| "make update-unicode -j4" exit with 0. |
| "make update-download -j4" exit with 0. |
| "make update-rubyspec -j4" exit with 0. |
| "make update-src -j4" exit with 0. |
| From https://github.com/ruby/ruby |
| 440b59d..1cba1b3 master -> origin/master |
| "make after-update -j4" exit with 0. |
| configure: WARNING: something wrong with CXXFLAGS="" |
| In file included from conftest.c:4: |
| /tmp/ruby/src/trunk-repeat50/version.h:25:39: error: invalid suffix "RUBY_RELEASE_MONTH" on integer constant |
| 25 | #define ONLY_ONE_DIGIT(x) TOKEN_PASTE(10,x) < 1000 |
| | ^~ |
| /tmp/ruby/src/trunk-repeat50/version.h:23:26: note: in definition of macro 'TOKEN_PASTE' |
| 23 | #define TOKEN_PASTE(x,y) x##y |
| | ^ |
| /tmp/ruby/src/trunk-repeat50/version.h:29:5: note: in expansion of macro 'ONLY_ONE_DIGIT' |
| 29 | #if ONLY_ONE_DIGIT(RUBY_RELEASE_MONTH) |
| | ^~~~~~~~~~~~~~ |
| /tmp/ruby/src/trunk-repeat50/version.h:25:39: error: invalid suffix "RUBY_RELEASE_DAY" on integer constant |
| 25 | #define ONLY_ONE_DIGIT(x) TOKEN_PASTE(10,x) < 1000 |
| | ^~ |
| /tmp/ruby/src/trunk-repeat50/version.h:23:26: note: in definition of macro 'TOKEN_PASTE' |
| 23 | #define TOKEN_PASTE(x,y) x##y |
| | ^ |
| /tmp/ruby/src/trunk-repeat50/version.h:34:5: note: in expansion of macro 'ONLY_ONE_DIGIT' |
| 34 | #if ONLY_ONE_DIGIT(RUBY_RELEASE_DAY) |
| | ^~~~~~~~~~~~~~ |
| "make miniruby -j4" exit with 0. |
| "make ruby -j4" exit with 0. |
| "make all -j4" exit with 0. |
| "make install -j4" exit with 0. |
| "make yes-btest TESTOPTS='-q -j4'" exit with 0. |
| |
| "make yes-test-basic TESTS=--repeat-count=50" exit with 0. |
| "make yes-test-all TESTOPTS='--stderr-on-failure' TESTS=--repeat-count=50" exit with 512. |
| Skipping Gem::PackageTask tests. rake not found. |
| 1) Failure: |
| TestGc#test_stat_heap [/tmp/ruby/src/trunk-repeat50/test/ruby/test_gc.rb:169]: |
| Expected 44380522 to be <= 44380502. |
| make: *** [uncommon.mk:945: yes-test-all] Error 1 |
| "make yes-test-rubyspec MSPECOPT='--error-output stderr --debug' TESTS=--repeat-count=50" exit with 0. |