# Logfile created on 2023-11-24 11:23:01 +0000 by logger.rb/v1.4.3
#<BuildRuby:0x000055e80ffba980 @REPOSITORY="https://github.com/ruby/ruby.git", @REPOSITORY_TYPE=:git, @git_branch=nil, @git_worktree=nil, @svn_revision=nil, @SRC_DIR="/tmp/ruby/src", @BUILD_DIR="/tmp/ruby/build", @INSTALL_DIR="/tmp/ruby/install", @TARGET_NAME="trunk-repeat50", @TARGET_SRC_DIR="/tmp/ruby/src/trunk-repeat50", @TARGET_BUILD_DIR="/tmp/ruby/build/trunk-repeat50", @TARGET_INSTALL_DIR="/tmp/ruby/install/trunk-repeat50", @configure_opts=["--enable-shared"], @build_opts="-j4", @btest_opts="-j4", @test_opts="TESTS=--repeat-count=50", @incremental=true, @steps=["checkout", "autoconf", "configure", "build_up", "build_miniruby", "build_ruby", "build_all", "build_install", "test_btest", "test_basic", "test_all", "test_rubyspec"], @quiet=false, @gist=false, @timeout=208000, @logfile="/home/ko1/ruby/logs/brlog.trunk-repeat50.20231124-112301", @ruby_env=[["RUBY_DEBUG", "ci"]], @make="make", @logger=#<Logger:0x000055e810043578 @level=0, @progname=nil, @default_formatter=#<Logger::Formatter:0x000055e8100433e8 @datetime_format=nil>, @formatter=nil, @logdev=#<Logger::LogDevice:0x000055e810043258 @shift_period_suffix="%Y%m%d", @shift_size=1048576, @shift_age=0, @filename="/home/ko1/ruby/logs/brlog.trunk-repeat50.20231124-112301", @dev=#<File:/home/ko1/ruby/logs/brlog.trunk-repeat50.20231124-112301>, @binmode=false, @mon_data=#<Monitor:0x000055e810043190>, @mon_data_owner_object_id=860>>>
$$$[beg] make update-unicode  -j4
make: Nothing to be done for 'update-unicode'.
$$$[end] "make update-unicode  -j4" exit with 0.
$$$[beg] make update-download -j4
tool/config.guess already exists
tool/config.sub already exists
Update debug to 927587afb6aac69b358b86a01f602d207053e8d2
echo 927587afb6aac69b358b86a01f602d207053e8d2 | /bin/sh /tmp/ruby/src/trunk-repeat50/tool/ifchange /tmp/ruby/src/trunk-repeat50/.bundle/.timestamp/debug.revision -
/tmp/ruby/src/trunk-repeat50/.bundle/.timestamp/debug.revision unchanged
$$$[end] "make update-download -j4" exit with 0.
$$$[beg] make update-rubyspec -j4
make: Nothing to be done for 'update-rubyspec'.
$$$[end] "make update-rubyspec -j4" exit with 0.
$$$[beg] make update-src      -j4
From https://github.com/ruby/ruby
   440b59d..1cba1b3  master     -> origin/master
Updating 440b59d..1cba1b3
Fast-forward
 .travis.yml                                        |   5 +-
 configure.ac                                       |   5 +-
 doc/contributing/documentation_guide.md            |  30 ++
 doc/timezones.rdoc                                 |  31 +-
 enumerator.c                                       |  41 +-
 gc.c                                               |  35 +-
 lib/bundler/cli.rb                                 |   1 +
 lib/bundler/cli/outdated.rb                        |  75 +++-
 lib/irb.rb                                         |   9 +-
 lib/resolv.rb                                      | 460 ++++++++++++++++++++-
 lib/rubygems/command.rb                            |   8 +-
 spec/bundler/bundler/cli_spec.rb                   |  21 +
 ...ktrace_exception.rb => test_raise_exception.rb} |  25 +-
 test/resolv/test_svcb_https.rb                     | 231 +++++++++++
 test/ruby/test_time.rb                             |   1 +
 timev.rb                                           |  11 +-
 yjit.rb                                            |   3 +-
 yjit/src/codegen.rs                                |   5 +-
 yjit/src/stats.rs                                  |   3 +-
 19 files changed, 930 insertions(+), 70 deletions(-)
 rename test/irb/{test_raise_no_backtrace_exception.rb => test_raise_exception.rb} (68%)
 create mode 100644 test/resolv/test_svcb_https.rb
Latest commit hash = 1cba1b3992
$$$[end] "make update-src      -j4" exit with 0.
$$$[beg] make after-update    -j4
cd -P /tmp/ruby/src/trunk-repeat50 && exec autoconf -o configure
running CONFIG_SHELL=/bin/bash /bin/bash /tmp/ruby/src/trunk-repeat50/configure --prefix=/tmp/ruby/install/trunk-repeat50 --disable-install-doc --enable-shared --no-create --no-recursion
checking for ruby... /usr/bin/ruby --disable=gems
tool/config.guess already exists
tool/config.sub already exists
checking build system type... x86_64-pc-linux-gnu
checking host system type... x86_64-pc-linux-gnu
checking target system type... x86_64-pc-linux-gnu
checking for gcc... gcc
checking for ld... ld
checking for gcc-ar... gcc-ar
checking for g++... no
checking for gcc-nm... gcc-nm
checking for gcc-ranlib... gcc-ranlib
checking whether the C compiler works... yes
checking for C compiler default output file name... a.out
checking for suffix of executables... 
checking whether we are cross compiling... no
checking for suffix of object files... o
checking whether the compiler supports GNU C... yes
checking whether gcc accepts -g... yes
checking for gcc option to enable C11 features... none needed
checking for g++... no
checking for c++... c++
checking whether the compiler supports GNU C++... yes
checking whether c++ accepts -g... yes
checking for c++ option to enable C++11 features... none needed
checking how to run the C preprocessor... gcc -E
checking for gas... no
checking for as... as
checking for gobjcopy... no
checking for objcopy... objcopy
checking for gobjdump... no
checking for objdump... objdump
checking for gstrip... no
checking for strip... strip
checking for stdio.h... yes
checking for stdlib.h... yes
checking for string.h... yes
checking for inttypes.h... yes
checking for stdint.h... yes
checking for strings.h... yes
checking for sys/stat.h... yes
checking for sys/types.h... yes
checking for unistd.h... yes
checking for wchar.h... yes
checking for minix/config.h... no
checking for vfork.h... no
checking whether it is safe to define __EXTENSIONS__... yes
checking whether _XOPEN_SOURCE should be defined... no
checking whether the linker is GNU ld... yes
checking whether gcc -E accepts -o... yes
checking for gcc-ar flags... rcD
checking whether ln -s works... yes
checking whether make sets $(MAKE)... yes
checking for a BSD-compatible install... /usr/bin/install -c
checking for a race-free mkdir -p... /usr/bin/mkdir -p
checking for dtrace... no
checking for dot... no
checking for doxygen... no
checking for pkg-config... no
checking whether it is Android... no
checking for cd using physical directory... cd -P
checking whether CFLAGS is valid... yes
checking whether LDFLAGS is valid... yes
checking whether ELF binaries are produced... yes
checking whether -Wl,-rpath,. is accepted as LDFLAGS... yes
checking whether -fdeclspec is accepted as LDFLAGS... no
checking whether -fdeclspec is accepted as CXXFLAGS... no
checking whether -Wextra-tokens is accepted as CFLAGS... no
checking whether -Wdeprecated-declarations is accepted as CFLAGS... yes
checking whether -Wdivision-by-zero is accepted as CFLAGS... no
checking whether -Wdiv-by-zero is accepted as CFLAGS... yes
checking whether -Wduplicated-cond is accepted as CFLAGS... yes
checking whether -Wimplicit-function-declaration is accepted as CFLAGS... yes
checking whether -Wimplicit-int is accepted as CFLAGS... yes
checking whether -Wpointer-arith is accepted as CFLAGS... yes
checking whether -Wshorten-64-to-32 is accepted as CFLAGS... no
checking whether -Wwrite-strings is accepted as CFLAGS... yes
checking whether -Wold-style-definition is accepted as CFLAGS... yes
checking whether -Wimplicit-fallthrough=0 is accepted as CFLAGS... yes
checking whether -Wmissing-noreturn is accepted as CFLAGS... yes
checking whether -Wno-cast-function-type is accepted as CFLAGS... yes
checking whether -Wno-constant-logical-operand is accepted as CFLAGS... yes
checking whether -Wno-long-long is accepted as CFLAGS... yes
checking whether -Wno-missing-field-initializers is accepted as CFLAGS... yes
checking whether -Wno-overlength-strings is accepted as CFLAGS... yes
checking whether -Wno-packed-bitfield-compat is accepted as CFLAGS... yes
configure: WARNING: something wrong with CXXFLAGS=""
checking whether -Wno-parentheses-equality is accepted as CFLAGS... yes
checking whether -Wno-self-assign is accepted as CFLAGS... yes
checking whether -Wno-tautological-compare is accepted as CFLAGS... yes
checking whether -Wno-unused-parameter is accepted as CFLAGS... yes
checking whether -Wno-unused-value is accepted as CFLAGS... yes
checking whether -Wsuggest-attribute=format is accepted as CFLAGS... yes
checking whether -Wsuggest-attribute=noreturn is accepted as CFLAGS... yes
checking whether -Wunused-variable is accepted as CFLAGS... yes
checking whether -diag-disable=175,188,1684,2259,2312 is accepted as CFLAGS... no
checking whether -Wmisleading-indentation is accepted as CFLAGS... yes
checking whether -Wundef is accepted as CFLAGS... yes
checking whether -Wall -Wextra is accepted as CFLAGS... yes
checking whether -Qunused-arguments is accepted as CFLAGS... no
checking whether -O3 -D_FORTIFY_SOURCE=2 is accepted as CFLAGS... yes
checking whether -fstack-protector-strong is accepted as CFLAGS... yes
checking whether -fstack-protector-strong is accepted as LDFLAGS... yes
checking for -fstack-protector... -fstack-protector-strong
checking whether -Wl,--compress-debug-sections=zlib is accepted as LDFLAGS... yes
checking whether -fno-strict-overflow is accepted as CFLAGS... yes
checking whether -ggdb3 is accepted as CFLAGS... yes
checking whether -fvisibility=hidden is accepted as CFLAGS... yes
checking whether -fno-fast-math is accepted as CFLAGS... yes
checking whether -fexcess-precision=standard is accepted as CFLAGS... yes
checking whether -fp-model precise is accepted as CFLAGS... no
checking whether compiler has statement and declarations in expressions... yes
checking for pthread.h... yes
checking for pthread_create in -lthr... no
checking for pthread_create in -lpthread... yes
checking for pthread_np.h... no
checking thread model... pthread
checking whether CXXFLAGS is valid... no
checking for crypt in -lcrypt... yes
checking for dlopen in -ldl... yes
checking for shutdown in -lsocket... no
checking for dirent.h that defines DIR... yes
checking for library containing opendir... none required
checking for _Bool... yes
checking for stdbool.h that conforms to C99... yes
checking for sys/wait.h that is POSIX.1 compatible... yes
checking for afunix.h... no
checking for atomic.h... no
checking for copyfile.h... no
checking for direct.h... no
checking for grp.h... yes
checking for fcntl.h... yes
checking for float.h... yes
checking for ieeefp.h... no
checking for intrinsics.h... no
checking for langinfo.h... yes
checking for limits.h... yes
checking for locale.h... yes
checking for malloc.h... yes
checking for malloc/malloc.h... no
checking for malloc_np.h... no
checking for net/socket.h... no
checking for process.h... no
checking for pwd.h... yes
checking for sanitizer/asan_interface.h... yes
checking for sanitizer/msan_interface.h... no
checking for setjmpex.h... no
checking for stdalign.h... yes
checking for sys/attr.h... no
checking for sys/eventfd.h... yes
checking for sys/fcntl.h... yes
checking for sys/file.h... yes
checking for sys/id.h... no
checking for sys/ioctl.h... yes
checking for sys/mkdev.h... no
checking for sys/param.h... yes
checking for sys/prctl.h... yes
checking for sys/random.h... yes
checking for sys/resource.h... yes
checking for sys/select.h... yes
checking for sys/sendfile.h... yes
checking for sys/socket.h... yes
checking for sys/syscall.h... yes
checking for sys/sysmacros.h... yes
checking for sys/time.h... yes
checking for sys/times.h... yes
checking for sys/uio.h... yes
checking for sys/utime.h... no
checking for syscall.h... yes
checking for time.h... yes
checking for ucontext.h... yes
checking for utime.h... yes
checking for sys/epoll.h... yes
checking for x86intrin.h... yes
checking for x86intrin.h when defined(__x86_64__)... yes
checking for gmp.h... yes
checking for library containing __gmpz_init... -lgmp
checking for special C compiler options needed for large files... no
checking for _FILE_OFFSET_BITS value needed for large files... no
checking whether byte ordering is bigendian... no
checking for an ANSI C-conforming const... yes
checking whether char is unsigned... no
checking for inline... inline
checking for working volatile... yes
checking for typeof syntax and keyword spelling... typeof
checking for C/C++ restrict keyword... __restrict__
checking for long long... yes
checking for off_t... yes
checking char bit... 8
checking size of int... 4
checking size of short... 2
checking size of long... 8
checking size of long long... 8
checking size of __int64... 0
checking size of __int128... 16
checking size of off_t... 8
checking size of void*... 8
checking size of float... 4
checking size of double... 8
checking size of time_t... 8
checking size of clock_t... 8
checking word size... 8
checking packed struct attribute... x __attribute__((packed))
checking whether -Wno-address-of-packed-member is accepted as CFLAGS... yes
checking for printf prefix for long long... ll
checking for pid_t... yes
checking for convertible type of pid_t... INT
checking for uid_t... yes
checking for convertible type of uid_t... UINT
checking for gid_t... yes
checking for convertible type of gid_t... UINT
checking for time_t... yes
checking for convertible type of time_t... LONG
checking for dev_t... yes
checking for convertible type of dev_t... ULONG
checking for mode_t... yes
checking for convertible type of mode_t... UINT
checking for rlim_t... yes
checking for convertible type of rlim_t... ULONG
checking for convertible type of off_t... LONG
checking for clockid_t... yes
checking for convertible type of clockid_t... INT
checking for variable length macro... yes
checking if _Alignof() works... yes
checking for CONSTFUNC function attribute... __attribute__ ((__const__)) x
checking for PUREFUNC function attribute... __attribute__ ((__pure__)) x
checking for NORETURN function attribute... __attribute__ ((__noreturn__)) x
checking for DEPRECATED function attribute... __attribute__ ((__deprecated__)) x
checking for DEPRECATED_BY function attribute... __attribute__ ((__deprecated__("by "#n))) x
checking for NOINLINE function attribute... __attribute__ ((__noinline__)) x
checking for ALWAYS_INLINE function attribute... __attribute__ ((__always_inline__)) x
checking for NO_SANITIZE function attribute... __attribute__ ((__no_sanitize__(san))) x
checking for NO_SANITIZE_ADDRESS function attribute... __attribute__ ((__no_sanitize_address__)) x
checking for NO_ADDRESS_SAFETY_ANALYSIS function attribute... __attribute__ ((__no_address_safety_analysis__)) x
checking for WARN_UNUSED_RESULT function attribute... __attribute__ ((__warn_unused_result__)) x
checking for MAYBE_UNUSED function attribute... __attribute__ ((__unused__)) x
checking for ERRORFUNC function attribute... __attribute__ ((__error__ mesg)) x
checking for WARNINGFUNC function attribute... __attribute__ ((__warning__ mesg)) x
checking for WEAK function attribute... __attribute__ ((__weak__)) x
checking for __attribute__((__depreacted__(msg))) in C++... no
checking for std::nullptr_t... no
checking for FUNC_STDCALL function attribute... x
checking for FUNC_CDECL function attribute... x
checking for FUNC_FASTCALL function attribute... x
checking for FUNC_UNOPTIMIZED function attribute... __attribute__ ((__optimize__("O0"))) x
checking for FUNC_MINIMIZED function attribute... __attribute__ ((__optimize__("-Os","-fomit-frame-pointer"))) x
checking for function alias... alias
checking for __atomic builtins... yes
checking for __sync builtins... yes
checking for __builtin_unreachable... yes
checking for __assume... no
checking for exported function attribute... __attribute__ ((__visibility__("default")))
checking for RUBY_FUNC_NONNULL function attribute... __attribute__ ((__nonnull__(n))) x
checking for function name string predefined identifier... __func__
checking if enum over int is allowed... yes
checking for gcc options needed to detect all undeclared functions... none needed
checking whether sys_nerr is declared... no
checking whether getenv is declared... yes
checking for size_t... yes
checking size of size_t... 8
checking size of ptrdiff_t... 8
checking size of dev_t... 8
checking for printf prefix for size_t... z
checking for printf prefix for ptrdiff_t... t
checking for struct stat.st_blksize... yes
checking for struct stat.st_blocks... yes
checking for struct stat.st_rdev... yes
checking size of struct stat.st_size... SIZEOF_OFF_T
checking size of struct stat.st_blocks... SIZEOF_OFF_T
checking size of struct stat.st_ino... SIZEOF_LONG
checking size of struct stat.st_dev... SIZEOF_DEV_T
checking size of struct stat.st_rdev... SIZEOF_DEV_T
checking for struct stat.st_atim... yes
checking for struct stat.st_atimespec... no
checking for struct stat.st_atimensec... no
checking for struct stat.st_mtim... yes
checking for struct stat.st_mtimespec... no
checking for struct stat.st_mtimensec... no
checking for struct stat.st_ctim... yes
checking for struct stat.st_ctimespec... no
checking for struct stat.st_ctimensec... no
checking for struct stat.st_birthtimespec... no
checking for struct statx.stx_btime... yes
checking for struct timeval... yes
checking size of struct timeval.tv_sec... SIZEOF_TIME_T
checking for struct timespec... yes
checking for struct timezone... yes
checking for fd_mask... yes
checking for int8_t... yes
checking size of int8_t... 1
checking for uint8_t... yes
checking size of uint8_t... 1
checking for int16_t... yes
checking size of int16_t... 2
checking for uint16_t... yes
checking size of uint16_t... 2
checking for int32_t... yes
checking size of int32_t... 4
checking for uint32_t... yes
checking size of uint32_t... 4
checking for int64_t... yes
checking size of int64_t... 8
checking for uint64_t... yes
checking size of uint64_t... 8
checking for int128_t... __int128
checking for uint128_t... unsigned __int128
checking for intptr_t... yes
checking size of intptr_t... 8
checking for uintptr_t... yes
checking size of uintptr_t... 8
checking for printf prefix for intptr_t... NONE
checking for ssize_t... yes
checking size of ssize_t... 8
checking for printf prefix for int64_t... NONE
checking for stack end address... __libc_stack_end
checking for grep that handles long lines and -e... /usr/bin/grep
checking for egrep... /usr/bin/grep -E
checking type of array argument to getgroups... gid_t
checking for working alloca.h... yes
checking for alloca... yes
checking for dynamic size alloca... ok
checking for working memcmp... yes
checking for dup... yes
checking for dup2... yes
checking for acosh... yes
checking for cbrt... yes
checking for crypt... yes
checking for erf... yes
checking for explicit_bzero... yes
checking for ffs... yes
checking for flock... yes
checking for hypot... yes
checking for lgamma_r... yes
checking for memmove... yes
checking for nan... yes
checking for nextafter... yes
checking for setproctitle... no
checking for strchr... yes
checking for strerror... yes
checking for strlcat... no
checking for strlcpy... no
checking for strstr... yes
checking for tgamma... yes
checking for sys/pstat.h... no
checking for fork... yes
checking for vfork... yes
checking for working fork... yes
checking for __syscall... no
checking for _longjmp... yes
checking for arc4random_buf... no
checking for atan2l... yes
checking for atan2f... yes
checking for chmod... yes
checking for chown... yes
checking for chroot... yes
checking for chsize... no
checking for clock_gettime... yes
checking for copy_file_range... yes
checking for cosh... yes
checking for crypt_r... yes
checking for dirfd... yes
checking for dl_iterate_phdr... yes
checking for dlopen... yes
checking for dladdr... yes
checking for dup3... yes
checking for eaccess... yes
checking for endgrent... yes
checking for eventfd... yes
checking for execl... yes
checking for execle... yes
checking for execv... yes
checking for execve... yes
checking for explicit_memset... no
checking for fcopyfile... no
checking for fchdir... yes
checking for fchmod... yes
checking for fchown... yes
checking for fcntl... yes
checking for fdatasync... yes
checking for fdopendir... yes
checking for fgetattrlist... no
checking for fmod... yes
checking for fstatat... yes
checking for fsync... yes
checking for ftruncate... yes
checking for ftruncate64... yes
checking for getattrlist... no
checking for getcwd... yes
checking for getegid... yes
checking for getentropy... yes
checking for geteuid... yes
checking for getgid... yes
checking for getgidx... no
checking for getgrnam... yes
checking for getgrnam_r... yes
checking for getgroups... yes
checking for getlogin... yes
checking for getlogin_r... yes
checking for getpgid... yes
checking for getpgrp... yes
checking for getppid... yes
checking for getpriority... yes
checking for getpwnam... yes
checking for getpwnam_r... yes
checking for getpwuid... yes
checking for getpwuid_r... yes
checking for getrandom... yes
checking for getresgid... yes
checking for getresuid... yes
checking for getrlimit... yes
checking for getsid... yes
checking for gettimeofday... yes
checking for getuid... yes
checking for getuidx... no
checking for gmtime_r... yes
checking for grantpt... yes
checking for initgroups... yes
checking for ioctl... yes
checking for isfinite... no
checking for issetugid... no
checking for kill... yes
checking for killpg... yes
checking for lchmod... yes
checking for lchown... yes
checking for link... yes
checking for llabs... yes
checking for lockf... yes
checking for log2... yes
checking for lstat... yes
checking for lutimes... yes
checking for malloc_usable_size... yes
checking for malloc_size... no
checking for malloc_trim... yes
checking for mblen... yes
checking for memalign... yes
checking for memset_s... no
checking for writev... yes
checking for memrchr... yes
checking for memmem... yes
checking for mkfifo... yes
checking for mknod... yes
checking for mktime... yes
checking for mmap... yes
checking for mremap... yes
checking for openat... yes
checking for pclose... yes
checking for pipe... yes
checking for pipe2... yes
checking for poll... yes
checking for popen... yes
checking for posix_fadvise... yes
checking for posix_madvise... yes
checking for posix_memalign... yes
checking for ppoll... yes
checking for pread... yes
checking for pwrite... yes
checking for qsort_r... yes
checking for qsort_s... no
checking for readlink... yes
checking for realpath... yes
checking for round... yes
checking for sched_getaffinity... yes
checking for seekdir... yes
checking for select_large_fdset... no
checking for sendfile... yes
checking for setegid... yes
checking for setenv... yes
checking for seteuid... yes
checking for setgid... yes
checking for setgroups... yes
checking for setpgid... yes
checking for setpgrp... yes
checking for setregid... yes
checking for setresgid... yes
checking for setresuid... yes
checking for setreuid... yes
checking for setrgid... no
checking for setrlimit... yes
checking for setruid... no
checking for setsid... yes
checking for setuid... yes
checking for shutdown... yes
checking for sigaction... yes
checking for sigaltstack... yes
checking for sigprocmask... yes
checking for sinh... yes
checking for snprintf... yes
checking for spawnv... no
checking for symlink... yes
checking for syscall... yes
checking for sysconf... yes
checking for system... yes
checking for tanh... yes
checking for telldir... yes
checking for timegm... yes
checking for times... yes
checking for truncate... yes
checking for truncate64... yes
checking for tzset... yes
checking for umask... yes
checking for unsetenv... yes
checking for utimensat... yes
checking for utimes... yes
checking for wait4... yes
checking for waitpid... yes
checking for __cospi... no
checking for __sinpi... no
checking for statx... yes
checking if getcwd allocates buffer if NULL is given... yes
checking for crypt.h... yes
checking for struct crypt_data.initialized... yes
checking for __builtin_alloca_with_align... yes
checking for __builtin_assume_aligned... yes
checking for __builtin_bswap16... yes
checking for __builtin_bswap32... yes
checking for __builtin_bswap64... yes
checking for __builtin_popcount... yes
checking for __builtin_popcountll... yes
checking for __builtin_clz... yes
checking for __builtin_clzl... yes
checking for __builtin_clzll... yes
checking for __builtin_ctz... yes
checking for __builtin_ctzll... yes
checking for __builtin_add_overflow... yes
In file included from conftest.c:4:
/tmp/ruby/src/trunk-repeat50/version.h:25:39: error: invalid suffix "RUBY_RELEASE_MONTH" on integer constant
   25 | #define ONLY_ONE_DIGIT(x) TOKEN_PASTE(10,x) < 1000
      |                                       ^~
/tmp/ruby/src/trunk-repeat50/version.h:23:26: note: in definition of macro 'TOKEN_PASTE'
   23 | #define TOKEN_PASTE(x,y) x##y
      |                          ^
/tmp/ruby/src/trunk-repeat50/version.h:29:5: note: in expansion of macro 'ONLY_ONE_DIGIT'
   29 | #if ONLY_ONE_DIGIT(RUBY_RELEASE_MONTH)
      |     ^~~~~~~~~~~~~~
/tmp/ruby/src/trunk-repeat50/version.h:25:39: error: invalid suffix "RUBY_RELEASE_DAY" on integer constant
   25 | #define ONLY_ONE_DIGIT(x) TOKEN_PASTE(10,x) < 1000
      |                                       ^~
/tmp/ruby/src/trunk-repeat50/version.h:23:26: note: in definition of macro 'TOKEN_PASTE'
   23 | #define TOKEN_PASTE(x,y) x##y
      |                          ^
/tmp/ruby/src/trunk-repeat50/version.h:34:5: note: in expansion of macro 'ONLY_ONE_DIGIT'
   34 | #if ONLY_ONE_DIGIT(RUBY_RELEASE_DAY)
      |     ^~~~~~~~~~~~~~
checking for __builtin_sub_overflow... yes
checking for __builtin_mul_overflow... yes
checking for __builtin_mul_overflow_p... yes
checking for __builtin_constant_p... yes
checking for __builtin_choose_expr... yes
checking for __builtin_choose_expr_constant_p... yes
checking for __builtin_types_compatible_p... yes
checking for __builtin_trap... yes
checking for __builtin_expect... yes
checking for __builtin_mul_overflow with long long arguments... yes
checking whether qsort_r is GNU version... yes
checking whether qsort_r is BSD version... no
checking whether atan2 handles Inf as C99... yes
checking for clock_getres... yes
checking for timer_create in -lrt... yes
checking for timer_settime in -lrt... yes
checking for unsetenv returns a value... yes
checking whether struct tm is in sys/time.h or time.h... time.h
checking for struct tm.tm_zone... yes
checking for struct tm.tm_gmtoff... yes
checking for external int daylight... yes
checking for negative time_t for gmtime(3)... yes
checking for localtime(3) overflow correctly... yes
checking for sig_t... yes
checking whether right shift preserve sign bit... yes
checking whether _SC_CLK_TCK is supported... yes
checking stack growing direction on x86_64... -1
checking native coroutine implementation for x86_64-linux... amd64
checking whether pthread_t is scalar type... yes
checking for sched_yield... yes
checking for pthread_attr_setinheritsched... yes
checking for pthread_attr_get_np... no
checking for pthread_attr_getstack... yes
checking for pthread_attr_getguardsize... yes
checking for pthread_get_stackaddr_np... no
checking for pthread_get_stacksize_np... no
checking for thr_stksegment... no
checking for pthread_stackseg_np... no
checking for pthread_getthrds_np... no
checking for pthread_condattr_setclock... yes
checking for pthread_setname_np... yes
checking for pthread_set_name_np... no
checking for pthread_sigmask... yes
checking for pthread_getattr_np... yes
checking arguments of pthread_setname_np... (pthread_self(), name)
checking for thread-local storage sepcifier... _Thread_local
checking if mcontext_t is a pointer... no
checking for getcontext... yes
checking for setcontext... yes
checking if fork works with pthread... yes
checking for sys/user.h... yes
checking whether PAGE_SIZE is compile-time const... yes
checking ioctl request type... unsigned long
checking for elf.h... yes
checking for elf_abi.h... no
checking for uncompress in -lz... yes
checking for mach-o/loader.h... no
checking whether OS depend dynamic link works... yes
checking for backtrace... yes
checking for broken backtrace... no
checking for valgrind/memcheck.h... yes
checking for strip flags... -S -x
checking whether -Wl,--no-as-needed is accepted as LDFLAGS... yes
checking whether -Wl,--no-undefined is accepted as LDFLAGS... yes
checking whether wrapper for LD_LIBRARY_PATH is needed... no
checking whether dtrace USDT is available... no
checking for __builtin_setjmp... yes with cast ()
checking for _setjmpex as a macro or function... no
checking for _setjmp as a macro or function... yes
checking for sigsetjmp as a macro or function... no
checking for setjmp type... __builtin_setjmp
checking for rustc... rustc
checking whether rustc works for YJIT... yes
checking for prefix of external symbols... NONE
checking for default symbols in empty shared library... 
checking if make is GNU make... yes
.ext/include/x86_64-linux/ruby/config.h unchanged
configure: ruby library version = 3.3.0+0
configure: creating ./config.status
---
Configuration summary for ruby version 3.3.0

   * Installation prefix: /tmp/ruby/install/trunk-repeat50
   * exec prefix:         ${prefix}
   * arch:                x86_64-linux
   * site arch:           ${arch}
   * RUBY_BASE_NAME:      ruby
   * enable shared:       yes
   * ruby lib prefix:     ${libdir}/${RUBY_BASE_NAME}
   * site libraries path: ${rubylibprefix}/${sitearch}
   * vendor path:         ${rubylibprefix}/vendor_ruby
   * target OS:           linux
   * compiler:            gcc
   * with thread:         pthread
   * with coroutine:      amd64
   * enable shared libs:  yes
   * dynamic library ext: so
   * CFLAGS:              ${optflags} ${debugflags} ${warnflags}
   * LDFLAGS:             -L. -fstack-protector-strong -rdynamic \
                          -Wl,-export-dynamic -Wl,--no-as-needed
   * DLDFLAGS:            -Wl,--compress-debug-sections=zlib
   * optflags:            -O3 -fno-fast-math
   * debugflags:          -ggdb3
   * warnflags:           -Wall -Wextra -Wdeprecated-declarations \
                          -Wdiv-by-zero -Wduplicated-cond \
                          -Wimplicit-function-declaration -Wimplicit-int \
                          -Wpointer-arith -Wwrite-strings \
                          -Wold-style-definition -Wimplicit-fallthrough=0 \
                          -Wmissing-noreturn -Wno-cast-function-type \
                          -Wno-constant-logical-operand -Wno-long-long \
                          -Wno-missing-field-initializers \
                          -Wno-overlength-strings \
                          -Wno-packed-bitfield-compat \
                          -Wno-parentheses-equality -Wno-self-assign \
                          -Wno-tautological-compare -Wno-unused-parameter \
                          -Wno-unused-value -Wsuggest-attribute=format \
                          -Wsuggest-attribute=noreturn -Wunused-variable \
                          -Wmisleading-indentation -Wundef
   * strip command:       strip -S -x
   * install doc:         no
   * YJIT support:        yes
   * RJIT support:        yes
   * man page type:       man
   * BASERUBY -v:         ruby 3.0.2p107 (2021-07-07 revision 0db68f0233) \
                          [x86_64-linux-gnu]

---
MAKE=make /bin/sh ./config.status Makefile
MAKE=make /bin/sh ./config.status GNUmakefile
config.status: creating GNUmakefile
config.status: creating Makefile
GNUmakefile unchanged
Makefile unchanged
making /tmp/ruby/src/trunk-repeat50/yjit.rbinc
making /tmp/ruby/src/trunk-repeat50/timev.rbinc
generating /tmp/ruby/src/trunk-repeat50/ext/ripper/eventids2table.c
make[1]: Entering directory '/tmp/ruby/src/trunk-repeat50/ext/ripper'
make[1]: Nothing to be done for 'src'.
make[1]: Leaving directory '/tmp/ruby/src/trunk-repeat50/ext/ripper'
generating /tmp/ruby/src/trunk-repeat50/ext/rbconfig/sizeof/sizes.c
make[1]: Entering directory '/tmp/ruby/src/trunk-repeat50/ext/rbconfig/sizeof'
generating miniprelude.c
sizes.c updated
make[1]: Leaving directory '/tmp/ruby/src/trunk-repeat50/ext/rbconfig/sizeof'
/tmp/ruby/src/trunk-repeat50/revision.h updated
generating x86_64-linux-fake.rb
x86_64-linux-fake.rb updated
miniprelude.c updated
/bin/sh /tmp/ruby/src/trunk-repeat50/tool/ifchange "--timestamp=.rbconfig.time" rbconfig.rb rbconfig.tmp
rbconfig.rb updated
generating enc.mk
making srcs under enc
make[1]: Entering directory '/tmp/ruby/build/trunk-repeat50'
make[1]: Nothing to be done for 'srcs'.
make[1]: Leaving directory '/tmp/ruby/build/trunk-repeat50'
Update debug to 927587afb6aac69b358b86a01f602d207053e8d2
echo 927587afb6aac69b358b86a01f602d207053e8d2 | /bin/sh /tmp/ruby/src/trunk-repeat50/tool/ifchange /tmp/ruby/src/trunk-repeat50/.bundle/.timestamp/debug.revision -
/tmp/ruby/src/trunk-repeat50/.bundle/.timestamp/debug.revision unchanged
$$$[end] "make after-update    -j4" exit with 0.
$$$[beg] make miniruby -j4
	BASERUBY = /usr/bin/ruby --disable=gems
	CC = gcc
	LD = ld
	LDSHARED = gcc -shared
	CFLAGS = -O3 -fno-fast-math -ggdb3 -Wall -Wextra -Wdeprecated-declarations -Wdiv-by-zero -Wduplicated-cond -Wimplicit-function-declaration -Wimplicit-int -Wpointer-arith -Wwrite-strings -Wold-style-definition -Wimplicit-fallthrough=0 -Wmissing-noreturn -Wno-cast-function-type -Wno-constant-logical-operand -Wno-long-long -Wno-missing-field-initializers -Wno-overlength-strings -Wno-packed-bitfield-compat -Wno-parentheses-equality -Wno-self-assign -Wno-tautological-compare -Wno-unused-parameter -Wno-unused-value -Wsuggest-attribute=format -Wsuggest-attribute=noreturn -Wunused-variable -Wmisleading-indentation -Wundef   -fPIC 
	XCFLAGS = -U_FORTIFY_SOURCE -D_FORTIFY_SOURCE=2 -fstack-protector-strong -fno-strict-overflow -fvisibility=hidden -fexcess-precision=standard -DRUBY_EXPORT -I. -I.ext/include/x86_64-linux -I/tmp/ruby/src/trunk-repeat50/include -I/tmp/ruby/src/trunk-repeat50 -I/tmp/ruby/src/trunk-repeat50/prism -I/tmp/ruby/src/trunk-repeat50/enc/unicode/15.0.0  
	CPPFLAGS =   
	DLDFLAGS = -Wl,--compress-debug-sections=zlib -Wl,-soname,libruby.so.3.3  -fstack-protector-strong  
	SOLIBS = -lz -lrt -lrt -lgmp -ldl -lcrypt -lm -lpthread 
	LANG = 
	LC_ALL = 
	LC_CTYPE = 
	MFLAGS = -j4 --jobserver-auth=4,5
	RUSTC = rustc
	YJIT_RUSTC_ARGS = --crate-name=yjit --crate-type=staticlib --edition=2021 -g -C lto=thin -C opt-level=3 -C overflow-checks=on '--out-dir=/tmp/ruby/build/trunk-repeat50/yjit/target/release/' /tmp/ruby/src/trunk-repeat50/yjit/src/lib.rs
gcc (Ubuntu 11.3.0-1ubuntu1~22.04.1) 11.3.0
Copyright (C) 2021 Free Software Foundation, Inc.
This is free software; see the source for copying conditions.  There is NO
warranty; not even for MERCHANTABILITY or FITNESS FOR A PARTICULAR PURPOSE.

compiling /tmp/ruby/src/trunk-repeat50/miniinit.c
compiling /tmp/ruby/src/trunk-repeat50/enumerator.c
compiling /tmp/ruby/src/trunk-repeat50/gc.c
compiling /tmp/ruby/src/trunk-repeat50/time.c
compiling /tmp/ruby/src/trunk-repeat50/version.c
compiling /tmp/ruby/src/trunk-repeat50/yjit.c
building Rust YJIT (release mode)
touch yjit/target/release/libyjit.a
partial linking yjit/target/release/libyjit.a into yjit/target/release/libyjit.o
linking miniruby
$$$[end] "make miniruby -j4" exit with 0.
$$$[beg] make ruby -j4
	BASERUBY = /usr/bin/ruby --disable=gems
	CC = gcc
	LD = ld
	LDSHARED = gcc -shared
	CFLAGS = -O3 -fno-fast-math -ggdb3 -Wall -Wextra -Wdeprecated-declarations -Wdiv-by-zero -Wduplicated-cond -Wimplicit-function-declaration -Wimplicit-int -Wpointer-arith -Wwrite-strings -Wold-style-definition -Wimplicit-fallthrough=0 -Wmissing-noreturn -Wno-cast-function-type -Wno-constant-logical-operand -Wno-long-long -Wno-missing-field-initializers -Wno-overlength-strings -Wno-packed-bitfield-compat -Wno-parentheses-equality -Wno-self-assign -Wno-tautological-compare -Wno-unused-parameter -Wno-unused-value -Wsuggest-attribute=format -Wsuggest-attribute=noreturn -Wunused-variable -Wmisleading-indentation -Wundef   -fPIC 
	XCFLAGS = -U_FORTIFY_SOURCE -D_FORTIFY_SOURCE=2 -fstack-protector-strong -fno-strict-overflow -fvisibility=hidden -fexcess-precision=standard -DRUBY_EXPORT -I. -I.ext/include/x86_64-linux -I/tmp/ruby/src/trunk-repeat50/include -I/tmp/ruby/src/trunk-repeat50 -I/tmp/ruby/src/trunk-repeat50/prism -I/tmp/ruby/src/trunk-repeat50/enc/unicode/15.0.0  
	CPPFLAGS =   
	DLDFLAGS = -Wl,--compress-debug-sections=zlib -Wl,-soname,libruby.so.3.3  -fstack-protector-strong  
	SOLIBS = -lz -lrt -lrt -lgmp -ldl -lcrypt -lm -lpthread 
	LANG = 
	LC_ALL = 
	LC_CTYPE = 
	MFLAGS = -j4 --jobserver-auth=4,5
	RUSTC = rustc
	YJIT_RUSTC_ARGS = --crate-name=yjit --crate-type=staticlib --edition=2021 -g -C lto=thin -C opt-level=3 -C overflow-checks=on '--out-dir=/tmp/ruby/build/trunk-repeat50/yjit/target/release/' /tmp/ruby/src/trunk-repeat50/yjit/src/lib.rs
gcc (Ubuntu 11.3.0-1ubuntu1~22.04.1) 11.3.0
Copyright (C) 2021 Free Software Foundation, Inc.
This is free software; see the source for copying conditions.  There is NO
warranty; not even for MERCHANTABILITY or FITNESS FOR A PARTICULAR PURPOSE.

creating verconf.h
verconf.h updated
compiling /tmp/ruby/src/trunk-repeat50/loadpath.c
builtin_binary.inc updated
ee0df0dd987ae3a7b1e4e7430dde95a64fdfc52b943491243eb78062557f74b8  builtin_binary.inc
compiling /tmp/ruby/src/trunk-repeat50/builtin.c
linking static-library libruby-static.a
linking shared-library libruby.so.3.3.0
linking ruby
$$$[end] "make ruby -j4" exit with 0.
$$$[beg] make all -j4
	BASERUBY = /usr/bin/ruby --disable=gems
	CC = gcc
	LD = ld
	LDSHARED = gcc -shared
	CFLAGS = -O3 -fno-fast-math -ggdb3 -Wall -Wextra -Wdeprecated-declarations -Wdiv-by-zero -Wduplicated-cond -Wimplicit-function-declaration -Wimplicit-int -Wpointer-arith -Wwrite-strings -Wold-style-definition -Wimplicit-fallthrough=0 -Wmissing-noreturn -Wno-cast-function-type -Wno-constant-logical-operand -Wno-long-long -Wno-missing-field-initializers -Wno-overlength-strings -Wno-packed-bitfield-compat -Wno-parentheses-equality -Wno-self-assign -Wno-tautological-compare -Wno-unused-parameter -Wno-unused-value -Wsuggest-attribute=format -Wsuggest-attribute=noreturn -Wunused-variable -Wmisleading-indentation -Wundef   -fPIC 
	XCFLAGS = -U_FORTIFY_SOURCE -D_FORTIFY_SOURCE=2 -fstack-protector-strong -fno-strict-overflow -fvisibility=hidden -fexcess-precision=standard -DRUBY_EXPORT -I. -I.ext/include/x86_64-linux -I/tmp/ruby/src/trunk-repeat50/include -I/tmp/ruby/src/trunk-repeat50 -I/tmp/ruby/src/trunk-repeat50/prism -I/tmp/ruby/src/trunk-repeat50/enc/unicode/15.0.0  
	CPPFLAGS =   
	DLDFLAGS = -Wl,--compress-debug-sections=zlib -Wl,-soname,libruby.so.3.3  -fstack-protector-strong  
	SOLIBS = -lz -lrt -lrt -lgmp -ldl -lcrypt -lm -lpthread 
	LANG = 
	LC_ALL = 
	LC_CTYPE = 
	MFLAGS = -j4 --jobserver-auth=4,5
	RUSTC = rustc
	YJIT_RUSTC_ARGS = --crate-name=yjit --crate-type=staticlib --edition=2021 -g -C lto=thin -C opt-level=3 -C overflow-checks=on '--out-dir=/tmp/ruby/build/trunk-repeat50/yjit/target/release/' /tmp/ruby/src/trunk-repeat50/yjit/src/lib.rs
gcc (Ubuntu 11.3.0-1ubuntu1~22.04.1) 11.3.0
Copyright (C) 2021 Free Software Foundation, Inc.
This is free software; see the source for copying conditions.  There is NO
warranty; not even for MERCHANTABILITY or FITNESS FOR A PARTICULAR PURPOSE.

generating encdb.h
generating enc.mk
building spec/ruby/optional/capi/ext/array_spec.so
building spec/ruby/optional/capi/ext/basic_object_spec.so
encdb.h unchanged
building spec/ruby/optional/capi/ext/bignum_spec.so
building spec/ruby/optional/capi/ext/binding_spec.so
building spec/ruby/optional/capi/ext/boolean_spec.so
building spec/ruby/optional/capi/ext/class_id_under_autoload_spec.so
building spec/ruby/optional/capi/ext/class_spec.so
building spec/ruby/optional/capi/ext/class_under_autoload_spec.so
building spec/ruby/optional/capi/ext/complex_spec.so
building spec/ruby/optional/capi/ext/constants_spec.so
building spec/ruby/optional/capi/ext/data_spec.so
building spec/ruby/optional/capi/ext/debug_spec.so
building spec/ruby/optional/capi/ext/encoding_spec.so
building spec/ruby/optional/capi/ext/enumerator_spec.so
building spec/ruby/optional/capi/ext/exception_spec.so
building spec/ruby/optional/capi/ext/fiber_spec.so
building spec/ruby/optional/capi/ext/file_spec.so
building spec/ruby/optional/capi/ext/fixnum_spec.so
building spec/ruby/optional/capi/ext/float_spec.so
building spec/ruby/optional/capi/ext/gc_spec.so
building spec/ruby/optional/capi/ext/globals_spec.so
building spec/ruby/optional/capi/ext/hash_spec.so
building spec/ruby/optional/capi/ext/integer_spec.so
building spec/ruby/optional/capi/ext/io_spec.so
building spec/ruby/optional/capi/ext/kernel_spec.so
building spec/ruby/optional/capi/ext/language_spec.so
building spec/ruby/optional/capi/ext/marshal_spec.so
building spec/ruby/optional/capi/ext/module_spec.so
building spec/ruby/optional/capi/ext/module_under_autoload_spec.so
building spec/ruby/optional/capi/ext/mutex_spec.so
building spec/ruby/optional/capi/ext/numeric_spec.so
building spec/ruby/optional/capi/ext/object_spec.so
building spec/ruby/optional/capi/ext/proc_spec.so
building spec/ruby/optional/capi/ext/range_spec.so
building spec/ruby/optional/capi/ext/rational_spec.so
building spec/ruby/optional/capi/ext/rbasic_spec.so
building spec/ruby/optional/capi/ext/regexp_spec.so
building spec/ruby/optional/capi/ext/st_spec.so
building spec/ruby/optional/capi/ext/string_spec.so
building spec/ruby/optional/capi/ext/struct_spec.so
building spec/ruby/optional/capi/ext/symbol_spec.so
building spec/ruby/optional/capi/ext/thread_spec.so
building spec/ruby/optional/capi/ext/time_spec.so
building spec/ruby/optional/capi/ext/tracepoint_spec.so
building spec/ruby/optional/capi/ext/typed_data_spec.so
building spec/ruby/optional/capi/ext/util_spec.so
making enc
making srcs under enc
make[1]: Entering directory '/tmp/ruby/build/trunk-repeat50'
linking encoding encdb.so
linking encoding big5.so
make[1]: Entering directory '/tmp/ruby/build/trunk-repeat50'
make[1]: Nothing to be done for 'srcs'.
make[1]: Leaving directory '/tmp/ruby/build/trunk-repeat50'
generating transdb.h
linking encoding cesu_8.so
linking encoding cp949.so
linking encoding emacs_mule.so
linking encoding euc_jp.so
linking encoding euc_kr.so
transdb.h unchanged
linking encoding euc_tw.so
making trans
linking encoding gb2312.so
linking encoding gb18030.so
make[1]: Entering directory '/tmp/ruby/build/trunk-repeat50'
linking transcoder transdb.so
linking encoding gbk.so
linking encoding iso_8859_1.so
linking encoding iso_8859_2.so
linking transcoder big5.so
linking encoding iso_8859_3.so
linking encoding iso_8859_4.so
linking encoding iso_8859_5.so
linking encoding iso_8859_6.so
linking encoding iso_8859_7.so
linking transcoder cesu_8.so
linking encoding iso_8859_8.so
linking encoding iso_8859_9.so
linking transcoder chinese.so
linking encoding iso_8859_10.so
linking encoding iso_8859_11.so
linking encoding iso_8859_13.so
linking transcoder ebcdic.so
linking encoding iso_8859_14.so
linking encoding iso_8859_15.so
linking transcoder emoji.so
linking encoding iso_8859_16.so
linking encoding koi8_r.so
linking encoding koi8_u.so
linking transcoder emoji_iso2022_kddi.so
linking encoding shift_jis.so
linking transcoder emoji_sjis_docomo.so
linking encoding utf_16be.so
linking transcoder emoji_sjis_kddi.so
linking transcoder emoji_sjis_softbank.so
linking encoding utf_16le.so
linking encoding utf_32be.so
linking transcoder escape.so
linking encoding utf_32le.so
linking encoding windows_31j.so
linking transcoder gb18030.so
linking transcoder gbk.so
linking transcoder iso2022.so
linking encoding windows_1250.so
linking encoding windows_1251.so
linking transcoder japanese.so
linking transcoder japanese_euc.so
linking encoding windows_1252.so
linking encoding windows_1253.so
linking transcoder japanese_sjis.so
linking encoding windows_1254.so
linking encoding windows_1257.so
linking transcoder korean.so
linking transcoder single_byte.so
make[1]: Leaving directory '/tmp/ruby/build/trunk-repeat50'
linking transcoder utf8_mac.so
generating makefiles ext/configure-ext.mk
linking transcoder utf_16_32.so
ext/configure-ext.mk updated
make[1]: Entering directory '/tmp/ruby/build/trunk-repeat50'
configuring bigdecimal
configuring -test-/RUBY_ALIGNOF
configuring -test-/abi
configuring -test-/arith_seq/beg_len_step
make[1]: Leaving directory '/tmp/ruby/build/trunk-repeat50'
making encs
configuring -test-/arith_seq/extract
configuring -test-/array/concat
configuring cgi/escape
configuring -test-/array/resize
configuring -test-/bignum
configuring -test-/bug-14834
configuring -test-/bug-3571
configuring -test-/bug-5832
configuring -test-/bug_reporter
make[1]: Entering directory '/tmp/ruby/build/trunk-repeat50'
make[1]: Nothing to be done for 'encs'.
make[1]: Leaving directory '/tmp/ruby/build/trunk-repeat50'
configuring -test-/class
configuring continuation
configuring -test-/cxxanyargs
configuring -test-/debug
configuring -test-/dln/empty
configuring -test-/econv
configuring -test-/enumerator_kw
configuring -test-/eval
configuring -test-/exception
configuring -test-/fatal
configuring -test-/file
configuring coverage
configuring date
configuring digest
configuring digest/bubblebabble
configuring digest/md5
configuring digest/rmd160
configuring digest/sha1
configuring digest/sha2
configuring -test-/float
configuring -test-/funcall
configuring -test-/gvl/call_without_gvl
configuring -test-/hash
configuring -test-/integer
configuring -test-/iseq_load
configuring -test-/iter
configuring -test-/load/dot.dot
configuring -test-/load/protect
configuring -test-/marshal/compat
configuring -test-/marshal/internal_ivar
configuring -test-/marshal/usr
configuring -test-/memory_status
configuring -test-/memory_view
configuring -test-/method
configuring -test-/notimplement
configuring -test-/num2int
configuring -test-/path_to_class
configuring -test-/popen_deadlock
configuring -test-/postponed_job
configuring -test-/printf
configuring -test-/proc
configuring -test-/random
configuring -test-/rational
configuring -test-/rb_call_super_kw
configuring -test-/recursion
configuring -test-/regexp
configuring -test-/scan_args
configuring -test-/st/foreach
configuring -test-/st/numhash
configuring -test-/st/update
configuring -test-/string
configuring erb/escape
configuring -test-/struct
configuring -test-/symbol
configuring etc
configuring -test-/thread/instrumentation
configuring -test-/thread_fd
configuring -test-/time
configuring -test-/tracepoint
configuring -test-/typeddata
configuring -test-/vm
configuring -test-/wait
configuring fcntl
configuring fiddle
configuring io/console
configuring json
configuring json/generator
configuring json/parser
configuring monitor
configuring nkf
configuring objspace
configuring openssl
configuring pathname
configuring psych
configuring io/nonblock
configuring pty
configuring io/wait
configuring rbconfig/sizeof
configuring ripper
configuring rubyvm
configuring socket
configuring stringio
configuring strscan
configuring syslog
configuring zlib
configuring debug-1.8.0/ext/debug
configuring racc-1.7.3/ext/racc/cparse
configuring rbs-3.2.2/ext/rbs_extension
configuring rbs-3.3.0/ext/rbs_extension
configuring rbs-3.3.2/ext/rbs_extension
make[1]: Leaving directory '/tmp/ruby/build/trunk-repeat50'
generating makefile exts.mk
exts.mk unchanged
make[1]: Entering directory '/tmp/ruby/build/trunk-repeat50'
make[2]: Entering directory '/tmp/ruby/build/trunk-repeat50/ext/-test-/abi'
make[2]: Entering directory '/tmp/ruby/build/trunk-repeat50/ext/-test-/RUBY_ALIGNOF'
make[2]: Entering directory '/tmp/ruby/build/trunk-repeat50/ext/-test-/arith_seq/beg_len_step'
linking shared-object -test-/abi.so
linking shared-object -test-/arith_seq/beg_len_step.so
linking shared-object -test-/RUBY_ALIGNOF.so
make[2]: Entering directory '/tmp/ruby/build/trunk-repeat50/ext/-test-/arith_seq/extract'
linking shared-object -test-/arith_seq/extract.so
make[2]: Leaving directory '/tmp/ruby/build/trunk-repeat50/ext/-test-/abi'
make[2]: Entering directory '/tmp/ruby/build/trunk-repeat50/ext/-test-/array/concat'
linking shared-object -test-/array/to_ary_concat.so
make[2]: Leaving directory '/tmp/ruby/build/trunk-repeat50/ext/-test-/RUBY_ALIGNOF'
make[2]: Leaving directory '/tmp/ruby/build/trunk-repeat50/ext/-test-/arith_seq/extract'
make[2]: Leaving directory '/tmp/ruby/build/trunk-repeat50/ext/-test-/arith_seq/beg_len_step'
make[2]: Entering directory '/tmp/ruby/build/trunk-repeat50/ext/-test-/array/resize'
linking shared-object -test-/array/resize.so
make[2]: Entering directory '/tmp/ruby/build/trunk-repeat50/ext/-test-/bignum'
make[2]: Entering directory '/tmp/ruby/build/trunk-repeat50/ext/-test-/bug-14834'
linking shared-object -test-/bignum.so
linking shared-object -test-/bug_14834.so
make[2]: Leaving directory '/tmp/ruby/build/trunk-repeat50/ext/-test-/array/concat'
make[2]: Entering directory '/tmp/ruby/build/trunk-repeat50/ext/-test-/bug-3571'
linking shared-object -test-/bug_3571.so
make[2]: Leaving directory '/tmp/ruby/build/trunk-repeat50/ext/-test-/bug-14834'
make[2]: Entering directory '/tmp/ruby/build/trunk-repeat50/ext/-test-/bug-5832'
linking shared-object -test-/bug_5832.so
make[2]: Leaving directory '/tmp/ruby/build/trunk-repeat50/ext/-test-/array/resize'
make[2]: Entering directory '/tmp/ruby/build/trunk-repeat50/ext/-test-/bug_reporter'
linking shared-object -test-/bug_reporter.so
make[2]: Leaving directory '/tmp/ruby/build/trunk-repeat50/ext/-test-/bug-3571'
make[2]: Leaving directory '/tmp/ruby/build/trunk-repeat50/ext/-test-/bignum'
make[2]: Leaving directory '/tmp/ruby/build/trunk-repeat50/ext/-test-/bug-5832'
make[2]: Entering directory '/tmp/ruby/build/trunk-repeat50/ext/-test-/class'
linking shared-object -test-/class.so
make[2]: Entering directory '/tmp/ruby/build/trunk-repeat50/ext/-test-/dln/empty'
make[2]: Entering directory '/tmp/ruby/build/trunk-repeat50/ext/-test-/debug'
linking shared-object -test-/debug.so
linking shared-object -test-/dln/empty.so
make[2]: Leaving directory '/tmp/ruby/build/trunk-repeat50/ext/-test-/bug_reporter'
make[2]: Entering directory '/tmp/ruby/build/trunk-repeat50/ext/-test-/econv'
linking shared-object -test-/econv.so
make[2]: Leaving directory '/tmp/ruby/build/trunk-repeat50/ext/-test-/dln/empty'
make[2]: Entering directory '/tmp/ruby/build/trunk-repeat50/ext/-test-/enumerator_kw'
linking shared-object -test-/enumerator_kw.so
make[2]: Leaving directory '/tmp/ruby/build/trunk-repeat50/ext/-test-/class'
make[2]: Entering directory '/tmp/ruby/build/trunk-repeat50/ext/-test-/eval'
linking shared-object -test-/eval.so
make[2]: Leaving directory '/tmp/ruby/build/trunk-repeat50/ext/-test-/debug'
make[2]: Entering directory '/tmp/ruby/build/trunk-repeat50/ext/-test-/exception'
linking shared-object -test-/exception.so
make[2]: Leaving directory '/tmp/ruby/build/trunk-repeat50/ext/-test-/econv'
make[2]: Entering directory '/tmp/ruby/build/trunk-repeat50/ext/-test-/fatal'
linking shared-object -test-/fatal/rb_fatal.so
make[2]: Leaving directory '/tmp/ruby/build/trunk-repeat50/ext/-test-/enumerator_kw'
make[2]: Entering directory '/tmp/ruby/build/trunk-repeat50/ext/-test-/file'
linking shared-object -test-/file.so
make[2]: Leaving directory '/tmp/ruby/build/trunk-repeat50/ext/-test-/eval'
make[2]: Entering directory '/tmp/ruby/build/trunk-repeat50/ext/-test-/float'
linking shared-object -test-/float.so
make[2]: Leaving directory '/tmp/ruby/build/trunk-repeat50/ext/-test-/fatal'
make[2]: Leaving directory '/tmp/ruby/build/trunk-repeat50/ext/-test-/exception'
make[2]: Entering directory '/tmp/ruby/build/trunk-repeat50/ext/-test-/funcall'
linking shared-object -test-/funcall.so
make[2]: Entering directory '/tmp/ruby/build/trunk-repeat50/ext/-test-/gvl/call_without_gvl'
linking shared-object -test-/gvl/call_without_gvl.so
make[2]: Leaving directory '/tmp/ruby/build/trunk-repeat50/ext/-test-/file'
make[2]: Entering directory '/tmp/ruby/build/trunk-repeat50/ext/-test-/hash'
make[2]: Leaving directory '/tmp/ruby/build/trunk-repeat50/ext/-test-/funcall'
linking shared-object -test-/hash.so
make[2]: Leaving directory '/tmp/ruby/build/trunk-repeat50/ext/-test-/float'
make[2]: Entering directory '/tmp/ruby/build/trunk-repeat50/ext/-test-/integer'
linking shared-object -test-/integer.so
make[2]: Entering directory '/tmp/ruby/build/trunk-repeat50/ext/-test-/iseq_load'
linking shared-object -test-/iseq_load.so
make[2]: Leaving directory '/tmp/ruby/build/trunk-repeat50/ext/-test-/gvl/call_without_gvl'
make[2]: Entering directory '/tmp/ruby/build/trunk-repeat50/ext/-test-/iter'
linking shared-object -test-/iter.so
make[2]: Leaving directory '/tmp/ruby/build/trunk-repeat50/ext/-test-/hash'
make[2]: Entering directory '/tmp/ruby/build/trunk-repeat50/ext/-test-/load/dot.dot'
linking shared-object -test-/load/dot.dot.so
make[2]: Leaving directory '/tmp/ruby/build/trunk-repeat50/ext/-test-/integer'
make[2]: Entering directory '/tmp/ruby/build/trunk-repeat50/ext/-test-/load/protect'
linking shared-object -test-/load/protect.so
make[2]: Leaving directory '/tmp/ruby/build/trunk-repeat50/ext/-test-/iseq_load'
make[2]: Entering directory '/tmp/ruby/build/trunk-repeat50/ext/-test-/marshal/compat'
linking shared-object -test-/marshal/compat.so
make[2]: Leaving directory '/tmp/ruby/build/trunk-repeat50/ext/-test-/iter'
make[2]: Leaving directory '/tmp/ruby/build/trunk-repeat50/ext/-test-/load/dot.dot'
make[2]: Entering directory '/tmp/ruby/build/trunk-repeat50/ext/-test-/marshal/internal_ivar'
linking shared-object -test-/marshal/internal_ivar.so
make[2]: Entering directory '/tmp/ruby/build/trunk-repeat50/ext/-test-/marshal/usr'
make[2]: Leaving directory '/tmp/ruby/build/trunk-repeat50/ext/-test-/load/protect'
linking shared-object -test-/marshal/usr.so
make[2]: Entering directory '/tmp/ruby/build/trunk-repeat50/ext/-test-/memory_view'
linking shared-object -test-/memory_view.so
make[2]: Leaving directory '/tmp/ruby/build/trunk-repeat50/ext/-test-/marshal/compat'
make[2]: Entering directory '/tmp/ruby/build/trunk-repeat50/ext/-test-/method'
linking shared-object -test-/method.so
make[2]: Leaving directory '/tmp/ruby/build/trunk-repeat50/ext/-test-/marshal/internal_ivar'
make[2]: Entering directory '/tmp/ruby/build/trunk-repeat50/ext/-test-/notimplement'
linking shared-object -test-/notimplement.so
make[2]: Leaving directory '/tmp/ruby/build/trunk-repeat50/ext/-test-/marshal/usr'
make[2]: Entering directory '/tmp/ruby/build/trunk-repeat50/ext/-test-/num2int'
linking shared-object -test-/num2int.so
make[2]: Leaving directory '/tmp/ruby/build/trunk-repeat50/ext/-test-/method'
make[2]: Entering directory '/tmp/ruby/build/trunk-repeat50/ext/-test-/path_to_class'
linking shared-object -test-/path_to_class.so
make[2]: Leaving directory '/tmp/ruby/build/trunk-repeat50/ext/-test-/memory_view'
make[2]: Entering directory '/tmp/ruby/build/trunk-repeat50/ext/-test-/popen_deadlock'
linking shared-object -test-/popen_deadlock/infinite_loop_dlsym.so
make[2]: Leaving directory '/tmp/ruby/build/trunk-repeat50/ext/-test-/notimplement'
make[2]: Entering directory '/tmp/ruby/build/trunk-repeat50/ext/-test-/postponed_job'
make[2]: Leaving directory '/tmp/ruby/build/trunk-repeat50/ext/-test-/num2int'
linking shared-object -test-/postponed_job.so
make[2]: Entering directory '/tmp/ruby/build/trunk-repeat50/ext/-test-/printf'
linking shared-object -test-/printf.so
make[2]: Leaving directory '/tmp/ruby/build/trunk-repeat50/ext/-test-/popen_deadlock'
make[2]: Entering directory '/tmp/ruby/build/trunk-repeat50/ext/-test-/proc'
linking shared-object -test-/proc.so
make[2]: Leaving directory '/tmp/ruby/build/trunk-repeat50/ext/-test-/postponed_job'
make[2]: Entering directory '/tmp/ruby/build/trunk-repeat50/ext/-test-/random'
linking shared-object -test-/random.so
make[2]: Leaving directory '/tmp/ruby/build/trunk-repeat50/ext/-test-/path_to_class'
make[2]: Entering directory '/tmp/ruby/build/trunk-repeat50/ext/-test-/rational'
linking shared-object -test-/rational.so
make[2]: Leaving directory '/tmp/ruby/build/trunk-repeat50/ext/-test-/printf'
make[2]: Entering directory '/tmp/ruby/build/trunk-repeat50/ext/-test-/rb_call_super_kw'
linking shared-object -test-/rb_call_super_kw.so
make[2]: Leaving directory '/tmp/ruby/build/trunk-repeat50/ext/-test-/rational'
make[2]: Entering directory '/tmp/ruby/build/trunk-repeat50/ext/-test-/recursion'
linking shared-object -test-/recursion.so
make[2]: Leaving directory '/tmp/ruby/build/trunk-repeat50/ext/-test-/proc'
make[2]: Entering directory '/tmp/ruby/build/trunk-repeat50/ext/-test-/regexp'
linking shared-object -test-/regexp.so
make[2]: Leaving directory '/tmp/ruby/build/trunk-repeat50/ext/-test-/random'
make[2]: Entering directory '/tmp/ruby/build/trunk-repeat50/ext/-test-/scan_args'
linking shared-object -test-/scan_args.so
make[2]: Leaving directory '/tmp/ruby/build/trunk-repeat50/ext/-test-/rb_call_super_kw'
make[2]: Entering directory '/tmp/ruby/build/trunk-repeat50/ext/-test-/st/foreach'
linking shared-object -test-/st/foreach.so
make[2]: Leaving directory '/tmp/ruby/build/trunk-repeat50/ext/-test-/recursion'
make[2]: Entering directory '/tmp/ruby/build/trunk-repeat50/ext/-test-/st/numhash'
linking shared-object -test-/st/numhash.so
make[2]: Leaving directory '/tmp/ruby/build/trunk-repeat50/ext/-test-/st/foreach'
make[2]: Entering directory '/tmp/ruby/build/trunk-repeat50/ext/-test-/st/update'
linking shared-object -test-/st/update.so
make[2]: Leaving directory '/tmp/ruby/build/trunk-repeat50/ext/-test-/regexp'
make[2]: Entering directory '/tmp/ruby/build/trunk-repeat50/ext/-test-/string'
make[2]: Leaving directory '/tmp/ruby/build/trunk-repeat50/ext/-test-/scan_args'
linking shared-object -test-/string.so
make[2]: Entering directory '/tmp/ruby/build/trunk-repeat50/ext/-test-/struct'
linking shared-object -test-/struct.so
make[2]: Leaving directory '/tmp/ruby/build/trunk-repeat50/ext/-test-/st/numhash'
make[2]: Entering directory '/tmp/ruby/build/trunk-repeat50/ext/-test-/symbol'
linking shared-object -test-/symbol.so
make[2]: Leaving directory '/tmp/ruby/build/trunk-repeat50/ext/-test-/st/update'
make[2]: Entering directory '/tmp/ruby/build/trunk-repeat50/ext/-test-/thread/instrumentation'
linking shared-object -test-/thread/instrumentation.so
make[2]: Leaving directory '/tmp/ruby/build/trunk-repeat50/ext/-test-/symbol'
make[2]: Entering directory '/tmp/ruby/build/trunk-repeat50/ext/-test-/thread_fd'
linking shared-object -test-/thread_fd.so
make[2]: Leaving directory '/tmp/ruby/build/trunk-repeat50/ext/-test-/struct'
make[2]: Entering directory '/tmp/ruby/build/trunk-repeat50/ext/-test-/time'
make[2]: Leaving directory '/tmp/ruby/build/trunk-repeat50/ext/-test-/thread/instrumentation'
linking shared-object -test-/time.so
make[2]: Entering directory '/tmp/ruby/build/trunk-repeat50/ext/-test-/tracepoint'
linking shared-object -test-/tracepoint.so
make[2]: Leaving directory '/tmp/ruby/build/trunk-repeat50/ext/-test-/thread_fd'
make[2]: Entering directory '/tmp/ruby/build/trunk-repeat50/ext/-test-/typeddata'
linking shared-object -test-/typeddata.so
make[2]: Leaving directory '/tmp/ruby/build/trunk-repeat50/ext/-test-/string'
make[2]: Entering directory '/tmp/ruby/build/trunk-repeat50/ext/-test-/vm'
linking shared-object -test-/vm/at_exit.so
make[2]: Leaving directory '/tmp/ruby/build/trunk-repeat50/ext/-test-/typeddata'
make[2]: Entering directory '/tmp/ruby/build/trunk-repeat50/ext/-test-/wait'
linking shared-object -test-/wait.so
make[2]: Leaving directory '/tmp/ruby/build/trunk-repeat50/ext/-test-/time'
make[2]: Leaving directory '/tmp/ruby/build/trunk-repeat50/ext/-test-/tracepoint'
make[2]: Entering directory '/tmp/ruby/build/trunk-repeat50/ext/bigdecimal'
linking shared-object bigdecimal.so
make[2]: Entering directory '/tmp/ruby/build/trunk-repeat50/ext/cgi/escape'
linking shared-object cgi/escape.so
make[2]: Leaving directory '/tmp/ruby/build/trunk-repeat50/ext/-test-/wait'
make[2]: Leaving directory '/tmp/ruby/build/trunk-repeat50/ext/-test-/vm'
make[2]: Entering directory '/tmp/ruby/build/trunk-repeat50/ext/continuation'
make[2]: Entering directory '/tmp/ruby/build/trunk-repeat50/ext/coverage'
linking shared-object continuation.so
linking shared-object coverage.so
make[2]: Leaving directory '/tmp/ruby/build/trunk-repeat50/ext/cgi/escape'
make[2]: Entering directory '/tmp/ruby/build/trunk-repeat50/ext/date'
linking shared-object date_core.so
make[2]: Leaving directory '/tmp/ruby/build/trunk-repeat50/ext/continuation'
make[2]: Entering directory '/tmp/ruby/build/trunk-repeat50/ext/digest'
linking shared-object digest.so
make[2]: Leaving directory '/tmp/ruby/build/trunk-repeat50/ext/bigdecimal'
make[2]: Entering directory '/tmp/ruby/build/trunk-repeat50/ext/erb/escape'
linking shared-object erb/escape.so
make[2]: Leaving directory '/tmp/ruby/build/trunk-repeat50/ext/coverage'
make[2]: Entering directory '/tmp/ruby/build/trunk-repeat50/ext/etc'
linking shared-object etc.so
make[2]: Leaving directory '/tmp/ruby/build/trunk-repeat50/ext/digest'
make[2]: Entering directory '/tmp/ruby/build/trunk-repeat50/ext/fcntl'
linking shared-object fcntl.so
make[2]: Leaving directory '/tmp/ruby/build/trunk-repeat50/ext/etc'
make[2]: Leaving directory '/tmp/ruby/build/trunk-repeat50/ext/date'
make[2]: Entering directory '/tmp/ruby/build/trunk-repeat50/ext/fiddle'
make[2]: Leaving directory '/tmp/ruby/build/trunk-repeat50/ext/erb/escape'
linking shared-object fiddle.so
make[2]: Entering directory '/tmp/ruby/build/trunk-repeat50/ext/io/console'
linking shared-object io/console.so
make[2]: Entering directory '/tmp/ruby/build/trunk-repeat50/ext/io/nonblock'
linking shared-object io/nonblock.so
make[2]: Leaving directory '/tmp/ruby/build/trunk-repeat50/ext/io/nonblock'
make[2]: Leaving directory '/tmp/ruby/build/trunk-repeat50/ext/io/console'
make[2]: Entering directory '/tmp/ruby/build/trunk-repeat50/ext/io/wait'
make[2]: Leaving directory '/tmp/ruby/build/trunk-repeat50/ext/fcntl'
linking shared-object io/wait.so
make[2]: Entering directory '/tmp/ruby/build/trunk-repeat50/ext/json'
make[2]: Leaving directory '/tmp/ruby/build/trunk-repeat50/ext/json'
make[2]: Entering directory '/tmp/ruby/build/trunk-repeat50/ext/monitor'
make[2]: Entering directory '/tmp/ruby/build/trunk-repeat50/ext/nkf'
linking shared-object monitor.so
linking shared-object nkf.so
make[2]: Leaving directory '/tmp/ruby/build/trunk-repeat50/ext/fiddle'
make[2]: Entering directory '/tmp/ruby/build/trunk-repeat50/ext/objspace'
make[2]: Leaving directory '/tmp/ruby/build/trunk-repeat50/ext/io/wait'
make[2]: Leaving directory '/tmp/ruby/build/trunk-repeat50/ext/monitor'
linking shared-object objspace.so
make[2]: Entering directory '/tmp/ruby/build/trunk-repeat50/ext/pathname'
linking shared-object pathname.so
make[2]: Entering directory '/tmp/ruby/build/trunk-repeat50/ext/openssl'
linking shared-object openssl.so
make[2]: Leaving directory '/tmp/ruby/build/trunk-repeat50/ext/nkf'
make[2]: Entering directory '/tmp/ruby/build/trunk-repeat50/ext/psych'
linking shared-object psych.so
make[2]: Leaving directory '/tmp/ruby/build/trunk-repeat50/ext/objspace'
make[2]: Entering directory '/tmp/ruby/build/trunk-repeat50/ext/pty'
linking shared-object pty.so
make[2]: Leaving directory '/tmp/ruby/build/trunk-repeat50/ext/pathname'
make[2]: Entering directory '/tmp/ruby/build/trunk-repeat50/ext/rbconfig/sizeof'
compiling /tmp/ruby/src/trunk-repeat50/ext/rbconfig/sizeof/sizes.c
linking shared-object rbconfig/sizeof.so
make[2]: Leaving directory '/tmp/ruby/build/trunk-repeat50/ext/psych'
make[2]: Entering directory '/tmp/ruby/build/trunk-repeat50/ext/ripper'
linking shared-object ripper.so
make[2]: Leaving directory '/tmp/ruby/build/trunk-repeat50/ext/pty'
make[2]: Entering directory '/tmp/ruby/build/trunk-repeat50/ext/rubyvm'
make[2]: Leaving directory '/tmp/ruby/build/trunk-repeat50/ext/rubyvm'
make[2]: Entering directory '/tmp/ruby/build/trunk-repeat50/ext/socket'
make[2]: Leaving directory '/tmp/ruby/build/trunk-repeat50/ext/rbconfig/sizeof'
linking shared-object socket.so
make[2]: Entering directory '/tmp/ruby/build/trunk-repeat50/ext/stringio'
linking shared-object stringio.so
make[2]: Leaving directory '/tmp/ruby/build/trunk-repeat50/ext/stringio'
make[2]: Entering directory '/tmp/ruby/build/trunk-repeat50/ext/strscan'
linking shared-object strscan.so
make[2]: Leaving directory '/tmp/ruby/build/trunk-repeat50/ext/ripper'
make[2]: Entering directory '/tmp/ruby/build/trunk-repeat50/ext/syslog'
linking shared-object syslog.so
make[2]: Leaving directory '/tmp/ruby/build/trunk-repeat50/ext/strscan'
make[2]: Entering directory '/tmp/ruby/build/trunk-repeat50/ext/zlib'
linking shared-object zlib.so
make[2]: Leaving directory '/tmp/ruby/build/trunk-repeat50/ext/syslog'
make[2]: Entering directory '/tmp/ruby/build/trunk-repeat50/.bundle/gems/debug-1.8.0/ext/debug'
linking shared-object debug/debug.so
make[2]: Leaving directory '/tmp/ruby/build/trunk-repeat50/ext/socket'
make[2]: Entering directory '/tmp/ruby/build/trunk-repeat50/.bundle/gems/racc-1.7.3/ext/racc/cparse'
linking shared-object racc/cparse.so
make[2]: Leaving directory '/tmp/ruby/build/trunk-repeat50/ext/zlib'
make[2]: Entering directory '/tmp/ruby/build/trunk-repeat50/.bundle/gems/rbs-3.2.2/ext/rbs_extension'
linking shared-object rbs_extension.so
make[2]: Leaving directory '/tmp/ruby/build/trunk-repeat50/.bundle/gems/debug-1.8.0/ext/debug'
make[2]: Entering directory '/tmp/ruby/build/trunk-repeat50/.bundle/gems/rbs-3.3.0/ext/rbs_extension'
linking shared-object rbs_extension.so
make[2]: Leaving directory '/tmp/ruby/build/trunk-repeat50/.bundle/gems/racc-1.7.3/ext/racc/cparse'
make[2]: Entering directory '/tmp/ruby/build/trunk-repeat50/.bundle/gems/rbs-3.3.2/ext/rbs_extension'
linking shared-object rbs_extension.so
make[2]: Leaving directory '/tmp/ruby/build/trunk-repeat50/.bundle/gems/rbs-3.2.2/ext/rbs_extension'
make[2]: Entering directory '/tmp/ruby/build/trunk-repeat50/ext/digest/bubblebabble'
linking shared-object digest/bubblebabble.so
make[2]: Leaving directory '/tmp/ruby/build/trunk-repeat50/ext/digest/bubblebabble'
make[2]: Leaving directory '/tmp/ruby/build/trunk-repeat50/.bundle/gems/rbs-3.3.0/ext/rbs_extension'
make[2]: Leaving directory '/tmp/ruby/build/trunk-repeat50/.bundle/gems/rbs-3.3.2/ext/rbs_extension'
make[2]: Entering directory '/tmp/ruby/build/trunk-repeat50/ext/digest/md5'
linking shared-object digest/md5.so
make[2]: Entering directory '/tmp/ruby/build/trunk-repeat50/ext/digest/rmd160'
linking shared-object digest/rmd160.so
make[2]: Entering directory '/tmp/ruby/build/trunk-repeat50/ext/digest/sha1'
linking shared-object digest/sha1.so
make[2]: Leaving directory '/tmp/ruby/build/trunk-repeat50/ext/openssl'
make[2]: Entering directory '/tmp/ruby/build/trunk-repeat50/ext/digest/sha2'
linking shared-object digest/sha2.so
make[2]: Leaving directory '/tmp/ruby/build/trunk-repeat50/ext/digest/rmd160'
make[2]: Leaving directory '/tmp/ruby/build/trunk-repeat50/ext/digest/md5'
make[2]: Entering directory '/tmp/ruby/build/trunk-repeat50/ext/json/generator'
linking shared-object json/ext/generator.so
make[2]: Entering directory '/tmp/ruby/build/trunk-repeat50/ext/json/parser'
linking shared-object json/ext/parser.so
make[2]: Leaving directory '/tmp/ruby/build/trunk-repeat50/ext/digest/sha1'
make[2]: Leaving directory '/tmp/ruby/build/trunk-repeat50/ext/digest/sha2'
make[2]: Leaving directory '/tmp/ruby/build/trunk-repeat50/ext/json/parser'
make[2]: Leaving directory '/tmp/ruby/build/trunk-repeat50/ext/json/generator'
make[2]: Entering directory '/tmp/ruby/build/trunk-repeat50'
make[2]: 'ruby' is up to date.
make[2]: Leaving directory '/tmp/ruby/build/trunk-repeat50'
make[1]: Leaving directory '/tmp/ruby/build/trunk-repeat50'
make[1]: Entering directory '/tmp/ruby/build/trunk-repeat50'
make[1]: Nothing to be done for 'note'.
make[1]: Leaving directory '/tmp/ruby/build/trunk-repeat50'
$$$[end] "make all -j4" exit with 0.
$$$[beg] make install -j4
	BASERUBY = /usr/bin/ruby --disable=gems
	CC = gcc
	LD = ld
	LDSHARED = gcc -shared
	CFLAGS = -O3 -fno-fast-math -ggdb3 -Wall -Wextra -Wdeprecated-declarations -Wdiv-by-zero -Wduplicated-cond -Wimplicit-function-declaration -Wimplicit-int -Wpointer-arith -Wwrite-strings -Wold-style-definition -Wimplicit-fallthrough=0 -Wmissing-noreturn -Wno-cast-function-type -Wno-constant-logical-operand -Wno-long-long -Wno-missing-field-initializers -Wno-overlength-strings -Wno-packed-bitfield-compat -Wno-parentheses-equality -Wno-self-assign -Wno-tautological-compare -Wno-unused-parameter -Wno-unused-value -Wsuggest-attribute=format -Wsuggest-attribute=noreturn -Wunused-variable -Wmisleading-indentation -Wundef   -fPIC 
	XCFLAGS = -U_FORTIFY_SOURCE -D_FORTIFY_SOURCE=2 -fstack-protector-strong -fno-strict-overflow -fvisibility=hidden -fexcess-precision=standard -DRUBY_EXPORT -I. -I.ext/include/x86_64-linux -I/tmp/ruby/src/trunk-repeat50/include -I/tmp/ruby/src/trunk-repeat50 -I/tmp/ruby/src/trunk-repeat50/prism -I/tmp/ruby/src/trunk-repeat50/enc/unicode/15.0.0  
	CPPFLAGS =   
	DLDFLAGS = -Wl,--compress-debug-sections=zlib -Wl,-soname,libruby.so.3.3  -fstack-protector-strong  
	SOLIBS = -lz -lrt -lrt -lgmp -ldl -lcrypt -lm -lpthread 
	LANG = 
	LC_ALL = 
	LC_CTYPE = 
	MFLAGS = -j4 --jobserver-auth=4,5
	RUSTC = rustc
	YJIT_RUSTC_ARGS = --crate-name=yjit --crate-type=staticlib --edition=2021 -g -C lto=thin -C opt-level=3 -C overflow-checks=on '--out-dir=/tmp/ruby/build/trunk-repeat50/yjit/target/release/' /tmp/ruby/src/trunk-repeat50/yjit/src/lib.rs
Update debug to 927587afb6aac69b358b86a01f602d207053e8d2
echo 927587afb6aac69b358b86a01f602d207053e8d2 | /bin/sh /tmp/ruby/src/trunk-repeat50/tool/ifchange /tmp/ruby/src/trunk-repeat50/.bundle/.timestamp/debug.revision -
generating encdb.h
/tmp/ruby/src/trunk-repeat50/.bundle/.timestamp/debug.revision unchanged
generating enc.mk
gcc (Ubuntu 11.3.0-1ubuntu1~22.04.1) 11.3.0
Copyright (C) 2021 Free Software Foundation, Inc.
This is free software; see the source for copying conditions.  There is NO
warranty; not even for MERCHANTABILITY or FITNESS FOR A PARTICULAR PURPOSE.

encdb.h unchanged
making srcs under enc
making enc
make[1]: Entering directory '/tmp/ruby/build/trunk-repeat50'
make[1]: Nothing to be done for 'enc'.
make[1]: Leaving directory '/tmp/ruby/build/trunk-repeat50'
make[1]: Entering directory '/tmp/ruby/build/trunk-repeat50'
make[1]: Nothing to be done for 'srcs'.
make[1]: Leaving directory '/tmp/ruby/build/trunk-repeat50'
generating transdb.h
transdb.h unchanged
generating makefiles ext/configure-ext.mk
making trans
ext/configure-ext.mk unchanged
make[1]: Entering directory '/tmp/ruby/build/trunk-repeat50'
make[1]: Entering directory '/tmp/ruby/build/trunk-repeat50'
make[1]: Nothing to be done for '/tmp/ruby/src/trunk-repeat50/enc/trans'.
make[1]: Leaving directory '/tmp/ruby/build/trunk-repeat50'
making encs
make[1]: Entering directory '/tmp/ruby/build/trunk-repeat50'
make[1]: Nothing to be done for 'encs'.
make[1]: Leaving directory '/tmp/ruby/build/trunk-repeat50'
make[1]: Leaving directory '/tmp/ruby/build/trunk-repeat50'
generating makefile exts.mk
exts.mk unchanged
make[1]: Entering directory '/tmp/ruby/build/trunk-repeat50'
make[2]: Entering directory '/tmp/ruby/build/trunk-repeat50/ext/bigdecimal'
make[2]: Leaving directory '/tmp/ruby/build/trunk-repeat50/ext/bigdecimal'
make[2]: Entering directory '/tmp/ruby/build/trunk-repeat50/ext/coverage'
make[2]: Leaving directory '/tmp/ruby/build/trunk-repeat50/ext/coverage'
make[2]: Entering directory '/tmp/ruby/build/trunk-repeat50/ext/digest'
make[2]: Entering directory '/tmp/ruby/build/trunk-repeat50/ext/date'
make[2]: Leaving directory '/tmp/ruby/build/trunk-repeat50/ext/digest'
make[2]: Leaving directory '/tmp/ruby/build/trunk-repeat50/ext/date'
make[2]: Entering directory '/tmp/ruby/build/trunk-repeat50/ext/io/console'
make[2]: Entering directory '/tmp/ruby/build/trunk-repeat50/ext/json'
make[2]: Leaving directory '/tmp/ruby/build/trunk-repeat50/ext/io/console'
make[2]: Entering directory '/tmp/ruby/build/trunk-repeat50/ext/fiddle'
make[2]: Entering directory '/tmp/ruby/build/trunk-repeat50/ext/nkf'
make[2]: Entering directory '/tmp/ruby/build/trunk-repeat50/ext/monitor'
make[2]: Leaving directory '/tmp/ruby/build/trunk-repeat50/ext/monitor'
make[2]: Leaving directory '/tmp/ruby/build/trunk-repeat50/ext/fiddle'
make[2]: Leaving directory '/tmp/ruby/build/trunk-repeat50/ext/nkf'
make[2]: Leaving directory '/tmp/ruby/build/trunk-repeat50/ext/json'
make[2]: Entering directory '/tmp/ruby/build/trunk-repeat50/ext/objspace'
make[2]: Entering directory '/tmp/ruby/build/trunk-repeat50/ext/pathname'
make[2]: Leaving directory '/tmp/ruby/build/trunk-repeat50/ext/objspace'
make[2]: Leaving directory '/tmp/ruby/build/trunk-repeat50/ext/pathname'
make[2]: Entering directory '/tmp/ruby/build/trunk-repeat50/ext/psych'
make[2]: Entering directory '/tmp/ruby/build/trunk-repeat50/ext/pty'
make[2]: Entering directory '/tmp/ruby/build/trunk-repeat50/ext/openssl'
make[2]: Leaving directory '/tmp/ruby/build/trunk-repeat50/ext/psych'
make[2]: Leaving directory '/tmp/ruby/build/trunk-repeat50/ext/pty'
make[2]: Entering directory '/tmp/ruby/build/trunk-repeat50/ext/ripper'
make[2]: Entering directory '/tmp/ruby/build/trunk-repeat50/ext/rubyvm'
make[2]: Leaving directory '/tmp/ruby/build/trunk-repeat50/ext/rubyvm'
make[2]: Leaving directory '/tmp/ruby/build/trunk-repeat50/ext/openssl'
make[2]: Leaving directory '/tmp/ruby/build/trunk-repeat50/ext/ripper'
make[2]: Entering directory '/tmp/ruby/build/trunk-repeat50/ext/syslog'
make[2]: Entering directory '/tmp/ruby/build/trunk-repeat50/.bundle/gems/debug-1.8.0/ext/debug'
make[2]: Leaving directory '/tmp/ruby/build/trunk-repeat50/ext/syslog'
make[2]: Entering directory '/tmp/ruby/build/trunk-repeat50/ext/socket'
make[2]: Entering directory '/tmp/ruby/build/trunk-repeat50/.bundle/gems/racc-1.7.3/ext/racc/cparse'
make[2]: Entering directory '/tmp/ruby/build/trunk-repeat50/.bundle/gems/rbs-3.2.2/ext/rbs_extension'
make[2]: Leaving directory '/tmp/ruby/build/trunk-repeat50/ext/socket'
make[2]: Entering directory '/tmp/ruby/build/trunk-repeat50/.bundle/gems/rbs-3.3.0/ext/rbs_extension'
make[2]: Leaving directory '/tmp/ruby/build/trunk-repeat50/.bundle/gems/debug-1.8.0/ext/debug'
make[2]: Entering directory '/tmp/ruby/build/trunk-repeat50/.bundle/gems/rbs-3.3.2/ext/rbs_extension'
make[2]: Leaving directory '/tmp/ruby/build/trunk-repeat50/.bundle/gems/racc-1.7.3/ext/racc/cparse'
make[2]: Leaving directory '/tmp/ruby/build/trunk-repeat50/.bundle/gems/rbs-3.2.2/ext/rbs_extension'
make[2]: Leaving directory '/tmp/ruby/build/trunk-repeat50/.bundle/gems/rbs-3.3.2/ext/rbs_extension'
make[2]: Leaving directory '/tmp/ruby/build/trunk-repeat50/.bundle/gems/rbs-3.3.0/ext/rbs_extension'
make[2]: Entering directory '/tmp/ruby/build/trunk-repeat50/ext/digest/sha2'
make[2]: Leaving directory '/tmp/ruby/build/trunk-repeat50/ext/digest/sha2'
make[2]: Entering directory '/tmp/ruby/build/trunk-repeat50'
make[2]: 'ruby' is up to date.
make[2]: Leaving directory '/tmp/ruby/build/trunk-repeat50'
make[1]: Leaving directory '/tmp/ruby/build/trunk-repeat50'
make[1]: Entering directory '/tmp/ruby/build/trunk-repeat50'
make[1]: Nothing to be done for 'note'.
make[1]: Leaving directory '/tmp/ruby/build/trunk-repeat50'
./miniruby -I/tmp/ruby/src/trunk-repeat50/lib -I. -I.ext/common  /tmp/ruby/src/trunk-repeat50/tool/runruby.rb --extout=.ext  -- --disable-gems -r./x86_64-linux-fake /tmp/ruby/src/trunk-repeat50/tool/rbinstall.rb --make="make" --dest-dir="" --extout=".ext" --ext-build-dir="./ext" --mflags="-j4 --jobserver-auth=4,5" --make-flags=" -j4 --jobserver-auth=4,5" --data-mode=0644 --prog-mode=0755 --installed-list .installed.list --mantype="man"  --gnumake --install=all --exclude=doc
Installing to 
installing binary commands:         /tmp/ruby/install/trunk-repeat50/bin
installing base libraries:          /tmp/ruby/install/trunk-repeat50/lib
installing arch files:              /tmp/ruby/install/trunk-repeat50/lib/ruby/3.3.0+0/x86_64-linux
installing pkgconfig data:          /tmp/ruby/install/trunk-repeat50/lib/pkgconfig
installing extension objects:       /tmp/ruby/install/trunk-repeat50/lib/ruby/3.3.0+0/x86_64-linux
installing extension objects:       /tmp/ruby/install/trunk-repeat50/lib/ruby/site_ruby/3.3.0+0/x86_64-linux
installing extension objects:       /tmp/ruby/install/trunk-repeat50/lib/ruby/vendor_ruby/3.3.0+0/x86_64-linux
installing extension headers:       /tmp/ruby/install/trunk-repeat50/include/ruby-3.3.0+0/x86_64-linux
installing extension scripts:       /tmp/ruby/install/trunk-repeat50/lib/ruby/3.3.0+0
installing extension scripts:       /tmp/ruby/install/trunk-repeat50/lib/ruby/site_ruby/3.3.0+0
installing extension scripts:       /tmp/ruby/install/trunk-repeat50/lib/ruby/vendor_ruby/3.3.0+0
installing extension headers:       /tmp/ruby/install/trunk-repeat50/include/ruby-3.3.0+0/ruby
installing command scripts:         /tmp/ruby/install/trunk-repeat50/bin
installing library scripts:         /tmp/ruby/install/trunk-repeat50/lib/ruby/3.3.0+0
installing common headers:          /tmp/ruby/install/trunk-repeat50/include/ruby-3.3.0+0
installing manpages:                /tmp/ruby/install/trunk-repeat50/share/man/man1
installing default gems from lib:   /tmp/ruby/install/trunk-repeat50/lib/ruby/gems/3.3.0+0
                                    abbrev 0.1.1
                                    base64 0.2.0
                                    benchmark 0.3.0
                                    bundler 2.5.0.dev
                                    cgi 0.4.0
                                    csv 3.2.8
                                    delegate 0.3.1
                                    did_you_mean 1.6.3
                                    drb 2.2.0
                                    english 0.8.0
                                    erb 4.0.3
                                    error_highlight 0.5.1
                                    fileutils 1.7.2
                                    find 0.2.0
                                    forwardable 1.3.3
                                    getoptlong 0.2.1
                                    ipaddr 1.2.5
                                    irb 1.9.1
                                    logger 1.6.0
                                    mutex_m 0.2.0
                                    net-http 0.4.0
                                    net-protocol 0.2.2
                                    observer 0.1.2
                                    open-uri 0.4.0
                                    open3 0.2.0
                                    optparse 0.4.0
                                    ostruct 0.6.0
                                    pp 0.5.0
                                    prettyprint 0.2.0
                                    prism 0.18.0
                                    pstore 0.1.3
                                    rdoc 6.6.0
                                    readline 0.0.3
                                    reline 0.4.0
                                    resolv 0.2.2
                                    resolv-replace 0.1.1
                                    rinda 0.2.0
                                    ruby2_keywords 0.0.5
                                    securerandom 0.3.0
                                    set 1.0.3
                                    shellwords 0.2.0
                                    singleton 0.2.0
                                    syntax_suggest 1.1.0
                                    tempfile 0.2.0
                                    time 0.3.0
                                    timeout 0.4.1
                                    tmpdir 0.2.0
                                    tsort 0.2.0
                                    un 0.3.0
                                    uri 0.13.0
                                    weakref 0.1.3
                                    yaml 0.3.0
installing default gems from ext:   /tmp/ruby/install/trunk-repeat50/lib/ruby/gems/3.3.0+0
                                    bigdecimal 3.1.5
                                    date 3.3.4
                                    digest 3.1.1
                                    etc 1.4.3.dev.1
                                    fcntl 1.1.0
                                    fiddle 1.1.2
                                    io-console 0.6.1.dev.1
                                    io-nonblock 0.2.0
                                    io-wait 0.3.0
                                    json 2.6.3
                                    nkf 0.1.3
                                    openssl 3.2.0
                                    pathname 0.3.0
                                    psych 5.1.1.1
                                    stringio 3.1.0
                                    strscan 3.0.8
                                    syslog 0.1.1
                                    zlib 3.1.0
installing bundled gems:            /tmp/ruby/install/trunk-repeat50/lib/ruby/gems/3.3.0+0
                                    minitest 5.20.0
                                    power_assert 2.0.3
                                    rake 13.1.0
                                    test-unit 3.6.1
                                    rexml 3.2.6
                                    rss 0.3.0
                                    net-ftp 0.2.0
                                    net-imap 0.4.6
                                    net-pop 0.1.2
                                    net-smtp 0.4.0
                                    matrix 0.4.2
                                    prime 0.1.2
                                    rbs 3.3.2
                                    typeprof 0.21.8
                                    debug 1.8.0
                                    racc 1.7.3
installing bundled gem cache:       /tmp/ruby/install/trunk-repeat50/lib/ruby/gems/3.3.0+0/cache
$$$[end] "make install -j4" exit with 0.
$$$[beg] make yes-btest TESTOPTS='-q -j4'
PASS all 1864 tests
 
$$$[end] "make yes-btest TESTOPTS='-q -j4'" exit with 0.
$$$[beg] make yes-test-basic TESTS=--repeat-count=50
	BASERUBY = /usr/bin/ruby --disable=gems
	CC = gcc
	LD = ld
	LDSHARED = gcc -shared
	CFLAGS = -O3 -fno-fast-math -ggdb3 -Wall -Wextra -Wdeprecated-declarations -Wdiv-by-zero -Wduplicated-cond -Wimplicit-function-declaration -Wimplicit-int -Wpointer-arith -Wwrite-strings -Wold-style-definition -Wimplicit-fallthrough=0 -Wmissing-noreturn -Wno-cast-function-type -Wno-constant-logical-operand -Wno-long-long -Wno-missing-field-initializers -Wno-overlength-strings -Wno-packed-bitfield-compat -Wno-parentheses-equality -Wno-self-assign -Wno-tautological-compare -Wno-unused-parameter -Wno-unused-value -Wsuggest-attribute=format -Wsuggest-attribute=noreturn -Wunused-variable -Wmisleading-indentation -Wundef   -fPIC 
	XCFLAGS = -U_FORTIFY_SOURCE -D_FORTIFY_SOURCE=2 -fstack-protector-strong -fno-strict-overflow -fvisibility=hidden -fexcess-precision=standard -DRUBY_EXPORT -I. -I.ext/include/x86_64-linux -I/tmp/ruby/src/trunk-repeat50/include -I/tmp/ruby/src/trunk-repeat50 -I/tmp/ruby/src/trunk-repeat50/prism -I/tmp/ruby/src/trunk-repeat50/enc/unicode/15.0.0  
	CPPFLAGS =   
	DLDFLAGS = -Wl,--compress-debug-sections=zlib -Wl,-soname,libruby.so.3.3  -fstack-protector-strong  
	SOLIBS = -lz -lrt -lrt -lgmp -ldl -lcrypt -lm -lpthread 
	LANG = 
	LC_ALL = 
	LC_CTYPE = 
	MFLAGS = 
	RUSTC = rustc
	YJIT_RUSTC_ARGS = --crate-name=yjit --crate-type=staticlib --edition=2021 -g -C lto=thin -C opt-level=3 -C overflow-checks=on '--out-dir=/tmp/ruby/build/trunk-repeat50/yjit/target/release/' /tmp/ruby/src/trunk-repeat50/yjit/src/lib.rs
gcc (Ubuntu 11.3.0-1ubuntu1~22.04.1) 11.3.0
Copyright (C) 2021 Free Software Foundation, Inc.
This is free software; see the source for copying conditions.  There is NO
warranty; not even for MERCHANTABILITY or FITNESS FOR A PARTICULAR PURPOSE.

Ignore setproctitle.o because of setproctitle.c under missing
Ignore strlcat.o because of strlcat.c under missing
Ignore strlcpy.o because of strlcpy.c under missing
Checking leaked global symbols...none
/tmp/ruby/src/trunk-repeat50/basictest/test.rb:assignment ....................................................................................................................................................................................................................................................................................................................................................................................OK 372
/tmp/ruby/src/trunk-repeat50/basictest/test.rb:condition ..OK 2
/tmp/ruby/src/trunk-repeat50/basictest/test.rb:if/unless ...OK 3
/tmp/ruby/src/trunk-repeat50/basictest/test.rb:case .....OK 5
/tmp/ruby/src/trunk-repeat50/basictest/test.rb:while/until ........OK 8
/tmp/ruby/src/trunk-repeat50/basictest/test.rb:exception ..........OK 10
/tmp/ruby/src/trunk-repeat50/basictest/test.rb:array .......................................OK 39
/tmp/ruby/src/trunk-repeat50/basictest/test.rb:hash ...........................OK 27
/tmp/ruby/src/trunk-repeat50/basictest/test.rb:iterator ...........................................................................................................OK 107
/tmp/ruby/src/trunk-repeat50/basictest/test.rb:float ................................................................................OK 80
/tmp/ruby/src/trunk-repeat50/basictest/test.rb:bignum ...............................OK 31
/tmp/ruby/src/trunk-repeat50/basictest/test.rb:string & char ..............................................................OK 62
/tmp/ruby/src/trunk-repeat50/basictest/test.rb:assignment ..........OK 10
/tmp/ruby/src/trunk-repeat50/basictest/test.rb:call ......OK 6
/tmp/ruby/src/trunk-repeat50/basictest/test.rb:proc .........OK 9
/tmp/ruby/src/trunk-repeat50/basictest/test.rb:signal ..OK 2
/tmp/ruby/src/trunk-repeat50/basictest/test.rb:eval ...........................OK 27
/tmp/ruby/src/trunk-repeat50/basictest/test.rb:system ........OK 8
/tmp/ruby/src/trunk-repeat50/basictest/test.rb:const .....OK 5
/tmp/ruby/src/trunk-repeat50/basictest/test.rb:clone .....OK 5
/tmp/ruby/src/trunk-repeat50/basictest/test.rb:marshal ....OK 4
/tmp/ruby/src/trunk-repeat50/basictest/test.rb:pack ....OK 4
/tmp/ruby/src/trunk-repeat50/basictest/test.rb:math ..OK 2
/tmp/ruby/src/trunk-repeat50/basictest/test.rb:struct ......OK 6
/tmp/ruby/src/trunk-repeat50/basictest/test.rb:variable ............OK 12
/tmp/ruby/src/trunk-repeat50/basictest/test.rb:trace ...OK 3
/tmp/ruby/src/trunk-repeat50/basictest/test.rb:defined? ............OK 12
/tmp/ruby/src/trunk-repeat50/basictest/test.rb:alias ......OK 6
/tmp/ruby/src/trunk-repeat50/basictest/test.rb:path .......................OK 23
/tmp/ruby/src/trunk-repeat50/basictest/test.rb:gc ....OK 4

test succeeded
$$$[end] "make yes-test-basic TESTS=--repeat-count=50" exit with 0.
$$$[beg] make yes-test-all TESTOPTS='--stderr-on-failure' TESTS=--repeat-count=50
	BASERUBY = /usr/bin/ruby --disable=gems
	CC = gcc
	LD = ld
	LDSHARED = gcc -shared
	CFLAGS = -O3 -fno-fast-math -ggdb3 -Wall -Wextra -Wdeprecated-declarations -Wdiv-by-zero -Wduplicated-cond -Wimplicit-function-declaration -Wimplicit-int -Wpointer-arith -Wwrite-strings -Wold-style-definition -Wimplicit-fallthrough=0 -Wmissing-noreturn -Wno-cast-function-type -Wno-constant-logical-operand -Wno-long-long -Wno-missing-field-initializers -Wno-overlength-strings -Wno-packed-bitfield-compat -Wno-parentheses-equality -Wno-self-assign -Wno-tautological-compare -Wno-unused-parameter -Wno-unused-value -Wsuggest-attribute=format -Wsuggest-attribute=noreturn -Wunused-variable -Wmisleading-indentation -Wundef   -fPIC 
	XCFLAGS = -U_FORTIFY_SOURCE -D_FORTIFY_SOURCE=2 -fstack-protector-strong -fno-strict-overflow -fvisibility=hidden -fexcess-precision=standard -DRUBY_EXPORT -I. -I.ext/include/x86_64-linux -I/tmp/ruby/src/trunk-repeat50/include -I/tmp/ruby/src/trunk-repeat50 -I/tmp/ruby/src/trunk-repeat50/prism -I/tmp/ruby/src/trunk-repeat50/enc/unicode/15.0.0  
	CPPFLAGS =   
	DLDFLAGS = -Wl,--compress-debug-sections=zlib -Wl,-soname,libruby.so.3.3  -fstack-protector-strong  
	SOLIBS = -lz -lrt -lrt -lgmp -ldl -lcrypt -lm -lpthread 
	LANG = 
	LC_ALL = 
	LC_CTYPE = 
	MFLAGS = 
	RUSTC = rustc
	YJIT_RUSTC_ARGS = --crate-name=yjit --crate-type=staticlib --edition=2021 -g -C lto=thin -C opt-level=3 -C overflow-checks=on '--out-dir=/tmp/ruby/build/trunk-repeat50/yjit/target/release/' /tmp/ruby/src/trunk-repeat50/yjit/src/lib.rs
gcc (Ubuntu 11.3.0-1ubuntu1~22.04.1) 11.3.0
Copyright (C) 2021 Free Software Foundation, Inc.
This is free software; see the source for copying conditions.  There is NO
warranty; not even for MERCHANTABILITY or FITNESS FOR A PARTICULAR PURPOSE.

generating enc.mk
generating encdb.h
encdb.h unchanged
making enc
make[1]: Entering directory '/tmp/ruby/build/trunk-repeat50'
make[1]: Nothing to be done for 'enc'.
make[1]: Leaving directory '/tmp/ruby/build/trunk-repeat50'
making srcs under enc
make[1]: Entering directory '/tmp/ruby/build/trunk-repeat50'
make[1]: Nothing to be done for 'srcs'.
make[1]: Leaving directory '/tmp/ruby/build/trunk-repeat50'
generating transdb.h
transdb.h unchanged
making trans
make[1]: Entering directory '/tmp/ruby/build/trunk-repeat50'
make[1]: Nothing to be done for '/tmp/ruby/src/trunk-repeat50/enc/trans'.
make[1]: Leaving directory '/tmp/ruby/build/trunk-repeat50'
making encs
make[1]: Entering directory '/tmp/ruby/build/trunk-repeat50'
make[1]: Nothing to be done for 'encs'.
make[1]: Leaving directory '/tmp/ruby/build/trunk-repeat50'
generating makefiles ext/configure-ext.mk
ext/configure-ext.mk updated
make[1]: Entering directory '/tmp/ruby/build/trunk-repeat50'
make[1]: Leaving directory '/tmp/ruby/build/trunk-repeat50'
generating makefile exts.mk
exts.mk unchanged
make[1]: Entering directory '/tmp/ruby/build/trunk-repeat50'
make[2]: Entering directory '/tmp/ruby/build/trunk-repeat50/ext/bigdecimal'
make[2]: Leaving directory '/tmp/ruby/build/trunk-repeat50/ext/bigdecimal'
make[2]: Entering directory '/tmp/ruby/build/trunk-repeat50/ext/coverage'
make[2]: Leaving directory '/tmp/ruby/build/trunk-repeat50/ext/coverage'
make[2]: Entering directory '/tmp/ruby/build/trunk-repeat50/ext/date'
make[2]: Leaving directory '/tmp/ruby/build/trunk-repeat50/ext/date'
make[2]: Entering directory '/tmp/ruby/build/trunk-repeat50/ext/digest'
make[2]: Leaving directory '/tmp/ruby/build/trunk-repeat50/ext/digest'
make[2]: Entering directory '/tmp/ruby/build/trunk-repeat50/ext/digest/sha2'
make[2]: Leaving directory '/tmp/ruby/build/trunk-repeat50/ext/digest/sha2'
make[2]: Entering directory '/tmp/ruby/build/trunk-repeat50/ext/fiddle'
make[2]: Leaving directory '/tmp/ruby/build/trunk-repeat50/ext/fiddle'
make[2]: Entering directory '/tmp/ruby/build/trunk-repeat50/ext/io/console'
make[2]: Leaving directory '/tmp/ruby/build/trunk-repeat50/ext/io/console'
make[2]: Entering directory '/tmp/ruby/build/trunk-repeat50/ext/json'
make[2]: Leaving directory '/tmp/ruby/build/trunk-repeat50/ext/json'
make[2]: Entering directory '/tmp/ruby/build/trunk-repeat50/ext/monitor'
make[2]: Leaving directory '/tmp/ruby/build/trunk-repeat50/ext/monitor'
make[2]: Entering directory '/tmp/ruby/build/trunk-repeat50/ext/nkf'
make[2]: Leaving directory '/tmp/ruby/build/trunk-repeat50/ext/nkf'
make[2]: Entering directory '/tmp/ruby/build/trunk-repeat50/ext/objspace'
make[2]: Leaving directory '/tmp/ruby/build/trunk-repeat50/ext/objspace'
make[2]: Entering directory '/tmp/ruby/build/trunk-repeat50/ext/openssl'
make[2]: Leaving directory '/tmp/ruby/build/trunk-repeat50/ext/openssl'
make[2]: Entering directory '/tmp/ruby/build/trunk-repeat50/ext/pathname'
make[2]: Leaving directory '/tmp/ruby/build/trunk-repeat50/ext/pathname'
make[2]: Entering directory '/tmp/ruby/build/trunk-repeat50/ext/psych'
make[2]: Leaving directory '/tmp/ruby/build/trunk-repeat50/ext/psych'
make[2]: Entering directory '/tmp/ruby/build/trunk-repeat50/ext/pty'
make[2]: Leaving directory '/tmp/ruby/build/trunk-repeat50/ext/pty'
make[2]: Entering directory '/tmp/ruby/build/trunk-repeat50/ext/ripper'
make[2]: Leaving directory '/tmp/ruby/build/trunk-repeat50/ext/ripper'
make[2]: Entering directory '/tmp/ruby/build/trunk-repeat50/ext/rubyvm'
make[2]: Leaving directory '/tmp/ruby/build/trunk-repeat50/ext/rubyvm'
make[2]: Entering directory '/tmp/ruby/build/trunk-repeat50/ext/socket'
make[2]: Leaving directory '/tmp/ruby/build/trunk-repeat50/ext/socket'
make[2]: Entering directory '/tmp/ruby/build/trunk-repeat50/ext/syslog'
make[2]: Leaving directory '/tmp/ruby/build/trunk-repeat50/ext/syslog'
make[2]: Entering directory '/tmp/ruby/build/trunk-repeat50/.bundle/gems/debug-1.8.0/ext/debug'
make[2]: Leaving directory '/tmp/ruby/build/trunk-repeat50/.bundle/gems/debug-1.8.0/ext/debug'
make[2]: Entering directory '/tmp/ruby/build/trunk-repeat50/.bundle/gems/racc-1.7.3/ext/racc/cparse'
make[2]: Leaving directory '/tmp/ruby/build/trunk-repeat50/.bundle/gems/racc-1.7.3/ext/racc/cparse'
make[2]: Entering directory '/tmp/ruby/build/trunk-repeat50/.bundle/gems/rbs-3.2.2/ext/rbs_extension'
make[2]: Leaving directory '/tmp/ruby/build/trunk-repeat50/.bundle/gems/rbs-3.2.2/ext/rbs_extension'
make[2]: Entering directory '/tmp/ruby/build/trunk-repeat50/.bundle/gems/rbs-3.3.0/ext/rbs_extension'
make[2]: Leaving directory '/tmp/ruby/build/trunk-repeat50/.bundle/gems/rbs-3.3.0/ext/rbs_extension'
make[2]: Entering directory '/tmp/ruby/build/trunk-repeat50/.bundle/gems/rbs-3.3.2/ext/rbs_extension'
make[2]: Leaving directory '/tmp/ruby/build/trunk-repeat50/.bundle/gems/rbs-3.3.2/ext/rbs_extension'
make[2]: Entering directory '/tmp/ruby/build/trunk-repeat50'
make[2]: 'ruby' is up to date.
make[2]: Leaving directory '/tmp/ruby/build/trunk-repeat50'
make[1]: Leaving directory '/tmp/ruby/build/trunk-repeat50'
make[1]: Entering directory '/tmp/ruby/build/trunk-repeat50'
make[1]: Nothing to be done for 'note'.
make[1]: Leaving directory '/tmp/ruby/build/trunk-repeat50'
Skipping Gem::PackageTask tests.  rake not found.
Run options: 
  --seed=40138
  "--ruby=./miniruby -I/tmp/ruby/src/trunk-repeat50/lib -I. -I.ext/common  /tmp/ruby/src/trunk-repeat50/tool/runruby.rb --extout=.ext  -- --disable-gems"
  --excludes-dir=/tmp/ruby/src/trunk-repeat50/test/.excludes
  --name=!/memory_leak/
  --stderr-on-failure
  --repeat-count=50

# Running tests:

Leaked file descriptor: TestIRB::ContextTest#test_build_completor: 7 #<File::Stat dev=0x70, ino=14430222, mode=0100644, nlink=1, uid=1001, gid=1000, rdev=0x0, size=1020, blksize=4096, blocks=8, atime=2023-11-24 11:25:14.041073437 +0000, mtime=2023-11-24 11:25:14.037073268 +0000, ctime=2023-11-24 11:25:14.037073268 +0000>
Leaked thread: TestIRB::ContextTest#test_build_completor: #<Thread:0x00007efd90ce8b70 /tmp/ruby/src/trunk-repeat50/lib/irb/type_completion/types.rb:16 sleep>
Closed file descriptor: TestIRB::ContextTest#test_default_return_format: 7
Finished thread: TestIRB::ContextTest#test_default_return_format: #<Thread:0x00007efd90ce8b70 /tmp/ruby/src/trunk-repeat50/lib/irb/type_completion/types.rb:16 dead>
Finished(1/50)  tests in 1008.100335s, 26.7444 tests/s, 10407.4303 assertions/s.
Leaked file descriptor: WebauthnListenerTest#test_wait_for_otp_code_options_request: 9 : #<TCPSocket:fd 9, AF_INET, 127.0.0.1, 45587>
Closed file descriptor: TestGemCommandsQueryCommandWithoutInstalledGems#test_execute_show_default_gems_with_platform: 9
Finished(2/50)  tests in 1176.350575s, 22.9192 tests/s, 8920.7650 assertions/s.
Leaked file descriptor: WebauthnListenerTest#test_wait_for_otp_code_options_request: 9 : #<TCPSocket:fd 9, AF_INET, 127.0.0.1, 37189>
Closed file descriptor: WebauthnListenerTest#test_wait_for_otp_code_get_follows_options: 9
Leaked file descriptor: DRbTests::TestDRbTCP#test_immediate_close: 12 : #<IO:fd 12>
Leaked thread: DRbTests::TestDRbTCP#test_immediate_close: #<Thread:0x00007efd8b8afd60 /tmp/ruby/src/trunk-repeat50/lib/drb/drb.rb:1717 sleep>
Finished(3/50)  tests in 1221.614974s, 22.0700 tests/s, 8590.1477 assertions/s.
Leaked file descriptor: WebauthnListenerTest#test_wait_for_otp_code_get_follows_options: 9 : #<TCPSocket:fd 9, AF_INET, 127.0.0.1, 44387>
Closed file descriptor: WebauthnListenerTest#test_wait_for_otp_code_incorrect_path: 9
Finished(4/50)  tests in 1584.970411s, 17.0104 tests/s, 6620.8706 assertions/s.
Leaked file descriptor: WebauthnListenerTest#test_wait_for_otp_code_get_follows_options: 9 : #<TCPSocket:fd 9, AF_INET, 127.0.0.1, 41125>
Closed file descriptor: WebauthnListenerTest#test_wait_for_otp_code_incorrect_path: 9
Finished(5/50)  tests in 1315.913141s, 20.4884 tests/s, 7973.7915 assertions/s.
Leaked file descriptor: WebauthnListenerTest#test_wait_for_otp_code_get_follows_options: 9 : #<TCPSocket:fd 9, AF_INET, 127.0.0.1, 34707>
Closed file descriptor: WebauthnListenerTest#test_wait_for_otp_code_incorrect_path: 9
Finished(6/50)  tests in 1189.538455s, 22.6651 tests/s, 8821.0137 assertions/s.
Leaked file descriptor: WebauthnListenerTest#test_wait_for_otp_code_options_request: 9 : #<TCPSocket:fd 9, AF_INET, 127.0.0.1, 45863>
Closed file descriptor: TestIRB::FrozenObjectTest#test_calling_command_on_a_frozen_main: 9
Finished(7/50)  tests in 1192.502219s, 22.6088 tests/s, 8798.9564 assertions/s.
Leaked file descriptor: WebauthnListenerTest#test_wait_for_otp_code_options_request: 9 : #<TCPSocket:fd 9, AF_INET, 127.0.0.1, 41007>
Closed file descriptor: TestIRB::FrozenObjectTest#test_calling_command_on_a_frozen_main: 9
Finished(8/50)  tests in 1118.550189s, 24.1035 tests/s, 9381.6067 assertions/s.
Leaked file descriptor: WebauthnListenerTest#test_wait_for_otp_code_get_follows_options: 9 : #<TCPSocket:fd 9, AF_INET, 127.0.0.1, 38537>
Closed file descriptor: WebauthnListenerTest#test_wait_for_otp_code_incorrect_path: 9
Finished(9/50)  tests in 1164.277301s, 23.1569 tests/s, 9013.1294 assertions/s.
Leaked file descriptor: WebauthnListenerTest#test_wait_for_otp_code_options_request: 9 : #<TCPSocket:fd 9, AF_INET, 127.0.0.1, 44261>
Closed file descriptor: TestGemCommandsQueryCommandWithoutInstalledGems#test_execute_show_default_gems_with_platform: 9
Finished(10/50)  tests in 1484.386354s, 18.1631 tests/s, 7068.8120 assertions/s.
Leaked file descriptor: DRbTests::TestDRbTCP#test_immediate_close: 12 : #<IO:fd 12>
Leaked thread: DRbTests::TestDRbTCP#test_immediate_close: #<Thread:0x00007efd892d7890 /tmp/ruby/src/trunk-repeat50/lib/drb/drb.rb:1717 sleep>
Finished(11/50)  tests in 1130.367891s, 23.8515 tests/s, 9283.0972 assertions/s.
Finished(12/50)  tests in 1111.669747s, 24.2527 tests/s, 9439.7577 assertions/s.
Finished(13/50)  tests in 1100.287252s, 24.5036 tests/s, 9537.5248 assertions/s.
Leaked file descriptor: WebauthnListenerTest#test_wait_for_otp_code_options_request: 9 : #<TCPSocket:fd 9, AF_INET, 127.0.0.1, 33953>
Closed file descriptor: WebauthnListenerTest#test_wait_for_otp_code_get_follows_options: 9
Leaked file descriptor: DRbTests::TestDRbTCP#test_immediate_close: 12 : #<IO:fd 12>
Leaked thread: DRbTests::TestDRbTCP#test_immediate_close: #<Thread:0x00007efd8a03aed8 /tmp/ruby/src/trunk-repeat50/lib/drb/drb.rb:1717 sleep>
Finished(14/50)  tests in 1206.482875s, 22.3468 tests/s, 8697.6560 assertions/s.
Finished(15/50)  tests in 1313.987975s, 20.5185 tests/s, 7986.1987 assertions/s.
Leaked file descriptor: WebauthnListenerTest#test_wait_for_otp_code_get_follows_options: 9 : #<TCPSocket:fd 9, AF_INET, 127.0.0.1, 33771>
Closed file descriptor: WebauthnListenerTest#test_wait_for_otp_code_incorrect_path: 9
Finished(16/50)  tests in 1544.077219s, 17.4609 tests/s, 6796.6089 assertions/s.
Leaked file descriptor: WebauthnListenerTest#test_wait_for_otp_code_options_request: 9 : #<TCPSocket:fd 9, AF_INET, 127.0.0.1, 32977>
Closed file descriptor: WebauthnListenerTest#test_wait_for_otp_code_get_follows_options: 9
Finished(17/50)  tests in 1240.707507s, 21.7303 tests/s, 8458.1442 assertions/s.
Finished(18/50)  tests in 1095.523442s, 24.6102 tests/s, 9578.9379 assertions/s.
Leaked file descriptor: DRbTests::TestDRbTCP#test_immediate_close: 12 : #<IO:fd 12>
Leaked thread: DRbTests::TestDRbTCP#test_immediate_close: #<Thread:0x00007efd0cc63b48 /tmp/ruby/src/trunk-repeat50/lib/drb/drb.rb:1717 sleep>
Finished(19/50)  tests in 1145.912189s, 23.5280 tests/s, 9157.0027 assertions/s.
Leaked file descriptor: WebauthnListenerTest#test_wait_for_otp_code_options_request: 9 : #<TCPSocket:fd 9, AF_INET, 127.0.0.1, 42861>
Closed file descriptor: TestIRB::FrozenObjectTest#test_calling_command_on_a_frozen_main: 9
Finished(20/50)  tests in 1242.143556s, 21.7052 tests/s, 8447.9986 assertions/s.
Leaked file descriptor: WebauthnListenerTest#test_wait_for_otp_code_options_request: 9 : #<TCPSocket:fd 9, AF_INET, 127.0.0.1, 41657>
Closed file descriptor: TestGemCommandsQueryCommandWithoutInstalledGems#test_execute_exact_remote: 9
Finished(21/50)  tests in 1479.901102s, 18.2181 tests/s, 7091.2029 assertions/s.
Leaked file descriptor: WebauthnListenerTest#test_wait_for_otp_code_get_follows_options: 9 : #<TCPSocket:fd 9, AF_INET, 127.0.0.1, 40657>
Closed file descriptor: WebauthnListenerTest#test_wait_for_otp_code_incorrect_path: 9
Finished(22/50)  tests in 1471.861223s, 18.3176 tests/s, 7129.4745 assertions/s.
Finished(23/50)  tests in 1255.644051s, 21.4718 tests/s, 8356.9241 assertions/s.
Finished(24/50)  tests in 1234.781939s, 21.8346 tests/s, 8498.2268 assertions/s.
Finished(25/50)  tests in 1140.170576s, 23.6465 tests/s, 9203.1194 assertions/s.
Leaked file descriptor: Rinda::TupleSpaceProxyTest#test_take_bug_8215: 20 : #<IO:fd 20>
Closed file descriptor: Rinda::TupleSpaceProxyTest#test_00_tuple: 16
Closed file descriptor: Rinda::TupleSpaceProxyTest#test_00_tuple: 17
Closed file descriptor: Rinda::TupleSpaceProxyTest#test_00_tuple: 18
Closed file descriptor: Rinda::TupleSpaceProxyTest#test_00_tuple: 19
Closed file descriptor: Rinda::TupleSpaceProxyTest#test_00_tuple: 20
Closed file descriptor: Rinda::TupleSpaceProxyTest#test_00_tuple: 21
Finished(26/50)  tests in 1270.016838s, 21.2289 tests/s, 8262.2716 assertions/s.
Leaked file descriptor: Rinda::TupleSpaceProxyTest#test_take_bug_8215: 14 : #<IO:fd 14>
Closed file descriptor: Rinda::TupleSpaceProxyTest#test_00_tuple: 13
Closed file descriptor: Rinda::TupleSpaceProxyTest#test_00_tuple: 14
Closed file descriptor: Rinda::TupleSpaceProxyTest#test_00_tuple: 15
Leaked file descriptor: WebauthnListenerTest#test_wait_for_otp_code_options_request: 9 : #<TCPSocket:fd 9, AF_INET, 127.0.0.1, 43553>
Closed file descriptor: TestIRB::FrozenObjectTest#test_calling_command_on_a_frozen_main: 9
Finished(27/50)  tests in 1611.233772s, 16.7331 tests/s, 6511.3705 assertions/s.
Leaked file descriptor: WebauthnListenerTest#test_wait_for_otp_code_get_follows_options: 9 : #<TCPSocket:fd 9, AF_INET, 127.0.0.1, 33515>
Closed file descriptor: WebauthnListenerTest#test_wait_for_otp_code_incorrect_path: 9
Finished(28/50)  tests in 1316.777649s, 20.4750 tests/s, 7968.6384 assertions/s.
Finished(29/50)  tests in 1262.926395s, 21.3480 tests/s, 8307.6219 assertions/s.
Leaked file descriptor: Rinda::TupleSpaceProxyTest#test_take_bug_8215: 17 : #<IO:fd 17>
Leaked file descriptor: Rinda::TupleSpaceProxyTest#test_take_bug_8215: 18 : #<IO:fd 18>
Closed file descriptor: Rinda::TupleSpaceProxyTest#test_00_tuple: 16
Closed file descriptor: Rinda::TupleSpaceProxyTest#test_00_tuple: 17
Closed file descriptor: Rinda::TupleSpaceProxyTest#test_00_tuple: 18
Finished(30/50)  tests in 1204.823484s, 22.3776 tests/s, 8708.3686 assertions/s.
Leaked file descriptor: WebauthnListenerTest#test_wait_for_otp_code_options_request: 9 : #<TCPSocket:fd 9, AF_INET, 127.0.0.1, 33603>
Closed file descriptor: TestIRB::FrozenObjectTest#test_calling_command_on_a_frozen_main: 9
Finished(31/50)  tests in 1142.699034s, 23.5941 tests/s, 9183.3674 assertions/s.
Leaked file descriptor: WebauthnListenerTest#test_wait_for_otp_code_options_request: 9 : #<TCPSocket:fd 9, AF_INET, 127.0.0.1, 44331>
Closed file descriptor: WebauthnListenerTest#test_wait_for_otp_code_get_follows_options: 9
Finished(32/50)  tests in 1433.299403s, 18.8104 tests/s, 7321.1926 assertions/s.
Leaked file descriptor: WebauthnListenerTest#test_wait_for_otp_code_options_request: 9 : #<TCPSocket:fd 9, AF_INET, 127.0.0.1, 35989>
Closed file descriptor: TestIRB::FrozenObjectTest#test_calling_command_on_a_frozen_main: 9
Finished(33/50)  tests in 1480.375925s, 18.2123 tests/s, 7088.2286 assertions/s.
Leaked file descriptor: DRbTests::TestDRbTCP#test_immediate_close: 12 : #<IO:fd 12>
Leaked thread: DRbTests::TestDRbTCP#test_immediate_close: #<Thread:0x00007efd9071d470 /tmp/ruby/src/trunk-repeat50/lib/drb/drb.rb:1717 sleep>
Finished(34/50)  tests in 1268.055167s, 21.2617 tests/s, 8275.0272 assertions/s.
Leaked file descriptor: WebauthnListenerTest#test_wait_for_otp_code_options_request: 9 : #<TCPSocket:fd 9, AF_INET, 127.0.0.1, 38269>
Closed file descriptor: TestIRB::FrozenObjectTest#test_calling_command_on_a_frozen_main: 9
Finished(35/50)  tests in 1273.444342s, 21.1717 tests/s, 8240.9829 assertions/s.
Leaked file descriptor: WebauthnListenerTest#test_wait_for_otp_code_get_follows_options: 9 : #<TCPSocket:fd 9, AF_INET, 127.0.0.1, 39997>
Closed file descriptor: WebauthnListenerTest#test_wait_for_otp_code_incorrect_path: 9
Finished(36/50)  tests in 1291.416302s, 20.8771 tests/s, 8124.4142 assertions/s.
Finished(37/50)  tests in 1266.680136s, 21.2848 tests/s, 8284.3874 assertions/s.
Leaked file descriptor: WebauthnListenerTest#test_wait_for_otp_code_options_request: 9 : #<TCPSocket:fd 9, AF_INET, 127.0.0.1, 34819>
Closed file descriptor: TestIRB::FrozenObjectTest#test_calling_command_on_a_frozen_main: 9
Finished(38/50)  tests in 1605.753126s, 16.7903 tests/s, 6534.3936 assertions/s.
Leaked file descriptor: Rinda::TupleSpaceProxyTest#test_take_bug_8215: 17 : #<IO:fd 17>
Leaked file descriptor: Rinda::TupleSpaceProxyTest#test_take_bug_8215: 18 : #<IO:fd 18>
Closed file descriptor: Rinda::TupleSpaceProxyTest#test_00_tuple: 16
Closed file descriptor: Rinda::TupleSpaceProxyTest#test_00_tuple: 17
Closed file descriptor: Rinda::TupleSpaceProxyTest#test_00_tuple: 18
Leaked file descriptor: WebauthnListenerTest#test_wait_for_otp_code_options_request: 9 : #<TCPSocket:fd 9, AF_INET, 127.0.0.1, 36457>
Closed file descriptor: TestIRB::FrozenObjectTest#test_calling_command_on_a_frozen_main: 9
Finished(39/50)  tests in 1320.334680s, 20.4198 tests/s, 7946.0194 assertions/s.
Leaked file descriptor: WebauthnListenerTest#test_wait_for_otp_code_options_request: 9 : #<TCPSocket:fd 9, AF_INET, 127.0.0.1, 44847>
Closed file descriptor: TestIRB::FrozenObjectTest#test_calling_command_on_a_frozen_main: 9
Finished(40/50)  tests in 1293.423700s, 20.8447 tests/s, 8113.3267 assertions/s.
Leaked file descriptor: WebauthnListenerTest#test_wait_for_otp_code_options_request: 9 : #<TCPSocket:fd 9, AF_INET, 127.0.0.1, 37609>
Closed file descriptor: TestIRB::FrozenObjectTest#test_calling_command_on_a_frozen_main: 9
Finished(41/50)  tests in 1314.847982s, 20.5050 tests/s, 7981.7052 assertions/s.
Leaked file descriptor: Rinda::TupleSpaceProxyTest#test_take_bug_8215: 17 : #<IO:fd 17>
Leaked file descriptor: Rinda::TupleSpaceProxyTest#test_take_bug_8215: 18 : #<IO:fd 18>
Closed file descriptor: Rinda::TupleSpaceProxyTest#test_00_tuple: 16
Closed file descriptor: Rinda::TupleSpaceProxyTest#test_00_tuple: 17
Closed file descriptor: Rinda::TupleSpaceProxyTest#test_00_tuple: 18
Leaked file descriptor: WebauthnListenerTest#test_wait_for_otp_code_get_follows_options: 9 : #<TCPSocket:fd 9, AF_INET, 127.0.0.1, 34499>
Closed file descriptor: WebauthnListenerTest#test_wait_for_otp_code_incorrect_path: 9

  1) Failure:
TestGc#test_stat_heap [/tmp/ruby/src/trunk-repeat50/test/ruby/test_gc.rb:169]:
Expected 44380522 to be <= 44380502.

Finished(42/50)  tests in 1278.357010s, 21.0904 tests/s, 8208.3721 assertions/s.
1132362 tests, 440719222 assertions, 1 failures, 0 errors, 4153 skips

ruby -v: ruby 3.3.0dev (2023-11-24T11:00:13Z master 1cba1b3992) [x86_64-linux]
make: *** [uncommon.mk:945: yes-test-all] Error 1
$$$[end] "make yes-test-all TESTOPTS='--stderr-on-failure' TESTS=--repeat-count=50" exit with 512.
$$$[beg] make yes-test-rubyspec MSPECOPT='--error-output stderr --debug' TESTS=--repeat-count=50
	BASERUBY = /usr/bin/ruby --disable=gems
	CC = gcc
	LD = ld
	LDSHARED = gcc -shared
	CFLAGS = -O3 -fno-fast-math -ggdb3 -Wall -Wextra -Wdeprecated-declarations -Wdiv-by-zero -Wduplicated-cond -Wimplicit-function-declaration -Wimplicit-int -Wpointer-arith -Wwrite-strings -Wold-style-definition -Wimplicit-fallthrough=0 -Wmissing-noreturn -Wno-cast-function-type -Wno-constant-logical-operand -Wno-long-long -Wno-missing-field-initializers -Wno-overlength-strings -Wno-packed-bitfield-compat -Wno-parentheses-equality -Wno-self-assign -Wno-tautological-compare -Wno-unused-parameter -Wno-unused-value -Wsuggest-attribute=format -Wsuggest-attribute=noreturn -Wunused-variable -Wmisleading-indentation -Wundef   -fPIC 
	XCFLAGS = -U_FORTIFY_SOURCE -D_FORTIFY_SOURCE=2 -fstack-protector-strong -fno-strict-overflow -fvisibility=hidden -fexcess-precision=standard -DRUBY_EXPORT -I. -I.ext/include/x86_64-linux -I/tmp/ruby/src/trunk-repeat50/include -I/tmp/ruby/src/trunk-repeat50 -I/tmp/ruby/src/trunk-repeat50/prism -I/tmp/ruby/src/trunk-repeat50/enc/unicode/15.0.0  
	CPPFLAGS =   
	DLDFLAGS = -Wl,--compress-debug-sections=zlib -Wl,-soname,libruby.so.3.3  -fstack-protector-strong  
	SOLIBS = -lz -lrt -lrt -lgmp -ldl -lcrypt -lm -lpthread 
	LANG = 
	LC_ALL = 
	LC_CTYPE = 
	MFLAGS = 
	RUSTC = rustc
	YJIT_RUSTC_ARGS = --crate-name=yjit --crate-type=staticlib --edition=2021 -g -C lto=thin -C opt-level=3 -C overflow-checks=on '--out-dir=/tmp/ruby/build/trunk-repeat50/yjit/target/release/' /tmp/ruby/src/trunk-repeat50/yjit/src/lib.rs
gcc (Ubuntu 11.3.0-1ubuntu1~22.04.1) 11.3.0
Copyright (C) 2021 Free Software Foundation, Inc.
This is free software; see the source for copying conditions.  There is NO
warranty; not even for MERCHANTABILITY or FITNESS FOR A PARTICULAR PURPOSE.

generating enc.mk
generating encdb.h
encdb.h unchanged
making enc
make[1]: Entering directory '/tmp/ruby/build/trunk-repeat50'
make[1]: Nothing to be done for 'enc'.
make[1]: Leaving directory '/tmp/ruby/build/trunk-repeat50'
making srcs under enc
make[1]: Entering directory '/tmp/ruby/build/trunk-repeat50'
make[1]: Nothing to be done for 'srcs'.
make[1]: Leaving directory '/tmp/ruby/build/trunk-repeat50'
generating transdb.h
transdb.h unchanged
making trans
make[1]: Entering directory '/tmp/ruby/build/trunk-repeat50'
make[1]: Nothing to be done for '/tmp/ruby/src/trunk-repeat50/enc/trans'.
make[1]: Leaving directory '/tmp/ruby/build/trunk-repeat50'
making encs
make[1]: Entering directory '/tmp/ruby/build/trunk-repeat50'
make[1]: Nothing to be done for 'encs'.
make[1]: Leaving directory '/tmp/ruby/build/trunk-repeat50'
generating makefiles ext/configure-ext.mk
ext/configure-ext.mk updated
make[1]: Entering directory '/tmp/ruby/build/trunk-repeat50'
make[1]: Leaving directory '/tmp/ruby/build/trunk-repeat50'
generating makefile exts.mk
exts.mk unchanged
make[1]: Entering directory '/tmp/ruby/build/trunk-repeat50'
make[2]: Entering directory '/tmp/ruby/build/trunk-repeat50/ext/bigdecimal'
make[2]: Leaving directory '/tmp/ruby/build/trunk-repeat50/ext/bigdecimal'
make[2]: Entering directory '/tmp/ruby/build/trunk-repeat50/ext/coverage'
make[2]: Leaving directory '/tmp/ruby/build/trunk-repeat50/ext/coverage'
make[2]: Entering directory '/tmp/ruby/build/trunk-repeat50/ext/date'
make[2]: Leaving directory '/tmp/ruby/build/trunk-repeat50/ext/date'
make[2]: Entering directory '/tmp/ruby/build/trunk-repeat50/ext/digest'
make[2]: Leaving directory '/tmp/ruby/build/trunk-repeat50/ext/digest'
make[2]: Entering directory '/tmp/ruby/build/trunk-repeat50/ext/digest/sha2'
make[2]: Leaving directory '/tmp/ruby/build/trunk-repeat50/ext/digest/sha2'
make[2]: Entering directory '/tmp/ruby/build/trunk-repeat50/ext/fiddle'
make[2]: Leaving directory '/tmp/ruby/build/trunk-repeat50/ext/fiddle'
make[2]: Entering directory '/tmp/ruby/build/trunk-repeat50/ext/io/console'
make[2]: Leaving directory '/tmp/ruby/build/trunk-repeat50/ext/io/console'
make[2]: Entering directory '/tmp/ruby/build/trunk-repeat50/ext/json'
make[2]: Leaving directory '/tmp/ruby/build/trunk-repeat50/ext/json'
make[2]: Entering directory '/tmp/ruby/build/trunk-repeat50/ext/monitor'
make[2]: Leaving directory '/tmp/ruby/build/trunk-repeat50/ext/monitor'
make[2]: Entering directory '/tmp/ruby/build/trunk-repeat50/ext/nkf'
make[2]: Leaving directory '/tmp/ruby/build/trunk-repeat50/ext/nkf'
make[2]: Entering directory '/tmp/ruby/build/trunk-repeat50/ext/objspace'
make[2]: Leaving directory '/tmp/ruby/build/trunk-repeat50/ext/objspace'
make[2]: Entering directory '/tmp/ruby/build/trunk-repeat50/ext/openssl'
make[2]: Leaving directory '/tmp/ruby/build/trunk-repeat50/ext/openssl'
make[2]: Entering directory '/tmp/ruby/build/trunk-repeat50/ext/pathname'
make[2]: Leaving directory '/tmp/ruby/build/trunk-repeat50/ext/pathname'
make[2]: Entering directory '/tmp/ruby/build/trunk-repeat50/ext/psych'
make[2]: Leaving directory '/tmp/ruby/build/trunk-repeat50/ext/psych'
make[2]: Entering directory '/tmp/ruby/build/trunk-repeat50/ext/pty'
make[2]: Leaving directory '/tmp/ruby/build/trunk-repeat50/ext/pty'
make[2]: Entering directory '/tmp/ruby/build/trunk-repeat50/ext/ripper'
make[2]: Leaving directory '/tmp/ruby/build/trunk-repeat50/ext/ripper'
make[2]: Entering directory '/tmp/ruby/build/trunk-repeat50/ext/rubyvm'
make[2]: Leaving directory '/tmp/ruby/build/trunk-repeat50/ext/rubyvm'
make[2]: Entering directory '/tmp/ruby/build/trunk-repeat50/ext/socket'
make[2]: Leaving directory '/tmp/ruby/build/trunk-repeat50/ext/socket'
make[2]: Entering directory '/tmp/ruby/build/trunk-repeat50/ext/syslog'
make[2]: Leaving directory '/tmp/ruby/build/trunk-repeat50/ext/syslog'
make[2]: Entering directory '/tmp/ruby/build/trunk-repeat50/.bundle/gems/debug-1.8.0/ext/debug'
make[2]: Leaving directory '/tmp/ruby/build/trunk-repeat50/.bundle/gems/debug-1.8.0/ext/debug'
make[2]: Entering directory '/tmp/ruby/build/trunk-repeat50/.bundle/gems/racc-1.7.3/ext/racc/cparse'
make[2]: Leaving directory '/tmp/ruby/build/trunk-repeat50/.bundle/gems/racc-1.7.3/ext/racc/cparse'
make[2]: Entering directory '/tmp/ruby/build/trunk-repeat50/.bundle/gems/rbs-3.2.2/ext/rbs_extension'
make[2]: Leaving directory '/tmp/ruby/build/trunk-repeat50/.bundle/gems/rbs-3.2.2/ext/rbs_extension'
make[2]: Entering directory '/tmp/ruby/build/trunk-repeat50/.bundle/gems/rbs-3.3.0/ext/rbs_extension'
make[2]: Leaving directory '/tmp/ruby/build/trunk-repeat50/.bundle/gems/rbs-3.3.0/ext/rbs_extension'
make[2]: Entering directory '/tmp/ruby/build/trunk-repeat50/.bundle/gems/rbs-3.3.2/ext/rbs_extension'
make[2]: Leaving directory '/tmp/ruby/build/trunk-repeat50/.bundle/gems/rbs-3.3.2/ext/rbs_extension'
make[2]: Entering directory '/tmp/ruby/build/trunk-repeat50'
make[2]: 'ruby' is up to date.
make[2]: Leaving directory '/tmp/ruby/build/trunk-repeat50'
make[1]: Leaving directory '/tmp/ruby/build/trunk-repeat50'
make[1]: Entering directory '/tmp/ruby/build/trunk-repeat50'
make[1]: Nothing to be done for 'note'.
make[1]: Leaving directory '/tmp/ruby/build/trunk-repeat50'
$ /tmp/ruby/build/trunk-repeat50/miniruby -I/tmp/ruby/src/trunk-repeat50/lib /tmp/ruby/src/trunk-repeat50/tool/runruby.rb --archdir=/tmp/ruby/build/trunk-repeat50 --extout=.ext -- /tmp/ruby/src/trunk-repeat50/spec/mspec/bin/mspec-run -B /tmp/ruby/src/trunk-repeat50/spec/default.mspec --error-output stderr --debug
ruby 3.3.0dev (2023-11-24T11:00:13Z master 1cba1b3992) [x86_64-linux]
     0 .........................................................................
    73 .........................................................................
   146 .........................................................................
   219 .........................................................................
   292 .........................................................................
   365 .........................................................................
   438 .........................................................................
   511 .........................................................................
   584 .........................................................................
   657 .........................................................................
   730 .........................................................................
   803 .........................................................................
   876 .........................................................................
   949 .........................................................................
  1022 .........................................................................
  1095 .........................................................................
  1168 .........................................................................
  1241 .........................................................................
  1314 .........................................................................
  1387 .........................................................................
  1460 .........................................................................
  1533 .........................................................................
  1606 .........................................................................
  1679 .........................................................................
  1752 .........................................................................
  1825 .........................................................................
  1898 .........................................................................
  1971 .........................................................................
  2044 .........................................................................
  2117 .........................................................................
  2190 .........................................................................
  2263 .........................................................................
  2336 .........................................................................
  2409 .........................................................................
  2482 .........................................................................
  2555 .........................................................................
  2628 .........................................................................
  2701 .........................................................................
  2774 .........................................................................
  2847 .........................................................................
  2920 .........................................................................
  2993 .........................................................................
  3066 .........................................................................
  3139 .........................................................................
  3212 .........................................................................
  3285 .........................................................................
  3358 .........................................................................
  3431 .........................................................................
  3504 .........................................................................
  3577 .........................................................................
  3650 .........................................................................
  3723 ..

Finished in 97.071641 seconds

3725 files, 32456 examples, 178553 expectations, 0 failures, 0 errors, 0 tagged
$$$[end] "make yes-test-rubyspec MSPECOPT='--error-output stderr --debug' TESTS=--repeat-count=50" exit with 0.
raw logfile