| "make update-download -j4" exit with 0. |
| "make update-src -j4" exit with 0. |
| "make after-update -j4" exit with 0. |
| "make miniruby -j4" exit with 0. |
| "make ruby -j4" exit with 0. |
| "make all -j4" exit with 0. |
| "make install -j4" exit with 0. |
| "make yes-btest TESTOPTS='-q -j4'" exit with 0. |
| |
| "make yes-test-basic TESTS=--repeat-count=50" exit with 0. |
| "make yes-test-all TESTOPTS='--stderr-on-failure' TESTS=--repeat-count=50" exit with 512. |
| /tmp/ruby/build/trunk-repeat50/ruby: error while loading shared libraries: /tmp/ruby/build/trunk-repeat50/libruby.so.3.5: file too short |
| /tmp/ruby/build/trunk-repeat50/ruby: error while loading shared libraries: /tmp/ruby/build/trunk-repeat50/libruby.so.3.5: file too short |
| #<Thread:0x0000ffff7fefa360 /tmp/ruby/src/trunk-repeat50/test/ruby/test_io.rb:3150 run> terminated with exception (report_on_exception is true): |
| /tmp/ruby/src/trunk-repeat50/tool/lib/envutil.rb:184:in 'IO#write': Broken pipe (Errno::EPIPE) |
| from /tmp/ruby/src/trunk-repeat50/tool/lib/envutil.rb:184:in 'EnvUtil.invoke_ruby' |
| from /tmp/ruby/src/trunk-repeat50/tool/lib/core_assertions.rb:103:in 'Test::Unit::CoreAssertions#assert_in_out_err' |
| from /tmp/ruby/src/trunk-repeat50/test/ruby/test_io.rb:3151:in 'block (2 levels) in TestIO#test_threaded_flush' |
| #<Thread:0x0000ffff7fefa220 /tmp/ruby/src/trunk-repeat50/test/ruby/test_io.rb:3150 run> terminated with exception (report_on_exception is true): |
| /tmp/ruby/src/trunk-repeat50/tool/lib/envutil.rb:184:in 'IO#write': Broken pipe (Errno::EPIPE) |
| from /tmp/ruby/src/trunk-repeat50/tool/lib/envutil.rb:184:in 'EnvUtil.invoke_ruby' |
| from /tmp/ruby/src/trunk-repeat50/tool/lib/core_assertions.rb:103:in 'Test::Unit::CoreAssertions#assert_in_out_err' |
| from /tmp/ruby/src/trunk-repeat50/test/ruby/test_io.rb:3151:in 'block (2 levels) in TestIO#test_threaded_flush' |
| #<Thread:0x0000ffff7fefa0e0 /tmp/ruby/src/trunk-repeat50/test/ruby/test_io.rb:3150 run> terminated with exception (report_on_exception is true): |
| /tmp/ruby/src/trunk-repeat50/tool/lib/envutil.rb:184:in 'IO#write': Broken pipe (Errno::EPIPE) |
| from /tmp/ruby/src/trunk-repeat50/tool/lib/envutil.rb:184:in 'EnvUtil.invoke_ruby' |
| from /tmp/ruby/src/trunk-repeat50/tool/lib/core_assertions.rb:103:in 'Test::Unit::CoreAssertions#assert_in_out_err' |
| from /tmp/ruby/src/trunk-repeat50/test/ruby/test_io.rb:3151:in 'block (2 levels) in TestIO#test_threaded_flush' |
| #<Thread:0x0000ffff7fef9ff0 /tmp/ruby/src/trunk-repeat50/test/ruby/test_io.rb:3150 run> terminated with exception (report_on_exception is true): |
| /tmp/ruby/src/trunk-repeat50/tool/lib/envutil.rb:184:in 'IO#write': Broken pipe (Errno::EPIPE) |
| from /tmp/ruby/src/trunk-repeat50/tool/lib/envutil.rb:184:in 'EnvUtil.invoke_ruby' |
| from /tmp/ruby/src/trunk-repeat50/tool/lib/core_assertions.rb:103:in 'Test::Unit::CoreAssertions#assert_in_out_err' |
| from /tmp/ruby/src/trunk-repeat50/test/ruby/test_io.rb:3151:in 'block (2 levels) in TestIO#test_threaded_flush' |
| #<Thread:0x0000ffff7fef9f00 /tmp/ruby/src/trunk-repeat50/test/ruby/test_io.rb:3150 run> terminated with exception (report_on_exception is true): |
| /tmp/ruby/src/trunk-repeat50/tool/lib/envutil.rb:184:in 'IO#write': Broken pipe (Errno::EPIPE) |
| from /tmp/ruby/src/trunk-repeat50/tool/lib/envutil.rb:184:in 'EnvUtil.invoke_ruby' |
| from /tmp/ruby/src/trunk-repeat50/tool/lib/core_assertions.rb:103:in 'Test::Unit::CoreAssertions#assert_in_out_err' |
| from /tmp/ruby/src/trunk-repeat50/test/ruby/test_io.rb:3151:in 'block (2 levels) in TestIO#test_threaded_flush' |
| #<Thread:0x0000ffff7fef9e10 /tmp/ruby/src/trunk-repeat50/test/ruby/test_io.rb:3150 run> terminated with exception (report_on_exception is true): |
| /tmp/ruby/src/trunk-repeat50/tool/lib/envutil.rb:184:in 'IO#write': Broken pipe (Errno::EPIPE) |
| from /tmp/ruby/src/trunk-repeat50/tool/lib/envutil.rb:184:in 'EnvUtil.invoke_ruby' |
| from /tmp/ruby/src/trunk-repeat50/tool/lib/core_assertions.rb:103:in 'Test::Unit::CoreAssertions#assert_in_out_err' |
| from /tmp/ruby/src/trunk-repeat50/test/ruby/test_io.rb:3151:in 'block (2 levels) in TestIO#test_threaded_flush' |
| #<Thread:0x0000ffff7fef9d20 /tmp/ruby/src/trunk-repeat50/test/ruby/test_io.rb:3150 run> terminated with exception (report_on_exception is true): |
| /tmp/ruby/src/trunk-repeat50/tool/lib/envutil.rb:184:in 'IO#write': Broken pipe (Errno::EPIPE) |
| from /tmp/ruby/src/trunk-repeat50/tool/lib/envutil.rb:184:in 'EnvUtil.invoke_ruby' |
| from /tmp/ruby/src/trunk-repeat50/tool/lib/core_assertions.rb:103:in 'Test::Unit::CoreAssertions#assert_in_out_err' |
| from /tmp/ruby/src/trunk-repeat50/test/ruby/test_io.rb:3151:in 'block (2 levels) in TestIO#test_threaded_flush' |
| #<Thread:0x0000ffff7fef9c30 /tmp/ruby/src/trunk-repeat50/test/ruby/test_io.rb:3150 run> terminated with exception (report_on_exception is true): |
| /tmp/ruby/src/trunk-repeat50/tool/lib/envutil.rb:184:in 'IO#write': Broken pipe (Errno::EPIPE) |
| from /tmp/ruby/src/trunk-repeat50/tool/lib/envutil.rb:184:in 'EnvUtil.invoke_ruby' |
| from /tmp/ruby/src/trunk-repeat50/tool/lib/core_assertions.rb:103:in 'Test::Unit::CoreAssertions#assert_in_out_err' |
| from /tmp/ruby/src/trunk-repeat50/test/ruby/test_io.rb:3151:in 'block (2 levels) in TestIO#test_threaded_flush' |
| #<Thread:0x0000ffff7fef9b40 /tmp/ruby/src/trunk-repeat50/test/ruby/test_io.rb:3150 run> terminated with exception (report_on_exception is true): |
| /tmp/ruby/src/trunk-repeat50/tool/lib/envutil.rb:184:in 'IO#write': Broken pipe (Errno::EPIPE) |
| from /tmp/ruby/src/trunk-repeat50/tool/lib/envutil.rb:184:in 'EnvUtil.invoke_ruby' |
| from /tmp/ruby/src/trunk-repeat50/tool/lib/core_assertions.rb:103:in 'Test::Unit::CoreAssertions#assert_in_out_err' |
| from /tmp/ruby/src/trunk-repeat50/test/ruby/test_io.rb:3151:in 'block (2 levels) in TestIO#test_threaded_flush' |
| #<Thread:0x0000ffff7fef9a50 /tmp/ruby/src/trunk-repeat50/test/ruby/test_io.rb:3150 run> terminated with exception (report_on_exception is true): |
| /tmp/ruby/src/trunk-repeat50/tool/lib/envutil.rb:184:in 'IO#write': Broken pipe (Errno::EPIPE) |
| from /tmp/ruby/src/trunk-repeat50/tool/lib/envutil.rb:184:in 'EnvUtil.invoke_ruby' |
| from /tmp/ruby/src/trunk-repeat50/tool/lib/core_assertions.rb:103:in 'Test::Unit::CoreAssertions#assert_in_out_err' |
| from /tmp/ruby/src/trunk-repeat50/test/ruby/test_io.rb:3151:in 'block (2 levels) in TestIO#test_threaded_flush' |
| /tmp/ruby/build/trunk-repeat50/ruby: error while loading shared libraries: /tmp/ruby/build/trunk-repeat50/libruby.so.3.5: invalid ELF header |
| 1) Failure: |
| TestIO#test_cross_thread_close_stdio [/tmp/ruby/src/trunk-repeat50/test/ruby/test_io.rb:3411]: |
| assert_separately failed with error message |
| pid 44598 exit 127 |
| | /tmp/ruby/build/trunk-repeat50/ruby: error while loading shared libraries: /tmp/ruby/build/trunk-repeat50/libruby.so.3.5: file too short |
| 2) Failure: |
| TestIO#test_open_pipe [/tmp/ruby/src/trunk-repeat50/test/ruby/test_io.rb:2605]: |
| <"foo\n"> expected but was |
| <"">. |
| 3) Failure: |
| TestIO#test_closed_stream_in_rescue [/tmp/ruby/src/trunk-repeat50/test/ruby/test_io.rb:4203]: |
| assert_separately failed with error message |
| pid 44637 exit 127 |
| | /tmp/ruby/build/trunk-repeat50/ruby: error while loading shared libraries: /tmp/ruby/build/trunk-repeat50/libruby.so.3.5: file too short |
| 4) Failure: |
| TestIO#test_threaded_flush [/tmp/ruby/src/trunk-repeat50/tool/lib/zombie_hunter.rb:6]: |
| Expected [[44664, #<Process::Status: pid 44664 exit 127>], |
| [44665, #<Process::Status: pid 44665 exit 127>], |
| [44666, #<Process::Status: pid 44666 exit 127>], |
| [44667, #<Process::Status: pid 44667 exit 127>], |
| [44668, #<Process::Status: pid 44668 exit 127>], |
| [44669, #<Process::Status: pid 44669 exit 127>], |
| [44670, #<Process::Status: pid 44670 exit 127>], |
| [44671, #<Process::Status: pid 44671 exit 127>], |
| [44672, #<Process::Status: pid 44672 exit 127>], |
| [44673, #<Process::Status: pid 44673 exit 127>]] to be empty. |
| 5) Failure: |
| TestIO#test_reopen_stdio [/tmp/ruby/src/trunk-repeat50/test/ruby/test_io.rb:2694]: |
| <""> expected but was |
| <"hello">. |
| 6) Failure: |
| TestIO#test_print [/tmp/ruby/src/trunk-repeat50/test/ruby/test_io.rb:2919]: |
| pid 44710 exit 127 |
| | /tmp/ruby/build/trunk-repeat50/ruby: error while loading shared libraries: /tmp/ruby/build/trunk-repeat50/libruby.so.3.5: invalid ELF header |
| . |
| 1. [1/2] Assertion for "stdout" |
| | <["foo", "bar", "baz"]> expected but was |
| | <[]>. |
| 2. [2/2] Assertion for "stderr" |
| | <[]> expected but was |
| | <["/tmp/ruby/build/trunk-repeat50/ruby: error while loading shared libraries: /tmp/ruby/build/trunk-repeat50/libruby.so.3.5: invalid ELF header"]>. |
| 7) Failure: |
| TestIO#test_stdout_to_closed_pipe [/tmp/ruby/src/trunk-repeat50/test/ruby/test_io.rb:4367]: |
| <"ok\n"> expected but was |
| <nil>. |
| 8) Failure: |
| TestIO#test_reopen_ivar [/tmp/ruby/src/trunk-repeat50/test/ruby/test_io.rb:2827]: |
| pid 44716 exit 127 |
| | /tmp/ruby/build/trunk-repeat50/ruby: error while loading shared libraries: /tmp/ruby/build/trunk-repeat50/libruby.so.3.5: invalid ELF header |
| 9) Failure: |
| TestIO#test_write_buffered_with_multiple_arguments [/tmp/ruby/src/trunk-repeat50/test/ruby/test_io.rb:1463]: |
| Expected #<Process::Status: pid 44719 exit 127> to be success?. |
| 10) Error: |
| TestIO#test_threaded_flush: |
| Errno::EPIPE: Broken pipe |
| /tmp/ruby/src/trunk-repeat50/tool/lib/envutil.rb:184:in 'IO#write' |
| /tmp/ruby/src/trunk-repeat50/tool/lib/envutil.rb:184:in 'EnvUtil.invoke_ruby' |
| make: *** [uncommon.mk:953: yes-test-all] Error 10 |
| "make yes-test-rubyspec MSPECOPT='--error-output stderr -j' TESTS=--repeat-count=50" exit with 0. |