# Logfile created on 2025-03-12 09:48:17 +0000 by logger.rb/v1.5.3
#<BuildRuby:0x0000ffff9620fdc8 @REPOSITORY="https://github.com/ruby/ruby.git", @REPOSITORY_TYPE=:git, @git_branch=nil, @git_worktree=nil, @svn_revision=nil, @SRC_DIR="/tmp/ruby/src", @BUILD_DIR="/tmp/ruby/build", @INSTALL_DIR="/tmp/ruby/install", @TARGET_NAME="trunk-repeat50", @TARGET_SRC_DIR="/tmp/ruby/src/trunk-repeat50", @TARGET_BUILD_DIR="/tmp/ruby/build/trunk-repeat50", @TARGET_INSTALL_DIR="/tmp/ruby/install/trunk-repeat50", @configure_opts=["--enable-shared"], @build_opts="-j4", @btest_opts="-j4", @test_opts="TESTS=--repeat-count=50", @spec_opts="-j", @incremental=true, @steps=["checkout", "autoconf", "configure", "build_up", "build_miniruby", "build_ruby", "build_all", "build_install", "test_btest", "test_basic", "test_all", "test_rubyspec"], @quiet=false, @gist=false, @timeout=208000, @no_timeout_error=nil, @logfile="/home/ko1/ruby/logs/brlog.trunk-repeat50.20250312-094817", @ruby_env=[["RUBY_DEBUG", "ci"]], @make="make", @logger=#<Logger:0x0000ffff962304d8 @level=0, @progname=nil, @default_formatter=#<Logger::Formatter:0x0000ffff9a85fe40 @datetime_format=nil>, @formatter=nil, @logdev=#<Logger::LogDevice:0x0000ffff9611a1e8 @shift_period_suffix="%Y%m%d", @shift_size=1048576, @shift_age=0, @filename="/home/ko1/ruby/logs/brlog.trunk-repeat50.20250312-094817", @dev=#<File:/home/ko1/ruby/logs/brlog.trunk-repeat50.20250312-094817>, @binmode=false, @mon_data=#<Monitor:0x0000ffff9a85f9e0>, @mon_data_owner_object_id=880>>>
$$$[beg] make update-download -j4
tool/config.guess already exists
tool/config.sub already exists
Update irb to 6bb53630c3398b2042fb99d5232c68399491d338
Update reline to defcd36c0b6e6648333d4b9ab5923eb4e543615e
echo defcd36c0b6e6648333d4b9ab5923eb4e543615e | /bin/sh /tmp/ruby/src/trunk-repeat50/tool/ifchange /tmp/ruby/src/trunk-repeat50/.bundle/.timestamp/reline.revision -
echo 6bb53630c3398b2042fb99d5232c68399491d338 | /bin/sh /tmp/ruby/src/trunk-repeat50/tool/ifchange /tmp/ruby/src/trunk-repeat50/.bundle/.timestamp/irb.revision -
/tmp/ruby/src/trunk-repeat50/.bundle/.timestamp/reline.revision unchanged
/tmp/ruby/src/trunk-repeat50/.bundle/.timestamp/irb.revision unchanged
$$$[end] "make update-download -j4" exit with 0.
$$$[beg] make update-src      -j4
Already up to date.
Latest commit hash = 2782cc75a9
$$$[end] "make update-src      -j4" exit with 0.
$$$[beg] make after-update    -j4
Update irb to 6bb53630c3398b2042fb99d5232c68399491d338
Update reline to defcd36c0b6e6648333d4b9ab5923eb4e543615e
echo defcd36c0b6e6648333d4b9ab5923eb4e543615e | /bin/sh /tmp/ruby/src/trunk-repeat50/tool/ifchange /tmp/ruby/src/trunk-repeat50/.bundle/.timestamp/reline.revision -
echo 6bb53630c3398b2042fb99d5232c68399491d338 | /bin/sh /tmp/ruby/src/trunk-repeat50/tool/ifchange /tmp/ruby/src/trunk-repeat50/.bundle/.timestamp/irb.revision -
/tmp/ruby/src/trunk-repeat50/.bundle/.timestamp/reline.revision unchanged
/tmp/ruby/src/trunk-repeat50/.bundle/.timestamp/irb.revision unchanged
/tmp/ruby/src/trunk-repeat50/revision.h updated
generating aarch64-linux-fake.rb
aarch64-linux-fake.rb updated
generating enc.mk
making srcs under enc
make[1]: Entering directory '/tmp/ruby/build/trunk-repeat50'
make[1]: Nothing to be done for 'srcs'.
make[1]: Leaving directory '/tmp/ruby/build/trunk-repeat50'
$$$[end] "make after-update    -j4" exit with 0.
$$$[beg] make miniruby -j4
	BASERUBY = /usr/bin/ruby --disable=gems
	CC = gcc
	LD = ld
	LDSHARED = gcc -shared
	CFLAGS = -mbranch-protection=pac-ret -fstack-protector-strong -U_FORTIFY_SOURCE -D_FORTIFY_SOURCE=2  -O3 -fno-fast-math -ggdb3 -Wall -Wextra -Wdeprecated-declarations -Wdiv-by-zero -Wduplicated-cond -Wimplicit-function-declaration -Wimplicit-int -Wpointer-arith -Wwrite-strings -Wold-style-definition -Wimplicit-fallthrough=0 -Wmissing-noreturn -Wno-cast-function-type -Wno-constant-logical-operand -Wno-long-long -Wno-missing-field-initializers -Wno-overlength-strings -Wno-packed-bitfield-compat -Wno-parentheses-equality -Wno-self-assign -Wno-tautological-compare -Wno-unused-parameter -Wno-unused-value -Wsuggest-attribute=format -Wsuggest-attribute=noreturn -Wunused-variable -Wmisleading-indentation -Wundef   -fPIC 
	XCFLAGS = -fno-strict-overflow -fvisibility=hidden -fexcess-precision=standard -DRUBY_EXPORT -I. -I.ext/include/aarch64-linux -I/tmp/ruby/src/trunk-repeat50/include -I/tmp/ruby/src/trunk-repeat50 -I/tmp/ruby/src/trunk-repeat50/prism -I/tmp/ruby/src/trunk-repeat50/enc/unicode/15.0.0   -Dmodular_gc_dir=
	CPPFLAGS =   
	DLDFLAGS = -Wl,--compress-debug-sections=zlib -Wl,-soname,libruby.so.3.5  -fstack-protector-strong  
	SOLIBS = -lz -lrt -lrt -lgmp -ldl -lcrypt -lm -lpthread 
	LANG = C.UTF-8
	LC_ALL = 
	LC_CTYPE = 
	MFLAGS = -j4 --jobserver-auth=4,5
	RUSTC = rustc
	YJIT_RUSTC_ARGS = --crate-name=yjit --crate-type=staticlib --edition=2021 -g -C lto=thin -C opt-level=3 -C overflow-checks=on '--out-dir=/tmp/ruby/build/trunk-repeat50/yjit/target/release/' /tmp/ruby/src/trunk-repeat50/yjit/src/lib.rs
gcc (Ubuntu 13.3.0-6ubuntu2~24.04) 13.3.0
Copyright (C) 2023 Free Software Foundation, Inc.
This is free software; see the source for copying conditions.  There is NO
warranty; not even for MERCHANTABILITY or FITNESS FOR A PARTICULAR PURPOSE.

compiling /tmp/ruby/src/trunk-repeat50/version.c
linking miniruby
$$$[end] "make miniruby -j4" exit with 0.
$$$[beg] make ruby -j4
	BASERUBY = /usr/bin/ruby --disable=gems
	CC = gcc
	LD = ld
	LDSHARED = gcc -shared
	CFLAGS = -mbranch-protection=pac-ret -fstack-protector-strong -U_FORTIFY_SOURCE -D_FORTIFY_SOURCE=2  -O3 -fno-fast-math -ggdb3 -Wall -Wextra -Wdeprecated-declarations -Wdiv-by-zero -Wduplicated-cond -Wimplicit-function-declaration -Wimplicit-int -Wpointer-arith -Wwrite-strings -Wold-style-definition -Wimplicit-fallthrough=0 -Wmissing-noreturn -Wno-cast-function-type -Wno-constant-logical-operand -Wno-long-long -Wno-missing-field-initializers -Wno-overlength-strings -Wno-packed-bitfield-compat -Wno-parentheses-equality -Wno-self-assign -Wno-tautological-compare -Wno-unused-parameter -Wno-unused-value -Wsuggest-attribute=format -Wsuggest-attribute=noreturn -Wunused-variable -Wmisleading-indentation -Wundef   -fPIC 
	XCFLAGS = -fno-strict-overflow -fvisibility=hidden -fexcess-precision=standard -DRUBY_EXPORT -I. -I.ext/include/aarch64-linux -I/tmp/ruby/src/trunk-repeat50/include -I/tmp/ruby/src/trunk-repeat50 -I/tmp/ruby/src/trunk-repeat50/prism -I/tmp/ruby/src/trunk-repeat50/enc/unicode/15.0.0   -Dmodular_gc_dir=
	CPPFLAGS =   
	DLDFLAGS = -Wl,--compress-debug-sections=zlib -Wl,-soname,libruby.so.3.5  -fstack-protector-strong  
	SOLIBS = -lz -lrt -lrt -lgmp -ldl -lcrypt -lm -lpthread 
	LANG = C.UTF-8
	LC_ALL = 
	LC_CTYPE = 
	MFLAGS = -j4 --jobserver-auth=4,5
	RUSTC = rustc
	YJIT_RUSTC_ARGS = --crate-name=yjit --crate-type=staticlib --edition=2021 -g -C lto=thin -C opt-level=3 -C overflow-checks=on '--out-dir=/tmp/ruby/build/trunk-repeat50/yjit/target/release/' /tmp/ruby/src/trunk-repeat50/yjit/src/lib.rs
gcc (Ubuntu 13.3.0-6ubuntu2~24.04) 13.3.0
Copyright (C) 2023 Free Software Foundation, Inc.
This is free software; see the source for copying conditions.  There is NO
warranty; not even for MERCHANTABILITY or FITNESS FOR A PARTICULAR PURPOSE.

builtin_binary.inc updated
97bafa315238ac23ceaca69e88cad1e4e8ce47d05d17eb01a3c7e7dd6459d072  builtin_binary.inc
compiling /tmp/ruby/src/trunk-repeat50/builtin.c
linking static-library libruby-static.a
linking shared-library libruby.so.3.5.0
linking ruby
$$$[end] "make ruby -j4" exit with 0.
$$$[beg] make all -j4
	BASERUBY = /usr/bin/ruby --disable=gems
	CC = gcc
	LD = ld
	LDSHARED = gcc -shared
	CFLAGS = -mbranch-protection=pac-ret -fstack-protector-strong -U_FORTIFY_SOURCE -D_FORTIFY_SOURCE=2  -O3 -fno-fast-math -ggdb3 -Wall -Wextra -Wdeprecated-declarations -Wdiv-by-zero -Wduplicated-cond -Wimplicit-function-declaration -Wimplicit-int -Wpointer-arith -Wwrite-strings -Wold-style-definition -Wimplicit-fallthrough=0 -Wmissing-noreturn -Wno-cast-function-type -Wno-constant-logical-operand -Wno-long-long -Wno-missing-field-initializers -Wno-overlength-strings -Wno-packed-bitfield-compat -Wno-parentheses-equality -Wno-self-assign -Wno-tautological-compare -Wno-unused-parameter -Wno-unused-value -Wsuggest-attribute=format -Wsuggest-attribute=noreturn -Wunused-variable -Wmisleading-indentation -Wundef   -fPIC 
	XCFLAGS = -fno-strict-overflow -fvisibility=hidden -fexcess-precision=standard -DRUBY_EXPORT -I. -I.ext/include/aarch64-linux -I/tmp/ruby/src/trunk-repeat50/include -I/tmp/ruby/src/trunk-repeat50 -I/tmp/ruby/src/trunk-repeat50/prism -I/tmp/ruby/src/trunk-repeat50/enc/unicode/15.0.0   -Dmodular_gc_dir=
	CPPFLAGS =   
	DLDFLAGS = -Wl,--compress-debug-sections=zlib -Wl,-soname,libruby.so.3.5  -fstack-protector-strong  
	SOLIBS = -lz -lrt -lrt -lgmp -ldl -lcrypt -lm -lpthread 
	LANG = C.UTF-8
	LC_ALL = 
	LC_CTYPE = 
	MFLAGS = -j4 --jobserver-auth=4,5
	RUSTC = rustc
	YJIT_RUSTC_ARGS = --crate-name=yjit --crate-type=staticlib --edition=2021 -g -C lto=thin -C opt-level=3 -C overflow-checks=on '--out-dir=/tmp/ruby/build/trunk-repeat50/yjit/target/release/' /tmp/ruby/src/trunk-repeat50/yjit/src/lib.rs
gcc (Ubuntu 13.3.0-6ubuntu2~24.04) 13.3.0
Copyright (C) 2023 Free Software Foundation, Inc.
This is free software; see the source for copying conditions.  There is NO
warranty; not even for MERCHANTABILITY or FITNESS FOR A PARTICULAR PURPOSE.

generating enc.mk
building spec/ruby/optional/capi/ext/array_spec.so
building spec/ruby/optional/capi/ext/basic_object_spec.so
building spec/ruby/optional/capi/ext/bignum_spec.so
building spec/ruby/optional/capi/ext/binding_spec.so
building spec/ruby/optional/capi/ext/boolean_spec.so
building spec/ruby/optional/capi/ext/class_id_under_autoload_spec.so
building spec/ruby/optional/capi/ext/class_spec.so
building spec/ruby/optional/capi/ext/class_under_autoload_spec.so
building spec/ruby/optional/capi/ext/complex_spec.so
building spec/ruby/optional/capi/ext/constants_spec.so
building spec/ruby/optional/capi/ext/data_spec.so
building spec/ruby/optional/capi/ext/debug_spec.so
building spec/ruby/optional/capi/ext/encoding_spec.so
building spec/ruby/optional/capi/ext/enumerator_spec.so
building spec/ruby/optional/capi/ext/exception_spec.so
building spec/ruby/optional/capi/ext/fiber_spec.so
building spec/ruby/optional/capi/ext/file_spec.so
building spec/ruby/optional/capi/ext/finalizer_spec.so
building spec/ruby/optional/capi/ext/fixnum_spec.so
building spec/ruby/optional/capi/ext/float_spec.so
building spec/ruby/optional/capi/ext/gc_spec.so
building spec/ruby/optional/capi/ext/globals_spec.so
building spec/ruby/optional/capi/ext/hash_spec.so
building spec/ruby/optional/capi/ext/integer_spec.so
building spec/ruby/optional/capi/ext/io_spec.so
building spec/ruby/optional/capi/ext/kernel_spec.so
building spec/ruby/optional/capi/ext/language_spec.so
building spec/ruby/optional/capi/ext/marshal_spec.so
building spec/ruby/optional/capi/ext/module_spec.so
building spec/ruby/optional/capi/ext/module_under_autoload_spec.so
building spec/ruby/optional/capi/ext/mutex_spec.so
building spec/ruby/optional/capi/ext/numeric_spec.so
building spec/ruby/optional/capi/ext/object_spec.so
building spec/ruby/optional/capi/ext/proc_spec.so
building spec/ruby/optional/capi/ext/range_spec.so
building spec/ruby/optional/capi/ext/rational_spec.so
building spec/ruby/optional/capi/ext/rbasic_spec.so
building spec/ruby/optional/capi/ext/regexp_spec.so
building spec/ruby/optional/capi/ext/st_spec.so
building spec/ruby/optional/capi/ext/string_spec.so
building spec/ruby/optional/capi/ext/struct_spec.so
building spec/ruby/optional/capi/ext/symbol_spec.so
building spec/ruby/optional/capi/ext/thread_spec.so
building spec/ruby/optional/capi/ext/time_spec.so
building spec/ruby/optional/capi/ext/tracepoint_spec.so
building spec/ruby/optional/capi/ext/typed_data_spec.so
building spec/ruby/optional/capi/ext/util_spec.so
making enc
making srcs under enc
make[1]: Entering directory '/tmp/ruby/build/trunk-repeat50'
make[1]: Nothing to be done for 'enc'.
make[1]: Leaving directory '/tmp/ruby/build/trunk-repeat50'
make[1]: Entering directory '/tmp/ruby/build/trunk-repeat50'
make[1]: Nothing to be done for 'srcs'.
make[1]: Leaving directory '/tmp/ruby/build/trunk-repeat50'
generating transdb.h
transdb.h unchanged
generating makefiles ext/configure-ext.mk
making trans
ext/configure-ext.mk updated
make[1]: Entering directory '/tmp/ruby/build/trunk-repeat50'
make[1]: Entering directory '/tmp/ruby/build/trunk-repeat50'
make[1]: Nothing to be done for 'trans'.
make[1]: Leaving directory '/tmp/ruby/build/trunk-repeat50'
making encs
make[1]: Leaving directory '/tmp/ruby/build/trunk-repeat50'
generating makefile exts.mk
make[1]: Entering directory '/tmp/ruby/build/trunk-repeat50'
make[1]: Nothing to be done for 'encs'.
make[1]: Leaving directory '/tmp/ruby/build/trunk-repeat50'
exts.mk unchanged
make[1]: Entering directory '/tmp/ruby/build/trunk-repeat50'
make[2]: Entering directory '/tmp/ruby/build/trunk-repeat50/ext/coverage'
make[2]: Entering directory '/tmp/ruby/build/trunk-repeat50/ext/digest'
make[2]: Leaving directory '/tmp/ruby/build/trunk-repeat50/ext/coverage'
make[2]: Entering directory '/tmp/ruby/build/trunk-repeat50/ext/date'
make[2]: Leaving directory '/tmp/ruby/build/trunk-repeat50/ext/date'
make[2]: Leaving directory '/tmp/ruby/build/trunk-repeat50/ext/digest'
make[2]: Entering directory '/tmp/ruby/build/trunk-repeat50/ext/json'
make[2]: Entering directory '/tmp/ruby/build/trunk-repeat50/ext/io/console'
make[2]: Leaving directory '/tmp/ruby/build/trunk-repeat50/ext/io/console'
make[2]: Leaving directory '/tmp/ruby/build/trunk-repeat50/ext/json'
make[2]: Entering directory '/tmp/ruby/build/trunk-repeat50/ext/monitor'
make[2]: Entering directory '/tmp/ruby/build/trunk-repeat50/ext/objspace'
make[2]: Leaving directory '/tmp/ruby/build/trunk-repeat50/ext/monitor'
make[2]: Entering directory '/tmp/ruby/build/trunk-repeat50/ext/pathname'
make[2]: Leaving directory '/tmp/ruby/build/trunk-repeat50/ext/pathname'
make[2]: Leaving directory '/tmp/ruby/build/trunk-repeat50/ext/objspace'
make[2]: Entering directory '/tmp/ruby/build/trunk-repeat50/ext/psych'
make[2]: Entering directory '/tmp/ruby/build/trunk-repeat50/ext/pty'
make[2]: Leaving directory '/tmp/ruby/build/trunk-repeat50/ext/pty'
make[2]: Entering directory '/tmp/ruby/build/trunk-repeat50/ext/openssl'
make[2]: Entering directory '/tmp/ruby/build/trunk-repeat50/ext/rubyvm'
make[2]: Leaving directory '/tmp/ruby/build/trunk-repeat50/ext/rubyvm'
make[2]: Entering directory '/tmp/ruby/build/trunk-repeat50/ext/ripper'
make[2]: Leaving directory '/tmp/ruby/build/trunk-repeat50/ext/psych'
make[2]: Leaving directory '/tmp/ruby/build/trunk-repeat50/ext/ripper'
make[2]: Leaving directory '/tmp/ruby/build/trunk-repeat50/ext/openssl'
make[2]: Entering directory '/tmp/ruby/build/trunk-repeat50/ext/strscan'
make[2]: Entering directory '/tmp/ruby/build/trunk-repeat50/ext/socket'
make[2]: Entering directory '/tmp/ruby/build/trunk-repeat50/.bundle/gems/bigdecimal-3.1.9/ext/bigdecimal'
make[2]: Leaving directory '/tmp/ruby/build/trunk-repeat50/ext/strscan'
make[2]: Entering directory '/tmp/ruby/build/trunk-repeat50/.bundle/gems/debug-1.10.0/ext/debug'
make[2]: Entering directory '/tmp/ruby/build/trunk-repeat50/.bundle/gems/fiddle-1.1.6/ext/fiddle'
make[2]: Leaving directory '/tmp/ruby/build/trunk-repeat50/ext/socket'
make[2]: Entering directory '/tmp/ruby/build/trunk-repeat50/.bundle/gems/nkf-0.2.0/ext/nkf'
make[2]: Leaving directory '/tmp/ruby/build/trunk-repeat50/.bundle/gems/bigdecimal-3.1.9/ext/bigdecimal'
make[2]: Leaving directory '/tmp/ruby/build/trunk-repeat50/.bundle/gems/debug-1.10.0/ext/debug'
make[2]: Entering directory '/tmp/ruby/build/trunk-repeat50/.bundle/gems/racc-1.8.1/ext/racc/cparse'
make[2]: Leaving directory '/tmp/ruby/build/trunk-repeat50/.bundle/gems/fiddle-1.1.6/ext/fiddle'
make[2]: Entering directory '/tmp/ruby/build/trunk-repeat50/.bundle/gems/rbs-3.8.1/ext/rbs_extension'
make[2]: Entering directory '/tmp/ruby/build/trunk-repeat50/.bundle/gems/syslog-0.3.0/ext/syslog'
make[2]: Leaving directory '/tmp/ruby/build/trunk-repeat50/.bundle/gems/rbs-3.8.1/ext/rbs_extension'
make[2]: Leaving directory '/tmp/ruby/build/trunk-repeat50/.bundle/gems/nkf-0.2.0/ext/nkf'
make[2]: Leaving directory '/tmp/ruby/build/trunk-repeat50/.bundle/gems/racc-1.8.1/ext/racc/cparse'
make[2]: Entering directory '/tmp/ruby/build/trunk-repeat50/ext/digest/sha2'
make[2]: Leaving directory '/tmp/ruby/build/trunk-repeat50/.bundle/gems/syslog-0.3.0/ext/syslog'
make[2]: Leaving directory '/tmp/ruby/build/trunk-repeat50/ext/digest/sha2'
make[2]: Entering directory '/tmp/ruby/build/trunk-repeat50'
linking ruby
make[2]: Leaving directory '/tmp/ruby/build/trunk-repeat50'
make[1]: Leaving directory '/tmp/ruby/build/trunk-repeat50'
make[1]: Entering directory '/tmp/ruby/build/trunk-repeat50'
make[1]: Nothing to be done for 'note'.
make[1]: Leaving directory '/tmp/ruby/build/trunk-repeat50'
$$$[end] "make all -j4" exit with 0.
$$$[beg] make install -j4
Update irb to 6bb53630c3398b2042fb99d5232c68399491d338
Update reline to defcd36c0b6e6648333d4b9ab5923eb4e543615e
	BASERUBY = /usr/bin/ruby --disable=gems
	CC = gcc
	LD = ld
	LDSHARED = gcc -shared
	CFLAGS = -mbranch-protection=pac-ret -fstack-protector-strong -U_FORTIFY_SOURCE -D_FORTIFY_SOURCE=2  -O3 -fno-fast-math -ggdb3 -Wall -Wextra -Wdeprecated-declarations -Wdiv-by-zero -Wduplicated-cond -Wimplicit-function-declaration -Wimplicit-int -Wpointer-arith -Wwrite-strings -Wold-style-definition -Wimplicit-fallthrough=0 -Wmissing-noreturn -Wno-cast-function-type -Wno-constant-logical-operand -Wno-long-long -Wno-missing-field-initializers -Wno-overlength-strings -Wno-packed-bitfield-compat -Wno-parentheses-equality -Wno-self-assign -Wno-tautological-compare -Wno-unused-parameter -Wno-unused-value -Wsuggest-attribute=format -Wsuggest-attribute=noreturn -Wunused-variable -Wmisleading-indentation -Wundef   -fPIC 
	XCFLAGS = -fno-strict-overflow -fvisibility=hidden -fexcess-precision=standard -DRUBY_EXPORT -I. -I.ext/include/aarch64-linux -I/tmp/ruby/src/trunk-repeat50/include -I/tmp/ruby/src/trunk-repeat50 -I/tmp/ruby/src/trunk-repeat50/prism -I/tmp/ruby/src/trunk-repeat50/enc/unicode/15.0.0   -Dmodular_gc_dir=
	CPPFLAGS =   
	DLDFLAGS = -Wl,--compress-debug-sections=zlib -Wl,-soname,libruby.so.3.5  -fstack-protector-strong  
	SOLIBS = -lz -lrt -lrt -lgmp -ldl -lcrypt -lm -lpthread 
	LANG = C.UTF-8
	LC_ALL = 
	LC_CTYPE = 
	MFLAGS = -j4 --jobserver-auth=4,5
	RUSTC = rustc
	YJIT_RUSTC_ARGS = --crate-name=yjit --crate-type=staticlib --edition=2021 -g -C lto=thin -C opt-level=3 -C overflow-checks=on '--out-dir=/tmp/ruby/build/trunk-repeat50/yjit/target/release/' /tmp/ruby/src/trunk-repeat50/yjit/src/lib.rs
echo 6bb53630c3398b2042fb99d5232c68399491d338 | /bin/sh /tmp/ruby/src/trunk-repeat50/tool/ifchange /tmp/ruby/src/trunk-repeat50/.bundle/.timestamp/irb.revision -
echo defcd36c0b6e6648333d4b9ab5923eb4e543615e | /bin/sh /tmp/ruby/src/trunk-repeat50/tool/ifchange /tmp/ruby/src/trunk-repeat50/.bundle/.timestamp/reline.revision -
generating enc.mk
gcc (Ubuntu 13.3.0-6ubuntu2~24.04) 13.3.0
Copyright (C) 2023 Free Software Foundation, Inc.
This is free software; see the source for copying conditions.  There is NO
warranty; not even for MERCHANTABILITY or FITNESS FOR A PARTICULAR PURPOSE.

/tmp/ruby/src/trunk-repeat50/.bundle/.timestamp/irb.revision unchanged
/tmp/ruby/src/trunk-repeat50/.bundle/.timestamp/reline.revision unchanged
making srcs under enc
making enc
make[1]: Entering directory '/tmp/ruby/build/trunk-repeat50'
make[1]: Nothing to be done for 'enc'.
make[1]: Leaving directory '/tmp/ruby/build/trunk-repeat50'
make[1]: Entering directory '/tmp/ruby/build/trunk-repeat50'
make[1]: Nothing to be done for 'srcs'.
make[1]: Leaving directory '/tmp/ruby/build/trunk-repeat50'
generating transdb.h
transdb.h unchanged
generating makefiles ext/configure-ext.mk
making trans
ext/configure-ext.mk unchanged
make[1]: Entering directory '/tmp/ruby/build/trunk-repeat50'
make[1]: Entering directory '/tmp/ruby/build/trunk-repeat50'
make[1]: Nothing to be done for 'trans'.
make[1]: Leaving directory '/tmp/ruby/build/trunk-repeat50'
making encs
make[1]: Entering directory '/tmp/ruby/build/trunk-repeat50'
make[1]: Nothing to be done for 'encs'.
make[1]: Leaving directory '/tmp/ruby/build/trunk-repeat50'
make[1]: Leaving directory '/tmp/ruby/build/trunk-repeat50'
generating makefile exts.mk
exts.mk unchanged
make[1]: Entering directory '/tmp/ruby/build/trunk-repeat50'
make[2]: Entering directory '/tmp/ruby/build/trunk-repeat50/ext/coverage'
make[2]: Entering directory '/tmp/ruby/build/trunk-repeat50/ext/digest'
make[2]: Leaving directory '/tmp/ruby/build/trunk-repeat50/ext/coverage'
make[2]: Entering directory '/tmp/ruby/build/trunk-repeat50/ext/date'
make[2]: Leaving directory '/tmp/ruby/build/trunk-repeat50/ext/date'
make[2]: Leaving directory '/tmp/ruby/build/trunk-repeat50/ext/digest'
make[2]: Entering directory '/tmp/ruby/build/trunk-repeat50/ext/json'
make[2]: Entering directory '/tmp/ruby/build/trunk-repeat50/ext/io/console'
make[2]: Leaving directory '/tmp/ruby/build/trunk-repeat50/ext/io/console'
make[2]: Entering directory '/tmp/ruby/build/trunk-repeat50/ext/monitor'
make[2]: Leaving directory '/tmp/ruby/build/trunk-repeat50/ext/json'
make[2]: Entering directory '/tmp/ruby/build/trunk-repeat50/ext/objspace'
make[2]: Leaving directory '/tmp/ruby/build/trunk-repeat50/ext/monitor'
make[2]: Entering directory '/tmp/ruby/build/trunk-repeat50/ext/pathname'
make[2]: Leaving directory '/tmp/ruby/build/trunk-repeat50/ext/objspace'
make[2]: Leaving directory '/tmp/ruby/build/trunk-repeat50/ext/pathname'
make[2]: Entering directory '/tmp/ruby/build/trunk-repeat50/ext/psych'
make[2]: Entering directory '/tmp/ruby/build/trunk-repeat50/ext/pty'
make[2]: Leaving directory '/tmp/ruby/build/trunk-repeat50/ext/pty'
make[2]: Entering directory '/tmp/ruby/build/trunk-repeat50/ext/openssl'
make[2]: Entering directory '/tmp/ruby/build/trunk-repeat50/ext/rubyvm'
make[2]: Leaving directory '/tmp/ruby/build/trunk-repeat50/ext/rubyvm'
make[2]: Leaving directory '/tmp/ruby/build/trunk-repeat50/ext/psych'
make[2]: Entering directory '/tmp/ruby/build/trunk-repeat50/ext/ripper'
make[2]: Leaving directory '/tmp/ruby/build/trunk-repeat50/ext/ripper'
make[2]: Entering directory '/tmp/ruby/build/trunk-repeat50/ext/socket'
make[2]: Entering directory '/tmp/ruby/build/trunk-repeat50/ext/strscan'
make[2]: Leaving directory '/tmp/ruby/build/trunk-repeat50/ext/openssl'
make[2]: Entering directory '/tmp/ruby/build/trunk-repeat50/.bundle/gems/bigdecimal-3.1.9/ext/bigdecimal'
make[2]: Leaving directory '/tmp/ruby/build/trunk-repeat50/ext/strscan'
make[2]: Entering directory '/tmp/ruby/build/trunk-repeat50/.bundle/gems/debug-1.10.0/ext/debug'
make[2]: Entering directory '/tmp/ruby/build/trunk-repeat50/.bundle/gems/fiddle-1.1.6/ext/fiddle'
make[2]: Leaving directory '/tmp/ruby/build/trunk-repeat50/ext/socket'
make[2]: Entering directory '/tmp/ruby/build/trunk-repeat50/.bundle/gems/nkf-0.2.0/ext/nkf'
make[2]: Leaving directory '/tmp/ruby/build/trunk-repeat50/.bundle/gems/bigdecimal-3.1.9/ext/bigdecimal'
make[2]: Leaving directory '/tmp/ruby/build/trunk-repeat50/.bundle/gems/debug-1.10.0/ext/debug'
make[2]: Leaving directory '/tmp/ruby/build/trunk-repeat50/.bundle/gems/fiddle-1.1.6/ext/fiddle'
make[2]: Entering directory '/tmp/ruby/build/trunk-repeat50/.bundle/gems/racc-1.8.1/ext/racc/cparse'
make[2]: Entering directory '/tmp/ruby/build/trunk-repeat50/.bundle/gems/rbs-3.8.1/ext/rbs_extension'
make[2]: Entering directory '/tmp/ruby/build/trunk-repeat50/.bundle/gems/syslog-0.3.0/ext/syslog'
make[2]: Leaving directory '/tmp/ruby/build/trunk-repeat50/.bundle/gems/rbs-3.8.1/ext/rbs_extension'
make[2]: Leaving directory '/tmp/ruby/build/trunk-repeat50/.bundle/gems/nkf-0.2.0/ext/nkf'
make[2]: Leaving directory '/tmp/ruby/build/trunk-repeat50/.bundle/gems/racc-1.8.1/ext/racc/cparse'
make[2]: Leaving directory '/tmp/ruby/build/trunk-repeat50/.bundle/gems/syslog-0.3.0/ext/syslog'
make[2]: Entering directory '/tmp/ruby/build/trunk-repeat50/ext/digest/sha2'
make[2]: Leaving directory '/tmp/ruby/build/trunk-repeat50/ext/digest/sha2'
make[2]: Entering directory '/tmp/ruby/build/trunk-repeat50'
make[2]: 'ruby' is up to date.
make[2]: Leaving directory '/tmp/ruby/build/trunk-repeat50'
make[1]: Leaving directory '/tmp/ruby/build/trunk-repeat50'
make[1]: Entering directory '/tmp/ruby/build/trunk-repeat50'
make[1]: Nothing to be done for 'note'.
make[1]: Leaving directory '/tmp/ruby/build/trunk-repeat50'
./miniruby -I/tmp/ruby/src/trunk-repeat50/lib -I. -I.ext/common  /tmp/ruby/src/trunk-repeat50/tool/runruby.rb --extout=.ext  -- --disable-gems -r./aarch64-linux-fake /tmp/ruby/src/trunk-repeat50/tool/rbinstall.rb --make="make" --dest-dir="" --extout=".ext" --ext-build-dir="./ext" --mflags="-j4 --jobserver-auth=4,5" --make-flags=" -j4 --jobserver-auth=4,5" --data-mode=0644 --prog-mode=0755 --installed-list .installed.list --mantype="man"  --gnumake --install=all --exclude=doc
installing binary commands:         /tmp/ruby/install/trunk-repeat50/bin
installing base libraries:          /tmp/ruby/install/trunk-repeat50/lib
installing arch files:              /tmp/ruby/install/trunk-repeat50/lib/ruby/3.5.0+0/aarch64-linux
installing pkgconfig data:          /tmp/ruby/install/trunk-repeat50/lib/pkgconfig
installing extension objects:       /tmp/ruby/install/trunk-repeat50/lib/ruby/3.5.0+0/aarch64-linux
installing extension objects:       /tmp/ruby/install/trunk-repeat50/lib/ruby/site_ruby/3.5.0+0/aarch64-linux
installing extension objects:       /tmp/ruby/install/trunk-repeat50/lib/ruby/vendor_ruby/3.5.0+0/aarch64-linux
installing extension headers:       /tmp/ruby/install/trunk-repeat50/include/ruby-3.5.0+0/aarch64-linux
installing extension scripts:       /tmp/ruby/install/trunk-repeat50/lib/ruby/3.5.0+0
installing extension scripts:       /tmp/ruby/install/trunk-repeat50/lib/ruby/site_ruby/3.5.0+0
installing extension scripts:       /tmp/ruby/install/trunk-repeat50/lib/ruby/vendor_ruby/3.5.0+0
installing extension headers:       /tmp/ruby/install/trunk-repeat50/include/ruby-3.5.0+0/ruby
installing command scripts:         /tmp/ruby/install/trunk-repeat50/bin
installing library scripts:         /tmp/ruby/install/trunk-repeat50/lib/ruby/3.5.0+0
installing common headers:          /tmp/ruby/install/trunk-repeat50/include/ruby-3.5.0+0
installing manpages:                /tmp/ruby/install/trunk-repeat50/share/man/man1
installing default gems from lib:   /tmp/ruby/install/trunk-repeat50/lib/ruby/gems/3.5.0+0
                                    bundler 2.7.0.dev
                                    cgi 0.4.2
                                    delegate 0.4.0
                                    did_you_mean 2.0.0
                                    english 0.8.0
                                    erb 4.0.4
                                    error_highlight 0.7.0
                                    fileutils 1.7.3
                                    find 0.2.0
                                    forwardable 1.3.3
                                    ipaddr 1.2.7
                                    net-http 0.6.0
                                    net-protocol 0.2.2
                                    open-uri 0.5.0
                                    open3 0.2.1
                                    optparse 0.7.0.dev.1
                                    pp 0.6.2
                                    prettyprint 0.2.0
                                    prism 1.3.0
                                    resolv 0.6.0
                                    ruby2_keywords 0.0.5
                                    securerandom 0.4.1
                                    set 1.1.1
                                    shellwords 0.2.2
                                    singleton 0.3.0
                                    syntax_suggest 2.0.2
                                    tempfile 0.3.1
                                    time 0.4.1
                                    timeout 0.4.3
                                    tmpdir 0.3.1
                                    tsort 0.2.0
                                    un 0.3.0
                                    uri 1.0.3
                                    weakref 0.1.3
                                    yaml 0.4.0
installing default gems from ext:   /tmp/ruby/install/trunk-repeat50/lib/ruby/gems/3.5.0+0
                                    date 3.4.1
                                    digest 3.2.0
                                    etc 1.4.5
                                    fcntl 1.2.0
                                    io-console 0.8.0
                                    io-nonblock 0.3.1
                                    io-wait 0.3.1
                                    json 2.10.1
                                    openssl 3.3.0
                                    pathname 0.4.0
                                    psych 5.2.3
                                    stringio 3.1.6.dev
                                    strscan 3.1.2
                                    zlib 3.2.1
installing bundled gems:            /tmp/ruby/install/trunk-repeat50/lib/ruby/gems/3.5.0+0
                                    minitest 5.25.4
                                    power_assert 2.0.5
                                    rake 13.2.1
                                    test-unit 3.6.7
                                    rexml 3.4.1
                                    rss 0.3.1
                                    net-ftp 0.3.8
                                    net-imap 0.5.6
                                    net-pop 0.1.2
                                    net-smtp 0.5.1
                                    matrix 0.4.2
                                    prime 0.1.3
                                    rbs 3.8.1
                                    typeprof 0.30.1
                                    debug 1.10.0
                                    racc 1.8.1
                                    mutex_m 0.3.0
                                    getoptlong 0.2.1
                                    base64 0.2.0
                                    bigdecimal 3.1.9
                                    observer 0.1.2
                                    abbrev 0.1.2
                                    resolv-replace 0.1.1
                                    rinda 0.2.0
                                    drb 2.2.1
                                    nkf 0.2.0
                                    syslog 0.3.0
                                    csv 3.3.2
                                    repl_type_completor 0.1.10
                                    ostruct 0.6.1
                                    pstore 0.2.0
                                    benchmark 0.4.0
                                    logger 1.6.6
                                    rdoc 6.12.0
                                    irb 1.15.1
                                    reline 0.6.0
                                    readline 0.0.4
                                    fiddle 1.1.6
installing bundled gem cache:       /tmp/ruby/install/trunk-repeat50/lib/ruby/gems/3.5.0+0/cache
skipped bundled gems:
    win32ole-1.9.1.gem              not found in bundled_gems
$$$[end] "make install -j4" exit with 0.
$$$[beg] make yes-btest TESTOPTS='-q -j4'
PASS all 2000 tests
 
$$$[end] "make yes-btest TESTOPTS='-q -j4'" exit with 0.
$$$[beg] make yes-test-basic TESTS=--repeat-count=50
	BASERUBY = /usr/bin/ruby --disable=gems
	CC = gcc
	LD = ld
	LDSHARED = gcc -shared
	CFLAGS = -mbranch-protection=pac-ret -fstack-protector-strong -U_FORTIFY_SOURCE -D_FORTIFY_SOURCE=2  -O3 -fno-fast-math -ggdb3 -Wall -Wextra -Wdeprecated-declarations -Wdiv-by-zero -Wduplicated-cond -Wimplicit-function-declaration -Wimplicit-int -Wpointer-arith -Wwrite-strings -Wold-style-definition -Wimplicit-fallthrough=0 -Wmissing-noreturn -Wno-cast-function-type -Wno-constant-logical-operand -Wno-long-long -Wno-missing-field-initializers -Wno-overlength-strings -Wno-packed-bitfield-compat -Wno-parentheses-equality -Wno-self-assign -Wno-tautological-compare -Wno-unused-parameter -Wno-unused-value -Wsuggest-attribute=format -Wsuggest-attribute=noreturn -Wunused-variable -Wmisleading-indentation -Wundef   -fPIC 
	XCFLAGS = -fno-strict-overflow -fvisibility=hidden -fexcess-precision=standard -DRUBY_EXPORT -I. -I.ext/include/aarch64-linux -I/tmp/ruby/src/trunk-repeat50/include -I/tmp/ruby/src/trunk-repeat50 -I/tmp/ruby/src/trunk-repeat50/prism -I/tmp/ruby/src/trunk-repeat50/enc/unicode/15.0.0   -Dmodular_gc_dir=
	CPPFLAGS =   
	DLDFLAGS = -Wl,--compress-debug-sections=zlib -Wl,-soname,libruby.so.3.5  -fstack-protector-strong  
	SOLIBS = -lz -lrt -lrt -lgmp -ldl -lcrypt -lm -lpthread 
	LANG = C.UTF-8
	LC_ALL = 
	LC_CTYPE = 
	MFLAGS = 
	RUSTC = rustc
	YJIT_RUSTC_ARGS = --crate-name=yjit --crate-type=staticlib --edition=2021 -g -C lto=thin -C opt-level=3 -C overflow-checks=on '--out-dir=/tmp/ruby/build/trunk-repeat50/yjit/target/release/' /tmp/ruby/src/trunk-repeat50/yjit/src/lib.rs
gcc (Ubuntu 13.3.0-6ubuntu2~24.04) 13.3.0
Copyright (C) 2023 Free Software Foundation, Inc.
This is free software; see the source for copying conditions.  There is NO
warranty; not even for MERCHANTABILITY or FITNESS FOR A PARTICULAR PURPOSE.

Checking leaked global symbols...none
/tmp/ruby/src/trunk-repeat50/basictest/test.rb:assignment ....................................................................................................................................................................................................................................................................................................................................................................................OK 372
/tmp/ruby/src/trunk-repeat50/basictest/test.rb:condition ..OK 2
/tmp/ruby/src/trunk-repeat50/basictest/test.rb:if/unless ...OK 3
/tmp/ruby/src/trunk-repeat50/basictest/test.rb:case .....OK 5
/tmp/ruby/src/trunk-repeat50/basictest/test.rb:while/until ........OK 8
/tmp/ruby/src/trunk-repeat50/basictest/test.rb:exception ..........OK 10
/tmp/ruby/src/trunk-repeat50/basictest/test.rb:array .......................................OK 39
/tmp/ruby/src/trunk-repeat50/basictest/test.rb:hash ...........................OK 27
/tmp/ruby/src/trunk-repeat50/basictest/test.rb:iterator ...........................................................................................................OK 107
/tmp/ruby/src/trunk-repeat50/basictest/test.rb:float ................................................................................OK 80
/tmp/ruby/src/trunk-repeat50/basictest/test.rb:bignum ...............................OK 31
/tmp/ruby/src/trunk-repeat50/basictest/test.rb:string & char ..............................................................OK 62
/tmp/ruby/src/trunk-repeat50/basictest/test.rb:assignment ..........OK 10
/tmp/ruby/src/trunk-repeat50/basictest/test.rb:call ......OK 6
/tmp/ruby/src/trunk-repeat50/basictest/test.rb:proc .........OK 9
/tmp/ruby/src/trunk-repeat50/basictest/test.rb:signal ..OK 2
/tmp/ruby/src/trunk-repeat50/basictest/test.rb:eval ...........................OK 27
/tmp/ruby/src/trunk-repeat50/basictest/test.rb:system ........OK 8
/tmp/ruby/src/trunk-repeat50/basictest/test.rb:const .....OK 5
/tmp/ruby/src/trunk-repeat50/basictest/test.rb:clone .....OK 5
/tmp/ruby/src/trunk-repeat50/basictest/test.rb:marshal ....OK 4
/tmp/ruby/src/trunk-repeat50/basictest/test.rb:pack ....OK 4
/tmp/ruby/src/trunk-repeat50/basictest/test.rb:math ..OK 2
/tmp/ruby/src/trunk-repeat50/basictest/test.rb:struct ......OK 6
/tmp/ruby/src/trunk-repeat50/basictest/test.rb:variable ............OK 12
/tmp/ruby/src/trunk-repeat50/basictest/test.rb:trace ...OK 3
/tmp/ruby/src/trunk-repeat50/basictest/test.rb:defined? ............OK 12
/tmp/ruby/src/trunk-repeat50/basictest/test.rb:alias ......OK 6
/tmp/ruby/src/trunk-repeat50/basictest/test.rb:path .......................OK 23
/tmp/ruby/src/trunk-repeat50/basictest/test.rb:gc ....OK 4

test succeeded
$$$[end] "make yes-test-basic TESTS=--repeat-count=50" exit with 0.
$$$[beg] make yes-test-all TESTOPTS='--stderr-on-failure' TESTS=--repeat-count=50
	BASERUBY = /usr/bin/ruby --disable=gems
	CC = gcc
	LD = ld
	LDSHARED = gcc -shared
	CFLAGS = -mbranch-protection=pac-ret -fstack-protector-strong -U_FORTIFY_SOURCE -D_FORTIFY_SOURCE=2  -O3 -fno-fast-math -ggdb3 -Wall -Wextra -Wdeprecated-declarations -Wdiv-by-zero -Wduplicated-cond -Wimplicit-function-declaration -Wimplicit-int -Wpointer-arith -Wwrite-strings -Wold-style-definition -Wimplicit-fallthrough=0 -Wmissing-noreturn -Wno-cast-function-type -Wno-constant-logical-operand -Wno-long-long -Wno-missing-field-initializers -Wno-overlength-strings -Wno-packed-bitfield-compat -Wno-parentheses-equality -Wno-self-assign -Wno-tautological-compare -Wno-unused-parameter -Wno-unused-value -Wsuggest-attribute=format -Wsuggest-attribute=noreturn -Wunused-variable -Wmisleading-indentation -Wundef   -fPIC 
	XCFLAGS = -fno-strict-overflow -fvisibility=hidden -fexcess-precision=standard -DRUBY_EXPORT -I. -I.ext/include/aarch64-linux -I/tmp/ruby/src/trunk-repeat50/include -I/tmp/ruby/src/trunk-repeat50 -I/tmp/ruby/src/trunk-repeat50/prism -I/tmp/ruby/src/trunk-repeat50/enc/unicode/15.0.0   -Dmodular_gc_dir=
	CPPFLAGS =   
	DLDFLAGS = -Wl,--compress-debug-sections=zlib -Wl,-soname,libruby.so.3.5  -fstack-protector-strong  
	SOLIBS = -lz -lrt -lrt -lgmp -ldl -lcrypt -lm -lpthread 
	LANG = C.UTF-8
	LC_ALL = 
	LC_CTYPE = 
	MFLAGS = 
	RUSTC = rustc
	YJIT_RUSTC_ARGS = --crate-name=yjit --crate-type=staticlib --edition=2021 -g -C lto=thin -C opt-level=3 -C overflow-checks=on '--out-dir=/tmp/ruby/build/trunk-repeat50/yjit/target/release/' /tmp/ruby/src/trunk-repeat50/yjit/src/lib.rs
gcc (Ubuntu 13.3.0-6ubuntu2~24.04) 13.3.0
Copyright (C) 2023 Free Software Foundation, Inc.
This is free software; see the source for copying conditions.  There is NO
warranty; not even for MERCHANTABILITY or FITNESS FOR A PARTICULAR PURPOSE.

generating enc.mk
making enc
make[1]: Entering directory '/tmp/ruby/build/trunk-repeat50'
make[1]: Nothing to be done for 'enc'.
make[1]: Leaving directory '/tmp/ruby/build/trunk-repeat50'
making srcs under enc
make[1]: Entering directory '/tmp/ruby/build/trunk-repeat50'
make[1]: Nothing to be done for 'srcs'.
make[1]: Leaving directory '/tmp/ruby/build/trunk-repeat50'
generating transdb.h
transdb.h unchanged
making trans
make[1]: Entering directory '/tmp/ruby/build/trunk-repeat50'
make[1]: Nothing to be done for 'trans'.
make[1]: Leaving directory '/tmp/ruby/build/trunk-repeat50'
making encs
make[1]: Entering directory '/tmp/ruby/build/trunk-repeat50'
make[1]: Nothing to be done for 'encs'.
make[1]: Leaving directory '/tmp/ruby/build/trunk-repeat50'
generating makefiles ext/configure-ext.mk
ext/configure-ext.mk updated
make[1]: Entering directory '/tmp/ruby/build/trunk-repeat50'
make[1]: Leaving directory '/tmp/ruby/build/trunk-repeat50'
generating makefile exts.mk
exts.mk unchanged
make[1]: Entering directory '/tmp/ruby/build/trunk-repeat50'
make[2]: Entering directory '/tmp/ruby/build/trunk-repeat50/ext/coverage'
make[2]: Leaving directory '/tmp/ruby/build/trunk-repeat50/ext/coverage'
make[2]: Entering directory '/tmp/ruby/build/trunk-repeat50/ext/date'
make[2]: Leaving directory '/tmp/ruby/build/trunk-repeat50/ext/date'
make[2]: Entering directory '/tmp/ruby/build/trunk-repeat50/ext/digest'
make[2]: Leaving directory '/tmp/ruby/build/trunk-repeat50/ext/digest'
make[2]: Entering directory '/tmp/ruby/build/trunk-repeat50/ext/digest/sha2'
make[2]: Leaving directory '/tmp/ruby/build/trunk-repeat50/ext/digest/sha2'
make[2]: Entering directory '/tmp/ruby/build/trunk-repeat50/ext/io/console'
make[2]: Leaving directory '/tmp/ruby/build/trunk-repeat50/ext/io/console'
make[2]: Entering directory '/tmp/ruby/build/trunk-repeat50/ext/json'
make[2]: Leaving directory '/tmp/ruby/build/trunk-repeat50/ext/json'
make[2]: Entering directory '/tmp/ruby/build/trunk-repeat50/ext/monitor'
make[2]: Leaving directory '/tmp/ruby/build/trunk-repeat50/ext/monitor'
make[2]: Entering directory '/tmp/ruby/build/trunk-repeat50/ext/objspace'
make[2]: Leaving directory '/tmp/ruby/build/trunk-repeat50/ext/objspace'
make[2]: Entering directory '/tmp/ruby/build/trunk-repeat50/ext/openssl'
make[2]: Leaving directory '/tmp/ruby/build/trunk-repeat50/ext/openssl'
make[2]: Entering directory '/tmp/ruby/build/trunk-repeat50/ext/pathname'
make[2]: Leaving directory '/tmp/ruby/build/trunk-repeat50/ext/pathname'
make[2]: Entering directory '/tmp/ruby/build/trunk-repeat50/ext/psych'
make[2]: Leaving directory '/tmp/ruby/build/trunk-repeat50/ext/psych'
make[2]: Entering directory '/tmp/ruby/build/trunk-repeat50/ext/pty'
make[2]: Leaving directory '/tmp/ruby/build/trunk-repeat50/ext/pty'
make[2]: Entering directory '/tmp/ruby/build/trunk-repeat50/ext/ripper'
make[2]: Leaving directory '/tmp/ruby/build/trunk-repeat50/ext/ripper'
make[2]: Entering directory '/tmp/ruby/build/trunk-repeat50/ext/rubyvm'
make[2]: Leaving directory '/tmp/ruby/build/trunk-repeat50/ext/rubyvm'
make[2]: Entering directory '/tmp/ruby/build/trunk-repeat50/ext/socket'
make[2]: Leaving directory '/tmp/ruby/build/trunk-repeat50/ext/socket'
make[2]: Entering directory '/tmp/ruby/build/trunk-repeat50/ext/strscan'
make[2]: Leaving directory '/tmp/ruby/build/trunk-repeat50/ext/strscan'
make[2]: Entering directory '/tmp/ruby/build/trunk-repeat50/.bundle/gems/bigdecimal-3.1.9/ext/bigdecimal'
make[2]: Leaving directory '/tmp/ruby/build/trunk-repeat50/.bundle/gems/bigdecimal-3.1.9/ext/bigdecimal'
make[2]: Entering directory '/tmp/ruby/build/trunk-repeat50/.bundle/gems/debug-1.10.0/ext/debug'
make[2]: Leaving directory '/tmp/ruby/build/trunk-repeat50/.bundle/gems/debug-1.10.0/ext/debug'
make[2]: Entering directory '/tmp/ruby/build/trunk-repeat50/.bundle/gems/fiddle-1.1.6/ext/fiddle'
make[2]: Leaving directory '/tmp/ruby/build/trunk-repeat50/.bundle/gems/fiddle-1.1.6/ext/fiddle'
make[2]: Entering directory '/tmp/ruby/build/trunk-repeat50/.bundle/gems/nkf-0.2.0/ext/nkf'
make[2]: Leaving directory '/tmp/ruby/build/trunk-repeat50/.bundle/gems/nkf-0.2.0/ext/nkf'
make[2]: Entering directory '/tmp/ruby/build/trunk-repeat50/.bundle/gems/racc-1.8.1/ext/racc/cparse'
make[2]: Leaving directory '/tmp/ruby/build/trunk-repeat50/.bundle/gems/racc-1.8.1/ext/racc/cparse'
make[2]: Entering directory '/tmp/ruby/build/trunk-repeat50/.bundle/gems/rbs-3.8.1/ext/rbs_extension'
make[2]: Leaving directory '/tmp/ruby/build/trunk-repeat50/.bundle/gems/rbs-3.8.1/ext/rbs_extension'
make[2]: Entering directory '/tmp/ruby/build/trunk-repeat50/.bundle/gems/syslog-0.3.0/ext/syslog'
make[2]: Leaving directory '/tmp/ruby/build/trunk-repeat50/.bundle/gems/syslog-0.3.0/ext/syslog'
make[2]: Entering directory '/tmp/ruby/build/trunk-repeat50'
make[2]: 'ruby' is up to date.
make[2]: Leaving directory '/tmp/ruby/build/trunk-repeat50'
make[1]: Leaving directory '/tmp/ruby/build/trunk-repeat50'
make[1]: Entering directory '/tmp/ruby/build/trunk-repeat50'
make[1]: Nothing to be done for 'note'.
make[1]: Leaving directory '/tmp/ruby/build/trunk-repeat50'
Run options: 
  --seed=24608
  "--ruby=./miniruby -I/tmp/ruby/src/trunk-repeat50/lib -I. -I.ext/common  /tmp/ruby/src/trunk-repeat50/tool/runruby.rb --extout=.ext  -- --disable-gems"
  --excludes-dir=/tmp/ruby/src/trunk-repeat50/test/.excludes
  --name=!/memory_leak/
  --stderr-on-failure
  --repeat-count=50

# Running tests:

Leaked file descriptor: TestOpenURISSL#test_bad_ssl_version: 8 #<File::Stat dev=0x8, ino=4278315, mode=0140777, nlink=1, uid=1001, gid=1000, rdev=0x0, size=0, blksize=4096, blocks=0, atime=1970-01-01 00:00:00 +0000, mtime=1970-01-01 00:00:00 +0000, ctime=1970-01-01 00:00:00 +0000>
Leaked file descriptor: TestNetHTTP_v1_2_chunked#test_post: 9 #<File::Stat dev=0x8, ino=4288019, mode=0140777, nlink=1, uid=1001, gid=1000, rdev=0x0, size=0, blksize=4096, blocks=0, atime=1970-01-01 00:00:00 +0000, mtime=1970-01-01 00:00:00 +0000, ctime=1970-01-01 00:00:00 +0000>
/tmp/ruby/build/trunk-repeat50/ruby: error while loading shared libraries: /tmp/ruby/build/trunk-repeat50/libruby.so.3.5: file too short
/tmp/ruby/build/trunk-repeat50/ruby: error while loading shared libraries: /tmp/ruby/build/trunk-repeat50/libruby.so.3.5: file too short
#<Thread:0x0000ffff7fefa360 /tmp/ruby/src/trunk-repeat50/test/ruby/test_io.rb:3150 run> terminated with exception (report_on_exception is true):
/tmp/ruby/src/trunk-repeat50/tool/lib/envutil.rb:184:in 'IO#write': Broken pipe (Errno::EPIPE)
	from /tmp/ruby/src/trunk-repeat50/tool/lib/envutil.rb:184:in 'EnvUtil.invoke_ruby'
	from /tmp/ruby/src/trunk-repeat50/tool/lib/core_assertions.rb:103:in 'Test::Unit::CoreAssertions#assert_in_out_err'
	from /tmp/ruby/src/trunk-repeat50/test/ruby/test_io.rb:3151:in 'block (2 levels) in TestIO#test_threaded_flush'
#<Thread:0x0000ffff7fefa220 /tmp/ruby/src/trunk-repeat50/test/ruby/test_io.rb:3150 run> terminated with exception (report_on_exception is true):
/tmp/ruby/src/trunk-repeat50/tool/lib/envutil.rb:184:in 'IO#write': Broken pipe (Errno::EPIPE)
	from /tmp/ruby/src/trunk-repeat50/tool/lib/envutil.rb:184:in 'EnvUtil.invoke_ruby'
	from /tmp/ruby/src/trunk-repeat50/tool/lib/core_assertions.rb:103:in 'Test::Unit::CoreAssertions#assert_in_out_err'
	from /tmp/ruby/src/trunk-repeat50/test/ruby/test_io.rb:3151:in 'block (2 levels) in TestIO#test_threaded_flush'
#<Thread:0x0000ffff7fefa0e0 /tmp/ruby/src/trunk-repeat50/test/ruby/test_io.rb:3150 run> terminated with exception (report_on_exception is true):
/tmp/ruby/src/trunk-repeat50/tool/lib/envutil.rb:184:in 'IO#write': Broken pipe (Errno::EPIPE)
	from /tmp/ruby/src/trunk-repeat50/tool/lib/envutil.rb:184:in 'EnvUtil.invoke_ruby'
	from /tmp/ruby/src/trunk-repeat50/tool/lib/core_assertions.rb:103:in 'Test::Unit::CoreAssertions#assert_in_out_err'
	from /tmp/ruby/src/trunk-repeat50/test/ruby/test_io.rb:3151:in 'block (2 levels) in TestIO#test_threaded_flush'
#<Thread:0x0000ffff7fef9ff0 /tmp/ruby/src/trunk-repeat50/test/ruby/test_io.rb:3150 run> terminated with exception (report_on_exception is true):
/tmp/ruby/src/trunk-repeat50/tool/lib/envutil.rb:184:in 'IO#write': Broken pipe (Errno::EPIPE)
	from /tmp/ruby/src/trunk-repeat50/tool/lib/envutil.rb:184:in 'EnvUtil.invoke_ruby'
	from /tmp/ruby/src/trunk-repeat50/tool/lib/core_assertions.rb:103:in 'Test::Unit::CoreAssertions#assert_in_out_err'
	from /tmp/ruby/src/trunk-repeat50/test/ruby/test_io.rb:3151:in 'block (2 levels) in TestIO#test_threaded_flush'
#<Thread:0x0000ffff7fef9f00 /tmp/ruby/src/trunk-repeat50/test/ruby/test_io.rb:3150 run> terminated with exception (report_on_exception is true):
/tmp/ruby/src/trunk-repeat50/tool/lib/envutil.rb:184:in 'IO#write': Broken pipe (Errno::EPIPE)
	from /tmp/ruby/src/trunk-repeat50/tool/lib/envutil.rb:184:in 'EnvUtil.invoke_ruby'
	from /tmp/ruby/src/trunk-repeat50/tool/lib/core_assertions.rb:103:in 'Test::Unit::CoreAssertions#assert_in_out_err'
	from /tmp/ruby/src/trunk-repeat50/test/ruby/test_io.rb:3151:in 'block (2 levels) in TestIO#test_threaded_flush'
#<Thread:0x0000ffff7fef9e10 /tmp/ruby/src/trunk-repeat50/test/ruby/test_io.rb:3150 run> terminated with exception (report_on_exception is true):
/tmp/ruby/src/trunk-repeat50/tool/lib/envutil.rb:184:in 'IO#write': Broken pipe (Errno::EPIPE)
	from /tmp/ruby/src/trunk-repeat50/tool/lib/envutil.rb:184:in 'EnvUtil.invoke_ruby'
	from /tmp/ruby/src/trunk-repeat50/tool/lib/core_assertions.rb:103:in 'Test::Unit::CoreAssertions#assert_in_out_err'
	from /tmp/ruby/src/trunk-repeat50/test/ruby/test_io.rb:3151:in 'block (2 levels) in TestIO#test_threaded_flush'
#<Thread:0x0000ffff7fef9d20 /tmp/ruby/src/trunk-repeat50/test/ruby/test_io.rb:3150 run> terminated with exception (report_on_exception is true):
/tmp/ruby/src/trunk-repeat50/tool/lib/envutil.rb:184:in 'IO#write': Broken pipe (Errno::EPIPE)
	from /tmp/ruby/src/trunk-repeat50/tool/lib/envutil.rb:184:in 'EnvUtil.invoke_ruby'
	from /tmp/ruby/src/trunk-repeat50/tool/lib/core_assertions.rb:103:in 'Test::Unit::CoreAssertions#assert_in_out_err'
	from /tmp/ruby/src/trunk-repeat50/test/ruby/test_io.rb:3151:in 'block (2 levels) in TestIO#test_threaded_flush'
#<Thread:0x0000ffff7fef9c30 /tmp/ruby/src/trunk-repeat50/test/ruby/test_io.rb:3150 run> terminated with exception (report_on_exception is true):
/tmp/ruby/src/trunk-repeat50/tool/lib/envutil.rb:184:in 'IO#write': Broken pipe (Errno::EPIPE)
	from /tmp/ruby/src/trunk-repeat50/tool/lib/envutil.rb:184:in 'EnvUtil.invoke_ruby'
	from /tmp/ruby/src/trunk-repeat50/tool/lib/core_assertions.rb:103:in 'Test::Unit::CoreAssertions#assert_in_out_err'
	from /tmp/ruby/src/trunk-repeat50/test/ruby/test_io.rb:3151:in 'block (2 levels) in TestIO#test_threaded_flush'
#<Thread:0x0000ffff7fef9b40 /tmp/ruby/src/trunk-repeat50/test/ruby/test_io.rb:3150 run> terminated with exception (report_on_exception is true):
/tmp/ruby/src/trunk-repeat50/tool/lib/envutil.rb:184:in 'IO#write': Broken pipe (Errno::EPIPE)
	from /tmp/ruby/src/trunk-repeat50/tool/lib/envutil.rb:184:in 'EnvUtil.invoke_ruby'
	from /tmp/ruby/src/trunk-repeat50/tool/lib/core_assertions.rb:103:in 'Test::Unit::CoreAssertions#assert_in_out_err'
	from /tmp/ruby/src/trunk-repeat50/test/ruby/test_io.rb:3151:in 'block (2 levels) in TestIO#test_threaded_flush'
#<Thread:0x0000ffff7fef9a50 /tmp/ruby/src/trunk-repeat50/test/ruby/test_io.rb:3150 run> terminated with exception (report_on_exception is true):
/tmp/ruby/src/trunk-repeat50/tool/lib/envutil.rb:184:in 'IO#write': Broken pipe (Errno::EPIPE)
	from /tmp/ruby/src/trunk-repeat50/tool/lib/envutil.rb:184:in 'EnvUtil.invoke_ruby'
	from /tmp/ruby/src/trunk-repeat50/tool/lib/core_assertions.rb:103:in 'Test::Unit::CoreAssertions#assert_in_out_err'
	from /tmp/ruby/src/trunk-repeat50/test/ruby/test_io.rb:3151:in 'block (2 levels) in TestIO#test_threaded_flush'
/tmp/ruby/build/trunk-repeat50/ruby: error while loading shared libraries: /tmp/ruby/build/trunk-repeat50/libruby.so.3.5: invalid ELF header

  1) Failure:
TestIO#test_cross_thread_close_stdio [/tmp/ruby/src/trunk-repeat50/test/ruby/test_io.rb:3411]:
assert_separately failed with error message
pid 44598 exit 127
| /tmp/ruby/build/trunk-repeat50/ruby: error while loading shared libraries: /tmp/ruby/build/trunk-repeat50/libruby.so.3.5: file too short


  2) Failure:
TestIO#test_open_pipe [/tmp/ruby/src/trunk-repeat50/test/ruby/test_io.rb:2605]:
<"foo\n"> expected but was
<"">.

  3) Failure:
TestIO#test_closed_stream_in_rescue [/tmp/ruby/src/trunk-repeat50/test/ruby/test_io.rb:4203]:
assert_separately failed with error message
pid 44637 exit 127
| /tmp/ruby/build/trunk-repeat50/ruby: error while loading shared libraries: /tmp/ruby/build/trunk-repeat50/libruby.so.3.5: file too short


  4) Failure:
TestIO#test_threaded_flush [/tmp/ruby/src/trunk-repeat50/tool/lib/zombie_hunter.rb:6]:
Expected [[44664, #<Process::Status: pid 44664 exit 127>],
 [44665, #<Process::Status: pid 44665 exit 127>],
 [44666, #<Process::Status: pid 44666 exit 127>],
 [44667, #<Process::Status: pid 44667 exit 127>],
 [44668, #<Process::Status: pid 44668 exit 127>],
 [44669, #<Process::Status: pid 44669 exit 127>],
 [44670, #<Process::Status: pid 44670 exit 127>],
 [44671, #<Process::Status: pid 44671 exit 127>],
 [44672, #<Process::Status: pid 44672 exit 127>],
 [44673, #<Process::Status: pid 44673 exit 127>]] to be empty.

  5) Failure:
TestIO#test_reopen_stdio [/tmp/ruby/src/trunk-repeat50/test/ruby/test_io.rb:2694]:
<""> expected but was
<"hello">.

  6) Failure:
TestIO#test_print [/tmp/ruby/src/trunk-repeat50/test/ruby/test_io.rb:2919]:
pid 44710 exit 127
| /tmp/ruby/build/trunk-repeat50/ruby: error while loading shared libraries: /tmp/ruby/build/trunk-repeat50/libruby.so.3.5: invalid ELF header
.

1. [1/2] Assertion for "stdout"
   | <["foo", "bar", "baz"]> expected but was
   | <[]>.

2. [2/2] Assertion for "stderr"
   | <[]> expected but was
   | <["/tmp/ruby/build/trunk-repeat50/ruby: error while loading shared libraries: /tmp/ruby/build/trunk-repeat50/libruby.so.3.5: invalid ELF header"]>.

  7) Failure:
TestIO#test_stdout_to_closed_pipe [/tmp/ruby/src/trunk-repeat50/test/ruby/test_io.rb:4367]:
<"ok\n"> expected but was
<nil>.

  8) Failure:
TestIO#test_reopen_ivar [/tmp/ruby/src/trunk-repeat50/test/ruby/test_io.rb:2827]:
pid 44716 exit 127
| /tmp/ruby/build/trunk-repeat50/ruby: error while loading shared libraries: /tmp/ruby/build/trunk-repeat50/libruby.so.3.5: invalid ELF header


  9) Failure:
TestIO#test_write_buffered_with_multiple_arguments [/tmp/ruby/src/trunk-repeat50/test/ruby/test_io.rb:1463]:
Expected #<Process::Status: pid 44719 exit 127> to be success?.

 10) Error:
TestIO#test_threaded_flush:
Errno::EPIPE: Broken pipe
    /tmp/ruby/src/trunk-repeat50/tool/lib/envutil.rb:184:in 'IO#write'
    /tmp/ruby/src/trunk-repeat50/tool/lib/envutil.rb:184:in 'EnvUtil.invoke_ruby'

Finished(1/50)  tests in 468.635284s, 60.8277 tests/s, 12944.7487 assertions/s.
28506 tests, 6066366 assertions, 9 failures, 1 errors, 120 skips

ruby -v: ruby 3.5.0dev (2025-03-12T09:20:40Z master 2782cc75a9) +PRISM [aarch64-linux]
make: *** [uncommon.mk:953: yes-test-all] Error 10
$$$[end] "make yes-test-all TESTOPTS='--stderr-on-failure' TESTS=--repeat-count=50" exit with 512.
$$$[beg] make yes-test-rubyspec MSPECOPT='--error-output stderr -j' TESTS=--repeat-count=50
	BASERUBY = /usr/bin/ruby --disable=gems
	CC = gcc
	LD = ld
	LDSHARED = gcc -shared
	CFLAGS = -mbranch-protection=pac-ret -fstack-protector-strong -U_FORTIFY_SOURCE -D_FORTIFY_SOURCE=2  -O3 -fno-fast-math -ggdb3 -Wall -Wextra -Wdeprecated-declarations -Wdiv-by-zero -Wduplicated-cond -Wimplicit-function-declaration -Wimplicit-int -Wpointer-arith -Wwrite-strings -Wold-style-definition -Wimplicit-fallthrough=0 -Wmissing-noreturn -Wno-cast-function-type -Wno-constant-logical-operand -Wno-long-long -Wno-missing-field-initializers -Wno-overlength-strings -Wno-packed-bitfield-compat -Wno-parentheses-equality -Wno-self-assign -Wno-tautological-compare -Wno-unused-parameter -Wno-unused-value -Wsuggest-attribute=format -Wsuggest-attribute=noreturn -Wunused-variable -Wmisleading-indentation -Wundef   -fPIC 
	XCFLAGS = -fno-strict-overflow -fvisibility=hidden -fexcess-precision=standard -DRUBY_EXPORT -I. -I.ext/include/aarch64-linux -I/tmp/ruby/src/trunk-repeat50/include -I/tmp/ruby/src/trunk-repeat50 -I/tmp/ruby/src/trunk-repeat50/prism -I/tmp/ruby/src/trunk-repeat50/enc/unicode/15.0.0   -Dmodular_gc_dir=
	CPPFLAGS =   
	DLDFLAGS = -Wl,--compress-debug-sections=zlib -Wl,-soname,libruby.so.3.5  -fstack-protector-strong  
	SOLIBS = -lz -lrt -lrt -lgmp -ldl -lcrypt -lm -lpthread 
	LANG = C.UTF-8
	LC_ALL = 
	LC_CTYPE = 
	MFLAGS = 
	RUSTC = rustc
	YJIT_RUSTC_ARGS = --crate-name=yjit --crate-type=staticlib --edition=2021 -g -C lto=thin -C opt-level=3 -C overflow-checks=on '--out-dir=/tmp/ruby/build/trunk-repeat50/yjit/target/release/' /tmp/ruby/src/trunk-repeat50/yjit/src/lib.rs
gcc (Ubuntu 13.3.0-6ubuntu2~24.04) 13.3.0
Copyright (C) 2023 Free Software Foundation, Inc.
This is free software; see the source for copying conditions.  There is NO
warranty; not even for MERCHANTABILITY or FITNESS FOR A PARTICULAR PURPOSE.

generating enc.mk
making enc
make[1]: Entering directory '/tmp/ruby/build/trunk-repeat50'
make[1]: Nothing to be done for 'enc'.
make[1]: Leaving directory '/tmp/ruby/build/trunk-repeat50'
making srcs under enc
make[1]: Entering directory '/tmp/ruby/build/trunk-repeat50'
make[1]: Nothing to be done for 'srcs'.
make[1]: Leaving directory '/tmp/ruby/build/trunk-repeat50'
generating transdb.h
transdb.h unchanged
making trans
make[1]: Entering directory '/tmp/ruby/build/trunk-repeat50'
make[1]: Nothing to be done for 'trans'.
make[1]: Leaving directory '/tmp/ruby/build/trunk-repeat50'
making encs
make[1]: Entering directory '/tmp/ruby/build/trunk-repeat50'
make[1]: Nothing to be done for 'encs'.
make[1]: Leaving directory '/tmp/ruby/build/trunk-repeat50'
generating makefiles ext/configure-ext.mk
ext/configure-ext.mk updated
make[1]: Entering directory '/tmp/ruby/build/trunk-repeat50'
make[1]: Leaving directory '/tmp/ruby/build/trunk-repeat50'
generating makefile exts.mk
exts.mk unchanged
make[1]: Entering directory '/tmp/ruby/build/trunk-repeat50'
make[2]: Entering directory '/tmp/ruby/build/trunk-repeat50/ext/coverage'
make[2]: Leaving directory '/tmp/ruby/build/trunk-repeat50/ext/coverage'
make[2]: Entering directory '/tmp/ruby/build/trunk-repeat50/ext/date'
make[2]: Leaving directory '/tmp/ruby/build/trunk-repeat50/ext/date'
make[2]: Entering directory '/tmp/ruby/build/trunk-repeat50/ext/digest'
make[2]: Leaving directory '/tmp/ruby/build/trunk-repeat50/ext/digest'
make[2]: Entering directory '/tmp/ruby/build/trunk-repeat50/ext/digest/sha2'
make[2]: Leaving directory '/tmp/ruby/build/trunk-repeat50/ext/digest/sha2'
make[2]: Entering directory '/tmp/ruby/build/trunk-repeat50/ext/io/console'
make[2]: Leaving directory '/tmp/ruby/build/trunk-repeat50/ext/io/console'
make[2]: Entering directory '/tmp/ruby/build/trunk-repeat50/ext/json'
make[2]: Leaving directory '/tmp/ruby/build/trunk-repeat50/ext/json'
make[2]: Entering directory '/tmp/ruby/build/trunk-repeat50/ext/monitor'
make[2]: Leaving directory '/tmp/ruby/build/trunk-repeat50/ext/monitor'
make[2]: Entering directory '/tmp/ruby/build/trunk-repeat50/ext/objspace'
make[2]: Leaving directory '/tmp/ruby/build/trunk-repeat50/ext/objspace'
make[2]: Entering directory '/tmp/ruby/build/trunk-repeat50/ext/openssl'
make[2]: Leaving directory '/tmp/ruby/build/trunk-repeat50/ext/openssl'
make[2]: Entering directory '/tmp/ruby/build/trunk-repeat50/ext/pathname'
make[2]: Leaving directory '/tmp/ruby/build/trunk-repeat50/ext/pathname'
make[2]: Entering directory '/tmp/ruby/build/trunk-repeat50/ext/psych'
make[2]: Leaving directory '/tmp/ruby/build/trunk-repeat50/ext/psych'
make[2]: Entering directory '/tmp/ruby/build/trunk-repeat50/ext/pty'
make[2]: Leaving directory '/tmp/ruby/build/trunk-repeat50/ext/pty'
make[2]: Entering directory '/tmp/ruby/build/trunk-repeat50/ext/ripper'
make[2]: Leaving directory '/tmp/ruby/build/trunk-repeat50/ext/ripper'
make[2]: Entering directory '/tmp/ruby/build/trunk-repeat50/ext/rubyvm'
make[2]: Leaving directory '/tmp/ruby/build/trunk-repeat50/ext/rubyvm'
make[2]: Entering directory '/tmp/ruby/build/trunk-repeat50/ext/socket'
make[2]: Leaving directory '/tmp/ruby/build/trunk-repeat50/ext/socket'
make[2]: Entering directory '/tmp/ruby/build/trunk-repeat50/ext/strscan'
make[2]: Leaving directory '/tmp/ruby/build/trunk-repeat50/ext/strscan'
make[2]: Entering directory '/tmp/ruby/build/trunk-repeat50/.bundle/gems/bigdecimal-3.1.9/ext/bigdecimal'
make[2]: Leaving directory '/tmp/ruby/build/trunk-repeat50/.bundle/gems/bigdecimal-3.1.9/ext/bigdecimal'
make[2]: Entering directory '/tmp/ruby/build/trunk-repeat50/.bundle/gems/debug-1.10.0/ext/debug'
make[2]: Leaving directory '/tmp/ruby/build/trunk-repeat50/.bundle/gems/debug-1.10.0/ext/debug'
make[2]: Entering directory '/tmp/ruby/build/trunk-repeat50/.bundle/gems/fiddle-1.1.6/ext/fiddle'
make[2]: Leaving directory '/tmp/ruby/build/trunk-repeat50/.bundle/gems/fiddle-1.1.6/ext/fiddle'
make[2]: Entering directory '/tmp/ruby/build/trunk-repeat50/.bundle/gems/nkf-0.2.0/ext/nkf'
make[2]: Leaving directory '/tmp/ruby/build/trunk-repeat50/.bundle/gems/nkf-0.2.0/ext/nkf'
make[2]: Entering directory '/tmp/ruby/build/trunk-repeat50/.bundle/gems/racc-1.8.1/ext/racc/cparse'
make[2]: Leaving directory '/tmp/ruby/build/trunk-repeat50/.bundle/gems/racc-1.8.1/ext/racc/cparse'
make[2]: Entering directory '/tmp/ruby/build/trunk-repeat50/.bundle/gems/rbs-3.8.1/ext/rbs_extension'
make[2]: Leaving directory '/tmp/ruby/build/trunk-repeat50/.bundle/gems/rbs-3.8.1/ext/rbs_extension'
make[2]: Entering directory '/tmp/ruby/build/trunk-repeat50/.bundle/gems/syslog-0.3.0/ext/syslog'
make[2]: Leaving directory '/tmp/ruby/build/trunk-repeat50/.bundle/gems/syslog-0.3.0/ext/syslog'
make[2]: Entering directory '/tmp/ruby/build/trunk-repeat50'
make[2]: 'ruby' is up to date.
make[2]: Leaving directory '/tmp/ruby/build/trunk-repeat50'
make[1]: Leaving directory '/tmp/ruby/build/trunk-repeat50'
make[1]: Entering directory '/tmp/ruby/build/trunk-repeat50'
make[1]: Nothing to be done for 'note'.
make[1]: Leaving directory '/tmp/ruby/build/trunk-repeat50'
ruby 3.5.0dev (2025-03-12T09:20:40Z master 2782cc75a9) +PRISM [aarch64-linux]
     0 ............................................................
    60 ............................................................
   120 ............................................................
   180 ............................................................
   240 ............................................................
   300 ............................................................
   360 ............................................................
   420 ............................................................
   480 ............................................................
   540 ............................................................
   600 ............................................................
   660 ............................................................
   720 ............................................................
   780 ............................................................
   840 ............................................................
   900 ............................................................
   960 ............................................................
  1020 ............................................................
  1080 ............................................................
  1140 ............................................................
  1200 ............................................................
  1260 ............................................................
  1320 ............................................................
  1380 ............................................................
  1440 ............................................................
  1500 ............................................................
  1560 ............................................................
  1620 ............................................................
  1680 ............................................................
  1740 ............................................................
  1800 ............................................................
  1860 ............................................................
  1920 ............................................................
  1980 ............................................................
  2040 ............................................................
  2100 ............................................................
  2160 ............................................................
  2220 ............................................................
  2280 ............................................................
  2340 ............................................................
  2400 ............................................................
  2460 ............................................................
  2520 ............................................................
  2580 ............................................................
  2640 ............................................................
  2700 ............................................................
  2760 ............................................................
  2820 ............................................................
  2880 ............................................................
  2940 ............................................................
  3000 ............................................................
  3060 ............................................................
  3120 ............................................................
  3180 ............................................................
  3240 ............................................................
  3300 ................

Finished in 8.301674 seconds

3315 files, 32999 examples, 246847 expectations, 0 failures, 0 errors, 0 tagged
$$$[end] "make yes-test-rubyspec MSPECOPT='--error-output stderr -j' TESTS=--repeat-count=50" exit with 0.
raw logfile