| "make update-unicode -j4" exit with 0. |
| "make update-download -j4" exit with 0. |
| "make update-rubyspec -j4" exit with 0. |
| "make update-src -j4" exit with 0. |
| From https://github.com/ruby/ruby |
| 67940b1..9eba7a0 master -> origin/master |
| "make after-update -j4" exit with 0. |
| configure: WARNING: something wrong with CXXFLAGS="" |
| In file included from conftest.c:4: |
| /tmp/ruby/src/trunk-repeat50/version.h:25:39: error: invalid suffix "RUBY_RELEASE_MONTH" on integer constant |
| 25 | #define ONLY_ONE_DIGIT(x) TOKEN_PASTE(10,x) < 1000 |
| | ^~ |
| /tmp/ruby/src/trunk-repeat50/version.h:23:26: note: in definition of macro 'TOKEN_PASTE' |
| 23 | #define TOKEN_PASTE(x,y) x##y |
| | ^ |
| /tmp/ruby/src/trunk-repeat50/version.h:29:5: note: in expansion of macro 'ONLY_ONE_DIGIT' |
| 29 | #if ONLY_ONE_DIGIT(RUBY_RELEASE_MONTH) |
| | ^~~~~~~~~~~~~~ |
| /tmp/ruby/src/trunk-repeat50/version.h:25:39: error: invalid suffix "RUBY_RELEASE_DAY" on integer constant |
| 25 | #define ONLY_ONE_DIGIT(x) TOKEN_PASTE(10,x) < 1000 |
| | ^~ |
| /tmp/ruby/src/trunk-repeat50/version.h:23:26: note: in definition of macro 'TOKEN_PASTE' |
| 23 | #define TOKEN_PASTE(x,y) x##y |
| | ^ |
| /tmp/ruby/src/trunk-repeat50/version.h:34:5: note: in expansion of macro 'ONLY_ONE_DIGIT' |
| 34 | #if ONLY_ONE_DIGIT(RUBY_RELEASE_DAY) |
| | ^~~~~~~~~~~~~~ |
| "make miniruby -j4" exit with 0. |
| In file included from /tmp/ruby/src/trunk-repeat50/compile.c:13741: |
| /tmp/ruby/src/trunk-repeat50/prism_compile.c: In function 'pm_compile_node': |
| /tmp/ruby/src/trunk-repeat50/prism_compile.c:2330:20: warning: zero-length gnu_printf format string [-Wformat-zero-length] |
| 2330 | rb_bug(""); |
| | ^~ |
| /tmp/ruby/src/trunk-repeat50/compile.c: At top level: |
| cc1: note: unrecognized command-line option '-Wno-self-assign' may have been intended to silence earlier diagnostics |
| cc1: note: unrecognized command-line option '-Wno-parentheses-equality' may have been intended to silence earlier diagnostics |
| cc1: note: unrecognized command-line option '-Wno-constant-logical-operand' may have been intended to silence earlier diagnostics |
| "make ruby -j4" exit with 0. |
| "make all -j4" exit with 0. |
| "make install -j4" exit with 0. |
| "make yes-btest TESTOPTS='-q -j4'" exit with 0. |
| |
| "make yes-test-basic TESTS=--repeat-count=50" exit with 0. |
| "make yes-test-all TESTOPTS='--stderr-on-failure' TESTS=--repeat-count=50" exit with 512. |
| Skipping Gem::PackageTask tests. rake not found. |
| 1) Failure: |
| TestRDocRDoc#test_normalized_file_list_with_dot_doc_overridden_by_exclude_option [/tmp/ruby/src/trunk-repeat50/test/rdoc/test_rdoc_rdoc.rb:203]: |
| <["/tmp/d20231213-922092-zobdrb/a.rb"]> expected but was |
| <[]>. |
| make: *** [uncommon.mk:937: yes-test-all] Error 1 |
| "make yes-test-rubyspec MSPECOPT='--error-output stderr --debug' TESTS=--repeat-count=50" exit with 0. |