| "make update-unicode DEFS=\"-DRGENGC_CHECK_MODE=2\"" exit with 0. |
| "make update-download DEFS=\"-DRGENGC_CHECK_MODE=2\"" exit with 0. |
| "make update-rubyspec DEFS=\"-DRGENGC_CHECK_MODE=2\"" exit with 0. |
| "make update-src DEFS=\"-DRGENGC_CHECK_MODE=2\"" exit with 0. |
| From https://github.com/ruby/ruby |
| 7865ceb..55c5ebe master -> origin/master |
| "make after-update DEFS=\"-DRGENGC_CHECK_MODE=2\"" exit with 0. |
| configure: WARNING: something wrong with CXXFLAGS="" |
| In file included from conftest.c:4: |
| /tmp/ruby/src/trunk-gc-asserts/version.h:25:39: error: invalid suffix "RUBY_RELEASE_MONTH" on integer constant |
| 25 | #define ONLY_ONE_DIGIT(x) TOKEN_PASTE(10,x) < 1000 |
| | ^~ |
| /tmp/ruby/src/trunk-gc-asserts/version.h:23:26: note: in definition of macro 'TOKEN_PASTE' |
| 23 | #define TOKEN_PASTE(x,y) x##y |
| | ^ |
| /tmp/ruby/src/trunk-gc-asserts/version.h:29:5: note: in expansion of macro 'ONLY_ONE_DIGIT' |
| 29 | #if ONLY_ONE_DIGIT(RUBY_RELEASE_MONTH) |
| | ^~~~~~~~~~~~~~ |
| /tmp/ruby/src/trunk-gc-asserts/version.h:25:39: error: invalid suffix "RUBY_RELEASE_DAY" on integer constant |
| 25 | #define ONLY_ONE_DIGIT(x) TOKEN_PASTE(10,x) < 1000 |
| | ^~ |
| /tmp/ruby/src/trunk-gc-asserts/version.h:23:26: note: in definition of macro 'TOKEN_PASTE' |
| 23 | #define TOKEN_PASTE(x,y) x##y |
| | ^ |
| /tmp/ruby/src/trunk-gc-asserts/version.h:34:5: note: in expansion of macro 'ONLY_ONE_DIGIT' |
| 34 | #if ONLY_ONE_DIGIT(RUBY_RELEASE_DAY) |
| | ^~~~~~~~~~~~~~ |
| "make miniruby DEFS=\"-DRGENGC_CHECK_MODE=2\"" exit with 0. |
| "make ruby DEFS=\"-DRGENGC_CHECK_MODE=2\"" exit with 0. |
| "make all DEFS=\"-DRGENGC_CHECK_MODE=2\"" exit with 0. |
| "make install DEFS=\"-DRGENGC_CHECK_MODE=2\"" exit with 0. |
| "make yes-btest TESTOPTS='-q -j4'" exit with 0. |
| |
| "make yes-test-basic TESTS='-j4'" exit with 0. |
| "make yes-test-all TESTOPTS='--stderr-on-failure' TESTS='-j4'" exit with 512. |
| Retrying is failed because the file and testcase is not consistent: |
| {:file=> |
| "/tmp/ruby/src/trunk-gc-asserts/test/ruby/enc/test_case_comprehensive.rb", |
| :result=>nil, |
| :testcase=>"TestGc", |
| :error=>["TestGc", :test_singleton_method_added]} |
| make: *** [uncommon.mk:938: yes-test-all] Error 1 |
| "make yes-test-rubyspec MSPECOPT='--error-output stderr --debug' TESTS='-j4'" exit with 0. |