| "make update-unicode DEFS=\"-DRGENGC_CHECK_MODE=2 -DRUBY_DEBUG=1 -fno-inline\"" exit with 0. |
| "make update-download DEFS=\"-DRGENGC_CHECK_MODE=2 -DRUBY_DEBUG=1 -fno-inline\"" exit with 0. |
| "make update-rubyspec DEFS=\"-DRGENGC_CHECK_MODE=2 -DRUBY_DEBUG=1 -fno-inline\"" exit with 0. |
| "make update-src DEFS=\"-DRGENGC_CHECK_MODE=2 -DRUBY_DEBUG=1 -fno-inline\"" exit with 0. |
| From https://github.com/ruby/ruby |
| 520987c..7b3e05c master -> origin/master |
| "make after-update DEFS=\"-DRGENGC_CHECK_MODE=2 -DRUBY_DEBUG=1 -fno-inline\"" exit with 0. |
| configure: WARNING: something wrong with CXXFLAGS="" |
| In file included from conftest.c:4: |
| /tmp/ruby/src/trunk-asserts-nopara/version.h:25:39: error: invalid suffix "RUBY_RELEASE_MONTH" on integer constant |
| 25 | #define ONLY_ONE_DIGIT(x) TOKEN_PASTE(10,x) < 1000 |
| | ^~ |
| /tmp/ruby/src/trunk-asserts-nopara/version.h:23:26: note: in definition of macro 'TOKEN_PASTE' |
| 23 | #define TOKEN_PASTE(x,y) x##y |
| | ^ |
| /tmp/ruby/src/trunk-asserts-nopara/version.h:29:5: note: in expansion of macro 'ONLY_ONE_DIGIT' |
| 29 | #if ONLY_ONE_DIGIT(RUBY_RELEASE_MONTH) |
| | ^~~~~~~~~~~~~~ |
| /tmp/ruby/src/trunk-asserts-nopara/version.h:25:39: error: invalid suffix "RUBY_RELEASE_DAY" on integer constant |
| 25 | #define ONLY_ONE_DIGIT(x) TOKEN_PASTE(10,x) < 1000 |
| | ^~ |
| /tmp/ruby/src/trunk-asserts-nopara/version.h:23:26: note: in definition of macro 'TOKEN_PASTE' |
| 23 | #define TOKEN_PASTE(x,y) x##y |
| | ^ |
| /tmp/ruby/src/trunk-asserts-nopara/version.h:34:5: note: in expansion of macro 'ONLY_ONE_DIGIT' |
| 34 | #if ONLY_ONE_DIGIT(RUBY_RELEASE_DAY) |
| | ^~~~~~~~~~~~~~ |
| "make miniruby DEFS=\"-DRGENGC_CHECK_MODE=2 -DRUBY_DEBUG=1 -fno-inline\"" exit with 0. |
| /tmp/ruby/src/trunk-asserts-nopara/complex.c: In function 'complex_pow_for_special_angle': |
| /tmp/ruby/src/trunk-asserts-nopara/complex.c:1074:13: warning: 'dir' may be used uninitialized in this function [-Wmaybe-uninitialized] |
| 1074 | dir += 4; |
| | ~~~~^~~~ |
| /tmp/ruby/src/trunk-asserts-nopara/complex.c: At top level: |
| cc1: note: unrecognized command-line option '-Wno-self-assign' may have been intended to silence earlier diagnostics |
| cc1: note: unrecognized command-line option '-Wno-parentheses-equality' may have been intended to silence earlier diagnostics |
| cc1: note: unrecognized command-line option '-Wno-constant-logical-operand' may have been intended to silence earlier diagnostics |
| "make ruby DEFS=\"-DRGENGC_CHECK_MODE=2 -DRUBY_DEBUG=1 -fno-inline\"" exit with 0. |
| "make all DEFS=\"-DRGENGC_CHECK_MODE=2 -DRUBY_DEBUG=1 -fno-inline\"" exit with 0. |
| "make install DEFS=\"-DRGENGC_CHECK_MODE=2 -DRUBY_DEBUG=1 -fno-inline\"" exit with 0. |
| "make yes-btest TESTOPTS='-q '" exit with 0. |
| "make yes-test-basic " exit with 0. |
| "make yes-test-all TESTOPTS='--stderr-on-failure' " exit with 512. |
| 1) Error: |
| TestIO#test_copy_stream_read_pipe: |
| IOError: stream closed in another thread |
| /tmp/ruby/src/trunk-asserts-nopara/test/ruby/test_io.rb:629:in `write' |
| /tmp/ruby/src/trunk-asserts-nopara/test/ruby/test_io.rb:629:in `<<' |
| /tmp/ruby/src/trunk-asserts-nopara/test/ruby/test_io.rb:629:in `block (2 levels) in test_copy_stream_read_pipe' |
| /tmp/ruby/src/trunk-asserts-nopara/test/ruby/test_io.rb:44:in `block in pipe' |
| make: *** [uncommon.mk:945: yes-test-all] Error 1 |
| "make yes-test-rubyspec MSPECOPT='--error-output stderr --debug' " exit with 0. |