# Logfile created on 2025-05-13 23:16:11 +0000 by logger.rb/v1.5.0
#<BuildRuby:0x0000003fc24348b8 @REPOSITORY="https://github.com/ruby/ruby.git", @REPOSITORY_TYPE=:git, @git_branch=nil, @git_worktree=nil, @svn_revision=nil, @SRC_DIR="/tmp/ruby/src", @BUILD_DIR="/tmp/ruby/build", @INSTALL_DIR="/tmp/ruby/install", @TARGET_NAME="trunk", @TARGET_SRC_DIR="/tmp/ruby/src/trunk", @TARGET_BUILD_DIR="/tmp/ruby/build/trunk", @TARGET_INSTALL_DIR="/tmp/ruby/install/trunk", @configure_opts=["--enable-shared"], @build_opts="-j4", @btest_opts="-j4", @test_opts="TESTS='-j4'", @spec_opts="-j", @incremental=true, @steps=["checkout", "autoconf", "configure", "build_up", "build_miniruby", "build_ruby", "build_all", "build_install", "test_btest", "test_basic", "test_all", "test_rubyspec"], @quiet=false, @gist=false, @timeout=10800, @no_timeout_error=nil, @logfile="/home/sipeed/ruby/logs/brlog.trunk.20250513-231611", @ruby_env=[["RUBY_DEBUG", "ci"]], @make="make", @logger=#<Logger:0x0000003fc2412a60 @level=0, @progname=nil, @default_formatter=#<Logger::Formatter:0x0000003fc2412920 @datetime_format=nil>, @formatter=nil, @logdev=#<Logger::LogDevice:0x0000003fc2412768 @shift_period_suffix="%Y%m%d", @shift_size=1048576, @shift_age=0, @filename="/home/sipeed/ruby/logs/brlog.trunk.20250513-231611", @dev=#<File:/home/sipeed/ruby/logs/brlog.trunk.20250513-231611>, @binmode=false, @mon_data=#<Monitor:0x0000003fc2412650>, @mon_data_owner_object_id=880>>>
$$$[beg] make update-download -j4
tool/config.guess already exists
tool/config.sub already exists
Update repl_type_completor to 25108aa8d69ddaba0b5da3feff1c0035371524b2
echo 25108aa8d69ddaba0b5da3feff1c0035371524b2 | /bin/sh /tmp/ruby/src/trunk/tool/ifchange /tmp/ruby/src/trunk/.bundle/.timestamp/repl_type_completor.revision -
/tmp/ruby/src/trunk/.bundle/.timestamp/repl_type_completor.revision unchanged
$$$[end] "make update-download -j4" exit with 0.
$$$[beg] make update-src -j4
Already up to date.
Latest commit hash = 2279da2c91
$$$[end] "make update-src -j4" exit with 0.
$$$[beg] make after-update -j4
Update repl_type_completor to 25108aa8d69ddaba0b5da3feff1c0035371524b2
echo 25108aa8d69ddaba0b5da3feff1c0035371524b2 | /bin/sh /tmp/ruby/src/trunk/tool/ifchange /tmp/ruby/src/trunk/.bundle/.timestamp/repl_type_completor.revision -
/tmp/ruby/src/trunk/.bundle/.timestamp/repl_type_completor.revision unchanged
/tmp/ruby/src/trunk/revision.h updated
generating riscv64-linux-fake.rb
riscv64-linux-fake.rb updated
generating enc.mk
making srcs under enc
make[1]: Entering directory '/tmp/ruby/build/trunk'
make[1]: Nothing to be done for 'srcs'.
make[1]: Leaving directory '/tmp/ruby/build/trunk'
$$$[end] "make after-update -j4" exit with 0.
$$$[beg] make miniruby -j4
BASERUBY = /usr/bin/ruby --disable=gems
CC = gcc
LD = ld
LDSHARED = gcc -shared
CFLAGS = -fstack-protector-strong -U_FORTIFY_SOURCE -D_FORTIFY_SOURCE=2 -O3 -fno-fast-math -ggdb3 -Wall -Wextra -Wdeprecated-declarations -Wdiv-by-zero -Wduplicated-cond -Wimplicit-function-declaration -Wimplicit-int -Wpointer-arith -Wwrite-strings -Wold-style-definition -Wimplicit-fallthrough=0 -Wmissing-noreturn -Wno-cast-function-type -Wno-constant-logical-operand -Wno-long-long -Wno-missing-field-initializers -Wno-overlength-strings -Wno-packed-bitfield-compat -Wno-parentheses-equality -Wno-self-assign -Wno-tautological-compare -Wno-unused-parameter -Wno-unused-value -Wsuggest-attribute=format -Wsuggest-attribute=noreturn -Wunused-variable -Wmisleading-indentation -Wundef -fPIC
XCFLAGS = -fno-strict-overflow -fvisibility=hidden -fexcess-precision=standard -DRUBY_EXPORT -I. -I.ext/include/riscv64-linux -I.ext/include -I/tmp/ruby/src/trunk/include -I/tmp/ruby/src/trunk -I/tmp/ruby/src/trunk/prism -I/tmp/ruby/src/trunk/enc/unicode/16.0.0 -Dmodular_gc_dir=
CPPFLAGS =
DLDFLAGS = -Wl,--compress-debug-sections=zlib -Wl,-soname,libruby.so.3.5 -fstack-protector-strong
SOLIBS = -lz -lrt -lrt -lgmp -ldl -lcrypt -lm -lpthread
LANG = C.UTF-8
LC_ALL =
LC_CTYPE =
MFLAGS = -j4 --jobserver-auth=4,5
RUSTC = rustc
YJIT_RUSTC_ARGS = --crate-name=yjit --crate-type=staticlib --edition=2021 -g -C lto=thin -C opt-level=3 -C overflow-checks=on '--out-dir=/tmp/ruby/build/trunk/yjit/target/release/' /tmp/ruby/src/trunk/yjit/src/lib.rs
ZJIT_RUSTC_ARGS = --crate-name=zjit --crate-type=staticlib --edition=2024 -g -C lto=thin -C opt-level=3 -C overflow-checks=on '--out-dir=/tmp/ruby/build/trunk/zjit/target/release/' /tmp/ruby/src/trunk/zjit/src/lib.rs
gcc (Debian 13.2.0-23revyos1) 13.2.0
Copyright (C) 2023 Free Software Foundation, Inc.
This is free software; see the source for copying conditions. There is NO
warranty; not even for MERCHANTABILITY or FITNESS FOR A PARTICULAR PURPOSE.
compiling /tmp/ruby/src/trunk/version.c
linking miniruby
$$$[end] "make miniruby -j4" exit with 0.
$$$[beg] make ruby -j4
BASERUBY = /usr/bin/ruby --disable=gems
CC = gcc
LD = ld
LDSHARED = gcc -shared
CFLAGS = -fstack-protector-strong -U_FORTIFY_SOURCE -D_FORTIFY_SOURCE=2 -O3 -fno-fast-math -ggdb3 -Wall -Wextra -Wdeprecated-declarations -Wdiv-by-zero -Wduplicated-cond -Wimplicit-function-declaration -Wimplicit-int -Wpointer-arith -Wwrite-strings -Wold-style-definition -Wimplicit-fallthrough=0 -Wmissing-noreturn -Wno-cast-function-type -Wno-constant-logical-operand -Wno-long-long -Wno-missing-field-initializers -Wno-overlength-strings -Wno-packed-bitfield-compat -Wno-parentheses-equality -Wno-self-assign -Wno-tautological-compare -Wno-unused-parameter -Wno-unused-value -Wsuggest-attribute=format -Wsuggest-attribute=noreturn -Wunused-variable -Wmisleading-indentation -Wundef -fPIC
XCFLAGS = -fno-strict-overflow -fvisibility=hidden -fexcess-precision=standard -DRUBY_EXPORT -I. -I.ext/include/riscv64-linux -I.ext/include -I/tmp/ruby/src/trunk/include -I/tmp/ruby/src/trunk -I/tmp/ruby/src/trunk/prism -I/tmp/ruby/src/trunk/enc/unicode/16.0.0 -Dmodular_gc_dir=
CPPFLAGS =
DLDFLAGS = -Wl,--compress-debug-sections=zlib -Wl,-soname,libruby.so.3.5 -fstack-protector-strong
SOLIBS = -lz -lrt -lrt -lgmp -ldl -lcrypt -lm -lpthread
LANG = C.UTF-8
LC_ALL =
LC_CTYPE =
MFLAGS = -j4 --jobserver-auth=4,5
RUSTC = rustc
YJIT_RUSTC_ARGS = --crate-name=yjit --crate-type=staticlib --edition=2021 -g -C lto=thin -C opt-level=3 -C overflow-checks=on '--out-dir=/tmp/ruby/build/trunk/yjit/target/release/' /tmp/ruby/src/trunk/yjit/src/lib.rs
ZJIT_RUSTC_ARGS = --crate-name=zjit --crate-type=staticlib --edition=2024 -g -C lto=thin -C opt-level=3 -C overflow-checks=on '--out-dir=/tmp/ruby/build/trunk/zjit/target/release/' /tmp/ruby/src/trunk/zjit/src/lib.rs
gcc (Debian 13.2.0-23revyos1) 13.2.0
Copyright (C) 2023 Free Software Foundation, Inc.
This is free software; see the source for copying conditions. There is NO
warranty; not even for MERCHANTABILITY or FITNESS FOR A PARTICULAR PURPOSE.
builtin_binary.inc updated
795a3c4cb815c410314072e3c43c89fff353a1c694fffa2a3fcef9f1ce400a5e builtin_binary.inc
compiling /tmp/ruby/src/trunk/builtin.c
linking static-library libruby-static.a
linking shared-library libruby.so.3.5.0
linking ruby
$$$[end] "make ruby -j4" exit with 0.
$$$[beg] make all -j4
BASERUBY = /usr/bin/ruby --disable=gems
CC = gcc
LD = ld
LDSHARED = gcc -shared
CFLAGS = -fstack-protector-strong -U_FORTIFY_SOURCE -D_FORTIFY_SOURCE=2 -O3 -fno-fast-math -ggdb3 -Wall -Wextra -Wdeprecated-declarations -Wdiv-by-zero -Wduplicated-cond -Wimplicit-function-declaration -Wimplicit-int -Wpointer-arith -Wwrite-strings -Wold-style-definition -Wimplicit-fallthrough=0 -Wmissing-noreturn -Wno-cast-function-type -Wno-constant-logical-operand -Wno-long-long -Wno-missing-field-initializers -Wno-overlength-strings -Wno-packed-bitfield-compat -Wno-parentheses-equality -Wno-self-assign -Wno-tautological-compare -Wno-unused-parameter -Wno-unused-value -Wsuggest-attribute=format -Wsuggest-attribute=noreturn -Wunused-variable -Wmisleading-indentation -Wundef -fPIC
XCFLAGS = -fno-strict-overflow -fvisibility=hidden -fexcess-precision=standard -DRUBY_EXPORT -I. -I.ext/include/riscv64-linux -I.ext/include -I/tmp/ruby/src/trunk/include -I/tmp/ruby/src/trunk -I/tmp/ruby/src/trunk/prism -I/tmp/ruby/src/trunk/enc/unicode/16.0.0 -Dmodular_gc_dir=
CPPFLAGS =
DLDFLAGS = -Wl,--compress-debug-sections=zlib -Wl,-soname,libruby.so.3.5 -fstack-protector-strong
SOLIBS = -lz -lrt -lrt -lgmp -ldl -lcrypt -lm -lpthread
LANG = C.UTF-8
LC_ALL =
LC_CTYPE =
MFLAGS = -j4 --jobserver-auth=4,5
RUSTC = rustc
YJIT_RUSTC_ARGS = --crate-name=yjit --crate-type=staticlib --edition=2021 -g -C lto=thin -C opt-level=3 -C overflow-checks=on '--out-dir=/tmp/ruby/build/trunk/yjit/target/release/' /tmp/ruby/src/trunk/yjit/src/lib.rs
ZJIT_RUSTC_ARGS = --crate-name=zjit --crate-type=staticlib --edition=2024 -g -C lto=thin -C opt-level=3 -C overflow-checks=on '--out-dir=/tmp/ruby/build/trunk/zjit/target/release/' /tmp/ruby/src/trunk/zjit/src/lib.rs
gcc (Debian 13.2.0-23revyos1) 13.2.0
Copyright (C) 2023 Free Software Foundation, Inc.
This is free software; see the source for copying conditions. There is NO
warranty; not even for MERCHANTABILITY or FITNESS FOR A PARTICULAR PURPOSE.
generating enc.mk
making srcs under enc
making enc
make[1]: Entering directory '/tmp/ruby/build/trunk'
make[1]: Nothing to be done for 'enc'.
make[1]: Leaving directory '/tmp/ruby/build/trunk'
make[1]: Entering directory '/tmp/ruby/build/trunk'
make[1]: Nothing to be done for 'srcs'.
make[1]: Leaving directory '/tmp/ruby/build/trunk'
generating transdb.h
transdb.h unchanged
generating makefiles ext/configure-ext.mk
making trans
ext/configure-ext.mk updated
make[1]: Entering directory '/tmp/ruby/build/trunk'
make[1]: Entering directory '/tmp/ruby/build/trunk'
make[1]: Nothing to be done for 'trans'.
make[1]: Leaving directory '/tmp/ruby/build/trunk'
making encs
make[1]: Entering directory '/tmp/ruby/build/trunk'
make[1]: Nothing to be done for 'encs'.
make[1]: Leaving directory '/tmp/ruby/build/trunk'
make[1]: Leaving directory '/tmp/ruby/build/trunk'
generating makefile exts.mk
exts.mk unchanged
make[1]: Entering directory '/tmp/ruby/build/trunk'
make[2]: Entering directory '/tmp/ruby/build/trunk/ext/coverage'
make[2]: Entering directory '/tmp/ruby/build/trunk/ext/digest'
make[2]: Entering directory '/tmp/ruby/build/trunk/ext/date'
make[2]: Leaving directory '/tmp/ruby/build/trunk/ext/coverage'
make[2]: Leaving directory '/tmp/ruby/build/trunk/ext/date'
make[2]: Leaving directory '/tmp/ruby/build/trunk/ext/digest'
make[2]: Entering directory '/tmp/ruby/build/trunk/ext/io/console'
make[2]: Entering directory '/tmp/ruby/build/trunk/ext/json'
make[2]: Leaving directory '/tmp/ruby/build/trunk/ext/io/console'
make[2]: Entering directory '/tmp/ruby/build/trunk/ext/monitor'
make[2]: Entering directory '/tmp/ruby/build/trunk/ext/objspace'
make[2]: Leaving directory '/tmp/ruby/build/trunk/ext/monitor'
make[2]: Leaving directory '/tmp/ruby/build/trunk/ext/json'
make[2]: Entering directory '/tmp/ruby/build/trunk/ext/pathname'
make[2]: Leaving directory '/tmp/ruby/build/trunk/ext/objspace'
make[2]: Leaving directory '/tmp/ruby/build/trunk/ext/pathname'
make[2]: Entering directory '/tmp/ruby/build/trunk/ext/pty'
make[2]: Entering directory '/tmp/ruby/build/trunk/ext/psych'
make[2]: Entering directory '/tmp/ruby/build/trunk/ext/openssl'
make[2]: Leaving directory '/tmp/ruby/build/trunk/ext/pty'
make[2]: Entering directory '/tmp/ruby/build/trunk/ext/rubyvm'
make[2]: Leaving directory '/tmp/ruby/build/trunk/ext/rubyvm'
make[2]: Entering directory '/tmp/ruby/build/trunk/ext/ripper'
make[2]: Leaving directory '/tmp/ruby/build/trunk/ext/ripper'
make[2]: Leaving directory '/tmp/ruby/build/trunk/ext/psych'
make[2]: Leaving directory '/tmp/ruby/build/trunk/ext/openssl'
make[2]: Entering directory '/tmp/ruby/build/trunk/ext/socket'
make[2]: Entering directory '/tmp/ruby/build/trunk/ext/strscan'
make[2]: Entering directory '/tmp/ruby/build/trunk/.bundle/gems/bigdecimal-3.1.9/ext/bigdecimal'
make[2]: Leaving directory '/tmp/ruby/build/trunk/ext/strscan'
make[2]: Entering directory '/tmp/ruby/build/trunk/.bundle/gems/debug-1.10.0/ext/debug'
make[2]: Entering directory '/tmp/ruby/build/trunk/.bundle/gems/fiddle-1.1.8/ext/fiddle'
make[2]: Leaving directory '/tmp/ruby/build/trunk/ext/socket'
make[2]: Entering directory '/tmp/ruby/build/trunk/.bundle/gems/nkf-0.2.0/ext/nkf'
make[2]: Leaving directory '/tmp/ruby/build/trunk/.bundle/gems/bigdecimal-3.1.9/ext/bigdecimal'
make[2]: Entering directory '/tmp/ruby/build/trunk/.bundle/gems/racc-1.8.1/ext/racc/cparse'
make[2]: Leaving directory '/tmp/ruby/build/trunk/.bundle/gems/debug-1.10.0/ext/debug'
make[2]: Leaving directory '/tmp/ruby/build/trunk/.bundle/gems/fiddle-1.1.8/ext/fiddle'
make[2]: Entering directory '/tmp/ruby/build/trunk/.bundle/gems/syslog-0.3.0/ext/syslog'
make[2]: Entering directory '/tmp/ruby/build/trunk/.bundle/gems/rbs-3.9.3/ext/rbs_extension'
make[2]: Leaving directory '/tmp/ruby/build/trunk/.bundle/gems/rbs-3.9.3/ext/rbs_extension'
make[2]: Leaving directory '/tmp/ruby/build/trunk/.bundle/gems/nkf-0.2.0/ext/nkf'
make[2]: Leaving directory '/tmp/ruby/build/trunk/.bundle/gems/racc-1.8.1/ext/racc/cparse'
make[2]: Entering directory '/tmp/ruby/build/trunk/ext/digest/sha2'
make[2]: Leaving directory '/tmp/ruby/build/trunk/.bundle/gems/syslog-0.3.0/ext/syslog'
make[2]: Leaving directory '/tmp/ruby/build/trunk/ext/digest/sha2'
make[2]: Entering directory '/tmp/ruby/build/trunk'
make[2]: 'ruby' is up to date.
make[2]: Leaving directory '/tmp/ruby/build/trunk'
make[1]: Leaving directory '/tmp/ruby/build/trunk'
make[1]: Entering directory '/tmp/ruby/build/trunk'
make[1]: Nothing to be done for 'note'.
make[1]: Leaving directory '/tmp/ruby/build/trunk'
building spec/ruby/optional/capi/ext/array_spec.so
building spec/ruby/optional/capi/ext/basic_object_spec.so
building spec/ruby/optional/capi/ext/bignum_spec.so
building spec/ruby/optional/capi/ext/binding_spec.so
building spec/ruby/optional/capi/ext/boolean_spec.so
building spec/ruby/optional/capi/ext/class_id_under_autoload_spec.so
building spec/ruby/optional/capi/ext/class_spec.so
building spec/ruby/optional/capi/ext/class_under_autoload_spec.so
building spec/ruby/optional/capi/ext/complex_spec.so
building spec/ruby/optional/capi/ext/constants_spec.so
building spec/ruby/optional/capi/ext/data_spec.so
building spec/ruby/optional/capi/ext/debug_spec.so
building spec/ruby/optional/capi/ext/digest_spec.so
building spec/ruby/optional/capi/ext/encoding_spec.so
building spec/ruby/optional/capi/ext/enumerator_spec.so
building spec/ruby/optional/capi/ext/exception_spec.so
building spec/ruby/optional/capi/ext/fiber_spec.so
building spec/ruby/optional/capi/ext/file_spec.so
building spec/ruby/optional/capi/ext/finalizer_spec.so
building spec/ruby/optional/capi/ext/fixnum_spec.so
building spec/ruby/optional/capi/ext/float_spec.so
building spec/ruby/optional/capi/ext/gc_spec.so
building spec/ruby/optional/capi/ext/globals_spec.so
building spec/ruby/optional/capi/ext/hash_spec.so
building spec/ruby/optional/capi/ext/integer_spec.so
building spec/ruby/optional/capi/ext/io_spec.so
building spec/ruby/optional/capi/ext/kernel_spec.so
building spec/ruby/optional/capi/ext/language_spec.so
building spec/ruby/optional/capi/ext/marshal_spec.so
building spec/ruby/optional/capi/ext/module_spec.so
building spec/ruby/optional/capi/ext/module_under_autoload_spec.so
building spec/ruby/optional/capi/ext/mutex_spec.so
building spec/ruby/optional/capi/ext/numeric_spec.so
building spec/ruby/optional/capi/ext/object_spec.so
building spec/ruby/optional/capi/ext/proc_spec.so
building spec/ruby/optional/capi/ext/range_spec.so
building spec/ruby/optional/capi/ext/rational_spec.so
building spec/ruby/optional/capi/ext/rbasic_spec.so
building spec/ruby/optional/capi/ext/regexp_spec.so
building spec/ruby/optional/capi/ext/st_spec.so
building spec/ruby/optional/capi/ext/string_spec.so
building spec/ruby/optional/capi/ext/struct_spec.so
building spec/ruby/optional/capi/ext/symbol_spec.so
building spec/ruby/optional/capi/ext/thread_spec.so
building spec/ruby/optional/capi/ext/time_spec.so
building spec/ruby/optional/capi/ext/tracepoint_spec.so
building spec/ruby/optional/capi/ext/typed_data_spec.so
building spec/ruby/optional/capi/ext/util_spec.so
$$$[end] "make all -j4" exit with 0.
$$$[beg] make install -j4
Update repl_type_completor to 25108aa8d69ddaba0b5da3feff1c0035371524b2
BASERUBY = /usr/bin/ruby --disable=gems
CC = gcc
LD = ld
LDSHARED = gcc -shared
CFLAGS = -fstack-protector-strong -U_FORTIFY_SOURCE -D_FORTIFY_SOURCE=2 -O3 -fno-fast-math -ggdb3 -Wall -Wextra -Wdeprecated-declarations -Wdiv-by-zero -Wduplicated-cond -Wimplicit-function-declaration -Wimplicit-int -Wpointer-arith -Wwrite-strings -Wold-style-definition -Wimplicit-fallthrough=0 -Wmissing-noreturn -Wno-cast-function-type -Wno-constant-logical-operand -Wno-long-long -Wno-missing-field-initializers -Wno-overlength-strings -Wno-packed-bitfield-compat -Wno-parentheses-equality -Wno-self-assign -Wno-tautological-compare -Wno-unused-parameter -Wno-unused-value -Wsuggest-attribute=format -Wsuggest-attribute=noreturn -Wunused-variable -Wmisleading-indentation -Wundef -fPIC
XCFLAGS = -fno-strict-overflow -fvisibility=hidden -fexcess-precision=standard -DRUBY_EXPORT -I. -I.ext/include/riscv64-linux -I.ext/include -I/tmp/ruby/src/trunk/include -I/tmp/ruby/src/trunk -I/tmp/ruby/src/trunk/prism -I/tmp/ruby/src/trunk/enc/unicode/16.0.0 -Dmodular_gc_dir=
CPPFLAGS =
DLDFLAGS = -Wl,--compress-debug-sections=zlib -Wl,-soname,libruby.so.3.5 -fstack-protector-strong
SOLIBS = -lz -lrt -lrt -lgmp -ldl -lcrypt -lm -lpthread
LANG = C.UTF-8
LC_ALL =
LC_CTYPE =
MFLAGS = -j4 --jobserver-auth=4,5
RUSTC = rustc
YJIT_RUSTC_ARGS = --crate-name=yjit --crate-type=staticlib --edition=2021 -g -C lto=thin -C opt-level=3 -C overflow-checks=on '--out-dir=/tmp/ruby/build/trunk/yjit/target/release/' /tmp/ruby/src/trunk/yjit/src/lib.rs
ZJIT_RUSTC_ARGS = --crate-name=zjit --crate-type=staticlib --edition=2024 -g -C lto=thin -C opt-level=3 -C overflow-checks=on '--out-dir=/tmp/ruby/build/trunk/zjit/target/release/' /tmp/ruby/src/trunk/zjit/src/lib.rs
echo 25108aa8d69ddaba0b5da3feff1c0035371524b2 | /bin/sh /tmp/ruby/src/trunk/tool/ifchange /tmp/ruby/src/trunk/.bundle/.timestamp/repl_type_completor.revision -
generating enc.mk
gcc (Debian 13.2.0-23revyos1) 13.2.0
Copyright (C) 2023 Free Software Foundation, Inc.
This is free software; see the source for copying conditions. There is NO
warranty; not even for MERCHANTABILITY or FITNESS FOR A PARTICULAR PURPOSE.
/tmp/ruby/src/trunk/.bundle/.timestamp/repl_type_completor.revision unchanged
making srcs under enc
making enc
make[1]: Entering directory '/tmp/ruby/build/trunk'
make[1]: Nothing to be done for 'enc'.
make[1]: Leaving directory '/tmp/ruby/build/trunk'
make[1]: Entering directory '/tmp/ruby/build/trunk'
make[1]: Nothing to be done for 'srcs'.
make[1]: Leaving directory '/tmp/ruby/build/trunk'
generating transdb.h
transdb.h unchanged
generating makefiles ext/configure-ext.mk
making trans
ext/configure-ext.mk unchanged
make[1]: Entering directory '/tmp/ruby/build/trunk'
make[1]: Entering directory '/tmp/ruby/build/trunk'
make[1]: Nothing to be done for 'trans'.
make[1]: Leaving directory '/tmp/ruby/build/trunk'
making encs
make[1]: Entering directory '/tmp/ruby/build/trunk'
make[1]: Nothing to be done for 'encs'.
make[1]: Leaving directory '/tmp/ruby/build/trunk'
make[1]: Leaving directory '/tmp/ruby/build/trunk'
generating makefile exts.mk
exts.mk unchanged
make[1]: Entering directory '/tmp/ruby/build/trunk'
make[2]: Entering directory '/tmp/ruby/build/trunk/ext/coverage'
make[2]: Entering directory '/tmp/ruby/build/trunk/ext/digest'
make[2]: Entering directory '/tmp/ruby/build/trunk/ext/date'
make[2]: Leaving directory '/tmp/ruby/build/trunk/ext/coverage'
make[2]: Leaving directory '/tmp/ruby/build/trunk/ext/date'
make[2]: Leaving directory '/tmp/ruby/build/trunk/ext/digest'
make[2]: Entering directory '/tmp/ruby/build/trunk/ext/io/console'
make[2]: Entering directory '/tmp/ruby/build/trunk/ext/json'
make[2]: Leaving directory '/tmp/ruby/build/trunk/ext/io/console'
make[2]: Entering directory '/tmp/ruby/build/trunk/ext/monitor'
make[2]: Entering directory '/tmp/ruby/build/trunk/ext/objspace'
make[2]: Leaving directory '/tmp/ruby/build/trunk/ext/json'
make[2]: Leaving directory '/tmp/ruby/build/trunk/ext/monitor'
make[2]: Leaving directory '/tmp/ruby/build/trunk/ext/objspace'
make[2]: Entering directory '/tmp/ruby/build/trunk/ext/pathname'
make[2]: Entering directory '/tmp/ruby/build/trunk/ext/psych'
make[2]: Leaving directory '/tmp/ruby/build/trunk/ext/pathname'
make[2]: Entering directory '/tmp/ruby/build/trunk/ext/pty'
make[2]: Leaving directory '/tmp/ruby/build/trunk/ext/pty'
make[2]: Entering directory '/tmp/ruby/build/trunk/ext/openssl'
make[2]: Entering directory '/tmp/ruby/build/trunk/ext/rubyvm'
make[2]: Entering directory '/tmp/ruby/build/trunk/ext/ripper'
make[2]: Leaving directory '/tmp/ruby/build/trunk/ext/rubyvm'
make[2]: Leaving directory '/tmp/ruby/build/trunk/ext/psych'
make[2]: Leaving directory '/tmp/ruby/build/trunk/ext/ripper'
make[2]: Leaving directory '/tmp/ruby/build/trunk/ext/openssl'
make[2]: Entering directory '/tmp/ruby/build/trunk/ext/strscan'
make[2]: Entering directory '/tmp/ruby/build/trunk/.bundle/gems/bigdecimal-3.1.9/ext/bigdecimal'
make[2]: Entering directory '/tmp/ruby/build/trunk/ext/socket'
make[2]: Leaving directory '/tmp/ruby/build/trunk/ext/strscan'
make[2]: Entering directory '/tmp/ruby/build/trunk/.bundle/gems/debug-1.10.0/ext/debug'
make[2]: Entering directory '/tmp/ruby/build/trunk/.bundle/gems/fiddle-1.1.8/ext/fiddle'
make[2]: Leaving directory '/tmp/ruby/build/trunk/ext/socket'
make[2]: Entering directory '/tmp/ruby/build/trunk/.bundle/gems/nkf-0.2.0/ext/nkf'
make[2]: Leaving directory '/tmp/ruby/build/trunk/.bundle/gems/bigdecimal-3.1.9/ext/bigdecimal'
make[2]: Entering directory '/tmp/ruby/build/trunk/.bundle/gems/racc-1.8.1/ext/racc/cparse'
make[2]: Leaving directory '/tmp/ruby/build/trunk/.bundle/gems/debug-1.10.0/ext/debug'
make[2]: Leaving directory '/tmp/ruby/build/trunk/.bundle/gems/fiddle-1.1.8/ext/fiddle'
make[2]: Entering directory '/tmp/ruby/build/trunk/.bundle/gems/syslog-0.3.0/ext/syslog'
make[2]: Entering directory '/tmp/ruby/build/trunk/.bundle/gems/rbs-3.9.3/ext/rbs_extension'
make[2]: Leaving directory '/tmp/ruby/build/trunk/.bundle/gems/rbs-3.9.3/ext/rbs_extension'
make[2]: Leaving directory '/tmp/ruby/build/trunk/.bundle/gems/nkf-0.2.0/ext/nkf'
make[2]: Leaving directory '/tmp/ruby/build/trunk/.bundle/gems/racc-1.8.1/ext/racc/cparse'
make[2]: Entering directory '/tmp/ruby/build/trunk/ext/digest/sha2'
make[2]: Leaving directory '/tmp/ruby/build/trunk/.bundle/gems/syslog-0.3.0/ext/syslog'
make[2]: Leaving directory '/tmp/ruby/build/trunk/ext/digest/sha2'
make[2]: Entering directory '/tmp/ruby/build/trunk'
make[2]: 'ruby' is up to date.
make[2]: Leaving directory '/tmp/ruby/build/trunk'
make[1]: Leaving directory '/tmp/ruby/build/trunk'
make[1]: Entering directory '/tmp/ruby/build/trunk'
make[1]: Nothing to be done for 'note'.
make[1]: Leaving directory '/tmp/ruby/build/trunk'
./miniruby -I/tmp/ruby/src/trunk/lib -I. -I.ext/common /tmp/ruby/src/trunk/tool/runruby.rb --extout=.ext -- --disable-gems -r./riscv64-linux-fake /tmp/ruby/src/trunk/tool/rbinstall.rb --make="make" --dest-dir="" --extout=".ext" --ext-build-dir="./ext" --mflags="-j4 --jobserver-auth=4,5" --make-flags=" -j4 --jobserver-auth=4,5" --data-mode=0644 --prog-mode=0755 --installed-list .installed.list --mantype="doc" --gnumake --install=all --exclude=doc
installing binary commands: /tmp/ruby/install/trunk/bin
installing base libraries: /tmp/ruby/install/trunk/lib
installing arch files: /tmp/ruby/install/trunk/lib/ruby/3.5.0+0/riscv64-linux
installing pkgconfig data: /tmp/ruby/install/trunk/lib/pkgconfig
installing extension objects: /tmp/ruby/install/trunk/lib/ruby/3.5.0+0/riscv64-linux
installing extension objects: /tmp/ruby/install/trunk/lib/ruby/site_ruby/3.5.0+0/riscv64-linux
installing extension objects: /tmp/ruby/install/trunk/lib/ruby/vendor_ruby/3.5.0+0/riscv64-linux
installing extension headers: /tmp/ruby/install/trunk/include/ruby-3.5.0+0/riscv64-linux
installing extension scripts: /tmp/ruby/install/trunk/lib/ruby/3.5.0+0
installing extension scripts: /tmp/ruby/install/trunk/lib/ruby/site_ruby/3.5.0+0
installing extension scripts: /tmp/ruby/install/trunk/lib/ruby/vendor_ruby/3.5.0+0
installing extension headers: /tmp/ruby/install/trunk/include/ruby-3.5.0+0/ruby
installing command scripts: /tmp/ruby/install/trunk/bin
installing library scripts: /tmp/ruby/install/trunk/lib/ruby/3.5.0+0
installing common headers: /tmp/ruby/install/trunk/include/ruby-3.5.0+0
installing manpages: /tmp/ruby/install/trunk/share/man/man1
installing default gems from lib: /tmp/ruby/install/trunk/lib/ruby/gems/3.5.0+0
bundler 2.7.0.dev
delegate 0.4.0
did_you_mean 2.0.0
english 0.8.0
erb 5.0.0
error_highlight 0.7.0
fileutils 1.7.3
find 0.2.0
forwardable 1.3.3
ipaddr 1.2.7
net-http 0.6.0
net-protocol 0.2.2
open-uri 0.5.0
open3 0.2.1
optparse 0.7.0.dev.2
pp 0.6.2
prettyprint 0.2.0
prism 1.4.0
resolv 0.6.0
ruby2_keywords 0.0.5
securerandom 0.4.1
shellwords 0.2.2
singleton 0.3.0
syntax_suggest 2.0.2
tempfile 0.3.1
time 0.4.1
timeout 0.4.3
tmpdir 0.3.1
tsort 0.2.0
un 0.3.0
uri 1.0.3
weakref 0.1.3
yaml 0.4.0
installing default gems from ext: /tmp/ruby/install/trunk/lib/ruby/gems/3.5.0+0
date 3.4.1
digest 3.2.0
etc 1.4.5
fcntl 1.2.0
io-console 0.8.0
io-nonblock 0.3.1
io-wait 0.3.1
json 2.12.0
openssl 3.3.0
pathname 0.4.0
psych 5.2.6
stringio 3.1.8.dev
strscan 3.1.5.dev
zlib 3.2.1
installing bundled gems: /tmp/ruby/install/trunk/lib/ruby/gems/3.5.0+0
minitest 5.25.5
power_assert 2.0.5
rake 13.2.1
test-unit 3.6.8
rexml 3.4.1
rss 0.3.1
net-ftp 0.3.8
net-imap 0.5.8
net-pop 0.1.2
net-smtp 0.5.1
matrix 0.4.2
prime 0.1.3
rbs 3.9.3
typeprof 0.30.1
debug 1.10.0
racc 1.8.1
mutex_m 0.3.0
getoptlong 0.2.1
base64 0.2.0
bigdecimal 3.1.9
observer 0.1.2
abbrev 0.1.2
resolv-replace 0.1.1
rinda 0.2.0
drb 2.2.1
nkf 0.2.0
syslog 0.3.0
csv 3.3.4
repl_type_completor 0.1.11
ostruct 0.6.1
pstore 0.2.0
benchmark 0.4.0
logger 1.7.0
rdoc 6.13.1
irb 1.15.2
reline 0.6.1
readline 0.0.4
fiddle 1.1.8
installing bundled gem cache: /tmp/ruby/install/trunk/lib/ruby/gems/3.5.0+0/cache
skipped bundled gems:
win32ole-1.9.2.gem not found in bundled_gems
$$$[end] "make install -j4" exit with 0.
$$$[beg] make yes-btest TESTOPTS='-q -j4'
PASS all 2029 tests
$$$[end] "make yes-btest TESTOPTS='-q -j4'" exit with 0.
$$$[beg] make yes-test-basic TESTS='-j4'
BASERUBY = /usr/bin/ruby --disable=gems
CC = gcc
LD = ld
LDSHARED = gcc -shared
CFLAGS = -fstack-protector-strong -U_FORTIFY_SOURCE -D_FORTIFY_SOURCE=2 -O3 -fno-fast-math -ggdb3 -Wall -Wextra -Wdeprecated-declarations -Wdiv-by-zero -Wduplicated-cond -Wimplicit-function-declaration -Wimplicit-int -Wpointer-arith -Wwrite-strings -Wold-style-definition -Wimplicit-fallthrough=0 -Wmissing-noreturn -Wno-cast-function-type -Wno-constant-logical-operand -Wno-long-long -Wno-missing-field-initializers -Wno-overlength-strings -Wno-packed-bitfield-compat -Wno-parentheses-equality -Wno-self-assign -Wno-tautological-compare -Wno-unused-parameter -Wno-unused-value -Wsuggest-attribute=format -Wsuggest-attribute=noreturn -Wunused-variable -Wmisleading-indentation -Wundef -fPIC
XCFLAGS = -fno-strict-overflow -fvisibility=hidden -fexcess-precision=standard -DRUBY_EXPORT -I. -I.ext/include/riscv64-linux -I.ext/include -I/tmp/ruby/src/trunk/include -I/tmp/ruby/src/trunk -I/tmp/ruby/src/trunk/prism -I/tmp/ruby/src/trunk/enc/unicode/16.0.0 -Dmodular_gc_dir=
CPPFLAGS =
DLDFLAGS = -Wl,--compress-debug-sections=zlib -Wl,-soname,libruby.so.3.5 -fstack-protector-strong
SOLIBS = -lz -lrt -lrt -lgmp -ldl -lcrypt -lm -lpthread
LANG = C.UTF-8
LC_ALL =
LC_CTYPE =
MFLAGS =
RUSTC = rustc
YJIT_RUSTC_ARGS = --crate-name=yjit --crate-type=staticlib --edition=2021 -g -C lto=thin -C opt-level=3 -C overflow-checks=on '--out-dir=/tmp/ruby/build/trunk/yjit/target/release/' /tmp/ruby/src/trunk/yjit/src/lib.rs
ZJIT_RUSTC_ARGS = --crate-name=zjit --crate-type=staticlib --edition=2024 -g -C lto=thin -C opt-level=3 -C overflow-checks=on '--out-dir=/tmp/ruby/build/trunk/zjit/target/release/' /tmp/ruby/src/trunk/zjit/src/lib.rs
gcc (Debian 13.2.0-23revyos1) 13.2.0
Copyright (C) 2023 Free Software Foundation, Inc.
This is free software; see the source for copying conditions. There is NO
warranty; not even for MERCHANTABILITY or FITNESS FOR A PARTICULAR PURPOSE.
Checking leaked global symbols...none
/tmp/ruby/src/trunk/basictest/test.rb:assignment ....................................................................................................................................................................................................................................................................................................................................................................................OK 372
/tmp/ruby/src/trunk/basictest/test.rb:condition ..OK 2
/tmp/ruby/src/trunk/basictest/test.rb:if/unless ...OK 3
/tmp/ruby/src/trunk/basictest/test.rb:case .....OK 5
/tmp/ruby/src/trunk/basictest/test.rb:while/until ........OK 8
/tmp/ruby/src/trunk/basictest/test.rb:exception ..........OK 10
/tmp/ruby/src/trunk/basictest/test.rb:array .......................................OK 39
/tmp/ruby/src/trunk/basictest/test.rb:hash ...........................OK 27
/tmp/ruby/src/trunk/basictest/test.rb:iterator ...........................................................................................................OK 107
/tmp/ruby/src/trunk/basictest/test.rb:float ................................................................................OK 80
/tmp/ruby/src/trunk/basictest/test.rb:bignum ...............................OK 31
/tmp/ruby/src/trunk/basictest/test.rb:string & char ..............................................................OK 62
/tmp/ruby/src/trunk/basictest/test.rb:assignment ..........OK 10
/tmp/ruby/src/trunk/basictest/test.rb:call ......OK 6
/tmp/ruby/src/trunk/basictest/test.rb:proc .........OK 9
/tmp/ruby/src/trunk/basictest/test.rb:signal ..OK 2
/tmp/ruby/src/trunk/basictest/test.rb:eval ...........................OK 27
/tmp/ruby/src/trunk/basictest/test.rb:system ........OK 8
/tmp/ruby/src/trunk/basictest/test.rb:const .....OK 5
/tmp/ruby/src/trunk/basictest/test.rb:clone .....OK 5
/tmp/ruby/src/trunk/basictest/test.rb:marshal ....OK 4
/tmp/ruby/src/trunk/basictest/test.rb:pack ....OK 4
/tmp/ruby/src/trunk/basictest/test.rb:math ..OK 2
/tmp/ruby/src/trunk/basictest/test.rb:struct ......OK 6
/tmp/ruby/src/trunk/basictest/test.rb:variable ............OK 12
/tmp/ruby/src/trunk/basictest/test.rb:trace ...OK 3
/tmp/ruby/src/trunk/basictest/test.rb:defined? ............OK 12
/tmp/ruby/src/trunk/basictest/test.rb:alias ......OK 6
/tmp/ruby/src/trunk/basictest/test.rb:path .......................OK 23
/tmp/ruby/src/trunk/basictest/test.rb:gc ....OK 4
test succeeded
$$$[end] "make yes-test-basic TESTS='-j4'" exit with 0.
$$$[beg] make yes-test-all TESTOPTS='--stderr-on-failure' TESTS='-j4'
BASERUBY = /usr/bin/ruby --disable=gems
CC = gcc
LD = ld
LDSHARED = gcc -shared
CFLAGS = -fstack-protector-strong -U_FORTIFY_SOURCE -D_FORTIFY_SOURCE=2 -O3 -fno-fast-math -ggdb3 -Wall -Wextra -Wdeprecated-declarations -Wdiv-by-zero -Wduplicated-cond -Wimplicit-function-declaration -Wimplicit-int -Wpointer-arith -Wwrite-strings -Wold-style-definition -Wimplicit-fallthrough=0 -Wmissing-noreturn -Wno-cast-function-type -Wno-constant-logical-operand -Wno-long-long -Wno-missing-field-initializers -Wno-overlength-strings -Wno-packed-bitfield-compat -Wno-parentheses-equality -Wno-self-assign -Wno-tautological-compare -Wno-unused-parameter -Wno-unused-value -Wsuggest-attribute=format -Wsuggest-attribute=noreturn -Wunused-variable -Wmisleading-indentation -Wundef -fPIC
XCFLAGS = -fno-strict-overflow -fvisibility=hidden -fexcess-precision=standard -DRUBY_EXPORT -I. -I.ext/include/riscv64-linux -I.ext/include -I/tmp/ruby/src/trunk/include -I/tmp/ruby/src/trunk -I/tmp/ruby/src/trunk/prism -I/tmp/ruby/src/trunk/enc/unicode/16.0.0 -Dmodular_gc_dir=
CPPFLAGS =
DLDFLAGS = -Wl,--compress-debug-sections=zlib -Wl,-soname,libruby.so.3.5 -fstack-protector-strong
SOLIBS = -lz -lrt -lrt -lgmp -ldl -lcrypt -lm -lpthread
LANG = C.UTF-8
LC_ALL =
LC_CTYPE =
MFLAGS =
RUSTC = rustc
YJIT_RUSTC_ARGS = --crate-name=yjit --crate-type=staticlib --edition=2021 -g -C lto=thin -C opt-level=3 -C overflow-checks=on '--out-dir=/tmp/ruby/build/trunk/yjit/target/release/' /tmp/ruby/src/trunk/yjit/src/lib.rs
ZJIT_RUSTC_ARGS = --crate-name=zjit --crate-type=staticlib --edition=2024 -g -C lto=thin -C opt-level=3 -C overflow-checks=on '--out-dir=/tmp/ruby/build/trunk/zjit/target/release/' /tmp/ruby/src/trunk/zjit/src/lib.rs
gcc (Debian 13.2.0-23revyos1) 13.2.0
Copyright (C) 2023 Free Software Foundation, Inc.
This is free software; see the source for copying conditions. There is NO
warranty; not even for MERCHANTABILITY or FITNESS FOR A PARTICULAR PURPOSE.
generating enc.mk
making enc
make[1]: Entering directory '/tmp/ruby/build/trunk'
make[1]: Nothing to be done for 'enc'.
make[1]: Leaving directory '/tmp/ruby/build/trunk'
making srcs under enc
make[1]: Entering directory '/tmp/ruby/build/trunk'
make[1]: Nothing to be done for 'srcs'.
make[1]: Leaving directory '/tmp/ruby/build/trunk'
generating transdb.h
transdb.h unchanged
making trans
make[1]: Entering directory '/tmp/ruby/build/trunk'
make[1]: Nothing to be done for 'trans'.
make[1]: Leaving directory '/tmp/ruby/build/trunk'
making encs
make[1]: Entering directory '/tmp/ruby/build/trunk'
make[1]: Nothing to be done for 'encs'.
make[1]: Leaving directory '/tmp/ruby/build/trunk'
generating makefiles ext/configure-ext.mk
ext/configure-ext.mk updated
make[1]: Entering directory '/tmp/ruby/build/trunk'
make[1]: Leaving directory '/tmp/ruby/build/trunk'
generating makefile exts.mk
exts.mk unchanged
make[1]: Entering directory '/tmp/ruby/build/trunk'
make[2]: Entering directory '/tmp/ruby/build/trunk/ext/coverage'
make[2]: Leaving directory '/tmp/ruby/build/trunk/ext/coverage'
make[2]: Entering directory '/tmp/ruby/build/trunk/ext/date'
make[2]: Leaving directory '/tmp/ruby/build/trunk/ext/date'
make[2]: Entering directory '/tmp/ruby/build/trunk/ext/digest'
make[2]: Leaving directory '/tmp/ruby/build/trunk/ext/digest'
make[2]: Entering directory '/tmp/ruby/build/trunk/ext/digest/sha2'
make[2]: Leaving directory '/tmp/ruby/build/trunk/ext/digest/sha2'
make[2]: Entering directory '/tmp/ruby/build/trunk/ext/io/console'
make[2]: Leaving directory '/tmp/ruby/build/trunk/ext/io/console'
make[2]: Entering directory '/tmp/ruby/build/trunk/ext/json'
make[2]: Leaving directory '/tmp/ruby/build/trunk/ext/json'
make[2]: Entering directory '/tmp/ruby/build/trunk/ext/monitor'
make[2]: Leaving directory '/tmp/ruby/build/trunk/ext/monitor'
make[2]: Entering directory '/tmp/ruby/build/trunk/ext/objspace'
make[2]: Leaving directory '/tmp/ruby/build/trunk/ext/objspace'
make[2]: Entering directory '/tmp/ruby/build/trunk/ext/openssl'
make[2]: Leaving directory '/tmp/ruby/build/trunk/ext/openssl'
make[2]: Entering directory '/tmp/ruby/build/trunk/ext/pathname'
make[2]: Leaving directory '/tmp/ruby/build/trunk/ext/pathname'
make[2]: Entering directory '/tmp/ruby/build/trunk/ext/psych'
make[2]: Leaving directory '/tmp/ruby/build/trunk/ext/psych'
make[2]: Entering directory '/tmp/ruby/build/trunk/ext/pty'
make[2]: Leaving directory '/tmp/ruby/build/trunk/ext/pty'
make[2]: Entering directory '/tmp/ruby/build/trunk/ext/ripper'
make[2]: Leaving directory '/tmp/ruby/build/trunk/ext/ripper'
make[2]: Entering directory '/tmp/ruby/build/trunk/ext/rubyvm'
make[2]: Leaving directory '/tmp/ruby/build/trunk/ext/rubyvm'
make[2]: Entering directory '/tmp/ruby/build/trunk/ext/socket'
make[2]: Leaving directory '/tmp/ruby/build/trunk/ext/socket'
make[2]: Entering directory '/tmp/ruby/build/trunk/ext/strscan'
make[2]: Leaving directory '/tmp/ruby/build/trunk/ext/strscan'
make[2]: Entering directory '/tmp/ruby/build/trunk/.bundle/gems/bigdecimal-3.1.9/ext/bigdecimal'
make[2]: Leaving directory '/tmp/ruby/build/trunk/.bundle/gems/bigdecimal-3.1.9/ext/bigdecimal'
make[2]: Entering directory '/tmp/ruby/build/trunk/.bundle/gems/debug-1.10.0/ext/debug'
make[2]: Leaving directory '/tmp/ruby/build/trunk/.bundle/gems/debug-1.10.0/ext/debug'
make[2]: Entering directory '/tmp/ruby/build/trunk/.bundle/gems/fiddle-1.1.8/ext/fiddle'
make[2]: Leaving directory '/tmp/ruby/build/trunk/.bundle/gems/fiddle-1.1.8/ext/fiddle'
make[2]: Entering directory '/tmp/ruby/build/trunk/.bundle/gems/nkf-0.2.0/ext/nkf'
make[2]: Leaving directory '/tmp/ruby/build/trunk/.bundle/gems/nkf-0.2.0/ext/nkf'
make[2]: Entering directory '/tmp/ruby/build/trunk/.bundle/gems/racc-1.8.1/ext/racc/cparse'
make[2]: Leaving directory '/tmp/ruby/build/trunk/.bundle/gems/racc-1.8.1/ext/racc/cparse'
make[2]: Entering directory '/tmp/ruby/build/trunk/.bundle/gems/rbs-3.9.3/ext/rbs_extension'
make[2]: Leaving directory '/tmp/ruby/build/trunk/.bundle/gems/rbs-3.9.3/ext/rbs_extension'
make[2]: Entering directory '/tmp/ruby/build/trunk/.bundle/gems/syslog-0.3.0/ext/syslog'
make[2]: Leaving directory '/tmp/ruby/build/trunk/.bundle/gems/syslog-0.3.0/ext/syslog'
make[2]: Entering directory '/tmp/ruby/build/trunk'
make[2]: 'ruby' is up to date.
make[2]: Leaving directory '/tmp/ruby/build/trunk'
make[1]: Leaving directory '/tmp/ruby/build/trunk'
make[1]: Entering directory '/tmp/ruby/build/trunk'
make[1]: Nothing to be done for 'note'.
make[1]: Leaving directory '/tmp/ruby/build/trunk'
Run options:
--seed=8083
"--ruby=./miniruby -I/tmp/ruby/src/trunk/lib -I. -I.ext/common /tmp/ruby/src/trunk/tool/runruby.rb --extout=.ext -- --disable-gems"
--excludes-dir=/tmp/ruby/src/trunk/test/.excludes
--name=!/memory_leak/
--stderr-on-failure
-j4
# Running tests:
[ 1/753] 3202329=objspace/test_objspace
[ 2/753] 3202328=ruby/test_undef
[ 3/753] 3202327=rubygems/test_gem_security_trust_dir
[ 4/753] 3202328=ruby/test_string_memory
[ 5/753] 3202330=ruby/test_sprintf
[ 6/753] 3202328=rubygems/test_gem_requirement
[ 7/753] 3202327=prism/result/equality_test
[ 8/753] 3202327=prism/encoding/regular_expression_encoding_test
[ 9/753] 3202327=psych/test_set
[ 10/753] 3202327=rubygems/test_gem_commands_stale_command
[ 11/753] 3202327=-ext-/thread/test_lock_native_thread
[ 12/753] 3202328=rubygems/test_remote_fetch_error
[ 13/753] 3202328=mkmf/test_have_library
[ 14/753] 3202330=ruby/test_namespace
[ 15/753] 3202330=psych/test_hash
[ 16/753] 3202330=psych/test_tree_builder
[ 17/753] 3202330=rubygems/test_gem_resolver_dependency_request
[ 18/753] 3202327=-ext-/string/test_external_new
[ 19/753] 3202327=-ext-/postponed_job/test_postponed_job
[ 20/753] 3202330=psych/test_alias_and_anchor
[ 21/753] 3202330=rubygems/test_gem_request_set_lockfile
[ 22/753] 3202327=-ext-/load/test_protect
[ 23/753] 3202327=ruby/test_weakmap
[ 24/753] 3202330=ruby/test_yjit
[ 25/753] 3202330=uri/test_ws
[ 26/753] 3202330=ruby/test_m17n
[ 27/753] 3202330=rubygems/test_gem_commands_environment_command
[ 28/753] 3202330=ruby/test_argf
[ 29/753] 3202328=openssl/test_ns_spki
[ 30/753] 3202328=mkmf/test_framework
[ 31/753] 3202328=-ext-/win32/test_console_attr
[ 32/753] 3202328=optparse/test_summary
[ 33/753] 3202328=rubygems/test_gem_commands_exec_command
[ 34/753] 3202327=io/wait/test_io_wait
[ 35/753] 3202327=optparse/test_kwargs
[ 36/753] 3202327=-ext-/string/test_ellipsize
[ 37/753] 3202327=date/test_date_attr
[ 38/753] 3202327=fiber/test_io
[ 39/753] 3202328=ruby/enc/test_emoji
[ 40/753] 3202328=set/test_sorted_set
[ 41/753] 3202327=-ext-/gvl/test_ubf_async_safe
[ 42/753] 3202327=ruby/test_hash
[ 43/753] 3202328=rubygems/test_gem_unsatisfiable_dependency_error
[ 44/753] 3202328=ruby/enc/test_cp949
[ 45/753] 3202328=rubygems/test_gem_source_specific_file
[ 46/753] 3202328=-ext-/st/test_foreach
[ 47/753] 3202328=ruby/test_condition
[ 48/753] 3202328=rubygems/test_gem_commands_uninstall_command
[ 49/753] 3202328=ruby/test_method
[ 50/753] 3202330=rubygems/test_gem_commands_query_command
[ 51/753] 3202330=rubygems/test_gem_impossible_dependencies_error
[ 52/753] 3202330=dtrace/test_array_create
[ 53/753] 3202330=-ext-/bignum/test_pack
[ 54/753] 3202330=did_you_mean/spell_checking/test_pattern_key_name_check
[ 55/753] 3202330=psych/visitors/test_to_ruby
[ 56/753] 3202330=uri/test_ftp
[ 57/753] 3202330=ruby/enc/test_euc_kr
[ 58/753] 3202330=ruby/test_system
[ 59/753] 3202327=openssl/test_pkcs12
[ 60/753] 3202329=-ext-/bignum/test_bigzero
[ 61/753] 3202329=openssl/test_pkey_dh
[ 62/753] 3202330=prism/result/source_location_test
[ 63/753] 3202329=rubygems/test_gem_package_tar_header
[ 64/753] 3202330=-ext-/iseq_load/test_iseq_load
[ 65/753] 3202329=rubygems/test_gem_util
[ 66/753] 3202327=rubygems/test_gem_config_file
[ 67/753] 3202329=ripper/test_ripper
[ 68/753] 3202327=net/protocol/test_protocol
[ 69/753] 3202327=optparse/test_getopts
[ 70/753] 3202327=rubygems/test_gem_resolver_activation_request
[ 71/753] 3202327=ruby/test_yjit_exit_locations
[ 72/753] 3202327=etc/test_etc
[ 73/753] 3202327=psych/visitors/test_yaml_tree
[ 74/753] 3202328=-ext-/namespace/test_load_ext
[ 75/753] 3202328=mkmf/test_libs
[ 76/753] 3202327=dtrace/test_gc
[ 77/753] 3202327=rubygems/test_gem_commands_fetch_command
[ 78/753] 3202328=ruby/test_math
[ 79/753] 3202328=fiber/test_sleep
[ 80/753] 3202327=rubygems/test_config
[ 81/753] 3202329=ruby/test_autoload
[ 82/753] 3202327=ruby/enc/test_utf16
[ 83/753] 3202328=prism/result/numeric_value_test
[ 84/753] 3202327=ruby/test_io
[ 85/753] 3202328=ruby/test_unicode_escape
[ 86/753] 3202328=ruby/test_case
[ 87/753] 3202328=mkmf/test_sizeof
[ 88/753] 3202330=fiber/test_io_buffer
[ 89/753] 3202330=ruby/test_backtrace
[ 90/753] 3202330=rubygems/test_gem_resolver_conflict
[ 91/753] 3202330=prism/result/regular_expression_options_test
[ 92/753] 3202330=prism/locals_test
[ 93/753] 3202330=rubygems/test_gem_commands_install_command
[ 94/753] 3202330=ruby/test_clone
[ 95/753] 3202330=io/console/test_ractor
[ 96/753] 3202330=ruby/test_readpartial
[ 97/753] 3202330=-ext-/string/test_fstring
[ 98/753] 3202330=psych/test_array
[ 99/753] 3202330=optparse/test_optparse
[100/753] 3202330=-ext-/rational/test_rat
[101/753] 3202330=rubygems/test_webauthn_poller
[102/753] 3202330=-ext-/typeddata/test_typeddata
[103/753] 3202329=rubygems/test_gem_resolver_best_set
[104/753] 3202329=strscan/test_stringscanner
[105/753] 3202329=ripper/test_files_sample
[106/753] 3202329=mkmf/test_convertible
[107/753] 3202330=ruby/test_yield
[108/753] 3202328=-ext-/wait/test_wait
[109/753] 3202328=test_forwardable
[110/753] 3202328=psych/test_yaml
[111/753] 3202328=-ext-/bignum/test_big2str
[112/753] 3202328=rubygems/test_gem_commands_sources_command
[113/753] 3202328=ruby/enc/test_euc_tw
[114/753] 3202328=io/wait/test_ractor
[115/753] 3202328=-ext-/proc/test_bmethod
[116/753] 3202328=ruby/test_thread_queue
[117/753] 3202327=fileutils/test_nowrite
[118/753] 3202327=prism/result/index_write_test
[119/753] 3202327=ruby/test_comparable
[120/753] 3202327=json/json_fixtures_test
[121/753] 3202327=ruby/test_shapes
[122/753] 3202327=ruby/test_io_timeout
[123/753] 3202327=-ext-/debug/test_profile_frames
[124/753] 3202327=-ext-/string/test_cstr
[125/753] 3202327=ruby/test_warning
[126/753] 3202327=-ext-/string/test_enc_str_buf_cat
[127/753] 3202327=-ext-/class/test_class2name
[128/753] 3202327=ruby/enc/test_gbk
[129/753] 3202327=rubygems/test_require
[130/753] 3202328=rubygems/test_gem_commands_contents_command
[131/753] 3202328=psych/test_psych_set
[132/753] 3202328=rubygems/test_gem_ext_cmake_builder
[133/753] 3202328=digest/test_digest
[134/753] 3202328=psych/test_marshalable
[135/753] 3202328=test_find
[136/753] 3202328=digest/test_ractor
[137/753] 3202328=uri/test_wss
[138/753] 3202328=uri/test_file
[139/753] 3202328=-ext-/string/test_modify_expand
[140/753] 3202328=rubygems/test_gem_available_set
[141/753] 3202328=pathname/test_pathname
[142/753] 3202327=ruby/test_complexrational
[143/753] 3202327=rubygems/test_gem_package_tar_reader
[144/753] 3202327=prism/regexp_test
[145/753] 3202327=coverage/test_coverage
[146/753] 3202328=psych/handlers/test_recorder
[147/753] 3202328=rubygems/test_gem_commands_owner_command
[148/753] 3202328=rubygems/test_gem_source_vendor
[149/753] 3202328=optparse/test_bash_completion
[150/753] 3202328=rubygems/test_deprecate
[151/753] 3202328=ruby/test_zjit
[152/753] 3202328=rubygems/test_gem_installer
[153/753] 3202327=psych/test_yamlstore
[154/753] 3202327=prism/encoding/symbol_encoding_test
[155/753] 3202327=date/test_date_strftime
[156/753] 3202330=openssl/test_asn1
[157/753] 3202330=openssl/test_random
[158/753] 3202330=optparse/test_load
[159/753] 3202330=json/json_string_matching_test
[160/753] 3202330=ruby/test_const
[161/753] 3202330=ruby/test_class
[162/753] 3202327=optparse/test_noarg
[163/753] 3202327=prism/ruby/pattern_test
[164/753] 3202327=test_tempfile
[165/753] 3202327=fiber/test_queue
[166/753] 3202327=prism/ruby/desugar_compiler_test
[167/753] 3202327=rubygems/test_gem_resolver_index_specification
[168/753] 3202327=-ext-/marshal/test_internal_ivar
[169/753] 3202327=-ext-/tracepoint/test_tracepoint
[170/753] 3202327=test_prettyprint
[171/753] 3202327=rubygems/test_gem_commands_help_command
[172/753] 3202327=-ext-/struct/test_duplicate
[173/753] 3202327=socket/test_basicsocket
[174/753] 3202327=ruby/enc/test_utf32
[175/753] 3202327=-ext-/string/test_too_many_dummy_encodings
[176/753] 3202327=optparse/test_reqarg
[177/753] 3202327=ruby/test_stack
[178/753] 3202329=rubygems/test_gem_commands_list_command
[179/753] 3202329=uri/test_ldap
[180/753] 3202329=resolv/test_resource
[181/753] 3202329=rubygems/test_gem_commands_signin_command
[182/753] 3202329=psych/visitors/test_emitter
[183/753] 3202329=prism/encoding/encodings_test
[184/753] 3202329=fileutils/test_fileutils
[185/753] 3202329=ruby/enc/test_cesu8
[186/753] 3202329=ruby/test_econv
[187/753] 3202327=rubygems/test_gem_version
[188/753] 3202327=-ext-/path_to_class/test_path_to_class
[189/753] 3202327=prism/lex_test
[190/753] 3202329=rubygems/test_gem_dependency
[191/753] 3202329=-ext-/stack/test_stack_overflow
[192/753] 3202329=rubygems/test_gem_resolver_specification
[193/753] 3202329=ruby/test_inlinecache
[194/753] 3202329=ruby/test_complex
[195/753] 3202327=rubygems/test_gem_commands_search_command
[196/753] 3202327=dtrace/test_method_cache
[197/753] 3202327=rubygems/test_gem_stub_specification
[198/753] 3202329=ruby/test_frozen_error
[199/753] 3202329=rubygems/test_gem_ext_ext_conf_builder
[200/753] 3202327=rubygems/test_gem_resolver_installed_specification
[201/753] 3202328=prism/result/string_test
[202/753] 3202327=ripper/test_scanner_events
[203/753] 3202328=rubygems/test_gem_remote_fetcher
[204/753] 3202327=ruby/test_parse
[205/753] 3202328=resolv/test_mdns
[206/753] 3202328=test_securerandom
[207/753] 3202328=psych/test_data
[208/753] 3202328=json/json_coder_test
[209/753] 3202328=io/console/test_io_console
[210/753] 3202327=io/nonblock/test_flush
[211/753] 3202327=test_singleton
[212/753] 3202327=date/test_switch_hitter
[213/753] 3202327=did_you_mean/spell_checking/test_uncorrectable_name_check
[214/753] 3202327=prism/newline_test
[215/753] 3202327=dtrace/test_hash_create
[216/753] 3202327=ruby/test_stringchar
[217/753] 3202327=-ext-/funcall/test_passing_block
[218/753] 3202327=ruby/test_process
[219/753] 3202329=-ext-/gvl/test_last_thread
[220/753] 3202328=ruby/test_pack
[221/753] 3202329=prism/api/command_line_test
[222/753] 3202329=rubygems/test_gem_source_local
[223/753] 3202328=rubygems/test_gem_security_policy
[224/753] 3202329=rubygems/test_gem_ext_rake_builder
[225/753] 3202328=-ext-/method/test_arity
[226/753] 3202328=rubygems/test_gem_resolver_lock_specification
[227/753] 3202328=ruby/test_gc
[228/753] 3202329=openssl/test_x509cert
[229/753] 3202329=ruby/enc/test_shift_jis
[230/753] 3202329=rubygems/test_gem_commands_which_command
[231/753] 3202329=uri/test_http
[232/753] 3202329=ruby/test_enumerator
[233/753] 3202330=-ext-/symbol/test_inadvertent_creation
[234/753] 3202330=mkmf/test_flags
[235/753] 3202330=rubygems/test_gem_commands_specification_command
[236/753] 3202330=prism/ruby/reflection_test
[237/753] 3202330=rubygems/test_gem_commands_dependency_command
[238/753] 3202330=rubygems/test_gem_resolver_composed_set
[239/753] 3202330=psych/test_safe_load
[240/753] 3202330=rubygems/test_gem_resolver
[241/753] 3202330=ruby/test_name_error
[242/753] 3202330=open-uri/test_open-uri
[243/753] 3202330=net/http/test_httpresponse
[244/753] 3202330=psych/test_stream
[245/753] 3202330=ruby/enc/test_iso_8859
[246/753] 3202330=socket/test_tcp
[247/753] 3202330=rubygems/test_gem_safe_yaml
[248/753] 3202330=ruby/test_syntax
[249/753] 3202329=ruby/test_data
[250/753] 3202329=date/test_date_new
[251/753] 3202329=psych/test_date_time
[252/753] 3202329=dtrace/test_require
[253/753] 3202329=prism/ruby/parameters_signature_test
[254/753] 3202329=rubygems/test_gem_dependency_installer
[255/753] 3202328=psych/test_scalar
[256/753] 3202328=rubygems/test_gem_commands_info_command
[257/753] 3202328=ruby/enc/test_case_options
[258/753] 3202328=yaml/test_store
[259/753] 3202328=ruby/test_exception
[260/753] 3202329=-ext-/bug_reporter/test_bug_reporter
[261/753] 3202329=ruby/test_rand
[262/753] 3202329=rubygems/test_gem_name_tuple
[263/753] 3202329=rubygems/test_gem_package_tar_reader_entry
[264/753] 3202329=cgi/test_cgi_escape
[265/753] 3202329=rubygems/test_gem_ext_cargo_builder_link_flag_converter
[266/753] 3202329=rubygems/test_gem_commands_mirror
[267/753] 3202329=rubygems/test_gem_request
[268/753] 3202329=ruby/test_method_cache
[269/753] 3202329=ruby/test_sprintf_comb
[270/753] 3202330=uri/test_generic
[271/753] 3202330=-ext-/test_scan_args
[272/753] 3202330=-ext-/test_enumerator_kw
[273/753] 3202330=rubygems/test_gem_text
[274/753] 3202330=ruby/test_settracefunc
[275/753] 3202329=prism/ruby/tunnel_test
[276/753] 3202329=openssl/test_pkey
[277/753] 3202329=ripper/test_parser_events
[278/753] 3202329=optparse/test_cclass
[279/753] 3202329=rubygems/test_gem_request_connection_pools
[280/753] 3202327=ruby/enc/test_grapheme_breaks
[281/753] 3202327=rubygems/test_gem_version_option
[282/753] 3202329=ruby/test_m17n_comb
[283/753] 3202327=fiber/test_ractor
[284/753] 3202327=psych/test_json_tree
[285/753] 3202327=stringio/test_ractor
[286/753] 3202327=ruby/test_require_lib
[287/753] 3202328=rubygems/test_gem_install_update_options
[288/753] 3202328=rubygems/test_gem_stream_ui
[289/753] 3202330=test_extlibs
[290/753] 3202328=ruby/test_literal
[291/753] 3202328=-ext-/bignum/test_str2big
[292/753] 3202328=-ext-/load/test_dot_dot
[293/753] 3202328=socket/test_socket
[294/753] 3202330=fiber/test_thread
[295/753] 3202330=rubygems/test_gem_remote_fetcher_s3
[296/753] 3202330=prism/ruby/location_test
[297/753] 3202330=ruby/test_objectspace
[298/753] 3202327=zlib/test_zlib
[299/753] 3202328=mkmf/test_egrep_cpp
[300/753] 3202328=erb/test_erb_m17n
[301/753] 3202328=ruby/test_optimization
[302/753] 3202329=date/test_date_conv
[303/753] 3202329=prism/result/integer_parse_test
[304/753] 3202329=ruby/test_proc
[305/753] 3202327=ruby/test_string
[306/753] 3202329=ruby/test_gc_compact
[307/753] 3202330=rubygems/test_gem_resolver_index_set
[308/753] 3202330=rubygems/test_gem_package_old
[309/753] 3202330=rubygems/test_gem_validator
[310/753] 3202330=did_you_mean/spell_checking/test_require_path_check
[311/753] 3202330=ruby/test_fnmatch
[312/753] 3202330=ripper/test_files_test_2
[313/753] 3202328=ruby/test_pattern_matching
[314/753] 3202328=psych/test_string
[315/753] 3202328=-ext-/test_ensure_and_callcc
[316/753] 3202328=psych/visitors/test_depth_first
[317/753] 3202328=rubygems/test_gem_request_set_lockfile_parser
[318/753] 3202328=dtrace/test_raise
[319/753] 3202328=openssl/test_x509attr
[320/753] 3202328=json/json_addition_test
[321/753] 3202328=-ext-/string/test_qsort
[322/753] 3202328=rubygems/test_gem_dependency_resolution_error
[323/753] 3202328=psych/test_null
[324/753] 3202328=-ext-/bignum/test_mul
[325/753] 3202328=prism/newline_offsets_test
[326/753] 3202328=ruby/test_default_gems
[327/753] 3202328=prism/ruby/compiler_test
[328/753] 3202328=date/test_date_parse
[329/753] 3202329=ruby/test_pipe
[330/753] 3202328=test_trick
[331/753] 3202329=openssl/test_pkey_ec
[332/753] 3202329=prism/result/integer_base_flags_test
[333/753] 3202329=did_you_mean/spell_checking/test_key_name_check
[334/753] 3202329=ruby/test_defined
[335/753] 3202329=fiber/test_backtrace
[336/753] 3202329=ruby/test_io_buffer
[337/753] 3202329=prism/ruby/relocation_test
[338/753] 3202329=ruby/enc/test_windows_1251
[339/753] 3202329=ruby/test_time
[340/753] 3202329=rubygems/test_gem_uninstaller
[341/753] 3202330=openssl/test_buffering
[342/753] 3202330=resolv/test_svcb_https
[343/753] 3202330=ruby/enc/test_gb18030
[344/753] 3202330=prism/result/static_inspect_test
[345/753] 3202330=-ext-/test_bug-5832
[346/753] 3202330=ripper/test_files_ext
[347/753] 3202330=psych/test_emitter
[348/753] 3202330=rubygems/test_gem_silent_ui
[349/753] 3202330=openssl/test_kdf
[350/753] 3202330=rubygems/test_gem_doctor
[351/753] 3202330=rubygems/test_kernel
[352/753] 3202330=psych/test_psych
[353/753] 3202330=-ext-/exception/test_enc_raise
[354/753] 3202330=lib/!Nothing_to_test
[355/753] 3202330=dtrace/test_object_create_start
[356/753] 3202330=prism/snippets_test
[357/753] 3202329=-ext-/vm/test_at_exit
[358/753] 3202329=rubygems/test_gem_rdoc
[359/753] 3202329=date/test_date
[360/753] 3202329=prism/api/parse_success_test
[361/753] 3202329=rubygems/test_gem_ext_cargo_builder_unit
[362/753] 3202329=openssl/test_hmac
[363/753] 3202329=prism/api/parse_stream_test
[364/753] 3202329=ruby/test_numeric
[365/753] 3202329=ruby/test_assignment
[366/753] 3202328=ruby/test_ifunless
[367/753] 3202328=rubygems/test_gem_commands_lock_command
[368/753] 3202328=rubygems/test_gem_command
[369/753] 3202328=-ext-/test_bug-3571
[370/753] 3202328=uri/test_common
[371/753] 3202328=rubygems/test_gem_spec_fetcher
[372/753] 3202328=fiber/test_address_resolve
[373/753] 3202328=psych/test_yaml_special_cases
[374/753] 3202328=optparse/test_optarg
[375/753] 3202328=rubygems/test_gem_source_list
[376/753] 3202328=fileutils/test_verbose
[377/753] 3202328=-ext-/num2int/test_num2int
[378/753] 3202328=psych/test_nil
[379/753] 3202328=test_pp
[380/753] 3202328=rubygems/test_gem_remote_fetcher_local_server
[381/753] 3202328=ruby/test_frozen
[382/753] 3202328=rubygems/test_gem_ext_configure_builder
[383/753] 3202328=psych/test_exception
[384/753] 3202328=optparse/test_zsh_completion
[385/753] 3202328=-ext-/iter/test_iter_break
[386/753] 3202328=ruby/test_weakkeymap
[387/753] 3202330=rubygems/test_gem_commands_push_command
[388/753] 3202330=-ext-/st/test_numhash
[389/753] 3202330=openssl/test_pkey_rsa
[390/753] 3202328=rubygems/test_gem_platform
[391/753] 3202328=optparse/test_placearg
[392/753] 3202328=date/test_date_strptime
[393/753] 3202328=rubygems/test_gem_package_task
[394/753] 3202328=-ext-/hash/test_delete
[395/753] 3202328=did_you_mean/spell_checking/test_class_name_check
[396/753] 3202328=ruby/test_keyword
[397/753] 3202329=prism/api/dump_test
[398/753] 3202328=-ext-/win32/test_fd_setsize
[399/753] 3202328=ruby/test_continuation
[400/753] 3202328=ruby/test_file_exhaustive
[401/753] 3202330=rubygems/test_gem_update_suggestion
[402/753] 3202330=ripper/test_files_test
[403/753] 3202330=prism/result/attribute_write_test
[404/753] 3202330=ruby/test_not
[405/753] 3202330=rubygems/test_gem_resolver_lock_set
[406/753] 3202330=psych/test_object
[407/753] 3202330=prism/heredoc_dedent_test
[408/753] 3202330=prism/version_test
[409/753] 3202330=rubygems/test_gem_gemcutter_utilities
[410/753] 3202330=ruby/test_basicinstructions
[411/753] 3202330=prism/api/parse_test
[412/753] 3202330=rubygems/test_gem_command_manager
[413/753] 3202330=rubygems/test_gem_remote_fetcher_local_ssl_server
[414/753] 3202329=prism/api/lex_test
[415/753] 3202329=ruby/test_arithmetic_sequence
[416/753] 3202329=fiber/test_timeout
[417/753] 3202329=-ext-/string/test_normalize
[418/753] 3202329=openssl/test_ossl
[419/753] 3202330=did_you_mean/tree_spell/test_change_word
[420/753] 3202330=ruby/test_flip
[421/753] 3202330=ruby/test_sleep
[422/753] 3202327=ruby/test_object
[423/753] 3202330=date/test_date_arith
[424/753] 3202330=rubygems/test_gem_local_remote_options
[425/753] 3202330=ruby/enc/test_big5
[426/753] 3202330=pathname/test_ractor
[427/753] 3202330=-ext-/symbol/test_type
[428/753] 3202330=mkmf/test_signedness
[429/753] 3202327=test_tsort
[430/753] 3202327=prism/errors_test
[431/753] 3202327=rubygems/test_gem_commands_check_command
[432/753] 3202327=ruby/test_regexp
[433/753] 3202328=ruby/test_integer_comb
[434/753] 3202329=test_tmpdir
[435/753] 3202329=open-uri/test_ftp
[436/753] 3202329=ruby/test_vm_dump
[437/753] 3202329=ruby/test_object_id
[438/753] 3202329=socket/test_udp
[439/753] 3202329=prism/bom_test
[440/753] 3202329=-ext-/exception/test_data_error
[441/753] 3202329=ruby/test_file
[442/753] 3202329=prism/unescape_test
[443/753] 3202329=erb/test_erb_command
[444/753] 3202329=json/test_helper
[445/753] 3202329=ruby/test_encoding
[446/753] 3202329=rubygems/test_gem_uri_formatter
[447/753] 3202329=rubygems/test_project_sanity
[448/753] 3202330=ruby/test_range
[449/753] 3202329=mkmf/test_constant
[450/753] 3202328=test_pty
[451/753] 3202330=ruby/test_dup
[452/753] 3202330=-ext-/exception/test_ensured
[453/753] 3202330=resolv/test_addr
[454/753] 3202330=prism/library_symbols_test
[455/753] 3202330=openssl/test_ts
[456/753] 3202328=psych/nodes/test_enumerable
[457/753] 3202328=mkmf/test_config
[458/753] 3202328=rubygems/test_gem_resolver_vendor_set
[459/753] 3202328=rubygems/test_gem_resolver_api_set
[460/753] 3202328=prism/ruby/ruby_parser_test
[461/753] 3202328=rubygems/test_gem_safe_marshal
[462/753] 3202330=ruby/test_transcode
[463/753] 3202330=json/json_generator_test
[464/753] 3202328=ruby/test_eval
[465/753] 3202329=openssl/test_x509store
[466/753] 3202328=-ext-/st/test_update
[467/753] 3202328=openssl/test_x509name
[468/753] 3202330=openssl/test_fips
[469/753] 3202328=prism/api/parse_comments_test
[470/753] 3202328=prism/test_helper
[471/753] 3202328=ruby/test_random_formatter
[472/753] 3202328=did_you_mean/edit_distance/test_jaro_winkler
[473/753] 3202328=ruby/test_ast
[474/753] 3202329=rubygems/test_gem_request_set_gem_dependency_api
[475/753] 3202330=ruby/test_lambda
[476/753] 3202330=rubygems/test_webauthn_listener
Leaked file descriptor: WebauthnListenerTest#test_wait_for_otp_code_options_request: 10 : #<TCPSocket:fd 10, AF_INET, 127.0.0.1, 33893>
COMMAND PID USER FD TYPE DEVICE SIZE/OFF NODE NAME
ruby 3202330 sipeed 10u IPv4 1774404 0t0 TCP localhost:33893->localhost:40588 (CLOSE_WAIT)
[477/753] 3202329=net/http/test_https_proxy
Closed file descriptor: WebauthnListenerTest#test_listener_thread_sets_error: 10
[478/753] 3202329=prism/ruby/ripper_test
[479/753] 3202330=ruby/test_call
[480/753] 3202330=rubygems/test_rubygems
[481/753] 3202330=ruby/test_integer
[482/753] 3202329=ruby/test_super
[483/753] 3202329=ruby/test_rubyoptions
[484/753] 3202330=rubygems/test_gem_resolver_git_specification
[485/753] 3202330=psych/test_object_references
[486/753] 3202330=-ext-/marshal/test_usrmarshal
[487/753] 3202330=-ext-/float/test_nextafter
[488/753] 3202330=-ext-/string/test_capacity
[489/753] 3202330=-ext-/file/test_stat
[490/753] 3202330=rubygems/test_gem_request_set_lockfile_tokenizer
[491/753] 3202330=mkmf/test_have_func
[492/753] 3202327=-ext-/integer/test_integer
[493/753] 3202327=fileutils/test_dryrun
[494/753] 3202327=ruby/test_env
[495/753] 3202329=rubygems/test_gem_commands_setup_command
[496/753] 3202329=psych/test_parser
[497/753] 3202329=ruby/test_ractor
[498/753] 3202329=rubygems/test_gem_commands_open_command
[499/753] 3202329=resolv/test_dns
[500/753] 3202329=strscan/test_ractor
[501/753] 3202329=rubygems/test_gem_source_lock
[502/753] 3202329=rubygems/test_gem
[503/753] 3202327=win32/test_registry
[504/753] 3202327=psych/test_ractor
[505/753] 3202329=ruby/test_thread
[506/753] 3202327=json/json_ext_parser_test
[507/753] 3202327=-ext-/integer/test_my_integer
[508/753] 3202327=open-uri/test_ssl
[509/753] 3202330=dtrace/test_singleton_function
[510/753] 3202330=socket/test_ancdata
[511/753] 3202327=-ext-/string/test_rb_str_dup
[512/753] 3202330=test_unicode_normalize
[513/753] 3202327=ruby/test_marshal
[514/753] 3202330=test_weakref
[515/753] 3202330=socket/test_nonblock
[516/753] 3202330=ruby/test_alias
[517/753] 3202330=test_timeout
[518/753] 3202327=ruby/test_time_tz
[519/753] 3202330=json/ractor_test
[520/753] 3202327=ruby/test_trace
[521/753] 3202330=io/wait/test_io_wait_uncommon
[522/753] 3202330=ruby/test_arity
[523/753] 3202327=stringio/test_stringio
[524/753] 3202330=rubygems/test_gem_ci_detector
[525/753] 3202330=ruby/test_bignum
[526/753] 3202327=ruby/test_threadgroup
[527/753] 3202330=rubygems/test_gem_specification
[528/753] 3202327=ruby/test_enum
[529/753] 3202329=mkmf/test_have_macro
[530/753] 3202329=ruby/test_complex2
[531/753] 3202329=-ext-/load/test_resolve_symbol
[532/753] 3202329=rubygems/test_gem_package
[533/753] 3202327=psych/test_merge_keys
[534/753] 3202327=test_ipaddr
[535/753] 3202327=ruby/test_mixed_unicode_escapes
[536/753] 3202327=rubygems/test_gem_resolver_api_specification
[537/753] 3202327=prism/result/overlap_test
[538/753] 3202329=prism/result/static_literals_test
[539/753] 3202329=rubygems/test_gem_commands_cleanup_command
[540/753] 3202327=psych/test_numeric
[541/753] 3202327=-ext-/struct/test_member
[542/753] 3202327=did_you_mean/test_ractor_compatibility
[543/753] 3202329=optparse/test_autoconf
[544/753] 3202329=-ext-/eval/test_eval
[545/753] 3202329=ruby/test_dir
[546/753] 3202327=date/test_date_ractor
[547/753] 3202329=rubygems/test_gem_console_ui
[548/753] 3202329=uri/test_mailto
[549/753] 3202329=-ext-/string/test_coderange
[550/753] 3202329=psych/test_symbol
[551/753] 3202327=prism/ractor_test
[552/753] 3202329=rubygems/test_gem_source_fetch_problem
[553/753] 3202330=json/json_generic_object_test
[554/753] 3202330=net/http/test_http_request
[555/753] 3202329=-ext-/array/test_resize
[556/753] 3202330=error_highlight/test_error_highlight
[557/753] 3202329=dtrace/test_function_entry
[558/753] 3202329=rubygems/test_gem_resolver_requirement_list
[559/753] 3202329=-ext-/arith_seq/test_arith_seq_beg_len_step
[560/753] 3202327=openssl/test_pkcs7
[561/753] 3202329=-ext-/string/test_enc_associate
[562/753] 3202327=ruby/test_lazy_enumerator
[563/753] 3202329=psych/test_stringio
[564/753] 3202329=socket/test_unix
[565/753] 3202329=prism/ruby/parser_test
[566/753] 3202329=ruby/test_symbol
[567/753] 3202327=psych/test_coder
[568/753] 3202327=-ext-/string/test_nofree
[569/753] 3202327=rubygems/test_gem_commands_pristine_command
[570/753] 3202330=mkmf/test_find_executable
[571/753] 3202330=openssl/test_ssl
[572/753] 3202327=rubygems/test_gem_ext_cargo_builder
[573/753] 3202327=ruby/test_module
[574/753] 3202329=rubygems/test_gem_request_set
[575/753] 3202329=did_you_mean/spell_checking/test_method_name_check
[576/753] 3202329=-ext-/arith_seq/test_arith_seq_extract
[577/753] 3202329=uri/test_parser
[578/753] 3202329=mkmf/test_configuration
[579/753] 3202329=ruby/test_rubyvm
[580/753] 3202329=monitor/test_monitor
[581/753] 3202329=net/http/test_buffered_io
[582/753] 3202329=ruby/test_whileuntil
[583/753] 3202329=prism/ruby/string_query_test
[584/753] 3202329=psych/test_boolean
[585/753] 3202329=-ext-/thread/test_instrumentation_api
[586/753] 3202329=-ext-/load/test_stringify_symbols
[587/753] 3202329=rubygems/test_gem_dependency_list
[588/753] 3202329=prism/result/implicit_array_test
[589/753] 3202329=rubygems/test_gem_source
[590/753] 3202327=psych/test_scalar_scanner
[591/753] 3202327=rubygems/test_gem_commands_outdated_command
[592/753] 3202327=rubygems/test_gem_package_tar_writer
[593/753] 3202329=ruby/test_array
[594/753] 3202327=-ext-/test_abi
[595/753] 3202327=openssl/test_provider
[596/753] 3202327=psych/test_yamldbm
[597/753] 3202327=rubygems/test_gem_commands_rebuild_command
[598/753] 3202327=dtrace/test_load
[599/753] 3202327=net/http/test_https
[600/753] 3202327=rubygems/test_gem_ext_builder
[601/753] 3202327=erb/test_erb
[602/753] 3202327=openssl/test_x509ext
[603/753] 3202327=rubygems/test_gem_source_installed
[604/753] 3202327=-ext-/struct/test_len
[605/753] 3202327=open-uri/test_proxy
[606/753] 3202327=-ext-/iter/test_yield_block
[607/753] 3202327=rubygems/test_gem_commands_cert_command
[608/753] 3202330=ruby/test_rational
[609/753] 3202327=prism/fixtures_test
[610/753] 3202327=ruby/test_rational2
[611/753] 3202327=did_you_mean/test_spell_checker
[612/753] 3202327=ruby/test_float
[613/753] 3202329=ruby/test_require
[614/753] 3202327=ruby/test_refinement
[615/753] 3202330=rubygems/test_gem_commands_signout_command
[616/753] 3202330=ruby/enc/test_regex_casefold
[617/753] 3202330=rubygems/test_gem_source_git
[618/753] 3202330=ruby/test_dir_m17n
[619/753] 3202330=prism/result/warnings_test
[620/753] 3202330=rubygems/test_gem_resolver_installer_set
[621/753] 3202330=prism/ruby/dispatcher_test
[622/753] 3202330=prism/result/heredoc_test
[623/753] 3202330=ruby/test_metaclass
[624/753] 3202330=ruby/test_fixnum
[625/753] 3202330=ruby/test_signal
[626/753] 3202329=openssl/test_x509crl
[627/753] 3202330=fiber/test_process
[628/753] 3202330=ruby/enc/test_windows_1252
[629/753] 3202330=digest/test_digest_extend
[630/753] 3202330=ruby/test_iterator
[631/753] 3202329=dtrace/test_string
[632/753] 3202329=psych/test_omap
[633/753] 3202329=-ext-/debug/test_debug
[634/753] 3202330=ruby/test_memory_view
[635/753] 3202329=test_shellwords
[636/753] 3202329=-ext-/time/test_new
[637/753] 3202329=openssl/test_cipher
[638/753] 3202330=rubygems/test_gem_security_signer
[639/753] 3202329=rubygems/test_gem_resolver_git_set
[640/753] 3202330=fiber/test_storage
[641/753] 3202330=prism/result/constant_path_node_test
[642/753] 3202330=rubygems/test_gem_source_subpath_problem
[643/753] 3202330=-ext-/win32/test_dln
[644/753] 3202330=json/json_common_interface_test
[645/753] 3202330=prism/result/named_capture_test
[646/753] 3202330=prism/result/comments_test
[647/753] 3202330=json/json_parser_test
[648/753] 3202330=ruby/test_nomethod_error
[649/753] 3202330=openssl/test_config
[650/753] 3202329=mkmf/test_pkg_config
[651/753] 3202329=psych/test_struct
[652/753] 3202329=prism/magic_comment_test
[653/753] 3202330=prism/onigmo_test
[654/753] 3202330=ripper/test_sexp
[655/753] 3202330=prism/fuzzer_test
[656/753] 3202330=ruby/test_variable
[657/753] 3202330=ruby/test_allocation
[658/753] 3202329=-ext-/bignum/test_div
[659/753] 3202329=openssl/test_engine
[660/753] 3202329=ruby/test_key_error
[661/753] 3202329=psych/test_serialize_subclasses
[662/753] 3202329=ruby/test_insns_leaf
[663/753] 3202329=psych/test_deprecated
[664/753] 3202329=ripper/test_files_test_1
[665/753] 3202329=rubygems/test_gem_path_support
[666/753] 3202329=ruby/test_struct
[667/753] 3202327=fiber/test_mutex
[668/753] 3202327=openssl/test_x509req
[669/753] 3202327=rubygems/test_gem_commands_build_command
[670/753] 3202327=prism/result/node_id_test
[671/753] 3202327=prism/api/freeze_test
[672/753] 3202327=-ext-/string/test_interned_str
[673/753] 3202327=ruby/enc/test_case_comprehensive
[674/753] 3202327=rubygems/test_gem_commands_server_command
[675/753] 3202327=did_you_mean/spell_checking/test_variable_name_check
[676/753] 3202327=ruby/test_io_m17n
[677/753] 3202327=optparse/test_did_you_mean
[678/753] 3202327=dtrace/test_cmethod
[679/753] 3202327=prism/percent_delimiter_string_test
[680/753] 3202327=-ext-/econv/test_append
[681/753] 3202327=prism/result/breadth_first_search_test
[682/753] 3202327=ruby/test_iseq
[683/753] 3202329=-ext-/exception/test_exception_at_throwing
[684/753] 3202329=openssl/test_pkey_dsa
[685/753] 3202327=psych/test_class
[686/753] 3202327=openssl/test_ocsp
[687/753] 3202327=fiber/test_scheduler
[688/753] 3202330=rubygems/test_gem_bundler_version_finder
[689/753] 3202330=ruby/enc/test_emoji_breaks
[690/753] 3202330=rubygems/test_gem_commands_unpack_command
[691/753] 3202330=ripper/test_files_lib
[692/753] 3202330=ruby/test_beginendblock
[693/753] 3202329=test_time
[694/753] 3202329=rubygems/test_webauthn_listener_response
[695/753] 3202329=-ext-/array/test_to_ary_concat
[696/753] 3202330=psych/json/test_stream
[697/753] 3202330=-ext-/test_printf
[698/753] 3202330=ruby/test_set
[699/753] 3202330=date/test_date_marshal
[700/753] 3202330=mkmf/test_mkmf
[701/753] 3202330=test_delegate
[702/753] 3202330=-ext-/popen_deadlock/test_popen_deadlock
[703/753] 3202330=rubygems/test_exit
[704/753] 3202330=-ext-/test_recursion
[705/753] 3202330=objspace/test_ractor
[706/753] 3202330=rubygems/test_gem_security
[707/753] 3202329=openssl/test_digest
[708/753] 3202329=rubygems/test_bundled_ca
[709/753] 3202329=ruby/test_fiber
[710/753] 3202327=test_open3
[711/753] 3202329=did_you_mean/tree_spell/test_human_typo
[712/753] 3202329=ruby/test_primitive
[713/753] 3202329=test_rbconfig
[714/753] 3202329=rubygems/test_gem_commands_yank_command
[715/753] 3202329=openssl/test_pair
[716/753] 3202327=psych/test_document
[717/753] 3202327=ruby/enc/test_euc_jp
[718/753] 3202327=optparse/test_acceptable
[719/753] 3202327=did_you_mean/core_ext/test_name_error_extension
[720/753] 3202327=test_bundled_gems
[721/753] 3202327=net/http/test_httpresponses
[722/753] 3202327=psych/test_encoding
[723/753] 3202327=-ext-/string/test_set_len
[724/753] 3202327=net/http/test_httpheader
[725/753] 3202327=rubygems/test_gem_resolver_local_specification
[726/753] 3202327=mkmf/test_install
[727/753] 3202327=socket/test_sockopt
[728/753] 3202327=prism/encoding/string_encoding_test
[729/753] 3202327=json/json_encoding_test
[730/753] 3202327=date/test_date_compat
[731/753] 3202327=-ext-/test_bug-14834
[732/753] 3202327=ruby/test_compile_prism
[733/753] 3202327=ruby/test_path
[734/753] 3202327=ruby/enc/test_case_mapping
[735/753] 3202327=openssl/test_bn
[736/753] 3202327=net/http/test_http
Leaked file descriptor: TestNetHTTP_v1_2#test_get__crlf: 10 #<File::Stat dev=0x8, ino=1786191, mode=0140777, nlink=1, uid=1001, gid=1001, rdev=0x0, size=0, blksize=4096, blocks=0, atime=1970-01-01 00:00:00 +0000, mtime=1970-01-01 00:00:00 +0000, ctime=1970-01-01 00:00:00 +0000>
COMMAND PID USER FD TYPE DEVICE SIZE/OFF NODE NAME
ruby 3202327 sipeed 10u IPv4 1786191 0t0 TCP localhost:33003->localhost:34458 (CLOSE_WAIT)
Leaked file descriptor: TestNetHTTP_v1_2#test_s_start: 11 #<File::Stat dev=0x8, ino=1786316, mode=0140777, nlink=1, uid=1001, gid=1001, rdev=0x0, size=0, blksize=4096, blocks=0, atime=1970-01-01 00:00:00 +0000, mtime=1970-01-01 00:00:00 +0000, ctime=1970-01-01 00:00:00 +0000>
COMMAND PID USER FD TYPE DEVICE SIZE/OFF NODE NAME
ruby 3202327 sipeed 11u IPv4 1786316 0t0 TCP localhost:41193->localhost:55842 (CLOSE_WAIT)
Leaked file descriptor: TestNetHTTP_v1_2_chunked#test_get__crlf: 12 #<File::Stat dev=0x8, ino=1786396, mode=0140777, nlink=1, uid=1001, gid=1001, rdev=0x0, size=0, blksize=4096, blocks=0, atime=1970-01-01 00:00:00 +0000, mtime=1970-01-01 00:00:00 +0000, ctime=1970-01-01 00:00:00 +0000>
COMMAND PID USER FD TYPE DEVICE SIZE/OFF NODE NAME
ruby 3202327 sipeed 12u IPv4 1786396 0t0 TCP localhost:40799->localhost:53114 (CLOSE_WAIT)
[737/753] 3202327=socket/test_addrinfo
[738/753] 3202327=did_you_mean/test_tree_spell_checker
[739/753] 3202327=rubygems/test_gem_gem_runner
[740/753] 3202327=ripper/test_filter
[741/753] 3202327=-ext-/struct/test_data
[742/753] 3202327=ruby/enc/test_koi8
[743/753] 3202327=fiber/test_enumerator
[744/753] 3202327=ripper/test_lexer
[745/753] 3202327=ruby/test_thread_cv
[746/753] 3202327=yaml/test_dbm
[747/753] 3202327=openssl/test_ssl_session
[748/753] 3202329=rubygems/test_gem_uri
[749/753] 3202327=-ext-/test_random
[750/753] 3202329=-ext-/test_notimplement
[751/753] 3202329=mmtk/test_configuration
[752/753] 3202327=rubygems/test_gem_commands_update_command
[753/753] 3202329=rubygems/test_gem_resolver_vendor_specification
1) Failure:
TestRubyOptions#test_warning [/tmp/ruby/src/trunk/test/ruby/test_rubyoptions.rb:147]:
pid 3220964 killed by SIGSEGV (signal 11) (core dumped).
1. [1/2] Assertion for "stdout"
| <["false:false:true:false:false", "false:false:true:false:false"]> expected but was
| <[]>.
Finished tests in 753.655949s, 37.9510 tests/s, 8059.8329 assertions/s.
28602 tests, 6074341 assertions, 1 failures, 0 errors, 153 skips
ruby -v: ruby 3.5.0dev (2025-05-13T20:39:45Z master 2279da2c91) +PRISM [riscv64-linux]
make: *** [uncommon.mk:976: yes-test-all] Error 1
$$$[end] "make yes-test-all TESTOPTS='--stderr-on-failure' TESTS='-j4'" exit with 512.
$$$[beg] make yes-test-rubyspec MSPECOPT='--error-output stderr -j' TESTS='-j4'
BASERUBY = /usr/bin/ruby --disable=gems
CC = gcc
LD = ld
LDSHARED = gcc -shared
CFLAGS = -fstack-protector-strong -U_FORTIFY_SOURCE -D_FORTIFY_SOURCE=2 -O3 -fno-fast-math -ggdb3 -Wall -Wextra -Wdeprecated-declarations -Wdiv-by-zero -Wduplicated-cond -Wimplicit-function-declaration -Wimplicit-int -Wpointer-arith -Wwrite-strings -Wold-style-definition -Wimplicit-fallthrough=0 -Wmissing-noreturn -Wno-cast-function-type -Wno-constant-logical-operand -Wno-long-long -Wno-missing-field-initializers -Wno-overlength-strings -Wno-packed-bitfield-compat -Wno-parentheses-equality -Wno-self-assign -Wno-tautological-compare -Wno-unused-parameter -Wno-unused-value -Wsuggest-attribute=format -Wsuggest-attribute=noreturn -Wunused-variable -Wmisleading-indentation -Wundef -fPIC
XCFLAGS = -fno-strict-overflow -fvisibility=hidden -fexcess-precision=standard -DRUBY_EXPORT -I. -I.ext/include/riscv64-linux -I.ext/include -I/tmp/ruby/src/trunk/include -I/tmp/ruby/src/trunk -I/tmp/ruby/src/trunk/prism -I/tmp/ruby/src/trunk/enc/unicode/16.0.0 -Dmodular_gc_dir=
CPPFLAGS =
DLDFLAGS = -Wl,--compress-debug-sections=zlib -Wl,-soname,libruby.so.3.5 -fstack-protector-strong
SOLIBS = -lz -lrt -lrt -lgmp -ldl -lcrypt -lm -lpthread
LANG = C.UTF-8
LC_ALL =
LC_CTYPE =
MFLAGS =
RUSTC = rustc
YJIT_RUSTC_ARGS = --crate-name=yjit --crate-type=staticlib --edition=2021 -g -C lto=thin -C opt-level=3 -C overflow-checks=on '--out-dir=/tmp/ruby/build/trunk/yjit/target/release/' /tmp/ruby/src/trunk/yjit/src/lib.rs
ZJIT_RUSTC_ARGS = --crate-name=zjit --crate-type=staticlib --edition=2024 -g -C lto=thin -C opt-level=3 -C overflow-checks=on '--out-dir=/tmp/ruby/build/trunk/zjit/target/release/' /tmp/ruby/src/trunk/zjit/src/lib.rs
gcc (Debian 13.2.0-23revyos1) 13.2.0
Copyright (C) 2023 Free Software Foundation, Inc.
This is free software; see the source for copying conditions. There is NO
warranty; not even for MERCHANTABILITY or FITNESS FOR A PARTICULAR PURPOSE.
generating enc.mk
making enc
make[1]: Entering directory '/tmp/ruby/build/trunk'
make[1]: Nothing to be done for 'enc'.
make[1]: Leaving directory '/tmp/ruby/build/trunk'
making srcs under enc
make[1]: Entering directory '/tmp/ruby/build/trunk'
make[1]: Nothing to be done for 'srcs'.
make[1]: Leaving directory '/tmp/ruby/build/trunk'
generating transdb.h
transdb.h unchanged
making trans
make[1]: Entering directory '/tmp/ruby/build/trunk'
make[1]: Nothing to be done for 'trans'.
make[1]: Leaving directory '/tmp/ruby/build/trunk'
making encs
make[1]: Entering directory '/tmp/ruby/build/trunk'
make[1]: Nothing to be done for 'encs'.
make[1]: Leaving directory '/tmp/ruby/build/trunk'
generating makefiles ext/configure-ext.mk
ext/configure-ext.mk updated
make[1]: Entering directory '/tmp/ruby/build/trunk'
make[1]: Leaving directory '/tmp/ruby/build/trunk'
generating makefile exts.mk
exts.mk unchanged
make[1]: Entering directory '/tmp/ruby/build/trunk'
make[2]: Entering directory '/tmp/ruby/build/trunk/ext/coverage'
make[2]: Leaving directory '/tmp/ruby/build/trunk/ext/coverage'
make[2]: Entering directory '/tmp/ruby/build/trunk/ext/date'
make[2]: Leaving directory '/tmp/ruby/build/trunk/ext/date'
make[2]: Entering directory '/tmp/ruby/build/trunk/ext/digest'
make[2]: Leaving directory '/tmp/ruby/build/trunk/ext/digest'
make[2]: Entering directory '/tmp/ruby/build/trunk/ext/digest/sha2'
make[2]: Leaving directory '/tmp/ruby/build/trunk/ext/digest/sha2'
make[2]: Entering directory '/tmp/ruby/build/trunk/ext/io/console'
make[2]: Leaving directory '/tmp/ruby/build/trunk/ext/io/console'
make[2]: Entering directory '/tmp/ruby/build/trunk/ext/json'
make[2]: Leaving directory '/tmp/ruby/build/trunk/ext/json'
make[2]: Entering directory '/tmp/ruby/build/trunk/ext/monitor'
make[2]: Leaving directory '/tmp/ruby/build/trunk/ext/monitor'
make[2]: Entering directory '/tmp/ruby/build/trunk/ext/objspace'
make[2]: Leaving directory '/tmp/ruby/build/trunk/ext/objspace'
make[2]: Entering directory '/tmp/ruby/build/trunk/ext/openssl'
make[2]: Leaving directory '/tmp/ruby/build/trunk/ext/openssl'
make[2]: Entering directory '/tmp/ruby/build/trunk/ext/pathname'
make[2]: Leaving directory '/tmp/ruby/build/trunk/ext/pathname'
make[2]: Entering directory '/tmp/ruby/build/trunk/ext/psych'
make[2]: Leaving directory '/tmp/ruby/build/trunk/ext/psych'
make[2]: Entering directory '/tmp/ruby/build/trunk/ext/pty'
make[2]: Leaving directory '/tmp/ruby/build/trunk/ext/pty'
make[2]: Entering directory '/tmp/ruby/build/trunk/ext/ripper'
make[2]: Leaving directory '/tmp/ruby/build/trunk/ext/ripper'
make[2]: Entering directory '/tmp/ruby/build/trunk/ext/rubyvm'
make[2]: Leaving directory '/tmp/ruby/build/trunk/ext/rubyvm'
make[2]: Entering directory '/tmp/ruby/build/trunk/ext/socket'
make[2]: Leaving directory '/tmp/ruby/build/trunk/ext/socket'
make[2]: Entering directory '/tmp/ruby/build/trunk/ext/strscan'
make[2]: Leaving directory '/tmp/ruby/build/trunk/ext/strscan'
make[2]: Entering directory '/tmp/ruby/build/trunk/.bundle/gems/bigdecimal-3.1.9/ext/bigdecimal'
make[2]: Leaving directory '/tmp/ruby/build/trunk/.bundle/gems/bigdecimal-3.1.9/ext/bigdecimal'
make[2]: Entering directory '/tmp/ruby/build/trunk/.bundle/gems/debug-1.10.0/ext/debug'
make[2]: Leaving directory '/tmp/ruby/build/trunk/.bundle/gems/debug-1.10.0/ext/debug'
make[2]: Entering directory '/tmp/ruby/build/trunk/.bundle/gems/fiddle-1.1.8/ext/fiddle'
make[2]: Leaving directory '/tmp/ruby/build/trunk/.bundle/gems/fiddle-1.1.8/ext/fiddle'
make[2]: Entering directory '/tmp/ruby/build/trunk/.bundle/gems/nkf-0.2.0/ext/nkf'
make[2]: Leaving directory '/tmp/ruby/build/trunk/.bundle/gems/nkf-0.2.0/ext/nkf'
make[2]: Entering directory '/tmp/ruby/build/trunk/.bundle/gems/racc-1.8.1/ext/racc/cparse'
make[2]: Leaving directory '/tmp/ruby/build/trunk/.bundle/gems/racc-1.8.1/ext/racc/cparse'
make[2]: Entering directory '/tmp/ruby/build/trunk/.bundle/gems/rbs-3.9.3/ext/rbs_extension'
make[2]: Leaving directory '/tmp/ruby/build/trunk/.bundle/gems/rbs-3.9.3/ext/rbs_extension'
make[2]: Entering directory '/tmp/ruby/build/trunk/.bundle/gems/syslog-0.3.0/ext/syslog'
make[2]: Leaving directory '/tmp/ruby/build/trunk/.bundle/gems/syslog-0.3.0/ext/syslog'
make[2]: Entering directory '/tmp/ruby/build/trunk'
make[2]: 'ruby' is up to date.
make[2]: Leaving directory '/tmp/ruby/build/trunk'
make[1]: Leaving directory '/tmp/ruby/build/trunk'
make[1]: Entering directory '/tmp/ruby/build/trunk'
make[1]: Nothing to be done for 'note'.
make[1]: Leaving directory '/tmp/ruby/build/trunk'
ruby 3.5.0dev (2025-05-13T20:39:45Z master 2279da2c91) +PRISM [riscv64-linux]
0 ............................................................
60 ............................................................
120 ............................................................
180 ............................................................
240 ............................................................
300 ............................................................
360 ............................................................
420 ............................................................
480 ............................................................
540 ............................................................
600 ............................................................
660 ............................................................
720 ............................................................
780 ............................................................
840 ............................................................
900 ............................................................
960 ............................................................
1020 ............................................................
1080 ............................................................
1140 ............................................................
1200 ............................................................
1260 ............................................................
1320 ............................................................
1380 ............................................................
1440 ............................................................
1500 ............................................................
1560 ............................................................
1620 ............................................................
1680 ............................................................
1740 ............................................................
1800 ............................................................
1860 ............................................................
1920 ............................................................
1980 ............................................................
2040 ............................................................
2100 ............................................................
2160 ............................................................
2220 ............................................................
2280 ............................................................
2340 ............................................................
2400 ............................................................
2460 ............................................................
2520 ............................................................
2580 ............................................................
2640 ............................................................
2700 ............................................................
2760 ............................................................
2820 ............................................................
2880 ............................................................
2940 ............................................................
3000 ............................................................
3060 ............................................................
3120 ............................................................
3180 ............................................................
3240 ............................................................
3300 ......................................
1)
An Exception reaching the top level is printed on STDERR FAILED
Expected exit status is 1 but actual is :SIGSEGV for command ruby_exe("/tmp/ruby/build/trunk/miniruby -I/tmp/ruby/src/trunk/lib /tmp/ruby/src/trunk/tool/runruby.rb --archdir=/tmp/ruby/build/trunk --extout=.ext -- /tmp/rubytest.cdpdnw_1/90-rubyexe.rb")
Output:
/tmp/ruby/src/trunk/lib/rubygems/basic_specification.rb:124: [BUG] Segmentation fault at 0xfffffffffffffff8
ruby 3.5.0dev (2025-05-13T20:39:45Z master 2279da2c91) +PRISM [riscv64-linux]
-- Control frame information -----------------------------------------------
c:0016 p:0014 s:0078 e:000074 METHOD /tmp/ruby/src/trunk/lib/rubygems/basic_specification.rb:124
c:0015 p:0012 s:0071 e:000070 METHOD /tmp/ruby/src/trunk/lib/rubygems/basic_specification.rb:283
c:0014 p:0004 s:0067 e:000066 METHOD /tmp/ruby/src/trunk/lib/rubygems.rb:1241
c:0013 p:0006 s:0058 e:000057 BLOCK /tmp/ruby/src/trunk/lib/rubygems/specification.rb:850
c:0012 p:0015 s:0054 e:000053 BLOCK /tmp/ruby/src/trunk/lib/rubygems/specification.rb:791
c:0011 p:0004 s:0049 e:000048 BLOCK /tmp/ruby/src/trunk/lib/rubygems/specification.rb:779 [FINISH]
c:0010 p:---- s:0045 e:000044 CFUNC :each
c:0009 p:0011 s:0041 e:000040 BLOCK /tmp/ruby/src/trunk/lib/rubygems/specification.rb:778 [FINISH]
c:0008 p:---- s:0037 e:000036 CFUNC :each
c:0007 p:0005 s:0033 e:000032 METHOD /tmp/ruby/src/trunk/lib/rubygems/specification.rb:777
c:0006 p:0006 s:0028 e:000027 METHOD /tmp/ruby/src/trunk/lib/rubygems/specification.rb:789
c:0005 p:0010 s:0023 e:000022 METHOD /tmp/ruby/src/trunk/lib/rubygems/specification.rb:847
c:0004 p:0090 s:0019 e:000018 TOP /tmp/ruby/src/trunk/lib/rubygems.rb:1402 [FINISH]
c:0003 p:---- s:0012 e:000011 CFUNC :require
c:0002 p:0012 s:0007 e:000006 TOP <internal:gem_prelude>:2 [FINISH]
c:0001 p:0000 s:0003 E:0016c0 DUMMY [FINISH]
-- Ruby level backtrace information ----------------------------------------
<internal:gem_prelude>:2:in '<internal:gem_prelude>'
<internal:gem_prelude>:2:in 'require'
/tmp/ruby/src/trunk/lib/rubygems.rb:1402:in '<top (required)>'
/tmp/ruby/src/trunk/lib/rubygems/specification.rb:847:in 'load_defaults'
/tmp/ruby/src/trunk/lib/rubygems/specification.rb:789:in 'each_spec'
/tmp/ruby/src/trunk/lib/rubygems/specification.rb:777:in 'each_gemspec'
/tmp/ruby/src/trunk/lib/rubygems/specification.rb:777:in 'each'
/tmp/ruby/src/trunk/lib/rubygems/specification.rb:778:in 'block in each_gemspec'
Finished in 122.031440 seconds
3337 files, 33384 examples, 139262 expectations, 1 failure, 0 errors, 0 tagged
/tmp/ruby/src/trunk/lib/rubygems/specification.rb:778:in 'each'
/tmp/ruby/src/trunk/lib/rubygems/specification.rb:779:in 'block (2 levels) in each_gemspec'
/tmp/ruby/src/trunk/lib/rubygems/specification.rb:791:in 'block in each_spec'
/tmp/ruby/src/trunk/lib/rubygems/specification.rb:850:in 'block in load_defaults'
/tmp/ruby/src/trunk/lib/rubygems.rb:1241:in 'register_default_spec'
/tmp/ruby/src/trunk/lib/rubygems/basic_specification.rb:283:in 'require_paths'
/tmp/ruby/src/trunk/lib/rubygems/basic_specification.rb:124:in 'extension_dir'
-- Threading information ---------------------------------------------------
Total ractor count: 1
Ruby thread count for this ractor: 1
-- Machine register context ------------------------------------------------
sp: 0x0000003fffcbb420 s0: 0x0000002adfe42270 s1: 0x0000000000007fff
a0: 0x0000ae31001c0001 a1: 0x0000002ae00701b0 a2: 0x0000003fa810d848
a3: 0x0000000000000000 a4: 0x0000003fa80f4898 a5: 0x0000000000000000
a6: 0x0000000000000000 a7: 0x0000003fa8182800 s2: 0x000000000000ffff
s3: 0x0000003fffcbb4f8 s4: 0x0000000000000024 s5: 0x0000003fc2fd3d18
s6: 0x0000003fc280cc90 s7: 0x0000000000000013 s8: 0x0000002ae00696c0
s9: 0x0000003fa8187f80 s10: 0x000000000000bf63 s11: 0x0000002ae0069670
-- C level backtrace information -------------------------------------------
/tmp/ruby/build/trunk/libruby.so.3.5(rb_print_backtrace+0x14) [0x3fc2da449e] /tmp/ruby/src/trunk/vm_dump.c:843
/tmp/ruby/build/trunk/libruby.so.3.5(rb_vm_bugreport) /tmp/ruby/src/trunk/vm_dump.c:1175
/tmp/ruby/build/trunk/libruby.so.3.5(rb_bug_for_fatal_signal+0x6e) [0x3fc2bef29c] /tmp/ruby/src/trunk/error.c:1130
/tmp/ruby/build/trunk/libruby.so.3.5(sigsegv+0x42) [0x3fc2d09490] /tmp/ruby/src/trunk/signal.c:936
linux-vdso.so.1(__vdso_rt_sigreturn+0x0) [0x3fc2fb0800]
/tmp/ruby/build/trunk/libruby.so.3.5(vm_exec_core+0x1aa6) [0x3fc2d8fba0] /tmp/ruby/build/trunk/vm.inc:381
/tmp/ruby/build/trunk/libruby.so.3.5(vm_exec_loop+0x0) [0x3fc2d93664] /tmp/ruby/src/trunk/vm.c:2623
/tmp/ruby/build/trunk/libruby.so.3.5(rb_vm_exec) /tmp/ruby/src/trunk/vm.c:2626
/tmp/ruby/build/trunk/libruby.so.3.5(vm_yield_with_cref+0x26) [0x3fc2d96a34] /tmp/ruby/src/trunk/vm.c:1704
/tmp/ruby/build/trunk/libruby.so.3.5(vm_yield) /tmp/ruby/src/trunk/vm.c:1712
/tmp/ruby/build/trunk/libruby.so.3.5(rb_yield_0) /tmp/ruby/src/trunk/vm_eval.c:1361
/tmp/ruby/build/trunk/libruby.so.3.5(rb_yield) /tmp/ruby/src/trunk/vm_eval.c:1377
/tmp/ruby/build/trunk/libruby.so.3.5(RB_FL_TEST_RAW+0x0) [0x3fc2b563fa] /tmp/ruby/src/trunk/array.c:2646
/tmp/ruby/build/trunk/libruby.so.3.5(RB_FL_ANY_RAW) /tmp/ruby/src/trunk/include/ruby/internal/fl_type.h:507
/tmp/ruby/build/trunk/libruby.so.3.5(rb_array_len) /tmp/ruby/src/trunk/include/ruby/internal/core/rarray.h:259
/tmp/ruby/build/trunk/libruby.so.3.5(rb_ary_each) /tmp/ruby/src/trunk/array.c:2645
/tmp/ruby/build/trunk/libruby.so.3.5(vm_cfp_consistent_p+0x0) [0x3fc2d7e22c] /tmp/ruby/src/trunk/vm_insnhelper.c:3798
/tmp/ruby/build/trunk/libruby.so.3.5(vm_call_cfunc_with_frame_) /tmp/ruby/src/trunk/vm_insnhelper.c:3800
/tmp/ruby/build/trunk/libruby.so.3.5(vm_sendish+0x9a) [0x3fc2d8437c] /tmp/ruby/src/trunk/vm_insnhelper.c:5995
/tmp/ruby/build/trunk/libruby.so.3.5(vm_exec_core+0xc44) [0x3fc2d8ed3e] ../../src/trunk/insns.def:851
/tmp/ruby/build/trunk/libruby.so.3.5(vm_exec_loop+0x0) [0x3fc2d93664] /tmp/ruby/src/trunk/vm.c:2623
/tmp/ruby/build/trunk/libruby.so.3.5(rb_vm_exec) /tmp/ruby/src/trunk/vm.c:2626
/tmp/ruby/build/trunk/libruby.so.3.5(vm_yield_with_cref+0x26) [0x3fc2d96a34] /tmp/ruby/src/trunk/vm.c:1704
/tmp/ruby/build/trunk/libruby.so.3.5(vm_yield) /tmp/ruby/src/trunk/vm.c:1712
/tmp/ruby/build/trunk/libruby.so.3.5(rb_yield_0) /tmp/ruby/src/trunk/vm_eval.c:1361
/tmp/ruby/build/trunk/libruby.so.3.5(rb_yield) /tmp/ruby/src/trunk/vm_eval.c:1377
/tmp/ruby/build/trunk/libruby.so.3.5(RB_FL_TEST_RAW+0x0) [0x3fc2b563fa] /tmp/ruby/src/trunk/array.c:2646
/tmp/ruby/build/trunk/libruby.so.3.5(RB_FL_ANY_RAW) /tmp/ruby/src/trunk/include/ruby/internal/fl_type.h:507
/tmp/ruby/build/trunk/libruby.so.3.5(rb_array_len) /tmp/ruby/src/trunk/include/ruby/internal/core/rarray.h:259
/tmp/ruby/build/trunk/libruby.so.3.5(rb_ary_each) /tmp/ruby/src/trunk/array.c:2645
/tmp/ruby/build/trunk/libruby.so.3.5(vm_cfp_consistent_p+0x0) [0x3fc2d7e22c] /tmp/ruby/src/trunk/vm_insnhelper.c:3798
/tmp/ruby/build/trunk/libruby.so.3.5(vm_call_cfunc_with_frame_) /tmp/ruby/src/trunk/vm_insnhelper.c:3800
/tmp/ruby/build/trunk/libruby.so.3.5(vm_sendish+0x9a) [0x3fc2d8437c] /tmp/ruby/src/trunk/vm_insnhelper.c:5995
/tmp/ruby/build/trunk/libruby.so.3.5(vm_exec_core+0xc44) [0x3fc2d8ed3e] ../../src/trunk/insns.def:851
/tmp/ruby/build/trunk/libruby.so.3.5(vm_exec_loop+0x1e) [0x3fc2d93710] /tmp/ruby/src/trunk/vm.c:2650
/tmp/ruby/build/trunk/libruby.so.3.5(rb_vm_exec) /tmp/ruby/src/trunk/vm.c:2629
/tmp/ruby/build/trunk/libruby.so.3.5(load_iseq_eval+0xde) [0x3fc2c4b134] /tmp/ruby/src/trunk/load.c:871
/tmp/ruby/build/trunk/libruby.so.3.5(require_internal) /tmp/ruby/src/trunk/load.c:1449
/tmp/ruby/build/trunk/libruby.so.3.5(rb_require_string_internal+0x2a) [0x3fc2c4bb32] /tmp/ruby/src/trunk/load.c:1564
/tmp/ruby/build/trunk/libruby.so.3.5(rb_require_string) /tmp/ruby/src/trunk/load.c:1550
/tmp/ruby/build/trunk/libruby.so.3.5(vm_cfp_consistent_p+0x0) [0x3fc2d7e22c] /tmp/ruby/src/trunk/vm_insnhelper.c:3798
/tmp/ruby/build/trunk/libruby.so.3.5(vm_call_cfunc_with_frame_) /tmp/ruby/src/trunk/vm_insnhelper.c:3800
/tmp/ruby/build/trunk/libruby.so.3.5(vm_exec_core+0xf2) [0x3fc2d8e1ec] /tmp/ruby/src/trunk/vm_insnhelper.c:5995
/tmp/ruby/build/trunk/libruby.so.3.5(vm_exec_loop+0x0) [0x3fc2d93664] /tmp/ruby/src/trunk/vm.c:2623
/tmp/ruby/build/trunk/libruby.so.3.5(rb_vm_exec) /tmp/ruby/src/trunk/vm.c:2626
/tmp/ruby/build/trunk/libruby.so.3.5(load_with_builtin_functions+0xe8) [0x3fc2e24b5c] /tmp/ruby/src/trunk/builtin.c:60
/tmp/ruby/build/trunk/libruby.so.3.5(ruby_init_prelude+0x8) [0x3fc2d0316a] /tmp/ruby/src/trunk/ruby.c:1774
/tmp/ruby/build/trunk/libruby.so.3.5(ruby_opt_init) /tmp/ruby/src/trunk/ruby.c:1825
/tmp/ruby/build/trunk/libruby.so.3.5(ruby_opt_init) /tmp/ruby/src/trunk/ruby.c:1791
/tmp/ruby/build/trunk/libruby.so.3.5(prism_script+0x6) [0x3fc2d04e80] /tmp/ruby/src/trunk/ruby.c:2235
/tmp/ruby/build/trunk/libruby.so.3.5(process_options) /tmp/ruby/src/trunk/ruby.c:2563
/tmp/ruby/build/trunk/libruby.so.3.5(ruby_process_options+0x13e) [0x3fc2d05352] /tmp/ruby/src/trunk/ruby.c:3199
/tmp/ruby/build/trunk/libruby.so.3.5(ruby_options+0x94) [0x3fc2bf8c96] /tmp/ruby/src/trunk/eval.c:117
/tmp/ruby/build/trunk/ruby(rb_main+0x12) [0x2adfe36a9a] /tmp/ruby/src/trunk/main.c:42
/tmp/ruby/build/trunk/ruby(main) /tmp/ruby/src/trunk/main.c:62
[0x3fc288ea48]
[0x3fc288eaf0]
[0x2adfe36ad8]
-- Other runtime information -----------------------------------------------
* Loaded script: /tmp/ruby/build/trunk/ruby
* Loaded features:
0 enumerator.so
1 thread.rb
2 fiber.so
3 rational.so
4 complex.so
5 ruby2_keywords.rb
6 set.rb
7 /tmp/ruby/build/trunk/.ext/riscv64-linux/enc/encdb.so
8 /tmp/ruby/build/trunk/.ext/riscv64-linux/enc/trans/transdb.so
9 /tmp/ruby/build/trunk/rbconfig.rb
10 /tmp/ruby/src/trunk/lib/rubygems/compatibility.rb
11 /tmp/ruby/src/trunk/lib/rubygems/defaults.rb
12 /tmp/ruby/src/trunk/lib/rubygems/deprecate.rb
13 /tmp/ruby/src/trunk/lib/rubygems/errors.rb
14 /tmp/ruby/src/trunk/lib/rubygems/target_rbconfig.rb
15 /tmp/ruby/src/trunk/lib/rubygems/unknown_command_spell_checker.rb
16 /tmp/ruby/src/trunk/lib/rubygems/exceptions.rb
17 /tmp/ruby/src/trunk/lib/rubygems/basic_specification.rb
18 /tmp/ruby/src/trunk/lib/rubygems/stub_specification.rb
19 /tmp/ruby/src/trunk/lib/rubygems/platform.rb
20 /tmp/ruby/src/trunk/lib/rubygems/specification_record.rb
21 /tmp/ruby/src/trunk/lib/rubygems/util/list.rb
22 /tmp/ruby/src/trunk/lib/rubygems/version.rb
23 /tmp/ruby/src/trunk/lib/rubygems/requirement.rb
24 /tmp/ruby/src/trunk/lib/rubygems/specification.rb
25 /tmp/ruby/src/trunk/lib/rubygems/util.rb
26 /tmp/ruby/src/trunk/lib/rubygems/dependency.rb
* Process memory map:
2adfe36000-2adfe37000 r-xp 00000000 00:1e 2734627 /tmp/ruby/build/trunk/ruby
2adfe37000-2adfe38000 r--p 00000000 00:1e 2734627 /tmp/ruby/build/trunk/ruby
2adfe38000-2adfe39000 rw-p 00001000 00:1e 2734627 /tmp/ruby/build/trunk/ruby
2adfe39000-2ae00b9000 rw-p 00000000 00:00 0 [heap]
3fa5e25000-3fa723d000 rw-p 00000000 00:00 0
3fa723d000-3fa8058000 r--s 00000000 00:1e 2734620 /tmp/ruby/build/trunk/libruby.so.3.5.0
3fa8058000-3fa8093000 r--s 00000000 00:1e 2734627 /tmp/ruby/build/trunk/ruby
3fa8093000-3fa80ae000 r-xp 00000000 b3:03 32 /usr/lib/riscv64-linux-gnu/libgcc_s.so.1
3fa80ae000-3fa80af000 r--p 0001b000 b3:03 32 /usr/lib/riscv64-linux-gnu/libgcc_s.so.1
3fa80af000-3fa80b0000 rw-p 0001c000 b3:03 32 /usr/lib/riscv64-linux-gnu/libgcc_s.so.1
3fa80b0000-3fa8120000 rw-p 00000000 00:00 0 [anon:Ruby:GC:default:heap_page_body_allocate]
3fa812d000-3fa816e000 rw-p 00000000 00:00 0
3fa8180000-3fa8200000 rw-p 00000000 00:00 0 [anon:Ruby:GC:default:heap_page_body_allocate]
3fa820f000-3fa8210000 ---p 00000000 00:00 0 [anon:Ruby:fiber_pool_allocate_memory]
3fa8210000-3fa8251000 rw-p 00000000 00:00 0 [anon:Ruby:fiber_pool_allocate_memory]
3fa8251000-3fa8252000 ---p 00000000 00:00 0 [anon:Ruby:fiber_pool_allocate_memory]
3fa8252000-3fa8293000 rw-p 00000000 00:00 0 [anon:Ruby:fiber_pool_allocate_memory]
3fa8293000-3fa8294000 ---p 00000000 00:00 0 [anon:Ruby:fiber_pool_allocate_memory]
3fa8294000-3fa82d5000 rw-p 00000000 00:00 0 [anon:Ruby:fiber_pool_allocate_memory]
3fa82d5000-3fa82d6000 ---p 00000000 00:00 0 [anon:Ruby:fiber_pool_allocate_memory]
3fa82d6000-3fa8317000 rw-p 00000000 00:00 0 [anon:Ruby:fiber_pool_allocate_memory]
3fa8317000-3fa8318000 ---p 00000000 00:00 0 [anon:Ruby:fiber_pool_allocate_memory]
3fa8318000-3fa8359000 rw-p 00000000 00:00 0 [anon:Ruby:fiber_pool_allocate_memory]
3fa8359000-3fa835a000 ---p 00000000 00:00 0 [anon:Ruby:fiber_pool_allocate_memory]
3fa835a000-3fa839b000 rw-p 00000000 00:00 0 [anon:Ruby:fiber_pool_allocate_memory]
3fa839b000-3fa839c000 ---p 00000000 00:00 0 [anon:Ruby:fiber_pool_allocate_memory]
3fa839c000-3fa83dd000 rw-p 00000000 00:00 0 [anon:Ruby:fiber_pool_allocate_memory]
3fa83dd000-3fa83de000 ---p 00000000 00:00 0 [anon:Ruby:fiber_pool_allocate_memory]
3fa83de000-3fa841f000 rw-p 00000000 00:00 0 [anon:Ruby:fiber_pool_allocate_memory]
3fa841f000-3fa8420000 ---p 00000000 00:00 0 [anon:Ruby:fiber_pool_allocate_memory]
3fa8420000-3fa8461000 rw-p 00000000 00:00 0 [anon:Ruby:fiber_pool_allocate_memory]
3fa8461000-3fa8462000 ---p 00000000 00:00 0 [anon:Ruby:fiber_pool_allocate_memory]
3fa8462000-3fa84a3000 rw-p 00000000 00:00 0 [anon:Ruby:fiber_pool_allocate_memory]
3fa84a3000-3fa84a4000 ---p 00000000 00:00 0 [anon:Ruby:fiber_pool_allocate_memory]
3fa84a4000-3fa84e5000 rw-p 00000000 00:00 0 [anon:Ruby:fiber_pool_allocate_memory]
3fa84e5000-3fa84e6000 ---p 00000000 00:00 0 [anon:Ruby:fiber_pool_allocate_memory]
3fa84e6000-3fa8527000 rw-p 00000000 00:00 0 [anon:Ruby:fiber_pool_allocate_memory]
3fa8527000-3fa8528000 ---p 00000000 00:00 0 [anon:Ruby:fiber_pool_allocate_memory]
3fa8528000-3fa8569000 rw-p 00000000 00:00 0 [anon:Ruby:fiber_pool_allocate_memory]
3fa8569000-3fa856a000 ---p 00000000 00:00 0 [anon:Ruby:fiber_pool_allocate_memory]
3fa856a000-3fa85ab000 rw-p 00000000 00:00 0 [anon:Ruby:fiber_pool_allocate_memory]
3fa85ab000-3fa85ac000 ---p 00000000 00:00 0 [anon:Ruby:fiber_pool_allocate_memory]
3fa85ac000-3fa85ed000 rw-p 00000000 00:00 0 [anon:Ruby:fiber_pool_allocate_memory]
3fa85ed000-3fa85ee000 ---p 00000000 00:00 0 [anon:Ruby:fiber_pool_allocate_memory]
3fa85ee000-3fa862f000 rw-p 00000000 00:00 0 [anon:Ruby:fiber_pool_allocate_memory]
3fa862f000-3fa8630000 ---p 00000000 00:00 0 [anon:Ruby:fiber_pool_allocate_memory]
3fa8630000-3fa8671000 rw-p 00000000 00:00 0 [anon:Ruby:fiber_pool_allocate_memory]
3fa8671000-3fa8672000 ---p 00000000 00:00 0 [anon:Ruby:fiber_pool_allocate_memory]
3fa8672000-3fa86b3000 rw-p 00000000 00:00 0 [anon:Ruby:fiber_pool_allocate_memory]
3fa86b3000-3fa86b4000 ---p 00000000 00:00 0 [anon:Ruby:fiber_pool_allocate_memory]
3fa86b4000-3fa86f5000 rw-p 00000000 00:00 0 [anon:Ruby:fiber_pool_allocate_memory]
3fa86f5000-3fa86f6000 ---p 00000000 00:00 0 [anon:Ruby:fiber_pool_allocate_memory]
3fa86f6000-3fa8737000 rw-p 00000000 00:00 0 [anon:Ruby:fiber_pool_allocate_memory]
3fa8737000-3fa8738000 ---p 00000000 00:00 0 [anon:Ruby:fiber_pool_allocate_memory]
3fa8738000-3fa8779000 rw-p 00000000 00:00 0 [anon:Ruby:fiber_pool_allocate_memory]
3fa8779000-3fa877a000 ---p 00000000 00:00 0 [anon:Ruby:fiber_pool_allocate_memory]
3fa877a000-3fa87bb000 rw-p 00000000 00:00 0 [anon:Ruby:fiber_pool_allocate_memory]
3fa87bb000-3fa87bc000 ---p 00000000 00:00 0 [anon:Ruby:fiber_pool_allocate_memory]
3fa87bc000-3fa87fd000 rw-p 00000000 00:00 0 [anon:Ruby:fiber_pool_allocate_memory]
3fa87fd000-3fa87fe000 ---p 00000000 00:00 0 [anon:Ruby:fiber_pool_allocate_memory]
3fa87fe000-3fa883f000 rw-p 00000000 00:00 0 [anon:Ruby:fiber_pool_allocate_memory]
3fa883f000-3fa8840000 ---p 00000000 00:00 0 [anon:Ruby:fiber_pool_allocate_memory]
3fa8840000-3fa8881000 rw-p 00000000 00:00 0 [anon:Ruby:fiber_pool_allocate_memory]
3fa8881000-3fa8882000 ---p 00000000 00:00 0 [anon:Ruby:fiber_pool_allocate_memory]
3fa8882000-3fa88c3000 rw-p 00000000 00:00 0 [anon:Ruby:fiber_pool_allocate_memory]
3fa88c3000-3fa88c4000 ---p 00000000 00:00 0 [anon:Ruby:fiber_pool_allocate_memory]
3fa88c4000-3fa8905000 rw-p 00000000 00:00 0 [anon:Ruby:fiber_pool_allocate_memory]
3fa8905000-3fa8906000 ---p 00000000 00:00 0 [anon:Ruby:fiber_pool_allocate_memory]
3fa8906000-3fa8947000 rw-p 00000000 00:00 0 [anon:Ruby:fiber_pool_allocate_memory]
3fa8947000-3fa8948000 ---p 00000000 00:00 0 [anon:Ruby:fiber_pool_allocate_memory]
3fa8948000-3fa8989000 rw-p 00000000 00:00 0 [anon:Ruby:fiber_pool_allocate_memory]
3fa8989000-3fa898a000 ---p 00000000 00:00 0 [anon:Ruby:fiber_pool_allocate_memory]
3fa898a000-3fa89cb000 rw-p 00000000 00:00 0 [anon:Ruby:fiber_pool_allocate_memory]
3fa89cb000-3fa89cc000 ---p 00000000 00:00 0 [anon:Ruby:fiber_pool_allocate_memory]
3fa89cc000-3fa8a0d000 rw-p 00000000 00:00 0 [anon:Ruby:fiber_pool_allocate_memory]
3fa8a0d000-3fa8a0e000 ---p 00000000 00:00 0 [anon:Ruby:fiber_pool_allocate_memory]
3fa8a0e000-3fa8a4f000 rw-p 00000000 00:00 0 [anon:Ruby:fiber_pool_allocate_memory]
3fa8a4f000-3fa8a50000 ---p 00000000 00:00 0
3fa8a50000-3fa9250000 rw-p 00000000 00:00 0
3fa9250000-3fa92c0000 rw-p 00000000 00:00 0 [anon:Ruby:GC:default:heap_page_body_allocate]
3fa92cf000-3fc12cf000 rw-p 00000000 00:00 0 [anon:Ruby:Init_default_shapes:shape_cache]
3fc12cf000-3fc26cf000 rw-p 00000000 00:00 0 [anon:Ruby:Init_default_shapes:shape_list]
3fc26e0000-3fc2700000 rw-p 00000000 00:00 0 [anon:Ruby:GC:default:heap_page_body_allocate]
3fc2708000-3fc270b000 r-xp 00000000 00:1e 2515895 /tmp/ruby/build/trunk/.ext/riscv64-linux/enc/trans/transdb.so
3fc270b000-3fc270c000 r--p 00002000 00:1e 2515895 /tmp/ruby/build/trunk/.ext/riscv64-linux/enc/trans/transdb.so
3fc270c000-3fc270d000 rw-p 00003000 00:1e 2515895 /tmp/ruby/build/trunk/.ext/riscv64-linux/enc/trans/transdb.so
3fc270d000-3fc280e000 rw-p 00000000 00:00 0
3fc280e000-3fc2866000 r--p 00000000 b3:03 8804 /usr/lib/locale/C.utf8/LC_CTYPE
3fc2866000-3fc2868000 rw-p 00000000 00:00 0
3fc2868000-3fc29d2000 r-xp 00000000 b3:03 5812 /usr/lib/riscv64-linux-gnu/libc.so.6
3fc29d2000-3fc29d5000 r--p 0016a000 b3:03 5812 /usr/lib/riscv64-linux-gnu/libc.so.6
3fc29d5000-3fc29d7000 rw-p 0016d000 b3:03 5812 /usr/lib/riscv64-linux-gnu/libc.so.6
3fc29d7000-3fc29e3000 rw-p 00000000 00:00 0
3fc29e3000-3fc2a5a000 r-xp 00000000 b3:03 5818 /usr/lib/riscv64-linux-gnu/libm.so.6
3fc2a5a000-3fc2a5b000 r--p 00077000 b3:03 5818 /usr/lib/riscv64-linux-gnu/libm.so.6
3fc2a5b000-3fc2a5c000 rw-p 00078000 b3:03 5818 /usr/lib/riscv64-linux-gnu/libm.so.6
3fc2a5c000-3fc2a8b000 r-xp 00000000 b3:03 4307 /usr/lib/riscv64-linux-gnu/libcrypt.so.1.1.0
3fc2a8b000-3fc2a8c000 r--p 0002e000 b3:03 4307 /usr/lib/riscv64-linux-gnu/libcrypt.so.1.1.0
3fc2a8c000-3fc2a8d000 rw-p 0002f000 b3:03 4307 /usr/lib/riscv64-linux-gnu/libcrypt.so.1.1.0
3fc2a8d000-3fc2a95000 rw-p 00000000 00:00 0
3fc2a95000-3fc2af1000 r-xp 00000000 b3:03 313 /usr/lib/riscv64-linux-gnu/libgmp.so.10.4.1
3fc2af1000-3fc2af2000 r--p 0005b000 b3:03 313 /usr/lib/riscv64-linux-gnu/libgmp.so.10.4.1
3fc2af2000-3fc2af3000 rw-p 0005c000 b3:03 313 /usr/lib/riscv64-linux-gnu/libgmp.so.10.4.1
3fc2af3000-3fc2b06000 r-xp 00000000 b3:03 4335 /usr/lib/riscv64-linux-gnu/libz.so.1.2.13
3fc2b06000-3fc2b07000 r--p 00013000 b3:03 4335 /usr/lib/riscv64-linux-gnu/libz.so.1.2.13
3fc2b07000-3fc2b08000 rw-p 00014000 b3:03 4335 /usr/lib/riscv64-linux-gnu/libz.so.1.2.13
3fc2b0a000-3fc2b0b000 r--p 00000000 00:1e 2803906 /tmp/rubytest.cdpdnw_1/90-rubyexe.rb
3fc2b0b000-3fc2b0d000 r-xp 00000000 00:1e 2511704 /tmp/ruby/build/trunk/.ext/riscv64-linux/enc/encdb.so
3fc2b0d000-3fc2b0e000 r--p 00001000 00:1e 2511704 /tmp/ruby/build/trunk/.ext/riscv64-linux/enc/encdb.so
3fc2b0e000-3fc2b0f000 rw-p 00002000 00:1e 2511704 /tmp/ruby/build/trunk/.ext/riscv64-linux/enc/encdb.so
3fc2b0f000-3fc2b16000 r--s 00000000 b3:03 10215 /usr/lib/riscv64-linux-gnu/gconv/gconv-modules.cache
3fc2b16000-3fc2f8d000 r-xp 00000000 00:1e 2734620 /tmp/ruby/build/trunk/libruby.so.3.5.0
3fc2f8d000-3fc2f97000 r--p 00476000 00:1e 2734620 /tmp/ruby/build/trunk/libruby.so.3.5.0
3fc2f97000-3fc2f9b000 rw-p 00480000 00:1e 2734620 /tmp/ruby/build/trunk/libruby.so.3.5.0
3fc2f9b000-3fc2fb0000 rw-p 00000000 00:00 0
3fc2fb0000-3fc2fb1000 r-xp 00000000 00:00 0 [vdso]
3fc2fb1000-3fc2fb2000 r--p 00000000 00:00 0 [vdso_data]
3fc2fb2000-3fc2fd2000 r-xp 00000000 b3:03 5806 /usr/lib/riscv64-linux-gnu/ld-linux-riscv64-lp64d.so.1
3fc2fd2000-3fc2fd4000 r--p 0001f000 b3:03 5806 /usr/lib/riscv64-linux-gnu/ld-linux-riscv64-lp64d.so.1
3fc2fd4000-3fc2fd6000 rw-p 00021000 b3:03 5806 /usr/lib/riscv64-linux-gnu/ld-linux-riscv64-lp64d.so.1
3fffc9e000-3fffcbf000 rw-p 00000000 00:00 0 [stack]
/tmp/ruby/src/trunk/spec/ruby/core/exception/top_level_spec.rb:5:in 'block (2 levels) in <top (required)>'
/tmp/ruby/src/trunk/spec/ruby/core/exception/top_level_spec.rb:3:in '<top (required)>'
make: *** [uncommon.mk:1026: yes-test-spec] Error 1
$$$[end] "make yes-test-rubyspec MSPECOPT='--error-output stderr -j' TESTS='-j4'" exit with 512.