# Logfile created on 2024-01-28 20:13:03 +0000 by logger.rb/v1.4.3
#<BuildRuby:0x000055c7c3565f50 @REPOSITORY="https://github.com/ruby/ruby.git", @REPOSITORY_TYPE=:git, @git_branch=nil, @git_worktree=nil, @svn_revision=nil, @SRC_DIR="/tmp/ruby/src", @BUILD_DIR="/tmp/ruby/build", @INSTALL_DIR="/tmp/ruby/install", @TARGET_NAME="trunk-yjit", @TARGET_SRC_DIR="/tmp/ruby/src/trunk-yjit", @TARGET_BUILD_DIR="/tmp/ruby/build/trunk-yjit", @TARGET_INSTALL_DIR="/tmp/ruby/install/trunk-yjit", @configure_opts=["cppflags=-DYJIT_FORCE_ENABLE"], @build_opts="-j4", @btest_opts="-j4", @test_opts="TESTS='-j4'", @incremental=true, @steps=["checkout", "autoconf", "configure", "build_up", "build_miniruby", "build_ruby", "build_all", "build_install", "test_btest", "test_basic", "test_all", "test_rubyspec"], @quiet=false, @gist=false, @timeout=10800, @logfile="/home/ko1/ruby/logs/brlog.trunk-yjit.20240128-201303", @ruby_env=[["RUBY_DEBUG", "ci"]], @make="make", @logger=#<Logger:0x000055c7c35fb410 @level=0, @progname=nil, @default_formatter=#<Logger::Formatter:0x000055c7c35fb280 @datetime_format=nil>, @formatter=nil, @logdev=#<Logger::LogDevice:0x000055c7c35fb0f0 @shift_period_suffix="%Y%m%d", @shift_size=1048576, @shift_age=0, @filename="/home/ko1/ruby/logs/brlog.trunk-yjit.20240128-201303", @dev=#<File:/home/ko1/ruby/logs/brlog.trunk-yjit.20240128-201303>, @binmode=false, @mon_data=#<Monitor:0x000055c7c35fb028>, @mon_data_owner_object_id=860>>>
$$$[beg] make update-unicode -j4
make: Nothing to be done for 'update-unicode'.
$$$[end] "make update-unicode -j4" exit with 0.
$$$[beg] make update-download -j4
tool/config.guess already exists
tool/config.sub already exists
Update debug to 91fe870eeceb9ffbbc7f1bb4673f9e2f6a2c1f60
echo 91fe870eeceb9ffbbc7f1bb4673f9e2f6a2c1f60 | /bin/sh /tmp/ruby/src/trunk-yjit/tool/ifchange /tmp/ruby/src/trunk-yjit/.bundle/.timestamp/debug.revision -
/tmp/ruby/src/trunk-yjit/.bundle/.timestamp/debug.revision unchanged
$$$[end] "make update-download -j4" exit with 0.
$$$[beg] make update-rubyspec -j4
make: Nothing to be done for 'update-rubyspec'.
$$$[end] "make update-rubyspec -j4" exit with 0.
$$$[beg] make update-src -j4
Already up to date.
Latest commit hash = 5ac9c8f01b
$$$[end] "make update-src -j4" exit with 0.
$$$[beg] make after-update -j4
/tmp/ruby/src/trunk-yjit/revision.h updated
generating x86_64-linux-fake.rb
x86_64-linux-fake.rb updated
generating enc.mk
making srcs under enc
make[1]: Entering directory '/tmp/ruby/build/trunk-yjit'
make[1]: Nothing to be done for 'srcs'.
make[1]: Leaving directory '/tmp/ruby/build/trunk-yjit'
Update debug to 91fe870eeceb9ffbbc7f1bb4673f9e2f6a2c1f60
echo 91fe870eeceb9ffbbc7f1bb4673f9e2f6a2c1f60 | /bin/sh /tmp/ruby/src/trunk-yjit/tool/ifchange /tmp/ruby/src/trunk-yjit/.bundle/.timestamp/debug.revision -
/tmp/ruby/src/trunk-yjit/.bundle/.timestamp/debug.revision unchanged
$$$[end] "make after-update -j4" exit with 0.
$$$[beg] make miniruby -j4
BASERUBY = /usr/bin/ruby --disable=gems
CC = gcc
LD = ld
LDSHARED = gcc -shared
CFLAGS = -O3 -fno-fast-math -ggdb3 -Wall -Wextra -Wdeprecated-declarations -Wdiv-by-zero -Wduplicated-cond -Wimplicit-function-declaration -Wimplicit-int -Wpointer-arith -Wwrite-strings -Wold-style-definition -Wimplicit-fallthrough=0 -Wmissing-noreturn -Wno-cast-function-type -Wno-constant-logical-operand -Wno-long-long -Wno-missing-field-initializers -Wno-overlength-strings -Wno-packed-bitfield-compat -Wno-parentheses-equality -Wno-self-assign -Wno-tautological-compare -Wno-unused-parameter -Wno-unused-value -Wsuggest-attribute=format -Wsuggest-attribute=noreturn -Wunused-variable -Wmisleading-indentation -Wundef
XCFLAGS = -U_FORTIFY_SOURCE -D_FORTIFY_SOURCE=2 -fstack-protector-strong -fno-strict-overflow -fvisibility=hidden -fexcess-precision=standard -DRUBY_EXPORT -fPIE -I. -I.ext/include/x86_64-linux -I/tmp/ruby/src/trunk-yjit/include -I/tmp/ruby/src/trunk-yjit -I/tmp/ruby/src/trunk-yjit/prism -I/tmp/ruby/src/trunk-yjit/enc/unicode/15.0.0
CPPFLAGS = -DYJIT_FORCE_ENABLE
DLDFLAGS = -Wl,--compress-debug-sections=zlib -fstack-protector-strong -pie
SOLIBS = -lz -lrt -lrt -lgmp -ldl -lcrypt -lm -lpthread
LANG =
LC_ALL =
LC_CTYPE =
MFLAGS = -j4 --jobserver-auth=4,5
RUSTC = rustc
YJIT_RUSTC_ARGS = --crate-name=yjit --crate-type=staticlib --edition=2021 -g -C lto=thin -C opt-level=3 -C overflow-checks=on '--out-dir=/tmp/ruby/build/trunk-yjit/yjit/target/release/' /tmp/ruby/src/trunk-yjit/yjit/src/lib.rs
gcc (Ubuntu 11.3.0-1ubuntu1~22.04.1) 11.3.0
Copyright (C) 2021 Free Software Foundation, Inc.
This is free software; see the source for copying conditions. There is NO
warranty; not even for MERCHANTABILITY or FITNESS FOR A PARTICULAR PURPOSE.
compiling /tmp/ruby/src/trunk-yjit/version.c
linking miniruby
$$$[end] "make miniruby -j4" exit with 0.
$$$[beg] make ruby -j4
BASERUBY = /usr/bin/ruby --disable=gems
CC = gcc
LD = ld
LDSHARED = gcc -shared
CFLAGS = -O3 -fno-fast-math -ggdb3 -Wall -Wextra -Wdeprecated-declarations -Wdiv-by-zero -Wduplicated-cond -Wimplicit-function-declaration -Wimplicit-int -Wpointer-arith -Wwrite-strings -Wold-style-definition -Wimplicit-fallthrough=0 -Wmissing-noreturn -Wno-cast-function-type -Wno-constant-logical-operand -Wno-long-long -Wno-missing-field-initializers -Wno-overlength-strings -Wno-packed-bitfield-compat -Wno-parentheses-equality -Wno-self-assign -Wno-tautological-compare -Wno-unused-parameter -Wno-unused-value -Wsuggest-attribute=format -Wsuggest-attribute=noreturn -Wunused-variable -Wmisleading-indentation -Wundef
XCFLAGS = -U_FORTIFY_SOURCE -D_FORTIFY_SOURCE=2 -fstack-protector-strong -fno-strict-overflow -fvisibility=hidden -fexcess-precision=standard -DRUBY_EXPORT -fPIE -I. -I.ext/include/x86_64-linux -I/tmp/ruby/src/trunk-yjit/include -I/tmp/ruby/src/trunk-yjit -I/tmp/ruby/src/trunk-yjit/prism -I/tmp/ruby/src/trunk-yjit/enc/unicode/15.0.0
CPPFLAGS = -DYJIT_FORCE_ENABLE
DLDFLAGS = -Wl,--compress-debug-sections=zlib -fstack-protector-strong -pie
SOLIBS = -lz -lrt -lrt -lgmp -ldl -lcrypt -lm -lpthread
LANG =
LC_ALL =
LC_CTYPE =
MFLAGS = -j4 --jobserver-auth=4,5
RUSTC = rustc
YJIT_RUSTC_ARGS = --crate-name=yjit --crate-type=staticlib --edition=2021 -g -C lto=thin -C opt-level=3 -C overflow-checks=on '--out-dir=/tmp/ruby/build/trunk-yjit/yjit/target/release/' /tmp/ruby/src/trunk-yjit/yjit/src/lib.rs
gcc (Ubuntu 11.3.0-1ubuntu1~22.04.1) 11.3.0
Copyright (C) 2021 Free Software Foundation, Inc.
This is free software; see the source for copying conditions. There is NO
warranty; not even for MERCHANTABILITY or FITNESS FOR A PARTICULAR PURPOSE.
builtin_binary.inc updated
8fce80a95e109352f64c6cb206bfa5235a7e522a910e8688e36c5f8a8231ed51 builtin_binary.inc
compiling /tmp/ruby/src/trunk-yjit/builtin.c
linking static-library libruby-static.a
linking ruby
$$$[end] "make ruby -j4" exit with 0.
$$$[beg] make all -j4
BASERUBY = /usr/bin/ruby --disable=gems
CC = gcc
LD = ld
LDSHARED = gcc -shared
CFLAGS = -O3 -fno-fast-math -ggdb3 -Wall -Wextra -Wdeprecated-declarations -Wdiv-by-zero -Wduplicated-cond -Wimplicit-function-declaration -Wimplicit-int -Wpointer-arith -Wwrite-strings -Wold-style-definition -Wimplicit-fallthrough=0 -Wmissing-noreturn -Wno-cast-function-type -Wno-constant-logical-operand -Wno-long-long -Wno-missing-field-initializers -Wno-overlength-strings -Wno-packed-bitfield-compat -Wno-parentheses-equality -Wno-self-assign -Wno-tautological-compare -Wno-unused-parameter -Wno-unused-value -Wsuggest-attribute=format -Wsuggest-attribute=noreturn -Wunused-variable -Wmisleading-indentation -Wundef
XCFLAGS = -U_FORTIFY_SOURCE -D_FORTIFY_SOURCE=2 -fstack-protector-strong -fno-strict-overflow -fvisibility=hidden -fexcess-precision=standard -DRUBY_EXPORT -fPIE -I. -I.ext/include/x86_64-linux -I/tmp/ruby/src/trunk-yjit/include -I/tmp/ruby/src/trunk-yjit -I/tmp/ruby/src/trunk-yjit/prism -I/tmp/ruby/src/trunk-yjit/enc/unicode/15.0.0
CPPFLAGS = -DYJIT_FORCE_ENABLE
DLDFLAGS = -Wl,--compress-debug-sections=zlib -fstack-protector-strong -pie
SOLIBS = -lz -lrt -lrt -lgmp -ldl -lcrypt -lm -lpthread
LANG =
LC_ALL =
LC_CTYPE =
MFLAGS = -j4 --jobserver-auth=4,5
RUSTC = rustc
YJIT_RUSTC_ARGS = --crate-name=yjit --crate-type=staticlib --edition=2021 -g -C lto=thin -C opt-level=3 -C overflow-checks=on '--out-dir=/tmp/ruby/build/trunk-yjit/yjit/target/release/' /tmp/ruby/src/trunk-yjit/yjit/src/lib.rs
gcc (Ubuntu 11.3.0-1ubuntu1~22.04.1) 11.3.0
Copyright (C) 2021 Free Software Foundation, Inc.
This is free software; see the source for copying conditions. There is NO
warranty; not even for MERCHANTABILITY or FITNESS FOR A PARTICULAR PURPOSE.
generating enc.mk
making srcs under enc
making enc
make[1]: Entering directory '/tmp/ruby/build/trunk-yjit'
make[1]: Nothing to be done for 'enc'.
make[1]: Leaving directory '/tmp/ruby/build/trunk-yjit'
make[1]: Entering directory '/tmp/ruby/build/trunk-yjit'
make[1]: Nothing to be done for 'srcs'.
make[1]: Leaving directory '/tmp/ruby/build/trunk-yjit'
generating transdb.h
transdb.h unchanged
generating makefiles ext/configure-ext.mk
making trans
ext/configure-ext.mk updated
make[1]: Entering directory '/tmp/ruby/build/trunk-yjit'
make[1]: Entering directory '/tmp/ruby/build/trunk-yjit'
make[1]: Nothing to be done for '/tmp/ruby/src/trunk-yjit/enc/trans'.
make[1]: Leaving directory '/tmp/ruby/build/trunk-yjit'
making encs
make[1]: Entering directory '/tmp/ruby/build/trunk-yjit'
make[1]: Nothing to be done for 'encs'.
make[1]: Leaving directory '/tmp/ruby/build/trunk-yjit'
make[1]: Leaving directory '/tmp/ruby/build/trunk-yjit'
generating makefile exts.mk
exts.mk unchanged
make[1]: Entering directory '/tmp/ruby/build/trunk-yjit'
make[2]: Entering directory '/tmp/ruby/build/trunk-yjit/ext/digest'
make[2]: Entering directory '/tmp/ruby/build/trunk-yjit/ext/coverage'
make[2]: Entering directory '/tmp/ruby/build/trunk-yjit/ext/date'
make[2]: Leaving directory '/tmp/ruby/build/trunk-yjit/ext/date'
make[2]: Leaving directory '/tmp/ruby/build/trunk-yjit/ext/digest'
make[2]: Leaving directory '/tmp/ruby/build/trunk-yjit/ext/coverage'
make[2]: Entering directory '/tmp/ruby/build/trunk-yjit/ext/io/console'
make[2]: Entering directory '/tmp/ruby/build/trunk-yjit/ext/fiddle'
make[2]: Leaving directory '/tmp/ruby/build/trunk-yjit/ext/io/console'
make[2]: Entering directory '/tmp/ruby/build/trunk-yjit/ext/json'
make[2]: Entering directory '/tmp/ruby/build/trunk-yjit/ext/monitor'
make[2]: Leaving directory '/tmp/ruby/build/trunk-yjit/ext/fiddle'
make[2]: Leaving directory '/tmp/ruby/build/trunk-yjit/ext/monitor'
make[2]: Entering directory '/tmp/ruby/build/trunk-yjit/ext/objspace'
make[2]: Entering directory '/tmp/ruby/build/trunk-yjit/ext/pathname'
make[2]: Leaving directory '/tmp/ruby/build/trunk-yjit/ext/json'
make[2]: Leaving directory '/tmp/ruby/build/trunk-yjit/ext/pathname'
make[2]: Leaving directory '/tmp/ruby/build/trunk-yjit/ext/objspace'
make[2]: Entering directory '/tmp/ruby/build/trunk-yjit/ext/psych'
make[2]: Entering directory '/tmp/ruby/build/trunk-yjit/ext/pty'
make[2]: Entering directory '/tmp/ruby/build/trunk-yjit/ext/openssl'
make[2]: Leaving directory '/tmp/ruby/build/trunk-yjit/ext/pty'
make[2]: Entering directory '/tmp/ruby/build/trunk-yjit/ext/rubyvm'
make[2]: Entering directory '/tmp/ruby/build/trunk-yjit/ext/ripper'
make[2]: Leaving directory '/tmp/ruby/build/trunk-yjit/ext/rubyvm'
make[2]: Leaving directory '/tmp/ruby/build/trunk-yjit/ext/psych'
make[2]: Leaving directory '/tmp/ruby/build/trunk-yjit/ext/ripper'
make[2]: Entering directory '/tmp/ruby/build/trunk-yjit/ext/socket'
make[2]: Entering directory '/tmp/ruby/build/trunk-yjit/.bundle/gems/bigdecimal-3.1.6/ext/bigdecimal'
make[2]: Leaving directory '/tmp/ruby/build/trunk-yjit/ext/openssl'
make[2]: Leaving directory '/tmp/ruby/build/trunk-yjit/ext/socket'
make[2]: Entering directory '/tmp/ruby/build/trunk-yjit/.bundle/gems/debug-1.9.1/ext/debug'
make[2]: Entering directory '/tmp/ruby/build/trunk-yjit/.bundle/gems/nkf-0.2.0/ext/nkf'
make[2]: Entering directory '/tmp/ruby/build/trunk-yjit/.bundle/gems/racc-1.7.3/ext/racc/cparse'
make[2]: Leaving directory '/tmp/ruby/build/trunk-yjit/.bundle/gems/bigdecimal-3.1.6/ext/bigdecimal'
make[2]: Leaving directory '/tmp/ruby/build/trunk-yjit/.bundle/gems/debug-1.9.1/ext/debug'
make[2]: Entering directory '/tmp/ruby/build/trunk-yjit/.bundle/gems/rbs-3.4.3/ext/rbs_extension'
make[2]: Entering directory '/tmp/ruby/build/trunk-yjit/.bundle/gems/syslog-0.1.2/ext/syslog'
make[2]: Leaving directory '/tmp/ruby/build/trunk-yjit/.bundle/gems/nkf-0.2.0/ext/nkf'
make[2]: Leaving directory '/tmp/ruby/build/trunk-yjit/.bundle/gems/racc-1.7.3/ext/racc/cparse'
make[2]: Entering directory '/tmp/ruby/build/trunk-yjit/ext/digest/sha2'
make[2]: Leaving directory '/tmp/ruby/build/trunk-yjit/ext/digest/sha2'
make[2]: Leaving directory '/tmp/ruby/build/trunk-yjit/.bundle/gems/syslog-0.1.2/ext/syslog'
make[2]: Leaving directory '/tmp/ruby/build/trunk-yjit/.bundle/gems/rbs-3.4.3/ext/rbs_extension'
make[2]: Entering directory '/tmp/ruby/build/trunk-yjit'
make[2]: 'ruby' is up to date.
make[2]: Leaving directory '/tmp/ruby/build/trunk-yjit'
make[1]: Leaving directory '/tmp/ruby/build/trunk-yjit'
make[1]: Entering directory '/tmp/ruby/build/trunk-yjit'
make[1]: Nothing to be done for 'note'.
make[1]: Leaving directory '/tmp/ruby/build/trunk-yjit'
$$$[end] "make all -j4" exit with 0.
$$$[beg] make install -j4
Update debug to 91fe870eeceb9ffbbc7f1bb4673f9e2f6a2c1f60
BASERUBY = /usr/bin/ruby --disable=gems
CC = gcc
LD = ld
LDSHARED = gcc -shared
CFLAGS = -O3 -fno-fast-math -ggdb3 -Wall -Wextra -Wdeprecated-declarations -Wdiv-by-zero -Wduplicated-cond -Wimplicit-function-declaration -Wimplicit-int -Wpointer-arith -Wwrite-strings -Wold-style-definition -Wimplicit-fallthrough=0 -Wmissing-noreturn -Wno-cast-function-type -Wno-constant-logical-operand -Wno-long-long -Wno-missing-field-initializers -Wno-overlength-strings -Wno-packed-bitfield-compat -Wno-parentheses-equality -Wno-self-assign -Wno-tautological-compare -Wno-unused-parameter -Wno-unused-value -Wsuggest-attribute=format -Wsuggest-attribute=noreturn -Wunused-variable -Wmisleading-indentation -Wundef
XCFLAGS = -U_FORTIFY_SOURCE -D_FORTIFY_SOURCE=2 -fstack-protector-strong -fno-strict-overflow -fvisibility=hidden -fexcess-precision=standard -DRUBY_EXPORT -fPIE -I. -I.ext/include/x86_64-linux -I/tmp/ruby/src/trunk-yjit/include -I/tmp/ruby/src/trunk-yjit -I/tmp/ruby/src/trunk-yjit/prism -I/tmp/ruby/src/trunk-yjit/enc/unicode/15.0.0
CPPFLAGS = -DYJIT_FORCE_ENABLE
DLDFLAGS = -Wl,--compress-debug-sections=zlib -fstack-protector-strong -pie
SOLIBS = -lz -lrt -lrt -lgmp -ldl -lcrypt -lm -lpthread
LANG =
LC_ALL =
LC_CTYPE =
MFLAGS = -j4 --jobserver-auth=4,5
RUSTC = rustc
YJIT_RUSTC_ARGS = --crate-name=yjit --crate-type=staticlib --edition=2021 -g -C lto=thin -C opt-level=3 -C overflow-checks=on '--out-dir=/tmp/ruby/build/trunk-yjit/yjit/target/release/' /tmp/ruby/src/trunk-yjit/yjit/src/lib.rs
echo 91fe870eeceb9ffbbc7f1bb4673f9e2f6a2c1f60 | /bin/sh /tmp/ruby/src/trunk-yjit/tool/ifchange /tmp/ruby/src/trunk-yjit/.bundle/.timestamp/debug.revision -
gcc (Ubuntu 11.3.0-1ubuntu1~22.04.1) 11.3.0
Copyright (C) 2021 Free Software Foundation, Inc.
This is free software; see the source for copying conditions. There is NO
warranty; not even for MERCHANTABILITY or FITNESS FOR A PARTICULAR PURPOSE.
/tmp/ruby/src/trunk-yjit/.bundle/.timestamp/debug.revision unchanged
generating enc.mk
making srcs under enc
making enc
make[1]: Entering directory '/tmp/ruby/build/trunk-yjit'
make[1]: Nothing to be done for 'enc'.
make[1]: Leaving directory '/tmp/ruby/build/trunk-yjit'
make[1]: Entering directory '/tmp/ruby/build/trunk-yjit'
make[1]: Nothing to be done for 'srcs'.
make[1]: Leaving directory '/tmp/ruby/build/trunk-yjit'
generating transdb.h
transdb.h unchanged
generating makefiles ext/configure-ext.mk
making trans
make[1]: Entering directory '/tmp/ruby/build/trunk-yjit'
make[1]: Nothing to be done for '/tmp/ruby/src/trunk-yjit/enc/trans'.
make[1]: Leaving directory '/tmp/ruby/build/trunk-yjit'
ext/configure-ext.mk unchanged
making encs
make[1]: Entering directory '/tmp/ruby/build/trunk-yjit'
make[1]: Entering directory '/tmp/ruby/build/trunk-yjit'
make[1]: Nothing to be done for 'encs'.
make[1]: Leaving directory '/tmp/ruby/build/trunk-yjit'
make[1]: Leaving directory '/tmp/ruby/build/trunk-yjit'
generating makefile exts.mk
exts.mk unchanged
make[1]: Entering directory '/tmp/ruby/build/trunk-yjit'
make[2]: Entering directory '/tmp/ruby/build/trunk-yjit/ext/coverage'
make[2]: Leaving directory '/tmp/ruby/build/trunk-yjit/ext/coverage'
make[2]: Entering directory '/tmp/ruby/build/trunk-yjit/ext/date'
make[2]: Entering directory '/tmp/ruby/build/trunk-yjit/ext/digest'
make[2]: Leaving directory '/tmp/ruby/build/trunk-yjit/ext/digest'
make[2]: Leaving directory '/tmp/ruby/build/trunk-yjit/ext/date'
make[2]: Entering directory '/tmp/ruby/build/trunk-yjit/ext/fiddle'
make[2]: Entering directory '/tmp/ruby/build/trunk-yjit/ext/io/console'
make[2]: Leaving directory '/tmp/ruby/build/trunk-yjit/ext/fiddle'
make[2]: Leaving directory '/tmp/ruby/build/trunk-yjit/ext/io/console'
make[2]: Entering directory '/tmp/ruby/build/trunk-yjit/ext/json'
make[2]: Entering directory '/tmp/ruby/build/trunk-yjit/ext/monitor'
make[2]: Entering directory '/tmp/ruby/build/trunk-yjit/ext/objspace'
make[2]: Leaving directory '/tmp/ruby/build/trunk-yjit/ext/monitor'
make[2]: Leaving directory '/tmp/ruby/build/trunk-yjit/ext/json'
make[2]: Entering directory '/tmp/ruby/build/trunk-yjit/ext/pathname'
make[2]: Entering directory '/tmp/ruby/build/trunk-yjit/ext/openssl'
make[2]: Leaving directory '/tmp/ruby/build/trunk-yjit/ext/objspace'
make[2]: Entering directory '/tmp/ruby/build/trunk-yjit/ext/psych'
make[2]: Leaving directory '/tmp/ruby/build/trunk-yjit/ext/pathname'
make[2]: Entering directory '/tmp/ruby/build/trunk-yjit/ext/pty'
make[2]: Entering directory '/tmp/ruby/build/trunk-yjit/ext/ripper'
make[2]: Leaving directory '/tmp/ruby/build/trunk-yjit/ext/pty'
make[2]: Entering directory '/tmp/ruby/build/trunk-yjit/ext/rubyvm'
make[2]: Leaving directory '/tmp/ruby/build/trunk-yjit/ext/psych'
make[2]: Leaving directory '/tmp/ruby/build/trunk-yjit/ext/openssl'
make[2]: Leaving directory '/tmp/ruby/build/trunk-yjit/ext/rubyvm'
make[2]: Leaving directory '/tmp/ruby/build/trunk-yjit/ext/ripper'
make[2]: Entering directory '/tmp/ruby/build/trunk-yjit/ext/socket'
make[2]: Leaving directory '/tmp/ruby/build/trunk-yjit/ext/socket'
make[2]: Entering directory '/tmp/ruby/build/trunk-yjit/.bundle/gems/bigdecimal-3.1.6/ext/bigdecimal'
make[2]: Entering directory '/tmp/ruby/build/trunk-yjit/.bundle/gems/debug-1.9.1/ext/debug'
make[2]: Entering directory '/tmp/ruby/build/trunk-yjit/.bundle/gems/nkf-0.2.0/ext/nkf'
make[2]: Entering directory '/tmp/ruby/build/trunk-yjit/.bundle/gems/racc-1.7.3/ext/racc/cparse'
make[2]: Leaving directory '/tmp/ruby/build/trunk-yjit/.bundle/gems/nkf-0.2.0/ext/nkf'
make[2]: Entering directory '/tmp/ruby/build/trunk-yjit/.bundle/gems/rbs-3.4.3/ext/rbs_extension'
make[2]: Leaving directory '/tmp/ruby/build/trunk-yjit/.bundle/gems/bigdecimal-3.1.6/ext/bigdecimal'
make[2]: Entering directory '/tmp/ruby/build/trunk-yjit/.bundle/gems/syslog-0.1.2/ext/syslog'
make[2]: Leaving directory '/tmp/ruby/build/trunk-yjit/.bundle/gems/debug-1.9.1/ext/debug'
make[2]: Leaving directory '/tmp/ruby/build/trunk-yjit/.bundle/gems/rbs-3.4.3/ext/rbs_extension'
make[2]: Entering directory '/tmp/ruby/build/trunk-yjit/ext/digest/sha2'
make[2]: Leaving directory '/tmp/ruby/build/trunk-yjit/.bundle/gems/racc-1.7.3/ext/racc/cparse'
make[2]: Leaving directory '/tmp/ruby/build/trunk-yjit/ext/digest/sha2'
make[2]: Leaving directory '/tmp/ruby/build/trunk-yjit/.bundle/gems/syslog-0.1.2/ext/syslog'
make[2]: Entering directory '/tmp/ruby/build/trunk-yjit'
make[2]: 'ruby' is up to date.
make[2]: Leaving directory '/tmp/ruby/build/trunk-yjit'
make[1]: Leaving directory '/tmp/ruby/build/trunk-yjit'
make[1]: Entering directory '/tmp/ruby/build/trunk-yjit'
make[1]: Nothing to be done for 'note'.
make[1]: Leaving directory '/tmp/ruby/build/trunk-yjit'
./miniruby -I/tmp/ruby/src/trunk-yjit/lib -I. -I.ext/common /tmp/ruby/src/trunk-yjit/tool/runruby.rb --extout=.ext -- --disable-gems -r./x86_64-linux-fake /tmp/ruby/src/trunk-yjit/tool/rbinstall.rb --make="make" --dest-dir="" --extout=".ext" --ext-build-dir="./ext" --mflags="-j4 --jobserver-auth=4,5" --make-flags=" -j4 --jobserver-auth=4,5" --data-mode=0644 --prog-mode=0755 --installed-list .installed.list --mantype="man" --gnumake --install=all --exclude=doc
Installing to
installing binary commands: /tmp/ruby/install/trunk-yjit/bin
installing base libraries: /tmp/ruby/install/trunk-yjit/lib
installing arch files: /tmp/ruby/install/trunk-yjit/lib/ruby/3.4.0+0/x86_64-linux
installing pkgconfig data: /tmp/ruby/install/trunk-yjit/lib/pkgconfig
installing extension objects: /tmp/ruby/install/trunk-yjit/lib/ruby/3.4.0+0/x86_64-linux
installing extension objects: /tmp/ruby/install/trunk-yjit/lib/ruby/site_ruby/3.4.0+0/x86_64-linux
installing extension objects: /tmp/ruby/install/trunk-yjit/lib/ruby/vendor_ruby/3.4.0+0/x86_64-linux
installing extension headers: /tmp/ruby/install/trunk-yjit/include/ruby-3.4.0+0/x86_64-linux
installing extension scripts: /tmp/ruby/install/trunk-yjit/lib/ruby/3.4.0+0
installing extension scripts: /tmp/ruby/install/trunk-yjit/lib/ruby/site_ruby/3.4.0+0
installing extension scripts: /tmp/ruby/install/trunk-yjit/lib/ruby/vendor_ruby/3.4.0+0
installing extension headers: /tmp/ruby/install/trunk-yjit/include/ruby-3.4.0+0/ruby
installing command scripts: /tmp/ruby/install/trunk-yjit/bin
installing library scripts: /tmp/ruby/install/trunk-yjit/lib/ruby/3.4.0+0
installing common headers: /tmp/ruby/install/trunk-yjit/include/ruby-3.4.0+0
installing manpages: /tmp/ruby/install/trunk-yjit/share/man/man1
installing default gems from lib: /tmp/ruby/install/trunk-yjit/lib/ruby/gems/3.4.0+0
benchmark 0.3.0
bundler 2.6.0.dev
cgi 0.4.1
delegate 0.3.1
did_you_mean 1.6.3
english 0.8.0
erb 4.0.4
error_highlight 0.6.0
fileutils 1.7.2
find 0.2.0
forwardable 1.3.3
ipaddr 1.2.6
irb 1.11.1
logger 1.6.0
net-http 0.4.1
net-protocol 0.2.2
open-uri 0.4.1
open3 0.2.1
optparse 0.4.0
ostruct 0.6.0
pp 0.5.0
prettyprint 0.2.0
prism 0.19.0
pstore 0.1.3
rdoc 6.6.2
readline 0.0.4
reline 0.4.2
resolv 0.3.0
ruby2_keywords 0.0.5
securerandom 0.3.1
set 1.1.0
shellwords 0.2.0
singleton 0.2.0
syntax_suggest 2.0.0
tempfile 0.2.1
time 0.3.0
timeout 0.4.1
tmpdir 0.2.0
tsort 0.2.0
un 0.3.0
uri 0.13.0
weakref 0.1.3
yaml 0.3.0
installing default gems from ext: /tmp/ruby/install/trunk-yjit/lib/ruby/gems/3.4.0+0
date 3.3.4
digest 3.1.1
etc 1.4.3
fcntl 1.1.0
fiddle 1.1.3
io-console 0.7.2
io-nonblock 0.3.0
io-wait 0.3.1
json 2.7.1
openssl 3.2.0
pathname 0.3.0
psych 5.1.2
stringio 3.1.1
strscan 3.0.9
zlib 3.1.0
installing bundled gems: /tmp/ruby/install/trunk-yjit/lib/ruby/gems/3.4.0+0
minitest 5.21.2
power_assert 2.0.3
rake 13.1.0
test-unit 3.6.1
rexml 3.2.6
rss 0.3.0
net-ftp 0.3.4
net-imap 0.4.9.1
net-pop 0.1.2
net-smtp 0.4.0.1
matrix 0.4.2
prime 0.1.2
rbs 3.4.3
typeprof 0.21.9
debug 1.9.1
racc 1.7.3
mutex_m 0.2.0
getoptlong 0.2.1
base64 0.2.0
bigdecimal 3.1.6
observer 0.1.2
abbrev 0.1.2
resolv-replace 0.1.1
rinda 0.2.0
drb 2.2.0
nkf 0.2.0
syslog 0.1.2
csv 3.2.8
installing bundled gem cache: /tmp/ruby/install/trunk-yjit/lib/ruby/gems/3.4.0+0/cache
$$$[end] "make install -j4" exit with 0.
$$$[beg] make yes-btest TESTOPTS='-q -j4'
PASS all 1883 tests
$$$[end] "make yes-btest TESTOPTS='-q -j4'" exit with 0.
$$$[beg] make yes-test-basic TESTS='-j4'
BASERUBY = /usr/bin/ruby --disable=gems
CC = gcc
LD = ld
LDSHARED = gcc -shared
CFLAGS = -O3 -fno-fast-math -ggdb3 -Wall -Wextra -Wdeprecated-declarations -Wdiv-by-zero -Wduplicated-cond -Wimplicit-function-declaration -Wimplicit-int -Wpointer-arith -Wwrite-strings -Wold-style-definition -Wimplicit-fallthrough=0 -Wmissing-noreturn -Wno-cast-function-type -Wno-constant-logical-operand -Wno-long-long -Wno-missing-field-initializers -Wno-overlength-strings -Wno-packed-bitfield-compat -Wno-parentheses-equality -Wno-self-assign -Wno-tautological-compare -Wno-unused-parameter -Wno-unused-value -Wsuggest-attribute=format -Wsuggest-attribute=noreturn -Wunused-variable -Wmisleading-indentation -Wundef
XCFLAGS = -U_FORTIFY_SOURCE -D_FORTIFY_SOURCE=2 -fstack-protector-strong -fno-strict-overflow -fvisibility=hidden -fexcess-precision=standard -DRUBY_EXPORT -fPIE -I. -I.ext/include/x86_64-linux -I/tmp/ruby/src/trunk-yjit/include -I/tmp/ruby/src/trunk-yjit -I/tmp/ruby/src/trunk-yjit/prism -I/tmp/ruby/src/trunk-yjit/enc/unicode/15.0.0
CPPFLAGS = -DYJIT_FORCE_ENABLE
DLDFLAGS = -Wl,--compress-debug-sections=zlib -fstack-protector-strong -pie
SOLIBS = -lz -lrt -lrt -lgmp -ldl -lcrypt -lm -lpthread
LANG =
LC_ALL =
LC_CTYPE =
MFLAGS =
RUSTC = rustc
YJIT_RUSTC_ARGS = --crate-name=yjit --crate-type=staticlib --edition=2021 -g -C lto=thin -C opt-level=3 -C overflow-checks=on '--out-dir=/tmp/ruby/build/trunk-yjit/yjit/target/release/' /tmp/ruby/src/trunk-yjit/yjit/src/lib.rs
gcc (Ubuntu 11.3.0-1ubuntu1~22.04.1) 11.3.0
Copyright (C) 2021 Free Software Foundation, Inc.
This is free software; see the source for copying conditions. There is NO
warranty; not even for MERCHANTABILITY or FITNESS FOR A PARTICULAR PURPOSE.
Ignore setproctitle.o because of setproctitle.c under missing
Ignore strlcat.o because of strlcat.c under missing
Ignore strlcpy.o because of strlcpy.c under missing
Checking leaked global symbols...none
/tmp/ruby/src/trunk-yjit/basictest/test.rb:assignment ....................................................................................................................................................................................................................................................................................................................................................................................OK 372
/tmp/ruby/src/trunk-yjit/basictest/test.rb:condition ..OK 2
/tmp/ruby/src/trunk-yjit/basictest/test.rb:if/unless ...OK 3
/tmp/ruby/src/trunk-yjit/basictest/test.rb:case .....OK 5
/tmp/ruby/src/trunk-yjit/basictest/test.rb:while/until ........OK 8
/tmp/ruby/src/trunk-yjit/basictest/test.rb:exception ..........OK 10
/tmp/ruby/src/trunk-yjit/basictest/test.rb:array .......................................OK 39
/tmp/ruby/src/trunk-yjit/basictest/test.rb:hash ...........................OK 27
/tmp/ruby/src/trunk-yjit/basictest/test.rb:iterator ...........................................................................................................OK 107
/tmp/ruby/src/trunk-yjit/basictest/test.rb:float ................................................................................OK 80
/tmp/ruby/src/trunk-yjit/basictest/test.rb:bignum ...............................OK 31
/tmp/ruby/src/trunk-yjit/basictest/test.rb:string & char ..............................................................OK 62
/tmp/ruby/src/trunk-yjit/basictest/test.rb:assignment ..........OK 10
/tmp/ruby/src/trunk-yjit/basictest/test.rb:call ......OK 6
/tmp/ruby/src/trunk-yjit/basictest/test.rb:proc .........OK 9
/tmp/ruby/src/trunk-yjit/basictest/test.rb:signal ..OK 2
/tmp/ruby/src/trunk-yjit/basictest/test.rb:eval ...........................OK 27
/tmp/ruby/src/trunk-yjit/basictest/test.rb:system ........OK 8
/tmp/ruby/src/trunk-yjit/basictest/test.rb:const .....OK 5
/tmp/ruby/src/trunk-yjit/basictest/test.rb:clone .....OK 5
/tmp/ruby/src/trunk-yjit/basictest/test.rb:marshal ....OK 4
/tmp/ruby/src/trunk-yjit/basictest/test.rb:pack ....OK 4
/tmp/ruby/src/trunk-yjit/basictest/test.rb:math ..OK 2
/tmp/ruby/src/trunk-yjit/basictest/test.rb:struct ......OK 6
/tmp/ruby/src/trunk-yjit/basictest/test.rb:variable ............OK 12
/tmp/ruby/src/trunk-yjit/basictest/test.rb:trace ...OK 3
/tmp/ruby/src/trunk-yjit/basictest/test.rb:defined? ............OK 12
/tmp/ruby/src/trunk-yjit/basictest/test.rb:alias ......OK 6
/tmp/ruby/src/trunk-yjit/basictest/test.rb:path .......................OK 23
/tmp/ruby/src/trunk-yjit/basictest/test.rb:gc ....OK 4
test succeeded
$$$[end] "make yes-test-basic TESTS='-j4'" exit with 0.
$$$[beg] make yes-test-all TESTOPTS='--stderr-on-failure' TESTS='-j4'
BASERUBY = /usr/bin/ruby --disable=gems
CC = gcc
LD = ld
LDSHARED = gcc -shared
CFLAGS = -O3 -fno-fast-math -ggdb3 -Wall -Wextra -Wdeprecated-declarations -Wdiv-by-zero -Wduplicated-cond -Wimplicit-function-declaration -Wimplicit-int -Wpointer-arith -Wwrite-strings -Wold-style-definition -Wimplicit-fallthrough=0 -Wmissing-noreturn -Wno-cast-function-type -Wno-constant-logical-operand -Wno-long-long -Wno-missing-field-initializers -Wno-overlength-strings -Wno-packed-bitfield-compat -Wno-parentheses-equality -Wno-self-assign -Wno-tautological-compare -Wno-unused-parameter -Wno-unused-value -Wsuggest-attribute=format -Wsuggest-attribute=noreturn -Wunused-variable -Wmisleading-indentation -Wundef
XCFLAGS = -U_FORTIFY_SOURCE -D_FORTIFY_SOURCE=2 -fstack-protector-strong -fno-strict-overflow -fvisibility=hidden -fexcess-precision=standard -DRUBY_EXPORT -fPIE -I. -I.ext/include/x86_64-linux -I/tmp/ruby/src/trunk-yjit/include -I/tmp/ruby/src/trunk-yjit -I/tmp/ruby/src/trunk-yjit/prism -I/tmp/ruby/src/trunk-yjit/enc/unicode/15.0.0
CPPFLAGS = -DYJIT_FORCE_ENABLE
DLDFLAGS = -Wl,--compress-debug-sections=zlib -fstack-protector-strong -pie
SOLIBS = -lz -lrt -lrt -lgmp -ldl -lcrypt -lm -lpthread
LANG =
LC_ALL =
LC_CTYPE =
MFLAGS =
RUSTC = rustc
YJIT_RUSTC_ARGS = --crate-name=yjit --crate-type=staticlib --edition=2021 -g -C lto=thin -C opt-level=3 -C overflow-checks=on '--out-dir=/tmp/ruby/build/trunk-yjit/yjit/target/release/' /tmp/ruby/src/trunk-yjit/yjit/src/lib.rs
gcc (Ubuntu 11.3.0-1ubuntu1~22.04.1) 11.3.0
Copyright (C) 2021 Free Software Foundation, Inc.
This is free software; see the source for copying conditions. There is NO
warranty; not even for MERCHANTABILITY or FITNESS FOR A PARTICULAR PURPOSE.
generating enc.mk
making enc
make[1]: Entering directory '/tmp/ruby/build/trunk-yjit'
make[1]: Nothing to be done for 'enc'.
make[1]: Leaving directory '/tmp/ruby/build/trunk-yjit'
making srcs under enc
make[1]: Entering directory '/tmp/ruby/build/trunk-yjit'
make[1]: Nothing to be done for 'srcs'.
make[1]: Leaving directory '/tmp/ruby/build/trunk-yjit'
generating transdb.h
transdb.h unchanged
making trans
make[1]: Entering directory '/tmp/ruby/build/trunk-yjit'
make[1]: Nothing to be done for '/tmp/ruby/src/trunk-yjit/enc/trans'.
make[1]: Leaving directory '/tmp/ruby/build/trunk-yjit'
making encs
make[1]: Entering directory '/tmp/ruby/build/trunk-yjit'
make[1]: Nothing to be done for 'encs'.
make[1]: Leaving directory '/tmp/ruby/build/trunk-yjit'
generating makefiles ext/configure-ext.mk
ext/configure-ext.mk updated
make[1]: Entering directory '/tmp/ruby/build/trunk-yjit'
make[1]: Leaving directory '/tmp/ruby/build/trunk-yjit'
generating makefile exts.mk
exts.mk unchanged
make[1]: Entering directory '/tmp/ruby/build/trunk-yjit'
make[2]: Entering directory '/tmp/ruby/build/trunk-yjit/ext/coverage'
make[2]: Leaving directory '/tmp/ruby/build/trunk-yjit/ext/coverage'
make[2]: Entering directory '/tmp/ruby/build/trunk-yjit/ext/date'
make[2]: Leaving directory '/tmp/ruby/build/trunk-yjit/ext/date'
make[2]: Entering directory '/tmp/ruby/build/trunk-yjit/ext/digest'
make[2]: Leaving directory '/tmp/ruby/build/trunk-yjit/ext/digest'
make[2]: Entering directory '/tmp/ruby/build/trunk-yjit/ext/digest/sha2'
make[2]: Leaving directory '/tmp/ruby/build/trunk-yjit/ext/digest/sha2'
make[2]: Entering directory '/tmp/ruby/build/trunk-yjit/ext/fiddle'
make[2]: Leaving directory '/tmp/ruby/build/trunk-yjit/ext/fiddle'
make[2]: Entering directory '/tmp/ruby/build/trunk-yjit/ext/io/console'
make[2]: Leaving directory '/tmp/ruby/build/trunk-yjit/ext/io/console'
make[2]: Entering directory '/tmp/ruby/build/trunk-yjit/ext/json'
make[2]: Leaving directory '/tmp/ruby/build/trunk-yjit/ext/json'
make[2]: Entering directory '/tmp/ruby/build/trunk-yjit/ext/monitor'
make[2]: Leaving directory '/tmp/ruby/build/trunk-yjit/ext/monitor'
make[2]: Entering directory '/tmp/ruby/build/trunk-yjit/ext/objspace'
make[2]: Leaving directory '/tmp/ruby/build/trunk-yjit/ext/objspace'
make[2]: Entering directory '/tmp/ruby/build/trunk-yjit/ext/openssl'
make[2]: Leaving directory '/tmp/ruby/build/trunk-yjit/ext/openssl'
make[2]: Entering directory '/tmp/ruby/build/trunk-yjit/ext/pathname'
make[2]: Leaving directory '/tmp/ruby/build/trunk-yjit/ext/pathname'
make[2]: Entering directory '/tmp/ruby/build/trunk-yjit/ext/psych'
make[2]: Leaving directory '/tmp/ruby/build/trunk-yjit/ext/psych'
make[2]: Entering directory '/tmp/ruby/build/trunk-yjit/ext/pty'
make[2]: Leaving directory '/tmp/ruby/build/trunk-yjit/ext/pty'
make[2]: Entering directory '/tmp/ruby/build/trunk-yjit/ext/ripper'
make[2]: Leaving directory '/tmp/ruby/build/trunk-yjit/ext/ripper'
make[2]: Entering directory '/tmp/ruby/build/trunk-yjit/ext/rubyvm'
make[2]: Leaving directory '/tmp/ruby/build/trunk-yjit/ext/rubyvm'
make[2]: Entering directory '/tmp/ruby/build/trunk-yjit/ext/socket'
make[2]: Leaving directory '/tmp/ruby/build/trunk-yjit/ext/socket'
make[2]: Entering directory '/tmp/ruby/build/trunk-yjit/.bundle/gems/bigdecimal-3.1.6/ext/bigdecimal'
make[2]: Leaving directory '/tmp/ruby/build/trunk-yjit/.bundle/gems/bigdecimal-3.1.6/ext/bigdecimal'
make[2]: Entering directory '/tmp/ruby/build/trunk-yjit/.bundle/gems/debug-1.9.1/ext/debug'
make[2]: Leaving directory '/tmp/ruby/build/trunk-yjit/.bundle/gems/debug-1.9.1/ext/debug'
make[2]: Entering directory '/tmp/ruby/build/trunk-yjit/.bundle/gems/nkf-0.2.0/ext/nkf'
make[2]: Leaving directory '/tmp/ruby/build/trunk-yjit/.bundle/gems/nkf-0.2.0/ext/nkf'
make[2]: Entering directory '/tmp/ruby/build/trunk-yjit/.bundle/gems/racc-1.7.3/ext/racc/cparse'
make[2]: Leaving directory '/tmp/ruby/build/trunk-yjit/.bundle/gems/racc-1.7.3/ext/racc/cparse'
make[2]: Entering directory '/tmp/ruby/build/trunk-yjit/.bundle/gems/rbs-3.4.3/ext/rbs_extension'
make[2]: Leaving directory '/tmp/ruby/build/trunk-yjit/.bundle/gems/rbs-3.4.3/ext/rbs_extension'
make[2]: Entering directory '/tmp/ruby/build/trunk-yjit/.bundle/gems/syslog-0.1.2/ext/syslog'
make[2]: Leaving directory '/tmp/ruby/build/trunk-yjit/.bundle/gems/syslog-0.1.2/ext/syslog'
make[2]: Entering directory '/tmp/ruby/build/trunk-yjit'
make[2]: 'ruby' is up to date.
make[2]: Leaving directory '/tmp/ruby/build/trunk-yjit'
make[1]: Leaving directory '/tmp/ruby/build/trunk-yjit'
make[1]: Entering directory '/tmp/ruby/build/trunk-yjit'
make[1]: Nothing to be done for 'note'.
make[1]: Leaving directory '/tmp/ruby/build/trunk-yjit'
Run options:
--seed=54643
"--ruby=./miniruby -I/tmp/ruby/src/trunk-yjit/lib -I. -I.ext/common /tmp/ruby/src/trunk-yjit/tool/runruby.rb --extout=.ext -- --disable-gems"
--excludes-dir=/tmp/ruby/src/trunk-yjit/test/.excludes
--name=!/memory_leak/
--stderr-on-failure
-j4
--exclude=rubygems/test_gem_package_task\.rb
# Running tests:
[ 1/862] 1069472=test_date_conv
[ 2/862] 1069472=test_history
[ 3/862] 1069474=test_rdoc_markup_to_tt_only
[ 4/862] 1069471=test_egrep_cpp
[ 5/862] 1069476=!Nothing_to_test
[ 6/862] 1069476=test_io
[ 7/862] 1069472=json_parser_test
[ 8/862] 1069472=test_gem_resolver_vendor_set
[ 9/862] 1069471=test_verbose
[ 10/862] 1069474=test_rb_str_dup
[ 11/862] 1069474=test_trick
[ 12/862] 1069471=test_helper
[ 13/862] 1069471=test_div
[ 14/862] 1069471=test_gem_commands_specification_command
[ 15/862] 1069472=test_rdoc_parser_markdown
[ 16/862] 1069476=test_gem_ext_cargo_builder_unit
[ 17/862] 1069472=test_tmpdir
[ 18/862] 1069472=test_show_source
[ 19/862] 1069472=test_gem_command
[ 20/862] 1069476=test_rdoc_tom_doc
[ 21/862] 1069471=test_deprecated
[ 22/862] 1069471=test_fips
[ 23/862] 1069472=test_kernel
[ 24/862] 1069476=test_scanner_events
[ 25/862] 1069476=test_optarg
[ 26/862] 1069476=test_gem_resolver_git_specification
[ 27/862] 1069471=errors_test
[ 28/862] 1069472=test_socket
[ 29/862] 1069471=desugar_compiler_test
[ 30/862] 1069471=test_class
[ 31/862] 1069471=test_exception
[ 32/862] 1069476=test_flags
[ 33/862] 1069471=test_gem_rdoc
[ 34/862] 1069471=test_vm_dump
[ 35/862] 1069471=test_input_method
[ 36/862] 1069471=test_gem_dependency_installer
[ 37/862] 1069474=test_enum
[ 38/862] 1069476=test_rdoc_rd_block_parser
[ 39/862] 1069476=test_human_typo
[ 40/862] 1069476=test_reline
[ 41/862] 1069476=test_memory_view
[ 42/862] 1069476=test_io_buffer
[ 43/862] 1069476=test_tcp
[ 44/862] 1069474=test_assignment
[ 45/862] 1069476=test_rdoc_rdoc
[ 46/862] 1069472=test_grapheme_breaks
[ 47/862] 1069476=test_gem_commands_yank_command
[ 48/862] 1069472=test_object_references
[ 49/862] 1069472=test_win32ole_param_event
[ 50/862] 1069472=test_bug-5832
[ 51/862] 1069472=test_err_in_callback
[ 52/862] 1069472=test_rdoc_stats
[ 53/862] 1069472=test_rdoc_markup_attributes
[ 54/862] 1069472=test_rdoc_store
[ 55/862] 1069476=test_resize
[ 56/862] 1069476=parameters_signature_test
[ 57/862] 1069476=test_rdoc_parser_changelog
[ 58/862] 1069474=test_store
[ 59/862] 1069476=test_provider
[ 60/862] 1069472=test_object
[ 61/862] 1069472=test_rdoc_markup_document
[ 62/862] 1069472=test_gem_gemcutter_utilities
[ 63/862] 1069474=test_inadvertent_creation
[ 64/862] 1069474=test_buffering
[ 65/862] 1069474=test_svcb_https
[ 66/862] 1069474=test_coderange
[ 67/862] 1069474=test_default_gems
[ 68/862] 1069472=test_len
[ 69/862] 1069472=test_gem_console_ui
[ 70/862] 1069472=test_gc_compact
[ 71/862] 1069474=test_ossl
[ 72/862] 1069471=test_enumerator_kw
[ 73/862] 1069471=test_ruby_lex
[ 74/862] 1069476=newline_test
[ 75/862] 1069471=test_gem_ext_cargo_builder_link_flag_converter
[ 76/862] 1069476=test_keyword
[ 77/862] 1069471=test_call
[ 78/862] 1069471=test_backtrace
[ 79/862] 1069471=test_date_new
[ 80/862] 1069471=test_gem_safe_marshal
[ 81/862] 1069476=test_bug-3571
[ 82/862] 1069476=test_win32ole_event
[ 83/862] 1069476=test_folderitem2_invokeverb
[ 84/862] 1069476=test_require_path_check
[ 85/862] 1069476=test_gem_resolver_api_specification
[ 86/862] 1069476=test_optimization
[ 87/862] 1069471=test_variable_name_check
[ 88/862] 1069471=test_ole_methods
[ 89/862] 1069471=test_date_parse
[ 90/862] 1069471=test_gem_resolver_index_set
[ 91/862] 1069471=test_exception_at_throwing
[ 92/862] 1069471=test_rdoc_class_module
[ 93/862] 1069471=test_pkey_ec
[ 94/862] 1069471=test_thread
[ 95/862] 1069471=test_date_compat
[ 96/862] 1069471=test_str2big
[ 97/862] 1069471=test_spell_checker
[ 98/862] 1069471=test_symbol
[ 99/862] 1069471=test_gem_version_option
[100/862] 1069471=test_scan_args
[101/862] 1069471=test_eval
[102/862] 1069471=test_normalize
[103/862] 1069471=test_gem_resolver_git_set
[104/862] 1069472=test_gem_commands_update_command
[105/862] 1069471=test_class_name_check
[106/862] 1069471=test_ipaddr
[107/862] 1069471=test_files_test_2
ruby: YJIT has panicked. More info to follow...
thread '<unnamed>' panicked at 'assertion failed: `(left == right)`
left: `0x7f9ff7db44f0`,
right: `0x7f9ff407e748`: each stub expects a particular iseq', /tmp/ruby/src/trunk-yjit/yjit/src/core.rs:2751:9
stack backtrace:
0: rust_begin_unwind
at /build/rustc-Oic09u/rustc-1.65.0+dfsg0ubuntu1/library/std/src/panicking.rs:584:5
1: core::panicking::panic_fmt
at /build/rustc-Oic09u/rustc-1.65.0+dfsg0ubuntu1/library/core/src/panicking.rs:142:14
2: core::panicking::assert_failed_inner
3: core::panicking::assert_failed
at /build/rustc-Oic09u/rustc-1.65.0+dfsg0ubuntu1/library/core/src/panicking.rs:181:5
4: yjit::core::branch_stub_hit_body
at /tmp/ruby/src/trunk-yjit/yjit/src/core.rs:2751:9
5: yjit::core::branch_stub_hit::{{closure}}::{{closure}}
at /tmp/ruby/src/trunk-yjit/yjit/src/core.rs:2696:36
6: yjit::stats::with_compile_time
at /tmp/ruby/src/trunk-yjit/yjit/src/stats.rs:979:15
7: yjit::core::branch_stub_hit::{{closure}}
at /tmp/ruby/src/trunk-yjit/yjit/src/core.rs:2696:13
8: std::panicking::try::do_call
at /build/rustc-Oic09u/rustc-1.65.0+dfsg0ubuntu1/library/std/src/panicking.rs:492:40
9: std::panicking::try
at /build/rustc-Oic09u/rustc-1.65.0+dfsg0ubuntu1/library/std/src/panicking.rs:456:19
10: std::panic::catch_unwind
at /build/rustc-Oic09u/rustc-1.65.0+dfsg0ubuntu1/library/std/src/panic.rs:137:14
11: yjit::cruby::with_vm_lock
at /tmp/ruby/src/trunk-yjit/yjit/src/cruby.rs:647:21
12: yjit::core::branch_stub_hit
at /tmp/ruby/src/trunk-yjit/yjit/src/core.rs:2695:9
13: <unknown>
note: Some details are omitted, run with `RUST_BACKTRACE=full` for a verbose backtrace.
/tmp/ruby/src/trunk-yjit/tool/lib/test/unit/testcase.rb:167: [BUG] YJIT panicked
ruby 3.4.0dev (2024-01-28T15:27:19Z master 5ac9c8f01b) +YJIT [x86_64-linux]
-- Control frame information -----------------------------------------------
c:0012 p:0052 s:0085 e:000084 METHOD /tmp/ruby/src/trunk-yjit/tool/lib/test/unit/testcase.rb:167 [FINISH]
c:0011 p:0083 s:0076 e:000075 BLOCK /tmp/ruby/src/trunk-yjit/tool/lib/test/unit.rb:1552 [FINISH]
c:0010 p:---- s:0069 e:000068 CFUNC :map
c:0009 p:0103 s:0065 e:000064 METHOD /tmp/ruby/src/trunk-yjit/tool/lib/test/unit.rb:1539
c:0008 p:0035 s:0053 e:000052 METHOD /tmp/ruby/src/trunk-yjit/tool/lib/test/unit.rb:1332
c:0007 p:0066 s:0046 E:000ba0 METHOD /tmp/ruby/src/trunk-yjit/tool/lib/test/unit/parallel.rb:52
c:0006 p:0007 s:0030 e:000029 BLOCK /tmp/ruby/src/trunk-yjit/tool/lib/test/unit/parallel.rb:24 [FINISH]
c:0005 p:---- s:0026 e:000025 CFUNC :map
c:0004 p:0005 s:0022 e:000021 METHOD /tmp/ruby/src/trunk-yjit/tool/lib/test/unit/parallel.rb:23
c:0003 p:0202 s:0016 e:000015 METHOD /tmp/ruby/src/trunk-yjit/tool/lib/test/unit/parallel.rb:122
c:0002 p:0051 s:0006 e:000005 EVAL /tmp/ruby/src/trunk-yjit/tool/lib/test/unit/parallel.rb:209 [FINISH]
c:0001 p:0000 s:0003 E:0026d0 DUMMY [FINISH]
-- Ruby level backtrace information ----------------------------------------
/tmp/ruby/src/trunk-yjit/tool/lib/test/unit/parallel.rb:209:in `<main>'
/tmp/ruby/src/trunk-yjit/tool/lib/test/unit/parallel.rb:122:in `run'
/tmp/ruby/src/trunk-yjit/tool/lib/test/unit/parallel.rb:23:in `_run_suites'
/tmp/ruby/src/trunk-yjit/tool/lib/test/unit/parallel.rb:23:in `map'
/tmp/ruby/src/trunk-yjit/tool/lib/test/unit/parallel.rb:24:in `block in _run_suites'
/tmp/ruby/src/trunk-yjit/tool/lib/test/unit/parallel.rb:52:in `_run_suite'
/tmp/ruby/src/trunk-yjit/tool/lib/test/unit.rb:1332:in `_run_suite'
/tmp/ruby/src/trunk-yjit/tool/lib/test/unit.rb:1539:in `_run_suite'
/tmp/ruby/src/trunk-yjit/tool/lib/test/unit.rb:1539:in `map'
/tmp/ruby/src/trunk-yjit/tool/lib/test/unit.rb:1552:in `block in _run_suite'
/tmp/ruby/src/trunk-yjit/tool/lib/test/unit/testcase.rb:167:in `run'
-- Threading information ---------------------------------------------------
Total ractor count: 1
Ruby thread count for this ractor: 3
-- C level backtrace information -------------------------------------------
/tmp/ruby/build/trunk-yjit/ruby(rb_print_backtrace+0x14) [0x562980ecd211] /tmp/ruby/src/trunk-yjit/vm_dump.c:820
/tmp/ruby/build/trunk-yjit/ruby(rb_vm_bugreport) /tmp/ruby/src/trunk-yjit/vm_dump.c:1151
/tmp/ruby/build/trunk-yjit/ruby(bug_report_end+0x0) [0x56298109a6c6] /tmp/ruby/src/trunk-yjit/error.c:1042
/tmp/ruby/build/trunk-yjit/ruby(rb_bug_without_die) /tmp/ruby/src/trunk-yjit/error.c:1042
/tmp/ruby/build/trunk-yjit/ruby(die+0x0) [0x562980cb4933] /tmp/ruby/src/trunk-yjit/error.c:1050
/tmp/ruby/build/trunk-yjit/ruby(rb_bug) /tmp/ruby/src/trunk-yjit/error.c:1052
/tmp/ruby/build/trunk-yjit/ruby({closure#0}+0x78) [0x562980f8a478] /tmp/ruby/src/trunk-yjit/yjit/src/yjit.rs:105
/tmp/ruby/build/trunk-yjit/ruby(rust_panic_with_hook+0x196) [0x562980f48fb6] library/std/src/panicking.rs:702
/tmp/ruby/build/trunk-yjit/ruby({closure#0}+0x84) [0x562980f5ada4] library/std/src/panicking.rs:588
/tmp/ruby/build/trunk-yjit/ruby(__rust_end_short_backtrace<std::panicking::begin_panic_handler::{closure_env#0}, !>+0x14) [0x562980f5aaa4] library/std/src/sys_common/backtrace.rs:138
/tmp/ruby/build/trunk-yjit/ruby(begin_panic_handler+0x42) [0x562980f48bf2] library/std/src/panicking.rs:584
/tmp/ruby/build/trunk-yjit/ruby(panic_fmt+0x33) [0x562980cade93] library/core/src/panicking.rs:142
/tmp/ruby/src/trunk-yjit/tool/lib/test/unit/parallel.rb(assert_failed_inner+0x1be) [0x562980f249fe]
/tmp/ruby/build/trunk-yjit/ruby(assert_failed<*const yjit::cruby::rb_iseq_t, *const yjit::cruby::rb_iseq_t>+0x4b) [0x562980cb018b] /build/rustc-Oic09u/rustc-1.65.0+dfsg0ubuntu1/library/core/src/panicking.rs:181
/tmp/ruby/build/trunk-yjit/ruby(branch_stub_hit_body+0x740) [0x562980fb6360] /tmp/ruby/src/trunk-yjit/yjit/src/core.rs:2751
/tmp/ruby/build/trunk-yjit/ruby({closure#0}+0x5) [0x562980fbb7a3] /tmp/ruby/src/trunk-yjit/yjit/src/core.rs:2696
/tmp/ruby/build/trunk-yjit/ruby(with_compile_time<yjit::core::branch_stub_hit::{closure#0}::{closure_env#0}, *const u8>) /tmp/ruby/src/trunk-yjit/yjit/src/stats.rs:979
/tmp/ruby/build/trunk-yjit/ruby({closure#0}+0x14) [0x562980fca01c] /tmp/ruby/src/trunk-yjit/yjit/src/core.rs:2696
/tmp/ruby/build/trunk-yjit/ruby(do_call<yjit::core::branch_stub_hit::{closure_env#0}, *const u8>) /build/rustc-Oic09u/rustc-1.65.0+dfsg0ubuntu1/library/std/src/panicking.rs:492
/tmp/ruby/build/trunk-yjit/ruby(with_vm_lock<yjit::core::branch_stub_hit::{closure_env#0}, *const u8>) /build/rustc-Oic09u/rustc-1.65.0+dfsg0ubuntu1/library/std/src/panicking.rs:456
/tmp/ruby/build/trunk-yjit/ruby(branch_stub_hit+0x71) [0x562980fb9c61] /tmp/ruby/src/trunk-yjit/yjit/src/core.rs:2695
[0x562983320033]
-- Other runtime information -----------------------------------------------
* Loaded script: /tmp/ruby/src/trunk-yjit/tool/lib/test/unit/parallel.rb
* Loaded features:
0 enumerator.so
1 thread.rb
2 fiber.so
3 rational.so
4 complex.so
5 ruby2_keywords.rb
6 /tmp/ruby/build/trunk-yjit/.ext/x86_64-linux/enc/encdb.so
7 /tmp/ruby/build/trunk-yjit/.ext/x86_64-linux/enc/trans/transdb.so
8 /tmp/ruby/src/trunk-yjit/lib/open3/version.rb
9 /tmp/ruby/src/trunk-yjit/lib/open3.rb
10 /tmp/ruby/src/trunk-yjit/lib/timeout.rb
11 /tmp/ruby/build/trunk-yjit/rbconfig.rb
12 /tmp/ruby/src/trunk-yjit/tool/lib/find_executable.rb
13 /tmp/ruby/build/trunk-yjit/.ext/x86_64-linux/rbconfig/sizeof.so
14 /tmp/ruby/src/trunk-yjit/tool/lib/envutil.rb
15 /tmp/ruby/src/trunk-yjit/tool/lib/colorize.rb
16 /tmp/ruby/src/trunk-yjit/tool/lib/leakchecker.rb
17 /tmp/ruby/src/trunk-yjit/lib/prettyprint.rb
18 /tmp/ruby/src/trunk-yjit/lib/pp.rb
19 /tmp/ruby/src/trunk-yjit/tool/lib/test/unit/assertions.rb
20 /tmp/ruby/build/trunk-yjit/.ext/x86_64-linux/io/console.so
21 /tmp/ruby/src/trunk-yjit/tool/lib/core_assertions.rb
22 /tmp/ruby/src/trunk-yjit/tool/lib/test/unit/testcase.rb
23 /tmp/ruby/src/trunk-yjit/lib/optparse.rb
24 /tmp/ruby/src/trunk-yjit/tool/lib/test/unit.rb
25 /tmp/ruby/src/trunk-yjit/tool/lib/tracepointchecker.rb
26 /tmp/ruby/src/trunk-yjit/tool/lib/zombie_hunter.rb
27 /tmp/ruby/src/trunk-yjit/lib/delegate.rb
28 /tmp/ruby/src/trunk-yjit/lib/fileutils.rb
29 /tmp/ruby/build/trunk-yjit/.ext/x86_64-linux/etc.so
30 /tmp/ruby/src/trunk-yjit/lib/tmpdir.rb
31 /tmp/ruby/src/trunk-yjit/lib/tempfile.rb
32 /tmp/ruby/src/trunk-yjit/tool/lib/iseq_loader_checker.rb
33 /tmp/ruby/src/trunk-yjit/tool/lib/gc_checker.rb
34 /tmp/ruby/src/trunk-yjit/tool/test/init.rb
35 /tmp/ruby/src/trunk-yjit/lib/rubygems/compatibility.rb
36 /tmp/ruby/src/trunk-yjit/lib/rubygems/defaults.rb
37 /tmp/ruby/src/trunk-yjit/lib/rubygems/deprecate.rb
38 /tmp/ruby/src/trunk-yjit/lib/rubygems/errors.rb
39 /tmp/ruby/src/trunk-yjit/lib/rubygems/unknown_command_spell_checker.rb
40 /tmp/ruby/src/trunk-yjit/lib/rubygems/exceptions.rb
41 /tmp/ruby/src/trunk-yjit/lib/rubygems/basic_specification.rb
42 /tmp/ruby/src/trunk-yjit/lib/rubygems/stub_specification.rb
43 /tmp/ruby/src/trunk-yjit/lib/rubygems/platform.rb
44 /tmp/ruby/src/trunk-yjit/lib/rubygems/util/list.rb
45 /tmp/ruby/src/trunk-yjit/lib/rubygems/version.rb
46 /tmp/ruby/src/trunk-yjit/lib/rubygems/requirement.rb
47 /tmp/ruby/src/trunk-yjit/lib/rubygems/specification.rb
48 /tmp/ruby/src/trunk-yjit/lib/rubygems/util.rb
49 /tmp/ruby/src/trunk-yjit/lib/rubygems/dependency.rb
50 /tmp/ruby/src/trunk-yjit/lib/rubygems/core_ext/kernel_gem.rb
51 /tmp/ruby/build/trunk-yjit/.ext/x86_64-linux/monitor.so
52 /tmp/ruby/build/trunk-yjit/.ext/common/monitor.rb
53 /tmp/ruby/src/trunk-yjit/lib/rubygems.rb
54 /tmp/ruby/src/trunk-yjit/lib/rubygems/path_support.rb
55 /tmp/ruby/src/trunk-yjit/test/lib/!Nothing_to_test.rb
56 /tmp/ruby/build/trunk-yjit/.ext/x86_64-linux/socket.so
57 /tmp/ruby/build/trunk-yjit/.ext/common/socket.rb
58 /tmp/ruby/build/trunk-yjit/.ext/x86_64-linux/io/nonblock.so
59 /tmp/ruby/src/trunk-yjit/test/fiber/scheduler.rb
60 /tmp/ruby/src/trunk-yjit/test/fiber/test_io.rb
61 /tmp/ruby/build/trunk-yjit/.ext/x86_64-linux/pathname.so
62 /tmp/ruby/build/trunk-yjit/.ext/common/pathname.rb
63 /tmp/ruby/build/trunk-yjit/.ext/common/digest/version.rb
64 /tmp/ruby/build/trunk-yjit/.ext/x86_64-linux/digest.so
65 /tmp/ruby/build/trunk-yjit/.ext/common/digest/loader.rb
66 /tmp/ruby/build/trunk-yjit/.ext/common/digest.rb
67 /tmp/ruby/build/trunk-yjit/.ext/x86_64-linux/openssl.so
68 /tmp/ruby/build/trunk-yjit/.ext/common/openssl/bn.rb
69 /tmp/ruby/build/trunk-yjit/.ext/common/openssl/marshal.rb
70 /tmp/ruby/build/trunk-yjit/.ext/common/openssl/pkey.rb
71 /tmp/ruby/build/trunk-yjit/.ext/common/openssl/cipher.rb
72 /tmp/ruby/build/trunk-yjit/.ext/common/openssl/digest.rb
73 /tmp/ruby/build/trunk-yjit/.ext/common/openssl/hmac.rb
74 /tmp/ruby/build/trunk-yjit/.ext/common/openssl/x509.rb
75 /tmp/ruby/build/trunk-yjit/.ext/common/openssl/buffering.rb
76 /tmp/ruby/src/trunk-yjit/lib/ipaddr.rb
77 /tmp/ruby/build/trunk-yjit/.ext/common/openssl/ssl.rb
78 /tmp/ruby/build/trunk-yjit/.ext/common/openssl/pkcs5.rb
79 /tmp/ruby/build/trunk-yjit/.ext/common/openssl/version.rb
80 /tmp/ruby/build/trunk-yjit/.ext/common/openssl.rb
81 /tmp/ruby/src/trunk-yjit/lib/rubygems/openssl.rb
82 /tmp/ruby/src/trunk-yjit/lib/rubygems/text.rb
83 /tmp/ruby/src/trunk-yjit/lib/rubygems/user_interaction.rb
84 /tmp/ruby/src/trunk-yjit/lib/rubygems/security/policy.rb
85 /tmp/ruby/src/trunk-yjit/lib/rubygems/security/policies.rb
86 /tmp/ruby/src/trunk-yjit/lib/rubygems/security/trust_dir.rb
87 /tmp/ruby/src/trunk-yjit/lib/rubygems/security/signer.rb
88 /tmp/ruby/src/trunk-yjit/lib/rubygems/security.rb
89 /tmp/ruby/src/trunk-yjit/lib/rubygems/package/digest_io.rb
90 /tmp/ruby/src/trunk-yjit/lib/rubygems/package/source.rb
91 /tmp/ruby/src/trunk-yjit/lib/rubygems/package/file_source.rb
92 /tmp/ruby/src/trunk-yjit/lib/rubygems/package/io_source.rb
93 /tmp/ruby/src/trunk-yjit/lib/rubygems/package/old.rb
94 /tmp/ruby/src/trunk-yjit/lib/rubygems/package/tar_header.rb
95 /tmp/ruby/src/trunk-yjit/lib/rubygems/package/tar_reader/entry.rb
96 /tmp/ruby/src/trunk-yjit/lib/rubygems/package/tar_reader.rb
97 /tmp/ruby/src/trunk-yjit/lib/rubygems/package/tar_writer.rb
98 /tmp/ruby/src/trunk-yjit/lib/rubygems/package.rb
99 /tmp/ruby/src/trunk-yjit/lib/shellwords.rb
100 /tmp/ruby/src/trunk-yjit/lib/uri/version.rb
101 /tmp/ruby/src/trunk-yjit/lib/uri/rfc2396_parser.rb
102 /tmp/ruby/src/trunk-yjit/lib/uri/rfc3986_parser.rb
103 /tmp/ruby/src/trunk-yjit/lib/uri/common.rb
104 /tmp/ruby/src/trunk-yjit/lib/uri/generic.rb
105 /tmp/ruby/src/trunk-yjit/lib/uri/file.rb
106 /tmp/ruby/src/trunk-yjit/lib/uri/ftp.rb
107 /tmp/ruby/src/trunk-yjit/lib/uri/http.rb
108 /tmp/ruby/src/trunk-yjit/lib/uri/https.rb
109 /tmp/ruby/src/trunk-yjit/lib/uri/ldap.rb
110 /tmp/ruby/src/trunk-yjit/lib/uri/ldaps.rb
111 /tmp/ruby/src/trunk-yjit/lib/uri/mailto.rb
112 /tmp/ruby/src/trunk-yjit/lib/uri/ws.rb
113 /tmp/ruby/src/trunk-yjit/lib/uri/wss.rb
114 /tmp/ruby/src/trunk-yjit/lib/uri.rb
115 /tmp/ruby/build/trunk-yjit/.ext/x86_64-linux/zlib.so
116 /tmp/ruby/src/trunk-yjit/lib/benchmark.rb
117 /tmp/ruby/src/trunk-yjit/test/rubygems/mock_gem_ui.rb
118 /tmp/ruby/build/trunk-yjit/.ext/x86_64-linux/stringio.so
119 /tmp/ruby/src/trunk-yjit/lib/rubygems/optparse/lib/optparse.rb
120 /tmp/ruby/src/trunk-yjit/lib/rubygems/optparse.rb
121 /tmp/ruby/src/trunk-yjit/lib/rubygems/command.rb
122 /tmp/ruby/src/trunk-yjit/lib/rubygems/resolver/molinillo/lib/molinillo/gem_metadata.rb
123 /tmp/ruby/src/trunk-yjit/lib/rubygems/resolver/molinillo/lib/molinillo/delegates/specification_provider.rb
124 /tmp/ruby/src/trunk-yjit/lib/rubygems/resolver/molinillo/lib/molinillo/errors.rb
125 /tmp/ruby/src/trunk-yjit/lib/rubygems/tsort/lib/tsort.rb
126 /tmp/ruby/src/trunk-yjit/lib/rubygems/tsort.rb
127 /tmp/ruby/src/trunk-yjit/lib/rubygems/resolver/molinillo/lib/molinillo/dependency_graph/action.rb
128 /tmp/ruby/src/trunk-yjit/lib/rubygems/resolver/molinillo/lib/molinillo/dependency_graph/add_edge_no_circular.rb
129 /tmp/ruby/src/trunk-yjit/lib/rubygems/resolver/molinillo/lib/molinillo/dependency_graph/add_vertex.rb
130 /tmp/ruby/src/trunk-yjit/lib/rubygems/resolver/molinillo/lib/molinillo/dependency_graph/delete_edge.rb
131 /tmp/ruby/src/trunk-yjit/lib/rubygems/resolver/molinillo/lib/molinillo/dependency_graph/detach_vertex_named.rb
132 /tmp/ruby/src/trunk-yjit/lib/rubygems/resolver/molinillo/lib/molinillo/dependency_graph/set_payload.rb
133 /tmp/ruby/src/trunk-yjit/lib/rubygems/resolver/molinillo/lib/molinillo/dependency_graph/tag.rb
134 /tmp/ruby/src/trunk-yjit/lib/rubygems/resolver/molinillo/lib/molinillo/dependency_graph/log.rb
135 /tmp/ruby/src/trunk-yjit/lib/rubygems/resolver/molinillo/lib/molinillo/dependency_graph/vertex.rb
136 /tmp/ruby/src/trunk-yjit/lib/rubygems/resolver/molinillo/lib/molinillo/dependency_graph.rb
137 /tmp/ruby/src/trunk-yjit/lib/rubygems/resolver/molinillo/lib/molinillo/state.rb
138 /tmp/ruby/src/trunk-yjit/lib/rubygems/resolver/molinillo/lib/molinillo/modules/specification_provider.rb
139 /tmp/ruby/src/trunk-yjit/lib/rubygems/resolver/molinillo/lib/molinillo/delegates/resolution_state.rb
140 /tmp/ruby/src/trunk-yjit/lib/rubygems/resolver/molinillo/lib/molinillo/resolution.rb
141 /tmp/ruby/src/trunk-yjit/lib/rubygems/resolver/molinillo/lib/molinillo/resolver.rb
142 /tmp/ruby/src/trunk-yjit/lib/rubygems/resolver/molinillo/lib/molinillo/modules/ui.rb
143 /tmp/ruby/src/trunk-yjit/lib/rubygems/resolver/molinillo/lib/molinillo.rb
144 /tmp/ruby/src/trunk-yjit/lib/rubygems/resolver/molinillo.rb
145 /tmp/ruby/src/trunk-yjit/lib/rubygems/resolver/activation_request.rb
146 /tmp/ruby/src/trunk-yjit/lib/rubygems/resolver/conflict.rb
147 /tmp/ruby/src/trunk-yjit/lib/rubygems/resolver/dependency_request.rb
148 /tmp/ruby/src/trunk-yjit/lib/rubygems/resolver/requirement_list.rb
149 /tmp/ruby/src/trunk-yjit/lib/rubygems/resolver/stats.rb
150 /tmp/ruby/src/trunk-yjit/lib/rubygems/resolver/set.rb
151 /tmp/ruby/src/trunk-yjit/lib/rubygems/resolver/api_set.rb
152 /tmp/ruby/src/trunk-yjit/lib/rubygems/resolver/composed_set.rb
153 /tmp/ruby/src/trunk-yjit/lib/rubygems/resolver/best_set.rb
154 /tmp/ruby/src/trunk-yjit/lib/rubygems/resolver/current_set.rb
155 /tmp/ruby/src/trunk-yjit/lib/rubygems/resolver/git_set.rb
156 /tmp/ruby/src/trunk-yjit/lib/rubygems/resolver/index_set.rb
157 /tmp/ruby/src/trunk-yjit/lib/rubygems/resolver/installer_set.rb
158 /tmp/ruby/src/trunk-yjit/lib/rubygems/resolver/lock_set.rb
159 /tmp/ruby/src/trunk-yjit/lib/rubygems/resolver/vendor_set.rb
160 /tmp/ruby/src/trunk-yjit/lib/rubygems/resolver/source_set.rb
161 /tmp/ruby/src/trunk-yjit/lib/rubygems/resolver/specification.rb
162 /tmp/ruby/src/trunk-yjit/lib/rubygems/resolver/spec_specification.rb
163 /tmp/ruby/src/trunk-yjit/lib/rubygems/resolver/api_specification.rb
164 /tmp/ruby/src/trunk-yjit/lib/rubygems/resolver/git_specification.rb
165 /tmp/ruby/src/trunk-yjit/lib/rubygems/resolver/index_specification.rb
166 /tmp/ruby/src/trunk-yjit/lib/rubygems/resolver/installed_specification.rb
167 /tmp/ruby/src/trunk-yjit/lib/rubygems/resolver/local_specification.rb
168 /tmp/ruby/src/trunk-yjit/lib/rubygems/resolver/lock_specification.rb
169 /tmp/ruby/src/trunk-yjit/lib/rubygems/resolver/vendor_specification.rb
170 /tmp/ruby/src/trunk-yjit/lib/rubygems/resolver.rb
171 /tmp/ruby/src/trunk-yjit/lib/rubygems/timeout/lib/timeout.rb
172 /tmp/ruby/build/trunk-yjit/.ext/x86_64-linux/io/wait.so
173 /tmp/ruby/src/trunk-yjit/lib/rubygems/net-protocol/lib/net/protocol.rb
174 /tmp/ruby/src/trunk-yjit/lib/random/formatter.rb
175 /tmp/ruby/src/trunk-yjit/lib/securerandom.rb
176 /tmp/ruby/src/trunk-yjit/lib/rubygems/resolv/lib/resolv.rb
177 /tmp/ruby/src/trunk-yjit/lib/rubygems/net-http/lib/net/http/exceptions.rb
178 /tmp/ruby/src/trunk-yjit/lib/rubygems/net-http/lib/net/http/header.rb
179 /tmp/ruby/src/trunk-yjit/lib/rubygems/net-http/lib/net/http/generic_request.rb
180 /tmp/ruby/src/trunk-yjit/lib/rubygems/net-http/lib/net/http/request.rb
181 /tmp/ruby/src/trunk-yjit/lib/rubygems/net-http/lib/net/http/requests.rb
182 /tmp/ruby/src/trunk-yjit/lib/rubygems/net-http/lib/net/http/response.rb
183 /tmp/ruby/src/trunk-yjit/lib/rubygems/net-http/lib/net/http/responses.rb
184 /tmp/ruby/src/trunk-yjit/lib/rubygems/net-http/lib/net/http/proxy_delta.rb
185 /tmp/ruby/src/trunk-yjit/lib/rubygems/net-http/lib/net/http/backward.rb
186 /tmp/ruby/src/trunk-yjit/lib/rubygems/net-http/lib/net/http.rb
187 /tmp/ruby/src/trunk-yjit/lib/rubygems/net/http.rb
188 /tmp/ruby/src/trunk-yjit/lib/rubygems/request/http_pool.rb
189 /tmp/ruby/src/trunk-yjit/lib/rubygems/request/https_pool.rb
190 /tmp/ruby/src/trunk-yjit/lib/rubygems/request/connection_pools.rb
191 /tmp/ruby/src/trunk-yjit/lib/rubygems/request.rb
192 /tmp/ruby/src/trunk-yjit/lib/rubygems/s3_uri_signer.rb
193 /tmp/ruby/src/trunk-yjit/lib/rubygems/uri_formatter.rb
194 /tmp/ruby/src/trunk-yjit/lib/rubygems/uri.rb
195 /tmp/ruby/src/trunk-yjit/lib/rubygems/remote_fetcher.rb
196 /tmp/ruby/src/trunk-yjit/test/rubygems/utilities.rb
197 /tmp/ruby/src/trunk-yjit/test/rubygems/helper.rb
198 /tmp/ruby/src/trunk-yjit/lib/rubygems/ext/build_error.rb
199 /tmp/ruby/src/trunk-yjit/lib/rubygems/shellwords.rb
200 /tmp/ruby/src/trunk-yjit/lib/rubygems/ext/builder.rb
201 /tmp/ruby/src/trunk-yjit/lib/rubygems/ext/configure_builder.rb
202 /tmp/ruby/src/trunk-yjit/lib/rubygems/ext/ext_conf_builder.rb
203 /tmp/ruby/src/trunk-yjit/lib/rubygems/ext/rake_builder.rb
204 /tmp/ruby/src/trunk-yjit/lib/rubygems/ext/cmake_builder.rb
205 /tmp/ruby/src/trunk-yjit/lib/rubygems/ext/cargo_builder.rb
206 /tmp/ruby/src/trunk-yjit/lib/rubygems/ext.rb
207 /tmp/ruby/src/trunk-yjit/test/rubygems/test_gem_ext_cargo_builder_unit.rb
208 /tmp/ruby/src/trunk-yjit/lib/rubygems/config_file.rb
209 /tmp/ruby/src/trunk-yjit/lib/rubygems/source_list.rb
210 /tmp/ruby/src/trunk-yjit/lib/rubygems/source/git.rb
211 /tmp/ruby/src/trunk-yjit/lib/rubygems/source/installed.rb
212 /tmp/ruby/src/trunk-yjit/lib/rubygems/source/specific_file.rb
213 /tmp/ruby/src/trunk-yjit/lib/rubygems/source/local.rb
214 /tmp/ruby/src/trunk-yjit/lib/rubygems/source/lock.rb
215 /tmp/ruby/src/trunk-yjit/lib/rubygems/source/vendor.rb
216 /tmp/ruby/src/trunk-yjit/lib/rubygems/source.rb
217 /tmp/ruby/src/trunk-yjit/lib/rubygems/name_tuple.rb
218 /tmp/ruby/src/trunk-yjit/lib/rubygems/spec_fetcher.rb
219 /tmp/ruby/src/trunk-yjit/lib/rubygems/ext/cargo_builder/link_flag_converter.rb
220 /tmp/ruby/src/trunk-yjit/lib/bundler/errors.rb
221 /tmp/ruby/src/trunk-yjit/lib/rdoc/version.rb
222 /tmp/ruby/src/trunk-yjit/lib/rdoc/i18n/text.rb
223 /tmp/ruby/src/trunk-yjit/lib/rdoc/i18n.rb
224 /tmp/ruby/src/trunk-yjit/lib/rdoc.rb
225 /tmp/ruby/src/trunk-yjit/test/rdoc/support/test_case.rb
226 /tmp/ruby/src/trunk-yjit/lib/rdoc/markup.rb
227 /tmp/ruby/src/trunk-yjit/test/rdoc/support/formatter_test_case.rb
228 /tmp/ruby/src/trunk-yjit/test/rdoc/support/text_formatter_test_case.rb
229 /tmp/ruby/src/trunk-yjit/test/rdoc/helper.rb
230 /tmp/ruby/src/trunk-yjit/test/rdoc/test_rdoc_tom_doc.rb
231 /tmp/ruby/src/trunk-yjit/lib/rdoc/store.rb
232 /tmp/ruby/src/trunk-yjit/lib/find.rb
233 /tmp/ruby/build/trunk-yjit/.ext/x86_64-linux/date_core.so
234 /tmp/ruby/build/trunk-yjit/.ext/common/date.rb
235 /tmp/ruby/src/trunk-yjit/lib/time.rb
236 /tmp/ruby/build/trunk-yjit/.ext/x86_64-linux/cgi/escape.so
237 /tmp/ruby/src/trunk-yjit/lib/cgi/util.rb
238 /tmp/ruby/src/trunk-yjit/lib/erb/version.rb
239 /tmp/ruby/build/trunk-yjit/.ext/x86_64-linux/strscan.so
240 /tmp/ruby/src/trunk-yjit/lib/erb/compiler.rb
241 /tmp/ruby/src/trunk-yjit/lib/erb/def_method.rb
242 /tmp/ruby/build/trunk-yjit/.ext/x86_64-linux/erb/escape.so
243 /tmp/ruby/src/trunk-yjit/lib/erb/util.rb
244 /tmp/ruby/src/trunk-yjit/lib/erb.rb
245 /tmp/ruby/src/trunk-yjit/lib/rdoc/generator.rb
246 /tmp/ruby/src/trunk-yjit/lib/rdoc/markup/formatter.rb
247 /tmp/ruby/src/trunk-yjit/lib/rdoc/markup/to_joined_paragraph.rb
248 /tmp/ruby/src/trunk-yjit/lib/rdoc/markdown/entities.rb
249 /tmp/ruby/src/trunk-yjit/lib/rdoc/markdown/literals.rb
250 /tmp/ruby/src/trunk-yjit/lib/rdoc/markdown.rb
251 /tmp/ruby/src/trunk-yjit/lib/rdoc/rd.rb
252 /tmp/ruby/src/trunk-yjit/lib/rdoc/markup/parser.rb
253 /tmp/ruby/src/trunk-yjit/lib/rdoc/markup/pre_process.rb
254 /tmp/ruby/src/trunk-yjit/lib/rdoc/tom_doc.rb
255 /tmp/ruby/src/trunk-yjit/lib/rdoc/text.rb
256 /tmp/ruby/src/trunk-yjit/lib/rdoc/code_object.rb
257 /tmp/ruby/src/trunk-yjit/lib/rdoc/method_attr.rb
258 /tmp/ruby/src/trunk-yjit/lib/rdoc/context.rb
259 /tmp/ruby/src/trunk-yjit/lib/rdoc/class_module.rb
260 /tmp/ruby/src/trunk-yjit/lib/rdoc/context/section.rb
261 /tmp/ruby/src/trunk-yjit/lib/rdoc/top_level.rb
262 /tmp/ruby/src/trunk-yjit/lib/rdoc/generator/markup.rb
263 /tmp/ruby/src/trunk-yjit/lib/rdoc/generator/darkfish.rb
264 /tmp/ruby/src/trunk-yjit/lib/rdoc/generator/ri.rb
265 /tmp/ruby/src/trunk-yjit/lib/rdoc/generator/pot/message_extractor.rb
266 /tmp/ruby/src/trunk-yjit/lib/rdoc/generator/pot/po.rb
267 /tmp/ruby/src/trunk-yjit/lib/rdoc/generator/pot/po_entry.rb
268 /tmp/ruby/src/trunk-yjit/lib/rdoc/generator/pot.rb
269 /tmp/ruby/src/trunk-yjit/lib/rdoc/rdoc.rb
270 /tmp/ruby/src/trunk-yjit/lib/rdoc/options.rb
271 /tmp/ruby/src/trunk-yjit/lib/rdoc/comment.rb
272 /tmp/ruby/src/trunk-yjit/lib/rdoc/token_stream.rb
273 /tmp/ruby/src/trunk-yjit/lib/rdoc/any_method.rb
274 /tmp/ruby/src/trunk-yjit/lib/rdoc/markup/raw.rb
275 /tmp/ruby/src/trunk-yjit/lib/rdoc/markup/verbatim.rb
276 /tmp/ruby/src/trunk-yjit/lib/rdoc/markup/paragraph.rb
277 /tmp/ruby/src/trunk-yjit/lib/rdoc/markup/blank_line.rb
278 /tmp/ruby/src/trunk-yjit/lib/rdoc/markup/heading.rb
279 /tmp/ruby/src/trunk-yjit/lib/rdoc/markup/document.rb
280 /tmp/ruby/src/trunk-yjit/lib/rdoc/markup/list_item.rb
281 /tmp/ruby/src/trunk-yjit/lib/rdoc/markup/list.rb
282 /tmp/ruby/src/trunk-yjit/lib/rdoc/encoding.rb
283 /tmp/ruby/build/trunk-yjit/.ext/x86_64-linux/ripper.so
284 /tmp/ruby/build/trunk-yjit/.ext/common/ripper/core.rb
285 /tmp/ruby/build/trunk-yjit/.ext/common/ripper/lexer.rb
286 /tmp/ruby/build/trunk-yjit/.ext/common/ripper/filter.rb
287 /tmp/ruby/build/trunk-yjit/.ext/common/ripper/sexp.rb
288 /tmp/ruby/build/trunk-yjit/.ext/common/ripper.rb
289 /tmp/ruby/src/trunk-yjit/test/ripper/test_scanner_events.rb
290 /tmp/ruby/src/trunk-yjit/test/optparse/test_optparse.rb
291 /tmp/ruby/src/trunk-yjit/test/optparse/test_optarg.rb
292 /tmp/ruby/build/trunk-yjit/.ext/x86_64-linux/enc/windows_31j.so
293 /tmp/ruby/build/trunk-yjit/.ext/x86_64-linux/enc/trans/japanese_sjis.so
294 /tmp/ruby/src/trunk-yjit/lib/rubygems/installer_uninstaller_utils.rb
295 /tmp/ruby/src/trunk-yjit/lib/rubygems/installer.rb
296 /tmp/ruby/src/trunk-yjit/test/rubygems/test_gem_resolver_git_specification.rb
297 /tmp/ruby/src/trunk-yjit/lib/mkmf.rb
298 /tmp/ruby/src/trunk-yjit/test/mkmf/base.rb
299 /tmp/ruby/src/trunk-yjit/test/mkmf/test_flags.rb
300 /tmp/ruby/src/trunk-yjit/test/rdoc/test_rdoc_rd_block_parser.rb
301 /tmp/ruby/src/trunk-yjit/lib/rdoc/rd/racc/parser.rb
302 /tmp/ruby/src/trunk-yjit/lib/rdoc/rd/racc/info.rb
303 /tmp/ruby/src/trunk-yjit/lib/rdoc/rd/block_parser.rb
304 /tmp/ruby/src/trunk-yjit/lib/rdoc/rd/inline_parser.rb
305 /tmp/ruby/src/trunk-yjit/lib/rdoc/rd/inline.rb
306 /tmp/ruby/src/trunk-yjit/lib/rdoc/markup/rule.rb
307 /tmp/ruby/src/trunk-yjit/lib/rdoc/markup/include.rb
308 /tmp/ruby/src/trunk-yjit/lib/did_you_mean/version.rb
309 /tmp/ruby/src/trunk-yjit/lib/did_you_mean/core_ext/name_error.rb
310 /tmp/ruby/src/trunk-yjit/lib/did_you_mean/levenshtein.rb
311 /tmp/ruby/src/trunk-yjit/lib/did_you_mean/jaro_winkler.rb
312 /tmp/ruby/src/trunk-yjit/lib/did_you_mean/spell_checker.rb
313 /tmp/ruby/src/trunk-yjit/lib/did_you_mean/spell_checkers/name_error_checkers/class_name_checker.rb
314 /tmp/ruby/src/trunk-yjit/lib/did_you_mean/spell_checkers/name_error_checkers/variable_name_checker.rb
315 /tmp/ruby/src/trunk-yjit/lib/did_you_mean/spell_checkers/name_error_checkers.rb
316 /tmp/ruby/src/trunk-yjit/lib/did_you_mean/spell_checkers/method_name_checker.rb
317 /tmp/ruby/src/trunk-yjit/lib/did_you_mean/spell_checkers/key_error_checker.rb
318 /tmp/ruby/src/trunk-yjit/lib/did_you_mean/spell_checkers/null_checker.rb
319 /tmp/ruby/src/trunk-yjit/lib/did_you_mean/tree_spell_checker.rb
320 /tmp/ruby/src/trunk-yjit/lib/did_you_mean/spell_checkers/require_path_checker.rb
321 /tmp/ruby/src/trunk-yjit/lib/did_you_mean/spell_checkers/pattern_key_name_checker.rb
322 /tmp/ruby/src/trunk-yjit/lib/did_you_mean/formatter.rb
323 /tmp/ruby/src/trunk-yjit/lib/did_you_mean.rb
324 /tmp/ruby/src/trunk-yjit/test/did_you_mean/helper.rb
325 /tmp/ruby/src/trunk-yjit/test/did_you_mean/tree_spell/change_word.rb
326 /tmp/ruby/src/trunk-yjit/test/did_you_mean/tree_spell/human_typo.rb
327 /tmp/ruby/src/trunk-yjit/test/did_you_mean/tree_spell/test_human_typo.rb
328 /tmp/ruby/build/trunk-yjit/.ext/common/forwardable/impl.rb
329 /tmp/ruby/src/trunk-yjit/lib/forwardable.rb
330 /tmp/ruby/src/trunk-yjit/lib/reline/version.rb
331 /tmp/ruby/src/trunk-yjit/lib/reline/config.rb
332 /tmp/ruby/src/trunk-yjit/lib/reline/key_actor/base.rb
333 /tmp/ruby/src/trunk-yjit/lib/reline/key_actor/emacs.rb
334 /tmp/ruby/src/trunk-yjit/lib/reline/key_actor/vi_command.rb
335 /tmp/ruby/src/trunk-yjit/lib/reline/key_actor/vi_insert.rb
336 /tmp/ruby/src/trunk-yjit/lib/reline/key_actor.rb
337 /tmp/ruby/src/trunk-yjit/lib/reline/key_stroke.rb
338 /tmp/ruby/src/trunk-yjit/lib/reline/kill_ring.rb
339 /tmp/ruby/src/trunk-yjit/lib/reline/unicode/east_asian_width.rb
340 /tmp/ruby/src/trunk-yjit/lib/reline/unicode.rb
341 /tmp/ruby/src/trunk-yjit/lib/reline/line_editor.rb
342 /tmp/ruby/src/trunk-yjit/lib/reline/history.rb
343 /tmp/ruby/build/trunk-yjit/.ext/x86_64-linux/fiddle.so
344 /tmp/ruby/build/trunk-yjit/.ext/common/fiddle/closure.rb
345 /tmp/ruby/build/trunk-yjit/.ext/common/fiddle/function.rb
346 /tmp/ruby/build/trunk-yjit/.ext/common/fiddle/version.rb
347 /tmp/ruby/build/trunk-yjit/.ext/common/fiddle.rb
348 /tmp/ruby/build/trunk-yjit/.ext/common/fiddle/value.rb
349 /tmp/ruby/build/trunk-yjit/.ext/common/fiddle/pack.rb
350 /tmp/ruby/build/trunk-yjit/.ext/common/fiddle/struct.rb
351 /tmp/ruby/build/trunk-yjit/.ext/common/fiddle/cparser.rb
352 /tmp/ruby/build/trunk-yjit/.ext/common/fiddle/import.rb
353 /tmp/ruby/src/trunk-yjit/lib/reline/terminfo.rb
354 /tmp/ruby/src/trunk-yjit/lib/reline/face.rb
355 /tmp/ruby/src/trunk-yjit/lib/reline/general_io.rb
356 /tmp/ruby/src/trunk-yjit/lib/reline.rb
357 /tmp/ruby/src/trunk-yjit/test/reline/helper.rb
358 /tmp/ruby/src/trunk-yjit/test/reline/test_reline.rb
359 /tmp/ruby/build/trunk-yjit/.ext/x86_64-linux/-test-/memory_view.so
360 /tmp/ruby/src/trunk-yjit/test/ruby/test_memory_view.rb
361 /tmp/ruby/src/trunk-yjit/test/ruby/test_io_buffer.rb
362 /tmp/ruby/src/trunk-yjit/test/socket/test_tcp.rb
363 /tmp/ruby/src/trunk-yjit/test/rdoc/test_rdoc_rdoc.rb
364 /tmp/ruby/src/trunk-yjit/lib/rdoc/stats.rb
365 /tmp/ruby/src/trunk-yjit/lib/rdoc/stats/quiet.rb
366 /tmp/ruby/src/trunk-yjit/lib/rdoc/parser/text.rb
367 /tmp/ruby/src/trunk-yjit/lib/rdoc/parser/simple.rb
368 /tmp/ruby/src/trunk-yjit/lib/tsort.rb
369 /tmp/ruby/src/trunk-yjit/lib/rdoc/parser/c.rb
370 /tmp/ruby/src/trunk-yjit/lib/rdoc/parser/changelog.rb
371 /tmp/ruby/src/trunk-yjit/lib/rdoc/parser/markdown.rb
372 /tmp/ruby/src/trunk-yjit/lib/rdoc/parser/rd.rb
373 /tmp/ruby/src/trunk-yjit/lib/rdoc/parser/ripper_state_lex.rb
374 /tmp/ruby/src/trunk-yjit/lib/rdoc/parser/ruby_tools.rb
375 /tmp/ruby/src/trunk-yjit/lib/rdoc/parser/ruby.rb
376 /tmp/ruby/src/trunk-yjit/lib/rdoc/parser.rb
377 /tmp/ruby/src/trunk-yjit/lib/rdoc/markup/to_html.rb
378 /tmp/ruby/src/trunk-yjit/lib/rdoc/markup/attribute_manager.rb
379 /tmp/ruby/src/trunk-yjit/lib/rdoc/markup/attributes.rb
380 /tmp/ruby/src/trunk-yjit/lib/rdoc/markup/hard_break.rb
381 /tmp/ruby/src/trunk-yjit/lib/rdoc/markup/attr_span.rb
382 /tmp/ruby/build/trunk-yjit/.ext/common/io/console/size.rb
383 /tmp/ruby/src/trunk-yjit/lib/rdoc/stats/normal.rb
384 /tmp/ruby/src/trunk-yjit/lib/rdoc/constant.rb
385 /tmp/ruby/src/trunk-yjit/lib/rdoc/normal_class.rb
386 /tmp/ruby/build/trunk-yjit/.ext/common/json/version.rb
387 /tmp/ruby/src/trunk-yjit/lib/ostruct.rb
388 /tmp/ruby/build/trunk-yjit/.ext/common/json/generic_object.rb
389 /tmp/ruby/build/trunk-yjit/.ext/common/json/common.rb
390 /tmp/ruby/build/trunk-yjit/.ext/x86_64-linux/json/ext/parser.so
391 /tmp/ruby/build/trunk-yjit/.ext/x86_64-linux/json/ext/generator.so
392 /tmp/ruby/build/trunk-yjit/.ext/common/json/ext.rb
393 /tmp/ruby/build/trunk-yjit/.ext/common/json.rb
394 /tmp/ruby/src/trunk-yjit/lib/rdoc/generator/json_index.rb
395 /tmp/ruby/src/trunk-yjit/lib/rdoc/erb_partial.rb
396 /tmp/ruby/src/trunk-yjit/lib/rdoc/markup/to_table_of_contents.rb
397 /tmp/ruby/src/trunk-yjit/lib/rdoc/cross_reference.rb
398 /tmp/ruby/src/trunk-yjit/lib/rdoc/markup/to_html_crossref.rb
399 /tmp/ruby/src/trunk-yjit/lib/rdoc/markup/to_html_snippet.rb
400 /tmp/ruby/src/trunk-yjit/lib/rdoc/markup/to_rdoc.rb
401 /tmp/ruby/build/trunk-yjit/.ext/x86_64-linux/enc/iso_8859_1.so
402 /tmp/ruby/src/trunk-yjit/test/rubygems/multifactor_auth_utilities.rb
403 /tmp/ruby/src/trunk-yjit/lib/rubygems/local_remote_options.rb
404 /tmp/ruby/src/trunk-yjit/lib/rubygems/version_option.rb
405 /tmp/ruby/src/trunk-yjit/lib/rubygems/gemcutter_utilities/webauthn_listener/response.rb
406 /tmp/ruby/src/trunk-yjit/lib/rubygems/gemcutter_utilities/webauthn_listener.rb
407 /tmp/ruby/src/trunk-yjit/lib/rubygems/gemcutter_utilities/webauthn_poller.rb
408 /tmp/ruby/src/trunk-yjit/lib/rubygems/gemcutter_utilities.rb
409 /tmp/ruby/src/trunk-yjit/lib/rubygems/commands/yank_command.rb
410 /tmp/ruby/src/trunk-yjit/test/rubygems/test_gem_commands_yank_command.rb
411 /tmp/ruby/src/trunk-yjit/lib/rubygems/yaml_serializer.rb
412 /tmp/ruby/build/trunk-yjit/.ext/x86_64-linux/-test-/array/resize.so
413 /tmp/ruby/src/trunk-yjit/test/-ext-/array/test_resize.rb
414 /tmp/ruby/src/trunk-yjit/lib/prism/node.rb
415 /tmp/ruby/src/trunk-yjit/lib/prism/node_ext.rb
416 /tmp/ruby/src/trunk-yjit/lib/prism/parse_result.rb
417 /tmp/ruby/src/trunk-yjit/lib/prism/parse_result/comments.rb
418 /tmp/ruby/src/trunk-yjit/lib/prism/visitor.rb
419 /tmp/ruby/src/trunk-yjit/lib/prism/parse_result/newlines.rb
420 /tmp/ruby/src/trunk-yjit/lib/prism/debug.rb
421 /tmp/ruby/src/trunk-yjit/lib/prism/pack.rb
422 prism/prism.so
423 /tmp/ruby/src/trunk-yjit/lib/prism.rb
424 /tmp/ruby/src/trunk-yjit/test/prism/test_helper.rb
425 /tmp/ruby/src/trunk-yjit/test/prism/parameters_signature_test.rb
426 /tmp/ruby/src/trunk-yjit/test/rdoc/test_rdoc_parser_changelog.rb
427 /tmp/ruby/src/trunk-yjit/test/openssl/utils.rb
428 /tmp/ruby/src/trunk-yjit/test/openssl/test_provider.rb
429 /tmp/ruby/src/trunk-yjit/test/prism/newline_test.rb
430 /tmp/ruby/build/trunk-yjit/.ext/x86_64-linux/-test-/rb_call_super_kw.so
431 /tmp/ruby/build/trunk-yjit/.ext/x86_64-linux/-test-/iter.so
432 /tmp/ruby/src/trunk-yjit/test/ruby/test_keyword.rb
433 /tmp/ruby/src/trunk-yjit/test/-ext-/test_bug-3571.rb
434 /tmp/ruby/src/trunk-yjit/test/win32ole/test_win32ole_event.rb
435 /tmp/ruby/src/trunk-yjit/test/win32ole/test_folderitem2_invokeverb.rb
436 /tmp/ruby/src/trunk-yjit/test/did_you_mean/spell_checking/test_require_path_check.rb
437 /tmp/ruby/src/trunk-yjit/test/rubygems/test_gem_resolver_api_specification.rb
438 /tmp/ruby/src/trunk-yjit/lib/rubygems/safe_marshal/elements.rb
439 /tmp/ruby/src/trunk-yjit/lib/rubygems/safe_marshal/reader.rb
440 /tmp/ruby/src/trunk-yjit/lib/rubygems/safe_marshal/visitors/visitor.rb
441 /tmp/ruby/src/trunk-yjit/lib/rubygems/safe_marshal/visitors/to_ruby.rb
442 /tmp/ruby/src/trunk-yjit/lib/rubygems/safe_marshal.rb
443 /tmp/ruby/build/trunk-yjit/.ext/common/psych/versions.rb
444 /tmp/ruby/build/trunk-yjit/.ext/common/psych/exception.rb
445 /tmp/ruby/build/trunk-yjit/.ext/common/psych/syntax_error.rb
446 /tmp/ruby/build/trunk-yjit/.ext/x86_64-linux/psych.so
447 /tmp/ruby/build/trunk-yjit/.ext/common/psych/omap.rb
448 /tmp/ruby/build/trunk-yjit/.ext/common/psych/set.rb
449 /tmp/ruby/build/trunk-yjit/.ext/common/psych/class_loader.rb
450 /tmp/ruby/build/trunk-yjit/.ext/common/psych/scalar_scanner.rb
451 /tmp/ruby/build/trunk-yjit/.ext/common/psych/nodes/node.rb
452 /tmp/ruby/build/trunk-yjit/.ext/common/psych/nodes/stream.rb
453 /tmp/ruby/build/trunk-yjit/.ext/common/psych/nodes/document.rb
454 /tmp/ruby/build/trunk-yjit/.ext/common/psych/nodes/sequence.rb
455 /tmp/ruby/build/trunk-yjit/.ext/common/psych/nodes/scalar.rb
456 /tmp/ruby/build/trunk-yjit/.ext/common/psych/nodes/mapping.rb
457 /tmp/ruby/build/trunk-yjit/.ext/common/psych/nodes/alias.rb
458 /tmp/ruby/build/trunk-yjit/.ext/common/psych/nodes.rb
459 /tmp/ruby/build/trunk-yjit/.ext/common/psych/streaming.rb
460 /tmp/ruby/build/trunk-yjit/.ext/common/psych/visitors/visitor.rb
461 /tmp/ruby/build/trunk-yjit/.ext/common/psych/visitors/to_ruby.rb
462 /tmp/ruby/build/trunk-yjit/.ext/common/psych/visitors/emitter.rb
463 /tmp/ruby/build/trunk-yjit/.ext/common/psych/handler.rb
464 /tmp/ruby/build/trunk-yjit/.ext/common/psych/tree_builder.rb
465 /tmp/ruby/build/trunk-yjit/.ext/common/psych/visitors/yaml_tree.rb
466 /tmp/ruby/build/trunk-yjit/.ext/common/psych/json/ruby_events.rb
467 /tmp/ruby/build/trunk-yjit/.ext/common/psych/visitors/json_tree.rb
468 /tmp/ruby/build/trunk-yjit/.ext/common/psych/visitors/depth_first.rb
469 /tmp/ruby/build/trunk-yjit/.ext/common/psych/visitors.rb
470 /tmp/ruby/build/trunk-yjit/.ext/common/psych/parser.rb
471 /tmp/ruby/build/trunk-yjit/.ext/common/psych/coder.rb
472 /tmp/ruby/build/trunk-yjit/.ext/common/psych/core_ext.rb
473 /tmp/ruby/build/trunk-yjit/.ext/common/psych/stream.rb
474 /tmp/ruby/build/trunk-yjit/.ext/common/psych/json/yaml_events.rb
475 /tmp/ruby/build/trunk-yjit/.ext/common/psych/json/tree_builder.rb
476 /tmp/ruby/build/trunk-yjit/.ext/common/psych/json/stream.rb
477 /tmp/ruby/build/trunk-yjit/.ext/common/psych/handlers/document_stream.rb
478 /tmp/ruby/build/trunk-yjit/.ext/common/psych.rb
479 /tmp/ruby/src/trunk-yjit/lib/rubygems/psych_tree.rb
480 /tmp/ruby/src/trunk-yjit/lib/rubygems/safe_yaml.rb
481 /tmp/ruby/src/trunk-yjit/lib/rubygems/specification_policy.rb
482 /tmp/ruby/src/trunk-yjit/lib/rubygems/util/licenses.rb
483 /tmp/ruby/build/trunk-yjit/.ext/x86_64-linux/objspace.so
484 /tmp/ruby/build/trunk-yjit/.ext/common/objspace.rb
485 /tmp/ruby/src/trunk-yjit/test/ruby/test_optimization.rb
* Process memory map:
562980c66000-562980ca9000 r--p 00000000 00:126 13276888 /tmp/ruby/build/trunk-yjit/ruby
562980ca9000-5629810c6000 r-xp 00043000 00:126 13276888 /tmp/ruby/build/trunk-yjit/ruby
5629810c6000-562981254000 r--p 00460000 00:126 13276888 /tmp/ruby/build/trunk-yjit/ruby
562981254000-56298126c000 r--p 005ed000 00:126 13276888 /tmp/ruby/build/trunk-yjit/ruby
56298126c000-56298126d000 rw-p 00605000 00:126 13276888 /tmp/ruby/build/trunk-yjit/ruby
56298126d000-562981282000 rw-p 00000000 00:00 0
562983170000-562983308000 rw-p 00000000 00:00 0 [heap]
56298331e000-5629835c2000 r-xp 00000000 00:00 0
5629835c2000-56298631e000 ---p 00000000 00:00 0
7f9f8d42c000-7f9f90000000 r--p 00000000 00:126 13276888 /tmp/ruby/build/trunk-yjit/ruby
7f9f90000000-7f9f90021000 rw-p 00000000 00:00 0
7f9f90021000-7f9f94000000 ---p 00000000 00:00 0
7f9f95fbe000-7f9f98000000 rw-p 00000000 00:00 0
7f9f98000000-7f9f99250000 rw-p 00000000 00:00 0
7f9f99250000-7f9f9c000000 ---p 00000000 00:00 0
7f9f9c000000-7f9f9d559000 rw-p 00000000 00:00 0
7f9f9d559000-7f9fa0000000 ---p 00000000 00:00 0
7f9fa0000000-7f9fa1259000 rw-p 00000000 00:00 0
7f9fa1259000-7f9fa4000000 ---p 00000000 00:00 0
7f9fa4000000-7f9fa4021000 rw-p 00000000 00:00 0
7f9fa4021000-7f9fa8000000 ---p 00000000 00:00 0
7f9fa8000000-7f9fa8021000 rw-p 00000000 00:00 0
7f9fa8021000-7f9fac000000 ---p 00000000 00:00 0
7f9facb56000-7f9fad377000 rw-p 00000000 00:00 0
7f9fad377000-7f9fad378000 ---p 00000000 00:00 0
7f9fad378000-7f9fadb78000 rw-p 00000000 00:00 0
7f9fadb78000-7f9fadb79000 ---p 00000000 00:00 0
7f9fadb79000-7f9fae379000 rw-p 00000000 00:00 0
7f9fae379000-7f9fae37a000 ---p 00000000 00:00 0
7f9fae37a000-7f9faeb7a000 rw-p 00000000 00:00 0
7f9faeb7a000-7f9faeb7b000 ---p 00000000 00:00 0
7f9faeb7b000-7f9faf7ff000 rw-p 00000000 00:00 0
7f9fafebf000-7f9fafec1000 r--p 00000000 00:126 13129429 /usr/lib/x86_64-linux-gnu/libyaml-0.so.2.0.6
7f9fafec1000-7f9fafeda000 r-xp 00002000 00:126 13129429 /usr/lib/x86_64-linux-gnu/libyaml-0.so.2.0.6
7f9fafeda000-7f9fafede000 r--p 0001b000 00:126 13129429 /usr/lib/x86_64-linux-gnu/libyaml-0.so.2.0.6
7f9fafede000-7f9fafedf000 r--p 0001e000 00:126 13129429 /usr/lib/x86_64-linux-gnu/libyaml-0.so.2.0.6
7f9fafedf000-7f9fafee0000 rw-p 0001f000 00:126 13129429 /usr/lib/x86_64-linux-gnu/libyaml-0.so.2.0.6
7f9fafee0000-7f9fb0000000 rw-p 00000000 00:00 0
7f9fb0000000-7f9fb061d000 rw-p 00000000 00:00 0
7f9fb061d000-7f9fb4000000 ---p 00000000 00:00 0
7f9fb4000000-7f9fb4c37000 rw-p 00000000 00:00 0
7f9fb4c37000-7f9fb8000000 ---p 00000000 00:00 0
7f9fb8000000-7f9fb861c000 rw-p 00000000 00:00 0
7f9fb861c000-7f9fbc000000 ---p 00000000 00:00 0
7f9fbc000000-7f9fbc021000 rw-p 00000000 00:00 0
7f9fbc021000-7f9fc0000000 ---p 00000000 00:00 0
7f9fc0000000-7f9fc0021000 rw-p 00000000 00:00 0
7f9fc0021000-7f9fc4000000 ---p 00000000 00:00 0
7f9fc4000000-7f9fc4021000 rw-p 00000000 00:00 0
7f9fc4021000-7f9fc8000000 ---p 00000000 00:00 0
7f9fc8000000-7f9fc8021000 rw-p 00000000 00:00 0
7f9fc8021000-7f9fcc000000 ---p 00000000 00:00 0
7f9fcc000000-7f9fcc021000 rw-p 00000000 00:00 0
7f9fcc021000-7f9fd0000000 ---p 00000000 00:00 0
7f9fd0000000-7f9fd0021000 rw-p 00000000 00:00 0
7f9fd0021000-7f9fd4000000 ---p 00000000 00:00 0
7f9fd4000000-7f9fd4021000 rw-p 00000000 00:00 0
7f9fd4021000-7f9fd8000000 ---p 00000000 00:00 0
7f9fd8000000-7f9fd8021000 rw-p 00000000 00:00 0
7f9fd8021000-7f9fdc000000 ---p 00000000 00:00 0
7f9fdc000000-7f9fdc021000 rw-p 00000000 00:00 0
7f9fdc021000-7f9fe0000000 ---p 00000000 00:00 0
7f9fe0000000-7f9fe0021000 rw-p 00000000 00:00 0
7f9fe0021000-7f9fe4000000 ---p 00000000 00:00 0
7f9fe4000000-7f9fe4021000 rw-p 00000000 00:00 0
7f9fe4021000-7f9fe8000000 ---p 00000000 00:00 0
7f9fe8000000-7f9fe810a000 rw-p 00000000 00:00 0
7f9fe810a000-7f9fec000000 ---p 00000000 00:00 0
7f9fec000000-7f9fec211000 rw-p 00000000 00:00 0
7f9fec211000-7f9ff0000000 ---p 00000000 00:00 0
7f9ff0000000-7f9ff061c000 rw-p 00000000 00:00 0
7f9ff061c000-7f9ff4000000 ---p 00000000 00:00 0
7f9ff4010000-7f9ff4060000 rw-p 00000000 00:00 0
7f9ff4070000-7f9ff4080000 rw-p 00000000 00:00 0
7f9ff4080000-7f9ff40d0000 rw-p 00000000 00:00 0
7f9ff40dc000-7f9ff40dd000 ---p 00000000 00:00 0
7f9ff40dd000-7f9ff40fd000 rw-p 00000000 00:00 0
7f9ff40fd000-7f9ff40fe000 ---p 00000000 00:00 0
7f9ff40fe000-7f9ff411e000 rw-p 00000000 00:00 0
7f9ff411e000-7f9ff411f000 ---p 00000000 00:00 0
7f9ff411f000-7f9ff413f000 rw-p 00000000 00:00 0
7f9ff413f000-7f9ff4140000 ---p 00000000 00:00 0
7f9ff4140000-7f9ff41b0000 rw-p 00000000 00:00 0
7f9ff41bf000-7f9ff41c3000 r--p 00000000 00:126 15635317 /tmp/ruby/build/trunk-yjit/.ext/x86_64-linux/fiddle.so
7f9ff41c3000-7f9ff41cb000 r-xp 00004000 00:126 15635317 /tmp/ruby/build/trunk-yjit/.ext/x86_64-linux/fiddle.so
7f9ff41cb000-7f9ff41ce000 r--p 0000c000 00:126 15635317 /tmp/ruby/build/trunk-yjit/.ext/x86_64-linux/fiddle.so
7f9ff41ce000-7f9ff41cf000 r--p 0000e000 00:126 15635317 /tmp/ruby/build/trunk-yjit/.ext/x86_64-linux/fiddle.so
7f9ff41cf000-7f9ff41d0000 rw-p 0000f000 00:126 15635317 /tmp/ruby/build/trunk-yjit/.ext/x86_64-linux/fiddle.so
7f9ff41d0000-7f9ff4280000 rw-p 00000000 00:00 0
7f9ff428f000-7f9ff4710000 rw-p 00000000 00:00 0
7f9ff4718000-7f9ff4719000 r--p 00000000 00:126 15609200 /tmp/ruby/build/trunk-yjit/.ext/x86_64-linux/enc/trans/japanese_sjis.so
7f9ff4719000-7f9ff471a000 r-xp 00001000 00:126 15609200 /tmp/ruby/build/trunk-yjit/.ext/x86_64-linux/enc/trans/japanese_sjis.so
7f9ff471a000-7f9ff473e000 r--p 00002000 00:126 15609200 /tmp/ruby/build/trunk-yjit/.ext/x86_64-linux/enc/trans/japanese_sjis.so
7f9ff473e000-7f9ff473f000 r--p 00025000 00:126 15609200 /tmp/ruby/build/trunk-yjit/.ext/x86_64-linux/enc/trans/japanese_sjis.so
7f9ff473f000-7f9ff4740000 rw-p 00026000 00:126 15609200 /tmp/ruby/build/trunk-yjit/.ext/x86_64-linux/enc/trans/japanese_sjis.so
7f9ff4740000-7f9ff4780000 rw-p 00000000 00:00 0
7f9ff4788000-7f9ff478f000 r--p 00000000 00:126 15636194 /tmp/ruby/build/trunk-yjit/.ext/x86_64-linux/ripper.so
7f9ff478f000-7f9ff47b3000 r-xp 00007000 00:126 15636194 /tmp/ruby/build/trunk-yjit/.ext/x86_64-linux/ripper.so
7f9ff47b3000-7f9ff47cd000 r--p 0002b000 00:126 15636194 /tmp/ruby/build/trunk-yjit/.ext/x86_64-linux/ripper.so
7f9ff47cd000-7f9ff47cf000 r--p 00044000 00:126 15636194 /tmp/ruby/build/trunk-yjit/.ext/x86_64-linux/ripper.so
7f9ff47cf000-7f9ff47d0000 rw-p 00046000 00:126 15636194 /tmp/ruby/build/trunk-yjit/.ext/x86_64-linux/ripper.so
7f9ff47d0000-7f9ff4860000 rw-p 00000000 00:00 0
7f9ff4861000-7f9ff4c82000 rw-p 00000000 00:00 0
7f9ff4c82000-7f9ff4c85000 r--p 00000000 00:126 15609186 /tmp/ruby/build/trunk-yjit/.ext/x86_64-linux/date_core.so
7f9ff4c85000-7f9ff4cb4000 r-xp 00003000 00:126 15609186 /tmp/ruby/build/trunk-yjit/.ext/x86_64-linux/date_core.so
7f9ff4cb4000-7f9ff4cbd000 r--p 00032000 00:126 15609186 /tmp/ruby/build/trunk-yjit/.ext/x86_64-linux/date_core.so
7f9ff4cbd000-7f9ff4cbe000 r--p 0003a000 00:126 15609186 /tmp/ruby/build/trunk-yjit/.ext/x86_64-linux/date_core.so
7f9ff4cbe000-7f9ff4cbf000 rw-p 0003b000 00:126 15609186 /tmp/ruby/build/trunk-yjit/.ext/x86_64-linux/date_core.so
7f9ff4cbf000-7f9ff4d60000 rw-p 00000000 00:00 0
7f9ff4d6f000-7f9ff5040000 rw-p 00000000 00:00 0
7f9ff5044000-7f9ff50f6000 r--p 00000000 00:126 13112697 /usr/lib/x86_64-linux-gnu/libcrypto.so.3
7f9ff50f6000-7f9ff5354000 r-xp 000b2000 00:126 13112697 /usr/lib/x86_64-linux-gnu/libcrypto.so.3
7f9ff5354000-7f9ff5426000 r--p 00310000 00:126 13112697 /usr/lib/x86_64-linux-gnu/libcrypto.so.3
7f9ff5426000-7f9ff5481000 r--p 003e1000 00:126 13112697 /usr/lib/x86_64-linux-gnu/libcrypto.so.3
7f9ff5481000-7f9ff5484000 rw-p 0043c000 00:126 13112697 /usr/lib/x86_64-linux-gnu/libcrypto.so.3
7f9ff5484000-7f9ff5487000 rw-p 00000000 00:00 0
7f9ff5487000-7f9ff54a5000 r--p 00000000 00:126 13112794 /usr/lib/x86_64-linux-gnu/libssl.so.3
7f9ff54a5000-7f9ff5500000 r-xp 0001e000 00:126 13112794 /usr/lib/x86_64-linux-gnu/libssl.so.3
7f9ff5500000-7f9ff551d000 r--p 00079000 00:126 13112794 /usr/lib/x86_64-linux-gnu/libssl.so.3
7f9ff551d000-7f9ff5527000 r--p 00095000 00:126 13112794 /usr/lib/x86_64-linux-gnu/libssl.so.3
7f9ff5527000-7f9ff552b000 rw-p 0009f000 00:126 13112794 /usr/lib/x86_64-linux-gnu/libssl.so.3
7f9ff552b000-7f9ff5540000 r--p 00000000 00:126 15636707 /tmp/ruby/build/trunk-yjit/.ext/x86_64-linux/openssl.so
7f9ff5540000-7f9ff5578000 r-xp 00015000 00:126 15636707 /tmp/ruby/build/trunk-yjit/.ext/x86_64-linux/openssl.so
7f9ff5578000-7f9ff558a000 r--p 0004d000 00:126 15636707 /tmp/ruby/build/trunk-yjit/.ext/x86_64-linux/openssl.so
7f9ff558a000-7f9ff558b000 ---p 0005f000 00:126 15636707 /tmp/ruby/build/trunk-yjit/.ext/x86_64-linux/openssl.so
7f9ff558b000-7f9ff558d000 r--p 0005f000 00:126 15636707 /tmp/ruby/build/trunk-yjit/.ext/x86_64-linux/openssl.so
7f9ff558d000-7f9ff558f000 rw-p 00061000 00:126 15636707 /tmp/ruby/build/trunk-yjit/.ext/x86_64-linux/openssl.so
7f9ff558f000-7f9ff55a0000 rw-p 00000000 00:00 0
7f9ff55a9000-7f9ff56ca000 rw-p 00000000 00:00 0
7f9ff56ca000-7f9ff56cb000 ---p 00000000 00:00 0
7f9ff56cb000-7f9ff580c000 rw-p 00000000 00:00 0
7f9ff580c000-7f9ff580d000 ---p 00000000 00:00 0
7f9ff580d000-7f9ff594e000 rw-p 00000000 00:00 0
7f9ff594e000-7f9ff594f000 ---p 00000000 00:00 0
7f9ff594f000-7f9ff5a90000 rw-p 00000000 00:00 0
7f9ff5a90000-7f9ff5a91000 ---p 00000000 00:00 0
7f9ff5a91000-7f9ff5bd2000 rw-p 00000000 00:00 0
7f9ff5bd2000-7f9ff5bd3000 ---p 00000000 00:00 0
7f9ff5bd3000-7f9ff5d14000 rw-p 00000000 00:00 0
7f9ff5d14000-7f9ff5d15000 ---p 00000000 00:00 0
7f9ff5d15000-7f9ff5e56000 rw-p 00000000 00:00 0
7f9ff5e56000-7f9ff5e57000 ---p 00000000 00:00 0
7f9ff5e57000-7f9ff5f98000 rw-p 00000000 00:00 0
7f9ff5f98000-7f9ff5f99000 ---p 00000000 00:00 0
7f9ff5f99000-7f9ff60da000 rw-p 00000000 00:00 0
7f9ff60da000-7f9ff60db000 ---p 00000000 00:00 0
7f9ff60db000-7f9ff60fb000 rw-p 00000000 00:00 0
7f9ff60fb000-7f9ff60fc000 ---p 00000000 00:00 0
7f9ff60fc000-7f9ff611c000 rw-p 00000000 00:00 0
7f9ff611c000-7f9ff611d000 ---p 00000000 00:00 0
7f9ff611d000-7f9ff613d000 rw-p 00000000 00:00 0
7f9ff613d000-7f9ff613e000 ---p 00000000 00:00 0
7f9ff613e000-7f9ff615e000 rw-p 00000000 00:00 0
7f9ff615e000-7f9ff615f000 ---p 00000000 00:00 0
7f9ff615f000-7f9ff617f000 rw-p 00000000 00:00 0
7f9ff617f000-7f9ff6180000 ---p 00000000 00:00 0
7f9ff6180000-7f9ff61a0000 rw-p 00000000 00:00 0
7f9ff61a0000-7f9ff61a1000 ---p 00000000 00:00 0
7f9ff61a1000-7f9ff69a8000 rw-p 00000000 00:00 0
7f9ff69b2000-7f9ff69b5000 r--p 00000000 00:126 15635506 /tmp/ruby/build/trunk-yjit/.ext/x86_64-linux/objspace.so
7f9ff69b5000-7f9ff69bc000 r-xp 00003000 00:126 15635506 /tmp/ruby/build/trunk-yjit/.ext/x86_64-linux/objspace.so
7f9ff69bc000-7f9ff69be000 r--p 0000a000 00:126 15635506 /tmp/ruby/build/trunk-yjit/.ext/x86_64-linux/objspace.so
7f9ff69be000-7f9ff69bf000 r--p 0000b000 00:126 15635506 /tmp/ruby/build/trunk-yjit/.ext/x86_64-linux/objspace.so
7f9ff69bf000-7f9ff69c0000 rw-p 0000c000 00:126 15635506 /tmp/ruby/build/trunk-yjit/.ext/x86_64-linux/objspace.so
7f9ff69c0000-7f9ff6a10000 rw-p 00000000 00:00 0
7f9ff6a15000-7f9ff6a18000 r--p 00000000 00:126 15635971 /tmp/ruby/build/trunk-yjit/.ext/x86_64-linux/psych.so
7f9ff6a18000-7f9ff6a1c000 r-xp 00003000 00:126 15635971 /tmp/ruby/build/trunk-yjit/.ext/x86_64-linux/psych.so
7f9ff6a1c000-7f9ff6a1d000 r--p 00007000 00:126 15635971 /tmp/ruby/build/trunk-yjit/.ext/x86_64-linux/psych.so
7f9ff6a1d000-7f9ff6a1e000 ---p 00008000 00:126 15635971 /tmp/ruby/build/trunk-yjit/.ext/x86_64-linux/psych.so
7f9ff6a1e000-7f9ff6a1f000 r--p 00008000 00:126 15635971 /tmp/ruby/build/trunk-yjit/.ext/x86_64-linux/psych.so
7f9ff6a1f000-7f9ff6a20000 rw-p 00009000 00:126 15635971 /tmp/ruby/build/trunk-yjit/.ext/x86_64-linux/psych.so
7f9ff6a20000-7f9ff6b20000 rw-p 00000000 00:00 0
7f9ff6b2a000-7f9ff6b2b000 r--p 00000000 00:126 15749118 /tmp/ruby/build/trunk-yjit/.ext/x86_64-linux/-test-/iter.so
7f9ff6b2b000-7f9ff6b2c000 r-xp 00001000 00:126 15749118 /tmp/ruby/build/trunk-yjit/.ext/x86_64-linux/-test-/iter.so
7f9ff6b2c000-7f9ff6b2d000 r--p 00002000 00:126 15749118 /tmp/ruby/build/trunk-yjit/.ext/x86_64-linux/-test-/iter.so
7f9ff6b2d000-7f9ff6b2e000 r--p 00002000 00:126 15749118 /tmp/ruby/build/trunk-yjit/.ext/x86_64-linux/-test-/iter.so
7f9ff6b2e000-7f9ff6b2f000 rw-p 00003000 00:126 15749118 /tmp/ruby/build/trunk-yjit/.ext/x86_64-linux/-test-/iter.so
7f9ff6b2f000-7f9ff6f70000 rw-p 00000000 00:00 0
7f9ff6f70000-7f9ff6f71000 r--p 00000000 00:126 15749164 /tmp/ruby/build/trunk-yjit/.ext/x86_64-linux/-test-/rb_call_super_kw.so
7f9ff6f71000-7f9ff6f72000 r-xp 00001000 00:126 15749164 /tmp/ruby/build/trunk-yjit/.ext/x86_64-linux/-test-/rb_call_super_kw.so
7f9ff6f72000-7f9ff6f73000 r--p 00002000 00:126 15749164 /tmp/ruby/build/trunk-yjit/.ext/x86_64-linux/-test-/rb_call_super_kw.so
7f9ff6f73000-7f9ff6f74000 r--p 00002000 00:126 15749164 /tmp/ruby/build/trunk-yjit/.ext/x86_64-linux/-test-/rb_call_super_kw.so
7f9ff6f74000-7f9ff6f75000 rw-p 00003000 00:126 15749164 /tmp/ruby/build/trunk-yjit/.ext/x86_64-linux/-test-/rb_call_super_kw.so
7f9ff6f75000-7f9ff6f76000 r--p 00000000 00:126 15747202 /tmp/ruby/build/trunk-yjit/.ext/x86_64-linux/-test-/array/resize.so
7f9ff6f76000-7f9ff6f77000 r-xp 00001000 00:126 15747202 /tmp/ruby/build/trunk-yjit/.ext/x86_64-linux/-test-/array/resize.so
7f9ff6f77000-7f9ff6f78000 r--p 00002000 00:126 15747202 /tmp/ruby/build/trunk-yjit/.ext/x86_64-linux/-test-/array/resize.so
7f9ff6f78000-7f9ff6f79000 r--p 00002000 00:126 15747202 /tmp/ruby/build/trunk-yjit/.ext/x86_64-linux/-test-/array/resize.so
7f9ff6f79000-7f9ff6f7a000 rw-p 00003000 00:126 15747202 /tmp/ruby/build/trunk-yjit/.ext/x86_64-linux/-test-/array/resize.so
7f9ff6f7a000-7f9ff6f7c000 r--p 00000000 00:126 15749300 /tmp/ruby/build/trunk-yjit/.ext/x86_64-linux/json/ext/generator.so
7f9ff6f7c000-7f9ff6f84000 r-xp 00002000 00:126 15749300 /tmp/ruby/build/trunk-yjit/.ext/x86_64-linux/json/ext/generator.so
7f9ff6f84000-7f9ff6f86000 r--p 0000a000 00:126 15749300 /tmp/ruby/build/trunk-yjit/.ext/x86_64-linux/json/ext/generator.so
7f9ff6f86000-7f9ff6f87000 r--p 0000b000 00:126 15749300 /tmp/ruby/build/trunk-yjit/.ext/x86_64-linux/json/ext/generator.so
7f9ff6f87000-7f9ff6f88000 rw-p 0000c000 00:126 15749300 /tmp/ruby/build/trunk-yjit/.ext/x86_64-linux/json/ext/generator.so
7f9ff6f88000-7f9ff71a9000 rw-p 00000000 00:00 0
7f9ff71a9000-7f9ff71aa000 ---p 00000000 00:00 0
7f9ff71aa000-7f9ff71ca000 rw-p 00000000 00:00 0
7f9ff71ca000-7f9ff71cb000 ---p 00000000 00:00 0
7f9ff71cb000-7f9ff71eb000 rw-p 00000000 00:00 0
7f9ff71eb000-7f9ff71ec000 ---p 00000000 00:00 0
7f9ff71ec000-7f9ff720c000 rw-p 00000000 00:00 0
7f9ff720c000-7f9ff7213000 r--p 00000000 00:126 15636227 /tmp/ruby/build/trunk-yjit/.ext/x86_64-linux/socket.so
7f9ff7213000-7f9ff7236000 r-xp 00007000 00:126 15636227 /tmp/ruby/build/trunk-yjit/.ext/x86_64-linux/socket.so
7f9ff7236000-7f9ff723e000 r--p 0002a000 00:126 15636227 /tmp/ruby/build/trunk-yjit/.ext/x86_64-linux/socket.so
7f9ff723e000-7f9ff723f000 r--p 00031000 00:126 15636227 /tmp/ruby/build/trunk-yjit/.ext/x86_64-linux/socket.so
7f9ff723f000-7f9ff7240000 rw-p 00032000 00:126 15636227 /tmp/ruby/build/trunk-yjit/.ext/x86_64-linux/socket.so
7f9ff7240000-7f9ff7320000 rw-p 00000000 00:00 0
7f9ff7321000-7f9ff7322000 r--p 00000000 00:126 15608767 /tmp/ruby/build/trunk-yjit/.ext/x86_64-linux/enc/iso_8859_1.so
7f9ff7322000-7f9ff7323000 r-xp 00001000 00:126 15608767 /tmp/ruby/build/trunk-yjit/.ext/x86_64-linux/enc/iso_8859_1.so
7f9ff7323000-7f9ff7324000 r--p 00002000 00:126 15608767 /tmp/ruby/build/trunk-yjit/.ext/x86_64-linux/enc/iso_8859_1.so
7f9ff7324000-7f9ff7325000 r--p 00002000 00:126 15608767 /tmp/ruby/build/trunk-yjit/.ext/x86_64-linux/enc/iso_8859_1.so
7f9ff7325000-7f9ff7326000 rw-p 00003000 00:126 15608767 /tmp/ruby/build/trunk-yjit/.ext/x86_64-linux/enc/iso_8859_1.so
7f9ff7326000-7f9ff7328000 r--p 00000000 00:126 15749444 /tmp/ruby/build/trunk-yjit/.ext/x86_64-linux/json/ext/parser.so
7f9ff7328000-7f9ff732c000 r-xp 00002000 00:126 15749444 /tmp/ruby/build/trunk-yjit/.ext/x86_64-linux/json/ext/parser.so
7f9ff732c000-7f9ff732d000 r--p 00006000 00:126 15749444 /tmp/ruby/build/trunk-yjit/.ext/x86_64-linux/json/ext/parser.so
7f9ff732d000-7f9ff732e000 r--p 00006000 00:126 15749444 /tmp/ruby/build/trunk-yjit/.ext/x86_64-linux/json/ext/parser.so
7f9ff732e000-7f9ff732f000 rw-p 00007000 00:126 15749444 /tmp/ruby/build/trunk-yjit/.ext/x86_64-linux/json/ext/parser.so
7f9ff732f000-7f9ff75b0000 rw-p 00000000 00:00 0
7f9ff75b2000-7f9ff75b4000 r--p 00000000 00:126 15749136 /tmp/ruby/build/trunk-yjit/.ext/x86_64-linux/-test-/memory_view.so
7f9ff75b4000-7f9ff75b6000 r-xp 00002000 00:126 15749136 /tmp/ruby/build/trunk-yjit/.ext/x86_64-linux/-test-/memory_view.so
7f9ff75b6000-7f9ff75b7000 r--p 00004000 00:126 15749136 /tmp/ruby/build/trunk-yjit/.ext/x86_64-linux/-test-/memory_view.so
7f9ff75b7000-7f9ff75b8000 r--p 00004000 00:126 15749136 /tmp/ruby/build/trunk-yjit/.ext/x86_64-linux/-test-/memory_view.so
7f9ff75b8000-7f9ff75b9000 rw-p 00005000 00:126 15749136 /tmp/ruby/build/trunk-yjit/.ext/x86_64-linux/-test-/memory_view.so
7f9ff75b9000-7f9ff789e000 rw-p 00000000 00:00 0
7f9ff789f000-7f9ff78a1000 r--p 00000000 00:126 13112707 /usr/lib/x86_64-linux-gnu/libffi.so.8.1.0
7f9ff78a1000-7f9ff78a8000 r-xp 00002000 00:126 13112707 /usr/lib/x86_64-linux-gnu/libffi.so.8.1.0
7f9ff78a8000-7f9ff78a9000 r--p 00009000 00:126 13112707 /usr/lib/x86_64-linux-gnu/libffi.so.8.1.0
7f9ff78a9000-7f9ff78aa000 ---p 0000a000 00:126 13112707 /usr/lib/x86_64-linux-gnu/libffi.so.8.1.0
7f9ff78aa000-7f9ff78ab000 r--p 0000a000 00:126 13112707 /usr/lib/x86_64-linux-gnu/libffi.so.8.1.0
7f9ff78ab000-7f9ff78ac000 rw-p 0000b000 00:126 13112707 /usr/lib/x86_64-linux-gnu/libffi.so.8.1.0
7f9ff78ac000-7f9ff7ae0000 rw-p 00000000 00:00 0
7f9ff7ae3000-7f9ff7ae5000 r--p 00000000 00:126 15613455 /tmp/ruby/build/trunk-yjit/.ext/x86_64-linux/strscan.so
7f9ff7ae5000-7f9ff7ae9000 r-xp 00002000 00:126 15613455 /tmp/ruby/build/trunk-yjit/.ext/x86_64-linux/strscan.so
7f9ff7ae9000-7f9ff7aeb000 r--p 00006000 00:126 15613455 /tmp/ruby/build/trunk-yjit/.ext/x86_64-linux/strscan.so
7f9ff7aeb000-7f9ff7aec000 r--p 00007000 00:126 15613455 /tmp/ruby/build/trunk-yjit/.ext/x86_64-linux/strscan.so
7f9ff7aec000-7f9ff7aed000 rw-p 00008000 00:126 15613455 /tmp/ruby/build/trunk-yjit/.ext/x86_64-linux/strscan.so
7f9ff7aed000-7f9ff7b0e000 rw-p 00000000 00:00 0
7f9ff7b11000-7f9ff7b12000 r--p 00000000 00:126 15608992 /tmp/ruby/build/trunk-yjit/.ext/x86_64-linux/enc/windows_31j.so
7f9ff7b12000-7f9ff7b13000 r-xp 00001000 00:126 15608992 /tmp/ruby/build/trunk-yjit/.ext/x86_64-linux/enc/windows_31j.so
7f9ff7b13000-7f9ff7b14000 r--p 00002000 00:126 15608992 /tmp/ruby/build/trunk-yjit/.ext/x86_64-linux/enc/windows_31j.so
7f9ff7b14000-7f9ff7b15000 ---p 00003000 00:126 15608992 /tmp/ruby/build/trunk-yjit/.ext/x86_64-linux/enc/windows_31j.so
7f9ff7b15000-7f9ff7b16000 r--p 00003000 00:126 15608992 /tmp/ruby/build/trunk-yjit/.ext/x86_64-linux/enc/windows_31j.so
7f9ff7b16000-7f9ff7b17000 rw-p 00004000 00:126 15608992 /tmp/ruby/build/trunk-yjit/.ext/x86_64-linux/enc/windows_31j.so
7f9ff7b17000-7f9ff7b80000 rw-p 00000000 00:00 0
7f9ff7b83000-7f9ff7b85000 r--p 00000000 00:126 15635707 /tmp/ruby/build/trunk-yjit/.ext/x86_64-linux/pathname.so
7f9ff7b85000-7f9ff7b8b000 r-xp 00002000 00:126 15635707 /tmp/ruby/build/trunk-yjit/.ext/x86_64-linux/pathname.so
7f9ff7b8b000-7f9ff7b8d000 r--p 00008000 00:126 15635707 /tmp/ruby/build/trunk-yjit/.ext/x86_64-linux/pathname.so
7f9ff7b8d000-7f9ff7b8e000 r--p 00009000 00:126 15635707 /tmp/ruby/build/trunk-yjit/.ext/x86_64-linux/pathname.so
7f9ff7b8e000-7f9ff7b8f000 rw-p 0000a000 00:126 15635707 /tmp/ruby/build/trunk-yjit/.ext/x86_64-linux/pathname.so
7f9ff7b8f000-7f9ff7be0000 rw-p 00000000 00:00 0
7f9ff7be3000-7f9ff7be5000 r--p 00000000 00:126 15635010 /tmp/ruby/build/trunk-yjit/.ext/x86_64-linux/digest.so
7f9ff7be5000-7f9ff7be7000 r-xp 00002000 00:126 15635010 /tmp/ruby/build/trunk-yjit/.ext/x86_64-linux/digest.so
7f9ff7be7000-7f9ff7be8000 r--p 00004000 00:126 15635010 /tmp/ruby/build/trunk-yjit/.ext/x86_64-linux/digest.so
7f9ff7be8000-7f9ff7be9000 r--p 00004000 00:126 15635010 /tmp/ruby/build/trunk-yjit/.ext/x86_64-linux/digest.so
7f9ff7be9000-7f9ff7bea000 rw-p 00005000 00:126 15635010 /tmp/ruby/build/trunk-yjit/.ext/x86_64-linux/digest.so
7f9ff7bea000-7f9ff7beb000 r--p 00000000 00:126 15749111 /tmp/ruby/build/trunk-yjit/.ext/x86_64-linux/io/nonblock.so
7f9ff7beb000-7f9ff7bec000 r-xp 00001000 00:126 15749111 /tmp/ruby/build/trunk-yjit/.ext/x86_64-linux/io/nonblock.so
7f9ff7bec000-7f9ff7bed000 r--p 00002000 00:126 15749111 /tmp/ruby/build/trunk-yjit/.ext/x86_64-linux/io/nonblock.so
7f9ff7bed000-7f9ff7bee000 r--p 00002000 00:126 15749111 /tmp/ruby/build/trunk-yjit/.ext/x86_64-linux/io/nonblock.so
7f9ff7bee000-7f9ff7bef000 rw-p 00003000 00:126 15749111 /tmp/ruby/build/trunk-yjit/.ext/x86_64-linux/io/nonblock.so
7f9ff7bef000-7f9ff7e00000 rw-p 00000000 00:00 0
7f9ff7e04000-7f9ff7e06000 r--p 00000000 00:126 15749247 /tmp/ruby/build/trunk-yjit/.ext/x86_64-linux/io/console.so
7f9ff7e06000-7f9ff7e0b000 r-xp 00002000 00:126 15749247 /tmp/ruby/build/trunk-yjit/.ext/x86_64-linux/io/console.so
7f9ff7e0b000-7f9ff7e0c000 r--p 00007000 00:126 15749247 /tmp/ruby/build/trunk-yjit/.ext/x86_64-linux/io/console.so
7f9ff7e0c000-7f9ff7e0d000 ---p 00008000 00:126 15749247 /tmp/ruby/build/trunk-yjit/.ext/x86_64-linux/io/console.so
7f9ff7e0d000-7f9ff7e0e000 r--p 00008000 00:126 15749247 /tmp/ruby/build/trunk-yjit/.ext/x86_64-linux/io/console.so
7f9ff7e0e000-7f9ff7e0f000 rw-p 00009000 00:126 15749247 /tmp/ruby/build/trunk-yjit/.ext/x86_64-linux/io/console.so
7f9ff7e0f000-7f9ff7e10000 ---p 00000000 00:00 0
7f9ff7e10000-7f9ff7e51000 rw-p 00000000 00:00 0
7f9ff7e51000-7f9ff7e52000 ---p 00000000 00:00 0
7f9ff7e52000-7f9ff7e93000 rw-p 00000000 00:00 0
7f9ff7e93000-7f9ff7e94000 ---p 00000000 00:00 0
7f9ff7e94000-7f9ff7ed5000 rw-p 00000000 00:00 0
7f9ff7ed5000-7f9ff7ed6000 ---p 00000000 00:00 0
7f9ff7ed6000-7f9ff7f17000 rw-p 00000000 00:00 0
7f9ff7f17000-7f9ff7f18000 ---p 00000000 00:00 0
7f9ff7f18000-7f9ff7f59000 rw-p 00000000 00:00 0
7f9ff7f59000-7f9ff7f5a000 ---p 00000000 00:00 0
7f9ff7f5a000-7f9ff7f9b000 rw-p 00000000 00:00 0
7f9ff7f9b000-7f9ff7f9c000 ---p 00000000 00:00 0
7f9ff7f9c000-7f9ff7fdd000 rw-p 00000000 00:00 0
7f9ff7fdd000-7f9ff7fde000 ---p 00000000 00:00 0
7f9ff7fde000-7f9ff801f000 rw-p 00000000 00:00 0
7f9ff801f000-7f9ff8020000 ---p 00000000 00:00 0
7f9ff8020000-7f9ff8061000 rw-p 00000000 00:00 0
7f9ff8061000-7f9ff8062000 ---p 00000000 00:00 0
7f9ff8062000-7f9ff80a3000 rw-p 00000000 00:00 0
7f9ff80a3000-7f9ff80a4000 ---p 00000000 00:00 0
7f9ff80a4000-7f9ff80e5000 rw-p 00000000 00:00 0
7f9ff80e5000-7f9ff80e6000 ---p 00000000 00:00 0
7f9ff80e6000-7f9ff8127000 rw-p 00000000 00:00 0
7f9ff8127000-7f9ff8128000 ---p 00000000 00:00 0
7f9ff8128000-7f9ff8169000 rw-p 00000000 00:00 0
7f9ff8169000-7f9ff816a000 ---p 00000000 00:00 0
7f9ff816a000-7f9ff81ab000 rw-p 00000000 00:00 0
7f9ff81ab000-7f9ff81ac000 ---p 00000000 00:00 0
7f9ff81ac000-7f9ff81ed000 rw-p 00000000 00:00 0
7f9ff81ed000-7f9ff81ee000 ---p 00000000 00:00 0
7f9ff81ee000-7f9ff822f000 rw-p 00000000 00:00 0
7f9ff822f000-7f9ff8230000 ---p 00000000 00:00 0
7f9ff8230000-7f9ff8271000 rw-p 00000000 00:00 0
7f9ff8271000-7f9ff8272000 ---p 00000000 00:00 0
7f9ff8272000-7f9ff82b3000 rw-p 00000000 00:00 0
7f9ff82b3000-7f9ff82b4000 ---p 00000000 00:00 0
7f9ff82b4000-7f9ff82f5000 rw-p 00000000 00:00 0
7f9ff82f5000-7f9ff82f6000 ---p 00000000 00:00 0
7f9ff82f6000-7f9ff8337000 rw-p 00000000 00:00 0
7f9ff8337000-7f9ff8338000 ---p 00000000 00:00 0
7f9ff8338000-7f9ff8379000 rw-p 00000000 00:00 0
7f9ff8379000-7f9ff837a000 ---p 00000000 00:00 0
7f9ff837a000-7f9ff83bb000 rw-p 00000000 00:00 0
7f9ff83bb000-7f9ff83bc000 ---p 00000000 00:00 0
7f9ff83bc000-7f9ff83fd000 rw-p 00000000 00:00 0
7f9ff83fd000-7f9ff83fe000 ---p 00000000 00:00 0
7f9ff83fe000-7f9ff843f000 rw-p 00000000 00:00 0
7f9ff843f000-7f9ff8440000 ---p 00000000 00:00 0
7f9ff8440000-7f9ff8481000 rw-p 00000000 00:00 0
7f9ff8481000-7f9ff8482000 ---p 00000000 00:00 0
7f9ff8482000-7f9ff84c3000 rw-p 00000000 00:00 0
7f9ff84c3000-7f9ff84c4000 ---p 00000000 00:00 0
7f9ff84c4000-7f9ff8505000 rw-p 00000000 00:00 0
7f9ff8505000-7f9ff8506000 ---p 00000000 00:00 0
7f9ff8506000-7f9ff8547000 rw-p 00000000 00:00 0
7f9ff8547000-7f9ff8548000 ---p 00000000 00:00 0
7f9ff8548000-7f9ff8589000 rw-p 00000000 00:00 0
7f9ff8589000-7f9ff858a000 ---p 00000000 00:00 0
7f9ff858a000-7f9ff85cb000 rw-p 00000000 00:00 0
7f9ff85cb000-7f9ff85cc000 ---p 00000000 00:00 0
7f9ff85cc000-7f9ff860d000 rw-p 00000000 00:00 0
7f9ff860d000-7f9ff860e000 ---p 00000000 00:00 0
7f9ff860e000-7f9ff864f000 rw-p 00000000 00:00 0
7f9ff864f000-7f9ff8650000 ---p 00000000 00:00 0
7f9ff8650000-7f9ff8ea0000 rw-p 00000000 00:00 0
7f9ff8ea0000-7f9ff8ea2000 r--p 00000000 00:126 15635067 /tmp/ruby/build/trunk-yjit/.ext/x86_64-linux/etc.so
7f9ff8ea2000-7f9ff8ea5000 r-xp 00002000 00:126 15635067 /tmp/ruby/build/trunk-yjit/.ext/x86_64-linux/etc.so
7f9ff8ea5000-7f9ff8ea7000 r--p 00005000 00:126 15635067 /tmp/ruby/build/trunk-yjit/.ext/x86_64-linux/etc.so
7f9ff8ea7000-7f9ff8ea8000 r--p 00006000 00:126 15635067 /tmp/ruby/build/trunk-yjit/.ext/x86_64-linux/etc.so
7f9ff8ea8000-7f9ff8ea9000 rw-p 00007000 00:126 15635067 /tmp/ruby/build/trunk-yjit/.ext/x86_64-linux/etc.so
7f9ff8ea9000-7f9ff8eaa000 r--p 00000000 00:126 15749324 /tmp/ruby/build/trunk-yjit/.ext/x86_64-linux/rbconfig/sizeof.so
7f9ff8eaa000-7f9ff8eac000 r-xp 00001000 00:126 15749324 /tmp/ruby/build/trunk-yjit/.ext/x86_64-linux/rbconfig/sizeof.so
7f9ff8eac000-7f9ff8ead000 r--p 00003000 00:126 15749324 /tmp/ruby/build/trunk-yjit/.ext/x86_64-linux/rbconfig/sizeof.so
7f9ff8ead000-7f9ff8eae000 r--p 00003000 00:126 15749324 /tmp/ruby/build/trunk-yjit/.ext/x86_64-linux/rbconfig/sizeof.so
7f9ff8eae000-7f9ff8eaf000 rw-p 00004000 00:126 15749324 /tmp/ruby/build/trunk-yjit/.ext/x86_64-linux/rbconfig/sizeof.so
7f9ff8eaf000-7fa0122af000 rw-p 00000000 00:00 0
7fa0122b0000-7fa0122b1000 r--p 00000000 00:126 15749237 /tmp/ruby/build/trunk-yjit/.ext/x86_64-linux/erb/escape.so
7fa0122b1000-7fa0122b2000 r-xp 00001000 00:126 15749237 /tmp/ruby/build/trunk-yjit/.ext/x86_64-linux/erb/escape.so
7fa0122b2000-7fa0122b3000 r--p 00002000 00:126 15749237 /tmp/ruby/build/trunk-yjit/.ext/x86_64-linux/erb/escape.so
7fa0122b3000-7fa0122b4000 r--p 00002000 00:126 15749237 /tmp/ruby/build/trunk-yjit/.ext/x86_64-linux/erb/escape.so
7fa0122b4000-7fa0122b5000 rw-p 00003000 00:126 15749237 /tmp/ruby/build/trunk-yjit/.ext/x86_64-linux/erb/escape.so
7fa0122b5000-7fa0122b6000 r--p 00000000 00:126 15749225 /tmp/ruby/build/trunk-yjit/.ext/x86_64-linux/cgi/escape.so
7fa0122b6000-7fa0122b8000 r-xp 00001000 00:126 15749225 /tmp/ruby/build/trunk-yjit/.ext/x86_64-linux/cgi/escape.so
7fa0122b8000-7fa0122b9000 r--p 00003000 00:126 15749225 /tmp/ruby/build/trunk-yjit/.ext/x86_64-linux/cgi/escape.so
7fa0122b9000-7fa0122ba000 r--p 00003000 00:126 15749225 /tmp/ruby/build/trunk-yjit/.ext/x86_64-linux/cgi/escape.so
7fa0122ba000-7fa0122bb000 rw-p 00004000 00:126 15749225 /tmp/ruby/build/trunk-yjit/.ext/x86_64-linux/cgi/escape.so
7fa0122bb000-7fa0122bc000 r--p 00000000 00:126 15749196 /tmp/ruby/build/trunk-yjit/.ext/x86_64-linux/io/wait.so
7fa0122bc000-7fa0122bd000 r-xp 00001000 00:126 15749196 /tmp/ruby/build/trunk-yjit/.ext/x86_64-linux/io/wait.so
7fa0122bd000-7fa0122be000 r--p 00002000 00:126 15749196 /tmp/ruby/build/trunk-yjit/.ext/x86_64-linux/io/wait.so
7fa0122be000-7fa0122bf000 r--p 00002000 00:126 15749196 /tmp/ruby/build/trunk-yjit/.ext/x86_64-linux/io/wait.so
7fa0122bf000-7fa0122c0000 rw-p 00003000 00:126 15749196 /tmp/ruby/build/trunk-yjit/.ext/x86_64-linux/io/wait.so
7fa0122c0000-7fa0122f0000 rw-p 00000000 00:00 0
7fa0122f0000-7fa0122f3000 r--p 00000000 00:126 15613033 /tmp/ruby/build/trunk-yjit/.ext/x86_64-linux/stringio.so
7fa0122f3000-7fa0122f8000 r-xp 00003000 00:126 15613033 /tmp/ruby/build/trunk-yjit/.ext/x86_64-linux/stringio.so
7fa0122f8000-7fa0122fa000 r--p 00008000 00:126 15613033 /tmp/ruby/build/trunk-yjit/.ext/x86_64-linux/stringio.so
7fa0122fa000-7fa0122fb000 r--p 00009000 00:126 15613033 /tmp/ruby/build/trunk-yjit/.ext/x86_64-linux/stringio.so
7fa0122fb000-7fa0122fc000 rw-p 0000a000 00:126 15613033 /tmp/ruby/build/trunk-yjit/.ext/x86_64-linux/stringio.so
7fa0122fc000-7fa0122ff000 r--p 00000000 00:126 15636223 /tmp/ruby/build/trunk-yjit/.ext/x86_64-linux/zlib.so
7fa0122ff000-7fa01230b000 r-xp 00003000 00:126 15636223 /tmp/ruby/build/trunk-yjit/.ext/x86_64-linux/zlib.so
7fa01230b000-7fa01230e000 r--p 0000f000 00:126 15636223 /tmp/ruby/build/trunk-yjit/.ext/x86_64-linux/zlib.so
7fa01230e000-7fa01230f000 r--p 00011000 00:126 15636223 /tmp/ruby/build/trunk-yjit/.ext/x86_64-linux/zlib.so
7fa01230f000-7fa012310000 rw-p 00012000 00:126 15636223 /tmp/ruby/build/trunk-yjit/.ext/x86_64-linux/zlib.so
7fa012310000-7fa012320000 rw-p 00000000 00:00 0
7fa012320000-7fa012321000 r--p 00000000 00:126 15635474 /tmp/ruby/build/trunk-yjit/.ext/x86_64-linux/monitor.so
7fa012321000-7fa012322000 r-xp 00001000 00:126 15635474 /tmp/ruby/build/trunk-yjit/.ext/x86_64-linux/monitor.so
7fa012322000-7fa012323000 r--p 00002000 00:126 15635474 /tmp/ruby/build/trunk-yjit/.ext/x86_64-linux/monitor.so
7fa012323000-7fa012324000 r--p 00002000 00:126 15635474 /tmp/ruby/build/trunk-yjit/.ext/x86_64-linux/monitor.so
7fa012324000-7fa012325000 rw-p 00003000 00:126 15635474 /tmp/ruby/build/trunk-yjit/.ext/x86_64-linux/monitor.so
7fa012325000-7fa012326000 r--p 00000000 00:126 15609054 /tmp/ruby/build/trunk-yjit/.ext/x86_64-linux/enc/trans/transdb.so
7fa012326000-7fa012327000 r-xp 00001000 00:126 15609054 /tmp/ruby/build/trunk-yjit/.ext/x86_64-linux/enc/trans/transdb.so
7fa012327000-7fa012328000 r--p 00002000 00:126 15609054 /tmp/ruby/build/trunk-yjit/.ext/x86_64-linux/enc/trans/transdb.so
7fa012328000-7fa012329000 r--p 00002000 00:126 15609054 /tmp/ruby/build/trunk-yjit/.ext/x86_64-linux/enc/trans/transdb.so
7fa012329000-7fa01232a000 rw-p 00003000 00:126 15609054 /tmp/ruby/build/trunk-yjit/.ext/x86_64-linux/enc/trans/transdb.so
7fa01232a000-7fa01232b000 r--p 00000000 00:126 15608260 /tmp/ruby/build/trunk-yjit/.ext/x86_64-linux/enc/encdb.so
7fa01232b000-7fa01232c000 r-xp 00001000 00:126 15608260 /tmp/ruby/build/trunk-yjit/.ext/x86_64-linux/enc/encdb.so
7fa01232c000-7fa01232d000 r--p 00002000 00:126 15608260 /tmp/ruby/build/trunk-yjit/.ext/x86_64-linux/enc/encdb.so
7fa01232d000-7fa01232e000 r--p 00002000 00:126 15608260 /tmp/ruby/build/trunk-yjit/.ext/x86_64-linux/enc/encdb.so
7fa01232e000-7fa01232f000 rw-p 00003000 00:126 15608260 /tmp/ruby/build/trunk-yjit/.ext/x86_64-linux/enc/encdb.so
7fa01232f000-7fa012433000 rw-p 00000000 00:00 0
7fa012433000-7fa01245b000 r--p 00000000 00:126 13112687 /usr/lib/x86_64-linux-gnu/libc.so.6
7fa01245b000-7fa0125f0000 r-xp 00028000 00:126 13112687 /usr/lib/x86_64-linux-gnu/libc.so.6
7fa0125f0000-7fa012648000 r--p 001bd000 00:126 13112687 /usr/lib/x86_64-linux-gnu/libc.so.6
7fa012648000-7fa01264c000 r--p 00214000 00:126 13112687 /usr/lib/x86_64-linux-gnu/libc.so.6
7fa01264c000-7fa01264e000 rw-p 00218000 00:126 13112687 /usr/lib/x86_64-linux-gnu/libc.so.6
7fa01264e000-7fa01265d000 rw-p 00000000 00:00 0
7fa01265d000-7fa012660000 r--p 00000000 00:126 13112712 /usr/lib/x86_64-linux-gnu/libgcc_s.so.1
7fa012660000-7fa012677000 r-xp 00003000 00:126 13112712 /usr/lib/x86_64-linux-gnu/libgcc_s.so.1
7fa012677000-7fa01267b000 r--p 0001a000 00:126 13112712 /usr/lib/x86_64-linux-gnu/libgcc_s.so.1
7fa01267b000-7fa01267c000 r--p 0001d000 00:126 13112712 /usr/lib/x86_64-linux-gnu/libgcc_s.so.1
7fa01267c000-7fa01267d000 rw-p 0001e000 00:126 13112712 /usr/lib/x86_64-linux-gnu/libgcc_s.so.1
7fa01267d000-7fa01268b000 r--p 00000000 00:126 13112739 /usr/lib/x86_64-linux-gnu/libm.so.6
7fa01268b000-7fa012707000 r-xp 0000e000 00:126 13112739 /usr/lib/x86_64-linux-gnu/libm.so.6
7fa012707000-7fa012762000 r--p 0008a000 00:126 13112739 /usr/lib/x86_64-linux-gnu/libm.so.6
7fa012762000-7fa012763000 r--p 000e4000 00:126 13112739 /usr/lib/x86_64-linux-gnu/libm.so.6
7fa012763000-7fa012764000 rw-p 000e5000 00:126 13112739 /usr/lib/x86_64-linux-gnu/libm.so.6
7fa012764000-7fa012766000 r--p 00000000 00:126 13112696 /usr/lib/x86_64-linux-gnu/libcrypt.so.1.1.0
7fa012766000-7fa01277a000 r-xp 00002000 00:126 13112696 /usr/lib/x86_64-linux-gnu/libcrypt.so.1.1.0
7fa01277a000-7fa012793000 r--p 00016000 00:126 13112696 /usr/lib/x86_64-linux-gnu/libcrypt.so.1.1.0
7fa012793000-7fa012794000 ---p 0002f000 00:126 13112696 /usr/lib/x86_64-linux-gnu/libcrypt.so.1.1.0
7fa012794000-7fa012795000 r--p 0002f000 00:126 13112696 /usr/lib/x86_64-linux-gnu/libcrypt.so.1.1.0
7fa012795000-7fa012796000 rw-p 00030000 00:126 13112696 /usr/lib/x86_64-linux-gnu/libcrypt.so.1.1.0
7fa012796000-7fa01279e000 rw-p 00000000 00:00 0
7fa01279e000-7fa0127a8000 r--p 00000000 00:126 13112716 /usr/lib/x86_64-linux-gnu/libgmp.so.10.4.1
7fa0127a8000-7fa012807000 r-xp 0000a000 00:126 13112716 /usr/lib/x86_64-linux-gnu/libgmp.so.10.4.1
7fa012807000-7fa01281e000 r--p 00069000 00:126 13112716 /usr/lib/x86_64-linux-gnu/libgmp.so.10.4.1
7fa01281e000-7fa01281f000 r--p 0007f000 00:126 13112716 /usr/lib/x86_64-linux-gnu/libgmp.so.10.4.1
7fa01281f000-7fa012820000 rw-p 00080000 00:126 13112716 /usr/lib/x86_64-linux-gnu/libgmp.so.10.4.1
7fa012820000-7fa012822000 r--p 00000000 00:126 13112818 /usr/lib/x86_64-linux-gnu/libz.so.1.2.11
7fa012822000-7fa012833000 r-xp 00002000 00:126 13112818 /usr/lib/x86_64-linux-gnu/libz.so.1.2.11
7fa012833000-7fa012839000 r--p 00013000 00:126 13112818 /usr/lib/x86_64-linux-gnu/libz.so.1.2.11
7fa012839000-7fa01283a000 ---p 00019000 00:126 13112818 /usr/lib/x86_64-linux-gnu/libz.so.1.2.11
7fa01283a000-7fa01283b000 r--p 00019000 00:126 13112818 /usr/lib/x86_64-linux-gnu/libz.so.1.2.11
7fa01283b000-7fa01283c000 rw-p 0001a000 00:126 13112818 /usr/lib/x86_64-linux-gnu/libz.so.1.2.11
7fa012840000-7fa012842000 rw-p 00000000 00:00 0
7fa012842000-7fa012844000 r--p 00000000 00:126 13112669 /usr/lib/x86_64-linux-gnu/ld-linux-x86-64.so.2
7fa012844000-7fa01286e000 r-xp 00002000 00:126 13112669 /usr/lib/x86_64-linux-gnu/ld-linux-x86-64.so.2
7fa01286e000-7fa012879000 r--p 0002c000 00:126 13112669 /usr/lib/x86_64-linux-gnu/ld-linux-x86-64.so.2
7fa01287a000-7fa01287c000 r--p 00037000 00:126 13112669 /usr/lib/x86_64-linux-gnu/ld-linux-x86-64.so.2
7fa01287c000-7fa01287e000 rw-p 00039000 00:126 13112669 /usr/lib/x86_64-linux-gnu/ld-linux-x86-64.so.2
7ffd94ca8000-7ffd954a7000 rw-p 00000000 00:00 0 [stack]
7ffd95588000-7ffd9558c000 r--p 00000000 00:00 0 [vvar]
7ffd9558c000-7ffd9558e000 r-xp 00000000 00:00 0 [vdso]
ffffffffff600000-ffffffffff601000 --xp 00000000 00:00 0 [vsyscall]
running file: /tmp/ruby/src/trunk-yjit/test/ruby/test_optimization.rb
A test worker crashed. It might be an interpreter bug or
a bug in test/unit/parallel.rb. Try again without the -j
option.
make: *** [uncommon.mk:945: yes-test-all] Error 1
$$$[end] "make yes-test-all TESTOPTS='--stderr-on-failure' TESTS='-j4'" exit with 512.
$$$[beg] make yes-test-rubyspec MSPECOPT='--error-output stderr --debug' TESTS='-j4'
BASERUBY = /usr/bin/ruby --disable=gems
CC = gcc
LD = ld
LDSHARED = gcc -shared
CFLAGS = -O3 -fno-fast-math -ggdb3 -Wall -Wextra -Wdeprecated-declarations -Wdiv-by-zero -Wduplicated-cond -Wimplicit-function-declaration -Wimplicit-int -Wpointer-arith -Wwrite-strings -Wold-style-definition -Wimplicit-fallthrough=0 -Wmissing-noreturn -Wno-cast-function-type -Wno-constant-logical-operand -Wno-long-long -Wno-missing-field-initializers -Wno-overlength-strings -Wno-packed-bitfield-compat -Wno-parentheses-equality -Wno-self-assign -Wno-tautological-compare -Wno-unused-parameter -Wno-unused-value -Wsuggest-attribute=format -Wsuggest-attribute=noreturn -Wunused-variable -Wmisleading-indentation -Wundef
XCFLAGS = -U_FORTIFY_SOURCE -D_FORTIFY_SOURCE=2 -fstack-protector-strong -fno-strict-overflow -fvisibility=hidden -fexcess-precision=standard -DRUBY_EXPORT -fPIE -I. -I.ext/include/x86_64-linux -I/tmp/ruby/src/trunk-yjit/include -I/tmp/ruby/src/trunk-yjit -I/tmp/ruby/src/trunk-yjit/prism -I/tmp/ruby/src/trunk-yjit/enc/unicode/15.0.0
CPPFLAGS = -DYJIT_FORCE_ENABLE
DLDFLAGS = -Wl,--compress-debug-sections=zlib -fstack-protector-strong -pie
SOLIBS = -lz -lrt -lrt -lgmp -ldl -lcrypt -lm -lpthread
LANG =
LC_ALL =
LC_CTYPE =
MFLAGS =
RUSTC = rustc
YJIT_RUSTC_ARGS = --crate-name=yjit --crate-type=staticlib --edition=2021 -g -C lto=thin -C opt-level=3 -C overflow-checks=on '--out-dir=/tmp/ruby/build/trunk-yjit/yjit/target/release/' /tmp/ruby/src/trunk-yjit/yjit/src/lib.rs
gcc (Ubuntu 11.3.0-1ubuntu1~22.04.1) 11.3.0
Copyright (C) 2021 Free Software Foundation, Inc.
This is free software; see the source for copying conditions. There is NO
warranty; not even for MERCHANTABILITY or FITNESS FOR A PARTICULAR PURPOSE.
generating enc.mk
making enc
make[1]: Entering directory '/tmp/ruby/build/trunk-yjit'
make[1]: Nothing to be done for 'enc'.
make[1]: Leaving directory '/tmp/ruby/build/trunk-yjit'
making srcs under enc
make[1]: Entering directory '/tmp/ruby/build/trunk-yjit'
make[1]: Nothing to be done for 'srcs'.
make[1]: Leaving directory '/tmp/ruby/build/trunk-yjit'
generating transdb.h
transdb.h unchanged
making trans
make[1]: Entering directory '/tmp/ruby/build/trunk-yjit'
make[1]: Nothing to be done for '/tmp/ruby/src/trunk-yjit/enc/trans'.
make[1]: Leaving directory '/tmp/ruby/build/trunk-yjit'
making encs
make[1]: Entering directory '/tmp/ruby/build/trunk-yjit'
make[1]: Nothing to be done for 'encs'.
make[1]: Leaving directory '/tmp/ruby/build/trunk-yjit'
generating makefiles ext/configure-ext.mk
ext/configure-ext.mk updated
make[1]: Entering directory '/tmp/ruby/build/trunk-yjit'
make[1]: Leaving directory '/tmp/ruby/build/trunk-yjit'
generating makefile exts.mk
exts.mk unchanged
make[1]: Entering directory '/tmp/ruby/build/trunk-yjit'
make[2]: Entering directory '/tmp/ruby/build/trunk-yjit/ext/coverage'
make[2]: Leaving directory '/tmp/ruby/build/trunk-yjit/ext/coverage'
make[2]: Entering directory '/tmp/ruby/build/trunk-yjit/ext/date'
make[2]: Leaving directory '/tmp/ruby/build/trunk-yjit/ext/date'
make[2]: Entering directory '/tmp/ruby/build/trunk-yjit/ext/digest'
make[2]: Leaving directory '/tmp/ruby/build/trunk-yjit/ext/digest'
make[2]: Entering directory '/tmp/ruby/build/trunk-yjit/ext/digest/sha2'
make[2]: Leaving directory '/tmp/ruby/build/trunk-yjit/ext/digest/sha2'
make[2]: Entering directory '/tmp/ruby/build/trunk-yjit/ext/fiddle'
make[2]: Leaving directory '/tmp/ruby/build/trunk-yjit/ext/fiddle'
make[2]: Entering directory '/tmp/ruby/build/trunk-yjit/ext/io/console'
make[2]: Leaving directory '/tmp/ruby/build/trunk-yjit/ext/io/console'
make[2]: Entering directory '/tmp/ruby/build/trunk-yjit/ext/json'
make[2]: Leaving directory '/tmp/ruby/build/trunk-yjit/ext/json'
make[2]: Entering directory '/tmp/ruby/build/trunk-yjit/ext/monitor'
make[2]: Leaving directory '/tmp/ruby/build/trunk-yjit/ext/monitor'
make[2]: Entering directory '/tmp/ruby/build/trunk-yjit/ext/objspace'
make[2]: Leaving directory '/tmp/ruby/build/trunk-yjit/ext/objspace'
make[2]: Entering directory '/tmp/ruby/build/trunk-yjit/ext/openssl'
make[2]: Leaving directory '/tmp/ruby/build/trunk-yjit/ext/openssl'
make[2]: Entering directory '/tmp/ruby/build/trunk-yjit/ext/pathname'
make[2]: Leaving directory '/tmp/ruby/build/trunk-yjit/ext/pathname'
make[2]: Entering directory '/tmp/ruby/build/trunk-yjit/ext/psych'
make[2]: Leaving directory '/tmp/ruby/build/trunk-yjit/ext/psych'
make[2]: Entering directory '/tmp/ruby/build/trunk-yjit/ext/pty'
make[2]: Leaving directory '/tmp/ruby/build/trunk-yjit/ext/pty'
make[2]: Entering directory '/tmp/ruby/build/trunk-yjit/ext/ripper'
make[2]: Leaving directory '/tmp/ruby/build/trunk-yjit/ext/ripper'
make[2]: Entering directory '/tmp/ruby/build/trunk-yjit/ext/rubyvm'
make[2]: Leaving directory '/tmp/ruby/build/trunk-yjit/ext/rubyvm'
make[2]: Entering directory '/tmp/ruby/build/trunk-yjit/ext/socket'
make[2]: Leaving directory '/tmp/ruby/build/trunk-yjit/ext/socket'
make[2]: Entering directory '/tmp/ruby/build/trunk-yjit/.bundle/gems/bigdecimal-3.1.6/ext/bigdecimal'
make[2]: Leaving directory '/tmp/ruby/build/trunk-yjit/.bundle/gems/bigdecimal-3.1.6/ext/bigdecimal'
make[2]: Entering directory '/tmp/ruby/build/trunk-yjit/.bundle/gems/debug-1.9.1/ext/debug'
make[2]: Leaving directory '/tmp/ruby/build/trunk-yjit/.bundle/gems/debug-1.9.1/ext/debug'
make[2]: Entering directory '/tmp/ruby/build/trunk-yjit/.bundle/gems/nkf-0.2.0/ext/nkf'
make[2]: Leaving directory '/tmp/ruby/build/trunk-yjit/.bundle/gems/nkf-0.2.0/ext/nkf'
make[2]: Entering directory '/tmp/ruby/build/trunk-yjit/.bundle/gems/racc-1.7.3/ext/racc/cparse'
make[2]: Leaving directory '/tmp/ruby/build/trunk-yjit/.bundle/gems/racc-1.7.3/ext/racc/cparse'
make[2]: Entering directory '/tmp/ruby/build/trunk-yjit/.bundle/gems/rbs-3.4.3/ext/rbs_extension'
make[2]: Leaving directory '/tmp/ruby/build/trunk-yjit/.bundle/gems/rbs-3.4.3/ext/rbs_extension'
make[2]: Entering directory '/tmp/ruby/build/trunk-yjit/.bundle/gems/syslog-0.1.2/ext/syslog'
make[2]: Leaving directory '/tmp/ruby/build/trunk-yjit/.bundle/gems/syslog-0.1.2/ext/syslog'
make[2]: Entering directory '/tmp/ruby/build/trunk-yjit'
make[2]: 'ruby' is up to date.
make[2]: Leaving directory '/tmp/ruby/build/trunk-yjit'
make[1]: Leaving directory '/tmp/ruby/build/trunk-yjit'
make[1]: Entering directory '/tmp/ruby/build/trunk-yjit'
make[1]: Nothing to be done for 'note'.
make[1]: Leaving directory '/tmp/ruby/build/trunk-yjit'
$ /tmp/ruby/build/trunk-yjit/miniruby -I/tmp/ruby/src/trunk-yjit/lib /tmp/ruby/src/trunk-yjit/tool/runruby.rb --archdir=/tmp/ruby/build/trunk-yjit --extout=.ext -- /tmp/ruby/src/trunk-yjit/spec/mspec/bin/mspec-run -B /tmp/ruby/src/trunk-yjit/spec/default.mspec --error-output stderr --debug
description_with_yjit
0 .........................................................................
73 .........................................................................
146 .........................................................................
219 .........................................................................
292 .........................................................................
365 .........................................................................
438 .........................................................................
511 .........................................................................
584 .........................................................................
657 .........................................................................
730 .........................................................................
803 .........................................................................
876 .........................................................................
949 .........................................................................
1022 .........................................................................
1095 .........................................................................
1168 .........................................................................
1241 .........................................................................
1314 .........................................................................
1387 .........................................................................
1460 .........................................................................
1533 .........................................................................
1606 .........................................................................
1679 .........................................................................
1752 .........................................................................
1825 .........................................................................
1898 .........................................................................
1971 .........................................................................
2044 .........................................................................
2117 .........................................................................
2190 .........................................................................
2263 .........................................................................
2336 .........................................................................
2409 .........................................................................
2482 .........................................................................
2555 .........................................................................
2628 .........................................................................
2701 .........................................................................
2774 .........................................................................
2847 .........................................................................
2920 .........................................................................
2993 .........................................................................
3066 .........................................................................
3139 .........................................................................
3212 .........................................................................
3285 .........................................................................
3358 .........................................................................
3431 .........................................................................
3504 .........................................................................
3577 .........................................................................
3650 .........................................................................
3723 .....
Finished in 176.810682 seconds
3728 files, 31901 examples, 215599 expectations, 0 failures, 0 errors, 0 tagged
$$$[end] "make yes-test-rubyspec MSPECOPT='--error-output stderr --debug' TESTS='-j4'" exit with 0.
$ gdb -batch -se /tmp/ruby/build/trunk-yjit/ruby -c /tmp/cores/core.1001.1069476.ruby -x gdbscript
[New LWP 1069476]
[New LWP 1072840]
[New LWP 1073826]
[New LWP 1073488]
[Thread debugging using libthread_db enabled]
Using host libthread_db library "/lib/x86_64-linux-gnu/libthread_db.so.1".
Core was generated by `/tmp/ruby/src/trunk-yjit/tool/lib/test/unit/parallel.rb '.
Program terminated with signal SIGABRT, Aborted.
#0 __pthread_kill_implementation (no_tid=0, signo=6, threadid=140325477877696) at ./nptl/pthread_kill.c:44
[Current thread is 1 (Thread 0x7fa0124307c0 (LWP 1069476))]
>>> Threads
Id Target Id Frame
* 1 Thread 0x7fa0124307c0 (LWP 1069476) __pthread_kill_implementation (no_tid=0, signo=6, threadid=140325477877696) at ./nptl/pthread_kill.c:44
2 Thread 0x7f9ff8e4f640 (LWP 1072840) 0x00007fa012558fde in epoll_wait (epfd=4, events=events@entry=0x56298127021c <timer_th+28>, maxevents=maxevents@entry=16, timeout=10) at ../sysdeps/unix/sysv/linux/epoll_wait.c:30
3 Thread 0x7f9ff5fb8640 (LWP 1073826) __futex_abstimed_wait_common64 (private=0, cancel=true, abstime=0x0, op=393, expected=0, futex_word=0x7f9ff4888cc0) at ./nptl/futex-internal.c:57
4 Thread 0x7f9ff5ab0640 (LWP 1073488) __futex_abstimed_wait_common64 (private=307067229, cancel=true, abstime=0x7f9ff5aaefc0, op=137, expected=0, futex_word=0x7f9fb8001bc4) at ./nptl/futex-internal.c:57
>>> Machine level backtrace
Thread 4 (Thread 0x7f9ff5ab0640 (LWP 1073488)):
#0 __futex_abstimed_wait_common64 (private=307067229, cancel=true, abstime=0x7f9ff5aaefc0, op=137, expected=0, futex_word=0x7f9fb8001bc4) at ./nptl/futex-internal.c:57
sc_cancel_oldtype = 0
sc_ret = <optimized out>
resultvar = <optimized out>
__arg6 = <optimized out>
__arg5 = <optimized out>
__arg4 = <optimized out>
__arg3 = <optimized out>
__arg2 = <optimized out>
__arg1 = <optimized out>
_a6 = <optimized out>
_a5 = <optimized out>
_a4 = <optimized out>
_a3 = <optimized out>
_a2 = <optimized out>
_a1 = <optimized out>
#1 __futex_abstimed_wait_common (cancel=true, private=307067229, abstime=0x7f9ff5aaefc0, clockid=16384, expected=0, futex_word=0x7f9fb8001bc4) at ./nptl/futex-internal.c:87
err = <optimized out>
clockbit = 4194560
op = 137
err = <optimized out>
clockbit = <optimized out>
op = <optimized out>
#2 __GI___futex_abstimed_wait_cancelable64 (futex_word=futex_word@entry=0x7f9fb8001bc4, expected=expected@entry=0, clockid=clockid@entry=1, abstime=abstime@entry=0x7f9ff5aaefc0, private=private@entry=0) at ./nptl/futex-internal.c:139
No locals.
#3 0x00007fa0124c6f1b in __pthread_cond_wait_common (abstime=0x7f9ff5aaefc0, clockid=1, mutex=0x7f9fb8001800, cond=0x7f9fb8001b98) at ./nptl/pthread_cond_wait.c:503
spin = 0
buffer = {__routine = 0x7fa0124c67a0 <__condvar_cleanup_waiting>, __arg = 0x7f9ff5aaef00, __canceltype = -1789343734, __prev = 0x0}
cbuffer = {wseq = 7, cond = 0x7f9fb8001b98, mutex = 0x7f9fb8001800, private = 0}
err = <optimized out>
g = 1
flags = <optimized out>
g1_start = <optimized out>
maxspin = 0
signals = <optimized out>
result = 0
wseq = 7
seq = 3
private = 0
maxspin = <optimized out>
err = <optimized out>
result = <optimized out>
wseq = <optimized out>
g = <optimized out>
seq = <optimized out>
flags = <optimized out>
private = <optimized out>
signals = <optimized out>
done = <optimized out>
g1_start = <optimized out>
spin = <optimized out>
buffer = <optimized out>
cbuffer = <optimized out>
s = <optimized out>
#4 ___pthread_cond_timedwait64 (cond=cond@entry=0x7f9fb8001b98, mutex=mutex@entry=0x7f9fb8001800, abstime=abstime@entry=0x7f9ff5aaefc0) at ./nptl/pthread_cond_wait.c:652
flags = <optimized out>
clockid = 1
#5 0x0000562980e6055a in native_cond_timedwait (abs=<synthetic pointer>, mutex=0x7f9fb8001800, cond=0x7f9fb8001b98) at /tmp/ruby/src/trunk-yjit/thread_pthread.c:242
r = <optimized out>
ts = {tv_sec = 911384, tv_nsec = 177546832}
r = <optimized out>
ts = <optimized out>
#6 native_cond_sleep (th=th@entry=0x7f9fb80016e0, rel=rel@entry=0x7f9ff5aaf010) at /tmp/ruby/src/trunk-yjit/thread_pthread.c:2457
end = <optimized out>
sched = <optimized out>
lock = 0x7f9fb8001800
cond = 0x7f9fb8001b98
max = 100000000000000000
#7 0x0000562980e63351 in native_sleep (rel=0x7f9ff5aaf010, th=0x7f9fb80016e0) at /tmp/ruby/src/trunk-yjit/thread_pthread.c:3294
sched = <optimized out>
sched = <optimized out>
#8 sleep_hrtime (fl=0, rel=<optimized out>, th=0x7f9fb80016e0) at /tmp/ruby/src/trunk-yjit/thread.c:1283
prev_status = THREAD_RUNNABLE
woke = 1
end = 911384177546482
prev_status = <optimized out>
woke = <optimized out>
end = <optimized out>
#9 rb_mutex_wait_for (time=time@entry=140324998148416) at /tmp/ruby/src/trunk-yjit/thread_sync.c:563
rel = 0x7f9ff5aaf140
#10 0x0000562980cbb2ec in rb_ensure (b_proc=b_proc@entry=0x562980e63280 <rb_mutex_wait_for>, data1=data1@entry=140324998148416, e_proc=e_proc@entry=0x562980e5cb10 <mutex_lock_uninterruptible>, data2=data2@entry=140324987079200) at /tmp/ruby/src/trunk-yjit/eval.c:1003
_ec = 0x7f9fb8001900
_tag = {tag = 36, retval = 140324998948328, buf = {0x7f9ff5020a20, 0x562980cbb3c0 <rb_ensure+480>, 0x0, 0x7f9ff5aaf050, 0x7f9ff5aaf0f0}, prev = 0x7f9ff5aaf430, state = RUBY_TAG_NONE, lock_rec = 0}
state = <optimized out>
result = 4
errinfo = <optimized out>
ec = 0x7f9fb8001900
ensure_list = {next = 0x7f9ff5aaf410, entry = {marker = 0, e_proc = 0x562980e5cb10 <mutex_lock_uninterruptible>, data2 = 140324987079200}}
#11 0x0000562980e5e969 in rb_mutex_sleep (self=140324987079200, timeout=258393997414105090) at /tmp/ruby/src/trunk-yjit/thread_sync.c:590
rel = 299999778000
t = <optimized out>
woken = 20
beg = 1706472848
scheduler = <optimized out>
end = <optimized out>
#12 0x0000562980eb385f in vm_call0_cfunc_with_frame (argv=0x7f9ff5aaf4c8, calling=<optimized out>, ec=0x7f9fb8001900) at /tmp/ruby/src/trunk-yjit/vm_eval.c:173
reg_cfp = 0x7f9fb8101af8
ci = <optimized out>
me = 0x7f9ff8e58ea0
mid = 26337
block_handler = <optimized out>
recv = <optimized out>
argc = <optimized out>
val = <optimized out>
cfunc = 0x5629831b1af8
len = <optimized out>
frame_flags = <optimized out>
ci = <optimized out>
val = <optimized out>
me = <optimized out>
cfunc = <optimized out>
len = <optimized out>
recv = <optimized out>
argc = <optimized out>
mid = <optimized out>
block_handler = <optimized out>
frame_flags = <optimized out>
unaligned_member_ptr_result = <optimized out>
args = <optimized out>
flag_arg_ = <optimized out>
hooks_arg_ = <optimized out>
reg_cfp = <optimized out>
flag_arg_ = <optimized out>
hooks_arg_ = <optimized out>
args = <optimized out>
#13 vm_call0_cfunc (argv=0x7f9ff5aaf4c8, calling=<optimized out>, ec=0x7f9fb8001900) at /tmp/ruby/src/trunk-yjit/vm_eval.c:187
No locals.
#14 vm_call0_body (ec=0x7f9fb8001900, calling=<optimized out>, argv=0x7f9ff5aaf4c8) at /tmp/ruby/src/trunk-yjit/vm_eval.c:233
ci = <optimized out>
cc = <optimized out>
ret = <optimized out>
#15 0x0000562980eb4658 in vm_call0_cc (ec=0x7f9fb8001900, recv=140324987079200, id=<optimized out>, argc=<optimized out>, argv=<optimized out>, cc=<optimized out>, kw_splat=0) at /tmp/ruby/src/trunk-yjit/vm_eval.c:110
flags = <optimized out>
use_argv = <optimized out>
av = {140320876527617, 28433}
calling = {cd = 0x7f9ff5aaf280, cc = 0x7f9ff41fe8c0, block_handler = 0, recv = 140324987079200, argc = 1, kw_splat = false, heap_argv = 0}
#16 0x0000562980eb6dba in rb_funcallv_scope (recv=140324987079200, mid=26337, argc=1, argv=0x7f9ff5aaf4c8, scope=CALL_FCALL) at /tmp/ruby/src/trunk-yjit/vm_eval.c:1069
ec = 0x7f9fb8001900
cc = <optimized out>
self = <optimized out>
#17 0x0000562980cbb2ec in rb_ensure (b_proc=b_proc@entry=0x562980e56600 <do_sleep>, data1=data1@entry=140324998149312, e_proc=e_proc@entry=0x562980e54cd0 <delete_from_waitq>, data2=data2@entry=140324998149328) at /tmp/ruby/src/trunk-yjit/eval.c:1003
_ec = 0x7f9fb8001900
_tag = {tag = 36, retval = 0, buf = {0x2, 0x562980cbb3c0 <rb_ensure+480>, 0x0, 0x7f9ff5aaf3d0, 0x0}, prev = 0x7f9ff5aaf6f0, state = RUBY_TAG_NONE, lock_rec = 0}
state = <optimized out>
result = 4
errinfo = <optimized out>
ec = 0x7f9fb8001900
ensure_list = {next = 0x7f9ff5aaf800, entry = {marker = 0, e_proc = 0x562980e54cd0 <delete_from_waitq>, data2 = 140324998149328}}
#18 0x0000562980e5642d in rb_condvar_wait (argc=2, argv=<optimized out>, self=<optimized out>) at /tmp/ruby/src/trunk-yjit/thread_sync.c:1548
ec = 0x7f9fb8001900
cv = 0x7f9ff661b1e0
args = {mutex = 140324987079200, timeout = 258393997414105090}
sync_waiter = {self = 140324987079200, th = 0x7f9fb80016e0, fiber = 0x0, node = {next = 0x7f9ff661b1e0, prev = 0x7f9ff661b1e0}}
#19 0x0000562980e9f41c in vm_call_cfunc_with_frame_ (stack_bottom=<optimized out>, argv=<optimized out>, argc=2, calling=<optimized out>, reg_cfp=0x7f9fb8101b30, ec=0x7f9fb8001900) at /tmp/ruby/src/trunk-yjit/vm_insnhelper.c:3492
ci = 0x461100100005
cc = <optimized out>
val = <optimized out>
me = 0x7f9ff8e58860
cfunc = 0x5629831be628
recv = <optimized out>
frame_type = <optimized out>
len = <optimized out>
block_handler = <optimized out>
ci = <optimized out>
cc = <optimized out>
val = <optimized out>
me = <optimized out>
cfunc = <optimized out>
recv = <optimized out>
block_handler = <optimized out>
frame_type = <optimized out>
len = <optimized out>
args = <optimized out>
flag_arg_ = <optimized out>
hooks_arg_ = <optimized out>
flag_arg_ = <optimized out>
hooks_arg_ = <optimized out>
args = <optimized out>
#20 vm_call_cfunc_with_frame (ec=0x7f9fb8001900, reg_cfp=0x7f9fb8101b30, calling=<optimized out>) at /tmp/ruby/src/trunk-yjit/vm_insnhelper.c:3520
argc = 2
stack_bottom = <optimized out>
argv = <optimized out>
#21 0x0000562980ebdbf1 in vm_sendish (method_explorer=<optimized out>, block_handler=<optimized out>, cd=<optimized out>, reg_cfp=<optimized out>, ec=<optimized out>) at /tmp/ruby/src/trunk-yjit/vm_callinfo.h:410
val = 140325030831152
ci = 0x0
cc = <optimized out>
recv = 140323963542468
argc = <optimized out>
calling = {cd = 0x7f9ff79da430, cc = 0x7f9ff41fe8e8, block_handler = 0, recv = 140324987079800, argc = 2, kw_splat = false, heap_argv = 0}
val = <optimized out>
ci = <optimized out>
cc = <optimized out>
argc = <optimized out>
recv = <optimized out>
calling = <optimized out>
#22 vm_exec_core (ec=0x7f9fb8001bc4) at ../../src/trunk-yjit/insns.def:862
bh = <optimized out>
cd = 0x7f9ff79da430
leaf = <optimized out>
val = 140325030831152
reg_pc = 0x7f9ff7d25a68
reg_cfp = 0x7f9fb8101b30
insns_address_table = {0x562980ebfd05 <vm_exec_core+8757>, 0x562980ebfc99 <vm_exec_core+8649>, 0x562980ebfc24 <vm_exec_core+8532>, 0x562980ebfba8 <vm_exec_core+8408>, 0x562980ebfee0 <vm_exec_core+9232>, 0x562980ebfe5e <vm_exec_core+9102>, 0x562980ebfd91 <vm_exec_core+8897>, 0x562980ebfd2e <vm_exec_core+8798>, 0x562980ebffb0 <vm_exec_core+9440>, 0x562980ebff5c <vm_exec_core+9356>, 0x562980ebf9dd <vm_exec_core+7949>, 0x562980ebf7e8 <vm_exec_core+7448>, 0x562980ebf79d <vm_exec_core+7373>, 0x562980ebf732 <vm_exec_core+7266>, 0x562980ebf6d2 <vm_exec_core+7170>, 0x562980ebf68e <vm_exec_core+7102>, 0x562980ebf64f <vm_exec_core+7039>, 0x562980ebf613 <vm_exec_core+6979>, 0x562980ebf5d7 <vm_exec_core+6919>, 0x562980ebf59b <vm_exec_core+6859>, 0x562980ebf502 <vm_exec_core+6706>, 0x562980ebf4ba <vm_exec_core+6634>, 0x562980ebf45b <vm_exec_core+6539>, 0x562980ebf40e <vm_exec_core+6462>, 0x562980ebf388 <vm_exec_core+6328>, 0x562980ebf347 <vm_exec_core+6263>, 0x562980ebf2e4 <vm_exec_core+6164>, 0x562980ebf266 <vm_exec_core+6038>, 0x562980ebf222 <vm_exec_core+5970>, 0x562980ebf1de <vm_exec_core+5902>, 0x562980ebf045 <vm_exec_core+5493>, 0x562980ebefb5 <vm_exec_core+5349>, 0x562980ebef50 <vm_exec_core+5248>, 0x562980ebeef1 <vm_exec_core+5153>, 0x562980ebee92 <vm_exec_core+5058>, 0x562980ebee40 <vm_exec_core+4976>, 0x562980ebede3 <vm_exec_core+4883>, 0x562980ebed92 <vm_exec_core+4802>, 0x562980ebed64 <vm_exec_core+4756>, 0x562980ebed22 <vm_exec_core+4690>, 0x562980ebecca <vm_exec_core+4602>, 0x562980ebec8f <vm_exec_core+4543>, 0x562980ebeb98 <vm_exec_core+4296>, 0x562980ebeb4e <vm_exec_core+4222>, 0x562980ebeb03 <vm_exec_core+4147>, 0x562980ebeace <vm_exec_core+4094>, 0x562980ebea59 <vm_exec_core+3977>, 0x562980ebe9f0 <vm_exec_core+3872>, 0x562980ebe99b <vm_exec_core+3787>, 0x562980ebe925 <vm_exec_core+3669>, 0x562980ebe888 <vm_exec_core+3512>, 0x562980ebe718 <vm_exec_core+3144>, 0x562980ebe6d6 <vm_exec_core+3078>, 0x562980ebe689 <vm_exec_core+3001>, 0x562980ebe530 <vm_exec_core+2656>, 0x562980ebdb30 <vm_exec_core+96>, 0x562980ebe4b0 <vm_exec_core+2528>, 0x562980ebe45a <vm_exec_core+2442>, 0x562980ec0c8d <vm_exec_core+12733>, 0x562980ebe404 <vm_exec_core+2356>, 0x562980ebe33d <vm_exec_core+2157>, 0x562980ec0310 <vm_exec_core+10304>, 0x562980ec017f <vm_exec_core+9903>, 0x562980ec00bd <vm_exec_core+9709>, 0x562980ec0730 <vm_exec_core+11360>, 0x562980ec0405 <vm_exec_core+10549>, 0x562980ec02aa <vm_exec_core+10202>, 0x562980ec0057 <vm_exec_core+9607>, 0x562980ec0014 <vm_exec_core+9540>, 0x562980ebe27d <vm_exec_core+1965>, 0x562980ebe1d3 <vm_exec_core+1795>, 0x562980ec1534 <vm_exec_core+14948>, 0x562980ec1469 <vm_exec_core+14745>, 0x562980ec129a <vm_exec_core+14282>, 0x562980ec1338 <vm_exec_core+14440>, 0x562980ec1393 <vm_exec_core+14531>, 0x562980ec14d3 <vm_exec_core+14851>, 0x562980ec0d9a <vm_exec_core+13002>, 0x562980ec0e20 <vm_exec_core+13136>, 0x562980ec0e84 <vm_exec_core+13236>, 0x562980ec0ee8 <vm_exec_core+13336>, 0x562980ec0f4c <vm_exec_core+13436>, 0x562980ec0fb0 <vm_exec_core+13536>, 0x562980ec1708 <vm_exec_core+15416>, 0x562980ec15a1 <vm_exec_core+15057>, 0x562980ec1697 <vm_exec_core+15303>, 0x562980ec110b <vm_exec_core+13883>, 0x562980ebe15f <vm_exec_core+1679>, 0x562980ebe0fa <vm_exec_core+1578>, 0x562980ec15fc <vm_exec_core+15148>, 0x562980ec142c <vm_exec_core+14684>, 0x562980ec175c <vm_exec_core+15500>, 0x562980ec1639 <vm_exec_core+15209>, 0x562980ec1197 <vm_exec_core+14023>, 0x562980ec120c <vm_exec_core+14140>, 0x562980ebe083 <vm_exec_core+1459>, 0x562980ebe002 <vm_exec_core+1330>, 0x562980ebdf4b <vm_exec_core+1147>, 0x562980ebdefd <vm_exec_core+1069>, 0x562980ebdeab <vm_exec_core+987>, 0x562980ebde5b <vm_exec_core+907>, 0x562980ebde03 <vm_exec_core+819>, 0x562980ebddc7 <vm_exec_core+759>, 0x562980ebdd8b <vm_exec_core+699>, 0x562980ebfcf5 <vm_exec_core+8741>, 0x562980ebfc89 <vm_exec_core+8633>, 0x562980ebfc14 <vm_exec_core+8516>, 0x562980ebfb98 <vm_exec_core+8392>, 0x562980ebfed0 <vm_exec_core+9216>, 0x562980ebfe4e <vm_exec_core+9086>, 0x562980ebfd81 <vm_exec_core+8881>, 0x562980ebfd1e <vm_exec_core+8782>, 0x562980ebffa0 <vm_exec_core+9424>, 0x562980ebff4c <vm_exec_core+9340>, 0x562980ebf9cd <vm_exec_core+7933>, 0x562980ebf7d8 <vm_exec_core+7432>, 0x562980ebf78d <vm_exec_core+7357>, 0x562980ebf722 <vm_exec_core+7250>, 0x562980ebf6c2 <vm_exec_core+7154>, 0x562980ebf67e <vm_exec_core+7086>, 0x562980ebf63f <vm_exec_core+7023>, 0x562980ebf603 <vm_exec_core+6963>, 0x562980ebf5c7 <vm_exec_core+6903>, 0x562980ebf58b <vm_exec_core+6843>, 0x562980ebf4f2 <vm_exec_core+6690>, 0x562980ebf4aa <vm_exec_core+6618>, 0x562980ebf44b <vm_exec_core+6523>, 0x562980ebf3fe <vm_exec_core+6446>, 0x562980ebf378 <vm_exec_core+6312>, 0x562980ebf337 <vm_exec_core+6247>, 0x562980ebf2d4 <vm_exec_core+6148>, 0x562980ebf256 <vm_exec_core+6022>, 0x562980ebf212 <vm_exec_core+5954>, 0x562980ebf1ce <vm_exec_core+5886>, 0x562980ebf035 <vm_exec_core+5477>, 0x562980ebefa5 <vm_exec_core+5333>, 0x562980ebef40 <vm_exec_core+5232>, 0x562980ebeee1 <vm_exec_core+5137>, 0x562980ebee82 <vm_exec_core+5042>, 0x562980ebee30 <vm_exec_core+4960>, 0x562980ebedd3 <vm_exec_core+4867>, 0x562980ebed82 <vm_exec_core+4786>, 0x562980ebed54 <vm_exec_core+4740>, 0x562980ebed12 <vm_exec_core+4674>, 0x562980ebecba <vm_exec_core+4586>, 0x562980ebec7f <vm_exec_core+4527>, 0x562980ebeb88 <vm_exec_core+4280>, 0x562980ebeb3e <vm_exec_core+4206>, 0x562980ebeaf3 <vm_exec_core+4131>, 0x562980ebeabe <vm_exec_core+4078>, 0x562980ebea49 <vm_exec_core+3961>, 0x562980ebe9e0 <vm_exec_core+3856>, 0x562980ebe98b <vm_exec_core+3771>, 0x562980ebe915 <vm_exec_core+3653>, 0x562980ebe878 <vm_exec_core+3496>, 0x562980ebe708 <vm_exec_core+3128>, 0x562980ebe6c6 <vm_exec_core+3062>, 0x562980ebe679 <vm_exec_core+2985>, 0x562980ebe520 <vm_exec_core+2640>, 0x562980ec0ff3 <vm_exec_core+13603>, 0x562980ebe4a0 <vm_exec_core+2512>, 0x562980ebe44a <vm_exec_core+2426>, 0x562980ec1008 <vm_exec_core+13624>, 0x562980ebe3f4 <vm_exec_core+2340>, 0x562980ebe32d <vm_exec_core+2141>, 0x562980ec0300 <vm_exec_core+10288>, 0x562980ec016f <vm_exec_core+9887>, 0x562980ec00ad <vm_exec_core+9693>, 0x562980ec0720 <vm_exec_core+11344>, 0x562980ec03f5 <vm_exec_core+10533>, 0x562980ec029a <vm_exec_core+10186>, 0x562980ec0047 <vm_exec_core+9591>, 0x562980ec0004 <vm_exec_core+9524>, 0x562980ebe26d <vm_exec_core+1949>, 0x562980ebe1c3 <vm_exec_core+1779>, 0x562980ec101d <vm_exec_core+13645>, 0x562980ec1032 <vm_exec_core+13666>, 0x562980ec1047 <vm_exec_core+13687>, 0x562980ec105c <vm_exec_core+13708>, 0x562980ec1071 <vm_exec_core+13729>, 0x562980ec1086 <vm_exec_core+13750>, 0x562980ec109b <vm_exec_core+13771>, 0x562980ec10b7 <vm_exec_core+13799>, 0x562980ec10cc <vm_exec_core+13820>, 0x562980ec10e1 <vm_exec_core+13841>, 0x562980ec10f6 <vm_exec_core+13862>, 0x562980ec0cdd <vm_exec_core+12813>, 0x562980ec0cf2 <vm_exec_core+12834>, 0x562980ec0d07 <vm_exec_core+12855>, 0x562980ec0d1c <vm_exec_core+12876>, 0x562980ec0d31 <vm_exec_core+12897>, 0x562980ebe14f <vm_exec_core+1663>, 0x562980ebe0ea <vm_exec_core+1562>, 0x562980ec0d46 <vm_exec_core+12918>, 0x562980ec0d5b <vm_exec_core+12939>, 0x562980ec0d70 <vm_exec_core+12960>, 0x562980ec0d85 <vm_exec_core+12981>, 0x562980ebdb12 <vm_exec_core+66>, 0x562980ebdb16 <vm_exec_core+70>, 0x562980ebe073 <vm_exec_core+1443>...}
#23 0x0000562980eadece in rb_vm_exec (ec=0x7f9fb8001900) at /tmp/ruby/src/trunk-yjit/vm.c:2489
_ec = 0x7f9fb8001900
_tag = {tag = 36, retval = 4, buf = {0x5629831b1b30, 0x562980eaded8 <rb_vm_exec+408>, 0x0, 0x7f9ff5aaf6d0, 0x0}, prev = 0x7f9ff5aaf820, state = RUBY_TAG_NONE, lock_rec = 0}
state = <optimized out>
result = <optimized out>
#24 0x0000562980eb311a in vm_yield_with_cref (is_lambda=0, cref=0x0, kw_splat=0, argv=0x0, argc=0, ec=<optimized out>) at /tmp/ruby/src/trunk-yjit/vm.c:1637
No locals.
#25 vm_yield (kw_splat=0, argv=0x0, argc=0, ec=<optimized out>) at /tmp/ruby/src/trunk-yjit/vm.c:1645
No locals.
#26 rb_yield_0 (argv=0x0, argc=0) at /tmp/ruby/src/trunk-yjit/vm_eval.c:1366
No locals.
#27 rb_yield (val=<optimized out>, val@entry=36) at /tmp/ruby/src/trunk-yjit/vm_eval.c:1379
No locals.
#28 0x0000562980cbb2ec in rb_ensure (b_proc=0x562980eb3060 <rb_yield>, data1=36, e_proc=<optimized out>, data2=<optimized out>) at /tmp/ruby/src/trunk-yjit/eval.c:1003
_ec = 0x7f9fb8001900
_tag = {tag = 36, retval = 140323964591008, buf = {0x5629831b1b30, 0x562980cbb3c0 <rb_ensure+480>, 0x0, 0x7f9ff5aaf7c0, 0x0}, prev = 0x7f9ff5aafa70, state = RUBY_TAG_NONE, lock_rec = 0}
state = <optimized out>
result = 4
errinfo = <optimized out>
ec = 0x7f9fb8001900
ensure_list = {next = 0x0, entry = {marker = 0, e_proc = 0x562980e593b0 <rb_mutex_unlock>, data2 = 140324987079200}}
#29 0x0000562980e9f41c in vm_call_cfunc_with_frame_ (stack_bottom=<optimized out>, argv=<optimized out>, argc=0, calling=<optimized out>, reg_cfp=0x7f9fb8101ba0, ec=0x7f9fb8001900) at /tmp/ruby/src/trunk-yjit/vm_insnhelper.c:3492
ci = 0x66f100000001
cc = <optimized out>
val = <optimized out>
me = 0x7f9ff8e58e50
cfunc = 0x5629831b1b38
recv = <optimized out>
frame_type = <optimized out>
len = <optimized out>
block_handler = <optimized out>
ci = <optimized out>
cc = <optimized out>
val = <optimized out>
me = <optimized out>
cfunc = <optimized out>
recv = <optimized out>
block_handler = <optimized out>
frame_type = <optimized out>
len = <optimized out>
args = <optimized out>
flag_arg_ = <optimized out>
hooks_arg_ = <optimized out>
flag_arg_ = <optimized out>
hooks_arg_ = <optimized out>
args = <optimized out>
#30 vm_call_cfunc_with_frame (ec=0x7f9fb8001900, reg_cfp=0x7f9fb8101ba0, calling=<optimized out>) at /tmp/ruby/src/trunk-yjit/vm_insnhelper.c:3520
argc = 0
stack_bottom = <optimized out>
argv = <optimized out>
#31 0x0000562980ebe65b in vm_sendish (method_explorer=<optimized out>, block_handler=<optimized out>, cd=<optimized out>, reg_cfp=<optimized out>, ec=<optimized out>) at /tmp/ruby/src/trunk-yjit/vm_callinfo.h:410
val = 140325032070880
ci = 0x7f9fb8001bc4
cc = <optimized out>
recv = 0
argc = <optimized out>
calling = {cd = 0x7f9ff7b08ee0, cc = 0x7f9ff731d028, block_handler = 140323964591033, recv = 140324987079200, argc = 0, kw_splat = false, heap_argv = 0}
val = <optimized out>
ci = <optimized out>
cc = <optimized out>
argc = <optimized out>
recv = <optimized out>
calling = <optimized out>
#32 vm_exec_core (ec=0x7f9fb8001bc4) at ../../src/trunk-yjit/insns.def:842
bh = 18446744073709551100
cd = 0x7f9ff7b08ee0
blockiseq = 0x0
leaf = <optimized out>
val = 140325032070880
reg_pc = 0x7f9ff7707fc0
reg_cfp = 0x7f9fb8101ba0
insns_address_table = {0x562980ebfd05 <vm_exec_core+8757>, 0x562980ebfc99 <vm_exec_core+8649>, 0x562980ebfc24 <vm_exec_core+8532>, 0x562980ebfba8 <vm_exec_core+8408>, 0x562980ebfee0 <vm_exec_core+9232>, 0x562980ebfe5e <vm_exec_core+9102>, 0x562980ebfd91 <vm_exec_core+8897>, 0x562980ebfd2e <vm_exec_core+8798>, 0x562980ebffb0 <vm_exec_core+9440>, 0x562980ebff5c <vm_exec_core+9356>, 0x562980ebf9dd <vm_exec_core+7949>, 0x562980ebf7e8 <vm_exec_core+7448>, 0x562980ebf79d <vm_exec_core+7373>, 0x562980ebf732 <vm_exec_core+7266>, 0x562980ebf6d2 <vm_exec_core+7170>, 0x562980ebf68e <vm_exec_core+7102>, 0x562980ebf64f <vm_exec_core+7039>, 0x562980ebf613 <vm_exec_core+6979>, 0x562980ebf5d7 <vm_exec_core+6919>, 0x562980ebf59b <vm_exec_core+6859>, 0x562980ebf502 <vm_exec_core+6706>, 0x562980ebf4ba <vm_exec_core+6634>, 0x562980ebf45b <vm_exec_core+6539>, 0x562980ebf40e <vm_exec_core+6462>, 0x562980ebf388 <vm_exec_core+6328>, 0x562980ebf347 <vm_exec_core+6263>, 0x562980ebf2e4 <vm_exec_core+6164>, 0x562980ebf266 <vm_exec_core+6038>, 0x562980ebf222 <vm_exec_core+5970>, 0x562980ebf1de <vm_exec_core+5902>, 0x562980ebf045 <vm_exec_core+5493>, 0x562980ebefb5 <vm_exec_core+5349>, 0x562980ebef50 <vm_exec_core+5248>, 0x562980ebeef1 <vm_exec_core+5153>, 0x562980ebee92 <vm_exec_core+5058>, 0x562980ebee40 <vm_exec_core+4976>, 0x562980ebede3 <vm_exec_core+4883>, 0x562980ebed92 <vm_exec_core+4802>, 0x562980ebed64 <vm_exec_core+4756>, 0x562980ebed22 <vm_exec_core+4690>, 0x562980ebecca <vm_exec_core+4602>, 0x562980ebec8f <vm_exec_core+4543>, 0x562980ebeb98 <vm_exec_core+4296>, 0x562980ebeb4e <vm_exec_core+4222>, 0x562980ebeb03 <vm_exec_core+4147>, 0x562980ebeace <vm_exec_core+4094>, 0x562980ebea59 <vm_exec_core+3977>, 0x562980ebe9f0 <vm_exec_core+3872>, 0x562980ebe99b <vm_exec_core+3787>, 0x562980ebe925 <vm_exec_core+3669>, 0x562980ebe888 <vm_exec_core+3512>, 0x562980ebe718 <vm_exec_core+3144>, 0x562980ebe6d6 <vm_exec_core+3078>, 0x562980ebe689 <vm_exec_core+3001>, 0x562980ebe530 <vm_exec_core+2656>, 0x562980ebdb30 <vm_exec_core+96>, 0x562980ebe4b0 <vm_exec_core+2528>, 0x562980ebe45a <vm_exec_core+2442>, 0x562980ec0c8d <vm_exec_core+12733>, 0x562980ebe404 <vm_exec_core+2356>, 0x562980ebe33d <vm_exec_core+2157>, 0x562980ec0310 <vm_exec_core+10304>, 0x562980ec017f <vm_exec_core+9903>, 0x562980ec00bd <vm_exec_core+9709>, 0x562980ec0730 <vm_exec_core+11360>, 0x562980ec0405 <vm_exec_core+10549>, 0x562980ec02aa <vm_exec_core+10202>, 0x562980ec0057 <vm_exec_core+9607>, 0x562980ec0014 <vm_exec_core+9540>, 0x562980ebe27d <vm_exec_core+1965>, 0x562980ebe1d3 <vm_exec_core+1795>, 0x562980ec1534 <vm_exec_core+14948>, 0x562980ec1469 <vm_exec_core+14745>, 0x562980ec129a <vm_exec_core+14282>, 0x562980ec1338 <vm_exec_core+14440>, 0x562980ec1393 <vm_exec_core+14531>, 0x562980ec14d3 <vm_exec_core+14851>, 0x562980ec0d9a <vm_exec_core+13002>, 0x562980ec0e20 <vm_exec_core+13136>, 0x562980ec0e84 <vm_exec_core+13236>, 0x562980ec0ee8 <vm_exec_core+13336>, 0x562980ec0f4c <vm_exec_core+13436>, 0x562980ec0fb0 <vm_exec_core+13536>, 0x562980ec1708 <vm_exec_core+15416>, 0x562980ec15a1 <vm_exec_core+15057>, 0x562980ec1697 <vm_exec_core+15303>, 0x562980ec110b <vm_exec_core+13883>, 0x562980ebe15f <vm_exec_core+1679>, 0x562980ebe0fa <vm_exec_core+1578>, 0x562980ec15fc <vm_exec_core+15148>, 0x562980ec142c <vm_exec_core+14684>, 0x562980ec175c <vm_exec_core+15500>, 0x562980ec1639 <vm_exec_core+15209>, 0x562980ec1197 <vm_exec_core+14023>, 0x562980ec120c <vm_exec_core+14140>, 0x562980ebe083 <vm_exec_core+1459>, 0x562980ebe002 <vm_exec_core+1330>, 0x562980ebdf4b <vm_exec_core+1147>, 0x562980ebdefd <vm_exec_core+1069>, 0x562980ebdeab <vm_exec_core+987>, 0x562980ebde5b <vm_exec_core+907>, 0x562980ebde03 <vm_exec_core+819>, 0x562980ebddc7 <vm_exec_core+759>, 0x562980ebdd8b <vm_exec_core+699>, 0x562980ebfcf5 <vm_exec_core+8741>, 0x562980ebfc89 <vm_exec_core+8633>, 0x562980ebfc14 <vm_exec_core+8516>, 0x562980ebfb98 <vm_exec_core+8392>, 0x562980ebfed0 <vm_exec_core+9216>, 0x562980ebfe4e <vm_exec_core+9086>, 0x562980ebfd81 <vm_exec_core+8881>, 0x562980ebfd1e <vm_exec_core+8782>, 0x562980ebffa0 <vm_exec_core+9424>, 0x562980ebff4c <vm_exec_core+9340>, 0x562980ebf9cd <vm_exec_core+7933>, 0x562980ebf7d8 <vm_exec_core+7432>, 0x562980ebf78d <vm_exec_core+7357>, 0x562980ebf722 <vm_exec_core+7250>, 0x562980ebf6c2 <vm_exec_core+7154>, 0x562980ebf67e <vm_exec_core+7086>, 0x562980ebf63f <vm_exec_core+7023>, 0x562980ebf603 <vm_exec_core+6963>, 0x562980ebf5c7 <vm_exec_core+6903>, 0x562980ebf58b <vm_exec_core+6843>, 0x562980ebf4f2 <vm_exec_core+6690>, 0x562980ebf4aa <vm_exec_core+6618>, 0x562980ebf44b <vm_exec_core+6523>, 0x562980ebf3fe <vm_exec_core+6446>, 0x562980ebf378 <vm_exec_core+6312>, 0x562980ebf337 <vm_exec_core+6247>, 0x562980ebf2d4 <vm_exec_core+6148>, 0x562980ebf256 <vm_exec_core+6022>, 0x562980ebf212 <vm_exec_core+5954>, 0x562980ebf1ce <vm_exec_core+5886>, 0x562980ebf035 <vm_exec_core+5477>, 0x562980ebefa5 <vm_exec_core+5333>, 0x562980ebef40 <vm_exec_core+5232>, 0x562980ebeee1 <vm_exec_core+5137>, 0x562980ebee82 <vm_exec_core+5042>, 0x562980ebee30 <vm_exec_core+4960>, 0x562980ebedd3 <vm_exec_core+4867>, 0x562980ebed82 <vm_exec_core+4786>, 0x562980ebed54 <vm_exec_core+4740>, 0x562980ebed12 <vm_exec_core+4674>, 0x562980ebecba <vm_exec_core+4586>, 0x562980ebec7f <vm_exec_core+4527>, 0x562980ebeb88 <vm_exec_core+4280>, 0x562980ebeb3e <vm_exec_core+4206>, 0x562980ebeaf3 <vm_exec_core+4131>, 0x562980ebeabe <vm_exec_core+4078>, 0x562980ebea49 <vm_exec_core+3961>, 0x562980ebe9e0 <vm_exec_core+3856>, 0x562980ebe98b <vm_exec_core+3771>, 0x562980ebe915 <vm_exec_core+3653>, 0x562980ebe878 <vm_exec_core+3496>, 0x562980ebe708 <vm_exec_core+3128>, 0x562980ebe6c6 <vm_exec_core+3062>, 0x562980ebe679 <vm_exec_core+2985>, 0x562980ebe520 <vm_exec_core+2640>, 0x562980ec0ff3 <vm_exec_core+13603>, 0x562980ebe4a0 <vm_exec_core+2512>, 0x562980ebe44a <vm_exec_core+2426>, 0x562980ec1008 <vm_exec_core+13624>, 0x562980ebe3f4 <vm_exec_core+2340>, 0x562980ebe32d <vm_exec_core+2141>, 0x562980ec0300 <vm_exec_core+10288>, 0x562980ec016f <vm_exec_core+9887>, 0x562980ec00ad <vm_exec_core+9693>, 0x562980ec0720 <vm_exec_core+11344>, 0x562980ec03f5 <vm_exec_core+10533>, 0x562980ec029a <vm_exec_core+10186>, 0x562980ec0047 <vm_exec_core+9591>, 0x562980ec0004 <vm_exec_core+9524>, 0x562980ebe26d <vm_exec_core+1949>, 0x562980ebe1c3 <vm_exec_core+1779>, 0x562980ec101d <vm_exec_core+13645>, 0x562980ec1032 <vm_exec_core+13666>, 0x562980ec1047 <vm_exec_core+13687>, 0x562980ec105c <vm_exec_core+13708>, 0x562980ec1071 <vm_exec_core+13729>, 0x562980ec1086 <vm_exec_core+13750>, 0x562980ec109b <vm_exec_core+13771>, 0x562980ec10b7 <vm_exec_core+13799>, 0x562980ec10cc <vm_exec_core+13820>, 0x562980ec10e1 <vm_exec_core+13841>, 0x562980ec10f6 <vm_exec_core+13862>, 0x562980ec0cdd <vm_exec_core+12813>, 0x562980ec0cf2 <vm_exec_core+12834>, 0x562980ec0d07 <vm_exec_core+12855>, 0x562980ec0d1c <vm_exec_core+12876>, 0x562980ec0d31 <vm_exec_core+12897>, 0x562980ebe14f <vm_exec_core+1663>, 0x562980ebe0ea <vm_exec_core+1562>, 0x562980ec0d46 <vm_exec_core+12918>, 0x562980ec0d5b <vm_exec_core+12939>, 0x562980ec0d70 <vm_exec_core+12960>, 0x562980ec0d85 <vm_exec_core+12981>, 0x562980ebdb12 <vm_exec_core+66>, 0x562980ebdb16 <vm_exec_core+70>, 0x562980ebe073 <vm_exec_core+1443>...}
#33 0x0000562980eadece in rb_vm_exec (ec=0x7f9fb8001900) at /tmp/ruby/src/trunk-yjit/vm.c:2489
_ec = 0x7f9fb8001900
_tag = {tag = 36, retval = 4, buf = {0x7f9ff5aafb70, 0x562980eaded8 <rb_vm_exec+408>, 0x0, 0x7f9ff5aafa50, 0x3000000028}, prev = 0x7f9ff5aafc70, state = RUBY_TAG_NONE, lock_rec = 0}
state = <optimized out>
result = <optimized out>
#34 0x0000562980eb3358 in invoke_block (captured=<optimized out>, captured=<optimized out>, opt_pc=<optimized out>, type=<optimized out>, cref=0x0, self=<optimized out>, iseq=0x7f9ff5025688, ec=<optimized out>) at /tmp/ruby/src/trunk-yjit/vm.c:1512
arg_size = <optimized out>
arg_size = <optimized out>
#35 0x0000562980eb36ff in rb_vm_invoke_proc (ec=<optimized out>, proc=proc@entry=0x7f9fb8001b40, argc=argc@entry=0, argv=argv@entry=0x7f9ff5aafb20, kw_splat=<optimized out>, passed_block_handler=passed_block_handler@entry=0) at /tmp/ruby/src/trunk-yjit/vm.c:1731
self = <optimized out>
#36 0x0000562980e5f3af in thread_do_start_proc (th=0x7f9fb80016e0) at /tmp/ruby/src/trunk-yjit/thread.c:595
args = 140325476368640
args_ptr = 0x7f9ff5aafb20
args_len = 0
procval = <optimized out>
proc = 0x7f9fb8001b40
#37 0x0000562980e60ff2 in thread_do_start (th=0x7f9fb80016e0) at /tmp/ruby/src/trunk-yjit/thread.c:614
result = 36
result = <optimized out>
flag_arg_ = <optimized out>
hooks_arg_ = <optimized out>
flag_arg_ = <optimized out>
hooks_arg_ = <optimized out>
#38 thread_start_func_2 (th=0x7f9fb80016e0, stack_start=<optimized out>) at /tmp/ruby/src/trunk-yjit/thread.c:668
_ec = 0x7f9fb8001900
_tag = {tag = 36, retval = 140325478502316, buf = {0x7f9fb80016e0, 0x562980e60f30 <thread_start_func_2+560>, 0x0, 0x7f9ff5aafb80, 0x562983173ad0}, prev = 0x0, state = RUBY_TAG_NONE, lock_rec = 0}
state = <optimized out>
errinfo = 4
ractor_main_th = 0x562983172810
#39 0x0000562980e61c40 in call_thread_start_func_2 (th=0x7f9fb80016e0) at /tmp/ruby/src/trunk-yjit/thread_pthread.c:2210
stack_start = 0
stack_start_addr = 0x7f9ff5aafd38
stack_start = <optimized out>
stack_start_addr = <optimized out>
#40 nt_start (ptr=0x7f9fb8001b70) at /tmp/ruby/src/trunk-yjit/thread_pthread.c:2255
th = 0x7f9fb80016e0
sched = <optimized out>
nt = <optimized out>
vm = <optimized out>
#41 0x00007fa0124c7b43 in start_thread (arg=<optimized out>) at ./nptl/pthread_create.c:442
ret = <optimized out>
pd = <optimized out>
out = <optimized out>
unwind_buf = {cancel_jmp_buf = {{jmp_buf = {140324971196368, 4895737542057021623, 140324998153792, 0, 140325478496336, 140324971196720, -4841708184981057353, -4850091183867146057}, mask_was_saved = 0}}, priv = {pad = {0x0, 0x0, 0x0, 0x0}, data = {prev = 0x0, cleanup = 0x0, canceltype = 0}}}
not_first_call = <optimized out>
#42 0x00007fa012558bb4 in clone () at ../sysdeps/unix/sysv/linux/x86_64/clone.S:100
No locals.
Thread 3 (Thread 0x7f9ff5fb8640 (LWP 1073826)):
#0 __futex_abstimed_wait_common64 (private=0, cancel=true, abstime=0x0, op=393, expected=0, futex_word=0x7f9ff4888cc0) at ./nptl/futex-internal.c:57
sc_cancel_oldtype = 0
sc_ret = <optimized out>
resultvar = <optimized out>
__arg6 = <optimized out>
__arg5 = <optimized out>
__arg4 = <optimized out>
__arg3 = <optimized out>
__arg2 = <optimized out>
__arg1 = <optimized out>
_a6 = <optimized out>
_a5 = <optimized out>
_a4 = <optimized out>
_a3 = <optimized out>
_a2 = <optimized out>
_a1 = <optimized out>
#1 __futex_abstimed_wait_common (cancel=true, private=0, abstime=0x0, clockid=0, expected=0, futex_word=0x7f9ff4888cc0) at ./nptl/futex-internal.c:87
err = <optimized out>
clockbit = 256
op = 393
err = <optimized out>
clockbit = <optimized out>
op = <optimized out>
#2 __GI___futex_abstimed_wait_cancelable64 (futex_word=futex_word@entry=0x7f9ff4888cc0, expected=expected@entry=0, clockid=clockid@entry=0, abstime=abstime@entry=0x0, private=private@entry=0) at ./nptl/futex-internal.c:139
No locals.
#3 0x00007fa0124c6ac1 in __pthread_cond_wait_common (abstime=0x0, clockid=0, mutex=0x562983173ad0, cond=0x7f9ff4888c98) at ./nptl/pthread_cond_wait.c:503
spin = 0
buffer = {__routine = 0x7fa0124c67a0 <__condvar_cleanup_waiting>, __arg = 0x7f9ff5fb7670, __canceltype = -168069264, __prev = 0x0}
cbuffer = {wseq = 52, cond = 0x7f9ff4888c98, mutex = 0x562983173ad0, private = 0}
err = <optimized out>
g = 0
flags = <optimized out>
g1_start = <optimized out>
maxspin = 0
signals = <optimized out>
result = 0
wseq = 52
seq = 26
private = 0
maxspin = <optimized out>
err = <optimized out>
result = <optimized out>
wseq = <optimized out>
g = <optimized out>
seq = <optimized out>
flags = <optimized out>
private = <optimized out>
signals = <optimized out>
done = <optimized out>
g1_start = <optimized out>
spin = <optimized out>
buffer = <optimized out>
cbuffer = <optimized out>
s = <optimized out>
#4 ___pthread_cond_wait (cond=0x7f9ff4888c98, mutex=mutex@entry=0x562983173ad0) at ./nptl/pthread_cond_wait.c:627
No locals.
#5 0x0000562980e5acb2 in rb_native_cond_wait (mutex=0x562983173ad0, cond=<optimized out>) at /tmp/ruby/src/trunk-yjit/thread_pthread.c:222
r = <optimized out>
r = <optimized out>
#6 thread_sched_wait_running_turn (sched=sched@entry=0x562983173ad0, th=th@entry=0x7f9ff4888a80, can_direct_transfer=can_direct_transfer@entry=false) at /tmp/ruby/src/trunk-yjit/thread_pthread.c:860
next_th = <optimized out>
#7 0x0000562980e5d117 in thread_sched_to_running_common (th=0x7f9ff4888a80, sched=0x562983173ad0) at /tmp/ruby/src/trunk-yjit/thread_pthread.c:936
No locals.
#8 thread_sched_to_running (sched=sched@entry=0x562983173ad0, th=th@entry=0x7f9ff4888a80) at /tmp/ruby/src/trunk-yjit/thread_pthread.c:950
No locals.
#9 0x0000562980e64601 in blocking_region_end (region=0x7f9ff5fb7798, th=0x7f9ff4888a80) at /tmp/ruby/src/trunk-yjit/thread.c:1491
No locals.
#10 rb_thread_io_blocking_call (func=0x562980cfd410 <internal_read_func>, data1=0x7f9ff5fb79a0, fd=7, events=1) at /tmp/ruby/src/trunk-yjit/thread.c:1781
__region = {prev_status = THREAD_RUNNABLE}
_ec = 0x7f9ff7146210
_tag = {tag = 36, retval = 3435870238867627222, buf = {0x7f9ff4a415f0, 0x562980e64760 <rb_thread_io_blocking_call+1008>, 0x0, 0x7f9ff5fb7730, 0x2}, prev = 0x7f9ff5fb78d0, state = RUBY_TAG_NONE, lock_rec = 0}
ec = 0x7f9ff7146210
th = 0x7f9ff4888a80
waiting_fd = {wfd_node = {next = 0x562983170488, prev = 0x562983170488}, th = 0x7f9ff4888a80, fd = 7, busy = 0x0}
val = 1
saved_errno = 11
state = <optimized out>
prev_mn_schedulable = false
retry = <optimized out>
#11 0x0000562980cbb2ec in rb_ensure (b_proc=0x562980cfe750 <io_read_memory_call>, data1=140325003426208, e_proc=<optimized out>, data2=<optimized out>) at /tmp/ruby/src/trunk-yjit/eval.c:1003
_ec = 0x7f9ff7146210
_tag = {tag = 36, retval = 140323828811280, buf = {0x7f9ff4a415f0, 0x562980cbb3c0 <rb_ensure+480>, 0x0, 0x7f9ff5fb7870, 0x400}, prev = 0x7f9ff5fb7a70, state = RUBY_TAG_NONE, lock_rec = 0}
state = <optimized out>
result = 4
errinfo = <optimized out>
ec = 0x7f9ff7146210
ensure_list = {next = 0x0, entry = {marker = 0, e_proc = 0x562980e28150 <rb_str_unlocktmp>, data2 = 140323828811280}}
#12 0x0000562980d14fdd in io_read_memory_locktmp (iis=0x7f9ff5fb79a0, str=<optimized out>) at /tmp/ruby/src/trunk-yjit/io.c:3429
No locals.
#13 io_getpartial (argc=<optimized out>, argv=<optimized out>, io=<optimized out>, no_exception=no_exception@entry=4, nonblock=nonblock@entry=0) at /tmp/ruby/src/trunk-yjit/io.c:3475
fptr = 0x7f9ff4a415f0
length = <optimized out>
str = 140323828811280
n = <optimized out>
len = 1024
iis = {th = 140324970660680, fptr = 0x7f9ff4a415f0, nonblock = 0, fd = 7, buf = 0x7f9fe8006420, capa = 1024, timeout = 0x0}
shrinkable = 1
__func__ = "io_getpartial"
#14 0x0000562980d15565 in io_readpartial (argc=<optimized out>, argv=<optimized out>, io=<optimized out>) at /tmp/ruby/src/trunk-yjit/io.c:3595
ret = <optimized out>
#15 0x0000562983536792 in ?? ()
No symbol table info available.
#16 0x00007f9ff4888a80 in ?? ()
No symbol table info available.
#17 0x00007f9ff4a2b880 in ?? ()
No symbol table info available.
#18 0x00007f9ff4078320 in ?? ()
No symbol table info available.
#19 0x0000562980eade19 in jit_exec_exception (ec=<optimized out>) at /tmp/ruby/src/trunk-yjit/vm.c:506
func = <optimized out>
func = <optimized out>
#20 vm_exec_loop (result=<optimized out>, tag=<optimized out>, state=<optimized out>, ec=<optimized out>) at /tmp/ruby/src/trunk-yjit/vm.c:2515
vm_loop_start = <optimized out>
vm_loop_start = <optimized out>
#21 rb_vm_exec (ec=0x7f9ff7146210) at /tmp/ruby/src/trunk-yjit/vm.c:2492
_ec = 0x7f9ff7146210
_tag = {tag = 36, retval = 4, buf = {0x7f9ff5fb7b70, 0x562980eaded8 <rb_vm_exec+408>, 0x0, 0x7f9ff5fb7a50, 0x3000000028}, prev = 0x7f9ff5fb7c70, state = RUBY_TAG_NONE, lock_rec = 0}
state = <optimized out>
result = <optimized out>
#22 0x0000562980eb3358 in invoke_block (captured=<optimized out>, captured=<optimized out>, opt_pc=<optimized out>, type=<optimized out>, cref=0x0, self=<optimized out>, iseq=0x7f9ff6d2efb0, ec=<optimized out>) at /tmp/ruby/src/trunk-yjit/vm.c:1512
arg_size = <optimized out>
arg_size = <optimized out>
#23 0x0000562980eb36ff in rb_vm_invoke_proc (ec=<optimized out>, proc=proc@entry=0x7f9ff4a2b880, argc=argc@entry=0, argv=argv@entry=0x7f9ff5fb7b20, kw_splat=<optimized out>, passed_block_handler=passed_block_handler@entry=0) at /tmp/ruby/src/trunk-yjit/vm.c:1731
self = <optimized out>
#24 0x0000562980e5f3af in thread_do_start_proc (th=0x7f9ff4888a80) at /tmp/ruby/src/trunk-yjit/thread.c:595
args = 140324970660640
args_ptr = 0x7f9ff5fb7b20
args_len = 0
procval = <optimized out>
proc = 0x7f9ff4a2b880
#25 0x0000562980e60ff2 in thread_do_start (th=0x7f9ff4888a80) at /tmp/ruby/src/trunk-yjit/thread.c:614
result = 36
result = <optimized out>
flag_arg_ = <optimized out>
hooks_arg_ = <optimized out>
flag_arg_ = <optimized out>
hooks_arg_ = <optimized out>
#26 thread_start_func_2 (th=0x7f9ff4888a80, stack_start=<optimized out>) at /tmp/ruby/src/trunk-yjit/thread.c:668
_ec = 0x7f9ff7146210
_tag = {tag = 36, retval = 140325478502316, buf = {0x7f9ff4888a80, 0x562980e60f30 <thread_start_func_2+560>, 0x0, 0x7f9ff5fb7b80, 0x562983170340}, prev = 0x0, state = RUBY_TAG_NONE, lock_rec = 0}
state = <optimized out>
errinfo = 4
ractor_main_th = 0x562983172810
#27 0x0000562980e61c40 in call_thread_start_func_2 (th=0x7f9ff4888a80) at /tmp/ruby/src/trunk-yjit/thread_pthread.c:2210
stack_start = 0
stack_start_addr = 0x7f9ff5fb7d38
stack_start = <optimized out>
stack_start_addr = <optimized out>
#28 nt_start (ptr=0x7f9ff4888c70) at /tmp/ruby/src/trunk-yjit/thread_pthread.c:2255
th = 0x7f9ff4888a80
sched = <optimized out>
nt = <optimized out>
vm = <optimized out>
#29 0x00007fa0124c7b43 in start_thread (arg=<optimized out>) at ./nptl/pthread_create.c:442
ret = <optimized out>
pd = <optimized out>
out = <optimized out>
unwind_buf = {cancel_jmp_buf = {{jmp_buf = {140727108130896, 4895737542057021623, 140325003429440, 25, 140325478496336, 140727108131248, -4841707502081257289, -4850091183867146057}, mask_was_saved = 0}}, priv = {pad = {0x0, 0x0, 0x0, 0x0}, data = {prev = 0x0, cleanup = 0x0, canceltype = 0}}}
not_first_call = <optimized out>
#30 0x00007fa012558bb4 in clone () at ../sysdeps/unix/sysv/linux/x86_64/clone.S:100
No locals.
Thread 2 (Thread 0x7f9ff8e4f640 (LWP 1072840)):
#0 0x00007fa012558fde in epoll_wait (epfd=4, events=events@entry=0x56298127021c <timer_th+28>, maxevents=maxevents@entry=16, timeout=10) at ../sysdeps/unix/sysv/linux/epoll_wait.c:30
sc_ret = -4
sc_cancel_oldtype = 0
sc_ret = <optimized out>
#1 0x0000562980e624f6 in event_wait (vm=0x5629831702a0) at /tmp/ruby/src/trunk-yjit/thread_pthread.c:2897
r = <optimized out>
r = <optimized out>
#2 timer_thread_polling (vm=0x5629831702a0) at /tmp/ruby/src/trunk-yjit/thread_pthread_mn.c:874
r = <optimized out>
r = <optimized out>
i = <optimized out>
th = <optimized out>
events = <optimized out>
#3 timer_thread_func (ptr=<optimized out>) at /tmp/ruby/src/trunk-yjit/thread_pthread.c:3024
vm = <optimized out>
#4 0x00007fa0124c7b43 in start_thread (arg=<optimized out>) at ./nptl/pthread_create.c:442
ret = <optimized out>
pd = <optimized out>
out = <optimized out>
unwind_buf = {cancel_jmp_buf = {{jmp_buf = {140727108129920, 4895737542057021623, 140325052282432, 0, 140325478496336, 140727108130272, -4841696623465967433, -4850091183867146057}, mask_was_saved = 0}}, priv = {pad = {0x0, 0x0, 0x0, 0x0}, data = {prev = 0x0, cleanup = 0x0, canceltype = 0}}}
not_first_call = <optimized out>
#5 0x00007fa012558bb4 in clone () at ../sysdeps/unix/sysv/linux/x86_64/clone.S:100
No locals.
Thread 1 (Thread 0x7fa0124307c0 (LWP 1069476)):
#0 __pthread_kill_implementation (no_tid=0, signo=6, threadid=140325477877696) at ./nptl/pthread_kill.c:44
tid = <optimized out>
ret = 0
pd = 0x7fa0124307c0
old_mask = {__val = {140727108129104, 0, 140324972422960, 140325478565075, 0, 140325478461421, 140325477877696, 140325480076800, 140324983213360, 140325478407591, 13, 140325480093344, 140324983213360, 94736256652375, 94736292971168, 139640481403232}}
ret = <optimized out>
pd = <optimized out>
old_mask = <optimized out>
ret = <optimized out>
tid = <optimized out>
ret = <optimized out>
resultvar = <optimized out>
resultvar = <optimized out>
__arg3 = <optimized out>
__arg2 = <optimized out>
__arg1 = <optimized out>
_a3 = <optimized out>
_a2 = <optimized out>
_a1 = <optimized out>
__futex = <optimized out>
resultvar = <optimized out>
__arg3 = <optimized out>
__arg2 = <optimized out>
__arg1 = <optimized out>
_a3 = <optimized out>
_a2 = <optimized out>
_a1 = <optimized out>
__futex = <optimized out>
__private = <optimized out>
__oldval = <optimized out>
result = <optimized out>
#1 __pthread_kill_internal (signo=6, threadid=140325477877696) at ./nptl/pthread_kill.c:78
No locals.
#2 __GI___pthread_kill (threadid=140325477877696, signo=signo@entry=6) at ./nptl/pthread_kill.c:89
No locals.
#3 0x00007fa012475476 in __GI_raise (sig=sig@entry=6) at ../sysdeps/posix/raise.c:26
ret = <optimized out>
#4 0x00007fa01245b7f3 in __GI_abort () at ./stdlib/abort.c:79
save_stage = 1
act = {__sigaction_handler = {sa_handler = 0x3031303666666666, sa_sigaction = 0x3031303666666666}, sa_mask = {__val = {2337500342031233072, 3472328296227680304, 3467824696768081952, 2314885530818453536, 2314885530818453536, 140727108129504, 2548586567943704064, 140325477870960, 94736260530656, 0, 140325480093344, 140727108129504, 140727108129792, 140727108129952, 94736258541254, 18446744069414584487}}, sa_flags = 94227968, sa_restorer = 0x562980f5a7c0 <std::sys_common::backtrace::_print::{impl#0}::fmt>}
sigs = {__val = {32, 2314885530818453536, 6733551554292031520, 3834033761153333002, 7365405400577893176, 3487255287645693030, 2337500343188860976, 3472328296227680304, 3467824696768081952, 2314885530818453536, 2314885530818453536, 2314885530818453536, 6732726843261788192, 7378697629483820554, 3472328296331896422, 7378697629483806000}}
#5 0x0000562980cb4938 in die () at /tmp/ruby/src/trunk-yjit/error.c:1028
No locals.
#6 rb_bug (fmt=<optimized out>) at /tmp/ruby/src/trunk-yjit/error.c:1052
args = {{gp_offset = 8, fp_offset = 48, overflow_arg_area = 0x7ffd954a53c0, reg_save_area = 0x7ffd954a5300}}
#7 0x0000562980f8a478 in yjit::yjit::rb_bug_panic_hook::{closure#0} (panic_info=0x7ffd954a5400) at /tmp/ruby/src/trunk-yjit/yjit/src/yjit.rs:105
previous_hook = <optimized out>
#8 0x0000562980f48fb6 in std::panicking::rust_panic_with_hook (payload=..., message=..., location=<optimized out>, can_unwind=true) at library/std/src/panicking.rs:702
ptr = *mut (dyn core::ops::function::Fn<(&core::panic::panic_info::PanicInfo), Output=()> + core::marker::Send + core::marker::Sync) {pointer: 0x562983304df0, vtable: <synthetic pointer>}
_guard = <optimized out>
info = core::panic::panic_info::PanicInfo {payload: &(dyn core::any::Any + core::marker::Send) {pointer: 0x7ffd954a54a8, vtable: 0x562981263208}, message: core::option::Option<&core::fmt::Arguments>::Some(0x7ffd954a55a0), location: 0x562981268298, can_unwind: true}
panics = 1
must_abort = <optimized out>
#9 0x0000562980f5ada4 in std::panicking::begin_panic_handler::{closure#0} () at library/std/src/panicking.rs:588
msg = <optimized out>
info = <optimized out>
loc = <optimized out>
#10 0x0000562980f5aaa4 in std::sys_common::backtrace::__rust_end_short_backtrace<std::panicking::begin_panic_handler::{closure_env#0}, !> (f=...) at library/std/src/sys_common/backtrace.rs:138
No locals.
#11 0x0000562980f48bf2 in std::panicking::begin_panic_handler (info=<optimized out>) at library/std/src/panicking.rs:584
msg = 0x0
loc = <optimized out>
#12 0x0000562980cade93 in core::panicking::panic_fmt (fmt=...) at library/core/src/panicking.rs:142
pi = core::panic::panic_info::PanicInfo {payload: &(dyn core::any::Any + core::marker::Send) {pointer: 0x56298110bc68, vtable: 0x562981261570}, message: core::option::Option<&core::fmt::Arguments>::Some(0x7ffd954a55a0), location: 0x562981268298, can_unwind: true}
#13 0x0000562980f249fe in core::panicking::assert_failed_inner (kind=<optimized out>, left=..., right=..., args=<error reading variable: Cannot access memory at address 0x1>) at library/core/src/fmt/mod.rs:398
op = "=="
#14 0x0000562980cb018b in core::panicking::assert_failed<*const yjit::cruby::rb_iseq_t, *const yjit::cruby::rb_iseq_t> (kind=(unknown: 0xa4), left=0x7ffd954a56f0, right=0x7ffd954a56c0, args=...) at /build/rustc-Oic09u/rustc-1.65.0+dfsg0ubuntu1/library/core/src/panicking.rs:181
No locals.
#15 0x0000562980fb6360 in yjit::core::branch_stub_hit_body (branch_ptr=0x7f9ff57605a0, target_idx=0, ec=0x562983173c60) at /tmp/ruby/src/trunk-yjit/yjit/src/core.rs:2751
reconned_sp = <optimized out>
reconned_sp = <optimized out>
reconned_pc = <optimized out>
running_iseq = 0x7f9ff7db44f0
original_interp_sp = 0x7fa01232f2b8
cfp = 0x7fa01242ed70
target_ctx = yjit::core::Context {stack_size: 4, sp_offset: 0, reg_temps: yjit::core::RegTemps (12), chain_depth_and_flags: 64, self_type: yjit::core::Type::Unknown, local_types: 0, temp_mapping_kind: 1, temp_payload: 144, inline_block: 0}
target_blockid = yjit::core::BlockId {iseq: 0x7f9ff407e748, idx: 10}
ocb = <optimized out>
cb = <optimized out>
target_branch_shape = yjit::core::BranchShape::Next0
target_idx = 0
housing_block = 0x7f9ff4f12550
branch_size_on_entry = 5
branch = 0x7f9ff57605a0
branch_ref = core::ptr::non_null::NonNull<yjit::core::Branch> {pointer: 0x7f9ff57605a0}
#16 0x0000562980fbb7a3 in yjit::core::branch_stub_hit::{closure#0}::{closure#0} () at /tmp/ruby/src/trunk-yjit/yjit/src/core.rs:2696
branch_ptr = <optimized out>
target_idx = <optimized out>
ec = <optimized out>
#17 yjit::stats::with_compile_time<yjit::core::branch_stub_hit::{closure#0}::{closure_env#0}, *const u8> (func=...) at /tmp/ruby/src/trunk-yjit/yjit/src/stats.rs:979
start = <optimized out>
#18 0x0000562980fca01c in yjit::core::branch_stub_hit::{closure#0} () at /tmp/ruby/src/trunk-yjit/yjit/src/core.rs:2696
branch_ptr = <optimized out>
target_idx = <optimized out>
ec = <optimized out>
#19 std::panicking::try::do_call<yjit::core::branch_stub_hit::{closure_env#0}, *const u8> (data=<optimized out>) at /build/rustc-Oic09u/rustc-1.65.0+dfsg0ubuntu1/library/std/src/panicking.rs:492
f = yjit::core::branch_stub_hit::{closure_env#0} {_ref__branch_ptr: <optimized out>, _ref__target_idx: <optimized out>, _ref__ec: 0x0}
data = <optimized out>
data = <optimized out>
f = <optimized out>
#20 std::panicking::try<*const u8, yjit::core::branch_stub_hit::{closure_env#0}> (f=...) at /build/rustc-Oic09u/rustc-1.65.0+dfsg0ubuntu1/library/std/src/panicking.rs:456
data = std::panicking::try::Data<yjit::core::branch_stub_hit::{closure_env#0}, *const u8> {f: core::mem::manually_drop::ManuallyDrop<yjit::core::branch_stub_hit::{closure_env#0}> {value: yjit::core::branch_stub_hit::{closure_env#0} {_ref__branch_ptr: <optimized out>, _ref__target_idx: <optimized out>, _ref__ec: 0x0}}, r: core::mem::manually_drop::ManuallyDrop<*const u8> {value: <optimized out>}, p: core::mem::manually_drop::ManuallyDrop<alloc::boxed::Box<(dyn core::any::Any + core::marker::Send), alloc::alloc::Global>> {value: alloc::boxed::Box<(dyn core::any::Any + core::marker::Send), alloc::alloc::Global> {pointer: <optimized out>, vtable: <optimized out>}}}
data = <optimized out>
data_ptr = <optimized out>
#21 std::panic::catch_unwind<yjit::core::branch_stub_hit::{closure_env#0}, *const u8> (f=...) at /build/rustc-Oic09u/rustc-1.65.0+dfsg0ubuntu1/library/std/src/panic.rs:137
No locals.
#22 yjit::cruby::with_vm_lock<yjit::core::branch_stub_hit::{closure_env#0}, *const u8> (loc=..., func=...) at /tmp/ruby/src/trunk-yjit/yjit/src/cruby.rs:647
recursive_lock_level = 0
line = 2695
file = 0x7f9ff711c770
#23 0x0000562980fb9c61 in yjit::core::branch_stub_hit () at /tmp/ruby/src/trunk-yjit/yjit/src/core.rs:2695
No locals.
#24 0x0000562983320033 in ?? ()
No symbol table info available.
#25 0x00007fa01232f308 in ?? ()
No symbol table info available.
#26 0x0000000000000000 in ?? ()
No symbol table info available.
>>> Dump Ruby level backtrace (if possible)