# Logfile created on 2023-12-23 08:49:53 +0000 by logger.rb/v1.4.3
#<BuildRuby:0x000055b95c172120 @REPOSITORY="https://github.com/ruby/ruby.git", @REPOSITORY_TYPE=:git, @git_branch=nil, @git_worktree=nil, @svn_revision=nil, @SRC_DIR="/tmp/ruby/src", @BUILD_DIR="/tmp/ruby/build", @INSTALL_DIR="/tmp/ruby/install", @TARGET_NAME="trunk-random2", @TARGET_SRC_DIR="/tmp/ruby/src/trunk-random2", @TARGET_BUILD_DIR="/tmp/ruby/build/trunk-random2", @TARGET_INSTALL_DIR="/tmp/ruby/install/trunk-random2", @configure_opts=["--enable-shared"], @build_opts="-j4", @btest_opts="-j4", @test_opts="TESTS=\"--test-order=random\"", @incremental=true, @steps=["checkout", "autoconf", "configure", "build_up", "build_miniruby", "build_ruby", "build_all", "build_install", "test_btest", "test_basic", "test_all", "test_rubyspec"], @quiet=false, @gist=false, @timeout=10800, @logfile="/home/ko1/ruby/logs/brlog.trunk-random2.20231223-084953", @ruby_env=[["RUBY_DEBUG", "ci"]], @make="make", @logger=#<Logger:0x000055b95c20b438 @level=0, @progname=nil, @default_formatter=#<Logger::Formatter:0x000055b95c20b2a8 @datetime_format=nil>, @formatter=nil, @logdev=#<Logger::LogDevice:0x000055b95c20b118 @shift_period_suffix="%Y%m%d", @shift_size=1048576, @shift_age=0, @filename="/home/ko1/ruby/logs/brlog.trunk-random2.20231223-084953", @dev=#<File:/home/ko1/ruby/logs/brlog.trunk-random2.20231223-084953>, @binmode=false, @mon_data=#<Monitor:0x000055b95c20b050>, @mon_data_owner_object_id=860>>>
$$$[beg] make update-unicode -j4
make: Nothing to be done for 'update-unicode'.
$$$[end] "make update-unicode -j4" exit with 0.
$$$[beg] make update-download -j4
tool/config.guess already exists
tool/config.sub already exists
$$$[end] "make update-download -j4" exit with 0.
$$$[beg] make update-rubyspec -j4
make: Nothing to be done for 'update-rubyspec'.
$$$[end] "make update-rubyspec -j4" exit with 0.
$$$[beg] make update-src -j4
Already up to date.
Latest commit hash = 40bc7ede38
$$$[end] "make update-src -j4" exit with 0.
$$$[beg] make after-update -j4
generating /tmp/ruby/src/trunk-random2/ext/ripper/eventids2table.c
make[1]: Entering directory '/tmp/ruby/src/trunk-random2/ext/ripper'
make[1]: Nothing to be done for 'src'.
make[1]: Leaving directory '/tmp/ruby/src/trunk-random2/ext/ripper'
/tmp/ruby/src/trunk-random2/revision.h updated
generating x86_64-linux-fake.rb
x86_64-linux-fake.rb updated
generating enc.mk
making srcs under enc
make[1]: Entering directory '/tmp/ruby/build/trunk-random2'
make[1]: Nothing to be done for 'srcs'.
make[1]: Leaving directory '/tmp/ruby/build/trunk-random2'
$$$[end] "make after-update -j4" exit with 0.
$$$[beg] make miniruby -j4
BASERUBY = /usr/bin/ruby --disable=gems
CC = gcc
LD = ld
LDSHARED = gcc -shared
CFLAGS = -O3 -fno-fast-math -ggdb3 -Wall -Wextra -Wdeprecated-declarations -Wdiv-by-zero -Wduplicated-cond -Wimplicit-function-declaration -Wimplicit-int -Wpointer-arith -Wwrite-strings -Wold-style-definition -Wimplicit-fallthrough=0 -Wmissing-noreturn -Wno-cast-function-type -Wno-constant-logical-operand -Wno-long-long -Wno-missing-field-initializers -Wno-overlength-strings -Wno-packed-bitfield-compat -Wno-parentheses-equality -Wno-self-assign -Wno-tautological-compare -Wno-unused-parameter -Wno-unused-value -Wsuggest-attribute=format -Wsuggest-attribute=noreturn -Wunused-variable -Wmisleading-indentation -Wundef -fPIC
XCFLAGS = -U_FORTIFY_SOURCE -D_FORTIFY_SOURCE=2 -fstack-protector-strong -fno-strict-overflow -fvisibility=hidden -fexcess-precision=standard -DRUBY_EXPORT -I. -I.ext/include/x86_64-linux -I/tmp/ruby/src/trunk-random2/include -I/tmp/ruby/src/trunk-random2 -I/tmp/ruby/src/trunk-random2/prism -I/tmp/ruby/src/trunk-random2/enc/unicode/15.0.0
CPPFLAGS =
DLDFLAGS = -Wl,--compress-debug-sections=zlib -Wl,-soname,libruby.so.3.3 -fstack-protector-strong
SOLIBS = -lz -lrt -lrt -lgmp -ldl -lcrypt -lm -lpthread
LANG =
LC_ALL =
LC_CTYPE =
MFLAGS = -j4 --jobserver-auth=4,5
RUSTC = rustc
YJIT_RUSTC_ARGS = --crate-name=yjit --crate-type=staticlib --edition=2021 -g -C lto=thin -C opt-level=3 -C overflow-checks=on '--out-dir=/tmp/ruby/build/trunk-random2/yjit/target/release/' /tmp/ruby/src/trunk-random2/yjit/src/lib.rs
gcc (Ubuntu 11.3.0-1ubuntu1~22.04.1) 11.3.0
Copyright (C) 2021 Free Software Foundation, Inc.
This is free software; see the source for copying conditions. There is NO
warranty; not even for MERCHANTABILITY or FITNESS FOR A PARTICULAR PURPOSE.
compiling /tmp/ruby/src/trunk-random2/version.c
linking miniruby
$$$[end] "make miniruby -j4" exit with 0.
$$$[beg] make ruby -j4
BASERUBY = /usr/bin/ruby --disable=gems
CC = gcc
LD = ld
LDSHARED = gcc -shared
CFLAGS = -O3 -fno-fast-math -ggdb3 -Wall -Wextra -Wdeprecated-declarations -Wdiv-by-zero -Wduplicated-cond -Wimplicit-function-declaration -Wimplicit-int -Wpointer-arith -Wwrite-strings -Wold-style-definition -Wimplicit-fallthrough=0 -Wmissing-noreturn -Wno-cast-function-type -Wno-constant-logical-operand -Wno-long-long -Wno-missing-field-initializers -Wno-overlength-strings -Wno-packed-bitfield-compat -Wno-parentheses-equality -Wno-self-assign -Wno-tautological-compare -Wno-unused-parameter -Wno-unused-value -Wsuggest-attribute=format -Wsuggest-attribute=noreturn -Wunused-variable -Wmisleading-indentation -Wundef -fPIC
XCFLAGS = -U_FORTIFY_SOURCE -D_FORTIFY_SOURCE=2 -fstack-protector-strong -fno-strict-overflow -fvisibility=hidden -fexcess-precision=standard -DRUBY_EXPORT -I. -I.ext/include/x86_64-linux -I/tmp/ruby/src/trunk-random2/include -I/tmp/ruby/src/trunk-random2 -I/tmp/ruby/src/trunk-random2/prism -I/tmp/ruby/src/trunk-random2/enc/unicode/15.0.0
CPPFLAGS =
DLDFLAGS = -Wl,--compress-debug-sections=zlib -Wl,-soname,libruby.so.3.3 -fstack-protector-strong
SOLIBS = -lz -lrt -lrt -lgmp -ldl -lcrypt -lm -lpthread
LANG =
LC_ALL =
LC_CTYPE =
MFLAGS = -j4 --jobserver-auth=4,5
RUSTC = rustc
YJIT_RUSTC_ARGS = --crate-name=yjit --crate-type=staticlib --edition=2021 -g -C lto=thin -C opt-level=3 -C overflow-checks=on '--out-dir=/tmp/ruby/build/trunk-random2/yjit/target/release/' /tmp/ruby/src/trunk-random2/yjit/src/lib.rs
gcc (Ubuntu 11.3.0-1ubuntu1~22.04.1) 11.3.0
Copyright (C) 2021 Free Software Foundation, Inc.
This is free software; see the source for copying conditions. There is NO
warranty; not even for MERCHANTABILITY or FITNESS FOR A PARTICULAR PURPOSE.
builtin_binary.inc updated
76e934bb17dc6707909e962248ef2d291897d7951f46fba0a469fe3d59b78422 builtin_binary.inc
compiling /tmp/ruby/src/trunk-random2/builtin.c
linking static-library libruby-static.a
linking shared-library libruby.so.3.3.0
linking ruby
$$$[end] "make ruby -j4" exit with 0.
$$$[beg] make all -j4
BASERUBY = /usr/bin/ruby --disable=gems
CC = gcc
LD = ld
LDSHARED = gcc -shared
CFLAGS = -O3 -fno-fast-math -ggdb3 -Wall -Wextra -Wdeprecated-declarations -Wdiv-by-zero -Wduplicated-cond -Wimplicit-function-declaration -Wimplicit-int -Wpointer-arith -Wwrite-strings -Wold-style-definition -Wimplicit-fallthrough=0 -Wmissing-noreturn -Wno-cast-function-type -Wno-constant-logical-operand -Wno-long-long -Wno-missing-field-initializers -Wno-overlength-strings -Wno-packed-bitfield-compat -Wno-parentheses-equality -Wno-self-assign -Wno-tautological-compare -Wno-unused-parameter -Wno-unused-value -Wsuggest-attribute=format -Wsuggest-attribute=noreturn -Wunused-variable -Wmisleading-indentation -Wundef -fPIC
XCFLAGS = -U_FORTIFY_SOURCE -D_FORTIFY_SOURCE=2 -fstack-protector-strong -fno-strict-overflow -fvisibility=hidden -fexcess-precision=standard -DRUBY_EXPORT -I. -I.ext/include/x86_64-linux -I/tmp/ruby/src/trunk-random2/include -I/tmp/ruby/src/trunk-random2 -I/tmp/ruby/src/trunk-random2/prism -I/tmp/ruby/src/trunk-random2/enc/unicode/15.0.0
CPPFLAGS =
DLDFLAGS = -Wl,--compress-debug-sections=zlib -Wl,-soname,libruby.so.3.3 -fstack-protector-strong
SOLIBS = -lz -lrt -lrt -lgmp -ldl -lcrypt -lm -lpthread
LANG =
LC_ALL =
LC_CTYPE =
MFLAGS = -j4 --jobserver-auth=4,5
RUSTC = rustc
YJIT_RUSTC_ARGS = --crate-name=yjit --crate-type=staticlib --edition=2021 -g -C lto=thin -C opt-level=3 -C overflow-checks=on '--out-dir=/tmp/ruby/build/trunk-random2/yjit/target/release/' /tmp/ruby/src/trunk-random2/yjit/src/lib.rs
gcc (Ubuntu 11.3.0-1ubuntu1~22.04.1) 11.3.0
Copyright (C) 2021 Free Software Foundation, Inc.
This is free software; see the source for copying conditions. There is NO
warranty; not even for MERCHANTABILITY or FITNESS FOR A PARTICULAR PURPOSE.
building spec/ruby/optional/capi/ext/array_spec.so
generating enc.mk
building spec/ruby/optional/capi/ext/basic_object_spec.so
building spec/ruby/optional/capi/ext/bignum_spec.so
building spec/ruby/optional/capi/ext/binding_spec.so
building spec/ruby/optional/capi/ext/boolean_spec.so
building spec/ruby/optional/capi/ext/class_id_under_autoload_spec.so
building spec/ruby/optional/capi/ext/class_spec.so
building spec/ruby/optional/capi/ext/class_under_autoload_spec.so
building spec/ruby/optional/capi/ext/complex_spec.so
building spec/ruby/optional/capi/ext/constants_spec.so
building spec/ruby/optional/capi/ext/data_spec.so
building spec/ruby/optional/capi/ext/debug_spec.so
building spec/ruby/optional/capi/ext/encoding_spec.so
building spec/ruby/optional/capi/ext/enumerator_spec.so
building spec/ruby/optional/capi/ext/exception_spec.so
building spec/ruby/optional/capi/ext/fiber_spec.so
building spec/ruby/optional/capi/ext/file_spec.so
building spec/ruby/optional/capi/ext/fixnum_spec.so
building spec/ruby/optional/capi/ext/float_spec.so
building spec/ruby/optional/capi/ext/gc_spec.so
building spec/ruby/optional/capi/ext/globals_spec.so
building spec/ruby/optional/capi/ext/hash_spec.so
building spec/ruby/optional/capi/ext/integer_spec.so
building spec/ruby/optional/capi/ext/io_spec.so
building spec/ruby/optional/capi/ext/kernel_spec.so
building spec/ruby/optional/capi/ext/language_spec.so
building spec/ruby/optional/capi/ext/marshal_spec.so
building spec/ruby/optional/capi/ext/module_spec.so
building spec/ruby/optional/capi/ext/module_under_autoload_spec.so
building spec/ruby/optional/capi/ext/mutex_spec.so
building spec/ruby/optional/capi/ext/numeric_spec.so
building spec/ruby/optional/capi/ext/object_spec.so
building spec/ruby/optional/capi/ext/proc_spec.so
building spec/ruby/optional/capi/ext/range_spec.so
building spec/ruby/optional/capi/ext/rational_spec.so
building spec/ruby/optional/capi/ext/rbasic_spec.so
building spec/ruby/optional/capi/ext/regexp_spec.so
building spec/ruby/optional/capi/ext/st_spec.so
building spec/ruby/optional/capi/ext/string_spec.so
building spec/ruby/optional/capi/ext/struct_spec.so
building spec/ruby/optional/capi/ext/symbol_spec.so
building spec/ruby/optional/capi/ext/thread_spec.so
building spec/ruby/optional/capi/ext/time_spec.so
building spec/ruby/optional/capi/ext/tracepoint_spec.so
building spec/ruby/optional/capi/ext/typed_data_spec.so
building spec/ruby/optional/capi/ext/util_spec.so
making enc
make[1]: Entering directory '/tmp/ruby/build/trunk-random2'
make[1]: Nothing to be done for 'enc'.
make[1]: Leaving directory '/tmp/ruby/build/trunk-random2'
making srcs under enc
make[1]: Entering directory '/tmp/ruby/build/trunk-random2'
make[1]: Nothing to be done for 'srcs'.
make[1]: Leaving directory '/tmp/ruby/build/trunk-random2'
generating transdb.h
transdb.h unchanged
generating makefiles ext/configure-ext.mk
making trans
make[1]: Entering directory '/tmp/ruby/build/trunk-random2'
make[1]: Nothing to be done for '/tmp/ruby/src/trunk-random2/enc/trans'.
make[1]: Leaving directory '/tmp/ruby/build/trunk-random2'
making encs
ext/configure-ext.mk updated
make[1]: Entering directory '/tmp/ruby/build/trunk-random2'
make[1]: Entering directory '/tmp/ruby/build/trunk-random2'
make[1]: Nothing to be done for 'encs'.
make[1]: Leaving directory '/tmp/ruby/build/trunk-random2'
make[1]: Leaving directory '/tmp/ruby/build/trunk-random2'
generating makefile exts.mk
exts.mk unchanged
make[1]: Entering directory '/tmp/ruby/build/trunk-random2'
make[2]: Entering directory '/tmp/ruby/build/trunk-random2/ext/bigdecimal'
make[2]: Entering directory '/tmp/ruby/build/trunk-random2/ext/coverage'
make[2]: Leaving directory '/tmp/ruby/build/trunk-random2/ext/bigdecimal'
make[2]: Entering directory '/tmp/ruby/build/trunk-random2/ext/digest'
make[2]: Entering directory '/tmp/ruby/build/trunk-random2/ext/date'
make[2]: Leaving directory '/tmp/ruby/build/trunk-random2/ext/digest'
make[2]: Leaving directory '/tmp/ruby/build/trunk-random2/ext/coverage'
make[2]: Leaving directory '/tmp/ruby/build/trunk-random2/ext/date'
make[2]: Entering directory '/tmp/ruby/build/trunk-random2/ext/fiddle'
make[2]: Entering directory '/tmp/ruby/build/trunk-random2/ext/io/console'
make[2]: Leaving directory '/tmp/ruby/build/trunk-random2/ext/io/console'
make[2]: Entering directory '/tmp/ruby/build/trunk-random2/ext/json'
make[2]: Entering directory '/tmp/ruby/build/trunk-random2/ext/monitor'
make[2]: Entering directory '/tmp/ruby/build/trunk-random2/ext/nkf'
make[2]: Leaving directory '/tmp/ruby/build/trunk-random2/ext/fiddle'
make[2]: Leaving directory '/tmp/ruby/build/trunk-random2/ext/monitor'
make[2]: Leaving directory '/tmp/ruby/build/trunk-random2/ext/nkf'
make[2]: Entering directory '/tmp/ruby/build/trunk-random2/ext/objspace'
make[2]: Leaving directory '/tmp/ruby/build/trunk-random2/ext/json'
make[2]: Leaving directory '/tmp/ruby/build/trunk-random2/ext/objspace'
make[2]: Entering directory '/tmp/ruby/build/trunk-random2/ext/pathname'
make[2]: Entering directory '/tmp/ruby/build/trunk-random2/ext/pty'
make[2]: Entering directory '/tmp/ruby/build/trunk-random2/ext/psych'
make[2]: Leaving directory '/tmp/ruby/build/trunk-random2/ext/pty'
make[2]: Leaving directory '/tmp/ruby/build/trunk-random2/ext/pathname'
make[2]: Entering directory '/tmp/ruby/build/trunk-random2/ext/openssl'
make[2]: Leaving directory '/tmp/ruby/build/trunk-random2/ext/psych'
make[2]: Entering directory '/tmp/ruby/build/trunk-random2/ext/rubyvm'
make[2]: Leaving directory '/tmp/ruby/build/trunk-random2/ext/openssl'
make[2]: Entering directory '/tmp/ruby/build/trunk-random2/ext/ripper'
make[2]: Leaving directory '/tmp/ruby/build/trunk-random2/ext/rubyvm'
make[2]: Entering directory '/tmp/ruby/build/trunk-random2/ext/syslog'
make[2]: Leaving directory '/tmp/ruby/build/trunk-random2/ext/syslog'
make[2]: Entering directory '/tmp/ruby/build/trunk-random2/.bundle/gems/debug-1.9.0/ext/debug'
make[2]: Entering directory '/tmp/ruby/build/trunk-random2/.bundle/gems/debug-1.9.1/ext/debug'
make[2]: Leaving directory '/tmp/ruby/build/trunk-random2/ext/ripper'
make[2]: Entering directory '/tmp/ruby/build/trunk-random2/ext/socket'
make[2]: Entering directory '/tmp/ruby/build/trunk-random2/.bundle/gems/racc-1.7.3/ext/racc/cparse'
make[2]: Leaving directory '/tmp/ruby/build/trunk-random2/ext/socket'
make[2]: Entering directory '/tmp/ruby/build/trunk-random2/.bundle/gems/rbs-3.4.0/ext/rbs_extension'
make[2]: Leaving directory '/tmp/ruby/build/trunk-random2/.bundle/gems/debug-1.9.1/ext/debug'
make[2]: Leaving directory '/tmp/ruby/build/trunk-random2/.bundle/gems/debug-1.9.0/ext/debug'
make[2]: Leaving directory '/tmp/ruby/build/trunk-random2/.bundle/gems/racc-1.7.3/ext/racc/cparse'
make[2]: Entering directory '/tmp/ruby/build/trunk-random2/ext/digest/sha2'
make[2]: Leaving directory '/tmp/ruby/build/trunk-random2/.bundle/gems/rbs-3.4.0/ext/rbs_extension'
make[2]: Leaving directory '/tmp/ruby/build/trunk-random2/ext/digest/sha2'
make[2]: Entering directory '/tmp/ruby/build/trunk-random2'
make[2]: 'ruby' is up to date.
make[2]: Leaving directory '/tmp/ruby/build/trunk-random2'
make[1]: Leaving directory '/tmp/ruby/build/trunk-random2'
make[1]: Entering directory '/tmp/ruby/build/trunk-random2'
make[1]: Nothing to be done for 'note'.
make[1]: Leaving directory '/tmp/ruby/build/trunk-random2'
$$$[end] "make all -j4" exit with 0.
$$$[beg] make install -j4
BASERUBY = /usr/bin/ruby --disable=gems
CC = gcc
LD = ld
LDSHARED = gcc -shared
CFLAGS = -O3 -fno-fast-math -ggdb3 -Wall -Wextra -Wdeprecated-declarations -Wdiv-by-zero -Wduplicated-cond -Wimplicit-function-declaration -Wimplicit-int -Wpointer-arith -Wwrite-strings -Wold-style-definition -Wimplicit-fallthrough=0 -Wmissing-noreturn -Wno-cast-function-type -Wno-constant-logical-operand -Wno-long-long -Wno-missing-field-initializers -Wno-overlength-strings -Wno-packed-bitfield-compat -Wno-parentheses-equality -Wno-self-assign -Wno-tautological-compare -Wno-unused-parameter -Wno-unused-value -Wsuggest-attribute=format -Wsuggest-attribute=noreturn -Wunused-variable -Wmisleading-indentation -Wundef -fPIC
XCFLAGS = -U_FORTIFY_SOURCE -D_FORTIFY_SOURCE=2 -fstack-protector-strong -fno-strict-overflow -fvisibility=hidden -fexcess-precision=standard -DRUBY_EXPORT -I. -I.ext/include/x86_64-linux -I/tmp/ruby/src/trunk-random2/include -I/tmp/ruby/src/trunk-random2 -I/tmp/ruby/src/trunk-random2/prism -I/tmp/ruby/src/trunk-random2/enc/unicode/15.0.0
CPPFLAGS =
DLDFLAGS = -Wl,--compress-debug-sections=zlib -Wl,-soname,libruby.so.3.3 -fstack-protector-strong
SOLIBS = -lz -lrt -lrt -lgmp -ldl -lcrypt -lm -lpthread
LANG =
LC_ALL =
LC_CTYPE =
MFLAGS = -j4 --jobserver-auth=4,5
RUSTC = rustc
YJIT_RUSTC_ARGS = --crate-name=yjit --crate-type=staticlib --edition=2021 -g -C lto=thin -C opt-level=3 -C overflow-checks=on '--out-dir=/tmp/ruby/build/trunk-random2/yjit/target/release/' /tmp/ruby/src/trunk-random2/yjit/src/lib.rs
generating enc.mk
gcc (Ubuntu 11.3.0-1ubuntu1~22.04.1) 11.3.0
Copyright (C) 2021 Free Software Foundation, Inc.
This is free software; see the source for copying conditions. There is NO
warranty; not even for MERCHANTABILITY or FITNESS FOR A PARTICULAR PURPOSE.
making srcs under enc
making enc
make[1]: Entering directory '/tmp/ruby/build/trunk-random2'
make[1]: Nothing to be done for 'enc'.
make[1]: Leaving directory '/tmp/ruby/build/trunk-random2'
make[1]: Entering directory '/tmp/ruby/build/trunk-random2'
make[1]: Nothing to be done for 'srcs'.
make[1]: Leaving directory '/tmp/ruby/build/trunk-random2'
generating transdb.h
transdb.h unchanged
generating makefiles ext/configure-ext.mk
making trans
make[1]: Entering directory '/tmp/ruby/build/trunk-random2'
make[1]: Nothing to be done for '/tmp/ruby/src/trunk-random2/enc/trans'.
make[1]: Leaving directory '/tmp/ruby/build/trunk-random2'
ext/configure-ext.mk unchanged
making encs
make[1]: Entering directory '/tmp/ruby/build/trunk-random2'
make[1]: Entering directory '/tmp/ruby/build/trunk-random2'
make[1]: Nothing to be done for 'encs'.
make[1]: Leaving directory '/tmp/ruby/build/trunk-random2'
make[1]: Leaving directory '/tmp/ruby/build/trunk-random2'
generating makefile exts.mk
exts.mk unchanged
make[1]: Entering directory '/tmp/ruby/build/trunk-random2'
make[2]: Entering directory '/tmp/ruby/build/trunk-random2/ext/bigdecimal'
make[2]: Leaving directory '/tmp/ruby/build/trunk-random2/ext/bigdecimal'
make[2]: Entering directory '/tmp/ruby/build/trunk-random2/ext/digest'
make[2]: Entering directory '/tmp/ruby/build/trunk-random2/ext/coverage'
make[2]: Entering directory '/tmp/ruby/build/trunk-random2/ext/date'
make[2]: Leaving directory '/tmp/ruby/build/trunk-random2/ext/date'
make[2]: Leaving directory '/tmp/ruby/build/trunk-random2/ext/coverage'
make[2]: Entering directory '/tmp/ruby/build/trunk-random2/ext/io/console'
make[2]: Entering directory '/tmp/ruby/build/trunk-random2/ext/fiddle'
make[2]: Leaving directory '/tmp/ruby/build/trunk-random2/ext/io/console'
make[2]: Entering directory '/tmp/ruby/build/trunk-random2/ext/json'
make[2]: Leaving directory '/tmp/ruby/build/trunk-random2/ext/digest'
make[2]: Entering directory '/tmp/ruby/build/trunk-random2/ext/monitor'
make[2]: Entering directory '/tmp/ruby/build/trunk-random2/ext/nkf'
make[2]: Leaving directory '/tmp/ruby/build/trunk-random2/ext/json'
make[2]: Leaving directory '/tmp/ruby/build/trunk-random2/ext/fiddle'
make[2]: Entering directory '/tmp/ruby/build/trunk-random2/ext/objspace'
make[2]: Leaving directory '/tmp/ruby/build/trunk-random2/ext/monitor'
make[2]: Leaving directory '/tmp/ruby/build/trunk-random2/ext/nkf'
make[2]: Leaving directory '/tmp/ruby/build/trunk-random2/ext/objspace'
make[2]: Entering directory '/tmp/ruby/build/trunk-random2/ext/pathname'
make[2]: Entering directory '/tmp/ruby/build/trunk-random2/ext/psych'
make[2]: Entering directory '/tmp/ruby/build/trunk-random2/ext/pty'
make[2]: Entering directory '/tmp/ruby/build/trunk-random2/ext/openssl'
make[2]: Leaving directory '/tmp/ruby/build/trunk-random2/ext/pty'
make[2]: Leaving directory '/tmp/ruby/build/trunk-random2/ext/pathname'
make[2]: Entering directory '/tmp/ruby/build/trunk-random2/ext/ripper'
make[2]: Entering directory '/tmp/ruby/build/trunk-random2/ext/rubyvm'
make[2]: Leaving directory '/tmp/ruby/build/trunk-random2/ext/psych'
make[2]: Leaving directory '/tmp/ruby/build/trunk-random2/ext/openssl'
make[2]: Leaving directory '/tmp/ruby/build/trunk-random2/ext/rubyvm'
make[2]: Leaving directory '/tmp/ruby/build/trunk-random2/ext/ripper'
make[2]: Entering directory '/tmp/ruby/build/trunk-random2/ext/socket'
make[2]: Entering directory '/tmp/ruby/build/trunk-random2/ext/syslog'
make[2]: Entering directory '/tmp/ruby/build/trunk-random2/.bundle/gems/debug-1.9.0/ext/debug'
make[2]: Entering directory '/tmp/ruby/build/trunk-random2/.bundle/gems/debug-1.9.1/ext/debug'
make[2]: Leaving directory '/tmp/ruby/build/trunk-random2/ext/syslog'
make[2]: Entering directory '/tmp/ruby/build/trunk-random2/.bundle/gems/racc-1.7.3/ext/racc/cparse'
make[2]: Leaving directory '/tmp/ruby/build/trunk-random2/ext/socket'
make[2]: Entering directory '/tmp/ruby/build/trunk-random2/.bundle/gems/rbs-3.4.0/ext/rbs_extension'
make[2]: Leaving directory '/tmp/ruby/build/trunk-random2/.bundle/gems/debug-1.9.0/ext/debug'
make[2]: Leaving directory '/tmp/ruby/build/trunk-random2/.bundle/gems/debug-1.9.1/ext/debug'
make[2]: Entering directory '/tmp/ruby/build/trunk-random2/ext/digest/sha2'
make[2]: Leaving directory '/tmp/ruby/build/trunk-random2/.bundle/gems/racc-1.7.3/ext/racc/cparse'
make[2]: Leaving directory '/tmp/ruby/build/trunk-random2/ext/digest/sha2'
make[2]: Leaving directory '/tmp/ruby/build/trunk-random2/.bundle/gems/rbs-3.4.0/ext/rbs_extension'
make[2]: Entering directory '/tmp/ruby/build/trunk-random2'
make[2]: 'ruby' is up to date.
make[2]: Leaving directory '/tmp/ruby/build/trunk-random2'
make[1]: Leaving directory '/tmp/ruby/build/trunk-random2'
make[1]: Entering directory '/tmp/ruby/build/trunk-random2'
make[1]: Nothing to be done for 'note'.
make[1]: Leaving directory '/tmp/ruby/build/trunk-random2'
./miniruby -I/tmp/ruby/src/trunk-random2/lib -I. -I.ext/common /tmp/ruby/src/trunk-random2/tool/runruby.rb --extout=.ext -- --disable-gems -r./x86_64-linux-fake /tmp/ruby/src/trunk-random2/tool/rbinstall.rb --make="make" --dest-dir="" --extout=".ext" --ext-build-dir="./ext" --mflags="-j4 --jobserver-auth=4,5" --make-flags=" -j4 --jobserver-auth=4,5" --data-mode=0644 --prog-mode=0755 --installed-list .installed.list --mantype="man" --gnumake --install=all --exclude=doc
Installing to
installing binary commands: /tmp/ruby/install/trunk-random2/bin
installing base libraries: /tmp/ruby/install/trunk-random2/lib
installing arch files: /tmp/ruby/install/trunk-random2/lib/ruby/3.3.0+0/x86_64-linux
installing pkgconfig data: /tmp/ruby/install/trunk-random2/lib/pkgconfig
installing extension objects: /tmp/ruby/install/trunk-random2/lib/ruby/3.3.0+0/x86_64-linux
installing extension objects: /tmp/ruby/install/trunk-random2/lib/ruby/site_ruby/3.3.0+0/x86_64-linux
installing extension objects: /tmp/ruby/install/trunk-random2/lib/ruby/vendor_ruby/3.3.0+0/x86_64-linux
installing extension headers: /tmp/ruby/install/trunk-random2/include/ruby-3.3.0+0/x86_64-linux
installing extension scripts: /tmp/ruby/install/trunk-random2/lib/ruby/3.3.0+0
installing extension scripts: /tmp/ruby/install/trunk-random2/lib/ruby/site_ruby/3.3.0+0
installing extension scripts: /tmp/ruby/install/trunk-random2/lib/ruby/vendor_ruby/3.3.0+0
installing extension headers: /tmp/ruby/install/trunk-random2/include/ruby-3.3.0+0/ruby
installing command scripts: /tmp/ruby/install/trunk-random2/bin
installing library scripts: /tmp/ruby/install/trunk-random2/lib/ruby/3.3.0+0
installing common headers: /tmp/ruby/install/trunk-random2/include/ruby-3.3.0+0
installing manpages: /tmp/ruby/install/trunk-random2/share/man/man1
installing default gems from lib: /tmp/ruby/install/trunk-random2/lib/ruby/gems/3.3.0+0
abbrev 0.1.2
base64 0.2.0
benchmark 0.3.0
bundler 2.5.3
cgi 0.4.1
csv 3.2.8
delegate 0.3.1
did_you_mean 1.6.3
drb 2.2.0
english 0.8.0
erb 4.0.3
error_highlight 0.6.0
fileutils 1.7.2
find 0.2.0
forwardable 1.3.3
getoptlong 0.2.1
ipaddr 1.2.6
irb 1.11.0
logger 1.6.0
mutex_m 0.2.0
net-http 0.4.0
net-protocol 0.2.2
observer 0.1.2
open-uri 0.4.1
open3 0.2.1
optparse 0.4.0
ostruct 0.6.0
pp 0.5.0
prettyprint 0.2.0
prism 0.19.0
pstore 0.1.3
rdoc 6.6.2
readline 0.0.4
reline 0.4.1
resolv 0.3.0
resolv-replace 0.1.1
rinda 0.2.0
ruby2_keywords 0.0.5
securerandom 0.3.1
set 1.1.0
shellwords 0.2.0
singleton 0.2.0
syntax_suggest 2.0.0
tempfile 0.2.1
time 0.3.0
timeout 0.4.1
tmpdir 0.2.0
tsort 0.2.0
un 0.3.0
uri 0.13.0
weakref 0.1.3
yaml 0.3.0
installing default gems from ext: /tmp/ruby/install/trunk-random2/lib/ruby/gems/3.3.0+0
bigdecimal 3.1.5
date 3.3.4
digest 3.1.1
etc 1.4.3
fcntl 1.1.0
fiddle 1.1.2
io-console 0.7.1
io-nonblock 0.3.0
io-wait 0.3.1
json 2.7.1
nkf 0.1.3
openssl 3.2.0
pathname 0.3.0
psych 5.1.2
stringio 3.1.0
strscan 3.0.7
syslog 0.1.2
zlib 3.1.0
installing bundled gems: /tmp/ruby/install/trunk-random2/lib/ruby/gems/3.3.0+0
minitest 5.20.0
power_assert 2.0.3
rake 13.1.0
test-unit 3.6.1
rexml 3.2.6
rss 0.3.0
net-ftp 0.3.3
net-imap 0.4.8
net-pop 0.1.2
net-smtp 0.4.0
matrix 0.4.2
prime 0.1.2
rbs 3.4.0
typeprof 0.21.9
debug 1.9.1
racc 1.7.3
installing bundled gem cache: /tmp/ruby/install/trunk-random2/lib/ruby/gems/3.3.0+0/cache
$$$[end] "make install -j4" exit with 0.
$$$[beg] make yes-btest TESTOPTS='-q -j4'
PASS all 1870 tests
$$$[end] "make yes-btest TESTOPTS='-q -j4'" exit with 0.
$$$[beg] make yes-test-basic TESTS="--test-order=random"
BASERUBY = /usr/bin/ruby --disable=gems
CC = gcc
LD = ld
LDSHARED = gcc -shared
CFLAGS = -O3 -fno-fast-math -ggdb3 -Wall -Wextra -Wdeprecated-declarations -Wdiv-by-zero -Wduplicated-cond -Wimplicit-function-declaration -Wimplicit-int -Wpointer-arith -Wwrite-strings -Wold-style-definition -Wimplicit-fallthrough=0 -Wmissing-noreturn -Wno-cast-function-type -Wno-constant-logical-operand -Wno-long-long -Wno-missing-field-initializers -Wno-overlength-strings -Wno-packed-bitfield-compat -Wno-parentheses-equality -Wno-self-assign -Wno-tautological-compare -Wno-unused-parameter -Wno-unused-value -Wsuggest-attribute=format -Wsuggest-attribute=noreturn -Wunused-variable -Wmisleading-indentation -Wundef -fPIC
XCFLAGS = -U_FORTIFY_SOURCE -D_FORTIFY_SOURCE=2 -fstack-protector-strong -fno-strict-overflow -fvisibility=hidden -fexcess-precision=standard -DRUBY_EXPORT -I. -I.ext/include/x86_64-linux -I/tmp/ruby/src/trunk-random2/include -I/tmp/ruby/src/trunk-random2 -I/tmp/ruby/src/trunk-random2/prism -I/tmp/ruby/src/trunk-random2/enc/unicode/15.0.0
CPPFLAGS =
DLDFLAGS = -Wl,--compress-debug-sections=zlib -Wl,-soname,libruby.so.3.3 -fstack-protector-strong
SOLIBS = -lz -lrt -lrt -lgmp -ldl -lcrypt -lm -lpthread
LANG =
LC_ALL =
LC_CTYPE =
MFLAGS =
RUSTC = rustc
YJIT_RUSTC_ARGS = --crate-name=yjit --crate-type=staticlib --edition=2021 -g -C lto=thin -C opt-level=3 -C overflow-checks=on '--out-dir=/tmp/ruby/build/trunk-random2/yjit/target/release/' /tmp/ruby/src/trunk-random2/yjit/src/lib.rs
gcc (Ubuntu 11.3.0-1ubuntu1~22.04.1) 11.3.0
Copyright (C) 2021 Free Software Foundation, Inc.
This is free software; see the source for copying conditions. There is NO
warranty; not even for MERCHANTABILITY or FITNESS FOR A PARTICULAR PURPOSE.
Ignore setproctitle.o because of setproctitle.c under missing
Ignore strlcat.o because of strlcat.c under missing
Ignore strlcpy.o because of strlcpy.c under missing
Checking leaked global symbols...none
/tmp/ruby/src/trunk-random2/basictest/test.rb:assignment ....................................................................................................................................................................................................................................................................................................................................................................................OK 372
/tmp/ruby/src/trunk-random2/basictest/test.rb:condition ..OK 2
/tmp/ruby/src/trunk-random2/basictest/test.rb:if/unless ...OK 3
/tmp/ruby/src/trunk-random2/basictest/test.rb:case .....OK 5
/tmp/ruby/src/trunk-random2/basictest/test.rb:while/until ........OK 8
/tmp/ruby/src/trunk-random2/basictest/test.rb:exception ..........OK 10
/tmp/ruby/src/trunk-random2/basictest/test.rb:array .......................................OK 39
/tmp/ruby/src/trunk-random2/basictest/test.rb:hash ...........................OK 27
/tmp/ruby/src/trunk-random2/basictest/test.rb:iterator ...........................................................................................................OK 107
/tmp/ruby/src/trunk-random2/basictest/test.rb:float ................................................................................OK 80
/tmp/ruby/src/trunk-random2/basictest/test.rb:bignum ...............................OK 31
/tmp/ruby/src/trunk-random2/basictest/test.rb:string & char ..............................................................OK 62
/tmp/ruby/src/trunk-random2/basictest/test.rb:assignment ..........OK 10
/tmp/ruby/src/trunk-random2/basictest/test.rb:call ......OK 6
/tmp/ruby/src/trunk-random2/basictest/test.rb:proc .........OK 9
/tmp/ruby/src/trunk-random2/basictest/test.rb:signal ..OK 2
/tmp/ruby/src/trunk-random2/basictest/test.rb:eval ...........................OK 27
/tmp/ruby/src/trunk-random2/basictest/test.rb:system ........OK 8
/tmp/ruby/src/trunk-random2/basictest/test.rb:const .....OK 5
/tmp/ruby/src/trunk-random2/basictest/test.rb:clone .....OK 5
/tmp/ruby/src/trunk-random2/basictest/test.rb:marshal ....OK 4
/tmp/ruby/src/trunk-random2/basictest/test.rb:pack ....OK 4
/tmp/ruby/src/trunk-random2/basictest/test.rb:math ..OK 2
/tmp/ruby/src/trunk-random2/basictest/test.rb:struct ......OK 6
/tmp/ruby/src/trunk-random2/basictest/test.rb:variable ............OK 12
/tmp/ruby/src/trunk-random2/basictest/test.rb:trace ...OK 3
/tmp/ruby/src/trunk-random2/basictest/test.rb:defined? ............OK 12
/tmp/ruby/src/trunk-random2/basictest/test.rb:alias ......OK 6
/tmp/ruby/src/trunk-random2/basictest/test.rb:path .......................OK 23
/tmp/ruby/src/trunk-random2/basictest/test.rb:gc ....OK 4
test succeeded
$$$[end] "make yes-test-basic TESTS=\"--test-order=random\"" exit with 0.
$$$[beg] make yes-test-all TESTOPTS='--stderr-on-failure' TESTS="--test-order=random"
BASERUBY = /usr/bin/ruby --disable=gems
CC = gcc
LD = ld
LDSHARED = gcc -shared
CFLAGS = -O3 -fno-fast-math -ggdb3 -Wall -Wextra -Wdeprecated-declarations -Wdiv-by-zero -Wduplicated-cond -Wimplicit-function-declaration -Wimplicit-int -Wpointer-arith -Wwrite-strings -Wold-style-definition -Wimplicit-fallthrough=0 -Wmissing-noreturn -Wno-cast-function-type -Wno-constant-logical-operand -Wno-long-long -Wno-missing-field-initializers -Wno-overlength-strings -Wno-packed-bitfield-compat -Wno-parentheses-equality -Wno-self-assign -Wno-tautological-compare -Wno-unused-parameter -Wno-unused-value -Wsuggest-attribute=format -Wsuggest-attribute=noreturn -Wunused-variable -Wmisleading-indentation -Wundef -fPIC
XCFLAGS = -U_FORTIFY_SOURCE -D_FORTIFY_SOURCE=2 -fstack-protector-strong -fno-strict-overflow -fvisibility=hidden -fexcess-precision=standard -DRUBY_EXPORT -I. -I.ext/include/x86_64-linux -I/tmp/ruby/src/trunk-random2/include -I/tmp/ruby/src/trunk-random2 -I/tmp/ruby/src/trunk-random2/prism -I/tmp/ruby/src/trunk-random2/enc/unicode/15.0.0
CPPFLAGS =
DLDFLAGS = -Wl,--compress-debug-sections=zlib -Wl,-soname,libruby.so.3.3 -fstack-protector-strong
SOLIBS = -lz -lrt -lrt -lgmp -ldl -lcrypt -lm -lpthread
LANG =
LC_ALL =
LC_CTYPE =
MFLAGS =
RUSTC = rustc
YJIT_RUSTC_ARGS = --crate-name=yjit --crate-type=staticlib --edition=2021 -g -C lto=thin -C opt-level=3 -C overflow-checks=on '--out-dir=/tmp/ruby/build/trunk-random2/yjit/target/release/' /tmp/ruby/src/trunk-random2/yjit/src/lib.rs
gcc (Ubuntu 11.3.0-1ubuntu1~22.04.1) 11.3.0
Copyright (C) 2021 Free Software Foundation, Inc.
This is free software; see the source for copying conditions. There is NO
warranty; not even for MERCHANTABILITY or FITNESS FOR A PARTICULAR PURPOSE.
generating enc.mk
making enc
make[1]: Entering directory '/tmp/ruby/build/trunk-random2'
make[1]: Nothing to be done for 'enc'.
make[1]: Leaving directory '/tmp/ruby/build/trunk-random2'
making srcs under enc
make[1]: Entering directory '/tmp/ruby/build/trunk-random2'
make[1]: Nothing to be done for 'srcs'.
make[1]: Leaving directory '/tmp/ruby/build/trunk-random2'
generating transdb.h
transdb.h unchanged
making trans
make[1]: Entering directory '/tmp/ruby/build/trunk-random2'
make[1]: Nothing to be done for '/tmp/ruby/src/trunk-random2/enc/trans'.
make[1]: Leaving directory '/tmp/ruby/build/trunk-random2'
making encs
make[1]: Entering directory '/tmp/ruby/build/trunk-random2'
make[1]: Nothing to be done for 'encs'.
make[1]: Leaving directory '/tmp/ruby/build/trunk-random2'
generating makefiles ext/configure-ext.mk
ext/configure-ext.mk updated
make[1]: Entering directory '/tmp/ruby/build/trunk-random2'
make[1]: Leaving directory '/tmp/ruby/build/trunk-random2'
generating makefile exts.mk
exts.mk unchanged
make[1]: Entering directory '/tmp/ruby/build/trunk-random2'
make[2]: Entering directory '/tmp/ruby/build/trunk-random2/ext/bigdecimal'
make[2]: Leaving directory '/tmp/ruby/build/trunk-random2/ext/bigdecimal'
make[2]: Entering directory '/tmp/ruby/build/trunk-random2/ext/coverage'
make[2]: Leaving directory '/tmp/ruby/build/trunk-random2/ext/coverage'
make[2]: Entering directory '/tmp/ruby/build/trunk-random2/ext/date'
make[2]: Leaving directory '/tmp/ruby/build/trunk-random2/ext/date'
make[2]: Entering directory '/tmp/ruby/build/trunk-random2/ext/digest'
make[2]: Leaving directory '/tmp/ruby/build/trunk-random2/ext/digest'
make[2]: Entering directory '/tmp/ruby/build/trunk-random2/ext/digest/sha2'
make[2]: Leaving directory '/tmp/ruby/build/trunk-random2/ext/digest/sha2'
make[2]: Entering directory '/tmp/ruby/build/trunk-random2/ext/fiddle'
make[2]: Leaving directory '/tmp/ruby/build/trunk-random2/ext/fiddle'
make[2]: Entering directory '/tmp/ruby/build/trunk-random2/ext/io/console'
make[2]: Leaving directory '/tmp/ruby/build/trunk-random2/ext/io/console'
make[2]: Entering directory '/tmp/ruby/build/trunk-random2/ext/json'
make[2]: Leaving directory '/tmp/ruby/build/trunk-random2/ext/json'
make[2]: Entering directory '/tmp/ruby/build/trunk-random2/ext/monitor'
make[2]: Leaving directory '/tmp/ruby/build/trunk-random2/ext/monitor'
make[2]: Entering directory '/tmp/ruby/build/trunk-random2/ext/nkf'
make[2]: Leaving directory '/tmp/ruby/build/trunk-random2/ext/nkf'
make[2]: Entering directory '/tmp/ruby/build/trunk-random2/ext/objspace'
make[2]: Leaving directory '/tmp/ruby/build/trunk-random2/ext/objspace'
make[2]: Entering directory '/tmp/ruby/build/trunk-random2/ext/openssl'
make[2]: Leaving directory '/tmp/ruby/build/trunk-random2/ext/openssl'
make[2]: Entering directory '/tmp/ruby/build/trunk-random2/ext/pathname'
make[2]: Leaving directory '/tmp/ruby/build/trunk-random2/ext/pathname'
make[2]: Entering directory '/tmp/ruby/build/trunk-random2/ext/psych'
make[2]: Leaving directory '/tmp/ruby/build/trunk-random2/ext/psych'
make[2]: Entering directory '/tmp/ruby/build/trunk-random2/ext/pty'
make[2]: Leaving directory '/tmp/ruby/build/trunk-random2/ext/pty'
make[2]: Entering directory '/tmp/ruby/build/trunk-random2/ext/ripper'
make[2]: Leaving directory '/tmp/ruby/build/trunk-random2/ext/ripper'
make[2]: Entering directory '/tmp/ruby/build/trunk-random2/ext/rubyvm'
make[2]: Leaving directory '/tmp/ruby/build/trunk-random2/ext/rubyvm'
make[2]: Entering directory '/tmp/ruby/build/trunk-random2/ext/socket'
make[2]: Leaving directory '/tmp/ruby/build/trunk-random2/ext/socket'
make[2]: Entering directory '/tmp/ruby/build/trunk-random2/ext/syslog'
make[2]: Leaving directory '/tmp/ruby/build/trunk-random2/ext/syslog'
make[2]: Entering directory '/tmp/ruby/build/trunk-random2/.bundle/gems/debug-1.9.0/ext/debug'
make[2]: Leaving directory '/tmp/ruby/build/trunk-random2/.bundle/gems/debug-1.9.0/ext/debug'
make[2]: Entering directory '/tmp/ruby/build/trunk-random2/.bundle/gems/debug-1.9.1/ext/debug'
make[2]: Leaving directory '/tmp/ruby/build/trunk-random2/.bundle/gems/debug-1.9.1/ext/debug'
make[2]: Entering directory '/tmp/ruby/build/trunk-random2/.bundle/gems/racc-1.7.3/ext/racc/cparse'
make[2]: Leaving directory '/tmp/ruby/build/trunk-random2/.bundle/gems/racc-1.7.3/ext/racc/cparse'
make[2]: Entering directory '/tmp/ruby/build/trunk-random2/.bundle/gems/rbs-3.4.0/ext/rbs_extension'
make[2]: Leaving directory '/tmp/ruby/build/trunk-random2/.bundle/gems/rbs-3.4.0/ext/rbs_extension'
make[2]: Entering directory '/tmp/ruby/build/trunk-random2'
make[2]: 'ruby' is up to date.
make[2]: Leaving directory '/tmp/ruby/build/trunk-random2'
make[1]: Leaving directory '/tmp/ruby/build/trunk-random2'
make[1]: Entering directory '/tmp/ruby/build/trunk-random2'
make[1]: Nothing to be done for 'note'.
make[1]: Leaving directory '/tmp/ruby/build/trunk-random2'
Skipping Gem::PackageTask tests. rake not found.
Run options:
--seed=41020
"--ruby=./miniruby -I/tmp/ruby/src/trunk-random2/lib -I. -I.ext/common /tmp/ruby/src/trunk-random2/tool/runruby.rb --extout=.ext -- --disable-gems"
--excludes-dir=/tmp/ruby/src/trunk-random2/test/.excludes
--name=!/memory_leak/
--stderr-on-failure
--test-order=random
# Running tests:
Leaked file descriptor: WebauthnListenerTest#test_wait_for_otp_code_get_follows_options: 9 : #<TCPSocket:fd 9, AF_INET, 127.0.0.1, 40149>
Closed file descriptor: TestStringchar#test_dump: 9
Leaked file descriptor: DRbTests::TestDRbTCP#test_immediate_close: 12 : #<IO:fd 12>
Leaked thread: DRbTests::TestDRbTCP#test_immediate_close: #<Thread:0x00007f345be50998 /tmp/ruby/src/trunk-random2/lib/drb/drb.rb:1717 sleep>
Finished tests in 1165.426714s, 23.1555 tests/s, 8206.6730 assertions/s.
26986 tests, 9564276 assertions, 0 failures, 0 errors, 111 skips
ruby -v: ruby 3.3.0dev (2023-12-23T07:51:41Z master 40bc7ede38) [x86_64-linux]
$$$[end] "make yes-test-all TESTOPTS='--stderr-on-failure' TESTS=\"--test-order=random\"" exit with 0.
$$$[beg] make yes-test-rubyspec MSPECOPT='--error-output stderr --debug' TESTS="--test-order=random"
BASERUBY = /usr/bin/ruby --disable=gems
CC = gcc
LD = ld
LDSHARED = gcc -shared
CFLAGS = -O3 -fno-fast-math -ggdb3 -Wall -Wextra -Wdeprecated-declarations -Wdiv-by-zero -Wduplicated-cond -Wimplicit-function-declaration -Wimplicit-int -Wpointer-arith -Wwrite-strings -Wold-style-definition -Wimplicit-fallthrough=0 -Wmissing-noreturn -Wno-cast-function-type -Wno-constant-logical-operand -Wno-long-long -Wno-missing-field-initializers -Wno-overlength-strings -Wno-packed-bitfield-compat -Wno-parentheses-equality -Wno-self-assign -Wno-tautological-compare -Wno-unused-parameter -Wno-unused-value -Wsuggest-attribute=format -Wsuggest-attribute=noreturn -Wunused-variable -Wmisleading-indentation -Wundef -fPIC
XCFLAGS = -U_FORTIFY_SOURCE -D_FORTIFY_SOURCE=2 -fstack-protector-strong -fno-strict-overflow -fvisibility=hidden -fexcess-precision=standard -DRUBY_EXPORT -I. -I.ext/include/x86_64-linux -I/tmp/ruby/src/trunk-random2/include -I/tmp/ruby/src/trunk-random2 -I/tmp/ruby/src/trunk-random2/prism -I/tmp/ruby/src/trunk-random2/enc/unicode/15.0.0
CPPFLAGS =
DLDFLAGS = -Wl,--compress-debug-sections=zlib -Wl,-soname,libruby.so.3.3 -fstack-protector-strong
SOLIBS = -lz -lrt -lrt -lgmp -ldl -lcrypt -lm -lpthread
LANG =
LC_ALL =
LC_CTYPE =
MFLAGS =
RUSTC = rustc
YJIT_RUSTC_ARGS = --crate-name=yjit --crate-type=staticlib --edition=2021 -g -C lto=thin -C opt-level=3 -C overflow-checks=on '--out-dir=/tmp/ruby/build/trunk-random2/yjit/target/release/' /tmp/ruby/src/trunk-random2/yjit/src/lib.rs
gcc (Ubuntu 11.3.0-1ubuntu1~22.04.1) 11.3.0
Copyright (C) 2021 Free Software Foundation, Inc.
This is free software; see the source for copying conditions. There is NO
warranty; not even for MERCHANTABILITY or FITNESS FOR A PARTICULAR PURPOSE.
generating enc.mk
making enc
make[1]: Entering directory '/tmp/ruby/build/trunk-random2'
make[1]: Nothing to be done for 'enc'.
make[1]: Leaving directory '/tmp/ruby/build/trunk-random2'
making srcs under enc
make[1]: Entering directory '/tmp/ruby/build/trunk-random2'
make[1]: Nothing to be done for 'srcs'.
make[1]: Leaving directory '/tmp/ruby/build/trunk-random2'
generating transdb.h
transdb.h unchanged
making trans
make[1]: Entering directory '/tmp/ruby/build/trunk-random2'
make[1]: Nothing to be done for '/tmp/ruby/src/trunk-random2/enc/trans'.
make[1]: Leaving directory '/tmp/ruby/build/trunk-random2'
making encs
make[1]: Entering directory '/tmp/ruby/build/trunk-random2'
make[1]: Nothing to be done for 'encs'.
make[1]: Leaving directory '/tmp/ruby/build/trunk-random2'
generating makefiles ext/configure-ext.mk
ext/configure-ext.mk updated
make[1]: Entering directory '/tmp/ruby/build/trunk-random2'
make[1]: Leaving directory '/tmp/ruby/build/trunk-random2'
generating makefile exts.mk
exts.mk unchanged
make[1]: Entering directory '/tmp/ruby/build/trunk-random2'
make[2]: Entering directory '/tmp/ruby/build/trunk-random2/ext/bigdecimal'
make[2]: Leaving directory '/tmp/ruby/build/trunk-random2/ext/bigdecimal'
make[2]: Entering directory '/tmp/ruby/build/trunk-random2/ext/coverage'
make[2]: Leaving directory '/tmp/ruby/build/trunk-random2/ext/coverage'
make[2]: Entering directory '/tmp/ruby/build/trunk-random2/ext/date'
make[2]: Leaving directory '/tmp/ruby/build/trunk-random2/ext/date'
make[2]: Entering directory '/tmp/ruby/build/trunk-random2/ext/digest'
make[2]: Leaving directory '/tmp/ruby/build/trunk-random2/ext/digest'
make[2]: Entering directory '/tmp/ruby/build/trunk-random2/ext/digest/sha2'
make[2]: Leaving directory '/tmp/ruby/build/trunk-random2/ext/digest/sha2'
make[2]: Entering directory '/tmp/ruby/build/trunk-random2/ext/fiddle'
make[2]: Leaving directory '/tmp/ruby/build/trunk-random2/ext/fiddle'
make[2]: Entering directory '/tmp/ruby/build/trunk-random2/ext/io/console'
make[2]: Leaving directory '/tmp/ruby/build/trunk-random2/ext/io/console'
make[2]: Entering directory '/tmp/ruby/build/trunk-random2/ext/json'
make[2]: Leaving directory '/tmp/ruby/build/trunk-random2/ext/json'
make[2]: Entering directory '/tmp/ruby/build/trunk-random2/ext/monitor'
make[2]: Leaving directory '/tmp/ruby/build/trunk-random2/ext/monitor'
make[2]: Entering directory '/tmp/ruby/build/trunk-random2/ext/nkf'
make[2]: Leaving directory '/tmp/ruby/build/trunk-random2/ext/nkf'
make[2]: Entering directory '/tmp/ruby/build/trunk-random2/ext/objspace'
make[2]: Leaving directory '/tmp/ruby/build/trunk-random2/ext/objspace'
make[2]: Entering directory '/tmp/ruby/build/trunk-random2/ext/openssl'
make[2]: Leaving directory '/tmp/ruby/build/trunk-random2/ext/openssl'
make[2]: Entering directory '/tmp/ruby/build/trunk-random2/ext/pathname'
make[2]: Leaving directory '/tmp/ruby/build/trunk-random2/ext/pathname'
make[2]: Entering directory '/tmp/ruby/build/trunk-random2/ext/psych'
make[2]: Leaving directory '/tmp/ruby/build/trunk-random2/ext/psych'
make[2]: Entering directory '/tmp/ruby/build/trunk-random2/ext/pty'
make[2]: Leaving directory '/tmp/ruby/build/trunk-random2/ext/pty'
make[2]: Entering directory '/tmp/ruby/build/trunk-random2/ext/ripper'
make[2]: Leaving directory '/tmp/ruby/build/trunk-random2/ext/ripper'
make[2]: Entering directory '/tmp/ruby/build/trunk-random2/ext/rubyvm'
make[2]: Leaving directory '/tmp/ruby/build/trunk-random2/ext/rubyvm'
make[2]: Entering directory '/tmp/ruby/build/trunk-random2/ext/socket'
make[2]: Leaving directory '/tmp/ruby/build/trunk-random2/ext/socket'
make[2]: Entering directory '/tmp/ruby/build/trunk-random2/ext/syslog'
make[2]: Leaving directory '/tmp/ruby/build/trunk-random2/ext/syslog'
make[2]: Entering directory '/tmp/ruby/build/trunk-random2/.bundle/gems/debug-1.9.0/ext/debug'
make[2]: Leaving directory '/tmp/ruby/build/trunk-random2/.bundle/gems/debug-1.9.0/ext/debug'
make[2]: Entering directory '/tmp/ruby/build/trunk-random2/.bundle/gems/debug-1.9.1/ext/debug'
make[2]: Leaving directory '/tmp/ruby/build/trunk-random2/.bundle/gems/debug-1.9.1/ext/debug'
make[2]: Entering directory '/tmp/ruby/build/trunk-random2/.bundle/gems/racc-1.7.3/ext/racc/cparse'
make[2]: Leaving directory '/tmp/ruby/build/trunk-random2/.bundle/gems/racc-1.7.3/ext/racc/cparse'
make[2]: Entering directory '/tmp/ruby/build/trunk-random2/.bundle/gems/rbs-3.4.0/ext/rbs_extension'
make[2]: Leaving directory '/tmp/ruby/build/trunk-random2/.bundle/gems/rbs-3.4.0/ext/rbs_extension'
make[2]: Entering directory '/tmp/ruby/build/trunk-random2'
make[2]: 'ruby' is up to date.
make[2]: Leaving directory '/tmp/ruby/build/trunk-random2'
make[1]: Leaving directory '/tmp/ruby/build/trunk-random2'
make[1]: Entering directory '/tmp/ruby/build/trunk-random2'
make[1]: Nothing to be done for 'note'.
make[1]: Leaving directory '/tmp/ruby/build/trunk-random2'
$ /tmp/ruby/build/trunk-random2/miniruby -I/tmp/ruby/src/trunk-random2/lib /tmp/ruby/src/trunk-random2/tool/runruby.rb --archdir=/tmp/ruby/build/trunk-random2 --extout=.ext -- /tmp/ruby/src/trunk-random2/spec/mspec/bin/mspec-run -B /tmp/ruby/src/trunk-random2/spec/default.mspec --error-output stderr --debug
ruby 3.3.0dev (2023-12-23T07:51:41Z master 40bc7ede38) [x86_64-linux]
0 .........................................................................
73 .........................................................................
146 .........................................................................
219 .........................................................................
292 .........................................................................
365 .........................................................................
438 .........................................................................
511 .........................................................................
584 .........................................................................
657 .........................................................................
730 .........................................................................
803 .........................................................................
876 .........................................................................
949 .........................................................................
1022 .........................................................................
1095 .........................................................................
1168 .........................................................................
1241 .........................................................................
1314 .........................................................................
1387 .........................................................................
1460 .........................................................................
1533 .........................................................................
1606 .........................................................................
1679 .........................................................................
1752 .........................................................................
1825 .........................................................................
1898 .........................................................................
1971 .........................................................................
2044 .........................................................................
2117 .........................................................................
2190 .........................................................................
2263 .........................................................................
2336 .........................................................................
2409 .........................................................................
2482 .........................................................................
2555 .........................................................................
2628 .........................................................................
2701 .........................................................................
2774 .........................................................................
2847 .........................................................................
2920 .........................................................................
2993 ........................................................................F
3067 .................F......F................................................
3142 .........................................................................
3215 .........................................................................
3288 .........................................................................
3361 .........................................................................
3434 .........................................................................
3507 .........................................................................
3580 .........................................................................
3653 .........................................................................
3726 .....
1)
Set#flatten! when Set contains a Set-like object flattens self, including Set-like objects FAILED
Expected nil == #<Set: {1}>
to be truthy but was false
/tmp/ruby/src/trunk-random2/spec/mspec/lib/mspec/expectations/expectations.rb:33:in `fail_predicate'
/tmp/ruby/src/trunk-random2/spec/mspec/lib/mspec/expectations/expectations.rb:37:in `fail_single_arg_predicate'
/tmp/ruby/src/trunk-random2/spec/mspec/lib/mspec/matchers/base.rb:21:in `=='
/tmp/ruby/src/trunk-random2/spec/ruby/library/set/flatten_spec.rb:50:in `block (3 levels) in <top (required)>'
/tmp/ruby/src/trunk-random2/spec/mspec/lib/mspec/runner/mspec.rb:117:in `instance_exec'
/tmp/ruby/src/trunk-random2/spec/mspec/lib/mspec/runner/mspec.rb:117:in `protect'
/tmp/ruby/src/trunk-random2/spec/mspec/lib/mspec/runner/context.rb:176:in `block in protect'
/tmp/ruby/src/trunk-random2/spec/mspec/lib/mspec/runner/context.rb:176:in `all?'
/tmp/ruby/src/trunk-random2/spec/mspec/lib/mspec/runner/context.rb:176:in `protect'
/tmp/ruby/src/trunk-random2/spec/mspec/lib/mspec/runner/context.rb:212:in `block (2 levels) in process'
/tmp/ruby/src/trunk-random2/spec/mspec/lib/mspec/runner/mspec.rb:285:in `repeat'
/tmp/ruby/src/trunk-random2/spec/mspec/lib/mspec/runner/context.rb:204:in `block in process'
/tmp/ruby/src/trunk-random2/spec/mspec/lib/mspec/runner/context.rb:203:in `each'
/tmp/ruby/src/trunk-random2/spec/mspec/lib/mspec/runner/context.rb:203:in `process'
/tmp/ruby/src/trunk-random2/spec/mspec/lib/mspec/runner/context.rb:235:in `block in process'
/tmp/ruby/src/trunk-random2/spec/mspec/lib/mspec/runner/context.rb:235:in `each'
/tmp/ruby/src/trunk-random2/spec/mspec/lib/mspec/runner/context.rb:235:in `process'
/tmp/ruby/src/trunk-random2/spec/mspec/lib/mspec/runner/mspec.rb:56:in `describe'
/tmp/ruby/src/trunk-random2/spec/mspec/lib/mspec/runner/object.rb:11:in `describe'
/tmp/ruby/src/trunk-random2/spec/ruby/library/set/flatten_spec.rb:26:in `<top (required)>'
/tmp/ruby/src/trunk-random2/spec/mspec/lib/mspec/runner/mspec.rb:100:in `load'
/tmp/ruby/src/trunk-random2/spec/mspec/lib/mspec/runner/mspec.rb:100:in `block (2 levels) in files'
/tmp/ruby/src/trunk-random2/spec/mspec/lib/mspec/runner/mspec.rb:117:in `instance_exec'
/tmp/ruby/src/trunk-random2/spec/mspec/lib/mspec/runner/mspec.rb:117:in `protect'
/tmp/ruby/src/trunk-random2/spec/mspec/lib/mspec/runner/mspec.rb:100:in `block in files'
/tmp/ruby/src/trunk-random2/spec/mspec/lib/mspec/runner/mspec.rb:91:in `each'
/tmp/ruby/src/trunk-random2/spec/mspec/lib/mspec/runner/mspec.rb:91:in `each_file'
/tmp/ruby/src/trunk-random2/spec/mspec/lib/mspec/runner/mspec.rb:96:in `files'
/tmp/ruby/src/trunk-random2/spec/mspec/lib/mspec/runner/mspec.rb:64:in `process'
/tmp/ruby/src/trunk-random2/spec/mspec/lib/mspec/commands/mspec-run.rb:84:in `run'
/tmp/ruby/src/trunk-random2/spec/mspec/lib/mspec/utils/script.rb:291:in `main'
/tmp/ruby/src/trunk-random2/spec/mspec/bin/mspec-run:7:in `<main>'
2)
Set#proper_subset? when comparing to a Set-like object returns true if passed a Set-like object that self is a proper subset of FAILED
Expected false to be true
/tmp/ruby/src/trunk-random2/spec/mspec/lib/mspec/expectations/expectations.rb:22:in `fail_with'
/tmp/ruby/src/trunk-random2/spec/mspec/lib/mspec/expectations/should.rb:18:in `should'
/tmp/ruby/src/trunk-random2/spec/ruby/library/set/proper_subset_spec.rb:38:in `block (3 levels) in <top (required)>'
/tmp/ruby/src/trunk-random2/spec/mspec/lib/mspec/runner/mspec.rb:117:in `instance_exec'
/tmp/ruby/src/trunk-random2/spec/mspec/lib/mspec/runner/mspec.rb:117:in `protect'
/tmp/ruby/src/trunk-random2/spec/mspec/lib/mspec/runner/context.rb:176:in `block in protect'
/tmp/ruby/src/trunk-random2/spec/mspec/lib/mspec/runner/context.rb:176:in `all?'
/tmp/ruby/src/trunk-random2/spec/mspec/lib/mspec/runner/context.rb:176:in `protect'
/tmp/ruby/src/trunk-random2/spec/mspec/lib/mspec/runner/context.rb:212:in `block (2 levels) in process'
/tmp/ruby/src/trunk-random2/spec/mspec/lib/mspec/runner/mspec.rb:285:in `repeat'
/tmp/ruby/src/trunk-random2/spec/mspec/lib/mspec/runner/context.rb:204:in `block in process'
/tmp/ruby/src/trunk-random2/spec/mspec/lib/mspec/runner/context.rb:203:in `each'
/tmp/ruby/src/trunk-random2/spec/mspec/lib/mspec/runner/context.rb:203:in `process'
/tmp/ruby/src/trunk-random2/spec/mspec/lib/mspec/runner/context.rb:235:in `block in process'
/tmp/ruby/src/trunk-random2/spec/mspec/lib/mspec/runner/context.rb:235:in `each'
/tmp/ruby/src/trunk-random2/spec/mspec/lib/mspec/runner/context.rb:235:in `process'
/tmp/ruby/src/trunk-random2/spec/mspec/lib/mspec/runner/mspec.rb:56:in `describe'
/tmp/ruby/src/trunk-random2/spec/mspec/lib/mspec/runner/object.rb:11:in `describe'
/tmp/ruby/src/trunk-random2/spec/ruby/library/set/proper_subset_spec.rb:5:in `<top (required)>'
/tmp/ruby/src/trunk-random2/spec/mspec/lib/mspec/runner/mspec.rb:100:in `load'
/tmp/ruby/src/trunk-random2/spec/mspec/lib/mspec/runner/mspec.rb:100:in `block (2 levels) in files'
/tmp/ruby/src/trunk-random2/spec/mspec/lib/mspec/runner/mspec.rb:117:in `instance_exec'
/tmp/ruby/src/trunk-random2/spec/mspec/lib/mspec/runner/mspec.rb:117:in `protect'
/tmp/ruby/src/trunk-random2/spec/mspec/lib/mspec/runner/mspec.rb:100:in `block in files'
/tmp/ruby/src/trunk-random2/spec/mspec/lib/mspec/runner/mspec.rb:91:in `each'
/tmp/ruby/src/trunk-random2/spec/mspec/lib/mspec/runner/mspec.rb:91:in `each_file'
/tmp/ruby/src/trunk-random2/spec/mspec/lib/mspec/runner/mspec.rb:96:in `files'
/tmp/ruby/src/trunk-random2/spec/mspec/lib/mspec/runner/mspec.rb:64:in `process'
/tmp/ruby/src/trunk-random2/spec/mspec/lib/mspec/commands/mspec-run.rb:84:in `run'
/tmp/ruby/src/trunk-random2/spec/mspec/lib/mspec/utils/script.rb:291:in `main'
/tmp/ruby/src/trunk-random2/spec/mspec/bin/mspec-run:7:in `<main>'
3)
Set#subset? when comparing to a Set-like object returns true if passed a Set-like object that self is a subset of FAILED
Expected false to be true
/tmp/ruby/src/trunk-random2/spec/mspec/lib/mspec/expectations/expectations.rb:22:in `fail_with'
/tmp/ruby/src/trunk-random2/spec/mspec/lib/mspec/expectations/should.rb:18:in `should'
/tmp/ruby/src/trunk-random2/spec/ruby/library/set/subset_spec.rb:38:in `block (3 levels) in <top (required)>'
/tmp/ruby/src/trunk-random2/spec/mspec/lib/mspec/runner/mspec.rb:117:in `instance_exec'
/tmp/ruby/src/trunk-random2/spec/mspec/lib/mspec/runner/mspec.rb:117:in `protect'
/tmp/ruby/src/trunk-random2/spec/mspec/lib/mspec/runner/context.rb:176:in `block in protect'
/tmp/ruby/src/trunk-random2/spec/mspec/lib/mspec/runner/context.rb:176:in `all?'
/tmp/ruby/src/trunk-random2/spec/mspec/lib/mspec/runner/context.rb:176:in `protect'
/tmp/ruby/src/trunk-random2/spec/mspec/lib/mspec/runner/context.rb:212:in `block (2 levels) in process'
/tmp/ruby/src/trunk-random2/spec/mspec/lib/mspec/runner/mspec.rb:285:in `repeat'
/tmp/ruby/src/trunk-random2/spec/mspec/lib/mspec/runner/context.rb:204:in `block in process'
/tmp/ruby/src/trunk-random2/spec/mspec/lib/mspec/runner/context.rb:203:in `each'
/tmp/ruby/src/trunk-random2/spec/mspec/lib/mspec/runner/context.rb:203:in `process'
/tmp/ruby/src/trunk-random2/spec/mspec/lib/mspec/runner/context.rb:235:in `block in process'
/tmp/ruby/src/trunk-random2/spec/mspec/lib/mspec/runner/context.rb:235:in `each'
/tmp/ruby/src/trunk-random2/spec/mspec/lib/mspec/runner/context.rb:235:in `process'
/tmp/ruby/src/trunk-random2/spec/mspec/lib/mspec/runner/mspec.rb:56:in `describe'
/tmp/ruby/src/trunk-random2/spec/mspec/lib/mspec/runner/object.rb:11:in `describe'
/tmp/ruby/src/trunk-random2/spec/ruby/library/set/subset_spec.rb:5:in `<top (required)>'
/tmp/ruby/src/trunk-random2/spec/mspec/lib/mspec/runner/mspec.rb:100:in `load'
/tmp/ruby/src/trunk-random2/spec/mspec/lib/mspec/runner/mspec.rb:100:in `block (2 levels) in files'
/tmp/ruby/src/trunk-random2/spec/mspec/lib/mspec/runner/mspec.rb:117:in `instance_exec'
/tmp/ruby/src/trunk-random2/spec/mspec/lib/mspec/runner/mspec.rb:117:in `protect'
/tmp/ruby/src/trunk-random2/spec/mspec/lib/mspec/runner/mspec.rb:100:in `block in files'
/tmp/ruby/src/trunk-random2/spec/mspec/lib/mspec/runner/mspec.rb:91:in `each'
/tmp/ruby/src/trunk-random2/spec/mspec/lib/mspec/runner/mspec.rb:91:in `each_file'
/tmp/ruby/src/trunk-random2/spec/mspec/lib/mspec/runner/mspec.rb:96:in `files'
/tmp/ruby/src/trunk-random2/spec/mspec/lib/mspec/runner/mspec.rb:64:in `process'
/tmp/ruby/src/trunk-random2/spec/mspec/lib/mspec/commands/mspec-run.rb:84:in `run'
/tmp/ruby/src/trunk-random2/spec/mspec/lib/mspec/utils/script.rb:291:in `main'
/tmp/ruby/src/trunk-random2/spec/mspec/bin/mspec-run:7:in `<main>'
Finished in 101.920178 seconds
3728 files, 32495 examples, 172317 expectations, 3 failures, 0 errors, 0 tagged
make: *** [uncommon.mk:988: yes-test-spec] Error 1
$$$[end] "make yes-test-rubyspec MSPECOPT='--error-output stderr --debug' TESTS=\"--test-order=random\"" exit with 512.