# Logfile created on 2023-06-12 09:28:04 +0000 by logger.rb/v1.5.3
#<BuildRuby:0x0000fffd3081fdc0 @REPOSITORY="https://github.com/ruby/ruby.git", @REPOSITORY_TYPE=:git, @git_branch=nil, @git_worktree=nil, @svn_revision=nil, @SRC_DIR="/home/opc/ruby/src", @BUILD_DIR="/home/opc/ruby/build", @INSTALL_DIR="/home/opc/ruby/install", @TARGET_NAME="master", @TARGET_SRC_DIR="/home/opc/ruby/src/master", @TARGET_BUILD_DIR="/home/opc/ruby/build/master", @TARGET_INSTALL_DIR="/home/opc/ruby/install/master", @configure_opts=["--disable-dtrace --disable-yjit"], @build_opts="-j3", @btest_opts="-j3", @test_opts="TESTS='-j3'", @incremental=true, @steps=["checkout", "autoconf", "configure", "build_up", "build_miniruby", "build_ruby", "build_all", "build_install", "test_btest", "test_basic", "test_all", "test_rubyspec"], @quiet=false, @gist=false, @timeout=10800, @logfile="/home/opc/ruby/logs/brlog.master.20230612-092804", @ruby_env=[["RUBY_DEBUG", "ci"]], @make="make", @logger=#<Logger:0x0000fffd3086f1b8 @level=0, @progname=nil, @default_formatter=#<Logger::Formatter:0x0000fffd3086f000 @datetime_format=nil>, @formatter=nil, @logdev=#<Logger::LogDevice:0x0000fffd307207d0 @shift_period_suffix="%Y%m%d", @shift_size=1048576, @shift_age=0, @filename="/home/opc/ruby/logs/brlog.master.20230612-092804", @dev=#<File:/home/opc/ruby/logs/brlog.master.20230612-092804>, @binmode=false, @mon_data=#<Monitor:0x0000fffd3086ec68>, @mon_data_owner_object_id=860>>>
$$$[beg] make update-unicode -j3
make: Nothing to be done for 'update-unicode'.
$$$[end] "make update-unicode -j3" exit with 0.
$$$[beg] make update-download -j3
tool/config.guess already exists
tool/config.sub already exists
Update typeprof to aabc019684d8b4a1ed66c2a1ca48da7bbb18dcc0
From https://github.com/ruby/typeprof
* branch aabc019684d8b4a1ed66c2a1ca48da7bbb18dcc0 -> FETCH_HEAD
HEAD is now at aabc019 Skip VM_CALL_BLOCKISEQ for Ruby < 3.3
echo aabc019684d8b4a1ed66c2a1ca48da7bbb18dcc0 | /bin/sh /home/opc/ruby/src/master/tool/ifchange /home/opc/ruby/src/master/.bundle/.timestamp/typeprof.revision -
/home/opc/ruby/src/master/.bundle/.timestamp/typeprof.revision unchanged
$$$[end] "make update-download -j3" exit with 0.
$$$[beg] make update-rubyspec -j3
make: Nothing to be done for 'update-rubyspec'.
$$$[end] "make update-rubyspec -j3" exit with 0.
$$$[beg] make update-src -j3
From https://github.com/ruby/ruby
b308f7c..a4bb2d7 master -> origin/master
Updating b308f7c..a4bb2d7
Fast-forward
.github/workflows/ubuntu.yml | 2 +
.gitignore | 2 +
ast.c | 2 +-
common.mk | 488 +++++++++-
ext/coverage/depend | 13 +
ext/objspace/depend | 20 +-
ext/ripper/depend | 532 +++++++++++
ext/ripper/eventids2.c | 12 +-
ext/ripper/eventids2.h | 8 +
ext/ripper/extconf.rb | 4 +-
ext/ripper/ripper_init.c.tmpl | 650 +++++++++++++
ext/ripper/ripper_init.h | 8 +
ext/ripper/tools/generate.rb | 39 +-
ext/ripper/tools/preproc.rb | 33 +-
ext/socket/depend | 15 +
internal/gc.h | 12 +
internal/parse.h | 123 ++-
internal/ruby_parser.h | 68 ++
iseq.c | 2 +-
load.c | 2 +-
node.c | 1275 +++----------------------
node.h | 537 ++---------
node_dump.c | 1122 ++++++++++++++++++++++
parse.y | 1391 ++++++++++++---------------
parser_bits.h | 564 +++++++++++
parser_node.h | 133 +++
parser_st.c | 2118 +++++++++++++++++++++++++++++++++++++++++
parser_st.h | 165 ++++
parser_value.h | 106 +++
ruby.c | 2 +-
ruby_parser.c | 983 +++++++++++++++++++
rubyparser.h | 642 +++++++++++++
template/prelude.c.tmpl | 1 +
tool/update-deps | 1 +
universal_parser.c | 400 ++++++++
vm.c | 2 +-
36 files changed, 9042 insertions(+), 2435 deletions(-)
create mode 100644 ext/ripper/eventids2.h
create mode 100644 ext/ripper/ripper_init.c.tmpl
create mode 100644 ext/ripper/ripper_init.h
create mode 100644 internal/ruby_parser.h
create mode 100644 node_dump.c
create mode 100644 parser_bits.h
create mode 100644 parser_node.h
create mode 100644 parser_st.c
create mode 100644 parser_st.h
create mode 100644 parser_value.h
create mode 100644 ruby_parser.c
create mode 100644 rubyparser.h
create mode 100644 universal_parser.c
Latest commit hash = a4bb2d7d63
$$$[end] "make update-src -j3" exit with 0.
$$$[beg] make after-update -j3
sed 's/{\$([^(){}]*)[^{}]*}//g' /home/opc/ruby/src/master/common.mk > uncommon.mk
generating node_name.inc
generating parse.c
generating /home/opc/ruby/src/master/ext/ripper/ripper.c
make[1]: Entering directory '/home/opc/ruby/src/master/ext/ripper'
extracting ripper.y from ../../parse.y
/home/opc/ruby/src/master/revision.h updated
make[1]: Entering directory '/home/opc/ruby/src/master/ext/socket'
make[1]: Nothing to be done for 'srcs'.
make[1]: Leaving directory '/home/opc/ruby/src/master/ext/socket'
generating miniprelude.c
generating eventids1.c from ../../parse.y
generating eventids2table.c from ./eventids2.c
miniprelude.c updated
generating golf_prelude.c
compiling compiler ripper.y
golf_prelude.c updated
/bin/sh /home/opc/ruby/src/master/tool/ifchange "--timestamp=.rbconfig.time" rbconfig.rb rbconfig.tmp
rbconfig.rb unchanged
generating aarch64-linux-fake.rb
aarch64-linux-fake.rb updated
generating enc.mk
making srcs under enc
make[1]: Entering directory '/home/opc/ruby/build/master'
make[1]: Nothing to be done for 'srcs'.
make[1]: Leaving directory '/home/opc/ruby/build/master'
make[1]: Leaving directory '/home/opc/ruby/src/master/ext/ripper'
Update typeprof to aabc019684d8b4a1ed66c2a1ca48da7bbb18dcc0
From https://github.com/ruby/typeprof
* branch aabc019684d8b4a1ed66c2a1ca48da7bbb18dcc0 -> FETCH_HEAD
HEAD is now at aabc019 Skip VM_CALL_BLOCKISEQ for Ruby < 3.3
echo aabc019684d8b4a1ed66c2a1ca48da7bbb18dcc0 | /bin/sh /home/opc/ruby/src/master/tool/ifchange /home/opc/ruby/src/master/.bundle/.timestamp/typeprof.revision -
/home/opc/ruby/src/master/.bundle/.timestamp/typeprof.revision unchanged
$$$[end] "make after-update -j3" exit with 0.
$$$[beg] make miniruby -j3
BASERUBY = /usr/local/bin/ruby --disable=gems
CC = gcc
LD = ld
LDSHARED = gcc -shared
CFLAGS = -O3 -fno-fast-math -ggdb3 -Wall -Wextra -Wdeprecated-declarations -Wdiv-by-zero -Wduplicated-cond -Wimplicit-function-declaration -Wimplicit-int -Wmisleading-indentation -Wpointer-arith -Wwrite-strings -Wold-style-definition -Wimplicit-fallthrough=0 -Wmissing-noreturn -Wno-cast-function-type -Wno-constant-logical-operand -Wno-long-long -Wno-missing-field-initializers -Wno-overlength-strings -Wno-packed-bitfield-compat -Wno-parentheses-equality -Wno-self-assign -Wno-tautological-compare -Wno-unused-parameter -Wno-unused-value -Wsuggest-attribute=format -Wsuggest-attribute=noreturn -Wunused-variable -Wundef
XCFLAGS = -U_FORTIFY_SOURCE -D_FORTIFY_SOURCE=2 -fstack-protector-strong -msign-return-address=all -fno-strict-overflow -fvisibility=hidden -fexcess-precision=standard -DRUBY_EXPORT -fPIE -I. -I.ext/include/aarch64-linux -I/home/opc/ruby/src/master/include -I/home/opc/ruby/src/master -I/home/opc/ruby/src/master/enc/unicode/15.0.0
CPPFLAGS =
DLDFLAGS = -Wl,--compress-debug-sections=zlib -fstack-protector-strong -pie
SOLIBS = -lz -lrt -lrt -ldl -lcrypt -lm -lpthread
LANG = en_US.UTF-8
LC_ALL =
LC_CTYPE =
MFLAGS = -j3 --jobserver-auth=4,5
RUSTC = rustc
YJIT_RUSTC_ARGS = --crate-name=yjit --crate-type=staticlib --edition=2021 -g -C lto=thin -C opt-level=3 -C overflow-checks=on '--out-dir=/home/opc/ruby/build/master/yjit/target/release/' /home/opc/ruby/src/master/yjit/src/lib.rs
gcc (GCC) 8.5.0 20210514 (Red Hat 8.5.0-10.1.0.1)
Copyright (C) 2018 Free Software Foundation, Inc.
This is free software; see the source for copying conditions. There is NO
warranty; not even for MERCHANTABILITY or FITNESS FOR A PARTICULAR PURPOSE.
compiling /home/opc/ruby/src/master/miniinit.c
compiling /home/opc/ruby/src/master/array.c
compiling /home/opc/ruby/src/master/ast.c
compiling /home/opc/ruby/src/master/bignum.c
compiling /home/opc/ruby/src/master/class.c
compiling /home/opc/ruby/src/master/compile.c
compiling /home/opc/ruby/src/master/complex.c
compiling /home/opc/ruby/src/master/cont.c
compiling /home/opc/ruby/src/master/debug.c
compiling /home/opc/ruby/src/master/dir.c
compiling /home/opc/ruby/src/master/encoding.c
compiling /home/opc/ruby/src/master/enum.c
compiling /home/opc/ruby/src/master/enumerator.c
compiling /home/opc/ruby/src/master/error.c
compiling /home/opc/ruby/src/master/eval.c
compiling /home/opc/ruby/src/master/file.c
compiling /home/opc/ruby/src/master/gc.c
compiling /home/opc/ruby/src/master/hash.c
compiling /home/opc/ruby/src/master/io.c
compiling /home/opc/ruby/src/master/iseq.c
compiling /home/opc/ruby/src/master/load.c
compiling /home/opc/ruby/src/master/marshal.c
compiling /home/opc/ruby/src/master/math.c
compiling /home/opc/ruby/src/master/memory_view.c
compiling /home/opc/ruby/src/master/rjit.c
compiling /home/opc/ruby/src/master/rjit_c.c
compiling /home/opc/ruby/src/master/node.c
compiling /home/opc/ruby/src/master/node_dump.c
compiling /home/opc/ruby/src/master/numeric.c
compiling /home/opc/ruby/src/master/object.c
compiling /home/opc/ruby/src/master/pack.c
compiling parse.c
compiling /home/opc/ruby/src/master/parser_st.c
compiling /home/opc/ruby/src/master/proc.c
compiling /home/opc/ruby/src/master/process.c
compiling /home/opc/ruby/src/master/ractor.c
compiling /home/opc/ruby/src/master/random.c
compiling /home/opc/ruby/src/master/range.c
compiling /home/opc/ruby/src/master/rational.c
compiling /home/opc/ruby/src/master/re.c
compiling /home/opc/ruby/src/master/ruby.c
compiling /home/opc/ruby/src/master/ruby_parser.c
compiling /home/opc/ruby/src/master/scheduler.c
compiling /home/opc/ruby/src/master/shape.c
compiling /home/opc/ruby/src/master/signal.c
compiling /home/opc/ruby/src/master/sprintf.c
compiling /home/opc/ruby/src/master/string.c
compiling /home/opc/ruby/src/master/struct.c
compiling /home/opc/ruby/src/master/symbol.c
compiling /home/opc/ruby/src/master/thread.c
compiling /home/opc/ruby/src/master/time.c
compiling /home/opc/ruby/src/master/transcode.c
compiling /home/opc/ruby/src/master/transient_heap.c
compiling /home/opc/ruby/src/master/variable.c
compiling /home/opc/ruby/src/master/version.c
compiling /home/opc/ruby/src/master/vm.c
compiling /home/opc/ruby/src/master/vm_backtrace.c
compiling /home/opc/ruby/src/master/vm_dump.c
compiling /home/opc/ruby/src/master/vm_sync.c
compiling /home/opc/ruby/src/master/vm_trace.c
compiling /home/opc/ruby/src/master/weakmap.c
linking miniruby
$$$[end] "make miniruby -j3" exit with 0.
$$$[beg] make ruby -j3
BASERUBY = /usr/local/bin/ruby --disable=gems
CC = gcc
LD = ld
LDSHARED = gcc -shared
CFLAGS = -O3 -fno-fast-math -ggdb3 -Wall -Wextra -Wdeprecated-declarations -Wdiv-by-zero -Wduplicated-cond -Wimplicit-function-declaration -Wimplicit-int -Wmisleading-indentation -Wpointer-arith -Wwrite-strings -Wold-style-definition -Wimplicit-fallthrough=0 -Wmissing-noreturn -Wno-cast-function-type -Wno-constant-logical-operand -Wno-long-long -Wno-missing-field-initializers -Wno-overlength-strings -Wno-packed-bitfield-compat -Wno-parentheses-equality -Wno-self-assign -Wno-tautological-compare -Wno-unused-parameter -Wno-unused-value -Wsuggest-attribute=format -Wsuggest-attribute=noreturn -Wunused-variable -Wundef
XCFLAGS = -U_FORTIFY_SOURCE -D_FORTIFY_SOURCE=2 -fstack-protector-strong -msign-return-address=all -fno-strict-overflow -fvisibility=hidden -fexcess-precision=standard -DRUBY_EXPORT -fPIE -I. -I.ext/include/aarch64-linux -I/home/opc/ruby/src/master/include -I/home/opc/ruby/src/master -I/home/opc/ruby/src/master/enc/unicode/15.0.0
CPPFLAGS =
DLDFLAGS = -Wl,--compress-debug-sections=zlib -fstack-protector-strong -pie
SOLIBS = -lz -lrt -lrt -ldl -lcrypt -lm -lpthread
LANG = en_US.UTF-8
LC_ALL =
LC_CTYPE =
MFLAGS = -j3 --jobserver-auth=4,5
RUSTC = rustc
YJIT_RUSTC_ARGS = --crate-name=yjit --crate-type=staticlib --edition=2021 -g -C lto=thin -C opt-level=3 -C overflow-checks=on '--out-dir=/home/opc/ruby/build/master/yjit/target/release/' /home/opc/ruby/src/master/yjit/src/lib.rs
gcc (GCC) 8.5.0 20210514 (Red Hat 8.5.0-10.1.0.1)
Copyright (C) 2018 Free Software Foundation, Inc.
This is free software; see the source for copying conditions. There is NO
warranty; not even for MERCHANTABILITY or FITNESS FOR A PARTICULAR PURPOSE.
creating verconf.h
verconf.h updated
compiling /home/opc/ruby/src/master/loadpath.c
builtin_binary.inc updated
compiling /home/opc/ruby/src/master/builtin.c
linking static-library libruby-static.a
linking ruby
$$$[end] "make ruby -j3" exit with 0.
$$$[beg] make all -j3
BASERUBY = /usr/local/bin/ruby --disable=gems
CC = gcc
LD = ld
LDSHARED = gcc -shared
CFLAGS = -O3 -fno-fast-math -ggdb3 -Wall -Wextra -Wdeprecated-declarations -Wdiv-by-zero -Wduplicated-cond -Wimplicit-function-declaration -Wimplicit-int -Wmisleading-indentation -Wpointer-arith -Wwrite-strings -Wold-style-definition -Wimplicit-fallthrough=0 -Wmissing-noreturn -Wno-cast-function-type -Wno-constant-logical-operand -Wno-long-long -Wno-missing-field-initializers -Wno-overlength-strings -Wno-packed-bitfield-compat -Wno-parentheses-equality -Wno-self-assign -Wno-tautological-compare -Wno-unused-parameter -Wno-unused-value -Wsuggest-attribute=format -Wsuggest-attribute=noreturn -Wunused-variable -Wundef
XCFLAGS = -U_FORTIFY_SOURCE -D_FORTIFY_SOURCE=2 -fstack-protector-strong -msign-return-address=all -fno-strict-overflow -fvisibility=hidden -fexcess-precision=standard -DRUBY_EXPORT -fPIE -I. -I.ext/include/aarch64-linux -I/home/opc/ruby/src/master/include -I/home/opc/ruby/src/master -I/home/opc/ruby/src/master/enc/unicode/15.0.0
CPPFLAGS =
DLDFLAGS = -Wl,--compress-debug-sections=zlib -fstack-protector-strong -pie
SOLIBS = -lz -lrt -lrt -ldl -lcrypt -lm -lpthread
LANG = en_US.UTF-8
LC_ALL =
LC_CTYPE =
MFLAGS = -j3 --jobserver-auth=4,5
RUSTC = rustc
YJIT_RUSTC_ARGS = --crate-name=yjit --crate-type=staticlib --edition=2021 -g -C lto=thin -C opt-level=3 -C overflow-checks=on '--out-dir=/home/opc/ruby/build/master/yjit/target/release/' /home/opc/ruby/src/master/yjit/src/lib.rs
gcc (GCC) 8.5.0 20210514 (Red Hat 8.5.0-10.1.0.1)
Copyright (C) 2018 Free Software Foundation, Inc.
This is free software; see the source for copying conditions. There is NO
warranty; not even for MERCHANTABILITY or FITNESS FOR A PARTICULAR PURPOSE.
generating encdb.h
generating enc.mk
encdb.h unchanged
making srcs under enc
making enc
make[1]: Entering directory '/home/opc/ruby/build/master'
make[1]: Nothing to be done for 'enc'.
make[1]: Leaving directory '/home/opc/ruby/build/master'
make[1]: Entering directory '/home/opc/ruby/build/master'
make[1]: Nothing to be done for 'srcs'.
make[1]: Leaving directory '/home/opc/ruby/build/master'
generating transdb.h
transdb.h unchanged
generating makefiles ext/configure-ext.mk
making trans
ext/configure-ext.mk unchanged
make[1]: Entering directory '/home/opc/ruby/build/master'
make[1]: Entering directory '/home/opc/ruby/build/master'
make[1]: Nothing to be done for '/home/opc/ruby/src/master/enc/trans'.
make[1]: Leaving directory '/home/opc/ruby/build/master'
making encs
make[1]: Entering directory '/home/opc/ruby/build/master'
make[1]: Nothing to be done for 'encs'.
make[1]: Leaving directory '/home/opc/ruby/build/master'
make[2]: Entering directory '/home/opc/ruby/build/master/ext/-test-/rational'
compiling /home/opc/ruby/src/master/ext/-test-/rational/rat.c
make[2]: Entering directory '/home/opc/ruby/build/master/ext/bigdecimal'
make[2]: Leaving directory '/home/opc/ruby/build/master/ext/bigdecimal'
make[2]: Entering directory '/home/opc/ruby/build/master/ext/coverage'
compiling /home/opc/ruby/src/master/ext/coverage/coverage.c
make[2]: Entering directory '/home/opc/ruby/build/master/ext/date'
make[2]: Leaving directory '/home/opc/ruby/build/master/ext/date'
make[2]: Entering directory '/home/opc/ruby/build/master/ext/digest'
make[2]: Leaving directory '/home/opc/ruby/build/master/ext/digest'
make[2]: Entering directory '/home/opc/ruby/build/master/ext/fiddle'
linking shared-object -test-/rational.so
make[2]: Leaving directory '/home/opc/ruby/build/master/ext/fiddle'
make[2]: Entering directory '/home/opc/ruby/build/master/ext/io/console'
make[2]: Leaving directory '/home/opc/ruby/build/master/ext/io/console'
make[2]: Entering directory '/home/opc/ruby/build/master/ext/json'
make[2]: Leaving directory '/home/opc/ruby/build/master/ext/-test-/rational'
make[2]: Leaving directory '/home/opc/ruby/build/master/ext/json'
make[2]: Entering directory '/home/opc/ruby/build/master/ext/monitor'
make[2]: Entering directory '/home/opc/ruby/build/master/ext/nkf'
make[2]: Leaving directory '/home/opc/ruby/build/master/ext/monitor'
make[2]: Leaving directory '/home/opc/ruby/build/master/ext/nkf'
make[2]: Entering directory '/home/opc/ruby/build/master/ext/objspace'
compiling /home/opc/ruby/src/master/ext/objspace/object_tracing.c
make[2]: Entering directory '/home/opc/ruby/build/master/ext/openssl'
make[2]: Leaving directory '/home/opc/ruby/build/master/ext/openssl'
make[2]: Entering directory '/home/opc/ruby/build/master/ext/pathname'
make[2]: Leaving directory '/home/opc/ruby/build/master/ext/pathname'
make[2]: Entering directory '/home/opc/ruby/build/master/ext/psych'
make[2]: Leaving directory '/home/opc/ruby/build/master/ext/psych'
make[2]: Entering directory '/home/opc/ruby/build/master/ext/pty'
compiling /home/opc/ruby/src/master/ext/pty/pty.c
linking shared-object coverage.so
make[2]: Leaving directory '/home/opc/ruby/build/master/ext/coverage'
compiling /home/opc/ruby/src/master/ext/objspace/objspace.c
make[2]: Entering directory '/home/opc/ruby/build/master/ext/ripper'
compiling /home/opc/ruby/src/master/ext/ripper/ripper.c
linking shared-object pty.so
make[2]: Leaving directory '/home/opc/ruby/build/master/ext/pty'
make[2]: Entering directory '/home/opc/ruby/build/master/ext/rubyvm'
make[2]: Leaving directory '/home/opc/ruby/build/master/ext/rubyvm'
make[2]: Entering directory '/home/opc/ruby/build/master/ext/socket'
compiling /home/opc/ruby/src/master/ext/socket/init.c
parse.y:1105:10: fatal error: eventids1.h: No such file or directory
compilation terminated.
make[2]: *** [Makefile:290: ripper.o] Error 1
make[2]: Leaving directory '/home/opc/ruby/build/master/ext/ripper'
make[1]: *** [exts.mk:284: ext/ripper/all] Error 2
make[1]: *** Waiting for unfinished jobs....
compiling /home/opc/ruby/src/master/ext/socket/constants.c
compiling /home/opc/ruby/src/master/ext/socket/basicsocket.c
compiling /home/opc/ruby/src/master/ext/objspace/objspace_dump.c
compiling /home/opc/ruby/src/master/ext/socket/socket.c
linking shared-object objspace.so
make[2]: Leaving directory '/home/opc/ruby/build/master/ext/objspace'
compiling /home/opc/ruby/src/master/ext/socket/ipsocket.c
compiling /home/opc/ruby/src/master/ext/socket/tcpsocket.c
compiling /home/opc/ruby/src/master/ext/socket/tcpserver.c
compiling /home/opc/ruby/src/master/ext/socket/sockssocket.c
compiling /home/opc/ruby/src/master/ext/socket/udpsocket.c
compiling /home/opc/ruby/src/master/ext/socket/unixsocket.c
compiling /home/opc/ruby/src/master/ext/socket/unixserver.c
compiling /home/opc/ruby/src/master/ext/socket/option.c
compiling /home/opc/ruby/src/master/ext/socket/ancdata.c
compiling /home/opc/ruby/src/master/ext/socket/raddrinfo.c
compiling /home/opc/ruby/src/master/ext/socket/ifaddr.c
linking shared-object socket.so
make[2]: Leaving directory '/home/opc/ruby/build/master/ext/socket'
make[1]: Leaving directory '/home/opc/ruby/build/master'
make: *** [uncommon.mk:303: build-ext] Error 2
$$$[end] "make all -j3" exit with 512.