# Logfile created on 2024-05-27 06:58:50 +0000 by logger.rb/v1.4.3 I, [2024-05-27T06:58:50.397684 #3340252] INFO -- : #, @formatter=nil, @logdev=#, @binmode=false, @mon_data=#, @mon_data_owner_object_id=860>>> I, [2024-05-27T06:58:50.397806 #3340252] INFO -- : $$$[beg] make update-unicode -j20 I, [2024-05-27T06:58:50.457314 #3340252] INFO -- : Downloading Unicode emoji 15.0 files... I, [2024-05-27T06:58:50.457471 #3340252] INFO -- : Downloading Unicode emoji 15.0 files... I, [2024-05-27T06:58:50.458122 #3340252] INFO -- : Downloading Unicode emoji 15.0 files... I, [2024-05-27T06:58:50.498772 #3340252] INFO -- : made symlink emoji/15.0/emoji-sequences.txt to /tmp/ruby/src/trunk/.downloaded-cache/emoji/15.0/emoji-sequences.txt I, [2024-05-27T06:58:50.498819 #3340252] INFO -- : downloading emoji/15.0/emoji-sequences.txt ... downloading emoji/15.0/emoji-test.txt ... /tmp/ruby/src/trunk/enc/unicode/data/emoji/15.0/emoji-sequences.txt already exists E, [2024-05-27T06:58:50.962186 #3340252] ERROR -- : /tmp/ruby/src/trunk/tool/downloader.rb:302:in `rescue in download': failed to download emoji/15.0/emoji-test.txt (RuntimeError) E, [2024-05-27T06:58:50.962305 #3340252] ERROR -- : OpenURI::HTTPError: 403 Forbidden: https://www.unicode.org/Public/emoji/15.0/emoji-test.txt E, [2024-05-27T06:58:50.962325 #3340252] ERROR -- : from /tmp/ruby/src/trunk/tool/downloader.rb:201:in `download' E, [2024-05-27T06:58:50.962338 #3340252] ERROR -- : from /tmp/ruby/src/trunk/tool/downloader.rb:136:in `download' E, [2024-05-27T06:58:50.962350 #3340252] ERROR -- : from /tmp/ruby/src/trunk/tool/downloader.rb:482:in `block in
' E, [2024-05-27T06:58:50.962363 #3340252] ERROR -- : from /tmp/ruby/src/trunk/tool/downloader.rb:465:in `each' E, [2024-05-27T06:58:50.962375 #3340252] ERROR -- : from /tmp/ruby/src/trunk/tool/downloader.rb:465:in `
' E, [2024-05-27T06:58:50.962387 #3340252] ERROR -- : /usr/lib/ruby/3.0.0/open-uri.rb:364:in `open_http': 403 Forbidden (OpenURI::HTTPError) E, [2024-05-27T06:58:50.962399 #3340252] ERROR -- : from /usr/lib/ruby/3.0.0/open-uri.rb:741:in `buffer_open' E, [2024-05-27T06:58:50.962414 #3340252] ERROR -- : from /usr/lib/ruby/3.0.0/open-uri.rb:212:in `block in open_loop' E, [2024-05-27T06:58:50.962426 #3340252] ERROR -- : from /usr/lib/ruby/3.0.0/open-uri.rb:210:in `catch' E, [2024-05-27T06:58:50.962437 #3340252] ERROR -- : from /usr/lib/ruby/3.0.0/open-uri.rb:210:in `open_loop' E, [2024-05-27T06:58:50.962449 #3340252] ERROR -- : from /usr/lib/ruby/3.0.0/open-uri.rb:151:in `open_uri' E, [2024-05-27T06:58:50.962460 #3340252] ERROR -- : from /usr/lib/ruby/3.0.0/open-uri.rb:721:in `open' E, [2024-05-27T06:58:50.962472 #3340252] ERROR -- : from /usr/lib/ruby/3.0.0/open-uri.rb:729:in `read' E, [2024-05-27T06:58:50.962483 #3340252] ERROR -- : from /tmp/ruby/src/trunk/tool/downloader.rb:247:in `block in download' E, [2024-05-27T06:58:50.962513 #3340252] ERROR -- : from /tmp/ruby/src/trunk/tool/downloader.rb:378:in `with_retry' E, [2024-05-27T06:58:50.962529 #3340252] ERROR -- : from /tmp/ruby/src/trunk/tool/downloader.rb:246:in `download' E, [2024-05-27T06:58:50.962541 #3340252] ERROR -- : from /tmp/ruby/src/trunk/tool/downloader.rb:136:in `download' E, [2024-05-27T06:58:50.962552 #3340252] ERROR -- : from /tmp/ruby/src/trunk/tool/downloader.rb:482:in `block in
' E, [2024-05-27T06:58:50.962564 #3340252] ERROR -- : from /tmp/ruby/src/trunk/tool/downloader.rb:465:in `each' E, [2024-05-27T06:58:50.962578 #3340252] ERROR -- : from /tmp/ruby/src/trunk/tool/downloader.rb:465:in `
' E, [2024-05-27T06:58:50.962592 #3340252] ERROR -- : /tmp/ruby/src/trunk/tool/downloader.rb:302:in `rescue in download': failed to download emoji/15.0/emoji-test.txt (RuntimeError) E, [2024-05-27T06:58:50.962603 #3340252] ERROR -- : OpenURI::HTTPError: 403 Forbidden: https://www.unicode.org/Public/emoji/15.0/emoji-test.txt E, [2024-05-27T06:58:50.962614 #3340252] ERROR -- : from /tmp/ruby/src/trunk/tool/downloader.rb:201:in `download' E, [2024-05-27T06:58:50.962627 #3340252] ERROR -- : from /tmp/ruby/src/trunk/tool/downloader.rb:136:in `download' E, [2024-05-27T06:58:50.962638 #3340252] ERROR -- : from /tmp/ruby/src/trunk/tool/downloader.rb:482:in `block in
' E, [2024-05-27T06:58:50.962649 #3340252] ERROR -- : from /tmp/ruby/src/trunk/tool/downloader.rb:465:in `each' E, [2024-05-27T06:58:50.962659 #3340252] ERROR -- : from /tmp/ruby/src/trunk/tool/downloader.rb:465:in `
' E, [2024-05-27T06:58:50.962670 #3340252] ERROR -- : /usr/lib/ruby/3.0.0/open-uri.rb:364:in `open_http': 403 Forbidden (OpenURI::HTTPError) E, [2024-05-27T06:58:50.962681 #3340252] ERROR -- : from /usr/lib/ruby/3.0.0/open-uri.rb:741:in `buffer_open' E, [2024-05-27T06:58:50.962692 #3340252] ERROR -- : from /usr/lib/ruby/3.0.0/open-uri.rb:212:in `block in open_loop' E, [2024-05-27T06:58:50.962702 #3340252] ERROR -- : from /usr/lib/ruby/3.0.0/open-uri.rb:210:in `catch' E, [2024-05-27T06:58:50.962726 #3340252] ERROR -- : from /usr/lib/ruby/3.0.0/open-uri.rb:210:in `open_loop' E, [2024-05-27T06:58:50.962738 #3340252] ERROR -- : from /usr/lib/ruby/3.0.0/open-uri.rb:151:in `open_uri' E, [2024-05-27T06:58:50.962749 #3340252] ERROR -- : from /usr/lib/ruby/3.0.0/open-uri.rb:721:in `open' E, [2024-05-27T06:58:50.962760 #3340252] ERROR -- : from /usr/lib/ruby/3.0.0/open-uri.rb:729:in `read' E, [2024-05-27T06:58:50.962770 #3340252] ERROR -- : from /tmp/ruby/src/trunk/tool/downloader.rb:247:in `block in download' E, [2024-05-27T06:58:50.962781 #3340252] ERROR -- : from /tmp/ruby/src/trunk/tool/downloader.rb:378:in `with_retry' E, [2024-05-27T06:58:50.962792 #3340252] ERROR -- : from /tmp/ruby/src/trunk/tool/downloader.rb:246:in `download' E, [2024-05-27T06:58:50.962802 #3340252] ERROR -- : from /tmp/ruby/src/trunk/tool/downloader.rb:136:in `download' E, [2024-05-27T06:58:50.962815 #3340252] ERROR -- : from /tmp/ruby/src/trunk/tool/downloader.rb:482:in `block in
' E, [2024-05-27T06:58:50.962826 #3340252] ERROR -- : from /tmp/ruby/src/trunk/tool/downloader.rb:465:in `each' E, [2024-05-27T06:58:50.962837 #3340252] ERROR -- : from /tmp/ruby/src/trunk/tool/downloader.rb:465:in `
' E, [2024-05-27T06:58:50.966619 #3340252] ERROR -- : make: *** [uncommon.mk:1758: /tmp/ruby/src/trunk/enc/unicode/data/emoji/15.0/emoji-test.txt] Error 1 E, [2024-05-27T06:58:50.966680 #3340252] ERROR -- : make: *** Waiting for unfinished jobs.... E, [2024-05-27T06:58:50.966819 #3340252] ERROR -- : make: *** [uncommon.mk:1758: /tmp/ruby/src/trunk/enc/unicode/data/emoji/15.0/emoji-zwj-sequences.txt] Error 1 E, [2024-05-27T06:58:51.401264 #3340252] ERROR -- : /tmp/ruby/src/trunk/tool/downloader.rb:302:in `rescue in download': failed to download emoji/15.0/emoji-sequences.txt (RuntimeError) E, [2024-05-27T06:58:51.401424 #3340252] ERROR -- : EOFError: end of file reached: https://www.unicode.org/Public/emoji/15.0/emoji-sequences.txt E, [2024-05-27T06:58:51.401473 #3340252] ERROR -- : from /tmp/ruby/src/trunk/tool/downloader.rb:201:in `download' E, [2024-05-27T06:58:51.401489 #3340252] ERROR -- : from /tmp/ruby/src/trunk/tool/downloader.rb:136:in `download' E, [2024-05-27T06:58:51.401505 #3340252] ERROR -- : from /tmp/ruby/src/trunk/tool/downloader.rb:482:in `block in
' E, [2024-05-27T06:58:51.401520 #3340252] ERROR -- : from /tmp/ruby/src/trunk/tool/downloader.rb:465:in `each' E, [2024-05-27T06:58:51.401534 #3340252] ERROR -- : from /tmp/ruby/src/trunk/tool/downloader.rb:465:in `
' E, [2024-05-27T06:58:51.401549 #3340252] ERROR -- : /usr/lib/ruby/3.0.0/net/protocol.rb:227:in `rbuf_fill': end of file reached (EOFError) E, [2024-05-27T06:58:51.401658 #3340252] ERROR -- : from /usr/lib/ruby/3.0.0/net/protocol.rb:193:in `readuntil' E, [2024-05-27T06:58:51.401689 #3340252] ERROR -- : from /usr/lib/ruby/3.0.0/net/protocol.rb:203:in `readline' E, [2024-05-27T06:58:51.401704 #3340252] ERROR -- : from /usr/lib/ruby/3.0.0/net/http/response.rb:42:in `read_status_line' E, [2024-05-27T06:58:51.401719 #3340252] ERROR -- : from /usr/lib/ruby/3.0.0/net/http/response.rb:31:in `read_new' E, [2024-05-27T06:58:51.401734 #3340252] ERROR -- : from /usr/lib/ruby/3.0.0/net/http.rb:1557:in `block in transport_request' E, [2024-05-27T06:58:51.401748 #3340252] ERROR -- : from /usr/lib/ruby/3.0.0/net/http.rb:1548:in `catch' E, [2024-05-27T06:58:51.401762 #3340252] ERROR -- : from /usr/lib/ruby/3.0.0/net/http.rb:1548:in `transport_request' E, [2024-05-27T06:58:51.401777 #3340252] ERROR -- : from /usr/lib/ruby/3.0.0/net/http.rb:1521:in `request' E, [2024-05-27T06:58:51.402048 #3340252] ERROR -- : from /usr/lib/ruby/3.0.0/open-uri.rb:329:in `block in open_http' E, [2024-05-27T06:58:51.402062 #3340252] ERROR -- : from /usr/lib/ruby/3.0.0/net/http.rb:960:in `start' E, [2024-05-27T06:58:51.402074 #3340252] ERROR -- : from /usr/lib/ruby/3.0.0/open-uri.rb:323:in `open_http' E, [2024-05-27T06:58:51.402087 #3340252] ERROR -- : from /usr/lib/ruby/3.0.0/open-uri.rb:741:in `buffer_open' E, [2024-05-27T06:58:51.402100 #3340252] ERROR -- : from /usr/lib/ruby/3.0.0/open-uri.rb:212:in `block in open_loop' E, [2024-05-27T06:58:51.402116 #3340252] ERROR -- : from /usr/lib/ruby/3.0.0/open-uri.rb:210:in `catch' E, [2024-05-27T06:58:51.402129 #3340252] ERROR -- : from /usr/lib/ruby/3.0.0/open-uri.rb:210:in `open_loop' E, [2024-05-27T06:58:51.402142 #3340252] ERROR -- : from /usr/lib/ruby/3.0.0/open-uri.rb:151:in `open_uri' E, [2024-05-27T06:58:51.402155 #3340252] ERROR -- : from /usr/lib/ruby/3.0.0/open-uri.rb:721:in `open' E, [2024-05-27T06:58:51.402168 #3340252] ERROR -- : from /usr/lib/ruby/3.0.0/open-uri.rb:729:in `read' E, [2024-05-27T06:58:51.402181 #3340252] ERROR -- : from /tmp/ruby/src/trunk/tool/downloader.rb:247:in `block in download' E, [2024-05-27T06:58:51.402194 #3340252] ERROR -- : from /tmp/ruby/src/trunk/tool/downloader.rb:378:in `with_retry' E, [2024-05-27T06:58:51.402206 #3340252] ERROR -- : from /tmp/ruby/src/trunk/tool/downloader.rb:246:in `download' E, [2024-05-27T06:58:51.402219 #3340252] ERROR -- : from /tmp/ruby/src/trunk/tool/downloader.rb:136:in `download' E, [2024-05-27T06:58:51.402236 #3340252] ERROR -- : from /tmp/ruby/src/trunk/tool/downloader.rb:482:in `block in
' E, [2024-05-27T06:58:51.402249 #3340252] ERROR -- : from /tmp/ruby/src/trunk/tool/downloader.rb:465:in `each' E, [2024-05-27T06:58:51.402268 #3340252] ERROR -- : from /tmp/ruby/src/trunk/tool/downloader.rb:465:in `
' E, [2024-05-27T06:58:51.406490 #3340252] ERROR -- : make: *** [uncommon.mk:1758: /tmp/ruby/src/trunk/enc/unicode/data/emoji/15.0/emoji-sequences.txt] Error 1 E, [2024-05-27T06:58:51.406575 #3340252] ERROR -- : make: *** Deleting file '/tmp/ruby/src/trunk/enc/unicode/data/emoji/15.0/emoji-sequences.txt' I, [2024-05-27T06:58:51.406647 #3340252] INFO -- : downloading emoji/15.0/emoji-test.txt ... I, [2024-05-27T06:58:51.407143 #3340252] INFO -- : $$$[end] "make update-unicode -j20" exit with 512. I, [2024-05-27T06:58:51.407220 #3340252] INFO -- : $$$[beg] make update-download -j20 I, [2024-05-27T06:58:51.515828 #3340252] INFO -- : tool/config.guess already exists I, [2024-05-27T06:58:51.515873 #3340252] INFO -- : tool/config.sub already exists I, [2024-05-27T06:58:51.518032 #3340252] INFO -- : Update power_assert to 84e85124c5014a139af39161d484156cfe87a9ed I, [2024-05-27T06:58:51.518342 #3340252] INFO -- : Update rbs to ba7872795d5de04adb8ff500c0e6afdc81a041dd I, [2024-05-27T06:58:51.518982 #3340252] INFO -- : Update typeprof to b19a6416da3a05d57fadd6ffdadb382b6d236ca5 I, [2024-05-27T06:58:51.519233 #3340252] INFO -- : echo 84e85124c5014a139af39161d484156cfe87a9ed | /bin/sh /tmp/ruby/src/trunk/tool/ifchange /tmp/ruby/src/trunk/.bundle/.timestamp/power_assert.revision - I, [2024-05-27T06:58:51.519452 #3340252] INFO -- : echo ba7872795d5de04adb8ff500c0e6afdc81a041dd | /bin/sh /tmp/ruby/src/trunk/tool/ifchange /tmp/ruby/src/trunk/.bundle/.timestamp/rbs.revision - I, [2024-05-27T06:58:51.520231 #3340252] INFO -- : echo b19a6416da3a05d57fadd6ffdadb382b6d236ca5 | /bin/sh /tmp/ruby/src/trunk/tool/ifchange /tmp/ruby/src/trunk/.bundle/.timestamp/typeprof.revision - I, [2024-05-27T06:58:51.521230 #3340252] INFO -- : /tmp/ruby/src/trunk/.bundle/.timestamp/rbs.revision unchanged I, [2024-05-27T06:58:51.521264 #3340252] INFO -- : /tmp/ruby/src/trunk/.bundle/.timestamp/power_assert.revision unchanged I, [2024-05-27T06:58:51.522103 #3340252] INFO -- : /tmp/ruby/src/trunk/.bundle/.timestamp/typeprof.revision unchanged I, [2024-05-27T06:58:51.522463 #3340252] INFO -- : Building power_assert@84e85124c5014a139af39161d484156cfe87a9ed to /tmp/ruby/src/trunk/gems/power_assert-2.0.3.gem I, [2024-05-27T06:58:51.590979 #3340252] INFO -- : Successfully built RubyGem I, [2024-05-27T06:58:51.591036 #3340252] INFO -- : Name: power_assert I, [2024-05-27T06:58:51.591049 #3340252] INFO -- : Version: 2.0.4dev I, [2024-05-27T06:58:51.591060 #3340252] INFO -- : File: power_assert-2.0.4dev.gem I, [2024-05-27T06:58:51.636363 #3340252] INFO -- : $$$[end] "make update-download -j20" exit with 0. I, [2024-05-27T06:58:51.636412 #3340252] INFO -- : $$$[beg] make update-rubyspec -j20 I, [2024-05-27T06:58:51.694098 #3340252] INFO -- : make: Nothing to be done for 'update-rubyspec'. I, [2024-05-27T06:58:51.694496 #3340252] INFO -- : $$$[end] "make update-rubyspec -j20" exit with 0. I, [2024-05-27T06:58:51.694530 #3340252] INFO -- : $$$[beg] make update-src -j20 I, [2024-05-27T06:58:52.403556 #3340252] INFO -- : Already up to date. I, [2024-05-27T06:58:52.419636 #3340252] INFO -- : Latest commit hash = 4fee1019f6 I, [2024-05-27T06:58:52.420662 #3340252] INFO -- : $$$[end] "make update-src -j20" exit with 0. I, [2024-05-27T06:58:52.420737 #3340252] INFO -- : $$$[beg] make after-update -j20 I, [2024-05-27T06:58:52.497968 #3340252] INFO -- : generating /tmp/ruby/src/trunk/ext/ripper/eventids2table.c I, [2024-05-27T06:58:52.502354 #3340252] INFO -- : make[1]: Entering directory '/tmp/ruby/src/trunk/ext/ripper' I, [2024-05-27T06:58:52.502376 #3340252] INFO -- : make[1]: Nothing to be done for 'src'. I, [2024-05-27T06:58:52.502382 #3340252] INFO -- : make[1]: Leaving directory '/tmp/ruby/src/trunk/ext/ripper' I, [2024-05-27T06:58:52.518187 #3340252] INFO -- : /tmp/ruby/src/trunk/revision.h updated I, [2024-05-27T06:58:52.519357 #3340252] INFO -- : generating x86_64-linux-fake.rb I, [2024-05-27T06:58:52.570202 #3340252] INFO -- : x86_64-linux-fake.rb updated I, [2024-05-27T06:58:52.571490 #3340252] INFO -- : generating enc.mk I, [2024-05-27T06:58:52.691795 #3340252] INFO -- : making srcs under enc I, [2024-05-27T06:58:52.721751 #3340252] INFO -- : make[1]: Entering directory '/tmp/ruby/build/trunk' I, [2024-05-27T06:58:52.721778 #3340252] INFO -- : make[1]: Nothing to be done for 'srcs'. I, [2024-05-27T06:58:52.721788 #3340252] INFO -- : make[1]: Leaving directory '/tmp/ruby/build/trunk' I, [2024-05-27T06:58:52.766358 #3340252] INFO -- : Update power_assert to 84e85124c5014a139af39161d484156cfe87a9ed I, [2024-05-27T06:58:52.766510 #3340252] INFO -- : Update rbs to ba7872795d5de04adb8ff500c0e6afdc81a041dd I, [2024-05-27T06:58:52.767236 #3340252] INFO -- : Update typeprof to b19a6416da3a05d57fadd6ffdadb382b6d236ca5 I, [2024-05-27T06:58:52.767588 #3340252] INFO -- : echo ba7872795d5de04adb8ff500c0e6afdc81a041dd | /bin/sh /tmp/ruby/src/trunk/tool/ifchange /tmp/ruby/src/trunk/.bundle/.timestamp/rbs.revision - I, [2024-05-27T06:58:52.767641 #3340252] INFO -- : echo 84e85124c5014a139af39161d484156cfe87a9ed | /bin/sh /tmp/ruby/src/trunk/tool/ifchange /tmp/ruby/src/trunk/.bundle/.timestamp/power_assert.revision - I, [2024-05-27T06:58:52.768618 #3340252] INFO -- : echo b19a6416da3a05d57fadd6ffdadb382b6d236ca5 | /bin/sh /tmp/ruby/src/trunk/tool/ifchange /tmp/ruby/src/trunk/.bundle/.timestamp/typeprof.revision - I, [2024-05-27T06:58:52.769373 #3340252] INFO -- : /tmp/ruby/src/trunk/.bundle/.timestamp/rbs.revision unchanged I, [2024-05-27T06:58:52.769859 #3340252] INFO -- : /tmp/ruby/src/trunk/.bundle/.timestamp/power_assert.revision unchanged I, [2024-05-27T06:58:52.770721 #3340252] INFO -- : /tmp/ruby/src/trunk/.bundle/.timestamp/typeprof.revision unchanged I, [2024-05-27T06:58:52.771079 #3340252] INFO -- : Building power_assert@84e85124c5014a139af39161d484156cfe87a9ed to /tmp/ruby/src/trunk/gems/power_assert-2.0.3.gem I, [2024-05-27T06:58:52.839706 #3340252] INFO -- : Successfully built RubyGem I, [2024-05-27T06:58:52.839746 #3340252] INFO -- : Name: power_assert I, [2024-05-27T06:58:52.839751 #3340252] INFO -- : Version: 2.0.4dev I, [2024-05-27T06:58:52.839755 #3340252] INFO -- : File: power_assert-2.0.4dev.gem I, [2024-05-27T06:58:52.842010 #3340252] INFO -- : Extracting bundle gem power_assert-2.0.3... I, [2024-05-27T06:58:52.902506 #3340252] INFO -- : Try with hash version of bundled gems instead of gems/power_assert-2.0.3.gem. We don't use this gem with release version of Ruby. I, [2024-05-27T06:58:52.907470 #3340252] INFO -- : Unpacked gems/power_assert-2.0.4dev.gem I, [2024-05-27T06:58:52.909416 #3340252] INFO -- : $$$[end] "make after-update -j20" exit with 0. I, [2024-05-27T06:58:52.909536 #3340252] INFO -- : $$$[beg] make miniruby -j20 I, [2024-05-27T06:58:52.967161 #3340252] INFO -- : BASERUBY = /usr/bin/ruby --disable=gems I, [2024-05-27T06:58:52.967207 #3340252] INFO -- : CC = gcc I, [2024-05-27T06:58:52.967222 #3340252] INFO -- : LD = ld I, [2024-05-27T06:58:52.967234 #3340252] INFO -- : LDSHARED = gcc -shared I, [2024-05-27T06:58:52.967249 #3340252] INFO -- : CFLAGS = -O3 -fno-fast-math -ggdb3 -Wall -Wextra -Wdeprecated-declarations -Wdiv-by-zero -Wduplicated-cond -Wimplicit-function-declaration -Wimplicit-int -Wpointer-arith -Wwrite-strings -Wold-style-definition -Wimplicit-fallthrough=0 -Wmissing-noreturn -Wno-cast-function-type -Wno-constant-logical-operand -Wno-long-long -Wno-missing-field-initializers -Wno-overlength-strings -Wno-packed-bitfield-compat -Wno-parentheses-equality -Wno-self-assign -Wno-tautological-compare -Wno-unused-parameter -Wno-unused-value -Wsuggest-attribute=format -Wsuggest-attribute=noreturn -Wunused-variable -Wmisleading-indentation -Wundef -fPIC I, [2024-05-27T06:58:52.967262 #3340252] INFO -- : XCFLAGS = -U_FORTIFY_SOURCE -D_FORTIFY_SOURCE=2 -fstack-protector-strong -fno-strict-overflow -fvisibility=hidden -fexcess-precision=standard -DRUBY_EXPORT -I. -I.ext/include/x86_64-linux -I/tmp/ruby/src/trunk/include -I/tmp/ruby/src/trunk -I/tmp/ruby/src/trunk/prism -I/tmp/ruby/src/trunk/enc/unicode/15.0.0 I, [2024-05-27T06:58:52.967274 #3340252] INFO -- : CPPFLAGS = I, [2024-05-27T06:58:52.967286 #3340252] INFO -- : DLDFLAGS = -Wl,--compress-debug-sections=zlib -Wl,-soname,libruby.so.3.4 -fstack-protector-strong I, [2024-05-27T06:58:52.967298 #3340252] INFO -- : SOLIBS = -lz -lrt -lrt -lgmp -ldl -lcrypt -lm -lpthread I, [2024-05-27T06:58:52.967309 #3340252] INFO -- : LANG = en_US.UTF-8 I, [2024-05-27T06:58:52.967323 #3340252] INFO -- : LC_ALL = I, [2024-05-27T06:58:52.967335 #3340252] INFO -- : LC_CTYPE = I, [2024-05-27T06:58:52.967346 #3340252] INFO -- : MFLAGS = -j20 --jobserver-auth=4,5 I, [2024-05-27T06:58:52.967366 #3340252] INFO -- : RUSTC = no I, [2024-05-27T06:58:52.967379 #3340252] INFO -- : YJIT_RUSTC_ARGS = --crate-name=yjit --crate-type=staticlib --edition=2021 -g -C lto=thin -C opt-level=3 -C overflow-checks=on '--out-dir=/tmp/ruby/build/trunk/yjit/target/release/' /tmp/ruby/src/trunk/yjit/src/lib.rs I, [2024-05-27T06:58:52.968699 #3340252] INFO -- : gcc (Ubuntu 11.4.0-1ubuntu1~22.04) 11.4.0 I, [2024-05-27T06:58:52.968747 #3340252] INFO -- : Copyright (C) 2021 Free Software Foundation, Inc. I, [2024-05-27T06:58:52.968762 #3340252] INFO -- : This is free software; see the source for copying conditions. There is NO I, [2024-05-27T06:58:52.968782 #3340252] INFO -- : warranty; not even for MERCHANTABILITY or FITNESS FOR A PARTICULAR PURPOSE. I, [2024-05-27T06:58:52.968796 #3340252] INFO -- : I, [2024-05-27T06:58:52.990785 #3340252] INFO -- : compiling /tmp/ruby/src/trunk/version.c I, [2024-05-27T06:58:53.094059 #3340252] INFO -- : linking miniruby I, [2024-05-27T06:58:53.621661 #3340252] INFO -- : $$$[end] "make miniruby -j20" exit with 0. I, [2024-05-27T06:58:53.621785 #3340252] INFO -- : $$$[beg] make ruby -j20 I, [2024-05-27T06:58:53.678850 #3340252] INFO -- : BASERUBY = /usr/bin/ruby --disable=gems I, [2024-05-27T06:58:53.678890 #3340252] INFO -- : CC = gcc I, [2024-05-27T06:58:53.678903 #3340252] INFO -- : LD = ld I, [2024-05-27T06:58:53.678913 #3340252] INFO -- : LDSHARED = gcc -shared I, [2024-05-27T06:58:53.678929 #3340252] INFO -- : CFLAGS = -O3 -fno-fast-math -ggdb3 -Wall -Wextra -Wdeprecated-declarations -Wdiv-by-zero -Wduplicated-cond -Wimplicit-function-declaration -Wimplicit-int -Wpointer-arith -Wwrite-strings -Wold-style-definition -Wimplicit-fallthrough=0 -Wmissing-noreturn -Wno-cast-function-type -Wno-constant-logical-operand -Wno-long-long -Wno-missing-field-initializers -Wno-overlength-strings -Wno-packed-bitfield-compat -Wno-parentheses-equality -Wno-self-assign -Wno-tautological-compare -Wno-unused-parameter -Wno-unused-value -Wsuggest-attribute=format -Wsuggest-attribute=noreturn -Wunused-variable -Wmisleading-indentation -Wundef -fPIC I, [2024-05-27T06:58:53.678942 #3340252] INFO -- : XCFLAGS = -U_FORTIFY_SOURCE -D_FORTIFY_SOURCE=2 -fstack-protector-strong -fno-strict-overflow -fvisibility=hidden -fexcess-precision=standard -DRUBY_EXPORT -I. -I.ext/include/x86_64-linux -I/tmp/ruby/src/trunk/include -I/tmp/ruby/src/trunk -I/tmp/ruby/src/trunk/prism -I/tmp/ruby/src/trunk/enc/unicode/15.0.0 I, [2024-05-27T06:58:53.678952 #3340252] INFO -- : CPPFLAGS = I, [2024-05-27T06:58:53.678963 #3340252] INFO -- : DLDFLAGS = -Wl,--compress-debug-sections=zlib -Wl,-soname,libruby.so.3.4 -fstack-protector-strong I, [2024-05-27T06:58:53.678973 #3340252] INFO -- : SOLIBS = -lz -lrt -lrt -lgmp -ldl -lcrypt -lm -lpthread I, [2024-05-27T06:58:53.678983 #3340252] INFO -- : LANG = en_US.UTF-8 I, [2024-05-27T06:58:53.678993 #3340252] INFO -- : LC_ALL = I, [2024-05-27T06:58:53.679003 #3340252] INFO -- : LC_CTYPE = I, [2024-05-27T06:58:53.679013 #3340252] INFO -- : MFLAGS = -j20 --jobserver-auth=4,5 I, [2024-05-27T06:58:53.679024 #3340252] INFO -- : RUSTC = no I, [2024-05-27T06:58:53.679035 #3340252] INFO -- : YJIT_RUSTC_ARGS = --crate-name=yjit --crate-type=staticlib --edition=2021 -g -C lto=thin -C opt-level=3 -C overflow-checks=on '--out-dir=/tmp/ruby/build/trunk/yjit/target/release/' /tmp/ruby/src/trunk/yjit/src/lib.rs I, [2024-05-27T06:58:53.680203 #3340252] INFO -- : gcc (Ubuntu 11.4.0-1ubuntu1~22.04) 11.4.0 I, [2024-05-27T06:58:53.680244 #3340252] INFO -- : Copyright (C) 2021 Free Software Foundation, Inc. I, [2024-05-27T06:58:53.680256 #3340252] INFO -- : This is free software; see the source for copying conditions. There is NO I, [2024-05-27T06:58:53.680267 #3340252] INFO -- : warranty; not even for MERCHANTABILITY or FITNESS FOR A PARTICULAR PURPOSE. I, [2024-05-27T06:58:53.680283 #3340252] INFO -- : I, [2024-05-27T06:58:53.789662 #3340252] INFO -- : builtin_binary.inc updated I, [2024-05-27T06:58:53.794278 #3340252] INFO -- : c86294a81d0df6836359a6b5498b71b1ddba3062aa6ec87c7b2896368a948a19 builtin_binary.inc I, [2024-05-27T06:58:53.794995 #3340252] INFO -- : compiling /tmp/ruby/src/trunk/builtin.c I, [2024-05-27T06:58:53.979272 #3340252] INFO -- : linking static-library libruby-static.a I, [2024-05-27T06:58:54.291009 #3340252] INFO -- : linking shared-library libruby.so.3.4.0 I, [2024-05-27T06:58:55.845104 #3340252] INFO -- : linking ruby I, [2024-05-27T06:58:55.868586 #3340252] INFO -- : $$$[end] "make ruby -j20" exit with 0. I, [2024-05-27T06:58:55.868743 #3340252] INFO -- : $$$[beg] make all -j20 I, [2024-05-27T06:58:55.925831 #3340252] INFO -- : BASERUBY = /usr/bin/ruby --disable=gems I, [2024-05-27T06:58:55.925873 #3340252] INFO -- : CC = gcc I, [2024-05-27T06:58:55.925885 #3340252] INFO -- : LD = ld I, [2024-05-27T06:58:55.925896 #3340252] INFO -- : LDSHARED = gcc -shared I, [2024-05-27T06:58:55.925906 #3340252] INFO -- : CFLAGS = -O3 -fno-fast-math -ggdb3 -Wall -Wextra -Wdeprecated-declarations -Wdiv-by-zero -Wduplicated-cond -Wimplicit-function-declaration -Wimplicit-int -Wpointer-arith -Wwrite-strings -Wold-style-definition -Wimplicit-fallthrough=0 -Wmissing-noreturn -Wno-cast-function-type -Wno-constant-logical-operand -Wno-long-long -Wno-missing-field-initializers -Wno-overlength-strings -Wno-packed-bitfield-compat -Wno-parentheses-equality -Wno-self-assign -Wno-tautological-compare -Wno-unused-parameter -Wno-unused-value -Wsuggest-attribute=format -Wsuggest-attribute=noreturn -Wunused-variable -Wmisleading-indentation -Wundef -fPIC I, [2024-05-27T06:58:55.925917 #3340252] INFO -- : XCFLAGS = -U_FORTIFY_SOURCE -D_FORTIFY_SOURCE=2 -fstack-protector-strong -fno-strict-overflow -fvisibility=hidden -fexcess-precision=standard -DRUBY_EXPORT -I. -I.ext/include/x86_64-linux -I/tmp/ruby/src/trunk/include -I/tmp/ruby/src/trunk -I/tmp/ruby/src/trunk/prism -I/tmp/ruby/src/trunk/enc/unicode/15.0.0 I, [2024-05-27T06:58:55.925928 #3340252] INFO -- : CPPFLAGS = I, [2024-05-27T06:58:55.925939 #3340252] INFO -- : DLDFLAGS = -Wl,--compress-debug-sections=zlib -Wl,-soname,libruby.so.3.4 -fstack-protector-strong I, [2024-05-27T06:58:55.925949 #3340252] INFO -- : SOLIBS = -lz -lrt -lrt -lgmp -ldl -lcrypt -lm -lpthread I, [2024-05-27T06:58:55.925959 #3340252] INFO -- : LANG = en_US.UTF-8 I, [2024-05-27T06:58:55.925968 #3340252] INFO -- : LC_ALL = I, [2024-05-27T06:58:55.925978 #3340252] INFO -- : LC_CTYPE = I, [2024-05-27T06:58:55.925988 #3340252] INFO -- : MFLAGS = -j20 --jobserver-auth=4,5 I, [2024-05-27T06:58:55.925998 #3340252] INFO -- : RUSTC = no I, [2024-05-27T06:58:55.926008 #3340252] INFO -- : YJIT_RUSTC_ARGS = --crate-name=yjit --crate-type=staticlib --edition=2021 -g -C lto=thin -C opt-level=3 -C overflow-checks=on '--out-dir=/tmp/ruby/build/trunk/yjit/target/release/' /tmp/ruby/src/trunk/yjit/src/lib.rs I, [2024-05-27T06:58:55.927254 #3340252] INFO -- : gcc (Ubuntu 11.4.0-1ubuntu1~22.04) 11.4.0 I, [2024-05-27T06:58:55.927295 #3340252] INFO -- : Copyright (C) 2021 Free Software Foundation, Inc. I, [2024-05-27T06:58:55.927313 #3340252] INFO -- : This is free software; see the source for copying conditions. There is NO I, [2024-05-27T06:58:55.927325 #3340252] INFO -- : warranty; not even for MERCHANTABILITY or FITNESS FOR A PARTICULAR PURPOSE. I, [2024-05-27T06:58:55.927335 #3340252] INFO -- : I, [2024-05-27T06:58:55.956307 #3340252] INFO -- : generating encdb.h I, [2024-05-27T06:58:55.957733 #3340252] INFO -- : generating enc.mk I, [2024-05-27T06:58:55.959569 #3340252] INFO -- : building spec/ruby/optional/capi/ext/array_spec.so I, [2024-05-27T06:58:55.959974 #3340252] INFO -- : building spec/ruby/optional/capi/ext/basic_object_spec.so I, [2024-05-27T06:58:55.960792 #3340252] INFO -- : building spec/ruby/optional/capi/ext/bignum_spec.so I, [2024-05-27T06:58:55.961371 #3340252] INFO -- : building spec/ruby/optional/capi/ext/binding_spec.so I, [2024-05-27T06:58:55.961907 #3340252] INFO -- : building spec/ruby/optional/capi/ext/boolean_spec.so I, [2024-05-27T06:58:55.962075 #3340252] INFO -- : building spec/ruby/optional/capi/ext/class_id_under_autoload_spec.so I, [2024-05-27T06:58:55.963099 #3340252] INFO -- : building spec/ruby/optional/capi/ext/class_spec.so I, [2024-05-27T06:58:55.963894 #3340252] INFO -- : building spec/ruby/optional/capi/ext/class_under_autoload_spec.so I, [2024-05-27T06:58:55.964235 #3340252] INFO -- : building spec/ruby/optional/capi/ext/complex_spec.so I, [2024-05-27T06:58:55.965089 #3340252] INFO -- : building spec/ruby/optional/capi/ext/constants_spec.so I, [2024-05-27T06:58:55.965937 #3340252] INFO -- : building spec/ruby/optional/capi/ext/data_spec.so I, [2024-05-27T06:58:55.966361 #3340252] INFO -- : building spec/ruby/optional/capi/ext/debug_spec.so I, [2024-05-27T06:58:55.967195 #3340252] INFO -- : building spec/ruby/optional/capi/ext/encoding_spec.so I, [2024-05-27T06:58:55.967939 #3340252] INFO -- : building spec/ruby/optional/capi/ext/enumerator_spec.so I, [2024-05-27T06:58:55.968189 #3340252] INFO -- : building spec/ruby/optional/capi/ext/exception_spec.so I, [2024-05-27T06:58:55.968780 #3340252] INFO -- : building spec/ruby/optional/capi/ext/fiber_spec.so I, [2024-05-27T06:58:55.969421 #3340252] INFO -- : building spec/ruby/optional/capi/ext/file_spec.so I, [2024-05-27T06:58:55.969906 #3340252] INFO -- : building spec/ruby/optional/capi/ext/fixnum_spec.so I, [2024-05-27T06:58:55.988341 #3340252] INFO -- : encdb.h unchanged I, [2024-05-27T06:58:56.000465 #3340252] INFO -- : building spec/ruby/optional/capi/ext/float_spec.so I, [2024-05-27T06:58:56.087227 #3340252] INFO -- : building spec/ruby/optional/capi/ext/gc_spec.so I, [2024-05-27T06:58:56.100194 #3340252] INFO -- : building spec/ruby/optional/capi/ext/globals_spec.so I, [2024-05-27T06:58:56.103932 #3340252] INFO -- : building spec/ruby/optional/capi/ext/hash_spec.so I, [2024-05-27T06:58:56.108396 #3340252] INFO -- : building spec/ruby/optional/capi/ext/integer_spec.so I, [2024-05-27T06:58:56.116665 #3340252] INFO -- : building spec/ruby/optional/capi/ext/io_spec.so I, [2024-05-27T06:58:56.117108 #3340252] INFO -- : building spec/ruby/optional/capi/ext/kernel_spec.so I, [2024-05-27T06:58:56.136627 #3340252] INFO -- : building spec/ruby/optional/capi/ext/language_spec.so I, [2024-05-27T06:58:56.140940 #3340252] INFO -- : building spec/ruby/optional/capi/ext/marshal_spec.so I, [2024-05-27T06:58:56.141236 #3340252] INFO -- : building spec/ruby/optional/capi/ext/module_spec.so I, [2024-05-27T06:58:56.144819 #3340252] INFO -- : building spec/ruby/optional/capi/ext/module_under_autoload_spec.so I, [2024-05-27T06:58:56.144951 #3340252] INFO -- : building spec/ruby/optional/capi/ext/mutex_spec.so I, [2024-05-27T06:58:56.149594 #3340252] INFO -- : building spec/ruby/optional/capi/ext/numeric_spec.so I, [2024-05-27T06:58:56.150515 #3340252] INFO -- : building spec/ruby/optional/capi/ext/object_spec.so I, [2024-05-27T06:58:56.159911 #3340252] INFO -- : building spec/ruby/optional/capi/ext/proc_spec.so I, [2024-05-27T06:58:56.161117 #3340252] INFO -- : building spec/ruby/optional/capi/ext/range_spec.so I, [2024-05-27T06:58:56.183363 #3340252] INFO -- : building spec/ruby/optional/capi/ext/rational_spec.so I, [2024-05-27T06:58:56.224888 #3340252] INFO -- : building spec/ruby/optional/capi/ext/rbasic_spec.so I, [2024-05-27T06:58:56.233523 #3340252] INFO -- : building spec/ruby/optional/capi/ext/regexp_spec.so I, [2024-05-27T06:58:56.269668 #3340252] INFO -- : building spec/ruby/optional/capi/ext/string_spec.so I, [2024-05-27T06:58:56.276304 #3340252] INFO -- : building spec/ruby/optional/capi/ext/struct_spec.so I, [2024-05-27T06:58:56.279472 #3340252] INFO -- : building spec/ruby/optional/capi/ext/st_spec.so I, [2024-05-27T06:58:56.281224 #3340252] INFO -- : building spec/ruby/optional/capi/ext/symbol_spec.so I, [2024-05-27T06:58:56.286547 #3340252] INFO -- : building spec/ruby/optional/capi/ext/thread_spec.so I, [2024-05-27T06:58:56.298910 #3340252] INFO -- : building spec/ruby/optional/capi/ext/time_spec.so I, [2024-05-27T06:58:56.307335 #3340252] INFO -- : building spec/ruby/optional/capi/ext/tracepoint_spec.so I, [2024-05-27T06:58:56.308917 #3340252] INFO -- : building spec/ruby/optional/capi/ext/typed_data_spec.so I, [2024-05-27T06:58:56.310182 #3340252] INFO -- : building spec/ruby/optional/capi/ext/util_spec.so I, [2024-05-27T06:58:56.325290 #3340252] INFO -- : making enc I, [2024-05-27T06:58:56.332568 #3340252] INFO -- : making srcs under enc I, [2024-05-27T06:58:56.352295 #3340252] INFO -- : make[1]: Entering directory '/tmp/ruby/build/trunk' I, [2024-05-27T06:58:56.352359 #3340252] INFO -- : make[1]: Nothing to be done for 'enc'. I, [2024-05-27T06:58:56.352369 #3340252] INFO -- : make[1]: Leaving directory '/tmp/ruby/build/trunk' I, [2024-05-27T06:58:56.380417 #3340252] INFO -- : make[1]: Entering directory '/tmp/ruby/build/trunk' I, [2024-05-27T06:58:56.380477 #3340252] INFO -- : make[1]: Nothing to be done for 'srcs'. I, [2024-05-27T06:58:56.380485 #3340252] INFO -- : make[1]: Leaving directory '/tmp/ruby/build/trunk' I, [2024-05-27T06:58:56.381204 #3340252] INFO -- : generating transdb.h I, [2024-05-27T06:58:56.502414 #3340252] INFO -- : transdb.h unchanged I, [2024-05-27T06:58:56.504299 #3340252] INFO -- : generating makefiles ext/configure-ext.mk I, [2024-05-27T06:58:56.504450 #3340252] INFO -- : making trans I, [2024-05-27T06:58:56.531014 #3340252] INFO -- : ext/configure-ext.mk updated I, [2024-05-27T06:58:56.533276 #3340252] INFO -- : make[1]: Entering directory '/tmp/ruby/build/trunk' I, [2024-05-27T06:58:56.540703 #3340252] INFO -- : make[1]: Entering directory '/tmp/ruby/build/trunk' I, [2024-05-27T06:58:56.540783 #3340252] INFO -- : make[1]: Nothing to be done for 'trans'. I, [2024-05-27T06:58:56.540795 #3340252] INFO -- : make[1]: Leaving directory '/tmp/ruby/build/trunk' I, [2024-05-27T06:58:56.541548 #3340252] INFO -- : making encs I, [2024-05-27T06:58:56.600523 #3340252] INFO -- : make[1]: Entering directory '/tmp/ruby/build/trunk' I, [2024-05-27T06:58:56.600583 #3340252] INFO -- : make[1]: Nothing to be done for 'encs'. I, [2024-05-27T06:58:56.600592 #3340252] INFO -- : make[1]: Leaving directory '/tmp/ruby/build/trunk' I, [2024-05-27T06:58:56.690333 #3340252] INFO -- : make[1]: Leaving directory '/tmp/ruby/build/trunk' I, [2024-05-27T06:58:56.691179 #3340252] INFO -- : generating makefile exts.mk I, [2024-05-27T06:58:56.728464 #3340252] INFO -- : exts.mk unchanged I, [2024-05-27T06:58:56.733037 #3340252] INFO -- : make[1]: Entering directory '/tmp/ruby/build/trunk' I, [2024-05-27T06:58:56.751661 #3340252] INFO -- : make[2]: Entering directory '/tmp/ruby/build/trunk/ext/digest' I, [2024-05-27T06:58:56.753091 #3340252] INFO -- : make[2]: Entering directory '/tmp/ruby/build/trunk/ext/json' I, [2024-05-27T06:58:56.753175 #3340252] INFO -- : make[2]: Entering directory '/tmp/ruby/build/trunk/ext/coverage' I, [2024-05-27T06:58:56.753858 #3340252] INFO -- : make[2]: Entering directory '/tmp/ruby/build/trunk/ext/date' I, [2024-05-27T06:58:56.754112 #3340252] INFO -- : make[2]: Entering directory '/tmp/ruby/build/trunk/ext/io/console' I, [2024-05-27T06:58:56.754729 #3340252] INFO -- : make[2]: Entering directory '/tmp/ruby/build/trunk/ext/rubyvm' I, [2024-05-27T06:58:56.755226 #3340252] INFO -- : make[2]: Entering directory '/tmp/ruby/build/trunk/ext/monitor' I, [2024-05-27T06:58:56.755821 #3340252] INFO -- : make[2]: Entering directory '/tmp/ruby/build/trunk/ext/pathname' I, [2024-05-27T06:58:56.755884 #3340252] INFO -- : make[2]: Leaving directory '/tmp/ruby/build/trunk/ext/digest' I, [2024-05-27T06:58:56.756149 #3340252] INFO -- : make[2]: Entering directory '/tmp/ruby/build/trunk/ext/fiddle' I, [2024-05-27T06:58:56.756325 #3340252] INFO -- : make[2]: Entering directory '/tmp/ruby/build/trunk/ext/pty' I, [2024-05-27T06:58:56.756602 #3340252] INFO -- : make[2]: Leaving directory '/tmp/ruby/build/trunk/ext/rubyvm' I, [2024-05-27T06:58:56.756851 #3340252] INFO -- : make[2]: Leaving directory '/tmp/ruby/build/trunk/ext/coverage' I, [2024-05-27T06:58:56.757270 #3340252] INFO -- : make[2]: Entering directory '/tmp/ruby/build/trunk/ext/objspace' I, [2024-05-27T06:58:56.757319 #3340252] INFO -- : make[2]: Leaving directory '/tmp/ruby/build/trunk/ext/date' I, [2024-05-27T06:58:56.757583 #3340252] INFO -- : make[2]: Leaving directory '/tmp/ruby/build/trunk/ext/io/console' I, [2024-05-27T06:58:56.757750 #3340252] INFO -- : make[2]: Leaving directory '/tmp/ruby/build/trunk/ext/monitor' I, [2024-05-27T06:58:56.757878 #3340252] INFO -- : make[2]: Entering directory '/tmp/ruby/build/trunk/ext/psych' I, [2024-05-27T06:58:56.758192 #3340252] INFO -- : make[2]: Leaving directory '/tmp/ruby/build/trunk/ext/pty' I, [2024-05-27T06:58:56.758480 #3340252] INFO -- : make[2]: Leaving directory '/tmp/ruby/build/trunk/ext/pathname' I, [2024-05-27T06:58:56.758699 #3340252] INFO -- : make[2]: Leaving directory '/tmp/ruby/build/trunk/ext/json' I, [2024-05-27T06:58:56.760259 #3340252] INFO -- : make[2]: Entering directory '/tmp/ruby/build/trunk/.bundle/gems/debug-1.9.2/ext/debug' I, [2024-05-27T06:58:56.760943 #3340252] INFO -- : make[2]: Entering directory '/tmp/ruby/build/trunk/ext/ripper' I, [2024-05-27T06:58:56.760999 #3340252] INFO -- : make[2]: Entering directory '/tmp/ruby/build/trunk/.bundle/gems/bigdecimal-3.1.8/ext/bigdecimal' I, [2024-05-27T06:58:56.761078 #3340252] INFO -- : make[2]: Entering directory '/tmp/ruby/build/trunk/.bundle/gems/nkf-0.2.0/ext/nkf' I, [2024-05-27T06:58:56.761277 #3340252] INFO -- : make[2]: Entering directory '/tmp/ruby/build/trunk/.bundle/gems/racc-1.7.3/ext/racc/cparse' I, [2024-05-27T06:58:56.761390 #3340252] INFO -- : make[2]: Entering directory '/tmp/ruby/build/trunk/.bundle/gems/racc-1.8.0/ext/racc/cparse' I, [2024-05-27T06:58:56.761466 #3340252] INFO -- : make[2]: Leaving directory '/tmp/ruby/build/trunk/ext/objspace' I, [2024-05-27T06:58:56.761499 #3340252] INFO -- : make[2]: Entering directory '/tmp/ruby/build/trunk/.bundle/gems/syslog-0.1.2/ext/syslog' I, [2024-05-27T06:58:56.761917 #3340252] INFO -- : make[2]: Entering directory '/tmp/ruby/build/trunk/.bundle/gems/rbs-3.4.4/ext/rbs_extension' I, [2024-05-27T06:58:56.762442 #3340252] INFO -- : make[2]: Leaving directory '/tmp/ruby/build/trunk/ext/fiddle' I, [2024-05-27T06:58:56.765916 #3340252] INFO -- : make[2]: Entering directory '/tmp/ruby/build/trunk/ext/socket' I, [2024-05-27T06:58:56.766411 #3340252] INFO -- : make[2]: Leaving directory '/tmp/ruby/build/trunk/ext/ripper' I, [2024-05-27T06:58:56.767120 #3340252] INFO -- : make[2]: Entering directory '/tmp/ruby/build/trunk/ext/digest/sha2' I, [2024-05-27T06:58:56.769353 #3340252] INFO -- : make[2]: Leaving directory '/tmp/ruby/build/trunk/ext/digest/sha2' I, [2024-05-27T06:58:56.769389 #3340252] INFO -- : make[2]: Leaving directory '/tmp/ruby/build/trunk/ext/psych' I, [2024-05-27T06:58:56.769877 #3340252] INFO -- : make[2]: Entering directory '/tmp/ruby/build/trunk/ext/openssl' I, [2024-05-27T06:58:56.774445 #3340252] INFO -- : make[2]: Leaving directory '/tmp/ruby/build/trunk/ext/socket' I, [2024-05-27T06:58:56.781184 #3340252] INFO -- : make[2]: Leaving directory '/tmp/ruby/build/trunk/ext/openssl' I, [2024-05-27T06:58:56.784118 #3340252] INFO -- : make[2]: Leaving directory '/tmp/ruby/build/trunk/.bundle/gems/debug-1.9.2/ext/debug' I, [2024-05-27T06:58:56.785211 #3340252] INFO -- : make[2]: Leaving directory '/tmp/ruby/build/trunk/.bundle/gems/syslog-0.1.2/ext/syslog' I, [2024-05-27T06:58:56.785415 #3340252] INFO -- : make[2]: Leaving directory '/tmp/ruby/build/trunk/.bundle/gems/racc-1.7.3/ext/racc/cparse' I, [2024-05-27T06:58:56.785664 #3340252] INFO -- : make[2]: Leaving directory '/tmp/ruby/build/trunk/.bundle/gems/rbs-3.4.4/ext/rbs_extension' I, [2024-05-27T06:58:56.793016 #3340252] INFO -- : make[2]: Leaving directory '/tmp/ruby/build/trunk/.bundle/gems/bigdecimal-3.1.8/ext/bigdecimal' I, [2024-05-27T06:58:56.793814 #3340252] INFO -- : make[2]: Leaving directory '/tmp/ruby/build/trunk/.bundle/gems/nkf-0.2.0/ext/nkf' I, [2024-05-27T06:58:56.793970 #3340252] INFO -- : make[2]: Leaving directory '/tmp/ruby/build/trunk/.bundle/gems/racc-1.8.0/ext/racc/cparse' I, [2024-05-27T06:58:56.818931 #3340252] INFO -- : make[2]: Entering directory '/tmp/ruby/build/trunk' I, [2024-05-27T06:58:56.886419 #3340252] INFO -- : linking ruby I, [2024-05-27T06:58:56.908866 #3340252] INFO -- : make[2]: Leaving directory '/tmp/ruby/build/trunk' I, [2024-05-27T06:58:56.909327 #3340252] INFO -- : make[1]: Leaving directory '/tmp/ruby/build/trunk' I, [2024-05-27T06:58:56.913409 #3340252] INFO -- : make[1]: Entering directory '/tmp/ruby/build/trunk' I, [2024-05-27T06:58:56.913470 #3340252] INFO -- : make[1]: Nothing to be done for 'note'. I, [2024-05-27T06:58:56.913487 #3340252] INFO -- : make[1]: Leaving directory '/tmp/ruby/build/trunk' I, [2024-05-27T06:58:56.914179 #3340252] INFO -- : $$$[end] "make all -j20" exit with 0. I, [2024-05-27T06:58:56.914376 #3340252] INFO -- : $$$[beg] make install -j20 I, [2024-05-27T06:58:56.978376 #3340252] INFO -- : Update power_assert to 84e85124c5014a139af39161d484156cfe87a9ed I, [2024-05-27T06:58:56.978670 #3340252] INFO -- : Update rbs to ba7872795d5de04adb8ff500c0e6afdc81a041dd I, [2024-05-27T06:58:56.979213 #3340252] INFO -- : Update typeprof to b19a6416da3a05d57fadd6ffdadb382b6d236ca5 I, [2024-05-27T06:58:56.980008 #3340252] INFO -- : echo 84e85124c5014a139af39161d484156cfe87a9ed | /bin/sh /tmp/ruby/src/trunk/tool/ifchange /tmp/ruby/src/trunk/.bundle/.timestamp/power_assert.revision - I, [2024-05-27T06:58:56.980192 #3340252] INFO -- : echo ba7872795d5de04adb8ff500c0e6afdc81a041dd | /bin/sh /tmp/ruby/src/trunk/tool/ifchange /tmp/ruby/src/trunk/.bundle/.timestamp/rbs.revision - I, [2024-05-27T06:58:56.981169 #3340252] INFO -- : BASERUBY = /usr/bin/ruby --disable=gems I, [2024-05-27T06:58:56.981207 #3340252] INFO -- : CC = gcc I, [2024-05-27T06:58:56.981226 #3340252] INFO -- : LD = ld I, [2024-05-27T06:58:56.981240 #3340252] INFO -- : LDSHARED = gcc -shared I, [2024-05-27T06:58:56.981253 #3340252] INFO -- : CFLAGS = -O3 -fno-fast-math -ggdb3 -Wall -Wextra -Wdeprecated-declarations -Wdiv-by-zero -Wduplicated-cond -Wimplicit-function-declaration -Wimplicit-int -Wpointer-arith -Wwrite-strings -Wold-style-definition -Wimplicit-fallthrough=0 -Wmissing-noreturn -Wno-cast-function-type -Wno-constant-logical-operand -Wno-long-long -Wno-missing-field-initializers -Wno-overlength-strings -Wno-packed-bitfield-compat -Wno-parentheses-equality -Wno-self-assign -Wno-tautological-compare -Wno-unused-parameter -Wno-unused-value -Wsuggest-attribute=format -Wsuggest-attribute=noreturn -Wunused-variable -Wmisleading-indentation -Wundef -fPIC I, [2024-05-27T06:58:56.981268 #3340252] INFO -- : XCFLAGS = -U_FORTIFY_SOURCE -D_FORTIFY_SOURCE=2 -fstack-protector-strong -fno-strict-overflow -fvisibility=hidden -fexcess-precision=standard -DRUBY_EXPORT -I. -I.ext/include/x86_64-linux -I/tmp/ruby/src/trunk/include -I/tmp/ruby/src/trunk -I/tmp/ruby/src/trunk/prism -I/tmp/ruby/src/trunk/enc/unicode/15.0.0 I, [2024-05-27T06:58:56.981282 #3340252] INFO -- : CPPFLAGS = I, [2024-05-27T06:58:56.981295 #3340252] INFO -- : DLDFLAGS = -Wl,--compress-debug-sections=zlib -Wl,-soname,libruby.so.3.4 -fstack-protector-strong I, [2024-05-27T06:58:56.981310 #3340252] INFO -- : SOLIBS = -lz -lrt -lrt -lgmp -ldl -lcrypt -lm -lpthread I, [2024-05-27T06:58:56.981323 #3340252] INFO -- : LANG = en_US.UTF-8 I, [2024-05-27T06:58:56.981335 #3340252] INFO -- : LC_ALL = I, [2024-05-27T06:58:56.981348 #3340252] INFO -- : LC_CTYPE = I, [2024-05-27T06:58:56.981361 #3340252] INFO -- : MFLAGS = -j20 --jobserver-auth=4,5 I, [2024-05-27T06:58:56.981374 #3340252] INFO -- : RUSTC = no I, [2024-05-27T06:58:56.981387 #3340252] INFO -- : YJIT_RUSTC_ARGS = --crate-name=yjit --crate-type=staticlib --edition=2021 -g -C lto=thin -C opt-level=3 -C overflow-checks=on '--out-dir=/tmp/ruby/build/trunk/yjit/target/release/' /tmp/ruby/src/trunk/yjit/src/lib.rs I, [2024-05-27T06:58:56.982336 #3340252] INFO -- : /tmp/ruby/src/trunk/.bundle/.timestamp/power_assert.revision unchanged I, [2024-05-27T06:58:56.982587 #3340252] INFO -- : /tmp/ruby/src/trunk/.bundle/.timestamp/rbs.revision unchanged I, [2024-05-27T06:58:57.011184 #3340252] INFO -- : echo b19a6416da3a05d57fadd6ffdadb382b6d236ca5 | /bin/sh /tmp/ruby/src/trunk/tool/ifchange /tmp/ruby/src/trunk/.bundle/.timestamp/typeprof.revision - I, [2024-05-27T06:58:57.011865 #3340252] INFO -- : generating encdb.h I, [2024-05-27T06:58:57.011897 #3340252] INFO -- : gcc (Ubuntu 11.4.0-1ubuntu1~22.04) 11.4.0 I, [2024-05-27T06:58:57.011909 #3340252] INFO -- : Copyright (C) 2021 Free Software Foundation, Inc. I, [2024-05-27T06:58:57.011919 #3340252] INFO -- : This is free software; see the source for copying conditions. There is NO I, [2024-05-27T06:58:57.011930 #3340252] INFO -- : warranty; not even for MERCHANTABILITY or FITNESS FOR A PARTICULAR PURPOSE. I, [2024-05-27T06:58:57.011940 #3340252] INFO -- : I, [2024-05-27T06:58:57.012709 #3340252] INFO -- : generating enc.mk I, [2024-05-27T06:58:57.013353 #3340252] INFO -- : /tmp/ruby/src/trunk/.bundle/.timestamp/typeprof.revision unchanged I, [2024-05-27T06:58:57.036030 #3340252] INFO -- : encdb.h unchanged I, [2024-05-27T06:58:57.037384 #3340252] INFO -- : Building power_assert@84e85124c5014a139af39161d484156cfe87a9ed to /tmp/ruby/src/trunk/gems/power_assert-2.0.3.gem I, [2024-05-27T06:58:57.106937 #3340252] INFO -- : Successfully built RubyGem I, [2024-05-27T06:58:57.106989 #3340252] INFO -- : Name: power_assert I, [2024-05-27T06:58:57.107002 #3340252] INFO -- : Version: 2.0.4dev I, [2024-05-27T06:58:57.107012 #3340252] INFO -- : File: power_assert-2.0.4dev.gem I, [2024-05-27T06:58:57.108918 #3340252] INFO -- : Extracting bundle gem power_assert-2.0.3... I, [2024-05-27T06:58:57.134794 #3340252] INFO -- : making srcs under enc I, [2024-05-27T06:58:57.134937 #3340252] INFO -- : making enc I, [2024-05-27T06:58:57.152320 #3340252] INFO -- : make[1]: Entering directory '/tmp/ruby/build/trunk' I, [2024-05-27T06:58:57.152375 #3340252] INFO -- : make[1]: Nothing to be done for 'enc'. I, [2024-05-27T06:58:57.152388 #3340252] INFO -- : make[1]: Leaving directory '/tmp/ruby/build/trunk' I, [2024-05-27T06:58:57.164205 #3340252] INFO -- : make[1]: Entering directory '/tmp/ruby/build/trunk' I, [2024-05-27T06:58:57.164264 #3340252] INFO -- : make[1]: Nothing to be done for 'srcs'. I, [2024-05-27T06:58:57.164277 #3340252] INFO -- : make[1]: Leaving directory '/tmp/ruby/build/trunk' I, [2024-05-27T06:58:57.164954 #3340252] INFO -- : generating transdb.h I, [2024-05-27T06:58:57.171088 #3340252] INFO -- : Try with hash version of bundled gems instead of gems/power_assert-2.0.3.gem. We don't use this gem with release version of Ruby. I, [2024-05-27T06:58:57.176153 #3340252] INFO -- : Unpacked gems/power_assert-2.0.4dev.gem I, [2024-05-27T06:58:57.260986 #3340252] INFO -- : transdb.h unchanged I, [2024-05-27T06:58:57.262428 #3340252] INFO -- : generating makefiles ext/configure-ext.mk I, [2024-05-27T06:58:57.262498 #3340252] INFO -- : making trans I, [2024-05-27T06:58:57.289558 #3340252] INFO -- : ext/configure-ext.mk unchanged I, [2024-05-27T06:58:57.291605 #3340252] INFO -- : make[1]: Entering directory '/tmp/ruby/build/trunk' I, [2024-05-27T06:58:57.297555 #3340252] INFO -- : make[1]: Entering directory '/tmp/ruby/build/trunk' I, [2024-05-27T06:58:57.297647 #3340252] INFO -- : make[1]: Nothing to be done for 'trans'. I, [2024-05-27T06:58:57.297658 #3340252] INFO -- : make[1]: Leaving directory '/tmp/ruby/build/trunk' I, [2024-05-27T06:58:57.298515 #3340252] INFO -- : making encs I, [2024-05-27T06:58:57.357681 #3340252] INFO -- : make[1]: Entering directory '/tmp/ruby/build/trunk' I, [2024-05-27T06:58:57.357757 #3340252] INFO -- : make[1]: Nothing to be done for 'encs'. I, [2024-05-27T06:58:57.357788 #3340252] INFO -- : make[1]: Leaving directory '/tmp/ruby/build/trunk' I, [2024-05-27T06:58:57.446003 #3340252] INFO -- : make[1]: Leaving directory '/tmp/ruby/build/trunk' I, [2024-05-27T06:58:57.446677 #3340252] INFO -- : generating makefile exts.mk I, [2024-05-27T06:58:57.485063 #3340252] INFO -- : exts.mk unchanged I, [2024-05-27T06:58:57.490355 #3340252] INFO -- : make[1]: Entering directory '/tmp/ruby/build/trunk' I, [2024-05-27T06:58:57.512197 #3340252] INFO -- : make[2]: Entering directory '/tmp/ruby/build/trunk/ext/digest' I, [2024-05-27T06:58:57.513698 #3340252] INFO -- : make[2]: Entering directory '/tmp/ruby/build/trunk/ext/json' I, [2024-05-27T06:58:57.513938 #3340252] INFO -- : make[2]: Entering directory '/tmp/ruby/build/trunk/ext/coverage' I, [2024-05-27T06:58:57.514010 #3340252] INFO -- : make[2]: Entering directory '/tmp/ruby/build/trunk/ext/io/console' I, [2024-05-27T06:58:57.514537 #3340252] INFO -- : make[2]: Entering directory '/tmp/ruby/build/trunk/ext/date' I, [2024-05-27T06:58:57.515827 #3340252] INFO -- : make[2]: Entering directory '/tmp/ruby/build/trunk/ext/monitor' I, [2024-05-27T06:58:57.516350 #3340252] INFO -- : make[2]: Entering directory '/tmp/ruby/build/trunk/ext/fiddle' I, [2024-05-27T06:58:57.516435 #3340252] INFO -- : make[2]: Entering directory '/tmp/ruby/build/trunk/ext/pathname' I, [2024-05-27T06:58:57.516593 #3340252] INFO -- : make[2]: Leaving directory '/tmp/ruby/build/trunk/ext/io/console' I, [2024-05-27T06:58:57.517021 #3340252] INFO -- : make[2]: Entering directory '/tmp/ruby/build/trunk/ext/pty' I, [2024-05-27T06:58:57.517076 #3340252] INFO -- : make[2]: Leaving directory '/tmp/ruby/build/trunk/ext/coverage' I, [2024-05-27T06:58:57.517187 #3340252] INFO -- : make[2]: Entering directory '/tmp/ruby/build/trunk/ext/rubyvm' I, [2024-05-27T06:58:57.517928 #3340252] INFO -- : make[2]: Entering directory '/tmp/ruby/build/trunk/ext/objspace' I, [2024-05-27T06:58:57.517972 #3340252] INFO -- : make[2]: Leaving directory '/tmp/ruby/build/trunk/ext/digest' I, [2024-05-27T06:58:57.518055 #3340252] INFO -- : make[2]: Leaving directory '/tmp/ruby/build/trunk/ext/date' I, [2024-05-27T06:58:57.518359 #3340252] INFO -- : make[2]: Leaving directory '/tmp/ruby/build/trunk/ext/monitor' I, [2024-05-27T06:58:57.518499 #3340252] INFO -- : make[2]: Entering directory '/tmp/ruby/build/trunk/ext/psych' I, [2024-05-27T06:58:57.518825 #3340252] INFO -- : make[2]: Leaving directory '/tmp/ruby/build/trunk/ext/json' I, [2024-05-27T06:58:57.518847 #3340252] INFO -- : make[2]: Leaving directory '/tmp/ruby/build/trunk/ext/rubyvm' I, [2024-05-27T06:58:57.519665 #3340252] INFO -- : make[2]: Leaving directory '/tmp/ruby/build/trunk/ext/pty' I, [2024-05-27T06:58:57.519799 #3340252] INFO -- : make[2]: Leaving directory '/tmp/ruby/build/trunk/ext/pathname' I, [2024-05-27T06:58:57.521479 #3340252] INFO -- : make[2]: Entering directory '/tmp/ruby/build/trunk/.bundle/gems/bigdecimal-3.1.8/ext/bigdecimal' I, [2024-05-27T06:58:57.521855 #3340252] INFO -- : make[2]: Entering directory '/tmp/ruby/build/trunk/.bundle/gems/debug-1.9.2/ext/debug' I, [2024-05-27T06:58:57.522038 #3340252] INFO -- : make[2]: Leaving directory '/tmp/ruby/build/trunk/ext/objspace' I, [2024-05-27T06:58:57.522285 #3340252] INFO -- : make[2]: Entering directory '/tmp/ruby/build/trunk/.bundle/gems/nkf-0.2.0/ext/nkf' I, [2024-05-27T06:58:57.522403 #3340252] INFO -- : make[2]: Entering directory '/tmp/ruby/build/trunk/.bundle/gems/racc-1.7.3/ext/racc/cparse' I, [2024-05-27T06:58:57.522523 #3340252] INFO -- : make[2]: Entering directory '/tmp/ruby/build/trunk/.bundle/gems/racc-1.8.0/ext/racc/cparse' I, [2024-05-27T06:58:57.522662 #3340252] INFO -- : make[2]: Entering directory '/tmp/ruby/build/trunk/.bundle/gems/syslog-0.1.2/ext/syslog' I, [2024-05-27T06:58:57.523092 #3340252] INFO -- : make[2]: Entering directory '/tmp/ruby/build/trunk/.bundle/gems/rbs-3.4.4/ext/rbs_extension' I, [2024-05-27T06:58:57.523309 #3340252] INFO -- : make[2]: Leaving directory '/tmp/ruby/build/trunk/ext/fiddle' I, [2024-05-27T06:58:57.523863 #3340252] INFO -- : make[2]: Entering directory '/tmp/ruby/build/trunk/ext/ripper' I, [2024-05-27T06:58:57.525650 #3340252] INFO -- : make[2]: Entering directory '/tmp/ruby/build/trunk/ext/digest/sha2' I, [2024-05-27T06:58:57.526486 #3340252] INFO -- : make[2]: Entering directory '/tmp/ruby/build/trunk/ext/socket' I, [2024-05-27T06:58:57.527947 #3340252] INFO -- : make[2]: Leaving directory '/tmp/ruby/build/trunk/ext/digest/sha2' I, [2024-05-27T06:58:57.528765 #3340252] INFO -- : make[2]: Entering directory '/tmp/ruby/build/trunk/ext/openssl' I, [2024-05-27T06:58:57.529473 #3340252] INFO -- : make[2]: Leaving directory '/tmp/ruby/build/trunk/ext/psych' I, [2024-05-27T06:58:57.531270 #3340252] INFO -- : make[2]: Leaving directory '/tmp/ruby/build/trunk/ext/ripper' I, [2024-05-27T06:58:57.534850 #3340252] INFO -- : make[2]: Leaving directory '/tmp/ruby/build/trunk/ext/socket' I, [2024-05-27T06:58:57.540042 #3340252] INFO -- : make[2]: Leaving directory '/tmp/ruby/build/trunk/ext/openssl' I, [2024-05-27T06:58:57.545605 #3340252] INFO -- : make[2]: Leaving directory '/tmp/ruby/build/trunk/.bundle/gems/bigdecimal-3.1.8/ext/bigdecimal' I, [2024-05-27T06:58:57.545665 #3340252] INFO -- : make[2]: Leaving directory '/tmp/ruby/build/trunk/.bundle/gems/debug-1.9.2/ext/debug' I, [2024-05-27T06:58:57.546654 #3340252] INFO -- : make[2]: Leaving directory '/tmp/ruby/build/trunk/.bundle/gems/nkf-0.2.0/ext/nkf' I, [2024-05-27T06:58:57.548293 #3340252] INFO -- : make[2]: Leaving directory '/tmp/ruby/build/trunk/.bundle/gems/syslog-0.1.2/ext/syslog' I, [2024-05-27T06:58:57.555493 #3340252] INFO -- : make[2]: Leaving directory '/tmp/ruby/build/trunk/.bundle/gems/racc-1.8.0/ext/racc/cparse' I, [2024-05-27T06:58:57.555725 #3340252] INFO -- : make[2]: Leaving directory '/tmp/ruby/build/trunk/.bundle/gems/rbs-3.4.4/ext/rbs_extension' I, [2024-05-27T06:58:57.558825 #3340252] INFO -- : make[2]: Leaving directory '/tmp/ruby/build/trunk/.bundle/gems/racc-1.7.3/ext/racc/cparse' I, [2024-05-27T06:58:57.584107 #3340252] INFO -- : make[2]: Entering directory '/tmp/ruby/build/trunk' I, [2024-05-27T06:58:57.650795 #3340252] INFO -- : make[2]: 'ruby' is up to date. I, [2024-05-27T06:58:57.650832 #3340252] INFO -- : make[2]: Leaving directory '/tmp/ruby/build/trunk' I, [2024-05-27T06:58:57.651117 #3340252] INFO -- : make[1]: Leaving directory '/tmp/ruby/build/trunk' I, [2024-05-27T06:58:57.654980 #3340252] INFO -- : make[1]: Entering directory '/tmp/ruby/build/trunk' I, [2024-05-27T06:58:57.655004 #3340252] INFO -- : make[1]: Nothing to be done for 'note'. I, [2024-05-27T06:58:57.655010 #3340252] INFO -- : make[1]: Leaving directory '/tmp/ruby/build/trunk' I, [2024-05-27T06:58:57.655156 #3340252] INFO -- : ./miniruby -I/tmp/ruby/src/trunk/lib -I. -I.ext/common /tmp/ruby/src/trunk/tool/runruby.rb --extout=.ext -- --disable-gems -r./x86_64-linux-fake /tmp/ruby/src/trunk/tool/rbinstall.rb --make="make" --dest-dir="" --extout=".ext" --ext-build-dir="./ext" --mflags="-j20 --jobserver-auth=4,5" --make-flags=" -j20 --jobserver-auth=4,5" --data-mode=0644 --prog-mode=0755 --installed-list .installed.list --mantype="doc" --gnumake --install=all --exclude=doc I, [2024-05-27T06:58:57.756167 #3340252] INFO -- : Installing to I, [2024-05-27T06:58:57.756234 #3340252] INFO -- : installing binary commands: /tmp/ruby/install/trunk/bin I, [2024-05-27T06:58:57.756346 #3340252] INFO -- : installing base libraries: /tmp/ruby/install/trunk/lib I, [2024-05-27T06:58:57.763550 #3340252] INFO -- : installing arch files: /tmp/ruby/install/trunk/lib/ruby/3.4.0+0/x86_64-linux I, [2024-05-27T06:58:57.763576 #3340252] INFO -- : installing pkgconfig data: /tmp/ruby/install/trunk/lib/pkgconfig I, [2024-05-27T06:58:57.763582 #3340252] INFO -- : installing extension objects: /tmp/ruby/install/trunk/lib/ruby/3.4.0+0/x86_64-linux I, [2024-05-27T06:58:57.773192 #3340252] INFO -- : installing extension objects: /tmp/ruby/install/trunk/lib/ruby/site_ruby/3.4.0+0/x86_64-linux I, [2024-05-27T06:58:57.773215 #3340252] INFO -- : installing extension objects: /tmp/ruby/install/trunk/lib/ruby/vendor_ruby/3.4.0+0/x86_64-linux I, [2024-05-27T06:58:57.773223 #3340252] INFO -- : installing extension headers: /tmp/ruby/install/trunk/include/ruby-3.4.0+0/x86_64-linux I, [2024-05-27T06:58:57.773374 #3340252] INFO -- : installing extension scripts: /tmp/ruby/install/trunk/lib/ruby/3.4.0+0 I, [2024-05-27T06:58:57.776119 #3340252] INFO -- : installing extension scripts: /tmp/ruby/install/trunk/lib/ruby/site_ruby/3.4.0+0 I, [2024-05-27T06:58:57.776146 #3340252] INFO -- : installing extension scripts: /tmp/ruby/install/trunk/lib/ruby/vendor_ruby/3.4.0+0 I, [2024-05-27T06:58:57.776152 #3340252] INFO -- : installing extension headers: /tmp/ruby/install/trunk/include/ruby-3.4.0+0/ruby I, [2024-05-27T06:58:57.776156 #3340252] INFO -- : installing command scripts: /tmp/ruby/install/trunk/bin I, [2024-05-27T06:58:57.776160 #3340252] INFO -- : installing library scripts: /tmp/ruby/install/trunk/lib/ruby/3.4.0+0 I, [2024-05-27T06:58:57.808537 #3340252] INFO -- : installing common headers: /tmp/ruby/install/trunk/include/ruby-3.4.0+0 I, [2024-05-27T06:58:57.814838 #3340252] INFO -- : installing manpages: /tmp/ruby/install/trunk/share/man/man1 I, [2024-05-27T06:58:57.814865 #3340252] INFO -- : installing default gems from lib: /tmp/ruby/install/trunk/lib/ruby/gems/3.4.0+0 I, [2024-05-27T06:58:57.837757 #3340252] INFO -- : benchmark 0.3.0 I, [2024-05-27T06:58:57.839697 #3340252] INFO -- : bundler 2.6.0.dev I, [2024-05-27T06:58:57.841841 #3340252] INFO -- : cgi 0.4.1 I, [2024-05-27T06:58:57.842385 #3340252] INFO -- : delegate 0.3.1 I, [2024-05-27T06:58:57.842872 #3340252] INFO -- : did_you_mean 1.6.3 I, [2024-05-27T06:58:57.843336 #3340252] INFO -- : english 0.8.0 I, [2024-05-27T06:58:57.843807 #3340252] INFO -- : erb 4.0.4 I, [2024-05-27T06:58:57.845024 #3340252] INFO -- : error_highlight 0.6.0 I, [2024-05-27T06:58:57.845729 #3340252] INFO -- : fileutils 1.7.2 I, [2024-05-27T06:58:57.846440 #3340252] INFO -- : find 0.2.0 I, [2024-05-27T06:58:57.847346 #3340252] INFO -- : forwardable 1.3.3 I, [2024-05-27T06:58:57.848321 #3340252] INFO -- : ipaddr 1.2.6 I, [2024-05-27T06:58:57.848904 #3340252] INFO -- : irb 1.13.1 I, [2024-05-27T06:58:57.849689 #3340252] INFO -- : logger 1.6.0 I, [2024-05-27T06:58:57.850162 #3340252] INFO -- : net-http 0.4.1 I, [2024-05-27T06:58:57.850660 #3340252] INFO -- : net-protocol 0.2.2 I, [2024-05-27T06:58:57.851151 #3340252] INFO -- : open-uri 0.4.1 I, [2024-05-27T06:58:57.851589 #3340252] INFO -- : open3 0.2.1 I, [2024-05-27T06:58:57.852135 #3340252] INFO -- : optparse 0.5.0 I, [2024-05-27T06:58:57.852640 #3340252] INFO -- : ostruct 0.6.0 I, [2024-05-27T06:58:57.853102 #3340252] INFO -- : pp 0.5.0 I, [2024-05-27T06:58:57.853569 #3340252] INFO -- : prettyprint 0.2.0 I, [2024-05-27T06:58:57.854043 #3340252] INFO -- : prism 0.29.0 I, [2024-05-27T06:58:57.854573 #3340252] INFO -- : pstore 0.1.3 I, [2024-05-27T06:58:57.855011 #3340252] INFO -- : rdoc 6.7.0 I, [2024-05-27T06:58:57.855958 #3340252] INFO -- : readline 0.0.4 I, [2024-05-27T06:58:57.856580 #3340252] INFO -- : reline 0.5.7 I, [2024-05-27T06:58:57.857102 #3340252] INFO -- : resolv 0.4.0 I, [2024-05-27T06:58:57.857591 #3340252] INFO -- : ruby2_keywords 0.0.5 I, [2024-05-27T06:58:57.858055 #3340252] INFO -- : securerandom 0.3.1 I, [2024-05-27T06:58:57.859178 #3340252] INFO -- : set 1.1.0 I, [2024-05-27T06:58:57.859693 #3340252] INFO -- : shellwords 0.2.0 I, [2024-05-27T06:58:57.860263 #3340252] INFO -- : singleton 0.2.0 I, [2024-05-27T06:58:57.860713 #3340252] INFO -- : syntax_suggest 2.0.0 I, [2024-05-27T06:58:57.861410 #3340252] INFO -- : tempfile 0.2.1 I, [2024-05-27T06:58:57.861880 #3340252] INFO -- : time 0.3.0 I, [2024-05-27T06:58:57.862373 #3340252] INFO -- : timeout 0.4.1 I, [2024-05-27T06:58:57.862848 #3340252] INFO -- : tmpdir 0.2.0 I, [2024-05-27T06:58:57.863242 #3340252] INFO -- : tsort 0.2.0 I, [2024-05-27T06:58:57.863722 #3340252] INFO -- : un 0.3.0 I, [2024-05-27T06:58:57.864263 #3340252] INFO -- : uri 0.13.0 I, [2024-05-27T06:58:57.864765 #3340252] INFO -- : weakref 0.1.3 I, [2024-05-27T06:58:57.865242 #3340252] INFO -- : yaml 0.3.0 I, [2024-05-27T06:58:57.865514 #3340252] INFO -- : installing default gems from ext: /tmp/ruby/install/trunk/lib/ruby/gems/3.4.0+0 I, [2024-05-27T06:58:57.872187 #3340252] INFO -- : date 3.3.4 I, [2024-05-27T06:58:57.872724 #3340252] INFO -- : digest 3.1.1 I, [2024-05-27T06:58:57.873218 #3340252] INFO -- : etc 1.4.3 I, [2024-05-27T06:58:57.873664 #3340252] INFO -- : fcntl 1.1.0 I, [2024-05-27T06:58:57.874198 #3340252] INFO -- : fiddle 1.1.3 I, [2024-05-27T06:58:57.874693 #3340252] INFO -- : io-console 0.7.2 I, [2024-05-27T06:58:57.875169 #3340252] INFO -- : io-nonblock 0.3.0 I, [2024-05-27T06:58:57.875629 #3340252] INFO -- : io-wait 0.3.1 I, [2024-05-27T06:58:57.876046 #3340252] INFO -- : json 2.7.2 I, [2024-05-27T06:58:57.876654 #3340252] INFO -- : openssl 3.2.0 I, [2024-05-27T06:58:57.877146 #3340252] INFO -- : pathname 0.3.0 I, [2024-05-27T06:58:57.877570 #3340252] INFO -- : psych 5.1.2 I, [2024-05-27T06:58:57.878178 #3340252] INFO -- : stringio 3.1.1 I, [2024-05-27T06:58:57.878678 #3340252] INFO -- : strscan 3.1.1 I, [2024-05-27T06:58:57.879144 #3340252] INFO -- : zlib 3.1.0 I, [2024-05-27T06:58:57.879499 #3340252] INFO -- : installing bundled gems: /tmp/ruby/install/trunk/lib/ruby/gems/3.4.0+0 I, [2024-05-27T06:58:57.880230 #3340252] INFO -- : minitest 5.23.1 I, [2024-05-27T06:58:57.888956 #3340252] INFO -- : rake 13.2.1 I, [2024-05-27T06:58:57.892391 #3340252] INFO -- : test-unit 3.6.2 I, [2024-05-27T06:58:57.897267 #3340252] INFO -- : rexml 3.2.8 I, [2024-05-27T06:58:57.901026 #3340252] INFO -- : rss 0.3.0 I, [2024-05-27T06:58:57.903643 #3340252] INFO -- : net-ftp 0.3.4 I, [2024-05-27T06:58:57.905306 #3340252] INFO -- : net-imap 0.4.11 I, [2024-05-27T06:58:57.909034 #3340252] INFO -- : net-pop 0.1.2 I, [2024-05-27T06:58:57.910045 #3340252] INFO -- : net-smtp 0.5.0 I, [2024-05-27T06:58:57.911206 #3340252] INFO -- : matrix 0.4.2 I, [2024-05-27T06:58:57.914683 #3340252] INFO -- : prime 0.1.2 I, [2024-05-27T06:58:57.919309 #3340252] INFO -- : rbs 3.4.4 I, [2024-05-27T06:58:57.941594 #3340252] INFO -- : typeprof 0.21.11 I, [2024-05-27T06:58:57.944380 #3340252] INFO -- : debug 1.9.2 I, [2024-05-27T06:58:57.947637 #3340252] INFO -- : racc 1.8.0 I, [2024-05-27T06:58:57.950347 #3340252] INFO -- : mutex_m 0.2.0 I, [2024-05-27T06:58:57.951695 #3340252] INFO -- : getoptlong 0.2.1 I, [2024-05-27T06:58:57.953322 #3340252] INFO -- : base64 0.2.0 I, [2024-05-27T06:58:57.954429 #3340252] INFO -- : bigdecimal 3.1.8 I, [2024-05-27T06:58:57.956978 #3340252] INFO -- : observer 0.1.2 I, [2024-05-27T06:58:57.958145 #3340252] INFO -- : abbrev 0.1.2 I, [2024-05-27T06:58:57.959408 #3340252] INFO -- : resolv-replace 0.1.1 I, [2024-05-27T06:58:57.960835 #3340252] INFO -- : rinda 0.2.0 I, [2024-05-27T06:58:57.962170 #3340252] INFO -- : drb 2.2.1 I, [2024-05-27T06:58:57.963760 #3340252] INFO -- : nkf 0.2.0 I, [2024-05-27T06:58:57.966230 #3340252] INFO -- : syslog 0.1.2 I, [2024-05-27T06:58:57.968578 #3340252] INFO -- : csv 3.3.0 I, [2024-05-27T06:58:57.971036 #3340252] INFO -- : installing bundled gem cache: /tmp/ruby/install/trunk/lib/ruby/gems/3.4.0+0/cache I, [2024-05-27T06:58:57.972424 #3340252] INFO -- : skipped bundled gems: I, [2024-05-27T06:58:57.972446 #3340252] INFO -- : power_assert-2.0.4dev.gem not found in bundled_gems I, [2024-05-27T06:58:57.975450 #3340252] INFO -- : $$$[end] "make install -j20" exit with 0. I, [2024-05-27T06:58:57.975560 #3340252] INFO -- : $$$[beg] make yes-btest TESTOPTS='-q -j20' I, [2024-05-27T06:59:03.364046 #3340252] INFO -- : PASS all 1936 tests E, [2024-05-27T06:59:03.369485 #3340252] ERROR -- : I, [2024-05-27T06:59:03.369757 #3340252] INFO -- : $$$[end] "make yes-btest TESTOPTS='-q -j20'" exit with 0. I, [2024-05-27T06:59:03.369838 #3340252] INFO -- : $$$[beg] make yes-test-basic TESTS='-j20' I, [2024-05-27T06:59:03.429105 #3340252] INFO -- : BASERUBY = /usr/bin/ruby --disable=gems I, [2024-05-27T06:59:03.429157 #3340252] INFO -- : CC = gcc I, [2024-05-27T06:59:03.429173 #3340252] INFO -- : LD = ld I, [2024-05-27T06:59:03.429186 #3340252] INFO -- : LDSHARED = gcc -shared I, [2024-05-27T06:59:03.429202 #3340252] INFO -- : CFLAGS = -O3 -fno-fast-math -ggdb3 -Wall -Wextra -Wdeprecated-declarations -Wdiv-by-zero -Wduplicated-cond -Wimplicit-function-declaration -Wimplicit-int -Wpointer-arith -Wwrite-strings -Wold-style-definition -Wimplicit-fallthrough=0 -Wmissing-noreturn -Wno-cast-function-type -Wno-constant-logical-operand -Wno-long-long -Wno-missing-field-initializers -Wno-overlength-strings -Wno-packed-bitfield-compat -Wno-parentheses-equality -Wno-self-assign -Wno-tautological-compare -Wno-unused-parameter -Wno-unused-value -Wsuggest-attribute=format -Wsuggest-attribute=noreturn -Wunused-variable -Wmisleading-indentation -Wundef -fPIC I, [2024-05-27T06:59:03.429216 #3340252] INFO -- : XCFLAGS = -U_FORTIFY_SOURCE -D_FORTIFY_SOURCE=2 -fstack-protector-strong -fno-strict-overflow -fvisibility=hidden -fexcess-precision=standard -DRUBY_EXPORT -I. -I.ext/include/x86_64-linux -I/tmp/ruby/src/trunk/include -I/tmp/ruby/src/trunk -I/tmp/ruby/src/trunk/prism -I/tmp/ruby/src/trunk/enc/unicode/15.0.0 I, [2024-05-27T06:59:03.429229 #3340252] INFO -- : CPPFLAGS = I, [2024-05-27T06:59:03.429242 #3340252] INFO -- : DLDFLAGS = -Wl,--compress-debug-sections=zlib -Wl,-soname,libruby.so.3.4 -fstack-protector-strong I, [2024-05-27T06:59:03.429265 #3340252] INFO -- : SOLIBS = -lz -lrt -lrt -lgmp -ldl -lcrypt -lm -lpthread I, [2024-05-27T06:59:03.429278 #3340252] INFO -- : LANG = en_US.UTF-8 I, [2024-05-27T06:59:03.429290 #3340252] INFO -- : LC_ALL = I, [2024-05-27T06:59:03.429302 #3340252] INFO -- : LC_CTYPE = I, [2024-05-27T06:59:03.429313 #3340252] INFO -- : MFLAGS = I, [2024-05-27T06:59:03.429325 #3340252] INFO -- : RUSTC = no I, [2024-05-27T06:59:03.429337 #3340252] INFO -- : YJIT_RUSTC_ARGS = --crate-name=yjit --crate-type=staticlib --edition=2021 -g -C lto=thin -C opt-level=3 -C overflow-checks=on '--out-dir=/tmp/ruby/build/trunk/yjit/target/release/' /tmp/ruby/src/trunk/yjit/src/lib.rs I, [2024-05-27T06:59:03.429742 #3340252] INFO -- : gcc (Ubuntu 11.4.0-1ubuntu1~22.04) 11.4.0 I, [2024-05-27T06:59:03.429791 #3340252] INFO -- : Copyright (C) 2021 Free Software Foundation, Inc. I, [2024-05-27T06:59:03.429806 #3340252] INFO -- : This is free software; see the source for copying conditions. There is NO I, [2024-05-27T06:59:03.429819 #3340252] INFO -- : warranty; not even for MERCHANTABILITY or FITNESS FOR A PARTICULAR PURPOSE. I, [2024-05-27T06:59:03.429831 #3340252] INFO -- : I, [2024-05-27T06:59:03.536966 #3340252] INFO -- : Checking leaked global symbols...none I, [2024-05-27T06:59:03.578776 #3340252] INFO -- : /tmp/ruby/src/trunk/basictest/test.rb:assignment ....................................................................................................................................................................................................................................................................................................................................................................................OK 372 I, [2024-05-27T06:59:03.578872 #3340252] INFO -- : /tmp/ruby/src/trunk/basictest/test.rb:condition ..OK 2 I, [2024-05-27T06:59:03.578889 #3340252] INFO -- : /tmp/ruby/src/trunk/basictest/test.rb:if/unless ...OK 3 I, [2024-05-27T06:59:03.578902 #3340252] INFO -- : /tmp/ruby/src/trunk/basictest/test.rb:case .....OK 5 I, [2024-05-27T06:59:03.579050 #3340252] INFO -- : /tmp/ruby/src/trunk/basictest/test.rb:while/until ........OK 8 I, [2024-05-27T06:59:03.579098 #3340252] INFO -- : /tmp/ruby/src/trunk/basictest/test.rb:exception ..........OK 10 I, [2024-05-27T06:59:03.579371 #3340252] INFO -- : /tmp/ruby/src/trunk/basictest/test.rb:array .......................................OK 39 I, [2024-05-27T06:59:03.579474 #3340252] INFO -- : /tmp/ruby/src/trunk/basictest/test.rb:hash ...........................OK 27 I, [2024-05-27T06:59:03.580196 #3340252] INFO -- : /tmp/ruby/src/trunk/basictest/test.rb:iterator ...........................................................................................................OK 107 I, [2024-05-27T06:59:03.580461 #3340252] INFO -- : /tmp/ruby/src/trunk/basictest/test.rb:float ................................................................................OK 80 I, [2024-05-27T06:59:03.582369 #3340252] INFO -- : /tmp/ruby/src/trunk/basictest/test.rb:bignum ...............................OK 31 I, [2024-05-27T06:59:03.583141 #3340252] INFO -- : /tmp/ruby/src/trunk/basictest/test.rb:string & char ..............................................................OK 62 I, [2024-05-27T06:59:03.583174 #3340252] INFO -- : /tmp/ruby/src/trunk/basictest/test.rb:assignment ..........OK 10 I, [2024-05-27T06:59:03.583202 #3340252] INFO -- : /tmp/ruby/src/trunk/basictest/test.rb:call ......OK 6 I, [2024-05-27T06:59:03.583255 #3340252] INFO -- : /tmp/ruby/src/trunk/basictest/test.rb:proc .........OK 9 I, [2024-05-27T06:59:03.683963 #3340252] INFO -- : /tmp/ruby/src/trunk/basictest/test.rb:signal ..OK 2 I, [2024-05-27T06:59:03.685580 #3340252] INFO -- : /tmp/ruby/src/trunk/basictest/test.rb:eval ...........................OK 27 I, [2024-05-27T06:59:03.791995 #3340252] INFO -- : /tmp/ruby/src/trunk/basictest/test.rb:system ........OK 8 I, [2024-05-27T06:59:03.792674 #3340252] INFO -- : /tmp/ruby/src/trunk/basictest/test.rb:const .....OK 5 I, [2024-05-27T06:59:03.792708 #3340252] INFO -- : /tmp/ruby/src/trunk/basictest/test.rb:clone .....OK 5 I, [2024-05-27T06:59:03.792800 #3340252] INFO -- : /tmp/ruby/src/trunk/basictest/test.rb:marshal ....OK 4 I, [2024-05-27T06:59:03.792837 #3340252] INFO -- : /tmp/ruby/src/trunk/basictest/test.rb:pack ....OK 4 I, [2024-05-27T06:59:03.792846 #3340252] INFO -- : /tmp/ruby/src/trunk/basictest/test.rb:math ..OK 2 I, [2024-05-27T06:59:03.792980 #3340252] INFO -- : /tmp/ruby/src/trunk/basictest/test.rb:struct ......OK 6 I, [2024-05-27T06:59:03.793001 #3340252] INFO -- : /tmp/ruby/src/trunk/basictest/test.rb:variable ............OK 12 I, [2024-05-27T06:59:03.793008 #3340252] INFO -- : /tmp/ruby/src/trunk/basictest/test.rb:trace ...OK 3 I, [2024-05-27T06:59:03.793024 #3340252] INFO -- : /tmp/ruby/src/trunk/basictest/test.rb:defined? ............OK 12 I, [2024-05-27T06:59:03.793058 #3340252] INFO -- : /tmp/ruby/src/trunk/basictest/test.rb:alias ......OK 6 I, [2024-05-27T06:59:03.793312 #3340252] INFO -- : /tmp/ruby/src/trunk/basictest/test.rb:path .......................OK 23 I, [2024-05-27T06:59:03.826800 #3340252] INFO -- : /tmp/ruby/src/trunk/basictest/test.rb:gc ....OK 4 I, [2024-05-27T06:59:03.829191 #3340252] INFO -- : I, [2024-05-27T06:59:03.829214 #3340252] INFO -- : test succeeded I, [2024-05-27T06:59:03.830908 #3340252] INFO -- : $$$[end] "make yes-test-basic TESTS='-j20'" exit with 0. I, [2024-05-27T06:59:03.831003 #3340252] INFO -- : $$$[beg] make yes-test-all TESTOPTS='--stderr-on-failure' TESTS='-j20' I, [2024-05-27T06:59:03.918846 #3340252] INFO -- : BASERUBY = /usr/bin/ruby --disable=gems I, [2024-05-27T06:59:03.918887 #3340252] INFO -- : CC = gcc I, [2024-05-27T06:59:03.918893 #3340252] INFO -- : LD = ld I, [2024-05-27T06:59:03.918897 #3340252] INFO -- : LDSHARED = gcc -shared I, [2024-05-27T06:59:03.918901 #3340252] INFO -- : CFLAGS = -O3 -fno-fast-math -ggdb3 -Wall -Wextra -Wdeprecated-declarations -Wdiv-by-zero -Wduplicated-cond -Wimplicit-function-declaration -Wimplicit-int -Wpointer-arith -Wwrite-strings -Wold-style-definition -Wimplicit-fallthrough=0 -Wmissing-noreturn -Wno-cast-function-type -Wno-constant-logical-operand -Wno-long-long -Wno-missing-field-initializers -Wno-overlength-strings -Wno-packed-bitfield-compat -Wno-parentheses-equality -Wno-self-assign -Wno-tautological-compare -Wno-unused-parameter -Wno-unused-value -Wsuggest-attribute=format -Wsuggest-attribute=noreturn -Wunused-variable -Wmisleading-indentation -Wundef -fPIC I, [2024-05-27T06:59:03.918906 #3340252] INFO -- : XCFLAGS = -U_FORTIFY_SOURCE -D_FORTIFY_SOURCE=2 -fstack-protector-strong -fno-strict-overflow -fvisibility=hidden -fexcess-precision=standard -DRUBY_EXPORT -I. -I.ext/include/x86_64-linux -I/tmp/ruby/src/trunk/include -I/tmp/ruby/src/trunk -I/tmp/ruby/src/trunk/prism -I/tmp/ruby/src/trunk/enc/unicode/15.0.0 I, [2024-05-27T06:59:03.918909 #3340252] INFO -- : CPPFLAGS = I, [2024-05-27T06:59:03.918913 #3340252] INFO -- : DLDFLAGS = -Wl,--compress-debug-sections=zlib -Wl,-soname,libruby.so.3.4 -fstack-protector-strong I, [2024-05-27T06:59:03.918917 #3340252] INFO -- : SOLIBS = -lz -lrt -lrt -lgmp -ldl -lcrypt -lm -lpthread I, [2024-05-27T06:59:03.918921 #3340252] INFO -- : LANG = en_US.UTF-8 I, [2024-05-27T06:59:03.918924 #3340252] INFO -- : LC_ALL = I, [2024-05-27T06:59:03.918927 #3340252] INFO -- : LC_CTYPE = I, [2024-05-27T06:59:03.918931 #3340252] INFO -- : MFLAGS = I, [2024-05-27T06:59:03.918934 #3340252] INFO -- : RUSTC = no I, [2024-05-27T06:59:03.918938 #3340252] INFO -- : YJIT_RUSTC_ARGS = --crate-name=yjit --crate-type=staticlib --edition=2021 -g -C lto=thin -C opt-level=3 -C overflow-checks=on '--out-dir=/tmp/ruby/build/trunk/yjit/target/release/' /tmp/ruby/src/trunk/yjit/src/lib.rs I, [2024-05-27T06:59:03.919571 #3340252] INFO -- : gcc (Ubuntu 11.4.0-1ubuntu1~22.04) 11.4.0 I, [2024-05-27T06:59:03.919587 #3340252] INFO -- : Copyright (C) 2021 Free Software Foundation, Inc. I, [2024-05-27T06:59:03.919598 #3340252] INFO -- : This is free software; see the source for copying conditions. There is NO I, [2024-05-27T06:59:03.919603 #3340252] INFO -- : warranty; not even for MERCHANTABILITY or FITNESS FOR A PARTICULAR PURPOSE. I, [2024-05-27T06:59:03.919606 #3340252] INFO -- : I, [2024-05-27T06:59:03.921349 #3340252] INFO -- : generating enc.mk I, [2024-05-27T06:59:04.038777 #3340252] INFO -- : generating encdb.h I, [2024-05-27T06:59:04.062448 #3340252] INFO -- : encdb.h unchanged I, [2024-05-27T06:59:04.063618 #3340252] INFO -- : making enc I, [2024-05-27T06:59:04.082090 #3340252] INFO -- : make[1]: Entering directory '/tmp/ruby/build/trunk' I, [2024-05-27T06:59:04.082113 #3340252] INFO -- : make[1]: Nothing to be done for 'enc'. I, [2024-05-27T06:59:04.082119 #3340252] INFO -- : make[1]: Leaving directory '/tmp/ruby/build/trunk' I, [2024-05-27T06:59:04.082767 #3340252] INFO -- : making srcs under enc I, [2024-05-27T06:59:04.113492 #3340252] INFO -- : make[1]: Entering directory '/tmp/ruby/build/trunk' I, [2024-05-27T06:59:04.113514 #3340252] INFO -- : make[1]: Nothing to be done for 'srcs'. I, [2024-05-27T06:59:04.113519 #3340252] INFO -- : make[1]: Leaving directory '/tmp/ruby/build/trunk' I, [2024-05-27T06:59:04.114339 #3340252] INFO -- : generating transdb.h I, [2024-05-27T06:59:04.211223 #3340252] INFO -- : transdb.h unchanged I, [2024-05-27T06:59:04.212552 #3340252] INFO -- : making trans I, [2024-05-27T06:59:04.247227 #3340252] INFO -- : make[1]: Entering directory '/tmp/ruby/build/trunk' I, [2024-05-27T06:59:04.247248 #3340252] INFO -- : make[1]: Nothing to be done for 'trans'. I, [2024-05-27T06:59:04.247254 #3340252] INFO -- : make[1]: Leaving directory '/tmp/ruby/build/trunk' I, [2024-05-27T06:59:04.247896 #3340252] INFO -- : making encs I, [2024-05-27T06:59:04.285057 #3340252] INFO -- : make[1]: Entering directory '/tmp/ruby/build/trunk' I, [2024-05-27T06:59:04.285079 #3340252] INFO -- : make[1]: Nothing to be done for 'encs'. I, [2024-05-27T06:59:04.285084 #3340252] INFO -- : make[1]: Leaving directory '/tmp/ruby/build/trunk' I, [2024-05-27T06:59:04.286998 #3340252] INFO -- : generating makefiles ext/configure-ext.mk I, [2024-05-27T06:59:04.314848 #3340252] INFO -- : ext/configure-ext.mk updated I, [2024-05-27T06:59:04.317273 #3340252] INFO -- : make[1]: Entering directory '/tmp/ruby/build/trunk' I, [2024-05-27T06:59:05.713373 #3340252] INFO -- : make[1]: Leaving directory '/tmp/ruby/build/trunk' I, [2024-05-27T06:59:05.714101 #3340252] INFO -- : generating makefile exts.mk I, [2024-05-27T06:59:05.750880 #3340252] INFO -- : exts.mk unchanged I, [2024-05-27T06:59:05.755495 #3340252] INFO -- : make[1]: Entering directory '/tmp/ruby/build/trunk' I, [2024-05-27T06:59:06.081137 #3340252] INFO -- : make[2]: Entering directory '/tmp/ruby/build/trunk/ext/coverage' I, [2024-05-27T06:59:06.085246 #3340252] INFO -- : make[2]: Leaving directory '/tmp/ruby/build/trunk/ext/coverage' I, [2024-05-27T06:59:06.091757 #3340252] INFO -- : make[2]: Entering directory '/tmp/ruby/build/trunk/ext/date' I, [2024-05-27T06:59:06.096682 #3340252] INFO -- : make[2]: Leaving directory '/tmp/ruby/build/trunk/ext/date' I, [2024-05-27T06:59:06.100509 #3340252] INFO -- : make[2]: Entering directory '/tmp/ruby/build/trunk/ext/digest' I, [2024-05-27T06:59:06.109245 #3340252] INFO -- : make[2]: Leaving directory '/tmp/ruby/build/trunk/ext/digest' I, [2024-05-27T06:59:06.135429 #3340252] INFO -- : make[2]: Entering directory '/tmp/ruby/build/trunk/ext/digest/sha2' I, [2024-05-27T06:59:06.140211 #3340252] INFO -- : make[2]: Leaving directory '/tmp/ruby/build/trunk/ext/digest/sha2' I, [2024-05-27T06:59:06.161221 #3340252] INFO -- : make[2]: Entering directory '/tmp/ruby/build/trunk/ext/fiddle' I, [2024-05-27T06:59:06.171954 #3340252] INFO -- : make[2]: Leaving directory '/tmp/ruby/build/trunk/ext/fiddle' I, [2024-05-27T06:59:06.176942 #3340252] INFO -- : make[2]: Entering directory '/tmp/ruby/build/trunk/ext/io/console' I, [2024-05-27T06:59:06.181380 #3340252] INFO -- : make[2]: Leaving directory '/tmp/ruby/build/trunk/ext/io/console' I, [2024-05-27T06:59:06.194227 #3340252] INFO -- : make[2]: Entering directory '/tmp/ruby/build/trunk/ext/json' I, [2024-05-27T06:59:06.204993 #3340252] INFO -- : make[2]: Leaving directory '/tmp/ruby/build/trunk/ext/json' I, [2024-05-27T06:59:06.219816 #3340252] INFO -- : make[2]: Entering directory '/tmp/ruby/build/trunk/ext/monitor' I, [2024-05-27T06:59:06.223015 #3340252] INFO -- : make[2]: Leaving directory '/tmp/ruby/build/trunk/ext/monitor' I, [2024-05-27T06:59:06.228589 #3340252] INFO -- : make[2]: Entering directory '/tmp/ruby/build/trunk/ext/objspace' I, [2024-05-27T06:59:06.232544 #3340252] INFO -- : make[2]: Leaving directory '/tmp/ruby/build/trunk/ext/objspace' I, [2024-05-27T06:59:06.247525 #3340252] INFO -- : make[2]: Entering directory '/tmp/ruby/build/trunk/ext/openssl' I, [2024-05-27T06:59:06.269382 #3340252] INFO -- : make[2]: Leaving directory '/tmp/ruby/build/trunk/ext/openssl' I, [2024-05-27T06:59:06.274243 #3340252] INFO -- : make[2]: Entering directory '/tmp/ruby/build/trunk/ext/pathname' I, [2024-05-27T06:59:06.278349 #3340252] INFO -- : make[2]: Leaving directory '/tmp/ruby/build/trunk/ext/pathname' I, [2024-05-27T06:59:06.285563 #3340252] INFO -- : make[2]: Entering directory '/tmp/ruby/build/trunk/ext/psych' I, [2024-05-27T06:59:06.309089 #3340252] INFO -- : make[2]: Leaving directory '/tmp/ruby/build/trunk/ext/psych' I, [2024-05-27T06:59:06.313582 #3340252] INFO -- : make[2]: Entering directory '/tmp/ruby/build/trunk/ext/pty' I, [2024-05-27T06:59:06.317308 #3340252] INFO -- : make[2]: Leaving directory '/tmp/ruby/build/trunk/ext/pty' I, [2024-05-27T06:59:06.333925 #3340252] INFO -- : make[2]: Entering directory '/tmp/ruby/build/trunk/ext/ripper' I, [2024-05-27T06:59:06.341842 #3340252] INFO -- : make[2]: Leaving directory '/tmp/ruby/build/trunk/ext/ripper' I, [2024-05-27T06:59:06.344297 #3340252] INFO -- : make[2]: Entering directory '/tmp/ruby/build/trunk/ext/rubyvm' I, [2024-05-27T06:59:06.347601 #3340252] INFO -- : make[2]: Leaving directory '/tmp/ruby/build/trunk/ext/rubyvm' I, [2024-05-27T06:59:06.359070 #3340252] INFO -- : make[2]: Entering directory '/tmp/ruby/build/trunk/ext/socket' I, [2024-05-27T06:59:06.365398 #3340252] INFO -- : make[2]: Leaving directory '/tmp/ruby/build/trunk/ext/socket' I, [2024-05-27T06:59:06.376491 #3340252] INFO -- : make[2]: Entering directory '/tmp/ruby/build/trunk/.bundle/gems/bigdecimal-3.1.8/ext/bigdecimal' I, [2024-05-27T06:59:06.399722 #3340252] INFO -- : make[2]: Leaving directory '/tmp/ruby/build/trunk/.bundle/gems/bigdecimal-3.1.8/ext/bigdecimal' I, [2024-05-27T06:59:06.401652 #3340252] INFO -- : make[2]: Entering directory '/tmp/ruby/build/trunk/.bundle/gems/debug-1.9.2/ext/debug' I, [2024-05-27T06:59:06.423403 #3340252] INFO -- : make[2]: Leaving directory '/tmp/ruby/build/trunk/.bundle/gems/debug-1.9.2/ext/debug' I, [2024-05-27T06:59:06.425204 #3340252] INFO -- : make[2]: Entering directory '/tmp/ruby/build/trunk/.bundle/gems/nkf-0.2.0/ext/nkf' I, [2024-05-27T06:59:06.446720 #3340252] INFO -- : make[2]: Leaving directory '/tmp/ruby/build/trunk/.bundle/gems/nkf-0.2.0/ext/nkf' I, [2024-05-27T06:59:06.448686 #3340252] INFO -- : make[2]: Entering directory '/tmp/ruby/build/trunk/.bundle/gems/racc-1.7.3/ext/racc/cparse' I, [2024-05-27T06:59:06.470666 #3340252] INFO -- : make[2]: Leaving directory '/tmp/ruby/build/trunk/.bundle/gems/racc-1.7.3/ext/racc/cparse' I, [2024-05-27T06:59:06.472629 #3340252] INFO -- : make[2]: Entering directory '/tmp/ruby/build/trunk/.bundle/gems/racc-1.8.0/ext/racc/cparse' I, [2024-05-27T06:59:06.496251 #3340252] INFO -- : make[2]: Leaving directory '/tmp/ruby/build/trunk/.bundle/gems/racc-1.8.0/ext/racc/cparse' I, [2024-05-27T06:59:06.498584 #3340252] INFO -- : make[2]: Entering directory '/tmp/ruby/build/trunk/.bundle/gems/rbs-3.4.4/ext/rbs_extension' I, [2024-05-27T06:59:06.520557 #3340252] INFO -- : make[2]: Leaving directory '/tmp/ruby/build/trunk/.bundle/gems/rbs-3.4.4/ext/rbs_extension' I, [2024-05-27T06:59:06.522545 #3340252] INFO -- : make[2]: Entering directory '/tmp/ruby/build/trunk/.bundle/gems/syslog-0.1.2/ext/syslog' I, [2024-05-27T06:59:06.550934 #3340252] INFO -- : make[2]: Leaving directory '/tmp/ruby/build/trunk/.bundle/gems/syslog-0.1.2/ext/syslog' I, [2024-05-27T06:59:06.575708 #3340252] INFO -- : make[2]: Entering directory '/tmp/ruby/build/trunk' I, [2024-05-27T06:59:06.642975 #3340252] INFO -- : make[2]: 'ruby' is up to date. I, [2024-05-27T06:59:06.643013 #3340252] INFO -- : make[2]: Leaving directory '/tmp/ruby/build/trunk' I, [2024-05-27T06:59:06.643259 #3340252] INFO -- : make[1]: Leaving directory '/tmp/ruby/build/trunk' I, [2024-05-27T06:59:06.646990 #3340252] INFO -- : make[1]: Entering directory '/tmp/ruby/build/trunk' I, [2024-05-27T06:59:06.647018 #3340252] INFO -- : make[1]: Nothing to be done for 'note'. I, [2024-05-27T06:59:06.647024 #3340252] INFO -- : make[1]: Leaving directory '/tmp/ruby/build/trunk' I, [2024-05-27T06:59:06.724323 #3340252] INFO -- : Run options: I, [2024-05-27T06:59:06.724383 #3340252] INFO -- : --seed=21485 I, [2024-05-27T06:59:06.724389 #3340252] INFO -- : "--ruby=./miniruby -I/tmp/ruby/src/trunk/lib -I. -I.ext/common /tmp/ruby/src/trunk/tool/runruby.rb --extout=.ext -- --disable-gems" I, [2024-05-27T06:59:06.724393 #3340252] INFO -- : --excludes-dir=/tmp/ruby/src/trunk/test/.excludes I, [2024-05-27T06:59:06.724397 #3340252] INFO -- : --name=!/memory_leak/ I, [2024-05-27T06:59:06.724400 #3340252] INFO -- : --stderr-on-failure I, [2024-05-27T06:59:06.724404 #3340252] INFO -- : -j20 I, [2024-05-27T06:59:06.724407 #3340252] INFO -- : I, [2024-05-27T06:59:06.724411 #3340252] INFO -- : # Running tests: I, [2024-05-27T06:59:06.724414 #3340252] INFO -- : I, [2024-05-27T06:59:06.865175 #3340252] INFO -- : [ 1/883] 3381609=test_rdoc_rd_block_parser I, [2024-05-27T06:59:06.872300 #3340252] INFO -- : [ 2/883] 3381612=test_signedness I, [2024-05-27T06:59:06.872361 #3340252] INFO -- : [ 3/883] 3381608=test_tsort I, [2024-05-27T06:59:06.872537 #3340252] INFO -- : [ 4/883] 3381607=test_ractor I, [2024-05-27T06:59:06.873950 #3340252] INFO -- : [ 5/883] 3381610=test_type I, [2024-05-27T06:59:06.875867 #3340252] INFO -- : [ 6/883] 3381611=test_big5 I, [2024-05-27T06:59:06.877130 #3340252] INFO -- : [ 7/883] 3381622=test_func I, [2024-05-27T06:59:06.877977 #3340252] INFO -- : [ 8/883] 3381621=test_pointer I, [2024-05-27T06:59:06.878012 #3340252] INFO -- : [ 9/883] 3381624=test_object I, [2024-05-27T06:59:06.878020 #3340252] INFO -- : [ 10/883] 3381611=test_ruby_lex I, [2024-05-27T06:59:06.878030 #3340252] INFO -- : [ 11/883] 3381625=test_date_arith I, [2024-05-27T06:59:06.878531 #3340252] INFO -- : [ 12/883] 3381608=test_gem_local_remote_options I, [2024-05-27T06:59:06.882337 #3340252] INFO -- : [ 13/883] 3381610=test_sleep I, [2024-05-27T06:59:06.889509 #3340252] INFO -- : [ 14/883] 3381625=test_change_word I, [2024-05-27T06:59:06.892301 #3340252] INFO -- : [ 15/883] 3381626=test_flip I, [2024-05-27T06:59:06.895353 #3340252] INFO -- : [ 16/883] 3381625=compiler_test I, [2024-05-27T06:59:06.907663 #3340252] INFO -- : [ 17/883] 3381618=test_timeout I, [2024-05-27T06:59:06.907766 #3340252] INFO -- : [ 18/883] 3381614=test_normalize I, [2024-05-27T06:59:06.907910 #3340252] INFO -- : [ 19/883] 3381616=test_ossl I, [2024-05-27T06:59:06.907927 #3340252] INFO -- : [ 20/883] 3381620=test_arithmetic_sequence I, [2024-05-27T06:59:06.908032 #3340252] INFO -- : [ 21/883] 3381623=test_key_actor_emacs I, [2024-05-27T06:59:06.908109 #3340252] INFO -- : [ 22/883] 3381617=test_basicinstructions I, [2024-05-27T06:59:06.908194 #3340252] INFO -- : [ 23/883] 3381615=test_gem_gemcutter_utilities I, [2024-05-27T06:59:06.908503 #3340252] INFO -- : [ 24/883] 3381619=test_gem_command_manager I, [2024-05-27T06:59:06.908746 #3340252] INFO -- : [ 25/883] 3381626=version_test I, [2024-05-27T06:59:06.913603 #3340252] INFO -- : [ 26/883] 3381614=heredoc_dedent_test I, [2024-05-27T06:59:06.914178 #3340252] INFO -- : [ 27/883] 3381618=test_cgi_header I, [2024-05-27T06:59:06.924316 #3340252] INFO -- : [ 28/883] 3381620=test_object I, [2024-05-27T06:59:06.924680 #3340252] INFO -- : [ 29/883] 3381613=test_rdoc_parser_markdown I, [2024-05-27T06:59:06.938049 #3340252] INFO -- : [ 30/883] 3381618=test_import I, [2024-05-27T06:59:06.938107 #3340252] INFO -- : [ 31/883] 3381620=test_not I, [2024-05-27T06:59:06.940918 #3340252] INFO -- : [ 32/883] 3381620=test_gem_resolver_lock_set I, [2024-05-27T06:59:06.955580 #3340252] INFO -- : [ 33/883] 3381607=test_logger I, [2024-05-27T06:59:06.968707 #3340252] INFO -- : [ 34/883] 3381607=test_file_exhaustive I, [2024-05-27T06:59:06.969836 #3340252] INFO -- : [ 35/883] 3381626=test_files_test I, [2024-05-27T06:59:06.983531 #3340252] INFO -- : [ 36/883] 3381609=test_gem_update_suggestion I, [2024-05-27T06:59:06.990348 #3340252] INFO -- : [ 37/883] 3381614=test_fd_setsize I, [2024-05-27T06:59:06.991604 #3340252] INFO -- : [ 38/883] 3381614=test_continuation I, [2024-05-27T06:59:06.993707 #3340252] INFO -- : [ 39/883] 3381625=test_keyword I, [2024-05-27T06:59:06.994599 #3340252] INFO -- : [ 40/883] 3381614=test_class_name_check I, [2024-05-27T06:59:07.013969 #3340252] INFO -- : [ 41/883] 3381614=test_delete I, [2024-05-27T06:59:07.018816 #3340252] INFO -- : [ 42/883] 3381614=test_win32ole_method I, [2024-05-27T06:59:07.026346 #3340252] INFO -- : [ 43/883] 3381617=test_placearg I, [2024-05-27T06:59:07.026554 #3340252] INFO -- : [ 44/883] 3381614=test_gem_package_task I, [2024-05-27T06:59:07.055321 #3340252] INFO -- : [ 45/883] 3381621=test_date_strptime I, [2024-05-27T06:59:07.057093 #3340252] INFO -- : [ 46/883] 3381626=test_rdoc_markup_hard_break I, [2024-05-27T06:59:07.059679 #3340252] INFO -- : [ 47/883] 3381623=test_gem_platform I, [2024-05-27T06:59:07.059748 #3340252] INFO -- : [ 48/883] 3381613=test_pkey_rsa I, [2024-05-27T06:59:07.100687 #3340252] INFO -- : [ 49/883] 3381611=test_gem_commands_push_command I, [2024-05-27T06:59:07.107503 #3340252] INFO -- : [ 50/883] 3381622=test_weakkeymap I, [2024-05-27T06:59:07.138411 #3340252] INFO -- : [ 51/883] 3381608=test_numhash I, [2024-05-27T06:59:07.143371 #3340252] INFO -- : [ 52/883] 3381608=test_webauthn_listener I, [2024-05-27T06:59:07.163326 #3340252] INFO -- : [ 53/883] 3381620=test_lambda I, [2024-05-27T06:59:07.165878 #3340252] INFO -- : [ 54/883] 3381617=test_ast I, [2024-05-27T06:59:07.168149 #3340252] INFO -- : [ 55/883] 3381626=test_gem_request_set_gem_dependency_api I, [2024-05-27T06:59:07.178493 #3340252] INFO -- : [ 56/883] 3381614=test_helper I, [2024-05-27T06:59:07.178583 #3340252] INFO -- : [ 57/883] 3381614=test_random_formatter I, [2024-05-27T06:59:07.193533 #3340252] INFO -- : [ 58/883] 3381614=test_jaro_winkler I, [2024-05-27T06:59:07.195516 #3340252] INFO -- : [ 59/883] 3381614=test_update I, [2024-05-27T06:59:07.198820 #3340252] INFO -- : [ 60/883] 3381614=test_x509name I, [2024-05-27T06:59:07.207739 #3340252] INFO -- : [ 61/883] 3381608=test_fips I, [2024-05-27T06:59:07.208001 #3340252] INFO -- : [ 62/883] 3381614=test_rdoc_code_object I, [2024-05-27T06:59:07.208672 #3340252] INFO -- : [ 63/883] 3381609=test_x509store I, [2024-05-27T06:59:07.219494 #3340252] INFO -- : [ 64/883] 3381622=test_eval I, [2024-05-27T06:59:07.222358 #3340252] INFO -- : [ 65/883] 3381621=json_generator_test I, [2024-05-27T06:59:07.228918 #3340252] INFO -- : [ 66/883] 3381618=test_transcode I, [2024-05-27T06:59:07.245066 #3340252] INFO -- : [ 67/883] 3381620=test_gem_safe_marshal I, [2024-05-27T06:59:07.273340 #3340252] INFO -- : [ 68/883] 3381619=test_gem_resolver_api_set I, [2024-05-27T06:59:07.294876 #3340252] INFO -- : [ 69/883] 3381623=test_config I, [2024-05-27T06:59:07.297256 #3340252] INFO -- : [ 70/883] 3381624=test_gem_resolver_vendor_set I, [2024-05-27T06:59:07.318500 #3340252] INFO -- : [ 71/883] 3381613=test_enumerable I, [2024-05-27T06:59:07.320509 #3340252] INFO -- : [ 72/883] 3381619=test_ts I, [2024-05-27T06:59:07.335707 #3340252] INFO -- : [ 73/883] 3381621=test_ensured I, [2024-05-27T06:59:07.344908 #3340252] INFO -- : [ 74/883] 3381613=test_addr I, [2024-05-27T06:59:07.363401 #3340252] INFO -- : [ 75/883] 3381613=test_locale I, [2024-05-27T06:59:07.403248 #3340252] INFO -- : [ 76/883] 3381621=library_symbols_test I, [2024-05-27T06:59:07.424448 #3340252] INFO -- : [ 77/883] 3381618=test_rdoc_ri_paths I, [2024-05-27T06:59:07.439764 #3340252] INFO -- : [ 78/883] 3381608=test_range I, [2024-05-27T06:59:07.462445 #3340252] INFO -- : [ 79/883] 3381621=test_project_sanity I, [2024-05-27T06:59:07.482873 #3340252] INFO -- : [ 80/883] 3381613=command_line_test I, [2024-05-27T06:59:07.500537 #3340252] INFO -- : [ 81/883] 3381624=test_dup I, [2024-05-27T06:59:07.504026 #3340252] INFO -- : [ 82/883] 3381622=test_pty I, [2024-05-27T06:59:07.504581 #3340252] INFO -- : [ 83/883] 3381615=test_constant I, [2024-05-27T06:59:07.535255 #3340252] INFO -- : [ 84/883] 3381613=test_gem_uri_formatter I, [2024-05-27T06:59:07.561397 #3340252] INFO -- : [ 85/883] 3381626=test_erb_command I, [2024-05-27T06:59:07.599079 #3340252] INFO -- : [ 86/883] 3381625=test_helper I, [2024-05-27T06:59:07.604954 #3340252] INFO -- : [ 87/883] 3381626=test_encoding I, [2024-05-27T06:59:07.605656 #3340252] INFO -- : [ 88/883] 3381614=static_inspect_test I, [2024-05-27T06:59:07.607143 #3340252] INFO -- : [ 89/883] 3381625=bom_test I, [2024-05-27T06:59:07.609989 #3340252] INFO -- : [ 90/883] 3381614=test_data_error I, [2024-05-27T06:59:07.616916 #3340252] INFO -- : [ 91/883] 3381625=unescape_test I, [2024-05-27T06:59:07.618661 #3340252] INFO -- : [ 92/883] 3381609=test_ostruct I, [2024-05-27T06:59:07.620252 #3340252] INFO -- : [ 93/883] 3381618=test_force_exit I, [2024-05-27T06:59:07.660288 #3340252] INFO -- : [ 94/883] 3381614=test_file I, [2024-05-27T06:59:07.671417 #3340252] INFO -- : [ 95/883] 3381624=test_udp I, [2024-05-27T06:59:07.675282 #3340252] INFO -- : [ 96/883] 3381624=test_vm_dump I, [2024-05-27T06:59:07.675711 #3340252] INFO -- : [ 97/883] 3381621=test_tmpdir I, [2024-05-27T06:59:07.676801 #3340252] INFO -- : [ 98/883] 3381624=test_integer_comb I, [2024-05-27T06:59:07.680994 #3340252] INFO -- : [ 99/883] 3381620=test_rdoc_markup_document I, [2024-05-27T06:59:07.693481 #3340252] INFO -- : [100/883] 3381613=errors_test I, [2024-05-27T06:59:07.727206 #3340252] INFO -- : [101/883] 3381621=test_regexp I, [2024-05-27T06:59:07.737917 #3340252] INFO -- : [102/883] 3381618=test_gem_commands_check_command I, [2024-05-27T06:59:07.781191 #3340252] INFO -- : [103/883] 3381613=test_alias I, [2024-05-27T06:59:07.789002 #3340252] INFO -- : [104/883] 3381623=test_timeout I, [2024-05-27T06:59:07.792326 #3340252] INFO -- : [105/883] 3381620=test_unicode_normalize I, [2024-05-27T06:59:07.818078 #3340252] INFO -- : [106/883] 3381609=test_marshal I, [2024-05-27T06:59:07.840266 #3340252] INFO -- : [107/883] 3381626=test_nonblock I, [2024-05-27T06:59:07.854095 #3340252] INFO -- : [108/883] 3381626=test_weakref I, [2024-05-27T06:59:07.873649 #3340252] INFO -- : [109/883] 3381619=test_rb_str_dup I, [2024-05-27T06:59:07.877140 #3340252] INFO -- : [110/883] 3381619=test_reline_key I, [2024-05-27T06:59:07.904626 #3340252] INFO -- : [111/883] 3381611=test_singleton_function I, [2024-05-27T06:59:07.908345 #3340252] INFO -- : [112/883] 3381611=test_ancdata I, [2024-05-27T06:59:07.914257 #3340252] INFO -- : [113/883] 3381611=test_ssl I, [2024-05-27T06:59:07.925403 #3340252] INFO -- : [114/883] 3381619=test_thread I, [2024-05-27T06:59:07.926565 #3340252] INFO -- : [115/883] 3381613=json_ext_parser_test I, [2024-05-27T06:59:07.937827 #3340252] INFO -- : [116/883] 3381613=test_my_integer I, [2024-05-27T06:59:07.954021 #3340252] INFO -- : [117/883] 3381613=test_rendering I, [2024-05-27T06:59:07.965047 #3340252] INFO -- : [118/883] 3381613=test_debugger_integration I, [2024-05-27T06:59:07.972009 #3340252] INFO -- : [119/883] 3381618=test_ractor I, [2024-05-27T06:59:07.982211 #3340252] INFO -- : [120/883] 3381613=parse_stream_test I, [2024-05-27T06:59:07.984805 #3340252] INFO -- : [121/883] 3381613=test_registry I, [2024-05-27T06:59:07.989053 #3340252] INFO -- : [122/883] 3381613=test_gem_source_lock I, [2024-05-27T06:59:08.010893 #3340252] INFO -- : [123/883] 3381626=test_gem I, [2024-05-27T06:59:08.042684 #3340252] INFO -- : [124/883] 3381622=test_dns I, [2024-05-27T06:59:08.069386 #3340252] INFO -- : [125/883] 3381613=test_gem_commands_open_command I, [2024-05-27T06:59:08.076703 #3340252] INFO -- : [126/883] 3381608=test_ractor I, [2024-05-27T06:59:08.083414 #3340252] INFO -- : [127/883] 3381608=test_cgi_core I, [2024-05-27T06:59:08.090652 #3340252] INFO -- : [128/883] 3381608=test_parser I, [2024-05-27T06:59:08.115598 #3340252] INFO -- : [129/883] 3381608=test_gem_commands_setup_command I, [2024-05-27T06:59:08.176134 #3340252] INFO -- : [130/883] 3381613=test_env I, [2024-05-27T06:59:08.234792 #3340252] INFO -- : [131/883] 3381609=test_rdoc_attr I, [2024-05-27T06:59:08.243541 #3340252] INFO -- : [132/883] 3381609=test_dryrun I, [2024-05-27T06:59:08.263462 #3340252] INFO -- : [133/883] 3381609=desugar_compiler_test I, [2024-05-27T06:59:08.367113 #3340252] INFO -- : [134/883] 3381609=test_integer I, [2024-05-27T06:59:08.432304 #3340252] INFO -- : [135/883] 3381609=test_gem_request_set_lockfile_tokenizer I, [2024-05-27T06:59:08.434122 #3340252] INFO -- : [136/883] 3381618=test_stat I, [2024-05-27T06:59:08.441873 #3340252] INFO -- : [137/883] 3381611=test_have_func I, [2024-05-27T06:59:08.450430 #3340252] INFO -- : [138/883] 3381618=test_nextafter I, [2024-05-27T06:59:08.473893 #3340252] INFO -- : [139/883] 3381608=test_capacity I, [2024-05-27T06:59:08.476582 #3340252] INFO -- : [140/883] 3381608=test_object_references I, [2024-05-27T06:59:08.480631 #3340252] INFO -- : [141/883] 3381608=test_usrmarshal I, [2024-05-27T06:59:08.497492 #3340252] INFO -- : [142/883] 3381609=test_gem_resolver_git_specification I, [2024-05-27T06:59:08.516890 #3340252] INFO -- : [143/883] 3381622=test_super I, [2024-05-27T06:59:08.539657 #3340252] INFO -- : [144/883] 3381618=test_rubyoptions I, [2024-05-27T06:59:08.637105 #3340252] INFO -- : [145/883] 3381608=test_cgi_modruby I, [2024-05-27T06:59:08.638390 #3340252] INFO -- : [146/883] 3381608=test_integer I, [2024-05-27T06:59:08.716722 #3340252] INFO -- : [147/883] 3381625=test_https_proxy I, [2024-05-27T06:59:08.721749 #3340252] INFO -- : [148/883] 3381623=test_call I, [2024-05-27T06:59:08.754255 #3340252] INFO -- : [149/883] 3381609=test_rubygems I, [2024-05-27T06:59:08.779433 #3340252] INFO -- : [150/883] 3381625=ruby_api_test I, [2024-05-27T06:59:08.831431 #3340252] INFO -- : [151/883] 3381622=test_find_executable I, [2024-05-27T06:59:08.854024 #3340252] INFO -- : [152/883] 3381622=test_symbol I, [2024-05-27T06:59:08.869653 #3340252] INFO -- : [153/883] 3381623=test_coder I, [2024-05-27T06:59:08.904168 #3340252] INFO -- : [154/883] 3381623=test_nofree I, [2024-05-27T06:59:08.925437 #3340252] INFO -- : [155/883] 3381623=test_context I, [2024-05-27T06:59:08.952986 #3340252] INFO -- : [156/883] 3381609=test_gem_commands_pristine_command I, [2024-05-27T06:59:08.964337 #3340252] INFO -- : [157/883] 3381625=test_unix I, [2024-05-27T06:59:08.989840 #3340252] INFO -- : [158/883] 3381625=test_enc_associate I, [2024-05-27T06:59:09.066645 #3340252] INFO -- : [159/883] 3381623=test_lazy_enumerator I, [2024-05-27T06:59:09.422566 #3340252] INFO -- : [160/883] 3381623=test_pkcs7 I, [2024-05-27T06:59:09.459231 #3340252] INFO -- : [161/883] 3381624=test_gem_resolver_requirement_list I, [2024-05-27T06:59:09.461018 #3340252] INFO -- : [162/883] 3381612=test_arith_seq_beg_len_step I, [2024-05-27T06:59:09.464659 #3340252] INFO -- : [163/883] 3381624=test_function_entry I, [2024-05-27T06:59:09.467733 #3340252] INFO -- : [164/883] 3381624=test_rdoc_generator_darkfish I, [2024-05-27T06:59:09.514346 #3340252] INFO -- : [165/883] 3381612=test_error_highlight I, [2024-05-27T06:59:09.590800 #3340252] INFO -- : [166/883] 3381625=test_resize I, [2024-05-27T06:59:09.602479 #3340252] INFO -- : [167/883] 3381625=test_rdoc_comment I, [2024-05-27T06:59:09.648935 #3340252] INFO -- : [168/883] 3381623=test_gem_source_fetch_problem I, [2024-05-27T06:59:09.662230 #3340252] INFO -- : [169/883] 3381623=json_generic_object_test I, [2024-05-27T06:59:09.680791 #3340252] INFO -- : [170/883] 3381623=test_http_request I, [2024-05-27T06:59:09.743800 #3340252] INFO -- : [171/883] 3381623=test_coderange I, [2024-05-27T06:59:09.748551 #3340252] INFO -- : [172/883] 3381623=test_symbol I, [2024-05-27T06:59:09.755268 #3340252] INFO -- : [173/883] 3381623=location_test I, [2024-05-27T06:59:09.764301 #3340252] INFO -- : [174/883] 3381611=test_mailto I, [2024-05-27T06:59:09.772799 #3340252] INFO -- : [175/883] 3381611=test_ractor_compatibility I, [2024-05-27T06:59:09.801632 #3340252] INFO -- : [176/883] 3381625=test_eval I, [2024-05-27T06:59:09.805863 #3340252] INFO -- : [177/883] 3381625=test_autoconf I, [2024-05-27T06:59:09.808292 #3340252] INFO -- : [178/883] 3381625=test_date_ractor I, [2024-05-27T06:59:09.890015 #3340252] INFO -- : [179/883] 3381623=test_gem_console_ui I, [2024-05-27T06:59:09.897255 #3340252] INFO -- : [180/883] 3381623=test_dir I, [2024-05-27T06:59:09.961764 #3340252] INFO -- : [181/883] 3381626=test_numeric I, [2024-05-27T06:59:09.969605 #3340252] INFO -- : [182/883] 3381626=test_member I, [2024-05-27T06:59:09.972469 #3340252] INFO -- : [183/883] 3381626=test_gem_commands_cleanup_command I, [2024-05-27T06:59:09.984874 #3340252] INFO -- : [184/883] 3381615=test_word I, [2024-05-27T06:59:09.989484 #3340252] INFO -- : [185/883] 3381615=test_cgi_multipart I, [2024-05-27T06:59:10.013236 #3340252] INFO -- : [186/883] 3381612=test_gem_resolver_api_specification I, [2024-05-27T06:59:10.042395 #3340252] INFO -- : [187/883] 3381624=test_win32ole_variant I, [2024-05-27T06:59:10.049422 #3340252] INFO -- : [188/883] 3381624=test_ipaddr I, [2024-05-27T06:59:10.058453 #3340252] INFO -- : [189/883] 3381625=test_rdoc_markup_to_ansi I, [2024-05-27T06:59:10.067681 #3340252] INFO -- : [190/883] 3381624=test_mixed_unicode_escapes I, [2024-05-27T06:59:10.070312 #3340252] INFO -- : [191/883] 3381624=test_history I, [2024-05-27T06:59:10.091682 #3340252] INFO -- : [192/883] 3381625=test_rdoc_extend I, [2024-05-27T06:59:10.117461 #3340252] INFO -- : [193/883] 3381624=test_merge_keys I, [2024-05-27T06:59:10.132640 #3340252] INFO -- : [194/883] 3381624=test_have_macro I, [2024-05-27T06:59:10.137272 #3340252] INFO -- : [195/883] 3381625=test_gem_package I, [2024-05-27T06:59:10.144503 #3340252] INFO -- : [196/883] 3381623=test_complex2 I, [2024-05-27T06:59:10.149774 #3340252] INFO -- : [197/883] 3381623=test_resolve_symbol I, [2024-05-27T06:59:10.179281 #3340252] INFO -- : [198/883] 3381615=test_enum I, [2024-05-27T06:59:10.182092 #3340252] INFO -- : [199/883] 3381620=test_gem_specification I, [2024-05-27T06:59:10.193145 #3340252] INFO -- : [200/883] 3381611=test_threadgroup I, [2024-05-27T06:59:10.226416 #3340252] INFO -- : [201/883] 3381623=test_gem_ci_detector I, [2024-05-27T06:59:10.234892 #3340252] INFO -- : [202/883] 3381623=test_rdoc_class_module I, [2024-05-27T06:59:10.306302 #3340252] INFO -- : [203/883] 3381612=test_bignum I, [2024-05-27T06:59:10.310502 #3340252] INFO -- : [204/883] 3381609=test_win32ole_variable I, [2024-05-27T06:59:10.315979 #3340252] INFO -- : [205/883] 3381609=test_io_wait_uncommon I, [2024-05-27T06:59:10.318833 #3340252] INFO -- : [206/883] 3381609=test_stringio I, [2024-05-27T06:59:10.325209 #3340252] INFO -- : [207/883] 3381622=test_arity I, [2024-05-27T06:59:10.327489 #3340252] INFO -- : [208/883] 3381622=test_trace I, [2024-05-27T06:59:10.332185 #3340252] INFO -- : [209/883] 3381622=ractor_test I, [2024-05-27T06:59:10.397036 #3340252] INFO -- : [210/883] 3381622=test_rdoc_generator_json_index I, [2024-05-27T06:59:10.422860 #3340252] INFO -- : [211/883] 3381609=test_win32ole_event I, [2024-05-27T06:59:10.425973 #3340252] INFO -- : [212/883] 3381626=test_time_tz I, [2024-05-27T06:59:10.427931 #3340252] INFO -- : [213/883] 3381609=test_assembler I, [2024-05-27T06:59:10.430945 #3340252] INFO -- : [214/883] 3381609=attribute_write_test I, [2024-05-27T06:59:10.434364 #3340252] INFO -- : [215/883] 3381609=test_propertyputref I, [2024-05-27T06:59:10.436298 #3340252] INFO -- : [216/883] 3381609=test_spell_checker I, [2024-05-27T06:59:10.447853 #3340252] INFO -- : [217/883] 3381609=test_rational2 I, [2024-05-27T06:59:10.464819 #3340252] INFO -- : [218/883] 3381626=test_rational I, [2024-05-27T06:59:10.471209 #3340252] INFO -- : [219/883] 3381609=test_completion I, [2024-05-27T06:59:10.482262 #3340252] INFO -- : [220/883] 3381626=test_gem_commands_cert_command I, [2024-05-27T06:59:10.577618 #3340252] INFO -- : [221/883] 3381622=test_len I, [2024-05-27T06:59:10.579029 #3340252] INFO -- : [222/883] 3381622=test_yield_block I, [2024-05-27T06:59:10.588876 #3340252] INFO -- : [223/883] 3381622=test_x509ext I, [2024-05-27T06:59:10.605192 #3340252] INFO -- : [224/883] 3381622=test_erb I, [2024-05-27T06:59:10.639282 #3340252] INFO -- : [225/883] 3381622=test_gem_source_installed I, [2024-05-27T06:59:10.646665 #3340252] INFO -- : [226/883] 3381624=test_evaluation I, [2024-05-27T06:59:10.653238 #3340252] INFO -- : [227/883] 3381624=test_https I, [2024-05-27T06:59:10.767539 #3340252] INFO -- : [228/883] 3381625=test_gem_ext_builder I, [2024-05-27T06:59:10.845025 #3340252] INFO -- : [229/883] 3381622=test_rdoc_parser_simple I, [2024-05-27T06:59:10.856193 #3340252] INFO -- : [230/883] 3381622=test_gem_commands_rebuild_command I, [2024-05-27T06:59:10.926663 #3340252] INFO -- : [231/883] 3381615=test_yamldbm I, [2024-05-27T06:59:10.929072 #3340252] INFO -- : [232/883] 3381622=test_load I, [2024-05-27T06:59:10.934149 #3340252] INFO -- : [233/883] 3381622=test_abi I, [2024-05-27T06:59:10.953793 #3340252] INFO -- : [234/883] 3381615=test_provider I, [2024-05-27T06:59:10.995524 #3340252] INFO -- : [235/883] 3381623=test_gem_commands_outdated_command I, [2024-05-27T06:59:11.031587 #3340252] INFO -- : [236/883] 3381623=test_gem_package_tar_writer I, [2024-05-27T06:59:11.047476 #3340252] INFO -- : [237/883] 3381608=test_helper_method I, [2024-05-27T06:59:11.054134 #3340252] INFO -- : [238/883] 3381624=test_array I, [2024-05-27T06:59:11.068373 #3340252] INFO -- : [239/883] 3381622=test_gem_source I, [2024-05-27T06:59:11.139044 #3340252] INFO -- : [240/883] 3381608=test_scalar_scanner I, [2024-05-27T06:59:11.145674 #3340252] INFO -- : [241/883] 3381608=test_win32ole_method_event I, [2024-05-27T06:59:11.147524 #3340252] INFO -- : [242/883] 3381608=test_nesting_parser I, [2024-05-27T06:59:11.150600 #3340252] INFO -- : [243/883] 3381623=test_gem_dependency_list I, [2024-05-27T06:59:11.166149 #3340252] INFO -- : [244/883] 3381608=test_benchmark I, [2024-05-27T06:59:11.192460 #3340252] INFO -- : [245/883] 3381613=test_instrumentation_api I, [2024-05-27T06:59:11.197883 #3340252] INFO -- : [246/883] 3381609=integer_parse_test I, [2024-05-27T06:59:11.200827 #3340252] INFO -- : [247/883] 3381611=test_stringify_symbols I, [2024-05-27T06:59:11.201532 #3340252] INFO -- : [248/883] 3381609=test_boolean I, [2024-05-27T06:59:11.208557 #3340252] INFO -- : [249/883] 3381611=test_rdoc_generator_markup I, [2024-05-27T06:59:11.212752 #3340252] INFO -- : [250/883] 3381609=test_whileuntil I, [2024-05-27T06:59:11.219549 #3340252] INFO -- : [251/883] 3381609=test_buffered_io I, [2024-05-27T06:59:11.225311 #3340252] INFO -- : [252/883] 3381623=test_monitor I, [2024-05-27T06:59:11.244837 #3340252] INFO -- : [253/883] 3381622=test_configuration I, [2024-05-27T06:59:11.255753 #3340252] INFO -- : [254/883] 3381615=test_rubyvm I, [2024-05-27T06:59:11.258073 #3340252] INFO -- : [255/883] 3381615=test_parser I, [2024-05-27T06:59:11.287896 #3340252] INFO -- : [256/883] 3381615=test_arith_seq_extract I, [2024-05-27T06:59:11.299432 #3340252] INFO -- : [257/883] 3381609=test_method_name_check I, [2024-05-27T06:59:11.312778 #3340252] INFO -- : [258/883] 3381622=test_gem_request_set I, [2024-05-27T06:59:11.317418 #3340252] INFO -- : [259/883] 3381611=test_module I, [2024-05-27T06:59:11.322640 #3340252] INFO -- : [260/883] 3381609=test_gem_ext_cargo_builder I, [2024-05-27T06:59:11.351696 #3340252] INFO -- : [261/883] 3381609=test_ssl I, [2024-05-27T06:59:11.430717 #3340252] INFO -- : [262/883] 3381615=constant_path_node_test I, [2024-05-27T06:59:11.438420 #3340252] INFO -- : [263/883] 3381623=test_rdoc_rd_inline I, [2024-05-27T06:59:11.441716 #3340252] INFO -- : [264/883] 3381623=test_x509req I, [2024-05-27T06:59:11.446780 #3340252] INFO -- : [265/883] 3381607=test_mutex I, [2024-05-27T06:59:11.485395 #3340252] INFO -- : [266/883] 3381615=test_set I, [2024-05-27T06:59:11.502673 #3340252] INFO -- : [267/883] 3381615=test_gem_path_support I, [2024-05-27T06:59:11.519638 #3340252] INFO -- : [268/883] 3381615=test_struct I, [2024-05-27T06:59:11.626353 #3340252] INFO -- : [269/883] 3381623=test_files_test_1 I, [2024-05-27T06:59:11.627999 #3340252] INFO -- : [270/883] 3381622=test_color_printer I, [2024-05-27T06:59:11.694407 #3340252] INFO -- : [271/883] 3381622=test_deprecated I, [2024-05-27T06:59:11.701374 #3340252] INFO -- : [272/883] 3381625=test_serialize_subclasses I, [2024-05-27T06:59:11.702805 #3340252] INFO -- : [273/883] 3381622=test_insns_leaf I, [2024-05-27T06:59:11.705444 #3340252] INFO -- : [274/883] 3381622=test_key_error I, [2024-05-27T06:59:11.709927 #3340252] INFO -- : [275/883] 3381625=test_engine I, [2024-05-27T06:59:11.713137 #3340252] INFO -- : [276/883] 3381622=test_win32ole_variant_m I, [2024-05-27T06:59:11.714468 #3340252] INFO -- : [277/883] 3381625=test_div I, [2024-05-27T06:59:11.716145 #3340252] INFO -- : [278/883] 3381622=test_allocation I, [2024-05-27T06:59:11.716664 #3340252] INFO -- : [279/883] 3381625=test_sexp I, [2024-05-27T06:59:11.732318 #3340252] INFO -- : [280/883] 3381625=test_rdoc_markup_include I, [2024-05-27T06:59:11.739767 #3340252] INFO -- : [281/883] 3381625=fuzzer_test I, [2024-05-27T06:59:11.747959 #3340252] INFO -- : [282/883] 3381625=test_variable I, [2024-05-27T06:59:11.804524 #3340252] INFO -- : [283/883] 3381620=test_struct I, [2024-05-27T06:59:11.813393 #3340252] INFO -- : [284/883] 3381620=test_rdoc_markup_to_html_snippet I, [2024-05-27T06:59:11.849049 #3340252] INFO -- : [285/883] 3381625=magic_comment_test I, [2024-05-27T06:59:11.855987 #3340252] INFO -- : [286/883] 3381625=test_cparser I, [2024-05-27T06:59:11.883638 #3340252] INFO -- : [287/883] 3381610=test_pkg_config I, [2024-05-27T06:59:11.903024 #3340252] INFO -- : [288/883] 3381620=test_config I, [2024-05-27T06:59:11.905900 #3340252] INFO -- : [289/883] 3381626=json_parser_test I, [2024-05-27T06:59:11.920646 #3340252] INFO -- : [290/883] 3381610=test_nomethod_error I, [2024-05-27T06:59:11.924876 #3340252] INFO -- : [291/883] 3381610=test_gem_source_subpath_problem I, [2024-05-27T06:59:11.954642 #3340252] INFO -- : [292/883] 3381626=test_dln I, [2024-05-27T06:59:11.955149 #3340252] INFO -- : [293/883] 3381626=json_common_interface_test I, [2024-05-27T06:59:11.963493 #3340252] INFO -- : [294/883] 3381626=test_win32ole_variant_outarg I, [2024-05-27T06:59:11.964926 #3340252] INFO -- : [295/883] 3381626=test_gem_resolver_git_set I, [2024-05-27T06:59:11.976519 #3340252] INFO -- : [296/883] 3381620=test_storage I, [2024-05-27T06:59:11.980454 #3340252] INFO -- : [297/883] 3381620=test_cipher I, [2024-05-27T06:59:12.016010 #3340252] INFO -- : [298/883] 3381615=test_gem_security_signer I, [2024-05-27T06:59:12.019457 #3340252] INFO -- : [299/883] 3381620=test_new I, [2024-05-27T06:59:12.024390 #3340252] INFO -- : [300/883] 3381620=test_shellwords I, [2024-05-27T06:59:12.029570 #3340252] INFO -- : [301/883] 3381620=test_debug I, [2024-05-27T06:59:12.033538 #3340252] INFO -- : [302/883] 3381620=pattern_test I, [2024-05-27T06:59:12.106957 #3340252] INFO -- : [303/883] 3381615=test_memory_view I, [2024-05-27T06:59:12.122877 #3340252] INFO -- : [304/883] 3381620=test_string I, [2024-05-27T06:59:12.126550 #3340252] INFO -- : [305/883] 3381620=test_iterator I, [2024-05-27T06:59:12.144851 #3340252] INFO -- : [306/883] 3381615=test_omap I, [2024-05-27T06:59:12.152592 #3340252] INFO -- : [307/883] 3381615=test_digest_extend I, [2024-05-27T06:59:12.159040 #3340252] INFO -- : [308/883] 3381615=test_windows_1252 I, [2024-05-27T06:59:12.165360 #3340252] INFO -- : [309/883] 3381615=test_input_method I, [2024-05-27T06:59:12.224232 #3340252] INFO -- : [310/883] 3381620=test_process I, [2024-05-27T06:59:12.254189 #3340252] INFO -- : [311/883] 3381620=test_signal I, [2024-05-27T06:59:12.261638 #3340252] INFO -- : [312/883] 3381610=test_fixnum I, [2024-05-27T06:59:12.272338 #3340252] INFO -- : [313/883] 3381626=test_x509crl I, [2024-05-27T06:59:12.276027 #3340252] INFO -- : [314/883] 3381610=test_cgi_session I, [2024-05-27T06:59:12.303324 #3340252] INFO -- : [315/883] 3381610=test_rdoc_rd I, [2024-05-27T06:59:12.360748 #3340252] INFO -- : [316/883] 3381608=test_metaclass I, [2024-05-27T06:59:12.370377 #3340252] INFO -- : [317/883] 3381608=test_rdoc_top_level I, [2024-05-27T06:59:12.403038 #3340252] INFO -- : [318/883] 3381625=test_dir_m17n I, [2024-05-27T06:59:12.428562 #3340252] INFO -- : [319/883] 3381615=test_gem_resolver_installer_set I, [2024-05-27T06:59:12.463935 #3340252] INFO -- : [320/883] 3381626=test_gem_commands_signout_command I, [2024-05-27T06:59:12.473472 #3340252] INFO -- : [321/883] 3381626=test_refinement I, [2024-05-27T06:59:12.489470 #3340252] INFO -- : [322/883] 3381610=test_regex_casefold I, [2024-05-27T06:59:12.575508 #3340252] INFO -- : [323/883] 3381607=test_gem_source_git I, [2024-05-27T06:59:12.599501 #3340252] INFO -- : [324/883] 3381615=test_float I, [2024-05-27T06:59:12.859157 #3340252] INFO -- : [325/883] 3381608=test_cgi_cookie I, [2024-05-27T06:59:12.865686 #3340252] INFO -- : [326/883] 3381608=test_require I, [2024-05-27T06:59:12.995451 #3340252] INFO -- : [327/883] 3381612=test_fiber I, [2024-05-27T06:59:13.056308 #3340252] INFO -- : [328/883] 3381610=test_multi_irb_commands I, [2024-05-27T06:59:13.061380 #3340252] INFO -- : [329/883] 3381610=test_open3 I, [2024-05-27T06:59:13.189143 #3340252] INFO -- : [330/883] 3381611=test_bundled_ca I, [2024-05-27T06:59:13.220745 #3340252] INFO -- : [331/883] 3381607=test_closure I, [2024-05-27T06:59:13.344340 #3340252] INFO -- : [332/883] 3381607=test_digest I, [2024-05-27T06:59:13.348701 #3340252] INFO -- : [333/883] 3381607=test_ractor I, [2024-05-27T06:59:13.396474 #3340252] INFO -- : [334/883] 3381607=test_gem_security I, [2024-05-27T06:59:13.555497 #3340252] INFO -- : [335/883] 3381616=test_rdoc_servlet I, [2024-05-27T06:59:13.669403 #3340252] INFO -- : [336/883] 3381625=test_recursion I, [2024-05-27T06:59:13.672007 #3340252] INFO -- : [337/883] 3381625=test_exit I, [2024-05-27T06:59:13.724608 #3340252] INFO -- : [338/883] 3381614=test_delegate I, [2024-05-27T06:59:13.739203 #3340252] INFO -- : [339/883] 3381614=test_popen_deadlock I, [2024-05-27T06:59:13.763713 #3340252] INFO -- : [340/883] 3381625=test_history I, [2024-05-27T06:59:13.783999 #3340252] INFO -- : [341/883] 3381616=test_date_marshal I, [2024-05-27T06:59:13.789101 #3340252] INFO -- : [342/883] 3381616=test_mkmf I, [2024-05-27T06:59:13.818378 #3340252] INFO -- : [343/883] 3381616=test_pinned I, [2024-05-27T06:59:13.832274 #3340252] INFO -- : [344/883] 3381616=test_printf I, [2024-05-27T06:59:13.843439 #3340252] INFO -- : [345/883] 3381616=test_rdoc_markup_pre_process I, [2024-05-27T06:59:13.858468 #3340252] INFO -- : [346/883] 3381625=test_time I, [2024-05-27T06:59:13.910305 #3340252] INFO -- : [347/883] 3381616=test_webauthn_listener_response I, [2024-05-27T06:59:14.021514 #3340252] INFO -- : [348/883] 3381625=test_to_ary_concat I, [2024-05-27T06:59:14.091781 #3340252] INFO -- : [349/883] 3381616=test_stream I, [2024-05-27T06:59:14.097008 #3340252] INFO -- : [350/883] 3381615=test_gem_commands_unpack_command I, [2024-05-27T06:59:14.115542 #3340252] INFO -- : [351/883] 3381616=test_files_lib I, [2024-05-27T06:59:14.161270 #3340252] INFO -- : [352/883] 3381623=test_beginendblock I, [2024-05-27T06:59:14.172073 #3340252] INFO -- : [353/883] 3381613=test_rdoc_markup_to_bs I, [2024-05-27T06:59:14.205816 #3340252] INFO -- : [354/883] 3381613=test_help I, [2024-05-27T06:59:14.206183 #3340252] INFO -- : [355/883] 3381613=test_gem_bundler_version_finder I, [2024-05-27T06:59:14.238100 #3340252] INFO -- : [356/883] 3381613=test_emoji_breaks I, [2024-05-27T06:59:14.242794 #3340252] INFO -- : [357/883] 3381613=test_within_pipe I, [2024-05-27T06:59:14.276948 #3340252] INFO -- : [358/883] 3381613=reflection_test I, [2024-05-27T06:59:14.285175 #3340252] INFO -- : [359/883] 3381613=test_scheduler I, [2024-05-27T06:59:14.328286 #3340252] INFO -- : [360/883] 3381614=test_class I, [2024-05-27T06:59:14.371799 #3340252] INFO -- : [361/883] 3381615=test_ocsp I, [2024-05-27T06:59:14.379816 #3340252] INFO -- : [362/883] 3381614=test_pkey_dsa I, [2024-05-27T06:59:14.384932 #3340252] INFO -- : [363/883] 3381620=test_iseq I, [2024-05-27T06:59:14.456376 #3340252] INFO -- : [364/883] 3381613=test_exception_at_throwing I, [2024-05-27T06:59:14.518699 #3340252] INFO -- : [365/883] 3381622=test_rdoc_markup_heading I, [2024-05-27T06:59:14.519828 #3340252] INFO -- : [366/883] 3381613=test_append I, [2024-05-27T06:59:14.522738 #3340252] INFO -- : [367/883] 3381622=test_option I, [2024-05-27T06:59:14.527257 #3340252] INFO -- : [368/883] 3381613=test_cmethod I, [2024-05-27T06:59:14.531575 #3340252] INFO -- : [369/883] 3381613=test_tracer I, [2024-05-27T06:59:14.536904 #3340252] INFO -- : [370/883] 3381613=test_variable_name_check I, [2024-05-27T06:59:14.588701 #3340252] INFO -- : [371/883] 3381613=test_io_m17n I, [2024-05-27T06:59:14.604344 #3340252] INFO -- : [372/883] 3381623=test_did_you_mean I, [2024-05-27T06:59:14.674732 #3340252] INFO -- : [373/883] 3381622=test_gem_commands_server_command I, [2024-05-27T06:59:14.679396 #3340252] INFO -- : [374/883] 3381622=test_interned_str I, [2024-05-27T06:59:14.684665 #3340252] INFO -- : [375/883] 3381622=test_case_comprehensive I, [2024-05-27T06:59:14.695173 #3340252] INFO -- : [376/883] 3381615=test_gem_commands_build_command I, [2024-05-27T06:59:14.731444 #3340252] INFO -- : [377/883] 3381623=test_gem_commands_update_command I, [2024-05-27T06:59:14.947211 #3340252] INFO -- : [378/883] 3381620=test_gem_resolver_vendor_specification I, [2024-05-27T06:59:14.968389 #3340252] INFO -- : [379/883] 3381611=test_key_event_record I, [2024-05-27T06:59:14.970237 #3340252] INFO -- : [380/883] 3381611=test_gem_uri I, [2024-05-27T06:59:14.975255 #3340252] INFO -- : [381/883] 3381620=test_random I, [2024-05-27T06:59:14.986752 #3340252] INFO -- : [382/883] 3381620=test_notimplement I, [2024-05-27T06:59:14.987806 #3340252] INFO -- : [383/883] 3381615=test_thread_cv I, [2024-05-27T06:59:14.992567 #3340252] INFO -- : [384/883] 3381611=test_lexer I, [2024-05-27T06:59:14.995486 #3340252] INFO -- : [385/883] 3381620=test_ssl_session I, [2024-05-27T06:59:15.003758 #3340252] INFO -- : [386/883] 3381611=test_rdoc_generator_pot I, [2024-05-27T06:59:15.021665 #3340252] INFO -- : [387/883] 3381611=test_koi8 I, [2024-05-27T06:59:15.024191 #3340252] INFO -- : [388/883] 3381611=parameters_signature_test I, [2024-05-27T06:59:15.076097 #3340252] INFO -- : [389/883] 3381611=test_rdoc_parser_changelog I, [2024-05-27T06:59:15.131768 #3340252] INFO -- : [390/883] 3381611=test_enumerator I, [2024-05-27T06:59:15.134719 #3340252] INFO -- : [391/883] 3381611=test_unicode I, [2024-05-27T06:59:15.143111 #3340252] INFO -- : [392/883] 3381611=test_rdoc_method_attr I, [2024-05-27T06:59:15.247462 #3340252] INFO -- : [393/883] 3381611=test_gem_gem_runner I, [2024-05-27T06:59:15.290943 #3340252] INFO -- : [394/883] 3381611=test_filter I, [2024-05-27T06:59:15.320890 #3340252] INFO -- : [395/883] 3381611=static_literals_test I, [2024-05-27T06:59:15.325174 #3340252] INFO -- : [396/883] 3381611=test_data I, [2024-05-27T06:59:15.329583 #3340252] INFO -- : [397/883] 3381611=test_tree_spell_checker I, [2024-05-27T06:59:15.338889 #3340252] INFO -- : [398/883] 3381626=test_addrinfo I, [2024-05-27T06:59:15.351971 #3340252] INFO -- : [399/883] 3381611=test_http I, [2024-05-27T06:59:15.365976 #3340252] INFO -- : [400/883] 3381626=test_bn I, [2024-05-27T06:59:15.375028 #3340252] INFO -- : [401/883] 3381626=test_win32ole_param_event I, [2024-05-27T06:59:15.379570 #3340252] INFO -- : [402/883] 3381626=test_path I, [2024-05-27T06:59:15.380570 #3340252] INFO -- : [403/883] 3381626=test_case_mapping I, [2024-05-27T06:59:15.380837 #3340252] INFO -- : [404/883] 3381610=redundant_return_test I, [2024-05-27T06:59:15.394295 #3340252] INFO -- : [405/883] 3381626=test_compile_prism I, [2024-05-27T06:59:15.496981 #3340252] INFO -- : [406/883] 3381610=test_terminfo I, [2024-05-27T06:59:15.505084 #3340252] INFO -- : [407/883] 3381624=test_bug-14834 I, [2024-05-27T06:59:15.556639 #3340252] INFO -- : [408/883] 3381610=test_date_compat I, [2024-05-27T06:59:15.561515 #3340252] INFO -- : [409/883] 3381610=test_rdoc_markup_to_html I, [2024-05-27T06:59:15.564008 #3340252] INFO -- : [410/883] 3381624=test_key_stroke I, [2024-05-27T06:59:15.572238 #3340252] INFO -- : [411/883] 3381624=test_color I, [2024-05-27T06:59:15.598818 #3340252] INFO -- : [412/883] 3381625=json_encoding_test I, [2024-05-27T06:59:15.604989 #3340252] INFO -- : [413/883] 3381625=test_sockopt I, [2024-05-27T06:59:15.607897 #3340252] INFO -- : [414/883] 3381625=test_install I, [2024-05-27T06:59:15.612232 #3340252] INFO -- : [415/883] 3381626=test_rdoc_markup_to_label I, [2024-05-27T06:59:15.613857 #3340252] INFO -- : [416/883] 3381624=test_httpheader I, [2024-05-27T06:59:15.620709 #3340252] INFO -- : [417/883] 3381624=test_gem_resolver_local_specification I, [2024-05-27T06:59:15.622276 #3340252] INFO -- : [418/883] 3381615=test_rdoc_ri_driver I, [2024-05-27T06:59:15.646235 #3340252] INFO -- : [419/883] 3381626=test_encoding I, [2024-05-27T06:59:15.656892 #3340252] INFO -- : [420/883] 3381624=test_httpresponses I, [2024-05-27T06:59:15.659526 #3340252] INFO -- : [421/883] 3381626=test_set_len I, [2024-05-27T06:59:15.660353 #3340252] INFO -- : [422/883] 3381624=test_name_error_extension I, [2024-05-27T06:59:15.662470 #3340252] INFO -- : [423/883] 3381626=test_chilled I, [2024-05-27T06:59:15.666961 #3340252] INFO -- : [424/883] 3381626=test_rdoc_i18n_locale I, [2024-05-27T06:59:15.668654 #3340252] INFO -- : [425/883] 3381614=test_document I, [2024-05-27T06:59:15.670861 #3340252] INFO -- : [426/883] 3381624=test_rdoc_generator_pot_po_entry I, [2024-05-27T06:59:15.671511 #3340252] INFO -- : [427/883] 3381626=test_euc_jp I, [2024-05-27T06:59:15.673629 #3340252] INFO -- : [428/883] 3381614=test_acceptable I, [2024-05-27T06:59:15.674742 #3340252] INFO -- : [429/883] 3381626=test_win32ole_param I, [2024-05-27T06:59:15.676138 #3340252] INFO -- : [430/883] 3381626=test_gem_commands_yank_command I, [2024-05-27T06:59:15.681972 #3340252] INFO -- : [431/883] 3381624=test_pair I, [2024-05-27T06:59:15.686007 #3340252] INFO -- : [432/883] 3381610=test_rbconfig I, [2024-05-27T06:59:15.691084 #3340252] INFO -- : [433/883] 3381610=test_primitive I, [2024-05-27T06:59:15.695747 #3340252] INFO -- : [434/883] 3381610=test_human_typo I, [2024-05-27T06:59:15.710372 #3340252] INFO -- : [435/883] 3381610=test_euc_kr I, [2024-05-27T06:59:15.714318 #3340252] INFO -- : [436/883] 3381610=test_rdoc_context_section I, [2024-05-27T06:59:15.720270 #3340252] INFO -- : [437/883] 3381610=test_ftp I, [2024-05-27T06:59:15.735748 #3340252] INFO -- : [438/883] 3381610=test_to_ruby I, [2024-05-27T06:59:15.752656 #3340252] INFO -- : [439/883] 3381610=test_pattern_key_name_check I, [2024-05-27T06:59:15.763931 #3340252] INFO -- : [440/883] 3381610=test_gem_impossible_dependencies_error I, [2024-05-27T06:59:15.771245 #3340252] INFO -- : [441/883] 3381610=test_pack I, [2024-05-27T06:59:15.827620 #3340252] INFO -- : [442/883] 3381614=test_array_create I, [2024-05-27T06:59:15.833017 #3340252] INFO -- : [443/883] 3381614=test_method I, [2024-05-27T06:59:15.853059 #3340252] INFO -- : [444/883] 3381608=test_gem_commands_query_command I, [2024-05-27T06:59:15.859122 #3340252] INFO -- : [445/883] 3381625=test_rdoc_rubygems_hook I, [2024-05-27T06:59:15.891078 #3340252] INFO -- : [446/883] 3381613=test_cp949 I, [2024-05-27T06:59:15.909534 #3340252] INFO -- : [447/883] 3381615=test_condition I, [2024-05-27T06:59:15.912979 #3340252] INFO -- : [448/883] 3381615=test_foreach I, [2024-05-27T06:59:15.916899 #3340252] INFO -- : [449/883] 3381615=test_gem_source_specific_file I, [2024-05-27T06:59:15.926496 #3340252] INFO -- : [450/883] 3381613=test_gem_commands_uninstall_command I, [2024-05-27T06:59:15.932589 #3340252] INFO -- : [451/883] 3381625=test_gem_unsatisfiable_dependency_error I, [2024-05-27T06:59:15.937560 #3340252] INFO -- : [452/883] 3381610=test_win32ole_record I, [2024-05-27T06:59:15.940309 #3340252] INFO -- : [453/883] 3381625=test_emoji I, [2024-05-27T06:59:15.941369 #3340252] INFO -- : [454/883] 3381610=test_win32ole_type_event I, [2024-05-27T06:59:15.941640 #3340252] INFO -- : [455/883] 3381610=test_sorted_set I, [2024-05-27T06:59:15.955426 #3340252] INFO -- : [456/883] 3381623=test_hash I, [2024-05-27T06:59:15.963900 #3340252] INFO -- : [457/883] 3381625=test_ubf_async_safe I, [2024-05-27T06:59:15.970091 #3340252] INFO -- : [458/883] 3381625=test_io I, [2024-05-27T06:59:15.995714 #3340252] INFO -- : [459/883] 3381615=test_ellipsize I, [2024-05-27T06:59:16.013795 #3340252] INFO -- : [460/883] 3381615=test_date_attr I, [2024-05-27T06:59:16.018244 #3340252] INFO -- : [461/883] 3381615=test_gem_commands_exec_command I, [2024-05-27T06:59:16.051761 #3340252] INFO -- : [462/883] 3381607=test_io_wait I, [2024-05-27T06:59:16.105043 #3340252] INFO -- : [463/883] 3381620=test_kwargs I, [2024-05-27T06:59:16.124973 #3340252] INFO -- : [464/883] 3381620=warnings_test I, [2024-05-27T06:59:16.135739 #3340252] INFO -- : [465/883] 3381620=test_type_completor I, [2024-05-27T06:59:16.137628 #3340252] INFO -- : [466/883] 3381620=test_console_attr I, [2024-05-27T06:59:16.139934 #3340252] INFO -- : [467/883] 3381620=test_summary I, [2024-05-27T06:59:16.141890 #3340252] INFO -- : [468/883] 3381610=test_framework I, [2024-05-27T06:59:16.143181 #3340252] INFO -- : [469/883] 3381610=test_ns_spki I, [2024-05-27T06:59:16.153536 #3340252] INFO -- : [470/883] 3381626=test_kill_ring I, [2024-05-27T06:59:16.168885 #3340252] INFO -- : [471/883] 3381610=test_argf I, [2024-05-27T06:59:16.188513 #3340252] INFO -- : [472/883] 3381625=test_ws I, [2024-05-27T06:59:16.197694 #3340252] INFO -- : [473/883] 3381625=test_m17n I, [2024-05-27T06:59:16.203015 #3340252] INFO -- : [474/883] 3381626=test_gem_commands_environment_command I, [2024-05-27T06:59:16.244001 #3340252] INFO -- : [475/883] 3381608=test_weakmap I, [2024-05-27T06:59:16.249886 #3340252] INFO -- : [476/883] 3381626=test_workspace I, [2024-05-27T06:59:16.260036 #3340252] INFO -- : [477/883] 3381620=test_yjit I, [2024-05-27T06:59:16.263747 #3340252] INFO -- : [478/883] 3381625=test_raise_exception I, [2024-05-27T06:59:16.266586 #3340252] INFO -- : [479/883] 3381620=test_gem_request_set_lockfile I, [2024-05-27T06:59:16.380459 #3340252] INFO -- : [480/883] 3381607=test_win32ole_typelib I, [2024-05-27T06:59:16.388150 #3340252] INFO -- : [481/883] 3381607=test_protect I, [2024-05-27T06:59:16.390230 #3340252] INFO -- : [482/883] 3381607=test_hash I, [2024-05-27T06:59:16.422044 #3340252] INFO -- : [483/883] 3381607=test_gem_resolver_dependency_request I, [2024-05-27T06:59:16.442343 #3340252] INFO -- : [484/883] 3381607=test_tree_builder I, [2024-05-27T06:59:16.445938 #3340252] INFO -- : [485/883] 3381607=test_external_new I, [2024-05-27T06:59:16.451204 #3340252] INFO -- : [486/883] 3381607=test_alias_and_anchor I, [2024-05-27T06:59:16.455122 #3340252] INFO -- : [487/883] 3381626=test_postponed_job I, [2024-05-27T06:59:16.455755 #3340252] INFO -- : [488/883] 3381607=test_gem_commands_stale_command I, [2024-05-27T06:59:16.475185 #3340252] INFO -- : [489/883] 3381607=test_lock_native_thread I, [2024-05-27T06:59:16.505016 #3340252] INFO -- : [490/883] 3381620=test_c_struct_entry I, [2024-05-27T06:59:16.728650 #3340252] INFO -- : [491/883] 3381607=test_have_library I, [2024-05-27T06:59:16.749290 #3340252] INFO -- : [492/883] 3381613=test_remote_fetch_error I, [2024-05-27T06:59:16.769155 #3340252] INFO -- : [493/883] 3381613=test_show_source I, [2024-05-27T06:59:16.779744 #3340252] INFO -- : [494/883] 3381613=test_set I, [2024-05-27T06:59:16.792013 #3340252] INFO -- : [495/883] 3381613=test_string_memory I, [2024-05-27T06:59:16.823758 #3340252] INFO -- : [496/883] 3381619=test_gem_requirement I, [2024-05-27T06:59:16.854668 #3340252] INFO -- : [497/883] 3381613=test_sprintf I, [2024-05-27T06:59:16.863489 #3340252] INFO -- : [498/883] 3381625=comments_test I, [2024-05-27T06:59:16.871360 #3340252] INFO -- : [499/883] 3381625=test_gem_security_trust_dir I, [2024-05-27T06:59:16.893292 #3340252] INFO -- : [500/883] 3381620=test_objspace I, [2024-05-27T06:59:16.918380 #3340252] INFO -- : [501/883] 3381625=ripper_test I, [2024-05-27T06:59:16.931445 #3340252] INFO -- : [502/883] 3381626=test_line_editor I, [2024-05-27T06:59:16.936533 #3340252] INFO -- : [503/883] 3381626=test_undef I, [2024-05-27T06:59:16.941242 #3340252] INFO -- : [504/883] 3381626=test_rdoc_alias I, [2024-05-27T06:59:16.941813 #3340252] INFO -- : [505/883] 3381619=test_yield I, [2024-05-27T06:59:16.982479 #3340252] INFO -- : [506/883] 3381615=test_convertible I, [2024-05-27T06:59:16.993230 #3340252] INFO -- : [507/883] 3381613=parser_test I, [2024-05-27T06:59:16.999166 #3340252] INFO -- : [508/883] 3381613=test_stringscanner I, [2024-05-27T06:59:17.000500 #3340252] INFO -- : [509/883] 3381626=test_files_sample I, [2024-05-27T06:59:17.001314 #3340252] INFO -- : [510/883] 3381626=test_rdoc_markup_to_html_crossref I, [2024-05-27T06:59:17.016963 #3340252] INFO -- : [511/883] 3381613=test_typeddata I, [2024-05-27T06:59:17.197850 #3340252] INFO -- : [512/883] 3381613=test_gem_resolver_best_set I, [2024-05-27T06:59:17.257468 #3340252] INFO -- : [513/883] 3381613=encoding_test I, [2024-05-27T06:59:17.307528 #3340252] INFO -- : [514/883] 3381626=test_rat I, [2024-05-27T06:59:17.334541 #3340252] INFO -- : [515/883] 3381626=test_rdoc_markup_raw I, [2024-05-27T06:59:17.337820 #3340252] INFO -- : [516/883] 3381626=test_webauthn_poller I, [2024-05-27T06:59:17.360228 #3340252] INFO -- : [517/883] 3381613=test_array I, [2024-05-27T06:59:17.373657 #3340252] INFO -- : [518/883] 3381613=test_optparse I, [2024-05-27T06:59:17.415146 #3340252] INFO -- : [519/883] 3381625=test_fstring I, [2024-05-27T06:59:17.434580 #3340252] INFO -- : [520/883] 3381613=test_readpartial I, [2024-05-27T06:59:17.464589 #3340252] INFO -- : [521/883] 3381626=test_gem_commands_install_command I, [2024-05-27T06:59:17.511515 #3340252] INFO -- : [522/883] 3381625=test_clone I, [2024-05-27T06:59:17.677343 #3340252] INFO -- : [523/883] 3381625=test_rdoc_require I, [2024-05-27T06:59:17.686840 #3340252] INFO -- : [524/883] 3381625=locals_test I, [2024-05-27T06:59:17.734146 #3340252] INFO -- : [525/883] 3381618=test_rdoc_markup_indented_paragraph I, [2024-05-27T06:59:17.742402 #3340252] INFO -- : [526/883] 3381618=test_gem_resolver_conflict I, [2024-05-27T06:59:17.755373 #3340252] INFO -- : [527/883] 3381618=test_rdoc_task I, [2024-05-27T06:59:17.759725 #3340252] INFO -- : [528/883] 3381618=test_io_buffer I, [2024-05-27T06:59:17.838429 #3340252] INFO -- : [529/883] 3381613=ruby_parser_test I, [2024-05-27T06:59:17.841168 #3340252] INFO -- : [530/883] 3381613=test_pack I, [2024-05-27T06:59:17.864491 #3340252] INFO -- : [531/883] 3381613=test_backtrace I, [2024-05-27T06:59:17.867615 #3340252] INFO -- : [532/883] 3381618=test_rendering I, [2024-05-27T06:59:17.873240 #3340252] INFO -- : [533/883] 3381618=test_case I, [2024-05-27T06:59:17.904879 #3340252] INFO -- : [534/883] 3381618=test_sizeof I, [2024-05-27T06:59:17.969946 #3340252] INFO -- : [535/883] 3381625=test_face I, [2024-05-27T06:59:17.983368 #3340252] INFO -- : [536/883] 3381607=test_io I, [2024-05-27T06:59:17.993406 #3340252] INFO -- : [537/883] 3381625=test_unicode_escape I, [2024-05-27T06:59:18.082260 #3340252] INFO -- : [538/883] 3381625=test_autoload I, [2024-05-27T06:59:18.104991 #3340252] INFO -- : [539/883] 3381616=test_utf16 I, [2024-05-27T06:59:18.113567 #3340252] INFO -- : [540/883] 3381616=test_sleep I, [2024-05-27T06:59:18.731058 #3340252] INFO -- : [541/883] 3381626=test_config I, [2024-05-27T06:59:18.761030 #3340252] INFO -- : [542/883] 3381621=test_libs I, [2024-05-27T06:59:18.765190 #3340252] INFO -- : [543/883] 3381626=test_gc I, [2024-05-27T06:59:18.767283 #3340252] INFO -- : [544/883] 3381626=test_gem_commands_fetch_command I, [2024-05-27T06:59:18.771978 #3340252] INFO -- : [545/883] 3381621=test_math I, [2024-05-27T06:59:18.780112 #3340252] INFO -- : [546/883] 3381621=test_yaml_tree I, [2024-05-27T06:59:18.821499 #3340252] INFO -- : [547/883] 3381621=test_etc I, [2024-05-27T06:59:18.848751 #3340252] INFO -- : [548/883] 3381608=test_yjit_exit_locations I, [2024-05-27T06:59:18.852105 #3340252] INFO -- : [549/883] 3381608=test_protocol I, [2024-05-27T06:59:18.855925 #3340252] INFO -- : [550/883] 3381626=test_getopts I, [2024-05-27T06:59:18.856672 #3340252] INFO -- : [551/883] 3381626=test_gem_resolver_activation_request I, [2024-05-27T06:59:18.870055 #3340252] INFO -- : [552/883] 3381626=test_gem_config_file I, [2024-05-27T06:59:18.908337 #3340252] INFO -- : [553/883] 3381621=test_ripper I, [2024-05-27T06:59:18.945753 #3340252] INFO -- : [554/883] 3381612=test_gem_package_tar_header I, [2024-05-27T06:59:18.959506 #3340252] INFO -- : [555/883] 3381624=test_iseq_load I, [2024-05-27T06:59:18.961934 #3340252] INFO -- : [556/883] 3381626=test_gem_util I, [2024-05-27T06:59:18.996659 #3340252] INFO -- : [557/883] 3381612=test_bigzero I, [2024-05-27T06:59:18.998449 #3340252] INFO -- : [558/883] 3381612=test_pkey_dh I, [2024-05-27T06:59:19.021802 #3340252] INFO -- : [559/883] 3381614=test_system I, [2024-05-27T06:59:19.072523 #3340252] INFO -- : [560/883] 3381612=test_pkcs12 I, [2024-05-27T06:59:19.080304 #3340252] INFO -- : [561/883] 3381626=test_rdoc_constant I, [2024-05-27T06:59:19.141088 #3340252] INFO -- : [562/883] 3381626=test_deprecate I, [2024-05-27T06:59:19.162058 #3340252] INFO -- : [563/883] 3381608=test_formatter I, [2024-05-27T06:59:19.165586 #3340252] INFO -- : [564/883] 3381626=test_bash_completion I, [2024-05-27T06:59:19.166384 #3340252] INFO -- : [565/883] 3381608=test_recorder I, [2024-05-27T06:59:19.168745 #3340252] INFO -- : [566/883] 3381626=test_gem_commands_owner_command I, [2024-05-27T06:59:19.169822 #3340252] INFO -- : [567/883] 3381608=test_gem_source_vendor I, [2024-05-27T06:59:19.176734 #3340252] INFO -- : [568/883] 3381608=test_gem_package_tar_reader I, [2024-05-27T06:59:19.177651 #3340252] INFO -- : [569/883] 3381613=regexp_test I, [2024-05-27T06:59:19.186600 #3340252] INFO -- : [570/883] 3381613=test_coverage I, [2024-05-27T06:59:19.204573 #3340252] INFO -- : [571/883] 3381608=test_rdoc_encoding I, [2024-05-27T06:59:19.209665 #3340252] INFO -- : [572/883] 3381619=test_pathname I, [2024-05-27T06:59:19.237549 #3340252] INFO -- : [573/883] 3381608=test_init I, [2024-05-27T06:59:19.267188 #3340252] INFO -- : [574/883] 3381621=test_complexrational I, [2024-05-27T06:59:19.277195 #3340252] INFO -- : [575/883] 3381621=test_modify_expand I, [2024-05-27T06:59:19.282758 #3340252] INFO -- : [576/883] 3381621=test_rdoc_any_method I, [2024-05-27T06:59:19.398947 #3340252] INFO -- : [577/883] 3381612=test_gem_available_set I, [2024-05-27T06:59:19.448421 #3340252] INFO -- : [578/883] 3381619=test_rdoc_markdown I, [2024-05-27T06:59:19.461721 #3340252] INFO -- : [579/883] 3381612=test_file I, [2024-05-27T06:59:19.481144 #3340252] INFO -- : [580/883] 3381612=test_fiddle I, [2024-05-27T06:59:19.503853 #3340252] INFO -- : [581/883] 3381612=test_wss I, [2024-05-27T06:59:19.508762 #3340252] INFO -- : [582/883] 3381612=test_ractor I, [2024-05-27T06:59:19.529059 #3340252] INFO -- : [583/883] 3381608=test_find I, [2024-05-27T06:59:19.535123 #3340252] INFO -- : [584/883] 3381624=test_marshalable I, [2024-05-27T06:59:19.538992 #3340252] INFO -- : [585/883] 3381608=test_digest I, [2024-05-27T06:59:19.540717 #3340252] INFO -- : [586/883] 3381624=test_gem_commands_contents_command I, [2024-05-27T06:59:19.596442 #3340252] INFO -- : [587/883] 3381612=test_gem_ext_cmake_builder I, [2024-05-27T06:59:19.610996 #3340252] INFO -- : [588/883] 3381612=test_require I, [2024-05-27T06:59:19.614938 #3340252] INFO -- : [589/883] 3381624=test_cgi_util I, [2024-05-27T06:59:19.722367 #3340252] INFO -- : [590/883] 3381621=test_class2name I, [2024-05-27T06:59:19.726587 #3340252] INFO -- : [591/883] 3381621=test_gbk I, [2024-05-27T06:59:19.729152 #3340252] INFO -- : [592/883] 3381621=test_enc_str_buf_cat I, [2024-05-27T06:59:19.730575 #3340252] INFO -- : [593/883] 3381626=test_cstr I, [2024-05-27T06:59:19.731465 #3340252] INFO -- : [594/883] 3381621=test_pstore I, [2024-05-27T06:59:19.759419 #3340252] INFO -- : [595/883] 3381621=test_profile_frames I, [2024-05-27T06:59:19.781708 #3340252] INFO -- : [596/883] 3381624=test_io_timeout I, [2024-05-27T06:59:19.784461 #3340252] INFO -- : [597/883] 3381624=json_fixtures_test I, [2024-05-27T06:59:19.792350 #3340252] INFO -- : [598/883] 3381624=test_shapes I, [2024-05-27T06:59:19.794436 #3340252] INFO -- : [599/883] 3381624=test_comparable I, [2024-05-27T06:59:19.800399 #3340252] INFO -- : [600/883] 3381624=test_rdoc_parser_c I, [2024-05-27T06:59:19.912227 #3340252] INFO -- : [601/883] 3381619=test_thread_queue I, [2024-05-27T06:59:19.932586 #3340252] INFO -- : [602/883] 3381610=test_nowrite I, [2024-05-27T06:59:19.949932 #3340252] INFO -- : [603/883] 3381621=test_rdoc_markup_formatter I, [2024-05-27T06:59:19.963117 #3340252] INFO -- : [604/883] 3381621=test_ractor I, [2024-05-27T06:59:19.965256 #3340252] INFO -- : [605/883] 3381610=test_euc_tw I, [2024-05-27T06:59:19.970671 #3340252] INFO -- : [606/883] 3381610=test_bmethod I, [2024-05-27T06:59:19.976969 #3340252] INFO -- : [607/883] 3381610=test_ansi_without_terminfo I, [2024-05-27T06:59:19.979257 #3340252] INFO -- : [608/883] 3381624=test_gem_commands_sources_command I, [2024-05-27T06:59:19.980373 #3340252] INFO -- : [609/883] 3381621=test_big2str I, [2024-05-27T06:59:19.981485 #3340252] INFO -- : [610/883] 3381609=test_forwardable I, [2024-05-27T06:59:19.985049 #3340252] INFO -- : [611/883] 3381621=test_yaml I, [2024-05-27T06:59:19.988662 #3340252] INFO -- : [612/883] 3381610=test_handle I, [2024-05-27T06:59:20.011621 #3340252] INFO -- : [613/883] 3381609=test_wait I, [2024-05-27T06:59:20.022524 #3340252] INFO -- : [614/883] 3381613=test_parse I, [2024-05-27T06:59:20.054074 #3340252] INFO -- : [615/883] 3381614=test_mdns I, [2024-05-27T06:59:20.055838 #3340252] INFO -- : [616/883] 3381621=test_gem_remote_fetcher I, [2024-05-27T06:59:20.073036 #3340252] INFO -- : [617/883] 3381609=test_scanner_events I, [2024-05-27T06:59:20.073650 #3340252] INFO -- : [618/883] 3381614=test_gem_resolver_installed_specification I, [2024-05-27T06:59:20.108789 #3340252] INFO -- : [619/883] 3381609=test_method_cache I, [2024-05-27T06:59:20.111255 #3340252] INFO -- : [620/883] 3381609=test_gem_stub_specification I, [2024-05-27T06:59:20.119196 #3340252] INFO -- : [621/883] 3381614=test_frozen_error I, [2024-05-27T06:59:20.125315 #3340252] INFO -- : [622/883] 3381614=test_gem_ext_ext_conf_builder I, [2024-05-27T06:59:20.165094 #3340252] INFO -- : [623/883] 3381616=test_complex I, [2024-05-27T06:59:20.168327 #3340252] INFO -- : [624/883] 3381624=test_gem_commands_search_command I, [2024-05-27T06:59:20.180207 #3340252] INFO -- : [625/883] 3381624=test_rdoc_markup_verbatim I, [2024-05-27T06:59:20.181109 #3340252] INFO -- : [626/883] 3381624=test_inlinecache I, [2024-05-27T06:59:20.243435 #3340252] INFO -- : [627/883] 3381624=test_path_to_class I, [2024-05-27T06:59:20.246905 #3340252] INFO -- : [628/883] 3381624=test_gem_dependency I, [2024-05-27T06:59:20.270285 #3340252] INFO -- : [629/883] 3381609=test_gem_resolver_specification I, [2024-05-27T06:59:20.277923 #3340252] INFO -- : [630/883] 3381616=test_gem_version I, [2024-05-27T06:59:20.288439 #3340252] INFO -- : [631/883] 3381609=test_cesu8 I, [2024-05-27T06:59:20.294266 #3340252] INFO -- : [632/883] 3381609=test_econv I, [2024-05-27T06:59:20.295039 #3340252] INFO -- : [633/883] 3381608=test_rdoc_options I, [2024-05-27T06:59:20.350842 #3340252] INFO -- : [634/883] 3381610=test_fileutils I, [2024-05-27T06:59:20.354938 #3340252] INFO -- : [635/883] 3381624=test_string_processing I, [2024-05-27T06:59:20.355290 #3340252] INFO -- : [636/883] 3381616=test_ldap I, [2024-05-27T06:59:20.358470 #3340252] INFO -- : [637/883] 3381624=test_gem_commands_signin_command I, [2024-05-27T06:59:20.366825 #3340252] INFO -- : [638/883] 3381616=test_resource I, [2024-05-27T06:59:20.380951 #3340252] INFO -- : [639/883] 3381616=test_emitter I, [2024-05-27T06:59:20.384297 #3340252] INFO -- : [640/883] 3381616=test_stack I, [2024-05-27T06:59:20.446219 #3340252] INFO -- : [641/883] 3381624=test_gem_commands_list_command I, [2024-05-27T06:59:20.454453 #3340252] INFO -- : [642/883] 3381624=test_reqarg I, [2024-05-27T06:59:20.497622 #3340252] INFO -- : [643/883] 3381626=test_rdoc_include I, [2024-05-27T06:59:20.520409 #3340252] INFO -- : [644/883] 3381626=test_too_many_dummy_encodings I, [2024-05-27T06:59:20.536728 #3340252] INFO -- : [645/883] 3381613=test_duplicate I, [2024-05-27T06:59:20.541062 #3340252] INFO -- : [646/883] 3381613=test_basicsocket I, [2024-05-27T06:59:20.551796 #3340252] INFO -- : [647/883] 3381613=test_utf32 I, [2024-05-27T06:59:20.557069 #3340252] INFO -- : [648/883] 3381613=test_tracepoint I, [2024-05-27T06:59:20.578784 #3340252] INFO -- : [649/883] 3381626=test_prettyprint I, [2024-05-27T06:59:20.581689 #3340252] INFO -- : [650/883] 3381608=test_rdoc_markup I, [2024-05-27T06:59:20.591074 #3340252] INFO -- : [651/883] 3381608=test_gem_commands_help_command I, [2024-05-27T06:59:20.598302 #3340252] INFO -- : [652/883] 3381626=test_internal_ivar I, [2024-05-27T06:59:20.603296 #3340252] INFO -- : [653/883] 3381626=test_gem_resolver_index_specification I, [2024-05-27T06:59:20.639109 #3340252] INFO -- : [654/883] 3381626=test_queue I, [2024-05-27T06:59:20.644709 #3340252] INFO -- : [655/883] 3381610=test_function I, [2024-05-27T06:59:20.652000 #3340252] INFO -- : [656/883] 3381608=test_tempfile I, [2024-05-27T06:59:20.668925 #3340252] INFO -- : [657/883] 3381626=test_noarg I, [2024-05-27T06:59:20.704313 #3340252] INFO -- : [658/883] 3381623=parse_comments_test I, [2024-05-27T06:59:20.708400 #3340252] INFO -- : [659/883] 3381623=test_load I, [2024-05-27T06:59:20.719447 #3340252] INFO -- : [660/883] 3381623=json_string_matching_test I, [2024-05-27T06:59:20.723003 #3340252] INFO -- : [661/883] 3381623=test_const I, [2024-05-27T06:59:20.725268 #3340252] INFO -- : [662/883] 3381623=test_rdoc_normal_class I, [2024-05-27T06:59:20.732679 #3340252] INFO -- : [663/883] 3381612=test_class I, [2024-05-27T06:59:20.776434 #3340252] INFO -- : [664/883] 3381618=test_asn1 I, [2024-05-27T06:59:20.778178 #3340252] INFO -- : [665/883] 3381623=test_random I, [2024-05-27T06:59:20.782881 #3340252] INFO -- : [666/883] 3381623=test_irb I, [2024-05-27T06:59:20.797906 #3340252] INFO -- : [667/883] 3381618=test_rdoc_parser_rd I, [2024-05-27T06:59:20.814160 #3340252] INFO -- : [668/883] 3381613=test_date_strftime I, [2024-05-27T06:59:20.821944 #3340252] INFO -- : [669/883] 3381624=test_yamlstore I, [2024-05-27T06:59:20.828316 #3340252] INFO -- : [670/883] 3381624=test_gem_installer I, [2024-05-27T06:59:20.836036 #3340252] INFO -- : [671/883] 3381626=test_date_new I, [2024-05-27T06:59:20.840295 #3340252] INFO -- : [672/883] 3381618=index_write_test I, [2024-05-27T06:59:20.849745 #3340252] INFO -- : [673/883] 3381626=test_data I, [2024-05-27T06:59:20.854182 #3340252] INFO -- : [674/883] 3381626=test_rdoc_markup_to_joined_paragraph I, [2024-05-27T06:59:20.859055 #3340252] INFO -- : [675/883] 3381626=test_date_time I, [2024-05-27T06:59:20.868878 #3340252] INFO -- : [676/883] 3381610=test_require I, [2024-05-27T06:59:20.871946 #3340252] INFO -- : [677/883] 3381626=test_gem_safe_yaml I, [2024-05-27T06:59:20.875412 #3340252] INFO -- : [678/883] 3381610=test_syntax I, [2024-05-27T06:59:20.878802 #3340252] INFO -- : [679/883] 3381618=test_rdoc_text I, [2024-05-27T06:59:20.882710 #3340252] INFO -- : [680/883] 3381626=test_iso_8859 I, [2024-05-27T06:59:20.905260 #3340252] INFO -- : [681/883] 3381618=test_tcp I, [2024-05-27T06:59:20.917871 #3340252] INFO -- : [682/883] 3381626=test_stream I, [2024-05-27T06:59:20.920587 #3340252] INFO -- : [683/883] 3381608=test_nil2vtempty I, [2024-05-27T06:59:20.920996 #3340252] INFO -- : [684/883] 3381608=test_rdoc_context I, [2024-05-27T06:59:20.925730 #3340252] INFO -- : [685/883] 3381626=test_open-uri I, [2024-05-27T06:59:20.929461 #3340252] INFO -- : [686/883] 3381618=test_httpresponse I, [2024-05-27T06:59:21.002461 #3340252] INFO -- : [687/883] 3381623=test_rdoc_parser_ruby I, [2024-05-27T06:59:21.044998 #3340252] INFO -- : [688/883] 3381618=test_name_error I, [2024-05-27T06:59:21.160785 #3340252] INFO -- : [689/883] 3381618=test_rdoc_markup_attribute_manager I, [2024-05-27T06:59:21.191312 #3340252] INFO -- : [690/883] 3381618=test_safe_load I, [2024-05-27T06:59:21.198151 #3340252] INFO -- : [691/883] 3381618=test_gem_resolver_composed_set I, [2024-05-27T06:59:21.206879 #3340252] INFO -- : [692/883] 3381614=test_gem_resolver I, [2024-05-27T06:59:21.210011 #3340252] INFO -- : [693/883] 3381618=test_gem_commands_dependency_command I, [2024-05-27T06:59:21.231431 #3340252] INFO -- : [694/883] 3381616=test_gem_commands_specification_command I, [2024-05-27T06:59:21.259168 #3340252] INFO -- : [695/883] 3381609=test_enumerator I, [2024-05-27T06:59:21.268325 #3340252] INFO -- : [696/883] 3381618=test_inadvertent_creation I, [2024-05-27T06:59:21.338043 #3340252] INFO -- : [697/883] 3381618=test_flags I, [2024-05-27T06:59:21.344931 #3340252] INFO -- : [698/883] 3381616=test_shift_jis I, [2024-05-27T06:59:21.347018 #3340252] INFO -- : [699/883] 3381616=test_gem_commands_which_command I, [2024-05-27T06:59:21.362247 #3340252] INFO -- : [700/883] 3381626=test_http I, [2024-05-27T06:59:21.366422 #3340252] INFO -- : [701/883] 3381626=test_gc I, [2024-05-27T06:59:21.368140 #3340252] INFO -- : [702/883] 3381616=test_x509cert I, [2024-05-27T06:59:21.441888 #3340252] INFO -- : [703/883] 3381613=test_err_in_callback I, [2024-05-27T06:59:21.446534 #3340252] INFO -- : [704/883] 3381613=test_gem_resolver_lock_specification I, [2024-05-27T06:59:21.482633 #3340252] INFO -- : [705/883] 3381613=test_logdevice I, [2024-05-27T06:59:21.489961 #3340252] INFO -- : [706/883] 3381615=test_gem_ext_rake_builder I, [2024-05-27T06:59:21.500338 #3340252] INFO -- : [707/883] 3381614=test_arity I, [2024-05-27T06:59:21.508081 #3340252] INFO -- : [708/883] 3381614=test_gem_security_policy I, [2024-05-27T06:59:21.603229 #3340252] INFO -- : [709/883] 3381623=test_gem_source_local I, [2024-05-27T06:59:21.604507 #3340252] INFO -- : [710/883] 3381616=test_pack I, [2024-05-27T06:59:21.783234 #3340252] INFO -- : [711/883] 3381616=test_process I, [2024-05-27T06:59:21.797946 #3340252] INFO -- : [712/883] 3381608=test_last_thread I, [2024-05-27T06:59:21.814922 #3340252] INFO -- : [713/883] 3381623=test_thread_fd_close I, [2024-05-27T06:59:21.821846 #3340252] INFO -- : [714/883] 3381623=test_passing_block I, [2024-05-27T06:59:21.823795 #3340252] INFO -- : [715/883] 3381623=test_hash_create I, [2024-05-27T06:59:21.828481 #3340252] INFO -- : [716/883] 3381623=test_stringchar I, [2024-05-27T06:59:21.829869 #3340252] INFO -- : [717/883] 3381614=test_uncorrectable_name_check I, [2024-05-27T06:59:21.836307 #3340252] INFO -- : [718/883] 3381614=newline_test I, [2024-05-27T06:59:21.838120 #3340252] INFO -- : [719/883] 3381621=test_switch_hitter I, [2024-05-27T06:59:21.853740 #3340252] INFO -- : [720/883] 3381621=test_io_console I, [2024-05-27T06:59:21.870937 #3340252] INFO -- : [721/883] 3381623=test_flush I, [2024-05-27T06:59:21.871360 #3340252] INFO -- : [722/883] 3381623=test_singleton I, [2024-05-27T06:59:21.878816 #3340252] INFO -- : [723/883] 3381623=test_rdoc_markdown_test I, [2024-05-27T06:59:21.895369 #3340252] INFO -- : [724/883] 3381614=test_c_union_entity I, [2024-05-27T06:59:21.931260 #3340252] INFO -- : [725/883] 3381614=test_rdoc_normal_module I, [2024-05-27T06:59:21.959920 #3340252] INFO -- : [726/883] 3381614=test_logperiod I, [2024-05-27T06:59:21.962834 #3340252] INFO -- : [727/883] 3381614=test_securerandom I, [2024-05-27T06:59:21.968711 #3340252] INFO -- : [728/883] 3381614=test_socket I, [2024-05-27T06:59:22.138568 #3340252] INFO -- : [729/883] 3381618=test_thread I, [2024-05-27T06:59:22.219231 #3340252] INFO -- : [730/883] 3381615=test_objectspace I, [2024-05-27T06:59:22.234164 #3340252] INFO -- : [731/883] 3381613=test_rdoc_markup_to_table_of_contents I, [2024-05-27T06:59:22.253984 #3340252] INFO -- : [732/883] 3381613=test_str2big I, [2024-05-27T06:59:22.264609 #3340252] INFO -- : [733/883] 3381613=test_c_struct_builder I, [2024-05-27T06:59:22.333928 #3340252] INFO -- : [734/883] 3381613=test_dot_dot I, [2024-05-27T06:59:22.338788 #3340252] INFO -- : [735/883] 3381613=test_literal I, [2024-05-27T06:59:22.361280 #3340252] INFO -- : [736/883] 3381618=test_gem_stream_ui I, [2024-05-27T06:59:22.402878 #3340252] INFO -- : [737/883] 3381625=test_extlibs I, [2024-05-27T06:59:22.434343 #3340252] INFO -- : [738/883] 3381618=test_rdoc_generator_ri I, [2024-05-27T06:59:22.439172 #3340252] INFO -- : [739/883] 3381618=test_require_lib I, [2024-05-27T06:59:22.545615 #3340252] INFO -- : [740/883] 3381612=parse_test I, [2024-05-27T06:59:22.605912 #3340252] INFO -- : [741/883] 3381623=test_gem_install_update_options I, [2024-05-27T06:59:22.700634 #3340252] INFO -- : [742/883] 3381623=test_severity I, [2024-05-27T06:59:22.711943 #3340252] INFO -- : [743/883] 3381623=test_ractor I, [2024-05-27T06:59:22.715104 #3340252] INFO -- : [744/883] 3381623=test_json_tree I, [2024-05-27T06:59:22.722032 #3340252] INFO -- : [745/883] 3381623=test_rdoc_markup_to_markdown I, [2024-05-27T06:59:22.766043 #3340252] INFO -- : [746/883] 3381623=test_rdoc_generator_pot_po I, [2024-05-27T06:59:22.772866 #3340252] INFO -- : [747/883] 3381623=test_ansi_with_terminfo I, [2024-05-27T06:59:22.777363 #3340252] INFO -- : [748/883] 3381623=test_ractor I, [2024-05-27T06:59:22.842974 #3340252] INFO -- : [749/883] 3381623=test_memory_view I, [2024-05-27T06:59:22.855743 #3340252] INFO -- : [750/883] 3381608=test_m17n_comb I, [2024-05-27T06:59:22.891623 #3340252] INFO -- : [751/883] 3381613=test_gem_request_connection_pools I, [2024-05-27T06:59:23.022693 #3340252] INFO -- : [752/883] 3381623=test_gem_version_option I, [2024-05-27T06:59:23.046725 #3340252] INFO -- : [753/883] 3381623=test_grapheme_breaks I, [2024-05-27T06:59:23.046787 #3340252] INFO -- : [754/883] 3381615=test_cclass I, [2024-05-27T06:59:23.061854 #3340252] INFO -- : [755/883] 3381623=test_reline I, [2024-05-27T06:59:23.116693 #3340252] INFO -- : [756/883] 3381614=test_parser_events I, [2024-05-27T06:59:23.169264 #3340252] INFO -- : [757/883] 3381614=test_pkey I, [2024-05-27T06:59:23.171716 #3340252] INFO -- : [758/883] 3381615=test_case I, [2024-05-27T06:59:23.172058 #3340252] INFO -- : [759/883] 3381615=test_settracefunc I, [2024-05-27T06:59:23.210340 #3340252] INFO -- : [760/883] 3381614=test_gem_text I, [2024-05-27T06:59:23.250065 #3340252] INFO -- : [761/883] 3381614=test_enumerator_kw I, [2024-05-27T06:59:23.254634 #3340252] INFO -- : [762/883] 3381614=test_scan_args I, [2024-05-27T06:59:23.261106 #3340252] INFO -- : [763/883] 3381623=test_generic I, [2024-05-27T06:59:23.264911 #3340252] INFO -- : [764/883] 3381614=test_win32ole I, [2024-05-27T06:59:23.270377 #3340252] INFO -- : [765/883] 3381614=test_sprintf_comb I, [2024-05-27T06:59:23.290677 #3340252] INFO -- : [766/883] 3381623=test_gem_request I, [2024-05-27T06:59:23.407037 #3340252] INFO -- : [767/883] 3381614=test_method_cache I, [2024-05-27T06:59:23.414588 #3340252] INFO -- : [768/883] 3381614=test_gem_ext_cargo_builder_link_flag_converter I, [2024-05-27T06:59:23.453694 #3340252] INFO -- : [769/883] 3381614=test_gem_commands_mirror I, [2024-05-27T06:59:23.458775 #3340252] INFO -- : [770/883] 3381614=test_rand I, [2024-05-27T06:59:23.496618 #3340252] INFO -- : [771/883] 3381623=test_gem_name_tuple I, [2024-05-27T06:59:23.510603 #3340252] INFO -- : [772/883] 3381623=test_gem_package_tar_reader_entry I, [2024-05-27T06:59:23.745404 #3340252] INFO -- : [773/883] 3381614=test_bug_reporter I, [2024-05-27T06:59:23.765825 #3340252] INFO -- : [774/883] 3381623=test_exception I, [2024-05-27T06:59:23.875173 #3340252] INFO -- : [775/883] 3381625=test_store I, [2024-05-27T06:59:23.931571 #3340252] INFO -- : [776/883] 3381613=test_case_options I, [2024-05-27T06:59:23.934922 #3340252] INFO -- : [777/883] 3381613=test_scalar I, [2024-05-27T06:59:23.940002 #3340252] INFO -- : [778/883] 3381613=test_gem_dependency_installer I, [2024-05-27T06:59:23.950286 #3340252] INFO -- : [779/883] 3381615=test_gem_commands_info_command I, [2024-05-27T06:59:23.967128 #3340252] INFO -- : [780/883] 3381615=test_rdoc_cross_reference I, [2024-05-27T06:59:24.025948 #3340252] INFO -- : [781/883] 3381625=test_svcb_https I, [2024-05-27T06:59:24.034027 #3340252] INFO -- : [782/883] 3381625=test_buffering I, [2024-05-27T06:59:24.040277 #3340252] INFO -- : [783/883] 3381625=test_gb18030 I, [2024-05-27T06:59:24.069960 #3340252] INFO -- : [784/883] 3381625=test_gem_uninstaller I, [2024-05-27T06:59:24.117098 #3340252] INFO -- : [785/883] 3381619=test_rdoc_rdoc I, [2024-05-27T06:59:24.168892 #3340252] INFO -- : [786/883] 3381614=test_time I, [2024-05-27T06:59:24.264661 #3340252] INFO -- : [787/883] 3381619=test_windows_1251 I, [2024-05-27T06:59:24.273169 #3340252] INFO -- : [788/883] 3381619=test_rdoc_i18n_text I, [2024-05-27T06:59:24.279307 #3340252] INFO -- : [789/883] 3381619=test_backtrace I, [2024-05-27T06:59:24.281938 #3340252] INFO -- : [790/883] 3381619=test_defined I, [2024-05-27T06:59:24.287889 #3340252] INFO -- : [791/883] 3381614=test_key_name_check I, [2024-05-27T06:59:24.298797 #3340252] INFO -- : [792/883] 3381614=test_io_buffer I, [2024-05-27T06:59:24.345733 #3340252] INFO -- : [793/883] 3381614=test_pkey_ec I, [2024-05-27T06:59:24.361070 #3340252] INFO -- : [794/883] 3381619=test_pipe I, [2024-05-27T06:59:24.387581 #3340252] INFO -- : [795/883] 3381615=test_thread I, [2024-05-27T06:59:24.390208 #3340252] INFO -- : [796/883] 3381615=test_trick I, [2024-05-27T06:59:24.424956 #3340252] INFO -- : [797/883] 3381614=test_date_parse I, [2024-05-27T06:59:24.498756 #3340252] INFO -- : [798/883] 3381619=test_rdoc_markup_attributes I, [2024-05-27T06:59:24.501787 #3340252] INFO -- : [799/883] 3381619=test_rdoc_rd_inline_parser I, [2024-05-27T06:59:24.515695 #3340252] INFO -- : [800/883] 3381619=test_rdoc_markup_to_rdoc I, [2024-05-27T06:59:24.539697 #3340252] INFO -- : [801/883] 3381619=test_default_gems I, [2024-05-27T06:59:24.552789 #3340252] INFO -- : [802/883] 3381621=test_win32ole_type I, [2024-05-27T06:59:24.554501 #3340252] INFO -- : [803/883] 3381621=test_null I, [2024-05-27T06:59:24.556232 #3340252] INFO -- : [804/883] 3381621=test_mul I, [2024-05-27T06:59:24.561640 #3340252] INFO -- : [805/883] 3381614=test_qsort I, [2024-05-27T06:59:24.566462 #3340252] INFO -- : [806/883] 3381621=test_rdoc_parser I, [2024-05-27T06:59:24.567145 #3340252] INFO -- : [807/883] 3381614=test_gem_dependency_resolution_error I, [2024-05-27T06:59:24.572714 #3340252] INFO -- : [808/883] 3381614=json_addition_test I, [2024-05-27T06:59:24.580963 #3340252] INFO -- : [809/883] 3381611=test_custom_command I, [2024-05-27T06:59:24.586197 #3340252] INFO -- : [810/883] 3381611=test_gem_request_set_lockfile_parser I, [2024-05-27T06:59:24.589559 #3340252] INFO -- : [811/883] 3381621=test_depth_first I, [2024-05-27T06:59:24.596397 #3340252] INFO -- : [812/883] 3381614=test_x509attr I, [2024-05-27T06:59:24.600451 #3340252] INFO -- : [813/883] 3381614=test_raise I, [2024-05-27T06:59:24.600705 #3340252] INFO -- : [814/883] 3381614=test_rdoc_store I, [2024-05-27T06:59:24.604399 #3340252] INFO -- : [815/883] 3381621=test_string I, [2024-05-27T06:59:24.604911 #3340252] INFO -- : [816/883] 3381619=test_pattern_matching I, [2024-05-27T06:59:24.615753 #3340252] INFO -- : [817/883] 3381621=test_rdoc_stats I, [2024-05-27T06:59:24.634140 #3340252] INFO -- : [818/883] 3381619=test_fnmatch I, [2024-05-27T06:59:24.643338 #3340252] INFO -- : [819/883] 3381621=test_files_test_2 I, [2024-05-27T06:59:24.668914 #3340252] INFO -- : [820/883] 3381619=test_folderitem2_invokeverb I, [2024-05-27T06:59:24.671049 #3340252] INFO -- : [821/883] 3381619=test_require_path_check I, [2024-05-27T06:59:24.719661 #3340252] INFO -- : [822/883] 3381611=test_rdoc_markup_parser I, [2024-05-27T06:59:24.740273 #3340252] INFO -- : [823/883] 3381619=test_gem_validator I, [2024-05-27T06:59:24.757179 #3340252] INFO -- : [824/883] 3381608=test_gem_resolver_index_set I, [2024-05-27T06:59:24.770174 #3340252] INFO -- : [825/883] 3381611=test_gem_package_old I, [2024-05-27T06:59:24.796025 #3340252] INFO -- : [826/883] 3381619=test_string I, [2024-05-27T06:59:24.803563 #3340252] INFO -- : [827/883] 3381608=test_proc I, [2024-05-27T06:59:24.816224 #3340252] INFO -- : [828/883] 3381611=test_gc_compact I, [2024-05-27T06:59:24.855535 #3340252] INFO -- : [829/883] 3381607=test_ole_methods I, [2024-05-27T06:59:24.855601 #3340252] INFO -- : [830/883] 3381607=test_erb_m17n I, [2024-05-27T06:59:24.896692 #3340252] INFO -- : [831/883] 3381607=test_optimization I, [2024-05-27T06:59:24.989239 #3340252] INFO -- : [832/883] 3381625=test_date_conv I, [2024-05-27T06:59:24.997904 #3340252] INFO -- : [833/883] 3381625=test_cgi_tag_helper I, [2024-05-27T06:59:25.016997 #3340252] INFO -- : [834/883] 3381625=test_zlib I, [2024-05-27T06:59:25.100186 #3340252] INFO -- : [835/883] 3381624=test_egrep_cpp I, [2024-05-27T06:59:25.241856 #3340252] INFO -- : [836/883] 3381614=test_exception I, [2024-05-27T06:59:25.251823 #3340252] INFO -- : [837/883] 3381614=test_zsh_completion I, [2024-05-27T06:59:25.256154 #3340252] INFO -- : [838/883] 3381614=test_iter_break I, [2024-05-27T06:59:25.260319 #3340252] INFO -- : [839/883] 3381614=test_macro I, [2024-05-27T06:59:25.268861 #3340252] INFO -- : [840/883] 3381624=test_pp I, [2024-05-27T06:59:25.302670 #3340252] INFO -- : [841/883] 3381624=test_gem_ext_configure_builder I, [2024-05-27T06:59:25.325989 #3340252] INFO -- : [842/883] 3381614=test_frozen I, [2024-05-27T06:59:25.334978 #3340252] INFO -- : [843/883] 3381614=test_verbose I, [2024-05-27T06:59:25.365385 #3340252] INFO -- : [844/883] 3381614=test_num2int I, [2024-05-27T06:59:25.381286 #3340252] INFO -- : [845/883] 3381614=test_nil I, [2024-05-27T06:59:25.383709 #3340252] INFO -- : [846/883] 3381624=test_rdoc_single_class I, [2024-05-27T06:59:25.388620 #3340252] INFO -- : [847/883] 3381614=test_gem_source_list I, [2024-05-27T06:59:25.393603 #3340252] INFO -- : [848/883] 3381624=test_yaml_special_cases I, [2024-05-27T06:59:25.398363 #3340252] INFO -- : [849/883] 3381624=test_optarg I, [2024-05-27T06:59:25.450636 #3340252] INFO -- : [850/883] 3381614=test_config I, [2024-05-27T06:59:25.463171 #3340252] INFO -- : [851/883] 3381624=test_address_resolve I, [2024-05-27T06:59:25.489234 #3340252] INFO -- : [852/883] 3381624=test_rdoc_token_stream I, [2024-05-27T06:59:25.492019 #3340252] INFO -- : [853/883] 3381614=test_common I, [2024-05-27T06:59:25.502364 #3340252] INFO -- : [854/883] 3381624=test_gem_spec_fetcher I, [2024-05-27T06:59:25.655991 #3340252] INFO -- : [855/883] 3381608=test_gem_command I, [2024-05-27T06:59:25.667106 #3340252] INFO -- : [856/883] 3381624=test_bug-3571 I, [2024-05-27T06:59:25.700218 #3340252] INFO -- : [857/883] 3381624=test_key_actor_vi I, [2024-05-27T06:59:25.735430 #3340252] INFO -- : [858/883] 3381614=test_ifunless I, [2024-05-27T06:59:25.737935 #3340252] INFO -- : [859/883] 3381614=test_assignment I, [2024-05-27T06:59:25.753198 #3340252] INFO -- : [860/883] 3381618=test_gem_commands_lock_command I, [2024-05-27T06:59:25.762388 #3340252] INFO -- : [861/883] 3381608=test_numeric I, [2024-05-27T06:59:25.773189 #3340252] INFO -- : [862/883] 3381618=test_rdoc_tom_doc I, [2024-05-27T06:59:25.805412 #3340252] INFO -- : [863/883] 3381618=test_rdoc_markup_to_tt_only I, [2024-05-27T06:59:25.832813 #3340252] INFO -- : [864/883] 3381624=test_hmac I, [2024-05-27T06:59:25.838121 #3340252] INFO -- : [865/883] 3381608=test_command I, [2024-05-27T06:59:25.842302 #3340252] INFO -- : [866/883] 3381618=test_at_exit I, [2024-05-27T06:59:25.854252 #3340252] INFO -- : [867/883] 3381624=test_date I, [2024-05-27T06:59:25.861030 #3340252] INFO -- : [868/883] 3381624=test_gem_rdoc I, [2024-05-27T06:59:25.867831 #3340252] INFO -- : [869/883] 3381618=test_gem_ext_cargo_builder_unit I, [2024-05-27T06:59:25.885695 #3340252] INFO -- : [870/883] 3381618=test_object_create_start I, [2024-05-27T06:59:25.890150 #3340252] INFO -- : [871/883] 3381618=test_rdoc_markup_paragraph I, [2024-05-27T06:59:25.896068 #3340252] INFO -- : [872/883] 3381618=test_psych I, [2024-05-27T06:59:25.928068 #3340252] INFO -- : [873/883] 3381618=test_enc_raise I, [2024-05-27T06:59:25.934899 #3340252] INFO -- : [874/883] 3381618=!Nothing_to_test I, [2024-05-27T06:59:25.935449 #3340252] INFO -- : [875/883] 3381618=dispatcher_test I, [2024-05-27T06:59:25.957577 #3340252] INFO -- : [876/883] 3381618=test_eval_history I, [2024-05-27T06:59:25.972673 #3340252] INFO -- : [877/883] 3381618=test_kernel I, [2024-05-27T06:59:25.997970 #3340252] INFO -- : [878/883] 3381624=test_gem_doctor I, [2024-05-27T06:59:26.024479 #3340252] INFO -- : [879/883] 3381612=test_kdf I, [2024-05-27T06:59:26.030511 #3340252] INFO -- : [880/883] 3381624=test_gem_silent_ui I, [2024-05-27T06:59:26.067782 #3340252] INFO -- : [881/883] 3381624=test_emitter I, [2024-05-27T06:59:26.073942 #3340252] INFO -- : [882/883] 3381624=test_files_ext I, [2024-05-27T06:59:26.105240 #3340252] INFO -- : [883/883] 3381612=test_bug-5832 I, [2024-05-27T06:59:37.297512 #3340252] INFO -- : Finished tests in 30.578326s, 862.5717 tests/s, 305935.0578 assertions/s. I, [2024-05-27T06:59:37.298168 #3340252] INFO -- : 26376 tests, 9354982 assertions, 0 failures, 0 errors, 306 skips I, [2024-05-27T06:59:37.298191 #3340252] INFO -- : I, [2024-05-27T06:59:37.298198 #3340252] INFO -- : ruby -v: ruby 3.4.0dev (2024-05-27T04:40:19Z master 4fee1019f6) [x86_64-linux] I, [2024-05-27T06:59:37.300320 #3340252] INFO -- : $$$[end] "make yes-test-all TESTOPTS='--stderr-on-failure' TESTS='-j20'" exit with 0. I, [2024-05-27T06:59:37.300458 #3340252] INFO -- : $$$[beg] make yes-test-rubyspec MSPECOPT='--error-output stderr --debug -j' TESTS='-j20' I, [2024-05-27T06:59:37.388896 #3340252] INFO -- : BASERUBY = /usr/bin/ruby --disable=gems I, [2024-05-27T06:59:37.388944 #3340252] INFO -- : CC = gcc I, [2024-05-27T06:59:37.388951 #3340252] INFO -- : LD = ld I, [2024-05-27T06:59:37.388959 #3340252] INFO -- : LDSHARED = gcc -shared I, [2024-05-27T06:59:37.388965 #3340252] INFO -- : CFLAGS = -O3 -fno-fast-math -ggdb3 -Wall -Wextra -Wdeprecated-declarations -Wdiv-by-zero -Wduplicated-cond -Wimplicit-function-declaration -Wimplicit-int -Wpointer-arith -Wwrite-strings -Wold-style-definition -Wimplicit-fallthrough=0 -Wmissing-noreturn -Wno-cast-function-type -Wno-constant-logical-operand -Wno-long-long -Wno-missing-field-initializers -Wno-overlength-strings -Wno-packed-bitfield-compat -Wno-parentheses-equality -Wno-self-assign -Wno-tautological-compare -Wno-unused-parameter -Wno-unused-value -Wsuggest-attribute=format -Wsuggest-attribute=noreturn -Wunused-variable -Wmisleading-indentation -Wundef -fPIC I, [2024-05-27T06:59:37.388971 #3340252] INFO -- : XCFLAGS = -U_FORTIFY_SOURCE -D_FORTIFY_SOURCE=2 -fstack-protector-strong -fno-strict-overflow -fvisibility=hidden -fexcess-precision=standard -DRUBY_EXPORT -I. -I.ext/include/x86_64-linux -I/tmp/ruby/src/trunk/include -I/tmp/ruby/src/trunk -I/tmp/ruby/src/trunk/prism -I/tmp/ruby/src/trunk/enc/unicode/15.0.0 I, [2024-05-27T06:59:37.388975 #3340252] INFO -- : CPPFLAGS = I, [2024-05-27T06:59:37.388980 #3340252] INFO -- : DLDFLAGS = -Wl,--compress-debug-sections=zlib -Wl,-soname,libruby.so.3.4 -fstack-protector-strong I, [2024-05-27T06:59:37.388986 #3340252] INFO -- : SOLIBS = -lz -lrt -lrt -lgmp -ldl -lcrypt -lm -lpthread I, [2024-05-27T06:59:37.388990 #3340252] INFO -- : LANG = en_US.UTF-8 I, [2024-05-27T06:59:37.388996 #3340252] INFO -- : LC_ALL = I, [2024-05-27T06:59:37.389001 #3340252] INFO -- : LC_CTYPE = I, [2024-05-27T06:59:37.389006 #3340252] INFO -- : MFLAGS = I, [2024-05-27T06:59:37.389010 #3340252] INFO -- : RUSTC = no I, [2024-05-27T06:59:37.389016 #3340252] INFO -- : YJIT_RUSTC_ARGS = --crate-name=yjit --crate-type=staticlib --edition=2021 -g -C lto=thin -C opt-level=3 -C overflow-checks=on '--out-dir=/tmp/ruby/build/trunk/yjit/target/release/' /tmp/ruby/src/trunk/yjit/src/lib.rs I, [2024-05-27T06:59:37.389583 #3340252] INFO -- : gcc (Ubuntu 11.4.0-1ubuntu1~22.04) 11.4.0 I, [2024-05-27T06:59:37.389608 #3340252] INFO -- : Copyright (C) 2021 Free Software Foundation, Inc. I, [2024-05-27T06:59:37.389615 #3340252] INFO -- : This is free software; see the source for copying conditions. There is NO I, [2024-05-27T06:59:37.389620 #3340252] INFO -- : warranty; not even for MERCHANTABILITY or FITNESS FOR A PARTICULAR PURPOSE. I, [2024-05-27T06:59:37.389628 #3340252] INFO -- : I, [2024-05-27T06:59:37.391392 #3340252] INFO -- : generating enc.mk I, [2024-05-27T06:59:37.510020 #3340252] INFO -- : generating encdb.h I, [2024-05-27T06:59:37.533888 #3340252] INFO -- : encdb.h unchanged I, [2024-05-27T06:59:37.535050 #3340252] INFO -- : making enc I, [2024-05-27T06:59:37.552204 #3340252] INFO -- : make[1]: Entering directory '/tmp/ruby/build/trunk' I, [2024-05-27T06:59:37.552226 #3340252] INFO -- : make[1]: Nothing to be done for 'enc'. I, [2024-05-27T06:59:37.552232 #3340252] INFO -- : make[1]: Leaving directory '/tmp/ruby/build/trunk' I, [2024-05-27T06:59:37.552958 #3340252] INFO -- : making srcs under enc I, [2024-05-27T06:59:37.582440 #3340252] INFO -- : make[1]: Entering directory '/tmp/ruby/build/trunk' I, [2024-05-27T06:59:37.582461 #3340252] INFO -- : make[1]: Nothing to be done for 'srcs'. I, [2024-05-27T06:59:37.582467 #3340252] INFO -- : make[1]: Leaving directory '/tmp/ruby/build/trunk' I, [2024-05-27T06:59:37.583244 #3340252] INFO -- : generating transdb.h I, [2024-05-27T06:59:37.679510 #3340252] INFO -- : transdb.h unchanged I, [2024-05-27T06:59:37.680853 #3340252] INFO -- : making trans I, [2024-05-27T06:59:37.714991 #3340252] INFO -- : make[1]: Entering directory '/tmp/ruby/build/trunk' I, [2024-05-27T06:59:37.715013 #3340252] INFO -- : make[1]: Nothing to be done for 'trans'. I, [2024-05-27T06:59:37.715019 #3340252] INFO -- : make[1]: Leaving directory '/tmp/ruby/build/trunk' I, [2024-05-27T06:59:37.715581 #3340252] INFO -- : making encs I, [2024-05-27T06:59:37.753311 #3340252] INFO -- : make[1]: Entering directory '/tmp/ruby/build/trunk' I, [2024-05-27T06:59:37.753332 #3340252] INFO -- : make[1]: Nothing to be done for 'encs'. I, [2024-05-27T06:59:37.753337 #3340252] INFO -- : make[1]: Leaving directory '/tmp/ruby/build/trunk' I, [2024-05-27T06:59:37.755182 #3340252] INFO -- : generating makefiles ext/configure-ext.mk I, [2024-05-27T06:59:37.782097 #3340252] INFO -- : ext/configure-ext.mk updated I, [2024-05-27T06:59:37.784577 #3340252] INFO -- : make[1]: Entering directory '/tmp/ruby/build/trunk' I, [2024-05-27T06:59:39.182369 #3340252] INFO -- : make[1]: Leaving directory '/tmp/ruby/build/trunk' I, [2024-05-27T06:59:39.183168 #3340252] INFO -- : generating makefile exts.mk I, [2024-05-27T06:59:39.221568 #3340252] INFO -- : exts.mk unchanged I, [2024-05-27T06:59:39.226126 #3340252] INFO -- : make[1]: Entering directory '/tmp/ruby/build/trunk' I, [2024-05-27T06:59:39.507188 #3340252] INFO -- : make[2]: Entering directory '/tmp/ruby/build/trunk/ext/coverage' I, [2024-05-27T06:59:39.511119 #3340252] INFO -- : make[2]: Leaving directory '/tmp/ruby/build/trunk/ext/coverage' I, [2024-05-27T06:59:39.517197 #3340252] INFO -- : make[2]: Entering directory '/tmp/ruby/build/trunk/ext/date' I, [2024-05-27T06:59:39.522287 #3340252] INFO -- : make[2]: Leaving directory '/tmp/ruby/build/trunk/ext/date' I, [2024-05-27T06:59:39.526042 #3340252] INFO -- : make[2]: Entering directory '/tmp/ruby/build/trunk/ext/digest' I, [2024-05-27T06:59:39.534883 #3340252] INFO -- : make[2]: Leaving directory '/tmp/ruby/build/trunk/ext/digest' I, [2024-05-27T06:59:39.560908 #3340252] INFO -- : make[2]: Entering directory '/tmp/ruby/build/trunk/ext/digest/sha2' I, [2024-05-27T06:59:39.565573 #3340252] INFO -- : make[2]: Leaving directory '/tmp/ruby/build/trunk/ext/digest/sha2' I, [2024-05-27T06:59:39.585783 #3340252] INFO -- : make[2]: Entering directory '/tmp/ruby/build/trunk/ext/fiddle' I, [2024-05-27T06:59:39.592917 #3340252] INFO -- : make[2]: Leaving directory '/tmp/ruby/build/trunk/ext/fiddle' I, [2024-05-27T06:59:39.595812 #3340252] INFO -- : make[2]: Entering directory '/tmp/ruby/build/trunk/ext/io/console' I, [2024-05-27T06:59:39.598591 #3340252] INFO -- : make[2]: Leaving directory '/tmp/ruby/build/trunk/ext/io/console' I, [2024-05-27T06:59:39.607922 #3340252] INFO -- : make[2]: Entering directory '/tmp/ruby/build/trunk/ext/json' I, [2024-05-27T06:59:39.618486 #3340252] INFO -- : make[2]: Leaving directory '/tmp/ruby/build/trunk/ext/json' I, [2024-05-27T06:59:39.633634 #3340252] INFO -- : make[2]: Entering directory '/tmp/ruby/build/trunk/ext/monitor' I, [2024-05-27T06:59:39.637655 #3340252] INFO -- : make[2]: Leaving directory '/tmp/ruby/build/trunk/ext/monitor' I, [2024-05-27T06:59:39.644699 #3340252] INFO -- : make[2]: Entering directory '/tmp/ruby/build/trunk/ext/objspace' I, [2024-05-27T06:59:39.651142 #3340252] INFO -- : make[2]: Leaving directory '/tmp/ruby/build/trunk/ext/objspace' I, [2024-05-27T06:59:39.668722 #3340252] INFO -- : make[2]: Entering directory '/tmp/ruby/build/trunk/ext/openssl' I, [2024-05-27T06:59:39.685926 #3340252] INFO -- : make[2]: Leaving directory '/tmp/ruby/build/trunk/ext/openssl' I, [2024-05-27T06:59:39.690843 #3340252] INFO -- : make[2]: Entering directory '/tmp/ruby/build/trunk/ext/pathname' I, [2024-05-27T06:59:39.695073 #3340252] INFO -- : make[2]: Leaving directory '/tmp/ruby/build/trunk/ext/pathname' I, [2024-05-27T06:59:39.702194 #3340252] INFO -- : make[2]: Entering directory '/tmp/ruby/build/trunk/ext/psych' I, [2024-05-27T06:59:39.726386 #3340252] INFO -- : make[2]: Leaving directory '/tmp/ruby/build/trunk/ext/psych' I, [2024-05-27T06:59:39.730943 #3340252] INFO -- : make[2]: Entering directory '/tmp/ruby/build/trunk/ext/pty' I, [2024-05-27T06:59:39.735027 #3340252] INFO -- : make[2]: Leaving directory '/tmp/ruby/build/trunk/ext/pty' I, [2024-05-27T06:59:39.750649 #3340252] INFO -- : make[2]: Entering directory '/tmp/ruby/build/trunk/ext/ripper' I, [2024-05-27T06:59:39.759064 #3340252] INFO -- : make[2]: Leaving directory '/tmp/ruby/build/trunk/ext/ripper' I, [2024-05-27T06:59:39.761561 #3340252] INFO -- : make[2]: Entering directory '/tmp/ruby/build/trunk/ext/rubyvm' I, [2024-05-27T06:59:39.764708 #3340252] INFO -- : make[2]: Leaving directory '/tmp/ruby/build/trunk/ext/rubyvm' I, [2024-05-27T06:59:39.776960 #3340252] INFO -- : make[2]: Entering directory '/tmp/ruby/build/trunk/ext/socket' I, [2024-05-27T06:59:39.787775 #3340252] INFO -- : make[2]: Leaving directory '/tmp/ruby/build/trunk/ext/socket' I, [2024-05-27T06:59:39.806502 #3340252] INFO -- : make[2]: Entering directory '/tmp/ruby/build/trunk/.bundle/gems/bigdecimal-3.1.8/ext/bigdecimal' I, [2024-05-27T06:59:39.837300 #3340252] INFO -- : make[2]: Leaving directory '/tmp/ruby/build/trunk/.bundle/gems/bigdecimal-3.1.8/ext/bigdecimal' I, [2024-05-27T06:59:39.839331 #3340252] INFO -- : make[2]: Entering directory '/tmp/ruby/build/trunk/.bundle/gems/debug-1.9.2/ext/debug' I, [2024-05-27T06:59:39.864440 #3340252] INFO -- : make[2]: Leaving directory '/tmp/ruby/build/trunk/.bundle/gems/debug-1.9.2/ext/debug' I, [2024-05-27T06:59:39.866581 #3340252] INFO -- : make[2]: Entering directory '/tmp/ruby/build/trunk/.bundle/gems/nkf-0.2.0/ext/nkf' I, [2024-05-27T06:59:39.888979 #3340252] INFO -- : make[2]: Leaving directory '/tmp/ruby/build/trunk/.bundle/gems/nkf-0.2.0/ext/nkf' I, [2024-05-27T06:59:39.890961 #3340252] INFO -- : make[2]: Entering directory '/tmp/ruby/build/trunk/.bundle/gems/racc-1.7.3/ext/racc/cparse' I, [2024-05-27T06:59:39.912616 #3340252] INFO -- : make[2]: Leaving directory '/tmp/ruby/build/trunk/.bundle/gems/racc-1.7.3/ext/racc/cparse' I, [2024-05-27T06:59:39.914500 #3340252] INFO -- : make[2]: Entering directory '/tmp/ruby/build/trunk/.bundle/gems/racc-1.8.0/ext/racc/cparse' I, [2024-05-27T06:59:39.937020 #3340252] INFO -- : make[2]: Leaving directory '/tmp/ruby/build/trunk/.bundle/gems/racc-1.8.0/ext/racc/cparse' I, [2024-05-27T06:59:39.939360 #3340252] INFO -- : make[2]: Entering directory '/tmp/ruby/build/trunk/.bundle/gems/rbs-3.4.4/ext/rbs_extension' I, [2024-05-27T06:59:39.964819 #3340252] INFO -- : make[2]: Leaving directory '/tmp/ruby/build/trunk/.bundle/gems/rbs-3.4.4/ext/rbs_extension' I, [2024-05-27T06:59:39.967035 #3340252] INFO -- : make[2]: Entering directory '/tmp/ruby/build/trunk/.bundle/gems/syslog-0.1.2/ext/syslog' I, [2024-05-27T06:59:39.990523 #3340252] INFO -- : make[2]: Leaving directory '/tmp/ruby/build/trunk/.bundle/gems/syslog-0.1.2/ext/syslog' I, [2024-05-27T06:59:40.014707 #3340252] INFO -- : make[2]: Entering directory '/tmp/ruby/build/trunk' I, [2024-05-27T06:59:40.077547 #3340252] INFO -- : make[2]: 'ruby' is up to date. I, [2024-05-27T06:59:40.077585 #3340252] INFO -- : make[2]: Leaving directory '/tmp/ruby/build/trunk' I, [2024-05-27T06:59:40.077862 #3340252] INFO -- : make[1]: Leaving directory '/tmp/ruby/build/trunk' I, [2024-05-27T06:59:40.081722 #3340252] INFO -- : make[1]: Entering directory '/tmp/ruby/build/trunk' I, [2024-05-27T06:59:40.081743 #3340252] INFO -- : make[1]: Nothing to be done for 'note'. I, [2024-05-27T06:59:40.081749 #3340252] INFO -- : make[1]: Leaving directory '/tmp/ruby/build/trunk' E, [2024-05-27T06:59:40.144814 #3340252] ERROR -- : $ /tmp/ruby/build/trunk/miniruby -I/tmp/ruby/src/trunk/lib /tmp/ruby/src/trunk/tool/runruby.rb --archdir=/tmp/ruby/build/trunk --extout=.ext -- /tmp/ruby/src/trunk/spec/mspec/bin/mspec-run -B /tmp/ruby/src/trunk/spec/default.mspec --error-output stderr --debug -fy -o /tmp/rubytest.ex92x3/1-mspec-multi-0 E, [2024-05-27T06:59:40.144966 #3340252] ERROR -- : $ /tmp/ruby/build/trunk/miniruby -I/tmp/ruby/src/trunk/lib /tmp/ruby/src/trunk/tool/runruby.rb --archdir=/tmp/ruby/build/trunk --extout=.ext -- /tmp/ruby/src/trunk/spec/mspec/bin/mspec-run -B /tmp/ruby/src/trunk/spec/default.mspec --error-output stderr --debug -fy -o /tmp/rubytest.ex92x3/2-mspec-multi-1 E, [2024-05-27T06:59:40.145292 #3340252] ERROR -- : $ /tmp/ruby/build/trunk/miniruby -I/tmp/ruby/src/trunk/lib /tmp/ruby/src/trunk/tool/runruby.rb --archdir=/tmp/ruby/build/trunk --extout=.ext -- /tmp/ruby/src/trunk/spec/mspec/bin/mspec-run -B /tmp/ruby/src/trunk/spec/default.mspec --error-output stderr --debug -fy -o /tmp/rubytest.ex92x3/3-mspec-multi-2 E, [2024-05-27T06:59:40.145562 #3340252] ERROR -- : $ /tmp/ruby/build/trunk/miniruby -I/tmp/ruby/src/trunk/lib /tmp/ruby/src/trunk/tool/runruby.rb --archdir=/tmp/ruby/build/trunk --extout=.ext -- /tmp/ruby/src/trunk/spec/mspec/bin/mspec-run -B /tmp/ruby/src/trunk/spec/default.mspec --error-output stderr --debug -fy -o /tmp/rubytest.ex92x3/4-mspec-multi-3 E, [2024-05-27T06:59:40.145794 #3340252] ERROR -- : $ /tmp/ruby/build/trunk/miniruby -I/tmp/ruby/src/trunk/lib /tmp/ruby/src/trunk/tool/runruby.rb --archdir=/tmp/ruby/build/trunk --extout=.ext -- /tmp/ruby/src/trunk/spec/mspec/bin/mspec-run -B /tmp/ruby/src/trunk/spec/default.mspec --error-output stderr --debug -fy -o /tmp/rubytest.ex92x3/5-mspec-multi-4 E, [2024-05-27T06:59:40.146070 #3340252] ERROR -- : $ /tmp/ruby/build/trunk/miniruby -I/tmp/ruby/src/trunk/lib /tmp/ruby/src/trunk/tool/runruby.rb --archdir=/tmp/ruby/build/trunk --extout=.ext -- /tmp/ruby/src/trunk/spec/mspec/bin/mspec-run -B /tmp/ruby/src/trunk/spec/default.mspec --error-output stderr --debug -fy -o /tmp/rubytest.ex92x3/6-mspec-multi-5 E, [2024-05-27T06:59:40.146213 #3340252] ERROR -- : $ /tmp/ruby/build/trunk/miniruby -I/tmp/ruby/src/trunk/lib /tmp/ruby/src/trunk/tool/runruby.rb --archdir=/tmp/ruby/build/trunk --extout=.ext -- /tmp/ruby/src/trunk/spec/mspec/bin/mspec-run -B /tmp/ruby/src/trunk/spec/default.mspec --error-output stderr --debug -fy -o /tmp/rubytest.ex92x3/7-mspec-multi-6 E, [2024-05-27T06:59:40.146413 #3340252] ERROR -- : $ /tmp/ruby/build/trunk/miniruby -I/tmp/ruby/src/trunk/lib /tmp/ruby/src/trunk/tool/runruby.rb --archdir=/tmp/ruby/build/trunk --extout=.ext -- /tmp/ruby/src/trunk/spec/mspec/bin/mspec-run -B /tmp/ruby/src/trunk/spec/default.mspec --error-output stderr --debug -fy -o /tmp/rubytest.ex92x3/8-mspec-multi-7 E, [2024-05-27T06:59:40.146652 #3340252] ERROR -- : $ /tmp/ruby/build/trunk/miniruby -I/tmp/ruby/src/trunk/lib /tmp/ruby/src/trunk/tool/runruby.rb --archdir=/tmp/ruby/build/trunk --extout=.ext -- /tmp/ruby/src/trunk/spec/mspec/bin/mspec-run -B /tmp/ruby/src/trunk/spec/default.mspec --error-output stderr --debug -fy -o /tmp/rubytest.ex92x3/9-mspec-multi-8 E, [2024-05-27T06:59:40.146813 #3340252] ERROR -- : $ /tmp/ruby/build/trunk/miniruby -I/tmp/ruby/src/trunk/lib /tmp/ruby/src/trunk/tool/runruby.rb --archdir=/tmp/ruby/build/trunk --extout=.ext -- /tmp/ruby/src/trunk/spec/mspec/bin/mspec-run -B /tmp/ruby/src/trunk/spec/default.mspec --error-output stderr --debug -fy -o /tmp/rubytest.ex92x3/10-mspec-multi-9 E, [2024-05-27T06:59:40.147036 #3340252] ERROR -- : $ /tmp/ruby/build/trunk/miniruby -I/tmp/ruby/src/trunk/lib /tmp/ruby/src/trunk/tool/runruby.rb --archdir=/tmp/ruby/build/trunk --extout=.ext -- /tmp/ruby/src/trunk/spec/mspec/bin/mspec-run -B /tmp/ruby/src/trunk/spec/default.mspec --error-output stderr --debug -fy -o /tmp/rubytest.ex92x3/11-mspec-multi-10 E, [2024-05-27T06:59:40.147203 #3340252] ERROR -- : $ /tmp/ruby/build/trunk/miniruby -I/tmp/ruby/src/trunk/lib /tmp/ruby/src/trunk/tool/runruby.rb --archdir=/tmp/ruby/build/trunk --extout=.ext -- /tmp/ruby/src/trunk/spec/mspec/bin/mspec-run -B /tmp/ruby/src/trunk/spec/default.mspec --error-output stderr --debug -fy -o /tmp/rubytest.ex92x3/12-mspec-multi-11 E, [2024-05-27T06:59:40.147413 #3340252] ERROR -- : $ /tmp/ruby/build/trunk/miniruby -I/tmp/ruby/src/trunk/lib /tmp/ruby/src/trunk/tool/runruby.rb --archdir=/tmp/ruby/build/trunk --extout=.ext -- /tmp/ruby/src/trunk/spec/mspec/bin/mspec-run -B /tmp/ruby/src/trunk/spec/default.mspec --error-output stderr --debug -fy -o /tmp/rubytest.ex92x3/13-mspec-multi-12 E, [2024-05-27T06:59:40.147540 #3340252] ERROR -- : $ /tmp/ruby/build/trunk/miniruby -I/tmp/ruby/src/trunk/lib /tmp/ruby/src/trunk/tool/runruby.rb --archdir=/tmp/ruby/build/trunk --extout=.ext -- /tmp/ruby/src/trunk/spec/mspec/bin/mspec-run -B /tmp/ruby/src/trunk/spec/default.mspec --error-output stderr --debug -fy -o /tmp/rubytest.ex92x3/14-mspec-multi-13 E, [2024-05-27T06:59:40.147819 #3340252] ERROR -- : $ /tmp/ruby/build/trunk/miniruby -I/tmp/ruby/src/trunk/lib /tmp/ruby/src/trunk/tool/runruby.rb --archdir=/tmp/ruby/build/trunk --extout=.ext -- /tmp/ruby/src/trunk/spec/mspec/bin/mspec-run -B /tmp/ruby/src/trunk/spec/default.mspec --error-output stderr --debug -fy -o /tmp/rubytest.ex92x3/15-mspec-multi-14 E, [2024-05-27T06:59:40.147971 #3340252] ERROR -- : $ /tmp/ruby/build/trunk/miniruby -I/tmp/ruby/src/trunk/lib /tmp/ruby/src/trunk/tool/runruby.rb --archdir=/tmp/ruby/build/trunk --extout=.ext -- /tmp/ruby/src/trunk/spec/mspec/bin/mspec-run -B /tmp/ruby/src/trunk/spec/default.mspec --error-output stderr --debug -fy -o /tmp/rubytest.ex92x3/16-mspec-multi-15 E, [2024-05-27T06:59:40.148150 #3340252] ERROR -- : $ /tmp/ruby/build/trunk/miniruby -I/tmp/ruby/src/trunk/lib /tmp/ruby/src/trunk/tool/runruby.rb --archdir=/tmp/ruby/build/trunk --extout=.ext -- /tmp/ruby/src/trunk/spec/mspec/bin/mspec-run -B /tmp/ruby/src/trunk/spec/default.mspec --error-output stderr --debug -fy -o /tmp/rubytest.ex92x3/17-mspec-multi-16 E, [2024-05-27T06:59:40.150188 #3340252] ERROR -- : $ /tmp/ruby/build/trunk/miniruby -I/tmp/ruby/src/trunk/lib /tmp/ruby/src/trunk/tool/runruby.rb --archdir=/tmp/ruby/build/trunk --extout=.ext -- /tmp/ruby/src/trunk/spec/mspec/bin/mspec-run -B /tmp/ruby/src/trunk/spec/default.mspec --error-output stderr --debug -fy -o /tmp/rubytest.ex92x3/18-mspec-multi-17 E, [2024-05-27T06:59:40.150717 #3340252] ERROR -- : $ /tmp/ruby/build/trunk/miniruby -I/tmp/ruby/src/trunk/lib /tmp/ruby/src/trunk/tool/runruby.rb --archdir=/tmp/ruby/build/trunk --extout=.ext -- /tmp/ruby/src/trunk/spec/mspec/bin/mspec-run -B /tmp/ruby/src/trunk/spec/default.mspec --error-output stderr --debug -fy -o /tmp/rubytest.ex92x3/19-mspec-multi-18 E, [2024-05-27T06:59:40.151086 #3340252] ERROR -- : $ /tmp/ruby/build/trunk/miniruby -I/tmp/ruby/src/trunk/lib /tmp/ruby/src/trunk/tool/runruby.rb --archdir=/tmp/ruby/build/trunk --extout=.ext -- /tmp/ruby/src/trunk/spec/mspec/bin/mspec-run -B /tmp/ruby/src/trunk/spec/default.mspec --error-output stderr --debug -fy -o /tmp/rubytest.ex92x3/20-mspec-multi-19 I, [2024-05-27T06:59:40.315828 #3340252] INFO -- : ruby 3.4.0dev (2024-05-27T04:40:19Z master 4fee1019f6) [x86_64-linux] I, [2024-05-27T06:59:40.975524 #3340252] INFO -- : 0 ......................................................................... I, [2024-05-27T06:59:41.322673 #3340252] INFO -- : 73 ......................................................................... I, [2024-05-27T06:59:41.463929 #3340252] INFO -- : 146 ......................................................................... I, [2024-05-27T06:59:41.514816 #3340252] INFO -- : 219 ......................................................................... I, [2024-05-27T06:59:41.581915 #3340252] INFO -- : 292 ......................................................................... I, [2024-05-27T06:59:41.625825 #3340252] INFO -- : 365 ......................................................................... I, [2024-05-27T06:59:41.645509 #3340252] INFO -- : 438 ......................................................................... I, [2024-05-27T06:59:41.664350 #3340252] INFO -- : 511 ......................................................................... I, [2024-05-27T06:59:41.680591 #3340252] INFO -- : 584 ......................................................................... I, [2024-05-27T06:59:41.736675 #3340252] INFO -- : 657 ......................................................................... I, [2024-05-27T06:59:41.766562 #3340252] INFO -- : 730 ......................................................................... I, [2024-05-27T06:59:41.789206 #3340252] INFO -- : 803 ......................................................................... I, [2024-05-27T06:59:41.826752 #3340252] INFO -- : 876 ......................................................................... I, [2024-05-27T06:59:41.877845 #3340252] INFO -- : 949 ......................................................................... I, [2024-05-27T06:59:41.961754 #3340252] INFO -- : 1022 ......................................................................... I, [2024-05-27T06:59:42.135836 #3340252] INFO -- : 1095 ......................................................................... I, [2024-05-27T06:59:42.254469 #3340252] INFO -- : 1168 ......................................................................... I, [2024-05-27T06:59:42.311490 #3340252] INFO -- : 1241 ......................................................................... I, [2024-05-27T06:59:42.359351 #3340252] INFO -- : 1314 ......................................................................... I, [2024-05-27T06:59:42.382904 #3340252] INFO -- : 1387 ......................................................................... I, [2024-05-27T06:59:42.475773 #3340252] INFO -- : 1460 ......................................................................... I, [2024-05-27T06:59:42.944437 #3340252] INFO -- : 1533 ......................................................................... I, [2024-05-27T06:59:43.009635 #3340252] INFO -- : 1606 ......................................................................... I, [2024-05-27T06:59:43.155273 #3340252] INFO -- : 1679 ......................................................................... I, [2024-05-27T06:59:43.261506 #3340252] INFO -- : 1752 ......................................................................... I, [2024-05-27T06:59:43.331684 #3340252] INFO -- : 1825 ......................................................................... I, [2024-05-27T06:59:43.435782 #3340252] INFO -- : 1898 ......................................................................... I, [2024-05-27T06:59:43.496064 #3340252] INFO -- : 1971 ......................................................................... I, [2024-05-27T06:59:43.555802 #3340252] INFO -- : 2044 ......................................................................... I, [2024-05-27T06:59:43.603867 #3340252] INFO -- : 2117 ......................................................................... I, [2024-05-27T06:59:43.624060 #3340252] INFO -- : 2190 ......................................................................... I, [2024-05-27T06:59:43.642788 #3340252] INFO -- : 2263 ......................................................................... I, [2024-05-27T06:59:43.656733 #3340252] INFO -- : 2336 ......................................................................... I, [2024-05-27T06:59:43.689834 #3340252] INFO -- : 2409 ......................................................................... I, [2024-05-27T06:59:43.798641 #3340252] INFO -- : 2482 ......................................................................... I, [2024-05-27T06:59:43.823439 #3340252] INFO -- : 2555 ......................................................................... I, [2024-05-27T06:59:43.910741 #3340252] INFO -- : 2628 ......................................................................... I, [2024-05-27T06:59:44.039499 #3340252] INFO -- : 2701 ......................................................................... I, [2024-05-27T06:59:44.073583 #3340252] INFO -- : 2774 ......................................................................... I, [2024-05-27T06:59:44.142351 #3340252] INFO -- : 2847 ......................................................................... I, [2024-05-27T06:59:44.178426 #3340252] INFO -- : 2920 ......................................................................... I, [2024-05-27T06:59:44.204898 #3340252] INFO -- : 2993 ......................................................................... I, [2024-05-27T06:59:44.225288 #3340252] INFO -- : 3066 ......................................................................... I, [2024-05-27T06:59:44.239953 #3340252] INFO -- : 3139 ......................................................................... I, [2024-05-27T06:59:44.250388 #3340252] INFO -- : 3212 ......................................................................... I, [2024-05-27T06:59:44.284693 #3340252] INFO -- : 3285 ......................................................................... I, [2024-05-27T06:59:48.227793 #3340252] INFO -- : 3358 ......................................................................... I, [2024-05-27T06:59:48.259087 #3340252] INFO -- : I, [2024-05-27T06:59:48.259124 #3340252] INFO -- : I, [2024-05-27T06:59:48.259132 #3340252] INFO -- : Finished in 8.111799 seconds I, [2024-05-27T06:59:48.259137 #3340252] INFO -- : I, [2024-05-27T06:59:48.259142 #3340252] INFO -- : 3430 files, 32652 examples, 200754 expectations, 0 failures, 0 errors, 0 tagged I, [2024-05-27T06:59:48.262466 #3340252] INFO -- : $$$[end] "make yes-test-rubyspec MSPECOPT='--error-output stderr --debug -j' TESTS='-j20'" exit with 0.