# Logfile created on 2024-05-26 03:15:43 +0000 by logger.rb/v1.4.3 I, [2024-05-26T03:15:43.046700 #3453513] INFO -- : #, @formatter=nil, @logdev=#, @binmode=false, @mon_data=#, @mon_data_owner_object_id=860>>> I, [2024-05-26T03:15:43.046822 #3453513] INFO -- : $$$[beg] make update-unicode -j20 I, [2024-05-26T03:15:43.111173 #3453513] INFO -- : Downloading Unicode emoji 15.0 files... I, [2024-05-26T03:15:43.111434 #3453513] INFO -- : Downloading Unicode emoji 15.0 files... I, [2024-05-26T03:15:43.111931 #3453513] INFO -- : Downloading Unicode emoji 15.0 files... I, [2024-05-26T03:15:43.157191 #3453513] INFO -- : made symlink emoji/15.0/emoji-sequences.txt to /tmp/ruby/src/trunk/.downloaded-cache/emoji/15.0/emoji-sequences.txt I, [2024-05-26T03:15:43.157243 #3453513] INFO -- : downloading emoji/15.0/emoji-test.txt ... downloading emoji/15.0/emoji-sequences.txt ... /tmp/ruby/src/trunk/enc/unicode/data/emoji/15.0/emoji-sequences.txt already exists E, [2024-05-26T03:15:43.616738 #3453513] ERROR -- : /tmp/ruby/src/trunk/tool/downloader.rb:302:in `rescue in download': failed to download emoji/15.0/emoji-test.txt (RuntimeError) E, [2024-05-26T03:15:43.616890 #3453513] ERROR -- : OpenURI::HTTPError: 403 Forbidden: https://www.unicode.org/Public/emoji/15.0/emoji-test.txt E, [2024-05-26T03:15:43.616916 #3453513] ERROR -- : from /tmp/ruby/src/trunk/tool/downloader.rb:201:in `download' E, [2024-05-26T03:15:43.616929 #3453513] ERROR -- : from /tmp/ruby/src/trunk/tool/downloader.rb:136:in `download' E, [2024-05-26T03:15:43.616941 #3453513] ERROR -- : from /tmp/ruby/src/trunk/tool/downloader.rb:482:in `block in
' E, [2024-05-26T03:15:43.616954 #3453513] ERROR -- : from /tmp/ruby/src/trunk/tool/downloader.rb:465:in `each' E, [2024-05-26T03:15:43.616968 #3453513] ERROR -- : from /tmp/ruby/src/trunk/tool/downloader.rb:465:in `
' E, [2024-05-26T03:15:43.616980 #3453513] ERROR -- : /usr/lib/ruby/3.0.0/open-uri.rb:364:in `open_http': 403 Forbidden (OpenURI::HTTPError) E, [2024-05-26T03:15:43.616992 #3453513] ERROR -- : from /usr/lib/ruby/3.0.0/open-uri.rb:741:in `buffer_open' E, [2024-05-26T03:15:43.617008 #3453513] ERROR -- : from /usr/lib/ruby/3.0.0/open-uri.rb:212:in `block in open_loop' E, [2024-05-26T03:15:43.617020 #3453513] ERROR -- : from /usr/lib/ruby/3.0.0/open-uri.rb:210:in `catch' E, [2024-05-26T03:15:43.617031 #3453513] ERROR -- : from /usr/lib/ruby/3.0.0/open-uri.rb:210:in `open_loop' E, [2024-05-26T03:15:43.617043 #3453513] ERROR -- : from /usr/lib/ruby/3.0.0/open-uri.rb:151:in `open_uri' E, [2024-05-26T03:15:43.617054 #3453513] ERROR -- : from /usr/lib/ruby/3.0.0/open-uri.rb:721:in `open' E, [2024-05-26T03:15:43.617066 #3453513] ERROR -- : from /usr/lib/ruby/3.0.0/open-uri.rb:729:in `read' E, [2024-05-26T03:15:43.617077 #3453513] ERROR -- : from /tmp/ruby/src/trunk/tool/downloader.rb:247:in `block in download' E, [2024-05-26T03:15:43.617107 #3453513] ERROR -- : from /tmp/ruby/src/trunk/tool/downloader.rb:378:in `with_retry' E, [2024-05-26T03:15:43.617120 #3453513] ERROR -- : from /tmp/ruby/src/trunk/tool/downloader.rb:246:in `download' E, [2024-05-26T03:15:43.617135 #3453513] ERROR -- : from /tmp/ruby/src/trunk/tool/downloader.rb:136:in `download' E, [2024-05-26T03:15:43.617147 #3453513] ERROR -- : from /tmp/ruby/src/trunk/tool/downloader.rb:482:in `block in
' E, [2024-05-26T03:15:43.617159 #3453513] ERROR -- : from /tmp/ruby/src/trunk/tool/downloader.rb:465:in `each' E, [2024-05-26T03:15:43.617171 #3453513] ERROR -- : from /tmp/ruby/src/trunk/tool/downloader.rb:465:in `
' E, [2024-05-26T03:15:43.618364 #3453513] ERROR -- : /tmp/ruby/src/trunk/tool/downloader.rb:302:in `rescue in download': failed to download emoji/15.0/emoji-test.txt (RuntimeError) E, [2024-05-26T03:15:43.618442 #3453513] ERROR -- : OpenURI::HTTPError: 403 Forbidden: https://www.unicode.org/Public/emoji/15.0/emoji-test.txt E, [2024-05-26T03:15:43.618462 #3453513] ERROR -- : from /tmp/ruby/src/trunk/tool/downloader.rb:201:in `download' E, [2024-05-26T03:15:43.618486 #3453513] ERROR -- : from /tmp/ruby/src/trunk/tool/downloader.rb:136:in `download' E, [2024-05-26T03:15:43.618498 #3453513] ERROR -- : from /tmp/ruby/src/trunk/tool/downloader.rb:482:in `block in
' E, [2024-05-26T03:15:43.618509 #3453513] ERROR -- : from /tmp/ruby/src/trunk/tool/downloader.rb:465:in `each' E, [2024-05-26T03:15:43.618520 #3453513] ERROR -- : from /tmp/ruby/src/trunk/tool/downloader.rb:465:in `
' E, [2024-05-26T03:15:43.618530 #3453513] ERROR -- : /usr/lib/ruby/3.0.0/open-uri.rb:364:in `open_http': 403 Forbidden (OpenURI::HTTPError) E, [2024-05-26T03:15:43.618541 #3453513] ERROR -- : from /usr/lib/ruby/3.0.0/open-uri.rb:741:in `buffer_open' E, [2024-05-26T03:15:43.618552 #3453513] ERROR -- : from /usr/lib/ruby/3.0.0/open-uri.rb:212:in `block in open_loop' E, [2024-05-26T03:15:43.618563 #3453513] ERROR -- : from /usr/lib/ruby/3.0.0/open-uri.rb:210:in `catch' E, [2024-05-26T03:15:43.618576 #3453513] ERROR -- : from /usr/lib/ruby/3.0.0/open-uri.rb:210:in `open_loop' E, [2024-05-26T03:15:43.618587 #3453513] ERROR -- : from /usr/lib/ruby/3.0.0/open-uri.rb:151:in `open_uri' E, [2024-05-26T03:15:43.618599 #3453513] ERROR -- : from /usr/lib/ruby/3.0.0/open-uri.rb:721:in `open' E, [2024-05-26T03:15:43.618610 #3453513] ERROR -- : from /usr/lib/ruby/3.0.0/open-uri.rb:729:in `read' E, [2024-05-26T03:15:43.618620 #3453513] ERROR -- : from /tmp/ruby/src/trunk/tool/downloader.rb:247:in `block in download' E, [2024-05-26T03:15:43.618631 #3453513] ERROR -- : from /tmp/ruby/src/trunk/tool/downloader.rb:378:in `with_retry' E, [2024-05-26T03:15:43.618648 #3453513] ERROR -- : from /tmp/ruby/src/trunk/tool/downloader.rb:246:in `download' E, [2024-05-26T03:15:43.618659 #3453513] ERROR -- : from /tmp/ruby/src/trunk/tool/downloader.rb:136:in `download' E, [2024-05-26T03:15:43.618669 #3453513] ERROR -- : from /tmp/ruby/src/trunk/tool/downloader.rb:482:in `block in
' E, [2024-05-26T03:15:43.618683 #3453513] ERROR -- : from /tmp/ruby/src/trunk/tool/downloader.rb:465:in `each' E, [2024-05-26T03:15:43.618694 #3453513] ERROR -- : from /tmp/ruby/src/trunk/tool/downloader.rb:465:in `
' E, [2024-05-26T03:15:43.621213 #3453513] ERROR -- : make: *** [uncommon.mk:1756: /tmp/ruby/src/trunk/enc/unicode/data/emoji/15.0/emoji-sequences.txt] Error 1 E, [2024-05-26T03:15:43.621282 #3453513] ERROR -- : make: *** Deleting file '/tmp/ruby/src/trunk/enc/unicode/data/emoji/15.0/emoji-sequences.txt' E, [2024-05-26T03:15:43.621297 #3453513] ERROR -- : make: *** Waiting for unfinished jobs.... E, [2024-05-26T03:15:43.622753 #3453513] ERROR -- : make: *** [uncommon.mk:1756: /tmp/ruby/src/trunk/enc/unicode/data/emoji/15.0/emoji-zwj-sequences.txt] Error 1 E, [2024-05-26T03:15:44.112339 #3453513] ERROR -- : /tmp/ruby/src/trunk/tool/downloader.rb:302:in `rescue in download': failed to download emoji/15.0/emoji-sequences.txt (RuntimeError) E, [2024-05-26T03:15:44.112470 #3453513] ERROR -- : EOFError: end of file reached: https://www.unicode.org/Public/emoji/15.0/emoji-sequences.txt E, [2024-05-26T03:15:44.112490 #3453513] ERROR -- : from /tmp/ruby/src/trunk/tool/downloader.rb:201:in `download' E, [2024-05-26T03:15:44.112503 #3453513] ERROR -- : from /tmp/ruby/src/trunk/tool/downloader.rb:136:in `download' E, [2024-05-26T03:15:44.112515 #3453513] ERROR -- : from /tmp/ruby/src/trunk/tool/downloader.rb:482:in `block in
' E, [2024-05-26T03:15:44.112527 #3453513] ERROR -- : from /tmp/ruby/src/trunk/tool/downloader.rb:465:in `each' E, [2024-05-26T03:15:44.112545 #3453513] ERROR -- : from /tmp/ruby/src/trunk/tool/downloader.rb:465:in `
' E, [2024-05-26T03:15:44.112557 #3453513] ERROR -- : /usr/lib/ruby/3.0.0/net/protocol.rb:227:in `rbuf_fill': end of file reached (EOFError) E, [2024-05-26T03:15:44.112573 #3453513] ERROR -- : from /usr/lib/ruby/3.0.0/net/protocol.rb:193:in `readuntil' E, [2024-05-26T03:15:44.112584 #3453513] ERROR -- : from /usr/lib/ruby/3.0.0/net/protocol.rb:203:in `readline' E, [2024-05-26T03:15:44.112597 #3453513] ERROR -- : from /usr/lib/ruby/3.0.0/net/http/response.rb:42:in `read_status_line' E, [2024-05-26T03:15:44.112608 #3453513] ERROR -- : from /usr/lib/ruby/3.0.0/net/http/response.rb:31:in `read_new' E, [2024-05-26T03:15:44.112620 #3453513] ERROR -- : from /usr/lib/ruby/3.0.0/net/http.rb:1557:in `block in transport_request' E, [2024-05-26T03:15:44.112632 #3453513] ERROR -- : from /usr/lib/ruby/3.0.0/net/http.rb:1548:in `catch' E, [2024-05-26T03:15:44.112643 #3453513] ERROR -- : from /usr/lib/ruby/3.0.0/net/http.rb:1548:in `transport_request' E, [2024-05-26T03:15:44.112874 #3453513] ERROR -- : from /usr/lib/ruby/3.0.0/net/http.rb:1521:in `request' E, [2024-05-26T03:15:44.112888 #3453513] ERROR -- : from /usr/lib/ruby/3.0.0/open-uri.rb:329:in `block in open_http' E, [2024-05-26T03:15:44.112899 #3453513] ERROR -- : from /usr/lib/ruby/3.0.0/net/http.rb:960:in `start' E, [2024-05-26T03:15:44.112910 #3453513] ERROR -- : from /usr/lib/ruby/3.0.0/open-uri.rb:323:in `open_http' E, [2024-05-26T03:15:44.112920 #3453513] ERROR -- : from /usr/lib/ruby/3.0.0/open-uri.rb:741:in `buffer_open' E, [2024-05-26T03:15:44.112934 #3453513] ERROR -- : from /usr/lib/ruby/3.0.0/open-uri.rb:212:in `block in open_loop' E, [2024-05-26T03:15:44.112945 #3453513] ERROR -- : from /usr/lib/ruby/3.0.0/open-uri.rb:210:in `catch' E, [2024-05-26T03:15:44.112956 #3453513] ERROR -- : from /usr/lib/ruby/3.0.0/open-uri.rb:210:in `open_loop' E, [2024-05-26T03:15:44.112973 #3453513] ERROR -- : from /usr/lib/ruby/3.0.0/open-uri.rb:151:in `open_uri' E, [2024-05-26T03:15:44.112984 #3453513] ERROR -- : from /usr/lib/ruby/3.0.0/open-uri.rb:721:in `open' E, [2024-05-26T03:15:44.112994 #3453513] ERROR -- : from /usr/lib/ruby/3.0.0/open-uri.rb:729:in `read' E, [2024-05-26T03:15:44.113005 #3453513] ERROR -- : from /tmp/ruby/src/trunk/tool/downloader.rb:247:in `block in download' E, [2024-05-26T03:15:44.113016 #3453513] ERROR -- : from /tmp/ruby/src/trunk/tool/downloader.rb:378:in `with_retry' E, [2024-05-26T03:15:44.113026 #3453513] ERROR -- : from /tmp/ruby/src/trunk/tool/downloader.rb:246:in `download' E, [2024-05-26T03:15:44.113039 #3453513] ERROR -- : from /tmp/ruby/src/trunk/tool/downloader.rb:136:in `download' E, [2024-05-26T03:15:44.113050 #3453513] ERROR -- : from /tmp/ruby/src/trunk/tool/downloader.rb:482:in `block in
' E, [2024-05-26T03:15:44.113061 #3453513] ERROR -- : from /tmp/ruby/src/trunk/tool/downloader.rb:465:in `each' E, [2024-05-26T03:15:44.113071 #3453513] ERROR -- : from /tmp/ruby/src/trunk/tool/downloader.rb:465:in `
' E, [2024-05-26T03:15:44.117113 #3453513] ERROR -- : make: *** [uncommon.mk:1756: /tmp/ruby/src/trunk/enc/unicode/data/emoji/15.0/emoji-test.txt] Error 1 I, [2024-05-26T03:15:44.117206 #3453513] INFO -- : downloading emoji/15.0/emoji-test.txt ... I, [2024-05-26T03:15:44.117779 #3453513] INFO -- : $$$[end] "make update-unicode -j20" exit with 512. I, [2024-05-26T03:15:44.117839 #3453513] INFO -- : $$$[beg] make update-download -j20 I, [2024-05-26T03:15:44.222122 #3453513] INFO -- : tool/config.guess already exists I, [2024-05-26T03:15:44.222171 #3453513] INFO -- : tool/config.sub already exists I, [2024-05-26T03:15:44.224314 #3453513] INFO -- : Update power_assert to 84e85124c5014a139af39161d484156cfe87a9ed I, [2024-05-26T03:15:44.224481 #3453513] INFO -- : Update rbs to ba7872795d5de04adb8ff500c0e6afdc81a041dd I, [2024-05-26T03:15:44.225232 #3453513] INFO -- : Update typeprof to b19a6416da3a05d57fadd6ffdadb382b6d236ca5 I, [2024-05-26T03:15:44.225724 #3453513] INFO -- : echo 84e85124c5014a139af39161d484156cfe87a9ed | /bin/sh /tmp/ruby/src/trunk/tool/ifchange /tmp/ruby/src/trunk/.bundle/.timestamp/power_assert.revision - I, [2024-05-26T03:15:44.225889 #3453513] INFO -- : echo ba7872795d5de04adb8ff500c0e6afdc81a041dd | /bin/sh /tmp/ruby/src/trunk/tool/ifchange /tmp/ruby/src/trunk/.bundle/.timestamp/rbs.revision - I, [2024-05-26T03:15:44.226365 #3453513] INFO -- : echo b19a6416da3a05d57fadd6ffdadb382b6d236ca5 | /bin/sh /tmp/ruby/src/trunk/tool/ifchange /tmp/ruby/src/trunk/.bundle/.timestamp/typeprof.revision - I, [2024-05-26T03:15:44.227694 #3453513] INFO -- : /tmp/ruby/src/trunk/.bundle/.timestamp/power_assert.revision unchanged I, [2024-05-26T03:15:44.227717 #3453513] INFO -- : /tmp/ruby/src/trunk/.bundle/.timestamp/rbs.revision unchanged I, [2024-05-26T03:15:44.228199 #3453513] INFO -- : /tmp/ruby/src/trunk/.bundle/.timestamp/typeprof.revision unchanged I, [2024-05-26T03:15:44.228984 #3453513] INFO -- : Building power_assert@84e85124c5014a139af39161d484156cfe87a9ed to /tmp/ruby/src/trunk/gems/power_assert-2.0.3.gem I, [2024-05-26T03:15:44.297453 #3453513] INFO -- : Successfully built RubyGem I, [2024-05-26T03:15:44.297492 #3453513] INFO -- : Name: power_assert I, [2024-05-26T03:15:44.297497 #3453513] INFO -- : Version: 2.0.4dev I, [2024-05-26T03:15:44.297500 #3453513] INFO -- : File: power_assert-2.0.4dev.gem I, [2024-05-26T03:15:44.342108 #3453513] INFO -- : $$$[end] "make update-download -j20" exit with 0. I, [2024-05-26T03:15:44.342151 #3453513] INFO -- : $$$[beg] make update-rubyspec -j20 I, [2024-05-26T03:15:44.399522 #3453513] INFO -- : make: Nothing to be done for 'update-rubyspec'. I, [2024-05-26T03:15:44.399868 #3453513] INFO -- : $$$[end] "make update-rubyspec -j20" exit with 0. I, [2024-05-26T03:15:44.399897 #3453513] INFO -- : $$$[beg] make update-src -j20 I, [2024-05-26T03:15:45.126392 #3453513] INFO -- : Already up to date. I, [2024-05-26T03:15:45.145327 #3453513] INFO -- : Latest commit hash = d2c4363e0c I, [2024-05-26T03:15:45.147018 #3453513] INFO -- : $$$[end] "make update-src -j20" exit with 0. I, [2024-05-26T03:15:45.147067 #3453513] INFO -- : $$$[beg] make after-update -j20 I, [2024-05-26T03:15:45.223186 #3453513] INFO -- : generating /tmp/ruby/src/trunk/ext/ripper/eventids2table.c I, [2024-05-26T03:15:45.227283 #3453513] INFO -- : make[1]: Entering directory '/tmp/ruby/src/trunk/ext/ripper' I, [2024-05-26T03:15:45.227308 #3453513] INFO -- : make[1]: Nothing to be done for 'src'. I, [2024-05-26T03:15:45.227315 #3453513] INFO -- : make[1]: Leaving directory '/tmp/ruby/src/trunk/ext/ripper' I, [2024-05-26T03:15:45.243404 #3453513] INFO -- : /tmp/ruby/src/trunk/revision.h updated I, [2024-05-26T03:15:45.244721 #3453513] INFO -- : generating x86_64-linux-fake.rb I, [2024-05-26T03:15:45.295937 #3453513] INFO -- : x86_64-linux-fake.rb updated I, [2024-05-26T03:15:45.297282 #3453513] INFO -- : generating enc.mk I, [2024-05-26T03:15:45.413837 #3453513] INFO -- : making srcs under enc I, [2024-05-26T03:15:45.443905 #3453513] INFO -- : make[1]: Entering directory '/tmp/ruby/build/trunk' I, [2024-05-26T03:15:45.443927 #3453513] INFO -- : make[1]: Nothing to be done for 'srcs'. I, [2024-05-26T03:15:45.443932 #3453513] INFO -- : make[1]: Leaving directory '/tmp/ruby/build/trunk' I, [2024-05-26T03:15:45.488501 #3453513] INFO -- : Update power_assert to 84e85124c5014a139af39161d484156cfe87a9ed I, [2024-05-26T03:15:45.488673 #3453513] INFO -- : Update rbs to ba7872795d5de04adb8ff500c0e6afdc81a041dd I, [2024-05-26T03:15:45.489351 #3453513] INFO -- : Update typeprof to b19a6416da3a05d57fadd6ffdadb382b6d236ca5 I, [2024-05-26T03:15:45.489795 #3453513] INFO -- : echo 84e85124c5014a139af39161d484156cfe87a9ed | /bin/sh /tmp/ruby/src/trunk/tool/ifchange /tmp/ruby/src/trunk/.bundle/.timestamp/power_assert.revision - I, [2024-05-26T03:15:45.490043 #3453513] INFO -- : echo ba7872795d5de04adb8ff500c0e6afdc81a041dd | /bin/sh /tmp/ruby/src/trunk/tool/ifchange /tmp/ruby/src/trunk/.bundle/.timestamp/rbs.revision - I, [2024-05-26T03:15:45.491346 #3453513] INFO -- : echo b19a6416da3a05d57fadd6ffdadb382b6d236ca5 | /bin/sh /tmp/ruby/src/trunk/tool/ifchange /tmp/ruby/src/trunk/.bundle/.timestamp/typeprof.revision - I, [2024-05-26T03:15:45.491846 #3453513] INFO -- : /tmp/ruby/src/trunk/.bundle/.timestamp/power_assert.revision unchanged I, [2024-05-26T03:15:45.491948 #3453513] INFO -- : /tmp/ruby/src/trunk/.bundle/.timestamp/rbs.revision unchanged I, [2024-05-26T03:15:45.492973 #3453513] INFO -- : /tmp/ruby/src/trunk/.bundle/.timestamp/typeprof.revision unchanged I, [2024-05-26T03:15:45.493025 #3453513] INFO -- : Building power_assert@84e85124c5014a139af39161d484156cfe87a9ed to /tmp/ruby/src/trunk/gems/power_assert-2.0.3.gem I, [2024-05-26T03:15:45.561892 #3453513] INFO -- : Successfully built RubyGem I, [2024-05-26T03:15:45.561941 #3453513] INFO -- : Name: power_assert I, [2024-05-26T03:15:45.561948 #3453513] INFO -- : Version: 2.0.4dev I, [2024-05-26T03:15:45.561952 #3453513] INFO -- : File: power_assert-2.0.4dev.gem I, [2024-05-26T03:15:45.564044 #3453513] INFO -- : Extracting bundle gem power_assert-2.0.3... I, [2024-05-26T03:15:45.626331 #3453513] INFO -- : Try with hash version of bundled gems instead of gems/power_assert-2.0.3.gem. We don't use this gem with release version of Ruby. I, [2024-05-26T03:15:45.631280 #3453513] INFO -- : Unpacked gems/power_assert-2.0.4dev.gem I, [2024-05-26T03:15:45.633334 #3453513] INFO -- : $$$[end] "make after-update -j20" exit with 0. I, [2024-05-26T03:15:45.633486 #3453513] INFO -- : $$$[beg] make miniruby -j20 I, [2024-05-26T03:15:45.691375 #3453513] INFO -- : BASERUBY = /usr/bin/ruby --disable=gems I, [2024-05-26T03:15:45.691409 #3453513] INFO -- : CC = gcc I, [2024-05-26T03:15:45.691415 #3453513] INFO -- : LD = ld I, [2024-05-26T03:15:45.691420 #3453513] INFO -- : LDSHARED = gcc -shared I, [2024-05-26T03:15:45.691425 #3453513] INFO -- : CFLAGS = -O3 -fno-fast-math -ggdb3 -Wall -Wextra -Wdeprecated-declarations -Wdiv-by-zero -Wduplicated-cond -Wimplicit-function-declaration -Wimplicit-int -Wpointer-arith -Wwrite-strings -Wold-style-definition -Wimplicit-fallthrough=0 -Wmissing-noreturn -Wno-cast-function-type -Wno-constant-logical-operand -Wno-long-long -Wno-missing-field-initializers -Wno-overlength-strings -Wno-packed-bitfield-compat -Wno-parentheses-equality -Wno-self-assign -Wno-tautological-compare -Wno-unused-parameter -Wno-unused-value -Wsuggest-attribute=format -Wsuggest-attribute=noreturn -Wunused-variable -Wmisleading-indentation -Wundef -fPIC I, [2024-05-26T03:15:45.691430 #3453513] INFO -- : XCFLAGS = -U_FORTIFY_SOURCE -D_FORTIFY_SOURCE=2 -fstack-protector-strong -fno-strict-overflow -fvisibility=hidden -fexcess-precision=standard -DRUBY_EXPORT -I. -I.ext/include/x86_64-linux -I/tmp/ruby/src/trunk/include -I/tmp/ruby/src/trunk -I/tmp/ruby/src/trunk/prism -I/tmp/ruby/src/trunk/enc/unicode/15.0.0 I, [2024-05-26T03:15:45.691435 #3453513] INFO -- : CPPFLAGS = I, [2024-05-26T03:15:45.691440 #3453513] INFO -- : DLDFLAGS = -Wl,--compress-debug-sections=zlib -Wl,-soname,libruby.so.3.4 -fstack-protector-strong I, [2024-05-26T03:15:45.691445 #3453513] INFO -- : SOLIBS = -lz -lrt -lrt -lgmp -ldl -lcrypt -lm -lpthread I, [2024-05-26T03:15:45.691449 #3453513] INFO -- : LANG = en_US.UTF-8 I, [2024-05-26T03:15:45.691455 #3453513] INFO -- : LC_ALL = I, [2024-05-26T03:15:45.691460 #3453513] INFO -- : LC_CTYPE = I, [2024-05-26T03:15:45.691464 #3453513] INFO -- : MFLAGS = -j20 --jobserver-auth=4,5 I, [2024-05-26T03:15:45.691476 #3453513] INFO -- : RUSTC = no I, [2024-05-26T03:15:45.691480 #3453513] INFO -- : YJIT_RUSTC_ARGS = --crate-name=yjit --crate-type=staticlib --edition=2021 -g -C lto=thin -C opt-level=3 -C overflow-checks=on '--out-dir=/tmp/ruby/build/trunk/yjit/target/release/' /tmp/ruby/src/trunk/yjit/src/lib.rs I, [2024-05-26T03:15:45.693152 #3453513] INFO -- : gcc (Ubuntu 11.4.0-1ubuntu1~22.04) 11.4.0 I, [2024-05-26T03:15:45.693185 #3453513] INFO -- : Copyright (C) 2021 Free Software Foundation, Inc. I, [2024-05-26T03:15:45.693194 #3453513] INFO -- : This is free software; see the source for copying conditions. There is NO I, [2024-05-26T03:15:45.693204 #3453513] INFO -- : warranty; not even for MERCHANTABILITY or FITNESS FOR A PARTICULAR PURPOSE. I, [2024-05-26T03:15:45.693210 #3453513] INFO -- : I, [2024-05-26T03:15:45.719899 #3453513] INFO -- : compiling /tmp/ruby/src/trunk/version.c I, [2024-05-26T03:15:45.822455 #3453513] INFO -- : linking miniruby I, [2024-05-26T03:15:46.351013 #3453513] INFO -- : $$$[end] "make miniruby -j20" exit with 0. I, [2024-05-26T03:15:46.351113 #3453513] INFO -- : $$$[beg] make ruby -j20 I, [2024-05-26T03:15:46.408787 #3453513] INFO -- : BASERUBY = /usr/bin/ruby --disable=gems I, [2024-05-26T03:15:46.408821 #3453513] INFO -- : CC = gcc I, [2024-05-26T03:15:46.408830 #3453513] INFO -- : LD = ld I, [2024-05-26T03:15:46.408836 #3453513] INFO -- : LDSHARED = gcc -shared I, [2024-05-26T03:15:46.408842 #3453513] INFO -- : CFLAGS = -O3 -fno-fast-math -ggdb3 -Wall -Wextra -Wdeprecated-declarations -Wdiv-by-zero -Wduplicated-cond -Wimplicit-function-declaration -Wimplicit-int -Wpointer-arith -Wwrite-strings -Wold-style-definition -Wimplicit-fallthrough=0 -Wmissing-noreturn -Wno-cast-function-type -Wno-constant-logical-operand -Wno-long-long -Wno-missing-field-initializers -Wno-overlength-strings -Wno-packed-bitfield-compat -Wno-parentheses-equality -Wno-self-assign -Wno-tautological-compare -Wno-unused-parameter -Wno-unused-value -Wsuggest-attribute=format -Wsuggest-attribute=noreturn -Wunused-variable -Wmisleading-indentation -Wundef -fPIC I, [2024-05-26T03:15:46.408848 #3453513] INFO -- : XCFLAGS = -U_FORTIFY_SOURCE -D_FORTIFY_SOURCE=2 -fstack-protector-strong -fno-strict-overflow -fvisibility=hidden -fexcess-precision=standard -DRUBY_EXPORT -I. -I.ext/include/x86_64-linux -I/tmp/ruby/src/trunk/include -I/tmp/ruby/src/trunk -I/tmp/ruby/src/trunk/prism -I/tmp/ruby/src/trunk/enc/unicode/15.0.0 I, [2024-05-26T03:15:46.408851 #3453513] INFO -- : CPPFLAGS = I, [2024-05-26T03:15:46.408855 #3453513] INFO -- : DLDFLAGS = -Wl,--compress-debug-sections=zlib -Wl,-soname,libruby.so.3.4 -fstack-protector-strong I, [2024-05-26T03:15:46.408859 #3453513] INFO -- : SOLIBS = -lz -lrt -lrt -lgmp -ldl -lcrypt -lm -lpthread I, [2024-05-26T03:15:46.408862 #3453513] INFO -- : LANG = en_US.UTF-8 I, [2024-05-26T03:15:46.408866 #3453513] INFO -- : LC_ALL = I, [2024-05-26T03:15:46.408869 #3453513] INFO -- : LC_CTYPE = I, [2024-05-26T03:15:46.408873 #3453513] INFO -- : MFLAGS = -j20 --jobserver-auth=4,5 I, [2024-05-26T03:15:46.408876 #3453513] INFO -- : RUSTC = no I, [2024-05-26T03:15:46.408880 #3453513] INFO -- : YJIT_RUSTC_ARGS = --crate-name=yjit --crate-type=staticlib --edition=2021 -g -C lto=thin -C opt-level=3 -C overflow-checks=on '--out-dir=/tmp/ruby/build/trunk/yjit/target/release/' /tmp/ruby/src/trunk/yjit/src/lib.rs I, [2024-05-26T03:15:46.410336 #3453513] INFO -- : gcc (Ubuntu 11.4.0-1ubuntu1~22.04) 11.4.0 I, [2024-05-26T03:15:46.410356 #3453513] INFO -- : Copyright (C) 2021 Free Software Foundation, Inc. I, [2024-05-26T03:15:46.410362 #3453513] INFO -- : This is free software; see the source for copying conditions. There is NO I, [2024-05-26T03:15:46.410366 #3453513] INFO -- : warranty; not even for MERCHANTABILITY or FITNESS FOR A PARTICULAR PURPOSE. I, [2024-05-26T03:15:46.410372 #3453513] INFO -- : I, [2024-05-26T03:15:46.518188 #3453513] INFO -- : builtin_binary.inc updated I, [2024-05-26T03:15:46.522660 #3453513] INFO -- : c86294a81d0df6836359a6b5498b71b1ddba3062aa6ec87c7b2896368a948a19 builtin_binary.inc I, [2024-05-26T03:15:46.523425 #3453513] INFO -- : compiling /tmp/ruby/src/trunk/builtin.c I, [2024-05-26T03:15:46.707435 #3453513] INFO -- : linking static-library libruby-static.a I, [2024-05-26T03:15:47.021046 #3453513] INFO -- : linking shared-library libruby.so.3.4.0 I, [2024-05-26T03:15:48.574400 #3453513] INFO -- : linking ruby I, [2024-05-26T03:15:48.598079 #3453513] INFO -- : $$$[end] "make ruby -j20" exit with 0. I, [2024-05-26T03:15:48.598210 #3453513] INFO -- : $$$[beg] make all -j20 I, [2024-05-26T03:15:48.657314 #3453513] INFO -- : BASERUBY = /usr/bin/ruby --disable=gems I, [2024-05-26T03:15:48.657344 #3453513] INFO -- : CC = gcc I, [2024-05-26T03:15:48.657349 #3453513] INFO -- : LD = ld I, [2024-05-26T03:15:48.657353 #3453513] INFO -- : LDSHARED = gcc -shared I, [2024-05-26T03:15:48.657357 #3453513] INFO -- : CFLAGS = -O3 -fno-fast-math -ggdb3 -Wall -Wextra -Wdeprecated-declarations -Wdiv-by-zero -Wduplicated-cond -Wimplicit-function-declaration -Wimplicit-int -Wpointer-arith -Wwrite-strings -Wold-style-definition -Wimplicit-fallthrough=0 -Wmissing-noreturn -Wno-cast-function-type -Wno-constant-logical-operand -Wno-long-long -Wno-missing-field-initializers -Wno-overlength-strings -Wno-packed-bitfield-compat -Wno-parentheses-equality -Wno-self-assign -Wno-tautological-compare -Wno-unused-parameter -Wno-unused-value -Wsuggest-attribute=format -Wsuggest-attribute=noreturn -Wunused-variable -Wmisleading-indentation -Wundef -fPIC I, [2024-05-26T03:15:48.657361 #3453513] INFO -- : XCFLAGS = -U_FORTIFY_SOURCE -D_FORTIFY_SOURCE=2 -fstack-protector-strong -fno-strict-overflow -fvisibility=hidden -fexcess-precision=standard -DRUBY_EXPORT -I. -I.ext/include/x86_64-linux -I/tmp/ruby/src/trunk/include -I/tmp/ruby/src/trunk -I/tmp/ruby/src/trunk/prism -I/tmp/ruby/src/trunk/enc/unicode/15.0.0 I, [2024-05-26T03:15:48.657365 #3453513] INFO -- : CPPFLAGS = I, [2024-05-26T03:15:48.657368 #3453513] INFO -- : DLDFLAGS = -Wl,--compress-debug-sections=zlib -Wl,-soname,libruby.so.3.4 -fstack-protector-strong I, [2024-05-26T03:15:48.657372 #3453513] INFO -- : SOLIBS = -lz -lrt -lrt -lgmp -ldl -lcrypt -lm -lpthread I, [2024-05-26T03:15:48.657380 #3453513] INFO -- : LANG = en_US.UTF-8 I, [2024-05-26T03:15:48.657383 #3453513] INFO -- : LC_ALL = I, [2024-05-26T03:15:48.657387 #3453513] INFO -- : LC_CTYPE = I, [2024-05-26T03:15:48.657390 #3453513] INFO -- : MFLAGS = -j20 --jobserver-auth=4,5 I, [2024-05-26T03:15:48.657393 #3453513] INFO -- : RUSTC = no I, [2024-05-26T03:15:48.657397 #3453513] INFO -- : YJIT_RUSTC_ARGS = --crate-name=yjit --crate-type=staticlib --edition=2021 -g -C lto=thin -C opt-level=3 -C overflow-checks=on '--out-dir=/tmp/ruby/build/trunk/yjit/target/release/' /tmp/ruby/src/trunk/yjit/src/lib.rs I, [2024-05-26T03:15:48.658759 #3453513] INFO -- : gcc (Ubuntu 11.4.0-1ubuntu1~22.04) 11.4.0 I, [2024-05-26T03:15:48.658781 #3453513] INFO -- : Copyright (C) 2021 Free Software Foundation, Inc. I, [2024-05-26T03:15:48.658790 #3453513] INFO -- : This is free software; see the source for copying conditions. There is NO I, [2024-05-26T03:15:48.658795 #3453513] INFO -- : warranty; not even for MERCHANTABILITY or FITNESS FOR A PARTICULAR PURPOSE. I, [2024-05-26T03:15:48.658798 #3453513] INFO -- : I, [2024-05-26T03:15:48.685676 #3453513] INFO -- : generating encdb.h I, [2024-05-26T03:15:48.687026 #3453513] INFO -- : generating enc.mk I, [2024-05-26T03:15:48.688752 #3453513] INFO -- : building spec/ruby/optional/capi/ext/array_spec.so I, [2024-05-26T03:15:48.689168 #3453513] INFO -- : building spec/ruby/optional/capi/ext/basic_object_spec.so I, [2024-05-26T03:15:48.689766 #3453513] INFO -- : building spec/ruby/optional/capi/ext/bignum_spec.so I, [2024-05-26T03:15:48.690388 #3453513] INFO -- : building spec/ruby/optional/capi/ext/binding_spec.so I, [2024-05-26T03:15:48.690966 #3453513] INFO -- : building spec/ruby/optional/capi/ext/boolean_spec.so I, [2024-05-26T03:15:48.691316 #3453513] INFO -- : building spec/ruby/optional/capi/ext/class_id_under_autoload_spec.so I, [2024-05-26T03:15:48.691996 #3453513] INFO -- : building spec/ruby/optional/capi/ext/class_spec.so I, [2024-05-26T03:15:48.693085 #3453513] INFO -- : building spec/ruby/optional/capi/ext/class_under_autoload_spec.so I, [2024-05-26T03:15:48.693458 #3453513] INFO -- : building spec/ruby/optional/capi/ext/complex_spec.so I, [2024-05-26T03:15:48.694133 #3453513] INFO -- : building spec/ruby/optional/capi/ext/constants_spec.so I, [2024-05-26T03:15:48.695069 #3453513] INFO -- : building spec/ruby/optional/capi/ext/data_spec.so I, [2024-05-26T03:15:48.695337 #3453513] INFO -- : building spec/ruby/optional/capi/ext/debug_spec.so I, [2024-05-26T03:15:48.695954 #3453513] INFO -- : building spec/ruby/optional/capi/ext/encoding_spec.so I, [2024-05-26T03:15:48.696229 #3453513] INFO -- : building spec/ruby/optional/capi/ext/enumerator_spec.so I, [2024-05-26T03:15:48.696945 #3453513] INFO -- : building spec/ruby/optional/capi/ext/exception_spec.so I, [2024-05-26T03:15:48.697542 #3453513] INFO -- : building spec/ruby/optional/capi/ext/fiber_spec.so I, [2024-05-26T03:15:48.697878 #3453513] INFO -- : building spec/ruby/optional/capi/ext/file_spec.so I, [2024-05-26T03:15:48.698732 #3453513] INFO -- : building spec/ruby/optional/capi/ext/fixnum_spec.so I, [2024-05-26T03:15:48.712003 #3453513] INFO -- : encdb.h unchanged I, [2024-05-26T03:15:48.713904 #3453513] INFO -- : building spec/ruby/optional/capi/ext/float_spec.so I, [2024-05-26T03:15:48.823582 #3453513] INFO -- : building spec/ruby/optional/capi/ext/gc_spec.so I, [2024-05-26T03:15:48.836271 #3453513] INFO -- : building spec/ruby/optional/capi/ext/globals_spec.so I, [2024-05-26T03:15:48.845405 #3453513] INFO -- : building spec/ruby/optional/capi/ext/hash_spec.so I, [2024-05-26T03:15:48.846242 #3453513] INFO -- : building spec/ruby/optional/capi/ext/integer_spec.so I, [2024-05-26T03:15:48.847283 #3453513] INFO -- : building spec/ruby/optional/capi/ext/io_spec.so I, [2024-05-26T03:15:48.848764 #3453513] INFO -- : building spec/ruby/optional/capi/ext/kernel_spec.so I, [2024-05-26T03:15:48.865740 #3453513] INFO -- : building spec/ruby/optional/capi/ext/language_spec.so I, [2024-05-26T03:15:48.866268 #3453513] INFO -- : building spec/ruby/optional/capi/ext/marshal_spec.so I, [2024-05-26T03:15:48.867466 #3453513] INFO -- : building spec/ruby/optional/capi/ext/module_spec.so I, [2024-05-26T03:15:48.868731 #3453513] INFO -- : building spec/ruby/optional/capi/ext/module_under_autoload_spec.so I, [2024-05-26T03:15:48.871336 #3453513] INFO -- : building spec/ruby/optional/capi/ext/mutex_spec.so I, [2024-05-26T03:15:48.871827 #3453513] INFO -- : building spec/ruby/optional/capi/ext/numeric_spec.so I, [2024-05-26T03:15:48.876646 #3453513] INFO -- : building spec/ruby/optional/capi/ext/object_spec.so I, [2024-05-26T03:15:48.877860 #3453513] INFO -- : building spec/ruby/optional/capi/ext/proc_spec.so I, [2024-05-26T03:15:48.898561 #3453513] INFO -- : building spec/ruby/optional/capi/ext/range_spec.so I, [2024-05-26T03:15:48.902324 #3453513] INFO -- : building spec/ruby/optional/capi/ext/rational_spec.so I, [2024-05-26T03:15:48.913048 #3453513] INFO -- : building spec/ruby/optional/capi/ext/rbasic_spec.so I, [2024-05-26T03:15:48.942275 #3453513] INFO -- : building spec/ruby/optional/capi/ext/regexp_spec.so I, [2024-05-26T03:15:49.007223 #3453513] INFO -- : building spec/ruby/optional/capi/ext/string_spec.so I, [2024-05-26T03:15:49.009431 #3453513] INFO -- : building spec/ruby/optional/capi/ext/struct_spec.so I, [2024-05-26T03:15:49.018053 #3453513] INFO -- : building spec/ruby/optional/capi/ext/st_spec.so I, [2024-05-26T03:15:49.021859 #3453513] INFO -- : building spec/ruby/optional/capi/ext/symbol_spec.so I, [2024-05-26T03:15:49.029773 #3453513] INFO -- : building spec/ruby/optional/capi/ext/thread_spec.so I, [2024-05-26T03:15:49.030024 #3453513] INFO -- : building spec/ruby/optional/capi/ext/time_spec.so I, [2024-05-26T03:15:49.030726 #3453513] INFO -- : building spec/ruby/optional/capi/ext/tracepoint_spec.so I, [2024-05-26T03:15:49.042264 #3453513] INFO -- : building spec/ruby/optional/capi/ext/typed_data_spec.so I, [2024-05-26T03:15:49.042722 #3453513] INFO -- : building spec/ruby/optional/capi/ext/util_spec.so I, [2024-05-26T03:15:49.051143 #3453513] INFO -- : making enc I, [2024-05-26T03:15:49.059614 #3453513] INFO -- : making srcs under enc I, [2024-05-26T03:15:49.077722 #3453513] INFO -- : make[1]: Entering directory '/tmp/ruby/build/trunk' I, [2024-05-26T03:15:49.077772 #3453513] INFO -- : make[1]: Nothing to be done for 'enc'. I, [2024-05-26T03:15:49.077778 #3453513] INFO -- : make[1]: Leaving directory '/tmp/ruby/build/trunk' I, [2024-05-26T03:15:49.106755 #3453513] INFO -- : make[1]: Entering directory '/tmp/ruby/build/trunk' I, [2024-05-26T03:15:49.106816 #3453513] INFO -- : make[1]: Nothing to be done for 'srcs'. I, [2024-05-26T03:15:49.106827 #3453513] INFO -- : make[1]: Leaving directory '/tmp/ruby/build/trunk' I, [2024-05-26T03:15:49.107437 #3453513] INFO -- : generating transdb.h I, [2024-05-26T03:15:49.204738 #3453513] INFO -- : transdb.h unchanged I, [2024-05-26T03:15:49.205769 #3453513] INFO -- : generating makefiles ext/configure-ext.mk I, [2024-05-26T03:15:49.205987 #3453513] INFO -- : making trans I, [2024-05-26T03:15:49.232337 #3453513] INFO -- : ext/configure-ext.mk updated I, [2024-05-26T03:15:49.234766 #3453513] INFO -- : make[1]: Entering directory '/tmp/ruby/build/trunk' I, [2024-05-26T03:15:49.241858 #3453513] INFO -- : make[1]: Entering directory '/tmp/ruby/build/trunk' I, [2024-05-26T03:15:49.241939 #3453513] INFO -- : make[1]: Nothing to be done for 'trans'. I, [2024-05-26T03:15:49.241951 #3453513] INFO -- : make[1]: Leaving directory '/tmp/ruby/build/trunk' I, [2024-05-26T03:15:49.242769 #3453513] INFO -- : making encs I, [2024-05-26T03:15:49.301181 #3453513] INFO -- : make[1]: Entering directory '/tmp/ruby/build/trunk' I, [2024-05-26T03:15:49.301250 #3453513] INFO -- : make[1]: Nothing to be done for 'encs'. I, [2024-05-26T03:15:49.301277 #3453513] INFO -- : make[1]: Leaving directory '/tmp/ruby/build/trunk' I, [2024-05-26T03:15:49.392852 #3453513] INFO -- : make[1]: Leaving directory '/tmp/ruby/build/trunk' I, [2024-05-26T03:15:49.393623 #3453513] INFO -- : generating makefile exts.mk I, [2024-05-26T03:15:49.431080 #3453513] INFO -- : exts.mk unchanged I, [2024-05-26T03:15:49.435786 #3453513] INFO -- : make[1]: Entering directory '/tmp/ruby/build/trunk' I, [2024-05-26T03:15:49.457591 #3453513] INFO -- : make[2]: Entering directory '/tmp/ruby/build/trunk/ext/digest' I, [2024-05-26T03:15:49.458948 #3453513] INFO -- : make[2]: Entering directory '/tmp/ruby/build/trunk/ext/coverage' I, [2024-05-26T03:15:49.459288 #3453513] INFO -- : make[2]: Entering directory '/tmp/ruby/build/trunk/ext/json' I, [2024-05-26T03:15:49.459857 #3453513] INFO -- : make[2]: Entering directory '/tmp/ruby/build/trunk/ext/date' I, [2024-05-26T03:15:49.460541 #3453513] INFO -- : make[2]: Entering directory '/tmp/ruby/build/trunk/ext/io/console' I, [2024-05-26T03:15:49.461247 #3453513] INFO -- : make[2]: Entering directory '/tmp/ruby/build/trunk/ext/monitor' I, [2024-05-26T03:15:49.461410 #3453513] INFO -- : make[2]: Entering directory '/tmp/ruby/build/trunk/ext/rubyvm' I, [2024-05-26T03:15:49.461732 #3453513] INFO -- : make[2]: Leaving directory '/tmp/ruby/build/trunk/ext/digest' I, [2024-05-26T03:15:49.461756 #3453513] INFO -- : make[2]: Entering directory '/tmp/ruby/build/trunk/ext/pathname' I, [2024-05-26T03:15:49.462209 #3453513] INFO -- : make[2]: Entering directory '/tmp/ruby/build/trunk/ext/pty' I, [2024-05-26T03:15:49.462242 #3453513] INFO -- : make[2]: Entering directory '/tmp/ruby/build/trunk/ext/fiddle' I, [2024-05-26T03:15:49.462441 #3453513] INFO -- : make[2]: Leaving directory '/tmp/ruby/build/trunk/ext/coverage' I, [2024-05-26T03:15:49.463737 #3453513] INFO -- : make[2]: Entering directory '/tmp/ruby/build/trunk/ext/objspace' I, [2024-05-26T03:15:49.463821 #3453513] INFO -- : make[2]: Leaving directory '/tmp/ruby/build/trunk/ext/date' I, [2024-05-26T03:15:49.464047 #3453513] INFO -- : make[2]: Leaving directory '/tmp/ruby/build/trunk/ext/io/console' I, [2024-05-26T03:15:49.464071 #3453513] INFO -- : make[2]: Leaving directory '/tmp/ruby/build/trunk/ext/rubyvm' I, [2024-05-26T03:15:49.464120 #3453513] INFO -- : make[2]: Entering directory '/tmp/ruby/build/trunk/ext/psych' I, [2024-05-26T03:15:49.464414 #3453513] INFO -- : make[2]: Entering directory '/tmp/ruby/build/trunk/.bundle/gems/bigdecimal-3.1.8/ext/bigdecimal' I, [2024-05-26T03:15:49.464531 #3453513] INFO -- : make[2]: Leaving directory '/tmp/ruby/build/trunk/ext/monitor' I, [2024-05-26T03:15:49.464757 #3453513] INFO -- : make[2]: Entering directory '/tmp/ruby/build/trunk/.bundle/gems/debug-1.9.2/ext/debug' I, [2024-05-26T03:15:49.465460 #3453513] INFO -- : make[2]: Leaving directory '/tmp/ruby/build/trunk/ext/pty' I, [2024-05-26T03:15:49.465542 #3453513] INFO -- : make[2]: Entering directory '/tmp/ruby/build/trunk/.bundle/gems/nkf-0.2.0/ext/nkf' I, [2024-05-26T03:15:49.466271 #3453513] INFO -- : make[2]: Entering directory '/tmp/ruby/build/trunk/.bundle/gems/racc-1.7.3/ext/racc/cparse' I, [2024-05-26T03:15:49.466304 #3453513] INFO -- : make[2]: Entering directory '/tmp/ruby/build/trunk/ext/ripper' I, [2024-05-26T03:15:49.466398 #3453513] INFO -- : make[2]: Entering directory '/tmp/ruby/build/trunk/.bundle/gems/racc-1.8.0/ext/racc/cparse' I, [2024-05-26T03:15:49.466511 #3453513] INFO -- : make[2]: Leaving directory '/tmp/ruby/build/trunk/ext/pathname' I, [2024-05-26T03:15:49.467000 #3453513] INFO -- : make[2]: Entering directory '/tmp/ruby/build/trunk/.bundle/gems/rbs-3.4.4/ext/rbs_extension' I, [2024-05-26T03:15:49.467027 #3453513] INFO -- : make[2]: Entering directory '/tmp/ruby/build/trunk/.bundle/gems/syslog-0.1.2/ext/syslog' I, [2024-05-26T03:15:49.468004 #3453513] INFO -- : make[2]: Leaving directory '/tmp/ruby/build/trunk/ext/objspace' I, [2024-05-26T03:15:49.468570 #3453513] INFO -- : make[2]: Leaving directory '/tmp/ruby/build/trunk/ext/json' I, [2024-05-26T03:15:49.470739 #3453513] INFO -- : make[2]: Leaving directory '/tmp/ruby/build/trunk/ext/fiddle' I, [2024-05-26T03:15:49.471817 #3453513] INFO -- : make[2]: Entering directory '/tmp/ruby/build/trunk/ext/socket' I, [2024-05-26T03:15:49.473790 #3453513] INFO -- : make[2]: Entering directory '/tmp/ruby/build/trunk/ext/digest/sha2' I, [2024-05-26T03:15:49.474383 #3453513] INFO -- : make[2]: Entering directory '/tmp/ruby/build/trunk/ext/openssl' I, [2024-05-26T03:15:49.476592 #3453513] INFO -- : make[2]: Leaving directory '/tmp/ruby/build/trunk/ext/digest/sha2' I, [2024-05-26T03:15:49.476797 #3453513] INFO -- : make[2]: Leaving directory '/tmp/ruby/build/trunk/ext/ripper' I, [2024-05-26T03:15:49.478948 #3453513] INFO -- : make[2]: Leaving directory '/tmp/ruby/build/trunk/ext/socket' I, [2024-05-26T03:15:49.486162 #3453513] INFO -- : make[2]: Leaving directory '/tmp/ruby/build/trunk/ext/openssl' I, [2024-05-26T03:15:49.487914 #3453513] INFO -- : make[2]: Leaving directory '/tmp/ruby/build/trunk/.bundle/gems/debug-1.9.2/ext/debug' I, [2024-05-26T03:15:49.488645 #3453513] INFO -- : make[2]: Leaving directory '/tmp/ruby/build/trunk/.bundle/gems/racc-1.7.3/ext/racc/cparse' I, [2024-05-26T03:15:49.488885 #3453513] INFO -- : make[2]: Leaving directory '/tmp/ruby/build/trunk/ext/psych' I, [2024-05-26T03:15:49.489244 #3453513] INFO -- : make[2]: Leaving directory '/tmp/ruby/build/trunk/.bundle/gems/rbs-3.4.4/ext/rbs_extension' I, [2024-05-26T03:15:49.489648 #3453513] INFO -- : make[2]: Leaving directory '/tmp/ruby/build/trunk/.bundle/gems/syslog-0.1.2/ext/syslog' I, [2024-05-26T03:15:49.492651 #3453513] INFO -- : make[2]: Leaving directory '/tmp/ruby/build/trunk/.bundle/gems/bigdecimal-3.1.8/ext/bigdecimal' I, [2024-05-26T03:15:49.497907 #3453513] INFO -- : make[2]: Leaving directory '/tmp/ruby/build/trunk/.bundle/gems/nkf-0.2.0/ext/nkf' I, [2024-05-26T03:15:49.499091 #3453513] INFO -- : make[2]: Leaving directory '/tmp/ruby/build/trunk/.bundle/gems/racc-1.8.0/ext/racc/cparse' I, [2024-05-26T03:15:49.522823 #3453513] INFO -- : make[2]: Entering directory '/tmp/ruby/build/trunk' I, [2024-05-26T03:15:49.590041 #3453513] INFO -- : linking ruby I, [2024-05-26T03:15:49.612296 #3453513] INFO -- : make[2]: Leaving directory '/tmp/ruby/build/trunk' I, [2024-05-26T03:15:49.612885 #3453513] INFO -- : make[1]: Leaving directory '/tmp/ruby/build/trunk' I, [2024-05-26T03:15:49.616998 #3453513] INFO -- : make[1]: Entering directory '/tmp/ruby/build/trunk' I, [2024-05-26T03:15:49.617021 #3453513] INFO -- : make[1]: Nothing to be done for 'note'. I, [2024-05-26T03:15:49.617027 #3453513] INFO -- : make[1]: Leaving directory '/tmp/ruby/build/trunk' I, [2024-05-26T03:15:49.617812 #3453513] INFO -- : $$$[end] "make all -j20" exit with 0. I, [2024-05-26T03:15:49.617993 #3453513] INFO -- : $$$[beg] make install -j20 I, [2024-05-26T03:15:49.685501 #3453513] INFO -- : Update power_assert to 84e85124c5014a139af39161d484156cfe87a9ed I, [2024-05-26T03:15:49.685797 #3453513] INFO -- : Update rbs to ba7872795d5de04adb8ff500c0e6afdc81a041dd I, [2024-05-26T03:15:49.686532 #3453513] INFO -- : Update typeprof to b19a6416da3a05d57fadd6ffdadb382b6d236ca5 I, [2024-05-26T03:15:49.687185 #3453513] INFO -- : echo 84e85124c5014a139af39161d484156cfe87a9ed | /bin/sh /tmp/ruby/src/trunk/tool/ifchange /tmp/ruby/src/trunk/.bundle/.timestamp/power_assert.revision - I, [2024-05-26T03:15:49.687220 #3453513] INFO -- : echo ba7872795d5de04adb8ff500c0e6afdc81a041dd | /bin/sh /tmp/ruby/src/trunk/tool/ifchange /tmp/ruby/src/trunk/.bundle/.timestamp/rbs.revision - I, [2024-05-26T03:15:49.687685 #3453513] INFO -- : BASERUBY = /usr/bin/ruby --disable=gems I, [2024-05-26T03:15:49.687729 #3453513] INFO -- : CC = gcc I, [2024-05-26T03:15:49.687745 #3453513] INFO -- : LD = ld I, [2024-05-26T03:15:49.687758 #3453513] INFO -- : LDSHARED = gcc -shared I, [2024-05-26T03:15:49.687772 #3453513] INFO -- : CFLAGS = -O3 -fno-fast-math -ggdb3 -Wall -Wextra -Wdeprecated-declarations -Wdiv-by-zero -Wduplicated-cond -Wimplicit-function-declaration -Wimplicit-int -Wpointer-arith -Wwrite-strings -Wold-style-definition -Wimplicit-fallthrough=0 -Wmissing-noreturn -Wno-cast-function-type -Wno-constant-logical-operand -Wno-long-long -Wno-missing-field-initializers -Wno-overlength-strings -Wno-packed-bitfield-compat -Wno-parentheses-equality -Wno-self-assign -Wno-tautological-compare -Wno-unused-parameter -Wno-unused-value -Wsuggest-attribute=format -Wsuggest-attribute=noreturn -Wunused-variable -Wmisleading-indentation -Wundef -fPIC I, [2024-05-26T03:15:49.687787 #3453513] INFO -- : XCFLAGS = -U_FORTIFY_SOURCE -D_FORTIFY_SOURCE=2 -fstack-protector-strong -fno-strict-overflow -fvisibility=hidden -fexcess-precision=standard -DRUBY_EXPORT -I. -I.ext/include/x86_64-linux -I/tmp/ruby/src/trunk/include -I/tmp/ruby/src/trunk -I/tmp/ruby/src/trunk/prism -I/tmp/ruby/src/trunk/enc/unicode/15.0.0 I, [2024-05-26T03:15:49.687802 #3453513] INFO -- : CPPFLAGS = I, [2024-05-26T03:15:49.687816 #3453513] INFO -- : DLDFLAGS = -Wl,--compress-debug-sections=zlib -Wl,-soname,libruby.so.3.4 -fstack-protector-strong I, [2024-05-26T03:15:49.687833 #3453513] INFO -- : SOLIBS = -lz -lrt -lrt -lgmp -ldl -lcrypt -lm -lpthread I, [2024-05-26T03:15:49.687847 #3453513] INFO -- : LANG = en_US.UTF-8 I, [2024-05-26T03:15:49.687860 #3453513] INFO -- : LC_ALL = I, [2024-05-26T03:15:49.687874 #3453513] INFO -- : LC_CTYPE = I, [2024-05-26T03:15:49.687888 #3453513] INFO -- : MFLAGS = -j20 --jobserver-auth=4,5 I, [2024-05-26T03:15:49.687902 #3453513] INFO -- : RUSTC = no I, [2024-05-26T03:15:49.687916 #3453513] INFO -- : YJIT_RUSTC_ARGS = --crate-name=yjit --crate-type=staticlib --edition=2021 -g -C lto=thin -C opt-level=3 -C overflow-checks=on '--out-dir=/tmp/ruby/build/trunk/yjit/target/release/' /tmp/ruby/src/trunk/yjit/src/lib.rs I, [2024-05-26T03:15:49.689182 #3453513] INFO -- : /tmp/ruby/src/trunk/.bundle/.timestamp/power_assert.revision unchanged I, [2024-05-26T03:15:49.689415 #3453513] INFO -- : /tmp/ruby/src/trunk/.bundle/.timestamp/rbs.revision unchanged I, [2024-05-26T03:15:49.715046 #3453513] INFO -- : echo b19a6416da3a05d57fadd6ffdadb382b6d236ca5 | /bin/sh /tmp/ruby/src/trunk/tool/ifchange /tmp/ruby/src/trunk/.bundle/.timestamp/typeprof.revision - I, [2024-05-26T03:15:49.715769 #3453513] INFO -- : generating encdb.h I, [2024-05-26T03:15:49.715799 #3453513] INFO -- : gcc (Ubuntu 11.4.0-1ubuntu1~22.04) 11.4.0 I, [2024-05-26T03:15:49.715812 #3453513] INFO -- : Copyright (C) 2021 Free Software Foundation, Inc. I, [2024-05-26T03:15:49.715822 #3453513] INFO -- : This is free software; see the source for copying conditions. There is NO I, [2024-05-26T03:15:49.715832 #3453513] INFO -- : warranty; not even for MERCHANTABILITY or FITNESS FOR A PARTICULAR PURPOSE. I, [2024-05-26T03:15:49.715842 #3453513] INFO -- : I, [2024-05-26T03:15:49.716485 #3453513] INFO -- : generating enc.mk I, [2024-05-26T03:15:49.717233 #3453513] INFO -- : /tmp/ruby/src/trunk/.bundle/.timestamp/typeprof.revision unchanged I, [2024-05-26T03:15:49.739840 #3453513] INFO -- : encdb.h unchanged I, [2024-05-26T03:15:49.741327 #3453513] INFO -- : Building power_assert@84e85124c5014a139af39161d484156cfe87a9ed to /tmp/ruby/src/trunk/gems/power_assert-2.0.3.gem I, [2024-05-26T03:15:49.810275 #3453513] INFO -- : Successfully built RubyGem I, [2024-05-26T03:15:49.810323 #3453513] INFO -- : Name: power_assert I, [2024-05-26T03:15:49.810336 #3453513] INFO -- : Version: 2.0.4dev I, [2024-05-26T03:15:49.810347 #3453513] INFO -- : File: power_assert-2.0.4dev.gem I, [2024-05-26T03:15:49.812105 #3453513] INFO -- : Extracting bundle gem power_assert-2.0.3... I, [2024-05-26T03:15:49.837091 #3453513] INFO -- : making srcs under enc I, [2024-05-26T03:15:49.837365 #3453513] INFO -- : making enc I, [2024-05-26T03:15:49.855491 #3453513] INFO -- : make[1]: Entering directory '/tmp/ruby/build/trunk' I, [2024-05-26T03:15:49.855546 #3453513] INFO -- : make[1]: Nothing to be done for 'enc'. I, [2024-05-26T03:15:49.855560 #3453513] INFO -- : make[1]: Leaving directory '/tmp/ruby/build/trunk' I, [2024-05-26T03:15:49.867410 #3453513] INFO -- : make[1]: Entering directory '/tmp/ruby/build/trunk' I, [2024-05-26T03:15:49.867469 #3453513] INFO -- : make[1]: Nothing to be done for 'srcs'. I, [2024-05-26T03:15:49.867482 #3453513] INFO -- : make[1]: Leaving directory '/tmp/ruby/build/trunk' I, [2024-05-26T03:15:49.868112 #3453513] INFO -- : generating transdb.h I, [2024-05-26T03:15:49.874395 #3453513] INFO -- : Try with hash version of bundled gems instead of gems/power_assert-2.0.3.gem. We don't use this gem with release version of Ruby. I, [2024-05-26T03:15:49.879425 #3453513] INFO -- : Unpacked gems/power_assert-2.0.4dev.gem I, [2024-05-26T03:15:49.966164 #3453513] INFO -- : transdb.h unchanged I, [2024-05-26T03:15:49.967713 #3453513] INFO -- : generating makefiles ext/configure-ext.mk I, [2024-05-26T03:15:49.967815 #3453513] INFO -- : making trans I, [2024-05-26T03:15:49.994734 #3453513] INFO -- : ext/configure-ext.mk unchanged I, [2024-05-26T03:15:49.996911 #3453513] INFO -- : make[1]: Entering directory '/tmp/ruby/build/trunk' I, [2024-05-26T03:15:50.003819 #3453513] INFO -- : make[1]: Entering directory '/tmp/ruby/build/trunk' I, [2024-05-26T03:15:50.003913 #3453513] INFO -- : make[1]: Nothing to be done for 'trans'. I, [2024-05-26T03:15:50.003946 #3453513] INFO -- : make[1]: Leaving directory '/tmp/ruby/build/trunk' I, [2024-05-26T03:15:50.065314 #3453513] INFO -- : making encs I, [2024-05-26T03:15:50.128204 #3453513] INFO -- : make[1]: Entering directory '/tmp/ruby/build/trunk' I, [2024-05-26T03:15:50.128266 #3453513] INFO -- : make[1]: Nothing to be done for 'encs'. I, [2024-05-26T03:15:50.128283 #3453513] INFO -- : make[1]: Leaving directory '/tmp/ruby/build/trunk' I, [2024-05-26T03:15:50.147684 #3453513] INFO -- : make[1]: Leaving directory '/tmp/ruby/build/trunk' I, [2024-05-26T03:15:50.148477 #3453513] INFO -- : generating makefile exts.mk I, [2024-05-26T03:15:50.185402 #3453513] INFO -- : exts.mk unchanged I, [2024-05-26T03:15:50.190397 #3453513] INFO -- : make[1]: Entering directory '/tmp/ruby/build/trunk' I, [2024-05-26T03:15:50.208576 #3453513] INFO -- : make[2]: Entering directory '/tmp/ruby/build/trunk/ext/digest' I, [2024-05-26T03:15:50.210232 #3453513] INFO -- : make[2]: Entering directory '/tmp/ruby/build/trunk/ext/json' I, [2024-05-26T03:15:50.210263 #3453513] INFO -- : make[2]: Entering directory '/tmp/ruby/build/trunk/ext/coverage' I, [2024-05-26T03:15:50.210892 #3453513] INFO -- : make[2]: Entering directory '/tmp/ruby/build/trunk/ext/io/console' I, [2024-05-26T03:15:50.210983 #3453513] INFO -- : make[2]: Entering directory '/tmp/ruby/build/trunk/ext/date' I, [2024-05-26T03:15:50.211941 #3453513] INFO -- : make[2]: Entering directory '/tmp/ruby/build/trunk/ext/monitor' I, [2024-05-26T03:15:50.212580 #3453513] INFO -- : make[2]: Leaving directory '/tmp/ruby/build/trunk/ext/digest' I, [2024-05-26T03:15:50.212744 #3453513] INFO -- : make[2]: Entering directory '/tmp/ruby/build/trunk/ext/rubyvm' I, [2024-05-26T03:15:50.213153 #3453513] INFO -- : make[2]: Entering directory '/tmp/ruby/build/trunk/ext/pathname' I, [2024-05-26T03:15:50.213278 #3453513] INFO -- : make[2]: Leaving directory '/tmp/ruby/build/trunk/ext/coverage' I, [2024-05-26T03:15:50.213492 #3453513] INFO -- : make[2]: Entering directory '/tmp/ruby/build/trunk/ext/fiddle' I, [2024-05-26T03:15:50.213630 #3453513] INFO -- : make[2]: Leaving directory '/tmp/ruby/build/trunk/ext/io/console' I, [2024-05-26T03:15:50.213650 #3453513] INFO -- : make[2]: Entering directory '/tmp/ruby/build/trunk/ext/pty' I, [2024-05-26T03:15:50.214839 #3453513] INFO -- : make[2]: Entering directory '/tmp/ruby/build/trunk/ext/objspace' I, [2024-05-26T03:15:50.215110 #3453513] INFO -- : make[2]: Leaving directory '/tmp/ruby/build/trunk/ext/monitor' I, [2024-05-26T03:15:50.215279 #3453513] INFO -- : make[2]: Leaving directory '/tmp/ruby/build/trunk/ext/date' I, [2024-05-26T03:15:50.215310 #3453513] INFO -- : make[2]: Leaving directory '/tmp/ruby/build/trunk/ext/rubyvm' I, [2024-05-26T03:15:50.215367 #3453513] INFO -- : make[2]: Entering directory '/tmp/ruby/build/trunk/ext/psych' I, [2024-05-26T03:15:50.215784 #3453513] INFO -- : make[2]: Leaving directory '/tmp/ruby/build/trunk/ext/pathname' I, [2024-05-26T03:15:50.215827 #3453513] INFO -- : make[2]: Leaving directory '/tmp/ruby/build/trunk/ext/json' I, [2024-05-26T03:15:50.215947 #3453513] INFO -- : make[2]: Leaving directory '/tmp/ruby/build/trunk/ext/pty' I, [2024-05-26T03:15:50.217420 #3453513] INFO -- : make[2]: Entering directory '/tmp/ruby/build/trunk/.bundle/gems/bigdecimal-3.1.8/ext/bigdecimal' I, [2024-05-26T03:15:50.217469 #3453513] INFO -- : make[2]: Entering directory '/tmp/ruby/build/trunk/.bundle/gems/nkf-0.2.0/ext/nkf' I, [2024-05-26T03:15:50.217621 #3453513] INFO -- : make[2]: Entering directory '/tmp/ruby/build/trunk/.bundle/gems/debug-1.9.2/ext/debug' I, [2024-05-26T03:15:50.217927 #3453513] INFO -- : make[2]: Entering directory '/tmp/ruby/build/trunk/.bundle/gems/racc-1.7.3/ext/racc/cparse' I, [2024-05-26T03:15:50.218060 #3453513] INFO -- : make[2]: Entering directory '/tmp/ruby/build/trunk/.bundle/gems/racc-1.8.0/ext/racc/cparse' I, [2024-05-26T03:15:50.218527 #3453513] INFO -- : make[2]: Entering directory '/tmp/ruby/build/trunk/.bundle/gems/syslog-0.1.2/ext/syslog' I, [2024-05-26T03:15:50.218557 #3453513] INFO -- : make[2]: Entering directory '/tmp/ruby/build/trunk/.bundle/gems/rbs-3.4.4/ext/rbs_extension' I, [2024-05-26T03:15:50.218674 #3453513] INFO -- : make[2]: Leaving directory '/tmp/ruby/build/trunk/ext/objspace' I, [2024-05-26T03:15:50.218875 #3453513] INFO -- : make[2]: Entering directory '/tmp/ruby/build/trunk/ext/ripper' I, [2024-05-26T03:15:50.219665 #3453513] INFO -- : make[2]: Leaving directory '/tmp/ruby/build/trunk/ext/fiddle' I, [2024-05-26T03:15:50.221258 #3453513] INFO -- : make[2]: Entering directory '/tmp/ruby/build/trunk/ext/digest/sha2' I, [2024-05-26T03:15:50.223455 #3453513] INFO -- : make[2]: Leaving directory '/tmp/ruby/build/trunk/ext/digest/sha2' I, [2024-05-26T03:15:50.223985 #3453513] INFO -- : make[2]: Entering directory '/tmp/ruby/build/trunk/ext/socket' I, [2024-05-26T03:15:50.225454 #3453513] INFO -- : make[2]: Leaving directory '/tmp/ruby/build/trunk/ext/ripper' I, [2024-05-26T03:15:50.226945 #3453513] INFO -- : make[2]: Entering directory '/tmp/ruby/build/trunk/ext/openssl' I, [2024-05-26T03:15:50.228033 #3453513] INFO -- : make[2]: Leaving directory '/tmp/ruby/build/trunk/ext/psych' I, [2024-05-26T03:15:50.229762 #3453513] INFO -- : make[2]: Leaving directory '/tmp/ruby/build/trunk/ext/socket' I, [2024-05-26T03:15:50.238286 #3453513] INFO -- : make[2]: Leaving directory '/tmp/ruby/build/trunk/ext/openssl' I, [2024-05-26T03:15:50.241660 #3453513] INFO -- : make[2]: Leaving directory '/tmp/ruby/build/trunk/.bundle/gems/syslog-0.1.2/ext/syslog' I, [2024-05-26T03:15:50.241718 #3453513] INFO -- : make[2]: Leaving directory '/tmp/ruby/build/trunk/.bundle/gems/racc-1.8.0/ext/racc/cparse' I, [2024-05-26T03:15:50.241949 #3453513] INFO -- : make[2]: Leaving directory '/tmp/ruby/build/trunk/.bundle/gems/nkf-0.2.0/ext/nkf' I, [2024-05-26T03:15:50.242121 #3453513] INFO -- : make[2]: Leaving directory '/tmp/ruby/build/trunk/.bundle/gems/racc-1.7.3/ext/racc/cparse' I, [2024-05-26T03:15:50.249830 #3453513] INFO -- : make[2]: Leaving directory '/tmp/ruby/build/trunk/.bundle/gems/rbs-3.4.4/ext/rbs_extension' I, [2024-05-26T03:15:50.250640 #3453513] INFO -- : make[2]: Leaving directory '/tmp/ruby/build/trunk/.bundle/gems/debug-1.9.2/ext/debug' I, [2024-05-26T03:15:50.250943 #3453513] INFO -- : make[2]: Leaving directory '/tmp/ruby/build/trunk/.bundle/gems/bigdecimal-3.1.8/ext/bigdecimal' I, [2024-05-26T03:15:50.275942 #3453513] INFO -- : make[2]: Entering directory '/tmp/ruby/build/trunk' I, [2024-05-26T03:15:50.344294 #3453513] INFO -- : make[2]: 'ruby' is up to date. I, [2024-05-26T03:15:50.344334 #3453513] INFO -- : make[2]: Leaving directory '/tmp/ruby/build/trunk' I, [2024-05-26T03:15:50.344654 #3453513] INFO -- : make[1]: Leaving directory '/tmp/ruby/build/trunk' I, [2024-05-26T03:15:50.349251 #3453513] INFO -- : make[1]: Entering directory '/tmp/ruby/build/trunk' I, [2024-05-26T03:15:50.349287 #3453513] INFO -- : make[1]: Nothing to be done for 'note'. I, [2024-05-26T03:15:50.349295 #3453513] INFO -- : make[1]: Leaving directory '/tmp/ruby/build/trunk' I, [2024-05-26T03:15:50.349691 #3453513] INFO -- : ./miniruby -I/tmp/ruby/src/trunk/lib -I. -I.ext/common /tmp/ruby/src/trunk/tool/runruby.rb --extout=.ext -- --disable-gems -r./x86_64-linux-fake /tmp/ruby/src/trunk/tool/rbinstall.rb --make="make" --dest-dir="" --extout=".ext" --ext-build-dir="./ext" --mflags="-j20 --jobserver-auth=4,5" --make-flags=" -j20 --jobserver-auth=4,5" --data-mode=0644 --prog-mode=0755 --installed-list .installed.list --mantype="doc" --gnumake --install=all --exclude=doc I, [2024-05-26T03:15:50.448340 #3453513] INFO -- : Installing to I, [2024-05-26T03:15:50.448409 #3453513] INFO -- : installing binary commands: /tmp/ruby/install/trunk/bin I, [2024-05-26T03:15:50.448504 #3453513] INFO -- : installing base libraries: /tmp/ruby/install/trunk/lib I, [2024-05-26T03:15:50.455678 #3453513] INFO -- : installing arch files: /tmp/ruby/install/trunk/lib/ruby/3.4.0+0/x86_64-linux I, [2024-05-26T03:15:50.455711 #3453513] INFO -- : installing pkgconfig data: /tmp/ruby/install/trunk/lib/pkgconfig I, [2024-05-26T03:15:50.455718 #3453513] INFO -- : installing extension objects: /tmp/ruby/install/trunk/lib/ruby/3.4.0+0/x86_64-linux I, [2024-05-26T03:15:50.465260 #3453513] INFO -- : installing extension objects: /tmp/ruby/install/trunk/lib/ruby/site_ruby/3.4.0+0/x86_64-linux I, [2024-05-26T03:15:50.465283 #3453513] INFO -- : installing extension objects: /tmp/ruby/install/trunk/lib/ruby/vendor_ruby/3.4.0+0/x86_64-linux I, [2024-05-26T03:15:50.465290 #3453513] INFO -- : installing extension headers: /tmp/ruby/install/trunk/include/ruby-3.4.0+0/x86_64-linux I, [2024-05-26T03:15:50.465444 #3453513] INFO -- : installing extension scripts: /tmp/ruby/install/trunk/lib/ruby/3.4.0+0 I, [2024-05-26T03:15:50.468202 #3453513] INFO -- : installing extension scripts: /tmp/ruby/install/trunk/lib/ruby/site_ruby/3.4.0+0 I, [2024-05-26T03:15:50.468236 #3453513] INFO -- : installing extension scripts: /tmp/ruby/install/trunk/lib/ruby/vendor_ruby/3.4.0+0 I, [2024-05-26T03:15:50.468242 #3453513] INFO -- : installing extension headers: /tmp/ruby/install/trunk/include/ruby-3.4.0+0/ruby I, [2024-05-26T03:15:50.468246 #3453513] INFO -- : installing command scripts: /tmp/ruby/install/trunk/bin I, [2024-05-26T03:15:50.468251 #3453513] INFO -- : installing library scripts: /tmp/ruby/install/trunk/lib/ruby/3.4.0+0 I, [2024-05-26T03:15:50.500731 #3453513] INFO -- : installing common headers: /tmp/ruby/install/trunk/include/ruby-3.4.0+0 I, [2024-05-26T03:15:50.507131 #3453513] INFO -- : installing manpages: /tmp/ruby/install/trunk/share/man/man1 I, [2024-05-26T03:15:50.507158 #3453513] INFO -- : installing default gems from lib: /tmp/ruby/install/trunk/lib/ruby/gems/3.4.0+0 I, [2024-05-26T03:15:50.529988 #3453513] INFO -- : benchmark 0.3.0 I, [2024-05-26T03:15:50.531930 #3453513] INFO -- : bundler 2.6.0.dev I, [2024-05-26T03:15:50.534054 #3453513] INFO -- : cgi 0.4.1 I, [2024-05-26T03:15:50.534611 #3453513] INFO -- : delegate 0.3.1 I, [2024-05-26T03:15:50.535090 #3453513] INFO -- : did_you_mean 1.6.3 I, [2024-05-26T03:15:50.535566 #3453513] INFO -- : english 0.8.0 I, [2024-05-26T03:15:50.536084 #3453513] INFO -- : erb 4.0.4 I, [2024-05-26T03:15:50.537075 #3453513] INFO -- : error_highlight 0.6.0 I, [2024-05-26T03:15:50.537899 #3453513] INFO -- : fileutils 1.7.2 I, [2024-05-26T03:15:50.538742 #3453513] INFO -- : find 0.2.0 I, [2024-05-26T03:15:50.539433 #3453513] INFO -- : forwardable 1.3.3 I, [2024-05-26T03:15:50.540531 #3453513] INFO -- : ipaddr 1.2.6 I, [2024-05-26T03:15:50.541144 #3453513] INFO -- : irb 1.13.1 I, [2024-05-26T03:15:50.541920 #3453513] INFO -- : logger 1.6.0 I, [2024-05-26T03:15:50.542413 #3453513] INFO -- : net-http 0.4.1 I, [2024-05-26T03:15:50.542930 #3453513] INFO -- : net-protocol 0.2.2 I, [2024-05-26T03:15:50.543406 #3453513] INFO -- : open-uri 0.4.1 I, [2024-05-26T03:15:50.543933 #3453513] INFO -- : open3 0.2.1 I, [2024-05-26T03:15:50.544344 #3453513] INFO -- : optparse 0.5.0 I, [2024-05-26T03:15:50.544904 #3453513] INFO -- : ostruct 0.6.0 I, [2024-05-26T03:15:50.545264 #3453513] INFO -- : pp 0.5.0 I, [2024-05-26T03:15:50.545789 #3453513] INFO -- : prettyprint 0.2.0 I, [2024-05-26T03:15:50.546256 #3453513] INFO -- : prism 0.29.0 I, [2024-05-26T03:15:50.546828 #3453513] INFO -- : pstore 0.1.3 I, [2024-05-26T03:15:50.547322 #3453513] INFO -- : rdoc 6.7.0 I, [2024-05-26T03:15:50.548302 #3453513] INFO -- : readline 0.0.4 I, [2024-05-26T03:15:50.548851 #3453513] INFO -- : reline 0.5.7 I, [2024-05-26T03:15:50.549370 #3453513] INFO -- : resolv 0.4.0 I, [2024-05-26T03:15:50.549840 #3453513] INFO -- : ruby2_keywords 0.0.5 I, [2024-05-26T03:15:50.550280 #3453513] INFO -- : securerandom 0.3.1 I, [2024-05-26T03:15:50.551269 #3453513] INFO -- : set 1.1.0 I, [2024-05-26T03:15:50.552069 #3453513] INFO -- : shellwords 0.2.0 I, [2024-05-26T03:15:50.552594 #3453513] INFO -- : singleton 0.2.0 I, [2024-05-26T03:15:50.553052 #3453513] INFO -- : syntax_suggest 2.0.0 I, [2024-05-26T03:15:50.553747 #3453513] INFO -- : tempfile 0.2.1 I, [2024-05-26T03:15:50.554223 #3453513] INFO -- : time 0.3.0 I, [2024-05-26T03:15:50.554714 #3453513] INFO -- : timeout 0.4.1 I, [2024-05-26T03:15:50.555161 #3453513] INFO -- : tmpdir 0.2.0 I, [2024-05-26T03:15:50.555566 #3453513] INFO -- : tsort 0.2.0 I, [2024-05-26T03:15:50.556186 #3453513] INFO -- : un 0.3.0 I, [2024-05-26T03:15:50.556648 #3453513] INFO -- : uri 0.13.0 I, [2024-05-26T03:15:50.557159 #3453513] INFO -- : weakref 0.1.3 I, [2024-05-26T03:15:50.557567 #3453513] INFO -- : yaml 0.3.0 I, [2024-05-26T03:15:50.558009 #3453513] INFO -- : installing default gems from ext: /tmp/ruby/install/trunk/lib/ruby/gems/3.4.0+0 I, [2024-05-26T03:15:50.564518 #3453513] INFO -- : date 3.3.4 I, [2024-05-26T03:15:50.565053 #3453513] INFO -- : digest 3.1.1 I, [2024-05-26T03:15:50.565533 #3453513] INFO -- : etc 1.4.3 I, [2024-05-26T03:15:50.565985 #3453513] INFO -- : fcntl 1.1.0 I, [2024-05-26T03:15:50.566529 #3453513] INFO -- : fiddle 1.1.3 I, [2024-05-26T03:15:50.567004 #3453513] INFO -- : io-console 0.7.2 I, [2024-05-26T03:15:50.567491 #3453513] INFO -- : io-nonblock 0.3.0 I, [2024-05-26T03:15:50.567926 #3453513] INFO -- : io-wait 0.3.1 I, [2024-05-26T03:15:50.568492 #3453513] INFO -- : json 2.7.2 I, [2024-05-26T03:15:50.569039 #3453513] INFO -- : openssl 3.2.0 I, [2024-05-26T03:15:50.569532 #3453513] INFO -- : pathname 0.3.0 I, [2024-05-26T03:15:50.570012 #3453513] INFO -- : psych 5.1.2 I, [2024-05-26T03:15:50.570570 #3453513] INFO -- : stringio 3.1.1 I, [2024-05-26T03:15:50.571058 #3453513] INFO -- : strscan 3.1.1 I, [2024-05-26T03:15:50.571528 #3453513] INFO -- : zlib 3.1.0 I, [2024-05-26T03:15:50.571943 #3453513] INFO -- : installing bundled gems: /tmp/ruby/install/trunk/lib/ruby/gems/3.4.0+0 I, [2024-05-26T03:15:50.572520 #3453513] INFO -- : minitest 5.23.1 I, [2024-05-26T03:15:50.581243 #3453513] INFO -- : rake 13.2.1 I, [2024-05-26T03:15:50.584686 #3453513] INFO -- : test-unit 3.6.2 I, [2024-05-26T03:15:50.589575 #3453513] INFO -- : rexml 3.2.8 I, [2024-05-26T03:15:50.593386 #3453513] INFO -- : rss 0.3.0 I, [2024-05-26T03:15:50.596064 #3453513] INFO -- : net-ftp 0.3.4 I, [2024-05-26T03:15:50.597679 #3453513] INFO -- : net-imap 0.4.11 I, [2024-05-26T03:15:50.601406 #3453513] INFO -- : net-pop 0.1.2 I, [2024-05-26T03:15:50.602407 #3453513] INFO -- : net-smtp 0.5.0 I, [2024-05-26T03:15:50.603563 #3453513] INFO -- : matrix 0.4.2 I, [2024-05-26T03:15:50.607035 #3453513] INFO -- : prime 0.1.2 I, [2024-05-26T03:15:50.611701 #3453513] INFO -- : rbs 3.4.4 I, [2024-05-26T03:15:50.634003 #3453513] INFO -- : typeprof 0.21.11 I, [2024-05-26T03:15:50.636797 #3453513] INFO -- : debug 1.9.2 I, [2024-05-26T03:15:50.640056 #3453513] INFO -- : racc 1.8.0 I, [2024-05-26T03:15:50.642757 #3453513] INFO -- : mutex_m 0.2.0 I, [2024-05-26T03:15:50.644300 #3453513] INFO -- : getoptlong 0.2.1 I, [2024-05-26T03:15:50.645681 #3453513] INFO -- : base64 0.2.0 I, [2024-05-26T03:15:50.646787 #3453513] INFO -- : bigdecimal 3.1.8 I, [2024-05-26T03:15:50.649358 #3453513] INFO -- : observer 0.1.2 I, [2024-05-26T03:15:50.650528 #3453513] INFO -- : abbrev 0.1.2 I, [2024-05-26T03:15:50.651920 #3453513] INFO -- : resolv-replace 0.1.1 I, [2024-05-26T03:15:50.653279 #3453513] INFO -- : rinda 0.2.0 I, [2024-05-26T03:15:50.654633 #3453513] INFO -- : drb 2.2.1 I, [2024-05-26T03:15:50.656237 #3453513] INFO -- : nkf 0.2.0 I, [2024-05-26T03:15:50.658693 #3453513] INFO -- : syslog 0.1.2 I, [2024-05-26T03:15:50.661017 #3453513] INFO -- : csv 3.3.0 I, [2024-05-26T03:15:50.663459 #3453513] INFO -- : installing bundled gem cache: /tmp/ruby/install/trunk/lib/ruby/gems/3.4.0+0/cache I, [2024-05-26T03:15:50.664875 #3453513] INFO -- : skipped bundled gems: I, [2024-05-26T03:15:50.664904 #3453513] INFO -- : power_assert-2.0.4dev.gem not found in bundled_gems I, [2024-05-26T03:15:50.667866 #3453513] INFO -- : $$$[end] "make install -j20" exit with 0. I, [2024-05-26T03:15:50.667983 #3453513] INFO -- : $$$[beg] make yes-btest TESTOPTS='-q -j20' I, [2024-05-26T03:15:56.199655 #3453513] INFO -- : PASS all 1936 tests E, [2024-05-26T03:15:56.204873 #3453513] ERROR -- : I, [2024-05-26T03:15:56.205181 #3453513] INFO -- : $$$[end] "make yes-btest TESTOPTS='-q -j20'" exit with 0. I, [2024-05-26T03:15:56.205267 #3453513] INFO -- : $$$[beg] make yes-test-basic TESTS='-j20' I, [2024-05-26T03:15:56.265411 #3453513] INFO -- : BASERUBY = /usr/bin/ruby --disable=gems I, [2024-05-26T03:15:56.265459 #3453513] INFO -- : CC = gcc I, [2024-05-26T03:15:56.265473 #3453513] INFO -- : LD = ld I, [2024-05-26T03:15:56.265485 #3453513] INFO -- : LDSHARED = gcc -shared I, [2024-05-26T03:15:56.265501 #3453513] INFO -- : CFLAGS = -O3 -fno-fast-math -ggdb3 -Wall -Wextra -Wdeprecated-declarations -Wdiv-by-zero -Wduplicated-cond -Wimplicit-function-declaration -Wimplicit-int -Wpointer-arith -Wwrite-strings -Wold-style-definition -Wimplicit-fallthrough=0 -Wmissing-noreturn -Wno-cast-function-type -Wno-constant-logical-operand -Wno-long-long -Wno-missing-field-initializers -Wno-overlength-strings -Wno-packed-bitfield-compat -Wno-parentheses-equality -Wno-self-assign -Wno-tautological-compare -Wno-unused-parameter -Wno-unused-value -Wsuggest-attribute=format -Wsuggest-attribute=noreturn -Wunused-variable -Wmisleading-indentation -Wundef -fPIC I, [2024-05-26T03:15:56.265513 #3453513] INFO -- : XCFLAGS = -U_FORTIFY_SOURCE -D_FORTIFY_SOURCE=2 -fstack-protector-strong -fno-strict-overflow -fvisibility=hidden -fexcess-precision=standard -DRUBY_EXPORT -I. -I.ext/include/x86_64-linux -I/tmp/ruby/src/trunk/include -I/tmp/ruby/src/trunk -I/tmp/ruby/src/trunk/prism -I/tmp/ruby/src/trunk/enc/unicode/15.0.0 I, [2024-05-26T03:15:56.265524 #3453513] INFO -- : CPPFLAGS = I, [2024-05-26T03:15:56.265536 #3453513] INFO -- : DLDFLAGS = -Wl,--compress-debug-sections=zlib -Wl,-soname,libruby.so.3.4 -fstack-protector-strong I, [2024-05-26T03:15:56.265558 #3453513] INFO -- : SOLIBS = -lz -lrt -lrt -lgmp -ldl -lcrypt -lm -lpthread I, [2024-05-26T03:15:56.265569 #3453513] INFO -- : LANG = en_US.UTF-8 I, [2024-05-26T03:15:56.265580 #3453513] INFO -- : LC_ALL = I, [2024-05-26T03:15:56.265590 #3453513] INFO -- : LC_CTYPE = I, [2024-05-26T03:15:56.265601 #3453513] INFO -- : MFLAGS = I, [2024-05-26T03:15:56.265611 #3453513] INFO -- : RUSTC = no I, [2024-05-26T03:15:56.265623 #3453513] INFO -- : YJIT_RUSTC_ARGS = --crate-name=yjit --crate-type=staticlib --edition=2021 -g -C lto=thin -C opt-level=3 -C overflow-checks=on '--out-dir=/tmp/ruby/build/trunk/yjit/target/release/' /tmp/ruby/src/trunk/yjit/src/lib.rs I, [2024-05-26T03:15:56.266095 #3453513] INFO -- : gcc (Ubuntu 11.4.0-1ubuntu1~22.04) 11.4.0 I, [2024-05-26T03:15:56.266136 #3453513] INFO -- : Copyright (C) 2021 Free Software Foundation, Inc. I, [2024-05-26T03:15:56.266150 #3453513] INFO -- : This is free software; see the source for copying conditions. There is NO I, [2024-05-26T03:15:56.266162 #3453513] INFO -- : warranty; not even for MERCHANTABILITY or FITNESS FOR A PARTICULAR PURPOSE. I, [2024-05-26T03:15:56.266173 #3453513] INFO -- : I, [2024-05-26T03:15:56.372791 #3453513] INFO -- : Checking leaked global symbols...none I, [2024-05-26T03:15:56.413706 #3453513] INFO -- : /tmp/ruby/src/trunk/basictest/test.rb:assignment ....................................................................................................................................................................................................................................................................................................................................................................................OK 372 I, [2024-05-26T03:15:56.413790 #3453513] INFO -- : /tmp/ruby/src/trunk/basictest/test.rb:condition ..OK 2 I, [2024-05-26T03:15:56.413818 #3453513] INFO -- : /tmp/ruby/src/trunk/basictest/test.rb:if/unless ...OK 3 I, [2024-05-26T03:15:56.413833 #3453513] INFO -- : /tmp/ruby/src/trunk/basictest/test.rb:case .....OK 5 I, [2024-05-26T03:15:56.413971 #3453513] INFO -- : /tmp/ruby/src/trunk/basictest/test.rb:while/until ........OK 8 I, [2024-05-26T03:15:56.414026 #3453513] INFO -- : /tmp/ruby/src/trunk/basictest/test.rb:exception ..........OK 10 I, [2024-05-26T03:15:56.414298 #3453513] INFO -- : /tmp/ruby/src/trunk/basictest/test.rb:array .......................................OK 39 I, [2024-05-26T03:15:56.414399 #3453513] INFO -- : /tmp/ruby/src/trunk/basictest/test.rb:hash ...........................OK 27 I, [2024-05-26T03:15:56.415119 #3453513] INFO -- : /tmp/ruby/src/trunk/basictest/test.rb:iterator ...........................................................................................................OK 107 I, [2024-05-26T03:15:56.415402 #3453513] INFO -- : /tmp/ruby/src/trunk/basictest/test.rb:float ................................................................................OK 80 I, [2024-05-26T03:15:56.417327 #3453513] INFO -- : /tmp/ruby/src/trunk/basictest/test.rb:bignum ...............................OK 31 I, [2024-05-26T03:15:56.418127 #3453513] INFO -- : /tmp/ruby/src/trunk/basictest/test.rb:string & char ..............................................................OK 62 I, [2024-05-26T03:15:56.418150 #3453513] INFO -- : /tmp/ruby/src/trunk/basictest/test.rb:assignment ..........OK 10 I, [2024-05-26T03:15:56.418162 #3453513] INFO -- : /tmp/ruby/src/trunk/basictest/test.rb:call ......OK 6 I, [2024-05-26T03:15:56.418209 #3453513] INFO -- : /tmp/ruby/src/trunk/basictest/test.rb:proc .........OK 9 I, [2024-05-26T03:15:56.518770 #3453513] INFO -- : /tmp/ruby/src/trunk/basictest/test.rb:signal ..OK 2 I, [2024-05-26T03:15:56.520592 #3453513] INFO -- : /tmp/ruby/src/trunk/basictest/test.rb:eval ...........................OK 27 I, [2024-05-26T03:15:56.644181 #3453513] INFO -- : /tmp/ruby/src/trunk/basictest/test.rb:system ........OK 8 I, [2024-05-26T03:15:56.644277 #3453513] INFO -- : /tmp/ruby/src/trunk/basictest/test.rb:const .....OK 5 I, [2024-05-26T03:15:56.644304 #3453513] INFO -- : /tmp/ruby/src/trunk/basictest/test.rb:clone .....OK 5 I, [2024-05-26T03:15:56.644319 #3453513] INFO -- : /tmp/ruby/src/trunk/basictest/test.rb:marshal ....OK 4 I, [2024-05-26T03:15:56.644431 #3453513] INFO -- : /tmp/ruby/src/trunk/basictest/test.rb:pack ....OK 4 I, [2024-05-26T03:15:56.645941 #3453513] INFO -- : /tmp/ruby/src/trunk/basictest/test.rb:math ..OK 2 I, [2024-05-26T03:15:56.646000 #3453513] INFO -- : /tmp/ruby/src/trunk/basictest/test.rb:struct ......OK 6 I, [2024-05-26T03:15:56.646013 #3453513] INFO -- : /tmp/ruby/src/trunk/basictest/test.rb:variable ............OK 12 I, [2024-05-26T03:15:56.646024 #3453513] INFO -- : /tmp/ruby/src/trunk/basictest/test.rb:trace ...OK 3 I, [2024-05-26T03:15:56.646035 #3453513] INFO -- : /tmp/ruby/src/trunk/basictest/test.rb:defined? ............OK 12 I, [2024-05-26T03:15:56.646056 #3453513] INFO -- : /tmp/ruby/src/trunk/basictest/test.rb:alias ......OK 6 I, [2024-05-26T03:15:56.646068 #3453513] INFO -- : /tmp/ruby/src/trunk/basictest/test.rb:path .......................OK 23 I, [2024-05-26T03:15:56.677418 #3453513] INFO -- : /tmp/ruby/src/trunk/basictest/test.rb:gc ....OK 4 I, [2024-05-26T03:15:56.679784 #3453513] INFO -- : I, [2024-05-26T03:15:56.679835 #3453513] INFO -- : test succeeded I, [2024-05-26T03:15:56.681317 #3453513] INFO -- : $$$[end] "make yes-test-basic TESTS='-j20'" exit with 0. I, [2024-05-26T03:15:56.681410 #3453513] INFO -- : $$$[beg] make yes-test-all TESTOPTS='--stderr-on-failure' TESTS='-j20' I, [2024-05-26T03:15:56.768740 #3453513] INFO -- : BASERUBY = /usr/bin/ruby --disable=gems I, [2024-05-26T03:15:56.768799 #3453513] INFO -- : CC = gcc I, [2024-05-26T03:15:56.768814 #3453513] INFO -- : LD = ld I, [2024-05-26T03:15:56.768825 #3453513] INFO -- : LDSHARED = gcc -shared I, [2024-05-26T03:15:56.768838 #3453513] INFO -- : CFLAGS = -O3 -fno-fast-math -ggdb3 -Wall -Wextra -Wdeprecated-declarations -Wdiv-by-zero -Wduplicated-cond -Wimplicit-function-declaration -Wimplicit-int -Wpointer-arith -Wwrite-strings -Wold-style-definition -Wimplicit-fallthrough=0 -Wmissing-noreturn -Wno-cast-function-type -Wno-constant-logical-operand -Wno-long-long -Wno-missing-field-initializers -Wno-overlength-strings -Wno-packed-bitfield-compat -Wno-parentheses-equality -Wno-self-assign -Wno-tautological-compare -Wno-unused-parameter -Wno-unused-value -Wsuggest-attribute=format -Wsuggest-attribute=noreturn -Wunused-variable -Wmisleading-indentation -Wundef -fPIC I, [2024-05-26T03:15:56.768850 #3453513] INFO -- : XCFLAGS = -U_FORTIFY_SOURCE -D_FORTIFY_SOURCE=2 -fstack-protector-strong -fno-strict-overflow -fvisibility=hidden -fexcess-precision=standard -DRUBY_EXPORT -I. -I.ext/include/x86_64-linux -I/tmp/ruby/src/trunk/include -I/tmp/ruby/src/trunk -I/tmp/ruby/src/trunk/prism -I/tmp/ruby/src/trunk/enc/unicode/15.0.0 I, [2024-05-26T03:15:56.768860 #3453513] INFO -- : CPPFLAGS = I, [2024-05-26T03:15:56.768871 #3453513] INFO -- : DLDFLAGS = -Wl,--compress-debug-sections=zlib -Wl,-soname,libruby.so.3.4 -fstack-protector-strong I, [2024-05-26T03:15:56.768892 #3453513] INFO -- : SOLIBS = -lz -lrt -lrt -lgmp -ldl -lcrypt -lm -lpthread I, [2024-05-26T03:15:56.768902 #3453513] INFO -- : LANG = en_US.UTF-8 I, [2024-05-26T03:15:56.768912 #3453513] INFO -- : LC_ALL = I, [2024-05-26T03:15:56.768922 #3453513] INFO -- : LC_CTYPE = I, [2024-05-26T03:15:56.768931 #3453513] INFO -- : MFLAGS = I, [2024-05-26T03:15:56.768944 #3453513] INFO -- : RUSTC = no I, [2024-05-26T03:15:56.768955 #3453513] INFO -- : YJIT_RUSTC_ARGS = --crate-name=yjit --crate-type=staticlib --edition=2021 -g -C lto=thin -C opt-level=3 -C overflow-checks=on '--out-dir=/tmp/ruby/build/trunk/yjit/target/release/' /tmp/ruby/src/trunk/yjit/src/lib.rs I, [2024-05-26T03:15:56.769409 #3453513] INFO -- : gcc (Ubuntu 11.4.0-1ubuntu1~22.04) 11.4.0 I, [2024-05-26T03:15:56.769461 #3453513] INFO -- : Copyright (C) 2021 Free Software Foundation, Inc. I, [2024-05-26T03:15:56.769486 #3453513] INFO -- : This is free software; see the source for copying conditions. There is NO I, [2024-05-26T03:15:56.769498 #3453513] INFO -- : warranty; not even for MERCHANTABILITY or FITNESS FOR A PARTICULAR PURPOSE. I, [2024-05-26T03:15:56.769509 #3453513] INFO -- : I, [2024-05-26T03:15:56.771045 #3453513] INFO -- : generating enc.mk I, [2024-05-26T03:15:56.888775 #3453513] INFO -- : generating encdb.h I, [2024-05-26T03:15:56.913733 #3453513] INFO -- : encdb.h unchanged I, [2024-05-26T03:15:56.914979 #3453513] INFO -- : making enc I, [2024-05-26T03:15:56.933434 #3453513] INFO -- : make[1]: Entering directory '/tmp/ruby/build/trunk' I, [2024-05-26T03:15:56.933496 #3453513] INFO -- : make[1]: Nothing to be done for 'enc'. I, [2024-05-26T03:15:56.933510 #3453513] INFO -- : make[1]: Leaving directory '/tmp/ruby/build/trunk' I, [2024-05-26T03:15:56.934160 #3453513] INFO -- : making srcs under enc I, [2024-05-26T03:15:56.963725 #3453513] INFO -- : make[1]: Entering directory '/tmp/ruby/build/trunk' I, [2024-05-26T03:15:56.963888 #3453513] INFO -- : make[1]: Nothing to be done for 'srcs'. I, [2024-05-26T03:15:56.963895 #3453513] INFO -- : make[1]: Leaving directory '/tmp/ruby/build/trunk' I, [2024-05-26T03:15:56.964731 #3453513] INFO -- : generating transdb.h I, [2024-05-26T03:15:57.064139 #3453513] INFO -- : transdb.h unchanged I, [2024-05-26T03:15:57.065466 #3453513] INFO -- : making trans I, [2024-05-26T03:15:57.099064 #3453513] INFO -- : make[1]: Entering directory '/tmp/ruby/build/trunk' I, [2024-05-26T03:15:57.099087 #3453513] INFO -- : make[1]: Nothing to be done for 'trans'. I, [2024-05-26T03:15:57.099093 #3453513] INFO -- : make[1]: Leaving directory '/tmp/ruby/build/trunk' I, [2024-05-26T03:15:57.099744 #3453513] INFO -- : making encs I, [2024-05-26T03:15:57.137408 #3453513] INFO -- : make[1]: Entering directory '/tmp/ruby/build/trunk' I, [2024-05-26T03:15:57.137428 #3453513] INFO -- : make[1]: Nothing to be done for 'encs'. I, [2024-05-26T03:15:57.137434 #3453513] INFO -- : make[1]: Leaving directory '/tmp/ruby/build/trunk' I, [2024-05-26T03:15:57.139432 #3453513] INFO -- : generating makefiles ext/configure-ext.mk I, [2024-05-26T03:15:57.166913 #3453513] INFO -- : ext/configure-ext.mk updated I, [2024-05-26T03:15:57.169593 #3453513] INFO -- : make[1]: Entering directory '/tmp/ruby/build/trunk' I, [2024-05-26T03:15:58.571467 #3453513] INFO -- : make[1]: Leaving directory '/tmp/ruby/build/trunk' I, [2024-05-26T03:15:58.572116 #3453513] INFO -- : generating makefile exts.mk I, [2024-05-26T03:15:58.610145 #3453513] INFO -- : exts.mk unchanged I, [2024-05-26T03:15:58.614601 #3453513] INFO -- : make[1]: Entering directory '/tmp/ruby/build/trunk' I, [2024-05-26T03:15:58.934419 #3453513] INFO -- : make[2]: Entering directory '/tmp/ruby/build/trunk/ext/coverage' I, [2024-05-26T03:15:58.937884 #3453513] INFO -- : make[2]: Leaving directory '/tmp/ruby/build/trunk/ext/coverage' I, [2024-05-26T03:15:58.944233 #3453513] INFO -- : make[2]: Entering directory '/tmp/ruby/build/trunk/ext/date' I, [2024-05-26T03:15:58.948682 #3453513] INFO -- : make[2]: Leaving directory '/tmp/ruby/build/trunk/ext/date' I, [2024-05-26T03:15:58.952466 #3453513] INFO -- : make[2]: Entering directory '/tmp/ruby/build/trunk/ext/digest' I, [2024-05-26T03:15:58.961595 #3453513] INFO -- : make[2]: Leaving directory '/tmp/ruby/build/trunk/ext/digest' I, [2024-05-26T03:15:58.988482 #3453513] INFO -- : make[2]: Entering directory '/tmp/ruby/build/trunk/ext/digest/sha2' I, [2024-05-26T03:15:58.993204 #3453513] INFO -- : make[2]: Leaving directory '/tmp/ruby/build/trunk/ext/digest/sha2' I, [2024-05-26T03:15:59.015023 #3453513] INFO -- : make[2]: Entering directory '/tmp/ruby/build/trunk/ext/fiddle' I, [2024-05-26T03:15:59.024968 #3453513] INFO -- : make[2]: Leaving directory '/tmp/ruby/build/trunk/ext/fiddle' I, [2024-05-26T03:15:59.029998 #3453513] INFO -- : make[2]: Entering directory '/tmp/ruby/build/trunk/ext/io/console' I, [2024-05-26T03:15:59.034195 #3453513] INFO -- : make[2]: Leaving directory '/tmp/ruby/build/trunk/ext/io/console' I, [2024-05-26T03:15:59.047288 #3453513] INFO -- : make[2]: Entering directory '/tmp/ruby/build/trunk/ext/json' I, [2024-05-26T03:15:59.057837 #3453513] INFO -- : make[2]: Leaving directory '/tmp/ruby/build/trunk/ext/json' I, [2024-05-26T03:15:59.073269 #3453513] INFO -- : make[2]: Entering directory '/tmp/ruby/build/trunk/ext/monitor' I, [2024-05-26T03:15:59.077268 #3453513] INFO -- : make[2]: Leaving directory '/tmp/ruby/build/trunk/ext/monitor' I, [2024-05-26T03:15:59.084368 #3453513] INFO -- : make[2]: Entering directory '/tmp/ruby/build/trunk/ext/objspace' I, [2024-05-26T03:15:59.090568 #3453513] INFO -- : make[2]: Leaving directory '/tmp/ruby/build/trunk/ext/objspace' I, [2024-05-26T03:15:59.109339 #3453513] INFO -- : make[2]: Entering directory '/tmp/ruby/build/trunk/ext/openssl' I, [2024-05-26T03:15:59.122576 #3453513] INFO -- : make[2]: Leaving directory '/tmp/ruby/build/trunk/ext/openssl' I, [2024-05-26T03:15:59.125582 #3453513] INFO -- : make[2]: Entering directory '/tmp/ruby/build/trunk/ext/pathname' I, [2024-05-26T03:15:59.128072 #3453513] INFO -- : make[2]: Leaving directory '/tmp/ruby/build/trunk/ext/pathname' I, [2024-05-26T03:15:59.132525 #3453513] INFO -- : make[2]: Entering directory '/tmp/ruby/build/trunk/ext/psych' I, [2024-05-26T03:15:59.156581 #3453513] INFO -- : make[2]: Leaving directory '/tmp/ruby/build/trunk/ext/psych' I, [2024-05-26T03:15:59.161793 #3453513] INFO -- : make[2]: Entering directory '/tmp/ruby/build/trunk/ext/pty' I, [2024-05-26T03:15:59.165918 #3453513] INFO -- : make[2]: Leaving directory '/tmp/ruby/build/trunk/ext/pty' I, [2024-05-26T03:15:59.182417 #3453513] INFO -- : make[2]: Entering directory '/tmp/ruby/build/trunk/ext/ripper' I, [2024-05-26T03:15:59.190734 #3453513] INFO -- : make[2]: Leaving directory '/tmp/ruby/build/trunk/ext/ripper' I, [2024-05-26T03:15:59.193251 #3453513] INFO -- : make[2]: Entering directory '/tmp/ruby/build/trunk/ext/rubyvm' I, [2024-05-26T03:15:59.196492 #3453513] INFO -- : make[2]: Leaving directory '/tmp/ruby/build/trunk/ext/rubyvm' I, [2024-05-26T03:15:59.209922 #3453513] INFO -- : make[2]: Entering directory '/tmp/ruby/build/trunk/ext/socket' I, [2024-05-26T03:15:59.220473 #3453513] INFO -- : make[2]: Leaving directory '/tmp/ruby/build/trunk/ext/socket' I, [2024-05-26T03:15:59.238173 #3453513] INFO -- : make[2]: Entering directory '/tmp/ruby/build/trunk/.bundle/gems/bigdecimal-3.1.8/ext/bigdecimal' I, [2024-05-26T03:15:59.265252 #3453513] INFO -- : make[2]: Leaving directory '/tmp/ruby/build/trunk/.bundle/gems/bigdecimal-3.1.8/ext/bigdecimal' I, [2024-05-26T03:15:59.267347 #3453513] INFO -- : make[2]: Entering directory '/tmp/ruby/build/trunk/.bundle/gems/debug-1.9.2/ext/debug' I, [2024-05-26T03:15:59.288883 #3453513] INFO -- : make[2]: Leaving directory '/tmp/ruby/build/trunk/.bundle/gems/debug-1.9.2/ext/debug' I, [2024-05-26T03:15:59.290820 #3453513] INFO -- : make[2]: Entering directory '/tmp/ruby/build/trunk/.bundle/gems/nkf-0.2.0/ext/nkf' I, [2024-05-26T03:15:59.312535 #3453513] INFO -- : make[2]: Leaving directory '/tmp/ruby/build/trunk/.bundle/gems/nkf-0.2.0/ext/nkf' I, [2024-05-26T03:15:59.314484 #3453513] INFO -- : make[2]: Entering directory '/tmp/ruby/build/trunk/.bundle/gems/racc-1.7.3/ext/racc/cparse' I, [2024-05-26T03:15:59.336444 #3453513] INFO -- : make[2]: Leaving directory '/tmp/ruby/build/trunk/.bundle/gems/racc-1.7.3/ext/racc/cparse' I, [2024-05-26T03:15:59.338426 #3453513] INFO -- : make[2]: Entering directory '/tmp/ruby/build/trunk/.bundle/gems/racc-1.8.0/ext/racc/cparse' I, [2024-05-26T03:15:59.359918 #3453513] INFO -- : make[2]: Leaving directory '/tmp/ruby/build/trunk/.bundle/gems/racc-1.8.0/ext/racc/cparse' I, [2024-05-26T03:15:59.362120 #3453513] INFO -- : make[2]: Entering directory '/tmp/ruby/build/trunk/.bundle/gems/rbs-3.4.4/ext/rbs_extension' I, [2024-05-26T03:15:59.383435 #3453513] INFO -- : make[2]: Leaving directory '/tmp/ruby/build/trunk/.bundle/gems/rbs-3.4.4/ext/rbs_extension' I, [2024-05-26T03:15:59.385295 #3453513] INFO -- : make[2]: Entering directory '/tmp/ruby/build/trunk/.bundle/gems/syslog-0.1.2/ext/syslog' I, [2024-05-26T03:15:59.406943 #3453513] INFO -- : make[2]: Leaving directory '/tmp/ruby/build/trunk/.bundle/gems/syslog-0.1.2/ext/syslog' I, [2024-05-26T03:15:59.431352 #3453513] INFO -- : make[2]: Entering directory '/tmp/ruby/build/trunk' I, [2024-05-26T03:15:59.501640 #3453513] INFO -- : make[2]: 'ruby' is up to date. I, [2024-05-26T03:15:59.501679 #3453513] INFO -- : make[2]: Leaving directory '/tmp/ruby/build/trunk' I, [2024-05-26T03:15:59.501977 #3453513] INFO -- : make[1]: Leaving directory '/tmp/ruby/build/trunk' I, [2024-05-26T03:15:59.505714 #3453513] INFO -- : make[1]: Entering directory '/tmp/ruby/build/trunk' I, [2024-05-26T03:15:59.505736 #3453513] INFO -- : make[1]: Nothing to be done for 'note'. I, [2024-05-26T03:15:59.505742 #3453513] INFO -- : make[1]: Leaving directory '/tmp/ruby/build/trunk' I, [2024-05-26T03:15:59.582111 #3453513] INFO -- : Run options: I, [2024-05-26T03:15:59.582153 #3453513] INFO -- : --seed=10127 I, [2024-05-26T03:15:59.582159 #3453513] INFO -- : "--ruby=./miniruby -I/tmp/ruby/src/trunk/lib -I. -I.ext/common /tmp/ruby/src/trunk/tool/runruby.rb --extout=.ext -- --disable-gems" I, [2024-05-26T03:15:59.582164 #3453513] INFO -- : --excludes-dir=/tmp/ruby/src/trunk/test/.excludes I, [2024-05-26T03:15:59.582168 #3453513] INFO -- : --name=!/memory_leak/ I, [2024-05-26T03:15:59.582172 #3453513] INFO -- : --stderr-on-failure I, [2024-05-26T03:15:59.582175 #3453513] INFO -- : -j20 I, [2024-05-26T03:15:59.582179 #3453513] INFO -- : I, [2024-05-26T03:15:59.582182 #3453513] INFO -- : # Running tests: I, [2024-05-26T03:15:59.582186 #3453513] INFO -- : I, [2024-05-26T03:15:59.731830 #3453513] INFO -- : [ 1/883] 3494874=test_scanner_events I, [2024-05-26T03:15:59.731921 #3453513] INFO -- : [ 2/883] 3494869=test_gem_resolver_installed_specification I, [2024-05-26T03:15:59.732232 #3453513] INFO -- : [ 3/883] 3494871=test_parse I, [2024-05-26T03:15:59.732571 #3453513] INFO -- : [ 4/883] 3494870=test_mdns I, [2024-05-26T03:15:59.732653 #3453513] INFO -- : [ 5/883] 3494873=test_gem_remote_fetcher I, [2024-05-26T03:15:59.735643 #3453513] INFO -- : [ 6/883] 3494872=test_inlinecache I, [2024-05-26T03:15:59.736350 #3453513] INFO -- : [ 7/883] 3494885=test_rdoc_markup_verbatim I, [2024-05-26T03:15:59.736449 #3453513] INFO -- : [ 8/883] 3494883=test_path_to_class I, [2024-05-26T03:15:59.736534 #3453513] INFO -- : [ 9/883] 3494887=test_gem_resolver_specification I, [2024-05-26T03:15:59.736602 #3453513] INFO -- : [ 10/883] 3494884=test_gem_dependency I, [2024-05-26T03:15:59.738034 #3453513] INFO -- : [ 11/883] 3494888=test_method_cache I, [2024-05-26T03:15:59.743043 #3453513] INFO -- : [ 12/883] 3494888=test_gem_stub_specification I, [2024-05-26T03:15:59.745211 #3453513] INFO -- : [ 13/883] 3494880=test_frozen_error I, [2024-05-26T03:15:59.745699 #3453513] INFO -- : [ 14/883] 3494883=test_gem_ext_ext_conf_builder I, [2024-05-26T03:15:59.747199 #3453513] INFO -- : [ 15/883] 3494880=test_complex I, [2024-05-26T03:15:59.758717 #3453513] INFO -- : [ 16/883] 3494886=test_gem_commands_search_command I, [2024-05-26T03:15:59.762988 #3453513] INFO -- : [ 17/883] 3494870=test_string_processing I, [2024-05-26T03:15:59.763459 #3453513] INFO -- : [ 18/883] 3494875=test_fileutils I, [2024-05-26T03:15:59.764689 #3453513] INFO -- : [ 19/883] 3494881=test_ldap I, [2024-05-26T03:15:59.765166 #3453513] INFO -- : [ 20/883] 3494876=test_emitter I, [2024-05-26T03:15:59.765229 #3453513] INFO -- : [ 21/883] 3494877=test_resource I, [2024-05-26T03:15:59.765324 #3453513] INFO -- : [ 22/883] 3494879=test_gem_commands_signin_command I, [2024-05-26T03:15:59.765824 #3453513] INFO -- : [ 23/883] 3494878=test_gem_version I, [2024-05-26T03:15:59.766184 #3453513] INFO -- : [ 24/883] 3494882=test_econv I, [2024-05-26T03:15:59.787984 #3453513] INFO -- : [ 25/883] 3494874=test_cesu8 I, [2024-05-26T03:15:59.788388 #3453513] INFO -- : [ 26/883] 3494881=test_rdoc_options I, [2024-05-26T03:15:59.794070 #3453513] INFO -- : [ 27/883] 3494876=test_too_many_dummy_encodings I, [2024-05-26T03:15:59.799856 #3453513] INFO -- : [ 28/883] 3494877=test_reqarg I, [2024-05-26T03:15:59.800397 #3453513] INFO -- : [ 29/883] 3494874=test_rdoc_include I, [2024-05-26T03:15:59.804549 #3453513] INFO -- : [ 30/883] 3494872=test_stack I, [2024-05-26T03:15:59.840496 #3453513] INFO -- : [ 31/883] 3494870=test_gem_commands_list_command I, [2024-05-26T03:15:59.871329 #3453513] INFO -- : [ 32/883] 3494876=test_internal_ivar I, [2024-05-26T03:15:59.874529 #3453513] INFO -- : [ 33/883] 3494876=test_gem_resolver_index_specification I, [2024-05-26T03:15:59.895639 #3453513] INFO -- : [ 34/883] 3494880=test_duplicate I, [2024-05-26T03:15:59.898329 #3453513] INFO -- : [ 35/883] 3494880=test_utf32 I, [2024-05-26T03:15:59.902178 #3453513] INFO -- : [ 36/883] 3494880=test_basicsocket I, [2024-05-26T03:15:59.924603 #3453513] INFO -- : [ 37/883] 3494885=test_tracepoint I, [2024-05-26T03:15:59.924677 #3453513] INFO -- : [ 38/883] 3494869=test_prettyprint I, [2024-05-26T03:15:59.924694 #3453513] INFO -- : [ 39/883] 3494880=test_gem_commands_help_command I, [2024-05-26T03:15:59.945235 #3453513] INFO -- : [ 40/883] 3494869=test_rdoc_markup I, [2024-05-26T03:15:59.950118 #3453513] INFO -- : [ 41/883] 3494886=test_tempfile I, [2024-05-26T03:15:59.959181 #3453513] INFO -- : [ 42/883] 3494887=parse_comments_test I, [2024-05-26T03:15:59.998326 #3453513] INFO -- : [ 43/883] 3494874=test_noarg I, [2024-05-26T03:16:00.021265 #3453513] INFO -- : [ 44/883] 3494884=test_function I, [2024-05-26T03:16:00.027216 #3453513] INFO -- : [ 45/883] 3494878=test_queue I, [2024-05-26T03:16:00.027613 #3453513] INFO -- : [ 46/883] 3494878=test_irb I, [2024-05-26T03:16:00.043406 #3453513] INFO -- : [ 47/883] 3494887=json_string_matching_test I, [2024-05-26T03:16:00.048268 #3453513] INFO -- : [ 48/883] 3494870=test_load I, [2024-05-26T03:16:00.048717 #3453513] INFO -- : [ 49/883] 3494888=test_class I, [2024-05-26T03:16:00.059511 #3453513] INFO -- : [ 50/883] 3494870=test_rdoc_normal_class I, [2024-05-26T03:16:00.068348 #3453513] INFO -- : [ 51/883] 3494887=test_const I, [2024-05-26T03:16:00.071914 #3453513] INFO -- : [ 52/883] 3494887=test_asn1 I, [2024-05-26T03:16:00.080636 #3453513] INFO -- : [ 53/883] 3494869=test_random I, [2024-05-26T03:16:00.085879 #3453513] INFO -- : [ 54/883] 3494869=test_yamlstore I, [2024-05-26T03:16:00.092440 #3453513] INFO -- : [ 55/883] 3494869=test_gem_installer I, [2024-05-26T03:16:00.095291 #3453513] INFO -- : [ 56/883] 3494879=test_rdoc_parser_rd I, [2024-05-26T03:16:00.096715 #3453513] INFO -- : [ 57/883] 3494887=test_date_strftime I, [2024-05-26T03:16:00.167908 #3453513] INFO -- : [ 58/883] 3494876=test_recorder I, [2024-05-26T03:16:00.170707 #3453513] INFO -- : [ 59/883] 3494876=test_gem_source_vendor I, [2024-05-26T03:16:00.176603 #3453513] INFO -- : [ 60/883] 3494876=test_gem_commands_owner_command I, [2024-05-26T03:16:00.178609 #3453513] INFO -- : [ 61/883] 3494880=test_deprecate I, [2024-05-26T03:16:00.182385 #3453513] INFO -- : [ 62/883] 3494877=test_rdoc_constant I, [2024-05-26T03:16:00.190441 #3453513] INFO -- : [ 63/883] 3494874=test_formatter I, [2024-05-26T03:16:00.197091 #3453513] INFO -- : [ 64/883] 3494874=test_bash_completion I, [2024-05-26T03:16:00.201159 #3453513] INFO -- : [ 65/883] 3494874=test_rdoc_any_method I, [2024-05-26T03:16:00.207530 #3453513] INFO -- : [ 66/883] 3494880=test_modify_expand I, [2024-05-26T03:16:00.211795 #3453513] INFO -- : [ 67/883] 3494880=test_rdoc_markdown I, [2024-05-26T03:16:00.213040 #3453513] INFO -- : [ 68/883] 3494875=test_gem_available_set I, [2024-05-26T03:16:00.223529 #3453513] INFO -- : [ 69/883] 3494885=test_file I, [2024-05-26T03:16:00.233641 #3453513] INFO -- : [ 70/883] 3494881=regexp_test I, [2024-05-26T03:16:00.235742 #3453513] INFO -- : [ 71/883] 3494884=test_gem_package_tar_reader I, [2024-05-26T03:16:00.247108 #3453513] INFO -- : [ 72/883] 3494886=test_rdoc_encoding I, [2024-05-26T03:16:00.260869 #3453513] INFO -- : [ 73/883] 3494885=test_coverage I, [2024-05-26T03:16:00.272265 #3453513] INFO -- : [ 74/883] 3494884=test_pathname I, [2024-05-26T03:16:00.292017 #3453513] INFO -- : [ 75/883] 3494871=test_complexrational I, [2024-05-26T03:16:00.299500 #3453513] INFO -- : [ 76/883] 3494871=test_init I, [2024-05-26T03:16:00.320899 #3453513] INFO -- : [ 77/883] 3494879=test_ractor I, [2024-05-26T03:16:00.323237 #3453513] INFO -- : [ 78/883] 3494881=test_find I, [2024-05-26T03:16:00.339727 #3453513] INFO -- : [ 79/883] 3494878=test_fiddle I, [2024-05-26T03:16:00.341903 #3453513] INFO -- : [ 80/883] 3494881=test_wss I, [2024-05-26T03:16:00.344019 #3453513] INFO -- : [ 81/883] 3494881=test_gem_commands_contents_command I, [2024-05-26T03:16:00.367652 #3453513] INFO -- : [ 82/883] 3494870=test_gem_ext_cmake_builder I, [2024-05-26T03:16:00.377608 #3453513] INFO -- : [ 83/883] 3494878=test_require I, [2024-05-26T03:16:00.384807 #3453513] INFO -- : [ 84/883] 3494870=test_cgi_util I, [2024-05-26T03:16:00.428767 #3453513] INFO -- : [ 85/883] 3494886=test_marshalable I, [2024-05-26T03:16:00.439139 #3453513] INFO -- : [ 86/883] 3494879=test_digest I, [2024-05-26T03:16:00.455881 #3453513] INFO -- : [ 87/883] 3494886=test_pstore I, [2024-05-26T03:16:00.487833 #3453513] INFO -- : [ 88/883] 3494886=test_cstr I, [2024-05-26T03:16:00.494760 #3453513] INFO -- : [ 89/883] 3494877=test_profile_frames I, [2024-05-26T03:16:00.510632 #3453513] INFO -- : [ 90/883] 3494875=test_class2name I, [2024-05-26T03:16:00.511284 #3453513] INFO -- : [ 91/883] 3494884=test_gbk I, [2024-05-26T03:16:00.514437 #3453513] INFO -- : [ 92/883] 3494884=test_enc_str_buf_cat I, [2024-05-26T03:16:00.514632 #3453513] INFO -- : [ 93/883] 3494875=test_comparable I, [2024-05-26T03:16:00.518149 #3453513] INFO -- : [ 94/883] 3494884=test_rdoc_parser_c I, [2024-05-26T03:16:00.520670 #3453513] INFO -- : [ 95/883] 3494875=test_io_timeout I, [2024-05-26T03:16:00.532868 #3453513] INFO -- : [ 96/883] 3494875=test_shapes I, [2024-05-26T03:16:00.537753 #3453513] INFO -- : [ 97/883] 3494875=json_fixtures_test I, [2024-05-26T03:16:00.545077 #3453513] INFO -- : [ 98/883] 3494875=test_euc_tw I, [2024-05-26T03:16:00.549561 #3453513] INFO -- : [ 99/883] 3494875=test_ractor I, [2024-05-26T03:16:00.557773 #3453513] INFO -- : [100/883] 3494880=test_bmethod I, [2024-05-26T03:16:00.561076 #3453513] INFO -- : [101/883] 3494875=test_gem_commands_sources_command I, [2024-05-26T03:16:00.562842 #3453513] INFO -- : [102/883] 3494880=test_ansi_without_terminfo I, [2024-05-26T03:16:00.574787 #3453513] INFO -- : [103/883] 3494874=test_thread_queue I, [2024-05-26T03:16:00.588036 #3453513] INFO -- : [104/883] 3494881=test_nowrite I, [2024-05-26T03:16:00.588990 #3453513] INFO -- : [105/883] 3494870=test_rdoc_markup_formatter I, [2024-05-26T03:16:00.601931 #3453513] INFO -- : [106/883] 3494870=test_forwardable I, [2024-05-26T03:16:00.611207 #3453513] INFO -- : [107/883] 3494881=test_yaml I, [2024-05-26T03:16:00.614718 #3453513] INFO -- : [108/883] 3494880=test_wait I, [2024-05-26T03:16:00.627198 #3453513] INFO -- : [109/883] 3494870=test_handle I, [2024-05-26T03:16:00.669512 #3453513] INFO -- : [110/883] 3494877=test_big2str I, [2024-05-26T03:16:00.673922 #3453513] INFO -- : [111/883] 3494877=test_stringscanner I, [2024-05-26T03:16:00.675978 #3453513] INFO -- : [112/883] 3494875=test_files_sample I, [2024-05-26T03:16:00.693685 #3453513] INFO -- : [113/883] 3494880=test_rdoc_alias I, [2024-05-26T03:16:00.697117 #3453513] INFO -- : [114/883] 3494881=test_yield I, [2024-05-26T03:16:00.708954 #3453513] INFO -- : [115/883] 3494877=parser_test I, [2024-05-26T03:16:00.737861 #3453513] INFO -- : [116/883] 3494876=test_convertible I, [2024-05-26T03:16:00.737931 #3453513] INFO -- : [117/883] 3494872=test_optparse I, [2024-05-26T03:16:00.739545 #3453513] INFO -- : [118/883] 3494875=test_array I, [2024-05-26T03:16:00.753275 #3453513] INFO -- : [119/883] 3494886=test_fstring I, [2024-05-26T03:16:00.753473 #3453513] INFO -- : [120/883] 3494875=test_rdoc_markup_to_html_crossref I, [2024-05-26T03:16:00.763237 #3453513] INFO -- : [121/883] 3494880=encoding_test I, [2024-05-26T03:16:00.765737 #3453513] INFO -- : [122/883] 3494877=test_gem_resolver_best_set I, [2024-05-26T03:16:00.768079 #3453513] INFO -- : [123/883] 3494871=test_typeddata I, [2024-05-26T03:16:00.800080 #3453513] INFO -- : [124/883] 3494872=test_rat I, [2024-05-26T03:16:00.803313 #3453513] INFO -- : [125/883] 3494872=test_rdoc_markup_raw I, [2024-05-26T03:16:00.809762 #3453513] INFO -- : [126/883] 3494882=test_webauthn_poller I, [2024-05-26T03:16:00.811258 #3453513] INFO -- : [127/883] 3494887=test_rdoc_require I, [2024-05-26T03:16:00.848360 #3453513] INFO -- : [128/883] 3494884=locals_test I, [2024-05-26T03:16:00.857356 #3453513] INFO -- : [129/883] 3494886=test_readpartial I, [2024-05-26T03:16:00.892502 #3453513] INFO -- : [130/883] 3494870=test_gem_commands_install_command I, [2024-05-26T03:16:00.918118 #3453513] INFO -- : [131/883] 3494872=test_clone I, [2024-05-26T03:16:00.923256 #3453513] INFO -- : [132/883] 3494880=test_gem_resolver_conflict I, [2024-05-26T03:16:00.933228 #3453513] INFO -- : [133/883] 3494880=test_rdoc_task I, [2024-05-26T03:16:00.937522 #3453513] INFO -- : [134/883] 3494880=test_backtrace I, [2024-05-26T03:16:00.970699 #3453513] INFO -- : [135/883] 3494887=test_pack I, [2024-05-26T03:16:00.984683 #3453513] INFO -- : [136/883] 3494887=ruby_parser_test I, [2024-05-26T03:16:00.986364 #3453513] INFO -- : [137/883] 3494887=test_io_buffer I, [2024-05-26T03:16:01.022310 #3453513] INFO -- : [138/883] 3494871=test_rdoc_markup_indented_paragraph I, [2024-05-26T03:16:01.051450 #3453513] INFO -- : [139/883] 3494877=test_io I, [2024-05-26T03:16:01.094039 #3453513] INFO -- : [140/883] 3494887=test_unicode_escape I, [2024-05-26T03:16:01.116412 #3453513] INFO -- : [141/883] 3494885=test_utf16 I, [2024-05-26T03:16:01.119392 #3453513] INFO -- : [142/883] 3494872=test_autoload I, [2024-05-26T03:16:01.125898 #3453513] INFO -- : [143/883] 3494885=test_rendering I, [2024-05-26T03:16:01.145403 #3453513] INFO -- : [144/883] 3494871=test_sizeof I, [2024-05-26T03:16:01.161973 #3453513] INFO -- : [145/883] 3494882=test_case I, [2024-05-26T03:16:01.181337 #3453513] INFO -- : [146/883] 3494883=test_face I, [2024-05-26T03:16:01.182191 #3453513] INFO -- : [147/883] 3494882=test_yaml_tree I, [2024-05-26T03:16:01.184565 #3453513] INFO -- : [148/883] 3494887=test_sleep I, [2024-05-26T03:16:01.190963 #3453513] INFO -- : [149/883] 3494884=test_config I, [2024-05-26T03:16:01.228973 #3453513] INFO -- : [150/883] 3494879=test_libs I, [2024-05-26T03:16:01.230684 #3453513] INFO -- : [151/883] 3494883=test_gem_commands_fetch_command I, [2024-05-26T03:16:01.233099 #3453513] INFO -- : [152/883] 3494882=test_math I, [2024-05-26T03:16:01.243603 #3453513] INFO -- : [153/883] 3494884=test_gc I, [2024-05-26T03:16:01.246127 #3453513] INFO -- : [154/883] 3494882=test_getopts I, [2024-05-26T03:16:01.246276 #3453513] INFO -- : [155/883] 3494884=test_protocol I, [2024-05-26T03:16:01.248695 #3453513] INFO -- : [156/883] 3494885=test_gem_resolver_activation_request I, [2024-05-26T03:16:01.251705 #3453513] INFO -- : [157/883] 3494882=test_gem_config_file I, [2024-05-26T03:16:01.257733 #3453513] INFO -- : [158/883] 3494879=test_ripper I, [2024-05-26T03:16:01.261573 #3453513] INFO -- : [159/883] 3494886=test_etc I, [2024-05-26T03:16:01.334438 #3453513] INFO -- : [160/883] 3494883=test_yjit_exit_locations I, [2024-05-26T03:16:01.335355 #3453513] INFO -- : [161/883] 3494883=test_system I, [2024-05-26T03:16:01.346399 #3453513] INFO -- : [162/883] 3494886=test_pkcs12 I, [2024-05-26T03:16:01.349059 #3453513] INFO -- : [163/883] 3494875=test_gem_package_tar_header I, [2024-05-26T03:16:01.395418 #3453513] INFO -- : [164/883] 3494882=test_gem_util I, [2024-05-26T03:16:01.397845 #3453513] INFO -- : [165/883] 3494875=test_iseq_load I, [2024-05-26T03:16:01.461554 #3453513] INFO -- : [166/883] 3494885=test_pkey_dh I, [2024-05-26T03:16:01.477272 #3453513] INFO -- : [167/883] 3494878=test_bigzero I, [2024-05-26T03:16:01.482359 #3453513] INFO -- : [168/883] 3494878=test_ftp I, [2024-05-26T03:16:01.495129 #3453513] INFO -- : [169/883] 3494878=test_rdoc_context_section I, [2024-05-26T03:16:01.509775 #3453513] INFO -- : [170/883] 3494879=test_euc_kr I, [2024-05-26T03:16:01.512528 #3453513] INFO -- : [171/883] 3494879=test_gem_commands_query_command I, [2024-05-26T03:16:01.556585 #3453513] INFO -- : [172/883] 3494884=test_method I, [2024-05-26T03:16:01.584017 #3453513] INFO -- : [173/883] 3494882=test_rdoc_rubygems_hook I, [2024-05-26T03:16:01.587855 #3453513] INFO -- : [174/883] 3494885=test_pattern_key_name_check I, [2024-05-26T03:16:01.593303 #3453513] INFO -- : [175/883] 3494885=test_to_ruby I, [2024-05-26T03:16:01.607456 #3453513] INFO -- : [176/883] 3494878=test_gem_impossible_dependencies_error I, [2024-05-26T03:16:01.609584 #3453513] INFO -- : [177/883] 3494878=test_array_create I, [2024-05-26T03:16:01.618005 #3453513] INFO -- : [178/883] 3494878=test_pack I, [2024-05-26T03:16:01.631994 #3453513] INFO -- : [179/883] 3494885=test_sorted_set I, [2024-05-26T03:16:01.642757 #3453513] INFO -- : [180/883] 3494886=test_win32ole_type_event I, [2024-05-26T03:16:01.642944 #3453513] INFO -- : [181/883] 3494886=test_emoji I, [2024-05-26T03:16:01.663050 #3453513] INFO -- : [182/883] 3494886=test_ubf_async_safe I, [2024-05-26T03:16:01.669735 #3453513] INFO -- : [183/883] 3494886=test_hash I, [2024-05-26T03:16:01.709532 #3453513] INFO -- : [184/883] 3494873=test_io I, [2024-05-26T03:16:01.770982 #3453513] INFO -- : [185/883] 3494882=test_cp949 I, [2024-05-26T03:16:01.772569 #3453513] INFO -- : [186/883] 3494882=test_gem_commands_uninstall_command I, [2024-05-26T03:16:01.844443 #3453513] INFO -- : [187/883] 3494885=test_gem_source_specific_file I, [2024-05-26T03:16:01.860697 #3453513] INFO -- : [188/883] 3494878=test_foreach I, [2024-05-26T03:16:01.863835 #3453513] INFO -- : [189/883] 3494878=test_condition I, [2024-05-26T03:16:01.866048 #3453513] INFO -- : [190/883] 3494878=test_gem_unsatisfiable_dependency_error I, [2024-05-26T03:16:01.878885 #3453513] INFO -- : [191/883] 3494878=test_win32ole_record I, [2024-05-26T03:16:01.883061 #3453513] INFO -- : [192/883] 3494878=test_type_completor I, [2024-05-26T03:16:01.886212 #3453513] INFO -- : [193/883] 3494878=test_console_attr I, [2024-05-26T03:16:01.891284 #3453513] INFO -- : [194/883] 3494878=test_summary I, [2024-05-26T03:16:01.924855 #3453513] INFO -- : [195/883] 3494885=test_ellipsize I, [2024-05-26T03:16:01.932049 #3453513] INFO -- : [196/883] 3494885=test_date_attr I, [2024-05-26T03:16:01.934745 #3453513] INFO -- : [197/883] 3494885=test_io_wait I, [2024-05-26T03:16:01.942502 #3453513] INFO -- : [198/883] 3494873=test_gem_commands_exec_command I, [2024-05-26T03:16:01.984342 #3453513] INFO -- : [199/883] 3494879=warnings_test I, [2024-05-26T03:16:01.996986 #3453513] INFO -- : [200/883] 3494878=test_kwargs I, [2024-05-26T03:16:01.997279 #3453513] INFO -- : [201/883] 3494878=test_ws I, [2024-05-26T03:16:02.001726 #3453513] INFO -- : [202/883] 3494878=test_gem_commands_environment_command I, [2024-05-26T03:16:02.052353 #3453513] INFO -- : [203/883] 3494878=test_m17n I, [2024-05-26T03:16:02.070625 #3453513] INFO -- : [204/883] 3494879=test_workspace I, [2024-05-26T03:16:02.091157 #3453513] INFO -- : [205/883] 3494888=test_weakmap I, [2024-05-26T03:16:02.138723 #3453513] INFO -- : [206/883] 3494878=test_yjit I, [2024-05-26T03:16:02.148444 #3453513] INFO -- : [207/883] 3494878=test_kill_ring I, [2024-05-26T03:16:02.154366 #3453513] INFO -- : [208/883] 3494878=test_ns_spki I, [2024-05-26T03:16:02.187771 #3453513] INFO -- : [209/883] 3494878=test_framework I, [2024-05-26T03:16:02.192202 #3453513] INFO -- : [210/883] 3494870=test_argf I, [2024-05-26T03:16:02.204784 #3453513] INFO -- : [211/883] 3494883=test_gem_request_set_lockfile I, [2024-05-26T03:16:02.214006 #3453513] INFO -- : [212/883] 3494878=test_raise_exception I, [2024-05-26T03:16:02.258275 #3453513] INFO -- : [213/883] 3494880=test_protect I, [2024-05-26T03:16:02.260857 #3453513] INFO -- : [214/883] 3494880=test_win32ole_typelib I, [2024-05-26T03:16:02.263233 #3453513] INFO -- : [215/883] 3494880=test_tree_builder I, [2024-05-26T03:16:02.266501 #3453513] INFO -- : [216/883] 3494885=test_gem_resolver_dependency_request I, [2024-05-26T03:16:02.268179 #3453513] INFO -- : [217/883] 3494880=test_hash I, [2024-05-26T03:16:02.279762 #3453513] INFO -- : [218/883] 3494880=test_postponed_job I, [2024-05-26T03:16:02.287726 #3453513] INFO -- : [219/883] 3494885=test_alias_and_anchor I, [2024-05-26T03:16:02.291907 #3453513] INFO -- : [220/883] 3494885=test_external_new I, [2024-05-26T03:16:02.296420 #3453513] INFO -- : [221/883] 3494885=test_show_source I, [2024-05-26T03:16:02.306842 #3453513] INFO -- : [222/883] 3494885=test_set I, [2024-05-26T03:16:02.319530 #3453513] INFO -- : [223/883] 3494885=test_c_struct_entry I, [2024-05-26T03:16:02.351147 #3453513] INFO -- : [224/883] 3494879=test_lock_native_thread I, [2024-05-26T03:16:02.421173 #3453513] INFO -- : [225/883] 3494882=test_gem_commands_stale_command I, [2024-05-26T03:16:02.429687 #3453513] INFO -- : [226/883] 3494882=test_remote_fetch_error I, [2024-05-26T03:16:02.437092 #3453513] INFO -- : [227/883] 3494882=test_have_library I, [2024-05-26T03:16:02.462875 #3453513] INFO -- : [228/883] 3494883=test_line_editor I, [2024-05-26T03:16:02.471995 #3453513] INFO -- : [229/883] 3494883=ripper_test I, [2024-05-26T03:16:02.492903 #3453513] INFO -- : [230/883] 3494885=test_objspace I, [2024-05-26T03:16:02.610306 #3453513] INFO -- : [231/883] 3494879=test_undef I, [2024-05-26T03:16:02.619304 #3453513] INFO -- : [232/883] 3494879=test_string_memory I, [2024-05-26T03:16:02.645729 #3453513] INFO -- : [233/883] 3494880=comments_test I, [2024-05-26T03:16:02.655393 #3453513] INFO -- : [234/883] 3494880=test_sprintf I, [2024-05-26T03:16:02.686090 #3453513] INFO -- : [235/883] 3494879=test_gem_requirement I, [2024-05-26T03:16:02.692927 #3453513] INFO -- : [236/883] 3494881=test_gem_security_trust_dir I, [2024-05-26T03:16:02.727450 #3453513] INFO -- : [237/883] 3494881=test_macro I, [2024-05-26T03:16:02.744419 #3453513] INFO -- : [238/883] 3494875=test_frozen I, [2024-05-26T03:16:02.746536 #3453513] INFO -- : [239/883] 3494875=test_gem_ext_configure_builder I, [2024-05-26T03:16:02.775477 #3453513] INFO -- : [240/883] 3494875=test_pp I, [2024-05-26T03:16:02.777389 #3453513] INFO -- : [241/883] 3494881=test_verbose I, [2024-05-26T03:16:02.786872 #3453513] INFO -- : [242/883] 3494879=test_num2int I, [2024-05-26T03:16:02.797330 #3453513] INFO -- : [243/883] 3494879=test_nil I, [2024-05-26T03:16:02.803354 #3453513] INFO -- : [244/883] 3494879=test_rdoc_single_class I, [2024-05-26T03:16:02.806045 #3453513] INFO -- : [245/883] 3494875=test_zsh_completion I, [2024-05-26T03:16:02.806667 #3453513] INFO -- : [246/883] 3494879=test_exception I, [2024-05-26T03:16:02.809427 #3453513] INFO -- : [247/883] 3494881=test_iter_break I, [2024-05-26T03:16:02.810027 #3453513] INFO -- : [248/883] 3494875=test_address_resolve I, [2024-05-26T03:16:02.812100 #3453513] INFO -- : [249/883] 3494881=test_rdoc_token_stream I, [2024-05-26T03:16:02.813276 #3453513] INFO -- : [250/883] 3494879=test_config I, [2024-05-26T03:16:02.821556 #3453513] INFO -- : [251/883] 3494881=test_yaml_special_cases I, [2024-05-26T03:16:02.822001 #3453513] INFO -- : [252/883] 3494880=test_optarg I, [2024-05-26T03:16:02.828826 #3453513] INFO -- : [253/883] 3494881=test_gem_source_list I, [2024-05-26T03:16:02.834130 #3453513] INFO -- : [254/883] 3494875=test_assignment I, [2024-05-26T03:16:02.845954 #3453513] INFO -- : [255/883] 3494879=test_ifunless I, [2024-05-26T03:16:02.850499 #3453513] INFO -- : [256/883] 3494879=test_gem_commands_lock_command I, [2024-05-26T03:16:02.858970 #3453513] INFO -- : [257/883] 3494873=test_numeric I, [2024-05-26T03:16:02.873393 #3453513] INFO -- : [258/883] 3494879=test_common I, [2024-05-26T03:16:02.882123 #3453513] INFO -- : [259/883] 3494881=test_gem_spec_fetcher I, [2024-05-26T03:16:02.916351 #3453513] INFO -- : [260/883] 3494878=test_gem_command I, [2024-05-26T03:16:02.945803 #3453513] INFO -- : [261/883] 3494873=test_key_actor_vi I, [2024-05-26T03:16:02.959035 #3453513] INFO -- : [262/883] 3494880=test_bug-3571 I, [2024-05-26T03:16:02.974812 #3453513] INFO -- : [263/883] 3494880=test_hmac I, [2024-05-26T03:16:02.984890 #3453513] INFO -- : [264/883] 3494880=test_rdoc_markup_to_tt_only I, [2024-05-26T03:16:02.993027 #3453513] INFO -- : [265/883] 3494878=test_rdoc_tom_doc I, [2024-05-26T03:16:03.009309 #3453513] INFO -- : [266/883] 3494880=test_object_create_start I, [2024-05-26T03:16:03.012587 #3453513] INFO -- : [267/883] 3494880=test_at_exit I, [2024-05-26T03:16:03.013064 #3453513] INFO -- : [268/883] 3494878=test_command I, [2024-05-26T03:16:03.037518 #3453513] INFO -- : [269/883] 3494880=test_gem_ext_cargo_builder_unit I, [2024-05-26T03:16:03.052872 #3453513] INFO -- : [270/883] 3494880=test_gem_rdoc I, [2024-05-26T03:16:03.063796 #3453513] INFO -- : [271/883] 3494881=test_date I, [2024-05-26T03:16:03.072142 #3453513] INFO -- : [272/883] 3494881=test_rdoc_markup_paragraph I, [2024-05-26T03:16:03.076151 #3453513] INFO -- : [273/883] 3494881=test_enc_raise I, [2024-05-26T03:16:03.081466 #3453513] INFO -- : [274/883] 3494881=test_psych I, [2024-05-26T03:16:03.091984 #3453513] INFO -- : [275/883] 3494879=!Nothing_to_test I, [2024-05-26T03:16:03.092992 #3453513] INFO -- : [276/883] 3494879=test_kdf I, [2024-05-26T03:16:03.104695 #3453513] INFO -- : [277/883] 3494881=test_gem_doctor I, [2024-05-26T03:16:03.119396 #3453513] INFO -- : [278/883] 3494883=test_eval_history I, [2024-05-26T03:16:03.130931 #3453513] INFO -- : [279/883] 3494873=dispatcher_test I, [2024-05-26T03:16:03.149594 #3453513] INFO -- : [280/883] 3494881=test_kernel I, [2024-05-26T03:16:03.164496 #3453513] INFO -- : [281/883] 3494880=test_bug-5832 I, [2024-05-26T03:16:03.172016 #3453513] INFO -- : [282/883] 3494880=test_files_ext I, [2024-05-26T03:16:03.177016 #3453513] INFO -- : [283/883] 3494883=test_gem_silent_ui I, [2024-05-26T03:16:03.182685 #3453513] INFO -- : [284/883] 3494879=test_emitter I, [2024-05-26T03:16:03.186443 #3453513] INFO -- : [285/883] 3494879=test_rdoc_rdoc I, [2024-05-26T03:16:03.210843 #3453513] INFO -- : [286/883] 3494873=test_windows_1251 I, [2024-05-26T03:16:03.213338 #3453513] INFO -- : [287/883] 3494873=test_time I, [2024-05-26T03:16:03.216737 #3453513] INFO -- : [288/883] 3494883=test_buffering I, [2024-05-26T03:16:03.229631 #3453513] INFO -- : [289/883] 3494878=test_svcb_https I, [2024-05-26T03:16:03.229760 #3453513] INFO -- : [290/883] 3494887=test_gb18030 I, [2024-05-26T03:16:03.233598 #3453513] INFO -- : [291/883] 3494883=test_gem_uninstaller I, [2024-05-26T03:16:03.235366 #3453513] INFO -- : [292/883] 3494887=test_rdoc_i18n_text I, [2024-05-26T03:16:03.240020 #3453513] INFO -- : [293/883] 3494887=test_io_buffer I, [2024-05-26T03:16:03.240200 #3453513] INFO -- : [294/883] 3494880=test_key_name_check I, [2024-05-26T03:16:03.247836 #3453513] INFO -- : [295/883] 3494878=test_defined I, [2024-05-26T03:16:03.249073 #3453513] INFO -- : [296/883] 3494880=test_backtrace I, [2024-05-26T03:16:03.252632 #3453513] INFO -- : [297/883] 3494880=test_date_parse I, [2024-05-26T03:16:03.255144 #3453513] INFO -- : [298/883] 3494879=test_pkey_ec I, [2024-05-26T03:16:03.289534 #3453513] INFO -- : [299/883] 3494887=test_trick I, [2024-05-26T03:16:03.328538 #3453513] INFO -- : [300/883] 3494878=test_thread I, [2024-05-26T03:16:03.333894 #3453513] INFO -- : [301/883] 3494878=test_pipe I, [2024-05-26T03:16:03.337988 #3453513] INFO -- : [302/883] 3494879=test_rdoc_markup_to_rdoc I, [2024-05-26T03:16:03.364704 #3453513] INFO -- : [303/883] 3494880=test_rdoc_rd_inline_parser I, [2024-05-26T03:16:03.369345 #3453513] INFO -- : [304/883] 3494873=test_default_gems I, [2024-05-26T03:16:03.385725 #3453513] INFO -- : [305/883] 3494879=test_null I, [2024-05-26T03:16:03.387841 #3453513] INFO -- : [306/883] 3494879=test_win32ole_type I, [2024-05-26T03:16:03.393376 #3453513] INFO -- : [307/883] 3494879=test_mul I, [2024-05-26T03:16:03.398445 #3453513] INFO -- : [308/883] 3494880=test_rdoc_markup_attributes I, [2024-05-26T03:16:03.401324 #3453513] INFO -- : [309/883] 3494880=test_custom_command I, [2024-05-26T03:16:03.407651 #3453513] INFO -- : [310/883] 3494879=json_addition_test I, [2024-05-26T03:16:03.423271 #3453513] INFO -- : [311/883] 3494873=test_gem_dependency_resolution_error I, [2024-05-26T03:16:03.427196 #3453513] INFO -- : [312/883] 3494879=test_rdoc_parser I, [2024-05-26T03:16:03.428020 #3453513] INFO -- : [313/883] 3494873=test_qsort I, [2024-05-26T03:16:03.435819 #3453513] INFO -- : [314/883] 3494873=test_string I, [2024-05-26T03:16:03.445983 #3453513] INFO -- : [315/883] 3494879=test_rdoc_stats I, [2024-05-26T03:16:03.455775 #3453513] INFO -- : [316/883] 3494873=test_pattern_matching I, [2024-05-26T03:16:03.461053 #3453513] INFO -- : [317/883] 3494880=test_depth_first I, [2024-05-26T03:16:03.463236 #3453513] INFO -- : [318/883] 3494878=test_gem_request_set_lockfile_parser I, [2024-05-26T03:16:03.465063 #3453513] INFO -- : [319/883] 3494879=test_raise I, [2024-05-26T03:16:03.466341 #3453513] INFO -- : [320/883] 3494880=test_x509attr I, [2024-05-26T03:16:03.469640 #3453513] INFO -- : [321/883] 3494879=test_rdoc_store I, [2024-05-26T03:16:03.476752 #3453513] INFO -- : [322/883] 3494880=test_gem_validator I, [2024-05-26T03:16:03.478401 #3453513] INFO -- : [323/883] 3494873=test_fnmatch I, [2024-05-26T03:16:03.495830 #3453513] INFO -- : [324/883] 3494880=test_files_test_2 I, [2024-05-26T03:16:03.496540 #3453513] INFO -- : [325/883] 3494880=test_rdoc_markup_parser I, [2024-05-26T03:16:03.526576 #3453513] INFO -- : [326/883] 3494873=test_require_path_check I, [2024-05-26T03:16:03.531524 #3453513] INFO -- : [327/883] 3494880=test_folderitem2_invokeverb I, [2024-05-26T03:16:03.536111 #3453513] INFO -- : [328/883] 3494880=test_ole_methods I, [2024-05-26T03:16:03.537241 #3453513] INFO -- : [329/883] 3494880=test_erb_m17n I, [2024-05-26T03:16:03.546040 #3453513] INFO -- : [330/883] 3494880=test_date_conv I, [2024-05-26T03:16:03.549066 #3453513] INFO -- : [331/883] 3494880=test_optimization I, [2024-05-26T03:16:03.562085 #3453513] INFO -- : [332/883] 3494878=test_zlib I, [2024-05-26T03:16:03.610503 #3453513] INFO -- : [333/883] 3494888=test_cgi_tag_helper I, [2024-05-26T03:16:03.615678 #3453513] INFO -- : [334/883] 3494873=test_egrep_cpp I, [2024-05-26T03:16:03.628487 #3453513] INFO -- : [335/883] 3494888=test_gem_resolver_index_set I, [2024-05-26T03:16:03.631988 #3453513] INFO -- : [336/883] 3494882=test_gem_package_old I, [2024-05-26T03:16:03.659482 #3453513] INFO -- : [337/883] 3494888=test_gc_compact I, [2024-05-26T03:16:03.665535 #3453513] INFO -- : [338/883] 3494882=test_proc I, [2024-05-26T03:16:03.734934 #3453513] INFO -- : [339/883] 3494873=test_string I, [2024-05-26T03:16:03.805947 #3453513] INFO -- : [340/883] 3494881=test_str2big I, [2024-05-26T03:16:03.811058 #3453513] INFO -- : [341/883] 3494881=test_dot_dot I, [2024-05-26T03:16:03.835168 #3453513] INFO -- : [342/883] 3494881=test_c_struct_builder I, [2024-05-26T03:16:03.995976 #3453513] INFO -- : [343/883] 3494881=test_literal I, [2024-05-26T03:16:04.182146 #3453513] INFO -- : [344/883] 3494883=test_thread I, [2024-05-26T03:16:04.185601 #3453513] INFO -- : [345/883] 3494871=test_socket I, [2024-05-26T03:16:04.277437 #3453513] INFO -- : [346/883] 3494879=test_objectspace I, [2024-05-26T03:16:04.279464 #3453513] INFO -- : [347/883] 3494869=test_rdoc_markup_to_table_of_contents I, [2024-05-26T03:16:04.301158 #3453513] INFO -- : [348/883] 3494869=test_require_lib I, [2024-05-26T03:16:04.408430 #3453513] INFO -- : [349/883] 3494883=test_gem_install_update_options I, [2024-05-26T03:16:04.452607 #3453513] INFO -- : [350/883] 3494882=parse_test I, [2024-05-26T03:16:04.550720 #3453513] INFO -- : [351/883] 3494883=test_ractor I, [2024-05-26T03:16:04.572321 #3453513] INFO -- : [352/883] 3494883=test_severity I, [2024-05-26T03:16:04.574317 #3453513] INFO -- : [353/883] 3494883=test_gem_stream_ui I, [2024-05-26T03:16:04.580698 #3453513] INFO -- : [354/883] 3494875=test_rdoc_generator_ri I, [2024-05-26T03:16:04.584871 #3453513] INFO -- : [355/883] 3494875=test_extlibs I, [2024-05-26T03:16:04.683282 #3453513] INFO -- : [356/883] 3494883=test_ractor I, [2024-05-26T03:16:04.746864 #3453513] INFO -- : [357/883] 3494883=test_memory_view I, [2024-05-26T03:16:04.754018 #3453513] INFO -- : [358/883] 3494881=test_m17n_comb I, [2024-05-26T03:16:04.769167 #3453513] INFO -- : [359/883] 3494874=test_rdoc_markup_to_markdown I, [2024-05-26T03:16:04.800407 #3453513] INFO -- : [360/883] 3494874=test_json_tree I, [2024-05-26T03:16:04.824088 #3453513] INFO -- : [361/883] 3494874=test_rdoc_generator_pot_po I, [2024-05-26T03:16:04.825123 #3453513] INFO -- : [362/883] 3494874=test_ansi_with_terminfo I, [2024-05-26T03:16:04.890610 #3453513] INFO -- : [363/883] 3494874=test_parser_events I, [2024-05-26T03:16:04.919757 #3453513] INFO -- : [364/883] 3494883=test_reline I, [2024-05-26T03:16:04.959944 #3453513] INFO -- : [365/883] 3494874=test_case I, [2024-05-26T03:16:04.960514 #3453513] INFO -- : [366/883] 3494874=test_pkey I, [2024-05-26T03:16:05.056882 #3453513] INFO -- : [367/883] 3494874=test_gem_request_connection_pools I, [2024-05-26T03:16:05.060992 #3453513] INFO -- : [368/883] 3494884=test_grapheme_breaks I, [2024-05-26T03:16:05.093516 #3453513] INFO -- : [369/883] 3494884=test_gem_version_option I, [2024-05-26T03:16:05.151019 #3453513] INFO -- : [370/883] 3494884=test_cclass I, [2024-05-26T03:16:05.156855 #3453513] INFO -- : [371/883] 3494883=test_scan_args I, [2024-05-26T03:16:05.168346 #3453513] INFO -- : [372/883] 3494883=test_win32ole I, [2024-05-26T03:16:05.177564 #3453513] INFO -- : [373/883] 3494883=test_generic I, [2024-05-26T03:16:05.218403 #3453513] INFO -- : [374/883] 3494883=test_gem_text I, [2024-05-26T03:16:05.235752 #3453513] INFO -- : [375/883] 3494879=test_settracefunc I, [2024-05-26T03:16:05.253026 #3453513] INFO -- : [376/883] 3494884=test_enumerator_kw I, [2024-05-26T03:16:05.256855 #3453513] INFO -- : [377/883] 3494884=test_gem_ext_cargo_builder_link_flag_converter I, [2024-05-26T03:16:05.266225 #3453513] INFO -- : [378/883] 3494883=test_gem_commands_mirror I, [2024-05-26T03:16:05.272325 #3453513] INFO -- : [379/883] 3494883=test_sprintf_comb I, [2024-05-26T03:16:05.299916 #3453513] INFO -- : [380/883] 3494884=test_method_cache I, [2024-05-26T03:16:05.306567 #3453513] INFO -- : [381/883] 3494884=test_gem_request I, [2024-05-26T03:16:05.412628 #3453513] INFO -- : [382/883] 3494883=test_exception I, [2024-05-26T03:16:05.447228 #3453513] INFO -- : [383/883] 3494884=test_rand I, [2024-05-26T03:16:05.549814 #3453513] INFO -- : [384/883] 3494871=test_gem_package_tar_reader_entry I, [2024-05-26T03:16:05.561713 #3453513] INFO -- : [385/883] 3494876=test_gem_name_tuple I, [2024-05-26T03:16:05.575090 #3453513] INFO -- : [386/883] 3494876=test_bug_reporter I, [2024-05-26T03:16:05.727313 #3453513] INFO -- : [387/883] 3494886=test_gem_dependency_installer I, [2024-05-26T03:16:05.761728 #3453513] INFO -- : [388/883] 3494884=test_scalar I, [2024-05-26T03:16:05.768540 #3453513] INFO -- : [389/883] 3494884=test_gem_commands_info_command I, [2024-05-26T03:16:05.789716 #3453513] INFO -- : [390/883] 3494884=test_rdoc_cross_reference I, [2024-05-26T03:16:05.817513 #3453513] INFO -- : [391/883] 3494871=test_store I, [2024-05-26T03:16:05.867570 #3453513] INFO -- : [392/883] 3494876=test_case_options I, [2024-05-26T03:16:05.871369 #3453513] INFO -- : [393/883] 3494876=test_rdoc_text I, [2024-05-26T03:16:05.946311 #3453513] INFO -- : [394/883] 3494871=test_iso_8859 I, [2024-05-26T03:16:05.983165 #3453513] INFO -- : [395/883] 3494871=test_tcp I, [2024-05-26T03:16:06.005653 #3453513] INFO -- : [396/883] 3494887=test_data I, [2024-05-26T03:16:06.017274 #3453513] INFO -- : [397/883] 3494887=test_date_new I, [2024-05-26T03:16:06.022994 #3453513] INFO -- : [398/883] 3494887=index_write_test I, [2024-05-26T03:16:06.026854 #3453513] INFO -- : [399/883] 3494887=test_require I, [2024-05-26T03:16:06.029498 #3453513] INFO -- : [400/883] 3494887=test_date_time I, [2024-05-26T03:16:06.037698 #3453513] INFO -- : [401/883] 3494876=test_rdoc_markup_to_joined_paragraph I, [2024-05-26T03:16:06.039781 #3453513] INFO -- : [402/883] 3494876=test_gem_safe_yaml I, [2024-05-26T03:16:06.044241 #3453513] INFO -- : [403/883] 3494887=test_syntax I, [2024-05-26T03:16:06.047985 #3453513] INFO -- : [404/883] 3494876=test_rdoc_parser_ruby I, [2024-05-26T03:16:06.058346 #3453513] INFO -- : [405/883] 3494871=test_open-uri I, [2024-05-26T03:16:06.059925 #3453513] INFO -- : [406/883] 3494872=test_httpresponse I, [2024-05-26T03:16:06.163384 #3453513] INFO -- : [407/883] 3494872=test_stream I, [2024-05-26T03:16:06.193490 #3453513] INFO -- : [408/883] 3494879=test_nil2vtempty I, [2024-05-26T03:16:06.195036 #3453513] INFO -- : [409/883] 3494879=test_rdoc_context I, [2024-05-26T03:16:06.196120 #3453513] INFO -- : [410/883] 3494872=test_gem_resolver_composed_set I, [2024-05-26T03:16:06.201656 #3453513] INFO -- : [411/883] 3494884=test_safe_load I, [2024-05-26T03:16:06.209355 #3453513] INFO -- : [412/883] 3494884=test_gem_resolver I, [2024-05-26T03:16:06.210415 #3453513] INFO -- : [413/883] 3494888=test_gem_commands_dependency_command I, [2024-05-26T03:16:06.212098 #3453513] INFO -- : [414/883] 3494870=test_rdoc_markup_attribute_manager I, [2024-05-26T03:16:06.242984 #3453513] INFO -- : [415/883] 3494874=test_name_error I, [2024-05-26T03:16:06.246448 #3453513] INFO -- : [416/883] 3494870=test_enumerator I, [2024-05-26T03:16:06.287819 #3453513] INFO -- : [417/883] 3494888=test_flags I, [2024-05-26T03:16:06.363627 #3453513] INFO -- : [418/883] 3494872=test_inadvertent_creation I, [2024-05-26T03:16:06.370076 #3453513] INFO -- : [419/883] 3494874=test_gem_commands_which_command I, [2024-05-26T03:16:06.416429 #3453513] INFO -- : [420/883] 3494884=test_shift_jis I, [2024-05-26T03:16:06.420901 #3453513] INFO -- : [421/883] 3494884=test_http I, [2024-05-26T03:16:06.424814 #3453513] INFO -- : [422/883] 3494884=test_gem_commands_specification_command I, [2024-05-26T03:16:06.436209 #3453513] INFO -- : [423/883] 3494874=test_logdevice I, [2024-05-26T03:16:06.499402 #3453513] INFO -- : [424/883] 3494872=test_arity I, [2024-05-26T03:16:06.504048 #3453513] INFO -- : [425/883] 3494872=test_gem_ext_rake_builder I, [2024-05-26T03:16:06.528988 #3453513] INFO -- : [426/883] 3494884=test_gc I, [2024-05-26T03:16:06.686510 #3453513] INFO -- : [427/883] 3494875=test_x509cert I, [2024-05-26T03:16:06.694863 #3453513] INFO -- : [428/883] 3494876=test_err_in_callback I, [2024-05-26T03:16:06.695780 #3453513] INFO -- : [429/883] 3494876=test_gem_resolver_lock_specification I, [2024-05-26T03:16:06.730831 #3453513] INFO -- : [430/883] 3494876=test_pack I, [2024-05-26T03:16:06.769845 #3453513] INFO -- : [431/883] 3494881=test_last_thread I, [2024-05-26T03:16:06.824159 #3453513] INFO -- : [432/883] 3494878=test_process I, [2024-05-26T03:16:06.902206 #3453513] INFO -- : [433/883] 3494871=test_gem_source_local I, [2024-05-26T03:16:06.985910 #3453513] INFO -- : [434/883] 3494875=test_gem_security_policy I, [2024-05-26T03:16:07.072798 #3453513] INFO -- : [435/883] 3494876=test_hash_create I, [2024-05-26T03:16:07.080947 #3453513] INFO -- : [436/883] 3494876=test_stringchar I, [2024-05-26T03:16:07.102735 #3453513] INFO -- : [437/883] 3494879=test_uncorrectable_name_check I, [2024-05-26T03:16:07.126258 #3453513] INFO -- : [438/883] 3494871=newline_test I, [2024-05-26T03:16:07.127853 #3453513] INFO -- : [439/883] 3494879=test_thread_fd_close I, [2024-05-26T03:16:07.144754 #3453513] INFO -- : [440/883] 3494879=test_passing_block I, [2024-05-26T03:16:07.149195 #3453513] INFO -- : [441/883] 3494879=test_rdoc_markdown_test I, [2024-05-26T03:16:07.186937 #3453513] INFO -- : [442/883] 3494876=test_rdoc_normal_module I, [2024-05-26T03:16:07.246860 #3453513] INFO -- : [443/883] 3494876=test_c_union_entity I, [2024-05-26T03:16:07.277797 #3453513] INFO -- : [444/883] 3494874=test_logperiod I, [2024-05-26T03:16:07.280519 #3453513] INFO -- : [445/883] 3494875=test_securerandom I, [2024-05-26T03:16:07.282866 #3453513] INFO -- : [446/883] 3494874=test_switch_hitter I, [2024-05-26T03:16:07.295714 #3453513] INFO -- : [447/883] 3494874=test_flush I, [2024-05-26T03:16:07.298693 #3453513] INFO -- : [448/883] 3494874=test_singleton I, [2024-05-26T03:16:07.306458 #3453513] INFO -- : [449/883] 3494871=test_io_console I, [2024-05-26T03:16:07.308111 #3453513] INFO -- : [450/883] 3494874=test_unix I, [2024-05-26T03:16:07.309855 #3453513] INFO -- : [451/883] 3494875=test_enc_associate I, [2024-05-26T03:16:07.315092 #3453513] INFO -- : [452/883] 3494876=test_lazy_enumerator I, [2024-05-26T03:16:07.340209 #3453513] INFO -- : [453/883] 3494872=ruby_api_test I, [2024-05-26T03:16:07.341061 #3453513] INFO -- : [454/883] 3494874=test_find_executable I, [2024-05-26T03:16:07.369953 #3453513] INFO -- : [455/883] 3494874=test_coder I, [2024-05-26T03:16:07.377319 #3453513] INFO -- : [456/883] 3494888=test_symbol I, [2024-05-26T03:16:07.386861 #3453513] INFO -- : [457/883] 3494874=test_gem_commands_pristine_command I, [2024-05-26T03:16:07.399205 #3453513] INFO -- : [458/883] 3494882=test_context I, [2024-05-26T03:16:07.550559 #3453513] INFO -- : [459/883] 3494882=test_nofree I, [2024-05-26T03:16:07.551556 #3453513] INFO -- : [460/883] 3494882=test_function_entry I, [2024-05-26T03:16:07.557778 #3453513] INFO -- : [461/883] 3494882=test_pkcs7 I, [2024-05-26T03:16:07.638359 #3453513] INFO -- : [462/883] 3494872=test_gem_resolver_requirement_list I, [2024-05-26T03:16:07.643522 #3453513] INFO -- : [463/883] 3494872=test_arith_seq_beg_len_step I, [2024-05-26T03:16:07.696439 #3453513] INFO -- : [464/883] 3494876=test_coderange I, [2024-05-26T03:16:07.703652 #3453513] INFO -- : [465/883] 3494876=location_test I, [2024-05-26T03:16:07.704392 #3453513] INFO -- : [466/883] 3494882=test_symbol I, [2024-05-26T03:16:07.709785 #3453513] INFO -- : [467/883] 3494882=test_mailto I, [2024-05-26T03:16:07.721262 #3453513] INFO -- : [468/883] 3494872=test_rdoc_generator_darkfish I, [2024-05-26T03:16:07.739201 #3453513] INFO -- : [469/883] 3494882=test_rdoc_comment I, [2024-05-26T03:16:07.794914 #3453513] INFO -- : [470/883] 3494882=test_resize I, [2024-05-26T03:16:07.822155 #3453513] INFO -- : [471/883] 3494882=test_error_highlight I, [2024-05-26T03:16:07.833933 #3453513] INFO -- : [472/883] 3494876=test_http_request I, [2024-05-26T03:16:07.838896 #3453513] INFO -- : [473/883] 3494881=test_gem_source_fetch_problem I, [2024-05-26T03:16:07.847059 #3453513] INFO -- : [474/883] 3494881=json_generic_object_test I, [2024-05-26T03:16:07.861366 #3453513] INFO -- : [475/883] 3494881=test_numeric I, [2024-05-26T03:16:07.870385 #3453513] INFO -- : [476/883] 3494869=test_member I, [2024-05-26T03:16:07.877521 #3453513] INFO -- : [477/883] 3494881=test_cgi_multipart I, [2024-05-26T03:16:07.883400 #3453513] INFO -- : [478/883] 3494869=test_word I, [2024-05-26T03:16:07.886518 #3453513] INFO -- : [479/883] 3494869=test_gem_commands_cleanup_command I, [2024-05-26T03:16:07.909702 #3453513] INFO -- : [480/883] 3494876=test_ractor_compatibility I, [2024-05-26T03:16:07.964630 #3453513] INFO -- : [481/883] 3494875=test_dir I, [2024-05-26T03:16:08.000382 #3453513] INFO -- : [482/883] 3494883=test_date_ractor I, [2024-05-26T03:16:08.079745 #3453513] INFO -- : [483/883] 3494881=test_gem_console_ui I, [2024-05-26T03:16:08.087420 #3453513] INFO -- : [484/883] 3494881=test_autoconf I, [2024-05-26T03:16:08.105928 #3453513] INFO -- : [485/883] 3494881=test_eval I, [2024-05-26T03:16:08.111604 #3453513] INFO -- : [486/883] 3494881=test_win32ole_variant I, [2024-05-26T03:16:08.116734 #3453513] INFO -- : [487/883] 3494881=test_ipaddr I, [2024-05-26T03:16:08.148177 #3453513] INFO -- : [488/883] 3494872=test_history I, [2024-05-26T03:16:08.157761 #3453513] INFO -- : [489/883] 3494881=test_mixed_unicode_escapes I, [2024-05-26T03:16:08.163965 #3453513] INFO -- : [490/883] 3494881=test_rdoc_markup_to_ansi I, [2024-05-26T03:16:08.180782 #3453513] INFO -- : [491/883] 3494886=test_gem_resolver_api_specification I, [2024-05-26T03:16:08.196979 #3453513] INFO -- : [492/883] 3494881=test_merge_keys I, [2024-05-26T03:16:08.205504 #3453513] INFO -- : [493/883] 3494881=test_rdoc_extend I, [2024-05-26T03:16:08.218009 #3453513] INFO -- : [494/883] 3494886=test_gem_specification I, [2024-05-26T03:16:08.224775 #3453513] INFO -- : [495/883] 3494872=test_enum I, [2024-05-26T03:16:08.258659 #3453513] INFO -- : [496/883] 3494883=test_threadgroup I, [2024-05-26T03:16:08.259542 #3453513] INFO -- : [497/883] 3494881=test_have_macro I, [2024-05-26T03:16:08.260507 #3453513] INFO -- : [498/883] 3494877=test_complex2 I, [2024-05-26T03:16:08.282559 #3453513] INFO -- : [499/883] 3494875=test_resolve_symbol I, [2024-05-26T03:16:08.287727 #3453513] INFO -- : [500/883] 3494877=test_gem_package I, [2024-05-26T03:16:08.337523 #3453513] INFO -- : [501/883] 3494879=ractor_test I, [2024-05-26T03:16:08.353274 #3453513] INFO -- : [502/883] 3494875=test_trace I, [2024-05-26T03:16:08.368395 #3453513] INFO -- : [503/883] 3494875=test_rdoc_generator_json_index I, [2024-05-26T03:16:08.391105 #3453513] INFO -- : [504/883] 3494879=test_time_tz I, [2024-05-26T03:16:08.396420 #3453513] INFO -- : [505/883] 3494875=test_win32ole_event I, [2024-05-26T03:16:08.401336 #3453513] INFO -- : [506/883] 3494875=test_bignum I, [2024-05-26T03:16:08.413633 #3453513] INFO -- : [507/883] 3494876=test_rdoc_class_module I, [2024-05-26T03:16:08.422933 #3453513] INFO -- : [508/883] 3494882=test_gem_ci_detector I, [2024-05-26T03:16:08.433011 #3453513] INFO -- : [509/883] 3494882=test_win32ole_variable I, [2024-05-26T03:16:08.435079 #3453513] INFO -- : [510/883] 3494879=test_arity I, [2024-05-26T03:16:08.437909 #3453513] INFO -- : [511/883] 3494882=test_stringio I, [2024-05-26T03:16:08.440588 #3453513] INFO -- : [512/883] 3494879=test_io_wait_uncommon I, [2024-05-26T03:16:08.445261 #3453513] INFO -- : [513/883] 3494879=test_rb_str_dup I, [2024-05-26T03:16:08.447392 #3453513] INFO -- : [514/883] 3494879=test_reline_key I, [2024-05-26T03:16:08.452377 #3453513] INFO -- : [515/883] 3494879=test_singleton_function I, [2024-05-26T03:16:08.453461 #3453513] INFO -- : [516/883] 3494879=test_ancdata I, [2024-05-26T03:16:08.458785 #3453513] INFO -- : [517/883] 3494879=test_alias I, [2024-05-26T03:16:08.469988 #3453513] INFO -- : [518/883] 3494869=test_timeout I, [2024-05-26T03:16:08.527719 #3453513] INFO -- : [519/883] 3494882=test_marshal I, [2024-05-26T03:16:08.615812 #3453513] INFO -- : [520/883] 3494879=test_unicode_normalize I, [2024-05-26T03:16:08.625027 #3453513] INFO -- : [521/883] 3494874=test_weakref I, [2024-05-26T03:16:08.802283 #3453513] INFO -- : [522/883] 3494874=test_nonblock I, [2024-05-26T03:16:08.810721 #3453513] INFO -- : [523/883] 3494881=test_my_integer I, [2024-05-26T03:16:08.815679 #3453513] INFO -- : [524/883] 3494874=test_thread I, [2024-05-26T03:16:08.822978 #3453513] INFO -- : [525/883] 3494881=json_ext_parser_test I, [2024-05-26T03:16:08.823561 #3453513] INFO -- : [526/883] 3494881=test_debugger_integration I, [2024-05-26T03:16:08.838643 #3453513] INFO -- : [527/883] 3494881=test_rendering I, [2024-05-26T03:16:08.845226 #3453513] INFO -- : [528/883] 3494881=test_ractor I, [2024-05-26T03:16:09.015645 #3453513] INFO -- : [529/883] 3494877=test_ssl I, [2024-05-26T03:16:09.023653 #3453513] INFO -- : [530/883] 3494888=test_gem_source_lock I, [2024-05-26T03:16:09.029831 #3453513] INFO -- : [531/883] 3494872=test_gem I, [2024-05-26T03:16:09.041442 #3453513] INFO -- : [532/883] 3494876=test_ractor I, [2024-05-26T03:16:09.058532 #3453513] INFO -- : [533/883] 3494876=test_gem_commands_open_command I, [2024-05-26T03:16:09.069880 #3453513] INFO -- : [534/883] 3494888=test_dns I, [2024-05-26T03:16:09.133999 #3453513] INFO -- : [535/883] 3494876=parse_stream_test I, [2024-05-26T03:16:09.140029 #3453513] INFO -- : [536/883] 3494876=test_registry I, [2024-05-26T03:16:09.142149 #3453513] INFO -- : [537/883] 3494876=test_parser I, [2024-05-26T03:16:09.156585 #3453513] INFO -- : [538/883] 3494876=test_cgi_core I, [2024-05-26T03:16:09.174564 #3453513] INFO -- : [539/883] 3494882=test_gem_commands_setup_command I, [2024-05-26T03:16:09.179001 #3453513] INFO -- : [540/883] 3494876=test_dryrun I, [2024-05-26T03:16:09.200138 #3453513] INFO -- : [541/883] 3494876=test_integer I, [2024-05-26T03:16:09.203907 #3453513] INFO -- : [542/883] 3494869=desugar_compiler_test I, [2024-05-26T03:16:09.259970 #3453513] INFO -- : [543/883] 3494881=test_env I, [2024-05-26T03:16:09.261315 #3453513] INFO -- : [544/883] 3494883=test_rdoc_attr I, [2024-05-26T03:16:09.277871 #3453513] INFO -- : [545/883] 3494876=test_object_references I, [2024-05-26T03:16:09.289175 #3453513] INFO -- : [546/883] 3494876=test_usrmarshal I, [2024-05-26T03:16:09.294129 #3453513] INFO -- : [547/883] 3494869=test_gem_resolver_git_specification I, [2024-05-26T03:16:09.391142 #3453513] INFO -- : [548/883] 3494883=test_stat I, [2024-05-26T03:16:09.394526 #3453513] INFO -- : [549/883] 3494883=test_gem_request_set_lockfile_tokenizer I, [2024-05-26T03:16:09.440416 #3453513] INFO -- : [550/883] 3494883=test_have_func I, [2024-05-26T03:16:09.460569 #3453513] INFO -- : [551/883] 3494876=test_nextafter I, [2024-05-26T03:16:09.475205 #3453513] INFO -- : [552/883] 3494869=test_capacity I, [2024-05-26T03:16:09.482151 #3453513] INFO -- : [553/883] 3494869=test_call I, [2024-05-26T03:16:09.509389 #3453513] INFO -- : [554/883] 3494877=test_https_proxy I, [2024-05-26T03:16:09.513791 #3453513] INFO -- : [555/883] 3494877=test_rubygems I, [2024-05-26T03:16:09.525632 #3453513] INFO -- : [556/883] 3494888=test_super I, [2024-05-26T03:16:09.534632 #3453513] INFO -- : [557/883] 3494876=test_rubyoptions I, [2024-05-26T03:16:09.617427 #3453513] INFO -- : [558/883] 3494869=test_cgi_modruby I, [2024-05-26T03:16:09.626259 #3453513] INFO -- : [559/883] 3494869=test_integer I, [2024-05-26T03:16:09.702777 #3453513] INFO -- : [560/883] 3494877=test_ast I, [2024-05-26T03:16:09.896356 #3453513] INFO -- : [561/883] 3494882=test_gem_request_set_gem_dependency_api I, [2024-05-26T03:16:09.988634 #3453513] INFO -- : [562/883] 3494871=test_lambda I, [2024-05-26T03:16:10.055141 #3453513] INFO -- : [563/883] 3494871=test_random_formatter I, [2024-05-26T03:16:10.081048 #3453513] INFO -- : [564/883] 3494871=test_helper I, [2024-05-26T03:16:10.081185 #3453513] INFO -- : [565/883] 3494871=test_jaro_winkler I, [2024-05-26T03:16:10.090190 #3453513] INFO -- : [566/883] 3494888=test_webauthn_listener I, [2024-05-26T03:16:10.102290 #3453513] INFO -- : [567/883] 3494871=test_rdoc_code_object I, [2024-05-26T03:16:10.139468 #3453513] INFO -- : [568/883] 3494888=test_x509store I, [2024-05-26T03:16:10.157430 #3453513] INFO -- : [569/883] 3494882=test_update I, [2024-05-26T03:16:10.163045 #3453513] INFO -- : [570/883] 3494882=test_fips I, [2024-05-26T03:16:10.218866 #3453513] INFO -- : [571/883] 3494886=test_x509name I, [2024-05-26T03:16:10.229231 #3453513] INFO -- : [572/883] 3494886=test_transcode I, [2024-05-26T03:16:10.440408 #3453513] INFO -- : [573/883] 3494886=test_eval I, [2024-05-26T03:16:10.447628 #3453513] INFO -- : [574/883] 3494882=json_generator_test I, [2024-05-26T03:16:10.483993 #3453513] INFO -- : [575/883] 3494871=test_config I, [2024-05-26T03:16:10.549524 #3453513] INFO -- : [576/883] 3494882=test_gem_resolver_vendor_set I, [2024-05-26T03:16:10.559255 #3453513] INFO -- : [577/883] 3494888=test_enumerable I, [2024-05-26T03:16:10.562424 #3453513] INFO -- : [578/883] 3494888=test_gem_safe_marshal I, [2024-05-26T03:16:10.573792 #3453513] INFO -- : [579/883] 3494882=test_gem_resolver_api_set I, [2024-05-26T03:16:10.627071 #3453513] INFO -- : [580/883] 3494882=test_rdoc_ri_paths I, [2024-05-26T03:16:10.651384 #3453513] INFO -- : [581/883] 3494882=test_ts I, [2024-05-26T03:16:10.728098 #3453513] INFO -- : [582/883] 3494886=test_ensured I, [2024-05-26T03:16:10.812343 #3453513] INFO -- : [583/883] 3494886=library_symbols_test I, [2024-05-26T03:16:10.834454 #3453513] INFO -- : [584/883] 3494883=test_locale I, [2024-05-26T03:16:10.836172 #3453513] INFO -- : [585/883] 3494872=test_addr I, [2024-05-26T03:16:10.850134 #3453513] INFO -- : [586/883] 3494883=test_gem_uri_formatter I, [2024-05-26T03:16:10.859467 #3453513] INFO -- : [587/883] 3494871=test_erb_command I, [2024-05-26T03:16:10.869922 #3453513] INFO -- : [588/883] 3494883=test_helper I, [2024-05-26T03:16:10.873778 #3453513] INFO -- : [589/883] 3494872=test_encoding I, [2024-05-26T03:16:10.880467 #3453513] INFO -- : [590/883] 3494886=test_project_sanity I, [2024-05-26T03:16:10.881629 #3453513] INFO -- : [591/883] 3494883=test_range I, [2024-05-26T03:16:10.907162 #3453513] INFO -- : [592/883] 3494871=test_constant I, [2024-05-26T03:16:10.953615 #3453513] INFO -- : [593/883] 3494886=test_pty I, [2024-05-26T03:16:11.084472 #3453513] INFO -- : [594/883] 3494888=test_dup I, [2024-05-26T03:16:11.104875 #3453513] INFO -- : [595/883] 3494872=command_line_test I, [2024-05-26T03:16:11.109568 #3453513] INFO -- : [596/883] 3494872=test_data_error I, [2024-05-26T03:16:11.173421 #3453513] INFO -- : [597/883] 3494875=bom_test I, [2024-05-26T03:16:11.179521 #3453513] INFO -- : [598/883] 3494872=test_force_exit I, [2024-05-26T03:16:11.230361 #3453513] INFO -- : [599/883] 3494872=test_file I, [2024-05-26T03:16:11.232332 #3453513] INFO -- : [600/883] 3494875=unescape_test I, [2024-05-26T03:16:11.259885 #3453513] INFO -- : [601/883] 3494882=test_ostruct I, [2024-05-26T03:16:11.277775 #3453513] INFO -- : [602/883] 3494888=test_udp I, [2024-05-26T03:16:11.281327 #3453513] INFO -- : [603/883] 3494888=static_inspect_test I, [2024-05-26T03:16:11.330965 #3453513] INFO -- : [604/883] 3494880=errors_test I, [2024-05-26T03:16:11.345226 #3453513] INFO -- : [605/883] 3494888=test_gem_commands_check_command I, [2024-05-26T03:16:11.362221 #3453513] INFO -- : [606/883] 3494888=test_regexp I, [2024-05-26T03:16:11.440866 #3453513] INFO -- : [607/883] 3494882=test_vm_dump I, [2024-05-26T03:16:11.441541 #3453513] INFO -- : [608/883] 3494882=test_rdoc_markup_document I, [2024-05-26T03:16:11.444844 #3453513] INFO -- : [609/883] 3494880=test_integer_comb I, [2024-05-26T03:16:11.464806 #3453513] INFO -- : [610/883] 3494886=test_tmpdir I, [2024-05-26T03:16:11.474131 #3453513] INFO -- : [611/883] 3494882=test_ractor I, [2024-05-26T03:16:11.551117 #3453513] INFO -- : [612/883] 3494882=test_type I, [2024-05-26T03:16:11.561510 #3453513] INFO -- : [613/883] 3494882=test_pointer I, [2024-05-26T03:16:11.574419 #3453513] INFO -- : [614/883] 3494886=test_big5 I, [2024-05-26T03:16:11.588584 #3453513] INFO -- : [615/883] 3494886=test_func I, [2024-05-26T03:16:11.635246 #3453513] INFO -- : [616/883] 3494883=test_rdoc_rd_block_parser I, [2024-05-26T03:16:11.694622 #3453513] INFO -- : [617/883] 3494883=test_signedness I, [2024-05-26T03:16:12.141724 #3453513] INFO -- : [618/883] 3494879=test_tsort I, [2024-05-26T03:16:12.149986 #3453513] INFO -- : [619/883] 3494879=test_change_word I, [2024-05-26T03:16:12.154264 #3453513] INFO -- : [620/883] 3494879=compiler_test I, [2024-05-26T03:16:12.173146 #3453513] INFO -- : [621/883] 3494879=test_flip I, [2024-05-26T03:16:12.241021 #3453513] INFO -- : [622/883] 3494879=test_timeout I, [2024-05-26T03:16:12.243180 #3453513] INFO -- : [623/883] 3494882=test_normalize I, [2024-05-26T03:16:12.245421 #3453513] INFO -- : [624/883] 3494882=test_ossl I, [2024-05-26T03:16:12.269451 #3453513] INFO -- : [625/883] 3494879=test_date_arith I, [2024-05-26T03:16:12.291414 #3453513] INFO -- : [626/883] 3494881=test_ruby_lex I, [2024-05-26T03:16:12.297485 #3453513] INFO -- : [627/883] 3494879=test_object I, [2024-05-26T03:16:12.495497 #3453513] INFO -- : [628/883] 3494881=test_gem_local_remote_options I, [2024-05-26T03:16:12.531816 #3453513] INFO -- : [629/883] 3494881=test_sleep I, [2024-05-26T03:16:12.571314 #3453513] INFO -- : [630/883] 3494875=test_key_actor_emacs I, [2024-05-26T03:16:12.747373 #3453513] INFO -- : [631/883] 3494875=test_gem_gemcutter_utilities I, [2024-05-26T03:16:12.754503 #3453513] INFO -- : [632/883] 3494879=test_basicinstructions I, [2024-05-26T03:16:12.779970 #3453513] INFO -- : [633/883] 3494869=test_gem_command_manager I, [2024-05-26T03:16:12.790945 #3453513] INFO -- : [634/883] 3494886=test_arithmetic_sequence I, [2024-05-26T03:16:12.799967 #3453513] INFO -- : [635/883] 3494886=test_cgi_header I, [2024-05-26T03:16:12.809568 #3453513] INFO -- : [636/883] 3494886=heredoc_dedent_test I, [2024-05-26T03:16:12.811577 #3453513] INFO -- : [637/883] 3494886=test_object I, [2024-05-26T03:16:12.816384 #3453513] INFO -- : [638/883] 3494886=version_test I, [2024-05-26T03:16:12.816627 #3453513] INFO -- : [639/883] 3494886=test_import I, [2024-05-26T03:16:12.828009 #3453513] INFO -- : [640/883] 3494879=test_gem_resolver_lock_set I, [2024-05-26T03:16:12.847666 #3453513] INFO -- : [641/883] 3494879=test_not I, [2024-05-26T03:16:12.855450 #3453513] INFO -- : [642/883] 3494879=test_rdoc_parser_markdown I, [2024-05-26T03:16:12.859561 #3453513] INFO -- : [643/883] 3494887=test_file_exhaustive I, [2024-05-26T03:16:12.877502 #3453513] INFO -- : [644/883] 3494879=test_gem_update_suggestion I, [2024-05-26T03:16:12.916908 #3453513] INFO -- : [645/883] 3494869=test_files_test I, [2024-05-26T03:16:12.972058 #3453513] INFO -- : [646/883] 3494869=test_logger I, [2024-05-26T03:16:12.982941 #3453513] INFO -- : [647/883] 3494879=test_delete I, [2024-05-26T03:16:12.992067 #3453513] INFO -- : [648/883] 3494869=test_win32ole_method I, [2024-05-26T03:16:12.996213 #3453513] INFO -- : [649/883] 3494869=test_fd_setsize I, [2024-05-26T03:16:12.996526 #3453513] INFO -- : [650/883] 3494869=test_continuation I, [2024-05-26T03:16:13.001737 #3453513] INFO -- : [651/883] 3494879=test_class_name_check I, [2024-05-26T03:16:13.009405 #3453513] INFO -- : [652/883] 3494869=test_keyword I, [2024-05-26T03:16:13.032891 #3453513] INFO -- : [653/883] 3494879=test_pkey_rsa I, [2024-05-26T03:16:13.070328 #3453513] INFO -- : [654/883] 3494875=test_weakkeymap I, [2024-05-26T03:16:13.214399 #3453513] INFO -- : [655/883] 3494870=test_gem_commands_push_command I, [2024-05-26T03:16:13.231823 #3453513] INFO -- : [656/883] 3494879=test_numhash I, [2024-05-26T03:16:13.241651 #3453513] INFO -- : [657/883] 3494879=test_date_strptime I, [2024-05-26T03:16:13.317939 #3453513] INFO -- : [658/883] 3494875=test_gem_package_task I, [2024-05-26T03:16:13.325646 #3453513] INFO -- : [659/883] 3494875=test_placearg I, [2024-05-26T03:16:13.351006 #3453513] INFO -- : [660/883] 3494871=test_rdoc_markup_hard_break I, [2024-05-26T03:16:13.358979 #3453513] INFO -- : [661/883] 3494871=test_gem_platform I, [2024-05-26T03:16:13.399859 #3453513] INFO -- : [662/883] 3494879=test_ssl_session I, [2024-05-26T03:16:13.430966 #3453513] INFO -- : [663/883] 3494871=test_lexer I, [2024-05-26T03:16:13.437605 #3453513] INFO -- : [664/883] 3494871=test_thread_cv I, [2024-05-26T03:16:13.453861 #3453513] INFO -- : [665/883] 3494875=test_gem_resolver_vendor_specification I, [2024-05-26T03:16:13.468764 #3453513] INFO -- : [666/883] 3494875=test_gem_commands_update_command I, [2024-05-26T03:16:13.515731 #3453513] INFO -- : [667/883] 3494869=test_gem_uri I, [2024-05-26T03:16:13.543052 #3453513] INFO -- : [668/883] 3494869=test_key_event_record I, [2024-05-26T03:16:13.622893 #3453513] INFO -- : [669/883] 3494869=test_notimplement I, [2024-05-26T03:16:13.627010 #3453513] INFO -- : [670/883] 3494869=test_random I, [2024-05-26T03:16:13.641505 #3453513] INFO -- : [671/883] 3494869=test_rdoc_method_attr I, [2024-05-26T03:16:13.654959 #3453513] INFO -- : [672/883] 3494885=test_filter I, [2024-05-26T03:16:13.698809 #3453513] INFO -- : [673/883] 3494885=test_gem_gem_runner I, [2024-05-26T03:16:13.740768 #3453513] INFO -- : [674/883] 3494870=test_data I, [2024-05-26T03:16:13.745704 #3453513] INFO -- : [675/883] 3494870=static_literals_test I, [2024-05-26T03:16:13.756136 #3453513] INFO -- : [676/883] 3494885=test_rdoc_generator_pot I, [2024-05-26T03:16:13.791719 #3453513] INFO -- : [677/883] 3494885=test_enumerator I, [2024-05-26T03:16:13.804281 #3453513] INFO -- : [678/883] 3494885=test_rdoc_parser_changelog I, [2024-05-26T03:16:13.816872 #3453513] INFO -- : [679/883] 3494869=parameters_signature_test I, [2024-05-26T03:16:13.817670 #3453513] INFO -- : [680/883] 3494886=test_koi8 I, [2024-05-26T03:16:13.824042 #3453513] INFO -- : [681/883] 3494869=test_unicode I, [2024-05-26T03:16:13.828385 #3453513] INFO -- : [682/883] 3494886=test_bn I, [2024-05-26T03:16:13.831029 #3453513] INFO -- : [683/883] 3494869=test_win32ole_param_event I, [2024-05-26T03:16:13.832449 #3453513] INFO -- : [684/883] 3494870=test_path I, [2024-05-26T03:16:13.834160 #3453513] INFO -- : [685/883] 3494869=redundant_return_test I, [2024-05-26T03:16:13.835965 #3453513] INFO -- : [686/883] 3494886=test_case_mapping I, [2024-05-26T03:16:13.838970 #3453513] INFO -- : [687/883] 3494869=test_tree_spell_checker I, [2024-05-26T03:16:13.840358 #3453513] INFO -- : [688/883] 3494870=test_http I, [2024-05-26T03:16:13.844537 #3453513] INFO -- : [689/883] 3494886=test_addrinfo I, [2024-05-26T03:16:13.857391 #3453513] INFO -- : [690/883] 3494885=test_bug-14834 I, [2024-05-26T03:16:13.865528 #3453513] INFO -- : [691/883] 3494869=test_date_compat I, [2024-05-26T03:16:13.866418 #3453513] INFO -- : [692/883] 3494869=test_rdoc_markup_to_html I, [2024-05-26T03:16:13.873427 #3453513] INFO -- : [693/883] 3494886=test_terminfo I, [2024-05-26T03:16:13.914316 #3453513] INFO -- : [694/883] 3494885=test_compile_prism I, [2024-05-26T03:16:13.924996 #3453513] INFO -- : [695/883] 3494886=test_key_stroke I, [2024-05-26T03:16:13.933713 #3453513] INFO -- : [696/883] 3494886=json_encoding_test I, [2024-05-26T03:16:13.943127 #3453513] INFO -- : [697/883] 3494886=test_color I, [2024-05-26T03:16:13.955192 #3453513] INFO -- : [698/883] 3494869=test_httpheader I, [2024-05-26T03:16:13.988914 #3453513] INFO -- : [699/883] 3494883=test_gem_resolver_local_specification I, [2024-05-26T03:16:14.002225 #3453513] INFO -- : [700/883] 3494886=test_rdoc_ri_driver I, [2024-05-26T03:16:14.002979 #3453513] INFO -- : [701/883] 3494883=test_set_len I, [2024-05-26T03:16:14.010590 #3453513] INFO -- : [702/883] 3494883=test_httpresponses I, [2024-05-26T03:16:14.017167 #3453513] INFO -- : [703/883] 3494869=test_encoding I, [2024-05-26T03:16:14.040437 #3453513] INFO -- : [704/883] 3494883=test_sockopt I, [2024-05-26T03:16:14.041476 #3453513] INFO -- : [705/883] 3494869=test_install I, [2024-05-26T03:16:14.047039 #3453513] INFO -- : [706/883] 3494883=test_rdoc_markup_to_label I, [2024-05-26T03:16:14.073583 #3453513] INFO -- : [707/883] 3494871=test_document I, [2024-05-26T03:16:14.081378 #3453513] INFO -- : [708/883] 3494883=test_acceptable I, [2024-05-26T03:16:14.082733 #3453513] INFO -- : [709/883] 3494871=test_euc_jp I, [2024-05-26T03:16:14.087248 #3453513] INFO -- : [710/883] 3494871=test_rdoc_generator_pot_po_entry I, [2024-05-26T03:16:14.096938 #3453513] INFO -- : [711/883] 3494871=test_pair I, [2024-05-26T03:16:14.206668 #3453513] INFO -- : [712/883] 3494883=test_win32ole_param I, [2024-05-26T03:16:14.211630 #3453513] INFO -- : [713/883] 3494883=test_gem_commands_yank_command I, [2024-05-26T03:16:14.219317 #3453513] INFO -- : [714/883] 3494869=test_chilled I, [2024-05-26T03:16:14.222755 #3453513] INFO -- : [715/883] 3494869=test_name_error_extension I, [2024-05-26T03:16:14.228680 #3453513] INFO -- : [716/883] 3494869=test_rdoc_i18n_locale I, [2024-05-26T03:16:14.231848 #3453513] INFO -- : [717/883] 3494885=test_primitive I, [2024-05-26T03:16:14.235707 #3453513] INFO -- : [718/883] 3494869=test_human_typo I, [2024-05-26T03:16:14.235774 #3453513] INFO -- : [719/883] 3494884=test_rbconfig I, [2024-05-26T03:16:14.241617 #3453513] INFO -- : [720/883] 3494869=test_digest I, [2024-05-26T03:16:14.243562 #3453513] INFO -- : [721/883] 3494885=test_ractor I, [2024-05-26T03:16:14.247698 #3453513] INFO -- : [722/883] 3494869=test_rdoc_servlet I, [2024-05-26T03:16:14.250590 #3453513] INFO -- : [723/883] 3494884=test_gem_security I, [2024-05-26T03:16:14.315592 #3453513] INFO -- : [724/883] 3494886=test_multi_irb_commands I, [2024-05-26T03:16:14.317031 #3453513] INFO -- : [725/883] 3494886=test_fiber I, [2024-05-26T03:16:14.323220 #3453513] INFO -- : [726/883] 3494885=test_open3 I, [2024-05-26T03:16:14.354068 #3453513] INFO -- : [727/883] 3494879=test_closure I, [2024-05-26T03:16:14.415109 #3453513] INFO -- : [728/883] 3494869=test_bundled_ca I, [2024-05-26T03:16:14.524818 #3453513] INFO -- : [729/883] 3494873=test_delegate I, [2024-05-26T03:16:14.547663 #3453513] INFO -- : [730/883] 3494873=test_popen_deadlock I, [2024-05-26T03:16:14.700183 #3453513] INFO -- : [731/883] 3494883=test_history I, [2024-05-26T03:16:14.716208 #3453513] INFO -- : [732/883] 3494883=test_mkmf I, [2024-05-26T03:16:14.751949 #3453513] INFO -- : [733/883] 3494883=test_date_marshal I, [2024-05-26T03:16:14.761630 #3453513] INFO -- : [734/883] 3494883=test_recursion I, [2024-05-26T03:16:14.767970 #3453513] INFO -- : [735/883] 3494883=test_exit I, [2024-05-26T03:16:14.777549 #3453513] INFO -- : [736/883] 3494875=test_rdoc_markup_pre_process I, [2024-05-26T03:16:14.821225 #3453513] INFO -- : [737/883] 3494883=test_printf I, [2024-05-26T03:16:14.834656 #3453513] INFO -- : [738/883] 3494883=test_to_ary_concat I, [2024-05-26T03:16:14.848953 #3453513] INFO -- : [739/883] 3494875=test_time I, [2024-05-26T03:16:14.857135 #3453513] INFO -- : [740/883] 3494880=test_webauthn_listener_response I, [2024-05-26T03:16:14.882159 #3453513] INFO -- : [741/883] 3494880=test_stream I, [2024-05-26T03:16:14.905146 #3453513] INFO -- : [742/883] 3494880=test_pinned I, [2024-05-26T03:16:14.919166 #3453513] INFO -- : [743/883] 3494880=test_emoji_breaks I, [2024-05-26T03:16:14.928980 #3453513] INFO -- : [744/883] 3494880=test_gem_bundler_version_finder I, [2024-05-26T03:16:14.955372 #3453513] INFO -- : [745/883] 3494880=test_within_pipe I, [2024-05-26T03:16:14.977693 #3453513] INFO -- : [746/883] 3494875=reflection_test I, [2024-05-26T03:16:14.979399 #3453513] INFO -- : [747/883] 3494880=test_files_lib I, [2024-05-26T03:16:14.980217 #3453513] INFO -- : [748/883] 3494880=test_gem_commands_unpack_command I, [2024-05-26T03:16:14.985046 #3453513] INFO -- : [749/883] 3494875=test_beginendblock I, [2024-05-26T03:16:15.080727 #3453513] INFO -- : [750/883] 3494873=test_help I, [2024-05-26T03:16:15.093166 #3453513] INFO -- : [751/883] 3494873=test_rdoc_markup_to_bs I, [2024-05-26T03:16:15.221949 #3453513] INFO -- : [752/883] 3494879=test_ocsp I, [2024-05-26T03:16:15.233108 #3453513] INFO -- : [753/883] 3494873=test_class I, [2024-05-26T03:16:15.242553 #3453513] INFO -- : [754/883] 3494873=test_pkey_dsa I, [2024-05-26T03:16:15.247475 #3453513] INFO -- : [755/883] 3494880=test_scheduler I, [2024-05-26T03:16:15.342404 #3453513] INFO -- : [756/883] 3494875=test_exception_at_throwing I, [2024-05-26T03:16:15.385413 #3453513] INFO -- : [757/883] 3494875=test_iseq I, [2024-05-26T03:16:15.406976 #3453513] INFO -- : [758/883] 3494880=test_rdoc_markup_heading I, [2024-05-26T03:16:15.409205 #3453513] INFO -- : [759/883] 3494880=test_io_m17n I, [2024-05-26T03:16:15.509247 #3453513] INFO -- : [760/883] 3494879=test_variable_name_check I, [2024-05-26T03:16:15.610034 #3453513] INFO -- : [761/883] 3494879=test_did_you_mean I, [2024-05-26T03:16:15.708162 #3453513] INFO -- : [762/883] 3494879=test_gem_commands_server_command I, [2024-05-26T03:16:15.716172 #3453513] INFO -- : [763/883] 3494879=test_append I, [2024-05-26T03:16:15.724440 #3453513] INFO -- : [764/883] 3494879=test_option I, [2024-05-26T03:16:15.808826 #3453513] INFO -- : [765/883] 3494879=test_cmethod I, [2024-05-26T03:16:15.817067 #3453513] INFO -- : [766/883] 3494879=test_tracer I, [2024-05-26T03:16:15.831842 #3453513] INFO -- : [767/883] 3494879=test_gem_commands_build_command I, [2024-05-26T03:16:15.883292 #3453513] INFO -- : [768/883] 3494875=test_interned_str I, [2024-05-26T03:16:15.888104 #3453513] INFO -- : [769/883] 3494875=test_case_comprehensive I, [2024-05-26T03:16:16.102212 #3453513] INFO -- : [770/883] 3494879=test_set I, [2024-05-26T03:16:16.153133 #3453513] INFO -- : [771/883] 3494879=test_struct I, [2024-05-26T03:16:16.177280 #3453513] INFO -- : [772/883] 3494885=test_gem_path_support I, [2024-05-26T03:16:16.211450 #3453513] INFO -- : [773/883] 3494885=test_files_test_1 I, [2024-05-26T03:16:16.511878 #3453513] INFO -- : [774/883] 3494880=test_rdoc_rd_inline I, [2024-05-26T03:16:16.515069 #3453513] INFO -- : [775/883] 3494880=test_mutex I, [2024-05-26T03:16:16.534398 #3453513] INFO -- : [776/883] 3494879=test_x509req I, [2024-05-26T03:16:16.600962 #3453513] INFO -- : [777/883] 3494883=test_key_error I, [2024-05-26T03:16:16.604629 #3453513] INFO -- : [778/883] 3494883=test_allocation I, [2024-05-26T03:16:16.659596 #3453513] INFO -- : [779/883] 3494869=test_div I, [2024-05-26T03:16:16.666269 #3453513] INFO -- : [780/883] 3494869=test_win32ole_variant_m I, [2024-05-26T03:16:16.667399 #3453513] INFO -- : [781/883] 3494869=test_engine I, [2024-05-26T03:16:16.667741 #3453513] INFO -- : [782/883] 3494869=test_deprecated I, [2024-05-26T03:16:16.674902 #3453513] INFO -- : [783/883] 3494869=test_color_printer I, [2024-05-26T03:16:16.683040 #3453513] INFO -- : [784/883] 3494879=test_insns_leaf I, [2024-05-26T03:16:16.686858 #3453513] INFO -- : [785/883] 3494879=test_serialize_subclasses I, [2024-05-26T03:16:16.687893 #3453513] INFO -- : [786/883] 3494869=test_cparser I, [2024-05-26T03:16:16.697858 #3453513] INFO -- : [787/883] 3494879=test_pkg_config I, [2024-05-26T03:16:16.707955 #3453513] INFO -- : [788/883] 3494879=fuzzer_test I, [2024-05-26T03:16:16.711320 #3453513] INFO -- : [789/883] 3494879=test_rdoc_markup_include I, [2024-05-26T03:16:16.716320 #3453513] INFO -- : [790/883] 3494879=test_sexp I, [2024-05-26T03:16:16.745694 #3453513] INFO -- : [791/883] 3494879=test_variable I, [2024-05-26T03:16:16.862733 #3453513] INFO -- : [792/883] 3494879=test_struct I, [2024-05-26T03:16:16.869709 #3453513] INFO -- : [793/883] 3494879=magic_comment_test I, [2024-05-26T03:16:16.875362 #3453513] INFO -- : [794/883] 3494879=test_rdoc_markup_to_html_snippet I, [2024-05-26T03:16:16.941557 #3453513] INFO -- : [795/883] 3494879=test_gem_source_subpath_problem I, [2024-05-26T03:16:17.030440 #3453513] INFO -- : [796/883] 3494879=test_dln I, [2024-05-26T03:16:17.032126 #3453513] INFO -- : [797/883] 3494879=json_common_interface_test I, [2024-05-26T03:16:17.068210 #3453513] INFO -- : [798/883] 3494879=test_win32ole_variant_outarg I, [2024-05-26T03:16:17.074346 #3453513] INFO -- : [799/883] 3494879=test_config I, [2024-05-26T03:16:17.175825 #3453513] INFO -- : [800/883] 3494873=json_parser_test I, [2024-05-26T03:16:17.186004 #3453513] INFO -- : [801/883] 3494879=test_nomethod_error I, [2024-05-26T03:16:17.189795 #3453513] INFO -- : [802/883] 3494879=test_cipher I, [2024-05-26T03:16:17.228339 #3453513] INFO -- : [803/883] 3494873=test_gem_security_signer I, [2024-05-26T03:16:17.245403 #3453513] INFO -- : [804/883] 3494879=test_new I, [2024-05-26T03:16:17.252110 #3453513] INFO -- : [805/883] 3494879=test_gem_resolver_git_set I, [2024-05-26T03:16:17.267138 #3453513] INFO -- : [806/883] 3494869=test_storage I, [2024-05-26T03:16:17.270151 #3453513] INFO -- : [807/883] 3494869=test_iterator I, [2024-05-26T03:16:17.295269 #3453513] INFO -- : [808/883] 3494871=test_string I, [2024-05-26T03:16:17.297728 #3453513] INFO -- : [809/883] 3494871=test_omap I, [2024-05-26T03:16:17.303198 #3453513] INFO -- : [810/883] 3494871=test_digest_extend I, [2024-05-26T03:16:17.308163 #3453513] INFO -- : [811/883] 3494872=test_shellwords I, [2024-05-26T03:16:17.311863 #3453513] INFO -- : [812/883] 3494872=test_debug I, [2024-05-26T03:16:17.319402 #3453513] INFO -- : [813/883] 3494872=pattern_test I, [2024-05-26T03:16:17.335075 #3453513] INFO -- : [814/883] 3494873=test_memory_view I, [2024-05-26T03:16:17.335646 #3453513] INFO -- : [815/883] 3494869=test_fixnum I, [2024-05-26T03:16:17.338906 #3453513] INFO -- : [816/883] 3494872=test_signal I, [2024-05-26T03:16:17.345876 #3453513] INFO -- : [817/883] 3494869=test_x509crl I, [2024-05-26T03:16:17.358254 #3453513] INFO -- : [818/883] 3494871=test_rdoc_rd I, [2024-05-26T03:16:17.359064 #3453513] INFO -- : [819/883] 3494873=test_cgi_session I, [2024-05-26T03:16:17.374623 #3453513] INFO -- : [820/883] 3494873=test_rdoc_top_level I, [2024-05-26T03:16:17.379238 #3453513] INFO -- : [821/883] 3494871=test_metaclass I, [2024-05-26T03:16:17.384522 #3453513] INFO -- : [822/883] 3494871=test_input_method I, [2024-05-26T03:16:17.417200 #3453513] INFO -- : [823/883] 3494871=test_windows_1252 I, [2024-05-26T03:16:17.424153 #3453513] INFO -- : [824/883] 3494871=test_process I, [2024-05-26T03:16:17.449644 #3453513] INFO -- : [825/883] 3494871=test_float I, [2024-05-26T03:16:17.517215 #3453513] INFO -- : [826/883] 3494869=test_require I, [2024-05-26T03:16:17.521549 #3453513] INFO -- : [827/883] 3494879=test_cgi_cookie I, [2024-05-26T03:16:17.533528 #3453513] INFO -- : [828/883] 3494881=test_dir_m17n I, [2024-05-26T03:16:17.536763 #3453513] INFO -- : [829/883] 3494879=test_gem_resolver_installer_set I, [2024-05-26T03:16:17.645326 #3453513] INFO -- : [830/883] 3494880=test_regex_casefold I, [2024-05-26T03:16:17.674280 #3453513] INFO -- : [831/883] 3494874=test_refinement I, [2024-05-26T03:16:17.700516 #3453513] INFO -- : [832/883] 3494873=test_gem_commands_signout_command I, [2024-05-26T03:16:17.714500 #3453513] INFO -- : [833/883] 3494873=test_gem_source_git I, [2024-05-26T03:16:17.772286 #3453513] INFO -- : [834/883] 3494879=test_rational2 I, [2024-05-26T03:16:17.798631 #3453513] INFO -- : [835/883] 3494879=test_rational I, [2024-05-26T03:16:17.823337 #3453513] INFO -- : [836/883] 3494879=test_assembler I, [2024-05-26T03:16:17.823411 #3453513] INFO -- : [837/883] 3494879=test_spell_checker I, [2024-05-26T03:16:17.837719 #3453513] INFO -- : [838/883] 3494879=attribute_write_test I, [2024-05-26T03:16:17.844321 #3453513] INFO -- : [839/883] 3494879=test_propertyputref I, [2024-05-26T03:16:17.848792 #3453513] INFO -- : [840/883] 3494879=test_erb I, [2024-05-26T03:16:17.899228 #3453513] INFO -- : [841/883] 3494879=test_x509ext I, [2024-05-26T03:16:17.911093 #3453513] INFO -- : [842/883] 3494879=test_gem_source_installed I, [2024-05-26T03:16:17.924294 #3453513] INFO -- : [843/883] 3494879=test_gem_commands_cert_command I, [2024-05-26T03:16:17.944540 #3453513] INFO -- : [844/883] 3494880=test_completion I, [2024-05-26T03:16:18.165799 #3453513] INFO -- : [845/883] 3494887=test_len I, [2024-05-26T03:16:18.168511 #3453513] INFO -- : [846/883] 3494887=test_yield_block I, [2024-05-26T03:16:18.173531 #3453513] INFO -- : [847/883] 3494887=test_rdoc_parser_simple I, [2024-05-26T03:16:18.184887 #3453513] INFO -- : [848/883] 3494887=test_load I, [2024-05-26T03:16:18.188836 #3453513] INFO -- : [849/883] 3494887=test_yamldbm I, [2024-05-26T03:16:18.192544 #3453513] INFO -- : [850/883] 3494887=test_gem_commands_rebuild_command I, [2024-05-26T03:16:18.232500 #3453513] INFO -- : [851/883] 3494887=test_abi I, [2024-05-26T03:16:18.246933 #3453513] INFO -- : [852/883] 3494873=test_provider I, [2024-05-26T03:16:18.276784 #3453513] INFO -- : [853/883] 3494885=test_evaluation I, [2024-05-26T03:16:18.283630 #3453513] INFO -- : [854/883] 3494885=test_https I, [2024-05-26T03:16:18.332123 #3453513] INFO -- : [855/883] 3494880=test_gem_ext_builder I, [2024-05-26T03:16:18.413527 #3453513] INFO -- : [856/883] 3494876=test_win32ole_method_event I, [2024-05-26T03:16:18.423353 #3453513] INFO -- : [857/883] 3494876=test_nesting_parser I, [2024-05-26T03:16:18.438763 #3453513] INFO -- : [858/883] 3494887=test_gem_dependency_list I, [2024-05-26T03:16:18.511735 #3453513] INFO -- : [859/883] 3494887=test_benchmark I, [2024-05-26T03:16:18.527968 #3453513] INFO -- : [860/883] 3494876=test_gem_commands_outdated_command I, [2024-05-26T03:16:18.529042 #3453513] INFO -- : [861/883] 3494873=test_array I, [2024-05-26T03:16:18.581942 #3453513] INFO -- : [862/883] 3494876=test_helper_method I, [2024-05-26T03:16:18.594367 #3453513] INFO -- : [863/883] 3494876=test_gem_package_tar_writer I, [2024-05-26T03:16:18.612244 #3453513] INFO -- : [864/883] 3494885=test_gem_source I, [2024-05-26T03:16:18.634516 #3453513] INFO -- : [865/883] 3494882=test_scalar_scanner I, [2024-05-26T03:16:18.639516 #3453513] INFO -- : [866/883] 3494882=test_boolean I, [2024-05-26T03:16:18.643999 #3453513] INFO -- : [867/883] 3494882=test_stringify_symbols I, [2024-05-26T03:16:18.652118 #3453513] INFO -- : [868/883] 3494882=integer_parse_test I, [2024-05-26T03:16:18.652797 #3453513] INFO -- : [869/883] 3494882=test_instrumentation_api I, [2024-05-26T03:16:18.681714 #3453513] INFO -- : [870/883] 3494876=test_monitor I, [2024-05-26T03:16:18.761969 #3453513] INFO -- : [871/883] 3494881=test_buffered_io I, [2024-05-26T03:16:18.831284 #3453513] INFO -- : [872/883] 3494881=test_configuration I, [2024-05-26T03:16:18.890629 #3453513] INFO -- : [873/883] 3494876=test_rubyvm I, [2024-05-26T03:16:18.893177 #3453513] INFO -- : [874/883] 3494876=test_rdoc_generator_markup I, [2024-05-26T03:16:18.901048 #3453513] INFO -- : [875/883] 3494876=test_whileuntil I, [2024-05-26T03:16:18.902896 #3453513] INFO -- : [876/883] 3494881=test_parser I, [2024-05-26T03:16:18.904511 #3453513] INFO -- : [877/883] 3494871=test_method_name_check I, [2024-05-26T03:16:18.906861 #3453513] INFO -- : [878/883] 3494876=test_arith_seq_extract I, [2024-05-26T03:16:18.913994 #3453513] INFO -- : [879/883] 3494885=test_ssl I, [2024-05-26T03:16:18.920166 #3453513] INFO -- : [880/883] 3494871=test_gem_ext_cargo_builder I, [2024-05-26T03:16:18.932541 #3453513] INFO -- : [881/883] 3494881=constant_path_node_test I, [2024-05-26T03:16:18.933463 #3453513] INFO -- : [882/883] 3494871=test_gem_request_set I, [2024-05-26T03:16:18.945239 #3453513] INFO -- : [883/883] 3494881=test_module I, [2024-05-26T03:16:35.502365 #3453513] INFO -- : Finished tests in 35.925150s, 733.8592 tests/s, 260422.1859 assertions/s. I, [2024-05-26T03:16:35.503093 #3453513] INFO -- : 26364 tests, 9355706 assertions, 0 failures, 0 errors, 306 skips I, [2024-05-26T03:16:35.503107 #3453513] INFO -- : I, [2024-05-26T03:16:35.503113 #3453513] INFO -- : ruby -v: ruby 3.4.0dev (2024-05-25T17:47:07Z master d2c4363e0c) [x86_64-linux] I, [2024-05-26T03:16:35.505131 #3453513] INFO -- : $$$[end] "make yes-test-all TESTOPTS='--stderr-on-failure' TESTS='-j20'" exit with 0. I, [2024-05-26T03:16:35.505288 #3453513] INFO -- : $$$[beg] make yes-test-rubyspec MSPECOPT='--error-output stderr --debug -j' TESTS='-j20' I, [2024-05-26T03:16:35.594213 #3453513] INFO -- : BASERUBY = /usr/bin/ruby --disable=gems I, [2024-05-26T03:16:35.594274 #3453513] INFO -- : CC = gcc I, [2024-05-26T03:16:35.594288 #3453513] INFO -- : LD = ld I, [2024-05-26T03:16:35.594299 #3453513] INFO -- : LDSHARED = gcc -shared I, [2024-05-26T03:16:35.594312 #3453513] INFO -- : CFLAGS = -O3 -fno-fast-math -ggdb3 -Wall -Wextra -Wdeprecated-declarations -Wdiv-by-zero -Wduplicated-cond -Wimplicit-function-declaration -Wimplicit-int -Wpointer-arith -Wwrite-strings -Wold-style-definition -Wimplicit-fallthrough=0 -Wmissing-noreturn -Wno-cast-function-type -Wno-constant-logical-operand -Wno-long-long -Wno-missing-field-initializers -Wno-overlength-strings -Wno-packed-bitfield-compat -Wno-parentheses-equality -Wno-self-assign -Wno-tautological-compare -Wno-unused-parameter -Wno-unused-value -Wsuggest-attribute=format -Wsuggest-attribute=noreturn -Wunused-variable -Wmisleading-indentation -Wundef -fPIC I, [2024-05-26T03:16:35.594325 #3453513] INFO -- : XCFLAGS = -U_FORTIFY_SOURCE -D_FORTIFY_SOURCE=2 -fstack-protector-strong -fno-strict-overflow -fvisibility=hidden -fexcess-precision=standard -DRUBY_EXPORT -I. -I.ext/include/x86_64-linux -I/tmp/ruby/src/trunk/include -I/tmp/ruby/src/trunk -I/tmp/ruby/src/trunk/prism -I/tmp/ruby/src/trunk/enc/unicode/15.0.0 I, [2024-05-26T03:16:35.594336 #3453513] INFO -- : CPPFLAGS = I, [2024-05-26T03:16:35.594347 #3453513] INFO -- : DLDFLAGS = -Wl,--compress-debug-sections=zlib -Wl,-soname,libruby.so.3.4 -fstack-protector-strong I, [2024-05-26T03:16:35.594358 #3453513] INFO -- : SOLIBS = -lz -lrt -lrt -lgmp -ldl -lcrypt -lm -lpthread I, [2024-05-26T03:16:35.594368 #3453513] INFO -- : LANG = en_US.UTF-8 I, [2024-05-26T03:16:35.594377 #3453513] INFO -- : LC_ALL = I, [2024-05-26T03:16:35.594388 #3453513] INFO -- : LC_CTYPE = I, [2024-05-26T03:16:35.594397 #3453513] INFO -- : MFLAGS = I, [2024-05-26T03:16:35.594407 #3453513] INFO -- : RUSTC = no I, [2024-05-26T03:16:35.594418 #3453513] INFO -- : YJIT_RUSTC_ARGS = --crate-name=yjit --crate-type=staticlib --edition=2021 -g -C lto=thin -C opt-level=3 -C overflow-checks=on '--out-dir=/tmp/ruby/build/trunk/yjit/target/release/' /tmp/ruby/src/trunk/yjit/src/lib.rs I, [2024-05-26T03:16:35.594898 #3453513] INFO -- : gcc (Ubuntu 11.4.0-1ubuntu1~22.04) 11.4.0 I, [2024-05-26T03:16:35.594950 #3453513] INFO -- : Copyright (C) 2021 Free Software Foundation, Inc. I, [2024-05-26T03:16:35.594964 #3453513] INFO -- : This is free software; see the source for copying conditions. There is NO I, [2024-05-26T03:16:35.594977 #3453513] INFO -- : warranty; not even for MERCHANTABILITY or FITNESS FOR A PARTICULAR PURPOSE. I, [2024-05-26T03:16:35.594988 #3453513] INFO -- : I, [2024-05-26T03:16:35.596679 #3453513] INFO -- : generating enc.mk I, [2024-05-26T03:16:35.714698 #3453513] INFO -- : generating encdb.h I, [2024-05-26T03:16:35.738292 #3453513] INFO -- : encdb.h unchanged I, [2024-05-26T03:16:35.739327 #3453513] INFO -- : making enc I, [2024-05-26T03:16:35.756622 #3453513] INFO -- : make[1]: Entering directory '/tmp/ruby/build/trunk' I, [2024-05-26T03:16:35.756680 #3453513] INFO -- : make[1]: Nothing to be done for 'enc'. I, [2024-05-26T03:16:35.756694 #3453513] INFO -- : make[1]: Leaving directory '/tmp/ruby/build/trunk' I, [2024-05-26T03:16:35.757390 #3453513] INFO -- : making srcs under enc I, [2024-05-26T03:16:35.787048 #3453513] INFO -- : make[1]: Entering directory '/tmp/ruby/build/trunk' I, [2024-05-26T03:16:35.787117 #3453513] INFO -- : make[1]: Nothing to be done for 'srcs'. I, [2024-05-26T03:16:35.787135 #3453513] INFO -- : make[1]: Leaving directory '/tmp/ruby/build/trunk' I, [2024-05-26T03:16:35.788058 #3453513] INFO -- : generating transdb.h I, [2024-05-26T03:16:35.890629 #3453513] INFO -- : transdb.h unchanged I, [2024-05-26T03:16:35.892173 #3453513] INFO -- : making trans I, [2024-05-26T03:16:35.926559 #3453513] INFO -- : make[1]: Entering directory '/tmp/ruby/build/trunk' I, [2024-05-26T03:16:35.926629 #3453513] INFO -- : make[1]: Nothing to be done for 'trans'. I, [2024-05-26T03:16:35.926643 #3453513] INFO -- : make[1]: Leaving directory '/tmp/ruby/build/trunk' I, [2024-05-26T03:16:35.927293 #3453513] INFO -- : making encs I, [2024-05-26T03:16:35.964974 #3453513] INFO -- : make[1]: Entering directory '/tmp/ruby/build/trunk' I, [2024-05-26T03:16:35.965040 #3453513] INFO -- : make[1]: Nothing to be done for 'encs'. I, [2024-05-26T03:16:35.965057 #3453513] INFO -- : make[1]: Leaving directory '/tmp/ruby/build/trunk' I, [2024-05-26T03:16:35.966890 #3453513] INFO -- : generating makefiles ext/configure-ext.mk I, [2024-05-26T03:16:35.993661 #3453513] INFO -- : ext/configure-ext.mk updated I, [2024-05-26T03:16:35.996090 #3453513] INFO -- : make[1]: Entering directory '/tmp/ruby/build/trunk' I, [2024-05-26T03:16:37.398375 #3453513] INFO -- : make[1]: Leaving directory '/tmp/ruby/build/trunk' I, [2024-05-26T03:16:37.399153 #3453513] INFO -- : generating makefile exts.mk I, [2024-05-26T03:16:37.436063 #3453513] INFO -- : exts.mk unchanged I, [2024-05-26T03:16:37.440846 #3453513] INFO -- : make[1]: Entering directory '/tmp/ruby/build/trunk' I, [2024-05-26T03:16:37.759227 #3453513] INFO -- : make[2]: Entering directory '/tmp/ruby/build/trunk/ext/coverage' I, [2024-05-26T03:16:37.763098 #3453513] INFO -- : make[2]: Leaving directory '/tmp/ruby/build/trunk/ext/coverage' I, [2024-05-26T03:16:37.769355 #3453513] INFO -- : make[2]: Entering directory '/tmp/ruby/build/trunk/ext/date' I, [2024-05-26T03:16:37.774453 #3453513] INFO -- : make[2]: Leaving directory '/tmp/ruby/build/trunk/ext/date' I, [2024-05-26T03:16:37.778280 #3453513] INFO -- : make[2]: Entering directory '/tmp/ruby/build/trunk/ext/digest' I, [2024-05-26T03:16:37.787760 #3453513] INFO -- : make[2]: Leaving directory '/tmp/ruby/build/trunk/ext/digest' I, [2024-05-26T03:16:37.814729 #3453513] INFO -- : make[2]: Entering directory '/tmp/ruby/build/trunk/ext/digest/sha2' I, [2024-05-26T03:16:37.819531 #3453513] INFO -- : make[2]: Leaving directory '/tmp/ruby/build/trunk/ext/digest/sha2' I, [2024-05-26T03:16:37.840397 #3453513] INFO -- : make[2]: Entering directory '/tmp/ruby/build/trunk/ext/fiddle' I, [2024-05-26T03:16:37.849892 #3453513] INFO -- : make[2]: Leaving directory '/tmp/ruby/build/trunk/ext/fiddle' I, [2024-05-26T03:16:37.854892 #3453513] INFO -- : make[2]: Entering directory '/tmp/ruby/build/trunk/ext/io/console' I, [2024-05-26T03:16:37.859087 #3453513] INFO -- : make[2]: Leaving directory '/tmp/ruby/build/trunk/ext/io/console' I, [2024-05-26T03:16:37.872007 #3453513] INFO -- : make[2]: Entering directory '/tmp/ruby/build/trunk/ext/json' I, [2024-05-26T03:16:37.882543 #3453513] INFO -- : make[2]: Leaving directory '/tmp/ruby/build/trunk/ext/json' I, [2024-05-26T03:16:37.897664 #3453513] INFO -- : make[2]: Entering directory '/tmp/ruby/build/trunk/ext/monitor' I, [2024-05-26T03:16:37.901681 #3453513] INFO -- : make[2]: Leaving directory '/tmp/ruby/build/trunk/ext/monitor' I, [2024-05-26T03:16:37.909229 #3453513] INFO -- : make[2]: Entering directory '/tmp/ruby/build/trunk/ext/objspace' I, [2024-05-26T03:16:37.915433 #3453513] INFO -- : make[2]: Leaving directory '/tmp/ruby/build/trunk/ext/objspace' I, [2024-05-26T03:16:37.935451 #3453513] INFO -- : make[2]: Entering directory '/tmp/ruby/build/trunk/ext/openssl' I, [2024-05-26T03:16:37.953578 #3453513] INFO -- : make[2]: Leaving directory '/tmp/ruby/build/trunk/ext/openssl' I, [2024-05-26T03:16:37.956562 #3453513] INFO -- : make[2]: Entering directory '/tmp/ruby/build/trunk/ext/pathname' I, [2024-05-26T03:16:37.959333 #3453513] INFO -- : make[2]: Leaving directory '/tmp/ruby/build/trunk/ext/pathname' I, [2024-05-26T03:16:37.966039 #3453513] INFO -- : make[2]: Entering directory '/tmp/ruby/build/trunk/ext/psych' I, [2024-05-26T03:16:37.987243 #3453513] INFO -- : make[2]: Leaving directory '/tmp/ruby/build/trunk/ext/psych' I, [2024-05-26T03:16:37.992165 #3453513] INFO -- : make[2]: Entering directory '/tmp/ruby/build/trunk/ext/pty' I, [2024-05-26T03:16:37.996216 #3453513] INFO -- : make[2]: Leaving directory '/tmp/ruby/build/trunk/ext/pty' I, [2024-05-26T03:16:38.012314 #3453513] INFO -- : make[2]: Entering directory '/tmp/ruby/build/trunk/ext/ripper' I, [2024-05-26T03:16:38.020696 #3453513] INFO -- : make[2]: Leaving directory '/tmp/ruby/build/trunk/ext/ripper' I, [2024-05-26T03:16:38.023164 #3453513] INFO -- : make[2]: Entering directory '/tmp/ruby/build/trunk/ext/rubyvm' I, [2024-05-26T03:16:38.026580 #3453513] INFO -- : make[2]: Leaving directory '/tmp/ruby/build/trunk/ext/rubyvm' I, [2024-05-26T03:16:38.039917 #3453513] INFO -- : make[2]: Entering directory '/tmp/ruby/build/trunk/ext/socket' I, [2024-05-26T03:16:38.049941 #3453513] INFO -- : make[2]: Leaving directory '/tmp/ruby/build/trunk/ext/socket' I, [2024-05-26T03:16:38.068094 #3453513] INFO -- : make[2]: Entering directory '/tmp/ruby/build/trunk/.bundle/gems/bigdecimal-3.1.8/ext/bigdecimal' I, [2024-05-26T03:16:38.095722 #3453513] INFO -- : make[2]: Leaving directory '/tmp/ruby/build/trunk/.bundle/gems/bigdecimal-3.1.8/ext/bigdecimal' I, [2024-05-26T03:16:38.097639 #3453513] INFO -- : make[2]: Entering directory '/tmp/ruby/build/trunk/.bundle/gems/debug-1.9.2/ext/debug' I, [2024-05-26T03:16:38.119495 #3453513] INFO -- : make[2]: Leaving directory '/tmp/ruby/build/trunk/.bundle/gems/debug-1.9.2/ext/debug' I, [2024-05-26T03:16:38.121383 #3453513] INFO -- : make[2]: Entering directory '/tmp/ruby/build/trunk/.bundle/gems/nkf-0.2.0/ext/nkf' I, [2024-05-26T03:16:38.147718 #3453513] INFO -- : make[2]: Leaving directory '/tmp/ruby/build/trunk/.bundle/gems/nkf-0.2.0/ext/nkf' I, [2024-05-26T03:16:38.149783 #3453513] INFO -- : make[2]: Entering directory '/tmp/ruby/build/trunk/.bundle/gems/racc-1.7.3/ext/racc/cparse' I, [2024-05-26T03:16:38.174139 #3453513] INFO -- : make[2]: Leaving directory '/tmp/ruby/build/trunk/.bundle/gems/racc-1.7.3/ext/racc/cparse' I, [2024-05-26T03:16:38.176032 #3453513] INFO -- : make[2]: Entering directory '/tmp/ruby/build/trunk/.bundle/gems/racc-1.8.0/ext/racc/cparse' I, [2024-05-26T03:16:38.197569 #3453513] INFO -- : make[2]: Leaving directory '/tmp/ruby/build/trunk/.bundle/gems/racc-1.8.0/ext/racc/cparse' I, [2024-05-26T03:16:38.199982 #3453513] INFO -- : make[2]: Entering directory '/tmp/ruby/build/trunk/.bundle/gems/rbs-3.4.4/ext/rbs_extension' I, [2024-05-26T03:16:38.228387 #3453513] INFO -- : make[2]: Leaving directory '/tmp/ruby/build/trunk/.bundle/gems/rbs-3.4.4/ext/rbs_extension' I, [2024-05-26T03:16:38.230359 #3453513] INFO -- : make[2]: Entering directory '/tmp/ruby/build/trunk/.bundle/gems/syslog-0.1.2/ext/syslog' I, [2024-05-26T03:16:38.253611 #3453513] INFO -- : make[2]: Leaving directory '/tmp/ruby/build/trunk/.bundle/gems/syslog-0.1.2/ext/syslog' I, [2024-05-26T03:16:38.278456 #3453513] INFO -- : make[2]: Entering directory '/tmp/ruby/build/trunk' I, [2024-05-26T03:16:38.344920 #3453513] INFO -- : make[2]: 'ruby' is up to date. I, [2024-05-26T03:16:38.344951 #3453513] INFO -- : make[2]: Leaving directory '/tmp/ruby/build/trunk' I, [2024-05-26T03:16:38.345218 #3453513] INFO -- : make[1]: Leaving directory '/tmp/ruby/build/trunk' I, [2024-05-26T03:16:38.349273 #3453513] INFO -- : make[1]: Entering directory '/tmp/ruby/build/trunk' I, [2024-05-26T03:16:38.349293 #3453513] INFO -- : make[1]: Nothing to be done for 'note'. I, [2024-05-26T03:16:38.349299 #3453513] INFO -- : make[1]: Leaving directory '/tmp/ruby/build/trunk' E, [2024-05-26T03:16:38.410912 #3453513] ERROR -- : $ /tmp/ruby/build/trunk/miniruby -I/tmp/ruby/src/trunk/lib /tmp/ruby/src/trunk/tool/runruby.rb --archdir=/tmp/ruby/build/trunk --extout=.ext -- /tmp/ruby/src/trunk/spec/mspec/bin/mspec-run -B /tmp/ruby/src/trunk/spec/default.mspec --error-output stderr --debug -fy -o /tmp/rubytest.egygbf/1-mspec-multi-0 E, [2024-05-26T03:16:38.411223 #3453513] ERROR -- : $ /tmp/ruby/build/trunk/miniruby -I/tmp/ruby/src/trunk/lib /tmp/ruby/src/trunk/tool/runruby.rb --archdir=/tmp/ruby/build/trunk --extout=.ext -- /tmp/ruby/src/trunk/spec/mspec/bin/mspec-run -B /tmp/ruby/src/trunk/spec/default.mspec --error-output stderr --debug -fy -o /tmp/rubytest.egygbf/2-mspec-multi-1 E, [2024-05-26T03:16:38.411436 #3453513] ERROR -- : $ /tmp/ruby/build/trunk/miniruby -I/tmp/ruby/src/trunk/lib /tmp/ruby/src/trunk/tool/runruby.rb --archdir=/tmp/ruby/build/trunk --extout=.ext -- /tmp/ruby/src/trunk/spec/mspec/bin/mspec-run -B /tmp/ruby/src/trunk/spec/default.mspec --error-output stderr --debug -fy -o /tmp/rubytest.egygbf/3-mspec-multi-2 E, [2024-05-26T03:16:38.411625 #3453513] ERROR -- : $ /tmp/ruby/build/trunk/miniruby -I/tmp/ruby/src/trunk/lib /tmp/ruby/src/trunk/tool/runruby.rb --archdir=/tmp/ruby/build/trunk --extout=.ext -- /tmp/ruby/src/trunk/spec/mspec/bin/mspec-run -B /tmp/ruby/src/trunk/spec/default.mspec --error-output stderr --debug -fy -o /tmp/rubytest.egygbf/4-mspec-multi-3 E, [2024-05-26T03:16:38.411896 #3453513] ERROR -- : $ /tmp/ruby/build/trunk/miniruby -I/tmp/ruby/src/trunk/lib /tmp/ruby/src/trunk/tool/runruby.rb --archdir=/tmp/ruby/build/trunk --extout=.ext -- /tmp/ruby/src/trunk/spec/mspec/bin/mspec-run -B /tmp/ruby/src/trunk/spec/default.mspec --error-output stderr --debug -fy -o /tmp/rubytest.egygbf/5-mspec-multi-4 E, [2024-05-26T03:16:38.412128 #3453513] ERROR -- : $ /tmp/ruby/build/trunk/miniruby -I/tmp/ruby/src/trunk/lib /tmp/ruby/src/trunk/tool/runruby.rb --archdir=/tmp/ruby/build/trunk --extout=.ext -- /tmp/ruby/src/trunk/spec/mspec/bin/mspec-run -B /tmp/ruby/src/trunk/spec/default.mspec --error-output stderr --debug -fy -o /tmp/rubytest.egygbf/6-mspec-multi-5 E, [2024-05-26T03:16:38.412381 #3453513] ERROR -- : $ /tmp/ruby/build/trunk/miniruby -I/tmp/ruby/src/trunk/lib /tmp/ruby/src/trunk/tool/runruby.rb --archdir=/tmp/ruby/build/trunk --extout=.ext -- /tmp/ruby/src/trunk/spec/mspec/bin/mspec-run -B /tmp/ruby/src/trunk/spec/default.mspec --error-output stderr --debug -fy -o /tmp/rubytest.egygbf/7-mspec-multi-6 E, [2024-05-26T03:16:38.412525 #3453513] ERROR -- : $ /tmp/ruby/build/trunk/miniruby -I/tmp/ruby/src/trunk/lib /tmp/ruby/src/trunk/tool/runruby.rb --archdir=/tmp/ruby/build/trunk --extout=.ext -- /tmp/ruby/src/trunk/spec/mspec/bin/mspec-run -B /tmp/ruby/src/trunk/spec/default.mspec --error-output stderr --debug -fy -o /tmp/rubytest.egygbf/8-mspec-multi-7 E, [2024-05-26T03:16:38.412778 #3453513] ERROR -- : $ /tmp/ruby/build/trunk/miniruby -I/tmp/ruby/src/trunk/lib /tmp/ruby/src/trunk/tool/runruby.rb --archdir=/tmp/ruby/build/trunk --extout=.ext -- /tmp/ruby/src/trunk/spec/mspec/bin/mspec-run -B /tmp/ruby/src/trunk/spec/default.mspec --error-output stderr --debug -fy -o /tmp/rubytest.egygbf/9-mspec-multi-8 E, [2024-05-26T03:16:38.412937 #3453513] ERROR -- : $ /tmp/ruby/build/trunk/miniruby -I/tmp/ruby/src/trunk/lib /tmp/ruby/src/trunk/tool/runruby.rb --archdir=/tmp/ruby/build/trunk --extout=.ext -- /tmp/ruby/src/trunk/spec/mspec/bin/mspec-run -B /tmp/ruby/src/trunk/spec/default.mspec --error-output stderr --debug -fy -o /tmp/rubytest.egygbf/10-mspec-multi-9 E, [2024-05-26T03:16:38.413277 #3453513] ERROR -- : $ /tmp/ruby/build/trunk/miniruby -I/tmp/ruby/src/trunk/lib /tmp/ruby/src/trunk/tool/runruby.rb --archdir=/tmp/ruby/build/trunk --extout=.ext -- /tmp/ruby/src/trunk/spec/mspec/bin/mspec-run -B /tmp/ruby/src/trunk/spec/default.mspec --error-output stderr --debug -fy -o /tmp/rubytest.egygbf/11-mspec-multi-10 E, [2024-05-26T03:16:38.413509 #3453513] ERROR -- : $ /tmp/ruby/build/trunk/miniruby -I/tmp/ruby/src/trunk/lib /tmp/ruby/src/trunk/tool/runruby.rb --archdir=/tmp/ruby/build/trunk --extout=.ext -- /tmp/ruby/src/trunk/spec/mspec/bin/mspec-run -B /tmp/ruby/src/trunk/spec/default.mspec --error-output stderr --debug -fy -o /tmp/rubytest.egygbf/12-mspec-multi-11 E, [2024-05-26T03:16:38.413743 #3453513] ERROR -- : $ /tmp/ruby/build/trunk/miniruby -I/tmp/ruby/src/trunk/lib /tmp/ruby/src/trunk/tool/runruby.rb --archdir=/tmp/ruby/build/trunk --extout=.ext -- /tmp/ruby/src/trunk/spec/mspec/bin/mspec-run -B /tmp/ruby/src/trunk/spec/default.mspec --error-output stderr --debug -fy -o /tmp/rubytest.egygbf/13-mspec-multi-12 E, [2024-05-26T03:16:38.413942 #3453513] ERROR -- : $ /tmp/ruby/build/trunk/miniruby -I/tmp/ruby/src/trunk/lib /tmp/ruby/src/trunk/tool/runruby.rb --archdir=/tmp/ruby/build/trunk --extout=.ext -- /tmp/ruby/src/trunk/spec/mspec/bin/mspec-run -B /tmp/ruby/src/trunk/spec/default.mspec --error-output stderr --debug -fy -o /tmp/rubytest.egygbf/14-mspec-multi-13 E, [2024-05-26T03:16:38.414090 #3453513] ERROR -- : $ /tmp/ruby/build/trunk/miniruby -I/tmp/ruby/src/trunk/lib /tmp/ruby/src/trunk/tool/runruby.rb --archdir=/tmp/ruby/build/trunk --extout=.ext -- /tmp/ruby/src/trunk/spec/mspec/bin/mspec-run -B /tmp/ruby/src/trunk/spec/default.mspec --error-output stderr --debug -fy -o /tmp/rubytest.egygbf/15-mspec-multi-14 E, [2024-05-26T03:16:38.414328 #3453513] ERROR -- : $ /tmp/ruby/build/trunk/miniruby -I/tmp/ruby/src/trunk/lib /tmp/ruby/src/trunk/tool/runruby.rb --archdir=/tmp/ruby/build/trunk --extout=.ext -- /tmp/ruby/src/trunk/spec/mspec/bin/mspec-run -B /tmp/ruby/src/trunk/spec/default.mspec --error-output stderr --debug -fy -o /tmp/rubytest.egygbf/16-mspec-multi-15 E, [2024-05-26T03:16:38.414480 #3453513] ERROR -- : $ /tmp/ruby/build/trunk/miniruby -I/tmp/ruby/src/trunk/lib /tmp/ruby/src/trunk/tool/runruby.rb --archdir=/tmp/ruby/build/trunk --extout=.ext -- /tmp/ruby/src/trunk/spec/mspec/bin/mspec-run -B /tmp/ruby/src/trunk/spec/default.mspec --error-output stderr --debug -fy -o /tmp/rubytest.egygbf/17-mspec-multi-16 E, [2024-05-26T03:16:38.414682 #3453513] ERROR -- : $ /tmp/ruby/build/trunk/miniruby -I/tmp/ruby/src/trunk/lib /tmp/ruby/src/trunk/tool/runruby.rb --archdir=/tmp/ruby/build/trunk --extout=.ext -- /tmp/ruby/src/trunk/spec/mspec/bin/mspec-run -B /tmp/ruby/src/trunk/spec/default.mspec --error-output stderr --debug -fy -o /tmp/rubytest.egygbf/18-mspec-multi-17 E, [2024-05-26T03:16:38.416894 #3453513] ERROR -- : $ /tmp/ruby/build/trunk/miniruby -I/tmp/ruby/src/trunk/lib /tmp/ruby/src/trunk/tool/runruby.rb --archdir=/tmp/ruby/build/trunk --extout=.ext -- /tmp/ruby/src/trunk/spec/mspec/bin/mspec-run -B /tmp/ruby/src/trunk/spec/default.mspec --error-output stderr --debug -fy -o /tmp/rubytest.egygbf/19-mspec-multi-18 E, [2024-05-26T03:16:38.417304 #3453513] ERROR -- : $ /tmp/ruby/build/trunk/miniruby -I/tmp/ruby/src/trunk/lib /tmp/ruby/src/trunk/tool/runruby.rb --archdir=/tmp/ruby/build/trunk --extout=.ext -- /tmp/ruby/src/trunk/spec/mspec/bin/mspec-run -B /tmp/ruby/src/trunk/spec/default.mspec --error-output stderr --debug -fy -o /tmp/rubytest.egygbf/20-mspec-multi-19 I, [2024-05-26T03:16:38.586034 #3453513] INFO -- : ruby 3.4.0dev (2024-05-25T17:47:07Z master d2c4363e0c) [x86_64-linux] I, [2024-05-26T03:16:39.206635 #3453513] INFO -- : 0 ......................................................................... I, [2024-05-26T03:16:39.590672 #3453513] INFO -- : 73 ......................................................................... I, [2024-05-26T03:16:39.720596 #3453513] INFO -- : 146 ......................................................................... I, [2024-05-26T03:16:39.771497 #3453513] INFO -- : 219 ......................................................................... I, [2024-05-26T03:16:39.831802 #3453513] INFO -- : 292 ......................................................................... I, [2024-05-26T03:16:39.871558 #3453513] INFO -- : 365 ......................................................................... I, [2024-05-26T03:16:39.891131 #3453513] INFO -- : 438 ......................................................................... I, [2024-05-26T03:16:39.907773 #3453513] INFO -- : 511 ......................................................................... I, [2024-05-26T03:16:39.922693 #3453513] INFO -- : 584 ......................................................................... I, [2024-05-26T03:16:39.981367 #3453513] INFO -- : 657 ......................................................................... I, [2024-05-26T03:16:40.011381 #3453513] INFO -- : 730 ......................................................................... I, [2024-05-26T03:16:40.036311 #3453513] INFO -- : 803 ......................................................................... I, [2024-05-26T03:16:40.076978 #3453513] INFO -- : 876 ......................................................................... I, [2024-05-26T03:16:40.133461 #3453513] INFO -- : 949 ......................................................................... I, [2024-05-26T03:16:40.221880 #3453513] INFO -- : 1022 ......................................................................... I, [2024-05-26T03:16:40.391314 #3453513] INFO -- : 1095 ......................................................................... I, [2024-05-26T03:16:40.509518 #3453513] INFO -- : 1168 ......................................................................... I, [2024-05-26T03:16:40.578679 #3453513] INFO -- : 1241 ......................................................................... I, [2024-05-26T03:16:40.630364 #3453513] INFO -- : 1314 ......................................................................... I, [2024-05-26T03:16:40.647230 #3453513] INFO -- : 1387 ......................................................................... I, [2024-05-26T03:16:40.741862 #3453513] INFO -- : 1460 ......................................................................... I, [2024-05-26T03:16:41.186428 #3453513] INFO -- : 1533 ......................................................................... I, [2024-05-26T03:16:41.249854 #3453513] INFO -- : 1606 ......................................................................... I, [2024-05-26T03:16:41.435556 #3453513] INFO -- : 1679 ......................................................................... I, [2024-05-26T03:16:41.534573 #3453513] INFO -- : 1752 ......................................................................... I, [2024-05-26T03:16:41.606680 #3453513] INFO -- : 1825 ......................................................................... I, [2024-05-26T03:16:41.713773 #3453513] INFO -- : 1898 ......................................................................... I, [2024-05-26T03:16:41.775849 #3453513] INFO -- : 1971 ......................................................................... I, [2024-05-26T03:16:41.862553 #3453513] INFO -- : 2044 ......................................................................... I, [2024-05-26T03:16:41.906569 #3453513] INFO -- : 2117 ......................................................................... I, [2024-05-26T03:16:41.922916 #3453513] INFO -- : 2190 ......................................................................... I, [2024-05-26T03:16:41.944105 #3453513] INFO -- : 2263 ......................................................................... I, [2024-05-26T03:16:41.960993 #3453513] INFO -- : 2336 ......................................................................... I, [2024-05-26T03:16:41.995680 #3453513] INFO -- : 2409 ......................................................................... I, [2024-05-26T03:16:42.096821 #3453513] INFO -- : 2482 ......................................................................... I, [2024-05-26T03:16:42.128804 #3453513] INFO -- : 2555 ......................................................................... I, [2024-05-26T03:16:42.214466 #3453513] INFO -- : 2628 ......................................................................... I, [2024-05-26T03:16:42.313726 #3453513] INFO -- : 2701 ......................................................................... I, [2024-05-26T03:16:42.345900 #3453513] INFO -- : 2774 ......................................................................... I, [2024-05-26T03:16:42.407175 #3453513] INFO -- : 2847 ......................................................................... I, [2024-05-26T03:16:42.442508 #3453513] INFO -- : 2920 ......................................................................... I, [2024-05-26T03:16:42.467202 #3453513] INFO -- : 2993 ......................................................................... I, [2024-05-26T03:16:42.497824 #3453513] INFO -- : 3066 ......................................................................... I, [2024-05-26T03:16:42.510731 #3453513] INFO -- : 3139 ......................................................................... I, [2024-05-26T03:16:42.520849 #3453513] INFO -- : 3212 ......................................................................... I, [2024-05-26T03:16:42.552745 #3453513] INFO -- : 3285 ......................................................................... I, [2024-05-26T03:16:46.492837 #3453513] INFO -- : 3358 ......................................................................... I, [2024-05-26T03:16:46.519259 #3453513] INFO -- : I, [2024-05-26T03:16:46.519299 #3453513] INFO -- : I, [2024-05-26T03:16:46.519309 #3453513] INFO -- : Finished in 8.107564 seconds I, [2024-05-26T03:16:46.519319 #3453513] INFO -- : I, [2024-05-26T03:16:46.519326 #3453513] INFO -- : 3430 files, 32652 examples, 212449 expectations, 0 failures, 0 errors, 0 tagged I, [2024-05-26T03:16:46.521832 #3453513] INFO -- : $$$[end] "make yes-test-rubyspec MSPECOPT='--error-output stderr --debug -j' TESTS='-j20'" exit with 0.