# Logfile created on 2024-05-25 23:09:55 +0000 by logger.rb/v1.4.3 I, [2024-05-25T23:09:55.305328 #3104266] INFO -- : #, @formatter=nil, @logdev=#, @binmode=false, @mon_data=#, @mon_data_owner_object_id=860>>> I, [2024-05-25T23:09:55.305452 #3104266] INFO -- : $$$[beg] make update-unicode -j20 I, [2024-05-25T23:09:55.364232 #3104266] INFO -- : Downloading Unicode emoji 15.0 files... I, [2024-05-25T23:09:55.364392 #3104266] INFO -- : Downloading Unicode emoji 15.0 files... I, [2024-05-25T23:09:55.365139 #3104266] INFO -- : Downloading Unicode emoji 15.0 files... I, [2024-05-25T23:09:55.407168 #3104266] INFO -- : made symlink emoji/15.0/emoji-sequences.txt to /tmp/ruby/src/trunk/.downloaded-cache/emoji/15.0/emoji-sequences.txt I, [2024-05-25T23:09:55.407201 #3104266] INFO -- : downloading emoji/15.0/emoji-test.txt ... downloading emoji/15.0/emoji-sequences.txt ... /tmp/ruby/src/trunk/enc/unicode/data/emoji/15.0/emoji-sequences.txt already exists E, [2024-05-25T23:09:55.858921 #3104266] ERROR -- : /tmp/ruby/src/trunk/tool/downloader.rb:302:in `rescue in download': failed to download emoji/15.0/emoji-test.txt (RuntimeError) E, [2024-05-25T23:09:55.859070 #3104266] ERROR -- : OpenURI::HTTPError: 403 Forbidden: https://www.unicode.org/Public/emoji/15.0/emoji-test.txt E, [2024-05-25T23:09:55.859092 #3104266] ERROR -- : from /tmp/ruby/src/trunk/tool/downloader.rb:201:in `download' E, [2024-05-25T23:09:55.859107 #3104266] ERROR -- : from /tmp/ruby/src/trunk/tool/downloader.rb:136:in `download' E, [2024-05-25T23:09:55.859120 #3104266] ERROR -- : from /tmp/ruby/src/trunk/tool/downloader.rb:482:in `block in
' E, [2024-05-25T23:09:55.859135 #3104266] ERROR -- : from /tmp/ruby/src/trunk/tool/downloader.rb:465:in `each' E, [2024-05-25T23:09:55.859149 #3104266] ERROR -- : from /tmp/ruby/src/trunk/tool/downloader.rb:465:in `
' E, [2024-05-25T23:09:55.859162 #3104266] ERROR -- : /usr/lib/ruby/3.0.0/open-uri.rb:364:in `open_http': 403 Forbidden (OpenURI::HTTPError) E, [2024-05-25T23:09:55.859175 #3104266] ERROR -- : from /usr/lib/ruby/3.0.0/open-uri.rb:741:in `buffer_open' E, [2024-05-25T23:09:55.859199 #3104266] ERROR -- : from /usr/lib/ruby/3.0.0/open-uri.rb:212:in `block in open_loop' E, [2024-05-25T23:09:55.859212 #3104266] ERROR -- : from /usr/lib/ruby/3.0.0/open-uri.rb:210:in `catch' E, [2024-05-25T23:09:55.859226 #3104266] ERROR -- : from /usr/lib/ruby/3.0.0/open-uri.rb:210:in `open_loop' E, [2024-05-25T23:09:55.859238 #3104266] ERROR -- : from /usr/lib/ruby/3.0.0/open-uri.rb:151:in `open_uri' E, [2024-05-25T23:09:55.859251 #3104266] ERROR -- : from /usr/lib/ruby/3.0.0/open-uri.rb:721:in `open' E, [2024-05-25T23:09:55.859264 #3104266] ERROR -- : from /usr/lib/ruby/3.0.0/open-uri.rb:729:in `read' E, [2024-05-25T23:09:55.859277 #3104266] ERROR -- : from /tmp/ruby/src/trunk/tool/downloader.rb:247:in `block in download' E, [2024-05-25T23:09:55.859312 #3104266] ERROR -- : from /tmp/ruby/src/trunk/tool/downloader.rb:378:in `with_retry' E, [2024-05-25T23:09:55.859326 #3104266] ERROR -- : from /tmp/ruby/src/trunk/tool/downloader.rb:246:in `download' E, [2024-05-25T23:09:55.859343 #3104266] ERROR -- : from /tmp/ruby/src/trunk/tool/downloader.rb:136:in `download' E, [2024-05-25T23:09:55.859356 #3104266] ERROR -- : from /tmp/ruby/src/trunk/tool/downloader.rb:482:in `block in
' E, [2024-05-25T23:09:55.859369 #3104266] ERROR -- : from /tmp/ruby/src/trunk/tool/downloader.rb:465:in `each' E, [2024-05-25T23:09:55.859389 #3104266] ERROR -- : from /tmp/ruby/src/trunk/tool/downloader.rb:465:in `
' E, [2024-05-25T23:09:55.861720 #3104266] ERROR -- : /tmp/ruby/src/trunk/tool/downloader.rb:302:in `rescue in download': failed to download emoji/15.0/emoji-test.txt (RuntimeError) E, [2024-05-25T23:09:55.861798 #3104266] ERROR -- : OpenURI::HTTPError: 403 Forbidden: https://www.unicode.org/Public/emoji/15.0/emoji-test.txt E, [2024-05-25T23:09:55.861816 #3104266] ERROR -- : from /tmp/ruby/src/trunk/tool/downloader.rb:201:in `download' E, [2024-05-25T23:09:55.861847 #3104266] ERROR -- : from /tmp/ruby/src/trunk/tool/downloader.rb:136:in `download' E, [2024-05-25T23:09:55.861859 #3104266] ERROR -- : from /tmp/ruby/src/trunk/tool/downloader.rb:482:in `block in
' E, [2024-05-25T23:09:55.861870 #3104266] ERROR -- : from /tmp/ruby/src/trunk/tool/downloader.rb:465:in `each' E, [2024-05-25T23:09:55.861881 #3104266] ERROR -- : from /tmp/ruby/src/trunk/tool/downloader.rb:465:in `
' E, [2024-05-25T23:09:55.861892 #3104266] ERROR -- : /usr/lib/ruby/3.0.0/open-uri.rb:364:in `open_http': 403 Forbidden (OpenURI::HTTPError) E, [2024-05-25T23:09:55.861903 #3104266] ERROR -- : from /usr/lib/ruby/3.0.0/open-uri.rb:741:in `buffer_open' E, [2024-05-25T23:09:55.861913 #3104266] ERROR -- : from /usr/lib/ruby/3.0.0/open-uri.rb:212:in `block in open_loop' E, [2024-05-25T23:09:55.861922 #3104266] ERROR -- : from /usr/lib/ruby/3.0.0/open-uri.rb:210:in `catch' E, [2024-05-25T23:09:55.861936 #3104266] ERROR -- : from /usr/lib/ruby/3.0.0/open-uri.rb:210:in `open_loop' E, [2024-05-25T23:09:55.861946 #3104266] ERROR -- : from /usr/lib/ruby/3.0.0/open-uri.rb:151:in `open_uri' E, [2024-05-25T23:09:55.861956 #3104266] ERROR -- : from /usr/lib/ruby/3.0.0/open-uri.rb:721:in `open' E, [2024-05-25T23:09:55.861965 #3104266] ERROR -- : from /usr/lib/ruby/3.0.0/open-uri.rb:729:in `read' E, [2024-05-25T23:09:55.861975 #3104266] ERROR -- : from /tmp/ruby/src/trunk/tool/downloader.rb:247:in `block in download' E, [2024-05-25T23:09:55.861985 #3104266] ERROR -- : from /tmp/ruby/src/trunk/tool/downloader.rb:378:in `with_retry' E, [2024-05-25T23:09:55.861994 #3104266] ERROR -- : from /tmp/ruby/src/trunk/tool/downloader.rb:246:in `download' E, [2024-05-25T23:09:55.862004 #3104266] ERROR -- : from /tmp/ruby/src/trunk/tool/downloader.rb:136:in `download' E, [2024-05-25T23:09:55.862014 #3104266] ERROR -- : from /tmp/ruby/src/trunk/tool/downloader.rb:482:in `block in
' E, [2024-05-25T23:09:55.862026 #3104266] ERROR -- : from /tmp/ruby/src/trunk/tool/downloader.rb:465:in `each' E, [2024-05-25T23:09:55.862036 #3104266] ERROR -- : from /tmp/ruby/src/trunk/tool/downloader.rb:465:in `
' E, [2024-05-25T23:09:55.864039 #3104266] ERROR -- : make: *** [uncommon.mk:1756: /tmp/ruby/src/trunk/enc/unicode/data/emoji/15.0/emoji-zwj-sequences.txt] Error 1 E, [2024-05-25T23:09:55.864103 #3104266] ERROR -- : make: *** Waiting for unfinished jobs.... E, [2024-05-25T23:09:55.865718 #3104266] ERROR -- : make: *** [uncommon.mk:1756: /tmp/ruby/src/trunk/enc/unicode/data/emoji/15.0/emoji-sequences.txt] Error 1 E, [2024-05-25T23:09:55.865776 #3104266] ERROR -- : make: *** Deleting file '/tmp/ruby/src/trunk/enc/unicode/data/emoji/15.0/emoji-sequences.txt' E, [2024-05-25T23:09:56.287099 #3104266] ERROR -- : /tmp/ruby/src/trunk/tool/downloader.rb:302:in `rescue in download': failed to download emoji/15.0/emoji-sequences.txt (RuntimeError) E, [2024-05-25T23:09:56.287276 #3104266] ERROR -- : EOFError: end of file reached: https://www.unicode.org/Public/emoji/15.0/emoji-sequences.txt E, [2024-05-25T23:09:56.287299 #3104266] ERROR -- : from /tmp/ruby/src/trunk/tool/downloader.rb:201:in `download' E, [2024-05-25T23:09:56.287314 #3104266] ERROR -- : from /tmp/ruby/src/trunk/tool/downloader.rb:136:in `download' E, [2024-05-25T23:09:56.287327 #3104266] ERROR -- : from /tmp/ruby/src/trunk/tool/downloader.rb:482:in `block in
' E, [2024-05-25T23:09:56.287341 #3104266] ERROR -- : from /tmp/ruby/src/trunk/tool/downloader.rb:465:in `each' E, [2024-05-25T23:09:56.287354 #3104266] ERROR -- : from /tmp/ruby/src/trunk/tool/downloader.rb:465:in `
' E, [2024-05-25T23:09:56.287367 #3104266] ERROR -- : /usr/lib/ruby/3.0.0/net/protocol.rb:227:in `rbuf_fill': end of file reached (EOFError) E, [2024-05-25T23:09:56.287385 #3104266] ERROR -- : from /usr/lib/ruby/3.0.0/net/protocol.rb:193:in `readuntil' E, [2024-05-25T23:09:56.287399 #3104266] ERROR -- : from /usr/lib/ruby/3.0.0/net/protocol.rb:203:in `readline' E, [2024-05-25T23:09:56.287413 #3104266] ERROR -- : from /usr/lib/ruby/3.0.0/net/http/response.rb:42:in `read_status_line' E, [2024-05-25T23:09:56.287426 #3104266] ERROR -- : from /usr/lib/ruby/3.0.0/net/http/response.rb:31:in `read_new' E, [2024-05-25T23:09:56.287439 #3104266] ERROR -- : from /usr/lib/ruby/3.0.0/net/http.rb:1557:in `block in transport_request' E, [2024-05-25T23:09:56.287455 #3104266] ERROR -- : from /usr/lib/ruby/3.0.0/net/http.rb:1548:in `catch' E, [2024-05-25T23:09:56.287790 #3104266] ERROR -- : from /usr/lib/ruby/3.0.0/net/http.rb:1548:in `transport_request' E, [2024-05-25T23:09:56.287806 #3104266] ERROR -- : from /usr/lib/ruby/3.0.0/net/http.rb:1521:in `request' E, [2024-05-25T23:09:56.287818 #3104266] ERROR -- : from /usr/lib/ruby/3.0.0/open-uri.rb:329:in `block in open_http' E, [2024-05-25T23:09:56.287830 #3104266] ERROR -- : from /usr/lib/ruby/3.0.0/net/http.rb:960:in `start' E, [2024-05-25T23:09:56.287841 #3104266] ERROR -- : from /usr/lib/ruby/3.0.0/open-uri.rb:323:in `open_http' E, [2024-05-25T23:09:56.287857 #3104266] ERROR -- : from /usr/lib/ruby/3.0.0/open-uri.rb:741:in `buffer_open' E, [2024-05-25T23:09:56.287870 #3104266] ERROR -- : from /usr/lib/ruby/3.0.0/open-uri.rb:212:in `block in open_loop' E, [2024-05-25T23:09:56.287881 #3104266] ERROR -- : from /usr/lib/ruby/3.0.0/open-uri.rb:210:in `catch' E, [2024-05-25T23:09:56.287893 #3104266] ERROR -- : from /usr/lib/ruby/3.0.0/open-uri.rb:210:in `open_loop' E, [2024-05-25T23:09:56.287904 #3104266] ERROR -- : from /usr/lib/ruby/3.0.0/open-uri.rb:151:in `open_uri' E, [2024-05-25T23:09:56.287916 #3104266] ERROR -- : from /usr/lib/ruby/3.0.0/open-uri.rb:721:in `open' E, [2024-05-25T23:09:56.287927 #3104266] ERROR -- : from /usr/lib/ruby/3.0.0/open-uri.rb:729:in `read' E, [2024-05-25T23:09:56.287939 #3104266] ERROR -- : from /tmp/ruby/src/trunk/tool/downloader.rb:247:in `block in download' E, [2024-05-25T23:09:56.287951 #3104266] ERROR -- : from /tmp/ruby/src/trunk/tool/downloader.rb:378:in `with_retry' E, [2024-05-25T23:09:56.287966 #3104266] ERROR -- : from /tmp/ruby/src/trunk/tool/downloader.rb:246:in `download' E, [2024-05-25T23:09:56.287977 #3104266] ERROR -- : from /tmp/ruby/src/trunk/tool/downloader.rb:136:in `download' E, [2024-05-25T23:09:56.287989 #3104266] ERROR -- : from /tmp/ruby/src/trunk/tool/downloader.rb:482:in `block in
' E, [2024-05-25T23:09:56.288001 #3104266] ERROR -- : from /tmp/ruby/src/trunk/tool/downloader.rb:465:in `each' E, [2024-05-25T23:09:56.288017 #3104266] ERROR -- : from /tmp/ruby/src/trunk/tool/downloader.rb:465:in `
' E, [2024-05-25T23:09:56.291946 #3104266] ERROR -- : make: *** [uncommon.mk:1756: /tmp/ruby/src/trunk/enc/unicode/data/emoji/15.0/emoji-test.txt] Error 1 I, [2024-05-25T23:09:56.292049 #3104266] INFO -- : downloading emoji/15.0/emoji-test.txt ... I, [2024-05-25T23:09:56.292628 #3104266] INFO -- : $$$[end] "make update-unicode -j20" exit with 512. I, [2024-05-25T23:09:56.292692 #3104266] INFO -- : $$$[beg] make update-download -j20 I, [2024-05-25T23:09:56.397841 #3104266] INFO -- : tool/config.guess already exists I, [2024-05-25T23:09:56.397885 #3104266] INFO -- : tool/config.sub already exists I, [2024-05-25T23:09:56.399815 #3104266] INFO -- : Update power_assert to 84e85124c5014a139af39161d484156cfe87a9ed I, [2024-05-25T23:09:56.400069 #3104266] INFO -- : Update rbs to ba7872795d5de04adb8ff500c0e6afdc81a041dd I, [2024-05-25T23:09:56.400587 #3104266] INFO -- : Update typeprof to b19a6416da3a05d57fadd6ffdadb382b6d236ca5 I, [2024-05-25T23:09:56.400970 #3104266] INFO -- : echo 84e85124c5014a139af39161d484156cfe87a9ed | /bin/sh /tmp/ruby/src/trunk/tool/ifchange /tmp/ruby/src/trunk/.bundle/.timestamp/power_assert.revision - I, [2024-05-25T23:09:56.401167 #3104266] INFO -- : echo ba7872795d5de04adb8ff500c0e6afdc81a041dd | /bin/sh /tmp/ruby/src/trunk/tool/ifchange /tmp/ruby/src/trunk/.bundle/.timestamp/rbs.revision - I, [2024-05-25T23:09:56.401750 #3104266] INFO -- : echo b19a6416da3a05d57fadd6ffdadb382b6d236ca5 | /bin/sh /tmp/ruby/src/trunk/tool/ifchange /tmp/ruby/src/trunk/.bundle/.timestamp/typeprof.revision - I, [2024-05-25T23:09:56.402841 #3104266] INFO -- : /tmp/ruby/src/trunk/.bundle/.timestamp/rbs.revision unchanged I, [2024-05-25T23:09:56.403069 #3104266] INFO -- : /tmp/ruby/src/trunk/.bundle/.timestamp/power_assert.revision unchanged I, [2024-05-25T23:09:56.403733 #3104266] INFO -- : /tmp/ruby/src/trunk/.bundle/.timestamp/typeprof.revision unchanged I, [2024-05-25T23:09:56.404093 #3104266] INFO -- : Building power_assert@84e85124c5014a139af39161d484156cfe87a9ed to /tmp/ruby/src/trunk/gems/power_assert-2.0.3.gem I, [2024-05-25T23:09:56.473191 #3104266] INFO -- : Successfully built RubyGem I, [2024-05-25T23:09:56.473233 #3104266] INFO -- : Name: power_assert I, [2024-05-25T23:09:56.473239 #3104266] INFO -- : Version: 2.0.4dev I, [2024-05-25T23:09:56.473243 #3104266] INFO -- : File: power_assert-2.0.4dev.gem I, [2024-05-25T23:09:56.518205 #3104266] INFO -- : $$$[end] "make update-download -j20" exit with 0. I, [2024-05-25T23:09:56.518256 #3104266] INFO -- : $$$[beg] make update-rubyspec -j20 I, [2024-05-25T23:09:56.577637 #3104266] INFO -- : make: Nothing to be done for 'update-rubyspec'. I, [2024-05-25T23:09:56.578170 #3104266] INFO -- : $$$[end] "make update-rubyspec -j20" exit with 0. I, [2024-05-25T23:09:56.578221 #3104266] INFO -- : $$$[beg] make update-src -j20 I, [2024-05-25T23:09:57.203848 #3104266] INFO -- : Already up to date. I, [2024-05-25T23:09:57.219926 #3104266] INFO -- : Latest commit hash = d2c4363e0c I, [2024-05-25T23:09:57.221362 #3104266] INFO -- : $$$[end] "make update-src -j20" exit with 0. I, [2024-05-25T23:09:57.221417 #3104266] INFO -- : $$$[beg] make after-update -j20 I, [2024-05-25T23:09:57.301481 #3104266] INFO -- : generating /tmp/ruby/src/trunk/ext/ripper/eventids2table.c I, [2024-05-25T23:09:57.305678 #3104266] INFO -- : make[1]: Entering directory '/tmp/ruby/src/trunk/ext/ripper' I, [2024-05-25T23:09:57.305726 #3104266] INFO -- : make[1]: Nothing to be done for 'src'. I, [2024-05-25T23:09:57.305739 #3104266] INFO -- : make[1]: Leaving directory '/tmp/ruby/src/trunk/ext/ripper' I, [2024-05-25T23:09:57.322467 #3104266] INFO -- : /tmp/ruby/src/trunk/revision.h updated I, [2024-05-25T23:09:57.323794 #3104266] INFO -- : generating x86_64-linux-fake.rb I, [2024-05-25T23:09:57.385095 #3104266] INFO -- : x86_64-linux-fake.rb updated I, [2024-05-25T23:09:57.386508 #3104266] INFO -- : generating enc.mk I, [2024-05-25T23:09:57.505069 #3104266] INFO -- : making srcs under enc I, [2024-05-25T23:09:57.535128 #3104266] INFO -- : make[1]: Entering directory '/tmp/ruby/build/trunk' I, [2024-05-25T23:09:57.535154 #3104266] INFO -- : make[1]: Nothing to be done for 'srcs'. I, [2024-05-25T23:09:57.535161 #3104266] INFO -- : make[1]: Leaving directory '/tmp/ruby/build/trunk' I, [2024-05-25T23:09:57.579594 #3104266] INFO -- : Update power_assert to 84e85124c5014a139af39161d484156cfe87a9ed I, [2024-05-25T23:09:57.579641 #3104266] INFO -- : Update rbs to ba7872795d5de04adb8ff500c0e6afdc81a041dd I, [2024-05-25T23:09:57.579933 #3104266] INFO -- : Update typeprof to b19a6416da3a05d57fadd6ffdadb382b6d236ca5 I, [2024-05-25T23:09:57.581535 #3104266] INFO -- : echo 84e85124c5014a139af39161d484156cfe87a9ed | /bin/sh /tmp/ruby/src/trunk/tool/ifchange /tmp/ruby/src/trunk/.bundle/.timestamp/power_assert.revision - I, [2024-05-25T23:09:57.581698 #3104266] INFO -- : echo ba7872795d5de04adb8ff500c0e6afdc81a041dd | /bin/sh /tmp/ruby/src/trunk/tool/ifchange /tmp/ruby/src/trunk/.bundle/.timestamp/rbs.revision - I, [2024-05-25T23:09:57.581935 #3104266] INFO -- : echo b19a6416da3a05d57fadd6ffdadb382b6d236ca5 | /bin/sh /tmp/ruby/src/trunk/tool/ifchange /tmp/ruby/src/trunk/.bundle/.timestamp/typeprof.revision - I, [2024-05-25T23:09:57.583420 #3104266] INFO -- : /tmp/ruby/src/trunk/.bundle/.timestamp/power_assert.revision unchanged I, [2024-05-25T23:09:57.583538 #3104266] INFO -- : /tmp/ruby/src/trunk/.bundle/.timestamp/typeprof.revision unchanged I, [2024-05-25T23:09:57.583624 #3104266] INFO -- : /tmp/ruby/src/trunk/.bundle/.timestamp/rbs.revision unchanged I, [2024-05-25T23:09:57.584741 #3104266] INFO -- : Building power_assert@84e85124c5014a139af39161d484156cfe87a9ed to /tmp/ruby/src/trunk/gems/power_assert-2.0.3.gem I, [2024-05-25T23:09:57.654686 #3104266] INFO -- : Successfully built RubyGem I, [2024-05-25T23:09:57.654727 #3104266] INFO -- : Name: power_assert I, [2024-05-25T23:09:57.654732 #3104266] INFO -- : Version: 2.0.4dev I, [2024-05-25T23:09:57.654735 #3104266] INFO -- : File: power_assert-2.0.4dev.gem I, [2024-05-25T23:09:57.656845 #3104266] INFO -- : Extracting bundle gem power_assert-2.0.3... I, [2024-05-25T23:09:57.717194 #3104266] INFO -- : Try with hash version of bundled gems instead of gems/power_assert-2.0.3.gem. We don't use this gem with release version of Ruby. I, [2024-05-25T23:09:57.722119 #3104266] INFO -- : Unpacked gems/power_assert-2.0.4dev.gem I, [2024-05-25T23:09:57.724089 #3104266] INFO -- : $$$[end] "make after-update -j20" exit with 0. I, [2024-05-25T23:09:57.724310 #3104266] INFO -- : $$$[beg] make miniruby -j20 I, [2024-05-25T23:09:57.783551 #3104266] INFO -- : BASERUBY = /usr/bin/ruby --disable=gems I, [2024-05-25T23:09:57.783581 #3104266] INFO -- : CC = gcc I, [2024-05-25T23:09:57.783586 #3104266] INFO -- : LD = ld I, [2024-05-25T23:09:57.783590 #3104266] INFO -- : LDSHARED = gcc -shared I, [2024-05-25T23:09:57.783593 #3104266] INFO -- : CFLAGS = -O3 -fno-fast-math -ggdb3 -Wall -Wextra -Wdeprecated-declarations -Wdiv-by-zero -Wduplicated-cond -Wimplicit-function-declaration -Wimplicit-int -Wpointer-arith -Wwrite-strings -Wold-style-definition -Wimplicit-fallthrough=0 -Wmissing-noreturn -Wno-cast-function-type -Wno-constant-logical-operand -Wno-long-long -Wno-missing-field-initializers -Wno-overlength-strings -Wno-packed-bitfield-compat -Wno-parentheses-equality -Wno-self-assign -Wno-tautological-compare -Wno-unused-parameter -Wno-unused-value -Wsuggest-attribute=format -Wsuggest-attribute=noreturn -Wunused-variable -Wmisleading-indentation -Wundef -fPIC I, [2024-05-25T23:09:57.783598 #3104266] INFO -- : XCFLAGS = -U_FORTIFY_SOURCE -D_FORTIFY_SOURCE=2 -fstack-protector-strong -fno-strict-overflow -fvisibility=hidden -fexcess-precision=standard -DRUBY_EXPORT -I. -I.ext/include/x86_64-linux -I/tmp/ruby/src/trunk/include -I/tmp/ruby/src/trunk -I/tmp/ruby/src/trunk/prism -I/tmp/ruby/src/trunk/enc/unicode/15.0.0 I, [2024-05-25T23:09:57.783601 #3104266] INFO -- : CPPFLAGS = I, [2024-05-25T23:09:57.783605 #3104266] INFO -- : DLDFLAGS = -Wl,--compress-debug-sections=zlib -Wl,-soname,libruby.so.3.4 -fstack-protector-strong I, [2024-05-25T23:09:57.783609 #3104266] INFO -- : SOLIBS = -lz -lrt -lrt -lgmp -ldl -lcrypt -lm -lpthread I, [2024-05-25T23:09:57.783612 #3104266] INFO -- : LANG = en_US.UTF-8 I, [2024-05-25T23:09:57.783617 #3104266] INFO -- : LC_ALL = I, [2024-05-25T23:09:57.783620 #3104266] INFO -- : LC_CTYPE = I, [2024-05-25T23:09:57.783624 #3104266] INFO -- : MFLAGS = -j20 --jobserver-auth=4,5 I, [2024-05-25T23:09:57.783680 #3104266] INFO -- : RUSTC = no I, [2024-05-25T23:09:57.783684 #3104266] INFO -- : YJIT_RUSTC_ARGS = --crate-name=yjit --crate-type=staticlib --edition=2021 -g -C lto=thin -C opt-level=3 -C overflow-checks=on '--out-dir=/tmp/ruby/build/trunk/yjit/target/release/' /tmp/ruby/src/trunk/yjit/src/lib.rs I, [2024-05-25T23:09:57.784926 #3104266] INFO -- : gcc (Ubuntu 11.4.0-1ubuntu1~22.04) 11.4.0 I, [2024-05-25T23:09:57.784950 #3104266] INFO -- : Copyright (C) 2021 Free Software Foundation, Inc. I, [2024-05-25T23:09:57.784956 #3104266] INFO -- : This is free software; see the source for copying conditions. There is NO I, [2024-05-25T23:09:57.784963 #3104266] INFO -- : warranty; not even for MERCHANTABILITY or FITNESS FOR A PARTICULAR PURPOSE. I, [2024-05-25T23:09:57.784968 #3104266] INFO -- : I, [2024-05-25T23:09:57.812465 #3104266] INFO -- : compiling /tmp/ruby/src/trunk/version.c I, [2024-05-25T23:09:57.915066 #3104266] INFO -- : linking miniruby I, [2024-05-25T23:09:58.449493 #3104266] INFO -- : $$$[end] "make miniruby -j20" exit with 0. I, [2024-05-25T23:09:58.449665 #3104266] INFO -- : $$$[beg] make ruby -j20 I, [2024-05-25T23:09:58.509087 #3104266] INFO -- : BASERUBY = /usr/bin/ruby --disable=gems I, [2024-05-25T23:09:58.509122 #3104266] INFO -- : CC = gcc I, [2024-05-25T23:09:58.509128 #3104266] INFO -- : LD = ld I, [2024-05-25T23:09:58.509135 #3104266] INFO -- : LDSHARED = gcc -shared I, [2024-05-25T23:09:58.509139 #3104266] INFO -- : CFLAGS = -O3 -fno-fast-math -ggdb3 -Wall -Wextra -Wdeprecated-declarations -Wdiv-by-zero -Wduplicated-cond -Wimplicit-function-declaration -Wimplicit-int -Wpointer-arith -Wwrite-strings -Wold-style-definition -Wimplicit-fallthrough=0 -Wmissing-noreturn -Wno-cast-function-type -Wno-constant-logical-operand -Wno-long-long -Wno-missing-field-initializers -Wno-overlength-strings -Wno-packed-bitfield-compat -Wno-parentheses-equality -Wno-self-assign -Wno-tautological-compare -Wno-unused-parameter -Wno-unused-value -Wsuggest-attribute=format -Wsuggest-attribute=noreturn -Wunused-variable -Wmisleading-indentation -Wundef -fPIC I, [2024-05-25T23:09:58.509143 #3104266] INFO -- : XCFLAGS = -U_FORTIFY_SOURCE -D_FORTIFY_SOURCE=2 -fstack-protector-strong -fno-strict-overflow -fvisibility=hidden -fexcess-precision=standard -DRUBY_EXPORT -I. -I.ext/include/x86_64-linux -I/tmp/ruby/src/trunk/include -I/tmp/ruby/src/trunk -I/tmp/ruby/src/trunk/prism -I/tmp/ruby/src/trunk/enc/unicode/15.0.0 I, [2024-05-25T23:09:58.509147 #3104266] INFO -- : CPPFLAGS = I, [2024-05-25T23:09:58.509151 #3104266] INFO -- : DLDFLAGS = -Wl,--compress-debug-sections=zlib -Wl,-soname,libruby.so.3.4 -fstack-protector-strong I, [2024-05-25T23:09:58.509154 #3104266] INFO -- : SOLIBS = -lz -lrt -lrt -lgmp -ldl -lcrypt -lm -lpthread I, [2024-05-25T23:09:58.509158 #3104266] INFO -- : LANG = en_US.UTF-8 I, [2024-05-25T23:09:58.509161 #3104266] INFO -- : LC_ALL = I, [2024-05-25T23:09:58.509165 #3104266] INFO -- : LC_CTYPE = I, [2024-05-25T23:09:58.509168 #3104266] INFO -- : MFLAGS = -j20 --jobserver-auth=4,5 I, [2024-05-25T23:09:58.509172 #3104266] INFO -- : RUSTC = no I, [2024-05-25T23:09:58.509175 #3104266] INFO -- : YJIT_RUSTC_ARGS = --crate-name=yjit --crate-type=staticlib --edition=2021 -g -C lto=thin -C opt-level=3 -C overflow-checks=on '--out-dir=/tmp/ruby/build/trunk/yjit/target/release/' /tmp/ruby/src/trunk/yjit/src/lib.rs I, [2024-05-25T23:09:58.511399 #3104266] INFO -- : gcc (Ubuntu 11.4.0-1ubuntu1~22.04) 11.4.0 I, [2024-05-25T23:09:58.511422 #3104266] INFO -- : Copyright (C) 2021 Free Software Foundation, Inc. I, [2024-05-25T23:09:58.511427 #3104266] INFO -- : This is free software; see the source for copying conditions. There is NO I, [2024-05-25T23:09:58.511431 #3104266] INFO -- : warranty; not even for MERCHANTABILITY or FITNESS FOR A PARTICULAR PURPOSE. I, [2024-05-25T23:09:58.511435 #3104266] INFO -- : I, [2024-05-25T23:09:58.621853 #3104266] INFO -- : builtin_binary.inc updated I, [2024-05-25T23:09:58.626295 #3104266] INFO -- : c86294a81d0df6836359a6b5498b71b1ddba3062aa6ec87c7b2896368a948a19 builtin_binary.inc I, [2024-05-25T23:09:58.627143 #3104266] INFO -- : compiling /tmp/ruby/src/trunk/builtin.c I, [2024-05-25T23:09:58.810425 #3104266] INFO -- : linking static-library libruby-static.a I, [2024-05-25T23:09:59.126829 #3104266] INFO -- : linking shared-library libruby.so.3.4.0 I, [2024-05-25T23:10:00.680944 #3104266] INFO -- : linking ruby I, [2024-05-25T23:10:00.703938 #3104266] INFO -- : $$$[end] "make ruby -j20" exit with 0. I, [2024-05-25T23:10:00.704057 #3104266] INFO -- : $$$[beg] make all -j20 I, [2024-05-25T23:10:00.762401 #3104266] INFO -- : BASERUBY = /usr/bin/ruby --disable=gems I, [2024-05-25T23:10:00.762432 #3104266] INFO -- : CC = gcc I, [2024-05-25T23:10:00.762437 #3104266] INFO -- : LD = ld I, [2024-05-25T23:10:00.762441 #3104266] INFO -- : LDSHARED = gcc -shared I, [2024-05-25T23:10:00.762445 #3104266] INFO -- : CFLAGS = -O3 -fno-fast-math -ggdb3 -Wall -Wextra -Wdeprecated-declarations -Wdiv-by-zero -Wduplicated-cond -Wimplicit-function-declaration -Wimplicit-int -Wpointer-arith -Wwrite-strings -Wold-style-definition -Wimplicit-fallthrough=0 -Wmissing-noreturn -Wno-cast-function-type -Wno-constant-logical-operand -Wno-long-long -Wno-missing-field-initializers -Wno-overlength-strings -Wno-packed-bitfield-compat -Wno-parentheses-equality -Wno-self-assign -Wno-tautological-compare -Wno-unused-parameter -Wno-unused-value -Wsuggest-attribute=format -Wsuggest-attribute=noreturn -Wunused-variable -Wmisleading-indentation -Wundef -fPIC I, [2024-05-25T23:10:00.762449 #3104266] INFO -- : XCFLAGS = -U_FORTIFY_SOURCE -D_FORTIFY_SOURCE=2 -fstack-protector-strong -fno-strict-overflow -fvisibility=hidden -fexcess-precision=standard -DRUBY_EXPORT -I. -I.ext/include/x86_64-linux -I/tmp/ruby/src/trunk/include -I/tmp/ruby/src/trunk -I/tmp/ruby/src/trunk/prism -I/tmp/ruby/src/trunk/enc/unicode/15.0.0 I, [2024-05-25T23:10:00.762452 #3104266] INFO -- : CPPFLAGS = I, [2024-05-25T23:10:00.762456 #3104266] INFO -- : DLDFLAGS = -Wl,--compress-debug-sections=zlib -Wl,-soname,libruby.so.3.4 -fstack-protector-strong I, [2024-05-25T23:10:00.762460 #3104266] INFO -- : SOLIBS = -lz -lrt -lrt -lgmp -ldl -lcrypt -lm -lpthread I, [2024-05-25T23:10:00.762463 #3104266] INFO -- : LANG = en_US.UTF-8 I, [2024-05-25T23:10:00.762466 #3104266] INFO -- : LC_ALL = I, [2024-05-25T23:10:00.762470 #3104266] INFO -- : LC_CTYPE = I, [2024-05-25T23:10:00.762473 #3104266] INFO -- : MFLAGS = -j20 --jobserver-auth=4,5 I, [2024-05-25T23:10:00.762477 #3104266] INFO -- : RUSTC = no I, [2024-05-25T23:10:00.762481 #3104266] INFO -- : YJIT_RUSTC_ARGS = --crate-name=yjit --crate-type=staticlib --edition=2021 -g -C lto=thin -C opt-level=3 -C overflow-checks=on '--out-dir=/tmp/ruby/build/trunk/yjit/target/release/' /tmp/ruby/src/trunk/yjit/src/lib.rs I, [2024-05-25T23:10:00.763812 #3104266] INFO -- : gcc (Ubuntu 11.4.0-1ubuntu1~22.04) 11.4.0 I, [2024-05-25T23:10:00.763833 #3104266] INFO -- : Copyright (C) 2021 Free Software Foundation, Inc. I, [2024-05-25T23:10:00.763841 #3104266] INFO -- : This is free software; see the source for copying conditions. There is NO I, [2024-05-25T23:10:00.763845 #3104266] INFO -- : warranty; not even for MERCHANTABILITY or FITNESS FOR A PARTICULAR PURPOSE. I, [2024-05-25T23:10:00.763849 #3104266] INFO -- : I, [2024-05-25T23:10:00.792130 #3104266] INFO -- : generating encdb.h I, [2024-05-25T23:10:00.793646 #3104266] INFO -- : generating enc.mk I, [2024-05-25T23:10:00.795376 #3104266] INFO -- : building spec/ruby/optional/capi/ext/array_spec.so I, [2024-05-25T23:10:00.795664 #3104266] INFO -- : building spec/ruby/optional/capi/ext/basic_object_spec.so I, [2024-05-25T23:10:00.795903 #3104266] INFO -- : building spec/ruby/optional/capi/ext/bignum_spec.so I, [2024-05-25T23:10:00.797618 #3104266] INFO -- : building spec/ruby/optional/capi/ext/binding_spec.so I, [2024-05-25T23:10:00.797927 #3104266] INFO -- : building spec/ruby/optional/capi/ext/boolean_spec.so I, [2024-05-25T23:10:00.798609 #3104266] INFO -- : building spec/ruby/optional/capi/ext/class_id_under_autoload_spec.so I, [2024-05-25T23:10:00.799520 #3104266] INFO -- : building spec/ruby/optional/capi/ext/class_spec.so I, [2024-05-25T23:10:00.799909 #3104266] INFO -- : building spec/ruby/optional/capi/ext/class_under_autoload_spec.so I, [2024-05-25T23:10:00.800640 #3104266] INFO -- : building spec/ruby/optional/capi/ext/complex_spec.so I, [2024-05-25T23:10:00.801633 #3104266] INFO -- : building spec/ruby/optional/capi/ext/constants_spec.so I, [2024-05-25T23:10:00.802342 #3104266] INFO -- : building spec/ruby/optional/capi/ext/data_spec.so I, [2024-05-25T23:10:00.802637 #3104266] INFO -- : building spec/ruby/optional/capi/ext/debug_spec.so I, [2024-05-25T23:10:00.803361 #3104266] INFO -- : building spec/ruby/optional/capi/ext/encoding_spec.so I, [2024-05-25T23:10:00.803987 #3104266] INFO -- : building spec/ruby/optional/capi/ext/enumerator_spec.so I, [2024-05-25T23:10:00.804236 #3104266] INFO -- : building spec/ruby/optional/capi/ext/exception_spec.so I, [2024-05-25T23:10:00.804957 #3104266] INFO -- : building spec/ruby/optional/capi/ext/fiber_spec.so I, [2024-05-25T23:10:00.805550 #3104266] INFO -- : building spec/ruby/optional/capi/ext/file_spec.so I, [2024-05-25T23:10:00.820176 #3104266] INFO -- : building spec/ruby/optional/capi/ext/fixnum_spec.so I, [2024-05-25T23:10:00.824084 #3104266] INFO -- : encdb.h unchanged I, [2024-05-25T23:10:00.826141 #3104266] INFO -- : building spec/ruby/optional/capi/ext/float_spec.so I, [2024-05-25T23:10:00.932729 #3104266] INFO -- : building spec/ruby/optional/capi/ext/gc_spec.so I, [2024-05-25T23:10:00.935448 #3104266] INFO -- : building spec/ruby/optional/capi/ext/globals_spec.so I, [2024-05-25T23:10:00.946389 #3104266] INFO -- : building spec/ruby/optional/capi/ext/hash_spec.so I, [2024-05-25T23:10:00.948129 #3104266] INFO -- : building spec/ruby/optional/capi/ext/integer_spec.so I, [2024-05-25T23:10:00.959787 #3104266] INFO -- : building spec/ruby/optional/capi/ext/io_spec.so I, [2024-05-25T23:10:00.960184 #3104266] INFO -- : building spec/ruby/optional/capi/ext/kernel_spec.so I, [2024-05-25T23:10:00.967299 #3104266] INFO -- : building spec/ruby/optional/capi/ext/language_spec.so I, [2024-05-25T23:10:00.969976 #3104266] INFO -- : building spec/ruby/optional/capi/ext/marshal_spec.so I, [2024-05-25T23:10:00.970297 #3104266] INFO -- : building spec/ruby/optional/capi/ext/module_spec.so I, [2024-05-25T23:10:00.971526 #3104266] INFO -- : building spec/ruby/optional/capi/ext/module_under_autoload_spec.so I, [2024-05-25T23:10:00.972219 #3104266] INFO -- : building spec/ruby/optional/capi/ext/mutex_spec.so I, [2024-05-25T23:10:00.984972 #3104266] INFO -- : building spec/ruby/optional/capi/ext/numeric_spec.so I, [2024-05-25T23:10:00.987781 #3104266] INFO -- : building spec/ruby/optional/capi/ext/object_spec.so I, [2024-05-25T23:10:00.992644 #3104266] INFO -- : building spec/ruby/optional/capi/ext/proc_spec.so I, [2024-05-25T23:10:00.995097 #3104266] INFO -- : building spec/ruby/optional/capi/ext/range_spec.so I, [2024-05-25T23:10:01.009305 #3104266] INFO -- : building spec/ruby/optional/capi/ext/rational_spec.so I, [2024-05-25T23:10:01.043440 #3104266] INFO -- : building spec/ruby/optional/capi/ext/rbasic_spec.so I, [2024-05-25T23:10:01.062262 #3104266] INFO -- : building spec/ruby/optional/capi/ext/regexp_spec.so I, [2024-05-25T23:10:01.099715 #3104266] INFO -- : building spec/ruby/optional/capi/ext/string_spec.so I, [2024-05-25T23:10:01.109033 #3104266] INFO -- : building spec/ruby/optional/capi/ext/struct_spec.so I, [2024-05-25T23:10:01.117211 #3104266] INFO -- : building spec/ruby/optional/capi/ext/st_spec.so I, [2024-05-25T23:10:01.120327 #3104266] INFO -- : building spec/ruby/optional/capi/ext/symbol_spec.so I, [2024-05-25T23:10:01.125671 #3104266] INFO -- : building spec/ruby/optional/capi/ext/thread_spec.so I, [2024-05-25T23:10:01.132807 #3104266] INFO -- : building spec/ruby/optional/capi/ext/time_spec.so I, [2024-05-25T23:10:01.141036 #3104266] INFO -- : building spec/ruby/optional/capi/ext/tracepoint_spec.so I, [2024-05-25T23:10:01.144662 #3104266] INFO -- : building spec/ruby/optional/capi/ext/typed_data_spec.so I, [2024-05-25T23:10:01.146179 #3104266] INFO -- : building spec/ruby/optional/capi/ext/util_spec.so I, [2024-05-25T23:10:01.151711 #3104266] INFO -- : making enc I, [2024-05-25T23:10:01.155165 #3104266] INFO -- : making srcs under enc I, [2024-05-25T23:10:01.182392 #3104266] INFO -- : make[1]: Entering directory '/tmp/ruby/build/trunk' I, [2024-05-25T23:10:01.182464 #3104266] INFO -- : make[1]: Nothing to be done for 'enc'. I, [2024-05-25T23:10:01.182488 #3104266] INFO -- : make[1]: Leaving directory '/tmp/ruby/build/trunk' I, [2024-05-25T23:10:01.197198 #3104266] INFO -- : make[1]: Entering directory '/tmp/ruby/build/trunk' I, [2024-05-25T23:10:01.197284 #3104266] INFO -- : make[1]: Nothing to be done for 'srcs'. I, [2024-05-25T23:10:01.197294 #3104266] INFO -- : make[1]: Leaving directory '/tmp/ruby/build/trunk' I, [2024-05-25T23:10:01.197930 #3104266] INFO -- : generating transdb.h I, [2024-05-25T23:10:01.296155 #3104266] INFO -- : transdb.h unchanged I, [2024-05-25T23:10:01.297463 #3104266] INFO -- : generating makefiles ext/configure-ext.mk I, [2024-05-25T23:10:01.298316 #3104266] INFO -- : making trans I, [2024-05-25T23:10:01.324422 #3104266] INFO -- : ext/configure-ext.mk updated I, [2024-05-25T23:10:01.326819 #3104266] INFO -- : make[1]: Entering directory '/tmp/ruby/build/trunk' I, [2024-05-25T23:10:01.332731 #3104266] INFO -- : make[1]: Entering directory '/tmp/ruby/build/trunk' I, [2024-05-25T23:10:01.332829 #3104266] INFO -- : make[1]: Nothing to be done for 'trans'. I, [2024-05-25T23:10:01.332860 #3104266] INFO -- : make[1]: Leaving directory '/tmp/ruby/build/trunk' I, [2024-05-25T23:10:01.333948 #3104266] INFO -- : making encs I, [2024-05-25T23:10:01.392265 #3104266] INFO -- : make[1]: Entering directory '/tmp/ruby/build/trunk' I, [2024-05-25T23:10:01.393266 #3104266] INFO -- : make[1]: Nothing to be done for 'encs'. I, [2024-05-25T23:10:01.393371 #3104266] INFO -- : make[1]: Leaving directory '/tmp/ruby/build/trunk' I, [2024-05-25T23:10:01.484089 #3104266] INFO -- : make[1]: Leaving directory '/tmp/ruby/build/trunk' I, [2024-05-25T23:10:01.484892 #3104266] INFO -- : generating makefile exts.mk I, [2024-05-25T23:10:01.522246 #3104266] INFO -- : exts.mk unchanged I, [2024-05-25T23:10:01.527343 #3104266] INFO -- : make[1]: Entering directory '/tmp/ruby/build/trunk' I, [2024-05-25T23:10:01.544988 #3104266] INFO -- : make[2]: Entering directory '/tmp/ruby/build/trunk/ext/digest' I, [2024-05-25T23:10:01.546549 #3104266] INFO -- : make[2]: Entering directory '/tmp/ruby/build/trunk/ext/coverage' I, [2024-05-25T23:10:01.546623 #3104266] INFO -- : make[2]: Entering directory '/tmp/ruby/build/trunk/ext/json' I, [2024-05-25T23:10:01.547253 #3104266] INFO -- : make[2]: Entering directory '/tmp/ruby/build/trunk/ext/io/console' I, [2024-05-25T23:10:01.547513 #3104266] INFO -- : make[2]: Entering directory '/tmp/ruby/build/trunk/ext/date' I, [2024-05-25T23:10:01.548384 #3104266] INFO -- : make[2]: Entering directory '/tmp/ruby/build/trunk/ext/monitor' I, [2024-05-25T23:10:01.548672 #3104266] INFO -- : make[2]: Entering directory '/tmp/ruby/build/trunk/ext/rubyvm' I, [2024-05-25T23:10:01.549045 #3104266] INFO -- : make[2]: Leaving directory '/tmp/ruby/build/trunk/ext/digest' I, [2024-05-25T23:10:01.549362 #3104266] INFO -- : make[2]: Entering directory '/tmp/ruby/build/trunk/ext/pathname' I, [2024-05-25T23:10:01.549559 #3104266] INFO -- : make[2]: Entering directory '/tmp/ruby/build/trunk/ext/pty' I, [2024-05-25T23:10:01.549649 #3104266] INFO -- : make[2]: Leaving directory '/tmp/ruby/build/trunk/ext/coverage' I, [2024-05-25T23:10:01.550039 #3104266] INFO -- : make[2]: Entering directory '/tmp/ruby/build/trunk/ext/fiddle' I, [2024-05-25T23:10:01.550718 #3104266] INFO -- : make[2]: Entering directory '/tmp/ruby/build/trunk/ext/objspace' I, [2024-05-25T23:10:01.550921 #3104266] INFO -- : make[2]: Leaving directory '/tmp/ruby/build/trunk/ext/rubyvm' I, [2024-05-25T23:10:01.551188 #3104266] INFO -- : make[2]: Leaving directory '/tmp/ruby/build/trunk/ext/io/console' I, [2024-05-25T23:10:01.551483 #3104266] INFO -- : make[2]: Entering directory '/tmp/ruby/build/trunk/ext/psych' I, [2024-05-25T23:10:01.551537 #3104266] INFO -- : make[2]: Leaving directory '/tmp/ruby/build/trunk/ext/monitor' I, [2024-05-25T23:10:01.551723 #3104266] INFO -- : make[2]: Leaving directory '/tmp/ruby/build/trunk/ext/date' I, [2024-05-25T23:10:01.551841 #3104266] INFO -- : make[2]: Leaving directory '/tmp/ruby/build/trunk/ext/pathname' I, [2024-05-25T23:10:01.552043 #3104266] INFO -- : make[2]: Leaving directory '/tmp/ruby/build/trunk/ext/pty' I, [2024-05-25T23:10:01.553060 #3104266] INFO -- : make[2]: Entering directory '/tmp/ruby/build/trunk/.bundle/gems/bigdecimal-3.1.8/ext/bigdecimal' I, [2024-05-25T23:10:01.553438 #3104266] INFO -- : make[2]: Entering directory '/tmp/ruby/build/trunk/.bundle/gems/debug-1.9.2/ext/debug' I, [2024-05-25T23:10:01.553922 #3104266] INFO -- : make[2]: Entering directory '/tmp/ruby/build/trunk/.bundle/gems/nkf-0.2.0/ext/nkf' I, [2024-05-25T23:10:01.554196 #3104266] INFO -- : make[2]: Entering directory '/tmp/ruby/build/trunk/.bundle/gems/racc-1.7.3/ext/racc/cparse' I, [2024-05-25T23:10:01.554229 #3104266] INFO -- : make[2]: Entering directory '/tmp/ruby/build/trunk/.bundle/gems/racc-1.8.0/ext/racc/cparse' I, [2024-05-25T23:10:01.554296 #3104266] INFO -- : make[2]: Entering directory '/tmp/ruby/build/trunk/ext/ripper' I, [2024-05-25T23:10:01.554430 #3104266] INFO -- : make[2]: Leaving directory '/tmp/ruby/build/trunk/ext/json' I, [2024-05-25T23:10:01.554494 #3104266] INFO -- : make[2]: Entering directory '/tmp/ruby/build/trunk/.bundle/gems/syslog-0.1.2/ext/syslog' I, [2024-05-25T23:10:01.555081 #3104266] INFO -- : make[2]: Entering directory '/tmp/ruby/build/trunk/.bundle/gems/rbs-3.4.4/ext/rbs_extension' I, [2024-05-25T23:10:01.555157 #3104266] INFO -- : make[2]: Leaving directory '/tmp/ruby/build/trunk/ext/objspace' I, [2024-05-25T23:10:01.558282 #3104266] INFO -- : make[2]: Entering directory '/tmp/ruby/build/trunk/ext/socket' I, [2024-05-25T23:10:01.558753 #3104266] INFO -- : make[2]: Leaving directory '/tmp/ruby/build/trunk/ext/fiddle' I, [2024-05-25T23:10:01.559172 #3104266] INFO -- : make[2]: Leaving directory '/tmp/ruby/build/trunk/ext/ripper' I, [2024-05-25T23:10:01.560033 #3104266] INFO -- : make[2]: Entering directory '/tmp/ruby/build/trunk/ext/digest/sha2' I, [2024-05-25T23:10:01.561247 #3104266] INFO -- : make[2]: Entering directory '/tmp/ruby/build/trunk/ext/openssl' I, [2024-05-25T23:10:01.563265 #3104266] INFO -- : make[2]: Leaving directory '/tmp/ruby/build/trunk/ext/digest/sha2' I, [2024-05-25T23:10:01.564333 #3104266] INFO -- : make[2]: Leaving directory '/tmp/ruby/build/trunk/ext/psych' I, [2024-05-25T23:10:01.566859 #3104266] INFO -- : make[2]: Leaving directory '/tmp/ruby/build/trunk/ext/socket' I, [2024-05-25T23:10:01.576832 #3104266] INFO -- : make[2]: Leaving directory '/tmp/ruby/build/trunk/.bundle/gems/racc-1.8.0/ext/racc/cparse' I, [2024-05-25T23:10:01.577179 #3104266] INFO -- : make[2]: Leaving directory '/tmp/ruby/build/trunk/.bundle/gems/bigdecimal-3.1.8/ext/bigdecimal' I, [2024-05-25T23:10:01.577500 #3104266] INFO -- : make[2]: Leaving directory '/tmp/ruby/build/trunk/.bundle/gems/nkf-0.2.0/ext/nkf' I, [2024-05-25T23:10:01.577936 #3104266] INFO -- : make[2]: Leaving directory '/tmp/ruby/build/trunk/ext/openssl' I, [2024-05-25T23:10:01.580740 #3104266] INFO -- : make[2]: Leaving directory '/tmp/ruby/build/trunk/.bundle/gems/debug-1.9.2/ext/debug' I, [2024-05-25T23:10:01.586628 #3104266] INFO -- : make[2]: Leaving directory '/tmp/ruby/build/trunk/.bundle/gems/syslog-0.1.2/ext/syslog' I, [2024-05-25T23:10:01.588307 #3104266] INFO -- : make[2]: Leaving directory '/tmp/ruby/build/trunk/.bundle/gems/racc-1.7.3/ext/racc/cparse' I, [2024-05-25T23:10:01.589952 #3104266] INFO -- : make[2]: Leaving directory '/tmp/ruby/build/trunk/.bundle/gems/rbs-3.4.4/ext/rbs_extension' I, [2024-05-25T23:10:01.613360 #3104266] INFO -- : make[2]: Entering directory '/tmp/ruby/build/trunk' I, [2024-05-25T23:10:01.681263 #3104266] INFO -- : linking ruby I, [2024-05-25T23:10:01.703431 #3104266] INFO -- : make[2]: Leaving directory '/tmp/ruby/build/trunk' I, [2024-05-25T23:10:01.703678 #3104266] INFO -- : make[1]: Leaving directory '/tmp/ruby/build/trunk' I, [2024-05-25T23:10:01.707403 #3104266] INFO -- : make[1]: Entering directory '/tmp/ruby/build/trunk' I, [2024-05-25T23:10:01.707425 #3104266] INFO -- : make[1]: Nothing to be done for 'note'. I, [2024-05-25T23:10:01.707431 #3104266] INFO -- : make[1]: Leaving directory '/tmp/ruby/build/trunk' I, [2024-05-25T23:10:01.708527 #3104266] INFO -- : $$$[end] "make all -j20" exit with 0. I, [2024-05-25T23:10:01.708656 #3104266] INFO -- : $$$[beg] make install -j20 I, [2024-05-25T23:10:01.775938 #3104266] INFO -- : Update power_assert to 84e85124c5014a139af39161d484156cfe87a9ed I, [2024-05-25T23:10:01.776206 #3104266] INFO -- : Update rbs to ba7872795d5de04adb8ff500c0e6afdc81a041dd I, [2024-05-25T23:10:01.776780 #3104266] INFO -- : Update typeprof to b19a6416da3a05d57fadd6ffdadb382b6d236ca5 I, [2024-05-25T23:10:01.777967 #3104266] INFO -- : echo 84e85124c5014a139af39161d484156cfe87a9ed | /bin/sh /tmp/ruby/src/trunk/tool/ifchange /tmp/ruby/src/trunk/.bundle/.timestamp/power_assert.revision - I, [2024-05-25T23:10:01.778948 #3104266] INFO -- : BASERUBY = /usr/bin/ruby --disable=gems I, [2024-05-25T23:10:01.778990 #3104266] INFO -- : CC = gcc I, [2024-05-25T23:10:01.779008 #3104266] INFO -- : LD = ld I, [2024-05-25T23:10:01.779031 #3104266] INFO -- : LDSHARED = gcc -shared I, [2024-05-25T23:10:01.779047 #3104266] INFO -- : CFLAGS = -O3 -fno-fast-math -ggdb3 -Wall -Wextra -Wdeprecated-declarations -Wdiv-by-zero -Wduplicated-cond -Wimplicit-function-declaration -Wimplicit-int -Wpointer-arith -Wwrite-strings -Wold-style-definition -Wimplicit-fallthrough=0 -Wmissing-noreturn -Wno-cast-function-type -Wno-constant-logical-operand -Wno-long-long -Wno-missing-field-initializers -Wno-overlength-strings -Wno-packed-bitfield-compat -Wno-parentheses-equality -Wno-self-assign -Wno-tautological-compare -Wno-unused-parameter -Wno-unused-value -Wsuggest-attribute=format -Wsuggest-attribute=noreturn -Wunused-variable -Wmisleading-indentation -Wundef -fPIC I, [2024-05-25T23:10:01.779063 #3104266] INFO -- : XCFLAGS = -U_FORTIFY_SOURCE -D_FORTIFY_SOURCE=2 -fstack-protector-strong -fno-strict-overflow -fvisibility=hidden -fexcess-precision=standard -DRUBY_EXPORT -I. -I.ext/include/x86_64-linux -I/tmp/ruby/src/trunk/include -I/tmp/ruby/src/trunk -I/tmp/ruby/src/trunk/prism -I/tmp/ruby/src/trunk/enc/unicode/15.0.0 I, [2024-05-25T23:10:01.779078 #3104266] INFO -- : CPPFLAGS = I, [2024-05-25T23:10:01.779092 #3104266] INFO -- : DLDFLAGS = -Wl,--compress-debug-sections=zlib -Wl,-soname,libruby.so.3.4 -fstack-protector-strong I, [2024-05-25T23:10:01.779107 #3104266] INFO -- : SOLIBS = -lz -lrt -lrt -lgmp -ldl -lcrypt -lm -lpthread I, [2024-05-25T23:10:01.779121 #3104266] INFO -- : LANG = en_US.UTF-8 I, [2024-05-25T23:10:01.779134 #3104266] INFO -- : LC_ALL = I, [2024-05-25T23:10:01.779148 #3104266] INFO -- : LC_CTYPE = I, [2024-05-25T23:10:01.779166 #3104266] INFO -- : MFLAGS = -j20 --jobserver-auth=4,5 I, [2024-05-25T23:10:01.779180 #3104266] INFO -- : RUSTC = no I, [2024-05-25T23:10:01.779195 #3104266] INFO -- : YJIT_RUSTC_ARGS = --crate-name=yjit --crate-type=staticlib --edition=2021 -g -C lto=thin -C opt-level=3 -C overflow-checks=on '--out-dir=/tmp/ruby/build/trunk/yjit/target/release/' /tmp/ruby/src/trunk/yjit/src/lib.rs I, [2024-05-25T23:10:01.780804 #3104266] INFO -- : /tmp/ruby/src/trunk/.bundle/.timestamp/power_assert.revision unchanged I, [2024-05-25T23:10:01.812478 #3104266] INFO -- : echo ba7872795d5de04adb8ff500c0e6afdc81a041dd | /bin/sh /tmp/ruby/src/trunk/tool/ifchange /tmp/ruby/src/trunk/.bundle/.timestamp/rbs.revision - I, [2024-05-25T23:10:01.812682 #3104266] INFO -- : echo b19a6416da3a05d57fadd6ffdadb382b6d236ca5 | /bin/sh /tmp/ruby/src/trunk/tool/ifchange /tmp/ruby/src/trunk/.bundle/.timestamp/typeprof.revision - I, [2024-05-25T23:10:01.813495 #3104266] INFO -- : gcc (Ubuntu 11.4.0-1ubuntu1~22.04) 11.4.0 I, [2024-05-25T23:10:01.813538 #3104266] INFO -- : Copyright (C) 2021 Free Software Foundation, Inc. I, [2024-05-25T23:10:01.813558 #3104266] INFO -- : This is free software; see the source for copying conditions. There is NO I, [2024-05-25T23:10:01.813570 #3104266] INFO -- : warranty; not even for MERCHANTABILITY or FITNESS FOR A PARTICULAR PURPOSE. I, [2024-05-25T23:10:01.813580 #3104266] INFO -- : I, [2024-05-25T23:10:01.813593 #3104266] INFO -- : generating encdb.h I, [2024-05-25T23:10:01.814749 #3104266] INFO -- : /tmp/ruby/src/trunk/.bundle/.timestamp/rbs.revision unchanged I, [2024-05-25T23:10:01.814794 #3104266] INFO -- : /tmp/ruby/src/trunk/.bundle/.timestamp/typeprof.revision unchanged I, [2024-05-25T23:10:01.814808 #3104266] INFO -- : generating enc.mk I, [2024-05-25T23:10:01.838453 #3104266] INFO -- : encdb.h unchanged I, [2024-05-25T23:10:01.839890 #3104266] INFO -- : Building power_assert@84e85124c5014a139af39161d484156cfe87a9ed to /tmp/ruby/src/trunk/gems/power_assert-2.0.3.gem I, [2024-05-25T23:10:01.908796 #3104266] INFO -- : Successfully built RubyGem I, [2024-05-25T23:10:01.908846 #3104266] INFO -- : Name: power_assert I, [2024-05-25T23:10:01.908859 #3104266] INFO -- : Version: 2.0.4dev I, [2024-05-25T23:10:01.908870 #3104266] INFO -- : File: power_assert-2.0.4dev.gem I, [2024-05-25T23:10:01.910788 #3104266] INFO -- : Extracting bundle gem power_assert-2.0.3... I, [2024-05-25T23:10:01.937953 #3104266] INFO -- : making srcs under enc I, [2024-05-25T23:10:01.938288 #3104266] INFO -- : making enc I, [2024-05-25T23:10:01.955249 #3104266] INFO -- : make[1]: Entering directory '/tmp/ruby/build/trunk' I, [2024-05-25T23:10:01.955296 #3104266] INFO -- : make[1]: Nothing to be done for 'enc'. I, [2024-05-25T23:10:01.955309 #3104266] INFO -- : make[1]: Leaving directory '/tmp/ruby/build/trunk' I, [2024-05-25T23:10:01.967510 #3104266] INFO -- : make[1]: Entering directory '/tmp/ruby/build/trunk' I, [2024-05-25T23:10:01.967575 #3104266] INFO -- : make[1]: Nothing to be done for 'srcs'. I, [2024-05-25T23:10:01.967588 #3104266] INFO -- : make[1]: Leaving directory '/tmp/ruby/build/trunk' I, [2024-05-25T23:10:01.968230 #3104266] INFO -- : generating transdb.h I, [2024-05-25T23:10:01.972023 #3104266] INFO -- : Try with hash version of bundled gems instead of gems/power_assert-2.0.3.gem. We don't use this gem with release version of Ruby. I, [2024-05-25T23:10:01.977068 #3104266] INFO -- : Unpacked gems/power_assert-2.0.4dev.gem I, [2024-05-25T23:10:02.064534 #3104266] INFO -- : transdb.h unchanged I, [2024-05-25T23:10:02.066074 #3104266] INFO -- : generating makefiles ext/configure-ext.mk I, [2024-05-25T23:10:02.066137 #3104266] INFO -- : making trans I, [2024-05-25T23:10:02.093417 #3104266] INFO -- : ext/configure-ext.mk unchanged I, [2024-05-25T23:10:02.095563 #3104266] INFO -- : make[1]: Entering directory '/tmp/ruby/build/trunk' I, [2024-05-25T23:10:02.101873 #3104266] INFO -- : make[1]: Entering directory '/tmp/ruby/build/trunk' I, [2024-05-25T23:10:02.101966 #3104266] INFO -- : make[1]: Nothing to be done for 'trans'. I, [2024-05-25T23:10:02.101976 #3104266] INFO -- : make[1]: Leaving directory '/tmp/ruby/build/trunk' I, [2024-05-25T23:10:02.102838 #3104266] INFO -- : making encs I, [2024-05-25T23:10:02.161547 #3104266] INFO -- : make[1]: Entering directory '/tmp/ruby/build/trunk' I, [2024-05-25T23:10:02.161618 #3104266] INFO -- : make[1]: Nothing to be done for 'encs'. I, [2024-05-25T23:10:02.161645 #3104266] INFO -- : make[1]: Leaving directory '/tmp/ruby/build/trunk' I, [2024-05-25T23:10:02.250773 #3104266] INFO -- : make[1]: Leaving directory '/tmp/ruby/build/trunk' I, [2024-05-25T23:10:02.251422 #3104266] INFO -- : generating makefile exts.mk I, [2024-05-25T23:10:02.289031 #3104266] INFO -- : exts.mk unchanged I, [2024-05-25T23:10:02.293991 #3104266] INFO -- : make[1]: Entering directory '/tmp/ruby/build/trunk' I, [2024-05-25T23:10:02.312462 #3104266] INFO -- : make[2]: Entering directory '/tmp/ruby/build/trunk/ext/digest' I, [2024-05-25T23:10:02.313844 #3104266] INFO -- : make[2]: Entering directory '/tmp/ruby/build/trunk/ext/coverage' I, [2024-05-25T23:10:02.313958 #3104266] INFO -- : make[2]: Entering directory '/tmp/ruby/build/trunk/ext/json' I, [2024-05-25T23:10:02.314822 #3104266] INFO -- : make[2]: Entering directory '/tmp/ruby/build/trunk/ext/date' I, [2024-05-25T23:10:02.315193 #3104266] INFO -- : make[2]: Entering directory '/tmp/ruby/build/trunk/ext/io/console' I, [2024-05-25T23:10:02.315913 #3104266] INFO -- : make[2]: Entering directory '/tmp/ruby/build/trunk/ext/monitor' I, [2024-05-25T23:10:02.315960 #3104266] INFO -- : make[2]: Entering directory '/tmp/ruby/build/trunk/ext/rubyvm' I, [2024-05-25T23:10:02.316880 #3104266] INFO -- : make[2]: Entering directory '/tmp/ruby/build/trunk/ext/pathname' I, [2024-05-25T23:10:02.316912 #3104266] INFO -- : make[2]: Entering directory '/tmp/ruby/build/trunk/ext/fiddle' I, [2024-05-25T23:10:02.317181 #3104266] INFO -- : make[2]: Entering directory '/tmp/ruby/build/trunk/ext/pty' I, [2024-05-25T23:10:02.317324 #3104266] INFO -- : make[2]: Leaving directory '/tmp/ruby/build/trunk/ext/digest' I, [2024-05-25T23:10:02.317667 #3104266] INFO -- : make[2]: Leaving directory '/tmp/ruby/build/trunk/ext/coverage' I, [2024-05-25T23:10:02.318281 #3104266] INFO -- : make[2]: Entering directory '/tmp/ruby/build/trunk/ext/objspace' I, [2024-05-25T23:10:02.318498 #3104266] INFO -- : make[2]: Entering directory '/tmp/ruby/build/trunk/ext/psych' I, [2024-05-25T23:10:02.318529 #3104266] INFO -- : make[2]: Leaving directory '/tmp/ruby/build/trunk/ext/date' I, [2024-05-25T23:10:02.318584 #3104266] INFO -- : make[2]: Leaving directory '/tmp/ruby/build/trunk/ext/io/console' I, [2024-05-25T23:10:02.319060 #3104266] INFO -- : make[2]: Leaving directory '/tmp/ruby/build/trunk/ext/monitor' I, [2024-05-25T23:10:02.319439 #3104266] INFO -- : make[2]: Leaving directory '/tmp/ruby/build/trunk/ext/json' I, [2024-05-25T23:10:02.320279 #3104266] INFO -- : make[2]: Leaving directory '/tmp/ruby/build/trunk/ext/pathname' I, [2024-05-25T23:10:02.320444 #3104266] INFO -- : make[2]: Entering directory '/tmp/ruby/build/trunk/.bundle/gems/debug-1.9.2/ext/debug' I, [2024-05-25T23:10:02.320466 #3104266] INFO -- : make[2]: Entering directory '/tmp/ruby/build/trunk/.bundle/gems/bigdecimal-3.1.8/ext/bigdecimal' I, [2024-05-25T23:10:02.320479 #3104266] INFO -- : make[2]: Entering directory '/tmp/ruby/build/trunk/.bundle/gems/nkf-0.2.0/ext/nkf' I, [2024-05-25T23:10:02.320710 #3104266] INFO -- : make[2]: Leaving directory '/tmp/ruby/build/trunk/ext/pty' I, [2024-05-25T23:10:02.320980 #3104266] INFO -- : make[2]: Entering directory '/tmp/ruby/build/trunk/.bundle/gems/racc-1.7.3/ext/racc/cparse' I, [2024-05-25T23:10:02.321129 #3104266] INFO -- : make[2]: Leaving directory '/tmp/ruby/build/trunk/ext/rubyvm' I, [2024-05-25T23:10:02.321388 #3104266] INFO -- : make[2]: Entering directory '/tmp/ruby/build/trunk/.bundle/gems/racc-1.8.0/ext/racc/cparse' I, [2024-05-25T23:10:02.321549 #3104266] INFO -- : make[2]: Entering directory '/tmp/ruby/build/trunk/ext/ripper' I, [2024-05-25T23:10:02.322018 #3104266] INFO -- : make[2]: Entering directory '/tmp/ruby/build/trunk/.bundle/gems/syslog-0.1.2/ext/syslog' I, [2024-05-25T23:10:02.322147 #3104266] INFO -- : make[2]: Entering directory '/tmp/ruby/build/trunk/.bundle/gems/rbs-3.4.4/ext/rbs_extension' I, [2024-05-25T23:10:02.322476 #3104266] INFO -- : make[2]: Leaving directory '/tmp/ruby/build/trunk/ext/objspace' I, [2024-05-25T23:10:02.326304 #3104266] INFO -- : make[2]: Entering directory '/tmp/ruby/build/trunk/ext/digest/sha2' I, [2024-05-25T23:10:02.326358 #3104266] INFO -- : make[2]: Leaving directory '/tmp/ruby/build/trunk/ext/fiddle' I, [2024-05-25T23:10:02.327822 #3104266] INFO -- : make[2]: Entering directory '/tmp/ruby/build/trunk/ext/socket' I, [2024-05-25T23:10:02.329144 #3104266] INFO -- : make[2]: Leaving directory '/tmp/ruby/build/trunk/ext/ripper' I, [2024-05-25T23:10:02.329415 #3104266] INFO -- : make[2]: Entering directory '/tmp/ruby/build/trunk/ext/openssl' I, [2024-05-25T23:10:02.329536 #3104266] INFO -- : make[2]: Leaving directory '/tmp/ruby/build/trunk/ext/digest/sha2' I, [2024-05-25T23:10:02.331153 #3104266] INFO -- : make[2]: Leaving directory '/tmp/ruby/build/trunk/ext/psych' I, [2024-05-25T23:10:02.334963 #3104266] INFO -- : make[2]: Leaving directory '/tmp/ruby/build/trunk/ext/socket' I, [2024-05-25T23:10:02.340695 #3104266] INFO -- : make[2]: Leaving directory '/tmp/ruby/build/trunk/ext/openssl' I, [2024-05-25T23:10:02.343637 #3104266] INFO -- : make[2]: Leaving directory '/tmp/ruby/build/trunk/.bundle/gems/bigdecimal-3.1.8/ext/bigdecimal' I, [2024-05-25T23:10:02.343973 #3104266] INFO -- : make[2]: Leaving directory '/tmp/ruby/build/trunk/.bundle/gems/nkf-0.2.0/ext/nkf' I, [2024-05-25T23:10:02.346342 #3104266] INFO -- : make[2]: Leaving directory '/tmp/ruby/build/trunk/.bundle/gems/debug-1.9.2/ext/debug' I, [2024-05-25T23:10:02.347223 #3104266] INFO -- : make[2]: Leaving directory '/tmp/ruby/build/trunk/.bundle/gems/racc-1.8.0/ext/racc/cparse' I, [2024-05-25T23:10:02.351608 #3104266] INFO -- : make[2]: Leaving directory '/tmp/ruby/build/trunk/.bundle/gems/syslog-0.1.2/ext/syslog' I, [2024-05-25T23:10:02.351952 #3104266] INFO -- : make[2]: Leaving directory '/tmp/ruby/build/trunk/.bundle/gems/racc-1.7.3/ext/racc/cparse' I, [2024-05-25T23:10:02.353280 #3104266] INFO -- : make[2]: Leaving directory '/tmp/ruby/build/trunk/.bundle/gems/rbs-3.4.4/ext/rbs_extension' I, [2024-05-25T23:10:02.376921 #3104266] INFO -- : make[2]: Entering directory '/tmp/ruby/build/trunk' I, [2024-05-25T23:10:02.444548 #3104266] INFO -- : make[2]: 'ruby' is up to date. I, [2024-05-25T23:10:02.444586 #3104266] INFO -- : make[2]: Leaving directory '/tmp/ruby/build/trunk' I, [2024-05-25T23:10:02.444993 #3104266] INFO -- : make[1]: Leaving directory '/tmp/ruby/build/trunk' I, [2024-05-25T23:10:02.448898 #3104266] INFO -- : make[1]: Entering directory '/tmp/ruby/build/trunk' I, [2024-05-25T23:10:02.448920 #3104266] INFO -- : make[1]: Nothing to be done for 'note'. I, [2024-05-25T23:10:02.448925 #3104266] INFO -- : make[1]: Leaving directory '/tmp/ruby/build/trunk' I, [2024-05-25T23:10:02.449263 #3104266] INFO -- : ./miniruby -I/tmp/ruby/src/trunk/lib -I. -I.ext/common /tmp/ruby/src/trunk/tool/runruby.rb --extout=.ext -- --disable-gems -r./x86_64-linux-fake /tmp/ruby/src/trunk/tool/rbinstall.rb --make="make" --dest-dir="" --extout=".ext" --ext-build-dir="./ext" --mflags="-j20 --jobserver-auth=4,5" --make-flags=" -j20 --jobserver-auth=4,5" --data-mode=0644 --prog-mode=0755 --installed-list .installed.list --mantype="doc" --gnumake --install=all --exclude=doc I, [2024-05-25T23:10:02.545326 #3104266] INFO -- : Installing to I, [2024-05-25T23:10:02.545373 #3104266] INFO -- : installing binary commands: /tmp/ruby/install/trunk/bin I, [2024-05-25T23:10:02.545482 #3104266] INFO -- : installing base libraries: /tmp/ruby/install/trunk/lib I, [2024-05-25T23:10:02.552693 #3104266] INFO -- : installing arch files: /tmp/ruby/install/trunk/lib/ruby/3.4.0+0/x86_64-linux I, [2024-05-25T23:10:02.552718 #3104266] INFO -- : installing pkgconfig data: /tmp/ruby/install/trunk/lib/pkgconfig I, [2024-05-25T23:10:02.552724 #3104266] INFO -- : installing extension objects: /tmp/ruby/install/trunk/lib/ruby/3.4.0+0/x86_64-linux I, [2024-05-25T23:10:02.562470 #3104266] INFO -- : installing extension objects: /tmp/ruby/install/trunk/lib/ruby/site_ruby/3.4.0+0/x86_64-linux I, [2024-05-25T23:10:02.562494 #3104266] INFO -- : installing extension objects: /tmp/ruby/install/trunk/lib/ruby/vendor_ruby/3.4.0+0/x86_64-linux I, [2024-05-25T23:10:02.562501 #3104266] INFO -- : installing extension headers: /tmp/ruby/install/trunk/include/ruby-3.4.0+0/x86_64-linux I, [2024-05-25T23:10:02.562658 #3104266] INFO -- : installing extension scripts: /tmp/ruby/install/trunk/lib/ruby/3.4.0+0 I, [2024-05-25T23:10:02.565415 #3104266] INFO -- : installing extension scripts: /tmp/ruby/install/trunk/lib/ruby/site_ruby/3.4.0+0 I, [2024-05-25T23:10:02.565443 #3104266] INFO -- : installing extension scripts: /tmp/ruby/install/trunk/lib/ruby/vendor_ruby/3.4.0+0 I, [2024-05-25T23:10:02.565449 #3104266] INFO -- : installing extension headers: /tmp/ruby/install/trunk/include/ruby-3.4.0+0/ruby I, [2024-05-25T23:10:02.565457 #3104266] INFO -- : installing command scripts: /tmp/ruby/install/trunk/bin I, [2024-05-25T23:10:02.565462 #3104266] INFO -- : installing library scripts: /tmp/ruby/install/trunk/lib/ruby/3.4.0+0 I, [2024-05-25T23:10:02.598205 #3104266] INFO -- : installing common headers: /tmp/ruby/install/trunk/include/ruby-3.4.0+0 I, [2024-05-25T23:10:02.604747 #3104266] INFO -- : installing manpages: /tmp/ruby/install/trunk/share/man/man1 I, [2024-05-25T23:10:02.604780 #3104266] INFO -- : installing default gems from lib: /tmp/ruby/install/trunk/lib/ruby/gems/3.4.0+0 I, [2024-05-25T23:10:02.627471 #3104266] INFO -- : benchmark 0.3.0 I, [2024-05-25T23:10:02.629476 #3104266] INFO -- : bundler 2.6.0.dev I, [2024-05-25T23:10:02.631605 #3104266] INFO -- : cgi 0.4.1 I, [2024-05-25T23:10:02.632157 #3104266] INFO -- : delegate 0.3.1 I, [2024-05-25T23:10:02.632638 #3104266] INFO -- : did_you_mean 1.6.3 I, [2024-05-25T23:10:02.633117 #3104266] INFO -- : english 0.8.0 I, [2024-05-25T23:10:02.633585 #3104266] INFO -- : erb 4.0.4 I, [2024-05-25T23:10:02.634635 #3104266] INFO -- : error_highlight 0.6.0 I, [2024-05-25T23:10:02.635549 #3104266] INFO -- : fileutils 1.7.2 I, [2024-05-25T23:10:02.636432 #3104266] INFO -- : find 0.2.0 I, [2024-05-25T23:10:02.637262 #3104266] INFO -- : forwardable 1.3.3 I, [2024-05-25T23:10:02.638201 #3104266] INFO -- : ipaddr 1.2.6 I, [2024-05-25T23:10:02.638773 #3104266] INFO -- : irb 1.13.1 I, [2024-05-25T23:10:02.639539 #3104266] INFO -- : logger 1.6.0 I, [2024-05-25T23:10:02.640029 #3104266] INFO -- : net-http 0.4.1 I, [2024-05-25T23:10:02.640530 #3104266] INFO -- : net-protocol 0.2.2 I, [2024-05-25T23:10:02.641002 #3104266] INFO -- : open-uri 0.4.1 I, [2024-05-25T23:10:02.641518 #3104266] INFO -- : open3 0.2.1 I, [2024-05-25T23:10:02.641974 #3104266] INFO -- : optparse 0.5.0 I, [2024-05-25T23:10:02.642381 #3104266] INFO -- : ostruct 0.6.0 I, [2024-05-25T23:10:02.642827 #3104266] INFO -- : pp 0.5.0 I, [2024-05-25T23:10:02.643386 #3104266] INFO -- : prettyprint 0.2.0 I, [2024-05-25T23:10:02.643823 #3104266] INFO -- : prism 0.29.0 I, [2024-05-25T23:10:02.644401 #3104266] INFO -- : pstore 0.1.3 I, [2024-05-25T23:10:02.644847 #3104266] INFO -- : rdoc 6.7.0 I, [2024-05-25T23:10:02.645832 #3104266] INFO -- : readline 0.0.4 I, [2024-05-25T23:10:02.646335 #3104266] INFO -- : reline 0.5.7 I, [2024-05-25T23:10:02.646846 #3104266] INFO -- : resolv 0.4.0 I, [2024-05-25T23:10:02.647415 #3104266] INFO -- : ruby2_keywords 0.0.5 I, [2024-05-25T23:10:02.647832 #3104266] INFO -- : securerandom 0.3.1 I, [2024-05-25T23:10:02.649030 #3104266] INFO -- : set 1.1.0 I, [2024-05-25T23:10:02.649438 #3104266] INFO -- : shellwords 0.2.0 I, [2024-05-25T23:10:02.650025 #3104266] INFO -- : singleton 0.2.0 I, [2024-05-25T23:10:02.650470 #3104266] INFO -- : syntax_suggest 2.0.0 I, [2024-05-25T23:10:02.651082 #3104266] INFO -- : tempfile 0.2.1 I, [2024-05-25T23:10:02.651610 #3104266] INFO -- : time 0.3.0 I, [2024-05-25T23:10:02.652110 #3104266] INFO -- : timeout 0.4.1 I, [2024-05-25T23:10:02.652574 #3104266] INFO -- : tmpdir 0.2.0 I, [2024-05-25T23:10:02.653032 #3104266] INFO -- : tsort 0.2.0 I, [2024-05-25T23:10:02.653474 #3104266] INFO -- : un 0.3.0 I, [2024-05-25T23:10:02.653924 #3104266] INFO -- : uri 0.13.0 I, [2024-05-25T23:10:02.654436 #3104266] INFO -- : weakref 0.1.3 I, [2024-05-25T23:10:02.654812 #3104266] INFO -- : yaml 0.3.0 I, [2024-05-25T23:10:02.655170 #3104266] INFO -- : installing default gems from ext: /tmp/ruby/install/trunk/lib/ruby/gems/3.4.0+0 I, [2024-05-25T23:10:02.661900 #3104266] INFO -- : date 3.3.4 I, [2024-05-25T23:10:02.662430 #3104266] INFO -- : digest 3.1.1 I, [2024-05-25T23:10:02.662918 #3104266] INFO -- : etc 1.4.3 I, [2024-05-25T23:10:02.663420 #3104266] INFO -- : fcntl 1.1.0 I, [2024-05-25T23:10:02.663963 #3104266] INFO -- : fiddle 1.1.3 I, [2024-05-25T23:10:02.664465 #3104266] INFO -- : io-console 0.7.2 I, [2024-05-25T23:10:02.664870 #3104266] INFO -- : io-nonblock 0.3.0 I, [2024-05-25T23:10:02.665388 #3104266] INFO -- : io-wait 0.3.1 I, [2024-05-25T23:10:02.665823 #3104266] INFO -- : json 2.7.2 I, [2024-05-25T23:10:02.666336 #3104266] INFO -- : openssl 3.2.0 I, [2024-05-25T23:10:02.666913 #3104266] INFO -- : pathname 0.3.0 I, [2024-05-25T23:10:02.667393 #3104266] INFO -- : psych 5.1.2 I, [2024-05-25T23:10:02.667887 #3104266] INFO -- : stringio 3.1.1 I, [2024-05-25T23:10:02.668443 #3104266] INFO -- : strscan 3.1.1 I, [2024-05-25T23:10:02.668899 #3104266] INFO -- : zlib 3.1.0 I, [2024-05-25T23:10:02.669240 #3104266] INFO -- : installing bundled gems: /tmp/ruby/install/trunk/lib/ruby/gems/3.4.0+0 I, [2024-05-25T23:10:02.669825 #3104266] INFO -- : minitest 5.23.1 I, [2024-05-25T23:10:02.678526 #3104266] INFO -- : rake 13.2.1 I, [2024-05-25T23:10:02.681999 #3104266] INFO -- : test-unit 3.6.2 I, [2024-05-25T23:10:02.686869 #3104266] INFO -- : rexml 3.2.8 I, [2024-05-25T23:10:02.690729 #3104266] INFO -- : rss 0.3.0 I, [2024-05-25T23:10:02.693306 #3104266] INFO -- : net-ftp 0.3.4 I, [2024-05-25T23:10:02.694908 #3104266] INFO -- : net-imap 0.4.11 I, [2024-05-25T23:10:02.698763 #3104266] INFO -- : net-pop 0.1.2 I, [2024-05-25T23:10:02.699779 #3104266] INFO -- : net-smtp 0.5.0 I, [2024-05-25T23:10:02.700923 #3104266] INFO -- : matrix 0.4.2 I, [2024-05-25T23:10:02.704392 #3104266] INFO -- : prime 0.1.2 I, [2024-05-25T23:10:02.709058 #3104266] INFO -- : rbs 3.4.4 I, [2024-05-25T23:10:02.731393 #3104266] INFO -- : typeprof 0.21.11 I, [2024-05-25T23:10:02.733723 #3104266] INFO -- : debug 1.9.2 I, [2024-05-25T23:10:02.737274 #3104266] INFO -- : racc 1.8.0 I, [2024-05-25T23:10:02.739969 #3104266] INFO -- : mutex_m 0.2.0 I, [2024-05-25T23:10:02.741271 #3104266] INFO -- : getoptlong 0.2.1 I, [2024-05-25T23:10:02.742647 #3104266] INFO -- : base64 0.2.0 I, [2024-05-25T23:10:02.743732 #3104266] INFO -- : bigdecimal 3.1.8 I, [2024-05-25T23:10:02.746459 #3104266] INFO -- : observer 0.1.2 I, [2024-05-25T23:10:02.747644 #3104266] INFO -- : abbrev 0.1.2 I, [2024-05-25T23:10:02.748916 #3104266] INFO -- : resolv-replace 0.1.1 I, [2024-05-25T23:10:02.750181 #3104266] INFO -- : rinda 0.2.0 I, [2024-05-25T23:10:02.751527 #3104266] INFO -- : drb 2.2.1 I, [2024-05-25T23:10:02.753275 #3104266] INFO -- : nkf 0.2.0 I, [2024-05-25T23:10:02.755749 #3104266] INFO -- : syslog 0.1.2 I, [2024-05-25T23:10:02.757910 #3104266] INFO -- : csv 3.3.0 I, [2024-05-25T23:10:02.760511 #3104266] INFO -- : installing bundled gem cache: /tmp/ruby/install/trunk/lib/ruby/gems/3.4.0+0/cache I, [2024-05-25T23:10:02.761892 #3104266] INFO -- : skipped bundled gems: I, [2024-05-25T23:10:02.761912 #3104266] INFO -- : power_assert-2.0.4dev.gem not found in bundled_gems I, [2024-05-25T23:10:02.764935 #3104266] INFO -- : $$$[end] "make install -j20" exit with 0. I, [2024-05-25T23:10:02.765033 #3104266] INFO -- : $$$[beg] make yes-btest TESTOPTS='-q -j20' I, [2024-05-25T23:10:08.091205 #3104266] INFO -- : PASS all 1936 tests E, [2024-05-25T23:10:08.096770 #3104266] ERROR -- : I, [2024-05-25T23:10:08.097013 #3104266] INFO -- : $$$[end] "make yes-btest TESTOPTS='-q -j20'" exit with 0. I, [2024-05-25T23:10:08.097120 #3104266] INFO -- : $$$[beg] make yes-test-basic TESTS='-j20' I, [2024-05-25T23:10:08.159096 #3104266] INFO -- : BASERUBY = /usr/bin/ruby --disable=gems I, [2024-05-25T23:10:08.159147 #3104266] INFO -- : CC = gcc I, [2024-05-25T23:10:08.159163 #3104266] INFO -- : LD = ld I, [2024-05-25T23:10:08.159177 #3104266] INFO -- : LDSHARED = gcc -shared I, [2024-05-25T23:10:08.159191 #3104266] INFO -- : CFLAGS = -O3 -fno-fast-math -ggdb3 -Wall -Wextra -Wdeprecated-declarations -Wdiv-by-zero -Wduplicated-cond -Wimplicit-function-declaration -Wimplicit-int -Wpointer-arith -Wwrite-strings -Wold-style-definition -Wimplicit-fallthrough=0 -Wmissing-noreturn -Wno-cast-function-type -Wno-constant-logical-operand -Wno-long-long -Wno-missing-field-initializers -Wno-overlength-strings -Wno-packed-bitfield-compat -Wno-parentheses-equality -Wno-self-assign -Wno-tautological-compare -Wno-unused-parameter -Wno-unused-value -Wsuggest-attribute=format -Wsuggest-attribute=noreturn -Wunused-variable -Wmisleading-indentation -Wundef -fPIC I, [2024-05-25T23:10:08.159217 #3104266] INFO -- : XCFLAGS = -U_FORTIFY_SOURCE -D_FORTIFY_SOURCE=2 -fstack-protector-strong -fno-strict-overflow -fvisibility=hidden -fexcess-precision=standard -DRUBY_EXPORT -I. -I.ext/include/x86_64-linux -I/tmp/ruby/src/trunk/include -I/tmp/ruby/src/trunk -I/tmp/ruby/src/trunk/prism -I/tmp/ruby/src/trunk/enc/unicode/15.0.0 I, [2024-05-25T23:10:08.159231 #3104266] INFO -- : CPPFLAGS = I, [2024-05-25T23:10:08.159245 #3104266] INFO -- : DLDFLAGS = -Wl,--compress-debug-sections=zlib -Wl,-soname,libruby.so.3.4 -fstack-protector-strong I, [2024-05-25T23:10:08.159268 #3104266] INFO -- : SOLIBS = -lz -lrt -lrt -lgmp -ldl -lcrypt -lm -lpthread I, [2024-05-25T23:10:08.159282 #3104266] INFO -- : LANG = en_US.UTF-8 I, [2024-05-25T23:10:08.159294 #3104266] INFO -- : LC_ALL = I, [2024-05-25T23:10:08.159307 #3104266] INFO -- : LC_CTYPE = I, [2024-05-25T23:10:08.159319 #3104266] INFO -- : MFLAGS = I, [2024-05-25T23:10:08.159331 #3104266] INFO -- : RUSTC = no I, [2024-05-25T23:10:08.159343 #3104266] INFO -- : YJIT_RUSTC_ARGS = --crate-name=yjit --crate-type=staticlib --edition=2021 -g -C lto=thin -C opt-level=3 -C overflow-checks=on '--out-dir=/tmp/ruby/build/trunk/yjit/target/release/' /tmp/ruby/src/trunk/yjit/src/lib.rs I, [2024-05-25T23:10:08.159626 #3104266] INFO -- : gcc (Ubuntu 11.4.0-1ubuntu1~22.04) 11.4.0 I, [2024-05-25T23:10:08.159672 #3104266] INFO -- : Copyright (C) 2021 Free Software Foundation, Inc. I, [2024-05-25T23:10:08.159694 #3104266] INFO -- : This is free software; see the source for copying conditions. There is NO I, [2024-05-25T23:10:08.159709 #3104266] INFO -- : warranty; not even for MERCHANTABILITY or FITNESS FOR A PARTICULAR PURPOSE. I, [2024-05-25T23:10:08.159722 #3104266] INFO -- : I, [2024-05-25T23:10:08.267151 #3104266] INFO -- : Checking leaked global symbols...none I, [2024-05-25T23:10:08.307496 #3104266] INFO -- : /tmp/ruby/src/trunk/basictest/test.rb:assignment ....................................................................................................................................................................................................................................................................................................................................................................................OK 372 I, [2024-05-25T23:10:08.307594 #3104266] INFO -- : /tmp/ruby/src/trunk/basictest/test.rb:condition ..OK 2 I, [2024-05-25T23:10:08.307612 #3104266] INFO -- : /tmp/ruby/src/trunk/basictest/test.rb:if/unless ...OK 3 I, [2024-05-25T23:10:08.307625 #3104266] INFO -- : /tmp/ruby/src/trunk/basictest/test.rb:case .....OK 5 I, [2024-05-25T23:10:08.307757 #3104266] INFO -- : /tmp/ruby/src/trunk/basictest/test.rb:while/until ........OK 8 I, [2024-05-25T23:10:08.307812 #3104266] INFO -- : /tmp/ruby/src/trunk/basictest/test.rb:exception ..........OK 10 I, [2024-05-25T23:10:08.308085 #3104266] INFO -- : /tmp/ruby/src/trunk/basictest/test.rb:array .......................................OK 39 I, [2024-05-25T23:10:08.308188 #3104266] INFO -- : /tmp/ruby/src/trunk/basictest/test.rb:hash ...........................OK 27 I, [2024-05-25T23:10:08.308903 #3104266] INFO -- : /tmp/ruby/src/trunk/basictest/test.rb:iterator ...........................................................................................................OK 107 I, [2024-05-25T23:10:08.309175 #3104266] INFO -- : /tmp/ruby/src/trunk/basictest/test.rb:float ................................................................................OK 80 I, [2024-05-25T23:10:08.311086 #3104266] INFO -- : /tmp/ruby/src/trunk/basictest/test.rb:bignum ...............................OK 31 I, [2024-05-25T23:10:08.311980 #3104266] INFO -- : /tmp/ruby/src/trunk/basictest/test.rb:string & char ..............................................................OK 62 I, [2024-05-25T23:10:08.312013 #3104266] INFO -- : /tmp/ruby/src/trunk/basictest/test.rb:assignment ..........OK 10 I, [2024-05-25T23:10:08.312045 #3104266] INFO -- : /tmp/ruby/src/trunk/basictest/test.rb:call ......OK 6 I, [2024-05-25T23:10:08.312105 #3104266] INFO -- : /tmp/ruby/src/trunk/basictest/test.rb:proc .........OK 9 I, [2024-05-25T23:10:08.412738 #3104266] INFO -- : /tmp/ruby/src/trunk/basictest/test.rb:signal ..OK 2 I, [2024-05-25T23:10:08.414734 #3104266] INFO -- : /tmp/ruby/src/trunk/basictest/test.rb:eval ...........................OK 27 I, [2024-05-25T23:10:08.523738 #3104266] INFO -- : /tmp/ruby/src/trunk/basictest/test.rb:system ........OK 8 I, [2024-05-25T23:10:08.523836 #3104266] INFO -- : /tmp/ruby/src/trunk/basictest/test.rb:const .....OK 5 I, [2024-05-25T23:10:08.523864 #3104266] INFO -- : /tmp/ruby/src/trunk/basictest/test.rb:clone .....OK 5 I, [2024-05-25T23:10:08.523895 #3104266] INFO -- : /tmp/ruby/src/trunk/basictest/test.rb:marshal ....OK 4 I, [2024-05-25T23:10:08.524027 #3104266] INFO -- : /tmp/ruby/src/trunk/basictest/test.rb:pack ....OK 4 I, [2024-05-25T23:10:08.524051 #3104266] INFO -- : /tmp/ruby/src/trunk/basictest/test.rb:math ..OK 2 I, [2024-05-25T23:10:08.524085 #3104266] INFO -- : /tmp/ruby/src/trunk/basictest/test.rb:struct ......OK 6 I, [2024-05-25T23:10:08.524216 #3104266] INFO -- : /tmp/ruby/src/trunk/basictest/test.rb:variable ............OK 12 I, [2024-05-25T23:10:08.524240 #3104266] INFO -- : /tmp/ruby/src/trunk/basictest/test.rb:trace ...OK 3 I, [2024-05-25T23:10:08.524254 #3104266] INFO -- : /tmp/ruby/src/trunk/basictest/test.rb:defined? ............OK 12 I, [2024-05-25T23:10:08.524291 #3104266] INFO -- : /tmp/ruby/src/trunk/basictest/test.rb:alias ......OK 6 I, [2024-05-25T23:10:08.524660 #3104266] INFO -- : /tmp/ruby/src/trunk/basictest/test.rb:path .......................OK 23 I, [2024-05-25T23:10:08.557481 #3104266] INFO -- : /tmp/ruby/src/trunk/basictest/test.rb:gc ....OK 4 I, [2024-05-25T23:10:08.559753 #3104266] INFO -- : I, [2024-05-25T23:10:08.559817 #3104266] INFO -- : test succeeded I, [2024-05-25T23:10:08.561163 #3104266] INFO -- : $$$[end] "make yes-test-basic TESTS='-j20'" exit with 0. I, [2024-05-25T23:10:08.561301 #3104266] INFO -- : $$$[beg] make yes-test-all TESTOPTS='--stderr-on-failure' TESTS='-j20' I, [2024-05-25T23:10:08.652174 #3104266] INFO -- : BASERUBY = /usr/bin/ruby --disable=gems I, [2024-05-25T23:10:08.652212 #3104266] INFO -- : CC = gcc I, [2024-05-25T23:10:08.652217 #3104266] INFO -- : LD = ld I, [2024-05-25T23:10:08.652221 #3104266] INFO -- : LDSHARED = gcc -shared I, [2024-05-25T23:10:08.652226 #3104266] INFO -- : CFLAGS = -O3 -fno-fast-math -ggdb3 -Wall -Wextra -Wdeprecated-declarations -Wdiv-by-zero -Wduplicated-cond -Wimplicit-function-declaration -Wimplicit-int -Wpointer-arith -Wwrite-strings -Wold-style-definition -Wimplicit-fallthrough=0 -Wmissing-noreturn -Wno-cast-function-type -Wno-constant-logical-operand -Wno-long-long -Wno-missing-field-initializers -Wno-overlength-strings -Wno-packed-bitfield-compat -Wno-parentheses-equality -Wno-self-assign -Wno-tautological-compare -Wno-unused-parameter -Wno-unused-value -Wsuggest-attribute=format -Wsuggest-attribute=noreturn -Wunused-variable -Wmisleading-indentation -Wundef -fPIC I, [2024-05-25T23:10:08.652230 #3104266] INFO -- : XCFLAGS = -U_FORTIFY_SOURCE -D_FORTIFY_SOURCE=2 -fstack-protector-strong -fno-strict-overflow -fvisibility=hidden -fexcess-precision=standard -DRUBY_EXPORT -I. -I.ext/include/x86_64-linux -I/tmp/ruby/src/trunk/include -I/tmp/ruby/src/trunk -I/tmp/ruby/src/trunk/prism -I/tmp/ruby/src/trunk/enc/unicode/15.0.0 I, [2024-05-25T23:10:08.652234 #3104266] INFO -- : CPPFLAGS = I, [2024-05-25T23:10:08.652238 #3104266] INFO -- : DLDFLAGS = -Wl,--compress-debug-sections=zlib -Wl,-soname,libruby.so.3.4 -fstack-protector-strong I, [2024-05-25T23:10:08.652242 #3104266] INFO -- : SOLIBS = -lz -lrt -lrt -lgmp -ldl -lcrypt -lm -lpthread I, [2024-05-25T23:10:08.652246 #3104266] INFO -- : LANG = en_US.UTF-8 I, [2024-05-25T23:10:08.652249 #3104266] INFO -- : LC_ALL = I, [2024-05-25T23:10:08.652253 #3104266] INFO -- : LC_CTYPE = I, [2024-05-25T23:10:08.652257 #3104266] INFO -- : MFLAGS = I, [2024-05-25T23:10:08.652261 #3104266] INFO -- : RUSTC = no I, [2024-05-25T23:10:08.652265 #3104266] INFO -- : YJIT_RUSTC_ARGS = --crate-name=yjit --crate-type=staticlib --edition=2021 -g -C lto=thin -C opt-level=3 -C overflow-checks=on '--out-dir=/tmp/ruby/build/trunk/yjit/target/release/' /tmp/ruby/src/trunk/yjit/src/lib.rs I, [2024-05-25T23:10:08.652908 #3104266] INFO -- : gcc (Ubuntu 11.4.0-1ubuntu1~22.04) 11.4.0 I, [2024-05-25T23:10:08.652933 #3104266] INFO -- : Copyright (C) 2021 Free Software Foundation, Inc. I, [2024-05-25T23:10:08.652948 #3104266] INFO -- : This is free software; see the source for copying conditions. There is NO I, [2024-05-25T23:10:08.652953 #3104266] INFO -- : warranty; not even for MERCHANTABILITY or FITNESS FOR A PARTICULAR PURPOSE. I, [2024-05-25T23:10:08.652957 #3104266] INFO -- : I, [2024-05-25T23:10:08.654676 #3104266] INFO -- : generating enc.mk I, [2024-05-25T23:10:08.776387 #3104266] INFO -- : generating encdb.h I, [2024-05-25T23:10:08.801062 #3104266] INFO -- : encdb.h unchanged I, [2024-05-25T23:10:08.802149 #3104266] INFO -- : making enc I, [2024-05-25T23:10:08.825478 #3104266] INFO -- : make[1]: Entering directory '/tmp/ruby/build/trunk' I, [2024-05-25T23:10:08.825499 #3104266] INFO -- : make[1]: Nothing to be done for 'enc'. I, [2024-05-25T23:10:08.825504 #3104266] INFO -- : make[1]: Leaving directory '/tmp/ruby/build/trunk' I, [2024-05-25T23:10:08.826220 #3104266] INFO -- : making srcs under enc I, [2024-05-25T23:10:08.857705 #3104266] INFO -- : make[1]: Entering directory '/tmp/ruby/build/trunk' I, [2024-05-25T23:10:08.857726 #3104266] INFO -- : make[1]: Nothing to be done for 'srcs'. I, [2024-05-25T23:10:08.857731 #3104266] INFO -- : make[1]: Leaving directory '/tmp/ruby/build/trunk' I, [2024-05-25T23:10:08.858778 #3104266] INFO -- : generating transdb.h I, [2024-05-25T23:10:08.955591 #3104266] INFO -- : transdb.h unchanged I, [2024-05-25T23:10:08.956989 #3104266] INFO -- : making trans I, [2024-05-25T23:10:08.991241 #3104266] INFO -- : make[1]: Entering directory '/tmp/ruby/build/trunk' I, [2024-05-25T23:10:08.991263 #3104266] INFO -- : make[1]: Nothing to be done for 'trans'. I, [2024-05-25T23:10:08.991269 #3104266] INFO -- : make[1]: Leaving directory '/tmp/ruby/build/trunk' I, [2024-05-25T23:10:08.991911 #3104266] INFO -- : making encs I, [2024-05-25T23:10:09.029591 #3104266] INFO -- : make[1]: Entering directory '/tmp/ruby/build/trunk' I, [2024-05-25T23:10:09.029617 #3104266] INFO -- : make[1]: Nothing to be done for 'encs'. I, [2024-05-25T23:10:09.029623 #3104266] INFO -- : make[1]: Leaving directory '/tmp/ruby/build/trunk' I, [2024-05-25T23:10:09.031446 #3104266] INFO -- : generating makefiles ext/configure-ext.mk I, [2024-05-25T23:10:09.063754 #3104266] INFO -- : ext/configure-ext.mk updated I, [2024-05-25T23:10:09.066291 #3104266] INFO -- : make[1]: Entering directory '/tmp/ruby/build/trunk' I, [2024-05-25T23:10:10.464879 #3104266] INFO -- : make[1]: Leaving directory '/tmp/ruby/build/trunk' I, [2024-05-25T23:10:10.465549 #3104266] INFO -- : generating makefile exts.mk I, [2024-05-25T23:10:10.502424 #3104266] INFO -- : exts.mk unchanged I, [2024-05-25T23:10:10.507165 #3104266] INFO -- : make[1]: Entering directory '/tmp/ruby/build/trunk' I, [2024-05-25T23:10:10.826454 #3104266] INFO -- : make[2]: Entering directory '/tmp/ruby/build/trunk/ext/coverage' I, [2024-05-25T23:10:10.831177 #3104266] INFO -- : make[2]: Leaving directory '/tmp/ruby/build/trunk/ext/coverage' I, [2024-05-25T23:10:10.837734 #3104266] INFO -- : make[2]: Entering directory '/tmp/ruby/build/trunk/ext/date' I, [2024-05-25T23:10:10.842799 #3104266] INFO -- : make[2]: Leaving directory '/tmp/ruby/build/trunk/ext/date' I, [2024-05-25T23:10:10.846617 #3104266] INFO -- : make[2]: Entering directory '/tmp/ruby/build/trunk/ext/digest' I, [2024-05-25T23:10:10.855720 #3104266] INFO -- : make[2]: Leaving directory '/tmp/ruby/build/trunk/ext/digest' I, [2024-05-25T23:10:10.882043 #3104266] INFO -- : make[2]: Entering directory '/tmp/ruby/build/trunk/ext/digest/sha2' I, [2024-05-25T23:10:10.886906 #3104266] INFO -- : make[2]: Leaving directory '/tmp/ruby/build/trunk/ext/digest/sha2' I, [2024-05-25T23:10:10.908129 #3104266] INFO -- : make[2]: Entering directory '/tmp/ruby/build/trunk/ext/fiddle' I, [2024-05-25T23:10:10.918540 #3104266] INFO -- : make[2]: Leaving directory '/tmp/ruby/build/trunk/ext/fiddle' I, [2024-05-25T23:10:10.922789 #3104266] INFO -- : make[2]: Entering directory '/tmp/ruby/build/trunk/ext/io/console' I, [2024-05-25T23:10:10.926899 #3104266] INFO -- : make[2]: Leaving directory '/tmp/ruby/build/trunk/ext/io/console' I, [2024-05-25T23:10:10.939838 #3104266] INFO -- : make[2]: Entering directory '/tmp/ruby/build/trunk/ext/json' I, [2024-05-25T23:10:10.950477 #3104266] INFO -- : make[2]: Leaving directory '/tmp/ruby/build/trunk/ext/json' I, [2024-05-25T23:10:10.965710 #3104266] INFO -- : make[2]: Entering directory '/tmp/ruby/build/trunk/ext/monitor' I, [2024-05-25T23:10:10.969763 #3104266] INFO -- : make[2]: Leaving directory '/tmp/ruby/build/trunk/ext/monitor' I, [2024-05-25T23:10:10.977314 #3104266] INFO -- : make[2]: Entering directory '/tmp/ruby/build/trunk/ext/objspace' I, [2024-05-25T23:10:10.983451 #3104266] INFO -- : make[2]: Leaving directory '/tmp/ruby/build/trunk/ext/objspace' I, [2024-05-25T23:10:11.001345 #3104266] INFO -- : make[2]: Entering directory '/tmp/ruby/build/trunk/ext/openssl' I, [2024-05-25T23:10:11.023541 #3104266] INFO -- : make[2]: Leaving directory '/tmp/ruby/build/trunk/ext/openssl' I, [2024-05-25T23:10:11.028368 #3104266] INFO -- : make[2]: Entering directory '/tmp/ruby/build/trunk/ext/pathname' I, [2024-05-25T23:10:11.032484 #3104266] INFO -- : make[2]: Leaving directory '/tmp/ruby/build/trunk/ext/pathname' I, [2024-05-25T23:10:11.039637 #3104266] INFO -- : make[2]: Entering directory '/tmp/ruby/build/trunk/ext/psych' I, [2024-05-25T23:10:11.062052 #3104266] INFO -- : make[2]: Leaving directory '/tmp/ruby/build/trunk/ext/psych' I, [2024-05-25T23:10:11.065376 #3104266] INFO -- : make[2]: Entering directory '/tmp/ruby/build/trunk/ext/pty' I, [2024-05-25T23:10:11.068585 #3104266] INFO -- : make[2]: Leaving directory '/tmp/ruby/build/trunk/ext/pty' I, [2024-05-25T23:10:11.083909 #3104266] INFO -- : make[2]: Entering directory '/tmp/ruby/build/trunk/ext/ripper' I, [2024-05-25T23:10:11.090452 #3104266] INFO -- : make[2]: Leaving directory '/tmp/ruby/build/trunk/ext/ripper' I, [2024-05-25T23:10:11.092698 #3104266] INFO -- : make[2]: Entering directory '/tmp/ruby/build/trunk/ext/rubyvm' I, [2024-05-25T23:10:11.095825 #3104266] INFO -- : make[2]: Leaving directory '/tmp/ruby/build/trunk/ext/rubyvm' I, [2024-05-25T23:10:11.109756 #3104266] INFO -- : make[2]: Entering directory '/tmp/ruby/build/trunk/ext/socket' I, [2024-05-25T23:10:11.119820 #3104266] INFO -- : make[2]: Leaving directory '/tmp/ruby/build/trunk/ext/socket' I, [2024-05-25T23:10:11.138029 #3104266] INFO -- : make[2]: Entering directory '/tmp/ruby/build/trunk/.bundle/gems/bigdecimal-3.1.8/ext/bigdecimal' I, [2024-05-25T23:10:11.163998 #3104266] INFO -- : make[2]: Leaving directory '/tmp/ruby/build/trunk/.bundle/gems/bigdecimal-3.1.8/ext/bigdecimal' I, [2024-05-25T23:10:11.165831 #3104266] INFO -- : make[2]: Entering directory '/tmp/ruby/build/trunk/.bundle/gems/debug-1.9.2/ext/debug' I, [2024-05-25T23:10:11.187543 #3104266] INFO -- : make[2]: Leaving directory '/tmp/ruby/build/trunk/.bundle/gems/debug-1.9.2/ext/debug' I, [2024-05-25T23:10:11.189443 #3104266] INFO -- : make[2]: Entering directory '/tmp/ruby/build/trunk/.bundle/gems/nkf-0.2.0/ext/nkf' I, [2024-05-25T23:10:11.210747 #3104266] INFO -- : make[2]: Leaving directory '/tmp/ruby/build/trunk/.bundle/gems/nkf-0.2.0/ext/nkf' I, [2024-05-25T23:10:11.212729 #3104266] INFO -- : make[2]: Entering directory '/tmp/ruby/build/trunk/.bundle/gems/racc-1.7.3/ext/racc/cparse' I, [2024-05-25T23:10:11.235510 #3104266] INFO -- : make[2]: Leaving directory '/tmp/ruby/build/trunk/.bundle/gems/racc-1.7.3/ext/racc/cparse' I, [2024-05-25T23:10:11.237402 #3104266] INFO -- : make[2]: Entering directory '/tmp/ruby/build/trunk/.bundle/gems/racc-1.8.0/ext/racc/cparse' I, [2024-05-25T23:10:11.260315 #3104266] INFO -- : make[2]: Leaving directory '/tmp/ruby/build/trunk/.bundle/gems/racc-1.8.0/ext/racc/cparse' I, [2024-05-25T23:10:11.262841 #3104266] INFO -- : make[2]: Entering directory '/tmp/ruby/build/trunk/.bundle/gems/rbs-3.4.4/ext/rbs_extension' I, [2024-05-25T23:10:11.284324 #3104266] INFO -- : make[2]: Leaving directory '/tmp/ruby/build/trunk/.bundle/gems/rbs-3.4.4/ext/rbs_extension' I, [2024-05-25T23:10:11.286282 #3104266] INFO -- : make[2]: Entering directory '/tmp/ruby/build/trunk/.bundle/gems/syslog-0.1.2/ext/syslog' I, [2024-05-25T23:10:11.310109 #3104266] INFO -- : make[2]: Leaving directory '/tmp/ruby/build/trunk/.bundle/gems/syslog-0.1.2/ext/syslog' I, [2024-05-25T23:10:11.334484 #3104266] INFO -- : make[2]: Entering directory '/tmp/ruby/build/trunk' I, [2024-05-25T23:10:11.399232 #3104266] INFO -- : make[2]: 'ruby' is up to date. I, [2024-05-25T23:10:11.399273 #3104266] INFO -- : make[2]: Leaving directory '/tmp/ruby/build/trunk' I, [2024-05-25T23:10:11.399533 #3104266] INFO -- : make[1]: Leaving directory '/tmp/ruby/build/trunk' I, [2024-05-25T23:10:11.403280 #3104266] INFO -- : make[1]: Entering directory '/tmp/ruby/build/trunk' I, [2024-05-25T23:10:11.403304 #3104266] INFO -- : make[1]: Nothing to be done for 'note'. I, [2024-05-25T23:10:11.403310 #3104266] INFO -- : make[1]: Leaving directory '/tmp/ruby/build/trunk' I, [2024-05-25T23:10:11.478759 #3104266] INFO -- : Run options: I, [2024-05-25T23:10:11.478817 #3104266] INFO -- : --seed=33824 I, [2024-05-25T23:10:11.478824 #3104266] INFO -- : "--ruby=./miniruby -I/tmp/ruby/src/trunk/lib -I. -I.ext/common /tmp/ruby/src/trunk/tool/runruby.rb --extout=.ext -- --disable-gems" I, [2024-05-25T23:10:11.478829 #3104266] INFO -- : --excludes-dir=/tmp/ruby/src/trunk/test/.excludes I, [2024-05-25T23:10:11.478835 #3104266] INFO -- : --name=!/memory_leak/ I, [2024-05-25T23:10:11.478845 #3104266] INFO -- : --stderr-on-failure I, [2024-05-25T23:10:11.478849 #3104266] INFO -- : -j20 I, [2024-05-25T23:10:11.478853 #3104266] INFO -- : I, [2024-05-25T23:10:11.478862 #3104266] INFO -- : # Running tests: I, [2024-05-25T23:10:11.478866 #3104266] INFO -- : I, [2024-05-25T23:10:11.611218 #3104266] INFO -- : [ 1/883] 3145632=test_kwargs I, [2024-05-25T23:10:11.629176 #3104266] INFO -- : [ 2/883] 3145632=warnings_test I, [2024-05-25T23:10:11.629242 #3104266] INFO -- : [ 3/883] 3145619=test_gem_commands_exec_command I, [2024-05-25T23:10:11.629285 #3104266] INFO -- : [ 4/883] 3145621=test_io_wait I, [2024-05-25T23:10:11.629331 #3104266] INFO -- : [ 5/883] 3145618=test_date_attr I, [2024-05-25T23:10:11.629381 #3104266] INFO -- : [ 6/883] 3145620=test_ellipsize I, [2024-05-25T23:10:11.631914 #3104266] INFO -- : [ 7/883] 3145622=test_summary I, [2024-05-25T23:10:11.632017 #3104266] INFO -- : [ 8/883] 3145634=test_console_attr I, [2024-05-25T23:10:11.632100 #3104266] INFO -- : [ 9/883] 3145630=test_type_completor I, [2024-05-25T23:10:11.632624 #3104266] INFO -- : [ 10/883] 3145633=test_win32ole_record I, [2024-05-25T23:10:11.633172 #3104266] INFO -- : [ 11/883] 3145635=test_gem_unsatisfiable_dependency_error I, [2024-05-25T23:10:11.633384 #3104266] INFO -- : [ 12/883] 3145631=test_condition I, [2024-05-25T23:10:11.635247 #3104266] INFO -- : [ 13/883] 3145634=test_foreach I, [2024-05-25T23:10:11.635510 #3104266] INFO -- : [ 14/883] 3145633=test_gem_source_specific_file I, [2024-05-25T23:10:11.635952 #3104266] INFO -- : [ 15/883] 3145630=test_gem_commands_uninstall_command I, [2024-05-25T23:10:11.635995 #3104266] INFO -- : [ 16/883] 3145631=test_cp949 I, [2024-05-25T23:10:11.637376 #3104266] INFO -- : [ 17/883] 3145618=test_io I, [2024-05-25T23:10:11.637701 #3104266] INFO -- : [ 18/883] 3145634=test_hash I, [2024-05-25T23:10:11.646255 #3104266] INFO -- : [ 19/883] 3145631=test_ubf_async_safe I, [2024-05-25T23:10:11.649146 #3104266] INFO -- : [ 20/883] 3145620=test_emoji I, [2024-05-25T23:10:11.650900 #3104266] INFO -- : [ 21/883] 3145631=test_win32ole_type_event I, [2024-05-25T23:10:11.651274 #3104266] INFO -- : [ 22/883] 3145631=test_sorted_set I, [2024-05-25T23:10:11.652596 #3104266] INFO -- : [ 23/883] 3145629=test_pack I, [2024-05-25T23:10:11.661703 #3104266] INFO -- : [ 24/883] 3145625=test_array_create I, [2024-05-25T23:10:11.662149 #3104266] INFO -- : [ 25/883] 3145636=test_gem_impossible_dependencies_error I, [2024-05-25T23:10:11.663474 #3104266] INFO -- : [ 26/883] 3145626=test_to_ruby I, [2024-05-25T23:10:11.664078 #3104266] INFO -- : [ 27/883] 3145628=test_pattern_key_name_check I, [2024-05-25T23:10:11.665586 #3104266] INFO -- : [ 28/883] 3145620=test_rdoc_rubygems_hook I, [2024-05-25T23:10:11.665859 #3104266] INFO -- : [ 29/883] 3145625=test_method I, [2024-05-25T23:10:11.672988 #3104266] INFO -- : [ 30/883] 3145628=test_gem_commands_query_command I, [2024-05-25T23:10:11.674139 #3104266] INFO -- : [ 31/883] 3145624=test_euc_kr I, [2024-05-25T23:10:11.675382 #3104266] INFO -- : [ 32/883] 3145617=test_rdoc_context_section I, [2024-05-25T23:10:11.676867 #3104266] INFO -- : [ 33/883] 3145632=test_ftp I, [2024-05-25T23:10:11.677626 #3104266] INFO -- : [ 34/883] 3145627=test_gem_security_trust_dir I, [2024-05-25T23:10:11.677886 #3104266] INFO -- : [ 35/883] 3145623=test_gem_requirement I, [2024-05-25T23:10:11.679365 #3104266] INFO -- : [ 36/883] 3145624=test_sprintf I, [2024-05-25T23:10:11.693850 #3104266] INFO -- : [ 37/883] 3145632=comments_test I, [2024-05-25T23:10:11.700079 #3104266] INFO -- : [ 38/883] 3145632=test_string_memory I, [2024-05-25T23:10:11.725234 #3104266] INFO -- : [ 39/883] 3145626=test_undef I, [2024-05-25T23:10:11.729299 #3104266] INFO -- : [ 40/883] 3145632=ripper_test I, [2024-05-25T23:10:11.743457 #3104266] INFO -- : [ 41/883] 3145626=test_objspace I, [2024-05-25T23:10:11.766717 #3104266] INFO -- : [ 42/883] 3145617=test_line_editor I, [2024-05-25T23:10:11.792386 #3104266] INFO -- : [ 43/883] 3145622=test_have_library I, [2024-05-25T23:10:11.810156 #3104266] INFO -- : [ 44/883] 3145617=test_remote_fetch_error I, [2024-05-25T23:10:11.830195 #3104266] INFO -- : [ 45/883] 3145635=test_gem_commands_stale_command I, [2024-05-25T23:10:11.835550 #3104266] INFO -- : [ 46/883] 3145631=test_c_struct_entry I, [2024-05-25T23:10:11.844371 #3104266] INFO -- : [ 47/883] 3145635=test_lock_native_thread I, [2024-05-25T23:10:11.851380 #3104266] INFO -- : [ 48/883] 3145629=test_set I, [2024-05-25T23:10:11.869092 #3104266] INFO -- : [ 49/883] 3145633=test_show_source I, [2024-05-25T23:10:11.873498 #3104266] INFO -- : [ 50/883] 3145636=test_external_new I, [2024-05-25T23:10:11.876785 #3104266] INFO -- : [ 51/883] 3145629=test_alias_and_anchor I, [2024-05-25T23:10:11.880317 #3104266] INFO -- : [ 52/883] 3145636=test_postponed_job I, [2024-05-25T23:10:11.880557 #3104266] INFO -- : [ 53/883] 3145629=test_hash I, [2024-05-25T23:10:11.891824 #3104266] INFO -- : [ 54/883] 3145618=test_gem_resolver_dependency_request I, [2024-05-25T23:10:11.892355 #3104266] INFO -- : [ 55/883] 3145629=test_tree_builder I, [2024-05-25T23:10:11.894649 #3104266] INFO -- : [ 56/883] 3145631=test_win32ole_typelib I, [2024-05-25T23:10:11.896808 #3104266] INFO -- : [ 57/883] 3145631=test_protect I, [2024-05-25T23:10:11.898992 #3104266] INFO -- : [ 58/883] 3145631=test_raise_exception I, [2024-05-25T23:10:11.910083 #3104266] INFO -- : [ 59/883] 3145629=test_gem_request_set_lockfile I, [2024-05-25T23:10:11.917865 #3104266] INFO -- : [ 60/883] 3145627=test_argf I, [2024-05-25T23:10:11.948430 #3104266] INFO -- : [ 61/883] 3145624=test_framework I, [2024-05-25T23:10:11.957818 #3104266] INFO -- : [ 62/883] 3145620=test_ns_spki I, [2024-05-25T23:10:11.973536 #3104266] INFO -- : [ 63/883] 3145621=test_kill_ring I, [2024-05-25T23:10:11.976589 #3104266] INFO -- : [ 64/883] 3145617=test_yjit I, [2024-05-25T23:10:11.983929 #3104266] INFO -- : [ 65/883] 3145633=test_weakmap I, [2024-05-25T23:10:11.986127 #3104266] INFO -- : [ 66/883] 3145617=test_workspace I, [2024-05-25T23:10:11.992064 #3104266] INFO -- : [ 67/883] 3145624=test_m17n I, [2024-05-25T23:10:11.997599 #3104266] INFO -- : [ 68/883] 3145620=test_gem_commands_environment_command I, [2024-05-25T23:10:12.020231 #3104266] INFO -- : [ 69/883] 3145623=test_ws I, [2024-05-25T23:10:12.039506 #3104266] INFO -- : [ 70/883] 3145623=test_rdoc_markup_indented_paragraph I, [2024-05-25T23:10:12.057624 #3104266] INFO -- : [ 71/883] 3145621=test_io_buffer I, [2024-05-25T23:10:12.080794 #3104266] INFO -- : [ 72/883] 3145624=ruby_parser_test I, [2024-05-25T23:10:12.108648 #3104266] INFO -- : [ 73/883] 3145618=test_pack I, [2024-05-25T23:10:12.135769 #3104266] INFO -- : [ 74/883] 3145632=test_backtrace I, [2024-05-25T23:10:12.139815 #3104266] INFO -- : [ 75/883] 3145618=test_rdoc_task I, [2024-05-25T23:10:12.154408 #3104266] INFO -- : [ 76/883] 3145618=test_gem_resolver_conflict I, [2024-05-25T23:10:12.155837 #3104266] INFO -- : [ 77/883] 3145620=test_clone I, [2024-05-25T23:10:12.159785 #3104266] INFO -- : [ 78/883] 3145635=test_gem_commands_install_command I, [2024-05-25T23:10:12.165871 #3104266] INFO -- : [ 79/883] 3145621=test_readpartial I, [2024-05-25T23:10:12.166829 #3104266] INFO -- : [ 80/883] 3145618=locals_test I, [2024-05-25T23:10:12.168399 #3104266] INFO -- : [ 81/883] 3145624=test_rdoc_require I, [2024-05-25T23:10:12.173992 #3104266] INFO -- : [ 82/883] 3145623=test_webauthn_poller I, [2024-05-25T23:10:12.200027 #3104266] INFO -- : [ 83/883] 3145617=test_rdoc_markup_raw I, [2024-05-25T23:10:12.204079 #3104266] INFO -- : [ 84/883] 3145617=test_rat I, [2024-05-25T23:10:12.210025 #3104266] INFO -- : [ 85/883] 3145617=test_typeddata I, [2024-05-25T23:10:12.307077 #3104266] INFO -- : [ 86/883] 3145623=test_gem_resolver_best_set I, [2024-05-25T23:10:12.317219 #3104266] INFO -- : [ 87/883] 3145636=encoding_test I, [2024-05-25T23:10:12.335282 #3104266] INFO -- : [ 88/883] 3145624=test_rdoc_markup_to_html_crossref I, [2024-05-25T23:10:12.343289 #3104266] INFO -- : [ 89/883] 3145628=test_fstring I, [2024-05-25T23:10:12.345392 #3104266] INFO -- : [ 90/883] 3145620=test_array I, [2024-05-25T23:10:12.365365 #3104266] INFO -- : [ 91/883] 3145623=test_optparse I, [2024-05-25T23:10:12.368466 #3104266] INFO -- : [ 92/883] 3145620=test_convertible I, [2024-05-25T23:10:12.400950 #3104266] INFO -- : [ 93/883] 3145629=parser_test I, [2024-05-25T23:10:12.428195 #3104266] INFO -- : [ 94/883] 3145623=test_yield I, [2024-05-25T23:10:12.436827 #3104266] INFO -- : [ 95/883] 3145628=test_rdoc_alias I, [2024-05-25T23:10:12.467719 #3104266] INFO -- : [ 96/883] 3145617=test_files_sample I, [2024-05-25T23:10:12.471618 #3104266] INFO -- : [ 97/883] 3145631=test_stringscanner I, [2024-05-25T23:10:12.472359 #3104266] INFO -- : [ 98/883] 3145629=test_bigzero I, [2024-05-25T23:10:12.475221 #3104266] INFO -- : [ 99/883] 3145629=test_pkey_dh I, [2024-05-25T23:10:12.478186 #3104266] INFO -- : [100/883] 3145636=test_iseq_load I, [2024-05-25T23:10:12.484021 #3104266] INFO -- : [101/883] 3145630=test_gem_util I, [2024-05-25T23:10:12.505373 #3104266] INFO -- : [102/883] 3145631=test_gem_package_tar_header I, [2024-05-25T23:10:12.564941 #3104266] INFO -- : [103/883] 3145617=test_pkcs12 I, [2024-05-25T23:10:12.566584 #3104266] INFO -- : [104/883] 3145629=test_system I, [2024-05-25T23:10:12.570559 #3104266] INFO -- : [105/883] 3145621=test_yjit_exit_locations I, [2024-05-25T23:10:12.572032 #3104266] INFO -- : [106/883] 3145621=test_etc I, [2024-05-25T23:10:12.603578 #3104266] INFO -- : [107/883] 3145624=test_ripper I, [2024-05-25T23:10:12.611638 #3104266] INFO -- : [108/883] 3145628=test_gem_config_file I, [2024-05-25T23:10:12.623449 #3104266] INFO -- : [109/883] 3145618=test_gem_resolver_activation_request I, [2024-05-25T23:10:12.632679 #3104266] INFO -- : [110/883] 3145618=test_protocol I, [2024-05-25T23:10:12.648951 #3104266] INFO -- : [111/883] 3145621=test_getopts I, [2024-05-25T23:10:12.651685 #3104266] INFO -- : [112/883] 3145621=test_gc I, [2024-05-25T23:10:12.652471 #3104266] INFO -- : [113/883] 3145621=test_math I, [2024-05-25T23:10:12.670936 #3104266] INFO -- : [114/883] 3145621=test_gem_commands_fetch_command I, [2024-05-25T23:10:12.671085 #3104266] INFO -- : [115/883] 3145630=test_libs I, [2024-05-25T23:10:12.701372 #3104266] INFO -- : [116/883] 3145630=test_config I, [2024-05-25T23:10:12.701690 #3104266] INFO -- : [117/883] 3145631=test_sleep I, [2024-05-25T23:10:12.740908 #3104266] INFO -- : [118/883] 3145630=test_yaml_tree I, [2024-05-25T23:10:12.761963 #3104266] INFO -- : [119/883] 3145630=test_face I, [2024-05-25T23:10:12.784117 #3104266] INFO -- : [120/883] 3145628=test_case I, [2024-05-25T23:10:12.810398 #3104266] INFO -- : [121/883] 3145619=test_sizeof I, [2024-05-25T23:10:12.814187 #3104266] INFO -- : [122/883] 3145628=test_rendering I, [2024-05-25T23:10:12.825187 #3104266] INFO -- : [123/883] 3145630=test_autoload I, [2024-05-25T23:10:12.915719 #3104266] INFO -- : [124/883] 3145628=test_utf16 I, [2024-05-25T23:10:12.930269 #3104266] INFO -- : [125/883] 3145628=test_unicode_escape I, [2024-05-25T23:10:12.947944 #3104266] INFO -- : [126/883] 3145618=test_io I, [2024-05-25T23:10:12.957487 #3104266] INFO -- : [127/883] 3145621=test_digest I, [2024-05-25T23:10:12.960437 #3104266] INFO -- : [128/883] 3145624=test_marshalable I, [2024-05-25T23:10:12.988955 #3104266] INFO -- : [129/883] 3145624=test_cgi_util I, [2024-05-25T23:10:12.999136 #3104266] INFO -- : [130/883] 3145622=test_require I, [2024-05-25T23:10:13.024035 #3104266] INFO -- : [131/883] 3145628=test_gem_ext_cmake_builder I, [2024-05-25T23:10:13.028668 #3104266] INFO -- : [132/883] 3145617=test_gem_commands_contents_command I, [2024-05-25T23:10:13.040252 #3104266] INFO -- : [133/883] 3145628=test_wss I, [2024-05-25T23:10:13.062638 #3104266] INFO -- : [134/883] 3145628=test_fiddle I, [2024-05-25T23:10:13.102414 #3104266] INFO -- : [135/883] 3145617=test_find I, [2024-05-25T23:10:13.108348 #3104266] INFO -- : [136/883] 3145628=test_ractor I, [2024-05-25T23:10:13.114586 #3104266] INFO -- : [137/883] 3145617=test_init I, [2024-05-25T23:10:13.159006 #3104266] INFO -- : [138/883] 3145624=test_complexrational I, [2024-05-25T23:10:13.161574 #3104266] INFO -- : [139/883] 3145636=test_pathname I, [2024-05-25T23:10:13.170496 #3104266] INFO -- : [140/883] 3145624=test_coverage I, [2024-05-25T23:10:13.195804 #3104266] INFO -- : [141/883] 3145628=test_rdoc_encoding I, [2024-05-25T23:10:13.222440 #3104266] INFO -- : [142/883] 3145628=test_gem_package_tar_reader I, [2024-05-25T23:10:13.257179 #3104266] INFO -- : [143/883] 3145628=regexp_test I, [2024-05-25T23:10:13.345570 #3104266] INFO -- : [144/883] 3145628=test_file I, [2024-05-25T23:10:13.348461 #3104266] INFO -- : [145/883] 3145628=test_gem_available_set I, [2024-05-25T23:10:13.364875 #3104266] INFO -- : [146/883] 3145636=test_rdoc_markdown I, [2024-05-25T23:10:13.440174 #3104266] INFO -- : [147/883] 3145617=test_modify_expand I, [2024-05-25T23:10:13.443172 #3104266] INFO -- : [148/883] 3145617=test_rdoc_any_method I, [2024-05-25T23:10:13.455505 #3104266] INFO -- : [149/883] 3145632=test_bash_completion I, [2024-05-25T23:10:13.456993 #3104266] INFO -- : [150/883] 3145628=test_formatter I, [2024-05-25T23:10:13.464400 #3104266] INFO -- : [151/883] 3145632=test_rdoc_constant I, [2024-05-25T23:10:13.465782 #3104266] INFO -- : [152/883] 3145628=test_deprecate I, [2024-05-25T23:10:13.500548 #3104266] INFO -- : [153/883] 3145628=test_gem_commands_owner_command I, [2024-05-25T23:10:13.520755 #3104266] INFO -- : [154/883] 3145629=test_gem_source_vendor I, [2024-05-25T23:10:13.531035 #3104266] INFO -- : [155/883] 3145629=test_recorder I, [2024-05-25T23:10:13.532512 #3104266] INFO -- : [156/883] 3145629=test_big2str I, [2024-05-25T23:10:13.536621 #3104266] INFO -- : [157/883] 3145629=test_handle I, [2024-05-25T23:10:13.629038 #3104266] INFO -- : [158/883] 3145635=test_wait I, [2024-05-25T23:10:13.667537 #3104266] INFO -- : [159/883] 3145635=test_yaml I, [2024-05-25T23:10:13.682156 #3104266] INFO -- : [160/883] 3145625=test_forwardable I, [2024-05-25T23:10:13.706352 #3104266] INFO -- : [161/883] 3145621=test_rdoc_markup_formatter I, [2024-05-25T23:10:13.707964 #3104266] INFO -- : [162/883] 3145625=test_nowrite I, [2024-05-25T23:10:13.723448 #3104266] INFO -- : [163/883] 3145625=test_thread_queue I, [2024-05-25T23:10:13.723765 #3104266] INFO -- : [164/883] 3145636=test_ansi_without_terminfo I, [2024-05-25T23:10:13.747607 #3104266] INFO -- : [165/883] 3145635=test_gem_commands_sources_command I, [2024-05-25T23:10:13.764922 #3104266] INFO -- : [166/883] 3145636=test_bmethod I, [2024-05-25T23:10:13.769192 #3104266] INFO -- : [167/883] 3145636=test_euc_tw I, [2024-05-25T23:10:13.770486 #3104266] INFO -- : [168/883] 3145636=test_ractor I, [2024-05-25T23:10:13.780615 #3104266] INFO -- : [169/883] 3145636=json_fixtures_test I, [2024-05-25T23:10:13.784578 #3104266] INFO -- : [170/883] 3145632=test_shapes I, [2024-05-25T23:10:13.787355 #3104266] INFO -- : [171/883] 3145629=test_io_timeout I, [2024-05-25T23:10:13.791522 #3104266] INFO -- : [172/883] 3145629=test_rdoc_parser_c I, [2024-05-25T23:10:13.792972 #3104266] INFO -- : [173/883] 3145632=test_comparable I, [2024-05-25T23:10:13.794533 #3104266] INFO -- : [174/883] 3145636=test_enc_str_buf_cat I, [2024-05-25T23:10:13.798661 #3104266] INFO -- : [175/883] 3145632=test_gbk I, [2024-05-25T23:10:13.800520 #3104266] INFO -- : [176/883] 3145636=test_class2name I, [2024-05-25T23:10:13.803982 #3104266] INFO -- : [177/883] 3145636=test_profile_frames I, [2024-05-25T23:10:13.805065 #3104266] INFO -- : [178/883] 3145632=test_cstr I, [2024-05-25T23:10:13.892627 #3104266] INFO -- : [179/883] 3145621=test_pstore I, [2024-05-25T23:10:13.896924 #3104266] INFO -- : [180/883] 3145635=test_gem_commands_list_command I, [2024-05-25T23:10:13.904514 #3104266] INFO -- : [181/883] 3145635=test_stack I, [2024-05-25T23:10:13.935266 #3104266] INFO -- : [182/883] 3145621=test_rdoc_include I, [2024-05-25T23:10:13.965731 #3104266] INFO -- : [183/883] 3145617=test_reqarg I, [2024-05-25T23:10:13.966908 #3104266] INFO -- : [184/883] 3145636=test_too_many_dummy_encodings I, [2024-05-25T23:10:13.992875 #3104266] INFO -- : [185/883] 3145624=test_rdoc_options I, [2024-05-25T23:10:14.038582 #3104266] INFO -- : [186/883] 3145621=test_cesu8 I, [2024-05-25T23:10:14.041173 #3104266] INFO -- : [187/883] 3145621=test_econv I, [2024-05-25T23:10:14.042431 #3104266] INFO -- : [188/883] 3145636=test_gem_version I, [2024-05-25T23:10:14.084440 #3104266] INFO -- : [189/883] 3145628=test_gem_commands_signin_command I, [2024-05-25T23:10:14.110364 #3104266] INFO -- : [190/883] 3145636=test_resource I, [2024-05-25T23:10:14.129937 #3104266] INFO -- : [191/883] 3145629=test_emitter I, [2024-05-25T23:10:14.132758 #3104266] INFO -- : [192/883] 3145636=test_ldap I, [2024-05-25T23:10:14.148045 #3104266] INFO -- : [193/883] 3145636=test_fileutils I, [2024-05-25T23:10:14.156541 #3104266] INFO -- : [194/883] 3145629=test_string_processing I, [2024-05-25T23:10:14.169005 #3104266] INFO -- : [195/883] 3145628=test_gem_commands_search_command I, [2024-05-25T23:10:14.190124 #3104266] INFO -- : [196/883] 3145628=test_complex I, [2024-05-25T23:10:14.215651 #3104266] INFO -- : [197/883] 3145629=test_gem_ext_ext_conf_builder I, [2024-05-25T23:10:14.237886 #3104266] INFO -- : [198/883] 3145624=test_frozen_error I, [2024-05-25T23:10:14.241962 #3104266] INFO -- : [199/883] 3145624=test_gem_stub_specification I, [2024-05-25T23:10:14.255236 #3104266] INFO -- : [200/883] 3145622=test_method_cache I, [2024-05-25T23:10:14.256930 #3104266] INFO -- : [201/883] 3145622=test_gem_dependency I, [2024-05-25T23:10:14.281508 #3104266] INFO -- : [202/883] 3145632=test_gem_resolver_specification I, [2024-05-25T23:10:14.324441 #3104266] INFO -- : [203/883] 3145628=test_path_to_class I, [2024-05-25T23:10:14.328918 #3104266] INFO -- : [204/883] 3145628=test_rdoc_markup_verbatim I, [2024-05-25T23:10:14.333594 #3104266] INFO -- : [205/883] 3145628=test_inlinecache I, [2024-05-25T23:10:14.363918 #3104266] INFO -- : [206/883] 3145617=test_gem_remote_fetcher I, [2024-05-25T23:10:14.395142 #3104266] INFO -- : [207/883] 3145622=test_mdns I, [2024-05-25T23:10:14.402975 #3104266] INFO -- : [208/883] 3145628=test_parse I, [2024-05-25T23:10:14.411649 #3104266] INFO -- : [209/883] 3145622=test_gem_resolver_installed_specification I, [2024-05-25T23:10:14.434863 #3104266] INFO -- : [210/883] 3145622=test_scanner_events I, [2024-05-25T23:10:14.460193 #3104266] INFO -- : [211/883] 3145633=test_date_strftime I, [2024-05-25T23:10:14.480023 #3104266] INFO -- : [212/883] 3145622=test_rdoc_parser_rd I, [2024-05-25T23:10:14.520088 #3104266] INFO -- : [213/883] 3145636=test_gem_installer I, [2024-05-25T23:10:14.555119 #3104266] INFO -- : [214/883] 3145624=test_yamlstore I, [2024-05-25T23:10:14.563418 #3104266] INFO -- : [215/883] 3145632=test_random I, [2024-05-25T23:10:14.572559 #3104266] INFO -- : [216/883] 3145624=test_asn1 I, [2024-05-25T23:10:14.576984 #3104266] INFO -- : [217/883] 3145632=test_const I, [2024-05-25T23:10:14.581368 #3104266] INFO -- : [218/883] 3145632=test_rdoc_normal_class I, [2024-05-25T23:10:14.597845 #3104266] INFO -- : [219/883] 3145624=test_class I, [2024-05-25T23:10:14.627120 #3104266] INFO -- : [220/883] 3145622=test_load I, [2024-05-25T23:10:14.633705 #3104266] INFO -- : [221/883] 3145622=json_string_matching_test I, [2024-05-25T23:10:14.645461 #3104266] INFO -- : [222/883] 3145622=test_irb I, [2024-05-25T23:10:14.652872 #3104266] INFO -- : [223/883] 3145632=test_queue I, [2024-05-25T23:10:14.671283 #3104266] INFO -- : [224/883] 3145632=test_function I, [2024-05-25T23:10:14.749043 #3104266] INFO -- : [225/883] 3145631=test_noarg I, [2024-05-25T23:10:14.795240 #3104266] INFO -- : [226/883] 3145635=parse_comments_test I, [2024-05-25T23:10:14.868757 #3104266] INFO -- : [227/883] 3145635=test_tempfile I, [2024-05-25T23:10:14.888082 #3104266] INFO -- : [228/883] 3145632=test_rdoc_markup I, [2024-05-25T23:10:14.899086 #3104266] INFO -- : [229/883] 3145632=test_gem_commands_help_command I, [2024-05-25T23:10:14.933563 #3104266] INFO -- : [230/883] 3145631=test_prettyprint I, [2024-05-25T23:10:14.934575 #3104266] INFO -- : [231/883] 3145623=test_tracepoint I, [2024-05-25T23:10:14.952062 #3104266] INFO -- : [232/883] 3145631=test_basicsocket I, [2024-05-25T23:10:14.958649 #3104266] INFO -- : [233/883] 3145631=test_utf32 I, [2024-05-25T23:10:14.961199 #3104266] INFO -- : [234/883] 3145631=test_duplicate I, [2024-05-25T23:10:14.962657 #3104266] INFO -- : [235/883] 3145634=test_gem_resolver_index_specification I, [2024-05-25T23:10:14.966022 #3104266] INFO -- : [236/883] 3145631=test_internal_ivar I, [2024-05-25T23:10:14.968648 #3104266] INFO -- : [237/883] 3145631=test_gem_commands_specification_command I, [2024-05-25T23:10:14.973808 #3104266] INFO -- : [238/883] 3145622=test_http I, [2024-05-25T23:10:14.987235 #3104266] INFO -- : [239/883] 3145632=test_shift_jis I, [2024-05-25T23:10:14.988559 #3104266] INFO -- : [240/883] 3145632=test_gem_commands_which_command I, [2024-05-25T23:10:14.991529 #3104266] INFO -- : [241/883] 3145628=test_inadvertent_creation I, [2024-05-25T23:10:14.993843 #3104266] INFO -- : [242/883] 3145622=test_flags I, [2024-05-25T23:10:15.017043 #3104266] INFO -- : [243/883] 3145632=test_enumerator I, [2024-05-25T23:10:15.055290 #3104266] INFO -- : [244/883] 3145621=test_name_error I, [2024-05-25T23:10:15.087525 #3104266] INFO -- : [245/883] 3145633=test_rdoc_markup_attribute_manager I, [2024-05-25T23:10:15.104851 #3104266] INFO -- : [246/883] 3145628=test_gem_commands_dependency_command I, [2024-05-25T23:10:15.107028 #3104266] INFO -- : [247/883] 3145631=test_gem_resolver I, [2024-05-25T23:10:15.151909 #3104266] INFO -- : [248/883] 3145621=test_safe_load I, [2024-05-25T23:10:15.162385 #3104266] INFO -- : [249/883] 3145635=test_gem_resolver_composed_set I, [2024-05-25T23:10:15.166303 #3104266] INFO -- : [250/883] 3145621=test_rdoc_context I, [2024-05-25T23:10:15.177792 #3104266] INFO -- : [251/883] 3145635=test_nil2vtempty I, [2024-05-25T23:10:15.186398 #3104266] INFO -- : [252/883] 3145635=test_stream I, [2024-05-25T23:10:15.189289 #3104266] INFO -- : [253/883] 3145635=test_httpresponse I, [2024-05-25T23:10:15.202340 #3104266] INFO -- : [254/883] 3145623=test_open-uri I, [2024-05-25T23:10:15.206470 #3104266] INFO -- : [255/883] 3145628=test_rdoc_parser_ruby I, [2024-05-25T23:10:15.212878 #3104266] INFO -- : [256/883] 3145634=test_syntax I, [2024-05-25T23:10:15.260551 #3104266] INFO -- : [257/883] 3145635=test_gem_safe_yaml I, [2024-05-25T23:10:15.268587 #3104266] INFO -- : [258/883] 3145635=test_rdoc_markup_to_joined_paragraph I, [2024-05-25T23:10:15.292439 #3104266] INFO -- : [259/883] 3145635=test_date_time I, [2024-05-25T23:10:15.295679 #3104266] INFO -- : [260/883] 3145633=test_require I, [2024-05-25T23:10:15.299718 #3104266] INFO -- : [261/883] 3145633=index_write_test I, [2024-05-25T23:10:15.304756 #3104266] INFO -- : [262/883] 3145635=test_date_new I, [2024-05-25T23:10:15.314874 #3104266] INFO -- : [263/883] 3145635=test_data I, [2024-05-25T23:10:15.324018 #3104266] INFO -- : [264/883] 3145635=test_tcp I, [2024-05-25T23:10:15.343975 #3104266] INFO -- : [265/883] 3145635=test_iso_8859 I, [2024-05-25T23:10:15.377478 #3104266] INFO -- : [266/883] 3145635=test_rdoc_text I, [2024-05-25T23:10:15.379611 #3104266] INFO -- : [267/883] 3145631=test_io_console I, [2024-05-25T23:10:15.397807 #3104266] INFO -- : [268/883] 3145633=test_singleton I, [2024-05-25T23:10:15.403901 #3104266] INFO -- : [269/883] 3145633=test_flush I, [2024-05-25T23:10:15.407315 #3104266] INFO -- : [270/883] 3145633=test_switch_hitter I, [2024-05-25T23:10:15.418025 #3104266] INFO -- : [271/883] 3145629=test_securerandom I, [2024-05-25T23:10:15.422849 #3104266] INFO -- : [272/883] 3145633=test_logperiod I, [2024-05-25T23:10:15.436671 #3104266] INFO -- : [273/883] 3145633=test_rdoc_normal_module I, [2024-05-25T23:10:15.440759 #3104266] INFO -- : [274/883] 3145635=test_c_union_entity I, [2024-05-25T23:10:15.467449 #3104266] INFO -- : [275/883] 3145629=test_rdoc_markdown_test I, [2024-05-25T23:10:15.522212 #3104266] INFO -- : [276/883] 3145635=test_passing_block I, [2024-05-25T23:10:15.528123 #3104266] INFO -- : [277/883] 3145635=test_thread_fd_close I, [2024-05-25T23:10:15.530959 #3104266] INFO -- : [278/883] 3145635=newline_test I, [2024-05-25T23:10:15.552246 #3104266] INFO -- : [279/883] 3145633=test_uncorrectable_name_check I, [2024-05-25T23:10:15.559040 #3104266] INFO -- : [280/883] 3145633=test_stringchar I, [2024-05-25T23:10:15.583336 #3104266] INFO -- : [281/883] 3145623=test_hash_create I, [2024-05-25T23:10:15.587215 #3104266] INFO -- : [282/883] 3145623=test_gem_security_policy I, [2024-05-25T23:10:15.596405 #3104266] INFO -- : [283/883] 3145635=test_gem_source_local I, [2024-05-25T23:10:15.630681 #3104266] INFO -- : [284/883] 3145633=test_process I, [2024-05-25T23:10:15.737896 #3104266] INFO -- : [285/883] 3145619=test_last_thread I, [2024-05-25T23:10:15.807407 #3104266] INFO -- : [286/883] 3145623=test_pack I, [2024-05-25T23:10:15.828423 #3104266] INFO -- : [287/883] 3145628=test_gem_resolver_lock_specification I, [2024-05-25T23:10:15.865771 #3104266] INFO -- : [288/883] 3145628=test_err_in_callback I, [2024-05-25T23:10:15.871446 #3104266] INFO -- : [289/883] 3145628=test_x509cert I, [2024-05-25T23:10:15.876312 #3104266] INFO -- : [290/883] 3145635=test_gc I, [2024-05-25T23:10:15.881314 #3104266] INFO -- : [291/883] 3145621=test_gem_ext_rake_builder I, [2024-05-25T23:10:16.034096 #3104266] INFO -- : [292/883] 3145627=test_arity I, [2024-05-25T23:10:16.043148 #3104266] INFO -- : [293/883] 3145627=test_logdevice I, [2024-05-25T23:10:16.050984 #3104266] INFO -- : [294/883] 3145623=test_cclass I, [2024-05-25T23:10:16.068490 #3104266] INFO -- : [295/883] 3145622=test_gem_version_option I, [2024-05-25T23:10:16.093904 #3104266] INFO -- : [296/883] 3145623=test_grapheme_breaks I, [2024-05-25T23:10:16.108272 #3104266] INFO -- : [297/883] 3145622=test_gem_request_connection_pools I, [2024-05-25T23:10:16.123061 #3104266] INFO -- : [298/883] 3145626=test_pkey I, [2024-05-25T23:10:16.126547 #3104266] INFO -- : [299/883] 3145623=test_case I, [2024-05-25T23:10:16.127809 #3104266] INFO -- : [300/883] 3145623=test_reline I, [2024-05-25T23:10:16.162038 #3104266] INFO -- : [301/883] 3145628=test_parser_events I, [2024-05-25T23:10:16.176976 #3104266] INFO -- : [302/883] 3145626=test_ansi_with_terminfo I, [2024-05-25T23:10:16.204044 #3104266] INFO -- : [303/883] 3145628=test_rdoc_generator_pot_po I, [2024-05-25T23:10:16.213227 #3104266] INFO -- : [304/883] 3145628=test_json_tree I, [2024-05-25T23:10:16.217420 #3104266] INFO -- : [305/883] 3145628=test_rdoc_markup_to_markdown I, [2024-05-25T23:10:16.223730 #3104266] INFO -- : [306/883] 3145626=test_m17n_comb I, [2024-05-25T23:10:16.259400 #3104266] INFO -- : [307/883] 3145628=test_memory_view I, [2024-05-25T23:10:16.282493 #3104266] INFO -- : [308/883] 3145617=test_ractor I, [2024-05-25T23:10:16.344864 #3104266] INFO -- : [309/883] 3145617=test_extlibs I, [2024-05-25T23:10:16.469069 #3104266] INFO -- : [310/883] 3145628=test_rdoc_generator_ri I, [2024-05-25T23:10:16.473646 #3104266] INFO -- : [311/883] 3145628=test_gem_stream_ui I, [2024-05-25T23:10:16.473888 #3104266] INFO -- : [312/883] 3145623=test_severity I, [2024-05-25T23:10:16.483584 #3104266] INFO -- : [313/883] 3145623=test_ractor I, [2024-05-25T23:10:16.495582 #3104266] INFO -- : [314/883] 3145621=parse_test I, [2024-05-25T23:10:16.496315 #3104266] INFO -- : [315/883] 3145623=test_gem_install_update_options I, [2024-05-25T23:10:16.566039 #3104266] INFO -- : [316/883] 3145628=test_require_lib I, [2024-05-25T23:10:16.666397 #3104266] INFO -- : [317/883] 3145623=test_rdoc_markup_to_table_of_contents I, [2024-05-25T23:10:16.686154 #3104266] INFO -- : [318/883] 3145623=test_objectspace I, [2024-05-25T23:10:16.746672 #3104266] INFO -- : [319/883] 3145627=test_socket I, [2024-05-25T23:10:16.794609 #3104266] INFO -- : [320/883] 3145619=test_thread I, [2024-05-25T23:10:16.821623 #3104266] INFO -- : [321/883] 3145624=test_literal I, [2024-05-25T23:10:16.865833 #3104266] INFO -- : [322/883] 3145620=test_c_struct_builder I, [2024-05-25T23:10:16.876829 #3104266] INFO -- : [323/883] 3145629=test_dot_dot I, [2024-05-25T23:10:16.885391 #3104266] INFO -- : [324/883] 3145629=test_str2big I, [2024-05-25T23:10:16.890515 #3104266] INFO -- : [325/883] 3145629=test_case_options I, [2024-05-25T23:10:16.896031 #3104266] INFO -- : [326/883] 3145629=test_store I, [2024-05-25T23:10:16.918230 #3104266] INFO -- : [327/883] 3145620=test_rdoc_cross_reference I, [2024-05-25T23:10:16.998659 #3104266] INFO -- : [328/883] 3145629=test_gem_commands_info_command I, [2024-05-25T23:10:17.013971 #3104266] INFO -- : [329/883] 3145619=test_scalar I, [2024-05-25T23:10:17.021180 #3104266] INFO -- : [330/883] 3145619=test_gem_dependency_installer I, [2024-05-25T23:10:17.023906 #3104266] INFO -- : [331/883] 3145629=test_bug_reporter I, [2024-05-25T23:10:17.147724 #3104266] INFO -- : [332/883] 3145622=test_gem_name_tuple I, [2024-05-25T23:10:17.161050 #3104266] INFO -- : [333/883] 3145622=test_gem_package_tar_reader_entry I, [2024-05-25T23:10:17.203788 #3104266] INFO -- : [334/883] 3145620=test_rand I, [2024-05-25T23:10:17.232442 #3104266] INFO -- : [335/883] 3145624=test_exception I, [2024-05-25T23:10:17.348355 #3104266] INFO -- : [336/883] 3145622=test_gem_request I, [2024-05-25T23:10:17.449375 #3104266] INFO -- : [337/883] 3145629=test_method_cache I, [2024-05-25T23:10:17.454606 #3104266] INFO -- : [338/883] 3145629=test_sprintf_comb I, [2024-05-25T23:10:17.460574 #3104266] INFO -- : [339/883] 3145620=test_gem_commands_mirror I, [2024-05-25T23:10:17.466258 #3104266] INFO -- : [340/883] 3145620=test_gem_ext_cargo_builder_link_flag_converter I, [2024-05-25T23:10:17.513074 #3104266] INFO -- : [341/883] 3145620=test_enumerator_kw I, [2024-05-25T23:10:17.518022 #3104266] INFO -- : [342/883] 3145620=test_settracefunc I, [2024-05-25T23:10:17.519021 #3104266] INFO -- : [343/883] 3145623=test_gem_text I, [2024-05-25T23:10:17.527632 #3104266] INFO -- : [344/883] 3145622=test_win32ole I, [2024-05-25T23:10:17.536465 #3104266] INFO -- : [345/883] 3145622=test_generic I, [2024-05-25T23:10:17.555333 #3104266] INFO -- : [346/883] 3145630=test_scan_args I, [2024-05-25T23:10:17.557743 #3104266] INFO -- : [347/883] 3145622=test_rdoc_markup_attributes I, [2024-05-25T23:10:17.564815 #3104266] INFO -- : [348/883] 3145623=test_mul I, [2024-05-25T23:10:17.564986 #3104266] INFO -- : [349/883] 3145622=test_win32ole_type I, [2024-05-25T23:10:17.565190 #3104266] INFO -- : [350/883] 3145630=test_null I, [2024-05-25T23:10:17.567591 #3104266] INFO -- : [351/883] 3145622=test_default_gems I, [2024-05-25T23:10:17.568532 #3104266] INFO -- : [352/883] 3145630=test_rdoc_rd_inline_parser I, [2024-05-25T23:10:17.573159 #3104266] INFO -- : [353/883] 3145623=test_rdoc_markup_to_rdoc I, [2024-05-25T23:10:17.603083 #3104266] INFO -- : [354/883] 3145623=test_pipe I, [2024-05-25T23:10:17.614029 #3104266] INFO -- : [355/883] 3145622=test_thread I, [2024-05-25T23:10:17.615630 #3104266] INFO -- : [356/883] 3145622=test_trick I, [2024-05-25T23:10:17.641032 #3104266] INFO -- : [357/883] 3145629=test_pkey_ec I, [2024-05-25T23:10:17.715449 #3104266] INFO -- : [358/883] 3145623=test_date_parse I, [2024-05-25T23:10:17.725457 #3104266] INFO -- : [359/883] 3145629=test_backtrace I, [2024-05-25T23:10:17.727805 #3104266] INFO -- : [360/883] 3145629=test_defined I, [2024-05-25T23:10:17.773470 #3104266] INFO -- : [361/883] 3145630=test_key_name_check I, [2024-05-25T23:10:17.784757 #3104266] INFO -- : [362/883] 3145630=test_io_buffer I, [2024-05-25T23:10:17.800696 #3104266] INFO -- : [363/883] 3145629=test_rdoc_i18n_text I, [2024-05-25T23:10:17.806085 #3104266] INFO -- : [364/883] 3145623=test_gem_uninstaller I, [2024-05-25T23:10:17.809613 #3104266] INFO -- : [365/883] 3145629=test_gb18030 I, [2024-05-25T23:10:17.824838 #3104266] INFO -- : [366/883] 3145629=test_svcb_https I, [2024-05-25T23:10:17.825814 #3104266] INFO -- : [367/883] 3145630=test_buffering I, [2024-05-25T23:10:17.837969 #3104266] INFO -- : [368/883] 3145630=test_time I, [2024-05-25T23:10:17.845761 #3104266] INFO -- : [369/883] 3145629=test_windows_1251 I, [2024-05-25T23:10:17.849844 #3104266] INFO -- : [370/883] 3145627=test_rdoc_rdoc I, [2024-05-25T23:10:17.850190 #3104266] INFO -- : [371/883] 3145629=test_string I, [2024-05-25T23:10:17.970357 #3104266] INFO -- : [372/883] 3145630=test_proc I, [2024-05-25T23:10:17.986879 #3104266] INFO -- : [373/883] 3145625=test_gc_compact I, [2024-05-25T23:10:18.060808 #3104266] INFO -- : [374/883] 3145631=test_gem_package_old I, [2024-05-25T23:10:18.084496 #3104266] INFO -- : [375/883] 3145631=test_gem_resolver_index_set I, [2024-05-25T23:10:18.088670 #3104266] INFO -- : [376/883] 3145627=test_egrep_cpp I, [2024-05-25T23:10:18.105996 #3104266] INFO -- : [377/883] 3145631=test_cgi_tag_helper I, [2024-05-25T23:10:18.107496 #3104266] INFO -- : [378/883] 3145617=test_zlib I, [2024-05-25T23:10:18.118867 #3104266] INFO -- : [379/883] 3145631=test_optimization I, [2024-05-25T23:10:18.265390 #3104266] INFO -- : [380/883] 3145627=test_date_conv I, [2024-05-25T23:10:18.279841 #3104266] INFO -- : [381/883] 3145627=test_erb_m17n I, [2024-05-25T23:10:18.283283 #3104266] INFO -- : [382/883] 3145627=test_ole_methods I, [2024-05-25T23:10:18.285697 #3104266] INFO -- : [383/883] 3145627=test_folderitem2_invokeverb I, [2024-05-25T23:10:18.287337 #3104266] INFO -- : [384/883] 3145627=test_require_path_check I, [2024-05-25T23:10:18.349434 #3104266] INFO -- : [385/883] 3145620=test_rdoc_markup_parser I, [2024-05-25T23:10:18.367298 #3104266] INFO -- : [386/883] 3145627=test_files_test_2 I, [2024-05-25T23:10:18.427344 #3104266] INFO -- : [387/883] 3145620=test_fnmatch I, [2024-05-25T23:10:18.475306 #3104266] INFO -- : [388/883] 3145620=test_gem_validator I, [2024-05-25T23:10:18.513893 #3104266] INFO -- : [389/883] 3145620=test_rdoc_store I, [2024-05-25T23:10:18.731185 #3104266] INFO -- : [390/883] 3145623=test_x509attr I, [2024-05-25T23:10:18.743986 #3104266] INFO -- : [391/883] 3145623=test_raise I, [2024-05-25T23:10:18.746500 #3104266] INFO -- : [392/883] 3145623=test_gem_request_set_lockfile_parser I, [2024-05-25T23:10:18.750434 #3104266] INFO -- : [393/883] 3145630=test_depth_first I, [2024-05-25T23:10:18.754475 #3104266] INFO -- : [394/883] 3145630=test_pattern_matching I, [2024-05-25T23:10:18.778135 #3104266] INFO -- : [395/883] 3145630=test_rdoc_stats I, [2024-05-25T23:10:18.821906 #3104266] INFO -- : [396/883] 3145621=test_string I, [2024-05-25T23:10:18.843194 #3104266] INFO -- : [397/883] 3145621=test_qsort I, [2024-05-25T23:10:18.848391 #3104266] INFO -- : [398/883] 3145621=test_rdoc_parser I, [2024-05-25T23:10:18.852792 #3104266] INFO -- : [399/883] 3145630=test_gem_dependency_resolution_error I, [2024-05-25T23:10:18.858599 #3104266] INFO -- : [400/883] 3145623=json_addition_test I, [2024-05-25T23:10:18.865456 #3104266] INFO -- : [401/883] 3145621=test_custom_command I, [2024-05-25T23:10:18.879861 #3104266] INFO -- : [402/883] 3145630=test_rdoc_tom_doc I, [2024-05-25T23:10:18.881823 #3104266] INFO -- : [403/883] 3145623=test_rdoc_markup_to_tt_only I, [2024-05-25T23:10:18.902217 #3104266] INFO -- : [404/883] 3145621=test_hmac I, [2024-05-25T23:10:18.905306 #3104266] INFO -- : [405/883] 3145630=test_bug-3571 I, [2024-05-25T23:10:18.913129 #3104266] INFO -- : [406/883] 3145621=test_key_actor_vi I, [2024-05-25T23:10:18.916856 #3104266] INFO -- : [407/883] 3145623=test_gem_command I, [2024-05-25T23:10:18.919015 #3104266] INFO -- : [408/883] 3145630=test_gem_spec_fetcher I, [2024-05-25T23:10:18.954073 #3104266] INFO -- : [409/883] 3145636=test_common I, [2024-05-25T23:10:18.971653 #3104266] INFO -- : [410/883] 3145619=test_numeric I, [2024-05-25T23:10:18.994743 #3104266] INFO -- : [411/883] 3145621=test_gem_commands_lock_command I, [2024-05-25T23:10:19.016090 #3104266] INFO -- : [412/883] 3145623=test_ifunless I, [2024-05-25T23:10:19.021670 #3104266] INFO -- : [413/883] 3145621=test_assignment I, [2024-05-25T23:10:19.037067 #3104266] INFO -- : [414/883] 3145623=test_gem_source_list I, [2024-05-25T23:10:19.075207 #3104266] INFO -- : [415/883] 3145630=test_optarg I, [2024-05-25T23:10:19.108723 #3104266] INFO -- : [416/883] 3145619=test_yaml_special_cases I, [2024-05-25T23:10:19.112774 #3104266] INFO -- : [417/883] 3145623=test_config I, [2024-05-25T23:10:19.117680 #3104266] INFO -- : [418/883] 3145619=test_rdoc_token_stream I, [2024-05-25T23:10:19.138991 #3104266] INFO -- : [419/883] 3145620=test_address_resolve I, [2024-05-25T23:10:19.144059 #3104266] INFO -- : [420/883] 3145623=test_iter_break I, [2024-05-25T23:10:19.150762 #3104266] INFO -- : [421/883] 3145623=test_exception I, [2024-05-25T23:10:19.154189 #3104266] INFO -- : [422/883] 3145636=test_zsh_completion I, [2024-05-25T23:10:19.157202 #3104266] INFO -- : [423/883] 3145636=test_rdoc_single_class I, [2024-05-25T23:10:19.159198 #3104266] INFO -- : [424/883] 3145636=test_nil I, [2024-05-25T23:10:19.162982 #3104266] INFO -- : [425/883] 3145623=test_num2int I, [2024-05-25T23:10:19.168300 #3104266] INFO -- : [426/883] 3145636=test_verbose I, [2024-05-25T23:10:19.178440 #3104266] INFO -- : [427/883] 3145623=test_pp I, [2024-05-25T23:10:19.184942 #3104266] INFO -- : [428/883] 3145636=test_gem_ext_configure_builder I, [2024-05-25T23:10:19.186900 #3104266] INFO -- : [429/883] 3145626=test_frozen I, [2024-05-25T23:10:19.191948 #3104266] INFO -- : [430/883] 3145626=test_macro I, [2024-05-25T23:10:19.195245 #3104266] INFO -- : [431/883] 3145620=test_emitter I, [2024-05-25T23:10:19.198463 #3104266] INFO -- : [432/883] 3145626=test_gem_silent_ui I, [2024-05-25T23:10:19.203201 #3104266] INFO -- : [433/883] 3145630=test_files_ext I, [2024-05-25T23:10:19.204810 #3104266] INFO -- : [434/883] 3145620=test_bug-5832 I, [2024-05-25T23:10:19.208051 #3104266] INFO -- : [435/883] 3145620=test_kernel I, [2024-05-25T23:10:19.216509 #3104266] INFO -- : [436/883] 3145636=dispatcher_test I, [2024-05-25T23:10:19.240297 #3104266] INFO -- : [437/883] 3145623=test_eval_history I, [2024-05-25T23:10:19.253253 #3104266] INFO -- : [438/883] 3145636=test_gem_doctor I, [2024-05-25T23:10:19.266973 #3104266] INFO -- : [439/883] 3145619=test_kdf I, [2024-05-25T23:10:19.291592 #3104266] INFO -- : [440/883] 3145636=!Nothing_to_test I, [2024-05-25T23:10:19.306209 #3104266] INFO -- : [441/883] 3145636=test_psych I, [2024-05-25T23:10:19.322084 #3104266] INFO -- : [442/883] 3145630=test_enc_raise I, [2024-05-25T23:10:19.324228 #3104266] INFO -- : [443/883] 3145623=test_rdoc_markup_paragraph I, [2024-05-25T23:10:19.331496 #3104266] INFO -- : [444/883] 3145630=test_date I, [2024-05-25T23:10:19.331567 #3104266] INFO -- : [445/883] 3145619=test_gem_rdoc I, [2024-05-25T23:10:19.332759 #3104266] INFO -- : [446/883] 3145623=test_gem_ext_cargo_builder_unit I, [2024-05-25T23:10:19.336826 #3104266] INFO -- : [447/883] 3145636=test_command I, [2024-05-25T23:10:19.341997 #3104266] INFO -- : [448/883] 3145630=test_at_exit I, [2024-05-25T23:10:19.360753 #3104266] INFO -- : [449/883] 3145623=test_object_create_start I, [2024-05-25T23:10:19.364464 #3104266] INFO -- : [450/883] 3145623=version_test I, [2024-05-25T23:10:19.380149 #3104266] INFO -- : [451/883] 3145630=test_object I, [2024-05-25T23:10:19.380461 #3104266] INFO -- : [452/883] 3145630=heredoc_dedent_test I, [2024-05-25T23:10:19.401414 #3104266] INFO -- : [453/883] 3145626=test_cgi_header I, [2024-05-25T23:10:19.429248 #3104266] INFO -- : [454/883] 3145626=test_arithmetic_sequence I, [2024-05-25T23:10:19.440562 #3104266] INFO -- : [455/883] 3145626=test_gem_command_manager I, [2024-05-25T23:10:19.465323 #3104266] INFO -- : [456/883] 3145630=test_basicinstructions I, [2024-05-25T23:10:19.467485 #3104266] INFO -- : [457/883] 3145619=test_gem_gemcutter_utilities I, [2024-05-25T23:10:19.475466 #3104266] INFO -- : [458/883] 3145623=test_key_actor_emacs I, [2024-05-25T23:10:19.567455 #3104266] INFO -- : [459/883] 3145630=test_sleep I, [2024-05-25T23:10:19.592335 #3104266] INFO -- : [460/883] 3145626=test_gem_local_remote_options I, [2024-05-25T23:10:19.622101 #3104266] INFO -- : [461/883] 3145636=test_object I, [2024-05-25T23:10:19.641247 #3104266] INFO -- : [462/883] 3145623=test_ruby_lex I, [2024-05-25T23:10:19.654113 #3104266] INFO -- : [463/883] 3145626=test_date_arith I, [2024-05-25T23:10:19.660324 #3104266] INFO -- : [464/883] 3145626=test_ossl I, [2024-05-25T23:10:19.774249 #3104266] INFO -- : [465/883] 3145623=test_normalize I, [2024-05-25T23:10:19.775867 #3104266] INFO -- : [466/883] 3145623=test_timeout I, [2024-05-25T23:10:19.782971 #3104266] INFO -- : [467/883] 3145623=test_flip I, [2024-05-25T23:10:19.784457 #3104266] INFO -- : [468/883] 3145618=compiler_test I, [2024-05-25T23:10:19.789094 #3104266] INFO -- : [469/883] 3145618=test_change_word I, [2024-05-25T23:10:19.795609 #3104266] INFO -- : [470/883] 3145618=test_tsort I, [2024-05-25T23:10:19.801349 #3104266] INFO -- : [471/883] 3145618=test_signedness I, [2024-05-25T23:10:19.807844 #3104266] INFO -- : [472/883] 3145620=test_rdoc_rd_block_parser I, [2024-05-25T23:10:19.810198 #3104266] INFO -- : [473/883] 3145619=test_func I, [2024-05-25T23:10:19.816543 #3104266] INFO -- : [474/883] 3145623=test_big5 I, [2024-05-25T23:10:19.827037 #3104266] INFO -- : [475/883] 3145623=test_pointer I, [2024-05-25T23:10:19.840900 #3104266] INFO -- : [476/883] 3145620=test_type I, [2024-05-25T23:10:19.843714 #3104266] INFO -- : [477/883] 3145624=test_ractor I, [2024-05-25T23:10:19.847449 #3104266] INFO -- : [478/883] 3145620=test_gem_platform I, [2024-05-25T23:10:19.911824 #3104266] INFO -- : [479/883] 3145624=test_rdoc_markup_hard_break I, [2024-05-25T23:10:19.931352 #3104266] INFO -- : [480/883] 3145624=test_placearg I, [2024-05-25T23:10:19.931696 #3104266] INFO -- : [481/883] 3145620=test_gem_package_task I, [2024-05-25T23:10:19.937669 #3104266] INFO -- : [482/883] 3145620=test_date_strptime I, [2024-05-25T23:10:19.970150 #3104266] INFO -- : [483/883] 3145622=test_numhash I, [2024-05-25T23:10:19.988964 #3104266] INFO -- : [484/883] 3145622=test_gem_commands_push_command I, [2024-05-25T23:10:20.036855 #3104266] INFO -- : [485/883] 3145620=test_weakkeymap I, [2024-05-25T23:10:20.041305 #3104266] INFO -- : [486/883] 3145636=test_pkey_rsa I, [2024-05-25T23:10:20.068417 #3104266] INFO -- : [487/883] 3145624=test_keyword I, [2024-05-25T23:10:20.100245 #3104266] INFO -- : [488/883] 3145628=test_class_name_check I, [2024-05-25T23:10:20.115154 #3104266] INFO -- : [489/883] 3145621=test_continuation I, [2024-05-25T23:10:20.119856 #3104266] INFO -- : [490/883] 3145628=test_fd_setsize I, [2024-05-25T23:10:20.120439 #3104266] INFO -- : [491/883] 3145628=test_win32ole_method I, [2024-05-25T23:10:20.120746 #3104266] INFO -- : [492/883] 3145621=test_delete I, [2024-05-25T23:10:20.122959 #3104266] INFO -- : [493/883] 3145628=test_logger I, [2024-05-25T23:10:20.125370 #3104266] INFO -- : [494/883] 3145621=test_files_test I, [2024-05-25T23:10:20.138163 #3104266] INFO -- : [495/883] 3145628=test_gem_update_suggestion I, [2024-05-25T23:10:20.196444 #3104266] INFO -- : [496/883] 3145628=test_file_exhaustive I, [2024-05-25T23:10:20.224215 #3104266] INFO -- : [497/883] 3145620=test_rdoc_parser_markdown I, [2024-05-25T23:10:20.226852 #3104266] INFO -- : [498/883] 3145625=test_not I, [2024-05-25T23:10:20.230461 #3104266] INFO -- : [499/883] 3145625=test_gem_resolver_lock_set I, [2024-05-25T23:10:20.233092 #3104266] INFO -- : [500/883] 3145620=test_import I, [2024-05-25T23:10:20.246580 #3104266] INFO -- : [501/883] 3145621=test_gem_resolver_api_set I, [2024-05-25T23:10:20.289820 #3104266] INFO -- : [502/883] 3145621=test_gem_safe_marshal I, [2024-05-25T23:10:20.354258 #3104266] INFO -- : [503/883] 3145636=test_enumerable I, [2024-05-25T23:10:20.358901 #3104266] INFO -- : [504/883] 3145636=test_gem_resolver_vendor_set I, [2024-05-25T23:10:20.382131 #3104266] INFO -- : [505/883] 3145636=test_config I, [2024-05-25T23:10:20.438494 #3104266] INFO -- : [506/883] 3145625=json_generator_test I, [2024-05-25T23:10:20.457372 #3104266] INFO -- : [507/883] 3145623=test_eval I, [2024-05-25T23:10:20.474889 #3104266] INFO -- : [508/883] 3145622=test_transcode I, [2024-05-25T23:10:20.536428 #3104266] INFO -- : [509/883] 3145625=test_x509name I, [2024-05-25T23:10:20.553013 #3104266] INFO -- : [510/883] 3145625=test_fips I, [2024-05-25T23:10:20.626390 #3104266] INFO -- : [511/883] 3145624=test_update I, [2024-05-25T23:10:20.630912 #3104266] INFO -- : [512/883] 3145624=test_x509store I, [2024-05-25T23:10:20.693649 #3104266] INFO -- : [513/883] 3145623=test_rdoc_code_object I, [2024-05-25T23:10:20.727729 #3104266] INFO -- : [514/883] 3145622=test_webauthn_listener I, [2024-05-25T23:10:20.790997 #3104266] INFO -- : [515/883] 3145622=test_jaro_winkler I, [2024-05-25T23:10:20.797384 #3104266] INFO -- : [516/883] 3145622=test_helper I, [2024-05-25T23:10:20.841926 #3104266] INFO -- : [517/883] 3145621=test_random_formatter I, [2024-05-25T23:10:20.856440 #3104266] INFO -- : [518/883] 3145622=test_lambda I, [2024-05-25T23:10:20.859627 #3104266] INFO -- : [519/883] 3145621=test_gem_request_set_gem_dependency_api I, [2024-05-25T23:10:20.865830 #3104266] INFO -- : [520/883] 3145625=test_ast I, [2024-05-25T23:10:20.883144 #3104266] INFO -- : [521/883] 3145624=test_tmpdir I, [2024-05-25T23:10:20.924533 #3104266] INFO -- : [522/883] 3145619=test_integer_comb I, [2024-05-25T23:10:20.939782 #3104266] INFO -- : [523/883] 3145620=test_rdoc_markup_document I, [2024-05-25T23:10:20.945237 #3104266] INFO -- : [524/883] 3145620=test_vm_dump I, [2024-05-25T23:10:20.946838 #3104266] INFO -- : [525/883] 3145620=test_regexp I, [2024-05-25T23:10:20.961917 #3104266] INFO -- : [526/883] 3145624=test_gem_commands_check_command I, [2024-05-25T23:10:20.962167 #3104266] INFO -- : [527/883] 3145636=errors_test I, [2024-05-25T23:10:20.978938 #3104266] INFO -- : [528/883] 3145634=static_inspect_test I, [2024-05-25T23:10:20.979503 #3104266] INFO -- : [529/883] 3145622=test_udp I, [2024-05-25T23:10:20.984946 #3104266] INFO -- : [530/883] 3145622=test_ostruct I, [2024-05-25T23:10:20.998427 #3104266] INFO -- : [531/883] 3145617=unescape_test I, [2024-05-25T23:10:21.008572 #3104266] INFO -- : [532/883] 3145624=test_file I, [2024-05-25T23:10:21.052681 #3104266] INFO -- : [533/883] 3145623=test_force_exit I, [2024-05-25T23:10:21.056335 #3104266] INFO -- : [534/883] 3145636=bom_test I, [2024-05-25T23:10:21.056782 #3104266] INFO -- : [535/883] 3145623=test_data_error I, [2024-05-25T23:10:21.065024 #3104266] INFO -- : [536/883] 3145621=command_line_test I, [2024-05-25T23:10:21.066990 #3104266] INFO -- : [537/883] 3145636=test_dup I, [2024-05-25T23:10:21.068969 #3104266] INFO -- : [538/883] 3145621=test_pty I, [2024-05-25T23:10:21.079857 #3104266] INFO -- : [539/883] 3145634=test_constant I, [2024-05-25T23:10:21.125979 #3104266] INFO -- : [540/883] 3145622=test_range I, [2024-05-25T23:10:21.131884 #3104266] INFO -- : [541/883] 3145623=test_project_sanity I, [2024-05-25T23:10:21.184924 #3104266] INFO -- : [542/883] 3145623=test_encoding I, [2024-05-25T23:10:21.283942 #3104266] INFO -- : [543/883] 3145636=test_helper I, [2024-05-25T23:10:21.286234 #3104266] INFO -- : [544/883] 3145636=test_erb_command I, [2024-05-25T23:10:21.304651 #3104266] INFO -- : [545/883] 3145627=test_gem_uri_formatter I, [2024-05-25T23:10:21.318511 #3104266] INFO -- : [546/883] 3145627=test_addr I, [2024-05-25T23:10:21.322592 #3104266] INFO -- : [547/883] 3145636=test_locale I, [2024-05-25T23:10:21.338745 #3104266] INFO -- : [548/883] 3145627=library_symbols_test I, [2024-05-25T23:10:21.347782 #3104266] INFO -- : [549/883] 3145636=test_ensured I, [2024-05-25T23:10:21.399822 #3104266] INFO -- : [550/883] 3145627=test_ts I, [2024-05-25T23:10:21.404519 #3104266] INFO -- : [551/883] 3145623=test_rdoc_ri_paths I, [2024-05-25T23:10:21.407429 #3104266] INFO -- : [552/883] 3145636=test_cgi_core I, [2024-05-25T23:10:21.425114 #3104266] INFO -- : [553/883] 3145636=test_parser I, [2024-05-25T23:10:21.427207 #3104266] INFO -- : [554/883] 3145623=test_registry I, [2024-05-25T23:10:21.427397 #3104266] INFO -- : [555/883] 3145623=parse_stream_test I, [2024-05-25T23:10:21.434403 #3104266] INFO -- : [556/883] 3145623=test_dns I, [2024-05-25T23:10:21.437230 #3104266] INFO -- : [557/883] 3145636=test_gem_commands_open_command I, [2024-05-25T23:10:21.538920 #3104266] INFO -- : [558/883] 3145636=test_ractor I, [2024-05-25T23:10:21.548633 #3104266] INFO -- : [559/883] 3145636=test_gem I, [2024-05-25T23:10:21.561655 #3104266] INFO -- : [560/883] 3145621=test_gem_source_lock I, [2024-05-25T23:10:21.615227 #3104266] INFO -- : [561/883] 3145621=test_ssl I, [2024-05-25T23:10:21.762847 #3104266] INFO -- : [562/883] 3145622=test_ractor I, [2024-05-25T23:10:21.893834 #3104266] INFO -- : [563/883] 3145627=test_rendering I, [2024-05-25T23:10:21.899284 #3104266] INFO -- : [564/883] 3145623=test_debugger_integration I, [2024-05-25T23:10:21.901612 #3104266] INFO -- : [565/883] 3145617=json_ext_parser_test I, [2024-05-25T23:10:21.909571 #3104266] INFO -- : [566/883] 3145617=test_thread I, [2024-05-25T23:10:21.909638 #3104266] INFO -- : [567/883] 3145623=test_my_integer I, [2024-05-25T23:10:21.916644 #3104266] INFO -- : [568/883] 3145623=test_nonblock I, [2024-05-25T23:10:21.929799 #3104266] INFO -- : [569/883] 3145623=test_weakref I, [2024-05-25T23:10:21.942089 #3104266] INFO -- : [570/883] 3145627=test_unicode_normalize I, [2024-05-25T23:10:22.034596 #3104266] INFO -- : [571/883] 3145622=test_marshal I, [2024-05-25T23:10:22.121105 #3104266] INFO -- : [572/883] 3145621=test_timeout I, [2024-05-25T23:10:22.156899 #3104266] INFO -- : [573/883] 3145623=test_alias I, [2024-05-25T23:10:22.225886 #3104266] INFO -- : [574/883] 3145618=test_ancdata I, [2024-05-25T23:10:22.229109 #3104266] INFO -- : [575/883] 3145618=test_singleton_function I, [2024-05-25T23:10:22.233712 #3104266] INFO -- : [576/883] 3145618=test_reline_key I, [2024-05-25T23:10:22.293262 #3104266] INFO -- : [577/883] 3145618=test_rb_str_dup I, [2024-05-25T23:10:22.295910 #3104266] INFO -- : [578/883] 3145618=test_integer I, [2024-05-25T23:10:22.314585 #3104266] INFO -- : [579/883] 3145623=test_cgi_modruby I, [2024-05-25T23:10:22.328029 #3104266] INFO -- : [580/883] 3145623=test_rubyoptions I, [2024-05-25T23:10:22.484462 #3104266] INFO -- : [581/883] 3145622=test_super I, [2024-05-25T23:10:22.961683 #3104266] INFO -- : [582/883] 3145622=test_rubygems I, [2024-05-25T23:10:23.028527 #3104266] INFO -- : [583/883] 3145621=test_https_proxy I, [2024-05-25T23:10:23.030669 #3104266] INFO -- : [584/883] 3145621=test_call I, [2024-05-25T23:10:23.094267 #3104266] INFO -- : [585/883] 3145622=test_capacity I, [2024-05-25T23:10:23.097245 #3104266] INFO -- : [586/883] 3145622=test_nextafter I, [2024-05-25T23:10:23.142207 #3104266] INFO -- : [587/883] 3145634=test_have_func I, [2024-05-25T23:10:23.187063 #3104266] INFO -- : [588/883] 3145622=test_gem_request_set_lockfile_tokenizer I, [2024-05-25T23:10:23.193840 #3104266] INFO -- : [589/883] 3145621=test_stat I, [2024-05-25T23:10:23.198006 #3104266] INFO -- : [590/883] 3145621=test_gem_resolver_git_specification I, [2024-05-25T23:10:23.243040 #3104266] INFO -- : [591/883] 3145622=test_usrmarshal I, [2024-05-25T23:10:23.353979 #3104266] INFO -- : [592/883] 3145635=test_object_references I, [2024-05-25T23:10:23.363010 #3104266] INFO -- : [593/883] 3145635=test_rdoc_attr I, [2024-05-25T23:10:23.376060 #3104266] INFO -- : [594/883] 3145635=test_env I, [2024-05-25T23:10:23.404010 #3104266] INFO -- : [595/883] 3145622=desugar_compiler_test I, [2024-05-25T23:10:23.425053 #3104266] INFO -- : [596/883] 3145622=test_integer I, [2024-05-25T23:10:23.434869 #3104266] INFO -- : [597/883] 3145621=test_dryrun I, [2024-05-25T23:10:23.462558 #3104266] INFO -- : [598/883] 3145621=test_gem_commands_setup_command I, [2024-05-25T23:10:23.466016 #3104266] INFO -- : [599/883] 3145622=test_eval I, [2024-05-25T23:10:23.466587 #3104266] INFO -- : [600/883] 3145622=test_autoconf I, [2024-05-25T23:10:23.474949 #3104266] INFO -- : [601/883] 3145622=test_gem_console_ui I, [2024-05-25T23:10:23.479347 #3104266] INFO -- : [602/883] 3145622=test_date_ractor I, [2024-05-25T23:10:23.595279 #3104266] INFO -- : [603/883] 3145636=test_dir I, [2024-05-25T23:10:23.675422 #3104266] INFO -- : [604/883] 3145622=test_ractor_compatibility I, [2024-05-25T23:10:23.821235 #3104266] INFO -- : [605/883] 3145619=test_gem_commands_cleanup_command I, [2024-05-25T23:10:23.844414 #3104266] INFO -- : [606/883] 3145636=test_word I, [2024-05-25T23:10:23.851567 #3104266] INFO -- : [607/883] 3145636=test_cgi_multipart I, [2024-05-25T23:10:23.886827 #3104266] INFO -- : [608/883] 3145621=test_member I, [2024-05-25T23:10:23.891458 #3104266] INFO -- : [609/883] 3145621=test_numeric I, [2024-05-25T23:10:23.900846 #3104266] INFO -- : [610/883] 3145621=json_generic_object_test I, [2024-05-25T23:10:23.916127 #3104266] INFO -- : [611/883] 3145621=test_gem_source_fetch_problem I, [2024-05-25T23:10:23.926854 #3104266] INFO -- : [612/883] 3145621=test_http_request I, [2024-05-25T23:10:23.933734 #3104266] INFO -- : [613/883] 3145621=test_error_highlight I, [2024-05-25T23:10:24.017996 #3104266] INFO -- : [614/883] 3145636=test_resize I, [2024-05-25T23:10:24.022850 #3104266] INFO -- : [615/883] 3145622=test_rdoc_comment I, [2024-05-25T23:10:24.026132 #3104266] INFO -- : [616/883] 3145636=test_rdoc_generator_darkfish I, [2024-05-25T23:10:24.058886 #3104266] INFO -- : [617/883] 3145622=test_mailto I, [2024-05-25T23:10:24.068494 #3104266] INFO -- : [618/883] 3145622=test_symbol I, [2024-05-25T23:10:24.071713 #3104266] INFO -- : [619/883] 3145622=location_test I, [2024-05-25T23:10:24.133436 #3104266] INFO -- : [620/883] 3145622=test_coderange I, [2024-05-25T23:10:24.138984 #3104266] INFO -- : [621/883] 3145622=test_arith_seq_beg_len_step I, [2024-05-25T23:10:24.193739 #3104266] INFO -- : [622/883] 3145622=test_gem_resolver_requirement_list I, [2024-05-25T23:10:24.197953 #3104266] INFO -- : [623/883] 3145622=test_pkcs7 I, [2024-05-25T23:10:24.375053 #3104266] INFO -- : [624/883] 3145622=test_function_entry I, [2024-05-25T23:10:24.375969 #3104266] INFO -- : [625/883] 3145622=test_nofree I, [2024-05-25T23:10:24.379427 #3104266] INFO -- : [626/883] 3145622=test_context I, [2024-05-25T23:10:24.380629 #3104266] INFO -- : [627/883] 3145621=test_gem_commands_pristine_command I, [2024-05-25T23:10:24.389796 #3104266] INFO -- : [628/883] 3145619=test_symbol I, [2024-05-25T23:10:24.447129 #3104266] INFO -- : [629/883] 3145622=test_coder I, [2024-05-25T23:10:24.447656 #3104266] INFO -- : [630/883] 3145636=test_find_executable I, [2024-05-25T23:10:24.453284 #3104266] INFO -- : [631/883] 3145622=ruby_api_test I, [2024-05-25T23:10:24.455679 #3104266] INFO -- : [632/883] 3145636=test_lazy_enumerator I, [2024-05-25T23:10:24.464466 #3104266] INFO -- : [633/883] 3145634=test_enc_associate I, [2024-05-25T23:10:24.569875 #3104266] INFO -- : [634/883] 3145630=test_unix I, [2024-05-25T23:10:24.599951 #3104266] INFO -- : [635/883] 3145630=test_io_wait_uncommon I, [2024-05-25T23:10:24.602722 #3104266] INFO -- : [636/883] 3145622=test_stringio I, [2024-05-25T23:10:24.604231 #3104266] INFO -- : [637/883] 3145630=test_arity I, [2024-05-25T23:10:24.607909 #3104266] INFO -- : [638/883] 3145630=test_win32ole_variable I, [2024-05-25T23:10:24.614495 #3104266] INFO -- : [639/883] 3145630=test_gem_ci_detector I, [2024-05-25T23:10:24.628989 #3104266] INFO -- : [640/883] 3145630=test_rdoc_class_module I, [2024-05-25T23:10:24.672506 #3104266] INFO -- : [641/883] 3145618=test_bignum I, [2024-05-25T23:10:24.750936 #3104266] INFO -- : [642/883] 3145622=test_win32ole_event I, [2024-05-25T23:10:24.751945 #3104266] INFO -- : [643/883] 3145622=test_time_tz I, [2024-05-25T23:10:24.787397 #3104266] INFO -- : [644/883] 3145636=test_rdoc_generator_json_index I, [2024-05-25T23:10:24.790940 #3104266] INFO -- : [645/883] 3145627=test_trace I, [2024-05-25T23:10:24.803218 #3104266] INFO -- : [646/883] 3145627=ractor_test I, [2024-05-25T23:10:24.825335 #3104266] INFO -- : [647/883] 3145622=test_gem_package I, [2024-05-25T23:10:24.831485 #3104266] INFO -- : [648/883] 3145636=test_resolve_symbol I, [2024-05-25T23:10:24.857563 #3104266] INFO -- : [649/883] 3145627=test_complex2 I, [2024-05-25T23:10:24.870383 #3104266] INFO -- : [650/883] 3145627=test_have_macro I, [2024-05-25T23:10:24.889424 #3104266] INFO -- : [651/883] 3145636=test_threadgroup I, [2024-05-25T23:10:25.032753 #3104266] INFO -- : [652/883] 3145634=test_enum I, [2024-05-25T23:10:25.177025 #3104266] INFO -- : [653/883] 3145630=test_gem_specification I, [2024-05-25T23:10:25.282447 #3104266] INFO -- : [654/883] 3145627=test_rdoc_extend I, [2024-05-25T23:10:25.321398 #3104266] INFO -- : [655/883] 3145627=test_merge_keys I, [2024-05-25T23:10:25.348400 #3104266] INFO -- : [656/883] 3145627=test_gem_resolver_api_specification I, [2024-05-25T23:10:25.366184 #3104266] INFO -- : [657/883] 3145622=test_rdoc_markup_to_ansi I, [2024-05-25T23:10:25.393281 #3104266] INFO -- : [658/883] 3145627=test_mixed_unicode_escapes I, [2024-05-25T23:10:25.398213 #3104266] INFO -- : [659/883] 3145627=test_history I, [2024-05-25T23:10:25.405273 #3104266] INFO -- : [660/883] 3145622=test_ipaddr I, [2024-05-25T23:10:25.414362 #3104266] INFO -- : [661/883] 3145627=test_win32ole_variant I, [2024-05-25T23:10:25.428781 #3104266] INFO -- : [662/883] 3145627=test_scalar_scanner I, [2024-05-25T23:10:25.438143 #3104266] INFO -- : [663/883] 3145622=test_gem_source I, [2024-05-25T23:10:25.445662 #3104266] INFO -- : [664/883] 3145627=test_gem_package_tar_writer I, [2024-05-25T23:10:25.585254 #3104266] INFO -- : [665/883] 3145627=test_helper_method I, [2024-05-25T23:10:25.605318 #3104266] INFO -- : [666/883] 3145621=test_array I, [2024-05-25T23:10:25.667810 #3104266] INFO -- : [667/883] 3145627=test_gem_commands_outdated_command I, [2024-05-25T23:10:25.694304 #3104266] INFO -- : [668/883] 3145622=test_benchmark I, [2024-05-25T23:10:25.717893 #3104266] INFO -- : [669/883] 3145627=test_gem_dependency_list I, [2024-05-25T23:10:25.786065 #3104266] INFO -- : [670/883] 3145631=test_nesting_parser I, [2024-05-25T23:10:25.810220 #3104266] INFO -- : [671/883] 3145627=test_win32ole_method_event I, [2024-05-25T23:10:25.810283 #3104266] INFO -- : [672/883] 3145627=test_gem_ext_builder I, [2024-05-25T23:10:25.841556 #3104266] INFO -- : [673/883] 3145634=test_https I, [2024-05-25T23:10:25.877869 #3104266] INFO -- : [674/883] 3145631=test_evaluation I, [2024-05-25T23:10:25.880436 #3104266] INFO -- : [675/883] 3145631=test_provider I, [2024-05-25T23:10:25.894776 #3104266] INFO -- : [676/883] 3145636=test_abi I, [2024-05-25T23:10:25.991176 #3104266] INFO -- : [677/883] 3145632=test_gem_commands_rebuild_command I, [2024-05-25T23:10:26.021806 #3104266] INFO -- : [678/883] 3145632=test_yamldbm I, [2024-05-25T23:10:26.032346 #3104266] INFO -- : [679/883] 3145632=test_load I, [2024-05-25T23:10:26.035717 #3104266] INFO -- : [680/883] 3145632=test_rdoc_parser_simple I, [2024-05-25T23:10:26.047736 #3104266] INFO -- : [681/883] 3145632=test_yield_block I, [2024-05-25T23:10:26.048441 #3104266] INFO -- : [682/883] 3145632=test_len I, [2024-05-25T23:10:26.060930 #3104266] INFO -- : [683/883] 3145632=test_completion I, [2024-05-25T23:10:26.072685 #3104266] INFO -- : [684/883] 3145636=test_gem_commands_cert_command I, [2024-05-25T23:10:26.083745 #3104266] INFO -- : [685/883] 3145635=test_gem_source_installed I, [2024-05-25T23:10:26.094556 #3104266] INFO -- : [686/883] 3145635=test_x509ext I, [2024-05-25T23:10:26.105984 #3104266] INFO -- : [687/883] 3145635=test_erb I, [2024-05-25T23:10:26.147227 #3104266] INFO -- : [688/883] 3145635=test_propertyputref I, [2024-05-25T23:10:26.149757 #3104266] INFO -- : [689/883] 3145635=attribute_write_test I, [2024-05-25T23:10:26.158445 #3104266] INFO -- : [690/883] 3145635=test_spell_checker I, [2024-05-25T23:10:26.171509 #3104266] INFO -- : [691/883] 3145635=test_assembler I, [2024-05-25T23:10:26.172743 #3104266] INFO -- : [692/883] 3145635=test_rational I, [2024-05-25T23:10:26.190586 #3104266] INFO -- : [693/883] 3145635=test_rational2 I, [2024-05-25T23:10:26.203089 #3104266] INFO -- : [694/883] 3145635=test_module I, [2024-05-25T23:10:26.235894 #3104266] INFO -- : [695/883] 3145631=test_gem_request_set I, [2024-05-25T23:10:26.243278 #3104266] INFO -- : [696/883] 3145634=constant_path_node_test I, [2024-05-25T23:10:26.246752 #3104266] INFO -- : [697/883] 3145634=test_gem_ext_cargo_builder I, [2024-05-25T23:10:26.268188 #3104266] INFO -- : [698/883] 3145634=test_ssl I, [2024-05-25T23:10:26.334382 #3104266] INFO -- : [699/883] 3145619=test_arith_seq_extract I, [2024-05-25T23:10:26.536793 #3104266] INFO -- : [700/883] 3145619=test_method_name_check I, [2024-05-25T23:10:26.565980 #3104266] INFO -- : [701/883] 3145619=test_parser I, [2024-05-25T23:10:26.579146 #3104266] INFO -- : [702/883] 3145631=test_whileuntil I, [2024-05-25T23:10:26.581210 #3104266] INFO -- : [703/883] 3145631=test_rdoc_generator_markup I, [2024-05-25T23:10:26.609737 #3104266] INFO -- : [704/883] 3145619=test_rubyvm I, [2024-05-25T23:10:26.611298 #3104266] INFO -- : [705/883] 3145619=test_configuration I, [2024-05-25T23:10:26.614653 #3104266] INFO -- : [706/883] 3145628=test_buffered_io I, [2024-05-25T23:10:26.684772 #3104266] INFO -- : [707/883] 3145631=test_monitor I, [2024-05-25T23:10:26.687313 #3104266] INFO -- : [708/883] 3145628=integer_parse_test I, [2024-05-25T23:10:26.691030 #3104266] INFO -- : [709/883] 3145628=test_instrumentation_api I, [2024-05-25T23:10:26.704724 #3104266] INFO -- : [710/883] 3145619=test_stringify_symbols I, [2024-05-25T23:10:26.713590 #3104266] INFO -- : [711/883] 3145619=test_boolean I, [2024-05-25T23:10:26.719191 #3104266] INFO -- : [712/883] 3145619=test_nomethod_error I, [2024-05-25T23:10:26.720372 #3104266] INFO -- : [713/883] 3145619=json_parser_test I, [2024-05-25T23:10:26.735156 #3104266] INFO -- : [714/883] 3145632=test_config I, [2024-05-25T23:10:26.747822 #3104266] INFO -- : [715/883] 3145619=test_win32ole_variant_outarg I, [2024-05-25T23:10:26.750747 #3104266] INFO -- : [716/883] 3145619=json_common_interface_test I, [2024-05-25T23:10:26.759829 #3104266] INFO -- : [717/883] 3145619=test_dln I, [2024-05-25T23:10:26.761361 #3104266] INFO -- : [718/883] 3145619=test_gem_source_subpath_problem I, [2024-05-25T23:10:26.771664 #3104266] INFO -- : [719/883] 3145632=test_rdoc_markup_to_html_snippet I, [2024-05-25T23:10:26.826189 #3104266] INFO -- : [720/883] 3145632=magic_comment_test I, [2024-05-25T23:10:26.830768 #3104266] INFO -- : [721/883] 3145632=test_struct I, [2024-05-25T23:10:26.836376 #3104266] INFO -- : [722/883] 3145632=test_variable I, [2024-05-25T23:10:26.854516 #3104266] INFO -- : [723/883] 3145619=test_rdoc_markup_include I, [2024-05-25T23:10:26.855121 #3104266] INFO -- : [724/883] 3145627=test_sexp I, [2024-05-25T23:10:26.864048 #3104266] INFO -- : [725/883] 3145619=fuzzer_test I, [2024-05-25T23:10:26.887714 #3104266] INFO -- : [726/883] 3145627=test_pkg_config I, [2024-05-25T23:10:26.912700 #3104266] INFO -- : [727/883] 3145631=test_cparser I, [2024-05-25T23:10:26.921824 #3104266] INFO -- : [728/883] 3145632=test_serialize_subclasses I, [2024-05-25T23:10:26.927706 #3104266] INFO -- : [729/883] 3145627=test_insns_leaf I, [2024-05-25T23:10:26.928626 #3104266] INFO -- : [730/883] 3145632=test_deprecated I, [2024-05-25T23:10:26.932368 #3104266] INFO -- : [731/883] 3145627=test_color_printer I, [2024-05-25T23:10:26.933462 #3104266] INFO -- : [732/883] 3145632=test_engine I, [2024-05-25T23:10:26.935799 #3104266] INFO -- : [733/883] 3145632=test_win32ole_variant_m I, [2024-05-25T23:10:26.939232 #3104266] INFO -- : [734/883] 3145632=test_div I, [2024-05-25T23:10:26.939777 #3104266] INFO -- : [735/883] 3145627=test_allocation I, [2024-05-25T23:10:26.947158 #3104266] INFO -- : [736/883] 3145632=test_key_error I, [2024-05-25T23:10:26.951342 #3104266] INFO -- : [737/883] 3145632=test_x509req I, [2024-05-25T23:10:26.969687 #3104266] INFO -- : [738/883] 3145619=test_mutex I, [2024-05-25T23:10:27.024871 #3104266] INFO -- : [739/883] 3145622=test_rdoc_rd_inline I, [2024-05-25T23:10:27.033078 #3104266] INFO -- : [740/883] 3145622=test_files_test_1 I, [2024-05-25T23:10:27.089884 #3104266] INFO -- : [741/883] 3145624=test_gem_path_support I, [2024-05-25T23:10:27.120184 #3104266] INFO -- : [742/883] 3145624=test_struct I, [2024-05-25T23:10:27.143050 #3104266] INFO -- : [743/883] 3145632=test_set I, [2024-05-25T23:10:27.170835 #3104266] INFO -- : [744/883] 3145632=test_gem_source_git I, [2024-05-25T23:10:27.376465 #3104266] INFO -- : [745/883] 3145618=test_gem_commands_signout_command I, [2024-05-25T23:10:27.376788 #3104266] INFO -- : [746/883] 3145631=test_refinement I, [2024-05-25T23:10:27.381436 #3104266] INFO -- : [747/883] 3145630=test_regex_casefold I, [2024-05-25T23:10:27.396324 #3104266] INFO -- : [748/883] 3145618=test_gem_resolver_installer_set I, [2024-05-25T23:10:27.555478 #3104266] INFO -- : [749/883] 3145624=test_dir_m17n I, [2024-05-25T23:10:27.684940 #3104266] INFO -- : [750/883] 3145618=test_cgi_cookie I, [2024-05-25T23:10:27.701407 #3104266] INFO -- : [751/883] 3145618=test_require I, [2024-05-25T23:10:27.736367 #3104266] INFO -- : [752/883] 3145632=test_float I, [2024-05-25T23:10:27.930269 #3104266] INFO -- : [753/883] 3145630=test_process I, [2024-05-25T23:10:27.954127 #3104266] INFO -- : [754/883] 3145630=test_windows_1252 I, [2024-05-25T23:10:27.958012 #3104266] INFO -- : [755/883] 3145630=test_input_method I, [2024-05-25T23:10:27.979529 #3104266] INFO -- : [756/883] 3145636=test_metaclass I, [2024-05-25T23:10:27.986494 #3104266] INFO -- : [757/883] 3145636=test_rdoc_top_level I, [2024-05-25T23:10:28.041603 #3104266] INFO -- : [758/883] 3145630=test_cgi_session I, [2024-05-25T23:10:28.056017 #3104266] INFO -- : [759/883] 3145630=test_rdoc_rd I, [2024-05-25T23:10:28.065988 #3104266] INFO -- : [760/883] 3145630=test_x509crl I, [2024-05-25T23:10:28.088806 #3104266] INFO -- : [761/883] 3145626=test_signal I, [2024-05-25T23:10:28.127507 #3104266] INFO -- : [762/883] 3145619=test_fixnum I, [2024-05-25T23:10:28.140536 #3104266] INFO -- : [763/883] 3145619=test_memory_view I, [2024-05-25T23:10:28.172699 #3104266] INFO -- : [764/883] 3145619=pattern_test I, [2024-05-25T23:10:28.196291 #3104266] INFO -- : [765/883] 3145630=test_debug I, [2024-05-25T23:10:28.197963 #3104266] INFO -- : [766/883] 3145630=test_shellwords I, [2024-05-25T23:10:28.200660 #3104266] INFO -- : [767/883] 3145630=test_digest_extend I, [2024-05-25T23:10:28.209454 #3104266] INFO -- : [768/883] 3145630=test_omap I, [2024-05-25T23:10:28.211742 #3104266] INFO -- : [769/883] 3145619=test_string I, [2024-05-25T23:10:28.214725 #3104266] INFO -- : [770/883] 3145630=test_iterator I, [2024-05-25T23:10:28.215495 #3104266] INFO -- : [771/883] 3145619=test_storage I, [2024-05-25T23:10:28.219642 #3104266] INFO -- : [772/883] 3145619=test_gem_resolver_git_set I, [2024-05-25T23:10:28.232444 #3104266] INFO -- : [773/883] 3145629=test_new I, [2024-05-25T23:10:28.240147 #3104266] INFO -- : [774/883] 3145629=test_gem_security_signer I, [2024-05-25T23:10:28.254110 #3104266] INFO -- : [775/883] 3145636=test_cipher I, [2024-05-25T23:10:28.275847 #3104266] INFO -- : [776/883] 3145630=test_rdoc_markup_to_bs I, [2024-05-25T23:10:28.295063 #3104266] INFO -- : [777/883] 3145636=test_help I, [2024-05-25T23:10:28.297605 #3104266] INFO -- : [778/883] 3145636=test_beginendblock I, [2024-05-25T23:10:28.319888 #3104266] INFO -- : [779/883] 3145630=test_gem_commands_unpack_command I, [2024-05-25T23:10:28.371363 #3104266] INFO -- : [780/883] 3145629=test_files_lib I, [2024-05-25T23:10:28.469572 #3104266] INFO -- : [781/883] 3145635=reflection_test I, [2024-05-25T23:10:28.471125 #3104266] INFO -- : [782/883] 3145635=test_within_pipe I, [2024-05-25T23:10:28.549897 #3104266] INFO -- : [783/883] 3145635=test_gem_bundler_version_finder I, [2024-05-25T23:10:28.552536 #3104266] INFO -- : [784/883] 3145619=test_emoji_breaks I, [2024-05-25T23:10:28.557581 #3104266] INFO -- : [785/883] 3145619=test_pinned I, [2024-05-25T23:10:28.577005 #3104266] INFO -- : [786/883] 3145635=test_stream I, [2024-05-25T23:10:28.584460 #3104266] INFO -- : [787/883] 3145635=test_webauthn_listener_response I, [2024-05-25T23:10:28.586318 #3104266] INFO -- : [788/883] 3145619=test_time I, [2024-05-25T23:10:28.613594 #3104266] INFO -- : [789/883] 3145635=test_to_ary_concat I, [2024-05-25T23:10:28.707678 #3104266] INFO -- : [790/883] 3145630=test_printf I, [2024-05-25T23:10:28.711430 #3104266] INFO -- : [791/883] 3145636=test_rdoc_markup_pre_process I, [2024-05-25T23:10:28.721074 #3104266] INFO -- : [792/883] 3145619=test_exit I, [2024-05-25T23:10:28.723513 #3104266] INFO -- : [793/883] 3145630=test_recursion I, [2024-05-25T23:10:28.729849 #3104266] INFO -- : [794/883] 3145630=test_date_marshal I, [2024-05-25T23:10:28.733835 #3104266] INFO -- : [795/883] 3145630=test_mkmf I, [2024-05-25T23:10:28.752340 #3104266] INFO -- : [796/883] 3145630=test_history I, [2024-05-25T23:10:28.767141 #3104266] INFO -- : [797/883] 3145630=test_popen_deadlock I, [2024-05-25T23:10:28.783125 #3104266] INFO -- : [798/883] 3145619=test_delegate I, [2024-05-25T23:10:28.800428 #3104266] INFO -- : [799/883] 3145619=test_closure I, [2024-05-25T23:10:28.828552 #3104266] INFO -- : [800/883] 3145636=test_bundled_ca I, [2024-05-25T23:10:29.036104 #3104266] INFO -- : [801/883] 3145624=test_open3 I, [2024-05-25T23:10:29.185725 #3104266] INFO -- : [802/883] 3145619=test_fiber I, [2024-05-25T23:10:29.328256 #3104266] INFO -- : [803/883] 3145632=test_multi_irb_commands I, [2024-05-25T23:10:29.333744 #3104266] INFO -- : [804/883] 3145632=test_gem_security I, [2024-05-25T23:10:29.429449 #3104266] INFO -- : [805/883] 3145630=test_rdoc_servlet I, [2024-05-25T23:10:29.553481 #3104266] INFO -- : [806/883] 3145630=test_ractor I, [2024-05-25T23:10:29.610118 #3104266] INFO -- : [807/883] 3145630=test_digest I, [2024-05-25T23:10:29.613417 #3104266] INFO -- : [808/883] 3145630=test_case_comprehensive I, [2024-05-25T23:10:29.669127 #3104266] INFO -- : [809/883] 3145628=test_interned_str I, [2024-05-25T23:10:29.680782 #3104266] INFO -- : [810/883] 3145628=test_gem_commands_build_command I, [2024-05-25T23:10:29.852456 #3104266] INFO -- : [811/883] 3145627=test_tracer I, [2024-05-25T23:10:29.865166 #3104266] INFO -- : [812/883] 3145627=test_cmethod I, [2024-05-25T23:10:29.870000 #3104266] INFO -- : [813/883] 3145627=test_option I, [2024-05-25T23:10:30.016485 #3104266] INFO -- : [814/883] 3145628=test_append I, [2024-05-25T23:10:30.021055 #3104266] INFO -- : [815/883] 3145622=test_gem_commands_server_command I, [2024-05-25T23:10:30.026410 #3104266] INFO -- : [816/883] 3145628=test_did_you_mean I, [2024-05-25T23:10:30.027318 #3104266] INFO -- : [817/883] 3145627=test_variable_name_check I, [2024-05-25T23:10:30.039986 #3104266] INFO -- : [818/883] 3145622=test_io_m17n I, [2024-05-25T23:10:30.153082 #3104266] INFO -- : [819/883] 3145635=test_rdoc_markup_heading I, [2024-05-25T23:10:30.153996 #3104266] INFO -- : [820/883] 3145627=test_iseq I, [2024-05-25T23:10:30.154596 #3104266] INFO -- : [821/883] 3145635=test_exception_at_throwing I, [2024-05-25T23:10:30.156209 #3104266] INFO -- : [822/883] 3145628=test_scheduler I, [2024-05-25T23:10:30.162750 #3104266] INFO -- : [823/883] 3145636=test_pkey_dsa I, [2024-05-25T23:10:30.164394 #3104266] INFO -- : [824/883] 3145631=test_class I, [2024-05-25T23:10:30.175655 #3104266] INFO -- : [825/883] 3145631=test_ocsp I, [2024-05-25T23:10:30.202070 #3104266] INFO -- : [826/883] 3145635=test_compile_prism I, [2024-05-25T23:10:30.263114 #3104266] INFO -- : [827/883] 3145618=test_terminfo I, [2024-05-25T23:10:30.266190 #3104266] INFO -- : [828/883] 3145618=test_rdoc_markup_to_html I, [2024-05-25T23:10:30.276604 #3104266] INFO -- : [829/883] 3145626=test_date_compat I, [2024-05-25T23:10:30.282216 #3104266] INFO -- : [830/883] 3145626=test_bug-14834 I, [2024-05-25T23:10:30.302461 #3104266] INFO -- : [831/883] 3145628=test_addrinfo I, [2024-05-25T23:10:30.364132 #3104266] INFO -- : [832/883] 3145626=test_http I, [2024-05-25T23:10:30.403922 #3104266] INFO -- : [833/883] 3145628=test_tree_spell_checker I, [2024-05-25T23:10:30.445382 #3104266] INFO -- : [834/883] 3145628=test_case_mapping I, [2024-05-25T23:10:30.450970 #3104266] INFO -- : [835/883] 3145628=redundant_return_test I, [2024-05-25T23:10:30.456258 #3104266] INFO -- : [836/883] 3145628=test_path I, [2024-05-25T23:10:30.468035 #3104266] INFO -- : [837/883] 3145628=test_win32ole_param_event I, [2024-05-25T23:10:30.468627 #3104266] INFO -- : [838/883] 3145628=test_bn I, [2024-05-25T23:10:30.482010 #3104266] INFO -- : [839/883] 3145618=test_unicode I, [2024-05-25T23:10:30.484580 #3104266] INFO -- : [840/883] 3145618=test_koi8 I, [2024-05-25T23:10:30.491259 #3104266] INFO -- : [841/883] 3145618=parameters_signature_test I, [2024-05-25T23:10:30.500301 #3104266] INFO -- : [842/883] 3145618=test_rdoc_parser_changelog I, [2024-05-25T23:10:30.505467 #3104266] INFO -- : [843/883] 3145628=test_enumerator I, [2024-05-25T23:10:30.525804 #3104266] INFO -- : [844/883] 3145631=test_rdoc_generator_pot I, [2024-05-25T23:10:30.527386 #3104266] INFO -- : [845/883] 3145628=static_literals_test I, [2024-05-25T23:10:30.537418 #3104266] INFO -- : [846/883] 3145628=test_data I, [2024-05-25T23:10:30.540023 #3104266] INFO -- : [847/883] 3145628=test_gem_gem_runner I, [2024-05-25T23:10:30.546932 #3104266] INFO -- : [848/883] 3145635=test_filter I, [2024-05-25T23:10:30.555065 #3104266] INFO -- : [849/883] 3145631=test_rdoc_method_attr I, [2024-05-25T23:10:30.562336 #3104266] INFO -- : [850/883] 3145618=test_random I, [2024-05-25T23:10:30.568991 #3104266] INFO -- : [851/883] 3145618=test_notimplement I, [2024-05-25T23:10:30.571700 #3104266] INFO -- : [852/883] 3145618=test_key_event_record I, [2024-05-25T23:10:30.574491 #3104266] INFO -- : [853/883] 3145618=test_gem_uri I, [2024-05-25T23:10:30.592106 #3104266] INFO -- : [854/883] 3145618=test_gem_commands_update_command I, [2024-05-25T23:10:30.596838 #3104266] INFO -- : [855/883] 3145628=test_gem_resolver_vendor_specification I, [2024-05-25T23:10:30.599846 #3104266] INFO -- : [856/883] 3145635=test_thread_cv I, [2024-05-25T23:10:30.627401 #3104266] INFO -- : [857/883] 3145628=test_lexer I, [2024-05-25T23:10:30.641210 #3104266] INFO -- : [858/883] 3145628=test_ssl_session I, [2024-05-25T23:10:30.673464 #3104266] INFO -- : [859/883] 3145631=test_rbconfig I, [2024-05-25T23:10:30.676050 #3104266] INFO -- : [860/883] 3145631=test_human_typo I, [2024-05-25T23:10:30.683245 #3104266] INFO -- : [861/883] 3145631=test_primitive I, [2024-05-25T23:10:30.692600 #3104266] INFO -- : [862/883] 3145631=test_rdoc_i18n_locale I, [2024-05-25T23:10:30.699696 #3104266] INFO -- : [863/883] 3145631=test_name_error_extension I, [2024-05-25T23:10:30.711154 #3104266] INFO -- : [864/883] 3145631=test_chilled I, [2024-05-25T23:10:30.713979 #3104266] INFO -- : [865/883] 3145631=test_gem_commands_yank_command I, [2024-05-25T23:10:30.726752 #3104266] INFO -- : [866/883] 3145617=test_win32ole_param I, [2024-05-25T23:10:30.729668 #3104266] INFO -- : [867/883] 3145617=test_pair I, [2024-05-25T23:10:30.814165 #3104266] INFO -- : [868/883] 3145627=test_euc_jp I, [2024-05-25T23:10:30.827734 #3104266] INFO -- : [869/883] 3145627=test_rdoc_generator_pot_po_entry I, [2024-05-25T23:10:30.840721 #3104266] INFO -- : [870/883] 3145627=test_acceptable I, [2024-05-25T23:10:30.960170 #3104266] INFO -- : [871/883] 3145627=test_document I, [2024-05-25T23:10:30.964048 #3104266] INFO -- : [872/883] 3145627=test_rdoc_markup_to_label I, [2024-05-25T23:10:30.980773 #3104266] INFO -- : [873/883] 3145627=test_install I, [2024-05-25T23:10:31.130296 #3104266] INFO -- : [874/883] 3145627=test_sockopt I, [2024-05-25T23:10:31.137243 #3104266] INFO -- : [875/883] 3145627=test_encoding I, [2024-05-25T23:10:31.163202 #3104266] INFO -- : [876/883] 3145627=test_httpresponses I, [2024-05-25T23:10:31.184450 #3104266] INFO -- : [877/883] 3145631=test_set_len I, [2024-05-25T23:10:31.190340 #3104266] INFO -- : [878/883] 3145631=test_rdoc_ri_driver I, [2024-05-25T23:10:31.194204 #3104266] INFO -- : [879/883] 3145627=test_gem_resolver_local_specification I, [2024-05-25T23:10:31.213246 #3104266] INFO -- : [880/883] 3145627=test_httpheader I, [2024-05-25T23:10:31.219162 #3104266] INFO -- : [881/883] 3145627=test_color I, [2024-05-25T23:10:31.244212 #3104266] INFO -- : [882/883] 3145635=json_encoding_test I, [2024-05-25T23:10:31.256804 #3104266] INFO -- : [883/883] 3145627=test_key_stroke I, [2024-05-25T23:10:47.468346 #3104266] INFO -- : Finished tests in 35.994511s, 733.4729 tests/s, 259846.1735 assertions/s. I, [2024-05-25T23:10:47.469100 #3104266] INFO -- : 26401 tests, 9353036 assertions, 0 failures, 0 errors, 306 skips I, [2024-05-25T23:10:47.469122 #3104266] INFO -- : I, [2024-05-25T23:10:47.469129 #3104266] INFO -- : ruby -v: ruby 3.4.0dev (2024-05-25T17:47:07Z master d2c4363e0c) [x86_64-linux] I, [2024-05-25T23:10:47.471244 #3104266] INFO -- : $$$[end] "make yes-test-all TESTOPTS='--stderr-on-failure' TESTS='-j20'" exit with 0. I, [2024-05-25T23:10:47.471397 #3104266] INFO -- : $$$[beg] make yes-test-rubyspec MSPECOPT='--error-output stderr --debug -j' TESTS='-j20' I, [2024-05-25T23:10:47.560371 #3104266] INFO -- : BASERUBY = /usr/bin/ruby --disable=gems I, [2024-05-25T23:10:47.560438 #3104266] INFO -- : CC = gcc I, [2024-05-25T23:10:47.560451 #3104266] INFO -- : LD = ld I, [2024-05-25T23:10:47.560463 #3104266] INFO -- : LDSHARED = gcc -shared I, [2024-05-25T23:10:47.560474 #3104266] INFO -- : CFLAGS = -O3 -fno-fast-math -ggdb3 -Wall -Wextra -Wdeprecated-declarations -Wdiv-by-zero -Wduplicated-cond -Wimplicit-function-declaration -Wimplicit-int -Wpointer-arith -Wwrite-strings -Wold-style-definition -Wimplicit-fallthrough=0 -Wmissing-noreturn -Wno-cast-function-type -Wno-constant-logical-operand -Wno-long-long -Wno-missing-field-initializers -Wno-overlength-strings -Wno-packed-bitfield-compat -Wno-parentheses-equality -Wno-self-assign -Wno-tautological-compare -Wno-unused-parameter -Wno-unused-value -Wsuggest-attribute=format -Wsuggest-attribute=noreturn -Wunused-variable -Wmisleading-indentation -Wundef -fPIC I, [2024-05-25T23:10:47.560491 #3104266] INFO -- : XCFLAGS = -U_FORTIFY_SOURCE -D_FORTIFY_SOURCE=2 -fstack-protector-strong -fno-strict-overflow -fvisibility=hidden -fexcess-precision=standard -DRUBY_EXPORT -I. -I.ext/include/x86_64-linux -I/tmp/ruby/src/trunk/include -I/tmp/ruby/src/trunk -I/tmp/ruby/src/trunk/prism -I/tmp/ruby/src/trunk/enc/unicode/15.0.0 I, [2024-05-25T23:10:47.560502 #3104266] INFO -- : CPPFLAGS = I, [2024-05-25T23:10:47.560512 #3104266] INFO -- : DLDFLAGS = -Wl,--compress-debug-sections=zlib -Wl,-soname,libruby.so.3.4 -fstack-protector-strong I, [2024-05-25T23:10:47.560522 #3104266] INFO -- : SOLIBS = -lz -lrt -lrt -lgmp -ldl -lcrypt -lm -lpthread I, [2024-05-25T23:10:47.560532 #3104266] INFO -- : LANG = en_US.UTF-8 I, [2024-05-25T23:10:47.560542 #3104266] INFO -- : LC_ALL = I, [2024-05-25T23:10:47.560551 #3104266] INFO -- : LC_CTYPE = I, [2024-05-25T23:10:47.560561 #3104266] INFO -- : MFLAGS = I, [2024-05-25T23:10:47.560570 #3104266] INFO -- : RUSTC = no I, [2024-05-25T23:10:47.560581 #3104266] INFO -- : YJIT_RUSTC_ARGS = --crate-name=yjit --crate-type=staticlib --edition=2021 -g -C lto=thin -C opt-level=3 -C overflow-checks=on '--out-dir=/tmp/ruby/build/trunk/yjit/target/release/' /tmp/ruby/src/trunk/yjit/src/lib.rs I, [2024-05-25T23:10:47.561067 #3104266] INFO -- : gcc (Ubuntu 11.4.0-1ubuntu1~22.04) 11.4.0 I, [2024-05-25T23:10:47.561116 #3104266] INFO -- : Copyright (C) 2021 Free Software Foundation, Inc. I, [2024-05-25T23:10:47.561128 #3104266] INFO -- : This is free software; see the source for copying conditions. There is NO I, [2024-05-25T23:10:47.561139 #3104266] INFO -- : warranty; not even for MERCHANTABILITY or FITNESS FOR A PARTICULAR PURPOSE. I, [2024-05-25T23:10:47.561149 #3104266] INFO -- : I, [2024-05-25T23:10:47.562950 #3104266] INFO -- : generating enc.mk I, [2024-05-25T23:10:47.681267 #3104266] INFO -- : generating encdb.h I, [2024-05-25T23:10:47.704978 #3104266] INFO -- : encdb.h unchanged I, [2024-05-25T23:10:47.706216 #3104266] INFO -- : making enc I, [2024-05-25T23:10:47.727294 #3104266] INFO -- : make[1]: Entering directory '/tmp/ruby/build/trunk' I, [2024-05-25T23:10:47.727361 #3104266] INFO -- : make[1]: Nothing to be done for 'enc'. I, [2024-05-25T23:10:47.727377 #3104266] INFO -- : make[1]: Leaving directory '/tmp/ruby/build/trunk' I, [2024-05-25T23:10:47.728361 #3104266] INFO -- : making srcs under enc I, [2024-05-25T23:10:47.763733 #3104266] INFO -- : make[1]: Entering directory '/tmp/ruby/build/trunk' I, [2024-05-25T23:10:47.763921 #3104266] INFO -- : make[1]: Nothing to be done for 'srcs'. I, [2024-05-25T23:10:47.763962 #3104266] INFO -- : make[1]: Leaving directory '/tmp/ruby/build/trunk' I, [2024-05-25T23:10:47.764677 #3104266] INFO -- : generating transdb.h I, [2024-05-25T23:10:47.860194 #3104266] INFO -- : transdb.h unchanged I, [2024-05-25T23:10:47.861720 #3104266] INFO -- : making trans I, [2024-05-25T23:10:47.895572 #3104266] INFO -- : make[1]: Entering directory '/tmp/ruby/build/trunk' I, [2024-05-25T23:10:47.895593 #3104266] INFO -- : make[1]: Nothing to be done for 'trans'. I, [2024-05-25T23:10:47.895599 #3104266] INFO -- : make[1]: Leaving directory '/tmp/ruby/build/trunk' I, [2024-05-25T23:10:47.896290 #3104266] INFO -- : making encs I, [2024-05-25T23:10:47.934063 #3104266] INFO -- : make[1]: Entering directory '/tmp/ruby/build/trunk' I, [2024-05-25T23:10:47.934085 #3104266] INFO -- : make[1]: Nothing to be done for 'encs'. I, [2024-05-25T23:10:47.934091 #3104266] INFO -- : make[1]: Leaving directory '/tmp/ruby/build/trunk' I, [2024-05-25T23:10:47.935826 #3104266] INFO -- : generating makefiles ext/configure-ext.mk I, [2024-05-25T23:10:47.962685 #3104266] INFO -- : ext/configure-ext.mk updated I, [2024-05-25T23:10:47.965103 #3104266] INFO -- : make[1]: Entering directory '/tmp/ruby/build/trunk' I, [2024-05-25T23:10:49.363996 #3104266] INFO -- : make[1]: Leaving directory '/tmp/ruby/build/trunk' I, [2024-05-25T23:10:49.364609 #3104266] INFO -- : generating makefile exts.mk I, [2024-05-25T23:10:49.402611 #3104266] INFO -- : exts.mk unchanged I, [2024-05-25T23:10:49.407147 #3104266] INFO -- : make[1]: Entering directory '/tmp/ruby/build/trunk' I, [2024-05-25T23:10:49.716044 #3104266] INFO -- : make[2]: Entering directory '/tmp/ruby/build/trunk/ext/coverage' I, [2024-05-25T23:10:49.719436 #3104266] INFO -- : make[2]: Leaving directory '/tmp/ruby/build/trunk/ext/coverage' I, [2024-05-25T23:10:49.724995 #3104266] INFO -- : make[2]: Entering directory '/tmp/ruby/build/trunk/ext/date' I, [2024-05-25T23:10:49.729299 #3104266] INFO -- : make[2]: Leaving directory '/tmp/ruby/build/trunk/ext/date' I, [2024-05-25T23:10:49.733271 #3104266] INFO -- : make[2]: Entering directory '/tmp/ruby/build/trunk/ext/digest' I, [2024-05-25T23:10:49.742459 #3104266] INFO -- : make[2]: Leaving directory '/tmp/ruby/build/trunk/ext/digest' I, [2024-05-25T23:10:49.768794 #3104266] INFO -- : make[2]: Entering directory '/tmp/ruby/build/trunk/ext/digest/sha2' I, [2024-05-25T23:10:49.773021 #3104266] INFO -- : make[2]: Leaving directory '/tmp/ruby/build/trunk/ext/digest/sha2' I, [2024-05-25T23:10:49.794527 #3104266] INFO -- : make[2]: Entering directory '/tmp/ruby/build/trunk/ext/fiddle' I, [2024-05-25T23:10:49.805327 #3104266] INFO -- : make[2]: Leaving directory '/tmp/ruby/build/trunk/ext/fiddle' I, [2024-05-25T23:10:49.810395 #3104266] INFO -- : make[2]: Entering directory '/tmp/ruby/build/trunk/ext/io/console' I, [2024-05-25T23:10:49.814713 #3104266] INFO -- : make[2]: Leaving directory '/tmp/ruby/build/trunk/ext/io/console' I, [2024-05-25T23:10:49.827566 #3104266] INFO -- : make[2]: Entering directory '/tmp/ruby/build/trunk/ext/json' I, [2024-05-25T23:10:49.838093 #3104266] INFO -- : make[2]: Leaving directory '/tmp/ruby/build/trunk/ext/json' I, [2024-05-25T23:10:49.853565 #3104266] INFO -- : make[2]: Entering directory '/tmp/ruby/build/trunk/ext/monitor' I, [2024-05-25T23:10:49.857779 #3104266] INFO -- : make[2]: Leaving directory '/tmp/ruby/build/trunk/ext/monitor' I, [2024-05-25T23:10:49.864713 #3104266] INFO -- : make[2]: Entering directory '/tmp/ruby/build/trunk/ext/objspace' I, [2024-05-25T23:10:49.869850 #3104266] INFO -- : make[2]: Leaving directory '/tmp/ruby/build/trunk/ext/objspace' I, [2024-05-25T23:10:49.884366 #3104266] INFO -- : make[2]: Entering directory '/tmp/ruby/build/trunk/ext/openssl' I, [2024-05-25T23:10:49.903816 #3104266] INFO -- : make[2]: Leaving directory '/tmp/ruby/build/trunk/ext/openssl' I, [2024-05-25T23:10:49.908501 #3104266] INFO -- : make[2]: Entering directory '/tmp/ruby/build/trunk/ext/pathname' I, [2024-05-25T23:10:49.912551 #3104266] INFO -- : make[2]: Leaving directory '/tmp/ruby/build/trunk/ext/pathname' I, [2024-05-25T23:10:49.919817 #3104266] INFO -- : make[2]: Entering directory '/tmp/ruby/build/trunk/ext/psych' I, [2024-05-25T23:10:49.943159 #3104266] INFO -- : make[2]: Leaving directory '/tmp/ruby/build/trunk/ext/psych' I, [2024-05-25T23:10:49.948033 #3104266] INFO -- : make[2]: Entering directory '/tmp/ruby/build/trunk/ext/pty' I, [2024-05-25T23:10:49.952093 #3104266] INFO -- : make[2]: Leaving directory '/tmp/ruby/build/trunk/ext/pty' I, [2024-05-25T23:10:49.967811 #3104266] INFO -- : make[2]: Entering directory '/tmp/ruby/build/trunk/ext/ripper' I, [2024-05-25T23:10:49.975062 #3104266] INFO -- : make[2]: Leaving directory '/tmp/ruby/build/trunk/ext/ripper' I, [2024-05-25T23:10:49.977378 #3104266] INFO -- : make[2]: Entering directory '/tmp/ruby/build/trunk/ext/rubyvm' I, [2024-05-25T23:10:49.980598 #3104266] INFO -- : make[2]: Leaving directory '/tmp/ruby/build/trunk/ext/rubyvm' I, [2024-05-25T23:10:49.994143 #3104266] INFO -- : make[2]: Entering directory '/tmp/ruby/build/trunk/ext/socket' I, [2024-05-25T23:10:50.004369 #3104266] INFO -- : make[2]: Leaving directory '/tmp/ruby/build/trunk/ext/socket' I, [2024-05-25T23:10:50.022982 #3104266] INFO -- : make[2]: Entering directory '/tmp/ruby/build/trunk/.bundle/gems/bigdecimal-3.1.8/ext/bigdecimal' I, [2024-05-25T23:10:50.050243 #3104266] INFO -- : make[2]: Leaving directory '/tmp/ruby/build/trunk/.bundle/gems/bigdecimal-3.1.8/ext/bigdecimal' I, [2024-05-25T23:10:50.052169 #3104266] INFO -- : make[2]: Entering directory '/tmp/ruby/build/trunk/.bundle/gems/debug-1.9.2/ext/debug' I, [2024-05-25T23:10:50.074413 #3104266] INFO -- : make[2]: Leaving directory '/tmp/ruby/build/trunk/.bundle/gems/debug-1.9.2/ext/debug' I, [2024-05-25T23:10:50.076326 #3104266] INFO -- : make[2]: Entering directory '/tmp/ruby/build/trunk/.bundle/gems/nkf-0.2.0/ext/nkf' I, [2024-05-25T23:10:50.097822 #3104266] INFO -- : make[2]: Leaving directory '/tmp/ruby/build/trunk/.bundle/gems/nkf-0.2.0/ext/nkf' I, [2024-05-25T23:10:50.099819 #3104266] INFO -- : make[2]: Entering directory '/tmp/ruby/build/trunk/.bundle/gems/racc-1.7.3/ext/racc/cparse' I, [2024-05-25T23:10:50.121789 #3104266] INFO -- : make[2]: Leaving directory '/tmp/ruby/build/trunk/.bundle/gems/racc-1.7.3/ext/racc/cparse' I, [2024-05-25T23:10:50.123790 #3104266] INFO -- : make[2]: Entering directory '/tmp/ruby/build/trunk/.bundle/gems/racc-1.8.0/ext/racc/cparse' I, [2024-05-25T23:10:50.145507 #3104266] INFO -- : make[2]: Leaving directory '/tmp/ruby/build/trunk/.bundle/gems/racc-1.8.0/ext/racc/cparse' I, [2024-05-25T23:10:50.147875 #3104266] INFO -- : make[2]: Entering directory '/tmp/ruby/build/trunk/.bundle/gems/rbs-3.4.4/ext/rbs_extension' I, [2024-05-25T23:10:50.170264 #3104266] INFO -- : make[2]: Leaving directory '/tmp/ruby/build/trunk/.bundle/gems/rbs-3.4.4/ext/rbs_extension' I, [2024-05-25T23:10:50.172132 #3104266] INFO -- : make[2]: Entering directory '/tmp/ruby/build/trunk/.bundle/gems/syslog-0.1.2/ext/syslog' I, [2024-05-25T23:10:50.195371 #3104266] INFO -- : make[2]: Leaving directory '/tmp/ruby/build/trunk/.bundle/gems/syslog-0.1.2/ext/syslog' I, [2024-05-25T23:10:50.219568 #3104266] INFO -- : make[2]: Entering directory '/tmp/ruby/build/trunk' I, [2024-05-25T23:10:50.291119 #3104266] INFO -- : make[2]: 'ruby' is up to date. I, [2024-05-25T23:10:50.291156 #3104266] INFO -- : make[2]: Leaving directory '/tmp/ruby/build/trunk' I, [2024-05-25T23:10:50.291418 #3104266] INFO -- : make[1]: Leaving directory '/tmp/ruby/build/trunk' I, [2024-05-25T23:10:50.295208 #3104266] INFO -- : make[1]: Entering directory '/tmp/ruby/build/trunk' I, [2024-05-25T23:10:50.295229 #3104266] INFO -- : make[1]: Nothing to be done for 'note'. I, [2024-05-25T23:10:50.295235 #3104266] INFO -- : make[1]: Leaving directory '/tmp/ruby/build/trunk' E, [2024-05-25T23:10:50.351212 #3104266] ERROR -- : $ /tmp/ruby/build/trunk/miniruby -I/tmp/ruby/src/trunk/lib /tmp/ruby/src/trunk/tool/runruby.rb --archdir=/tmp/ruby/build/trunk --extout=.ext -- /tmp/ruby/src/trunk/spec/mspec/bin/mspec-run -B /tmp/ruby/src/trunk/spec/default.mspec --error-output stderr --debug -fy -o /tmp/rubytest.4w025b/1-mspec-multi-0 E, [2024-05-25T23:10:50.351371 #3104266] ERROR -- : $ /tmp/ruby/build/trunk/miniruby -I/tmp/ruby/src/trunk/lib /tmp/ruby/src/trunk/tool/runruby.rb --archdir=/tmp/ruby/build/trunk --extout=.ext -- /tmp/ruby/src/trunk/spec/mspec/bin/mspec-run -B /tmp/ruby/src/trunk/spec/default.mspec --error-output stderr --debug -fy -o /tmp/rubytest.4w025b/2-mspec-multi-1 E, [2024-05-25T23:10:50.351608 #3104266] ERROR -- : $ /tmp/ruby/build/trunk/miniruby -I/tmp/ruby/src/trunk/lib /tmp/ruby/src/trunk/tool/runruby.rb --archdir=/tmp/ruby/build/trunk --extout=.ext -- /tmp/ruby/src/trunk/spec/mspec/bin/mspec-run -B /tmp/ruby/src/trunk/spec/default.mspec --error-output stderr --debug -fy -o /tmp/rubytest.4w025b/3-mspec-multi-2 E, [2024-05-25T23:10:50.351714 #3104266] ERROR -- : $ /tmp/ruby/build/trunk/miniruby -I/tmp/ruby/src/trunk/lib /tmp/ruby/src/trunk/tool/runruby.rb --archdir=/tmp/ruby/build/trunk --extout=.ext -- /tmp/ruby/src/trunk/spec/mspec/bin/mspec-run -B /tmp/ruby/src/trunk/spec/default.mspec --error-output stderr --debug -fy -o /tmp/rubytest.4w025b/4-mspec-multi-3 E, [2024-05-25T23:10:50.352045 #3104266] ERROR -- : $ /tmp/ruby/build/trunk/miniruby -I/tmp/ruby/src/trunk/lib /tmp/ruby/src/trunk/tool/runruby.rb --archdir=/tmp/ruby/build/trunk --extout=.ext -- /tmp/ruby/src/trunk/spec/mspec/bin/mspec-run -B /tmp/ruby/src/trunk/spec/default.mspec --error-output stderr --debug -fy -o /tmp/rubytest.4w025b/5-mspec-multi-4 E, [2024-05-25T23:10:50.352213 #3104266] ERROR -- : $ /tmp/ruby/build/trunk/miniruby -I/tmp/ruby/src/trunk/lib /tmp/ruby/src/trunk/tool/runruby.rb --archdir=/tmp/ruby/build/trunk --extout=.ext -- /tmp/ruby/src/trunk/spec/mspec/bin/mspec-run -B /tmp/ruby/src/trunk/spec/default.mspec --error-output stderr --debug -fy -o /tmp/rubytest.4w025b/6-mspec-multi-5 E, [2024-05-25T23:10:50.352332 #3104266] ERROR -- : $ /tmp/ruby/build/trunk/miniruby -I/tmp/ruby/src/trunk/lib /tmp/ruby/src/trunk/tool/runruby.rb --archdir=/tmp/ruby/build/trunk --extout=.ext -- /tmp/ruby/src/trunk/spec/mspec/bin/mspec-run -B /tmp/ruby/src/trunk/spec/default.mspec --error-output stderr --debug -fy -o /tmp/rubytest.4w025b/7-mspec-multi-6 E, [2024-05-25T23:10:50.352536 #3104266] ERROR -- : $ /tmp/ruby/build/trunk/miniruby -I/tmp/ruby/src/trunk/lib /tmp/ruby/src/trunk/tool/runruby.rb --archdir=/tmp/ruby/build/trunk --extout=.ext -- /tmp/ruby/src/trunk/spec/mspec/bin/mspec-run -B /tmp/ruby/src/trunk/spec/default.mspec --error-output stderr --debug -fy -o /tmp/rubytest.4w025b/8-mspec-multi-7 E, [2024-05-25T23:10:50.352736 #3104266] ERROR -- : $ /tmp/ruby/build/trunk/miniruby -I/tmp/ruby/src/trunk/lib /tmp/ruby/src/trunk/tool/runruby.rb --archdir=/tmp/ruby/build/trunk --extout=.ext -- /tmp/ruby/src/trunk/spec/mspec/bin/mspec-run -B /tmp/ruby/src/trunk/spec/default.mspec --error-output stderr --debug -fy -o /tmp/rubytest.4w025b/9-mspec-multi-8 E, [2024-05-25T23:10:50.352943 #3104266] ERROR -- : $ /tmp/ruby/build/trunk/miniruby -I/tmp/ruby/src/trunk/lib /tmp/ruby/src/trunk/tool/runruby.rb --archdir=/tmp/ruby/build/trunk --extout=.ext -- /tmp/ruby/src/trunk/spec/mspec/bin/mspec-run -B /tmp/ruby/src/trunk/spec/default.mspec --error-output stderr --debug -fy -o /tmp/rubytest.4w025b/10-mspec-multi-9 E, [2024-05-25T23:10:50.353261 #3104266] ERROR -- : $ /tmp/ruby/build/trunk/miniruby -I/tmp/ruby/src/trunk/lib /tmp/ruby/src/trunk/tool/runruby.rb --archdir=/tmp/ruby/build/trunk --extout=.ext -- /tmp/ruby/src/trunk/spec/mspec/bin/mspec-run -B /tmp/ruby/src/trunk/spec/default.mspec --error-output stderr --debug -fy -o /tmp/rubytest.4w025b/11-mspec-multi-10 E, [2024-05-25T23:10:50.353490 #3104266] ERROR -- : $ /tmp/ruby/build/trunk/miniruby -I/tmp/ruby/src/trunk/lib /tmp/ruby/src/trunk/tool/runruby.rb --archdir=/tmp/ruby/build/trunk --extout=.ext -- /tmp/ruby/src/trunk/spec/mspec/bin/mspec-run -B /tmp/ruby/src/trunk/spec/default.mspec --error-output stderr --debug -fy -o /tmp/rubytest.4w025b/12-mspec-multi-11 E, [2024-05-25T23:10:50.353675 #3104266] ERROR -- : $ /tmp/ruby/build/trunk/miniruby -I/tmp/ruby/src/trunk/lib /tmp/ruby/src/trunk/tool/runruby.rb --archdir=/tmp/ruby/build/trunk --extout=.ext -- /tmp/ruby/src/trunk/spec/mspec/bin/mspec-run -B /tmp/ruby/src/trunk/spec/default.mspec --error-output stderr --debug -fy -o /tmp/rubytest.4w025b/13-mspec-multi-12 E, [2024-05-25T23:10:50.353815 #3104266] ERROR -- : $ /tmp/ruby/build/trunk/miniruby -I/tmp/ruby/src/trunk/lib /tmp/ruby/src/trunk/tool/runruby.rb --archdir=/tmp/ruby/build/trunk --extout=.ext -- /tmp/ruby/src/trunk/spec/mspec/bin/mspec-run -B /tmp/ruby/src/trunk/spec/default.mspec --error-output stderr --debug -fy -o /tmp/rubytest.4w025b/14-mspec-multi-13 E, [2024-05-25T23:10:50.354047 #3104266] ERROR -- : $ /tmp/ruby/build/trunk/miniruby -I/tmp/ruby/src/trunk/lib /tmp/ruby/src/trunk/tool/runruby.rb --archdir=/tmp/ruby/build/trunk --extout=.ext -- /tmp/ruby/src/trunk/spec/mspec/bin/mspec-run -B /tmp/ruby/src/trunk/spec/default.mspec --error-output stderr --debug -fy -o /tmp/rubytest.4w025b/15-mspec-multi-14 E, [2024-05-25T23:10:50.354215 #3104266] ERROR -- : $ /tmp/ruby/build/trunk/miniruby -I/tmp/ruby/src/trunk/lib /tmp/ruby/src/trunk/tool/runruby.rb --archdir=/tmp/ruby/build/trunk --extout=.ext -- /tmp/ruby/src/trunk/spec/mspec/bin/mspec-run -B /tmp/ruby/src/trunk/spec/default.mspec --error-output stderr --debug -fy -o /tmp/rubytest.4w025b/16-mspec-multi-15 E, [2024-05-25T23:10:50.354404 #3104266] ERROR -- : $ /tmp/ruby/build/trunk/miniruby -I/tmp/ruby/src/trunk/lib /tmp/ruby/src/trunk/tool/runruby.rb --archdir=/tmp/ruby/build/trunk --extout=.ext -- /tmp/ruby/src/trunk/spec/mspec/bin/mspec-run -B /tmp/ruby/src/trunk/spec/default.mspec --error-output stderr --debug -fy -o /tmp/rubytest.4w025b/17-mspec-multi-16 E, [2024-05-25T23:10:50.354620 #3104266] ERROR -- : $ /tmp/ruby/build/trunk/miniruby -I/tmp/ruby/src/trunk/lib /tmp/ruby/src/trunk/tool/runruby.rb --archdir=/tmp/ruby/build/trunk --extout=.ext -- /tmp/ruby/src/trunk/spec/mspec/bin/mspec-run -B /tmp/ruby/src/trunk/spec/default.mspec --error-output stderr --debug -fy -o /tmp/rubytest.4w025b/18-mspec-multi-17 E, [2024-05-25T23:10:50.357025 #3104266] ERROR -- : $ /tmp/ruby/build/trunk/miniruby -I/tmp/ruby/src/trunk/lib /tmp/ruby/src/trunk/tool/runruby.rb --archdir=/tmp/ruby/build/trunk --extout=.ext -- /tmp/ruby/src/trunk/spec/mspec/bin/mspec-run -B /tmp/ruby/src/trunk/spec/default.mspec --error-output stderr --debug -fy -o /tmp/rubytest.4w025b/19-mspec-multi-18 E, [2024-05-25T23:10:50.357307 #3104266] ERROR -- : $ /tmp/ruby/build/trunk/miniruby -I/tmp/ruby/src/trunk/lib /tmp/ruby/src/trunk/tool/runruby.rb --archdir=/tmp/ruby/build/trunk --extout=.ext -- /tmp/ruby/src/trunk/spec/mspec/bin/mspec-run -B /tmp/ruby/src/trunk/spec/default.mspec --error-output stderr --debug -fy -o /tmp/rubytest.4w025b/20-mspec-multi-19 I, [2024-05-25T23:10:50.523087 #3104266] INFO -- : ruby 3.4.0dev (2024-05-25T17:47:07Z master d2c4363e0c) [x86_64-linux] I, [2024-05-25T23:10:51.184473 #3104266] INFO -- : 0 ......................................................................... I, [2024-05-25T23:10:51.510742 #3104266] INFO -- : 73 ......................................................................... I, [2024-05-25T23:10:51.661524 #3104266] INFO -- : 146 ......................................................................... I, [2024-05-25T23:10:51.708687 #3104266] INFO -- : 219 ......................................................................... I, [2024-05-25T23:10:51.770556 #3104266] INFO -- : 292 ......................................................................... I, [2024-05-25T23:10:51.815600 #3104266] INFO -- : 365 ......................................................................... I, [2024-05-25T23:10:51.836743 #3104266] INFO -- : 438 ......................................................................... I, [2024-05-25T23:10:51.856641 #3104266] INFO -- : 511 ......................................................................... I, [2024-05-25T23:10:51.874950 #3104266] INFO -- : 584 ......................................................................... I, [2024-05-25T23:10:51.934461 #3104266] INFO -- : 657 ......................................................................... I, [2024-05-25T23:10:51.962014 #3104266] INFO -- : 730 ......................................................................... I, [2024-05-25T23:10:51.987718 #3104266] INFO -- : 803 ......................................................................... I, [2024-05-25T23:10:52.023815 #3104266] INFO -- : 876 ......................................................................... I, [2024-05-25T23:10:52.081908 #3104266] INFO -- : 949 ......................................................................... I, [2024-05-25T23:10:52.167383 #3104266] INFO -- : 1022 ......................................................................... I, [2024-05-25T23:10:52.338176 #3104266] INFO -- : 1095 ......................................................................... I, [2024-05-25T23:10:52.453180 #3104266] INFO -- : 1168 ......................................................................... I, [2024-05-25T23:10:52.509240 #3104266] INFO -- : 1241 ......................................................................... I, [2024-05-25T23:10:52.560161 #3104266] INFO -- : 1314 ......................................................................... I, [2024-05-25T23:10:52.588201 #3104266] INFO -- : 1387 ......................................................................... I, [2024-05-25T23:10:52.676853 #3104266] INFO -- : 1460 ......................................................................... I, [2024-05-25T23:10:53.126643 #3104266] INFO -- : 1533 ......................................................................... I, [2024-05-25T23:10:53.206577 #3104266] INFO -- : 1606 ......................................................................... I, [2024-05-25T23:10:53.375538 #3104266] INFO -- : 1679 ......................................................................... I, [2024-05-25T23:10:53.480504 #3104266] INFO -- : 1752 ......................................................................... I, [2024-05-25T23:10:53.546207 #3104266] INFO -- : 1825 ......................................................................... I, [2024-05-25T23:10:53.626231 #3104266] INFO -- : 1898 ......................................................................... I, [2024-05-25T23:10:53.727755 #3104266] INFO -- : 1971 ......................................................................... I, [2024-05-25T23:10:53.791637 #3104266] INFO -- : 2044 ......................................................................... I, [2024-05-25T23:10:53.830619 #3104266] INFO -- : 2117 ......................................................................... I, [2024-05-25T23:10:53.847585 #3104266] INFO -- : 2190 ......................................................................... I, [2024-05-25T23:10:53.865036 #3104266] INFO -- : 2263 ......................................................................... I, [2024-05-25T23:10:53.878542 #3104266] INFO -- : 2336 ......................................................................... I, [2024-05-25T23:10:53.906878 #3104266] INFO -- : 2409 ......................................................................... I, [2024-05-25T23:10:54.011709 #3104266] INFO -- : 2482 ......................................................................... I, [2024-05-25T23:10:54.040859 #3104266] INFO -- : 2555 ......................................................................... I, [2024-05-25T23:10:54.162335 #3104266] INFO -- : 2628 ......................................................................... I, [2024-05-25T23:10:54.259335 #3104266] INFO -- : 2701 ......................................................................... I, [2024-05-25T23:10:54.293152 #3104266] INFO -- : 2774 ......................................................................... I, [2024-05-25T23:10:54.351388 #3104266] INFO -- : 2847 ......................................................................... I, [2024-05-25T23:10:54.387948 #3104266] INFO -- : 2920 ......................................................................... I, [2024-05-25T23:10:54.413496 #3104266] INFO -- : 2993 ......................................................................... I, [2024-05-25T23:10:54.435901 #3104266] INFO -- : 3066 ......................................................................... I, [2024-05-25T23:10:54.452561 #3104266] INFO -- : 3139 ......................................................................... I, [2024-05-25T23:10:54.462869 #3104266] INFO -- : 3212 ......................................................................... I, [2024-05-25T23:10:54.499092 #3104266] INFO -- : 3285 ......................................................................... I, [2024-05-25T23:10:58.434299 #3104266] INFO -- : 3358 ......................................................................... I, [2024-05-25T23:10:58.457461 #3104266] INFO -- : I, [2024-05-25T23:10:58.457531 #3104266] INFO -- : I, [2024-05-25T23:10:58.457549 #3104266] INFO -- : Finished in 8.105512 seconds I, [2024-05-25T23:10:58.457564 #3104266] INFO -- : I, [2024-05-25T23:10:58.457579 #3104266] INFO -- : 3430 files, 32652 examples, 168502 expectations, 0 failures, 0 errors, 0 tagged I, [2024-05-25T23:10:58.459509 #3104266] INFO -- : $$$[end] "make yes-test-rubyspec MSPECOPT='--error-output stderr --debug -j' TESTS='-j20'" exit with 0.