# Logfile created on 2024-05-25 20:50:11 +0000 by logger.rb/v1.4.3 I, [2024-05-25T20:50:11.108321 #3793836] INFO -- : #, @formatter=nil, @logdev=#, @binmode=false, @mon_data=#, @mon_data_owner_object_id=860>>> I, [2024-05-25T20:50:11.108448 #3793836] INFO -- : $$$[beg] make update-unicode -j20 I, [2024-05-25T20:50:11.167412 #3793836] INFO -- : Downloading Unicode emoji 15.0 files... I, [2024-05-25T20:50:11.167675 #3793836] INFO -- : Downloading Unicode emoji 15.0 files... I, [2024-05-25T20:50:11.167733 #3793836] INFO -- : Downloading Unicode emoji 15.0 files... I, [2024-05-25T20:50:11.209212 #3793836] INFO -- : made symlink emoji/15.0/emoji-sequences.txt to /tmp/ruby/src/trunk/.downloaded-cache/emoji/15.0/emoji-sequences.txt I, [2024-05-25T20:50:11.209247 #3793836] INFO -- : downloading emoji/15.0/emoji-test.txt ... /tmp/ruby/src/trunk/enc/unicode/data/emoji/15.0/emoji-sequences.txt already exists I, [2024-05-25T20:50:11.210127 #3793836] INFO -- : downloading emoji/15.0/emoji-test.txt ... /tmp/ruby/src/trunk/enc/unicode/data/emoji/15.0/emoji-sequences.txt already exists E, [2024-05-25T20:50:11.663756 #3793836] ERROR -- : /tmp/ruby/src/trunk/tool/downloader.rb:302:in `rescue in download': failed to download emoji/15.0/emoji-test.txt (RuntimeError) E, [2024-05-25T20:50:11.663905 #3793836] ERROR -- : OpenURI::HTTPError: 403 Forbidden: https://www.unicode.org/Public/emoji/15.0/emoji-test.txt E, [2024-05-25T20:50:11.663925 #3793836] ERROR -- : from /tmp/ruby/src/trunk/tool/downloader.rb:201:in `download' E, [2024-05-25T20:50:11.663937 #3793836] ERROR -- : from /tmp/ruby/src/trunk/tool/downloader.rb:136:in `download' E, [2024-05-25T20:50:11.663950 #3793836] ERROR -- : from /tmp/ruby/src/trunk/tool/downloader.rb:482:in `block in
' E, [2024-05-25T20:50:11.663962 #3793836] ERROR -- : from /tmp/ruby/src/trunk/tool/downloader.rb:465:in `each' E, [2024-05-25T20:50:11.663974 #3793836] ERROR -- : from /tmp/ruby/src/trunk/tool/downloader.rb:465:in `
' E, [2024-05-25T20:50:11.663986 #3793836] ERROR -- : /usr/lib/ruby/3.0.0/open-uri.rb:364:in `open_http': 403 Forbidden (OpenURI::HTTPError) E, [2024-05-25T20:50:11.663999 #3793836] ERROR -- : from /usr/lib/ruby/3.0.0/open-uri.rb:741:in `buffer_open' E, [2024-05-25T20:50:11.664014 #3793836] ERROR -- : from /usr/lib/ruby/3.0.0/open-uri.rb:212:in `block in open_loop' E, [2024-05-25T20:50:11.664025 #3793836] ERROR -- : from /usr/lib/ruby/3.0.0/open-uri.rb:210:in `catch' E, [2024-05-25T20:50:11.664037 #3793836] ERROR -- : from /usr/lib/ruby/3.0.0/open-uri.rb:210:in `open_loop' E, [2024-05-25T20:50:11.664049 #3793836] ERROR -- : from /usr/lib/ruby/3.0.0/open-uri.rb:151:in `open_uri' E, [2024-05-25T20:50:11.664060 #3793836] ERROR -- : from /usr/lib/ruby/3.0.0/open-uri.rb:721:in `open' E, [2024-05-25T20:50:11.664071 #3793836] ERROR -- : from /usr/lib/ruby/3.0.0/open-uri.rb:729:in `read' E, [2024-05-25T20:50:11.664102 #3793836] ERROR -- : from /tmp/ruby/src/trunk/tool/downloader.rb:247:in `block in download' E, [2024-05-25T20:50:11.664114 #3793836] ERROR -- : from /tmp/ruby/src/trunk/tool/downloader.rb:378:in `with_retry' E, [2024-05-25T20:50:11.664126 #3793836] ERROR -- : from /tmp/ruby/src/trunk/tool/downloader.rb:246:in `download' E, [2024-05-25T20:50:11.664142 #3793836] ERROR -- : from /tmp/ruby/src/trunk/tool/downloader.rb:136:in `download' E, [2024-05-25T20:50:11.664154 #3793836] ERROR -- : from /tmp/ruby/src/trunk/tool/downloader.rb:482:in `block in
' E, [2024-05-25T20:50:11.664178 #3793836] ERROR -- : from /tmp/ruby/src/trunk/tool/downloader.rb:465:in `each' E, [2024-05-25T20:50:11.664190 #3793836] ERROR -- : from /tmp/ruby/src/trunk/tool/downloader.rb:465:in `
' E, [2024-05-25T20:50:11.667201 #3793836] ERROR -- : /tmp/ruby/src/trunk/tool/downloader.rb:302:in `rescue in download': failed to download emoji/15.0/emoji-test.txt (RuntimeError) E, [2024-05-25T20:50:11.667264 #3793836] ERROR -- : OpenURI::HTTPError: 403 Forbidden: https://www.unicode.org/Public/emoji/15.0/emoji-test.txt E, [2024-05-25T20:50:11.667279 #3793836] ERROR -- : from /tmp/ruby/src/trunk/tool/downloader.rb:201:in `download' E, [2024-05-25T20:50:11.667300 #3793836] ERROR -- : from /tmp/ruby/src/trunk/tool/downloader.rb:136:in `download' E, [2024-05-25T20:50:11.667310 #3793836] ERROR -- : from /tmp/ruby/src/trunk/tool/downloader.rb:482:in `block in
' E, [2024-05-25T20:50:11.667319 #3793836] ERROR -- : from /tmp/ruby/src/trunk/tool/downloader.rb:465:in `each' E, [2024-05-25T20:50:11.667328 #3793836] ERROR -- : from /tmp/ruby/src/trunk/tool/downloader.rb:465:in `
' E, [2024-05-25T20:50:11.667338 #3793836] ERROR -- : /usr/lib/ruby/3.0.0/open-uri.rb:364:in `open_http': 403 Forbidden (OpenURI::HTTPError) E, [2024-05-25T20:50:11.667347 #3793836] ERROR -- : from /usr/lib/ruby/3.0.0/open-uri.rb:741:in `buffer_open' E, [2024-05-25T20:50:11.667356 #3793836] ERROR -- : from /usr/lib/ruby/3.0.0/open-uri.rb:212:in `block in open_loop' E, [2024-05-25T20:50:11.667366 #3793836] ERROR -- : from /usr/lib/ruby/3.0.0/open-uri.rb:210:in `catch' E, [2024-05-25T20:50:11.667378 #3793836] ERROR -- : from /usr/lib/ruby/3.0.0/open-uri.rb:210:in `open_loop' E, [2024-05-25T20:50:11.667388 #3793836] ERROR -- : from /usr/lib/ruby/3.0.0/open-uri.rb:151:in `open_uri' E, [2024-05-25T20:50:11.667397 #3793836] ERROR -- : from /usr/lib/ruby/3.0.0/open-uri.rb:721:in `open' E, [2024-05-25T20:50:11.667406 #3793836] ERROR -- : from /usr/lib/ruby/3.0.0/open-uri.rb:729:in `read' E, [2024-05-25T20:50:11.667416 #3793836] ERROR -- : from /tmp/ruby/src/trunk/tool/downloader.rb:247:in `block in download' E, [2024-05-25T20:50:11.667425 #3793836] ERROR -- : from /tmp/ruby/src/trunk/tool/downloader.rb:378:in `with_retry' E, [2024-05-25T20:50:11.667434 #3793836] ERROR -- : from /tmp/ruby/src/trunk/tool/downloader.rb:246:in `download' E, [2024-05-25T20:50:11.667443 #3793836] ERROR -- : from /tmp/ruby/src/trunk/tool/downloader.rb:136:in `download' E, [2024-05-25T20:50:11.667452 #3793836] ERROR -- : from /tmp/ruby/src/trunk/tool/downloader.rb:482:in `block in
' E, [2024-05-25T20:50:11.667463 #3793836] ERROR -- : from /tmp/ruby/src/trunk/tool/downloader.rb:465:in `each' E, [2024-05-25T20:50:11.667472 #3793836] ERROR -- : from /tmp/ruby/src/trunk/tool/downloader.rb:465:in `
' E, [2024-05-25T20:50:11.668347 #3793836] ERROR -- : make: *** [uncommon.mk:1756: /tmp/ruby/src/trunk/enc/unicode/data/emoji/15.0/emoji-sequences.txt] Error 1 E, [2024-05-25T20:50:11.668405 #3793836] ERROR -- : make: *** Deleting file '/tmp/ruby/src/trunk/enc/unicode/data/emoji/15.0/emoji-sequences.txt' E, [2024-05-25T20:50:11.668420 #3793836] ERROR -- : make: *** Waiting for unfinished jobs.... E, [2024-05-25T20:50:11.670906 #3793836] ERROR -- : make: *** [uncommon.mk:1756: /tmp/ruby/src/trunk/enc/unicode/data/emoji/15.0/emoji-test.txt] Error 1 E, [2024-05-25T20:50:11.688365 #3793836] ERROR -- : /tmp/ruby/src/trunk/tool/downloader.rb:302:in `rescue in download': failed to download emoji/15.0/emoji-test.txt (RuntimeError) E, [2024-05-25T20:50:11.688489 #3793836] ERROR -- : OpenURI::HTTPError: 403 Forbidden: https://www.unicode.org/Public/emoji/15.0/emoji-test.txt E, [2024-05-25T20:50:11.688512 #3793836] ERROR -- : from /tmp/ruby/src/trunk/tool/downloader.rb:201:in `download' E, [2024-05-25T20:50:11.688526 #3793836] ERROR -- : from /tmp/ruby/src/trunk/tool/downloader.rb:136:in `download' E, [2024-05-25T20:50:11.688539 #3793836] ERROR -- : from /tmp/ruby/src/trunk/tool/downloader.rb:482:in `block in
' E, [2024-05-25T20:50:11.688552 #3793836] ERROR -- : from /tmp/ruby/src/trunk/tool/downloader.rb:465:in `each' E, [2024-05-25T20:50:11.688565 #3793836] ERROR -- : from /tmp/ruby/src/trunk/tool/downloader.rb:465:in `
' E, [2024-05-25T20:50:11.688578 #3793836] ERROR -- : /usr/lib/ruby/3.0.0/open-uri.rb:364:in `open_http': 403 Forbidden (OpenURI::HTTPError) E, [2024-05-25T20:50:11.688595 #3793836] ERROR -- : from /usr/lib/ruby/3.0.0/open-uri.rb:741:in `buffer_open' E, [2024-05-25T20:50:11.688608 #3793836] ERROR -- : from /usr/lib/ruby/3.0.0/open-uri.rb:212:in `block in open_loop' E, [2024-05-25T20:50:11.688621 #3793836] ERROR -- : from /usr/lib/ruby/3.0.0/open-uri.rb:210:in `catch' E, [2024-05-25T20:50:11.688634 #3793836] ERROR -- : from /usr/lib/ruby/3.0.0/open-uri.rb:210:in `open_loop' E, [2024-05-25T20:50:11.688646 #3793836] ERROR -- : from /usr/lib/ruby/3.0.0/open-uri.rb:151:in `open_uri' E, [2024-05-25T20:50:11.688659 #3793836] ERROR -- : from /usr/lib/ruby/3.0.0/open-uri.rb:721:in `open' E, [2024-05-25T20:50:11.688908 #3793836] ERROR -- : from /usr/lib/ruby/3.0.0/open-uri.rb:729:in `read' E, [2024-05-25T20:50:11.688922 #3793836] ERROR -- : from /tmp/ruby/src/trunk/tool/downloader.rb:247:in `block in download' E, [2024-05-25T20:50:11.688938 #3793836] ERROR -- : from /tmp/ruby/src/trunk/tool/downloader.rb:378:in `with_retry' E, [2024-05-25T20:50:11.688951 #3793836] ERROR -- : from /tmp/ruby/src/trunk/tool/downloader.rb:246:in `download' E, [2024-05-25T20:50:11.688963 #3793836] ERROR -- : from /tmp/ruby/src/trunk/tool/downloader.rb:136:in `download' E, [2024-05-25T20:50:11.688976 #3793836] ERROR -- : from /tmp/ruby/src/trunk/tool/downloader.rb:482:in `block in
' E, [2024-05-25T20:50:11.688990 #3793836] ERROR -- : from /tmp/ruby/src/trunk/tool/downloader.rb:465:in `each' E, [2024-05-25T20:50:11.689007 #3793836] ERROR -- : from /tmp/ruby/src/trunk/tool/downloader.rb:465:in `
' E, [2024-05-25T20:50:11.693204 #3793836] ERROR -- : make: *** [uncommon.mk:1756: /tmp/ruby/src/trunk/enc/unicode/data/emoji/15.0/emoji-zwj-sequences.txt] Error 1 I, [2024-05-25T20:50:11.693290 #3793836] INFO -- : downloading emoji/15.0/emoji-test.txt ... I, [2024-05-25T20:50:11.693764 #3793836] INFO -- : $$$[end] "make update-unicode -j20" exit with 512. I, [2024-05-25T20:50:11.693848 #3793836] INFO -- : $$$[beg] make update-download -j20 I, [2024-05-25T20:50:11.801146 #3793836] INFO -- : tool/config.guess already exists I, [2024-05-25T20:50:11.801192 #3793836] INFO -- : tool/config.sub already exists I, [2024-05-25T20:50:11.803608 #3793836] INFO -- : Update power_assert to 84e85124c5014a139af39161d484156cfe87a9ed I, [2024-05-25T20:50:11.803723 #3793836] INFO -- : Update rbs to ba7872795d5de04adb8ff500c0e6afdc81a041dd I, [2024-05-25T20:50:11.804003 #3793836] INFO -- : Update typeprof to b19a6416da3a05d57fadd6ffdadb382b6d236ca5 I, [2024-05-25T20:50:11.805073 #3793836] INFO -- : echo 84e85124c5014a139af39161d484156cfe87a9ed | /bin/sh /tmp/ruby/src/trunk/tool/ifchange /tmp/ruby/src/trunk/.bundle/.timestamp/power_assert.revision - I, [2024-05-25T20:50:11.805318 #3793836] INFO -- : echo ba7872795d5de04adb8ff500c0e6afdc81a041dd | /bin/sh /tmp/ruby/src/trunk/tool/ifchange /tmp/ruby/src/trunk/.bundle/.timestamp/rbs.revision - I, [2024-05-25T20:50:11.805561 #3793836] INFO -- : echo b19a6416da3a05d57fadd6ffdadb382b6d236ca5 | /bin/sh /tmp/ruby/src/trunk/tool/ifchange /tmp/ruby/src/trunk/.bundle/.timestamp/typeprof.revision - I, [2024-05-25T20:50:11.807250 #3793836] INFO -- : /tmp/ruby/src/trunk/.bundle/.timestamp/power_assert.revision unchanged I, [2024-05-25T20:50:11.807272 #3793836] INFO -- : /tmp/ruby/src/trunk/.bundle/.timestamp/rbs.revision unchanged I, [2024-05-25T20:50:11.807453 #3793836] INFO -- : /tmp/ruby/src/trunk/.bundle/.timestamp/typeprof.revision unchanged I, [2024-05-25T20:50:11.808337 #3793836] INFO -- : Building power_assert@84e85124c5014a139af39161d484156cfe87a9ed to /tmp/ruby/src/trunk/gems/power_assert-2.0.3.gem I, [2024-05-25T20:50:11.876920 #3793836] INFO -- : Successfully built RubyGem I, [2024-05-25T20:50:11.876969 #3793836] INFO -- : Name: power_assert I, [2024-05-25T20:50:11.876978 #3793836] INFO -- : Version: 2.0.4dev I, [2024-05-25T20:50:11.876985 #3793836] INFO -- : File: power_assert-2.0.4dev.gem I, [2024-05-25T20:50:11.921727 #3793836] INFO -- : $$$[end] "make update-download -j20" exit with 0. I, [2024-05-25T20:50:11.921772 #3793836] INFO -- : $$$[beg] make update-rubyspec -j20 I, [2024-05-25T20:50:11.979706 #3793836] INFO -- : make: Nothing to be done for 'update-rubyspec'. I, [2024-05-25T20:50:11.979990 #3793836] INFO -- : $$$[end] "make update-rubyspec -j20" exit with 0. I, [2024-05-25T20:50:11.980017 #3793836] INFO -- : $$$[beg] make update-src -j20 I, [2024-05-25T20:50:12.618500 #3793836] INFO -- : Already up to date. I, [2024-05-25T20:50:12.636411 #3793836] INFO -- : Latest commit hash = d2c4363e0c I, [2024-05-25T20:50:12.638183 #3793836] INFO -- : $$$[end] "make update-src -j20" exit with 0. I, [2024-05-25T20:50:12.638231 #3793836] INFO -- : $$$[beg] make after-update -j20 I, [2024-05-25T20:50:12.715175 #3793836] INFO -- : generating /tmp/ruby/src/trunk/ext/ripper/eventids2table.c I, [2024-05-25T20:50:12.719361 #3793836] INFO -- : make[1]: Entering directory '/tmp/ruby/src/trunk/ext/ripper' I, [2024-05-25T20:50:12.719382 #3793836] INFO -- : make[1]: Nothing to be done for 'src'. I, [2024-05-25T20:50:12.719387 #3793836] INFO -- : make[1]: Leaving directory '/tmp/ruby/src/trunk/ext/ripper' I, [2024-05-25T20:50:12.736987 #3793836] INFO -- : /tmp/ruby/src/trunk/revision.h updated I, [2024-05-25T20:50:12.738413 #3793836] INFO -- : generating x86_64-linux-fake.rb I, [2024-05-25T20:50:12.789675 #3793836] INFO -- : x86_64-linux-fake.rb updated I, [2024-05-25T20:50:12.791103 #3793836] INFO -- : generating enc.mk I, [2024-05-25T20:50:12.907883 #3793836] INFO -- : making srcs under enc I, [2024-05-25T20:50:12.937761 #3793836] INFO -- : make[1]: Entering directory '/tmp/ruby/build/trunk' I, [2024-05-25T20:50:12.937787 #3793836] INFO -- : make[1]: Nothing to be done for 'srcs'. I, [2024-05-25T20:50:12.937794 #3793836] INFO -- : make[1]: Leaving directory '/tmp/ruby/build/trunk' I, [2024-05-25T20:50:12.982416 #3793836] INFO -- : Update power_assert to 84e85124c5014a139af39161d484156cfe87a9ed I, [2024-05-25T20:50:12.982594 #3793836] INFO -- : Update rbs to ba7872795d5de04adb8ff500c0e6afdc81a041dd I, [2024-05-25T20:50:12.983200 #3793836] INFO -- : Update typeprof to b19a6416da3a05d57fadd6ffdadb382b6d236ca5 I, [2024-05-25T20:50:12.983977 #3793836] INFO -- : echo 84e85124c5014a139af39161d484156cfe87a9ed | /bin/sh /tmp/ruby/src/trunk/tool/ifchange /tmp/ruby/src/trunk/.bundle/.timestamp/power_assert.revision - I, [2024-05-25T20:50:12.984165 #3793836] INFO -- : echo ba7872795d5de04adb8ff500c0e6afdc81a041dd | /bin/sh /tmp/ruby/src/trunk/tool/ifchange /tmp/ruby/src/trunk/.bundle/.timestamp/rbs.revision - I, [2024-05-25T20:50:12.985547 #3793836] INFO -- : echo b19a6416da3a05d57fadd6ffdadb382b6d236ca5 | /bin/sh /tmp/ruby/src/trunk/tool/ifchange /tmp/ruby/src/trunk/.bundle/.timestamp/typeprof.revision - I, [2024-05-25T20:50:12.986007 #3793836] INFO -- : /tmp/ruby/src/trunk/.bundle/.timestamp/power_assert.revision unchanged I, [2024-05-25T20:50:12.986173 #3793836] INFO -- : /tmp/ruby/src/trunk/.bundle/.timestamp/rbs.revision unchanged I, [2024-05-25T20:50:12.986889 #3793836] INFO -- : Building power_assert@84e85124c5014a139af39161d484156cfe87a9ed to /tmp/ruby/src/trunk/gems/power_assert-2.0.3.gem I, [2024-05-25T20:50:12.987338 #3793836] INFO -- : /tmp/ruby/src/trunk/.bundle/.timestamp/typeprof.revision unchanged I, [2024-05-25T20:50:13.056220 #3793836] INFO -- : Successfully built RubyGem I, [2024-05-25T20:50:13.056260 #3793836] INFO -- : Name: power_assert I, [2024-05-25T20:50:13.056270 #3793836] INFO -- : Version: 2.0.4dev I, [2024-05-25T20:50:13.056275 #3793836] INFO -- : File: power_assert-2.0.4dev.gem I, [2024-05-25T20:50:13.058380 #3793836] INFO -- : Extracting bundle gem power_assert-2.0.3... I, [2024-05-25T20:50:13.119824 #3793836] INFO -- : Try with hash version of bundled gems instead of gems/power_assert-2.0.3.gem. We don't use this gem with release version of Ruby. I, [2024-05-25T20:50:13.124747 #3793836] INFO -- : Unpacked gems/power_assert-2.0.4dev.gem I, [2024-05-25T20:50:13.126532 #3793836] INFO -- : $$$[end] "make after-update -j20" exit with 0. I, [2024-05-25T20:50:13.126650 #3793836] INFO -- : $$$[beg] make miniruby -j20 I, [2024-05-25T20:50:13.183249 #3793836] INFO -- : BASERUBY = /usr/bin/ruby --disable=gems I, [2024-05-25T20:50:13.183288 #3793836] INFO -- : CC = gcc I, [2024-05-25T20:50:13.183297 #3793836] INFO -- : LD = ld I, [2024-05-25T20:50:13.183301 #3793836] INFO -- : LDSHARED = gcc -shared I, [2024-05-25T20:50:13.183306 #3793836] INFO -- : CFLAGS = -O3 -fno-fast-math -ggdb3 -Wall -Wextra -Wdeprecated-declarations -Wdiv-by-zero -Wduplicated-cond -Wimplicit-function-declaration -Wimplicit-int -Wpointer-arith -Wwrite-strings -Wold-style-definition -Wimplicit-fallthrough=0 -Wmissing-noreturn -Wno-cast-function-type -Wno-constant-logical-operand -Wno-long-long -Wno-missing-field-initializers -Wno-overlength-strings -Wno-packed-bitfield-compat -Wno-parentheses-equality -Wno-self-assign -Wno-tautological-compare -Wno-unused-parameter -Wno-unused-value -Wsuggest-attribute=format -Wsuggest-attribute=noreturn -Wunused-variable -Wmisleading-indentation -Wundef -fPIC I, [2024-05-25T20:50:13.183311 #3793836] INFO -- : XCFLAGS = -U_FORTIFY_SOURCE -D_FORTIFY_SOURCE=2 -fstack-protector-strong -fno-strict-overflow -fvisibility=hidden -fexcess-precision=standard -DRUBY_EXPORT -I. -I.ext/include/x86_64-linux -I/tmp/ruby/src/trunk/include -I/tmp/ruby/src/trunk -I/tmp/ruby/src/trunk/prism -I/tmp/ruby/src/trunk/enc/unicode/15.0.0 I, [2024-05-25T20:50:13.183315 #3793836] INFO -- : CPPFLAGS = I, [2024-05-25T20:50:13.183319 #3793836] INFO -- : DLDFLAGS = -Wl,--compress-debug-sections=zlib -Wl,-soname,libruby.so.3.4 -fstack-protector-strong I, [2024-05-25T20:50:13.183324 #3793836] INFO -- : SOLIBS = -lz -lrt -lrt -lgmp -ldl -lcrypt -lm -lpthread I, [2024-05-25T20:50:13.183327 #3793836] INFO -- : LANG = en_US.UTF-8 I, [2024-05-25T20:50:13.183334 #3793836] INFO -- : LC_ALL = I, [2024-05-25T20:50:13.183337 #3793836] INFO -- : LC_CTYPE = I, [2024-05-25T20:50:13.183341 #3793836] INFO -- : MFLAGS = -j20 --jobserver-auth=4,5 I, [2024-05-25T20:50:13.183345 #3793836] INFO -- : RUSTC = no I, [2024-05-25T20:50:13.183348 #3793836] INFO -- : YJIT_RUSTC_ARGS = --crate-name=yjit --crate-type=staticlib --edition=2021 -g -C lto=thin -C opt-level=3 -C overflow-checks=on '--out-dir=/tmp/ruby/build/trunk/yjit/target/release/' /tmp/ruby/src/trunk/yjit/src/lib.rs I, [2024-05-25T20:50:13.184879 #3793836] INFO -- : gcc (Ubuntu 11.4.0-1ubuntu1~22.04) 11.4.0 I, [2024-05-25T20:50:13.184904 #3793836] INFO -- : Copyright (C) 2021 Free Software Foundation, Inc. I, [2024-05-25T20:50:13.184910 #3793836] INFO -- : This is free software; see the source for copying conditions. There is NO I, [2024-05-25T20:50:13.184919 #3793836] INFO -- : warranty; not even for MERCHANTABILITY or FITNESS FOR A PARTICULAR PURPOSE. I, [2024-05-25T20:50:13.184924 #3793836] INFO -- : I, [2024-05-25T20:50:13.206993 #3793836] INFO -- : compiling /tmp/ruby/src/trunk/version.c I, [2024-05-25T20:50:13.309642 #3793836] INFO -- : linking miniruby I, [2024-05-25T20:50:13.842840 #3793836] INFO -- : $$$[end] "make miniruby -j20" exit with 0. I, [2024-05-25T20:50:13.842951 #3793836] INFO -- : $$$[beg] make ruby -j20 I, [2024-05-25T20:50:13.900532 #3793836] INFO -- : BASERUBY = /usr/bin/ruby --disable=gems I, [2024-05-25T20:50:13.900562 #3793836] INFO -- : CC = gcc I, [2024-05-25T20:50:13.900567 #3793836] INFO -- : LD = ld I, [2024-05-25T20:50:13.900575 #3793836] INFO -- : LDSHARED = gcc -shared I, [2024-05-25T20:50:13.900579 #3793836] INFO -- : CFLAGS = -O3 -fno-fast-math -ggdb3 -Wall -Wextra -Wdeprecated-declarations -Wdiv-by-zero -Wduplicated-cond -Wimplicit-function-declaration -Wimplicit-int -Wpointer-arith -Wwrite-strings -Wold-style-definition -Wimplicit-fallthrough=0 -Wmissing-noreturn -Wno-cast-function-type -Wno-constant-logical-operand -Wno-long-long -Wno-missing-field-initializers -Wno-overlength-strings -Wno-packed-bitfield-compat -Wno-parentheses-equality -Wno-self-assign -Wno-tautological-compare -Wno-unused-parameter -Wno-unused-value -Wsuggest-attribute=format -Wsuggest-attribute=noreturn -Wunused-variable -Wmisleading-indentation -Wundef -fPIC I, [2024-05-25T20:50:13.900583 #3793836] INFO -- : XCFLAGS = -U_FORTIFY_SOURCE -D_FORTIFY_SOURCE=2 -fstack-protector-strong -fno-strict-overflow -fvisibility=hidden -fexcess-precision=standard -DRUBY_EXPORT -I. -I.ext/include/x86_64-linux -I/tmp/ruby/src/trunk/include -I/tmp/ruby/src/trunk -I/tmp/ruby/src/trunk/prism -I/tmp/ruby/src/trunk/enc/unicode/15.0.0 I, [2024-05-25T20:50:13.900587 #3793836] INFO -- : CPPFLAGS = I, [2024-05-25T20:50:13.900590 #3793836] INFO -- : DLDFLAGS = -Wl,--compress-debug-sections=zlib -Wl,-soname,libruby.so.3.4 -fstack-protector-strong I, [2024-05-25T20:50:13.900594 #3793836] INFO -- : SOLIBS = -lz -lrt -lrt -lgmp -ldl -lcrypt -lm -lpthread I, [2024-05-25T20:50:13.900598 #3793836] INFO -- : LANG = en_US.UTF-8 I, [2024-05-25T20:50:13.900601 #3793836] INFO -- : LC_ALL = I, [2024-05-25T20:50:13.900605 #3793836] INFO -- : LC_CTYPE = I, [2024-05-25T20:50:13.900608 #3793836] INFO -- : MFLAGS = -j20 --jobserver-auth=4,5 I, [2024-05-25T20:50:13.900612 #3793836] INFO -- : RUSTC = no I, [2024-05-25T20:50:13.900616 #3793836] INFO -- : YJIT_RUSTC_ARGS = --crate-name=yjit --crate-type=staticlib --edition=2021 -g -C lto=thin -C opt-level=3 -C overflow-checks=on '--out-dir=/tmp/ruby/build/trunk/yjit/target/release/' /tmp/ruby/src/trunk/yjit/src/lib.rs I, [2024-05-25T20:50:13.901956 #3793836] INFO -- : gcc (Ubuntu 11.4.0-1ubuntu1~22.04) 11.4.0 I, [2024-05-25T20:50:13.901976 #3793836] INFO -- : Copyright (C) 2021 Free Software Foundation, Inc. I, [2024-05-25T20:50:13.901981 #3793836] INFO -- : This is free software; see the source for copying conditions. There is NO I, [2024-05-25T20:50:13.901989 #3793836] INFO -- : warranty; not even for MERCHANTABILITY or FITNESS FOR A PARTICULAR PURPOSE. I, [2024-05-25T20:50:13.901992 #3793836] INFO -- : I, [2024-05-25T20:50:14.009641 #3793836] INFO -- : builtin_binary.inc updated I, [2024-05-25T20:50:14.014139 #3793836] INFO -- : c86294a81d0df6836359a6b5498b71b1ddba3062aa6ec87c7b2896368a948a19 builtin_binary.inc I, [2024-05-25T20:50:14.014886 #3793836] INFO -- : compiling /tmp/ruby/src/trunk/builtin.c I, [2024-05-25T20:50:14.197623 #3793836] INFO -- : linking static-library libruby-static.a I, [2024-05-25T20:50:14.512193 #3793836] INFO -- : linking shared-library libruby.so.3.4.0 I, [2024-05-25T20:50:16.068873 #3793836] INFO -- : linking ruby I, [2024-05-25T20:50:16.091643 #3793836] INFO -- : $$$[end] "make ruby -j20" exit with 0. I, [2024-05-25T20:50:16.091773 #3793836] INFO -- : $$$[beg] make all -j20 I, [2024-05-25T20:50:16.153129 #3793836] INFO -- : BASERUBY = /usr/bin/ruby --disable=gems I, [2024-05-25T20:50:16.153166 #3793836] INFO -- : CC = gcc I, [2024-05-25T20:50:16.153176 #3793836] INFO -- : LD = ld I, [2024-05-25T20:50:16.153180 #3793836] INFO -- : LDSHARED = gcc -shared I, [2024-05-25T20:50:16.153184 #3793836] INFO -- : CFLAGS = -O3 -fno-fast-math -ggdb3 -Wall -Wextra -Wdeprecated-declarations -Wdiv-by-zero -Wduplicated-cond -Wimplicit-function-declaration -Wimplicit-int -Wpointer-arith -Wwrite-strings -Wold-style-definition -Wimplicit-fallthrough=0 -Wmissing-noreturn -Wno-cast-function-type -Wno-constant-logical-operand -Wno-long-long -Wno-missing-field-initializers -Wno-overlength-strings -Wno-packed-bitfield-compat -Wno-parentheses-equality -Wno-self-assign -Wno-tautological-compare -Wno-unused-parameter -Wno-unused-value -Wsuggest-attribute=format -Wsuggest-attribute=noreturn -Wunused-variable -Wmisleading-indentation -Wundef -fPIC I, [2024-05-25T20:50:16.153195 #3793836] INFO -- : XCFLAGS = -U_FORTIFY_SOURCE -D_FORTIFY_SOURCE=2 -fstack-protector-strong -fno-strict-overflow -fvisibility=hidden -fexcess-precision=standard -DRUBY_EXPORT -I. -I.ext/include/x86_64-linux -I/tmp/ruby/src/trunk/include -I/tmp/ruby/src/trunk -I/tmp/ruby/src/trunk/prism -I/tmp/ruby/src/trunk/enc/unicode/15.0.0 I, [2024-05-25T20:50:16.153199 #3793836] INFO -- : CPPFLAGS = I, [2024-05-25T20:50:16.153203 #3793836] INFO -- : DLDFLAGS = -Wl,--compress-debug-sections=zlib -Wl,-soname,libruby.so.3.4 -fstack-protector-strong I, [2024-05-25T20:50:16.153207 #3793836] INFO -- : SOLIBS = -lz -lrt -lrt -lgmp -ldl -lcrypt -lm -lpthread I, [2024-05-25T20:50:16.153211 #3793836] INFO -- : LANG = en_US.UTF-8 I, [2024-05-25T20:50:16.153215 #3793836] INFO -- : LC_ALL = I, [2024-05-25T20:50:16.153219 #3793836] INFO -- : LC_CTYPE = I, [2024-05-25T20:50:16.153223 #3793836] INFO -- : MFLAGS = -j20 --jobserver-auth=4,5 I, [2024-05-25T20:50:16.153227 #3793836] INFO -- : RUSTC = no I, [2024-05-25T20:50:16.153231 #3793836] INFO -- : YJIT_RUSTC_ARGS = --crate-name=yjit --crate-type=staticlib --edition=2021 -g -C lto=thin -C opt-level=3 -C overflow-checks=on '--out-dir=/tmp/ruby/build/trunk/yjit/target/release/' /tmp/ruby/src/trunk/yjit/src/lib.rs I, [2024-05-25T20:50:16.154657 #3793836] INFO -- : gcc (Ubuntu 11.4.0-1ubuntu1~22.04) 11.4.0 I, [2024-05-25T20:50:16.154678 #3793836] INFO -- : Copyright (C) 2021 Free Software Foundation, Inc. I, [2024-05-25T20:50:16.154687 #3793836] INFO -- : This is free software; see the source for copying conditions. There is NO I, [2024-05-25T20:50:16.154691 #3793836] INFO -- : warranty; not even for MERCHANTABILITY or FITNESS FOR A PARTICULAR PURPOSE. I, [2024-05-25T20:50:16.154695 #3793836] INFO -- : I, [2024-05-25T20:50:16.182073 #3793836] INFO -- : generating encdb.h I, [2024-05-25T20:50:16.183542 #3793836] INFO -- : generating enc.mk I, [2024-05-25T20:50:16.185186 #3793836] INFO -- : building spec/ruby/optional/capi/ext/array_spec.so I, [2024-05-25T20:50:16.185436 #3793836] INFO -- : building spec/ruby/optional/capi/ext/basic_object_spec.so I, [2024-05-25T20:50:16.185751 #3793836] INFO -- : building spec/ruby/optional/capi/ext/bignum_spec.so I, [2024-05-25T20:50:16.186248 #3793836] INFO -- : building spec/ruby/optional/capi/ext/binding_spec.so I, [2024-05-25T20:50:16.186956 #3793836] INFO -- : building spec/ruby/optional/capi/ext/boolean_spec.so I, [2024-05-25T20:50:16.187311 #3793836] INFO -- : building spec/ruby/optional/capi/ext/class_id_under_autoload_spec.so I, [2024-05-25T20:50:16.187759 #3793836] INFO -- : building spec/ruby/optional/capi/ext/class_spec.so I, [2024-05-25T20:50:16.188918 #3793836] INFO -- : building spec/ruby/optional/capi/ext/class_under_autoload_spec.so I, [2024-05-25T20:50:16.190047 #3793836] INFO -- : building spec/ruby/optional/capi/ext/complex_spec.so I, [2024-05-25T20:50:16.190383 #3793836] INFO -- : building spec/ruby/optional/capi/ext/constants_spec.so I, [2024-05-25T20:50:16.191252 #3793836] INFO -- : building spec/ruby/optional/capi/ext/data_spec.so I, [2024-05-25T20:50:16.191993 #3793836] INFO -- : building spec/ruby/optional/capi/ext/debug_spec.so I, [2024-05-25T20:50:16.192305 #3793836] INFO -- : building spec/ruby/optional/capi/ext/encoding_spec.so I, [2024-05-25T20:50:16.193194 #3793836] INFO -- : building spec/ruby/optional/capi/ext/enumerator_spec.so I, [2024-05-25T20:50:16.193957 #3793836] INFO -- : building spec/ruby/optional/capi/ext/exception_spec.so I, [2024-05-25T20:50:16.194183 #3793836] INFO -- : building spec/ruby/optional/capi/ext/fiber_spec.so I, [2024-05-25T20:50:16.194874 #3793836] INFO -- : building spec/ruby/optional/capi/ext/file_spec.so I, [2024-05-25T20:50:16.195226 #3793836] INFO -- : building spec/ruby/optional/capi/ext/fixnum_spec.so I, [2024-05-25T20:50:16.218222 #3793836] INFO -- : encdb.h unchanged I, [2024-05-25T20:50:16.220340 #3793836] INFO -- : building spec/ruby/optional/capi/ext/float_spec.so I, [2024-05-25T20:50:16.324699 #3793836] INFO -- : building spec/ruby/optional/capi/ext/gc_spec.so I, [2024-05-25T20:50:16.335062 #3793836] INFO -- : building spec/ruby/optional/capi/ext/globals_spec.so I, [2024-05-25T20:50:16.335316 #3793836] INFO -- : building spec/ruby/optional/capi/ext/hash_spec.so I, [2024-05-25T20:50:16.337337 #3793836] INFO -- : building spec/ruby/optional/capi/ext/integer_spec.so I, [2024-05-25T20:50:16.343787 #3793836] INFO -- : building spec/ruby/optional/capi/ext/io_spec.so I, [2024-05-25T20:50:16.345014 #3793836] INFO -- : building spec/ruby/optional/capi/ext/kernel_spec.so I, [2024-05-25T20:50:16.345860 #3793836] INFO -- : building spec/ruby/optional/capi/ext/language_spec.so I, [2024-05-25T20:50:16.347120 #3793836] INFO -- : building spec/ruby/optional/capi/ext/marshal_spec.so I, [2024-05-25T20:50:16.357903 #3793836] INFO -- : building spec/ruby/optional/capi/ext/module_spec.so I, [2024-05-25T20:50:16.358476 #3793836] INFO -- : building spec/ruby/optional/capi/ext/module_under_autoload_spec.so I, [2024-05-25T20:50:16.359923 #3793836] INFO -- : building spec/ruby/optional/capi/ext/mutex_spec.so I, [2024-05-25T20:50:16.363213 #3793836] INFO -- : building spec/ruby/optional/capi/ext/numeric_spec.so I, [2024-05-25T20:50:16.380396 #3793836] INFO -- : building spec/ruby/optional/capi/ext/object_spec.so I, [2024-05-25T20:50:16.387080 #3793836] INFO -- : building spec/ruby/optional/capi/ext/proc_spec.so I, [2024-05-25T20:50:16.387508 #3793836] INFO -- : building spec/ruby/optional/capi/ext/range_spec.so I, [2024-05-25T20:50:16.407787 #3793836] INFO -- : building spec/ruby/optional/capi/ext/rational_spec.so I, [2024-05-25T20:50:16.433213 #3793836] INFO -- : building spec/ruby/optional/capi/ext/rbasic_spec.so I, [2024-05-25T20:50:16.442973 #3793836] INFO -- : building spec/ruby/optional/capi/ext/regexp_spec.so I, [2024-05-25T20:50:16.486796 #3793836] INFO -- : building spec/ruby/optional/capi/ext/string_spec.so I, [2024-05-25T20:50:16.487223 #3793836] INFO -- : building spec/ruby/optional/capi/ext/struct_spec.so I, [2024-05-25T20:50:16.497363 #3793836] INFO -- : building spec/ruby/optional/capi/ext/st_spec.so I, [2024-05-25T20:50:16.506261 #3793836] INFO -- : building spec/ruby/optional/capi/ext/symbol_spec.so I, [2024-05-25T20:50:16.507054 #3793836] INFO -- : building spec/ruby/optional/capi/ext/thread_spec.so I, [2024-05-25T20:50:16.513516 #3793836] INFO -- : building spec/ruby/optional/capi/ext/tracepoint_spec.so I, [2024-05-25T20:50:16.513570 #3793836] INFO -- : building spec/ruby/optional/capi/ext/time_spec.so I, [2024-05-25T20:50:16.516110 #3793836] INFO -- : building spec/ruby/optional/capi/ext/typed_data_spec.so I, [2024-05-25T20:50:16.520894 #3793836] INFO -- : building spec/ruby/optional/capi/ext/util_spec.so I, [2024-05-25T20:50:16.534460 #3793836] INFO -- : making enc I, [2024-05-25T20:50:16.545396 #3793836] INFO -- : making srcs under enc I, [2024-05-25T20:50:16.563331 #3793836] INFO -- : make[1]: Entering directory '/tmp/ruby/build/trunk' I, [2024-05-25T20:50:16.563393 #3793836] INFO -- : make[1]: Nothing to be done for 'enc'. I, [2024-05-25T20:50:16.563425 #3793836] INFO -- : make[1]: Leaving directory '/tmp/ruby/build/trunk' I, [2024-05-25T20:50:16.584170 #3793836] INFO -- : make[1]: Entering directory '/tmp/ruby/build/trunk' I, [2024-05-25T20:50:16.584231 #3793836] INFO -- : make[1]: Nothing to be done for 'srcs'. I, [2024-05-25T20:50:16.584241 #3793836] INFO -- : make[1]: Leaving directory '/tmp/ruby/build/trunk' I, [2024-05-25T20:50:16.584801 #3793836] INFO -- : generating transdb.h I, [2024-05-25T20:50:16.684425 #3793836] INFO -- : transdb.h unchanged I, [2024-05-25T20:50:16.685574 #3793836] INFO -- : generating makefiles ext/configure-ext.mk I, [2024-05-25T20:50:16.685826 #3793836] INFO -- : making trans I, [2024-05-25T20:50:16.712488 #3793836] INFO -- : ext/configure-ext.mk updated I, [2024-05-25T20:50:16.715062 #3793836] INFO -- : make[1]: Entering directory '/tmp/ruby/build/trunk' I, [2024-05-25T20:50:16.734981 #3793836] INFO -- : make[1]: Entering directory '/tmp/ruby/build/trunk' I, [2024-05-25T20:50:16.735061 #3793836] INFO -- : make[1]: Nothing to be done for 'trans'. I, [2024-05-25T20:50:16.735087 #3793836] INFO -- : make[1]: Leaving directory '/tmp/ruby/build/trunk' I, [2024-05-25T20:50:16.736077 #3793836] INFO -- : making encs I, [2024-05-25T20:50:16.795164 #3793836] INFO -- : make[1]: Entering directory '/tmp/ruby/build/trunk' I, [2024-05-25T20:50:16.795235 #3793836] INFO -- : make[1]: Nothing to be done for 'encs'. I, [2024-05-25T20:50:16.795261 #3793836] INFO -- : make[1]: Leaving directory '/tmp/ruby/build/trunk' I, [2024-05-25T20:50:16.882542 #3793836] INFO -- : make[1]: Leaving directory '/tmp/ruby/build/trunk' I, [2024-05-25T20:50:16.883215 #3793836] INFO -- : generating makefile exts.mk I, [2024-05-25T20:50:16.920883 #3793836] INFO -- : exts.mk unchanged I, [2024-05-25T20:50:16.926368 #3793836] INFO -- : make[1]: Entering directory '/tmp/ruby/build/trunk' I, [2024-05-25T20:50:16.947517 #3793836] INFO -- : make[2]: Entering directory '/tmp/ruby/build/trunk/ext/digest' I, [2024-05-25T20:50:16.948731 #3793836] INFO -- : make[2]: Entering directory '/tmp/ruby/build/trunk/ext/json' I, [2024-05-25T20:50:16.949048 #3793836] INFO -- : make[2]: Entering directory '/tmp/ruby/build/trunk/ext/coverage' I, [2024-05-25T20:50:16.949328 #3793836] INFO -- : make[2]: Entering directory '/tmp/ruby/build/trunk/ext/io/console' I, [2024-05-25T20:50:16.949808 #3793836] INFO -- : make[2]: Entering directory '/tmp/ruby/build/trunk/ext/date' I, [2024-05-25T20:50:16.950333 #3793836] INFO -- : make[2]: Entering directory '/tmp/ruby/build/trunk/ext/rubyvm' I, [2024-05-25T20:50:16.951436 #3793836] INFO -- : make[2]: Entering directory '/tmp/ruby/build/trunk/ext/monitor' I, [2024-05-25T20:50:16.951546 #3793836] INFO -- : make[2]: Entering directory '/tmp/ruby/build/trunk/ext/pathname' I, [2024-05-25T20:50:16.951626 #3793836] INFO -- : make[2]: Entering directory '/tmp/ruby/build/trunk/ext/fiddle' I, [2024-05-25T20:50:16.952239 #3793836] INFO -- : make[2]: Entering directory '/tmp/ruby/build/trunk/ext/pty' I, [2024-05-25T20:50:16.952651 #3793836] INFO -- : make[2]: Leaving directory '/tmp/ruby/build/trunk/ext/io/console' I, [2024-05-25T20:50:16.952708 #3793836] INFO -- : make[2]: Leaving directory '/tmp/ruby/build/trunk/ext/coverage' I, [2024-05-25T20:50:16.953007 #3793836] INFO -- : make[2]: Entering directory '/tmp/ruby/build/trunk/ext/objspace' I, [2024-05-25T20:50:16.953546 #3793836] INFO -- : make[2]: Leaving directory '/tmp/ruby/build/trunk/ext/rubyvm' I, [2024-05-25T20:50:16.953562 #3793836] INFO -- : make[2]: Leaving directory '/tmp/ruby/build/trunk/ext/monitor' I, [2024-05-25T20:50:16.953612 #3793836] INFO -- : make[2]: Entering directory '/tmp/ruby/build/trunk/ext/psych' I, [2024-05-25T20:50:16.953872 #3793836] INFO -- : make[2]: Leaving directory '/tmp/ruby/build/trunk/ext/date' I, [2024-05-25T20:50:16.954192 #3793836] INFO -- : make[2]: Leaving directory '/tmp/ruby/build/trunk/ext/digest' I, [2024-05-25T20:50:16.954466 #3793836] INFO -- : make[2]: Leaving directory '/tmp/ruby/build/trunk/ext/pty' I, [2024-05-25T20:50:16.954919 #3793836] INFO -- : make[2]: Leaving directory '/tmp/ruby/build/trunk/ext/pathname' I, [2024-05-25T20:50:16.955906 #3793836] INFO -- : make[2]: Leaving directory '/tmp/ruby/build/trunk/ext/objspace' I, [2024-05-25T20:50:16.956354 #3793836] INFO -- : make[2]: Entering directory '/tmp/ruby/build/trunk/.bundle/gems/debug-1.9.2/ext/debug' I, [2024-05-25T20:50:16.956607 #3793836] INFO -- : make[2]: Entering directory '/tmp/ruby/build/trunk/.bundle/gems/bigdecimal-3.1.8/ext/bigdecimal' I, [2024-05-25T20:50:16.956737 #3793836] INFO -- : make[2]: Entering directory '/tmp/ruby/build/trunk/ext/ripper' I, [2024-05-25T20:50:16.956896 #3793836] INFO -- : make[2]: Entering directory '/tmp/ruby/build/trunk/.bundle/gems/nkf-0.2.0/ext/nkf' I, [2024-05-25T20:50:16.956956 #3793836] INFO -- : make[2]: Entering directory '/tmp/ruby/build/trunk/.bundle/gems/racc-1.7.3/ext/racc/cparse' I, [2024-05-25T20:50:16.957051 #3793836] INFO -- : make[2]: Entering directory '/tmp/ruby/build/trunk/.bundle/gems/racc-1.8.0/ext/racc/cparse' I, [2024-05-25T20:50:16.957303 #3793836] INFO -- : make[2]: Entering directory '/tmp/ruby/build/trunk/.bundle/gems/syslog-0.1.2/ext/syslog' I, [2024-05-25T20:50:16.957773 #3793836] INFO -- : make[2]: Entering directory '/tmp/ruby/build/trunk/.bundle/gems/rbs-3.4.4/ext/rbs_extension' I, [2024-05-25T20:50:16.958404 #3793836] INFO -- : make[2]: Leaving directory '/tmp/ruby/build/trunk/ext/json' I, [2024-05-25T20:50:16.960193 #3793836] INFO -- : make[2]: Entering directory '/tmp/ruby/build/trunk/ext/socket' I, [2024-05-25T20:50:16.960322 #3793836] INFO -- : make[2]: Entering directory '/tmp/ruby/build/trunk/ext/digest/sha2' I, [2024-05-25T20:50:16.961125 #3793836] INFO -- : make[2]: Leaving directory '/tmp/ruby/build/trunk/ext/fiddle' I, [2024-05-25T20:50:16.962783 #3793836] INFO -- : make[2]: Leaving directory '/tmp/ruby/build/trunk/ext/digest/sha2' I, [2024-05-25T20:50:16.964192 #3793836] INFO -- : make[2]: Leaving directory '/tmp/ruby/build/trunk/ext/ripper' I, [2024-05-25T20:50:16.965058 #3793836] INFO -- : make[2]: Entering directory '/tmp/ruby/build/trunk/ext/openssl' I, [2024-05-25T20:50:16.966049 #3793836] INFO -- : make[2]: Leaving directory '/tmp/ruby/build/trunk/ext/psych' I, [2024-05-25T20:50:16.966121 #3793836] INFO -- : make[2]: Leaving directory '/tmp/ruby/build/trunk/ext/socket' I, [2024-05-25T20:50:16.976445 #3793836] INFO -- : make[2]: Leaving directory '/tmp/ruby/build/trunk/ext/openssl' I, [2024-05-25T20:50:16.980511 #3793836] INFO -- : make[2]: Leaving directory '/tmp/ruby/build/trunk/.bundle/gems/bigdecimal-3.1.8/ext/bigdecimal' I, [2024-05-25T20:50:16.981508 #3793836] INFO -- : make[2]: Leaving directory '/tmp/ruby/build/trunk/.bundle/gems/racc-1.8.0/ext/racc/cparse' I, [2024-05-25T20:50:16.981544 #3793836] INFO -- : make[2]: Leaving directory '/tmp/ruby/build/trunk/.bundle/gems/nkf-0.2.0/ext/nkf' I, [2024-05-25T20:50:16.989685 #3793836] INFO -- : make[2]: Leaving directory '/tmp/ruby/build/trunk/.bundle/gems/debug-1.9.2/ext/debug' I, [2024-05-25T20:50:16.992916 #3793836] INFO -- : make[2]: Leaving directory '/tmp/ruby/build/trunk/.bundle/gems/syslog-0.1.2/ext/syslog' I, [2024-05-25T20:50:16.994202 #3793836] INFO -- : make[2]: Leaving directory '/tmp/ruby/build/trunk/.bundle/gems/racc-1.7.3/ext/racc/cparse' I, [2024-05-25T20:50:16.994695 #3793836] INFO -- : make[2]: Leaving directory '/tmp/ruby/build/trunk/.bundle/gems/rbs-3.4.4/ext/rbs_extension' I, [2024-05-25T20:50:17.019087 #3793836] INFO -- : make[2]: Entering directory '/tmp/ruby/build/trunk' I, [2024-05-25T20:50:17.086481 #3793836] INFO -- : linking ruby I, [2024-05-25T20:50:17.109215 #3793836] INFO -- : make[2]: Leaving directory '/tmp/ruby/build/trunk' I, [2024-05-25T20:50:17.109666 #3793836] INFO -- : make[1]: Leaving directory '/tmp/ruby/build/trunk' I, [2024-05-25T20:50:17.113064 #3793836] INFO -- : make[1]: Entering directory '/tmp/ruby/build/trunk' I, [2024-05-25T20:50:17.113090 #3793836] INFO -- : make[1]: Nothing to be done for 'note'. I, [2024-05-25T20:50:17.113098 #3793836] INFO -- : make[1]: Leaving directory '/tmp/ruby/build/trunk' I, [2024-05-25T20:50:17.113826 #3793836] INFO -- : $$$[end] "make all -j20" exit with 0. I, [2024-05-25T20:50:17.113984 #3793836] INFO -- : $$$[beg] make install -j20 I, [2024-05-25T20:50:17.177704 #3793836] INFO -- : Update power_assert to 84e85124c5014a139af39161d484156cfe87a9ed I, [2024-05-25T20:50:17.177937 #3793836] INFO -- : Update rbs to ba7872795d5de04adb8ff500c0e6afdc81a041dd I, [2024-05-25T20:50:17.178426 #3793836] INFO -- : Update typeprof to b19a6416da3a05d57fadd6ffdadb382b6d236ca5 I, [2024-05-25T20:50:17.179125 #3793836] INFO -- : echo 84e85124c5014a139af39161d484156cfe87a9ed | /bin/sh /tmp/ruby/src/trunk/tool/ifchange /tmp/ruby/src/trunk/.bundle/.timestamp/power_assert.revision - I, [2024-05-25T20:50:17.179694 #3793836] INFO -- : BASERUBY = /usr/bin/ruby --disable=gems I, [2024-05-25T20:50:17.179708 #3793836] INFO -- : CC = gcc I, [2024-05-25T20:50:17.179715 #3793836] INFO -- : LD = ld I, [2024-05-25T20:50:17.179720 #3793836] INFO -- : LDSHARED = gcc -shared I, [2024-05-25T20:50:17.179724 #3793836] INFO -- : CFLAGS = -O3 -fno-fast-math -ggdb3 -Wall -Wextra -Wdeprecated-declarations -Wdiv-by-zero -Wduplicated-cond -Wimplicit-function-declaration -Wimplicit-int -Wpointer-arith -Wwrite-strings -Wold-style-definition -Wimplicit-fallthrough=0 -Wmissing-noreturn -Wno-cast-function-type -Wno-constant-logical-operand -Wno-long-long -Wno-missing-field-initializers -Wno-overlength-strings -Wno-packed-bitfield-compat -Wno-parentheses-equality -Wno-self-assign -Wno-tautological-compare -Wno-unused-parameter -Wno-unused-value -Wsuggest-attribute=format -Wsuggest-attribute=noreturn -Wunused-variable -Wmisleading-indentation -Wundef -fPIC I, [2024-05-25T20:50:17.179729 #3793836] INFO -- : XCFLAGS = -U_FORTIFY_SOURCE -D_FORTIFY_SOURCE=2 -fstack-protector-strong -fno-strict-overflow -fvisibility=hidden -fexcess-precision=standard -DRUBY_EXPORT -I. -I.ext/include/x86_64-linux -I/tmp/ruby/src/trunk/include -I/tmp/ruby/src/trunk -I/tmp/ruby/src/trunk/prism -I/tmp/ruby/src/trunk/enc/unicode/15.0.0 I, [2024-05-25T20:50:17.179733 #3793836] INFO -- : CPPFLAGS = I, [2024-05-25T20:50:17.179739 #3793836] INFO -- : DLDFLAGS = -Wl,--compress-debug-sections=zlib -Wl,-soname,libruby.so.3.4 -fstack-protector-strong I, [2024-05-25T20:50:17.179744 #3793836] INFO -- : SOLIBS = -lz -lrt -lrt -lgmp -ldl -lcrypt -lm -lpthread I, [2024-05-25T20:50:17.179748 #3793836] INFO -- : LANG = en_US.UTF-8 I, [2024-05-25T20:50:17.179752 #3793836] INFO -- : LC_ALL = I, [2024-05-25T20:50:17.179756 #3793836] INFO -- : LC_CTYPE = I, [2024-05-25T20:50:17.179760 #3793836] INFO -- : MFLAGS = -j20 --jobserver-auth=4,5 I, [2024-05-25T20:50:17.179763 #3793836] INFO -- : RUSTC = no I, [2024-05-25T20:50:17.179767 #3793836] INFO -- : YJIT_RUSTC_ARGS = --crate-name=yjit --crate-type=staticlib --edition=2021 -g -C lto=thin -C opt-level=3 -C overflow-checks=on '--out-dir=/tmp/ruby/build/trunk/yjit/target/release/' /tmp/ruby/src/trunk/yjit/src/lib.rs I, [2024-05-25T20:50:17.181178 #3793836] INFO -- : /tmp/ruby/src/trunk/.bundle/.timestamp/power_assert.revision unchanged I, [2024-05-25T20:50:17.211206 #3793836] INFO -- : echo ba7872795d5de04adb8ff500c0e6afdc81a041dd | /bin/sh /tmp/ruby/src/trunk/tool/ifchange /tmp/ruby/src/trunk/.bundle/.timestamp/rbs.revision - I, [2024-05-25T20:50:17.211288 #3793836] INFO -- : echo b19a6416da3a05d57fadd6ffdadb382b6d236ca5 | /bin/sh /tmp/ruby/src/trunk/tool/ifchange /tmp/ruby/src/trunk/.bundle/.timestamp/typeprof.revision - I, [2024-05-25T20:50:17.211946 #3793836] INFO -- : generating encdb.h I, [2024-05-25T20:50:17.212095 #3793836] INFO -- : gcc (Ubuntu 11.4.0-1ubuntu1~22.04) 11.4.0 I, [2024-05-25T20:50:17.212115 #3793836] INFO -- : Copyright (C) 2021 Free Software Foundation, Inc. I, [2024-05-25T20:50:17.212121 #3793836] INFO -- : This is free software; see the source for copying conditions. There is NO I, [2024-05-25T20:50:17.212125 #3793836] INFO -- : warranty; not even for MERCHANTABILITY or FITNESS FOR A PARTICULAR PURPOSE. I, [2024-05-25T20:50:17.212129 #3793836] INFO -- : I, [2024-05-25T20:50:17.213333 #3793836] INFO -- : generating enc.mk I, [2024-05-25T20:50:17.213354 #3793836] INFO -- : /tmp/ruby/src/trunk/.bundle/.timestamp/rbs.revision unchanged I, [2024-05-25T20:50:17.213578 #3793836] INFO -- : /tmp/ruby/src/trunk/.bundle/.timestamp/typeprof.revision unchanged I, [2024-05-25T20:50:17.236982 #3793836] INFO -- : encdb.h unchanged I, [2024-05-25T20:50:17.238199 #3793836] INFO -- : Building power_assert@84e85124c5014a139af39161d484156cfe87a9ed to /tmp/ruby/src/trunk/gems/power_assert-2.0.3.gem I, [2024-05-25T20:50:17.307127 #3793836] INFO -- : Successfully built RubyGem I, [2024-05-25T20:50:17.307164 #3793836] INFO -- : Name: power_assert I, [2024-05-25T20:50:17.307170 #3793836] INFO -- : Version: 2.0.4dev I, [2024-05-25T20:50:17.307175 #3793836] INFO -- : File: power_assert-2.0.4dev.gem I, [2024-05-25T20:50:17.309165 #3793836] INFO -- : Extracting bundle gem power_assert-2.0.3... I, [2024-05-25T20:50:17.335228 #3793836] INFO -- : making srcs under enc I, [2024-05-25T20:50:17.335438 #3793836] INFO -- : making enc I, [2024-05-25T20:50:17.353431 #3793836] INFO -- : make[1]: Entering directory '/tmp/ruby/build/trunk' I, [2024-05-25T20:50:17.353456 #3793836] INFO -- : make[1]: Nothing to be done for 'enc'. I, [2024-05-25T20:50:17.353461 #3793836] INFO -- : make[1]: Leaving directory '/tmp/ruby/build/trunk' I, [2024-05-25T20:50:17.364618 #3793836] INFO -- : make[1]: Entering directory '/tmp/ruby/build/trunk' I, [2024-05-25T20:50:17.364641 #3793836] INFO -- : make[1]: Nothing to be done for 'srcs'. I, [2024-05-25T20:50:17.364647 #3793836] INFO -- : make[1]: Leaving directory '/tmp/ruby/build/trunk' I, [2024-05-25T20:50:17.365493 #3793836] INFO -- : generating transdb.h I, [2024-05-25T20:50:17.370797 #3793836] INFO -- : Try with hash version of bundled gems instead of gems/power_assert-2.0.3.gem. We don't use this gem with release version of Ruby. I, [2024-05-25T20:50:17.375819 #3793836] INFO -- : Unpacked gems/power_assert-2.0.4dev.gem I, [2024-05-25T20:50:17.461277 #3793836] INFO -- : transdb.h unchanged I, [2024-05-25T20:50:17.462881 #3793836] INFO -- : generating makefiles ext/configure-ext.mk I, [2024-05-25T20:50:17.463130 #3793836] INFO -- : making trans I, [2024-05-25T20:50:17.490509 #3793836] INFO -- : ext/configure-ext.mk unchanged I, [2024-05-25T20:50:17.492902 #3793836] INFO -- : make[1]: Entering directory '/tmp/ruby/build/trunk' I, [2024-05-25T20:50:17.496991 #3793836] INFO -- : make[1]: Entering directory '/tmp/ruby/build/trunk' I, [2024-05-25T20:50:17.497089 #3793836] INFO -- : make[1]: Nothing to be done for 'trans'. I, [2024-05-25T20:50:17.497117 #3793836] INFO -- : make[1]: Leaving directory '/tmp/ruby/build/trunk' I, [2024-05-25T20:50:17.498041 #3793836] INFO -- : making encs I, [2024-05-25T20:50:17.557989 #3793836] INFO -- : make[1]: Entering directory '/tmp/ruby/build/trunk' I, [2024-05-25T20:50:17.558062 #3793836] INFO -- : make[1]: Nothing to be done for 'encs'. I, [2024-05-25T20:50:17.558089 #3793836] INFO -- : make[1]: Leaving directory '/tmp/ruby/build/trunk' I, [2024-05-25T20:50:17.646304 #3793836] INFO -- : make[1]: Leaving directory '/tmp/ruby/build/trunk' I, [2024-05-25T20:50:17.646959 #3793836] INFO -- : generating makefile exts.mk I, [2024-05-25T20:50:17.684451 #3793836] INFO -- : exts.mk unchanged I, [2024-05-25T20:50:17.689435 #3793836] INFO -- : make[1]: Entering directory '/tmp/ruby/build/trunk' I, [2024-05-25T20:50:17.707481 #3793836] INFO -- : make[2]: Entering directory '/tmp/ruby/build/trunk/ext/digest' I, [2024-05-25T20:50:17.708968 #3793836] INFO -- : make[2]: Entering directory '/tmp/ruby/build/trunk/ext/coverage' I, [2024-05-25T20:50:17.709208 #3793836] INFO -- : make[2]: Entering directory '/tmp/ruby/build/trunk/ext/json' I, [2024-05-25T20:50:17.709536 #3793836] INFO -- : make[2]: Entering directory '/tmp/ruby/build/trunk/ext/io/console' I, [2024-05-25T20:50:17.709787 #3793836] INFO -- : make[2]: Entering directory '/tmp/ruby/build/trunk/ext/date' I, [2024-05-25T20:50:17.710412 #3793836] INFO -- : make[2]: Entering directory '/tmp/ruby/build/trunk/ext/rubyvm' I, [2024-05-25T20:50:17.711353 #3793836] INFO -- : make[2]: Entering directory '/tmp/ruby/build/trunk/ext/monitor' I, [2024-05-25T20:50:17.711825 #3793836] INFO -- : make[2]: Entering directory '/tmp/ruby/build/trunk/ext/pathname' I, [2024-05-25T20:50:17.712022 #3793836] INFO -- : make[2]: Entering directory '/tmp/ruby/build/trunk/ext/fiddle' I, [2024-05-25T20:50:17.712190 #3793836] INFO -- : make[2]: Entering directory '/tmp/ruby/build/trunk/ext/pty' I, [2024-05-25T20:50:17.712708 #3793836] INFO -- : make[2]: Leaving directory '/tmp/ruby/build/trunk/ext/coverage' I, [2024-05-25T20:50:17.712833 #3793836] INFO -- : make[2]: Leaving directory '/tmp/ruby/build/trunk/ext/io/console' I, [2024-05-25T20:50:17.713034 #3793836] INFO -- : make[2]: Leaving directory '/tmp/ruby/build/trunk/ext/rubyvm' I, [2024-05-25T20:50:17.713570 #3793836] INFO -- : make[2]: Entering directory '/tmp/ruby/build/trunk/ext/objspace' I, [2024-05-25T20:50:17.713923 #3793836] INFO -- : make[2]: Leaving directory '/tmp/ruby/build/trunk/ext/date' I, [2024-05-25T20:50:17.714243 #3793836] INFO -- : make[2]: Entering directory '/tmp/ruby/build/trunk/ext/psych' I, [2024-05-25T20:50:17.714578 #3793836] INFO -- : make[2]: Leaving directory '/tmp/ruby/build/trunk/ext/monitor' I, [2024-05-25T20:50:17.714772 #3793836] INFO -- : make[2]: Leaving directory '/tmp/ruby/build/trunk/ext/digest' I, [2024-05-25T20:50:17.714945 #3793836] INFO -- : make[2]: Entering directory '/tmp/ruby/build/trunk/.bundle/gems/bigdecimal-3.1.8/ext/bigdecimal' I, [2024-05-25T20:50:17.714980 #3793836] INFO -- : make[2]: Leaving directory '/tmp/ruby/build/trunk/ext/pathname' I, [2024-05-25T20:50:17.715384 #3793836] INFO -- : make[2]: Entering directory '/tmp/ruby/build/trunk/.bundle/gems/nkf-0.2.0/ext/nkf' I, [2024-05-25T20:50:17.715406 #3793836] INFO -- : make[2]: Leaving directory '/tmp/ruby/build/trunk/ext/pty' I, [2024-05-25T20:50:17.715414 #3793836] INFO -- : make[2]: Entering directory '/tmp/ruby/build/trunk/.bundle/gems/debug-1.9.2/ext/debug' I, [2024-05-25T20:50:17.716385 #3793836] INFO -- : make[2]: Entering directory '/tmp/ruby/build/trunk/.bundle/gems/racc-1.7.3/ext/racc/cparse' I, [2024-05-25T20:50:17.716504 #3793836] INFO -- : make[2]: Entering directory '/tmp/ruby/build/trunk/.bundle/gems/racc-1.8.0/ext/racc/cparse' I, [2024-05-25T20:50:17.716517 #3793836] INFO -- : make[2]: Entering directory '/tmp/ruby/build/trunk/ext/ripper' I, [2024-05-25T20:50:17.716983 #3793836] INFO -- : make[2]: Leaving directory '/tmp/ruby/build/trunk/ext/objspace' I, [2024-05-25T20:50:17.717325 #3793836] INFO -- : make[2]: Entering directory '/tmp/ruby/build/trunk/.bundle/gems/rbs-3.4.4/ext/rbs_extension' I, [2024-05-25T20:50:17.718259 #3793836] INFO -- : make[2]: Leaving directory '/tmp/ruby/build/trunk/ext/json' I, [2024-05-25T20:50:17.720537 #3793836] INFO -- : make[2]: Leaving directory '/tmp/ruby/build/trunk/ext/fiddle' I, [2024-05-25T20:50:17.720592 #3793836] INFO -- : make[2]: Entering directory '/tmp/ruby/build/trunk/.bundle/gems/syslog-0.1.2/ext/syslog' I, [2024-05-25T20:50:17.720602 #3793836] INFO -- : make[2]: Entering directory '/tmp/ruby/build/trunk/ext/socket' I, [2024-05-25T20:50:17.721699 #3793836] INFO -- : make[2]: Leaving directory '/tmp/ruby/build/trunk/ext/ripper' I, [2024-05-25T20:50:17.723987 #3793836] INFO -- : make[2]: Entering directory '/tmp/ruby/build/trunk/ext/digest/sha2' I, [2024-05-25T20:50:17.724662 #3793836] INFO -- : make[2]: Entering directory '/tmp/ruby/build/trunk/ext/openssl' I, [2024-05-25T20:50:17.726172 #3793836] INFO -- : make[2]: Leaving directory '/tmp/ruby/build/trunk/ext/digest/sha2' I, [2024-05-25T20:50:17.727150 #3793836] INFO -- : make[2]: Leaving directory '/tmp/ruby/build/trunk/ext/psych' I, [2024-05-25T20:50:17.729100 #3793836] INFO -- : make[2]: Leaving directory '/tmp/ruby/build/trunk/ext/socket' I, [2024-05-25T20:50:17.735883 #3793836] INFO -- : make[2]: Leaving directory '/tmp/ruby/build/trunk/ext/openssl' I, [2024-05-25T20:50:17.739385 #3793836] INFO -- : make[2]: Leaving directory '/tmp/ruby/build/trunk/.bundle/gems/debug-1.9.2/ext/debug' I, [2024-05-25T20:50:17.739439 #3793836] INFO -- : make[2]: Leaving directory '/tmp/ruby/build/trunk/.bundle/gems/bigdecimal-3.1.8/ext/bigdecimal' I, [2024-05-25T20:50:17.739970 #3793836] INFO -- : make[2]: Leaving directory '/tmp/ruby/build/trunk/.bundle/gems/racc-1.7.3/ext/racc/cparse' I, [2024-05-25T20:50:17.740868 #3793836] INFO -- : make[2]: Leaving directory '/tmp/ruby/build/trunk/.bundle/gems/rbs-3.4.4/ext/rbs_extension' I, [2024-05-25T20:50:17.745963 #3793836] INFO -- : make[2]: Leaving directory '/tmp/ruby/build/trunk/.bundle/gems/racc-1.8.0/ext/racc/cparse' I, [2024-05-25T20:50:17.747067 #3793836] INFO -- : make[2]: Leaving directory '/tmp/ruby/build/trunk/.bundle/gems/nkf-0.2.0/ext/nkf' I, [2024-05-25T20:50:17.751850 #3793836] INFO -- : make[2]: Leaving directory '/tmp/ruby/build/trunk/.bundle/gems/syslog-0.1.2/ext/syslog' I, [2024-05-25T20:50:17.777528 #3793836] INFO -- : make[2]: Entering directory '/tmp/ruby/build/trunk' I, [2024-05-25T20:50:17.842048 #3793836] INFO -- : make[2]: 'ruby' is up to date. I, [2024-05-25T20:50:17.842088 #3793836] INFO -- : make[2]: Leaving directory '/tmp/ruby/build/trunk' I, [2024-05-25T20:50:17.842517 #3793836] INFO -- : make[1]: Leaving directory '/tmp/ruby/build/trunk' I, [2024-05-25T20:50:17.846153 #3793836] INFO -- : make[1]: Entering directory '/tmp/ruby/build/trunk' I, [2024-05-25T20:50:17.846174 #3793836] INFO -- : make[1]: Nothing to be done for 'note'. I, [2024-05-25T20:50:17.846180 #3793836] INFO -- : make[1]: Leaving directory '/tmp/ruby/build/trunk' I, [2024-05-25T20:50:17.846534 #3793836] INFO -- : ./miniruby -I/tmp/ruby/src/trunk/lib -I. -I.ext/common /tmp/ruby/src/trunk/tool/runruby.rb --extout=.ext -- --disable-gems -r./x86_64-linux-fake /tmp/ruby/src/trunk/tool/rbinstall.rb --make="make" --dest-dir="" --extout=".ext" --ext-build-dir="./ext" --mflags="-j20 --jobserver-auth=4,5" --make-flags=" -j20 --jobserver-auth=4,5" --data-mode=0644 --prog-mode=0755 --installed-list .installed.list --mantype="doc" --gnumake --install=all --exclude=doc I, [2024-05-25T20:50:17.942601 #3793836] INFO -- : Installing to I, [2024-05-25T20:50:17.942681 #3793836] INFO -- : installing binary commands: /tmp/ruby/install/trunk/bin I, [2024-05-25T20:50:17.942698 #3793836] INFO -- : installing base libraries: /tmp/ruby/install/trunk/lib I, [2024-05-25T20:50:17.950157 #3793836] INFO -- : installing arch files: /tmp/ruby/install/trunk/lib/ruby/3.4.0+0/x86_64-linux I, [2024-05-25T20:50:17.950220 #3793836] INFO -- : installing pkgconfig data: /tmp/ruby/install/trunk/lib/pkgconfig I, [2024-05-25T20:50:17.950235 #3793836] INFO -- : installing extension objects: /tmp/ruby/install/trunk/lib/ruby/3.4.0+0/x86_64-linux I, [2024-05-25T20:50:17.959818 #3793836] INFO -- : installing extension objects: /tmp/ruby/install/trunk/lib/ruby/site_ruby/3.4.0+0/x86_64-linux I, [2024-05-25T20:50:17.959892 #3793836] INFO -- : installing extension objects: /tmp/ruby/install/trunk/lib/ruby/vendor_ruby/3.4.0+0/x86_64-linux I, [2024-05-25T20:50:17.959908 #3793836] INFO -- : installing extension headers: /tmp/ruby/install/trunk/include/ruby-3.4.0+0/x86_64-linux I, [2024-05-25T20:50:17.959923 #3793836] INFO -- : installing extension scripts: /tmp/ruby/install/trunk/lib/ruby/3.4.0+0 I, [2024-05-25T20:50:17.962760 #3793836] INFO -- : installing extension scripts: /tmp/ruby/install/trunk/lib/ruby/site_ruby/3.4.0+0 I, [2024-05-25T20:50:17.962820 #3793836] INFO -- : installing extension scripts: /tmp/ruby/install/trunk/lib/ruby/vendor_ruby/3.4.0+0 I, [2024-05-25T20:50:17.962834 #3793836] INFO -- : installing extension headers: /tmp/ruby/install/trunk/include/ruby-3.4.0+0/ruby I, [2024-05-25T20:50:17.962846 #3793836] INFO -- : installing command scripts: /tmp/ruby/install/trunk/bin I, [2024-05-25T20:50:17.962865 #3793836] INFO -- : installing library scripts: /tmp/ruby/install/trunk/lib/ruby/3.4.0+0 I, [2024-05-25T20:50:17.995205 #3793836] INFO -- : installing common headers: /tmp/ruby/install/trunk/include/ruby-3.4.0+0 I, [2024-05-25T20:50:18.001551 #3793836] INFO -- : installing manpages: /tmp/ruby/install/trunk/share/man/man1 I, [2024-05-25T20:50:18.001612 #3793836] INFO -- : installing default gems from lib: /tmp/ruby/install/trunk/lib/ruby/gems/3.4.0+0 I, [2024-05-25T20:50:18.024525 #3793836] INFO -- : benchmark 0.3.0 I, [2024-05-25T20:50:18.026453 #3793836] INFO -- : bundler 2.6.0.dev I, [2024-05-25T20:50:18.028605 #3793836] INFO -- : cgi 0.4.1 I, [2024-05-25T20:50:18.029148 #3793836] INFO -- : delegate 0.3.1 I, [2024-05-25T20:50:18.029656 #3793836] INFO -- : did_you_mean 1.6.3 I, [2024-05-25T20:50:18.030098 #3793836] INFO -- : english 0.8.0 I, [2024-05-25T20:50:18.030703 #3793836] INFO -- : erb 4.0.4 I, [2024-05-25T20:50:18.031768 #3793836] INFO -- : error_highlight 0.6.0 I, [2024-05-25T20:50:18.032644 #3793836] INFO -- : fileutils 1.7.2 I, [2024-05-25T20:50:18.033357 #3793836] INFO -- : find 0.2.0 I, [2024-05-25T20:50:18.034197 #3793836] INFO -- : forwardable 1.3.3 I, [2024-05-25T20:50:18.035128 #3793836] INFO -- : ipaddr 1.2.6 I, [2024-05-25T20:50:18.035657 #3793836] INFO -- : irb 1.13.1 I, [2024-05-25T20:50:18.036431 #3793836] INFO -- : logger 1.6.0 I, [2024-05-25T20:50:18.036920 #3793836] INFO -- : net-http 0.4.1 I, [2024-05-25T20:50:18.037420 #3793836] INFO -- : net-protocol 0.2.2 I, [2024-05-25T20:50:18.037910 #3793836] INFO -- : open-uri 0.4.1 I, [2024-05-25T20:50:18.038389 #3793836] INFO -- : open3 0.2.1 I, [2024-05-25T20:50:18.038867 #3793836] INFO -- : optparse 0.5.0 I, [2024-05-25T20:50:18.039293 #3793836] INFO -- : ostruct 0.6.0 I, [2024-05-25T20:50:18.039738 #3793836] INFO -- : pp 0.5.0 I, [2024-05-25T20:50:18.040308 #3793836] INFO -- : prettyprint 0.2.0 I, [2024-05-25T20:50:18.040713 #3793836] INFO -- : prism 0.29.0 I, [2024-05-25T20:50:18.041293 #3793836] INFO -- : pstore 0.1.3 I, [2024-05-25T20:50:18.041753 #3793836] INFO -- : rdoc 6.7.0 I, [2024-05-25T20:50:18.042746 #3793836] INFO -- : readline 0.0.4 I, [2024-05-25T20:50:18.043272 #3793836] INFO -- : reline 0.5.7 I, [2024-05-25T20:50:18.043776 #3793836] INFO -- : resolv 0.4.0 I, [2024-05-25T20:50:18.044302 #3793836] INFO -- : ruby2_keywords 0.0.5 I, [2024-05-25T20:50:18.044720 #3793836] INFO -- : securerandom 0.3.1 I, [2024-05-25T20:50:18.045996 #3793836] INFO -- : set 1.1.0 I, [2024-05-25T20:50:18.046510 #3793836] INFO -- : shellwords 0.2.0 I, [2024-05-25T20:50:18.046989 #3793836] INFO -- : singleton 0.2.0 I, [2024-05-25T20:50:18.047439 #3793836] INFO -- : syntax_suggest 2.0.0 I, [2024-05-25T20:50:18.048139 #3793836] INFO -- : tempfile 0.2.1 I, [2024-05-25T20:50:18.048623 #3793836] INFO -- : time 0.3.0 I, [2024-05-25T20:50:18.049115 #3793836] INFO -- : timeout 0.4.1 I, [2024-05-25T20:50:18.049532 #3793836] INFO -- : tmpdir 0.2.0 I, [2024-05-25T20:50:18.050016 #3793836] INFO -- : tsort 0.2.0 I, [2024-05-25T20:50:18.050529 #3793836] INFO -- : un 0.3.0 I, [2024-05-25T20:50:18.050944 #3793836] INFO -- : uri 0.13.0 I, [2024-05-25T20:50:18.051519 #3793836] INFO -- : weakref 0.1.3 I, [2024-05-25T20:50:18.052033 #3793836] INFO -- : yaml 0.3.0 I, [2024-05-25T20:50:18.052377 #3793836] INFO -- : installing default gems from ext: /tmp/ruby/install/trunk/lib/ruby/gems/3.4.0+0 I, [2024-05-25T20:50:18.058879 #3793836] INFO -- : date 3.3.4 I, [2024-05-25T20:50:18.059422 #3793836] INFO -- : digest 3.1.1 I, [2024-05-25T20:50:18.059914 #3793836] INFO -- : etc 1.4.3 I, [2024-05-25T20:50:18.060447 #3793836] INFO -- : fcntl 1.1.0 I, [2024-05-25T20:50:18.060920 #3793836] INFO -- : fiddle 1.1.3 I, [2024-05-25T20:50:18.061345 #3793836] INFO -- : io-console 0.7.2 I, [2024-05-25T20:50:18.061883 #3793836] INFO -- : io-nonblock 0.3.0 I, [2024-05-25T20:50:18.062350 #3793836] INFO -- : io-wait 0.3.1 I, [2024-05-25T20:50:18.062785 #3793836] INFO -- : json 2.7.2 I, [2024-05-25T20:50:18.063320 #3793836] INFO -- : openssl 3.2.0 I, [2024-05-25T20:50:18.063835 #3793836] INFO -- : pathname 0.3.0 I, [2024-05-25T20:50:18.064368 #3793836] INFO -- : psych 5.1.2 I, [2024-05-25T20:50:18.064927 #3793836] INFO -- : stringio 3.1.1 I, [2024-05-25T20:50:18.065410 #3793836] INFO -- : strscan 3.1.1 I, [2024-05-25T20:50:18.065889 #3793836] INFO -- : zlib 3.1.0 I, [2024-05-25T20:50:18.066252 #3793836] INFO -- : installing bundled gems: /tmp/ruby/install/trunk/lib/ruby/gems/3.4.0+0 I, [2024-05-25T20:50:18.066853 #3793836] INFO -- : minitest 5.23.1 I, [2024-05-25T20:50:18.075556 #3793836] INFO -- : rake 13.2.1 I, [2024-05-25T20:50:18.079120 #3793836] INFO -- : test-unit 3.6.2 I, [2024-05-25T20:50:18.084165 #3793836] INFO -- : rexml 3.2.8 I, [2024-05-25T20:50:18.087968 #3793836] INFO -- : rss 0.3.0 I, [2024-05-25T20:50:18.090555 #3793836] INFO -- : net-ftp 0.3.4 I, [2024-05-25T20:50:18.092191 #3793836] INFO -- : net-imap 0.4.11 I, [2024-05-25T20:50:18.095897 #3793836] INFO -- : net-pop 0.1.2 I, [2024-05-25T20:50:18.096901 #3793836] INFO -- : net-smtp 0.5.0 I, [2024-05-25T20:50:18.098068 #3793836] INFO -- : matrix 0.4.2 I, [2024-05-25T20:50:18.101529 #3793836] INFO -- : prime 0.1.2 I, [2024-05-25T20:50:18.106162 #3793836] INFO -- : rbs 3.4.4 I, [2024-05-25T20:50:18.128519 #3793836] INFO -- : typeprof 0.21.11 I, [2024-05-25T20:50:18.130847 #3793836] INFO -- : debug 1.9.2 I, [2024-05-25T20:50:18.134475 #3793836] INFO -- : racc 1.8.0 I, [2024-05-25T20:50:18.137172 #3793836] INFO -- : mutex_m 0.2.0 I, [2024-05-25T20:50:18.138502 #3793836] INFO -- : getoptlong 0.2.1 I, [2024-05-25T20:50:18.140078 #3793836] INFO -- : base64 0.2.0 I, [2024-05-25T20:50:18.141204 #3793836] INFO -- : bigdecimal 3.1.8 I, [2024-05-25T20:50:18.143729 #3793836] INFO -- : observer 0.1.2 I, [2024-05-25T20:50:18.144891 #3793836] INFO -- : abbrev 0.1.2 I, [2024-05-25T20:50:18.146181 #3793836] INFO -- : resolv-replace 0.1.1 I, [2024-05-25T20:50:18.147435 #3793836] INFO -- : rinda 0.2.0 I, [2024-05-25T20:50:18.148932 #3793836] INFO -- : drb 2.2.1 I, [2024-05-25T20:50:18.150519 #3793836] INFO -- : nkf 0.2.0 I, [2024-05-25T20:50:18.152971 #3793836] INFO -- : syslog 0.1.2 I, [2024-05-25T20:50:18.155146 #3793836] INFO -- : csv 3.3.0 I, [2024-05-25T20:50:18.157777 #3793836] INFO -- : installing bundled gem cache: /tmp/ruby/install/trunk/lib/ruby/gems/3.4.0+0/cache I, [2024-05-25T20:50:18.159147 #3793836] INFO -- : skipped bundled gems: I, [2024-05-25T20:50:18.159230 #3793836] INFO -- : power_assert-2.0.4dev.gem not found in bundled_gems I, [2024-05-25T20:50:18.161991 #3793836] INFO -- : $$$[end] "make install -j20" exit with 0. I, [2024-05-25T20:50:18.162114 #3793836] INFO -- : $$$[beg] make yes-btest TESTOPTS='-q -j20' I, [2024-05-25T20:50:23.831078 #3793836] INFO -- : PASS all 1936 tests E, [2024-05-25T20:50:23.836772 #3793836] ERROR -- : I, [2024-05-25T20:50:23.837090 #3793836] INFO -- : $$$[end] "make yes-btest TESTOPTS='-q -j20'" exit with 0. I, [2024-05-25T20:50:23.837172 #3793836] INFO -- : $$$[beg] make yes-test-basic TESTS='-j20' I, [2024-05-25T20:50:23.897441 #3793836] INFO -- : BASERUBY = /usr/bin/ruby --disable=gems I, [2024-05-25T20:50:23.897484 #3793836] INFO -- : CC = gcc I, [2024-05-25T20:50:23.897499 #3793836] INFO -- : LD = ld I, [2024-05-25T20:50:23.897511 #3793836] INFO -- : LDSHARED = gcc -shared I, [2024-05-25T20:50:23.897524 #3793836] INFO -- : CFLAGS = -O3 -fno-fast-math -ggdb3 -Wall -Wextra -Wdeprecated-declarations -Wdiv-by-zero -Wduplicated-cond -Wimplicit-function-declaration -Wimplicit-int -Wpointer-arith -Wwrite-strings -Wold-style-definition -Wimplicit-fallthrough=0 -Wmissing-noreturn -Wno-cast-function-type -Wno-constant-logical-operand -Wno-long-long -Wno-missing-field-initializers -Wno-overlength-strings -Wno-packed-bitfield-compat -Wno-parentheses-equality -Wno-self-assign -Wno-tautological-compare -Wno-unused-parameter -Wno-unused-value -Wsuggest-attribute=format -Wsuggest-attribute=noreturn -Wunused-variable -Wmisleading-indentation -Wundef -fPIC I, [2024-05-25T20:50:23.897538 #3793836] INFO -- : XCFLAGS = -U_FORTIFY_SOURCE -D_FORTIFY_SOURCE=2 -fstack-protector-strong -fno-strict-overflow -fvisibility=hidden -fexcess-precision=standard -DRUBY_EXPORT -I. -I.ext/include/x86_64-linux -I/tmp/ruby/src/trunk/include -I/tmp/ruby/src/trunk -I/tmp/ruby/src/trunk/prism -I/tmp/ruby/src/trunk/enc/unicode/15.0.0 I, [2024-05-25T20:50:23.897551 #3793836] INFO -- : CPPFLAGS = I, [2024-05-25T20:50:23.897563 #3793836] INFO -- : DLDFLAGS = -Wl,--compress-debug-sections=zlib -Wl,-soname,libruby.so.3.4 -fstack-protector-strong I, [2024-05-25T20:50:23.897575 #3793836] INFO -- : SOLIBS = -lz -lrt -lrt -lgmp -ldl -lcrypt -lm -lpthread I, [2024-05-25T20:50:23.897587 #3793836] INFO -- : LANG = en_US.UTF-8 I, [2024-05-25T20:50:23.897599 #3793836] INFO -- : LC_ALL = I, [2024-05-25T20:50:23.897611 #3793836] INFO -- : LC_CTYPE = I, [2024-05-25T20:50:23.897622 #3793836] INFO -- : MFLAGS = I, [2024-05-25T20:50:23.897634 #3793836] INFO -- : RUSTC = no I, [2024-05-25T20:50:23.897646 #3793836] INFO -- : YJIT_RUSTC_ARGS = --crate-name=yjit --crate-type=staticlib --edition=2021 -g -C lto=thin -C opt-level=3 -C overflow-checks=on '--out-dir=/tmp/ruby/build/trunk/yjit/target/release/' /tmp/ruby/src/trunk/yjit/src/lib.rs I, [2024-05-25T20:50:23.898008 #3793836] INFO -- : gcc (Ubuntu 11.4.0-1ubuntu1~22.04) 11.4.0 I, [2024-05-25T20:50:23.898053 #3793836] INFO -- : Copyright (C) 2021 Free Software Foundation, Inc. I, [2024-05-25T20:50:23.898068 #3793836] INFO -- : This is free software; see the source for copying conditions. There is NO I, [2024-05-25T20:50:23.898081 #3793836] INFO -- : warranty; not even for MERCHANTABILITY or FITNESS FOR A PARTICULAR PURPOSE. I, [2024-05-25T20:50:23.898103 #3793836] INFO -- : I, [2024-05-25T20:50:24.002476 #3793836] INFO -- : Checking leaked global symbols...none I, [2024-05-25T20:50:24.049796 #3793836] INFO -- : /tmp/ruby/src/trunk/basictest/test.rb:assignment ....................................................................................................................................................................................................................................................................................................................................................................................OK 372 I, [2024-05-25T20:50:24.049899 #3793836] INFO -- : /tmp/ruby/src/trunk/basictest/test.rb:condition ..OK 2 I, [2024-05-25T20:50:24.049917 #3793836] INFO -- : /tmp/ruby/src/trunk/basictest/test.rb:if/unless ...OK 3 I, [2024-05-25T20:50:24.049930 #3793836] INFO -- : /tmp/ruby/src/trunk/basictest/test.rb:case .....OK 5 I, [2024-05-25T20:50:24.050133 #3793836] INFO -- : /tmp/ruby/src/trunk/basictest/test.rb:while/until ........OK 8 I, [2024-05-25T20:50:24.050192 #3793836] INFO -- : /tmp/ruby/src/trunk/basictest/test.rb:exception ..........OK 10 I, [2024-05-25T20:50:24.050508 #3793836] INFO -- : /tmp/ruby/src/trunk/basictest/test.rb:array .......................................OK 39 I, [2024-05-25T20:50:24.050628 #3793836] INFO -- : /tmp/ruby/src/trunk/basictest/test.rb:hash ...........................OK 27 I, [2024-05-25T20:50:24.051410 #3793836] INFO -- : /tmp/ruby/src/trunk/basictest/test.rb:iterator ...........................................................................................................OK 107 I, [2024-05-25T20:50:24.051836 #3793836] INFO -- : /tmp/ruby/src/trunk/basictest/test.rb:float ................................................................................OK 80 I, [2024-05-25T20:50:24.053666 #3793836] INFO -- : /tmp/ruby/src/trunk/basictest/test.rb:bignum ...............................OK 31 I, [2024-05-25T20:50:24.054375 #3793836] INFO -- : /tmp/ruby/src/trunk/basictest/test.rb:string & char ..............................................................OK 62 I, [2024-05-25T20:50:24.054404 #3793836] INFO -- : /tmp/ruby/src/trunk/basictest/test.rb:assignment ..........OK 10 I, [2024-05-25T20:50:24.054432 #3793836] INFO -- : /tmp/ruby/src/trunk/basictest/test.rb:call ......OK 6 I, [2024-05-25T20:50:24.054492 #3793836] INFO -- : /tmp/ruby/src/trunk/basictest/test.rb:proc .........OK 9 I, [2024-05-25T20:50:24.155099 #3793836] INFO -- : /tmp/ruby/src/trunk/basictest/test.rb:signal ..OK 2 I, [2024-05-25T20:50:24.157658 #3793836] INFO -- : /tmp/ruby/src/trunk/basictest/test.rb:eval ...........................OK 27 I, [2024-05-25T20:50:24.279545 #3793836] INFO -- : /tmp/ruby/src/trunk/basictest/test.rb:system ........OK 8 I, [2024-05-25T20:50:24.279631 #3793836] INFO -- : /tmp/ruby/src/trunk/basictest/test.rb:const .....OK 5 I, [2024-05-25T20:50:24.279647 #3793836] INFO -- : /tmp/ruby/src/trunk/basictest/test.rb:clone .....OK 5 I, [2024-05-25T20:50:24.279684 #3793836] INFO -- : /tmp/ruby/src/trunk/basictest/test.rb:marshal ....OK 4 I, [2024-05-25T20:50:24.279818 #3793836] INFO -- : /tmp/ruby/src/trunk/basictest/test.rb:pack ....OK 4 I, [2024-05-25T20:50:24.279845 #3793836] INFO -- : /tmp/ruby/src/trunk/basictest/test.rb:math ..OK 2 I, [2024-05-25T20:50:24.279877 #3793836] INFO -- : /tmp/ruby/src/trunk/basictest/test.rb:struct ......OK 6 I, [2024-05-25T20:50:24.279990 #3793836] INFO -- : /tmp/ruby/src/trunk/basictest/test.rb:variable ............OK 12 I, [2024-05-25T20:50:24.280016 #3793836] INFO -- : /tmp/ruby/src/trunk/basictest/test.rb:trace ...OK 3 I, [2024-05-25T20:50:24.280032 #3793836] INFO -- : /tmp/ruby/src/trunk/basictest/test.rb:defined? ............OK 12 I, [2024-05-25T20:50:24.280056 #3793836] INFO -- : /tmp/ruby/src/trunk/basictest/test.rb:alias ......OK 6 I, [2024-05-25T20:50:24.280436 #3793836] INFO -- : /tmp/ruby/src/trunk/basictest/test.rb:path .......................OK 23 I, [2024-05-25T20:50:24.314594 #3793836] INFO -- : /tmp/ruby/src/trunk/basictest/test.rb:gc ....OK 4 I, [2024-05-25T20:50:24.316946 #3793836] INFO -- : I, [2024-05-25T20:50:24.317009 #3793836] INFO -- : test succeeded I, [2024-05-25T20:50:24.318590 #3793836] INFO -- : $$$[end] "make yes-test-basic TESTS='-j20'" exit with 0. I, [2024-05-25T20:50:24.318695 #3793836] INFO -- : $$$[beg] make yes-test-all TESTOPTS='--stderr-on-failure' TESTS='-j20' I, [2024-05-25T20:50:24.409142 #3793836] INFO -- : BASERUBY = /usr/bin/ruby --disable=gems I, [2024-05-25T20:50:24.409179 #3793836] INFO -- : CC = gcc I, [2024-05-25T20:50:24.409184 #3793836] INFO -- : LD = ld I, [2024-05-25T20:50:24.409188 #3793836] INFO -- : LDSHARED = gcc -shared I, [2024-05-25T20:50:24.409193 #3793836] INFO -- : CFLAGS = -O3 -fno-fast-math -ggdb3 -Wall -Wextra -Wdeprecated-declarations -Wdiv-by-zero -Wduplicated-cond -Wimplicit-function-declaration -Wimplicit-int -Wpointer-arith -Wwrite-strings -Wold-style-definition -Wimplicit-fallthrough=0 -Wmissing-noreturn -Wno-cast-function-type -Wno-constant-logical-operand -Wno-long-long -Wno-missing-field-initializers -Wno-overlength-strings -Wno-packed-bitfield-compat -Wno-parentheses-equality -Wno-self-assign -Wno-tautological-compare -Wno-unused-parameter -Wno-unused-value -Wsuggest-attribute=format -Wsuggest-attribute=noreturn -Wunused-variable -Wmisleading-indentation -Wundef -fPIC I, [2024-05-25T20:50:24.409198 #3793836] INFO -- : XCFLAGS = -U_FORTIFY_SOURCE -D_FORTIFY_SOURCE=2 -fstack-protector-strong -fno-strict-overflow -fvisibility=hidden -fexcess-precision=standard -DRUBY_EXPORT -I. -I.ext/include/x86_64-linux -I/tmp/ruby/src/trunk/include -I/tmp/ruby/src/trunk -I/tmp/ruby/src/trunk/prism -I/tmp/ruby/src/trunk/enc/unicode/15.0.0 I, [2024-05-25T20:50:24.409202 #3793836] INFO -- : CPPFLAGS = I, [2024-05-25T20:50:24.409207 #3793836] INFO -- : DLDFLAGS = -Wl,--compress-debug-sections=zlib -Wl,-soname,libruby.so.3.4 -fstack-protector-strong I, [2024-05-25T20:50:24.409211 #3793836] INFO -- : SOLIBS = -lz -lrt -lrt -lgmp -ldl -lcrypt -lm -lpthread I, [2024-05-25T20:50:24.409214 #3793836] INFO -- : LANG = en_US.UTF-8 I, [2024-05-25T20:50:24.409218 #3793836] INFO -- : LC_ALL = I, [2024-05-25T20:50:24.409221 #3793836] INFO -- : LC_CTYPE = I, [2024-05-25T20:50:24.409225 #3793836] INFO -- : MFLAGS = I, [2024-05-25T20:50:24.409228 #3793836] INFO -- : RUSTC = no I, [2024-05-25T20:50:24.409233 #3793836] INFO -- : YJIT_RUSTC_ARGS = --crate-name=yjit --crate-type=staticlib --edition=2021 -g -C lto=thin -C opt-level=3 -C overflow-checks=on '--out-dir=/tmp/ruby/build/trunk/yjit/target/release/' /tmp/ruby/src/trunk/yjit/src/lib.rs I, [2024-05-25T20:50:24.409826 #3793836] INFO -- : gcc (Ubuntu 11.4.0-1ubuntu1~22.04) 11.4.0 I, [2024-05-25T20:50:24.409847 #3793836] INFO -- : Copyright (C) 2021 Free Software Foundation, Inc. I, [2024-05-25T20:50:24.409853 #3793836] INFO -- : This is free software; see the source for copying conditions. There is NO I, [2024-05-25T20:50:24.409857 #3793836] INFO -- : warranty; not even for MERCHANTABILITY or FITNESS FOR A PARTICULAR PURPOSE. I, [2024-05-25T20:50:24.409860 #3793836] INFO -- : I, [2024-05-25T20:50:24.411485 #3793836] INFO -- : generating enc.mk I, [2024-05-25T20:50:24.528844 #3793836] INFO -- : generating encdb.h I, [2024-05-25T20:50:24.552682 #3793836] INFO -- : encdb.h unchanged I, [2024-05-25T20:50:24.553826 #3793836] INFO -- : making enc I, [2024-05-25T20:50:24.570901 #3793836] INFO -- : make[1]: Entering directory '/tmp/ruby/build/trunk' I, [2024-05-25T20:50:24.570928 #3793836] INFO -- : make[1]: Nothing to be done for 'enc'. I, [2024-05-25T20:50:24.570934 #3793836] INFO -- : make[1]: Leaving directory '/tmp/ruby/build/trunk' I, [2024-05-25T20:50:24.571617 #3793836] INFO -- : making srcs under enc I, [2024-05-25T20:50:24.603126 #3793836] INFO -- : make[1]: Entering directory '/tmp/ruby/build/trunk' I, [2024-05-25T20:50:24.603147 #3793836] INFO -- : make[1]: Nothing to be done for 'srcs'. I, [2024-05-25T20:50:24.603161 #3793836] INFO -- : make[1]: Leaving directory '/tmp/ruby/build/trunk' I, [2024-05-25T20:50:24.604144 #3793836] INFO -- : generating transdb.h I, [2024-05-25T20:50:24.700723 #3793836] INFO -- : transdb.h unchanged I, [2024-05-25T20:50:24.702228 #3793836] INFO -- : making trans I, [2024-05-25T20:50:24.736232 #3793836] INFO -- : make[1]: Entering directory '/tmp/ruby/build/trunk' I, [2024-05-25T20:50:24.736256 #3793836] INFO -- : make[1]: Nothing to be done for 'trans'. I, [2024-05-25T20:50:24.736262 #3793836] INFO -- : make[1]: Leaving directory '/tmp/ruby/build/trunk' I, [2024-05-25T20:50:24.737007 #3793836] INFO -- : making encs I, [2024-05-25T20:50:24.773987 #3793836] INFO -- : make[1]: Entering directory '/tmp/ruby/build/trunk' I, [2024-05-25T20:50:24.774010 #3793836] INFO -- : make[1]: Nothing to be done for 'encs'. I, [2024-05-25T20:50:24.774015 #3793836] INFO -- : make[1]: Leaving directory '/tmp/ruby/build/trunk' I, [2024-05-25T20:50:24.775818 #3793836] INFO -- : generating makefiles ext/configure-ext.mk I, [2024-05-25T20:50:24.802757 #3793836] INFO -- : ext/configure-ext.mk updated I, [2024-05-25T20:50:24.805148 #3793836] INFO -- : make[1]: Entering directory '/tmp/ruby/build/trunk' I, [2024-05-25T20:50:26.202257 #3793836] INFO -- : make[1]: Leaving directory '/tmp/ruby/build/trunk' I, [2024-05-25T20:50:26.203124 #3793836] INFO -- : generating makefile exts.mk I, [2024-05-25T20:50:26.241420 #3793836] INFO -- : exts.mk unchanged I, [2024-05-25T20:50:26.246447 #3793836] INFO -- : make[1]: Entering directory '/tmp/ruby/build/trunk' I, [2024-05-25T20:50:26.560290 #3793836] INFO -- : make[2]: Entering directory '/tmp/ruby/build/trunk/ext/coverage' I, [2024-05-25T20:50:26.564299 #3793836] INFO -- : make[2]: Leaving directory '/tmp/ruby/build/trunk/ext/coverage' I, [2024-05-25T20:50:26.569910 #3793836] INFO -- : make[2]: Entering directory '/tmp/ruby/build/trunk/ext/date' I, [2024-05-25T20:50:26.573265 #3793836] INFO -- : make[2]: Leaving directory '/tmp/ruby/build/trunk/ext/date' I, [2024-05-25T20:50:26.576099 #3793836] INFO -- : make[2]: Entering directory '/tmp/ruby/build/trunk/ext/digest' I, [2024-05-25T20:50:26.584867 #3793836] INFO -- : make[2]: Leaving directory '/tmp/ruby/build/trunk/ext/digest' I, [2024-05-25T20:50:26.611224 #3793836] INFO -- : make[2]: Entering directory '/tmp/ruby/build/trunk/ext/digest/sha2' I, [2024-05-25T20:50:26.615963 #3793836] INFO -- : make[2]: Leaving directory '/tmp/ruby/build/trunk/ext/digest/sha2' I, [2024-05-25T20:50:26.637220 #3793836] INFO -- : make[2]: Entering directory '/tmp/ruby/build/trunk/ext/fiddle' I, [2024-05-25T20:50:26.647783 #3793836] INFO -- : make[2]: Leaving directory '/tmp/ruby/build/trunk/ext/fiddle' I, [2024-05-25T20:50:26.652627 #3793836] INFO -- : make[2]: Entering directory '/tmp/ruby/build/trunk/ext/io/console' I, [2024-05-25T20:50:26.656025 #3793836] INFO -- : make[2]: Leaving directory '/tmp/ruby/build/trunk/ext/io/console' I, [2024-05-25T20:50:26.668029 #3793836] INFO -- : make[2]: Entering directory '/tmp/ruby/build/trunk/ext/json' I, [2024-05-25T20:50:26.678364 #3793836] INFO -- : make[2]: Leaving directory '/tmp/ruby/build/trunk/ext/json' I, [2024-05-25T20:50:26.693000 #3793836] INFO -- : make[2]: Entering directory '/tmp/ruby/build/trunk/ext/monitor' I, [2024-05-25T20:50:26.696952 #3793836] INFO -- : make[2]: Leaving directory '/tmp/ruby/build/trunk/ext/monitor' I, [2024-05-25T20:50:26.704422 #3793836] INFO -- : make[2]: Entering directory '/tmp/ruby/build/trunk/ext/objspace' I, [2024-05-25T20:50:26.710584 #3793836] INFO -- : make[2]: Leaving directory '/tmp/ruby/build/trunk/ext/objspace' I, [2024-05-25T20:50:26.728690 #3793836] INFO -- : make[2]: Entering directory '/tmp/ruby/build/trunk/ext/openssl' I, [2024-05-25T20:50:26.742629 #3793836] INFO -- : make[2]: Leaving directory '/tmp/ruby/build/trunk/ext/openssl' I, [2024-05-25T20:50:26.747180 #3793836] INFO -- : make[2]: Entering directory '/tmp/ruby/build/trunk/ext/pathname' I, [2024-05-25T20:50:26.751170 #3793836] INFO -- : make[2]: Leaving directory '/tmp/ruby/build/trunk/ext/pathname' I, [2024-05-25T20:50:26.758231 #3793836] INFO -- : make[2]: Entering directory '/tmp/ruby/build/trunk/ext/psych' I, [2024-05-25T20:50:26.781005 #3793836] INFO -- : make[2]: Leaving directory '/tmp/ruby/build/trunk/ext/psych' I, [2024-05-25T20:50:26.785940 #3793836] INFO -- : make[2]: Entering directory '/tmp/ruby/build/trunk/ext/pty' I, [2024-05-25T20:50:26.790076 #3793836] INFO -- : make[2]: Leaving directory '/tmp/ruby/build/trunk/ext/pty' I, [2024-05-25T20:50:26.806123 #3793836] INFO -- : make[2]: Entering directory '/tmp/ruby/build/trunk/ext/ripper' I, [2024-05-25T20:50:26.814281 #3793836] INFO -- : make[2]: Leaving directory '/tmp/ruby/build/trunk/ext/ripper' I, [2024-05-25T20:50:26.816793 #3793836] INFO -- : make[2]: Entering directory '/tmp/ruby/build/trunk/ext/rubyvm' I, [2024-05-25T20:50:26.820048 #3793836] INFO -- : make[2]: Leaving directory '/tmp/ruby/build/trunk/ext/rubyvm' I, [2024-05-25T20:50:26.833517 #3793836] INFO -- : make[2]: Entering directory '/tmp/ruby/build/trunk/ext/socket' I, [2024-05-25T20:50:26.844056 #3793836] INFO -- : make[2]: Leaving directory '/tmp/ruby/build/trunk/ext/socket' I, [2024-05-25T20:50:26.862460 #3793836] INFO -- : make[2]: Entering directory '/tmp/ruby/build/trunk/.bundle/gems/bigdecimal-3.1.8/ext/bigdecimal' I, [2024-05-25T20:50:26.887351 #3793836] INFO -- : make[2]: Leaving directory '/tmp/ruby/build/trunk/.bundle/gems/bigdecimal-3.1.8/ext/bigdecimal' I, [2024-05-25T20:50:26.889304 #3793836] INFO -- : make[2]: Entering directory '/tmp/ruby/build/trunk/.bundle/gems/debug-1.9.2/ext/debug' I, [2024-05-25T20:50:26.910682 #3793836] INFO -- : make[2]: Leaving directory '/tmp/ruby/build/trunk/.bundle/gems/debug-1.9.2/ext/debug' I, [2024-05-25T20:50:26.912671 #3793836] INFO -- : make[2]: Entering directory '/tmp/ruby/build/trunk/.bundle/gems/nkf-0.2.0/ext/nkf' I, [2024-05-25T20:50:26.933974 #3793836] INFO -- : make[2]: Leaving directory '/tmp/ruby/build/trunk/.bundle/gems/nkf-0.2.0/ext/nkf' I, [2024-05-25T20:50:26.935951 #3793836] INFO -- : make[2]: Entering directory '/tmp/ruby/build/trunk/.bundle/gems/racc-1.7.3/ext/racc/cparse' I, [2024-05-25T20:50:26.957416 #3793836] INFO -- : make[2]: Leaving directory '/tmp/ruby/build/trunk/.bundle/gems/racc-1.7.3/ext/racc/cparse' I, [2024-05-25T20:50:26.959352 #3793836] INFO -- : make[2]: Entering directory '/tmp/ruby/build/trunk/.bundle/gems/racc-1.8.0/ext/racc/cparse' I, [2024-05-25T20:50:26.981734 #3793836] INFO -- : make[2]: Leaving directory '/tmp/ruby/build/trunk/.bundle/gems/racc-1.8.0/ext/racc/cparse' I, [2024-05-25T20:50:26.984239 #3793836] INFO -- : make[2]: Entering directory '/tmp/ruby/build/trunk/.bundle/gems/rbs-3.4.4/ext/rbs_extension' I, [2024-05-25T20:50:27.006116 #3793836] INFO -- : make[2]: Leaving directory '/tmp/ruby/build/trunk/.bundle/gems/rbs-3.4.4/ext/rbs_extension' I, [2024-05-25T20:50:27.008311 #3793836] INFO -- : make[2]: Entering directory '/tmp/ruby/build/trunk/.bundle/gems/syslog-0.1.2/ext/syslog' I, [2024-05-25T20:50:27.030234 #3793836] INFO -- : make[2]: Leaving directory '/tmp/ruby/build/trunk/.bundle/gems/syslog-0.1.2/ext/syslog' I, [2024-05-25T20:50:27.056692 #3793836] INFO -- : make[2]: Entering directory '/tmp/ruby/build/trunk' I, [2024-05-25T20:50:27.122034 #3793836] INFO -- : make[2]: 'ruby' is up to date. I, [2024-05-25T20:50:27.122077 #3793836] INFO -- : make[2]: Leaving directory '/tmp/ruby/build/trunk' I, [2024-05-25T20:50:27.122551 #3793836] INFO -- : make[1]: Leaving directory '/tmp/ruby/build/trunk' I, [2024-05-25T20:50:27.126462 #3793836] INFO -- : make[1]: Entering directory '/tmp/ruby/build/trunk' I, [2024-05-25T20:50:27.126484 #3793836] INFO -- : make[1]: Nothing to be done for 'note'. I, [2024-05-25T20:50:27.126490 #3793836] INFO -- : make[1]: Leaving directory '/tmp/ruby/build/trunk' I, [2024-05-25T20:50:27.201937 #3793836] INFO -- : Run options: I, [2024-05-25T20:50:27.202005 #3793836] INFO -- : --seed=1218 I, [2024-05-25T20:50:27.202011 #3793836] INFO -- : "--ruby=./miniruby -I/tmp/ruby/src/trunk/lib -I. -I.ext/common /tmp/ruby/src/trunk/tool/runruby.rb --extout=.ext -- --disable-gems" I, [2024-05-25T20:50:27.202024 #3793836] INFO -- : --excludes-dir=/tmp/ruby/src/trunk/test/.excludes I, [2024-05-25T20:50:27.202030 #3793836] INFO -- : --name=!/memory_leak/ I, [2024-05-25T20:50:27.202034 #3793836] INFO -- : --stderr-on-failure I, [2024-05-25T20:50:27.202038 #3793836] INFO -- : -j20 I, [2024-05-25T20:50:27.202042 #3793836] INFO -- : I, [2024-05-25T20:50:27.202046 #3793836] INFO -- : # Running tests: I, [2024-05-25T20:50:27.202051 #3793836] INFO -- : I, [2024-05-25T20:50:27.350440 #3793836] INFO -- : [ 1/883] 3835188=test_pinned I, [2024-05-25T20:50:27.350503 #3793836] INFO -- : [ 2/883] 3835189=test_webauthn_listener_response I, [2024-05-25T20:50:27.351819 #3793836] INFO -- : [ 3/883] 3835187=test_time I, [2024-05-25T20:50:27.351973 #3793836] INFO -- : [ 4/883] 3835190=test_to_ary_concat I, [2024-05-25T20:50:27.352690 #3793836] INFO -- : [ 5/883] 3835191=test_stream I, [2024-05-25T20:50:27.355841 #3793836] INFO -- : [ 6/883] 3835192=test_printf I, [2024-05-25T20:50:27.356160 #3793836] INFO -- : [ 7/883] 3835203=test_rdoc_markup_pre_process I, [2024-05-25T20:50:27.356276 #3793836] INFO -- : [ 8/883] 3835201=test_rdoc_markup_to_bs I, [2024-05-25T20:50:27.356359 #3793836] INFO -- : [ 9/883] 3835200=test_help I, [2024-05-25T20:50:27.356638 #3793836] INFO -- : [ 10/883] 3835202=test_gem_commands_unpack_command I, [2024-05-25T20:50:27.356672 #3793836] INFO -- : [ 11/883] 3835204=test_files_lib I, [2024-05-25T20:50:27.359572 #3793836] INFO -- : [ 12/883] 3835205=test_beginendblock I, [2024-05-25T20:50:27.366777 #3793836] INFO -- : [ 13/883] 3835192=reflection_test I, [2024-05-25T20:50:27.368094 #3793836] INFO -- : [ 14/883] 3835188=test_gem_bundler_version_finder I, [2024-05-25T20:50:27.371248 #3793836] INFO -- : [ 15/883] 3835200=test_emoji_breaks I, [2024-05-25T20:50:27.374057 #3793836] INFO -- : [ 16/883] 3835200=test_within_pipe I, [2024-05-25T20:50:27.377313 #3793836] INFO -- : [ 17/883] 3835191=test_closure I, [2024-05-25T20:50:27.384220 #3793836] INFO -- : [ 18/883] 3835206=test_bundled_ca I, [2024-05-25T20:50:27.385383 #3793836] INFO -- : [ 19/883] 3835193=test_fiber I, [2024-05-25T20:50:27.385874 #3793836] INFO -- : [ 20/883] 3835195=test_multi_irb_commands I, [2024-05-25T20:50:27.386294 #3793836] INFO -- : [ 21/883] 3835194=test_open3 I, [2024-05-25T20:50:27.386430 #3793836] INFO -- : [ 22/883] 3835198=test_ractor I, [2024-05-25T20:50:27.387548 #3793836] INFO -- : [ 23/883] 3835197=test_gem_security I, [2024-05-25T20:50:27.387780 #3793836] INFO -- : [ 24/883] 3835196=test_rdoc_servlet I, [2024-05-25T20:50:27.393332 #3793836] INFO -- : [ 25/883] 3835199=test_digest I, [2024-05-25T20:50:27.420065 #3793836] INFO -- : [ 26/883] 3835195=test_exit I, [2024-05-25T20:50:27.444862 #3793836] INFO -- : [ 27/883] 3835192=test_recursion I, [2024-05-25T20:50:27.453387 #3793836] INFO -- : [ 28/883] 3835192=test_history I, [2024-05-25T20:50:27.465123 #3793836] INFO -- : [ 29/883] 3835198=test_date_marshal I, [2024-05-25T20:50:27.466521 #3793836] INFO -- : [ 30/883] 3835199=test_mkmf I, [2024-05-25T20:50:27.472309 #3793836] INFO -- : [ 31/883] 3835198=test_delegate I, [2024-05-25T20:50:27.473448 #3793836] INFO -- : [ 32/883] 3835200=test_popen_deadlock I, [2024-05-25T20:50:27.494830 #3793836] INFO -- : [ 33/883] 3835198=test_cmethod I, [2024-05-25T20:50:27.498250 #3793836] INFO -- : [ 34/883] 3835198=test_tracer I, [2024-05-25T20:50:27.511299 #3793836] INFO -- : [ 35/883] 3835199=test_append I, [2024-05-25T20:50:27.513750 #3793836] INFO -- : [ 36/883] 3835203=test_option I, [2024-05-25T20:50:27.521800 #3793836] INFO -- : [ 37/883] 3835199=test_gem_commands_server_command I, [2024-05-25T20:50:27.530722 #3793836] INFO -- : [ 38/883] 3835191=test_variable_name_check I, [2024-05-25T20:50:27.538771 #3793836] INFO -- : [ 39/883] 3835189=test_io_m17n I, [2024-05-25T20:50:27.548946 #3793836] INFO -- : [ 40/883] 3835201=test_did_you_mean I, [2024-05-25T20:50:27.551304 #3793836] INFO -- : [ 41/883] 3835187=test_interned_str I, [2024-05-25T20:50:27.555490 #3793836] INFO -- : [ 42/883] 3835187=test_case_comprehensive I, [2024-05-25T20:50:27.561872 #3793836] INFO -- : [ 43/883] 3835188=test_gem_commands_build_command I, [2024-05-25T20:50:27.564900 #3793836] INFO -- : [ 44/883] 3835191=test_scheduler I, [2024-05-25T20:50:27.569712 #3793836] INFO -- : [ 45/883] 3835192=test_pkey_dsa I, [2024-05-25T20:50:27.584110 #3793836] INFO -- : [ 46/883] 3835190=test_class I, [2024-05-25T20:50:27.609436 #3793836] INFO -- : [ 47/883] 3835190=test_ocsp I, [2024-05-25T20:50:27.610485 #3793836] INFO -- : [ 48/883] 3835198=test_rdoc_markup_heading I, [2024-05-25T20:50:27.668700 #3793836] INFO -- : [ 49/883] 3835203=test_iseq I, [2024-05-25T20:50:27.683208 #3793836] INFO -- : [ 50/883] 3835201=test_exception_at_throwing I, [2024-05-25T20:50:27.690287 #3793836] INFO -- : [ 51/883] 3835195=test_addrinfo I, [2024-05-25T20:50:27.695849 #3793836] INFO -- : [ 52/883] 3835199=test_http I, [2024-05-25T20:50:27.715065 #3793836] INFO -- : [ 53/883] 3835191=test_tree_spell_checker I, [2024-05-25T20:50:27.743386 #3793836] INFO -- : [ 54/883] 3835191=test_path I, [2024-05-25T20:50:27.743563 #3793836] INFO -- : [ 55/883] 3835198=test_case_mapping I, [2024-05-25T20:50:27.747263 #3793836] INFO -- : [ 56/883] 3835195=redundant_return_test I, [2024-05-25T20:50:27.751661 #3793836] INFO -- : [ 57/883] 3835191=test_bn I, [2024-05-25T20:50:27.756634 #3793836] INFO -- : [ 58/883] 3835201=test_win32ole_param_event I, [2024-05-25T20:50:27.759673 #3793836] INFO -- : [ 59/883] 3835201=test_compile_prism I, [2024-05-25T20:50:27.767582 #3793836] INFO -- : [ 60/883] 3835198=test_terminfo I, [2024-05-25T20:50:27.774003 #3793836] INFO -- : [ 61/883] 3835198=test_date_compat I, [2024-05-25T20:50:27.775386 #3793836] INFO -- : [ 62/883] 3835202=test_rdoc_markup_to_html I, [2024-05-25T20:50:27.777448 #3793836] INFO -- : [ 63/883] 3835198=test_bug-14834 I, [2024-05-25T20:50:27.788878 #3793836] INFO -- : [ 64/883] 3835191=test_key_event_record I, [2024-05-25T20:50:27.809676 #3793836] INFO -- : [ 65/883] 3835205=test_gem_uri I, [2024-05-25T20:50:27.811859 #3793836] INFO -- : [ 66/883] 3835196=test_random I, [2024-05-25T20:50:27.819910 #3793836] INFO -- : [ 67/883] 3835188=test_notimplement I, [2024-05-25T20:50:27.822172 #3793836] INFO -- : [ 68/883] 3835196=test_gem_commands_update_command I, [2024-05-25T20:50:27.827950 #3793836] INFO -- : [ 69/883] 3835188=test_gem_resolver_vendor_specification I, [2024-05-25T20:50:27.830718 #3793836] INFO -- : [ 70/883] 3835195=test_thread_cv I, [2024-05-25T20:50:27.833654 #3793836] INFO -- : [ 71/883] 3835191=test_lexer I, [2024-05-25T20:50:27.844307 #3793836] INFO -- : [ 72/883] 3835188=test_ssl_session I, [2024-05-25T20:50:27.848592 #3793836] INFO -- : [ 73/883] 3835191=test_koi8 I, [2024-05-25T20:50:27.851073 #3793836] INFO -- : [ 74/883] 3835191=parameters_signature_test I, [2024-05-25T20:50:27.863835 #3793836] INFO -- : [ 75/883] 3835198=test_rdoc_parser_changelog I, [2024-05-25T20:50:27.898878 #3793836] INFO -- : [ 76/883] 3835191=test_enumerator I, [2024-05-25T20:50:27.901881 #3793836] INFO -- : [ 77/883] 3835191=test_unicode I, [2024-05-25T20:50:27.909135 #3793836] INFO -- : [ 78/883] 3835191=test_rdoc_generator_pot I, [2024-05-25T20:50:27.939319 #3793836] INFO -- : [ 79/883] 3835198=test_gem_gem_runner I, [2024-05-25T20:50:27.969418 #3793836] INFO -- : [ 80/883] 3835190=test_filter I, [2024-05-25T20:50:28.004230 #3793836] INFO -- : [ 81/883] 3835202=static_literals_test I, [2024-05-25T20:50:28.011237 #3793836] INFO -- : [ 82/883] 3835190=test_data I, [2024-05-25T20:50:28.015273 #3793836] INFO -- : [ 83/883] 3835190=test_rdoc_method_attr I, [2024-05-25T20:50:28.023580 #3793836] INFO -- : [ 84/883] 3835191=test_name_error_extension I, [2024-05-25T20:50:28.026145 #3793836] INFO -- : [ 85/883] 3835191=test_chilled I, [2024-05-25T20:50:28.027436 #3793836] INFO -- : [ 86/883] 3835205=test_rdoc_i18n_locale I, [2024-05-25T20:50:28.031127 #3793836] INFO -- : [ 87/883] 3835191=test_gem_commands_yank_command I, [2024-05-25T20:50:28.043115 #3793836] INFO -- : [ 88/883] 3835202=test_win32ole_param I, [2024-05-25T20:50:28.045800 #3793836] INFO -- : [ 89/883] 3835202=test_pair I, [2024-05-25T20:50:28.083615 #3793836] INFO -- : [ 90/883] 3835201=test_document I, [2024-05-25T20:50:28.093034 #3793836] INFO -- : [ 91/883] 3835200=test_euc_jp I, [2024-05-25T20:50:28.096888 #3793836] INFO -- : [ 92/883] 3835200=test_rdoc_generator_pot_po_entry I, [2024-05-25T20:50:28.109639 #3793836] INFO -- : [ 93/883] 3835201=test_acceptable I, [2024-05-25T20:50:28.128553 #3793836] INFO -- : [ 94/883] 3835198=test_rbconfig I, [2024-05-25T20:50:28.131878 #3793836] INFO -- : [ 95/883] 3835198=test_human_typo I, [2024-05-25T20:50:28.139031 #3793836] INFO -- : [ 96/883] 3835198=test_primitive I, [2024-05-25T20:50:28.146981 #3793836] INFO -- : [ 97/883] 3835198=test_color I, [2024-05-25T20:50:28.180028 #3793836] INFO -- : [ 98/883] 3835200=json_encoding_test I, [2024-05-25T20:50:28.182307 #3793836] INFO -- : [ 99/883] 3835201=test_key_stroke I, [2024-05-25T20:50:28.185942 #3793836] INFO -- : [100/883] 3835205=test_install I, [2024-05-25T20:50:28.187676 #3793836] INFO -- : [101/883] 3835198=test_rdoc_markup_to_label I, [2024-05-25T20:50:28.189812 #3793836] INFO -- : [102/883] 3835200=test_sockopt I, [2024-05-25T20:50:28.217702 #3793836] INFO -- : [103/883] 3835203=test_encoding I, [2024-05-25T20:50:28.217771 #3793836] INFO -- : [104/883] 3835200=test_httpresponses I, [2024-05-25T20:50:28.219391 #3793836] INFO -- : [105/883] 3835198=test_set_len I, [2024-05-25T20:50:28.231727 #3793836] INFO -- : [106/883] 3835198=test_gem_resolver_local_specification I, [2024-05-25T20:50:28.256945 #3793836] INFO -- : [107/883] 3835201=test_httpheader I, [2024-05-25T20:50:28.264568 #3793836] INFO -- : [108/883] 3835203=test_rdoc_ri_driver I, [2024-05-25T20:50:28.283168 #3793836] INFO -- : [109/883] 3835200=test_https I, [2024-05-25T20:50:28.293540 #3793836] INFO -- : [110/883] 3835198=test_gem_ext_builder I, [2024-05-25T20:50:28.339837 #3793836] INFO -- : [111/883] 3835190=test_evaluation I, [2024-05-25T20:50:28.347819 #3793836] INFO -- : [112/883] 3835190=test_abi I, [2024-05-25T20:50:28.357268 #3793836] INFO -- : [113/883] 3835201=test_provider I, [2024-05-25T20:50:28.406064 #3793836] INFO -- : [114/883] 3835205=test_rdoc_parser_simple I, [2024-05-25T20:50:28.458563 #3793836] INFO -- : [115/883] 3835205=test_gem_commands_rebuild_command I, [2024-05-25T20:50:28.467871 #3793836] INFO -- : [116/883] 3835195=test_yamldbm I, [2024-05-25T20:50:28.492968 #3793836] INFO -- : [117/883] 3835190=test_load I, [2024-05-25T20:50:28.498123 #3793836] INFO -- : [118/883] 3835190=test_gem_source I, [2024-05-25T20:50:28.515530 #3793836] INFO -- : [119/883] 3835195=test_scalar_scanner I, [2024-05-25T20:50:28.524482 #3793836] INFO -- : [120/883] 3835195=test_gem_commands_outdated_command I, [2024-05-25T20:50:28.549284 #3793836] INFO -- : [121/883] 3835203=test_gem_package_tar_writer I, [2024-05-25T20:50:28.549632 #3793836] INFO -- : [122/883] 3835205=test_helper_method I, [2024-05-25T20:50:28.594401 #3793836] INFO -- : [123/883] 3835195=test_array I, [2024-05-25T20:50:28.626674 #3793836] INFO -- : [124/883] 3835200=test_gem_dependency_list I, [2024-05-25T20:50:28.634417 #3793836] INFO -- : [125/883] 3835191=test_benchmark I, [2024-05-25T20:50:28.657754 #3793836] INFO -- : [126/883] 3835201=test_win32ole_method_event I, [2024-05-25T20:50:28.668169 #3793836] INFO -- : [127/883] 3835201=test_nesting_parser I, [2024-05-25T20:50:28.669536 #3793836] INFO -- : [128/883] 3835205=test_assembler I, [2024-05-25T20:50:28.679445 #3793836] INFO -- : [129/883] 3835205=test_propertyputref I, [2024-05-25T20:50:28.680072 #3793836] INFO -- : [130/883] 3835205=attribute_write_test I, [2024-05-25T20:50:28.737717 #3793836] INFO -- : [131/883] 3835201=test_spell_checker I, [2024-05-25T20:50:28.746416 #3793836] INFO -- : [132/883] 3835201=test_rational I, [2024-05-25T20:50:28.764067 #3793836] INFO -- : [133/883] 3835201=test_rational2 I, [2024-05-25T20:50:28.774920 #3793836] INFO -- : [134/883] 3835201=test_len I, [2024-05-25T20:50:28.777065 #3793836] INFO -- : [135/883] 3835205=test_yield_block I, [2024-05-25T20:50:28.779034 #3793836] INFO -- : [136/883] 3835201=test_completion I, [2024-05-25T20:50:28.781884 #3793836] INFO -- : [137/883] 3835205=test_gem_commands_cert_command I, [2024-05-25T20:50:28.793737 #3793836] INFO -- : [138/883] 3835190=test_x509ext I, [2024-05-25T20:50:28.801004 #3793836] INFO -- : [139/883] 3835190=test_erb I, [2024-05-25T20:50:28.807804 #3793836] INFO -- : [140/883] 3835189=test_gem_source_installed I, [2024-05-25T20:50:28.817058 #3793836] INFO -- : [141/883] 3835200=test_arith_seq_extract I, [2024-05-25T20:50:28.835016 #3793836] INFO -- : [142/883] 3835203=test_method_name_check I, [2024-05-25T20:50:28.849996 #3793836] INFO -- : [143/883] 3835203=test_parser I, [2024-05-25T20:50:28.859520 #3793836] INFO -- : [144/883] 3835189=test_module I, [2024-05-25T20:50:28.872424 #3793836] INFO -- : [145/883] 3835190=test_gem_request_set I, [2024-05-25T20:50:28.881683 #3793836] INFO -- : [146/883] 3835203=constant_path_node_test I, [2024-05-25T20:50:28.923503 #3793836] INFO -- : [147/883] 3835188=test_gem_ext_cargo_builder I, [2024-05-25T20:50:28.934414 #3793836] INFO -- : [148/883] 3835203=test_ssl I, [2024-05-25T20:50:28.948488 #3793836] INFO -- : [149/883] 3835188=integer_parse_test I, [2024-05-25T20:50:28.964702 #3793836] INFO -- : [150/883] 3835196=test_instrumentation_api I, [2024-05-25T20:50:28.968464 #3793836] INFO -- : [151/883] 3835200=test_stringify_symbols I, [2024-05-25T20:50:28.979821 #3793836] INFO -- : [152/883] 3835200=test_boolean I, [2024-05-25T20:50:29.001298 #3793836] INFO -- : [153/883] 3835200=test_whileuntil I, [2024-05-25T20:50:29.003314 #3793836] INFO -- : [154/883] 3835200=test_rdoc_generator_markup I, [2024-05-25T20:50:29.005919 #3793836] INFO -- : [155/883] 3835188=test_configuration I, [2024-05-25T20:50:29.020264 #3793836] INFO -- : [156/883] 3835200=test_rubyvm I, [2024-05-25T20:50:29.022329 #3793836] INFO -- : [157/883] 3835200=test_buffered_io I, [2024-05-25T20:50:29.025225 #3793836] INFO -- : [158/883] 3835200=test_monitor I, [2024-05-25T20:50:29.131897 #3793836] INFO -- : [159/883] 3835188=test_struct I, [2024-05-25T20:50:29.137658 #3793836] INFO -- : [160/883] 3835188=test_rdoc_markup_to_html_snippet I, [2024-05-25T20:50:29.179345 #3793836] INFO -- : [161/883] 3835206=magic_comment_test I, [2024-05-25T20:50:29.204683 #3793836] INFO -- : [162/883] 3835198=test_rdoc_markup_include I, [2024-05-25T20:50:29.210483 #3793836] INFO -- : [163/883] 3835198=test_sexp I, [2024-05-25T20:50:29.224881 #3793836] INFO -- : [164/883] 3835198=fuzzer_test I, [2024-05-25T20:50:29.234642 #3793836] INFO -- : [165/883] 3835200=test_variable I, [2024-05-25T20:50:29.254711 #3793836] INFO -- : [166/883] 3835206=test_pkg_config I, [2024-05-25T20:50:29.264168 #3793836] INFO -- : [167/883] 3835190=test_cparser I, [2024-05-25T20:50:29.283321 #3793836] INFO -- : [168/883] 3835198=test_nomethod_error I, [2024-05-25T20:50:29.284090 #3793836] INFO -- : [169/883] 3835198=json_parser_test I, [2024-05-25T20:50:29.292584 #3793836] INFO -- : [170/883] 3835206=test_config I, [2024-05-25T20:50:29.320845 #3793836] INFO -- : [171/883] 3835206=test_win32ole_variant_outarg I, [2024-05-25T20:50:29.323934 #3793836] INFO -- : [172/883] 3835206=test_dln I, [2024-05-25T20:50:29.323990 #3793836] INFO -- : [173/883] 3835206=test_gem_source_subpath_problem I, [2024-05-25T20:50:29.343735 #3793836] INFO -- : [174/883] 3835200=json_common_interface_test I, [2024-05-25T20:50:29.349210 #3793836] INFO -- : [175/883] 3835198=test_x509req I, [2024-05-25T20:50:29.356915 #3793836] INFO -- : [176/883] 3835200=test_mutex I, [2024-05-25T20:50:29.358831 #3793836] INFO -- : [177/883] 3835188=test_rdoc_rd_inline I, [2024-05-25T20:50:29.365001 #3793836] INFO -- : [178/883] 3835188=test_files_test_1 I, [2024-05-25T20:50:29.416372 #3793836] INFO -- : [179/883] 3835194=test_set I, [2024-05-25T20:50:29.419587 #3793836] INFO -- : [180/883] 3835201=test_gem_path_support I, [2024-05-25T20:50:29.431582 #3793836] INFO -- : [181/883] 3835194=test_struct I, [2024-05-25T20:50:29.450850 #3793836] INFO -- : [182/883] 3835206=test_serialize_subclasses I, [2024-05-25T20:50:29.455760 #3793836] INFO -- : [183/883] 3835206=test_insns_leaf I, [2024-05-25T20:50:29.456834 #3793836] INFO -- : [184/883] 3835206=test_deprecated I, [2024-05-25T20:50:29.464591 #3793836] INFO -- : [185/883] 3835206=test_color_printer I, [2024-05-25T20:50:29.528643 #3793836] INFO -- : [186/883] 3835206=test_engine I, [2024-05-25T20:50:29.534712 #3793836] INFO -- : [187/883] 3835206=test_win32ole_variant_m I, [2024-05-25T20:50:29.539909 #3793836] INFO -- : [188/883] 3835206=test_div I, [2024-05-25T20:50:29.540579 #3793836] INFO -- : [189/883] 3835206=test_allocation I, [2024-05-25T20:50:29.544152 #3793836] INFO -- : [190/883] 3835198=test_key_error I, [2024-05-25T20:50:29.546896 #3793836] INFO -- : [191/883] 3835198=test_process I, [2024-05-25T20:50:29.561311 #3793836] INFO -- : [192/883] 3835198=test_windows_1252 I, [2024-05-25T20:50:29.567636 #3793836] INFO -- : [193/883] 3835198=test_input_method I, [2024-05-25T20:50:29.577325 #3793836] INFO -- : [194/883] 3835190=test_cgi_session I, [2024-05-25T20:50:29.589462 #3793836] INFO -- : [195/883] 3835201=test_rdoc_rd I, [2024-05-25T20:50:29.592640 #3793836] INFO -- : [196/883] 3835198=test_metaclass I, [2024-05-25T20:50:29.595274 #3793836] INFO -- : [197/883] 3835190=test_rdoc_top_level I, [2024-05-25T20:50:29.598399 #3793836] INFO -- : [198/883] 3835198=test_signal I, [2024-05-25T20:50:29.614997 #3793836] INFO -- : [199/883] 3835201=test_fixnum I, [2024-05-25T20:50:29.636476 #3793836] INFO -- : [200/883] 3835201=test_x509crl I, [2024-05-25T20:50:29.756593 #3793836] INFO -- : [201/883] 3835201=test_gem_commands_signout_command I, [2024-05-25T20:50:29.781517 #3793836] INFO -- : [202/883] 3835201=test_refinement I, [2024-05-25T20:50:29.797956 #3793836] INFO -- : [203/883] 3835205=test_regex_casefold I, [2024-05-25T20:50:29.821497 #3793836] INFO -- : [204/883] 3835190=test_gem_source_git I, [2024-05-25T20:50:29.845911 #3793836] INFO -- : [205/883] 3835191=test_dir_m17n I, [2024-05-25T20:50:29.868878 #3793836] INFO -- : [206/883] 3835192=test_gem_resolver_installer_set I, [2024-05-25T20:50:29.885632 #3793836] INFO -- : [207/883] 3835194=test_float I, [2024-05-25T20:50:30.074162 #3793836] INFO -- : [208/883] 3835205=test_cgi_cookie I, [2024-05-25T20:50:30.082374 #3793836] INFO -- : [209/883] 3835205=test_require I, [2024-05-25T20:50:30.176608 #3793836] INFO -- : [210/883] 3835192=test_storage I, [2024-05-25T20:50:30.193323 #3793836] INFO -- : [211/883] 3835192=test_gem_resolver_git_set I, [2024-05-25T20:50:30.316749 #3793836] INFO -- : [212/883] 3835190=test_new I, [2024-05-25T20:50:30.321642 #3793836] INFO -- : [213/883] 3835190=test_cipher I, [2024-05-25T20:50:30.358559 #3793836] INFO -- : [214/883] 3835190=test_gem_security_signer I, [2024-05-25T20:50:30.420115 #3793836] INFO -- : [215/883] 3835190=test_debug I, [2024-05-25T20:50:30.424583 #3793836] INFO -- : [216/883] 3835190=test_memory_view I, [2024-05-25T20:50:30.446428 #3793836] INFO -- : [217/883] 3835190=pattern_test I, [2024-05-25T20:50:30.450530 #3793836] INFO -- : [218/883] 3835189=test_shellwords I, [2024-05-25T20:50:30.468323 #3793836] INFO -- : [219/883] 3835189=test_digest_extend I, [2024-05-25T20:50:30.475602 #3793836] INFO -- : [220/883] 3835189=test_string I, [2024-05-25T20:50:30.476973 #3793836] INFO -- : [221/883] 3835189=test_iterator I, [2024-05-25T20:50:30.480536 #3793836] INFO -- : [222/883] 3835200=test_omap I, [2024-05-25T20:50:30.484746 #3793836] INFO -- : [223/883] 3835200=parse_stream_test I, [2024-05-25T20:50:30.487639 #3793836] INFO -- : [224/883] 3835192=test_registry I, [2024-05-25T20:50:30.490151 #3793836] INFO -- : [225/883] 3835192=test_dns I, [2024-05-25T20:50:30.531665 #3793836] INFO -- : [226/883] 3835190=test_gem_commands_open_command I, [2024-05-25T20:50:30.536272 #3793836] INFO -- : [227/883] 3835189=test_ractor I, [2024-05-25T20:50:30.545771 #3793836] INFO -- : [228/883] 3835189=test_gem_source_lock I, [2024-05-25T20:50:30.562734 #3793836] INFO -- : [229/883] 3835200=test_gem I, [2024-05-25T20:50:30.599096 #3793836] INFO -- : [230/883] 3835189=test_cgi_core I, [2024-05-25T20:50:30.615252 #3793836] INFO -- : [231/883] 3835189=test_parser I, [2024-05-25T20:50:30.634437 #3793836] INFO -- : [232/883] 3835189=test_unicode_normalize I, [2024-05-25T20:50:30.639342 #3793836] INFO -- : [233/883] 3835190=test_marshal I, [2024-05-25T20:50:30.753035 #3793836] INFO -- : [234/883] 3835204=test_nonblock I, [2024-05-25T20:50:30.776236 #3793836] INFO -- : [235/883] 3835204=test_weakref I, [2024-05-25T20:50:30.845733 #3793836] INFO -- : [236/883] 3835204=test_alias I, [2024-05-25T20:50:30.944019 #3793836] INFO -- : [237/883] 3835204=test_timeout I, [2024-05-25T20:50:30.987295 #3793836] INFO -- : [238/883] 3835192=test_ancdata I, [2024-05-25T20:50:30.992927 #3793836] INFO -- : [239/883] 3835192=test_singleton_function I, [2024-05-25T20:50:30.996024 #3793836] INFO -- : [240/883] 3835192=test_rb_str_dup I, [2024-05-25T20:50:31.001967 #3793836] INFO -- : [241/883] 3835192=test_reline_key I, [2024-05-25T20:50:31.009045 #3793836] INFO -- : [242/883] 3835192=test_ssl I, [2024-05-25T20:50:31.042222 #3793836] INFO -- : [243/883] 3835191=test_ractor I, [2024-05-25T20:50:31.156842 #3793836] INFO -- : [244/883] 3835194=json_ext_parser_test I, [2024-05-25T20:50:31.161623 #3793836] INFO -- : [245/883] 3835194=test_thread I, [2024-05-25T20:50:31.197981 #3793836] INFO -- : [246/883] 3835190=test_my_integer I, [2024-05-25T20:50:31.198671 #3793836] INFO -- : [247/883] 3835190=test_rendering I, [2024-05-25T20:50:31.248902 #3793836] INFO -- : [248/883] 3835190=test_debugger_integration I, [2024-05-25T20:50:31.248959 #3793836] INFO -- : [249/883] 3835190=test_nextafter I, [2024-05-25T20:50:31.295987 #3793836] INFO -- : [250/883] 3835190=test_capacity I, [2024-05-25T20:50:31.298992 #3793836] INFO -- : [251/883] 3835191=test_gem_request_set_lockfile_tokenizer I, [2024-05-25T20:50:31.301840 #3793836] INFO -- : [252/883] 3835190=test_stat I, [2024-05-25T20:50:31.309547 #3793836] INFO -- : [253/883] 3835190=test_have_func I, [2024-05-25T20:50:31.348996 #3793836] INFO -- : [254/883] 3835191=test_gem_resolver_git_specification I, [2024-05-25T20:50:31.527495 #3793836] INFO -- : [255/883] 3835192=test_object_references I, [2024-05-25T20:50:31.543245 #3793836] INFO -- : [256/883] 3835192=test_usrmarshal I, [2024-05-25T20:50:31.557343 #3793836] INFO -- : [257/883] 3835202=test_cgi_modruby I, [2024-05-25T20:50:31.564066 #3793836] INFO -- : [258/883] 3835191=test_integer I, [2024-05-25T20:50:31.568041 #3793836] INFO -- : [259/883] 3835202=test_super I, [2024-05-25T20:50:31.663375 #3793836] INFO -- : [260/883] 3835195=test_rubyoptions I, [2024-05-25T20:50:31.682741 #3793836] INFO -- : [261/883] 3835198=test_https_proxy I, [2024-05-25T20:50:31.734679 #3793836] INFO -- : [262/883] 3835198=test_call I, [2024-05-25T20:50:31.762594 #3793836] INFO -- : [263/883] 3835192=test_rubygems I, [2024-05-25T20:50:31.844705 #3793836] INFO -- : [264/883] 3835204=test_gem_commands_setup_command I, [2024-05-25T20:50:31.877831 #3793836] INFO -- : [265/883] 3835196=test_rdoc_attr I, [2024-05-25T20:50:31.885806 #3793836] INFO -- : [266/883] 3835198=test_env I, [2024-05-25T20:50:31.891598 #3793836] INFO -- : [267/883] 3835196=desugar_compiler_test I, [2024-05-25T20:50:31.936915 #3793836] INFO -- : [268/883] 3835197=test_integer I, [2024-05-25T20:50:31.954504 #3793836] INFO -- : [269/883] 3835192=test_dryrun I, [2024-05-25T20:50:31.962372 #3793836] INFO -- : [270/883] 3835188=json_generic_object_test I, [2024-05-25T20:50:31.964116 #3793836] INFO -- : [271/883] 3835196=test_gem_source_fetch_problem I, [2024-05-25T20:50:31.974640 #3793836] INFO -- : [272/883] 3835196=test_http_request I, [2024-05-25T20:50:31.977403 #3793836] INFO -- : [273/883] 3835188=test_rdoc_generator_darkfish I, [2024-05-25T20:50:31.995165 #3793836] INFO -- : [274/883] 3835192=test_error_highlight I, [2024-05-25T20:50:31.999201 #3793836] INFO -- : [275/883] 3835197=test_resize I, [2024-05-25T20:50:32.000114 #3793836] INFO -- : [276/883] 3835197=test_rdoc_comment I, [2024-05-25T20:50:32.016155 #3793836] INFO -- : [277/883] 3835196=test_mailto I, [2024-05-25T20:50:32.029050 #3793836] INFO -- : [278/883] 3835196=test_coderange I, [2024-05-25T20:50:32.033773 #3793836] INFO -- : [279/883] 3835196=test_symbol I, [2024-05-25T20:50:32.042076 #3793836] INFO -- : [280/883] 3835196=location_test I, [2024-05-25T20:50:32.078306 #3793836] INFO -- : [281/883] 3835196=test_ractor_compatibility I, [2024-05-25T20:50:32.162406 #3793836] INFO -- : [282/883] 3835197=test_eval I, [2024-05-25T20:50:32.162771 #3793836] INFO -- : [283/883] 3835197=test_autoconf I, [2024-05-25T20:50:32.165032 #3793836] INFO -- : [284/883] 3835206=test_gem_console_ui I, [2024-05-25T20:50:32.169836 #3793836] INFO -- : [285/883] 3835197=test_date_ractor I, [2024-05-25T20:50:32.181588 #3793836] INFO -- : [286/883] 3835206=test_dir I, [2024-05-25T20:50:32.250636 #3793836] INFO -- : [287/883] 3835202=test_gem_commands_cleanup_command I, [2024-05-25T20:50:32.291424 #3793836] INFO -- : [288/883] 3835188=test_word I, [2024-05-25T20:50:32.293183 #3793836] INFO -- : [289/883] 3835188=test_cgi_multipart I, [2024-05-25T20:50:32.428757 #3793836] INFO -- : [290/883] 3835197=test_numeric I, [2024-05-25T20:50:32.446099 #3793836] INFO -- : [291/883] 3835204=test_member I, [2024-05-25T20:50:32.448133 #3793836] INFO -- : [292/883] 3835204=test_symbol I, [2024-05-25T20:50:32.450672 #3793836] INFO -- : [293/883] 3835206=test_coder I, [2024-05-25T20:50:32.451982 #3793836] INFO -- : [294/883] 3835197=test_nofree I, [2024-05-25T20:50:32.452296 #3793836] INFO -- : [295/883] 3835196=test_context I, [2024-05-25T20:50:32.453828 #3793836] INFO -- : [296/883] 3835188=test_gem_commands_pristine_command I, [2024-05-25T20:50:32.453878 #3793836] INFO -- : [297/883] 3835197=ruby_api_test I, [2024-05-25T20:50:32.464419 #3793836] INFO -- : [298/883] 3835206=test_find_executable I, [2024-05-25T20:50:32.470242 #3793836] INFO -- : [299/883] 3835206=test_lazy_enumerator I, [2024-05-25T20:50:32.537368 #3793836] INFO -- : [300/883] 3835192=test_enc_associate I, [2024-05-25T20:50:32.555460 #3793836] INFO -- : [301/883] 3835200=test_unix I, [2024-05-25T20:50:32.589114 #3793836] INFO -- : [302/883] 3835200=test_gem_resolver_requirement_list I, [2024-05-25T20:50:32.593997 #3793836] INFO -- : [303/883] 3835200=test_arith_seq_beg_len_step I, [2024-05-25T20:50:32.595698 #3793836] INFO -- : [304/883] 3835200=test_pkcs7 I, [2024-05-25T20:50:32.668229 #3793836] INFO -- : [305/883] 3835196=test_function_entry I, [2024-05-25T20:50:32.672180 #3793836] INFO -- : [306/883] 3835196=test_have_macro I, [2024-05-25T20:50:32.679540 #3793836] INFO -- : [307/883] 3835197=test_gem_package I, [2024-05-25T20:50:32.714580 #3793836] INFO -- : [308/883] 3835202=test_resolve_symbol I, [2024-05-25T20:50:32.766588 #3793836] INFO -- : [309/883] 3835200=test_complex2 I, [2024-05-25T20:50:32.771928 #3793836] INFO -- : [310/883] 3835200=test_threadgroup I, [2024-05-25T20:50:32.791141 #3793836] INFO -- : [311/883] 3835202=test_enum I, [2024-05-25T20:50:32.796478 #3793836] INFO -- : [312/883] 3835190=test_gem_specification I, [2024-05-25T20:50:32.880465 #3793836] INFO -- : [313/883] 3835206=test_win32ole_variable I, [2024-05-25T20:50:32.889858 #3793836] INFO -- : [314/883] 3835206=test_io_wait_uncommon I, [2024-05-25T20:50:32.899798 #3793836] INFO -- : [315/883] 3835206=test_stringio I, [2024-05-25T20:50:32.923877 #3793836] INFO -- : [316/883] 3835205=test_arity I, [2024-05-25T20:50:32.932387 #3793836] INFO -- : [317/883] 3835205=test_gem_ci_detector I, [2024-05-25T20:50:32.960176 #3793836] INFO -- : [318/883] 3835205=test_rdoc_class_module I, [2024-05-25T20:50:33.007876 #3793836] INFO -- : [319/883] 3835206=test_bignum I, [2024-05-25T20:50:33.065866 #3793836] INFO -- : [320/883] 3835192=test_rdoc_generator_json_index I, [2024-05-25T20:50:33.203422 #3793836] INFO -- : [321/883] 3835196=test_win32ole_event I, [2024-05-25T20:50:33.209923 #3793836] INFO -- : [322/883] 3835196=test_time_tz I, [2024-05-25T20:50:33.240453 #3793836] INFO -- : [323/883] 3835192=test_trace I, [2024-05-25T20:50:33.261944 #3793836] INFO -- : [324/883] 3835192=ractor_test I, [2024-05-25T20:50:33.271887 #3793836] INFO -- : [325/883] 3835197=test_gem_resolver_api_specification I, [2024-05-25T20:50:33.274801 #3793836] INFO -- : [326/883] 3835196=test_ipaddr I, [2024-05-25T20:50:33.301008 #3793836] INFO -- : [327/883] 3835196=test_rdoc_markup_to_ansi I, [2024-05-25T20:50:33.318891 #3793836] INFO -- : [328/883] 3835197=test_mixed_unicode_escapes I, [2024-05-25T20:50:33.322573 #3793836] INFO -- : [329/883] 3835197=test_history I, [2024-05-25T20:50:33.326374 #3793836] INFO -- : [330/883] 3835192=test_win32ole_variant I, [2024-05-25T20:50:33.332088 #3793836] INFO -- : [331/883] 3835192=test_rdoc_extend I, [2024-05-25T20:50:33.341001 #3793836] INFO -- : [332/883] 3835193=test_merge_keys I, [2024-05-25T20:50:33.345115 #3793836] INFO -- : [333/883] 3835196=test_arithmetic_sequence I, [2024-05-25T20:50:33.360253 #3793836] INFO -- : [334/883] 3835196=test_basicinstructions I, [2024-05-25T20:50:33.365344 #3793836] INFO -- : [335/883] 3835192=test_gem_gemcutter_utilities I, [2024-05-25T20:50:33.371523 #3793836] INFO -- : [336/883] 3835193=test_gem_command_manager I, [2024-05-25T20:50:33.395401 #3793836] INFO -- : [337/883] 3835197=test_key_actor_emacs I, [2024-05-25T20:50:33.442495 #3793836] INFO -- : [338/883] 3835196=version_test I, [2024-05-25T20:50:33.444462 #3793836] INFO -- : [339/883] 3835196=test_object I, [2024-05-25T20:50:33.450150 #3793836] INFO -- : [340/883] 3835196=heredoc_dedent_test I, [2024-05-25T20:50:33.457464 #3793836] INFO -- : [341/883] 3835196=test_cgi_header I, [2024-05-25T20:50:33.471714 #3793836] INFO -- : [342/883] 3835196=test_signedness I, [2024-05-25T20:50:33.480870 #3793836] INFO -- : [343/883] 3835205=test_tsort I, [2024-05-25T20:50:33.485613 #3793836] INFO -- : [344/883] 3835205=test_rdoc_rd_block_parser I, [2024-05-25T20:50:33.507369 #3793836] INFO -- : [345/883] 3835205=test_func I, [2024-05-25T20:50:33.518586 #3793836] INFO -- : [346/883] 3835189=test_big5 I, [2024-05-25T20:50:33.523113 #3793836] INFO -- : [347/883] 3835189=test_pointer I, [2024-05-25T20:50:33.533281 #3793836] INFO -- : [348/883] 3835197=test_ractor I, [2024-05-25T20:50:33.587518 #3793836] INFO -- : [349/883] 3835197=test_type I, [2024-05-25T20:50:33.593652 #3793836] INFO -- : [350/883] 3835197=test_sleep I, [2024-05-25T20:50:33.595171 #3793836] INFO -- : [351/883] 3835201=test_object I, [2024-05-25T20:50:33.637815 #3793836] INFO -- : [352/883] 3835202=test_ruby_lex I, [2024-05-25T20:50:33.710721 #3793836] INFO -- : [353/883] 3835192=test_date_arith I, [2024-05-25T20:50:33.715403 #3793836] INFO -- : [354/883] 3835193=test_gem_local_remote_options I, [2024-05-25T20:50:33.719008 #3793836] INFO -- : [355/883] 3835192=test_timeout I, [2024-05-25T20:50:33.725815 #3793836] INFO -- : [356/883] 3835192=test_ossl I, [2024-05-25T20:50:33.753819 #3793836] INFO -- : [357/883] 3835193=test_normalize I, [2024-05-25T20:50:33.754846 #3793836] INFO -- : [358/883] 3835193=test_change_word I, [2024-05-25T20:50:33.757375 #3793836] INFO -- : [359/883] 3835188=test_flip I, [2024-05-25T20:50:33.764035 #3793836] INFO -- : [360/883] 3835193=compiler_test I, [2024-05-25T20:50:33.774568 #3793836] INFO -- : [361/883] 3835200=test_keyword I, [2024-05-25T20:50:33.776928 #3793836] INFO -- : [362/883] 3835188=test_class_name_check I, [2024-05-25T20:50:33.786524 #3793836] INFO -- : [363/883] 3835191=test_fd_setsize I, [2024-05-25T20:50:33.789355 #3793836] INFO -- : [364/883] 3835191=test_continuation I, [2024-05-25T20:50:33.792028 #3793836] INFO -- : [365/883] 3835191=test_win32ole_method I, [2024-05-25T20:50:33.798623 #3793836] INFO -- : [366/883] 3835191=test_delete I, [2024-05-25T20:50:33.802039 #3793836] INFO -- : [367/883] 3835188=test_gem_platform I, [2024-05-25T20:50:33.804682 #3793836] INFO -- : [368/883] 3835191=test_placearg I, [2024-05-25T20:50:33.838769 #3793836] INFO -- : [369/883] 3835193=test_gem_package_task I, [2024-05-25T20:50:33.849661 #3793836] INFO -- : [370/883] 3835204=test_date_strptime I, [2024-05-25T20:50:33.855189 #3793836] INFO -- : [371/883] 3835193=test_rdoc_markup_hard_break I, [2024-05-25T20:50:33.856302 #3793836] INFO -- : [372/883] 3835188=test_gem_commands_push_command I, [2024-05-25T20:50:33.864183 #3793836] INFO -- : [373/883] 3835202=test_weakkeymap I, [2024-05-25T20:50:33.926342 #3793836] INFO -- : [374/883] 3835191=test_numhash I, [2024-05-25T20:50:33.929141 #3793836] INFO -- : [375/883] 3835204=test_pkey_rsa I, [2024-05-25T20:50:33.930062 #3793836] INFO -- : [376/883] 3835191=test_rdoc_parser_markdown I, [2024-05-25T20:50:33.949820 #3793836] INFO -- : [377/883] 3835191=test_not I, [2024-05-25T20:50:33.953312 #3793836] INFO -- : [378/883] 3835191=test_gem_resolver_lock_set I, [2024-05-25T20:50:33.970224 #3793836] INFO -- : [379/883] 3835193=test_import I, [2024-05-25T20:50:33.974298 #3793836] INFO -- : [380/883] 3835191=test_logger I, [2024-05-25T20:50:33.991392 #3793836] INFO -- : [381/883] 3835191=test_file_exhaustive I, [2024-05-25T20:50:34.024667 #3793836] INFO -- : [382/883] 3835201=test_files_test I, [2024-05-25T20:50:34.105464 #3793836] INFO -- : [383/883] 3835202=test_gem_update_suggestion I, [2024-05-25T20:50:34.135357 #3793836] INFO -- : [384/883] 3835201=json_generator_test I, [2024-05-25T20:50:34.147279 #3793836] INFO -- : [385/883] 3835202=test_eval I, [2024-05-25T20:50:34.177818 #3793836] INFO -- : [386/883] 3835204=test_transcode I, [2024-05-25T20:50:34.227107 #3793836] INFO -- : [387/883] 3835201=test_gem_resolver_api_set I, [2024-05-25T20:50:34.266988 #3793836] INFO -- : [388/883] 3835200=test_gem_safe_marshal I, [2024-05-25T20:50:34.279327 #3793836] INFO -- : [389/883] 3835188=test_enumerable I, [2024-05-25T20:50:34.281826 #3793836] INFO -- : [390/883] 3835188=test_config I, [2024-05-25T20:50:34.306203 #3793836] INFO -- : [391/883] 3835201=test_gem_resolver_vendor_set I, [2024-05-25T20:50:34.342461 #3793836] INFO -- : [392/883] 3835201=test_webauthn_listener I, [2024-05-25T20:50:34.350055 #3793836] INFO -- : [393/883] 3835202=test_helper I, [2024-05-25T20:50:34.352076 #3793836] INFO -- : [394/883] 3835202=test_random_formatter I, [2024-05-25T20:50:34.369522 #3793836] INFO -- : [395/883] 3835202=test_jaro_winkler I, [2024-05-25T20:50:34.376705 #3793836] INFO -- : [396/883] 3835202=test_lambda I, [2024-05-25T20:50:34.387219 #3793836] INFO -- : [397/883] 3835204=test_gem_request_set_gem_dependency_api I, [2024-05-25T20:50:34.393737 #3793836] INFO -- : [398/883] 3835201=test_ast I, [2024-05-25T20:50:34.445029 #3793836] INFO -- : [399/883] 3835193=test_update I, [2024-05-25T20:50:34.447950 #3793836] INFO -- : [400/883] 3835193=test_x509name I, [2024-05-25T20:50:34.456726 #3793836] INFO -- : [401/883] 3835202=test_fips I, [2024-05-25T20:50:34.463021 #3793836] INFO -- : [402/883] 3835193=test_x509store I, [2024-05-25T20:50:34.512763 #3793836] INFO -- : [403/883] 3835189=test_rdoc_code_object I, [2024-05-25T20:50:34.531162 #3793836] INFO -- : [404/883] 3835190=static_inspect_test I, [2024-05-25T20:50:34.536607 #3793836] INFO -- : [405/883] 3835190=test_udp I, [2024-05-25T20:50:34.543312 #3793836] INFO -- : [406/883] 3835190=bom_test I, [2024-05-25T20:50:34.550346 #3793836] INFO -- : [407/883] 3835190=test_data_error I, [2024-05-25T20:50:34.587220 #3793836] INFO -- : [408/883] 3835204=test_ostruct I, [2024-05-25T20:50:34.610159 #3793836] INFO -- : [409/883] 3835190=unescape_test I, [2024-05-25T20:50:34.676576 #3793836] INFO -- : [410/883] 3835202=test_file I, [2024-05-25T20:50:34.690246 #3793836] INFO -- : [411/883] 3835193=test_force_exit I, [2024-05-25T20:50:34.725490 #3793836] INFO -- : [412/883] 3835205=test_tmpdir I, [2024-05-25T20:50:34.753511 #3793836] INFO -- : [413/883] 3835188=test_integer_comb I, [2024-05-25T20:50:34.759389 #3793836] INFO -- : [414/883] 3835204=test_rdoc_markup_document I, [2024-05-25T20:50:34.777275 #3793836] INFO -- : [415/883] 3835193=test_vm_dump I, [2024-05-25T20:50:34.777390 #3793836] INFO -- : [416/883] 3835193=errors_test I, [2024-05-25T20:50:34.817034 #3793836] INFO -- : [417/883] 3835205=test_regexp I, [2024-05-25T20:50:34.818150 #3793836] INFO -- : [418/883] 3835200=test_gem_commands_check_command I, [2024-05-25T20:50:34.837782 #3793836] INFO -- : [419/883] 3835200=test_ensured I, [2024-05-25T20:50:34.865660 #3793836] INFO -- : [420/883] 3835193=test_addr I, [2024-05-25T20:50:34.870452 #3793836] INFO -- : [421/883] 3835198=test_locale I, [2024-05-25T20:50:34.884988 #3793836] INFO -- : [422/883] 3835204=library_symbols_test I, [2024-05-25T20:50:34.887446 #3793836] INFO -- : [423/883] 3835193=test_ts I, [2024-05-25T20:50:34.892541 #3793836] INFO -- : [424/883] 3835198=test_rdoc_ri_paths I, [2024-05-25T20:50:34.897155 #3793836] INFO -- : [425/883] 3835200=test_range I, [2024-05-25T20:50:34.908059 #3793836] INFO -- : [426/883] 3835198=test_project_sanity I, [2024-05-25T20:50:34.951575 #3793836] INFO -- : [427/883] 3835204=command_line_test I, [2024-05-25T20:50:34.954075 #3793836] INFO -- : [428/883] 3835204=test_dup I, [2024-05-25T20:50:34.956619 #3793836] INFO -- : [429/883] 3835198=test_pty I, [2024-05-25T20:50:35.101750 #3793836] INFO -- : [430/883] 3835189=test_constant I, [2024-05-25T20:50:35.125260 #3793836] INFO -- : [431/883] 3835204=test_helper I, [2024-05-25T20:50:35.135881 #3793836] INFO -- : [432/883] 3835204=test_erb_command I, [2024-05-25T20:50:35.179410 #3793836] INFO -- : [433/883] 3835204=test_encoding I, [2024-05-25T20:50:35.381732 #3793836] INFO -- : [434/883] 3835204=test_gem_uri_formatter I, [2024-05-25T20:50:35.397311 #3793836] INFO -- : [435/883] 3835193=test_pipe I, [2024-05-25T20:50:35.404591 #3793836] INFO -- : [436/883] 3835204=test_thread I, [2024-05-25T20:50:35.412124 #3793836] INFO -- : [437/883] 3835204=test_trick I, [2024-05-25T20:50:35.466042 #3793836] INFO -- : [438/883] 3835196=test_pkey_ec I, [2024-05-25T20:50:35.466750 #3793836] INFO -- : [439/883] 3835198=test_date_parse I, [2024-05-25T20:50:35.473291 #3793836] INFO -- : [440/883] 3835190=test_rdoc_markup_attributes I, [2024-05-25T20:50:35.477786 #3793836] INFO -- : [441/883] 3835190=test_win32ole_type I, [2024-05-25T20:50:35.479931 #3793836] INFO -- : [442/883] 3835190=test_null I, [2024-05-25T20:50:35.484283 #3793836] INFO -- : [443/883] 3835190=test_mul I, [2024-05-25T20:50:35.491832 #3793836] INFO -- : [444/883] 3835190=test_rdoc_rd_inline_parser I, [2024-05-25T20:50:35.521062 #3793836] INFO -- : [445/883] 3835193=test_rdoc_markup_to_rdoc I, [2024-05-25T20:50:35.526998 #3793836] INFO -- : [446/883] 3835190=test_default_gems I, [2024-05-25T20:50:35.541554 #3793836] INFO -- : [447/883] 3835196=test_gem_uninstaller I, [2024-05-25T20:50:35.548259 #3793836] INFO -- : [448/883] 3835193=test_svcb_https I, [2024-05-25T20:50:35.554289 #3793836] INFO -- : [449/883] 3835193=test_buffering I, [2024-05-25T20:50:35.559293 #3793836] INFO -- : [450/883] 3835193=test_gb18030 I, [2024-05-25T20:50:35.562471 #3793836] INFO -- : [451/883] 3835198=test_time I, [2024-05-25T20:50:35.568203 #3793836] INFO -- : [452/883] 3835193=test_windows_1251 I, [2024-05-25T20:50:35.574343 #3793836] INFO -- : [453/883] 3835193=test_rdoc_rdoc I, [2024-05-25T20:50:35.579053 #3793836] INFO -- : [454/883] 3835190=test_backtrace I, [2024-05-25T20:50:35.584806 #3793836] INFO -- : [455/883] 3835190=test_defined I, [2024-05-25T20:50:35.596819 #3793836] INFO -- : [456/883] 3835200=test_key_name_check I, [2024-05-25T20:50:35.606171 #3793836] INFO -- : [457/883] 3835200=test_io_buffer I, [2024-05-25T20:50:35.638080 #3793836] INFO -- : [458/883] 3835200=test_rdoc_i18n_text I, [2024-05-25T20:50:35.646290 #3793836] INFO -- : [459/883] 3835200=test_folderitem2_invokeverb I, [2024-05-25T20:50:35.647224 #3793836] INFO -- : [460/883] 3835200=test_require_path_check I, [2024-05-25T20:50:35.663924 #3793836] INFO -- : [461/883] 3835190=test_rdoc_markup_parser I, [2024-05-25T20:50:35.665741 #3793836] INFO -- : [462/883] 3835198=test_fnmatch I, [2024-05-25T20:50:35.669811 #3793836] INFO -- : [463/883] 3835193=test_files_test_2 I, [2024-05-25T20:50:35.709904 #3793836] INFO -- : [464/883] 3835190=test_gem_validator I, [2024-05-25T20:50:35.710666 #3793836] INFO -- : [465/883] 3835200=test_string I, [2024-05-25T20:50:35.725046 #3793836] INFO -- : [466/883] 3835198=test_proc I, [2024-05-25T20:50:35.730726 #3793836] INFO -- : [467/883] 3835190=test_gc_compact I, [2024-05-25T20:50:35.948187 #3793836] INFO -- : [468/883] 3835206=test_gem_resolver_index_set I, [2024-05-25T20:50:35.976218 #3793836] INFO -- : [469/883] 3835206=test_gem_package_old I, [2024-05-25T20:50:36.021817 #3793836] INFO -- : [470/883] 3835206=test_cgi_tag_helper I, [2024-05-25T20:50:36.045256 #3793836] INFO -- : [471/883] 3835206=test_zlib I, [2024-05-25T20:50:36.409444 #3793836] INFO -- : [472/883] 3835198=test_egrep_cpp I, [2024-05-25T20:50:36.529505 #3793836] INFO -- : [473/883] 3835198=test_erb_m17n I, [2024-05-25T20:50:36.536611 #3793836] INFO -- : [474/883] 3835198=test_ole_methods I, [2024-05-25T20:50:36.540870 #3793836] INFO -- : [475/883] 3835198=test_optimization I, [2024-05-25T20:50:36.639630 #3793836] INFO -- : [476/883] 3835196=test_date_conv I, [2024-05-25T20:50:36.645417 #3793836] INFO -- : [477/883] 3835196=test_qsort I, [2024-05-25T20:50:36.645983 #3793836] INFO -- : [478/883] 3835196=test_rdoc_parser I, [2024-05-25T20:50:36.667017 #3793836] INFO -- : [479/883] 3835196=test_gem_dependency_resolution_error I, [2024-05-25T20:50:36.673372 #3793836] INFO -- : [480/883] 3835196=json_addition_test I, [2024-05-25T20:50:36.691119 #3793836] INFO -- : [481/883] 3835196=test_custom_command I, [2024-05-25T20:50:36.697319 #3793836] INFO -- : [482/883] 3835196=test_rdoc_store I, [2024-05-25T20:50:36.802918 #3793836] INFO -- : [483/883] 3835188=test_gem_request_set_lockfile_parser I, [2024-05-25T20:50:36.871373 #3793836] INFO -- : [484/883] 3835203=test_depth_first I, [2024-05-25T20:50:36.875589 #3793836] INFO -- : [485/883] 3835203=test_x509attr I, [2024-05-25T20:50:36.877281 #3793836] INFO -- : [486/883] 3835188=test_raise I, [2024-05-25T20:50:36.879614 #3793836] INFO -- : [487/883] 3835203=test_pattern_matching I, [2024-05-25T20:50:36.886014 #3793836] INFO -- : [488/883] 3835188=test_rdoc_stats I, [2024-05-25T20:50:36.905893 #3793836] INFO -- : [489/883] 3835188=test_string I, [2024-05-25T20:50:36.930208 #3793836] INFO -- : [490/883] 3835203=test_gem_command I, [2024-05-25T20:50:36.931734 #3793836] INFO -- : [491/883] 3835188=test_bug-3571 I, [2024-05-25T20:50:36.944639 #3793836] INFO -- : [492/883] 3835188=test_key_actor_vi I, [2024-05-25T20:50:37.013426 #3793836] INFO -- : [493/883] 3835203=test_common I, [2024-05-25T20:50:37.076391 #3793836] INFO -- : [494/883] 3835188=test_gem_spec_fetcher I, [2024-05-25T20:50:37.122066 #3793836] INFO -- : [495/883] 3835199=test_numeric I, [2024-05-25T20:50:37.186603 #3793836] INFO -- : [496/883] 3835203=test_ifunless I, [2024-05-25T20:50:37.186673 #3793836] INFO -- : [497/883] 3835203=test_assignment I, [2024-05-25T20:50:37.202872 #3793836] INFO -- : [498/883] 3835199=test_gem_commands_lock_command I, [2024-05-25T20:50:37.208277 #3793836] INFO -- : [499/883] 3835188=test_rdoc_tom_doc I, [2024-05-25T20:50:37.221766 #3793836] INFO -- : [500/883] 3835188=test_rdoc_markup_to_tt_only I, [2024-05-25T20:50:37.232134 #3793836] INFO -- : [501/883] 3835199=test_hmac I, [2024-05-25T20:50:37.235991 #3793836] INFO -- : [502/883] 3835199=test_exception I, [2024-05-25T20:50:37.243973 #3793836] INFO -- : [503/883] 3835188=test_zsh_completion I, [2024-05-25T20:50:37.257152 #3793836] INFO -- : [504/883] 3835199=test_iter_break I, [2024-05-25T20:50:37.259613 #3793836] INFO -- : [505/883] 3835199=test_verbose I, [2024-05-25T20:50:37.264059 #3793836] INFO -- : [506/883] 3835188=test_rdoc_single_class I, [2024-05-25T20:50:37.266096 #3793836] INFO -- : [507/883] 3835188=test_nil I, [2024-05-25T20:50:37.269944 #3793836] INFO -- : [508/883] 3835188=test_num2int I, [2024-05-25T20:50:37.283661 #3793836] INFO -- : [509/883] 3835199=test_macro I, [2024-05-25T20:50:37.289075 #3793836] INFO -- : [510/883] 3835188=test_pp I, [2024-05-25T20:50:37.320167 #3793836] INFO -- : [511/883] 3835199=test_gem_ext_configure_builder I, [2024-05-25T20:50:37.323360 #3793836] INFO -- : [512/883] 3835196=test_frozen I, [2024-05-25T20:50:37.325368 #3793836] INFO -- : [513/883] 3835196=test_gem_source_list I, [2024-05-25T20:50:37.329699 #3793836] INFO -- : [514/883] 3835188=test_optarg I, [2024-05-25T20:50:37.357437 #3793836] INFO -- : [515/883] 3835199=test_yaml_special_cases I, [2024-05-25T20:50:37.365964 #3793836] INFO -- : [516/883] 3835199=test_config I, [2024-05-25T20:50:37.369014 #3793836] INFO -- : [517/883] 3835196=test_rdoc_token_stream I, [2024-05-25T20:50:37.375311 #3793836] INFO -- : [518/883] 3835196=test_address_resolve I, [2024-05-25T20:50:37.388419 #3793836] INFO -- : [519/883] 3835196=test_kernel I, [2024-05-25T20:50:37.397785 #3793836] INFO -- : [520/883] 3835204=dispatcher_test I, [2024-05-25T20:50:37.414157 #3793836] INFO -- : [521/883] 3835199=test_eval_history I, [2024-05-25T20:50:37.423418 #3793836] INFO -- : [522/883] 3835204=test_gem_doctor I, [2024-05-25T20:50:37.458263 #3793836] INFO -- : [523/883] 3835199=test_kdf I, [2024-05-25T20:50:37.459160 #3793836] INFO -- : [524/883] 3835204=test_emitter I, [2024-05-25T20:50:37.466253 #3793836] INFO -- : [525/883] 3835204=test_gem_silent_ui I, [2024-05-25T20:50:37.470733 #3793836] INFO -- : [526/883] 3835188=test_files_ext I, [2024-05-25T20:50:37.471230 #3793836] INFO -- : [527/883] 3835188=test_bug-5832 I, [2024-05-25T20:50:37.477381 #3793836] INFO -- : [528/883] 3835188=test_command I, [2024-05-25T20:50:37.511596 #3793836] INFO -- : [529/883] 3835204=test_at_exit I, [2024-05-25T20:50:37.524607 #3793836] INFO -- : [530/883] 3835204=test_date I, [2024-05-25T20:50:37.526896 #3793836] INFO -- : [531/883] 3835204=test_gem_rdoc I, [2024-05-25T20:50:37.527711 #3793836] INFO -- : [532/883] 3835189=test_gem_ext_cargo_builder_unit I, [2024-05-25T20:50:37.530731 #3793836] INFO -- : [533/883] 3835199=test_object_create_start I, [2024-05-25T20:50:37.535814 #3793836] INFO -- : [534/883] 3835199=test_psych I, [2024-05-25T20:50:37.550868 #3793836] INFO -- : [535/883] 3835199=test_enc_raise I, [2024-05-25T20:50:37.555608 #3793836] INFO -- : [536/883] 3835189=!Nothing_to_test I, [2024-05-25T20:50:37.557429 #3793836] INFO -- : [537/883] 3835189=test_rdoc_markup_paragraph I, [2024-05-25T20:50:37.558124 #3793836] INFO -- : [538/883] 3835199=test_name_error I, [2024-05-25T20:50:37.565695 #3793836] INFO -- : [539/883] 3835189=test_rdoc_markup_attribute_manager I, [2024-05-25T20:50:37.597963 #3793836] INFO -- : [540/883] 3835189=test_gem_commands_dependency_command I, [2024-05-25T20:50:37.650401 #3793836] INFO -- : [541/883] 3835189=test_safe_load I, [2024-05-25T20:50:37.655845 #3793836] INFO -- : [542/883] 3835204=test_gem_resolver_composed_set I, [2024-05-25T20:50:37.659088 #3793836] INFO -- : [543/883] 3835199=test_gem_resolver I, [2024-05-25T20:50:37.661553 #3793836] INFO -- : [544/883] 3835189=test_gem_commands_specification_command I, [2024-05-25T20:50:37.672577 #3793836] INFO -- : [545/883] 3835204=test_shift_jis I, [2024-05-25T20:50:37.675793 #3793836] INFO -- : [546/883] 3835204=test_gem_commands_which_command I, [2024-05-25T20:50:37.714154 #3793836] INFO -- : [547/883] 3835204=test_http I, [2024-05-25T20:50:37.731444 #3793836] INFO -- : [548/883] 3835189=test_enumerator I, [2024-05-25T20:50:37.738872 #3793836] INFO -- : [549/883] 3835204=test_inadvertent_creation I, [2024-05-25T20:50:37.783125 #3793836] INFO -- : [550/883] 3835188=test_flags I, [2024-05-25T20:50:37.830390 #3793836] INFO -- : [551/883] 3835196=test_gem_safe_yaml I, [2024-05-25T20:50:37.834596 #3793836] INFO -- : [552/883] 3835196=test_syntax I, [2024-05-25T20:50:37.856807 #3793836] INFO -- : [553/883] 3835204=index_write_test I, [2024-05-25T20:50:37.887703 #3793836] INFO -- : [554/883] 3835204=test_date_new I, [2024-05-25T20:50:37.895392 #3793836] INFO -- : [555/883] 3835204=test_data I, [2024-05-25T20:50:37.899546 #3793836] INFO -- : [556/883] 3835199=test_rdoc_markup_to_joined_paragraph I, [2024-05-25T20:50:37.906750 #3793836] INFO -- : [557/883] 3835204=test_date_time I, [2024-05-25T20:50:37.920269 #3793836] INFO -- : [558/883] 3835204=test_require I, [2024-05-25T20:50:37.924395 #3793836] INFO -- : [559/883] 3835204=test_iso_8859 I, [2024-05-25T20:50:37.964074 #3793836] INFO -- : [560/883] 3835204=test_tcp I, [2024-05-25T20:50:37.973056 #3793836] INFO -- : [561/883] 3835190=test_rdoc_text I, [2024-05-25T20:50:37.979026 #3793836] INFO -- : [562/883] 3835204=test_rdoc_context I, [2024-05-25T20:50:38.006896 #3793836] INFO -- : [563/883] 3835190=test_stream I, [2024-05-25T20:50:38.014232 #3793836] INFO -- : [564/883] 3835190=test_nil2vtempty I, [2024-05-25T20:50:38.017414 #3793836] INFO -- : [565/883] 3835190=test_httpresponse I, [2024-05-25T20:50:38.035960 #3793836] INFO -- : [566/883] 3835199=test_open-uri I, [2024-05-25T20:50:38.120667 #3793836] INFO -- : [567/883] 3835190=test_rdoc_parser_ruby I, [2024-05-25T20:50:38.226527 #3793836] INFO -- : [568/883] 3835193=test_passing_block I, [2024-05-25T20:50:38.228745 #3793836] INFO -- : [569/883] 3835193=test_thread_fd_close I, [2024-05-25T20:50:38.232540 #3793836] INFO -- : [570/883] 3835193=test_uncorrectable_name_check I, [2024-05-25T20:50:38.236394 #3793836] INFO -- : [571/883] 3835193=newline_test I, [2024-05-25T20:50:38.298873 #3793836] INFO -- : [572/883] 3835199=test_hash_create I, [2024-05-25T20:50:38.300582 #3793836] INFO -- : [573/883] 3835199=test_stringchar I, [2024-05-25T20:50:38.334433 #3793836] INFO -- : [574/883] 3835193=test_io_console I, [2024-05-25T20:50:38.368052 #3793836] INFO -- : [575/883] 3835199=test_singleton I, [2024-05-25T20:50:38.392236 #3793836] INFO -- : [576/883] 3835199=test_flush I, [2024-05-25T20:50:38.394521 #3793836] INFO -- : [577/883] 3835199=test_switch_hitter I, [2024-05-25T20:50:38.408042 #3793836] INFO -- : [578/883] 3835199=test_securerandom I, [2024-05-25T20:50:38.445465 #3793836] INFO -- : [579/883] 3835199=test_rdoc_normal_module I, [2024-05-25T20:50:38.461509 #3793836] INFO -- : [580/883] 3835206=test_c_union_entity I, [2024-05-25T20:50:38.520142 #3793836] INFO -- : [581/883] 3835206=test_rdoc_markdown_test I, [2024-05-25T20:50:38.540699 #3793836] INFO -- : [582/883] 3835199=test_logperiod I, [2024-05-25T20:50:38.551235 #3793836] INFO -- : [583/883] 3835199=test_err_in_callback I, [2024-05-25T20:50:38.553360 #3793836] INFO -- : [584/883] 3835199=test_gem_resolver_lock_specification I, [2024-05-25T20:50:38.595605 #3793836] INFO -- : [585/883] 3835197=test_gc I, [2024-05-25T20:50:38.598347 #3793836] INFO -- : [586/883] 3835199=test_x509cert I, [2024-05-25T20:50:38.677078 #3793836] INFO -- : [587/883] 3835188=test_gem_ext_rake_builder I, [2024-05-25T20:50:38.736995 #3793836] INFO -- : [588/883] 3835190=test_arity I, [2024-05-25T20:50:38.742269 #3793836] INFO -- : [589/883] 3835190=test_logdevice I, [2024-05-25T20:50:38.892527 #3793836] INFO -- : [590/883] 3835204=test_gem_security_policy I, [2024-05-25T20:50:38.902024 #3793836] INFO -- : [591/883] 3835199=test_gem_source_local I, [2024-05-25T20:50:38.952002 #3793836] INFO -- : [592/883] 3835203=test_process I, [2024-05-25T20:50:39.165888 #3793836] INFO -- : [593/883] 3835199=test_last_thread I, [2024-05-25T20:50:39.227859 #3793836] INFO -- : [594/883] 3835204=test_pack I, [2024-05-25T20:50:39.368287 #3793836] INFO -- : [595/883] 3835188=test_rdoc_generator_pot_po I, [2024-05-25T20:50:39.375675 #3793836] INFO -- : [596/883] 3835188=test_ansi_with_terminfo I, [2024-05-25T20:50:39.376704 #3793836] INFO -- : [597/883] 3835188=test_json_tree I, [2024-05-25T20:50:39.382414 #3793836] INFO -- : [598/883] 3835188=test_rdoc_markup_to_markdown I, [2024-05-25T20:50:39.426801 #3793836] INFO -- : [599/883] 3835188=test_m17n_comb I, [2024-05-25T20:50:39.489872 #3793836] INFO -- : [600/883] 3835204=test_memory_view I, [2024-05-25T20:50:39.572919 #3793836] INFO -- : [601/883] 3835190=test_ractor I, [2024-05-25T20:50:39.634607 #3793836] INFO -- : [602/883] 3835191=test_cclass I, [2024-05-25T20:50:39.638374 #3793836] INFO -- : [603/883] 3835204=test_gem_request_connection_pools I, [2024-05-25T20:50:39.640160 #3793836] INFO -- : [604/883] 3835190=test_gem_version_option I, [2024-05-25T20:50:39.703858 #3793836] INFO -- : [605/883] 3835191=test_grapheme_breaks I, [2024-05-25T20:50:39.717156 #3793836] INFO -- : [606/883] 3835190=test_pkey I, [2024-05-25T20:50:39.729655 #3793836] INFO -- : [607/883] 3835191=test_case I, [2024-05-25T20:50:39.731122 #3793836] INFO -- : [608/883] 3835191=test_reline I, [2024-05-25T20:50:39.766128 #3793836] INFO -- : [609/883] 3835190=test_parser_events I, [2024-05-25T20:50:39.838285 #3793836] INFO -- : [610/883] 3835190=test_rdoc_markup_to_table_of_contents I, [2024-05-25T20:50:39.838592 #3793836] INFO -- : [611/883] 3835194=test_socket I, [2024-05-25T20:50:39.865824 #3793836] INFO -- : [612/883] 3835190=test_thread I, [2024-05-25T20:50:40.017723 #3793836] INFO -- : [613/883] 3835206=test_objectspace I, [2024-05-25T20:50:40.027827 #3793836] INFO -- : [614/883] 3835191=test_literal I, [2024-05-25T20:50:40.087506 #3793836] INFO -- : [615/883] 3835190=test_str2big I, [2024-05-25T20:50:40.090920 #3793836] INFO -- : [616/883] 3835190=test_c_struct_builder I, [2024-05-25T20:50:40.214250 #3793836] INFO -- : [617/883] 3835190=test_dot_dot I, [2024-05-25T20:50:40.218770 #3793836] INFO -- : [618/883] 3835190=test_gem_stream_ui I, [2024-05-25T20:50:40.239248 #3793836] INFO -- : [619/883] 3835199=test_extlibs I, [2024-05-25T20:50:40.282302 #3793836] INFO -- : [620/883] 3835190=test_rdoc_generator_ri I, [2024-05-25T20:50:40.286473 #3793836] INFO -- : [621/883] 3835190=test_severity I, [2024-05-25T20:50:40.294063 #3793836] INFO -- : [622/883] 3835190=test_ractor I, [2024-05-25T20:50:40.312009 #3793836] INFO -- : [623/883] 3835190=test_require_lib I, [2024-05-25T20:50:40.493999 #3793836] INFO -- : [624/883] 3835191=parse_test I, [2024-05-25T20:50:40.574279 #3793836] INFO -- : [625/883] 3835195=test_gem_install_update_options I, [2024-05-25T20:50:40.670368 #3793836] INFO -- : [626/883] 3835204=test_bug_reporter I, [2024-05-25T20:50:40.675893 #3793836] INFO -- : [627/883] 3835195=test_rand I, [2024-05-25T20:50:40.743264 #3793836] INFO -- : [628/883] 3835202=test_gem_name_tuple I, [2024-05-25T20:50:40.762272 #3793836] INFO -- : [629/883] 3835202=test_gem_package_tar_reader_entry I, [2024-05-25T20:50:40.799639 #3793836] INFO -- : [630/883] 3835206=test_exception I, [2024-05-25T20:50:40.947350 #3793836] INFO -- : [631/883] 3835195=test_case_options I, [2024-05-25T20:50:40.951902 #3793836] INFO -- : [632/883] 3835195=test_store I, [2024-05-25T20:50:40.967773 #3793836] INFO -- : [633/883] 3835202=test_rdoc_cross_reference I, [2024-05-25T20:50:41.054568 #3793836] INFO -- : [634/883] 3835204=test_scalar I, [2024-05-25T20:50:41.058924 #3793836] INFO -- : [635/883] 3835204=test_gem_dependency_installer I, [2024-05-25T20:50:41.064699 #3793836] INFO -- : [636/883] 3835193=test_gem_commands_info_command I, [2024-05-25T20:50:41.084330 #3793836] INFO -- : [637/883] 3835194=test_enumerator_kw I, [2024-05-25T20:50:41.087555 #3793836] INFO -- : [638/883] 3835193=test_settracefunc I, [2024-05-25T20:50:41.100252 #3793836] INFO -- : [639/883] 3835194=test_gem_text I, [2024-05-25T20:50:41.144474 #3793836] INFO -- : [640/883] 3835195=test_generic I, [2024-05-25T20:50:41.178478 #3793836] INFO -- : [641/883] 3835195=test_win32ole I, [2024-05-25T20:50:41.184402 #3793836] INFO -- : [642/883] 3835195=test_scan_args I, [2024-05-25T20:50:41.196118 #3793836] INFO -- : [643/883] 3835195=test_gem_request I, [2024-05-25T20:50:41.351048 #3793836] INFO -- : [644/883] 3835195=test_method_cache I, [2024-05-25T20:50:41.358181 #3793836] INFO -- : [645/883] 3835195=test_sprintf_comb I, [2024-05-25T20:50:41.365622 #3793836] INFO -- : [646/883] 3835194=test_gem_commands_mirror I, [2024-05-25T20:50:41.371240 #3793836] INFO -- : [647/883] 3835194=test_gem_ext_cargo_builder_link_flag_converter I, [2024-05-25T20:50:41.436386 #3793836] INFO -- : [648/883] 3835194=test_wss I, [2024-05-25T20:50:41.459496 #3793836] INFO -- : [649/883] 3835194=test_fiddle I, [2024-05-25T20:50:41.484348 #3793836] INFO -- : [650/883] 3835202=test_find I, [2024-05-25T20:50:41.508911 #3793836] INFO -- : [651/883] 3835202=test_ractor I, [2024-05-25T20:50:41.511902 #3793836] INFO -- : [652/883] 3835195=test_digest I, [2024-05-25T20:50:41.516820 #3793836] INFO -- : [653/883] 3835194=test_marshalable I, [2024-05-25T20:50:41.541505 #3793836] INFO -- : [654/883] 3835194=test_require I, [2024-05-25T20:50:41.675116 #3793836] INFO -- : [655/883] 3835188=test_cgi_util I, [2024-05-25T20:50:41.727054 #3793836] INFO -- : [656/883] 3835202=test_gem_commands_contents_command I, [2024-05-25T20:50:41.849740 #3793836] INFO -- : [657/883] 3835202=test_gem_ext_cmake_builder I, [2024-05-25T20:50:41.884776 #3793836] INFO -- : [658/883] 3835188=test_bash_completion I, [2024-05-25T20:50:41.891801 #3793836] INFO -- : [659/883] 3835188=test_formatter I, [2024-05-25T20:50:41.899954 #3793836] INFO -- : [660/883] 3835188=test_rdoc_constant I, [2024-05-25T20:50:41.907217 #3793836] INFO -- : [661/883] 3835202=test_deprecate I, [2024-05-25T20:50:41.934299 #3793836] INFO -- : [662/883] 3835202=test_recorder I, [2024-05-25T20:50:41.941188 #3793836] INFO -- : [663/883] 3835202=test_gem_commands_owner_command I, [2024-05-25T20:50:42.020341 #3793836] INFO -- : [664/883] 3835188=test_gem_source_vendor I, [2024-05-25T20:50:42.041337 #3793836] INFO -- : [665/883] 3835199=test_pathname I, [2024-05-25T20:50:42.046350 #3793836] INFO -- : [666/883] 3835188=test_init I, [2024-05-25T20:50:42.195300 #3793836] INFO -- : [667/883] 3835193=test_complexrational I, [2024-05-25T20:50:42.199369 #3793836] INFO -- : [668/883] 3835193=test_gem_package_tar_reader I, [2024-05-25T20:50:42.247572 #3793836] INFO -- : [669/883] 3835193=regexp_test I, [2024-05-25T20:50:42.260396 #3793836] INFO -- : [670/883] 3835193=test_coverage I, [2024-05-25T20:50:42.293111 #3793836] INFO -- : [671/883] 3835199=test_rdoc_encoding I, [2024-05-25T20:50:42.325008 #3793836] INFO -- : [672/883] 3835199=test_file I, [2024-05-25T20:50:42.327096 #3793836] INFO -- : [673/883] 3835199=test_modify_expand I, [2024-05-25T20:50:42.332886 #3793836] INFO -- : [674/883] 3835199=test_rdoc_any_method I, [2024-05-25T20:50:42.347753 #3793836] INFO -- : [675/883] 3835188=test_gem_available_set I, [2024-05-25T20:50:42.384302 #3793836] INFO -- : [676/883] 3835192=test_rdoc_markdown I, [2024-05-25T20:50:42.433339 #3793836] INFO -- : [677/883] 3835195=test_rdoc_markup_formatter I, [2024-05-25T20:50:42.470064 #3793836] INFO -- : [678/883] 3835188=test_thread_queue I, [2024-05-25T20:50:42.528051 #3793836] INFO -- : [679/883] 3835202=test_nowrite I, [2024-05-25T20:50:42.554656 #3793836] INFO -- : [680/883] 3835202=test_ansi_without_terminfo I, [2024-05-25T20:50:42.559749 #3793836] INFO -- : [681/883] 3835195=test_gem_commands_sources_command I, [2024-05-25T20:50:42.567936 #3793836] INFO -- : [682/883] 3835202=test_euc_tw I, [2024-05-25T20:50:42.579000 #3793836] INFO -- : [683/883] 3835202=test_ractor I, [2024-05-25T20:50:42.595879 #3793836] INFO -- : [684/883] 3835202=test_bmethod I, [2024-05-25T20:50:42.602178 #3793836] INFO -- : [685/883] 3835202=test_big2str I, [2024-05-25T20:50:42.608065 #3793836] INFO -- : [686/883] 3835202=test_handle I, [2024-05-25T20:50:42.711277 #3793836] INFO -- : [687/883] 3835195=test_wait I, [2024-05-25T20:50:42.712176 #3793836] INFO -- : [688/883] 3835199=test_forwardable I, [2024-05-25T20:50:42.752056 #3793836] INFO -- : [689/883] 3835199=test_yaml I, [2024-05-25T20:50:42.757499 #3793836] INFO -- : [690/883] 3835192=test_enc_str_buf_cat I, [2024-05-25T20:50:42.764319 #3793836] INFO -- : [691/883] 3835192=test_class2name I, [2024-05-25T20:50:42.770132 #3793836] INFO -- : [692/883] 3835192=test_gbk I, [2024-05-25T20:50:42.778765 #3793836] INFO -- : [693/883] 3835192=test_profile_frames I, [2024-05-25T20:50:42.781232 #3793836] INFO -- : [694/883] 3835195=test_cstr I, [2024-05-25T20:50:42.836678 #3793836] INFO -- : [695/883] 3835199=test_pstore I, [2024-05-25T20:50:42.848274 #3793836] INFO -- : [696/883] 3835194=json_fixtures_test I, [2024-05-25T20:50:42.855849 #3793836] INFO -- : [697/883] 3835194=test_shapes I, [2024-05-25T20:50:42.862484 #3793836] INFO -- : [698/883] 3835194=test_io_timeout I, [2024-05-25T20:50:42.866376 #3793836] INFO -- : [699/883] 3835194=test_rdoc_parser_c I, [2024-05-25T20:50:42.898277 #3793836] INFO -- : [700/883] 3835199=test_comparable I, [2024-05-25T20:50:42.902726 #3793836] INFO -- : [701/883] 3835199=test_cesu8 I, [2024-05-25T20:50:42.912952 #3793836] INFO -- : [702/883] 3835199=test_econv I, [2024-05-25T20:50:42.978408 #3793836] INFO -- : [703/883] 3835192=test_rdoc_options I, [2024-05-25T20:50:43.015517 #3793836] INFO -- : [704/883] 3835202=test_gem_version I, [2024-05-25T20:50:43.103744 #3793836] INFO -- : [705/883] 3835202=test_ldap I, [2024-05-25T20:50:43.122547 #3793836] INFO -- : [706/883] 3835202=test_gem_commands_signin_command I, [2024-05-25T20:50:43.216537 #3793836] INFO -- : [707/883] 3835193=test_resource I, [2024-05-25T20:50:43.224765 #3793836] INFO -- : [708/883] 3835193=test_emitter I, [2024-05-25T20:50:43.227588 #3793836] INFO -- : [709/883] 3835202=test_fileutils I, [2024-05-25T20:50:43.241232 #3793836] INFO -- : [710/883] 3835192=test_string_processing I, [2024-05-25T20:50:43.246299 #3793836] INFO -- : [711/883] 3835192=test_gem_commands_list_command I, [2024-05-25T20:50:43.249726 #3793836] INFO -- : [712/883] 3835193=test_stack I, [2024-05-25T20:50:43.259217 #3793836] INFO -- : [713/883] 3835192=test_rdoc_include I, [2024-05-25T20:50:43.294290 #3793836] INFO -- : [714/883] 3835192=test_reqarg I, [2024-05-25T20:50:43.297850 #3793836] INFO -- : [715/883] 3835194=test_too_many_dummy_encodings I, [2024-05-25T20:50:43.310845 #3793836] INFO -- : [716/883] 3835195=test_gem_remote_fetcher I, [2024-05-25T20:50:43.340345 #3793836] INFO -- : [717/883] 3835206=test_parse I, [2024-05-25T20:50:43.364947 #3793836] INFO -- : [718/883] 3835194=test_mdns I, [2024-05-25T20:50:43.385629 #3793836] INFO -- : [719/883] 3835194=test_gem_resolver_installed_specification I, [2024-05-25T20:50:43.413982 #3793836] INFO -- : [720/883] 3835194=test_scanner_events I, [2024-05-25T20:50:43.451451 #3793836] INFO -- : [721/883] 3835194=test_complex I, [2024-05-25T20:50:43.566276 #3793836] INFO -- : [722/883] 3835198=test_gem_commands_search_command I, [2024-05-25T20:50:43.571697 #3793836] INFO -- : [723/883] 3835198=test_frozen_error I, [2024-05-25T20:50:43.575512 #3793836] INFO -- : [724/883] 3835198=test_gem_stub_specification I, [2024-05-25T20:50:43.589950 #3793836] INFO -- : [725/883] 3835194=test_method_cache I, [2024-05-25T20:50:43.594296 #3793836] INFO -- : [726/883] 3835194=test_gem_ext_ext_conf_builder I, [2024-05-25T20:50:43.629292 #3793836] INFO -- : [727/883] 3835202=test_path_to_class I, [2024-05-25T20:50:43.630951 #3793836] INFO -- : [728/883] 3835204=test_gem_dependency I, [2024-05-25T20:50:43.632429 #3793836] INFO -- : [729/883] 3835202=test_gem_resolver_specification I, [2024-05-25T20:50:43.670493 #3793836] INFO -- : [730/883] 3835202=test_rdoc_markup_verbatim I, [2024-05-25T20:50:43.674914 #3793836] INFO -- : [731/883] 3835202=test_inlinecache I, [2024-05-25T20:50:43.709575 #3793836] INFO -- : [732/883] 3835192=test_asn1 I, [2024-05-25T20:50:43.728440 #3793836] INFO -- : [733/883] 3835192=test_random I, [2024-05-25T20:50:43.729927 #3793836] INFO -- : [734/883] 3835192=test_load I, [2024-05-25T20:50:43.737732 #3793836] INFO -- : [735/883] 3835192=json_string_matching_test I, [2024-05-25T20:50:43.738279 #3793836] INFO -- : [736/883] 3835202=test_const I, [2024-05-25T20:50:43.741584 #3793836] INFO -- : [737/883] 3835192=test_rdoc_normal_class I, [2024-05-25T20:50:43.744858 #3793836] INFO -- : [738/883] 3835202=test_class I, [2024-05-25T20:50:43.745868 #3793836] INFO -- : [739/883] 3835204=test_irb I, [2024-05-25T20:50:43.786256 #3793836] INFO -- : [740/883] 3835191=test_date_strftime I, [2024-05-25T20:50:43.801556 #3793836] INFO -- : [741/883] 3835198=test_rdoc_parser_rd I, [2024-05-25T20:50:43.840046 #3793836] INFO -- : [742/883] 3835192=test_gem_installer I, [2024-05-25T20:50:43.867579 #3793836] INFO -- : [743/883] 3835198=test_yamlstore I, [2024-05-25T20:50:43.880800 #3793836] INFO -- : [744/883] 3835198=test_prettyprint I, [2024-05-25T20:50:43.912115 #3793836] INFO -- : [745/883] 3835198=test_tracepoint I, [2024-05-25T20:50:43.967375 #3793836] INFO -- : [746/883] 3835206=test_rdoc_markup I, [2024-05-25T20:50:43.974291 #3793836] INFO -- : [747/883] 3835206=test_gem_commands_help_command I, [2024-05-25T20:50:43.985224 #3793836] INFO -- : [748/883] 3835199=test_duplicate I, [2024-05-25T20:50:43.991913 #3793836] INFO -- : [749/883] 3835199=test_basicsocket I, [2024-05-25T20:50:44.000142 #3793836] INFO -- : [750/883] 3835199=test_utf32 I, [2024-05-25T20:50:44.005829 #3793836] INFO -- : [751/883] 3835199=test_gem_resolver_index_specification I, [2024-05-25T20:50:44.006786 #3793836] INFO -- : [752/883] 3835204=test_internal_ivar I, [2024-05-25T20:50:44.010592 #3793836] INFO -- : [753/883] 3835204=test_queue I, [2024-05-25T20:50:44.014072 #3793836] INFO -- : [754/883] 3835204=test_function I, [2024-05-25T20:50:44.046148 #3793836] INFO -- : [755/883] 3835206=test_noarg I, [2024-05-25T20:50:44.049213 #3793836] INFO -- : [756/883] 3835199=parse_comments_test I, [2024-05-25T20:50:44.054173 #3793836] INFO -- : [757/883] 3835190=test_tempfile I, [2024-05-25T20:50:44.109960 #3793836] INFO -- : [758/883] 3835199=test_gem_unsatisfiable_dependency_error I, [2024-05-25T20:50:44.121443 #3793836] INFO -- : [759/883] 3835199=test_win32ole_record I, [2024-05-25T20:50:44.124088 #3793836] INFO -- : [760/883] 3835193=test_cp949 I, [2024-05-25T20:50:44.124793 #3793836] INFO -- : [761/883] 3835199=test_condition I, [2024-05-25T20:50:44.126958 #3793836] INFO -- : [762/883] 3835193=test_foreach I, [2024-05-25T20:50:44.128605 #3793836] INFO -- : [763/883] 3835199=test_gem_source_specific_file I, [2024-05-25T20:50:44.130704 #3793836] INFO -- : [764/883] 3835193=test_gem_commands_uninstall_command I, [2024-05-25T20:50:44.186351 #3793836] INFO -- : [765/883] 3835191=test_io I, [2024-05-25T20:50:44.195937 #3793836] INFO -- : [766/883] 3835198=test_emoji I, [2024-05-25T20:50:44.197718 #3793836] INFO -- : [767/883] 3835199=test_win32ole_type_event I, [2024-05-25T20:50:44.204710 #3793836] INFO -- : [768/883] 3835199=test_sorted_set I, [2024-05-25T20:50:44.215123 #3793836] INFO -- : [769/883] 3835198=test_hash I, [2024-05-25T20:50:44.241781 #3793836] INFO -- : [770/883] 3835204=test_ubf_async_safe I, [2024-05-25T20:50:44.253467 #3793836] INFO -- : [771/883] 3835204=test_gem_commands_exec_command I, [2024-05-25T20:50:44.260266 #3793836] INFO -- : [772/883] 3835206=test_io_wait I, [2024-05-25T20:50:44.332744 #3793836] INFO -- : [773/883] 3835190=test_kwargs I, [2024-05-25T20:50:44.337294 #3793836] INFO -- : [774/883] 3835190=warnings_test I, [2024-05-25T20:50:44.354775 #3793836] INFO -- : [775/883] 3835190=test_ellipsize I, [2024-05-25T20:50:44.363905 #3793836] INFO -- : [776/883] 3835187=test_date_attr I, [2024-05-25T20:50:44.366357 #3793836] INFO -- : [777/883] 3835187=test_console_attr I, [2024-05-25T20:50:44.369818 #3793836] INFO -- : [778/883] 3835187=test_summary I, [2024-05-25T20:50:44.371496 #3793836] INFO -- : [779/883] 3835190=test_type_completor I, [2024-05-25T20:50:44.376876 #3793836] INFO -- : [780/883] 3835190=test_euc_kr I, [2024-05-25T20:50:44.386176 #3793836] INFO -- : [781/883] 3835190=test_rdoc_context_section I, [2024-05-25T20:50:44.391427 #3793836] INFO -- : [782/883] 3835190=test_ftp I, [2024-05-25T20:50:44.397306 #3793836] INFO -- : [783/883] 3835190=test_gem_impossible_dependencies_error I, [2024-05-25T20:50:44.403422 #3793836] INFO -- : [784/883] 3835190=test_pack I, [2024-05-25T20:50:44.408435 #3793836] INFO -- : [785/883] 3835191=test_array_create I, [2024-05-25T20:50:44.408942 #3793836] INFO -- : [786/883] 3835191=test_to_ruby I, [2024-05-25T20:50:44.417358 #3793836] INFO -- : [787/883] 3835199=test_pattern_key_name_check I, [2024-05-25T20:50:44.423584 #3793836] INFO -- : [788/883] 3835191=test_rdoc_rubygems_hook I, [2024-05-25T20:50:44.424393 #3793836] INFO -- : [789/883] 3835199=test_method I, [2024-05-25T20:50:44.483806 #3793836] INFO -- : [790/883] 3835187=test_gem_commands_query_command I, [2024-05-25T20:50:44.517526 #3793836] INFO -- : [791/883] 3835191=test_gem_commands_stale_command I, [2024-05-25T20:50:44.531142 #3793836] INFO -- : [792/883] 3835191=test_lock_native_thread I, [2024-05-25T20:50:44.583321 #3793836] INFO -- : [793/883] 3835190=test_c_struct_entry I, [2024-05-25T20:50:44.597776 #3793836] INFO -- : [794/883] 3835206=test_have_library I, [2024-05-25T20:50:44.805107 #3793836] INFO -- : [795/883] 3835191=test_remote_fetch_error I, [2024-05-25T20:50:44.818955 #3793836] INFO -- : [796/883] 3835191=test_show_source I, [2024-05-25T20:50:44.866850 #3793836] INFO -- : [797/883] 3835194=test_set I, [2024-05-25T20:50:44.874194 #3793836] INFO -- : [798/883] 3835191=test_gem_security_trust_dir I, [2024-05-25T20:50:44.879132 #3793836] INFO -- : [799/883] 3835194=test_string_memory I, [2024-05-25T20:50:44.913397 #3793836] INFO -- : [800/883] 3835191=test_gem_requirement I, [2024-05-25T20:50:44.930659 #3793836] INFO -- : [801/883] 3835194=test_sprintf I, [2024-05-25T20:50:44.935387 #3793836] INFO -- : [802/883] 3835193=comments_test I, [2024-05-25T20:50:44.939989 #3793836] INFO -- : [803/883] 3835193=ripper_test I, [2024-05-25T20:50:44.955281 #3793836] INFO -- : [804/883] 3835197=test_objspace I, [2024-05-25T20:50:45.031263 #3793836] INFO -- : [805/883] 3835191=test_line_editor I, [2024-05-25T20:50:45.058011 #3793836] INFO -- : [806/883] 3835191=test_undef I, [2024-05-25T20:50:45.062307 #3793836] INFO -- : [807/883] 3835191=test_argf I, [2024-05-25T20:50:45.119205 #3793836] INFO -- : [808/883] 3835190=test_framework I, [2024-05-25T20:50:45.120789 #3793836] INFO -- : [809/883] 3835190=test_ns_spki I, [2024-05-25T20:50:45.145500 #3793836] INFO -- : [810/883] 3835190=test_kill_ring I, [2024-05-25T20:50:45.147987 #3793836] INFO -- : [811/883] 3835194=test_weakmap I, [2024-05-25T20:50:45.167830 #3793836] INFO -- : [812/883] 3835190=test_workspace I, [2024-05-25T20:50:45.184437 #3793836] INFO -- : [813/883] 3835204=test_yjit I, [2024-05-25T20:50:45.189385 #3793836] INFO -- : [814/883] 3835204=test_ws I, [2024-05-25T20:50:45.200503 #3793836] INFO -- : [815/883] 3835204=test_m17n I, [2024-05-25T20:50:45.280900 #3793836] INFO -- : [816/883] 3835204=test_gem_commands_environment_command I, [2024-05-25T20:50:45.338554 #3793836] INFO -- : [817/883] 3835204=test_hash I, [2024-05-25T20:50:45.357043 #3793836] INFO -- : [818/883] 3835187=test_gem_resolver_dependency_request I, [2024-05-25T20:50:45.357629 #3793836] INFO -- : [819/883] 3835204=test_tree_builder I, [2024-05-25T20:50:45.364161 #3793836] INFO -- : [820/883] 3835204=test_external_new I, [2024-05-25T20:50:45.384639 #3793836] INFO -- : [821/883] 3835204=test_alias_and_anchor I, [2024-05-25T20:50:45.384961 #3793836] INFO -- : [822/883] 3835187=test_postponed_job I, [2024-05-25T20:50:45.393083 #3793836] INFO -- : [823/883] 3835204=test_raise_exception I, [2024-05-25T20:50:45.398663 #3793836] INFO -- : [824/883] 3835190=test_gem_request_set_lockfile I, [2024-05-25T20:50:45.414630 #3793836] INFO -- : [825/883] 3835193=test_win32ole_typelib I, [2024-05-25T20:50:45.418779 #3793836] INFO -- : [826/883] 3835193=test_protect I, [2024-05-25T20:50:45.424962 #3793836] INFO -- : [827/883] 3835195=test_clone I, [2024-05-25T20:50:45.429945 #3793836] INFO -- : [828/883] 3835193=test_gem_commands_install_command I, [2024-05-25T20:50:45.658112 #3793836] INFO -- : [829/883] 3835195=test_readpartial I, [2024-05-25T20:50:45.756134 #3793836] INFO -- : [830/883] 3835187=locals_test I, [2024-05-25T20:50:45.772369 #3793836] INFO -- : [831/883] 3835190=test_rdoc_require I, [2024-05-25T20:50:45.787627 #3793836] INFO -- : [832/883] 3835190=test_rdoc_markup_indented_paragraph I, [2024-05-25T20:50:45.798577 #3793836] INFO -- : [833/883] 3835190=test_io_buffer I, [2024-05-25T20:50:45.817200 #3793836] INFO -- : [834/883] 3835206=ruby_parser_test I, [2024-05-25T20:50:45.820514 #3793836] INFO -- : [835/883] 3835206=test_pack I, [2024-05-25T20:50:45.832139 #3793836] INFO -- : [836/883] 3835196=test_backtrace I, [2024-05-25T20:50:45.850663 #3793836] INFO -- : [837/883] 3835206=test_gem_resolver_conflict I, [2024-05-25T20:50:45.866268 #3793836] INFO -- : [838/883] 3835206=test_rdoc_task I, [2024-05-25T20:50:45.870620 #3793836] INFO -- : [839/883] 3835206=test_convertible I, [2024-05-25T20:50:45.903547 #3793836] INFO -- : [840/883] 3835190=parser_test I, [2024-05-25T20:50:45.907947 #3793836] INFO -- : [841/883] 3835190=test_rdoc_alias I, [2024-05-25T20:50:45.921867 #3793836] INFO -- : [842/883] 3835190=test_yield I, [2024-05-25T20:50:46.059616 #3793836] INFO -- : [843/883] 3835195=test_stringscanner I, [2024-05-25T20:50:46.102201 #3793836] INFO -- : [844/883] 3835195=test_files_sample I, [2024-05-25T20:50:46.205399 #3793836] INFO -- : [845/883] 3835204=test_rat I, [2024-05-25T20:50:46.217554 #3793836] INFO -- : [846/883] 3835204=test_webauthn_poller I, [2024-05-25T20:50:46.258137 #3793836] INFO -- : [847/883] 3835187=test_rdoc_markup_raw I, [2024-05-25T20:50:46.259226 #3793836] INFO -- : [848/883] 3835195=test_rdoc_markup_to_html_crossref I, [2024-05-25T20:50:46.371013 #3793836] INFO -- : [849/883] 3835204=test_typeddata I, [2024-05-25T20:50:46.434291 #3793836] INFO -- : [850/883] 3835187=test_gem_resolver_best_set I, [2024-05-25T20:50:46.514511 #3793836] INFO -- : [851/883] 3835187=encoding_test I, [2024-05-25T20:50:46.626334 #3793836] INFO -- : [852/883] 3835187=test_fstring I, [2024-05-25T20:50:46.634731 #3793836] INFO -- : [853/883] 3835204=test_array I, [2024-05-25T20:50:46.643352 #3793836] INFO -- : [854/883] 3835204=test_optparse I, [2024-05-25T20:50:46.687577 #3793836] INFO -- : [855/883] 3835195=test_yjit_exit_locations I, [2024-05-25T20:50:46.692962 #3793836] INFO -- : [856/883] 3835195=test_etc I, [2024-05-25T20:50:46.715562 #3793836] INFO -- : [857/883] 3835204=test_gem_config_file I, [2024-05-25T20:50:46.775195 #3793836] INFO -- : [858/883] 3835187=test_ripper I, [2024-05-25T20:50:46.779598 #3793836] INFO -- : [859/883] 3835202=test_protocol I, [2024-05-25T20:50:46.791227 #3793836] INFO -- : [860/883] 3835195=test_getopts I, [2024-05-25T20:50:46.794396 #3793836] INFO -- : [861/883] 3835195=test_gem_resolver_activation_request I, [2024-05-25T20:50:46.806162 #3793836] INFO -- : [862/883] 3835195=test_bigzero I, [2024-05-25T20:50:46.811460 #3793836] INFO -- : [863/883] 3835195=test_pkey_dh I, [2024-05-25T20:50:46.847944 #3793836] INFO -- : [864/883] 3835193=test_gem_package_tar_header I, [2024-05-25T20:50:46.892369 #3793836] INFO -- : [865/883] 3835195=test_iseq_load I, [2024-05-25T20:50:46.894375 #3793836] INFO -- : [866/883] 3835204=test_gem_util I, [2024-05-25T20:50:46.901777 #3793836] INFO -- : [867/883] 3835193=test_system I, [2024-05-25T20:50:46.971671 #3793836] INFO -- : [868/883] 3835188=test_pkcs12 I, [2024-05-25T20:50:47.067980 #3793836] INFO -- : [869/883] 3835204=test_case I, [2024-05-25T20:50:47.091926 #3793836] INFO -- : [870/883] 3835204=test_sizeof I, [2024-05-25T20:50:47.097840 #3793836] INFO -- : [871/883] 3835202=test_face I, [2024-05-25T20:50:47.109681 #3793836] INFO -- : [872/883] 3835202=test_rendering I, [2024-05-25T20:50:47.121677 #3793836] INFO -- : [873/883] 3835202=test_autoload I, [2024-05-25T20:50:47.214104 #3793836] INFO -- : [874/883] 3835187=test_utf16 I, [2024-05-25T20:50:47.228175 #3793836] INFO -- : [875/883] 3835187=test_io I, [2024-05-25T20:50:47.266852 #3793836] INFO -- : [876/883] 3835196=test_unicode_escape I, [2024-05-25T20:50:47.371143 #3793836] INFO -- : [877/883] 3835196=test_libs I, [2024-05-25T20:50:47.386010 #3793836] INFO -- : [878/883] 3835196=test_gc I, [2024-05-25T20:50:47.388375 #3793836] INFO -- : [879/883] 3835196=test_math I, [2024-05-25T20:50:47.400773 #3793836] INFO -- : [880/883] 3835196=test_gem_commands_fetch_command I, [2024-05-25T20:50:47.538226 #3793836] INFO -- : [881/883] 3835196=test_sleep I, [2024-05-25T20:50:47.554848 #3793836] INFO -- : [882/883] 3835188=test_config I, [2024-05-25T20:50:47.599330 #3793836] INFO -- : [883/883] 3835188=test_yaml_tree I, [2024-05-25T20:51:04.417912 #3793836] INFO -- : Finished tests in 37.220838s, 709.0114 tests/s, 251318.1982 assertions/s. I, [2024-05-25T20:51:04.418704 #3793836] INFO -- : 26390 tests, 9354274 assertions, 0 failures, 0 errors, 306 skips I, [2024-05-25T20:51:04.418733 #3793836] INFO -- : I, [2024-05-25T20:51:04.418741 #3793836] INFO -- : ruby -v: ruby 3.4.0dev (2024-05-25T17:47:07Z master d2c4363e0c) [x86_64-linux] I, [2024-05-25T20:51:04.421077 #3793836] INFO -- : $$$[end] "make yes-test-all TESTOPTS='--stderr-on-failure' TESTS='-j20'" exit with 0. I, [2024-05-25T20:51:04.421224 #3793836] INFO -- : $$$[beg] make yes-test-rubyspec MSPECOPT='--error-output stderr --debug -j' TESTS='-j20' I, [2024-05-25T20:51:04.507337 #3793836] INFO -- : BASERUBY = /usr/bin/ruby --disable=gems I, [2024-05-25T20:51:04.507373 #3793836] INFO -- : CC = gcc I, [2024-05-25T20:51:04.507378 #3793836] INFO -- : LD = ld I, [2024-05-25T20:51:04.507383 #3793836] INFO -- : LDSHARED = gcc -shared I, [2024-05-25T20:51:04.507387 #3793836] INFO -- : CFLAGS = -O3 -fno-fast-math -ggdb3 -Wall -Wextra -Wdeprecated-declarations -Wdiv-by-zero -Wduplicated-cond -Wimplicit-function-declaration -Wimplicit-int -Wpointer-arith -Wwrite-strings -Wold-style-definition -Wimplicit-fallthrough=0 -Wmissing-noreturn -Wno-cast-function-type -Wno-constant-logical-operand -Wno-long-long -Wno-missing-field-initializers -Wno-overlength-strings -Wno-packed-bitfield-compat -Wno-parentheses-equality -Wno-self-assign -Wno-tautological-compare -Wno-unused-parameter -Wno-unused-value -Wsuggest-attribute=format -Wsuggest-attribute=noreturn -Wunused-variable -Wmisleading-indentation -Wundef -fPIC I, [2024-05-25T20:51:04.507392 #3793836] INFO -- : XCFLAGS = -U_FORTIFY_SOURCE -D_FORTIFY_SOURCE=2 -fstack-protector-strong -fno-strict-overflow -fvisibility=hidden -fexcess-precision=standard -DRUBY_EXPORT -I. -I.ext/include/x86_64-linux -I/tmp/ruby/src/trunk/include -I/tmp/ruby/src/trunk -I/tmp/ruby/src/trunk/prism -I/tmp/ruby/src/trunk/enc/unicode/15.0.0 I, [2024-05-25T20:51:04.507396 #3793836] INFO -- : CPPFLAGS = I, [2024-05-25T20:51:04.507400 #3793836] INFO -- : DLDFLAGS = -Wl,--compress-debug-sections=zlib -Wl,-soname,libruby.so.3.4 -fstack-protector-strong I, [2024-05-25T20:51:04.507404 #3793836] INFO -- : SOLIBS = -lz -lrt -lrt -lgmp -ldl -lcrypt -lm -lpthread I, [2024-05-25T20:51:04.507408 #3793836] INFO -- : LANG = en_US.UTF-8 I, [2024-05-25T20:51:04.507416 #3793836] INFO -- : LC_ALL = I, [2024-05-25T20:51:04.507420 #3793836] INFO -- : LC_CTYPE = I, [2024-05-25T20:51:04.507424 #3793836] INFO -- : MFLAGS = I, [2024-05-25T20:51:04.507427 #3793836] INFO -- : RUSTC = no I, [2024-05-25T20:51:04.507431 #3793836] INFO -- : YJIT_RUSTC_ARGS = --crate-name=yjit --crate-type=staticlib --edition=2021 -g -C lto=thin -C opt-level=3 -C overflow-checks=on '--out-dir=/tmp/ruby/build/trunk/yjit/target/release/' /tmp/ruby/src/trunk/yjit/src/lib.rs I, [2024-05-25T20:51:04.507946 #3793836] INFO -- : gcc (Ubuntu 11.4.0-1ubuntu1~22.04) 11.4.0 I, [2024-05-25T20:51:04.507969 #3793836] INFO -- : Copyright (C) 2021 Free Software Foundation, Inc. I, [2024-05-25T20:51:04.507975 #3793836] INFO -- : This is free software; see the source for copying conditions. There is NO I, [2024-05-25T20:51:04.507981 #3793836] INFO -- : warranty; not even for MERCHANTABILITY or FITNESS FOR A PARTICULAR PURPOSE. I, [2024-05-25T20:51:04.507985 #3793836] INFO -- : I, [2024-05-25T20:51:04.509719 #3793836] INFO -- : generating enc.mk I, [2024-05-25T20:51:04.631206 #3793836] INFO -- : generating encdb.h I, [2024-05-25T20:51:04.655266 #3793836] INFO -- : encdb.h unchanged I, [2024-05-25T20:51:04.656193 #3793836] INFO -- : making enc I, [2024-05-25T20:51:04.673640 #3793836] INFO -- : make[1]: Entering directory '/tmp/ruby/build/trunk' I, [2024-05-25T20:51:04.673663 #3793836] INFO -- : make[1]: Nothing to be done for 'enc'. I, [2024-05-25T20:51:04.673679 #3793836] INFO -- : make[1]: Leaving directory '/tmp/ruby/build/trunk' I, [2024-05-25T20:51:04.674406 #3793836] INFO -- : making srcs under enc I, [2024-05-25T20:51:04.705636 #3793836] INFO -- : make[1]: Entering directory '/tmp/ruby/build/trunk' I, [2024-05-25T20:51:04.705657 #3793836] INFO -- : make[1]: Nothing to be done for 'srcs'. I, [2024-05-25T20:51:04.705662 #3793836] INFO -- : make[1]: Leaving directory '/tmp/ruby/build/trunk' I, [2024-05-25T20:51:04.706635 #3793836] INFO -- : generating transdb.h I, [2024-05-25T20:51:04.808873 #3793836] INFO -- : transdb.h unchanged I, [2024-05-25T20:51:04.810296 #3793836] INFO -- : making trans I, [2024-05-25T20:51:04.844282 #3793836] INFO -- : make[1]: Entering directory '/tmp/ruby/build/trunk' I, [2024-05-25T20:51:04.844303 #3793836] INFO -- : make[1]: Nothing to be done for 'trans'. I, [2024-05-25T20:51:04.844309 #3793836] INFO -- : make[1]: Leaving directory '/tmp/ruby/build/trunk' I, [2024-05-25T20:51:04.845080 #3793836] INFO -- : making encs I, [2024-05-25T20:51:04.881613 #3793836] INFO -- : make[1]: Entering directory '/tmp/ruby/build/trunk' I, [2024-05-25T20:51:04.881634 #3793836] INFO -- : make[1]: Nothing to be done for 'encs'. I, [2024-05-25T20:51:04.881639 #3793836] INFO -- : make[1]: Leaving directory '/tmp/ruby/build/trunk' I, [2024-05-25T20:51:04.883431 #3793836] INFO -- : generating makefiles ext/configure-ext.mk I, [2024-05-25T20:51:04.911941 #3793836] INFO -- : ext/configure-ext.mk updated I, [2024-05-25T20:51:04.914325 #3793836] INFO -- : make[1]: Entering directory '/tmp/ruby/build/trunk' I, [2024-05-25T20:51:06.314934 #3793836] INFO -- : make[1]: Leaving directory '/tmp/ruby/build/trunk' I, [2024-05-25T20:51:06.315824 #3793836] INFO -- : generating makefile exts.mk I, [2024-05-25T20:51:06.352869 #3793836] INFO -- : exts.mk unchanged I, [2024-05-25T20:51:06.358012 #3793836] INFO -- : make[1]: Entering directory '/tmp/ruby/build/trunk' I, [2024-05-25T20:51:06.685554 #3793836] INFO -- : make[2]: Entering directory '/tmp/ruby/build/trunk/ext/coverage' I, [2024-05-25T20:51:06.690277 #3793836] INFO -- : make[2]: Leaving directory '/tmp/ruby/build/trunk/ext/coverage' I, [2024-05-25T20:51:06.697163 #3793836] INFO -- : make[2]: Entering directory '/tmp/ruby/build/trunk/ext/date' I, [2024-05-25T20:51:06.702317 #3793836] INFO -- : make[2]: Leaving directory '/tmp/ruby/build/trunk/ext/date' I, [2024-05-25T20:51:06.706116 #3793836] INFO -- : make[2]: Entering directory '/tmp/ruby/build/trunk/ext/digest' I, [2024-05-25T20:51:06.715005 #3793836] INFO -- : make[2]: Leaving directory '/tmp/ruby/build/trunk/ext/digest' I, [2024-05-25T20:51:06.741210 #3793836] INFO -- : make[2]: Entering directory '/tmp/ruby/build/trunk/ext/digest/sha2' I, [2024-05-25T20:51:06.746120 #3793836] INFO -- : make[2]: Leaving directory '/tmp/ruby/build/trunk/ext/digest/sha2' I, [2024-05-25T20:51:06.767659 #3793836] INFO -- : make[2]: Entering directory '/tmp/ruby/build/trunk/ext/fiddle' I, [2024-05-25T20:51:06.778430 #3793836] INFO -- : make[2]: Leaving directory '/tmp/ruby/build/trunk/ext/fiddle' I, [2024-05-25T20:51:06.783477 #3793836] INFO -- : make[2]: Entering directory '/tmp/ruby/build/trunk/ext/io/console' I, [2024-05-25T20:51:06.787654 #3793836] INFO -- : make[2]: Leaving directory '/tmp/ruby/build/trunk/ext/io/console' I, [2024-05-25T20:51:06.800498 #3793836] INFO -- : make[2]: Entering directory '/tmp/ruby/build/trunk/ext/json' I, [2024-05-25T20:51:06.811044 #3793836] INFO -- : make[2]: Leaving directory '/tmp/ruby/build/trunk/ext/json' I, [2024-05-25T20:51:06.826315 #3793836] INFO -- : make[2]: Entering directory '/tmp/ruby/build/trunk/ext/monitor' I, [2024-05-25T20:51:06.830380 #3793836] INFO -- : make[2]: Leaving directory '/tmp/ruby/build/trunk/ext/monitor' I, [2024-05-25T20:51:06.837483 #3793836] INFO -- : make[2]: Entering directory '/tmp/ruby/build/trunk/ext/objspace' I, [2024-05-25T20:51:06.843843 #3793836] INFO -- : make[2]: Leaving directory '/tmp/ruby/build/trunk/ext/objspace' I, [2024-05-25T20:51:06.860699 #3793836] INFO -- : make[2]: Entering directory '/tmp/ruby/build/trunk/ext/openssl' I, [2024-05-25T20:51:06.874917 #3793836] INFO -- : make[2]: Leaving directory '/tmp/ruby/build/trunk/ext/openssl' I, [2024-05-25T20:51:06.879457 #3793836] INFO -- : make[2]: Entering directory '/tmp/ruby/build/trunk/ext/pathname' I, [2024-05-25T20:51:06.883515 #3793836] INFO -- : make[2]: Leaving directory '/tmp/ruby/build/trunk/ext/pathname' I, [2024-05-25T20:51:06.890667 #3793836] INFO -- : make[2]: Entering directory '/tmp/ruby/build/trunk/ext/psych' I, [2024-05-25T20:51:06.913877 #3793836] INFO -- : make[2]: Leaving directory '/tmp/ruby/build/trunk/ext/psych' I, [2024-05-25T20:51:06.917663 #3793836] INFO -- : make[2]: Entering directory '/tmp/ruby/build/trunk/ext/pty' I, [2024-05-25T20:51:06.921516 #3793836] INFO -- : make[2]: Leaving directory '/tmp/ruby/build/trunk/ext/pty' I, [2024-05-25T20:51:06.937570 #3793836] INFO -- : make[2]: Entering directory '/tmp/ruby/build/trunk/ext/ripper' I, [2024-05-25T20:51:06.945595 #3793836] INFO -- : make[2]: Leaving directory '/tmp/ruby/build/trunk/ext/ripper' I, [2024-05-25T20:51:06.948064 #3793836] INFO -- : make[2]: Entering directory '/tmp/ruby/build/trunk/ext/rubyvm' I, [2024-05-25T20:51:06.951395 #3793836] INFO -- : make[2]: Leaving directory '/tmp/ruby/build/trunk/ext/rubyvm' I, [2024-05-25T20:51:06.962493 #3793836] INFO -- : make[2]: Entering directory '/tmp/ruby/build/trunk/ext/socket' I, [2024-05-25T20:51:06.969674 #3793836] INFO -- : make[2]: Leaving directory '/tmp/ruby/build/trunk/ext/socket' I, [2024-05-25T20:51:06.986934 #3793836] INFO -- : make[2]: Entering directory '/tmp/ruby/build/trunk/.bundle/gems/bigdecimal-3.1.8/ext/bigdecimal' I, [2024-05-25T20:51:07.013087 #3793836] INFO -- : make[2]: Leaving directory '/tmp/ruby/build/trunk/.bundle/gems/bigdecimal-3.1.8/ext/bigdecimal' I, [2024-05-25T20:51:07.015040 #3793836] INFO -- : make[2]: Entering directory '/tmp/ruby/build/trunk/.bundle/gems/debug-1.9.2/ext/debug' I, [2024-05-25T20:51:07.036849 #3793836] INFO -- : make[2]: Leaving directory '/tmp/ruby/build/trunk/.bundle/gems/debug-1.9.2/ext/debug' I, [2024-05-25T20:51:07.038709 #3793836] INFO -- : make[2]: Entering directory '/tmp/ruby/build/trunk/.bundle/gems/nkf-0.2.0/ext/nkf' I, [2024-05-25T20:51:07.060467 #3793836] INFO -- : make[2]: Leaving directory '/tmp/ruby/build/trunk/.bundle/gems/nkf-0.2.0/ext/nkf' I, [2024-05-25T20:51:07.062345 #3793836] INFO -- : make[2]: Entering directory '/tmp/ruby/build/trunk/.bundle/gems/racc-1.7.3/ext/racc/cparse' I, [2024-05-25T20:51:07.083646 #3793836] INFO -- : make[2]: Leaving directory '/tmp/ruby/build/trunk/.bundle/gems/racc-1.7.3/ext/racc/cparse' I, [2024-05-25T20:51:07.085537 #3793836] INFO -- : make[2]: Entering directory '/tmp/ruby/build/trunk/.bundle/gems/racc-1.8.0/ext/racc/cparse' I, [2024-05-25T20:51:07.107155 #3793836] INFO -- : make[2]: Leaving directory '/tmp/ruby/build/trunk/.bundle/gems/racc-1.8.0/ext/racc/cparse' I, [2024-05-25T20:51:07.109526 #3793836] INFO -- : make[2]: Entering directory '/tmp/ruby/build/trunk/.bundle/gems/rbs-3.4.4/ext/rbs_extension' I, [2024-05-25T20:51:07.131215 #3793836] INFO -- : make[2]: Leaving directory '/tmp/ruby/build/trunk/.bundle/gems/rbs-3.4.4/ext/rbs_extension' I, [2024-05-25T20:51:07.133254 #3793836] INFO -- : make[2]: Entering directory '/tmp/ruby/build/trunk/.bundle/gems/syslog-0.1.2/ext/syslog' I, [2024-05-25T20:51:07.155188 #3793836] INFO -- : make[2]: Leaving directory '/tmp/ruby/build/trunk/.bundle/gems/syslog-0.1.2/ext/syslog' I, [2024-05-25T20:51:07.178364 #3793836] INFO -- : make[2]: Entering directory '/tmp/ruby/build/trunk' I, [2024-05-25T20:51:07.243693 #3793836] INFO -- : make[2]: 'ruby' is up to date. I, [2024-05-25T20:51:07.243732 #3793836] INFO -- : make[2]: Leaving directory '/tmp/ruby/build/trunk' I, [2024-05-25T20:51:07.244017 #3793836] INFO -- : make[1]: Leaving directory '/tmp/ruby/build/trunk' I, [2024-05-25T20:51:07.247669 #3793836] INFO -- : make[1]: Entering directory '/tmp/ruby/build/trunk' I, [2024-05-25T20:51:07.247705 #3793836] INFO -- : make[1]: Nothing to be done for 'note'. I, [2024-05-25T20:51:07.247712 #3793836] INFO -- : make[1]: Leaving directory '/tmp/ruby/build/trunk' E, [2024-05-25T20:51:07.305975 #3793836] ERROR -- : $ /tmp/ruby/build/trunk/miniruby -I/tmp/ruby/src/trunk/lib /tmp/ruby/src/trunk/tool/runruby.rb --archdir=/tmp/ruby/build/trunk --extout=.ext -- /tmp/ruby/src/trunk/spec/mspec/bin/mspec-run -B /tmp/ruby/src/trunk/spec/default.mspec --error-output stderr --debug -fy -o /tmp/rubytest.vmu2u0/1-mspec-multi-0 E, [2024-05-25T20:51:07.306187 #3793836] ERROR -- : $ /tmp/ruby/build/trunk/miniruby -I/tmp/ruby/src/trunk/lib /tmp/ruby/src/trunk/tool/runruby.rb --archdir=/tmp/ruby/build/trunk --extout=.ext -- /tmp/ruby/src/trunk/spec/mspec/bin/mspec-run -B /tmp/ruby/src/trunk/spec/default.mspec --error-output stderr --debug -fy -o /tmp/rubytest.vmu2u0/2-mspec-multi-1 E, [2024-05-25T20:51:07.306546 #3793836] ERROR -- : $ /tmp/ruby/build/trunk/miniruby -I/tmp/ruby/src/trunk/lib /tmp/ruby/src/trunk/tool/runruby.rb --archdir=/tmp/ruby/build/trunk --extout=.ext -- /tmp/ruby/src/trunk/spec/mspec/bin/mspec-run -B /tmp/ruby/src/trunk/spec/default.mspec --error-output stderr --debug -fy -o /tmp/rubytest.vmu2u0/3-mspec-multi-2 E, [2024-05-25T20:51:07.306823 #3793836] ERROR -- : $ /tmp/ruby/build/trunk/miniruby -I/tmp/ruby/src/trunk/lib /tmp/ruby/src/trunk/tool/runruby.rb --archdir=/tmp/ruby/build/trunk --extout=.ext -- /tmp/ruby/src/trunk/spec/mspec/bin/mspec-run -B /tmp/ruby/src/trunk/spec/default.mspec --error-output stderr --debug -fy -o /tmp/rubytest.vmu2u0/4-mspec-multi-3 E, [2024-05-25T20:51:07.307113 #3793836] ERROR -- : $ /tmp/ruby/build/trunk/miniruby -I/tmp/ruby/src/trunk/lib /tmp/ruby/src/trunk/tool/runruby.rb --archdir=/tmp/ruby/build/trunk --extout=.ext -- /tmp/ruby/src/trunk/spec/mspec/bin/mspec-run -B /tmp/ruby/src/trunk/spec/default.mspec --error-output stderr --debug -fy -o /tmp/rubytest.vmu2u0/5-mspec-multi-4 E, [2024-05-25T20:51:07.307279 #3793836] ERROR -- : $ /tmp/ruby/build/trunk/miniruby -I/tmp/ruby/src/trunk/lib /tmp/ruby/src/trunk/tool/runruby.rb --archdir=/tmp/ruby/build/trunk --extout=.ext -- /tmp/ruby/src/trunk/spec/mspec/bin/mspec-run -B /tmp/ruby/src/trunk/spec/default.mspec --error-output stderr --debug -fy -o /tmp/rubytest.vmu2u0/6-mspec-multi-5 E, [2024-05-25T20:51:07.307383 #3793836] ERROR -- : $ /tmp/ruby/build/trunk/miniruby -I/tmp/ruby/src/trunk/lib /tmp/ruby/src/trunk/tool/runruby.rb --archdir=/tmp/ruby/build/trunk --extout=.ext -- /tmp/ruby/src/trunk/spec/mspec/bin/mspec-run -B /tmp/ruby/src/trunk/spec/default.mspec --error-output stderr --debug -fy -o /tmp/rubytest.vmu2u0/7-mspec-multi-6 E, [2024-05-25T20:51:07.307656 #3793836] ERROR -- : $ /tmp/ruby/build/trunk/miniruby -I/tmp/ruby/src/trunk/lib /tmp/ruby/src/trunk/tool/runruby.rb --archdir=/tmp/ruby/build/trunk --extout=.ext -- /tmp/ruby/src/trunk/spec/mspec/bin/mspec-run -B /tmp/ruby/src/trunk/spec/default.mspec --error-output stderr --debug -fy -o /tmp/rubytest.vmu2u0/8-mspec-multi-7 E, [2024-05-25T20:51:07.307926 #3793836] ERROR -- : $ /tmp/ruby/build/trunk/miniruby -I/tmp/ruby/src/trunk/lib /tmp/ruby/src/trunk/tool/runruby.rb --archdir=/tmp/ruby/build/trunk --extout=.ext -- /tmp/ruby/src/trunk/spec/mspec/bin/mspec-run -B /tmp/ruby/src/trunk/spec/default.mspec --error-output stderr --debug -fy -o /tmp/rubytest.vmu2u0/9-mspec-multi-8 E, [2024-05-25T20:51:07.308227 #3793836] ERROR -- : $ /tmp/ruby/build/trunk/miniruby -I/tmp/ruby/src/trunk/lib /tmp/ruby/src/trunk/tool/runruby.rb --archdir=/tmp/ruby/build/trunk --extout=.ext -- /tmp/ruby/src/trunk/spec/mspec/bin/mspec-run -B /tmp/ruby/src/trunk/spec/default.mspec --error-output stderr --debug -fy -o /tmp/rubytest.vmu2u0/10-mspec-multi-9 E, [2024-05-25T20:51:07.308557 #3793836] ERROR -- : $ /tmp/ruby/build/trunk/miniruby -I/tmp/ruby/src/trunk/lib /tmp/ruby/src/trunk/tool/runruby.rb --archdir=/tmp/ruby/build/trunk --extout=.ext -- /tmp/ruby/src/trunk/spec/mspec/bin/mspec-run -B /tmp/ruby/src/trunk/spec/default.mspec --error-output stderr --debug -fy -o /tmp/rubytest.vmu2u0/11-mspec-multi-10 E, [2024-05-25T20:51:07.308878 #3793836] ERROR -- : $ /tmp/ruby/build/trunk/miniruby -I/tmp/ruby/src/trunk/lib /tmp/ruby/src/trunk/tool/runruby.rb --archdir=/tmp/ruby/build/trunk --extout=.ext -- /tmp/ruby/src/trunk/spec/mspec/bin/mspec-run -B /tmp/ruby/src/trunk/spec/default.mspec --error-output stderr --debug -fy -o /tmp/rubytest.vmu2u0/12-mspec-multi-11 E, [2024-05-25T20:51:07.309134 #3793836] ERROR -- : $ /tmp/ruby/build/trunk/miniruby -I/tmp/ruby/src/trunk/lib /tmp/ruby/src/trunk/tool/runruby.rb --archdir=/tmp/ruby/build/trunk --extout=.ext -- /tmp/ruby/src/trunk/spec/mspec/bin/mspec-run -B /tmp/ruby/src/trunk/spec/default.mspec --error-output stderr --debug -fy -o /tmp/rubytest.vmu2u0/13-mspec-multi-12 E, [2024-05-25T20:51:07.309352 #3793836] ERROR -- : $ /tmp/ruby/build/trunk/miniruby -I/tmp/ruby/src/trunk/lib /tmp/ruby/src/trunk/tool/runruby.rb --archdir=/tmp/ruby/build/trunk --extout=.ext -- /tmp/ruby/src/trunk/spec/mspec/bin/mspec-run -B /tmp/ruby/src/trunk/spec/default.mspec --error-output stderr --debug -fy -o /tmp/rubytest.vmu2u0/14-mspec-multi-13 E, [2024-05-25T20:51:07.309534 #3793836] ERROR -- : $ /tmp/ruby/build/trunk/miniruby -I/tmp/ruby/src/trunk/lib /tmp/ruby/src/trunk/tool/runruby.rb --archdir=/tmp/ruby/build/trunk --extout=.ext -- /tmp/ruby/src/trunk/spec/mspec/bin/mspec-run -B /tmp/ruby/src/trunk/spec/default.mspec --error-output stderr --debug -fy -o /tmp/rubytest.vmu2u0/15-mspec-multi-14 E, [2024-05-25T20:51:07.309715 #3793836] ERROR -- : $ /tmp/ruby/build/trunk/miniruby -I/tmp/ruby/src/trunk/lib /tmp/ruby/src/trunk/tool/runruby.rb --archdir=/tmp/ruby/build/trunk --extout=.ext -- /tmp/ruby/src/trunk/spec/mspec/bin/mspec-run -B /tmp/ruby/src/trunk/spec/default.mspec --error-output stderr --debug -fy -o /tmp/rubytest.vmu2u0/16-mspec-multi-15 E, [2024-05-25T20:51:07.309893 #3793836] ERROR -- : $ /tmp/ruby/build/trunk/miniruby -I/tmp/ruby/src/trunk/lib /tmp/ruby/src/trunk/tool/runruby.rb --archdir=/tmp/ruby/build/trunk --extout=.ext -- /tmp/ruby/src/trunk/spec/mspec/bin/mspec-run -B /tmp/ruby/src/trunk/spec/default.mspec --error-output stderr --debug -fy -o /tmp/rubytest.vmu2u0/17-mspec-multi-16 E, [2024-05-25T20:51:07.310073 #3793836] ERROR -- : $ /tmp/ruby/build/trunk/miniruby -I/tmp/ruby/src/trunk/lib /tmp/ruby/src/trunk/tool/runruby.rb --archdir=/tmp/ruby/build/trunk --extout=.ext -- /tmp/ruby/src/trunk/spec/mspec/bin/mspec-run -B /tmp/ruby/src/trunk/spec/default.mspec --error-output stderr --debug -fy -o /tmp/rubytest.vmu2u0/18-mspec-multi-17 E, [2024-05-25T20:51:07.312888 #3793836] ERROR -- : $ /tmp/ruby/build/trunk/miniruby -I/tmp/ruby/src/trunk/lib /tmp/ruby/src/trunk/tool/runruby.rb --archdir=/tmp/ruby/build/trunk --extout=.ext -- /tmp/ruby/src/trunk/spec/mspec/bin/mspec-run -B /tmp/ruby/src/trunk/spec/default.mspec --error-output stderr --debug -fy -o /tmp/rubytest.vmu2u0/19-mspec-multi-18 E, [2024-05-25T20:51:07.313113 #3793836] ERROR -- : $ /tmp/ruby/build/trunk/miniruby -I/tmp/ruby/src/trunk/lib /tmp/ruby/src/trunk/tool/runruby.rb --archdir=/tmp/ruby/build/trunk --extout=.ext -- /tmp/ruby/src/trunk/spec/mspec/bin/mspec-run -B /tmp/ruby/src/trunk/spec/default.mspec --error-output stderr --debug -fy -o /tmp/rubytest.vmu2u0/20-mspec-multi-19 I, [2024-05-25T20:51:07.490307 #3793836] INFO -- : ruby 3.4.0dev (2024-05-25T17:47:07Z master d2c4363e0c) [x86_64-linux] I, [2024-05-25T20:51:08.134894 #3793836] INFO -- : 0 ......................................................................... I, [2024-05-25T20:51:08.484086 #3793836] INFO -- : 73 ......................................................................... I, [2024-05-25T20:51:08.640146 #3793836] INFO -- : 146 ......................................................................... I, [2024-05-25T20:51:08.688194 #3793836] INFO -- : 219 ......................................................................... I, [2024-05-25T20:51:08.747991 #3793836] INFO -- : 292 ......................................................................... I, [2024-05-25T20:51:08.794062 #3793836] INFO -- : 365 ......................................................................... I, [2024-05-25T20:51:08.816794 #3793836] INFO -- : 438 ......................................................................... I, [2024-05-25T20:51:08.837219 #3793836] INFO -- : 511 ......................................................................... I, [2024-05-25T20:51:08.857020 #3793836] INFO -- : 584 ......................................................................... I, [2024-05-25T20:51:08.905146 #3793836] INFO -- : 657 ......................................................................... I, [2024-05-25T20:51:08.934855 #3793836] INFO -- : 730 ......................................................................... I, [2024-05-25T20:51:08.959372 #3793836] INFO -- : 803 ......................................................................... I, [2024-05-25T20:51:08.990390 #3793836] INFO -- : 876 ......................................................................... I, [2024-05-25T20:51:09.035699 #3793836] INFO -- : 949 ......................................................................... I, [2024-05-25T20:51:09.125730 #3793836] INFO -- : 1022 ......................................................................... I, [2024-05-25T20:51:09.302999 #3793836] INFO -- : 1095 ......................................................................... I, [2024-05-25T20:51:09.410882 #3793836] INFO -- : 1168 ......................................................................... I, [2024-05-25T20:51:09.465545 #3793836] INFO -- : 1241 ......................................................................... I, [2024-05-25T20:51:09.520730 #3793836] INFO -- : 1314 ......................................................................... I, [2024-05-25T20:51:09.537447 #3793836] INFO -- : 1387 ......................................................................... I, [2024-05-25T20:51:09.632629 #3793836] INFO -- : 1460 ......................................................................... I, [2024-05-25T20:51:10.128060 #3793836] INFO -- : 1533 ......................................................................... I, [2024-05-25T20:51:10.180028 #3793836] INFO -- : 1606 ......................................................................... I, [2024-05-25T20:51:10.330115 #3793836] INFO -- : 1679 ......................................................................... I, [2024-05-25T20:51:10.436226 #3793836] INFO -- : 1752 ......................................................................... I, [2024-05-25T20:51:10.510783 #3793836] INFO -- : 1825 ......................................................................... I, [2024-05-25T20:51:10.618435 #3793836] INFO -- : 1898 ......................................................................... I, [2024-05-25T20:51:10.694116 #3793836] INFO -- : 1971 ......................................................................... I, [2024-05-25T20:51:10.770253 #3793836] INFO -- : 2044 ......................................................................... I, [2024-05-25T20:51:10.814825 #3793836] INFO -- : 2117 ......................................................................... I, [2024-05-25T20:51:10.830245 #3793836] INFO -- : 2190 ......................................................................... I, [2024-05-25T20:51:10.847212 #3793836] INFO -- : 2263 ......................................................................... I, [2024-05-25T20:51:10.859830 #3793836] INFO -- : 2336 ......................................................................... I, [2024-05-25T20:51:10.894993 #3793836] INFO -- : 2409 ......................................................................... I, [2024-05-25T20:51:11.002686 #3793836] INFO -- : 2482 ......................................................................... I, [2024-05-25T20:51:11.034754 #3793836] INFO -- : 2555 ......................................................................... I, [2024-05-25T20:51:11.136316 #3793836] INFO -- : 2628 ......................................................................... I, [2024-05-25T20:51:11.241392 #3793836] INFO -- : 2701 ......................................................................... I, [2024-05-25T20:51:11.267762 #3793836] INFO -- : 2774 ......................................................................... I, [2024-05-25T20:51:11.326820 #3793836] INFO -- : 2847 ......................................................................... I, [2024-05-25T20:51:11.364735 #3793836] INFO -- : 2920 ......................................................................... I, [2024-05-25T20:51:11.388595 #3793836] INFO -- : 2993 ......................................................................... I, [2024-05-25T20:51:11.406026 #3793836] INFO -- : 3066 ......................................................................... I, [2024-05-25T20:51:11.419502 #3793836] INFO -- : 3139 ......................................................................... I, [2024-05-25T20:51:11.427194 #3793836] INFO -- : 3212 ......................................................................... I, [2024-05-25T20:51:11.456952 #3793836] INFO -- : 3285 ......................................................................... I, [2024-05-25T20:51:15.407358 #3793836] INFO -- : 3358 ......................................................................... I, [2024-05-25T20:51:15.439827 #3793836] INFO -- : I, [2024-05-25T20:51:15.439864 #3793836] INFO -- : I, [2024-05-25T20:51:15.439872 #3793836] INFO -- : Finished in 8.131320 seconds I, [2024-05-25T20:51:15.439877 #3793836] INFO -- : I, [2024-05-25T20:51:15.439888 #3793836] INFO -- : 3430 files, 32652 examples, 198520 expectations, 0 failures, 0 errors, 0 tagged I, [2024-05-25T20:51:15.443020 #3793836] INFO -- : $$$[end] "make yes-test-rubyspec MSPECOPT='--error-output stderr --debug -j' TESTS='-j20'" exit with 0.