# Logfile created on 2024-05-25 20:21:51 +0000 by logger.rb/v1.4.3 I, [2024-05-25T20:21:51.346110 #507402] INFO -- : #, @formatter=nil, @logdev=#, @binmode=false, @mon_data=#, @mon_data_owner_object_id=860>>> I, [2024-05-25T20:21:51.346237 #507402] INFO -- : $$$[beg] make update-unicode -j20 I, [2024-05-25T20:21:51.405509 #507402] INFO -- : Downloading Unicode emoji 15.0 files... I, [2024-05-25T20:21:51.405770 #507402] INFO -- : Downloading Unicode emoji 15.0 files... I, [2024-05-25T20:21:51.406658 #507402] INFO -- : Downloading Unicode emoji 15.0 files... I, [2024-05-25T20:21:51.450073 #507402] INFO -- : made symlink emoji/15.0/emoji-sequences.txt to /tmp/ruby/src/trunk/.downloaded-cache/emoji/15.0/emoji-sequences.txt I, [2024-05-25T20:21:51.450122 #507402] INFO -- : /tmp/ruby/src/trunk/enc/unicode/data/emoji/15.0/emoji-sequences.txt already exists I, [2024-05-25T20:21:51.451104 #507402] INFO -- : downloading emoji/15.0/emoji-test.txt ... downloading emoji/15.0/emoji-test.txt ... /tmp/ruby/src/trunk/enc/unicode/data/emoji/15.0/emoji-sequences.txt already exists E, [2024-05-25T20:21:51.883377 #507402] ERROR -- : /tmp/ruby/src/trunk/tool/downloader.rb:302:in `rescue in download': failed to download emoji/15.0/emoji-test.txt (RuntimeError) E, [2024-05-25T20:21:51.883503 #507402] ERROR -- : OpenURI::HTTPError: 403 Forbidden: https://www.unicode.org/Public/emoji/15.0/emoji-test.txt E, [2024-05-25T20:21:51.883527 #507402] ERROR -- : from /tmp/ruby/src/trunk/tool/downloader.rb:201:in `download' E, [2024-05-25T20:21:51.883541 #507402] ERROR -- : from /tmp/ruby/src/trunk/tool/downloader.rb:136:in `download' E, [2024-05-25T20:21:51.883553 #507402] ERROR -- : from /tmp/ruby/src/trunk/tool/downloader.rb:482:in `block in
' E, [2024-05-25T20:21:51.883566 #507402] ERROR -- : from /tmp/ruby/src/trunk/tool/downloader.rb:465:in `each' E, [2024-05-25T20:21:51.883578 #507402] ERROR -- : from /tmp/ruby/src/trunk/tool/downloader.rb:465:in `
' E, [2024-05-25T20:21:51.883589 #507402] ERROR -- : /usr/lib/ruby/3.0.0/open-uri.rb:364:in `open_http': 403 Forbidden (OpenURI::HTTPError) E, [2024-05-25T20:21:51.883601 #507402] ERROR -- : from /usr/lib/ruby/3.0.0/open-uri.rb:741:in `buffer_open' E, [2024-05-25T20:21:51.883617 #507402] ERROR -- : from /usr/lib/ruby/3.0.0/open-uri.rb:212:in `block in open_loop' E, [2024-05-25T20:21:51.883629 #507402] ERROR -- : from /usr/lib/ruby/3.0.0/open-uri.rb:210:in `catch' E, [2024-05-25T20:21:51.883641 #507402] ERROR -- : from /usr/lib/ruby/3.0.0/open-uri.rb:210:in `open_loop' E, [2024-05-25T20:21:51.883658 #507402] ERROR -- : from /usr/lib/ruby/3.0.0/open-uri.rb:151:in `open_uri' E, [2024-05-25T20:21:51.883671 #507402] ERROR -- : from /usr/lib/ruby/3.0.0/open-uri.rb:721:in `open' E, [2024-05-25T20:21:51.883682 #507402] ERROR -- : from /usr/lib/ruby/3.0.0/open-uri.rb:729:in `read' E, [2024-05-25T20:21:51.883744 #507402] ERROR -- : from /tmp/ruby/src/trunk/tool/downloader.rb:247:in `block in download' E, [2024-05-25T20:21:51.883757 #507402] ERROR -- : from /tmp/ruby/src/trunk/tool/downloader.rb:378:in `with_retry' E, [2024-05-25T20:21:51.883773 #507402] ERROR -- : from /tmp/ruby/src/trunk/tool/downloader.rb:246:in `download' E, [2024-05-25T20:21:51.883785 #507402] ERROR -- : from /tmp/ruby/src/trunk/tool/downloader.rb:136:in `download' E, [2024-05-25T20:21:51.883797 #507402] ERROR -- : from /tmp/ruby/src/trunk/tool/downloader.rb:482:in `block in
' E, [2024-05-25T20:21:51.883809 #507402] ERROR -- : from /tmp/ruby/src/trunk/tool/downloader.rb:465:in `each' E, [2024-05-25T20:21:51.883821 #507402] ERROR -- : from /tmp/ruby/src/trunk/tool/downloader.rb:465:in `
' E, [2024-05-25T20:21:51.888033 #507402] ERROR -- : make: *** [uncommon.mk:1756: /tmp/ruby/src/trunk/enc/unicode/data/emoji/15.0/emoji-zwj-sequences.txt] Error 1 E, [2024-05-25T20:21:51.888110 #507402] ERROR -- : make: *** Waiting for unfinished jobs.... E, [2024-05-25T20:21:51.900852 #507402] ERROR -- : /tmp/ruby/src/trunk/tool/downloader.rb:302:in `rescue in download': failed to download emoji/15.0/emoji-test.txt (RuntimeError) E, [2024-05-25T20:21:51.900935 #507402] ERROR -- : OpenURI::HTTPError: 403 Forbidden: https://www.unicode.org/Public/emoji/15.0/emoji-test.txt E, [2024-05-25T20:21:51.900951 #507402] ERROR -- : from /tmp/ruby/src/trunk/tool/downloader.rb:201:in `download' E, [2024-05-25T20:21:51.900967 #507402] ERROR -- : from /tmp/ruby/src/trunk/tool/downloader.rb:136:in `download' E, [2024-05-25T20:21:51.900978 #507402] ERROR -- : from /tmp/ruby/src/trunk/tool/downloader.rb:482:in `block in
' E, [2024-05-25T20:21:51.900988 #507402] ERROR -- : from /tmp/ruby/src/trunk/tool/downloader.rb:465:in `each' E, [2024-05-25T20:21:51.900998 #507402] ERROR -- : from /tmp/ruby/src/trunk/tool/downloader.rb:465:in `
' E, [2024-05-25T20:21:51.901008 #507402] ERROR -- : /usr/lib/ruby/3.0.0/open-uri.rb:364:in `open_http': 403 Forbidden (OpenURI::HTTPError) E, [2024-05-25T20:21:51.901019 #507402] ERROR -- : from /usr/lib/ruby/3.0.0/open-uri.rb:741:in `buffer_open' E, [2024-05-25T20:21:51.901032 #507402] ERROR -- : from /usr/lib/ruby/3.0.0/open-uri.rb:212:in `block in open_loop' E, [2024-05-25T20:21:51.901041 #507402] ERROR -- : from /usr/lib/ruby/3.0.0/open-uri.rb:210:in `catch' E, [2024-05-25T20:21:51.901051 #507402] ERROR -- : from /usr/lib/ruby/3.0.0/open-uri.rb:210:in `open_loop' E, [2024-05-25T20:21:51.901061 #507402] ERROR -- : from /usr/lib/ruby/3.0.0/open-uri.rb:151:in `open_uri' E, [2024-05-25T20:21:51.901071 #507402] ERROR -- : from /usr/lib/ruby/3.0.0/open-uri.rb:721:in `open' E, [2024-05-25T20:21:51.901081 #507402] ERROR -- : from /usr/lib/ruby/3.0.0/open-uri.rb:729:in `read' E, [2024-05-25T20:21:51.901090 #507402] ERROR -- : from /tmp/ruby/src/trunk/tool/downloader.rb:247:in `block in download' E, [2024-05-25T20:21:51.901100 #507402] ERROR -- : from /tmp/ruby/src/trunk/tool/downloader.rb:378:in `with_retry' E, [2024-05-25T20:21:51.901112 #507402] ERROR -- : from /tmp/ruby/src/trunk/tool/downloader.rb:246:in `download' E, [2024-05-25T20:21:51.901123 #507402] ERROR -- : from /tmp/ruby/src/trunk/tool/downloader.rb:136:in `download' E, [2024-05-25T20:21:51.901132 #507402] ERROR -- : from /tmp/ruby/src/trunk/tool/downloader.rb:482:in `block in
' E, [2024-05-25T20:21:51.901143 #507402] ERROR -- : from /tmp/ruby/src/trunk/tool/downloader.rb:465:in `each' E, [2024-05-25T20:21:51.901152 #507402] ERROR -- : from /tmp/ruby/src/trunk/tool/downloader.rb:465:in `
' E, [2024-05-25T20:21:51.904312 #507402] ERROR -- : /tmp/ruby/src/trunk/tool/downloader.rb:302:in `rescue in download': failed to download emoji/15.0/emoji-test.txt (RuntimeError) E, [2024-05-25T20:21:51.904377 #507402] ERROR -- : OpenURI::HTTPError: 403 Forbidden: https://www.unicode.org/Public/emoji/15.0/emoji-test.txt E, [2024-05-25T20:21:51.904400 #507402] ERROR -- : from /tmp/ruby/src/trunk/tool/downloader.rb:201:in `download' E, [2024-05-25T20:21:51.904418 #507402] ERROR -- : from /tmp/ruby/src/trunk/tool/downloader.rb:136:in `download' E, [2024-05-25T20:21:51.904427 #507402] ERROR -- : from /tmp/ruby/src/trunk/tool/downloader.rb:482:in `block in
' E, [2024-05-25T20:21:51.904435 #507402] ERROR -- : from /tmp/ruby/src/trunk/tool/downloader.rb:465:in `each' E, [2024-05-25T20:21:51.904444 #507402] ERROR -- : from /tmp/ruby/src/trunk/tool/downloader.rb:465:in `
' E, [2024-05-25T20:21:51.904452 #507402] ERROR -- : /usr/lib/ruby/3.0.0/open-uri.rb:364:in `open_http': 403 Forbidden (OpenURI::HTTPError) E, [2024-05-25T20:21:51.904460 #507402] ERROR -- : from /usr/lib/ruby/3.0.0/open-uri.rb:741:in `buffer_open' E, [2024-05-25T20:21:51.904468 #507402] ERROR -- : from /usr/lib/ruby/3.0.0/open-uri.rb:212:in `block in open_loop' E, [2024-05-25T20:21:51.904476 #507402] ERROR -- : from /usr/lib/ruby/3.0.0/open-uri.rb:210:in `catch' E, [2024-05-25T20:21:51.904491 #507402] ERROR -- : from /usr/lib/ruby/3.0.0/open-uri.rb:210:in `open_loop' E, [2024-05-25T20:21:51.904499 #507402] ERROR -- : from /usr/lib/ruby/3.0.0/open-uri.rb:151:in `open_uri' E, [2024-05-25T20:21:51.904507 #507402] ERROR -- : from /usr/lib/ruby/3.0.0/open-uri.rb:721:in `open' E, [2024-05-25T20:21:51.904514 #507402] ERROR -- : from /usr/lib/ruby/3.0.0/open-uri.rb:729:in `read' E, [2024-05-25T20:21:51.904660 #507402] ERROR -- : from /tmp/ruby/src/trunk/tool/downloader.rb:247:in `block in download' E, [2024-05-25T20:21:51.904669 #507402] ERROR -- : from /tmp/ruby/src/trunk/tool/downloader.rb:378:in `with_retry' E, [2024-05-25T20:21:51.904677 #507402] ERROR -- : from /tmp/ruby/src/trunk/tool/downloader.rb:246:in `download' E, [2024-05-25T20:21:51.904685 #507402] ERROR -- : from /tmp/ruby/src/trunk/tool/downloader.rb:136:in `download' E, [2024-05-25T20:21:51.904693 #507402] ERROR -- : from /tmp/ruby/src/trunk/tool/downloader.rb:482:in `block in
' E, [2024-05-25T20:21:51.904701 #507402] ERROR -- : from /tmp/ruby/src/trunk/tool/downloader.rb:465:in `each' E, [2024-05-25T20:21:51.904709 #507402] ERROR -- : from /tmp/ruby/src/trunk/tool/downloader.rb:465:in `
' E, [2024-05-25T20:21:51.904719 #507402] ERROR -- : make: *** [uncommon.mk:1756: /tmp/ruby/src/trunk/enc/unicode/data/emoji/15.0/emoji-sequences.txt] Error 1 E, [2024-05-25T20:21:51.904727 #507402] ERROR -- : make: *** Deleting file '/tmp/ruby/src/trunk/enc/unicode/data/emoji/15.0/emoji-sequences.txt' E, [2024-05-25T20:21:51.907864 #507402] ERROR -- : make: *** [uncommon.mk:1756: /tmp/ruby/src/trunk/enc/unicode/data/emoji/15.0/emoji-test.txt] Error 1 I, [2024-05-25T20:21:51.907978 #507402] INFO -- : downloading emoji/15.0/emoji-test.txt ... I, [2024-05-25T20:21:51.908364 #507402] INFO -- : $$$[end] "make update-unicode -j20" exit with 512. I, [2024-05-25T20:21:51.908443 #507402] INFO -- : $$$[beg] make update-download -j20 I, [2024-05-25T20:21:52.017646 #507402] INFO -- : tool/config.guess already exists I, [2024-05-25T20:21:52.017683 #507402] INFO -- : tool/config.sub already exists I, [2024-05-25T20:21:52.019782 #507402] INFO -- : Update power_assert to 84e85124c5014a139af39161d484156cfe87a9ed I, [2024-05-25T20:21:52.019916 #507402] INFO -- : Update rbs to ba7872795d5de04adb8ff500c0e6afdc81a041dd I, [2024-05-25T20:21:52.020168 #507402] INFO -- : Update typeprof to b19a6416da3a05d57fadd6ffdadb382b6d236ca5 I, [2024-05-25T20:21:52.021197 #507402] INFO -- : echo 84e85124c5014a139af39161d484156cfe87a9ed | /bin/sh /tmp/ruby/src/trunk/tool/ifchange /tmp/ruby/src/trunk/.bundle/.timestamp/power_assert.revision - I, [2024-05-25T20:21:52.021528 #507402] INFO -- : echo ba7872795d5de04adb8ff500c0e6afdc81a041dd | /bin/sh /tmp/ruby/src/trunk/tool/ifchange /tmp/ruby/src/trunk/.bundle/.timestamp/rbs.revision - I, [2024-05-25T20:21:52.021634 #507402] INFO -- : echo b19a6416da3a05d57fadd6ffdadb382b6d236ca5 | /bin/sh /tmp/ruby/src/trunk/tool/ifchange /tmp/ruby/src/trunk/.bundle/.timestamp/typeprof.revision - I, [2024-05-25T20:21:52.023209 #507402] INFO -- : /tmp/ruby/src/trunk/.bundle/.timestamp/power_assert.revision unchanged I, [2024-05-25T20:21:52.023347 #507402] INFO -- : /tmp/ruby/src/trunk/.bundle/.timestamp/rbs.revision unchanged I, [2024-05-25T20:21:52.023863 #507402] INFO -- : /tmp/ruby/src/trunk/.bundle/.timestamp/typeprof.revision unchanged I, [2024-05-25T20:21:52.024209 #507402] INFO -- : Building power_assert@84e85124c5014a139af39161d484156cfe87a9ed to /tmp/ruby/src/trunk/gems/power_assert-2.0.3.gem I, [2024-05-25T20:21:52.093791 #507402] INFO -- : Successfully built RubyGem I, [2024-05-25T20:21:52.093834 #507402] INFO -- : Name: power_assert I, [2024-05-25T20:21:52.093840 #507402] INFO -- : Version: 2.0.4dev I, [2024-05-25T20:21:52.093845 #507402] INFO -- : File: power_assert-2.0.4dev.gem I, [2024-05-25T20:21:52.139023 #507402] INFO -- : $$$[end] "make update-download -j20" exit with 0. I, [2024-05-25T20:21:52.139063 #507402] INFO -- : $$$[beg] make update-rubyspec -j20 I, [2024-05-25T20:21:52.198384 #507402] INFO -- : make: Nothing to be done for 'update-rubyspec'. I, [2024-05-25T20:21:52.198735 #507402] INFO -- : $$$[end] "make update-rubyspec -j20" exit with 0. I, [2024-05-25T20:21:52.198771 #507402] INFO -- : $$$[beg] make update-src -j20 I, [2024-05-25T20:21:52.739253 #507402] INFO -- : Already up to date. I, [2024-05-25T20:21:52.757649 #507402] INFO -- : Latest commit hash = d2c4363e0c I, [2024-05-25T20:21:52.759366 #507402] INFO -- : $$$[end] "make update-src -j20" exit with 0. I, [2024-05-25T20:21:52.759415 #507402] INFO -- : $$$[beg] make after-update -j20 I, [2024-05-25T20:21:52.840657 #507402] INFO -- : generating /tmp/ruby/src/trunk/ext/ripper/eventids2table.c I, [2024-05-25T20:21:52.844892 #507402] INFO -- : make[1]: Entering directory '/tmp/ruby/src/trunk/ext/ripper' I, [2024-05-25T20:21:52.844939 #507402] INFO -- : make[1]: Nothing to be done for 'src'. I, [2024-05-25T20:21:52.844953 #507402] INFO -- : make[1]: Leaving directory '/tmp/ruby/src/trunk/ext/ripper' I, [2024-05-25T20:21:52.861899 #507402] INFO -- : /tmp/ruby/src/trunk/revision.h updated I, [2024-05-25T20:21:52.863222 #507402] INFO -- : generating x86_64-linux-fake.rb I, [2024-05-25T20:21:52.913947 #507402] INFO -- : x86_64-linux-fake.rb updated I, [2024-05-25T20:21:52.915258 #507402] INFO -- : generating enc.mk I, [2024-05-25T20:21:53.031136 #507402] INFO -- : making srcs under enc I, [2024-05-25T20:21:53.061043 #507402] INFO -- : make[1]: Entering directory '/tmp/ruby/build/trunk' I, [2024-05-25T20:21:53.061118 #507402] INFO -- : make[1]: Nothing to be done for 'srcs'. I, [2024-05-25T20:21:53.061131 #507402] INFO -- : make[1]: Leaving directory '/tmp/ruby/build/trunk' I, [2024-05-25T20:21:53.105673 #507402] INFO -- : Update power_assert to 84e85124c5014a139af39161d484156cfe87a9ed I, [2024-05-25T20:21:53.105908 #507402] INFO -- : Update rbs to ba7872795d5de04adb8ff500c0e6afdc81a041dd I, [2024-05-25T20:21:53.106680 #507402] INFO -- : Update typeprof to b19a6416da3a05d57fadd6ffdadb382b6d236ca5 I, [2024-05-25T20:21:53.107136 #507402] INFO -- : echo 84e85124c5014a139af39161d484156cfe87a9ed | /bin/sh /tmp/ruby/src/trunk/tool/ifchange /tmp/ruby/src/trunk/.bundle/.timestamp/power_assert.revision - I, [2024-05-25T20:21:53.107249 #507402] INFO -- : echo ba7872795d5de04adb8ff500c0e6afdc81a041dd | /bin/sh /tmp/ruby/src/trunk/tool/ifchange /tmp/ruby/src/trunk/.bundle/.timestamp/rbs.revision - I, [2024-05-25T20:21:53.108049 #507402] INFO -- : echo b19a6416da3a05d57fadd6ffdadb382b6d236ca5 | /bin/sh /tmp/ruby/src/trunk/tool/ifchange /tmp/ruby/src/trunk/.bundle/.timestamp/typeprof.revision - I, [2024-05-25T20:21:53.109352 #507402] INFO -- : /tmp/ruby/src/trunk/.bundle/.timestamp/power_assert.revision unchanged I, [2024-05-25T20:21:53.109559 #507402] INFO -- : /tmp/ruby/src/trunk/.bundle/.timestamp/rbs.revision unchanged I, [2024-05-25T20:21:53.110131 #507402] INFO -- : /tmp/ruby/src/trunk/.bundle/.timestamp/typeprof.revision unchanged I, [2024-05-25T20:21:53.110595 #507402] INFO -- : Building power_assert@84e85124c5014a139af39161d484156cfe87a9ed to /tmp/ruby/src/trunk/gems/power_assert-2.0.3.gem I, [2024-05-25T20:21:53.179815 #507402] INFO -- : Successfully built RubyGem I, [2024-05-25T20:21:53.179864 #507402] INFO -- : Name: power_assert I, [2024-05-25T20:21:53.179871 #507402] INFO -- : Version: 2.0.4dev I, [2024-05-25T20:21:53.179875 #507402] INFO -- : File: power_assert-2.0.4dev.gem I, [2024-05-25T20:21:53.182172 #507402] INFO -- : Extracting bundle gem power_assert-2.0.3... I, [2024-05-25T20:21:53.243042 #507402] INFO -- : Try with hash version of bundled gems instead of gems/power_assert-2.0.3.gem. We don't use this gem with release version of Ruby. I, [2024-05-25T20:21:53.247934 #507402] INFO -- : Unpacked gems/power_assert-2.0.4dev.gem I, [2024-05-25T20:21:53.250034 #507402] INFO -- : $$$[end] "make after-update -j20" exit with 0. I, [2024-05-25T20:21:53.250181 #507402] INFO -- : $$$[beg] make miniruby -j20 I, [2024-05-25T20:21:53.316659 #507402] INFO -- : BASERUBY = /usr/bin/ruby --disable=gems I, [2024-05-25T20:21:53.316703 #507402] INFO -- : CC = gcc I, [2024-05-25T20:21:53.316711 #507402] INFO -- : LD = ld I, [2024-05-25T20:21:53.316717 #507402] INFO -- : LDSHARED = gcc -shared I, [2024-05-25T20:21:53.316729 #507402] INFO -- : CFLAGS = -O3 -fno-fast-math -ggdb3 -Wall -Wextra -Wdeprecated-declarations -Wdiv-by-zero -Wduplicated-cond -Wimplicit-function-declaration -Wimplicit-int -Wpointer-arith -Wwrite-strings -Wold-style-definition -Wimplicit-fallthrough=0 -Wmissing-noreturn -Wno-cast-function-type -Wno-constant-logical-operand -Wno-long-long -Wno-missing-field-initializers -Wno-overlength-strings -Wno-packed-bitfield-compat -Wno-parentheses-equality -Wno-self-assign -Wno-tautological-compare -Wno-unused-parameter -Wno-unused-value -Wsuggest-attribute=format -Wsuggest-attribute=noreturn -Wunused-variable -Wmisleading-indentation -Wundef -fPIC I, [2024-05-25T20:21:53.316736 #507402] INFO -- : XCFLAGS = -U_FORTIFY_SOURCE -D_FORTIFY_SOURCE=2 -fstack-protector-strong -fno-strict-overflow -fvisibility=hidden -fexcess-precision=standard -DRUBY_EXPORT -I. -I.ext/include/x86_64-linux -I/tmp/ruby/src/trunk/include -I/tmp/ruby/src/trunk -I/tmp/ruby/src/trunk/prism -I/tmp/ruby/src/trunk/enc/unicode/15.0.0 I, [2024-05-25T20:21:53.316742 #507402] INFO -- : CPPFLAGS = I, [2024-05-25T20:21:53.316748 #507402] INFO -- : DLDFLAGS = -Wl,--compress-debug-sections=zlib -Wl,-soname,libruby.so.3.4 -fstack-protector-strong I, [2024-05-25T20:21:53.316755 #507402] INFO -- : SOLIBS = -lz -lrt -lrt -lgmp -ldl -lcrypt -lm -lpthread I, [2024-05-25T20:21:53.316760 #507402] INFO -- : LANG = en_US.UTF-8 I, [2024-05-25T20:21:53.316771 #507402] INFO -- : LC_ALL = I, [2024-05-25T20:21:53.316777 #507402] INFO -- : LC_CTYPE = I, [2024-05-25T20:21:53.316783 #507402] INFO -- : MFLAGS = -j20 --jobserver-auth=4,5 I, [2024-05-25T20:21:53.316789 #507402] INFO -- : RUSTC = no I, [2024-05-25T20:21:53.316795 #507402] INFO -- : YJIT_RUSTC_ARGS = --crate-name=yjit --crate-type=staticlib --edition=2021 -g -C lto=thin -C opt-level=3 -C overflow-checks=on '--out-dir=/tmp/ruby/build/trunk/yjit/target/release/' /tmp/ruby/src/trunk/yjit/src/lib.rs I, [2024-05-25T20:21:53.319001 #507402] INFO -- : gcc (Ubuntu 11.4.0-1ubuntu1~22.04) 11.4.0 I, [2024-05-25T20:21:53.319040 #507402] INFO -- : Copyright (C) 2021 Free Software Foundation, Inc. I, [2024-05-25T20:21:53.319050 #507402] INFO -- : This is free software; see the source for copying conditions. There is NO I, [2024-05-25T20:21:53.319063 #507402] INFO -- : warranty; not even for MERCHANTABILITY or FITNESS FOR A PARTICULAR PURPOSE. I, [2024-05-25T20:21:53.319070 #507402] INFO -- : I, [2024-05-25T20:21:53.344218 #507402] INFO -- : compiling /tmp/ruby/src/trunk/version.c I, [2024-05-25T20:21:53.446262 #507402] INFO -- : linking miniruby I, [2024-05-25T20:21:53.974048 #507402] INFO -- : $$$[end] "make miniruby -j20" exit with 0. I, [2024-05-25T20:21:53.974164 #507402] INFO -- : $$$[beg] make ruby -j20 I, [2024-05-25T20:21:54.032197 #507402] INFO -- : BASERUBY = /usr/bin/ruby --disable=gems I, [2024-05-25T20:21:54.032243 #507402] INFO -- : CC = gcc I, [2024-05-25T20:21:54.032266 #507402] INFO -- : LD = ld I, [2024-05-25T20:21:54.032283 #507402] INFO -- : LDSHARED = gcc -shared I, [2024-05-25T20:21:54.032295 #507402] INFO -- : CFLAGS = -O3 -fno-fast-math -ggdb3 -Wall -Wextra -Wdeprecated-declarations -Wdiv-by-zero -Wduplicated-cond -Wimplicit-function-declaration -Wimplicit-int -Wpointer-arith -Wwrite-strings -Wold-style-definition -Wimplicit-fallthrough=0 -Wmissing-noreturn -Wno-cast-function-type -Wno-constant-logical-operand -Wno-long-long -Wno-missing-field-initializers -Wno-overlength-strings -Wno-packed-bitfield-compat -Wno-parentheses-equality -Wno-self-assign -Wno-tautological-compare -Wno-unused-parameter -Wno-unused-value -Wsuggest-attribute=format -Wsuggest-attribute=noreturn -Wunused-variable -Wmisleading-indentation -Wundef -fPIC I, [2024-05-25T20:21:54.032307 #507402] INFO -- : XCFLAGS = -U_FORTIFY_SOURCE -D_FORTIFY_SOURCE=2 -fstack-protector-strong -fno-strict-overflow -fvisibility=hidden -fexcess-precision=standard -DRUBY_EXPORT -I. -I.ext/include/x86_64-linux -I/tmp/ruby/src/trunk/include -I/tmp/ruby/src/trunk -I/tmp/ruby/src/trunk/prism -I/tmp/ruby/src/trunk/enc/unicode/15.0.0 I, [2024-05-25T20:21:54.032318 #507402] INFO -- : CPPFLAGS = I, [2024-05-25T20:21:54.032328 #507402] INFO -- : DLDFLAGS = -Wl,--compress-debug-sections=zlib -Wl,-soname,libruby.so.3.4 -fstack-protector-strong I, [2024-05-25T20:21:54.032339 #507402] INFO -- : SOLIBS = -lz -lrt -lrt -lgmp -ldl -lcrypt -lm -lpthread I, [2024-05-25T20:21:54.032350 #507402] INFO -- : LANG = en_US.UTF-8 I, [2024-05-25T20:21:54.032360 #507402] INFO -- : LC_ALL = I, [2024-05-25T20:21:54.032370 #507402] INFO -- : LC_CTYPE = I, [2024-05-25T20:21:54.032381 #507402] INFO -- : MFLAGS = -j20 --jobserver-auth=4,5 I, [2024-05-25T20:21:54.032391 #507402] INFO -- : RUSTC = no I, [2024-05-25T20:21:54.032402 #507402] INFO -- : YJIT_RUSTC_ARGS = --crate-name=yjit --crate-type=staticlib --edition=2021 -g -C lto=thin -C opt-level=3 -C overflow-checks=on '--out-dir=/tmp/ruby/build/trunk/yjit/target/release/' /tmp/ruby/src/trunk/yjit/src/lib.rs I, [2024-05-25T20:21:54.033681 #507402] INFO -- : gcc (Ubuntu 11.4.0-1ubuntu1~22.04) 11.4.0 I, [2024-05-25T20:21:54.033724 #507402] INFO -- : Copyright (C) 2021 Free Software Foundation, Inc. I, [2024-05-25T20:21:54.033738 #507402] INFO -- : This is free software; see the source for copying conditions. There is NO I, [2024-05-25T20:21:54.033755 #507402] INFO -- : warranty; not even for MERCHANTABILITY or FITNESS FOR A PARTICULAR PURPOSE. I, [2024-05-25T20:21:54.033766 #507402] INFO -- : I, [2024-05-25T20:21:54.140579 #507402] INFO -- : builtin_binary.inc updated I, [2024-05-25T20:21:54.145209 #507402] INFO -- : c86294a81d0df6836359a6b5498b71b1ddba3062aa6ec87c7b2896368a948a19 builtin_binary.inc I, [2024-05-25T20:21:54.145980 #507402] INFO -- : compiling /tmp/ruby/src/trunk/builtin.c I, [2024-05-25T20:21:54.328830 #507402] INFO -- : linking static-library libruby-static.a I, [2024-05-25T20:21:54.644339 #507402] INFO -- : linking shared-library libruby.so.3.4.0 I, [2024-05-25T20:21:56.201000 #507402] INFO -- : linking ruby I, [2024-05-25T20:21:56.226605 #507402] INFO -- : $$$[end] "make ruby -j20" exit with 0. I, [2024-05-25T20:21:56.226723 #507402] INFO -- : $$$[beg] make all -j20 I, [2024-05-25T20:21:56.286677 #507402] INFO -- : BASERUBY = /usr/bin/ruby --disable=gems I, [2024-05-25T20:21:56.286731 #507402] INFO -- : CC = gcc I, [2024-05-25T20:21:56.286749 #507402] INFO -- : LD = ld I, [2024-05-25T20:21:56.286764 #507402] INFO -- : LDSHARED = gcc -shared I, [2024-05-25T20:21:56.286779 #507402] INFO -- : CFLAGS = -O3 -fno-fast-math -ggdb3 -Wall -Wextra -Wdeprecated-declarations -Wdiv-by-zero -Wduplicated-cond -Wimplicit-function-declaration -Wimplicit-int -Wpointer-arith -Wwrite-strings -Wold-style-definition -Wimplicit-fallthrough=0 -Wmissing-noreturn -Wno-cast-function-type -Wno-constant-logical-operand -Wno-long-long -Wno-missing-field-initializers -Wno-overlength-strings -Wno-packed-bitfield-compat -Wno-parentheses-equality -Wno-self-assign -Wno-tautological-compare -Wno-unused-parameter -Wno-unused-value -Wsuggest-attribute=format -Wsuggest-attribute=noreturn -Wunused-variable -Wmisleading-indentation -Wundef -fPIC I, [2024-05-25T20:21:56.286808 #507402] INFO -- : XCFLAGS = -U_FORTIFY_SOURCE -D_FORTIFY_SOURCE=2 -fstack-protector-strong -fno-strict-overflow -fvisibility=hidden -fexcess-precision=standard -DRUBY_EXPORT -I. -I.ext/include/x86_64-linux -I/tmp/ruby/src/trunk/include -I/tmp/ruby/src/trunk -I/tmp/ruby/src/trunk/prism -I/tmp/ruby/src/trunk/enc/unicode/15.0.0 I, [2024-05-25T20:21:56.286824 #507402] INFO -- : CPPFLAGS = I, [2024-05-25T20:21:56.286839 #507402] INFO -- : DLDFLAGS = -Wl,--compress-debug-sections=zlib -Wl,-soname,libruby.so.3.4 -fstack-protector-strong I, [2024-05-25T20:21:56.286854 #507402] INFO -- : SOLIBS = -lz -lrt -lrt -lgmp -ldl -lcrypt -lm -lpthread I, [2024-05-25T20:21:56.286868 #507402] INFO -- : LANG = en_US.UTF-8 I, [2024-05-25T20:21:56.286881 #507402] INFO -- : LC_ALL = I, [2024-05-25T20:21:56.286895 #507402] INFO -- : LC_CTYPE = I, [2024-05-25T20:21:56.286909 #507402] INFO -- : MFLAGS = -j20 --jobserver-auth=4,5 I, [2024-05-25T20:21:56.286923 #507402] INFO -- : RUSTC = no I, [2024-05-25T20:21:56.286938 #507402] INFO -- : YJIT_RUSTC_ARGS = --crate-name=yjit --crate-type=staticlib --edition=2021 -g -C lto=thin -C opt-level=3 -C overflow-checks=on '--out-dir=/tmp/ruby/build/trunk/yjit/target/release/' /tmp/ruby/src/trunk/yjit/src/lib.rs I, [2024-05-25T20:21:56.288585 #507402] INFO -- : gcc (Ubuntu 11.4.0-1ubuntu1~22.04) 11.4.0 I, [2024-05-25T20:21:56.288636 #507402] INFO -- : Copyright (C) 2021 Free Software Foundation, Inc. I, [2024-05-25T20:21:56.288660 #507402] INFO -- : This is free software; see the source for copying conditions. There is NO I, [2024-05-25T20:21:56.288676 #507402] INFO -- : warranty; not even for MERCHANTABILITY or FITNESS FOR A PARTICULAR PURPOSE. I, [2024-05-25T20:21:56.288691 #507402] INFO -- : I, [2024-05-25T20:21:56.317740 #507402] INFO -- : generating encdb.h I, [2024-05-25T20:21:56.319144 #507402] INFO -- : generating enc.mk I, [2024-05-25T20:21:56.321102 #507402] INFO -- : building spec/ruby/optional/capi/ext/array_spec.so I, [2024-05-25T20:21:56.321385 #507402] INFO -- : building spec/ruby/optional/capi/ext/basic_object_spec.so I, [2024-05-25T20:21:56.322388 #507402] INFO -- : building spec/ruby/optional/capi/ext/bignum_spec.so I, [2024-05-25T20:21:56.322615 #507402] INFO -- : building spec/ruby/optional/capi/ext/binding_spec.so I, [2024-05-25T20:21:56.322913 #507402] INFO -- : building spec/ruby/optional/capi/ext/boolean_spec.so I, [2024-05-25T20:21:56.323525 #507402] INFO -- : building spec/ruby/optional/capi/ext/class_id_under_autoload_spec.so I, [2024-05-25T20:21:56.324540 #507402] INFO -- : building spec/ruby/optional/capi/ext/class_spec.so I, [2024-05-25T20:21:56.325469 #507402] INFO -- : building spec/ruby/optional/capi/ext/class_under_autoload_spec.so I, [2024-05-25T20:21:56.325854 #507402] INFO -- : building spec/ruby/optional/capi/ext/complex_spec.so I, [2024-05-25T20:21:56.326772 #507402] INFO -- : building spec/ruby/optional/capi/ext/constants_spec.so I, [2024-05-25T20:21:56.327469 #507402] INFO -- : building spec/ruby/optional/capi/ext/data_spec.so I, [2024-05-25T20:21:56.327811 #507402] INFO -- : building spec/ruby/optional/capi/ext/debug_spec.so I, [2024-05-25T20:21:56.328682 #507402] INFO -- : building spec/ruby/optional/capi/ext/encoding_spec.so I, [2024-05-25T20:21:56.329400 #507402] INFO -- : building spec/ruby/optional/capi/ext/enumerator_spec.so I, [2024-05-25T20:21:56.329697 #507402] INFO -- : building spec/ruby/optional/capi/ext/exception_spec.so I, [2024-05-25T20:21:56.330327 #507402] INFO -- : building spec/ruby/optional/capi/ext/fiber_spec.so I, [2024-05-25T20:21:56.330565 #507402] INFO -- : building spec/ruby/optional/capi/ext/file_spec.so I, [2024-05-25T20:21:56.331538 #507402] INFO -- : building spec/ruby/optional/capi/ext/fixnum_spec.so I, [2024-05-25T20:21:56.355059 #507402] INFO -- : encdb.h unchanged I, [2024-05-25T20:21:56.357144 #507402] INFO -- : building spec/ruby/optional/capi/ext/float_spec.so I, [2024-05-25T20:21:56.460067 #507402] INFO -- : building spec/ruby/optional/capi/ext/gc_spec.so I, [2024-05-25T20:21:56.460399 #507402] INFO -- : building spec/ruby/optional/capi/ext/globals_spec.so I, [2024-05-25T20:21:56.483474 #507402] INFO -- : building spec/ruby/optional/capi/ext/hash_spec.so I, [2024-05-25T20:21:56.484572 #507402] INFO -- : building spec/ruby/optional/capi/ext/integer_spec.so I, [2024-05-25T20:21:56.485154 #507402] INFO -- : building spec/ruby/optional/capi/ext/io_spec.so I, [2024-05-25T20:21:56.485531 #507402] INFO -- : building spec/ruby/optional/capi/ext/kernel_spec.so I, [2024-05-25T20:21:56.494965 #507402] INFO -- : building spec/ruby/optional/capi/ext/marshal_spec.so I, [2024-05-25T20:21:56.497649 #507402] INFO -- : building spec/ruby/optional/capi/ext/module_spec.so I, [2024-05-25T20:21:56.498315 #507402] INFO -- : building spec/ruby/optional/capi/ext/language_spec.so I, [2024-05-25T20:21:56.500172 #507402] INFO -- : building spec/ruby/optional/capi/ext/module_under_autoload_spec.so I, [2024-05-25T20:21:56.505679 #507402] INFO -- : building spec/ruby/optional/capi/ext/mutex_spec.so I, [2024-05-25T20:21:56.510820 #507402] INFO -- : building spec/ruby/optional/capi/ext/numeric_spec.so I, [2024-05-25T20:21:56.515553 #507402] INFO -- : building spec/ruby/optional/capi/ext/object_spec.so I, [2024-05-25T20:21:56.516736 #507402] INFO -- : building spec/ruby/optional/capi/ext/proc_spec.so I, [2024-05-25T20:21:56.524053 #507402] INFO -- : building spec/ruby/optional/capi/ext/range_spec.so I, [2024-05-25T20:21:56.542772 #507402] INFO -- : building spec/ruby/optional/capi/ext/rational_spec.so I, [2024-05-25T20:21:56.542977 #507402] INFO -- : building spec/ruby/optional/capi/ext/rbasic_spec.so I, [2024-05-25T20:21:56.578898 #507402] INFO -- : building spec/ruby/optional/capi/ext/regexp_spec.so I, [2024-05-25T20:21:56.614622 #507402] INFO -- : building spec/ruby/optional/capi/ext/string_spec.so I, [2024-05-25T20:21:56.630596 #507402] INFO -- : building spec/ruby/optional/capi/ext/struct_spec.so I, [2024-05-25T20:21:56.647718 #507402] INFO -- : building spec/ruby/optional/capi/ext/st_spec.so I, [2024-05-25T20:21:56.650733 #507402] INFO -- : building spec/ruby/optional/capi/ext/symbol_spec.so I, [2024-05-25T20:21:56.652936 #507402] INFO -- : building spec/ruby/optional/capi/ext/thread_spec.so I, [2024-05-25T20:21:56.656365 #507402] INFO -- : building spec/ruby/optional/capi/ext/time_spec.so I, [2024-05-25T20:21:56.661030 #507402] INFO -- : building spec/ruby/optional/capi/ext/tracepoint_spec.so I, [2024-05-25T20:21:56.669906 #507402] INFO -- : building spec/ruby/optional/capi/ext/typed_data_spec.so I, [2024-05-25T20:21:56.670221 #507402] INFO -- : building spec/ruby/optional/capi/ext/util_spec.so I, [2024-05-25T20:21:56.673898 #507402] INFO -- : making enc I, [2024-05-25T20:21:56.674880 #507402] INFO -- : making srcs under enc I, [2024-05-25T20:21:56.701768 #507402] INFO -- : make[1]: Entering directory '/tmp/ruby/build/trunk' I, [2024-05-25T20:21:56.701827 #507402] INFO -- : make[1]: Nothing to be done for 'enc'. I, [2024-05-25T20:21:56.701836 #507402] INFO -- : make[1]: Leaving directory '/tmp/ruby/build/trunk' I, [2024-05-25T20:21:56.719831 #507402] INFO -- : make[1]: Entering directory '/tmp/ruby/build/trunk' I, [2024-05-25T20:21:56.719894 #507402] INFO -- : make[1]: Nothing to be done for 'srcs'. I, [2024-05-25T20:21:56.719903 #507402] INFO -- : make[1]: Leaving directory '/tmp/ruby/build/trunk' I, [2024-05-25T20:21:56.720411 #507402] INFO -- : generating transdb.h I, [2024-05-25T20:21:56.817257 #507402] INFO -- : transdb.h unchanged I, [2024-05-25T20:21:56.818302 #507402] INFO -- : generating makefiles ext/configure-ext.mk I, [2024-05-25T20:21:56.818499 #507402] INFO -- : making trans I, [2024-05-25T20:21:56.845277 #507402] INFO -- : ext/configure-ext.mk updated I, [2024-05-25T20:21:56.847436 #507402] INFO -- : make[1]: Entering directory '/tmp/ruby/build/trunk' I, [2024-05-25T20:21:56.854168 #507402] INFO -- : make[1]: Entering directory '/tmp/ruby/build/trunk' I, [2024-05-25T20:21:56.854253 #507402] INFO -- : make[1]: Nothing to be done for 'trans'. I, [2024-05-25T20:21:56.854267 #507402] INFO -- : make[1]: Leaving directory '/tmp/ruby/build/trunk' I, [2024-05-25T20:21:56.855051 #507402] INFO -- : making encs I, [2024-05-25T20:21:56.913328 #507402] INFO -- : make[1]: Entering directory '/tmp/ruby/build/trunk' I, [2024-05-25T20:21:56.913406 #507402] INFO -- : make[1]: Nothing to be done for 'encs'. I, [2024-05-25T20:21:56.913434 #507402] INFO -- : make[1]: Leaving directory '/tmp/ruby/build/trunk' I, [2024-05-25T20:21:57.006131 #507402] INFO -- : make[1]: Leaving directory '/tmp/ruby/build/trunk' I, [2024-05-25T20:21:57.006813 #507402] INFO -- : generating makefile exts.mk I, [2024-05-25T20:21:57.044235 #507402] INFO -- : exts.mk unchanged I, [2024-05-25T20:21:57.049110 #507402] INFO -- : make[1]: Entering directory '/tmp/ruby/build/trunk' I, [2024-05-25T20:21:57.072463 #507402] INFO -- : make[2]: Entering directory '/tmp/ruby/build/trunk/ext/digest' I, [2024-05-25T20:21:57.073899 #507402] INFO -- : make[2]: Entering directory '/tmp/ruby/build/trunk/ext/json' I, [2024-05-25T20:21:57.074177 #507402] INFO -- : make[2]: Entering directory '/tmp/ruby/build/trunk/ext/coverage' I, [2024-05-25T20:21:57.074358 #507402] INFO -- : make[2]: Entering directory '/tmp/ruby/build/trunk/ext/io/console' I, [2024-05-25T20:21:57.075262 #507402] INFO -- : make[2]: Entering directory '/tmp/ruby/build/trunk/ext/date' I, [2024-05-25T20:21:57.076134 #507402] INFO -- : make[2]: Entering directory '/tmp/ruby/build/trunk/ext/monitor' I, [2024-05-25T20:21:57.076166 #507402] INFO -- : make[2]: Entering directory '/tmp/ruby/build/trunk/ext/rubyvm' I, [2024-05-25T20:21:57.076393 #507402] INFO -- : make[2]: Entering directory '/tmp/ruby/build/trunk/ext/pathname' I, [2024-05-25T20:21:57.076904 #507402] INFO -- : make[2]: Entering directory '/tmp/ruby/build/trunk/ext/fiddle' I, [2024-05-25T20:21:57.077107 #507402] INFO -- : make[2]: Entering directory '/tmp/ruby/build/trunk/ext/pty' I, [2024-05-25T20:21:57.077335 #507402] INFO -- : make[2]: Leaving directory '/tmp/ruby/build/trunk/ext/digest' I, [2024-05-25T20:21:57.077359 #507402] INFO -- : make[2]: Leaving directory '/tmp/ruby/build/trunk/ext/coverage' I, [2024-05-25T20:21:57.078531 #507402] INFO -- : make[2]: Entering directory '/tmp/ruby/build/trunk/ext/psych' I, [2024-05-25T20:21:57.078558 #507402] INFO -- : make[2]: Leaving directory '/tmp/ruby/build/trunk/ext/io/console' I, [2024-05-25T20:21:57.078609 #507402] INFO -- : make[2]: Entering directory '/tmp/ruby/build/trunk/ext/objspace' I, [2024-05-25T20:21:57.078766 #507402] INFO -- : make[2]: Leaving directory '/tmp/ruby/build/trunk/ext/date' I, [2024-05-25T20:21:57.078790 #507402] INFO -- : make[2]: Leaving directory '/tmp/ruby/build/trunk/ext/rubyvm' I, [2024-05-25T20:21:57.079418 #507402] INFO -- : make[2]: Leaving directory '/tmp/ruby/build/trunk/ext/monitor' I, [2024-05-25T20:21:57.079762 #507402] INFO -- : make[2]: Leaving directory '/tmp/ruby/build/trunk/ext/pathname' I, [2024-05-25T20:21:57.079866 #507402] INFO -- : make[2]: Entering directory '/tmp/ruby/build/trunk/.bundle/gems/bigdecimal-3.1.8/ext/bigdecimal' I, [2024-05-25T20:21:57.080263 #507402] INFO -- : make[2]: Entering directory '/tmp/ruby/build/trunk/.bundle/gems/debug-1.9.2/ext/debug' I, [2024-05-25T20:21:57.080419 #507402] INFO -- : make[2]: Leaving directory '/tmp/ruby/build/trunk/ext/pty' I, [2024-05-25T20:21:57.080446 #507402] INFO -- : make[2]: Entering directory '/tmp/ruby/build/trunk/.bundle/gems/nkf-0.2.0/ext/nkf' I, [2024-05-25T20:21:57.081027 #507402] INFO -- : make[2]: Entering directory '/tmp/ruby/build/trunk/.bundle/gems/racc-1.7.3/ext/racc/cparse' I, [2024-05-25T20:21:57.081204 #507402] INFO -- : make[2]: Entering directory '/tmp/ruby/build/trunk/ext/ripper' I, [2024-05-25T20:21:57.081367 #507402] INFO -- : make[2]: Entering directory '/tmp/ruby/build/trunk/.bundle/gems/racc-1.8.0/ext/racc/cparse' I, [2024-05-25T20:21:57.081932 #507402] INFO -- : make[2]: Entering directory '/tmp/ruby/build/trunk/.bundle/gems/syslog-0.1.2/ext/syslog' I, [2024-05-25T20:21:57.082314 #507402] INFO -- : make[2]: Entering directory '/tmp/ruby/build/trunk/.bundle/gems/rbs-3.4.4/ext/rbs_extension' I, [2024-05-25T20:21:57.083778 #507402] INFO -- : make[2]: Leaving directory '/tmp/ruby/build/trunk/ext/objspace' I, [2024-05-25T20:21:57.084076 #507402] INFO -- : make[2]: Leaving directory '/tmp/ruby/build/trunk/ext/json' I, [2024-05-25T20:21:57.085445 #507402] INFO -- : make[2]: Leaving directory '/tmp/ruby/build/trunk/ext/fiddle' I, [2024-05-25T20:21:57.087195 #507402] INFO -- : make[2]: Entering directory '/tmp/ruby/build/trunk/ext/socket' I, [2024-05-25T20:21:57.087618 #507402] INFO -- : make[2]: Leaving directory '/tmp/ruby/build/trunk/ext/ripper' I, [2024-05-25T20:21:57.090239 #507402] INFO -- : make[2]: Entering directory '/tmp/ruby/build/trunk/ext/openssl' I, [2024-05-25T20:21:57.091361 #507402] INFO -- : make[2]: Leaving directory '/tmp/ruby/build/trunk/ext/psych' I, [2024-05-25T20:21:57.093272 #507402] INFO -- : make[2]: Leaving directory '/tmp/ruby/build/trunk/ext/socket' I, [2024-05-25T20:21:57.094920 #507402] INFO -- : make[2]: Entering directory '/tmp/ruby/build/trunk/ext/digest/sha2' I, [2024-05-25T20:21:57.097392 #507402] INFO -- : make[2]: Leaving directory '/tmp/ruby/build/trunk/ext/digest/sha2' I, [2024-05-25T20:21:57.103697 #507402] INFO -- : make[2]: Leaving directory '/tmp/ruby/build/trunk/.bundle/gems/bigdecimal-3.1.8/ext/bigdecimal' I, [2024-05-25T20:21:57.104075 #507402] INFO -- : make[2]: Leaving directory '/tmp/ruby/build/trunk/.bundle/gems/racc-1.7.3/ext/racc/cparse' I, [2024-05-25T20:21:57.104910 #507402] INFO -- : make[2]: Leaving directory '/tmp/ruby/build/trunk/.bundle/gems/racc-1.8.0/ext/racc/cparse' I, [2024-05-25T20:21:57.105079 #507402] INFO -- : make[2]: Leaving directory '/tmp/ruby/build/trunk/.bundle/gems/syslog-0.1.2/ext/syslog' I, [2024-05-25T20:21:57.105353 #507402] INFO -- : make[2]: Leaving directory '/tmp/ruby/build/trunk/.bundle/gems/rbs-3.4.4/ext/rbs_extension' I, [2024-05-25T20:21:57.105951 #507402] INFO -- : make[2]: Leaving directory '/tmp/ruby/build/trunk/ext/openssl' I, [2024-05-25T20:21:57.113586 #507402] INFO -- : make[2]: Leaving directory '/tmp/ruby/build/trunk/.bundle/gems/nkf-0.2.0/ext/nkf' I, [2024-05-25T20:21:57.114308 #507402] INFO -- : make[2]: Leaving directory '/tmp/ruby/build/trunk/.bundle/gems/debug-1.9.2/ext/debug' I, [2024-05-25T20:21:57.138225 #507402] INFO -- : make[2]: Entering directory '/tmp/ruby/build/trunk' I, [2024-05-25T20:21:57.205350 #507402] INFO -- : linking ruby I, [2024-05-25T20:21:57.228012 #507402] INFO -- : make[2]: Leaving directory '/tmp/ruby/build/trunk' I, [2024-05-25T20:21:57.228590 #507402] INFO -- : make[1]: Leaving directory '/tmp/ruby/build/trunk' I, [2024-05-25T20:21:57.232358 #507402] INFO -- : make[1]: Entering directory '/tmp/ruby/build/trunk' I, [2024-05-25T20:21:57.232418 #507402] INFO -- : make[1]: Nothing to be done for 'note'. I, [2024-05-25T20:21:57.232431 #507402] INFO -- : make[1]: Leaving directory '/tmp/ruby/build/trunk' I, [2024-05-25T20:21:57.233129 #507402] INFO -- : $$$[end] "make all -j20" exit with 0. I, [2024-05-25T20:21:57.233288 #507402] INFO -- : $$$[beg] make install -j20 I, [2024-05-25T20:21:57.301589 #507402] INFO -- : Update power_assert to 84e85124c5014a139af39161d484156cfe87a9ed I, [2024-05-25T20:21:57.301829 #507402] INFO -- : Update rbs to ba7872795d5de04adb8ff500c0e6afdc81a041dd I, [2024-05-25T20:21:57.302790 #507402] INFO -- : Update typeprof to b19a6416da3a05d57fadd6ffdadb382b6d236ca5 I, [2024-05-25T20:21:57.303720 #507402] INFO -- : echo 84e85124c5014a139af39161d484156cfe87a9ed | /bin/sh /tmp/ruby/src/trunk/tool/ifchange /tmp/ruby/src/trunk/.bundle/.timestamp/power_assert.revision - I, [2024-05-25T20:21:57.303783 #507402] INFO -- : echo ba7872795d5de04adb8ff500c0e6afdc81a041dd | /bin/sh /tmp/ruby/src/trunk/tool/ifchange /tmp/ruby/src/trunk/.bundle/.timestamp/rbs.revision - I, [2024-05-25T20:21:57.304826 #507402] INFO -- : BASERUBY = /usr/bin/ruby --disable=gems I, [2024-05-25T20:21:57.304888 #507402] INFO -- : CC = gcc I, [2024-05-25T20:21:57.304908 #507402] INFO -- : LD = ld I, [2024-05-25T20:21:57.304924 #507402] INFO -- : LDSHARED = gcc -shared I, [2024-05-25T20:21:57.304940 #507402] INFO -- : CFLAGS = -O3 -fno-fast-math -ggdb3 -Wall -Wextra -Wdeprecated-declarations -Wdiv-by-zero -Wduplicated-cond -Wimplicit-function-declaration -Wimplicit-int -Wpointer-arith -Wwrite-strings -Wold-style-definition -Wimplicit-fallthrough=0 -Wmissing-noreturn -Wno-cast-function-type -Wno-constant-logical-operand -Wno-long-long -Wno-missing-field-initializers -Wno-overlength-strings -Wno-packed-bitfield-compat -Wno-parentheses-equality -Wno-self-assign -Wno-tautological-compare -Wno-unused-parameter -Wno-unused-value -Wsuggest-attribute=format -Wsuggest-attribute=noreturn -Wunused-variable -Wmisleading-indentation -Wundef -fPIC I, [2024-05-25T20:21:57.304957 #507402] INFO -- : XCFLAGS = -U_FORTIFY_SOURCE -D_FORTIFY_SOURCE=2 -fstack-protector-strong -fno-strict-overflow -fvisibility=hidden -fexcess-precision=standard -DRUBY_EXPORT -I. -I.ext/include/x86_64-linux -I/tmp/ruby/src/trunk/include -I/tmp/ruby/src/trunk -I/tmp/ruby/src/trunk/prism -I/tmp/ruby/src/trunk/enc/unicode/15.0.0 I, [2024-05-25T20:21:57.304973 #507402] INFO -- : CPPFLAGS = I, [2024-05-25T20:21:57.304991 #507402] INFO -- : DLDFLAGS = -Wl,--compress-debug-sections=zlib -Wl,-soname,libruby.so.3.4 -fstack-protector-strong I, [2024-05-25T20:21:57.305007 #507402] INFO -- : SOLIBS = -lz -lrt -lrt -lgmp -ldl -lcrypt -lm -lpthread I, [2024-05-25T20:21:57.305022 #507402] INFO -- : LANG = en_US.UTF-8 I, [2024-05-25T20:21:57.305037 #507402] INFO -- : LC_ALL = I, [2024-05-25T20:21:57.305051 #507402] INFO -- : LC_CTYPE = I, [2024-05-25T20:21:57.305066 #507402] INFO -- : MFLAGS = -j20 --jobserver-auth=4,5 I, [2024-05-25T20:21:57.305080 #507402] INFO -- : RUSTC = no I, [2024-05-25T20:21:57.305094 #507402] INFO -- : YJIT_RUSTC_ARGS = --crate-name=yjit --crate-type=staticlib --edition=2021 -g -C lto=thin -C opt-level=3 -C overflow-checks=on '--out-dir=/tmp/ruby/build/trunk/yjit/target/release/' /tmp/ruby/src/trunk/yjit/src/lib.rs I, [2024-05-25T20:21:57.306819 #507402] INFO -- : /tmp/ruby/src/trunk/.bundle/.timestamp/power_assert.revision unchanged I, [2024-05-25T20:21:57.306884 #507402] INFO -- : /tmp/ruby/src/trunk/.bundle/.timestamp/rbs.revision unchanged I, [2024-05-25T20:21:57.332527 #507402] INFO -- : echo b19a6416da3a05d57fadd6ffdadb382b6d236ca5 | /bin/sh /tmp/ruby/src/trunk/tool/ifchange /tmp/ruby/src/trunk/.bundle/.timestamp/typeprof.revision - I, [2024-05-25T20:21:57.333297 #507402] INFO -- : gcc (Ubuntu 11.4.0-1ubuntu1~22.04) 11.4.0 I, [2024-05-25T20:21:57.333346 #507402] INFO -- : Copyright (C) 2021 Free Software Foundation, Inc. I, [2024-05-25T20:21:57.333360 #507402] INFO -- : This is free software; see the source for copying conditions. There is NO I, [2024-05-25T20:21:57.333372 #507402] INFO -- : warranty; not even for MERCHANTABILITY or FITNESS FOR A PARTICULAR PURPOSE. I, [2024-05-25T20:21:57.333383 #507402] INFO -- : I, [2024-05-25T20:21:57.333395 #507402] INFO -- : generating encdb.h I, [2024-05-25T20:21:57.334257 #507402] INFO -- : generating enc.mk I, [2024-05-25T20:21:57.334625 #507402] INFO -- : /tmp/ruby/src/trunk/.bundle/.timestamp/typeprof.revision unchanged I, [2024-05-25T20:21:57.357639 #507402] INFO -- : encdb.h unchanged I, [2024-05-25T20:21:57.359127 #507402] INFO -- : Building power_assert@84e85124c5014a139af39161d484156cfe87a9ed to /tmp/ruby/src/trunk/gems/power_assert-2.0.3.gem I, [2024-05-25T20:21:57.428163 #507402] INFO -- : Successfully built RubyGem I, [2024-05-25T20:21:57.428214 #507402] INFO -- : Name: power_assert I, [2024-05-25T20:21:57.428227 #507402] INFO -- : Version: 2.0.4dev I, [2024-05-25T20:21:57.428238 #507402] INFO -- : File: power_assert-2.0.4dev.gem I, [2024-05-25T20:21:57.430383 #507402] INFO -- : Extracting bundle gem power_assert-2.0.3... I, [2024-05-25T20:21:57.457126 #507402] INFO -- : making srcs under enc I, [2024-05-25T20:21:57.457285 #507402] INFO -- : making enc I, [2024-05-25T20:21:57.474336 #507402] INFO -- : make[1]: Entering directory '/tmp/ruby/build/trunk' I, [2024-05-25T20:21:57.474385 #507402] INFO -- : make[1]: Nothing to be done for 'enc'. I, [2024-05-25T20:21:57.474398 #507402] INFO -- : make[1]: Leaving directory '/tmp/ruby/build/trunk' I, [2024-05-25T20:21:57.486479 #507402] INFO -- : make[1]: Entering directory '/tmp/ruby/build/trunk' I, [2024-05-25T20:21:57.486538 #507402] INFO -- : make[1]: Nothing to be done for 'srcs'. I, [2024-05-25T20:21:57.486552 #507402] INFO -- : make[1]: Leaving directory '/tmp/ruby/build/trunk' I, [2024-05-25T20:21:57.487262 #507402] INFO -- : generating transdb.h I, [2024-05-25T20:21:57.492031 #507402] INFO -- : Try with hash version of bundled gems instead of gems/power_assert-2.0.3.gem. We don't use this gem with release version of Ruby. I, [2024-05-25T20:21:57.497045 #507402] INFO -- : Unpacked gems/power_assert-2.0.4dev.gem I, [2024-05-25T20:21:57.583928 #507402] INFO -- : transdb.h unchanged I, [2024-05-25T20:21:57.585406 #507402] INFO -- : generating makefiles ext/configure-ext.mk I, [2024-05-25T20:21:57.585467 #507402] INFO -- : making trans I, [2024-05-25T20:21:57.612834 #507402] INFO -- : ext/configure-ext.mk unchanged I, [2024-05-25T20:21:57.615115 #507402] INFO -- : make[1]: Entering directory '/tmp/ruby/build/trunk' I, [2024-05-25T20:21:57.620542 #507402] INFO -- : make[1]: Entering directory '/tmp/ruby/build/trunk' I, [2024-05-25T20:21:57.620648 #507402] INFO -- : make[1]: Nothing to be done for 'trans'. I, [2024-05-25T20:21:57.620677 #507402] INFO -- : make[1]: Leaving directory '/tmp/ruby/build/trunk' I, [2024-05-25T20:21:57.621789 #507402] INFO -- : making encs I, [2024-05-25T20:21:57.679809 #507402] INFO -- : make[1]: Entering directory '/tmp/ruby/build/trunk' I, [2024-05-25T20:21:57.679887 #507402] INFO -- : make[1]: Nothing to be done for 'encs'. I, [2024-05-25T20:21:57.679914 #507402] INFO -- : make[1]: Leaving directory '/tmp/ruby/build/trunk' I, [2024-05-25T20:21:57.768921 #507402] INFO -- : make[1]: Leaving directory '/tmp/ruby/build/trunk' I, [2024-05-25T20:21:57.769678 #507402] INFO -- : generating makefile exts.mk I, [2024-05-25T20:21:57.806946 #507402] INFO -- : exts.mk unchanged I, [2024-05-25T20:21:57.811965 #507402] INFO -- : make[1]: Entering directory '/tmp/ruby/build/trunk' I, [2024-05-25T20:21:57.832364 #507402] INFO -- : make[2]: Entering directory '/tmp/ruby/build/trunk/ext/digest' I, [2024-05-25T20:21:57.833845 #507402] INFO -- : make[2]: Entering directory '/tmp/ruby/build/trunk/ext/json' I, [2024-05-25T20:21:57.834252 #507402] INFO -- : make[2]: Entering directory '/tmp/ruby/build/trunk/ext/io/console' I, [2024-05-25T20:21:57.834535 #507402] INFO -- : make[2]: Entering directory '/tmp/ruby/build/trunk/ext/coverage' I, [2024-05-25T20:21:57.834609 #507402] INFO -- : make[2]: Entering directory '/tmp/ruby/build/trunk/ext/date' I, [2024-05-25T20:21:57.835709 #507402] INFO -- : make[2]: Entering directory '/tmp/ruby/build/trunk/ext/monitor' I, [2024-05-25T20:21:57.836389 #507402] INFO -- : make[2]: Entering directory '/tmp/ruby/build/trunk/ext/pathname' I, [2024-05-25T20:21:57.836946 #507402] INFO -- : make[2]: Entering directory '/tmp/ruby/build/trunk/ext/pty' I, [2024-05-25T20:21:57.837101 #507402] INFO -- : make[2]: Leaving directory '/tmp/ruby/build/trunk/ext/io/console' I, [2024-05-25T20:21:57.837242 #507402] INFO -- : make[2]: Entering directory '/tmp/ruby/build/trunk/ext/fiddle' I, [2024-05-25T20:21:57.837502 #507402] INFO -- : make[2]: Entering directory '/tmp/ruby/build/trunk/ext/rubyvm' I, [2024-05-25T20:21:57.837890 #507402] INFO -- : make[2]: Leaving directory '/tmp/ruby/build/trunk/ext/digest' I, [2024-05-25T20:21:57.837996 #507402] INFO -- : make[2]: Leaving directory '/tmp/ruby/build/trunk/ext/coverage' I, [2024-05-25T20:21:57.838138 #507402] INFO -- : make[2]: Leaving directory '/tmp/ruby/build/trunk/ext/date' I, [2024-05-25T20:21:57.838275 #507402] INFO -- : make[2]: Leaving directory '/tmp/ruby/build/trunk/ext/monitor' I, [2024-05-25T20:21:57.838359 #507402] INFO -- : make[2]: Entering directory '/tmp/ruby/build/trunk/ext/objspace' I, [2024-05-25T20:21:57.838463 #507402] INFO -- : make[2]: Entering directory '/tmp/ruby/build/trunk/ext/psych' I, [2024-05-25T20:21:57.839127 #507402] INFO -- : make[2]: Leaving directory '/tmp/ruby/build/trunk/ext/pathname' I, [2024-05-25T20:21:57.839325 #507402] INFO -- : make[2]: Leaving directory '/tmp/ruby/build/trunk/ext/json' I, [2024-05-25T20:21:57.839532 #507402] INFO -- : make[2]: Leaving directory '/tmp/ruby/build/trunk/ext/rubyvm' I, [2024-05-25T20:21:57.839649 #507402] INFO -- : make[2]: Leaving directory '/tmp/ruby/build/trunk/ext/pty' I, [2024-05-25T20:21:57.840043 #507402] INFO -- : make[2]: Entering directory '/tmp/ruby/build/trunk/ext/ripper' I, [2024-05-25T20:21:57.841738 #507402] INFO -- : make[2]: Entering directory '/tmp/ruby/build/trunk/.bundle/gems/bigdecimal-3.1.8/ext/bigdecimal' I, [2024-05-25T20:21:57.841912 #507402] INFO -- : make[2]: Entering directory '/tmp/ruby/build/trunk/.bundle/gems/nkf-0.2.0/ext/nkf' I, [2024-05-25T20:21:57.842106 #507402] INFO -- : make[2]: Entering directory '/tmp/ruby/build/trunk/.bundle/gems/debug-1.9.2/ext/debug' I, [2024-05-25T20:21:57.842217 #507402] INFO -- : make[2]: Entering directory '/tmp/ruby/build/trunk/.bundle/gems/racc-1.7.3/ext/racc/cparse' I, [2024-05-25T20:21:57.842287 #507402] INFO -- : make[2]: Leaving directory '/tmp/ruby/build/trunk/ext/objspace' I, [2024-05-25T20:21:57.842371 #507402] INFO -- : make[2]: Entering directory '/tmp/ruby/build/trunk/.bundle/gems/racc-1.8.0/ext/racc/cparse' I, [2024-05-25T20:21:57.842613 #507402] INFO -- : make[2]: Entering directory '/tmp/ruby/build/trunk/.bundle/gems/syslog-0.1.2/ext/syslog' I, [2024-05-25T20:21:57.843082 #507402] INFO -- : make[2]: Leaving directory '/tmp/ruby/build/trunk/ext/fiddle' I, [2024-05-25T20:21:57.843106 #507402] INFO -- : make[2]: Entering directory '/tmp/ruby/build/trunk/.bundle/gems/rbs-3.4.4/ext/rbs_extension' I, [2024-05-25T20:21:57.845334 #507402] INFO -- : make[2]: Leaving directory '/tmp/ruby/build/trunk/ext/ripper' I, [2024-05-25T20:21:57.847852 #507402] INFO -- : make[2]: Entering directory '/tmp/ruby/build/trunk/ext/openssl' I, [2024-05-25T20:21:57.848128 #507402] INFO -- : make[2]: Leaving directory '/tmp/ruby/build/trunk/ext/psych' I, [2024-05-25T20:21:57.848867 #507402] INFO -- : make[2]: Entering directory '/tmp/ruby/build/trunk/ext/socket' I, [2024-05-25T20:21:57.850691 #507402] INFO -- : make[2]: Entering directory '/tmp/ruby/build/trunk/ext/digest/sha2' I, [2024-05-25T20:21:57.852962 #507402] INFO -- : make[2]: Leaving directory '/tmp/ruby/build/trunk/ext/digest/sha2' I, [2024-05-25T20:21:57.855912 #507402] INFO -- : make[2]: Leaving directory '/tmp/ruby/build/trunk/ext/socket' I, [2024-05-25T20:21:57.862748 #507402] INFO -- : make[2]: Leaving directory '/tmp/ruby/build/trunk/ext/openssl' I, [2024-05-25T20:21:57.864981 #507402] INFO -- : make[2]: Leaving directory '/tmp/ruby/build/trunk/.bundle/gems/racc-1.7.3/ext/racc/cparse' I, [2024-05-25T20:21:57.866596 #507402] INFO -- : make[2]: Leaving directory '/tmp/ruby/build/trunk/.bundle/gems/syslog-0.1.2/ext/syslog' I, [2024-05-25T20:21:57.870766 #507402] INFO -- : make[2]: Leaving directory '/tmp/ruby/build/trunk/.bundle/gems/racc-1.8.0/ext/racc/cparse' I, [2024-05-25T20:21:57.873792 #507402] INFO -- : make[2]: Leaving directory '/tmp/ruby/build/trunk/.bundle/gems/bigdecimal-3.1.8/ext/bigdecimal' I, [2024-05-25T20:21:57.874852 #507402] INFO -- : make[2]: Leaving directory '/tmp/ruby/build/trunk/.bundle/gems/nkf-0.2.0/ext/nkf' I, [2024-05-25T20:21:57.876317 #507402] INFO -- : make[2]: Leaving directory '/tmp/ruby/build/trunk/.bundle/gems/rbs-3.4.4/ext/rbs_extension' I, [2024-05-25T20:21:57.878017 #507402] INFO -- : make[2]: Leaving directory '/tmp/ruby/build/trunk/.bundle/gems/debug-1.9.2/ext/debug' I, [2024-05-25T20:21:57.901454 #507402] INFO -- : make[2]: Entering directory '/tmp/ruby/build/trunk' I, [2024-05-25T20:21:57.966737 #507402] INFO -- : make[2]: 'ruby' is up to date. I, [2024-05-25T20:21:57.966777 #507402] INFO -- : make[2]: Leaving directory '/tmp/ruby/build/trunk' I, [2024-05-25T20:21:57.967215 #507402] INFO -- : make[1]: Leaving directory '/tmp/ruby/build/trunk' I, [2024-05-25T20:21:57.971225 #507402] INFO -- : make[1]: Entering directory '/tmp/ruby/build/trunk' I, [2024-05-25T20:21:57.971250 #507402] INFO -- : make[1]: Nothing to be done for 'note'. I, [2024-05-25T20:21:57.971258 #507402] INFO -- : make[1]: Leaving directory '/tmp/ruby/build/trunk' I, [2024-05-25T20:21:57.971605 #507402] INFO -- : ./miniruby -I/tmp/ruby/src/trunk/lib -I. -I.ext/common /tmp/ruby/src/trunk/tool/runruby.rb --extout=.ext -- --disable-gems -r./x86_64-linux-fake /tmp/ruby/src/trunk/tool/rbinstall.rb --make="make" --dest-dir="" --extout=".ext" --ext-build-dir="./ext" --mflags="-j20 --jobserver-auth=4,5" --make-flags=" -j20 --jobserver-auth=4,5" --data-mode=0644 --prog-mode=0755 --installed-list .installed.list --mantype="doc" --gnumake --install=all --exclude=doc I, [2024-05-25T20:21:58.068639 #507402] INFO -- : Installing to I, [2024-05-25T20:21:58.068701 #507402] INFO -- : installing binary commands: /tmp/ruby/install/trunk/bin I, [2024-05-25T20:21:58.068759 #507402] INFO -- : installing base libraries: /tmp/ruby/install/trunk/lib I, [2024-05-25T20:21:58.075954 #507402] INFO -- : installing arch files: /tmp/ruby/install/trunk/lib/ruby/3.4.0+0/x86_64-linux I, [2024-05-25T20:21:58.075981 #507402] INFO -- : installing pkgconfig data: /tmp/ruby/install/trunk/lib/pkgconfig I, [2024-05-25T20:21:58.075988 #507402] INFO -- : installing extension objects: /tmp/ruby/install/trunk/lib/ruby/3.4.0+0/x86_64-linux I, [2024-05-25T20:21:58.085768 #507402] INFO -- : installing extension objects: /tmp/ruby/install/trunk/lib/ruby/site_ruby/3.4.0+0/x86_64-linux I, [2024-05-25T20:21:58.085791 #507402] INFO -- : installing extension objects: /tmp/ruby/install/trunk/lib/ruby/vendor_ruby/3.4.0+0/x86_64-linux I, [2024-05-25T20:21:58.085801 #507402] INFO -- : installing extension headers: /tmp/ruby/install/trunk/include/ruby-3.4.0+0/x86_64-linux I, [2024-05-25T20:21:58.085947 #507402] INFO -- : installing extension scripts: /tmp/ruby/install/trunk/lib/ruby/3.4.0+0 I, [2024-05-25T20:21:58.088724 #507402] INFO -- : installing extension scripts: /tmp/ruby/install/trunk/lib/ruby/site_ruby/3.4.0+0 I, [2024-05-25T20:21:58.088745 #507402] INFO -- : installing extension scripts: /tmp/ruby/install/trunk/lib/ruby/vendor_ruby/3.4.0+0 I, [2024-05-25T20:21:58.088751 #507402] INFO -- : installing extension headers: /tmp/ruby/install/trunk/include/ruby-3.4.0+0/ruby I, [2024-05-25T20:21:58.088755 #507402] INFO -- : installing command scripts: /tmp/ruby/install/trunk/bin I, [2024-05-25T20:21:58.088760 #507402] INFO -- : installing library scripts: /tmp/ruby/install/trunk/lib/ruby/3.4.0+0 I, [2024-05-25T20:21:58.121896 #507402] INFO -- : installing common headers: /tmp/ruby/install/trunk/include/ruby-3.4.0+0 I, [2024-05-25T20:21:58.127919 #507402] INFO -- : installing manpages: /tmp/ruby/install/trunk/share/man/man1 I, [2024-05-25T20:21:58.127952 #507402] INFO -- : installing default gems from lib: /tmp/ruby/install/trunk/lib/ruby/gems/3.4.0+0 I, [2024-05-25T20:21:58.150795 #507402] INFO -- : benchmark 0.3.0 I, [2024-05-25T20:21:58.152832 #507402] INFO -- : bundler 2.6.0.dev I, [2024-05-25T20:21:58.154906 #507402] INFO -- : cgi 0.4.1 I, [2024-05-25T20:21:58.155451 #507402] INFO -- : delegate 0.3.1 I, [2024-05-25T20:21:58.155940 #507402] INFO -- : did_you_mean 1.6.3 I, [2024-05-25T20:21:58.156415 #507402] INFO -- : english 0.8.0 I, [2024-05-25T20:21:58.157002 #507402] INFO -- : erb 4.0.4 I, [2024-05-25T20:21:58.158213 #507402] INFO -- : error_highlight 0.6.0 I, [2024-05-25T20:21:58.158899 #507402] INFO -- : fileutils 1.7.2 I, [2024-05-25T20:21:58.159678 #507402] INFO -- : find 0.2.0 I, [2024-05-25T20:21:58.160551 #507402] INFO -- : forwardable 1.3.3 I, [2024-05-25T20:21:58.161609 #507402] INFO -- : ipaddr 1.2.6 I, [2024-05-25T20:21:58.162095 #507402] INFO -- : irb 1.13.1 I, [2024-05-25T20:21:58.162860 #507402] INFO -- : logger 1.6.0 I, [2024-05-25T20:21:58.163324 #507402] INFO -- : net-http 0.4.1 I, [2024-05-25T20:21:58.163834 #507402] INFO -- : net-protocol 0.2.2 I, [2024-05-25T20:21:58.164314 #507402] INFO -- : open-uri 0.4.1 I, [2024-05-25T20:21:58.164802 #507402] INFO -- : open3 0.2.1 I, [2024-05-25T20:21:58.165253 #507402] INFO -- : optparse 0.5.0 I, [2024-05-25T20:21:58.165643 #507402] INFO -- : ostruct 0.6.0 I, [2024-05-25T20:21:58.166117 #507402] INFO -- : pp 0.5.0 I, [2024-05-25T20:21:58.166676 #507402] INFO -- : prettyprint 0.2.0 I, [2024-05-25T20:21:58.167050 #507402] INFO -- : prism 0.29.0 I, [2024-05-25T20:21:58.167642 #507402] INFO -- : pstore 0.1.3 I, [2024-05-25T20:21:58.168094 #507402] INFO -- : rdoc 6.7.0 I, [2024-05-25T20:21:58.169078 #507402] INFO -- : readline 0.0.4 I, [2024-05-25T20:21:58.169556 #507402] INFO -- : reline 0.5.7 I, [2024-05-25T20:21:58.170054 #507402] INFO -- : resolv 0.4.0 I, [2024-05-25T20:21:58.170533 #507402] INFO -- : ruby2_keywords 0.0.5 I, [2024-05-25T20:21:58.170933 #507402] INFO -- : securerandom 0.3.1 I, [2024-05-25T20:21:58.172263 #507402] INFO -- : set 1.1.0 I, [2024-05-25T20:21:58.172759 #507402] INFO -- : shellwords 0.2.0 I, [2024-05-25T20:21:58.173237 #507402] INFO -- : singleton 0.2.0 I, [2024-05-25T20:21:58.173702 #507402] INFO -- : syntax_suggest 2.0.0 I, [2024-05-25T20:21:58.174309 #507402] INFO -- : tempfile 0.2.1 I, [2024-05-25T20:21:58.174838 #507402] INFO -- : time 0.3.0 I, [2024-05-25T20:21:58.175333 #507402] INFO -- : timeout 0.4.1 I, [2024-05-25T20:21:58.175739 #507402] INFO -- : tmpdir 0.2.0 I, [2024-05-25T20:21:58.176313 #507402] INFO -- : tsort 0.2.0 I, [2024-05-25T20:21:58.176775 #507402] INFO -- : un 0.3.0 I, [2024-05-25T20:21:58.177262 #507402] INFO -- : uri 0.13.0 I, [2024-05-25T20:21:58.177747 #507402] INFO -- : weakref 0.1.3 I, [2024-05-25T20:21:58.178223 #507402] INFO -- : yaml 0.3.0 I, [2024-05-25T20:21:58.178530 #507402] INFO -- : installing default gems from ext: /tmp/ruby/install/trunk/lib/ruby/gems/3.4.0+0 I, [2024-05-25T20:21:58.185260 #507402] INFO -- : date 3.3.4 I, [2024-05-25T20:21:58.185729 #507402] INFO -- : digest 3.1.1 I, [2024-05-25T20:21:58.186280 #507402] INFO -- : etc 1.4.3 I, [2024-05-25T20:21:58.186798 #507402] INFO -- : fcntl 1.1.0 I, [2024-05-25T20:21:58.187266 #507402] INFO -- : fiddle 1.1.3 I, [2024-05-25T20:21:58.187753 #507402] INFO -- : io-console 0.7.2 I, [2024-05-25T20:21:58.188216 #507402] INFO -- : io-nonblock 0.3.0 I, [2024-05-25T20:21:58.188676 #507402] INFO -- : io-wait 0.3.1 I, [2024-05-25T20:21:58.189100 #507402] INFO -- : json 2.7.2 I, [2024-05-25T20:21:58.189609 #507402] INFO -- : openssl 3.2.0 I, [2024-05-25T20:21:58.190127 #507402] INFO -- : pathname 0.3.0 I, [2024-05-25T20:21:58.190657 #507402] INFO -- : psych 5.1.2 I, [2024-05-25T20:21:58.191210 #507402] INFO -- : stringio 3.1.1 I, [2024-05-25T20:21:58.191705 #507402] INFO -- : strscan 3.1.1 I, [2024-05-25T20:21:58.192322 #507402] INFO -- : zlib 3.1.0 I, [2024-05-25T20:21:58.192679 #507402] INFO -- : installing bundled gems: /tmp/ruby/install/trunk/lib/ruby/gems/3.4.0+0 I, [2024-05-25T20:21:58.193260 #507402] INFO -- : minitest 5.23.1 I, [2024-05-25T20:21:58.201864 #507402] INFO -- : rake 13.2.1 I, [2024-05-25T20:21:58.205279 #507402] INFO -- : test-unit 3.6.2 I, [2024-05-25T20:21:58.210203 #507402] INFO -- : rexml 3.2.8 I, [2024-05-25T20:21:58.213983 #507402] INFO -- : rss 0.3.0 I, [2024-05-25T20:21:58.216654 #507402] INFO -- : net-ftp 0.3.4 I, [2024-05-25T20:21:58.218253 #507402] INFO -- : net-imap 0.4.11 I, [2024-05-25T20:21:58.221945 #507402] INFO -- : net-pop 0.1.2 I, [2024-05-25T20:21:58.222951 #507402] INFO -- : net-smtp 0.5.0 I, [2024-05-25T20:21:58.224293 #507402] INFO -- : matrix 0.4.2 I, [2024-05-25T20:21:58.227589 #507402] INFO -- : prime 0.1.2 I, [2024-05-25T20:21:58.232507 #507402] INFO -- : rbs 3.4.4 I, [2024-05-25T20:21:58.254563 #507402] INFO -- : typeprof 0.21.11 I, [2024-05-25T20:21:58.257288 #507402] INFO -- : debug 1.9.2 I, [2024-05-25T20:21:58.260556 #507402] INFO -- : racc 1.8.0 I, [2024-05-25T20:21:58.263246 #507402] INFO -- : mutex_m 0.2.0 I, [2024-05-25T20:21:58.264806 #507402] INFO -- : getoptlong 0.2.1 I, [2024-05-25T20:21:58.266187 #507402] INFO -- : base64 0.2.0 I, [2024-05-25T20:21:58.267284 #507402] INFO -- : bigdecimal 3.1.8 I, [2024-05-25T20:21:58.269835 #507402] INFO -- : observer 0.1.2 I, [2024-05-25T20:21:58.271002 #507402] INFO -- : abbrev 0.1.2 I, [2024-05-25T20:21:58.272444 #507402] INFO -- : resolv-replace 0.1.1 I, [2024-05-25T20:21:58.273692 #507402] INFO -- : rinda 0.2.0 I, [2024-05-25T20:21:58.275038 #507402] INFO -- : drb 2.2.1 I, [2024-05-25T20:21:58.276639 #507402] INFO -- : nkf 0.2.0 I, [2024-05-25T20:21:58.279103 #507402] INFO -- : syslog 0.1.2 I, [2024-05-25T20:21:58.281475 #507402] INFO -- : csv 3.3.0 I, [2024-05-25T20:21:58.283961 #507402] INFO -- : installing bundled gem cache: /tmp/ruby/install/trunk/lib/ruby/gems/3.4.0+0/cache I, [2024-05-25T20:21:58.285337 #507402] INFO -- : skipped bundled gems: I, [2024-05-25T20:21:58.285357 #507402] INFO -- : power_assert-2.0.4dev.gem not found in bundled_gems I, [2024-05-25T20:21:58.288628 #507402] INFO -- : $$$[end] "make install -j20" exit with 0. I, [2024-05-25T20:21:58.288722 #507402] INFO -- : $$$[beg] make yes-btest TESTOPTS='-q -j20' I, [2024-05-25T20:22:03.786929 #507402] INFO -- : PASS all 1936 tests E, [2024-05-25T20:22:03.792305 #507402] ERROR -- : I, [2024-05-25T20:22:03.792441 #507402] INFO -- : $$$[end] "make yes-btest TESTOPTS='-q -j20'" exit with 0. I, [2024-05-25T20:22:03.792527 #507402] INFO -- : $$$[beg] make yes-test-basic TESTS='-j20' I, [2024-05-25T20:22:03.853691 #507402] INFO -- : BASERUBY = /usr/bin/ruby --disable=gems I, [2024-05-25T20:22:03.853725 #507402] INFO -- : CC = gcc I, [2024-05-25T20:22:03.853733 #507402] INFO -- : LD = ld I, [2024-05-25T20:22:03.853738 #507402] INFO -- : LDSHARED = gcc -shared I, [2024-05-25T20:22:03.853742 #507402] INFO -- : CFLAGS = -O3 -fno-fast-math -ggdb3 -Wall -Wextra -Wdeprecated-declarations -Wdiv-by-zero -Wduplicated-cond -Wimplicit-function-declaration -Wimplicit-int -Wpointer-arith -Wwrite-strings -Wold-style-definition -Wimplicit-fallthrough=0 -Wmissing-noreturn -Wno-cast-function-type -Wno-constant-logical-operand -Wno-long-long -Wno-missing-field-initializers -Wno-overlength-strings -Wno-packed-bitfield-compat -Wno-parentheses-equality -Wno-self-assign -Wno-tautological-compare -Wno-unused-parameter -Wno-unused-value -Wsuggest-attribute=format -Wsuggest-attribute=noreturn -Wunused-variable -Wmisleading-indentation -Wundef -fPIC I, [2024-05-25T20:22:03.853747 #507402] INFO -- : XCFLAGS = -U_FORTIFY_SOURCE -D_FORTIFY_SOURCE=2 -fstack-protector-strong -fno-strict-overflow -fvisibility=hidden -fexcess-precision=standard -DRUBY_EXPORT -I. -I.ext/include/x86_64-linux -I/tmp/ruby/src/trunk/include -I/tmp/ruby/src/trunk -I/tmp/ruby/src/trunk/prism -I/tmp/ruby/src/trunk/enc/unicode/15.0.0 I, [2024-05-25T20:22:03.853751 #507402] INFO -- : CPPFLAGS = I, [2024-05-25T20:22:03.853759 #507402] INFO -- : DLDFLAGS = -Wl,--compress-debug-sections=zlib -Wl,-soname,libruby.so.3.4 -fstack-protector-strong I, [2024-05-25T20:22:03.853763 #507402] INFO -- : SOLIBS = -lz -lrt -lrt -lgmp -ldl -lcrypt -lm -lpthread I, [2024-05-25T20:22:03.853767 #507402] INFO -- : LANG = en_US.UTF-8 I, [2024-05-25T20:22:03.853770 #507402] INFO -- : LC_ALL = I, [2024-05-25T20:22:03.853774 #507402] INFO -- : LC_CTYPE = I, [2024-05-25T20:22:03.853777 #507402] INFO -- : MFLAGS = I, [2024-05-25T20:22:03.853780 #507402] INFO -- : RUSTC = no I, [2024-05-25T20:22:03.853785 #507402] INFO -- : YJIT_RUSTC_ARGS = --crate-name=yjit --crate-type=staticlib --edition=2021 -g -C lto=thin -C opt-level=3 -C overflow-checks=on '--out-dir=/tmp/ruby/build/trunk/yjit/target/release/' /tmp/ruby/src/trunk/yjit/src/lib.rs I, [2024-05-25T20:22:03.854244 #507402] INFO -- : gcc (Ubuntu 11.4.0-1ubuntu1~22.04) 11.4.0 I, [2024-05-25T20:22:03.854249 #507402] INFO -- : Copyright (C) 2021 Free Software Foundation, Inc. I, [2024-05-25T20:22:03.854252 #507402] INFO -- : This is free software; see the source for copying conditions. There is NO I, [2024-05-25T20:22:03.854256 #507402] INFO -- : warranty; not even for MERCHANTABILITY or FITNESS FOR A PARTICULAR PURPOSE. I, [2024-05-25T20:22:03.854260 #507402] INFO -- : I, [2024-05-25T20:22:03.957441 #507402] INFO -- : Checking leaked global symbols...none I, [2024-05-25T20:22:03.999084 #507402] INFO -- : /tmp/ruby/src/trunk/basictest/test.rb:assignment ....................................................................................................................................................................................................................................................................................................................................................................................OK 372 I, [2024-05-25T20:22:03.999178 #507402] INFO -- : /tmp/ruby/src/trunk/basictest/test.rb:condition ..OK 2 I, [2024-05-25T20:22:03.999189 #507402] INFO -- : /tmp/ruby/src/trunk/basictest/test.rb:if/unless ...OK 3 I, [2024-05-25T20:22:03.999197 #507402] INFO -- : /tmp/ruby/src/trunk/basictest/test.rb:case .....OK 5 I, [2024-05-25T20:22:03.999391 #507402] INFO -- : /tmp/ruby/src/trunk/basictest/test.rb:while/until ........OK 8 I, [2024-05-25T20:22:03.999466 #507402] INFO -- : /tmp/ruby/src/trunk/basictest/test.rb:exception ..........OK 10 I, [2024-05-25T20:22:03.999812 #507402] INFO -- : /tmp/ruby/src/trunk/basictest/test.rb:array .......................................OK 39 I, [2024-05-25T20:22:03.999962 #507402] INFO -- : /tmp/ruby/src/trunk/basictest/test.rb:hash ...........................OK 27 I, [2024-05-25T20:22:04.000835 #507402] INFO -- : /tmp/ruby/src/trunk/basictest/test.rb:iterator ...........................................................................................................OK 107 I, [2024-05-25T20:22:04.001235 #507402] INFO -- : /tmp/ruby/src/trunk/basictest/test.rb:float ................................................................................OK 80 I, [2024-05-25T20:22:04.003173 #507402] INFO -- : /tmp/ruby/src/trunk/basictest/test.rb:bignum ...............................OK 31 I, [2024-05-25T20:22:04.004018 #507402] INFO -- : /tmp/ruby/src/trunk/basictest/test.rb:string & char ..............................................................OK 62 I, [2024-05-25T20:22:04.004061 #507402] INFO -- : /tmp/ruby/src/trunk/basictest/test.rb:assignment ..........OK 10 I, [2024-05-25T20:22:04.004102 #507402] INFO -- : /tmp/ruby/src/trunk/basictest/test.rb:call ......OK 6 I, [2024-05-25T20:22:04.004172 #507402] INFO -- : /tmp/ruby/src/trunk/basictest/test.rb:proc .........OK 9 I, [2024-05-25T20:22:04.104897 #507402] INFO -- : /tmp/ruby/src/trunk/basictest/test.rb:signal ..OK 2 I, [2024-05-25T20:22:04.107712 #507402] INFO -- : /tmp/ruby/src/trunk/basictest/test.rb:eval ...........................OK 27 I, [2024-05-25T20:22:04.230404 #507402] INFO -- : /tmp/ruby/src/trunk/basictest/test.rb:system ........OK 8 I, [2024-05-25T20:22:04.230494 #507402] INFO -- : /tmp/ruby/src/trunk/basictest/test.rb:const .....OK 5 I, [2024-05-25T20:22:04.230565 #507402] INFO -- : /tmp/ruby/src/trunk/basictest/test.rb:clone .....OK 5 I, [2024-05-25T20:22:04.230756 #507402] INFO -- : /tmp/ruby/src/trunk/basictest/test.rb:marshal ....OK 4 I, [2024-05-25T20:22:04.230838 #507402] INFO -- : /tmp/ruby/src/trunk/basictest/test.rb:pack ....OK 4 I, [2024-05-25T20:22:04.230866 #507402] INFO -- : /tmp/ruby/src/trunk/basictest/test.rb:math ..OK 2 I, [2024-05-25T20:22:04.230945 #507402] INFO -- : /tmp/ruby/src/trunk/basictest/test.rb:struct ......OK 6 I, [2024-05-25T20:22:04.231086 #507402] INFO -- : /tmp/ruby/src/trunk/basictest/test.rb:variable ............OK 12 I, [2024-05-25T20:22:04.231123 #507402] INFO -- : /tmp/ruby/src/trunk/basictest/test.rb:trace ...OK 3 I, [2024-05-25T20:22:04.231219 #507402] INFO -- : /tmp/ruby/src/trunk/basictest/test.rb:defined? ............OK 12 I, [2024-05-25T20:22:04.231288 #507402] INFO -- : /tmp/ruby/src/trunk/basictest/test.rb:alias ......OK 6 I, [2024-05-25T20:22:04.231756 #507402] INFO -- : /tmp/ruby/src/trunk/basictest/test.rb:path .......................OK 23 I, [2024-05-25T20:22:04.269237 #507402] INFO -- : /tmp/ruby/src/trunk/basictest/test.rb:gc ....OK 4 I, [2024-05-25T20:22:04.271684 #507402] INFO -- : I, [2024-05-25T20:22:04.271728 #507402] INFO -- : test succeeded I, [2024-05-25T20:22:04.273288 #507402] INFO -- : $$$[end] "make yes-test-basic TESTS='-j20'" exit with 0. I, [2024-05-25T20:22:04.273372 #507402] INFO -- : $$$[beg] make yes-test-all TESTOPTS='--stderr-on-failure' TESTS='-j20' I, [2024-05-25T20:22:04.363519 #507402] INFO -- : BASERUBY = /usr/bin/ruby --disable=gems I, [2024-05-25T20:22:04.363571 #507402] INFO -- : CC = gcc I, [2024-05-25T20:22:04.363594 #507402] INFO -- : LD = ld I, [2024-05-25T20:22:04.363606 #507402] INFO -- : LDSHARED = gcc -shared I, [2024-05-25T20:22:04.363621 #507402] INFO -- : CFLAGS = -O3 -fno-fast-math -ggdb3 -Wall -Wextra -Wdeprecated-declarations -Wdiv-by-zero -Wduplicated-cond -Wimplicit-function-declaration -Wimplicit-int -Wpointer-arith -Wwrite-strings -Wold-style-definition -Wimplicit-fallthrough=0 -Wmissing-noreturn -Wno-cast-function-type -Wno-constant-logical-operand -Wno-long-long -Wno-missing-field-initializers -Wno-overlength-strings -Wno-packed-bitfield-compat -Wno-parentheses-equality -Wno-self-assign -Wno-tautological-compare -Wno-unused-parameter -Wno-unused-value -Wsuggest-attribute=format -Wsuggest-attribute=noreturn -Wunused-variable -Wmisleading-indentation -Wundef -fPIC I, [2024-05-25T20:22:04.363634 #507402] INFO -- : XCFLAGS = -U_FORTIFY_SOURCE -D_FORTIFY_SOURCE=2 -fstack-protector-strong -fno-strict-overflow -fvisibility=hidden -fexcess-precision=standard -DRUBY_EXPORT -I. -I.ext/include/x86_64-linux -I/tmp/ruby/src/trunk/include -I/tmp/ruby/src/trunk -I/tmp/ruby/src/trunk/prism -I/tmp/ruby/src/trunk/enc/unicode/15.0.0 I, [2024-05-25T20:22:04.363644 #507402] INFO -- : CPPFLAGS = I, [2024-05-25T20:22:04.363654 #507402] INFO -- : DLDFLAGS = -Wl,--compress-debug-sections=zlib -Wl,-soname,libruby.so.3.4 -fstack-protector-strong I, [2024-05-25T20:22:04.363664 #507402] INFO -- : SOLIBS = -lz -lrt -lrt -lgmp -ldl -lcrypt -lm -lpthread I, [2024-05-25T20:22:04.363674 #507402] INFO -- : LANG = en_US.UTF-8 I, [2024-05-25T20:22:04.363684 #507402] INFO -- : LC_ALL = I, [2024-05-25T20:22:04.363698 #507402] INFO -- : LC_CTYPE = I, [2024-05-25T20:22:04.363709 #507402] INFO -- : MFLAGS = I, [2024-05-25T20:22:04.363719 #507402] INFO -- : RUSTC = no I, [2024-05-25T20:22:04.363732 #507402] INFO -- : YJIT_RUSTC_ARGS = --crate-name=yjit --crate-type=staticlib --edition=2021 -g -C lto=thin -C opt-level=3 -C overflow-checks=on '--out-dir=/tmp/ruby/build/trunk/yjit/target/release/' /tmp/ruby/src/trunk/yjit/src/lib.rs I, [2024-05-25T20:22:04.364223 #507402] INFO -- : gcc (Ubuntu 11.4.0-1ubuntu1~22.04) 11.4.0 I, [2024-05-25T20:22:04.364280 #507402] INFO -- : Copyright (C) 2021 Free Software Foundation, Inc. I, [2024-05-25T20:22:04.364293 #507402] INFO -- : This is free software; see the source for copying conditions. There is NO I, [2024-05-25T20:22:04.364305 #507402] INFO -- : warranty; not even for MERCHANTABILITY or FITNESS FOR A PARTICULAR PURPOSE. I, [2024-05-25T20:22:04.364315 #507402] INFO -- : I, [2024-05-25T20:22:04.365927 #507402] INFO -- : generating enc.mk I, [2024-05-25T20:22:04.485523 #507402] INFO -- : generating encdb.h I, [2024-05-25T20:22:04.509289 #507402] INFO -- : encdb.h unchanged I, [2024-05-25T20:22:04.510375 #507402] INFO -- : making enc I, [2024-05-25T20:22:04.528304 #507402] INFO -- : make[1]: Entering directory '/tmp/ruby/build/trunk' I, [2024-05-25T20:22:04.528366 #507402] INFO -- : make[1]: Nothing to be done for 'enc'. I, [2024-05-25T20:22:04.528382 #507402] INFO -- : make[1]: Leaving directory '/tmp/ruby/build/trunk' I, [2024-05-25T20:22:04.529012 #507402] INFO -- : making srcs under enc I, [2024-05-25T20:22:04.559802 #507402] INFO -- : make[1]: Entering directory '/tmp/ruby/build/trunk' I, [2024-05-25T20:22:04.559870 #507402] INFO -- : make[1]: Nothing to be done for 'srcs'. I, [2024-05-25T20:22:04.559884 #507402] INFO -- : make[1]: Leaving directory '/tmp/ruby/build/trunk' I, [2024-05-25T20:22:04.560733 #507402] INFO -- : generating transdb.h I, [2024-05-25T20:22:04.657825 #507402] INFO -- : transdb.h unchanged I, [2024-05-25T20:22:04.659252 #507402] INFO -- : making trans I, [2024-05-25T20:22:04.693113 #507402] INFO -- : make[1]: Entering directory '/tmp/ruby/build/trunk' I, [2024-05-25T20:22:04.693182 #507402] INFO -- : make[1]: Nothing to be done for 'trans'. I, [2024-05-25T20:22:04.693196 #507402] INFO -- : make[1]: Leaving directory '/tmp/ruby/build/trunk' I, [2024-05-25T20:22:04.693856 #507402] INFO -- : making encs I, [2024-05-25T20:22:04.731584 #507402] INFO -- : make[1]: Entering directory '/tmp/ruby/build/trunk' I, [2024-05-25T20:22:04.731650 #507402] INFO -- : make[1]: Nothing to be done for 'encs'. I, [2024-05-25T20:22:04.731663 #507402] INFO -- : make[1]: Leaving directory '/tmp/ruby/build/trunk' I, [2024-05-25T20:22:04.733376 #507402] INFO -- : generating makefiles ext/configure-ext.mk I, [2024-05-25T20:22:04.760677 #507402] INFO -- : ext/configure-ext.mk updated I, [2024-05-25T20:22:04.763188 #507402] INFO -- : make[1]: Entering directory '/tmp/ruby/build/trunk' I, [2024-05-25T20:22:06.166707 #507402] INFO -- : make[1]: Leaving directory '/tmp/ruby/build/trunk' I, [2024-05-25T20:22:06.167409 #507402] INFO -- : generating makefile exts.mk I, [2024-05-25T20:22:06.205522 #507402] INFO -- : exts.mk unchanged I, [2024-05-25T20:22:06.209983 #507402] INFO -- : make[1]: Entering directory '/tmp/ruby/build/trunk' I, [2024-05-25T20:22:06.534410 #507402] INFO -- : make[2]: Entering directory '/tmp/ruby/build/trunk/ext/coverage' I, [2024-05-25T20:22:06.538112 #507402] INFO -- : make[2]: Leaving directory '/tmp/ruby/build/trunk/ext/coverage' I, [2024-05-25T20:22:06.543215 #507402] INFO -- : make[2]: Entering directory '/tmp/ruby/build/trunk/ext/date' I, [2024-05-25T20:22:06.548412 #507402] INFO -- : make[2]: Leaving directory '/tmp/ruby/build/trunk/ext/date' I, [2024-05-25T20:22:06.552138 #507402] INFO -- : make[2]: Entering directory '/tmp/ruby/build/trunk/ext/digest' I, [2024-05-25T20:22:06.561198 #507402] INFO -- : make[2]: Leaving directory '/tmp/ruby/build/trunk/ext/digest' I, [2024-05-25T20:22:06.586826 #507402] INFO -- : make[2]: Entering directory '/tmp/ruby/build/trunk/ext/digest/sha2' I, [2024-05-25T20:22:06.591677 #507402] INFO -- : make[2]: Leaving directory '/tmp/ruby/build/trunk/ext/digest/sha2' I, [2024-05-25T20:22:06.613552 #507402] INFO -- : make[2]: Entering directory '/tmp/ruby/build/trunk/ext/fiddle' I, [2024-05-25T20:22:06.624890 #507402] INFO -- : make[2]: Leaving directory '/tmp/ruby/build/trunk/ext/fiddle' I, [2024-05-25T20:22:06.629911 #507402] INFO -- : make[2]: Entering directory '/tmp/ruby/build/trunk/ext/io/console' I, [2024-05-25T20:22:06.634167 #507402] INFO -- : make[2]: Leaving directory '/tmp/ruby/build/trunk/ext/io/console' I, [2024-05-25T20:22:06.647469 #507402] INFO -- : make[2]: Entering directory '/tmp/ruby/build/trunk/ext/json' I, [2024-05-25T20:22:06.658165 #507402] INFO -- : make[2]: Leaving directory '/tmp/ruby/build/trunk/ext/json' I, [2024-05-25T20:22:06.673611 #507402] INFO -- : make[2]: Entering directory '/tmp/ruby/build/trunk/ext/monitor' I, [2024-05-25T20:22:06.677625 #507402] INFO -- : make[2]: Leaving directory '/tmp/ruby/build/trunk/ext/monitor' I, [2024-05-25T20:22:06.684780 #507402] INFO -- : make[2]: Entering directory '/tmp/ruby/build/trunk/ext/objspace' I, [2024-05-25T20:22:06.690885 #507402] INFO -- : make[2]: Leaving directory '/tmp/ruby/build/trunk/ext/objspace' I, [2024-05-25T20:22:06.709381 #507402] INFO -- : make[2]: Entering directory '/tmp/ruby/build/trunk/ext/openssl' I, [2024-05-25T20:22:06.727150 #507402] INFO -- : make[2]: Leaving directory '/tmp/ruby/build/trunk/ext/openssl' I, [2024-05-25T20:22:06.732072 #507402] INFO -- : make[2]: Entering directory '/tmp/ruby/build/trunk/ext/pathname' I, [2024-05-25T20:22:06.735914 #507402] INFO -- : make[2]: Leaving directory '/tmp/ruby/build/trunk/ext/pathname' I, [2024-05-25T20:22:06.743227 #507402] INFO -- : make[2]: Entering directory '/tmp/ruby/build/trunk/ext/psych' I, [2024-05-25T20:22:06.764024 #507402] INFO -- : make[2]: Leaving directory '/tmp/ruby/build/trunk/ext/psych' I, [2024-05-25T20:22:06.769255 #507402] INFO -- : make[2]: Entering directory '/tmp/ruby/build/trunk/ext/pty' I, [2024-05-25T20:22:06.773367 #507402] INFO -- : make[2]: Leaving directory '/tmp/ruby/build/trunk/ext/pty' I, [2024-05-25T20:22:06.789518 #507402] INFO -- : make[2]: Entering directory '/tmp/ruby/build/trunk/ext/ripper' I, [2024-05-25T20:22:06.797837 #507402] INFO -- : make[2]: Leaving directory '/tmp/ruby/build/trunk/ext/ripper' I, [2024-05-25T20:22:06.800405 #507402] INFO -- : make[2]: Entering directory '/tmp/ruby/build/trunk/ext/rubyvm' I, [2024-05-25T20:22:06.803675 #507402] INFO -- : make[2]: Leaving directory '/tmp/ruby/build/trunk/ext/rubyvm' I, [2024-05-25T20:22:06.814820 #507402] INFO -- : make[2]: Entering directory '/tmp/ruby/build/trunk/ext/socket' I, [2024-05-25T20:22:06.823003 #507402] INFO -- : make[2]: Leaving directory '/tmp/ruby/build/trunk/ext/socket' I, [2024-05-25T20:22:06.841443 #507402] INFO -- : make[2]: Entering directory '/tmp/ruby/build/trunk/.bundle/gems/bigdecimal-3.1.8/ext/bigdecimal' I, [2024-05-25T20:22:06.873096 #507402] INFO -- : make[2]: Leaving directory '/tmp/ruby/build/trunk/.bundle/gems/bigdecimal-3.1.8/ext/bigdecimal' I, [2024-05-25T20:22:06.875025 #507402] INFO -- : make[2]: Entering directory '/tmp/ruby/build/trunk/.bundle/gems/debug-1.9.2/ext/debug' I, [2024-05-25T20:22:06.896629 #507402] INFO -- : make[2]: Leaving directory '/tmp/ruby/build/trunk/.bundle/gems/debug-1.9.2/ext/debug' I, [2024-05-25T20:22:06.898520 #507402] INFO -- : make[2]: Entering directory '/tmp/ruby/build/trunk/.bundle/gems/nkf-0.2.0/ext/nkf' I, [2024-05-25T20:22:06.919901 #507402] INFO -- : make[2]: Leaving directory '/tmp/ruby/build/trunk/.bundle/gems/nkf-0.2.0/ext/nkf' I, [2024-05-25T20:22:06.921672 #507402] INFO -- : make[2]: Entering directory '/tmp/ruby/build/trunk/.bundle/gems/racc-1.7.3/ext/racc/cparse' I, [2024-05-25T20:22:06.944673 #507402] INFO -- : make[2]: Leaving directory '/tmp/ruby/build/trunk/.bundle/gems/racc-1.7.3/ext/racc/cparse' I, [2024-05-25T20:22:06.947710 #507402] INFO -- : make[2]: Entering directory '/tmp/ruby/build/trunk/.bundle/gems/racc-1.8.0/ext/racc/cparse' I, [2024-05-25T20:22:06.976681 #507402] INFO -- : make[2]: Leaving directory '/tmp/ruby/build/trunk/.bundle/gems/racc-1.8.0/ext/racc/cparse' I, [2024-05-25T20:22:06.978981 #507402] INFO -- : make[2]: Entering directory '/tmp/ruby/build/trunk/.bundle/gems/rbs-3.4.4/ext/rbs_extension' I, [2024-05-25T20:22:07.004385 #507402] INFO -- : make[2]: Leaving directory '/tmp/ruby/build/trunk/.bundle/gems/rbs-3.4.4/ext/rbs_extension' I, [2024-05-25T20:22:07.006743 #507402] INFO -- : make[2]: Entering directory '/tmp/ruby/build/trunk/.bundle/gems/syslog-0.1.2/ext/syslog' I, [2024-05-25T20:22:07.034232 #507402] INFO -- : make[2]: Leaving directory '/tmp/ruby/build/trunk/.bundle/gems/syslog-0.1.2/ext/syslog' I, [2024-05-25T20:22:07.057493 #507402] INFO -- : make[2]: Entering directory '/tmp/ruby/build/trunk' I, [2024-05-25T20:22:07.124099 #507402] INFO -- : make[2]: 'ruby' is up to date. I, [2024-05-25T20:22:07.124167 #507402] INFO -- : make[2]: Leaving directory '/tmp/ruby/build/trunk' I, [2024-05-25T20:22:07.124566 #507402] INFO -- : make[1]: Leaving directory '/tmp/ruby/build/trunk' I, [2024-05-25T20:22:07.128419 #507402] INFO -- : make[1]: Entering directory '/tmp/ruby/build/trunk' I, [2024-05-25T20:22:07.128472 #507402] INFO -- : make[1]: Nothing to be done for 'note'. I, [2024-05-25T20:22:07.128490 #507402] INFO -- : make[1]: Leaving directory '/tmp/ruby/build/trunk' I, [2024-05-25T20:22:07.204476 #507402] INFO -- : Run options: I, [2024-05-25T20:22:07.204556 #507402] INFO -- : --seed=62775 I, [2024-05-25T20:22:07.204569 #507402] INFO -- : "--ruby=./miniruby -I/tmp/ruby/src/trunk/lib -I. -I.ext/common /tmp/ruby/src/trunk/tool/runruby.rb --extout=.ext -- --disable-gems" I, [2024-05-25T20:22:07.204583 #507402] INFO -- : --excludes-dir=/tmp/ruby/src/trunk/test/.excludes I, [2024-05-25T20:22:07.204593 #507402] INFO -- : --name=!/memory_leak/ I, [2024-05-25T20:22:07.204603 #507402] INFO -- : --stderr-on-failure I, [2024-05-25T20:22:07.204613 #507402] INFO -- : -j20 I, [2024-05-25T20:22:07.204623 #507402] INFO -- : I, [2024-05-25T20:22:07.204633 #507402] INFO -- : # Running tests: I, [2024-05-25T20:22:07.204644 #507402] INFO -- : I, [2024-05-25T20:22:07.329267 #507402] INFO -- : [ 1/883] 548769=test_cp949 I, [2024-05-25T20:22:07.352303 #507402] INFO -- : [ 2/883] 548769=test_gem_commands_uninstall_command I, [2024-05-25T20:22:07.352667 #507402] INFO -- : [ 3/883] 548754=test_condition I, [2024-05-25T20:22:07.352752 #507402] INFO -- : [ 4/883] 548752=test_gem_source_specific_file I, [2024-05-25T20:22:07.352847 #507402] INFO -- : [ 5/883] 548753=test_foreach I, [2024-05-25T20:22:07.353035 #507402] INFO -- : [ 6/883] 548757=test_gem_unsatisfiable_dependency_error I, [2024-05-25T20:22:07.356110 #507402] INFO -- : [ 7/883] 548756=test_win32ole_record I, [2024-05-25T20:22:07.356400 #507402] INFO -- : [ 8/883] 548756=test_sorted_set I, [2024-05-25T20:22:07.356960 #507402] INFO -- : [ 9/883] 548766=test_emoji I, [2024-05-25T20:22:07.357851 #507402] INFO -- : [ 10/883] 548768=test_win32ole_type_event I, [2024-05-25T20:22:07.358260 #507402] INFO -- : [ 11/883] 548753=test_hash I, [2024-05-25T20:22:07.358444 #507402] INFO -- : [ 12/883] 548767=test_ubf_async_safe I, [2024-05-25T20:22:07.358927 #507402] INFO -- : [ 13/883] 548770=test_io I, [2024-05-25T20:22:07.359792 #507402] INFO -- : [ 14/883] 548771=test_ellipsize I, [2024-05-25T20:22:07.360294 #507402] INFO -- : [ 15/883] 548754=test_date_attr I, [2024-05-25T20:22:07.363675 #507402] INFO -- : [ 16/883] 548768=test_io_wait I, [2024-05-25T20:22:07.371922 #507402] INFO -- : [ 17/883] 548767=test_gem_commands_exec_command I, [2024-05-25T20:22:07.372094 #507402] INFO -- : [ 18/883] 548754=warnings_test I, [2024-05-25T20:22:07.372282 #507402] INFO -- : [ 19/883] 548755=test_kwargs I, [2024-05-25T20:22:07.376593 #507402] INFO -- : [ 20/883] 548755=test_type_completor I, [2024-05-25T20:22:07.377865 #507402] INFO -- : [ 21/883] 548771=test_console_attr I, [2024-05-25T20:22:07.380096 #507402] INFO -- : [ 22/883] 548771=test_summary I, [2024-05-25T20:22:07.380260 #507402] INFO -- : [ 23/883] 548755=test_euc_kr I, [2024-05-25T20:22:07.384685 #507402] INFO -- : [ 24/883] 548755=test_rdoc_context_section I, [2024-05-25T20:22:07.386280 #507402] INFO -- : [ 25/883] 548761=test_ftp I, [2024-05-25T20:22:07.387347 #507402] INFO -- : [ 26/883] 548759=test_pattern_key_name_check I, [2024-05-25T20:22:07.387385 #507402] INFO -- : [ 27/883] 548758=test_to_ruby I, [2024-05-25T20:22:07.390238 #507402] INFO -- : [ 28/883] 548763=test_gem_impossible_dependencies_error I, [2024-05-25T20:22:07.390301 #507402] INFO -- : [ 29/883] 548764=test_pack I, [2024-05-25T20:22:07.390362 #507402] INFO -- : [ 30/883] 548765=test_array_create I, [2024-05-25T20:22:07.394678 #507402] INFO -- : [ 31/883] 548765=test_gem_commands_query_command I, [2024-05-25T20:22:07.395985 #507402] INFO -- : [ 32/883] 548759=test_method I, [2024-05-25T20:22:07.398226 #507402] INFO -- : [ 33/883] 548766=test_rdoc_rubygems_hook I, [2024-05-25T20:22:07.412478 #507402] INFO -- : [ 34/883] 548762=test_lock_native_thread I, [2024-05-25T20:22:07.414698 #507402] INFO -- : [ 35/883] 548761=test_c_struct_entry I, [2024-05-25T20:22:07.431055 #507402] INFO -- : [ 36/883] 548760=test_gem_commands_stale_command I, [2024-05-25T20:22:07.433899 #507402] INFO -- : [ 37/883] 548758=test_remote_fetch_error I, [2024-05-25T20:22:07.442957 #507402] INFO -- : [ 38/883] 548754=test_have_library I, [2024-05-25T20:22:07.512592 #507402] INFO -- : [ 39/883] 548761=test_show_source I, [2024-05-25T20:22:07.516857 #507402] INFO -- : [ 40/883] 548771=test_set I, [2024-05-25T20:22:07.532330 #507402] INFO -- : [ 41/883] 548757=test_string_memory I, [2024-05-25T20:22:07.535368 #507402] INFO -- : [ 42/883] 548771=comments_test I, [2024-05-25T20:22:07.547959 #507402] INFO -- : [ 43/883] 548755=test_gem_requirement I, [2024-05-25T20:22:07.561707 #507402] INFO -- : [ 44/883] 548757=test_sprintf I, [2024-05-25T20:22:07.563542 #507402] INFO -- : [ 45/883] 548766=test_gem_security_trust_dir I, [2024-05-25T20:22:07.588959 #507402] INFO -- : [ 46/883] 548760=test_objspace I, [2024-05-25T20:22:07.604690 #507402] INFO -- : [ 47/883] 548763=ripper_test I, [2024-05-25T20:22:07.605109 #507402] INFO -- : [ 48/883] 548756=test_line_editor I, [2024-05-25T20:22:07.607782 #507402] INFO -- : [ 49/883] 548771=test_undef I, [2024-05-25T20:22:07.609460 #507402] INFO -- : [ 50/883] 548764=test_kill_ring I, [2024-05-25T20:22:07.614398 #507402] INFO -- : [ 51/883] 548771=test_framework I, [2024-05-25T20:22:07.621902 #507402] INFO -- : [ 52/883] 548752=test_ns_spki I, [2024-05-25T20:22:07.629038 #507402] INFO -- : [ 53/883] 548770=test_argf I, [2024-05-25T20:22:07.629768 #507402] INFO -- : [ 54/883] 548771=test_ws I, [2024-05-25T20:22:07.633840 #507402] INFO -- : [ 55/883] 548761=test_gem_commands_environment_command I, [2024-05-25T20:22:07.638818 #507402] INFO -- : [ 56/883] 548758=test_m17n I, [2024-05-25T20:22:07.647909 #507402] INFO -- : [ 57/883] 548752=test_workspace I, [2024-05-25T20:22:07.654885 #507402] INFO -- : [ 58/883] 548771=test_weakmap I, [2024-05-25T20:22:07.664304 #507402] INFO -- : [ 59/883] 548756=test_yjit I, [2024-05-25T20:22:07.670135 #507402] INFO -- : [ 60/883] 548756=test_gem_request_set_lockfile I, [2024-05-25T20:22:07.684039 #507402] INFO -- : [ 61/883] 548764=test_raise_exception I, [2024-05-25T20:22:07.692095 #507402] INFO -- : [ 62/883] 548762=test_protect I, [2024-05-25T20:22:07.692708 #507402] INFO -- : [ 63/883] 548762=test_win32ole_typelib I, [2024-05-25T20:22:07.695196 #507402] INFO -- : [ 64/883] 548762=test_gem_resolver_dependency_request I, [2024-05-25T20:22:07.708569 #507402] INFO -- : [ 65/883] 548768=test_tree_builder I, [2024-05-25T20:22:07.713879 #507402] INFO -- : [ 66/883] 548758=test_hash I, [2024-05-25T20:22:07.727545 #507402] INFO -- : [ 67/883] 548758=test_postponed_job I, [2024-05-25T20:22:07.750871 #507402] INFO -- : [ 68/883] 548766=test_alias_and_anchor I, [2024-05-25T20:22:07.753833 #507402] INFO -- : [ 69/883] 548768=test_external_new I, [2024-05-25T20:22:07.760799 #507402] INFO -- : [ 70/883] 548768=test_readpartial I, [2024-05-25T20:22:07.768263 #507402] INFO -- : [ 71/883] 548766=test_clone I, [2024-05-25T20:22:07.805385 #507402] INFO -- : [ 72/883] 548757=test_gem_commands_install_command I, [2024-05-25T20:22:07.876257 #507402] INFO -- : [ 73/883] 548752=test_rdoc_require I, [2024-05-25T20:22:07.900562 #507402] INFO -- : [ 74/883] 548761=locals_test I, [2024-05-25T20:22:07.901329 #507402] INFO -- : [ 75/883] 548755=test_rdoc_markup_indented_paragraph I, [2024-05-25T20:22:07.907404 #507402] INFO -- : [ 76/883] 548755=test_gem_resolver_conflict I, [2024-05-25T20:22:07.919299 #507402] INFO -- : [ 77/883] 548755=test_rdoc_task I, [2024-05-25T20:22:07.927565 #507402] INFO -- : [ 78/883] 548755=ruby_parser_test I, [2024-05-25T20:22:07.938465 #507402] INFO -- : [ 79/883] 548762=test_backtrace I, [2024-05-25T20:22:07.971337 #507402] INFO -- : [ 80/883] 548766=test_pack I, [2024-05-25T20:22:07.995489 #507402] INFO -- : [ 81/883] 548766=test_io_buffer I, [2024-05-25T20:22:08.025378 #507402] INFO -- : [ 82/883] 548755=test_rdoc_alias I, [2024-05-25T20:22:08.062041 #507402] INFO -- : [ 83/883] 548765=test_yield I, [2024-05-25T20:22:08.069172 #507402] INFO -- : [ 84/883] 548752=test_convertible I, [2024-05-25T20:22:08.071366 #507402] INFO -- : [ 85/883] 548758=parser_test I, [2024-05-25T20:22:08.081590 #507402] INFO -- : [ 86/883] 548755=test_stringscanner I, [2024-05-25T20:22:08.103737 #507402] INFO -- : [ 87/883] 548766=test_files_sample I, [2024-05-25T20:22:08.117516 #507402] INFO -- : [ 88/883] 548755=test_rdoc_markup_to_html_crossref I, [2024-05-25T20:22:08.164937 #507402] INFO -- : [ 89/883] 548768=test_gem_resolver_best_set I, [2024-05-25T20:22:08.175665 #507402] INFO -- : [ 90/883] 548758=encoding_test I, [2024-05-25T20:22:08.202659 #507402] INFO -- : [ 91/883] 548763=test_typeddata I, [2024-05-25T20:22:08.207327 #507402] INFO -- : [ 92/883] 548766=test_rat I, [2024-05-25T20:22:08.214006 #507402] INFO -- : [ 93/883] 548766=test_webauthn_poller I, [2024-05-25T20:22:08.253102 #507402] INFO -- : [ 94/883] 548756=test_rdoc_markup_raw I, [2024-05-25T20:22:08.254529 #507402] INFO -- : [ 95/883] 548769=test_optparse I, [2024-05-25T20:22:08.290260 #507402] INFO -- : [ 96/883] 548758=test_array I, [2024-05-25T20:22:08.297717 #507402] INFO -- : [ 97/883] 548758=test_fstring I, [2024-05-25T20:22:08.310571 #507402] INFO -- : [ 98/883] 548761=test_etc I, [2024-05-25T20:22:08.325200 #507402] INFO -- : [ 99/883] 548769=test_yjit_exit_locations I, [2024-05-25T20:22:08.326396 #507402] INFO -- : [100/883] 548769=test_getopts I, [2024-05-25T20:22:08.333713 #507402] INFO -- : [101/883] 548769=test_protocol I, [2024-05-25T20:22:08.356124 #507402] INFO -- : [102/883] 548766=test_gem_resolver_activation_request I, [2024-05-25T20:22:08.365968 #507402] INFO -- : [103/883] 548766=test_gem_config_file I, [2024-05-25T20:22:08.383309 #507402] INFO -- : [104/883] 548763=test_ripper I, [2024-05-25T20:22:08.390704 #507402] INFO -- : [105/883] 548761=test_gem_package_tar_header I, [2024-05-25T20:22:08.421671 #507402] INFO -- : [106/883] 548761=test_gem_util I, [2024-05-25T20:22:08.424971 #507402] INFO -- : [107/883] 548768=test_iseq_load I, [2024-05-25T20:22:08.427469 #507402] INFO -- : [108/883] 548764=test_pkey_dh I, [2024-05-25T20:22:08.434245 #507402] INFO -- : [109/883] 548756=test_bigzero I, [2024-05-25T20:22:08.435622 #507402] INFO -- : [110/883] 548755=test_system I, [2024-05-25T20:22:08.440628 #507402] INFO -- : [111/883] 548756=test_pkcs12 I, [2024-05-25T20:22:08.452632 #507402] INFO -- : [112/883] 548758=test_rendering I, [2024-05-25T20:22:08.466168 #507402] INFO -- : [113/883] 548766=test_sizeof I, [2024-05-25T20:22:08.535243 #507402] INFO -- : [114/883] 548767=test_case I, [2024-05-25T20:22:08.554764 #507402] INFO -- : [115/883] 548758=test_face I, [2024-05-25T20:22:08.570737 #507402] INFO -- : [116/883] 548758=test_io I, [2024-05-25T20:22:08.574699 #507402] INFO -- : [117/883] 548767=test_unicode_escape I, [2024-05-25T20:22:08.587301 #507402] INFO -- : [118/883] 548754=test_utf16 I, [2024-05-25T20:22:08.588673 #507402] INFO -- : [119/883] 548764=test_autoload I, [2024-05-25T20:22:08.595083 #507402] INFO -- : [120/883] 548754=test_sleep I, [2024-05-25T20:22:08.606162 #507402] INFO -- : [121/883] 548761=test_config I, [2024-05-25T20:22:08.640027 #507402] INFO -- : [122/883] 548769=test_libs I, [2024-05-25T20:22:08.679729 #507402] INFO -- : [123/883] 548767=test_math I, [2024-05-25T20:22:08.682468 #507402] INFO -- : [124/883] 548761=test_gem_commands_fetch_command I, [2024-05-25T20:22:08.688550 #507402] INFO -- : [125/883] 548769=test_gc I, [2024-05-25T20:22:08.691998 #507402] INFO -- : [126/883] 548767=test_yaml_tree I, [2024-05-25T20:22:08.697117 #507402] INFO -- : [127/883] 548769=test_fiddle I, [2024-05-25T20:22:08.728852 #507402] INFO -- : [128/883] 548767=test_wss I, [2024-05-25T20:22:08.741219 #507402] INFO -- : [129/883] 548767=test_ractor I, [2024-05-25T20:22:08.752652 #507402] INFO -- : [130/883] 548769=test_find I, [2024-05-25T20:22:08.762233 #507402] INFO -- : [131/883] 548763=test_marshalable I, [2024-05-25T20:22:08.771020 #507402] INFO -- : [132/883] 548769=test_digest I, [2024-05-25T20:22:08.776400 #507402] INFO -- : [133/883] 548763=test_gem_commands_contents_command I, [2024-05-25T20:22:08.843213 #507402] INFO -- : [134/883] 548767=test_gem_ext_cmake_builder I, [2024-05-25T20:22:08.857803 #507402] INFO -- : [135/883] 548763=test_require I, [2024-05-25T20:22:08.861286 #507402] INFO -- : [136/883] 548761=test_cgi_util I, [2024-05-25T20:22:08.862089 #507402] INFO -- : [137/883] 548767=test_deprecate I, [2024-05-25T20:22:08.893268 #507402] INFO -- : [138/883] 548767=test_rdoc_constant I, [2024-05-25T20:22:08.935892 #507402] INFO -- : [139/883] 548771=test_bash_completion I, [2024-05-25T20:22:08.938482 #507402] INFO -- : [140/883] 548771=test_formatter I, [2024-05-25T20:22:08.942274 #507402] INFO -- : [141/883] 548771=test_recorder I, [2024-05-25T20:22:08.943996 #507402] INFO -- : [142/883] 548771=test_gem_source_vendor I, [2024-05-25T20:22:09.016066 #507402] INFO -- : [143/883] 548768=test_gem_commands_owner_command I, [2024-05-25T20:22:09.018136 #507402] INFO -- : [144/883] 548756=regexp_test I, [2024-05-25T20:22:09.089949 #507402] INFO -- : [145/883] 548767=test_gem_package_tar_reader I, [2024-05-25T20:22:09.094541 #507402] INFO -- : [146/883] 548771=test_coverage I, [2024-05-25T20:22:09.106517 #507402] INFO -- : [147/883] 548761=test_rdoc_encoding I, [2024-05-25T20:22:09.110211 #507402] INFO -- : [148/883] 548767=test_pathname I, [2024-05-25T20:22:09.116616 #507402] INFO -- : [149/883] 548756=test_init I, [2024-05-25T20:22:09.199593 #507402] INFO -- : [150/883] 548759=test_complexrational I, [2024-05-25T20:22:09.204592 #507402] INFO -- : [151/883] 548759=test_rdoc_any_method I, [2024-05-25T20:22:09.221201 #507402] INFO -- : [152/883] 548757=test_modify_expand I, [2024-05-25T20:22:09.225531 #507402] INFO -- : [153/883] 548757=test_rdoc_markdown I, [2024-05-25T20:22:09.231298 #507402] INFO -- : [154/883] 548762=test_gem_available_set I, [2024-05-25T20:22:09.314958 #507402] INFO -- : [155/883] 548761=test_file I, [2024-05-25T20:22:09.318105 #507402] INFO -- : [156/883] 548761=test_thread_queue I, [2024-05-25T20:22:09.349261 #507402] INFO -- : [157/883] 548755=test_nowrite I, [2024-05-25T20:22:09.353388 #507402] INFO -- : [158/883] 548762=test_rdoc_markup_formatter I, [2024-05-25T20:22:09.354063 #507402] INFO -- : [159/883] 548767=test_ractor I, [2024-05-25T20:22:09.361739 #507402] INFO -- : [160/883] 548755=test_euc_tw I, [2024-05-25T20:22:09.367701 #507402] INFO -- : [161/883] 548755=test_bmethod I, [2024-05-25T20:22:09.370927 #507402] INFO -- : [162/883] 548767=test_ansi_without_terminfo I, [2024-05-25T20:22:09.373066 #507402] INFO -- : [163/883] 548755=test_gem_commands_sources_command I, [2024-05-25T20:22:09.440462 #507402] INFO -- : [164/883] 548767=test_big2str I, [2024-05-25T20:22:09.445267 #507402] INFO -- : [165/883] 548767=test_forwardable I, [2024-05-25T20:22:09.460672 #507402] INFO -- : [166/883] 548762=test_yaml I, [2024-05-25T20:22:09.476752 #507402] INFO -- : [167/883] 548767=test_wait I, [2024-05-25T20:22:09.512957 #507402] INFO -- : [168/883] 548756=test_handle I, [2024-05-25T20:22:09.523868 #507402] INFO -- : [169/883] 548762=test_class2name I, [2024-05-25T20:22:09.525107 #507402] INFO -- : [170/883] 548757=test_gbk I, [2024-05-25T20:22:09.527818 #507402] INFO -- : [171/883] 548762=test_enc_str_buf_cat I, [2024-05-25T20:22:09.530114 #507402] INFO -- : [172/883] 548757=test_pstore I, [2024-05-25T20:22:09.533734 #507402] INFO -- : [173/883] 548762=test_cstr I, [2024-05-25T20:22:09.552653 #507402] INFO -- : [174/883] 548767=test_profile_frames I, [2024-05-25T20:22:09.561302 #507402] INFO -- : [175/883] 548769=test_io_timeout I, [2024-05-25T20:22:09.562455 #507402] INFO -- : [176/883] 548769=test_shapes I, [2024-05-25T20:22:09.571476 #507402] INFO -- : [177/883] 548769=json_fixtures_test I, [2024-05-25T20:22:09.571972 #507402] INFO -- : [178/883] 548768=test_comparable I, [2024-05-25T20:22:09.574056 #507402] INFO -- : [179/883] 548769=test_rdoc_parser_c I, [2024-05-25T20:22:09.574112 #507402] INFO -- : [180/883] 548757=test_gem_version I, [2024-05-25T20:22:09.578561 #507402] INFO -- : [181/883] 548768=test_econv I, [2024-05-25T20:22:09.597048 #507402] INFO -- : [182/883] 548755=test_cesu8 I, [2024-05-25T20:22:09.603220 #507402] INFO -- : [183/883] 548755=test_rdoc_options I, [2024-05-25T20:22:09.627578 #507402] INFO -- : [184/883] 548757=test_fileutils I, [2024-05-25T20:22:09.628906 #507402] INFO -- : [185/883] 548759=test_string_processing I, [2024-05-25T20:22:09.697968 #507402] INFO -- : [186/883] 548759=test_ldap I, [2024-05-25T20:22:09.716250 #507402] INFO -- : [187/883] 548759=test_emitter I, [2024-05-25T20:22:09.738749 #507402] INFO -- : [188/883] 548759=test_resource I, [2024-05-25T20:22:09.741186 #507402] INFO -- : [189/883] 548767=test_gem_commands_signin_command I, [2024-05-25T20:22:09.771362 #507402] INFO -- : [190/883] 548759=test_gem_commands_list_command I, [2024-05-25T20:22:09.821616 #507402] INFO -- : [191/883] 548755=test_stack I, [2024-05-25T20:22:09.828213 #507402] INFO -- : [192/883] 548756=test_rdoc_include I, [2024-05-25T20:22:09.852591 #507402] INFO -- : [193/883] 548762=test_reqarg I, [2024-05-25T20:22:09.854849 #507402] INFO -- : [194/883] 548767=test_too_many_dummy_encodings I, [2024-05-25T20:22:09.883922 #507402] INFO -- : [195/883] 548756=test_parse I, [2024-05-25T20:22:09.890804 #507402] INFO -- : [196/883] 548771=test_mdns I, [2024-05-25T20:22:09.922312 #507402] INFO -- : [197/883] 548767=test_gem_remote_fetcher I, [2024-05-25T20:22:09.924723 #507402] INFO -- : [198/883] 548771=test_scanner_events I, [2024-05-25T20:22:09.937258 #507402] INFO -- : [199/883] 548769=test_gem_resolver_installed_specification I, [2024-05-25T20:22:09.955660 #507402] INFO -- : [200/883] 548769=test_frozen_error I, [2024-05-25T20:22:09.960114 #507402] INFO -- : [201/883] 548769=test_gem_stub_specification I, [2024-05-25T20:22:09.962694 #507402] INFO -- : [202/883] 548771=test_method_cache I, [2024-05-25T20:22:09.965625 #507402] INFO -- : [203/883] 548771=test_gem_ext_ext_conf_builder I, [2024-05-25T20:22:09.988304 #507402] INFO -- : [204/883] 548759=test_complex I, [2024-05-25T20:22:09.990718 #507402] INFO -- : [205/883] 548757=test_gem_commands_search_command I, [2024-05-25T20:22:09.997744 #507402] INFO -- : [206/883] 548757=test_inlinecache I, [2024-05-25T20:22:10.046363 #507402] INFO -- : [207/883] 548763=test_rdoc_markup_verbatim I, [2024-05-25T20:22:10.052586 #507402] INFO -- : [208/883] 548757=test_path_to_class I, [2024-05-25T20:22:10.057274 #507402] INFO -- : [209/883] 548757=test_gem_resolver_specification I, [2024-05-25T20:22:10.081934 #507402] INFO -- : [210/883] 548757=test_gem_dependency I, [2024-05-25T20:22:10.102868 #507402] INFO -- : [211/883] 548769=json_string_matching_test I, [2024-05-25T20:22:10.107499 #507402] INFO -- : [212/883] 548769=test_load I, [2024-05-25T20:22:10.111284 #507402] INFO -- : [213/883] 548769=test_class I, [2024-05-25T20:22:10.132770 #507402] INFO -- : [214/883] 548759=test_rdoc_normal_class I, [2024-05-25T20:22:10.160696 #507402] INFO -- : [215/883] 548763=test_const I, [2024-05-25T20:22:10.170111 #507402] INFO -- : [216/883] 548763=test_asn1 I, [2024-05-25T20:22:10.188027 #507402] INFO -- : [217/883] 548763=test_random I, [2024-05-25T20:22:10.190193 #507402] INFO -- : [218/883] 548757=test_irb I, [2024-05-25T20:22:10.191588 #507402] INFO -- : [219/883] 548763=test_date_strftime I, [2024-05-25T20:22:10.199526 #507402] INFO -- : [220/883] 548762=test_rdoc_parser_rd I, [2024-05-25T20:22:10.223279 #507402] INFO -- : [221/883] 548759=test_yamlstore I, [2024-05-25T20:22:10.227134 #507402] INFO -- : [222/883] 548759=test_gem_installer I, [2024-05-25T20:22:10.250647 #507402] INFO -- : [223/883] 548765=test_duplicate I, [2024-05-25T20:22:10.254058 #507402] INFO -- : [224/883] 548765=test_utf32 I, [2024-05-25T20:22:10.260582 #507402] INFO -- : [225/883] 548765=test_basicsocket I, [2024-05-25T20:22:10.261829 #507402] INFO -- : [226/883] 548762=test_prettyprint I, [2024-05-25T20:22:10.266555 #507402] INFO -- : [227/883] 548765=test_tracepoint I, [2024-05-25T20:22:10.282205 #507402] INFO -- : [228/883] 548762=test_rdoc_markup I, [2024-05-25T20:22:10.294359 #507402] INFO -- : [229/883] 548762=test_gem_commands_help_command I, [2024-05-25T20:22:10.362190 #507402] INFO -- : [230/883] 548762=test_internal_ivar I, [2024-05-25T20:22:10.381780 #507402] INFO -- : [231/883] 548762=test_gem_resolver_index_specification I, [2024-05-25T20:22:10.398038 #507402] INFO -- : [232/883] 548756=test_function I, [2024-05-25T20:22:10.406819 #507402] INFO -- : [233/883] 548762=test_queue I, [2024-05-25T20:22:10.418079 #507402] INFO -- : [234/883] 548762=test_tempfile I, [2024-05-25T20:22:10.503032 #507402] INFO -- : [235/883] 548768=parse_comments_test I, [2024-05-25T20:22:10.561360 #507402] INFO -- : [236/883] 548765=test_noarg I, [2024-05-25T20:22:10.576520 #507402] INFO -- : [237/883] 548757=test_name_error I, [2024-05-25T20:22:10.584839 #507402] INFO -- : [238/883] 548768=test_rdoc_markup_attribute_manager I, [2024-05-25T20:22:10.585426 #507402] INFO -- : [239/883] 548763=test_gem_resolver_composed_set I, [2024-05-25T20:22:10.598746 #507402] INFO -- : [240/883] 548763=test_safe_load I, [2024-05-25T20:22:10.613218 #507402] INFO -- : [241/883] 548763=test_gem_resolver I, [2024-05-25T20:22:10.623042 #507402] INFO -- : [242/883] 548762=test_gem_commands_dependency_command I, [2024-05-25T20:22:10.630602 #507402] INFO -- : [243/883] 548756=test_gem_commands_specification_command I, [2024-05-25T20:22:10.634189 #507402] INFO -- : [244/883] 548755=test_enumerator I, [2024-05-25T20:22:10.646416 #507402] INFO -- : [245/883] 548754=test_flags I, [2024-05-25T20:22:10.691498 #507402] INFO -- : [246/883] 548757=test_inadvertent_creation I, [2024-05-25T20:22:10.703129 #507402] INFO -- : [247/883] 548762=test_gem_commands_which_command I, [2024-05-25T20:22:10.705377 #507402] INFO -- : [248/883] 548753=test_shift_jis I, [2024-05-25T20:22:10.708020 #507402] INFO -- : [249/883] 548753=test_http I, [2024-05-25T20:22:10.732330 #507402] INFO -- : [250/883] 548753=index_write_test I, [2024-05-25T20:22:10.741690 #507402] INFO -- : [251/883] 548762=test_date_new I, [2024-05-25T20:22:10.749260 #507402] INFO -- : [252/883] 548765=test_data I, [2024-05-25T20:22:10.755379 #507402] INFO -- : [253/883] 548762=test_require I, [2024-05-25T20:22:10.758050 #507402] INFO -- : [254/883] 548765=test_rdoc_markup_to_joined_paragraph I, [2024-05-25T20:22:10.758376 #507402] INFO -- : [255/883] 548762=test_date_time I, [2024-05-25T20:22:10.767668 #507402] INFO -- : [256/883] 548768=test_gem_safe_yaml I, [2024-05-25T20:22:10.773186 #507402] INFO -- : [257/883] 548762=test_syntax I, [2024-05-25T20:22:10.776913 #507402] INFO -- : [258/883] 548756=test_rdoc_text I, [2024-05-25T20:22:10.787892 #507402] INFO -- : [259/883] 548768=test_iso_8859 I, [2024-05-25T20:22:10.797086 #507402] INFO -- : [260/883] 548757=test_tcp I, [2024-05-25T20:22:10.808363 #507402] INFO -- : [261/883] 548768=test_stream I, [2024-05-25T20:22:10.811765 #507402] INFO -- : [262/883] 548763=test_nil2vtempty I, [2024-05-25T20:22:10.813793 #507402] INFO -- : [263/883] 548763=test_rdoc_context I, [2024-05-25T20:22:10.824852 #507402] INFO -- : [264/883] 548753=test_httpresponse I, [2024-05-25T20:22:10.827389 #507402] INFO -- : [265/883] 548768=test_open-uri I, [2024-05-25T20:22:10.848903 #507402] INFO -- : [266/883] 548756=test_rdoc_parser_ruby I, [2024-05-25T20:22:10.902822 #507402] INFO -- : [267/883] 548765=test_thread_fd_close I, [2024-05-25T20:22:10.905859 #507402] INFO -- : [268/883] 548765=test_passing_block I, [2024-05-25T20:22:10.906474 #507402] INFO -- : [269/883] 548757=test_hash_create I, [2024-05-25T20:22:10.909507 #507402] INFO -- : [270/883] 548765=test_stringchar I, [2024-05-25T20:22:10.910665 #507402] INFO -- : [271/883] 548753=test_uncorrectable_name_check I, [2024-05-25T20:22:10.911881 #507402] INFO -- : [272/883] 548757=newline_test I, [2024-05-25T20:22:10.919742 #507402] INFO -- : [273/883] 548753=test_switch_hitter I, [2024-05-25T20:22:10.945390 #507402] INFO -- : [274/883] 548753=test_flush I, [2024-05-25T20:22:10.951677 #507402] INFO -- : [275/883] 548753=test_singleton I, [2024-05-25T20:22:10.956255 #507402] INFO -- : [276/883] 548753=test_io_console I, [2024-05-25T20:22:10.978428 #507402] INFO -- : [277/883] 548765=test_c_union_entity I, [2024-05-25T20:22:11.024483 #507402] INFO -- : [278/883] 548757=test_rdoc_normal_module I, [2024-05-25T20:22:11.033428 #507402] INFO -- : [279/883] 548765=test_rdoc_markdown_test I, [2024-05-25T20:22:11.062588 #507402] INFO -- : [280/883] 548757=test_logperiod I, [2024-05-25T20:22:11.068307 #507402] INFO -- : [281/883] 548757=test_securerandom I, [2024-05-25T20:22:11.096711 #507402] INFO -- : [282/883] 548757=test_gc I, [2024-05-25T20:22:11.172132 #507402] INFO -- : [283/883] 548768=test_x509cert I, [2024-05-25T20:22:11.260538 #507402] INFO -- : [284/883] 548771=test_err_in_callback I, [2024-05-25T20:22:11.264746 #507402] INFO -- : [285/883] 548771=test_gem_resolver_lock_specification I, [2024-05-25T20:22:11.315119 #507402] INFO -- : [286/883] 548771=test_logdevice I, [2024-05-25T20:22:11.425121 #507402] INFO -- : [287/883] 548756=test_arity I, [2024-05-25T20:22:11.434692 #507402] INFO -- : [288/883] 548756=test_gem_ext_rake_builder I, [2024-05-25T20:22:11.450909 #507402] INFO -- : [289/883] 548768=test_gem_security_policy I, [2024-05-25T20:22:11.503912 #507402] INFO -- : [290/883] 548766=test_gem_source_local I, [2024-05-25T20:22:11.539012 #507402] INFO -- : [291/883] 548770=test_pack I, [2024-05-25T20:22:11.702947 #507402] INFO -- : [292/883] 548754=test_last_thread I, [2024-05-25T20:22:11.716114 #507402] INFO -- : [293/883] 548763=test_process I, [2024-05-25T20:22:11.722430 #507402] INFO -- : [294/883] 548768=test_rdoc_markup_to_markdown I, [2024-05-25T20:22:11.758464 #507402] INFO -- : [295/883] 548768=test_json_tree I, [2024-05-25T20:22:11.767347 #507402] INFO -- : [296/883] 548768=test_rdoc_generator_pot_po I, [2024-05-25T20:22:11.772043 #507402] INFO -- : [297/883] 548768=test_ansi_with_terminfo I, [2024-05-25T20:22:11.789677 #507402] INFO -- : [298/883] 548770=test_ractor I, [2024-05-25T20:22:11.796785 #507402] INFO -- : [299/883] 548766=test_m17n_comb I, [2024-05-25T20:22:11.819005 #507402] INFO -- : [300/883] 548767=test_memory_view I, [2024-05-25T20:22:11.824568 #507402] INFO -- : [301/883] 548768=test_gem_request_connection_pools I, [2024-05-25T20:22:11.870953 #507402] INFO -- : [302/883] 548770=test_grapheme_breaks I, [2024-05-25T20:22:11.885679 #507402] INFO -- : [303/883] 548770=test_gem_version_option I, [2024-05-25T20:22:11.937486 #507402] INFO -- : [304/883] 548767=test_cclass I, [2024-05-25T20:22:12.050372 #507402] INFO -- : [305/883] 548767=test_parser_events I, [2024-05-25T20:22:12.082827 #507402] INFO -- : [306/883] 548771=test_reline I, [2024-05-25T20:22:12.103795 #507402] INFO -- : [307/883] 548756=test_case I, [2024-05-25T20:22:12.103857 #507402] INFO -- : [308/883] 548756=test_pkey I, [2024-05-25T20:22:12.121484 #507402] INFO -- : [309/883] 548767=test_thread I, [2024-05-25T20:22:12.132565 #507402] INFO -- : [310/883] 548770=test_socket I, [2024-05-25T20:22:12.164256 #507402] INFO -- : [311/883] 548756=test_objectspace I, [2024-05-25T20:22:12.287625 #507402] INFO -- : [312/883] 548769=test_rdoc_markup_to_table_of_contents I, [2024-05-25T20:22:12.314173 #507402] INFO -- : [313/883] 548769=test_str2big I, [2024-05-25T20:22:12.316492 #507402] INFO -- : [314/883] 548769=test_dot_dot I, [2024-05-25T20:22:12.317720 #507402] INFO -- : [315/883] 548769=test_c_struct_builder I, [2024-05-25T20:22:12.326922 #507402] INFO -- : [316/883] 548771=test_literal I, [2024-05-25T20:22:12.343006 #507402] INFO -- : [317/883] 548767=test_gem_stream_ui I, [2024-05-25T20:22:12.360733 #507402] INFO -- : [318/883] 548765=test_rdoc_generator_ri I, [2024-05-25T20:22:12.372844 #507402] INFO -- : [319/883] 548765=test_extlibs I, [2024-05-25T20:22:12.373888 #507402] INFO -- : [320/883] 548769=test_require_lib I, [2024-05-25T20:22:12.446854 #507402] INFO -- : [321/883] 548767=test_gem_install_update_options I, [2024-05-25T20:22:12.564794 #507402] INFO -- : [322/883] 548767=parse_test I, [2024-05-25T20:22:12.718202 #507402] INFO -- : [323/883] 548771=test_ractor I, [2024-05-25T20:22:12.731567 #507402] INFO -- : [324/883] 548771=test_severity I, [2024-05-25T20:22:12.743802 #507402] INFO -- : [325/883] 548771=test_rand I, [2024-05-25T20:22:12.781513 #507402] INFO -- : [326/883] 548754=test_gem_package_tar_reader_entry I, [2024-05-25T20:22:12.860516 #507402] INFO -- : [327/883] 548768=test_gem_name_tuple I, [2024-05-25T20:22:12.885053 #507402] INFO -- : [328/883] 548768=test_bug_reporter I, [2024-05-25T20:22:12.942731 #507402] INFO -- : [329/883] 548752=test_exception I, [2024-05-25T20:22:13.008069 #507402] INFO -- : [330/883] 548771=test_store I, [2024-05-25T20:22:13.107374 #507402] INFO -- : [331/883] 548756=test_case_options I, [2024-05-25T20:22:13.111553 #507402] INFO -- : [332/883] 548756=test_gem_dependency_installer I, [2024-05-25T20:22:13.160884 #507402] INFO -- : [333/883] 548754=test_scalar I, [2024-05-25T20:22:13.181651 #507402] INFO -- : [334/883] 548768=test_gem_commands_info_command I, [2024-05-25T20:22:13.202144 #507402] INFO -- : [335/883] 548754=test_rdoc_cross_reference I, [2024-05-25T20:22:13.205090 #507402] INFO -- : [336/883] 548771=test_settracefunc I, [2024-05-25T20:22:13.222410 #507402] INFO -- : [337/883] 548768=test_gem_text I, [2024-05-25T20:22:13.285596 #507402] INFO -- : [338/883] 548768=test_enumerator_kw I, [2024-05-25T20:22:13.291726 #507402] INFO -- : [339/883] 548768=test_scan_args I, [2024-05-25T20:22:13.307472 #507402] INFO -- : [340/883] 548768=test_generic I, [2024-05-25T20:22:13.353095 #507402] INFO -- : [341/883] 548768=test_win32ole I, [2024-05-25T20:22:13.360949 #507402] INFO -- : [342/883] 548768=test_sprintf_comb I, [2024-05-25T20:22:13.385260 #507402] INFO -- : [343/883] 548766=test_method_cache I, [2024-05-25T20:22:13.388119 #507402] INFO -- : [344/883] 548766=test_gem_request I, [2024-05-25T20:22:13.407664 #507402] INFO -- : [345/883] 548764=test_gem_commands_mirror I, [2024-05-25T20:22:13.439767 #507402] INFO -- : [346/883] 548770=test_gem_ext_cargo_builder_link_flag_converter I, [2024-05-25T20:22:13.489531 #507402] INFO -- : [347/883] 548770=test_pkey_ec I, [2024-05-25T20:22:13.526946 #507402] INFO -- : [348/883] 548768=test_trick I, [2024-05-25T20:22:13.553111 #507402] INFO -- : [349/883] 548761=test_thread I, [2024-05-25T20:22:13.555787 #507402] INFO -- : [350/883] 548761=test_pipe I, [2024-05-25T20:22:13.576941 #507402] INFO -- : [351/883] 548770=test_date_parse I, [2024-05-25T20:22:13.585093 #507402] INFO -- : [352/883] 548764=test_rdoc_markup_attributes I, [2024-05-25T20:22:13.589147 #507402] INFO -- : [353/883] 548766=test_rdoc_rd_inline_parser I, [2024-05-25T20:22:13.628168 #507402] INFO -- : [354/883] 548754=test_rdoc_markup_to_rdoc I, [2024-05-25T20:22:13.637027 #507402] INFO -- : [355/883] 548766=test_default_gems I, [2024-05-25T20:22:13.671329 #507402] INFO -- : [356/883] 548754=test_win32ole_type I, [2024-05-25T20:22:13.679679 #507402] INFO -- : [357/883] 548754=test_null I, [2024-05-25T20:22:13.681933 #507402] INFO -- : [358/883] 548753=test_mul I, [2024-05-25T20:22:13.690457 #507402] INFO -- : [359/883] 548753=test_svcb_https I, [2024-05-25T20:22:13.697490 #507402] INFO -- : [360/883] 548754=test_buffering I, [2024-05-25T20:22:13.699655 #507402] INFO -- : [361/883] 548753=test_gb18030 I, [2024-05-25T20:22:13.702185 #507402] INFO -- : [362/883] 548761=test_gem_uninstaller I, [2024-05-25T20:22:13.704021 #507402] INFO -- : [363/883] 548753=test_rdoc_rdoc I, [2024-05-25T20:22:13.707115 #507402] INFO -- : [364/883] 548754=test_windows_1251 I, [2024-05-25T20:22:13.707447 #507402] INFO -- : [365/883] 548766=test_time I, [2024-05-25T20:22:13.715509 #507402] INFO -- : [366/883] 548754=test_rdoc_i18n_text I, [2024-05-25T20:22:13.718872 #507402] INFO -- : [367/883] 548754=test_io_buffer I, [2024-05-25T20:22:13.741315 #507402] INFO -- : [368/883] 548770=test_defined I, [2024-05-25T20:22:13.760845 #507402] INFO -- : [369/883] 548764=test_backtrace I, [2024-05-25T20:22:13.771825 #507402] INFO -- : [370/883] 548764=test_key_name_check I, [2024-05-25T20:22:13.771908 #507402] INFO -- : [371/883] 548754=test_fnmatch I, [2024-05-25T20:22:13.776629 #507402] INFO -- : [372/883] 548764=test_files_test_2 I, [2024-05-25T20:22:13.810867 #507402] INFO -- : [373/883] 548754=test_require_path_check I, [2024-05-25T20:22:13.820107 #507402] INFO -- : [374/883] 548770=test_rdoc_markup_parser I, [2024-05-25T20:22:13.846900 #507402] INFO -- : [375/883] 548766=test_folderitem2_invokeverb I, [2024-05-25T20:22:13.848951 #507402] INFO -- : [376/883] 548766=test_gem_validator I, [2024-05-25T20:22:13.876268 #507402] INFO -- : [377/883] 548766=test_gem_resolver_index_set I, [2024-05-25T20:22:13.896738 #507402] INFO -- : [378/883] 548754=test_gem_package_old I, [2024-05-25T20:22:13.912859 #507402] INFO -- : [379/883] 548766=test_gc_compact I, [2024-05-25T20:22:13.929654 #507402] INFO -- : [380/883] 548754=test_proc I, [2024-05-25T20:22:13.948973 #507402] INFO -- : [381/883] 548770=test_string I, [2024-05-25T20:22:13.976144 #507402] INFO -- : [382/883] 548753=test_erb_m17n I, [2024-05-25T20:22:13.986880 #507402] INFO -- : [383/883] 548753=test_ole_methods I, [2024-05-25T20:22:13.998708 #507402] INFO -- : [384/883] 548753=test_date_conv I, [2024-05-25T20:22:14.000133 #507402] INFO -- : [385/883] 548753=test_optimization I, [2024-05-25T20:22:14.175905 #507402] INFO -- : [386/883] 548765=test_cgi_tag_helper I, [2024-05-25T20:22:14.188359 #507402] INFO -- : [387/883] 548765=test_zlib I, [2024-05-25T20:22:14.233585 #507402] INFO -- : [388/883] 548771=test_egrep_cpp I, [2024-05-25T20:22:14.385915 #507402] INFO -- : [389/883] 548771=test_gem_dependency_resolution_error I, [2024-05-25T20:22:14.406298 #507402] INFO -- : [390/883] 548771=test_rdoc_parser I, [2024-05-25T20:22:14.655452 #507402] INFO -- : [391/883] 548771=test_qsort I, [2024-05-25T20:22:14.679509 #507402] INFO -- : [392/883] 548771=json_addition_test I, [2024-05-25T20:22:14.703069 #507402] INFO -- : [393/883] 548771=test_custom_command I, [2024-05-25T20:22:14.738293 #507402] INFO -- : [394/883] 548761=test_gem_request_set_lockfile_parser I, [2024-05-25T20:22:14.768279 #507402] INFO -- : [395/883] 548771=test_depth_first I, [2024-05-25T20:22:14.768342 #507402] INFO -- : [396/883] 548771=test_raise I, [2024-05-25T20:22:14.770993 #507402] INFO -- : [397/883] 548771=test_x509attr I, [2024-05-25T20:22:14.778863 #507402] INFO -- : [398/883] 548771=test_rdoc_store I, [2024-05-25T20:22:14.784965 #507402] INFO -- : [399/883] 548754=test_string I, [2024-05-25T20:22:14.797219 #507402] INFO -- : [400/883] 548754=test_rdoc_stats I, [2024-05-25T20:22:14.824083 #507402] INFO -- : [401/883] 548754=test_pattern_matching I, [2024-05-25T20:22:14.826823 #507402] INFO -- : [402/883] 548761=test_common I, [2024-05-25T20:22:14.854403 #507402] INFO -- : [403/883] 548754=test_gem_spec_fetcher I, [2024-05-25T20:22:14.916392 #507402] INFO -- : [404/883] 548752=test_gem_command I, [2024-05-25T20:22:14.931067 #507402] INFO -- : [405/883] 548759=test_key_actor_vi I, [2024-05-25T20:22:15.002779 #507402] INFO -- : [406/883] 548754=test_bug-3571 I, [2024-05-25T20:22:15.018553 #507402] INFO -- : [407/883] 548754=test_ifunless I, [2024-05-25T20:22:15.020805 #507402] INFO -- : [408/883] 548752=test_assignment I, [2024-05-25T20:22:15.021546 #507402] INFO -- : [409/883] 548754=test_gem_commands_lock_command I, [2024-05-25T20:22:15.032252 #507402] INFO -- : [410/883] 548759=test_numeric I, [2024-05-25T20:22:15.036047 #507402] INFO -- : [411/883] 548761=test_rdoc_tom_doc I, [2024-05-25T20:22:15.050719 #507402] INFO -- : [412/883] 548754=test_hmac I, [2024-05-25T20:22:15.051390 #507402] INFO -- : [413/883] 548754=test_rdoc_markup_to_tt_only I, [2024-05-25T20:22:15.060978 #507402] INFO -- : [414/883] 548761=test_zsh_completion I, [2024-05-25T20:22:15.071390 #507402] INFO -- : [415/883] 548754=test_exception I, [2024-05-25T20:22:15.081094 #507402] INFO -- : [416/883] 548754=test_iter_break I, [2024-05-25T20:22:15.085909 #507402] INFO -- : [417/883] 548761=test_macro I, [2024-05-25T20:22:15.087916 #507402] INFO -- : [418/883] 548754=test_gem_ext_configure_builder I, [2024-05-25T20:22:15.094619 #507402] INFO -- : [419/883] 548761=test_frozen I, [2024-05-25T20:22:15.095673 #507402] INFO -- : [420/883] 548761=test_pp I, [2024-05-25T20:22:15.118994 #507402] INFO -- : [421/883] 548759=test_verbose I, [2024-05-25T20:22:15.133402 #507402] INFO -- : [422/883] 548754=test_rdoc_single_class I, [2024-05-25T20:22:15.134513 #507402] INFO -- : [423/883] 548761=test_nil I, [2024-05-25T20:22:15.136952 #507402] INFO -- : [424/883] 548754=test_num2int I, [2024-05-25T20:22:15.145840 #507402] INFO -- : [425/883] 548759=test_config I, [2024-05-25T20:22:15.150678 #507402] INFO -- : [426/883] 548761=test_gem_source_list I, [2024-05-25T20:22:15.152948 #507402] INFO -- : [427/883] 548754=test_optarg I, [2024-05-25T20:22:15.174429 #507402] INFO -- : [428/883] 548759=test_yaml_special_cases I, [2024-05-25T20:22:15.183206 #507402] INFO -- : [429/883] 548759=test_address_resolve I, [2024-05-25T20:22:15.198952 #507402] INFO -- : [430/883] 548759=test_rdoc_token_stream I, [2024-05-25T20:22:15.205410 #507402] INFO -- : [431/883] 548759=test_eval_history I, [2024-05-25T20:22:15.213806 #507402] INFO -- : [432/883] 548761=dispatcher_test I, [2024-05-25T20:22:15.234531 #507402] INFO -- : [433/883] 548761=test_kernel I, [2024-05-25T20:22:15.274381 #507402] INFO -- : [434/883] 548759=test_kdf I, [2024-05-25T20:22:15.277383 #507402] INFO -- : [435/883] 548754=test_gem_doctor I, [2024-05-25T20:22:15.345242 #507402] INFO -- : [436/883] 548754=test_gem_silent_ui I, [2024-05-25T20:22:15.360651 #507402] INFO -- : [437/883] 548759=test_emitter I, [2024-05-25T20:22:15.366102 #507402] INFO -- : [438/883] 548759=test_bug-5832 I, [2024-05-25T20:22:15.370177 #507402] INFO -- : [439/883] 548759=test_files_ext I, [2024-05-25T20:22:15.383161 #507402] INFO -- : [440/883] 548754=test_command I, [2024-05-25T20:22:15.448560 #507402] INFO -- : [441/883] 548771=test_at_exit I, [2024-05-25T20:22:15.460050 #507402] INFO -- : [442/883] 548758=test_gem_ext_cargo_builder_unit I, [2024-05-25T20:22:15.463455 #507402] INFO -- : [443/883] 548771=test_date I, [2024-05-25T20:22:15.468980 #507402] INFO -- : [444/883] 548771=test_gem_rdoc I, [2024-05-25T20:22:15.469289 #507402] INFO -- : [445/883] 548760=test_object_create_start I, [2024-05-25T20:22:15.480377 #507402] INFO -- : [446/883] 548760=test_rdoc_markup_paragraph I, [2024-05-25T20:22:15.480716 #507402] INFO -- : [447/883] 548758=test_enc_raise I, [2024-05-25T20:22:15.480765 #507402] INFO -- : [448/883] 548759=test_psych I, [2024-05-25T20:22:15.489771 #507402] INFO -- : [449/883] 548758=!Nothing_to_test I, [2024-05-25T20:22:15.490663 #507402] INFO -- : [450/883] 548758=test_arithmetic_sequence I, [2024-05-25T20:22:15.510187 #507402] INFO -- : [451/883] 548759=test_key_actor_emacs I, [2024-05-25T20:22:15.514168 #507402] INFO -- : [452/883] 548758=test_gem_gemcutter_utilities I, [2024-05-25T20:22:15.572282 #507402] INFO -- : [453/883] 548771=test_basicinstructions I, [2024-05-25T20:22:15.596077 #507402] INFO -- : [454/883] 548759=test_gem_command_manager I, [2024-05-25T20:22:15.625602 #507402] INFO -- : [455/883] 548760=version_test I, [2024-05-25T20:22:15.666806 #507402] INFO -- : [456/883] 548771=test_cgi_header I, [2024-05-25T20:22:15.671327 #507402] INFO -- : [457/883] 548771=heredoc_dedent_test I, [2024-05-25T20:22:15.679473 #507402] INFO -- : [458/883] 548771=test_object I, [2024-05-25T20:22:15.688438 #507402] INFO -- : [459/883] 548771=test_rdoc_rd_block_parser I, [2024-05-25T20:22:15.701161 #507402] INFO -- : [460/883] 548760=test_signedness I, [2024-05-25T20:22:15.735512 #507402] INFO -- : [461/883] 548771=test_tsort I, [2024-05-25T20:22:15.739220 #507402] INFO -- : [462/883] 548771=test_ractor I, [2024-05-25T20:22:15.756670 #507402] INFO -- : [463/883] 548759=test_type I, [2024-05-25T20:22:15.763771 #507402] INFO -- : [464/883] 548759=test_func I, [2024-05-25T20:22:15.768161 #507402] INFO -- : [465/883] 548754=test_big5 I, [2024-05-25T20:22:15.773143 #507402] INFO -- : [466/883] 548754=test_pointer I, [2024-05-25T20:22:15.784346 #507402] INFO -- : [467/883] 548756=test_date_arith I, [2024-05-25T20:22:15.793205 #507402] INFO -- : [468/883] 548756=test_object I, [2024-05-25T20:22:15.825522 #507402] INFO -- : [469/883] 548771=test_ruby_lex I, [2024-05-25T20:22:15.885263 #507402] INFO -- : [470/883] 548767=test_gem_local_remote_options I, [2024-05-25T20:22:15.894876 #507402] INFO -- : [471/883] 548761=test_sleep I, [2024-05-25T20:22:15.909029 #507402] INFO -- : [472/883] 548769=test_change_word I, [2024-05-25T20:22:15.916875 #507402] INFO -- : [473/883] 548758=compiler_test I, [2024-05-25T20:22:15.917126 #507402] INFO -- : [474/883] 548769=test_flip I, [2024-05-25T20:22:15.919415 #507402] INFO -- : [475/883] 548767=test_timeout I, [2024-05-25T20:22:15.923162 #507402] INFO -- : [476/883] 548758=test_ossl I, [2024-05-25T20:22:15.925707 #507402] INFO -- : [477/883] 548767=test_normalize I, [2024-05-25T20:22:15.926655 #507402] INFO -- : [478/883] 548767=test_fd_setsize I, [2024-05-25T20:22:15.934343 #507402] INFO -- : [479/883] 548767=test_continuation I, [2024-05-25T20:22:15.934795 #507402] INFO -- : [480/883] 548767=test_keyword I, [2024-05-25T20:22:15.941889 #507402] INFO -- : [481/883] 548769=test_class_name_check I, [2024-05-25T20:22:15.951166 #507402] INFO -- : [482/883] 548771=test_delete I, [2024-05-25T20:22:15.956336 #507402] INFO -- : [483/883] 548769=test_win32ole_method I, [2024-05-25T20:22:15.960106 #507402] INFO -- : [484/883] 548771=test_date_strptime I, [2024-05-25T20:22:15.963523 #507402] INFO -- : [485/883] 548769=test_gem_package_task I, [2024-05-25T20:22:15.963924 #507402] INFO -- : [486/883] 548769=test_placearg I, [2024-05-25T20:22:16.038472 #507402] INFO -- : [487/883] 548769=test_rdoc_markup_hard_break I, [2024-05-25T20:22:16.047493 #507402] INFO -- : [488/883] 548769=test_gem_platform I, [2024-05-25T20:22:16.057595 #507402] INFO -- : [489/883] 548752=test_pkey_rsa I, [2024-05-25T20:22:16.070276 #507402] INFO -- : [490/883] 548771=test_weakkeymap I, [2024-05-25T20:22:16.124433 #507402] INFO -- : [491/883] 548769=test_gem_commands_push_command I, [2024-05-25T20:22:16.238579 #507402] INFO -- : [492/883] 548756=test_numhash I, [2024-05-25T20:22:16.244436 #507402] INFO -- : [493/883] 548756=test_rdoc_parser_markdown I, [2024-05-25T20:22:16.254488 #507402] INFO -- : [494/883] 548756=test_import I, [2024-05-25T20:22:16.289894 #507402] INFO -- : [495/883] 548752=test_gem_resolver_lock_set I, [2024-05-25T20:22:16.300600 #507402] INFO -- : [496/883] 548771=test_not I, [2024-05-25T20:22:16.303910 #507402] INFO -- : [497/883] 548752=test_logger I, [2024-05-25T20:22:16.310785 #507402] INFO -- : [498/883] 548771=test_file_exhaustive I, [2024-05-25T20:22:16.320568 #507402] INFO -- : [499/883] 548752=test_files_test I, [2024-05-25T20:22:16.339273 #507402] INFO -- : [500/883] 548768=test_gem_update_suggestion I, [2024-05-25T20:22:16.377308 #507402] INFO -- : [501/883] 548752=test_eval I, [2024-05-25T20:22:16.396220 #507402] INFO -- : [502/883] 548768=json_generator_test I, [2024-05-25T20:22:16.475720 #507402] INFO -- : [503/883] 548768=test_transcode I, [2024-05-25T20:22:16.498592 #507402] INFO -- : [504/883] 548754=test_gem_safe_marshal I, [2024-05-25T20:22:16.511044 #507402] INFO -- : [505/883] 548767=test_gem_resolver_api_set I, [2024-05-25T20:22:16.539721 #507402] INFO -- : [506/883] 548752=test_config I, [2024-05-25T20:22:16.573798 #507402] INFO -- : [507/883] 548767=test_gem_resolver_vendor_set I, [2024-05-25T20:22:16.578255 #507402] INFO -- : [508/883] 548769=test_enumerable I, [2024-05-25T20:22:16.586141 #507402] INFO -- : [509/883] 548769=test_webauthn_listener I, [2024-05-25T20:22:16.592020 #507402] INFO -- : [510/883] 548767=test_lambda I, [2024-05-25T20:22:16.631995 #507402] INFO -- : [511/883] 548766=test_gem_request_set_gem_dependency_api I, [2024-05-25T20:22:16.651093 #507402] INFO -- : [512/883] 548769=test_ast I, [2024-05-25T20:22:16.673602 #507402] INFO -- : [513/883] 548767=test_random_formatter I, [2024-05-25T20:22:16.695823 #507402] INFO -- : [514/883] 548767=test_helper I, [2024-05-25T20:22:16.696253 #507402] INFO -- : [515/883] 548767=test_jaro_winkler I, [2024-05-25T20:22:16.706749 #507402] INFO -- : [516/883] 548767=test_update I, [2024-05-25T20:22:16.711793 #507402] INFO -- : [517/883] 548767=test_fips I, [2024-05-25T20:22:16.720406 #507402] INFO -- : [518/883] 548768=test_x509name I, [2024-05-25T20:22:16.731099 #507402] INFO -- : [519/883] 548768=test_rdoc_code_object I, [2024-05-25T20:22:16.825843 #507402] INFO -- : [520/883] 548766=test_x509store I, [2024-05-25T20:22:16.980098 #507402] INFO -- : [521/883] 548767=static_inspect_test I, [2024-05-25T20:22:16.986576 #507402] INFO -- : [522/883] 548767=test_data_error I, [2024-05-25T20:22:17.045404 #507402] INFO -- : [523/883] 548752=bom_test I, [2024-05-25T20:22:17.054474 #507402] INFO -- : [524/883] 548767=test_file I, [2024-05-25T20:22:17.072797 #507402] INFO -- : [525/883] 548754=test_force_exit I, [2024-05-25T20:22:17.073972 #507402] INFO -- : [526/883] 548754=test_ostruct I, [2024-05-25T20:22:17.079557 #507402] INFO -- : [527/883] 548756=unescape_test I, [2024-05-25T20:22:17.079871 #507402] INFO -- : [528/883] 548768=test_udp I, [2024-05-25T20:22:17.083577 #507402] INFO -- : [529/883] 548768=test_vm_dump I, [2024-05-25T20:22:17.084329 #507402] INFO -- : [530/883] 548768=test_tmpdir I, [2024-05-25T20:22:17.133348 #507402] INFO -- : [531/883] 548764=test_rdoc_markup_document I, [2024-05-25T20:22:17.136243 #507402] INFO -- : [532/883] 548752=test_integer_comb I, [2024-05-25T20:22:17.141821 #507402] INFO -- : [533/883] 548768=errors_test I, [2024-05-25T20:22:17.154805 #507402] INFO -- : [534/883] 548764=test_regexp I, [2024-05-25T20:22:17.172403 #507402] INFO -- : [535/883] 548765=test_gem_commands_check_command I, [2024-05-25T20:22:17.193400 #507402] INFO -- : [536/883] 548765=test_ts I, [2024-05-25T20:22:17.224183 #507402] INFO -- : [537/883] 548754=test_ensured I, [2024-05-25T20:22:17.239042 #507402] INFO -- : [538/883] 548768=library_symbols_test I, [2024-05-25T20:22:17.240285 #507402] INFO -- : [539/883] 548768=test_addr I, [2024-05-25T20:22:17.247628 #507402] INFO -- : [540/883] 548766=test_locale I, [2024-05-25T20:22:17.250123 #507402] INFO -- : [541/883] 548768=test_rdoc_ri_paths I, [2024-05-25T20:22:17.276861 #507402] INFO -- : [542/883] 548768=test_project_sanity I, [2024-05-25T20:22:17.288750 #507402] INFO -- : [543/883] 548754=test_range I, [2024-05-25T20:22:17.306844 #507402] INFO -- : [544/883] 548757=test_pty I, [2024-05-25T20:22:17.327186 #507402] INFO -- : [545/883] 548768=test_dup I, [2024-05-25T20:22:17.343539 #507402] INFO -- : [546/883] 548759=test_constant I, [2024-05-25T20:22:17.406542 #507402] INFO -- : [547/883] 548766=command_line_test I, [2024-05-25T20:22:17.476367 #507402] INFO -- : [548/883] 548766=test_gem_uri_formatter I, [2024-05-25T20:22:17.504808 #507402] INFO -- : [549/883] 548762=test_helper I, [2024-05-25T20:22:17.513567 #507402] INFO -- : [550/883] 548766=test_erb_command I, [2024-05-25T20:22:17.513970 #507402] INFO -- : [551/883] 548762=test_encoding I, [2024-05-25T20:22:17.546301 #507402] INFO -- : [552/883] 548768=parse_stream_test I, [2024-05-25T20:22:17.549703 #507402] INFO -- : [553/883] 548766=test_registry I, [2024-05-25T20:22:17.551141 #507402] INFO -- : [554/883] 548768=test_gem_source_lock I, [2024-05-25T20:22:17.551202 #507402] INFO -- : [555/883] 548766=test_gem I, [2024-05-25T20:22:17.586667 #507402] INFO -- : [556/883] 548768=test_ractor I, [2024-05-25T20:22:17.599009 #507402] INFO -- : [557/883] 548768=test_dns I, [2024-05-25T20:22:17.705279 #507402] INFO -- : [558/883] 548762=test_gem_commands_open_command I, [2024-05-25T20:22:17.772984 #507402] INFO -- : [559/883] 548765=test_cgi_core I, [2024-05-25T20:22:17.778295 #507402] INFO -- : [560/883] 548754=test_parser I, [2024-05-25T20:22:17.780356 #507402] INFO -- : [561/883] 548757=test_alias I, [2024-05-25T20:22:17.783632 #507402] INFO -- : [562/883] 548765=test_timeout I, [2024-05-25T20:22:17.788408 #507402] INFO -- : [563/883] 548754=test_marshal I, [2024-05-25T20:22:17.817200 #507402] INFO -- : [564/883] 548762=test_unicode_normalize I, [2024-05-25T20:22:17.959899 #507402] INFO -- : [565/883] 548757=test_weakref I, [2024-05-25T20:22:18.041595 #507402] INFO -- : [566/883] 548768=test_nonblock I, [2024-05-25T20:22:18.052879 #507402] INFO -- : [567/883] 548768=test_rb_str_dup I, [2024-05-25T20:22:18.057842 #507402] INFO -- : [568/883] 548768=test_reline_key I, [2024-05-25T20:22:18.061942 #507402] INFO -- : [569/883] 548768=test_ancdata I, [2024-05-25T20:22:18.063925 #507402] INFO -- : [570/883] 548768=test_singleton_function I, [2024-05-25T20:22:18.073706 #507402] INFO -- : [571/883] 548768=test_ssl I, [2024-05-25T20:22:18.101084 #507402] INFO -- : [572/883] 548760=test_my_integer I, [2024-05-25T20:22:18.106559 #507402] INFO -- : [573/883] 548760=json_ext_parser_test I, [2024-05-25T20:22:18.111389 #507402] INFO -- : [574/883] 548760=test_thread I, [2024-05-25T20:22:18.174885 #507402] INFO -- : [575/883] 548756=test_rendering I, [2024-05-25T20:22:18.181412 #507402] INFO -- : [576/883] 548757=test_debugger_integration I, [2024-05-25T20:22:18.185759 #507402] INFO -- : [577/883] 548756=test_ractor I, [2024-05-25T20:22:18.190455 #507402] INFO -- : [578/883] 548757=test_gem_request_set_lockfile_tokenizer I, [2024-05-25T20:22:18.210971 #507402] INFO -- : [579/883] 548754=test_stat I, [2024-05-25T20:22:18.216465 #507402] INFO -- : [580/883] 548754=test_have_func I, [2024-05-25T20:22:18.251429 #507402] INFO -- : [581/883] 548757=test_nextafter I, [2024-05-25T20:22:18.336048 #507402] INFO -- : [582/883] 548757=test_capacity I, [2024-05-25T20:22:18.347458 #507402] INFO -- : [583/883] 548757=test_object_references I, [2024-05-25T20:22:18.357951 #507402] INFO -- : [584/883] 548757=test_usrmarshal I, [2024-05-25T20:22:18.489376 #507402] INFO -- : [585/883] 548768=test_gem_resolver_git_specification I, [2024-05-25T20:22:18.584282 #507402] INFO -- : [586/883] 548757=test_super I, [2024-05-25T20:22:18.634337 #507402] INFO -- : [587/883] 548756=test_rubyoptions I, [2024-05-25T20:22:18.716962 #507402] INFO -- : [588/883] 548765=test_cgi_modruby I, [2024-05-25T20:22:18.721789 #507402] INFO -- : [589/883] 548768=test_integer I, [2024-05-25T20:22:18.724434 #507402] INFO -- : [590/883] 548765=test_call I, [2024-05-25T20:22:18.821666 #507402] INFO -- : [591/883] 548752=test_https_proxy I, [2024-05-25T20:22:18.857663 #507402] INFO -- : [592/883] 548752=test_rubygems I, [2024-05-25T20:22:18.890443 #507402] INFO -- : [593/883] 548765=test_gem_commands_setup_command I, [2024-05-25T20:22:18.968442 #507402] INFO -- : [594/883] 548752=test_env I, [2024-05-25T20:22:19.490807 #507402] INFO -- : [595/883] 548766=test_rdoc_attr I, [2024-05-25T20:22:19.492672 #507402] INFO -- : [596/883] 548759=test_dryrun I, [2024-05-25T20:22:19.495676 #507402] INFO -- : [597/883] 548766=test_integer I, [2024-05-25T20:22:19.513924 #507402] INFO -- : [598/883] 548759=desugar_compiler_test I, [2024-05-25T20:22:19.540382 #507402] INFO -- : [599/883] 548766=test_rdoc_generator_darkfish I, [2024-05-25T20:22:19.543911 #507402] INFO -- : [600/883] 548757=test_rdoc_comment I, [2024-05-25T20:22:19.577268 #507402] INFO -- : [601/883] 548765=test_error_highlight I, [2024-05-25T20:22:19.588801 #507402] INFO -- : [602/883] 548757=test_resize I, [2024-05-25T20:22:19.595319 #507402] INFO -- : [603/883] 548757=test_http_request I, [2024-05-25T20:22:19.596023 #507402] INFO -- : [604/883] 548759=json_generic_object_test I, [2024-05-25T20:22:19.619149 #507402] INFO -- : [605/883] 548759=test_gem_source_fetch_problem I, [2024-05-25T20:22:19.644052 #507402] INFO -- : [606/883] 548759=test_coderange I, [2024-05-25T20:22:19.646530 #507402] INFO -- : [607/883] 548759=location_test I, [2024-05-25T20:22:19.649110 #507402] INFO -- : [608/883] 548757=test_symbol I, [2024-05-25T20:22:19.654741 #507402] INFO -- : [609/883] 548757=test_mailto I, [2024-05-25T20:22:19.658027 #507402] INFO -- : [610/883] 548757=test_ractor_compatibility I, [2024-05-25T20:22:19.689549 #507402] INFO -- : [611/883] 548759=test_gem_console_ui I, [2024-05-25T20:22:19.697479 #507402] INFO -- : [612/883] 548759=test_date_ractor I, [2024-05-25T20:22:19.700189 #507402] INFO -- : [613/883] 548754=test_dir I, [2024-05-25T20:22:19.707645 #507402] INFO -- : [614/883] 548755=test_autoconf I, [2024-05-25T20:22:19.711989 #507402] INFO -- : [615/883] 548755=test_eval I, [2024-05-25T20:22:19.720562 #507402] INFO -- : [616/883] 548755=test_numeric I, [2024-05-25T20:22:19.726905 #507402] INFO -- : [617/883] 548755=test_member I, [2024-05-25T20:22:19.729419 #507402] INFO -- : [618/883] 548755=test_cgi_multipart I, [2024-05-25T20:22:19.741223 #507402] INFO -- : [619/883] 548766=test_gem_commands_cleanup_command I, [2024-05-25T20:22:19.871003 #507402] INFO -- : [620/883] 548755=test_word I, [2024-05-25T20:22:19.871532 #507402] INFO -- : [621/883] 548755=ruby_api_test I, [2024-05-25T20:22:19.931854 #507402] INFO -- : [622/883] 548754=test_find_executable I, [2024-05-25T20:22:19.937183 #507402] INFO -- : [623/883] 548754=test_coder I, [2024-05-25T20:22:19.945796 #507402] INFO -- : [624/883] 548754=test_symbol I, [2024-05-25T20:22:19.957057 #507402] INFO -- : [625/883] 548759=test_gem_commands_pristine_command I, [2024-05-25T20:22:20.005073 #507402] INFO -- : [626/883] 548755=test_context I, [2024-05-25T20:22:20.058774 #507402] INFO -- : [627/883] 548770=test_nofree I, [2024-05-25T20:22:20.069904 #507402] INFO -- : [628/883] 548770=test_unix I, [2024-05-25T20:22:20.087603 #507402] INFO -- : [629/883] 548757=test_lazy_enumerator I, [2024-05-25T20:22:20.102455 #507402] INFO -- : [630/883] 548770=test_enc_associate I, [2024-05-25T20:22:20.120150 #507402] INFO -- : [631/883] 548766=test_pkcs7 I, [2024-05-25T20:22:20.138485 #507402] INFO -- : [632/883] 548765=test_gem_resolver_requirement_list I, [2024-05-25T20:22:20.145011 #507402] INFO -- : [633/883] 548765=test_arith_seq_beg_len_step I, [2024-05-25T20:22:20.182665 #507402] INFO -- : [634/883] 548755=test_function_entry I, [2024-05-25T20:22:20.183020 #507402] INFO -- : [635/883] 548755=test_have_macro I, [2024-05-25T20:22:20.216055 #507402] INFO -- : [636/883] 548765=test_gem_package I, [2024-05-25T20:22:20.350310 #507402] INFO -- : [637/883] 548766=test_resolve_symbol I, [2024-05-25T20:22:20.396743 #507402] INFO -- : [638/883] 548762=test_complex2 I, [2024-05-25T20:22:20.409172 #507402] INFO -- : [639/883] 548762=test_enum I, [2024-05-25T20:22:20.424698 #507402] INFO -- : [640/883] 548766=test_gem_specification I, [2024-05-25T20:22:20.508298 #507402] INFO -- : [641/883] 548757=test_threadgroup I, [2024-05-25T20:22:20.634484 #507402] INFO -- : [642/883] 548770=test_rdoc_class_module I, [2024-05-25T20:22:20.652966 #507402] INFO -- : [643/883] 548755=test_bignum I, [2024-05-25T20:22:20.712147 #507402] INFO -- : [644/883] 548753=test_gem_ci_detector I, [2024-05-25T20:22:20.766033 #507402] INFO -- : [645/883] 548765=test_win32ole_variable I, [2024-05-25T20:22:20.774439 #507402] INFO -- : [646/883] 548765=test_stringio I, [2024-05-25T20:22:20.853712 #507402] INFO -- : [647/883] 548753=test_arity I, [2024-05-25T20:22:20.855823 #507402] INFO -- : [648/883] 548753=test_io_wait_uncommon I, [2024-05-25T20:22:20.859462 #507402] INFO -- : [649/883] 548753=test_trace I, [2024-05-25T20:22:20.870962 #507402] INFO -- : [650/883] 548753=ractor_test I, [2024-05-25T20:22:20.894568 #507402] INFO -- : [651/883] 548765=test_rdoc_generator_json_index I, [2024-05-25T20:22:20.901811 #507402] INFO -- : [652/883] 548761=test_time_tz I, [2024-05-25T20:22:20.928923 #507402] INFO -- : [653/883] 548753=test_win32ole_event I, [2024-05-25T20:22:20.933959 #507402] INFO -- : [654/883] 548753=test_gem_resolver_api_specification I, [2024-05-25T20:22:20.945581 #507402] INFO -- : [655/883] 548765=test_win32ole_variant I, [2024-05-25T20:22:20.952062 #507402] INFO -- : [656/883] 548761=test_ipaddr I, [2024-05-25T20:22:20.953750 #507402] INFO -- : [657/883] 548765=test_mixed_unicode_escapes I, [2024-05-25T20:22:20.971458 #507402] INFO -- : [658/883] 548765=test_history I, [2024-05-25T20:22:20.977265 #507402] INFO -- : [659/883] 548761=test_rdoc_markup_to_ansi I, [2024-05-25T20:22:20.998073 #507402] INFO -- : [660/883] 548753=test_rdoc_extend I, [2024-05-25T20:22:21.015144 #507402] INFO -- : [661/883] 548761=test_merge_keys I, [2024-05-25T20:22:21.022462 #507402] INFO -- : [662/883] 548761=test_evaluation I, [2024-05-25T20:22:21.023235 #507402] INFO -- : [663/883] 548753=test_https I, [2024-05-25T20:22:21.023954 #507402] INFO -- : [664/883] 548761=test_gem_ext_builder I, [2024-05-25T20:22:21.030774 #507402] INFO -- : [665/883] 548765=test_rdoc_parser_simple I, [2024-05-25T20:22:21.049805 #507402] INFO -- : [666/883] 548765=test_load I, [2024-05-25T20:22:21.053184 #507402] INFO -- : [667/883] 548765=test_gem_commands_rebuild_command I, [2024-05-25T20:22:21.099142 #507402] INFO -- : [668/883] 548765=test_yamldbm I, [2024-05-25T20:22:21.107326 #507402] INFO -- : [669/883] 548765=test_abi I, [2024-05-25T20:22:21.116856 #507402] INFO -- : [670/883] 548770=test_provider I, [2024-05-25T20:22:21.167757 #507402] INFO -- : [671/883] 548759=test_gem_commands_outdated_command I, [2024-05-25T20:22:21.219935 #507402] INFO -- : [672/883] 548759=test_array I, [2024-05-25T20:22:21.303585 #507402] INFO -- : [673/883] 548765=test_gem_package_tar_writer I, [2024-05-25T20:22:21.341607 #507402] INFO -- : [674/883] 548762=test_helper_method I, [2024-05-25T20:22:21.350860 #507402] INFO -- : [675/883] 548753=test_gem_source I, [2024-05-25T20:22:21.358751 #507402] INFO -- : [676/883] 548768=test_scalar_scanner I, [2024-05-25T20:22:21.368435 #507402] INFO -- : [677/883] 548768=test_win32ole_method_event I, [2024-05-25T20:22:21.373714 #507402] INFO -- : [678/883] 548768=test_nesting_parser I, [2024-05-25T20:22:21.397187 #507402] INFO -- : [679/883] 548765=test_gem_dependency_list I, [2024-05-25T20:22:21.409960 #507402] INFO -- : [680/883] 548770=test_benchmark I, [2024-05-25T20:22:21.433747 #507402] INFO -- : [681/883] 548762=test_assembler I, [2024-05-25T20:22:21.437401 #507402] INFO -- : [682/883] 548762=test_spell_checker I, [2024-05-25T20:22:21.448266 #507402] INFO -- : [683/883] 548768=test_propertyputref I, [2024-05-25T20:22:21.448757 #507402] INFO -- : [684/883] 548768=attribute_write_test I, [2024-05-25T20:22:21.452531 #507402] INFO -- : [685/883] 548765=test_rational2 I, [2024-05-25T20:22:21.457158 #507402] INFO -- : [686/883] 548768=test_rational I, [2024-05-25T20:22:21.464110 #507402] INFO -- : [687/883] 548765=test_gem_commands_cert_command I, [2024-05-25T20:22:21.466188 #507402] INFO -- : [688/883] 548762=test_completion I, [2024-05-25T20:22:21.470505 #507402] INFO -- : [689/883] 548768=test_len I, [2024-05-25T20:22:21.473787 #507402] INFO -- : [690/883] 548768=test_yield_block I, [2024-05-25T20:22:21.477232 #507402] INFO -- : [691/883] 548768=test_x509ext I, [2024-05-25T20:22:21.482685 #507402] INFO -- : [692/883] 548768=test_erb I, [2024-05-25T20:22:21.514948 #507402] INFO -- : [693/883] 548757=test_gem_source_installed I, [2024-05-25T20:22:21.525424 #507402] INFO -- : [694/883] 548768=test_parser I, [2024-05-25T20:22:21.527760 #507402] INFO -- : [695/883] 548757=test_arith_seq_extract I, [2024-05-25T20:22:21.546709 #507402] INFO -- : [696/883] 548768=test_method_name_check I, [2024-05-25T20:22:21.570506 #507402] INFO -- : [697/883] 548768=test_gem_request_set I, [2024-05-25T20:22:21.626333 #507402] INFO -- : [698/883] 548753=test_module I, [2024-05-25T20:22:21.717411 #507402] INFO -- : [699/883] 548752=test_gem_ext_cargo_builder I, [2024-05-25T20:22:21.740948 #507402] INFO -- : [700/883] 548752=test_ssl I, [2024-05-25T20:22:21.756762 #507402] INFO -- : [701/883] 548757=constant_path_node_test I, [2024-05-25T20:22:21.764577 #507402] INFO -- : [702/883] 548757=test_stringify_symbols I, [2024-05-25T20:22:21.773328 #507402] INFO -- : [703/883] 548757=test_instrumentation_api I, [2024-05-25T20:22:21.975846 #507402] INFO -- : [704/883] 548768=integer_parse_test I, [2024-05-25T20:22:21.981316 #507402] INFO -- : [705/883] 548768=test_boolean I, [2024-05-25T20:22:21.986427 #507402] INFO -- : [706/883] 548768=test_rdoc_generator_markup I, [2024-05-25T20:22:21.994835 #507402] INFO -- : [707/883] 548768=test_whileuntil I, [2024-05-25T20:22:21.998293 #507402] INFO -- : [708/883] 548768=test_buffered_io I, [2024-05-25T20:22:22.003638 #507402] INFO -- : [709/883] 548768=test_monitor I, [2024-05-25T20:22:22.136030 #507402] INFO -- : [710/883] 548761=test_configuration I, [2024-05-25T20:22:22.215396 #507402] INFO -- : [711/883] 548768=test_rubyvm I, [2024-05-25T20:22:22.223810 #507402] INFO -- : [712/883] 548768=fuzzer_test I, [2024-05-25T20:22:22.226282 #507402] INFO -- : [713/883] 548762=test_sexp I, [2024-05-25T20:22:22.230373 #507402] INFO -- : [714/883] 548768=test_rdoc_markup_include I, [2024-05-25T20:22:22.233191 #507402] INFO -- : [715/883] 548768=test_variable I, [2024-05-25T20:22:22.238938 #507402] INFO -- : [716/883] 548761=test_struct I, [2024-05-25T20:22:22.245256 #507402] INFO -- : [717/883] 548762=test_rdoc_markup_to_html_snippet I, [2024-05-25T20:22:22.246120 #507402] INFO -- : [718/883] 548761=magic_comment_test I, [2024-05-25T20:22:22.252038 #507402] INFO -- : [719/883] 548761=test_cparser I, [2024-05-25T20:22:22.259513 #507402] INFO -- : [720/883] 548766=test_pkg_config I, [2024-05-25T20:22:22.272895 #507402] INFO -- : [721/883] 548766=test_config I, [2024-05-25T20:22:22.300705 #507402] INFO -- : [722/883] 548762=test_nomethod_error I, [2024-05-25T20:22:22.306891 #507402] INFO -- : [723/883] 548766=json_parser_test I, [2024-05-25T20:22:22.310014 #507402] INFO -- : [724/883] 548762=test_dln I, [2024-05-25T20:22:22.313929 #507402] INFO -- : [725/883] 548762=test_gem_source_subpath_problem I, [2024-05-25T20:22:22.336266 #507402] INFO -- : [726/883] 548771=json_common_interface_test I, [2024-05-25T20:22:22.339227 #507402] INFO -- : [727/883] 548766=test_win32ole_variant_outarg I, [2024-05-25T20:22:22.339648 #507402] INFO -- : [728/883] 548766=test_rdoc_rd_inline I, [2024-05-25T20:22:22.340645 #507402] INFO -- : [729/883] 548768=test_x509req I, [2024-05-25T20:22:22.343539 #507402] INFO -- : [730/883] 548771=test_mutex I, [2024-05-25T20:22:22.345889 #507402] INFO -- : [731/883] 548766=test_set I, [2024-05-25T20:22:22.370521 #507402] INFO -- : [732/883] 548766=test_struct I, [2024-05-25T20:22:22.452980 #507402] INFO -- : [733/883] 548762=test_gem_path_support I, [2024-05-25T20:22:22.486818 #507402] INFO -- : [734/883] 548762=test_files_test_1 I, [2024-05-25T20:22:22.519844 #507402] INFO -- : [735/883] 548768=test_color_printer I, [2024-05-25T20:22:22.526159 #507402] INFO -- : [736/883] 548768=test_deprecated I, [2024-05-25T20:22:22.526849 #507402] INFO -- : [737/883] 548768=test_insns_leaf I, [2024-05-25T20:22:22.529394 #507402] INFO -- : [738/883] 548768=test_serialize_subclasses I, [2024-05-25T20:22:22.536870 #507402] INFO -- : [739/883] 548768=test_key_error I, [2024-05-25T20:22:22.540726 #507402] INFO -- : [740/883] 548768=test_win32ole_variant_m I, [2024-05-25T20:22:22.542529 #507402] INFO -- : [741/883] 548768=test_engine I, [2024-05-25T20:22:22.550461 #507402] INFO -- : [742/883] 548768=test_allocation I, [2024-05-25T20:22:22.554337 #507402] INFO -- : [743/883] 548758=test_div I, [2024-05-25T20:22:22.561160 #507402] INFO -- : [744/883] 548758=test_windows_1252 I, [2024-05-25T20:22:22.572658 #507402] INFO -- : [745/883] 548758=test_input_method I, [2024-05-25T20:22:22.714902 #507402] INFO -- : [746/883] 548758=test_process I, [2024-05-25T20:22:22.726856 #507402] INFO -- : [747/883] 548770=test_signal I, [2024-05-25T20:22:22.740817 #507402] INFO -- : [748/883] 548758=test_fixnum I, [2024-05-25T20:22:22.748340 #507402] INFO -- : [749/883] 548758=test_x509crl I, [2024-05-25T20:22:22.801003 #507402] INFO -- : [750/883] 548766=test_cgi_session I, [2024-05-25T20:22:22.818196 #507402] INFO -- : [751/883] 548766=test_rdoc_rd I, [2024-05-25T20:22:22.824225 #507402] INFO -- : [752/883] 548766=test_rdoc_top_level I, [2024-05-25T20:22:22.898699 #507402] INFO -- : [753/883] 548758=test_metaclass I, [2024-05-25T20:22:22.905115 #507402] INFO -- : [754/883] 548758=test_dir_m17n I, [2024-05-25T20:22:22.947761 #507402] INFO -- : [755/883] 548754=test_gem_resolver_installer_set I, [2024-05-25T20:22:23.060832 #507402] INFO -- : [756/883] 548766=test_regex_casefold I, [2024-05-25T20:22:23.115653 #507402] INFO -- : [757/883] 548761=test_refinement I, [2024-05-25T20:22:23.120280 #507402] INFO -- : [758/883] 548767=test_gem_commands_signout_command I, [2024-05-25T20:22:23.126651 #507402] INFO -- : [759/883] 548754=test_gem_source_git I, [2024-05-25T20:22:23.134087 #507402] INFO -- : [760/883] 548767=test_float I, [2024-05-25T20:22:23.374981 #507402] INFO -- : [761/883] 548755=test_require I, [2024-05-25T20:22:23.480904 #507402] INFO -- : [762/883] 548771=test_cgi_cookie I, [2024-05-25T20:22:23.487085 #507402] INFO -- : [763/883] 548771=test_storage I, [2024-05-25T20:22:23.494409 #507402] INFO -- : [764/883] 548771=test_gem_resolver_git_set I, [2024-05-25T20:22:23.559454 #507402] INFO -- : [765/883] 548766=test_cipher I, [2024-05-25T20:22:23.597317 #507402] INFO -- : [766/883] 548766=test_gem_security_signer I, [2024-05-25T20:22:23.688749 #507402] INFO -- : [767/883] 548754=test_new I, [2024-05-25T20:22:23.692429 #507402] INFO -- : [768/883] 548766=test_shellwords I, [2024-05-25T20:22:23.693415 #507402] INFO -- : [769/883] 548754=test_debug I, [2024-05-25T20:22:23.696373 #507402] INFO -- : [770/883] 548766=test_memory_view I, [2024-05-25T20:22:23.699062 #507402] INFO -- : [771/883] 548754=pattern_test I, [2024-05-25T20:22:23.716699 #507402] INFO -- : [772/883] 548766=test_string I, [2024-05-25T20:22:23.718568 #507402] INFO -- : [773/883] 548754=test_iterator I, [2024-05-25T20:22:23.722843 #507402] INFO -- : [774/883] 548766=test_omap I, [2024-05-25T20:22:23.734840 #507402] INFO -- : [775/883] 548766=test_digest_extend I, [2024-05-25T20:22:23.743109 #507402] INFO -- : [776/883] 548766=test_pinned I, [2024-05-25T20:22:23.782573 #507402] INFO -- : [777/883] 548754=test_rdoc_markup_pre_process I, [2024-05-25T20:22:23.807419 #507402] INFO -- : [778/883] 548766=test_printf I, [2024-05-25T20:22:23.817079 #507402] INFO -- : [779/883] 548766=test_to_ary_concat I, [2024-05-25T20:22:23.836556 #507402] INFO -- : [780/883] 548771=test_webauthn_listener_response I, [2024-05-25T20:22:23.854021 #507402] INFO -- : [781/883] 548771=test_time I, [2024-05-25T20:22:23.870567 #507402] INFO -- : [782/883] 548754=test_stream I, [2024-05-25T20:22:23.876787 #507402] INFO -- : [783/883] 548754=test_files_lib I, [2024-05-25T20:22:23.941794 #507402] INFO -- : [784/883] 548753=test_gem_commands_unpack_command I, [2024-05-25T20:22:24.011133 #507402] INFO -- : [785/883] 548771=test_beginendblock I, [2024-05-25T20:22:24.204735 #507402] INFO -- : [786/883] 548758=test_rdoc_markup_to_bs I, [2024-05-25T20:22:24.269301 #507402] INFO -- : [787/883] 548758=test_help I, [2024-05-25T20:22:24.273808 #507402] INFO -- : [788/883] 548758=test_emoji_breaks I, [2024-05-25T20:22:24.275947 #507402] INFO -- : [789/883] 548758=test_gem_bundler_version_finder I, [2024-05-25T20:22:24.300822 #507402] INFO -- : [790/883] 548758=test_within_pipe I, [2024-05-25T20:22:24.315974 #507402] INFO -- : [791/883] 548758=reflection_test I, [2024-05-25T20:22:24.320763 #507402] INFO -- : [792/883] 548753=test_multi_irb_commands I, [2024-05-25T20:22:24.330655 #507402] INFO -- : [793/883] 548753=test_fiber I, [2024-05-25T20:22:24.332735 #507402] INFO -- : [794/883] 548758=test_open3 I, [2024-05-25T20:22:24.336794 #507402] INFO -- : [795/883] 548765=test_bundled_ca I, [2024-05-25T20:22:24.482771 #507402] INFO -- : [796/883] 548771=test_closure I, [2024-05-25T20:22:24.629587 #507402] INFO -- : [797/883] 548767=test_digest I, [2024-05-25T20:22:24.648041 #507402] INFO -- : [798/883] 548767=test_ractor I, [2024-05-25T20:22:24.719423 #507402] INFO -- : [799/883] 548767=test_gem_security I, [2024-05-25T20:22:24.798073 #507402] INFO -- : [800/883] 548757=test_rdoc_servlet I, [2024-05-25T20:22:24.811268 #507402] INFO -- : [801/883] 548770=test_recursion I, [2024-05-25T20:22:24.819267 #507402] INFO -- : [802/883] 548770=test_exit I, [2024-05-25T20:22:24.860416 #507402] INFO -- : [803/883] 548771=test_delegate I, [2024-05-25T20:22:24.874139 #507402] INFO -- : [804/883] 548771=test_popen_deadlock I, [2024-05-25T20:22:24.896049 #507402] INFO -- : [805/883] 548770=test_history I, [2024-05-25T20:22:24.916809 #507402] INFO -- : [806/883] 548757=test_mkmf I, [2024-05-25T20:22:24.955869 #507402] INFO -- : [807/883] 548757=test_date_marshal I, [2024-05-25T20:22:24.961383 #507402] INFO -- : [808/883] 548757=test_append I, [2024-05-25T20:22:24.963244 #507402] INFO -- : [809/883] 548757=test_option I, [2024-05-25T20:22:24.996848 #507402] INFO -- : [810/883] 548770=test_cmethod I, [2024-05-25T20:22:25.000885 #507402] INFO -- : [811/883] 548770=test_tracer I, [2024-05-25T20:22:25.008510 #507402] INFO -- : [812/883] 548770=test_io_m17n I, [2024-05-25T20:22:25.013723 #507402] INFO -- : [813/883] 548766=test_variable_name_check I, [2024-05-25T20:22:25.082999 #507402] INFO -- : [814/883] 548766=test_did_you_mean I, [2024-05-25T20:22:25.130671 #507402] INFO -- : [815/883] 548757=test_gem_commands_server_command I, [2024-05-25T20:22:25.136870 #507402] INFO -- : [816/883] 548757=test_interned_str I, [2024-05-25T20:22:25.148985 #507402] INFO -- : [817/883] 548757=test_case_comprehensive I, [2024-05-25T20:22:25.222504 #507402] INFO -- : [818/883] 548766=test_gem_commands_build_command I, [2024-05-25T20:22:25.342376 #507402] INFO -- : [819/883] 548768=test_scheduler I, [2024-05-25T20:22:25.450004 #507402] INFO -- : [820/883] 548766=test_ocsp I, [2024-05-25T20:22:25.506374 #507402] INFO -- : [821/883] 548768=test_class I, [2024-05-25T20:22:25.508120 #507402] INFO -- : [822/883] 548771=test_pkey_dsa I, [2024-05-25T20:22:25.512710 #507402] INFO -- : [823/883] 548768=test_exception_at_throwing I, [2024-05-25T20:22:25.571117 #507402] INFO -- : [824/883] 548768=test_iseq I, [2024-05-25T20:22:25.621105 #507402] INFO -- : [825/883] 548765=test_rdoc_markup_heading I, [2024-05-25T20:22:25.626772 #507402] INFO -- : [826/883] 548765=test_tree_spell_checker I, [2024-05-25T20:22:25.657950 #507402] INFO -- : [827/883] 548765=test_http I, [2024-05-25T20:22:25.703966 #507402] INFO -- : [828/883] 548762=test_addrinfo I, [2024-05-25T20:22:25.752549 #507402] INFO -- : [829/883] 548766=test_bn I, [2024-05-25T20:22:25.755149 #507402] INFO -- : [830/883] 548762=test_win32ole_param_event I, [2024-05-25T20:22:25.762033 #507402] INFO -- : [831/883] 548762=test_path I, [2024-05-25T20:22:25.763366 #507402] INFO -- : [832/883] 548762=redundant_return_test I, [2024-05-25T20:22:25.772945 #507402] INFO -- : [833/883] 548766=test_case_mapping I, [2024-05-25T20:22:25.788711 #507402] INFO -- : [834/883] 548766=test_terminfo I, [2024-05-25T20:22:25.794761 #507402] INFO -- : [835/883] 548766=test_compile_prism I, [2024-05-25T20:22:25.853263 #507402] INFO -- : [836/883] 548762=test_bug-14834 I, [2024-05-25T20:22:25.908494 #507402] INFO -- : [837/883] 548762=test_date_compat I, [2024-05-25T20:22:25.916882 #507402] INFO -- : [838/883] 548762=test_rdoc_markup_to_html I, [2024-05-25T20:22:25.960854 #507402] INFO -- : [839/883] 548762=test_gem_resolver_vendor_specification I, [2024-05-25T20:22:25.985459 #507402] INFO -- : [840/883] 548762=test_gem_commands_update_command I, [2024-05-25T20:22:26.126600 #507402] INFO -- : [841/883] 548766=test_gem_uri I, [2024-05-25T20:22:26.156803 #507402] INFO -- : [842/883] 548766=test_key_event_record I, [2024-05-25T20:22:26.167001 #507402] INFO -- : [843/883] 548766=test_notimplement I, [2024-05-25T20:22:26.168651 #507402] INFO -- : [844/883] 548766=test_random I, [2024-05-25T20:22:26.184009 #507402] INFO -- : [845/883] 548766=test_ssl_session I, [2024-05-25T20:22:26.231710 #507402] INFO -- : [846/883] 548771=test_thread_cv I, [2024-05-25T20:22:26.282892 #507402] INFO -- : [847/883] 548770=test_lexer I, [2024-05-25T20:22:26.286840 #507402] INFO -- : [848/883] 548768=test_rdoc_generator_pot I, [2024-05-25T20:22:26.288927 #507402] INFO -- : [849/883] 548768=test_enumerator I, [2024-05-25T20:22:26.292506 #507402] INFO -- : [850/883] 548768=test_rdoc_parser_changelog I, [2024-05-25T20:22:26.308252 #507402] INFO -- : [851/883] 548770=parameters_signature_test I, [2024-05-25T20:22:26.392257 #507402] INFO -- : [852/883] 548768=test_koi8 I, [2024-05-25T20:22:26.404822 #507402] INFO -- : [853/883] 548768=test_unicode I, [2024-05-25T20:22:26.410614 #507402] INFO -- : [854/883] 548770=test_rdoc_method_attr I, [2024-05-25T20:22:26.414214 #507402] INFO -- : [855/883] 548768=test_filter I, [2024-05-25T20:22:26.437455 #507402] INFO -- : [856/883] 548768=test_gem_gem_runner I, [2024-05-25T20:22:26.442233 #507402] INFO -- : [857/883] 548755=test_data I, [2024-05-25T20:22:26.451182 #507402] INFO -- : [858/883] 548755=static_literals_test I, [2024-05-25T20:22:26.452720 #507402] INFO -- : [859/883] 548755=test_chilled I, [2024-05-25T20:22:26.459306 #507402] INFO -- : [860/883] 548755=test_name_error_extension I, [2024-05-25T20:22:26.468385 #507402] INFO -- : [861/883] 548755=test_rdoc_i18n_locale I, [2024-05-25T20:22:26.476464 #507402] INFO -- : [862/883] 548755=test_document I, [2024-05-25T20:22:26.480260 #507402] INFO -- : [863/883] 548755=test_acceptable I, [2024-05-25T20:22:26.488806 #507402] INFO -- : [864/883] 548768=test_rdoc_generator_pot_po_entry I, [2024-05-25T20:22:26.500746 #507402] INFO -- : [865/883] 548768=test_euc_jp I, [2024-05-25T20:22:26.512763 #507402] INFO -- : [866/883] 548768=test_pair I, [2024-05-25T20:22:26.544403 #507402] INFO -- : [867/883] 548770=test_gem_commands_yank_command I, [2024-05-25T20:22:26.610130 #507402] INFO -- : [868/883] 548755=test_win32ole_param I, [2024-05-25T20:22:26.612838 #507402] INFO -- : [869/883] 548755=test_rbconfig I, [2024-05-25T20:22:26.632479 #507402] INFO -- : [870/883] 548755=test_primitive I, [2024-05-25T20:22:26.642500 #507402] INFO -- : [871/883] 548755=test_human_typo I, [2024-05-25T20:22:26.643587 #507402] INFO -- : [872/883] 548755=test_key_stroke I, [2024-05-25T20:22:26.656728 #507402] INFO -- : [873/883] 548755=json_encoding_test I, [2024-05-25T20:22:26.667478 #507402] INFO -- : [874/883] 548755=test_color I, [2024-05-25T20:22:26.670061 #507402] INFO -- : [875/883] 548758=test_sockopt I, [2024-05-25T20:22:26.675016 #507402] INFO -- : [876/883] 548758=test_install I, [2024-05-25T20:22:26.724394 #507402] INFO -- : [877/883] 548759=test_rdoc_markup_to_label I, [2024-05-25T20:22:26.737299 #507402] INFO -- : [878/883] 548755=test_gem_resolver_local_specification I, [2024-05-25T20:22:26.743923 #507402] INFO -- : [879/883] 548759=test_httpheader I, [2024-05-25T20:22:26.766353 #507402] INFO -- : [880/883] 548755=test_rdoc_ri_driver I, [2024-05-25T20:22:26.766807 #507402] INFO -- : [881/883] 548759=test_set_len I, [2024-05-25T20:22:26.772038 #507402] INFO -- : [882/883] 548759=test_encoding I, [2024-05-25T20:22:26.778462 #507402] INFO -- : [883/883] 548760=test_httpresponses I, [2024-05-25T20:22:43.972912 #507402] INFO -- : Finished tests in 36.773447s, 717.9365 tests/s, 254384.2031 assertions/s. I, [2024-05-25T20:22:43.973567 #507402] INFO -- : 26401 tests, 9354584 assertions, 0 failures, 0 errors, 306 skips I, [2024-05-25T20:22:43.973592 #507402] INFO -- : I, [2024-05-25T20:22:43.973599 #507402] INFO -- : ruby -v: ruby 3.4.0dev (2024-05-25T17:47:07Z master d2c4363e0c) [x86_64-linux] I, [2024-05-25T20:22:43.975579 #507402] INFO -- : $$$[end] "make yes-test-all TESTOPTS='--stderr-on-failure' TESTS='-j20'" exit with 0. I, [2024-05-25T20:22:43.975731 #507402] INFO -- : $$$[beg] make yes-test-rubyspec MSPECOPT='--error-output stderr --debug -j' TESTS='-j20' I, [2024-05-25T20:22:44.067355 #507402] INFO -- : BASERUBY = /usr/bin/ruby --disable=gems I, [2024-05-25T20:22:44.067409 #507402] INFO -- : CC = gcc I, [2024-05-25T20:22:44.067425 #507402] INFO -- : LD = ld I, [2024-05-25T20:22:44.067437 #507402] INFO -- : LDSHARED = gcc -shared I, [2024-05-25T20:22:44.067451 #507402] INFO -- : CFLAGS = -O3 -fno-fast-math -ggdb3 -Wall -Wextra -Wdeprecated-declarations -Wdiv-by-zero -Wduplicated-cond -Wimplicit-function-declaration -Wimplicit-int -Wpointer-arith -Wwrite-strings -Wold-style-definition -Wimplicit-fallthrough=0 -Wmissing-noreturn -Wno-cast-function-type -Wno-constant-logical-operand -Wno-long-long -Wno-missing-field-initializers -Wno-overlength-strings -Wno-packed-bitfield-compat -Wno-parentheses-equality -Wno-self-assign -Wno-tautological-compare -Wno-unused-parameter -Wno-unused-value -Wsuggest-attribute=format -Wsuggest-attribute=noreturn -Wunused-variable -Wmisleading-indentation -Wundef -fPIC I, [2024-05-25T20:22:44.067464 #507402] INFO -- : XCFLAGS = -U_FORTIFY_SOURCE -D_FORTIFY_SOURCE=2 -fstack-protector-strong -fno-strict-overflow -fvisibility=hidden -fexcess-precision=standard -DRUBY_EXPORT -I. -I.ext/include/x86_64-linux -I/tmp/ruby/src/trunk/include -I/tmp/ruby/src/trunk -I/tmp/ruby/src/trunk/prism -I/tmp/ruby/src/trunk/enc/unicode/15.0.0 I, [2024-05-25T20:22:44.067477 #507402] INFO -- : CPPFLAGS = I, [2024-05-25T20:22:44.067489 #507402] INFO -- : DLDFLAGS = -Wl,--compress-debug-sections=zlib -Wl,-soname,libruby.so.3.4 -fstack-protector-strong I, [2024-05-25T20:22:44.067501 #507402] INFO -- : SOLIBS = -lz -lrt -lrt -lgmp -ldl -lcrypt -lm -lpthread I, [2024-05-25T20:22:44.067525 #507402] INFO -- : LANG = en_US.UTF-8 I, [2024-05-25T20:22:44.067537 #507402] INFO -- : LC_ALL = I, [2024-05-25T20:22:44.067549 #507402] INFO -- : LC_CTYPE = I, [2024-05-25T20:22:44.067560 #507402] INFO -- : MFLAGS = I, [2024-05-25T20:22:44.067572 #507402] INFO -- : RUSTC = no I, [2024-05-25T20:22:44.067584 #507402] INFO -- : YJIT_RUSTC_ARGS = --crate-name=yjit --crate-type=staticlib --edition=2021 -g -C lto=thin -C opt-level=3 -C overflow-checks=on '--out-dir=/tmp/ruby/build/trunk/yjit/target/release/' /tmp/ruby/src/trunk/yjit/src/lib.rs I, [2024-05-25T20:22:44.067968 #507402] INFO -- : gcc (Ubuntu 11.4.0-1ubuntu1~22.04) 11.4.0 I, [2024-05-25T20:22:44.068021 #507402] INFO -- : Copyright (C) 2021 Free Software Foundation, Inc. I, [2024-05-25T20:22:44.068036 #507402] INFO -- : This is free software; see the source for copying conditions. There is NO I, [2024-05-25T20:22:44.068050 #507402] INFO -- : warranty; not even for MERCHANTABILITY or FITNESS FOR A PARTICULAR PURPOSE. I, [2024-05-25T20:22:44.068063 #507402] INFO -- : I, [2024-05-25T20:22:44.069759 #507402] INFO -- : generating enc.mk I, [2024-05-25T20:22:44.188651 #507402] INFO -- : generating encdb.h I, [2024-05-25T20:22:44.212220 #507402] INFO -- : encdb.h unchanged I, [2024-05-25T20:22:44.213348 #507402] INFO -- : making enc I, [2024-05-25T20:22:44.231779 #507402] INFO -- : make[1]: Entering directory '/tmp/ruby/build/trunk' I, [2024-05-25T20:22:44.231979 #507402] INFO -- : make[1]: Nothing to be done for 'enc'. I, [2024-05-25T20:22:44.231987 #507402] INFO -- : make[1]: Leaving directory '/tmp/ruby/build/trunk' I, [2024-05-25T20:22:44.232286 #507402] INFO -- : making srcs under enc I, [2024-05-25T20:22:44.267453 #507402] INFO -- : make[1]: Entering directory '/tmp/ruby/build/trunk' I, [2024-05-25T20:22:44.267475 #507402] INFO -- : make[1]: Nothing to be done for 'srcs'. I, [2024-05-25T20:22:44.267481 #507402] INFO -- : make[1]: Leaving directory '/tmp/ruby/build/trunk' I, [2024-05-25T20:22:44.268331 #507402] INFO -- : generating transdb.h I, [2024-05-25T20:22:44.368099 #507402] INFO -- : transdb.h unchanged I, [2024-05-25T20:22:44.369603 #507402] INFO -- : making trans I, [2024-05-25T20:22:44.403885 #507402] INFO -- : make[1]: Entering directory '/tmp/ruby/build/trunk' I, [2024-05-25T20:22:44.403906 #507402] INFO -- : make[1]: Nothing to be done for 'trans'. I, [2024-05-25T20:22:44.403912 #507402] INFO -- : make[1]: Leaving directory '/tmp/ruby/build/trunk' I, [2024-05-25T20:22:44.404576 #507402] INFO -- : making encs I, [2024-05-25T20:22:44.442556 #507402] INFO -- : make[1]: Entering directory '/tmp/ruby/build/trunk' I, [2024-05-25T20:22:44.442576 #507402] INFO -- : make[1]: Nothing to be done for 'encs'. I, [2024-05-25T20:22:44.442582 #507402] INFO -- : make[1]: Leaving directory '/tmp/ruby/build/trunk' I, [2024-05-25T20:22:44.444289 #507402] INFO -- : generating makefiles ext/configure-ext.mk I, [2024-05-25T20:22:44.471255 #507402] INFO -- : ext/configure-ext.mk updated I, [2024-05-25T20:22:44.473769 #507402] INFO -- : make[1]: Entering directory '/tmp/ruby/build/trunk' I, [2024-05-25T20:22:45.872590 #507402] INFO -- : make[1]: Leaving directory '/tmp/ruby/build/trunk' I, [2024-05-25T20:22:45.873374 #507402] INFO -- : generating makefile exts.mk I, [2024-05-25T20:22:45.910292 #507402] INFO -- : exts.mk unchanged I, [2024-05-25T20:22:45.914789 #507402] INFO -- : make[1]: Entering directory '/tmp/ruby/build/trunk' I, [2024-05-25T20:22:46.255336 #507402] INFO -- : make[2]: Entering directory '/tmp/ruby/build/trunk/ext/coverage' I, [2024-05-25T20:22:46.259974 #507402] INFO -- : make[2]: Leaving directory '/tmp/ruby/build/trunk/ext/coverage' I, [2024-05-25T20:22:46.266781 #507402] INFO -- : make[2]: Entering directory '/tmp/ruby/build/trunk/ext/date' I, [2024-05-25T20:22:46.271999 #507402] INFO -- : make[2]: Leaving directory '/tmp/ruby/build/trunk/ext/date' I, [2024-05-25T20:22:46.275815 #507402] INFO -- : make[2]: Entering directory '/tmp/ruby/build/trunk/ext/digest' I, [2024-05-25T20:22:46.284723 #507402] INFO -- : make[2]: Leaving directory '/tmp/ruby/build/trunk/ext/digest' I, [2024-05-25T20:22:46.311796 #507402] INFO -- : make[2]: Entering directory '/tmp/ruby/build/trunk/ext/digest/sha2' I, [2024-05-25T20:22:46.316688 #507402] INFO -- : make[2]: Leaving directory '/tmp/ruby/build/trunk/ext/digest/sha2' I, [2024-05-25T20:22:46.338700 #507402] INFO -- : make[2]: Entering directory '/tmp/ruby/build/trunk/ext/fiddle' I, [2024-05-25T20:22:46.349402 #507402] INFO -- : make[2]: Leaving directory '/tmp/ruby/build/trunk/ext/fiddle' I, [2024-05-25T20:22:46.354411 #507402] INFO -- : make[2]: Entering directory '/tmp/ruby/build/trunk/ext/io/console' I, [2024-05-25T20:22:46.358598 #507402] INFO -- : make[2]: Leaving directory '/tmp/ruby/build/trunk/ext/io/console' I, [2024-05-25T20:22:46.371749 #507402] INFO -- : make[2]: Entering directory '/tmp/ruby/build/trunk/ext/json' I, [2024-05-25T20:22:46.382416 #507402] INFO -- : make[2]: Leaving directory '/tmp/ruby/build/trunk/ext/json' I, [2024-05-25T20:22:46.397830 #507402] INFO -- : make[2]: Entering directory '/tmp/ruby/build/trunk/ext/monitor' I, [2024-05-25T20:22:46.401867 #507402] INFO -- : make[2]: Leaving directory '/tmp/ruby/build/trunk/ext/monitor' I, [2024-05-25T20:22:46.409361 #507402] INFO -- : make[2]: Entering directory '/tmp/ruby/build/trunk/ext/objspace' I, [2024-05-25T20:22:46.415535 #507402] INFO -- : make[2]: Leaving directory '/tmp/ruby/build/trunk/ext/objspace' I, [2024-05-25T20:22:46.436046 #507402] INFO -- : make[2]: Entering directory '/tmp/ruby/build/trunk/ext/openssl' I, [2024-05-25T20:22:46.455330 #507402] INFO -- : make[2]: Leaving directory '/tmp/ruby/build/trunk/ext/openssl' I, [2024-05-25T20:22:46.460287 #507402] INFO -- : make[2]: Entering directory '/tmp/ruby/build/trunk/ext/pathname' I, [2024-05-25T20:22:46.464366 #507402] INFO -- : make[2]: Leaving directory '/tmp/ruby/build/trunk/ext/pathname' I, [2024-05-25T20:22:46.471518 #507402] INFO -- : make[2]: Entering directory '/tmp/ruby/build/trunk/ext/psych' I, [2024-05-25T20:22:46.496810 #507402] INFO -- : make[2]: Leaving directory '/tmp/ruby/build/trunk/ext/psych' I, [2024-05-25T20:22:46.502021 #507402] INFO -- : make[2]: Entering directory '/tmp/ruby/build/trunk/ext/pty' I, [2024-05-25T20:22:46.506161 #507402] INFO -- : make[2]: Leaving directory '/tmp/ruby/build/trunk/ext/pty' I, [2024-05-25T20:22:46.522302 #507402] INFO -- : make[2]: Entering directory '/tmp/ruby/build/trunk/ext/ripper' I, [2024-05-25T20:22:46.530651 #507402] INFO -- : make[2]: Leaving directory '/tmp/ruby/build/trunk/ext/ripper' I, [2024-05-25T20:22:46.533073 #507402] INFO -- : make[2]: Entering directory '/tmp/ruby/build/trunk/ext/rubyvm' I, [2024-05-25T20:22:46.536335 #507402] INFO -- : make[2]: Leaving directory '/tmp/ruby/build/trunk/ext/rubyvm' I, [2024-05-25T20:22:46.547991 #507402] INFO -- : make[2]: Entering directory '/tmp/ruby/build/trunk/ext/socket' I, [2024-05-25T20:22:46.555602 #507402] INFO -- : make[2]: Leaving directory '/tmp/ruby/build/trunk/ext/socket' I, [2024-05-25T20:22:46.573696 #507402] INFO -- : make[2]: Entering directory '/tmp/ruby/build/trunk/.bundle/gems/bigdecimal-3.1.8/ext/bigdecimal' I, [2024-05-25T20:22:46.600145 #507402] INFO -- : make[2]: Leaving directory '/tmp/ruby/build/trunk/.bundle/gems/bigdecimal-3.1.8/ext/bigdecimal' I, [2024-05-25T20:22:46.602093 #507402] INFO -- : make[2]: Entering directory '/tmp/ruby/build/trunk/.bundle/gems/debug-1.9.2/ext/debug' I, [2024-05-25T20:22:46.624618 #507402] INFO -- : make[2]: Leaving directory '/tmp/ruby/build/trunk/.bundle/gems/debug-1.9.2/ext/debug' I, [2024-05-25T20:22:46.626522 #507402] INFO -- : make[2]: Entering directory '/tmp/ruby/build/trunk/.bundle/gems/nkf-0.2.0/ext/nkf' I, [2024-05-25T20:22:46.648114 #507402] INFO -- : make[2]: Leaving directory '/tmp/ruby/build/trunk/.bundle/gems/nkf-0.2.0/ext/nkf' I, [2024-05-25T20:22:46.649923 #507402] INFO -- : make[2]: Entering directory '/tmp/ruby/build/trunk/.bundle/gems/racc-1.7.3/ext/racc/cparse' I, [2024-05-25T20:22:46.672274 #507402] INFO -- : make[2]: Leaving directory '/tmp/ruby/build/trunk/.bundle/gems/racc-1.7.3/ext/racc/cparse' I, [2024-05-25T20:22:46.674198 #507402] INFO -- : make[2]: Entering directory '/tmp/ruby/build/trunk/.bundle/gems/racc-1.8.0/ext/racc/cparse' I, [2024-05-25T20:22:46.697907 #507402] INFO -- : make[2]: Leaving directory '/tmp/ruby/build/trunk/.bundle/gems/racc-1.8.0/ext/racc/cparse' I, [2024-05-25T20:22:46.700354 #507402] INFO -- : make[2]: Entering directory '/tmp/ruby/build/trunk/.bundle/gems/rbs-3.4.4/ext/rbs_extension' I, [2024-05-25T20:22:46.722032 #507402] INFO -- : make[2]: Leaving directory '/tmp/ruby/build/trunk/.bundle/gems/rbs-3.4.4/ext/rbs_extension' I, [2024-05-25T20:22:46.724288 #507402] INFO -- : make[2]: Entering directory '/tmp/ruby/build/trunk/.bundle/gems/syslog-0.1.2/ext/syslog' I, [2024-05-25T20:22:46.746419 #507402] INFO -- : make[2]: Leaving directory '/tmp/ruby/build/trunk/.bundle/gems/syslog-0.1.2/ext/syslog' I, [2024-05-25T20:22:46.770439 #507402] INFO -- : make[2]: Entering directory '/tmp/ruby/build/trunk' I, [2024-05-25T20:22:46.834623 #507402] INFO -- : make[2]: 'ruby' is up to date. I, [2024-05-25T20:22:46.834663 #507402] INFO -- : make[2]: Leaving directory '/tmp/ruby/build/trunk' I, [2024-05-25T20:22:46.835003 #507402] INFO -- : make[1]: Leaving directory '/tmp/ruby/build/trunk' I, [2024-05-25T20:22:46.838544 #507402] INFO -- : make[1]: Entering directory '/tmp/ruby/build/trunk' I, [2024-05-25T20:22:46.838565 #507402] INFO -- : make[1]: Nothing to be done for 'note'. I, [2024-05-25T20:22:46.838570 #507402] INFO -- : make[1]: Leaving directory '/tmp/ruby/build/trunk' E, [2024-05-25T20:22:46.898154 #507402] ERROR -- : $ /tmp/ruby/build/trunk/miniruby -I/tmp/ruby/src/trunk/lib /tmp/ruby/src/trunk/tool/runruby.rb --archdir=/tmp/ruby/build/trunk --extout=.ext -- /tmp/ruby/src/trunk/spec/mspec/bin/mspec-run -B /tmp/ruby/src/trunk/spec/default.mspec --error-output stderr --debug -fy -o /tmp/rubytest.k8rnck/1-mspec-multi-0 E, [2024-05-25T20:22:46.898381 #507402] ERROR -- : $ /tmp/ruby/build/trunk/miniruby -I/tmp/ruby/src/trunk/lib /tmp/ruby/src/trunk/tool/runruby.rb --archdir=/tmp/ruby/build/trunk --extout=.ext -- /tmp/ruby/src/trunk/spec/mspec/bin/mspec-run -B /tmp/ruby/src/trunk/spec/default.mspec --error-output stderr --debug -fy -o /tmp/rubytest.k8rnck/2-mspec-multi-1 E, [2024-05-25T20:22:46.898652 #507402] ERROR -- : $ /tmp/ruby/build/trunk/miniruby -I/tmp/ruby/src/trunk/lib /tmp/ruby/src/trunk/tool/runruby.rb --archdir=/tmp/ruby/build/trunk --extout=.ext -- /tmp/ruby/src/trunk/spec/mspec/bin/mspec-run -B /tmp/ruby/src/trunk/spec/default.mspec --error-output stderr --debug -fy -o /tmp/rubytest.k8rnck/3-mspec-multi-2 E, [2024-05-25T20:22:46.898931 #507402] ERROR -- : $ /tmp/ruby/build/trunk/miniruby -I/tmp/ruby/src/trunk/lib /tmp/ruby/src/trunk/tool/runruby.rb --archdir=/tmp/ruby/build/trunk --extout=.ext -- /tmp/ruby/src/trunk/spec/mspec/bin/mspec-run -B /tmp/ruby/src/trunk/spec/default.mspec --error-output stderr --debug -fy -o /tmp/rubytest.k8rnck/4-mspec-multi-3 E, [2024-05-25T20:22:46.899202 #507402] ERROR -- : $ /tmp/ruby/build/trunk/miniruby -I/tmp/ruby/src/trunk/lib /tmp/ruby/src/trunk/tool/runruby.rb --archdir=/tmp/ruby/build/trunk --extout=.ext -- /tmp/ruby/src/trunk/spec/mspec/bin/mspec-run -B /tmp/ruby/src/trunk/spec/default.mspec --error-output stderr --debug -fy -o /tmp/rubytest.k8rnck/5-mspec-multi-4 E, [2024-05-25T20:22:46.899325 #507402] ERROR -- : $ /tmp/ruby/build/trunk/miniruby -I/tmp/ruby/src/trunk/lib /tmp/ruby/src/trunk/tool/runruby.rb --archdir=/tmp/ruby/build/trunk --extout=.ext -- /tmp/ruby/src/trunk/spec/mspec/bin/mspec-run -B /tmp/ruby/src/trunk/spec/default.mspec --error-output stderr --debug -fy -o /tmp/rubytest.k8rnck/6-mspec-multi-5 E, [2024-05-25T20:22:46.899728 #507402] ERROR -- : $ /tmp/ruby/build/trunk/miniruby -I/tmp/ruby/src/trunk/lib /tmp/ruby/src/trunk/tool/runruby.rb --archdir=/tmp/ruby/build/trunk --extout=.ext -- /tmp/ruby/src/trunk/spec/mspec/bin/mspec-run -B /tmp/ruby/src/trunk/spec/default.mspec --error-output stderr --debug -fy -o /tmp/rubytest.k8rnck/7-mspec-multi-6 E, [2024-05-25T20:22:46.899962 #507402] ERROR -- : $ /tmp/ruby/build/trunk/miniruby -I/tmp/ruby/src/trunk/lib /tmp/ruby/src/trunk/tool/runruby.rb --archdir=/tmp/ruby/build/trunk --extout=.ext -- /tmp/ruby/src/trunk/spec/mspec/bin/mspec-run -B /tmp/ruby/src/trunk/spec/default.mspec --error-output stderr --debug -fy -o /tmp/rubytest.k8rnck/8-mspec-multi-7 E, [2024-05-25T20:22:46.900249 #507402] ERROR -- : $ /tmp/ruby/build/trunk/miniruby -I/tmp/ruby/src/trunk/lib /tmp/ruby/src/trunk/tool/runruby.rb --archdir=/tmp/ruby/build/trunk --extout=.ext -- /tmp/ruby/src/trunk/spec/mspec/bin/mspec-run -B /tmp/ruby/src/trunk/spec/default.mspec --error-output stderr --debug -fy -o /tmp/rubytest.k8rnck/9-mspec-multi-8 E, [2024-05-25T20:22:46.900510 #507402] ERROR -- : $ /tmp/ruby/build/trunk/miniruby -I/tmp/ruby/src/trunk/lib /tmp/ruby/src/trunk/tool/runruby.rb --archdir=/tmp/ruby/build/trunk --extout=.ext -- /tmp/ruby/src/trunk/spec/mspec/bin/mspec-run -B /tmp/ruby/src/trunk/spec/default.mspec --error-output stderr --debug -fy -o /tmp/rubytest.k8rnck/10-mspec-multi-9 E, [2024-05-25T20:22:46.900813 #507402] ERROR -- : $ /tmp/ruby/build/trunk/miniruby -I/tmp/ruby/src/trunk/lib /tmp/ruby/src/trunk/tool/runruby.rb --archdir=/tmp/ruby/build/trunk --extout=.ext -- /tmp/ruby/src/trunk/spec/mspec/bin/mspec-run -B /tmp/ruby/src/trunk/spec/default.mspec --error-output stderr --debug -fy -o /tmp/rubytest.k8rnck/11-mspec-multi-10 E, [2024-05-25T20:22:46.901081 #507402] ERROR -- : $ /tmp/ruby/build/trunk/miniruby -I/tmp/ruby/src/trunk/lib /tmp/ruby/src/trunk/tool/runruby.rb --archdir=/tmp/ruby/build/trunk --extout=.ext -- /tmp/ruby/src/trunk/spec/mspec/bin/mspec-run -B /tmp/ruby/src/trunk/spec/default.mspec --error-output stderr --debug -fy -o /tmp/rubytest.k8rnck/12-mspec-multi-11 E, [2024-05-25T20:22:46.901364 #507402] ERROR -- : $ /tmp/ruby/build/trunk/miniruby -I/tmp/ruby/src/trunk/lib /tmp/ruby/src/trunk/tool/runruby.rb --archdir=/tmp/ruby/build/trunk --extout=.ext -- /tmp/ruby/src/trunk/spec/mspec/bin/mspec-run -B /tmp/ruby/src/trunk/spec/default.mspec --error-output stderr --debug -fy -o /tmp/rubytest.k8rnck/13-mspec-multi-12 E, [2024-05-25T20:22:46.901539 #507402] ERROR -- : $ /tmp/ruby/build/trunk/miniruby -I/tmp/ruby/src/trunk/lib /tmp/ruby/src/trunk/tool/runruby.rb --archdir=/tmp/ruby/build/trunk --extout=.ext -- /tmp/ruby/src/trunk/spec/mspec/bin/mspec-run -B /tmp/ruby/src/trunk/spec/default.mspec --error-output stderr --debug -fy -o /tmp/rubytest.k8rnck/14-mspec-multi-13 E, [2024-05-25T20:22:46.901705 #507402] ERROR -- : $ /tmp/ruby/build/trunk/miniruby -I/tmp/ruby/src/trunk/lib /tmp/ruby/src/trunk/tool/runruby.rb --archdir=/tmp/ruby/build/trunk --extout=.ext -- /tmp/ruby/src/trunk/spec/mspec/bin/mspec-run -B /tmp/ruby/src/trunk/spec/default.mspec --error-output stderr --debug -fy -o /tmp/rubytest.k8rnck/15-mspec-multi-14 E, [2024-05-25T20:22:46.901875 #507402] ERROR -- : $ /tmp/ruby/build/trunk/miniruby -I/tmp/ruby/src/trunk/lib /tmp/ruby/src/trunk/tool/runruby.rb --archdir=/tmp/ruby/build/trunk --extout=.ext -- /tmp/ruby/src/trunk/spec/mspec/bin/mspec-run -B /tmp/ruby/src/trunk/spec/default.mspec --error-output stderr --debug -fy -o /tmp/rubytest.k8rnck/16-mspec-multi-15 E, [2024-05-25T20:22:46.902037 #507402] ERROR -- : $ /tmp/ruby/build/trunk/miniruby -I/tmp/ruby/src/trunk/lib /tmp/ruby/src/trunk/tool/runruby.rb --archdir=/tmp/ruby/build/trunk --extout=.ext -- /tmp/ruby/src/trunk/spec/mspec/bin/mspec-run -B /tmp/ruby/src/trunk/spec/default.mspec --error-output stderr --debug -fy -o /tmp/rubytest.k8rnck/17-mspec-multi-16 E, [2024-05-25T20:22:46.902218 #507402] ERROR -- : $ /tmp/ruby/build/trunk/miniruby -I/tmp/ruby/src/trunk/lib /tmp/ruby/src/trunk/tool/runruby.rb --archdir=/tmp/ruby/build/trunk --extout=.ext -- /tmp/ruby/src/trunk/spec/mspec/bin/mspec-run -B /tmp/ruby/src/trunk/spec/default.mspec --error-output stderr --debug -fy -o /tmp/rubytest.k8rnck/18-mspec-multi-17 E, [2024-05-25T20:22:46.905097 #507402] ERROR -- : $ /tmp/ruby/build/trunk/miniruby -I/tmp/ruby/src/trunk/lib /tmp/ruby/src/trunk/tool/runruby.rb --archdir=/tmp/ruby/build/trunk --extout=.ext -- /tmp/ruby/src/trunk/spec/mspec/bin/mspec-run -B /tmp/ruby/src/trunk/spec/default.mspec --error-output stderr --debug -fy -o /tmp/rubytest.k8rnck/19-mspec-multi-18 E, [2024-05-25T20:22:46.905431 #507402] ERROR -- : $ /tmp/ruby/build/trunk/miniruby -I/tmp/ruby/src/trunk/lib /tmp/ruby/src/trunk/tool/runruby.rb --archdir=/tmp/ruby/build/trunk --extout=.ext -- /tmp/ruby/src/trunk/spec/mspec/bin/mspec-run -B /tmp/ruby/src/trunk/spec/default.mspec --error-output stderr --debug -fy -o /tmp/rubytest.k8rnck/20-mspec-multi-19 I, [2024-05-25T20:22:47.071003 #507402] INFO -- : ruby 3.4.0dev (2024-05-25T17:47:07Z master d2c4363e0c) [x86_64-linux] I, [2024-05-25T20:22:47.688377 #507402] INFO -- : 0 ......................................................................... I, [2024-05-25T20:22:48.045906 #507402] INFO -- : 73 ......................................................................... I, [2024-05-25T20:22:48.211915 #507402] INFO -- : 146 ......................................................................... I, [2024-05-25T20:22:48.265926 #507402] INFO -- : 219 ......................................................................... I, [2024-05-25T20:22:48.323125 #507402] INFO -- : 292 ......................................................................... I, [2024-05-25T20:22:48.365720 #507402] INFO -- : 365 ......................................................................... I, [2024-05-25T20:22:48.387755 #507402] INFO -- : 438 ......................................................................... I, [2024-05-25T20:22:48.407217 #507402] INFO -- : 511 ......................................................................... I, [2024-05-25T20:22:48.425380 #507402] INFO -- : 584 ......................................................................... I, [2024-05-25T20:22:48.483721 #507402] INFO -- : 657 ......................................................................... I, [2024-05-25T20:22:48.510594 #507402] INFO -- : 730 ......................................................................... I, [2024-05-25T20:22:48.527605 #507402] INFO -- : 803 ......................................................................... I, [2024-05-25T20:22:48.558854 #507402] INFO -- : 876 ......................................................................... I, [2024-05-25T20:22:48.609916 #507402] INFO -- : 949 ......................................................................... I, [2024-05-25T20:22:48.693959 #507402] INFO -- : 1022 ......................................................................... I, [2024-05-25T20:22:48.861787 #507402] INFO -- : 1095 ......................................................................... I, [2024-05-25T20:22:48.989188 #507402] INFO -- : 1168 ......................................................................... I, [2024-05-25T20:22:49.046888 #507402] INFO -- : 1241 ......................................................................... I, [2024-05-25T20:22:49.090562 #507402] INFO -- : 1314 ......................................................................... I, [2024-05-25T20:22:49.120532 #507402] INFO -- : 1387 ......................................................................... I, [2024-05-25T20:22:49.215413 #507402] INFO -- : 1460 ......................................................................... I, [2024-05-25T20:22:49.686625 #507402] INFO -- : 1533 ......................................................................... I, [2024-05-25T20:22:49.762263 #507402] INFO -- : 1606 ......................................................................... I, [2024-05-25T20:22:49.914809 #507402] INFO -- : 1679 ......................................................................... I, [2024-05-25T20:22:50.013762 #507402] INFO -- : 1752 ......................................................................... I, [2024-05-25T20:22:50.090823 #507402] INFO -- : 1825 ......................................................................... I, [2024-05-25T20:22:50.195318 #507402] INFO -- : 1898 ......................................................................... I, [2024-05-25T20:22:50.271623 #507402] INFO -- : 1971 ......................................................................... I, [2024-05-25T20:22:50.356864 #507402] INFO -- : 2044 ......................................................................... I, [2024-05-25T20:22:50.397552 #507402] INFO -- : 2117 ......................................................................... I, [2024-05-25T20:22:50.408995 #507402] INFO -- : 2190 ......................................................................... I, [2024-05-25T20:22:50.427502 #507402] INFO -- : 2263 ......................................................................... I, [2024-05-25T20:22:50.441096 #507402] INFO -- : 2336 ......................................................................... I, [2024-05-25T20:22:50.477097 #507402] INFO -- : 2409 ......................................................................... I, [2024-05-25T20:22:50.586061 #507402] INFO -- : 2482 ......................................................................... I, [2024-05-25T20:22:50.617044 #507402] INFO -- : 2555 ......................................................................... I, [2024-05-25T20:22:50.721800 #507402] INFO -- : 2628 ......................................................................... I, [2024-05-25T20:22:50.808560 #507402] INFO -- : 2701 ......................................................................... I, [2024-05-25T20:22:50.835218 #507402] INFO -- : 2774 ......................................................................... I, [2024-05-25T20:22:50.898763 #507402] INFO -- : 2847 ......................................................................... I, [2024-05-25T20:22:50.934652 #507402] INFO -- : 2920 ......................................................................... I, [2024-05-25T20:22:50.957773 #507402] INFO -- : 2993 ......................................................................... I, [2024-05-25T20:22:50.976123 #507402] INFO -- : 3066 ......................................................................... I, [2024-05-25T20:22:50.989648 #507402] INFO -- : 3139 ......................................................................... I, [2024-05-25T20:22:51.001627 #507402] INFO -- : 3212 ......................................................................... I, [2024-05-25T20:22:51.030805 #507402] INFO -- : 3285 ......................................................................... I, [2024-05-25T20:22:54.980488 #507402] INFO -- : 3358 ......................................................................... I, [2024-05-25T20:22:55.002258 #507402] INFO -- : I, [2024-05-25T20:22:55.002285 #507402] INFO -- : I, [2024-05-25T20:22:55.002291 #507402] INFO -- : Finished in 8.103339 seconds I, [2024-05-25T20:22:55.002295 #507402] INFO -- : I, [2024-05-25T20:22:55.002299 #507402] INFO -- : 3430 files, 32652 examples, 165763 expectations, 0 failures, 0 errors, 0 tagged I, [2024-05-25T20:22:55.004166 #507402] INFO -- : $$$[end] "make yes-test-rubyspec MSPECOPT='--error-output stderr --debug -j' TESTS='-j20'" exit with 0.