# Logfile created on 2024-05-25 07:19:27 +0000 by logger.rb/v1.4.3
I, [2024-05-25T07:19:27.845376 #688717]  INFO -- : #<BuildRuby:0x000055d1665f4028 @REPOSITORY="https://github.com/ruby/ruby.git", @REPOSITORY_TYPE=:git, @git_branch=nil, @git_worktree=nil, @svn_revision=nil, @SRC_DIR="/tmp/ruby/src", @BUILD_DIR="/tmp/ruby/build", @INSTALL_DIR="/tmp/ruby/install", @TARGET_NAME="trunk", @TARGET_SRC_DIR="/tmp/ruby/src/trunk", @TARGET_BUILD_DIR="/tmp/ruby/build/trunk", @TARGET_INSTALL_DIR="/tmp/ruby/install/trunk", @configure_opts=["--enable-shared"], @build_opts="-j20", @btest_opts="-j20", @test_opts="TESTS='-j20'", @spec_opts="-j", @incremental=true, @steps=["checkout", "autoconf", "configure", "build_up", "build_miniruby", "build_ruby", "build_all", "build_install", "test_btest", "test_basic", "test_all", "test_rubyspec"], @quiet=false, @gist=false, @timeout=10800, @logfile="/home/ko1/ruby/logs/brlog.trunk.20240525-071927", @ruby_env=[["RUBY_DEBUG", "ci"]], @make="make", @logger=#<Logger:0x000055d166643358 @level=0, @progname=nil, @default_formatter=#<Logger::Formatter:0x000055d166643218 @datetime_format=nil>, @formatter=nil, @logdev=#<Logger::LogDevice:0x000055d166642fe8 @shift_period_suffix="%Y%m%d", @shift_size=1048576, @shift_age=0, @filename="/home/ko1/ruby/logs/brlog.trunk.20240525-071927", @dev=#<File:/home/ko1/ruby/logs/brlog.trunk.20240525-071927>, @binmode=false, @mon_data=#<Monitor:0x000055d166642ed0>, @mon_data_owner_object_id=860>>>
I, [2024-05-25T07:19:27.845499 #688717]  INFO -- : $$$[beg] make update-unicode  -j20
I, [2024-05-25T07:19:27.904645 #688717]  INFO -- : Downloading Unicode emoji 15.0 files...
I, [2024-05-25T07:19:27.904904 #688717]  INFO -- : Downloading Unicode emoji 15.0 files...
I, [2024-05-25T07:19:27.905526 #688717]  INFO -- : Downloading Unicode emoji 15.0 files...
I, [2024-05-25T07:19:27.948341 #688717]  INFO -- : made symlink emoji/15.0/emoji-sequences.txt to /tmp/ruby/src/trunk/.downloaded-cache/emoji/15.0/emoji-sequences.txt
I, [2024-05-25T07:19:27.948469 #688717]  INFO -- : downloading emoji/15.0/emoji-test.txt ... downloading emoji/15.0/emoji-sequences.txt ... /tmp/ruby/src/trunk/enc/unicode/data/emoji/15.0/emoji-sequences.txt already exists
E, [2024-05-25T07:19:28.397053 #688717] ERROR -- : /tmp/ruby/src/trunk/tool/downloader.rb:302:in `rescue in download': failed to download emoji/15.0/emoji-test.txt (RuntimeError)
E, [2024-05-25T07:19:28.397167 #688717] ERROR -- : OpenURI::HTTPError: 403 Forbidden: https://www.unicode.org/Public/emoji/15.0/emoji-test.txt
E, [2024-05-25T07:19:28.397186 #688717] ERROR -- : 	from /tmp/ruby/src/trunk/tool/downloader.rb:201:in `download'
E, [2024-05-25T07:19:28.397198 #688717] ERROR -- : 	from /tmp/ruby/src/trunk/tool/downloader.rb:136:in `download'
E, [2024-05-25T07:19:28.397209 #688717] ERROR -- : 	from /tmp/ruby/src/trunk/tool/downloader.rb:482:in `block in <main>'
E, [2024-05-25T07:19:28.397221 #688717] ERROR -- : 	from /tmp/ruby/src/trunk/tool/downloader.rb:465:in `each'
E, [2024-05-25T07:19:28.397232 #688717] ERROR -- : 	from /tmp/ruby/src/trunk/tool/downloader.rb:465:in `<main>'
E, [2024-05-25T07:19:28.397243 #688717] ERROR -- : /usr/lib/ruby/3.0.0/open-uri.rb:364:in `open_http': 403 Forbidden (OpenURI::HTTPError)
E, [2024-05-25T07:19:28.397254 #688717] ERROR -- : 	from /usr/lib/ruby/3.0.0/open-uri.rb:741:in `buffer_open'
E, [2024-05-25T07:19:28.397268 #688717] ERROR -- : 	from /usr/lib/ruby/3.0.0/open-uri.rb:212:in `block in open_loop'
E, [2024-05-25T07:19:28.397278 #688717] ERROR -- : 	from /usr/lib/ruby/3.0.0/open-uri.rb:210:in `catch'
E, [2024-05-25T07:19:28.397289 #688717] ERROR -- : 	from /usr/lib/ruby/3.0.0/open-uri.rb:210:in `open_loop'
E, [2024-05-25T07:19:28.397300 #688717] ERROR -- : 	from /usr/lib/ruby/3.0.0/open-uri.rb:151:in `open_uri'
E, [2024-05-25T07:19:28.397310 #688717] ERROR -- : 	from /usr/lib/ruby/3.0.0/open-uri.rb:721:in `open'
E, [2024-05-25T07:19:28.397321 #688717] ERROR -- : 	from /usr/lib/ruby/3.0.0/open-uri.rb:729:in `read'
E, [2024-05-25T07:19:28.397332 #688717] ERROR -- : 	from /tmp/ruby/src/trunk/tool/downloader.rb:247:in `block in download'
E, [2024-05-25T07:19:28.397361 #688717] ERROR -- : 	from /tmp/ruby/src/trunk/tool/downloader.rb:378:in `with_retry'
E, [2024-05-25T07:19:28.397373 #688717] ERROR -- : 	from /tmp/ruby/src/trunk/tool/downloader.rb:246:in `download'
E, [2024-05-25T07:19:28.397387 #688717] ERROR -- : 	from /tmp/ruby/src/trunk/tool/downloader.rb:136:in `download'
E, [2024-05-25T07:19:28.397398 #688717] ERROR -- : 	from /tmp/ruby/src/trunk/tool/downloader.rb:482:in `block in <main>'
E, [2024-05-25T07:19:28.397409 #688717] ERROR -- : 	from /tmp/ruby/src/trunk/tool/downloader.rb:465:in `each'
E, [2024-05-25T07:19:28.397420 #688717] ERROR -- : 	from /tmp/ruby/src/trunk/tool/downloader.rb:465:in `<main>'
E, [2024-05-25T07:19:28.401237 #688717] ERROR -- : make: *** [uncommon.mk:1756: /tmp/ruby/src/trunk/enc/unicode/data/emoji/15.0/emoji-sequences.txt] Error 1
E, [2024-05-25T07:19:28.401291 #688717] ERROR -- : make: *** Deleting file '/tmp/ruby/src/trunk/enc/unicode/data/emoji/15.0/emoji-sequences.txt'
E, [2024-05-25T07:19:28.401305 #688717] ERROR -- : make: *** Waiting for unfinished jobs....
E, [2024-05-25T07:19:28.408289 #688717] ERROR -- : /tmp/ruby/src/trunk/tool/downloader.rb:302:in `rescue in download': failed to download emoji/15.0/emoji-test.txt (RuntimeError)
E, [2024-05-25T07:19:28.408359 #688717] ERROR -- : OpenURI::HTTPError: 403 Forbidden: https://www.unicode.org/Public/emoji/15.0/emoji-test.txt
E, [2024-05-25T07:19:28.408375 #688717] ERROR -- : 	from /tmp/ruby/src/trunk/tool/downloader.rb:201:in `download'
E, [2024-05-25T07:19:28.408385 #688717] ERROR -- : 	from /tmp/ruby/src/trunk/tool/downloader.rb:136:in `download'
E, [2024-05-25T07:19:28.408395 #688717] ERROR -- : 	from /tmp/ruby/src/trunk/tool/downloader.rb:482:in `block in <main>'
E, [2024-05-25T07:19:28.408406 #688717] ERROR -- : 	from /tmp/ruby/src/trunk/tool/downloader.rb:465:in `each'
E, [2024-05-25T07:19:28.408422 #688717] ERROR -- : 	from /tmp/ruby/src/trunk/tool/downloader.rb:465:in `<main>'
E, [2024-05-25T07:19:28.408432 #688717] ERROR -- : /usr/lib/ruby/3.0.0/open-uri.rb:364:in `open_http': 403 Forbidden (OpenURI::HTTPError)
E, [2024-05-25T07:19:28.408446 #688717] ERROR -- : 	from /usr/lib/ruby/3.0.0/open-uri.rb:741:in `buffer_open'
E, [2024-05-25T07:19:28.408457 #688717] ERROR -- : 	from /usr/lib/ruby/3.0.0/open-uri.rb:212:in `block in open_loop'
E, [2024-05-25T07:19:28.408467 #688717] ERROR -- : 	from /usr/lib/ruby/3.0.0/open-uri.rb:210:in `catch'
E, [2024-05-25T07:19:28.408477 #688717] ERROR -- : 	from /usr/lib/ruby/3.0.0/open-uri.rb:210:in `open_loop'
E, [2024-05-25T07:19:28.408487 #688717] ERROR -- : 	from /usr/lib/ruby/3.0.0/open-uri.rb:151:in `open_uri'
E, [2024-05-25T07:19:28.408497 #688717] ERROR -- : 	from /usr/lib/ruby/3.0.0/open-uri.rb:721:in `open'
E, [2024-05-25T07:19:28.408507 #688717] ERROR -- : 	from /usr/lib/ruby/3.0.0/open-uri.rb:729:in `read'
E, [2024-05-25T07:19:28.408517 #688717] ERROR -- : 	from /tmp/ruby/src/trunk/tool/downloader.rb:247:in `block in download'
E, [2024-05-25T07:19:28.408530 #688717] ERROR -- : 	from /tmp/ruby/src/trunk/tool/downloader.rb:378:in `with_retry'
E, [2024-05-25T07:19:28.408540 #688717] ERROR -- : 	from /tmp/ruby/src/trunk/tool/downloader.rb:246:in `download'
E, [2024-05-25T07:19:28.408549 #688717] ERROR -- : 	from /tmp/ruby/src/trunk/tool/downloader.rb:136:in `download'
E, [2024-05-25T07:19:28.408559 #688717] ERROR -- : 	from /tmp/ruby/src/trunk/tool/downloader.rb:482:in `block in <main>'
E, [2024-05-25T07:19:28.408570 #688717] ERROR -- : 	from /tmp/ruby/src/trunk/tool/downloader.rb:465:in `each'
E, [2024-05-25T07:19:28.408582 #688717] ERROR -- : 	from /tmp/ruby/src/trunk/tool/downloader.rb:465:in `<main>'
E, [2024-05-25T07:19:28.412184 #688717] ERROR -- : make: *** [uncommon.mk:1756: /tmp/ruby/src/trunk/enc/unicode/data/emoji/15.0/emoji-zwj-sequences.txt] Error 1
E, [2024-05-25T07:19:28.858902 #688717] ERROR -- : /tmp/ruby/src/trunk/tool/downloader.rb:302:in `rescue in download': failed to download emoji/15.0/emoji-sequences.txt (RuntimeError)
E, [2024-05-25T07:19:28.859004 #688717] ERROR -- : EOFError: end of file reached: https://www.unicode.org/Public/emoji/15.0/emoji-sequences.txt
E, [2024-05-25T07:19:28.859040 #688717] ERROR -- : 	from /tmp/ruby/src/trunk/tool/downloader.rb:201:in `download'
E, [2024-05-25T07:19:28.859052 #688717] ERROR -- : 	from /tmp/ruby/src/trunk/tool/downloader.rb:136:in `download'
E, [2024-05-25T07:19:28.859063 #688717] ERROR -- : 	from /tmp/ruby/src/trunk/tool/downloader.rb:482:in `block in <main>'
E, [2024-05-25T07:19:28.859074 #688717] ERROR -- : 	from /tmp/ruby/src/trunk/tool/downloader.rb:465:in `each'
E, [2024-05-25T07:19:28.859085 #688717] ERROR -- : 	from /tmp/ruby/src/trunk/tool/downloader.rb:465:in `<main>'
E, [2024-05-25T07:19:28.859096 #688717] ERROR -- : /usr/lib/ruby/3.0.0/net/protocol.rb:227:in `rbuf_fill': end of file reached (EOFError)
E, [2024-05-25T07:19:28.859110 #688717] ERROR -- : 	from /usr/lib/ruby/3.0.0/net/protocol.rb:193:in `readuntil'
E, [2024-05-25T07:19:28.859121 #688717] ERROR -- : 	from /usr/lib/ruby/3.0.0/net/protocol.rb:203:in `readline'
E, [2024-05-25T07:19:28.859132 #688717] ERROR -- : 	from /usr/lib/ruby/3.0.0/net/http/response.rb:42:in `read_status_line'
E, [2024-05-25T07:19:28.859143 #688717] ERROR -- : 	from /usr/lib/ruby/3.0.0/net/http/response.rb:31:in `read_new'
E, [2024-05-25T07:19:28.859154 #688717] ERROR -- : 	from /usr/lib/ruby/3.0.0/net/http.rb:1557:in `block in transport_request'
E, [2024-05-25T07:19:28.859164 #688717] ERROR -- : 	from /usr/lib/ruby/3.0.0/net/http.rb:1548:in `catch'
E, [2024-05-25T07:19:28.859174 #688717] ERROR -- : 	from /usr/lib/ruby/3.0.0/net/http.rb:1548:in `transport_request'
E, [2024-05-25T07:19:28.859381 #688717] ERROR -- : 	from /usr/lib/ruby/3.0.0/net/http.rb:1521:in `request'
E, [2024-05-25T07:19:28.859392 #688717] ERROR -- : 	from /usr/lib/ruby/3.0.0/open-uri.rb:329:in `block in open_http'
E, [2024-05-25T07:19:28.859403 #688717] ERROR -- : 	from /usr/lib/ruby/3.0.0/net/http.rb:960:in `start'
E, [2024-05-25T07:19:28.859413 #688717] ERROR -- : 	from /usr/lib/ruby/3.0.0/open-uri.rb:323:in `open_http'
E, [2024-05-25T07:19:28.859423 #688717] ERROR -- : 	from /usr/lib/ruby/3.0.0/open-uri.rb:741:in `buffer_open'
E, [2024-05-25T07:19:28.859437 #688717] ERROR -- : 	from /usr/lib/ruby/3.0.0/open-uri.rb:212:in `block in open_loop'
E, [2024-05-25T07:19:28.859448 #688717] ERROR -- : 	from /usr/lib/ruby/3.0.0/open-uri.rb:210:in `catch'
E, [2024-05-25T07:19:28.859459 #688717] ERROR -- : 	from /usr/lib/ruby/3.0.0/open-uri.rb:210:in `open_loop'
E, [2024-05-25T07:19:28.859469 #688717] ERROR -- : 	from /usr/lib/ruby/3.0.0/open-uri.rb:151:in `open_uri'
E, [2024-05-25T07:19:28.859479 #688717] ERROR -- : 	from /usr/lib/ruby/3.0.0/open-uri.rb:721:in `open'
E, [2024-05-25T07:19:28.859490 #688717] ERROR -- : 	from /usr/lib/ruby/3.0.0/open-uri.rb:729:in `read'
E, [2024-05-25T07:19:28.859503 #688717] ERROR -- : 	from /tmp/ruby/src/trunk/tool/downloader.rb:247:in `block in download'
E, [2024-05-25T07:19:28.859513 #688717] ERROR -- : 	from /tmp/ruby/src/trunk/tool/downloader.rb:378:in `with_retry'
E, [2024-05-25T07:19:28.859524 #688717] ERROR -- : 	from /tmp/ruby/src/trunk/tool/downloader.rb:246:in `download'
E, [2024-05-25T07:19:28.859537 #688717] ERROR -- : 	from /tmp/ruby/src/trunk/tool/downloader.rb:136:in `download'
E, [2024-05-25T07:19:28.859548 #688717] ERROR -- : 	from /tmp/ruby/src/trunk/tool/downloader.rb:482:in `block in <main>'
E, [2024-05-25T07:19:28.859559 #688717] ERROR -- : 	from /tmp/ruby/src/trunk/tool/downloader.rb:465:in `each'
E, [2024-05-25T07:19:28.859569 #688717] ERROR -- : 	from /tmp/ruby/src/trunk/tool/downloader.rb:465:in `<main>'
E, [2024-05-25T07:19:28.863311 #688717] ERROR -- : make: *** [uncommon.mk:1756: /tmp/ruby/src/trunk/enc/unicode/data/emoji/15.0/emoji-test.txt] Error 1
I, [2024-05-25T07:19:28.863403 #688717]  INFO -- : downloading emoji/15.0/emoji-test.txt ... 
I, [2024-05-25T07:19:28.863963 #688717]  INFO -- : $$$[end] "make update-unicode  -j20" exit with 512.
I, [2024-05-25T07:19:28.864028 #688717]  INFO -- : $$$[beg] make update-download -j20
I, [2024-05-25T07:19:28.967774 #688717]  INFO -- : tool/config.guess already exists
I, [2024-05-25T07:19:28.967817 #688717]  INFO -- : tool/config.sub already exists
I, [2024-05-25T07:19:28.969937 #688717]  INFO -- : Update power_assert to 84e85124c5014a139af39161d484156cfe87a9ed
I, [2024-05-25T07:19:28.970163 #688717]  INFO -- : Update rbs to ba7872795d5de04adb8ff500c0e6afdc81a041dd
I, [2024-05-25T07:19:28.970789 #688717]  INFO -- : Update typeprof to b19a6416da3a05d57fadd6ffdadb382b6d236ca5
I, [2024-05-25T07:19:28.971307 #688717]  INFO -- : echo 84e85124c5014a139af39161d484156cfe87a9ed | /bin/sh /tmp/ruby/src/trunk/tool/ifchange /tmp/ruby/src/trunk/.bundle/.timestamp/power_assert.revision -
I, [2024-05-25T07:19:28.971362 #688717]  INFO -- : echo ba7872795d5de04adb8ff500c0e6afdc81a041dd | /bin/sh /tmp/ruby/src/trunk/tool/ifchange /tmp/ruby/src/trunk/.bundle/.timestamp/rbs.revision -
I, [2024-05-25T07:19:28.971838 #688717]  INFO -- : echo b19a6416da3a05d57fadd6ffdadb382b6d236ca5 | /bin/sh /tmp/ruby/src/trunk/tool/ifchange /tmp/ruby/src/trunk/.bundle/.timestamp/typeprof.revision -
I, [2024-05-25T07:19:28.973298 #688717]  INFO -- : /tmp/ruby/src/trunk/.bundle/.timestamp/rbs.revision unchanged
I, [2024-05-25T07:19:28.973527 #688717]  INFO -- : /tmp/ruby/src/trunk/.bundle/.timestamp/power_assert.revision unchanged
I, [2024-05-25T07:19:28.973688 #688717]  INFO -- : /tmp/ruby/src/trunk/.bundle/.timestamp/typeprof.revision unchanged
I, [2024-05-25T07:19:28.974595 #688717]  INFO -- : Building power_assert@84e85124c5014a139af39161d484156cfe87a9ed to /tmp/ruby/src/trunk/gems/power_assert-2.0.3.gem
I, [2024-05-25T07:19:29.043363 #688717]  INFO -- :   Successfully built RubyGem
I, [2024-05-25T07:19:29.043403 #688717]  INFO -- :   Name: power_assert
I, [2024-05-25T07:19:29.043408 #688717]  INFO -- :   Version: 2.0.4dev
I, [2024-05-25T07:19:29.043412 #688717]  INFO -- :   File: power_assert-2.0.4dev.gem
I, [2024-05-25T07:19:29.088775 #688717]  INFO -- : $$$[end] "make update-download -j20" exit with 0.
I, [2024-05-25T07:19:29.088822 #688717]  INFO -- : $$$[beg] make update-rubyspec -j20
I, [2024-05-25T07:19:29.146658 #688717]  INFO -- : make: Nothing to be done for 'update-rubyspec'.
I, [2024-05-25T07:19:29.146771 #688717]  INFO -- : $$$[end] "make update-rubyspec -j20" exit with 0.
I, [2024-05-25T07:19:29.146806 #688717]  INFO -- : $$$[beg] make update-src      -j20
I, [2024-05-25T07:19:29.757617 #688717]  INFO -- : Already up to date.
I, [2024-05-25T07:19:29.775476 #688717]  INFO -- : Latest commit hash = 4d0c5486a2
I, [2024-05-25T07:19:29.776785 #688717]  INFO -- : $$$[end] "make update-src      -j20" exit with 0.
I, [2024-05-25T07:19:29.776820 #688717]  INFO -- : $$$[beg] make after-update    -j20
I, [2024-05-25T07:19:29.849406 #688717]  INFO -- : generating /tmp/ruby/src/trunk/ext/ripper/eventids2table.c
I, [2024-05-25T07:19:29.853692 #688717]  INFO -- : make[1]: Entering directory '/tmp/ruby/src/trunk/ext/ripper'
I, [2024-05-25T07:19:29.853717 #688717]  INFO -- : make[1]: Nothing to be done for 'src'.
I, [2024-05-25T07:19:29.853725 #688717]  INFO -- : make[1]: Leaving directory '/tmp/ruby/src/trunk/ext/ripper'
I, [2024-05-25T07:19:29.870735 #688717]  INFO -- : /tmp/ruby/src/trunk/revision.h updated
I, [2024-05-25T07:19:29.872245 #688717]  INFO -- : generating x86_64-linux-fake.rb
I, [2024-05-25T07:19:29.923074 #688717]  INFO -- : x86_64-linux-fake.rb updated
I, [2024-05-25T07:19:29.924497 #688717]  INFO -- : generating enc.mk
I, [2024-05-25T07:19:30.041578 #688717]  INFO -- : making srcs under enc
I, [2024-05-25T07:19:30.071376 #688717]  INFO -- : make[1]: Entering directory '/tmp/ruby/build/trunk'
I, [2024-05-25T07:19:30.071399 #688717]  INFO -- : make[1]: Nothing to be done for 'srcs'.
I, [2024-05-25T07:19:30.071404 #688717]  INFO -- : make[1]: Leaving directory '/tmp/ruby/build/trunk'
I, [2024-05-25T07:19:30.115711 #688717]  INFO -- : Update power_assert to 84e85124c5014a139af39161d484156cfe87a9ed
I, [2024-05-25T07:19:30.115887 #688717]  INFO -- : Update rbs to ba7872795d5de04adb8ff500c0e6afdc81a041dd
I, [2024-05-25T07:19:30.116074 #688717]  INFO -- : Update typeprof to b19a6416da3a05d57fadd6ffdadb382b6d236ca5
I, [2024-05-25T07:19:30.117875 #688717]  INFO -- : echo 84e85124c5014a139af39161d484156cfe87a9ed | /bin/sh /tmp/ruby/src/trunk/tool/ifchange /tmp/ruby/src/trunk/.bundle/.timestamp/power_assert.revision -
I, [2024-05-25T07:19:30.118083 #688717]  INFO -- : echo ba7872795d5de04adb8ff500c0e6afdc81a041dd | /bin/sh /tmp/ruby/src/trunk/tool/ifchange /tmp/ruby/src/trunk/.bundle/.timestamp/rbs.revision -
I, [2024-05-25T07:19:30.118369 #688717]  INFO -- : echo b19a6416da3a05d57fadd6ffdadb382b6d236ca5 | /bin/sh /tmp/ruby/src/trunk/tool/ifchange /tmp/ruby/src/trunk/.bundle/.timestamp/typeprof.revision -
I, [2024-05-25T07:19:30.119630 #688717]  INFO -- : /tmp/ruby/src/trunk/.bundle/.timestamp/power_assert.revision unchanged
I, [2024-05-25T07:19:30.119900 #688717]  INFO -- : /tmp/ruby/src/trunk/.bundle/.timestamp/rbs.revision unchanged
I, [2024-05-25T07:19:30.120169 #688717]  INFO -- : /tmp/ruby/src/trunk/.bundle/.timestamp/typeprof.revision unchanged
I, [2024-05-25T07:19:30.120948 #688717]  INFO -- : Building power_assert@84e85124c5014a139af39161d484156cfe87a9ed to /tmp/ruby/src/trunk/gems/power_assert-2.0.3.gem
I, [2024-05-25T07:19:30.189630 #688717]  INFO -- :   Successfully built RubyGem
I, [2024-05-25T07:19:30.189671 #688717]  INFO -- :   Name: power_assert
I, [2024-05-25T07:19:30.189676 #688717]  INFO -- :   Version: 2.0.4dev
I, [2024-05-25T07:19:30.189679 #688717]  INFO -- :   File: power_assert-2.0.4dev.gem
I, [2024-05-25T07:19:30.192194 #688717]  INFO -- : Extracting bundle gem power_assert-2.0.3...
I, [2024-05-25T07:19:30.252838 #688717]  INFO -- : Try with hash version of bundled gems instead of gems/power_assert-2.0.3.gem. We don't use this gem with release version of Ruby.
I, [2024-05-25T07:19:30.257783 #688717]  INFO -- : Unpacked gems/power_assert-2.0.4dev.gem
I, [2024-05-25T07:19:30.260031 #688717]  INFO -- : $$$[end] "make after-update    -j20" exit with 0.
I, [2024-05-25T07:19:30.260185 #688717]  INFO -- : $$$[beg] make miniruby -j20
I, [2024-05-25T07:19:30.317309 #688717]  INFO -- : 	BASERUBY = /usr/bin/ruby --disable=gems
I, [2024-05-25T07:19:30.317337 #688717]  INFO -- : 	CC = gcc
I, [2024-05-25T07:19:30.317343 #688717]  INFO -- : 	LD = ld
I, [2024-05-25T07:19:30.317346 #688717]  INFO -- : 	LDSHARED = gcc -shared
I, [2024-05-25T07:19:30.317350 #688717]  INFO -- : 	CFLAGS = -O3 -fno-fast-math -ggdb3 -Wall -Wextra -Wdeprecated-declarations -Wdiv-by-zero -Wduplicated-cond -Wimplicit-function-declaration -Wimplicit-int -Wpointer-arith -Wwrite-strings -Wold-style-definition -Wimplicit-fallthrough=0 -Wmissing-noreturn -Wno-cast-function-type -Wno-constant-logical-operand -Wno-long-long -Wno-missing-field-initializers -Wno-overlength-strings -Wno-packed-bitfield-compat -Wno-parentheses-equality -Wno-self-assign -Wno-tautological-compare -Wno-unused-parameter -Wno-unused-value -Wsuggest-attribute=format -Wsuggest-attribute=noreturn -Wunused-variable -Wmisleading-indentation -Wundef   -fPIC 
I, [2024-05-25T07:19:30.317355 #688717]  INFO -- : 	XCFLAGS = -U_FORTIFY_SOURCE -D_FORTIFY_SOURCE=2 -fstack-protector-strong -fno-strict-overflow -fvisibility=hidden -fexcess-precision=standard -DRUBY_EXPORT -I. -I.ext/include/x86_64-linux -I/tmp/ruby/src/trunk/include -I/tmp/ruby/src/trunk -I/tmp/ruby/src/trunk/prism -I/tmp/ruby/src/trunk/enc/unicode/15.0.0  
I, [2024-05-25T07:19:30.317359 #688717]  INFO -- : 	CPPFLAGS =   
I, [2024-05-25T07:19:30.317362 #688717]  INFO -- : 	DLDFLAGS = -Wl,--compress-debug-sections=zlib -Wl,-soname,libruby.so.3.4  -fstack-protector-strong  
I, [2024-05-25T07:19:30.317366 #688717]  INFO -- : 	SOLIBS = -lz -lrt -lrt -lgmp -ldl -lcrypt -lm -lpthread 
I, [2024-05-25T07:19:30.317370 #688717]  INFO -- : 	LANG = en_US.UTF-8
I, [2024-05-25T07:19:30.317375 #688717]  INFO -- : 	LC_ALL = 
I, [2024-05-25T07:19:30.317378 #688717]  INFO -- : 	LC_CTYPE = 
I, [2024-05-25T07:19:30.317382 #688717]  INFO -- : 	MFLAGS = -j20 --jobserver-auth=4,5
I, [2024-05-25T07:19:30.317385 #688717]  INFO -- : 	RUSTC = no
I, [2024-05-25T07:19:30.317389 #688717]  INFO -- : 	YJIT_RUSTC_ARGS = --crate-name=yjit --crate-type=staticlib --edition=2021 -g -C lto=thin -C opt-level=3 -C overflow-checks=on '--out-dir=/tmp/ruby/build/trunk/yjit/target/release/' /tmp/ruby/src/trunk/yjit/src/lib.rs
I, [2024-05-25T07:19:30.318730 #688717]  INFO -- : gcc (Ubuntu 11.4.0-1ubuntu1~22.04) 11.4.0
I, [2024-05-25T07:19:30.318750 #688717]  INFO -- : Copyright (C) 2021 Free Software Foundation, Inc.
I, [2024-05-25T07:19:30.318756 #688717]  INFO -- : This is free software; see the source for copying conditions.  There is NO
I, [2024-05-25T07:19:30.318763 #688717]  INFO -- : warranty; not even for MERCHANTABILITY or FITNESS FOR A PARTICULAR PURPOSE.
I, [2024-05-25T07:19:30.318767 #688717]  INFO -- : 
I, [2024-05-25T07:19:30.344778 #688717]  INFO -- : compiling /tmp/ruby/src/trunk/version.c
I, [2024-05-25T07:19:30.447668 #688717]  INFO -- : linking miniruby
I, [2024-05-25T07:19:30.977135 #688717]  INFO -- : $$$[end] "make miniruby -j20" exit with 0.
I, [2024-05-25T07:19:30.977251 #688717]  INFO -- : $$$[beg] make ruby -j20
I, [2024-05-25T07:19:31.035251 #688717]  INFO -- : 	BASERUBY = /usr/bin/ruby --disable=gems
I, [2024-05-25T07:19:31.035282 #688717]  INFO -- : 	CC = gcc
I, [2024-05-25T07:19:31.035288 #688717]  INFO -- : 	LD = ld
I, [2024-05-25T07:19:31.035296 #688717]  INFO -- : 	LDSHARED = gcc -shared
I, [2024-05-25T07:19:31.035301 #688717]  INFO -- : 	CFLAGS = -O3 -fno-fast-math -ggdb3 -Wall -Wextra -Wdeprecated-declarations -Wdiv-by-zero -Wduplicated-cond -Wimplicit-function-declaration -Wimplicit-int -Wpointer-arith -Wwrite-strings -Wold-style-definition -Wimplicit-fallthrough=0 -Wmissing-noreturn -Wno-cast-function-type -Wno-constant-logical-operand -Wno-long-long -Wno-missing-field-initializers -Wno-overlength-strings -Wno-packed-bitfield-compat -Wno-parentheses-equality -Wno-self-assign -Wno-tautological-compare -Wno-unused-parameter -Wno-unused-value -Wsuggest-attribute=format -Wsuggest-attribute=noreturn -Wunused-variable -Wmisleading-indentation -Wundef   -fPIC 
I, [2024-05-25T07:19:31.035306 #688717]  INFO -- : 	XCFLAGS = -U_FORTIFY_SOURCE -D_FORTIFY_SOURCE=2 -fstack-protector-strong -fno-strict-overflow -fvisibility=hidden -fexcess-precision=standard -DRUBY_EXPORT -I. -I.ext/include/x86_64-linux -I/tmp/ruby/src/trunk/include -I/tmp/ruby/src/trunk -I/tmp/ruby/src/trunk/prism -I/tmp/ruby/src/trunk/enc/unicode/15.0.0  
I, [2024-05-25T07:19:31.035310 #688717]  INFO -- : 	CPPFLAGS =   
I, [2024-05-25T07:19:31.035315 #688717]  INFO -- : 	DLDFLAGS = -Wl,--compress-debug-sections=zlib -Wl,-soname,libruby.so.3.4  -fstack-protector-strong  
I, [2024-05-25T07:19:31.035319 #688717]  INFO -- : 	SOLIBS = -lz -lrt -lrt -lgmp -ldl -lcrypt -lm -lpthread 
I, [2024-05-25T07:19:31.035323 #688717]  INFO -- : 	LANG = en_US.UTF-8
I, [2024-05-25T07:19:31.035327 #688717]  INFO -- : 	LC_ALL = 
I, [2024-05-25T07:19:31.035331 #688717]  INFO -- : 	LC_CTYPE = 
I, [2024-05-25T07:19:31.035335 #688717]  INFO -- : 	MFLAGS = -j20 --jobserver-auth=4,5
I, [2024-05-25T07:19:31.035339 #688717]  INFO -- : 	RUSTC = no
I, [2024-05-25T07:19:31.035344 #688717]  INFO -- : 	YJIT_RUSTC_ARGS = --crate-name=yjit --crate-type=staticlib --edition=2021 -g -C lto=thin -C opt-level=3 -C overflow-checks=on '--out-dir=/tmp/ruby/build/trunk/yjit/target/release/' /tmp/ruby/src/trunk/yjit/src/lib.rs
I, [2024-05-25T07:19:31.036767 #688717]  INFO -- : gcc (Ubuntu 11.4.0-1ubuntu1~22.04) 11.4.0
I, [2024-05-25T07:19:31.036792 #688717]  INFO -- : Copyright (C) 2021 Free Software Foundation, Inc.
I, [2024-05-25T07:19:31.036799 #688717]  INFO -- : This is free software; see the source for copying conditions.  There is NO
I, [2024-05-25T07:19:31.036803 #688717]  INFO -- : warranty; not even for MERCHANTABILITY or FITNESS FOR A PARTICULAR PURPOSE.
I, [2024-05-25T07:19:31.036808 #688717]  INFO -- : 
I, [2024-05-25T07:19:31.150226 #688717]  INFO -- : builtin_binary.inc updated
I, [2024-05-25T07:19:31.154856 #688717]  INFO -- : c86294a81d0df6836359a6b5498b71b1ddba3062aa6ec87c7b2896368a948a19  builtin_binary.inc
I, [2024-05-25T07:19:31.155669 #688717]  INFO -- : compiling /tmp/ruby/src/trunk/builtin.c
I, [2024-05-25T07:19:31.339103 #688717]  INFO -- : linking static-library libruby-static.a
I, [2024-05-25T07:19:31.654672 #688717]  INFO -- : linking shared-library libruby.so.3.4.0
I, [2024-05-25T07:19:33.214703 #688717]  INFO -- : linking ruby
I, [2024-05-25T07:19:33.236783 #688717]  INFO -- : $$$[end] "make ruby -j20" exit with 0.
I, [2024-05-25T07:19:33.236903 #688717]  INFO -- : $$$[beg] make all -j20
I, [2024-05-25T07:19:33.297498 #688717]  INFO -- : 	BASERUBY = /usr/bin/ruby --disable=gems
I, [2024-05-25T07:19:33.297532 #688717]  INFO -- : 	CC = gcc
I, [2024-05-25T07:19:33.297538 #688717]  INFO -- : 	LD = ld
I, [2024-05-25T07:19:33.297543 #688717]  INFO -- : 	LDSHARED = gcc -shared
I, [2024-05-25T07:19:33.297547 #688717]  INFO -- : 	CFLAGS = -O3 -fno-fast-math -ggdb3 -Wall -Wextra -Wdeprecated-declarations -Wdiv-by-zero -Wduplicated-cond -Wimplicit-function-declaration -Wimplicit-int -Wpointer-arith -Wwrite-strings -Wold-style-definition -Wimplicit-fallthrough=0 -Wmissing-noreturn -Wno-cast-function-type -Wno-constant-logical-operand -Wno-long-long -Wno-missing-field-initializers -Wno-overlength-strings -Wno-packed-bitfield-compat -Wno-parentheses-equality -Wno-self-assign -Wno-tautological-compare -Wno-unused-parameter -Wno-unused-value -Wsuggest-attribute=format -Wsuggest-attribute=noreturn -Wunused-variable -Wmisleading-indentation -Wundef   -fPIC 
I, [2024-05-25T07:19:33.297552 #688717]  INFO -- : 	XCFLAGS = -U_FORTIFY_SOURCE -D_FORTIFY_SOURCE=2 -fstack-protector-strong -fno-strict-overflow -fvisibility=hidden -fexcess-precision=standard -DRUBY_EXPORT -I. -I.ext/include/x86_64-linux -I/tmp/ruby/src/trunk/include -I/tmp/ruby/src/trunk -I/tmp/ruby/src/trunk/prism -I/tmp/ruby/src/trunk/enc/unicode/15.0.0  
I, [2024-05-25T07:19:33.297556 #688717]  INFO -- : 	CPPFLAGS =   
I, [2024-05-25T07:19:33.297561 #688717]  INFO -- : 	DLDFLAGS = -Wl,--compress-debug-sections=zlib -Wl,-soname,libruby.so.3.4  -fstack-protector-strong  
I, [2024-05-25T07:19:33.297565 #688717]  INFO -- : 	SOLIBS = -lz -lrt -lrt -lgmp -ldl -lcrypt -lm -lpthread 
I, [2024-05-25T07:19:33.297569 #688717]  INFO -- : 	LANG = en_US.UTF-8
I, [2024-05-25T07:19:33.297573 #688717]  INFO -- : 	LC_ALL = 
I, [2024-05-25T07:19:33.297577 #688717]  INFO -- : 	LC_CTYPE = 
I, [2024-05-25T07:19:33.297581 #688717]  INFO -- : 	MFLAGS = -j20 --jobserver-auth=4,5
I, [2024-05-25T07:19:33.297585 #688717]  INFO -- : 	RUSTC = no
I, [2024-05-25T07:19:33.297590 #688717]  INFO -- : 	YJIT_RUSTC_ARGS = --crate-name=yjit --crate-type=staticlib --edition=2021 -g -C lto=thin -C opt-level=3 -C overflow-checks=on '--out-dir=/tmp/ruby/build/trunk/yjit/target/release/' /tmp/ruby/src/trunk/yjit/src/lib.rs
I, [2024-05-25T07:19:33.299147 #688717]  INFO -- : gcc (Ubuntu 11.4.0-1ubuntu1~22.04) 11.4.0
I, [2024-05-25T07:19:33.299172 #688717]  INFO -- : Copyright (C) 2021 Free Software Foundation, Inc.
I, [2024-05-25T07:19:33.299184 #688717]  INFO -- : This is free software; see the source for copying conditions.  There is NO
I, [2024-05-25T07:19:33.299189 #688717]  INFO -- : warranty; not even for MERCHANTABILITY or FITNESS FOR A PARTICULAR PURPOSE.
I, [2024-05-25T07:19:33.299193 #688717]  INFO -- : 
I, [2024-05-25T07:19:33.330655 #688717]  INFO -- : generating encdb.h
I, [2024-05-25T07:19:33.332007 #688717]  INFO -- : generating enc.mk
I, [2024-05-25T07:19:33.333867 #688717]  INFO -- : building spec/ruby/optional/capi/ext/array_spec.so
I, [2024-05-25T07:19:33.334150 #688717]  INFO -- : building spec/ruby/optional/capi/ext/basic_object_spec.so
I, [2024-05-25T07:19:33.334980 #688717]  INFO -- : building spec/ruby/optional/capi/ext/bignum_spec.so
I, [2024-05-25T07:19:33.335667 #688717]  INFO -- : building spec/ruby/optional/capi/ext/binding_spec.so
I, [2024-05-25T07:19:33.335724 #688717]  INFO -- : building spec/ruby/optional/capi/ext/boolean_spec.so
I, [2024-05-25T07:19:33.336581 #688717]  INFO -- : building spec/ruby/optional/capi/ext/class_id_under_autoload_spec.so
I, [2024-05-25T07:19:33.337863 #688717]  INFO -- : building spec/ruby/optional/capi/ext/class_spec.so
I, [2024-05-25T07:19:33.338478 #688717]  INFO -- : building spec/ruby/optional/capi/ext/class_under_autoload_spec.so
I, [2024-05-25T07:19:33.338881 #688717]  INFO -- : building spec/ruby/optional/capi/ext/complex_spec.so
I, [2024-05-25T07:19:33.339508 #688717]  INFO -- : building spec/ruby/optional/capi/ext/constants_spec.so
I, [2024-05-25T07:19:33.339834 #688717]  INFO -- : building spec/ruby/optional/capi/ext/data_spec.so
I, [2024-05-25T07:19:33.340640 #688717]  INFO -- : building spec/ruby/optional/capi/ext/debug_spec.so
I, [2024-05-25T07:19:33.341544 #688717]  INFO -- : building spec/ruby/optional/capi/ext/encoding_spec.so
I, [2024-05-25T07:19:33.341844 #688717]  INFO -- : building spec/ruby/optional/capi/ext/enumerator_spec.so
I, [2024-05-25T07:19:33.342506 #688717]  INFO -- : building spec/ruby/optional/capi/ext/exception_spec.so
I, [2024-05-25T07:19:33.342769 #688717]  INFO -- : building spec/ruby/optional/capi/ext/fiber_spec.so
I, [2024-05-25T07:19:33.343466 #688717]  INFO -- : building spec/ruby/optional/capi/ext/file_spec.so
I, [2024-05-25T07:19:33.356219 #688717]  INFO -- : building spec/ruby/optional/capi/ext/fixnum_spec.so
I, [2024-05-25T07:19:33.365024 #688717]  INFO -- : encdb.h unchanged
I, [2024-05-25T07:19:33.380200 #688717]  INFO -- : building spec/ruby/optional/capi/ext/float_spec.so
I, [2024-05-25T07:19:33.468998 #688717]  INFO -- : building spec/ruby/optional/capi/ext/gc_spec.so
I, [2024-05-25T07:19:33.475934 #688717]  INFO -- : building spec/ruby/optional/capi/ext/globals_spec.so
I, [2024-05-25T07:19:33.476740 #688717]  INFO -- : building spec/ruby/optional/capi/ext/hash_spec.so
I, [2024-05-25T07:19:33.478964 #688717]  INFO -- : building spec/ruby/optional/capi/ext/integer_spec.so
I, [2024-05-25T07:19:33.485548 #688717]  INFO -- : building spec/ruby/optional/capi/ext/io_spec.so
I, [2024-05-25T07:19:33.490873 #688717]  INFO -- : building spec/ruby/optional/capi/ext/kernel_spec.so
I, [2024-05-25T07:19:33.499340 #688717]  INFO -- : building spec/ruby/optional/capi/ext/language_spec.so
I, [2024-05-25T07:19:33.509032 #688717]  INFO -- : building spec/ruby/optional/capi/ext/marshal_spec.so
I, [2024-05-25T07:19:33.510499 #688717]  INFO -- : building spec/ruby/optional/capi/ext/module_spec.so
I, [2024-05-25T07:19:33.514504 #688717]  INFO -- : building spec/ruby/optional/capi/ext/module_under_autoload_spec.so
I, [2024-05-25T07:19:33.521170 #688717]  INFO -- : building spec/ruby/optional/capi/ext/mutex_spec.so
I, [2024-05-25T07:19:33.525508 #688717]  INFO -- : building spec/ruby/optional/capi/ext/numeric_spec.so
I, [2024-05-25T07:19:33.528478 #688717]  INFO -- : building spec/ruby/optional/capi/ext/object_spec.so
I, [2024-05-25T07:19:33.534298 #688717]  INFO -- : building spec/ruby/optional/capi/ext/proc_spec.so
I, [2024-05-25T07:19:33.535244 #688717]  INFO -- : building spec/ruby/optional/capi/ext/range_spec.so
I, [2024-05-25T07:19:33.545636 #688717]  INFO -- : building spec/ruby/optional/capi/ext/rational_spec.so
I, [2024-05-25T07:19:33.583466 #688717]  INFO -- : building spec/ruby/optional/capi/ext/rbasic_spec.so
I, [2024-05-25T07:19:33.595036 #688717]  INFO -- : building spec/ruby/optional/capi/ext/regexp_spec.so
I, [2024-05-25T07:19:33.639165 #688717]  INFO -- : building spec/ruby/optional/capi/ext/string_spec.so
I, [2024-05-25T07:19:33.641856 #688717]  INFO -- : building spec/ruby/optional/capi/ext/st_spec.so
I, [2024-05-25T07:19:33.641922 #688717]  INFO -- : building spec/ruby/optional/capi/ext/struct_spec.so
I, [2024-05-25T07:19:33.660767 #688717]  INFO -- : building spec/ruby/optional/capi/ext/symbol_spec.so
I, [2024-05-25T07:19:33.664896 #688717]  INFO -- : building spec/ruby/optional/capi/ext/thread_spec.so
I, [2024-05-25T07:19:33.669716 #688717]  INFO -- : building spec/ruby/optional/capi/ext/time_spec.so
I, [2024-05-25T07:19:33.671655 #688717]  INFO -- : building spec/ruby/optional/capi/ext/tracepoint_spec.so
I, [2024-05-25T07:19:33.676623 #688717]  INFO -- : building spec/ruby/optional/capi/ext/typed_data_spec.so
I, [2024-05-25T07:19:33.682609 #688717]  INFO -- : building spec/ruby/optional/capi/ext/util_spec.so
I, [2024-05-25T07:19:33.697417 #688717]  INFO -- : making enc
I, [2024-05-25T07:19:33.706312 #688717]  INFO -- : making srcs under enc
I, [2024-05-25T07:19:33.721542 #688717]  INFO -- : make[1]: Entering directory '/tmp/ruby/build/trunk'
I, [2024-05-25T07:19:33.721614 #688717]  INFO -- : make[1]: Nothing to be done for 'enc'.
I, [2024-05-25T07:19:33.721638 #688717]  INFO -- : make[1]: Leaving directory '/tmp/ruby/build/trunk'
I, [2024-05-25T07:19:33.753843 #688717]  INFO -- : make[1]: Entering directory '/tmp/ruby/build/trunk'
I, [2024-05-25T07:19:33.753905 #688717]  INFO -- : make[1]: Nothing to be done for 'srcs'.
I, [2024-05-25T07:19:33.753914 #688717]  INFO -- : make[1]: Leaving directory '/tmp/ruby/build/trunk'
I, [2024-05-25T07:19:33.754744 #688717]  INFO -- : generating transdb.h
I, [2024-05-25T07:19:33.852273 #688717]  INFO -- : transdb.h unchanged
I, [2024-05-25T07:19:33.853469 #688717]  INFO -- : generating makefiles ext/configure-ext.mk
I, [2024-05-25T07:19:33.853641 #688717]  INFO -- : making trans
I, [2024-05-25T07:19:33.880362 #688717]  INFO -- : ext/configure-ext.mk updated
I, [2024-05-25T07:19:33.883059 #688717]  INFO -- : make[1]: Entering directory '/tmp/ruby/build/trunk'
I, [2024-05-25T07:19:33.889709 #688717]  INFO -- : make[1]: Entering directory '/tmp/ruby/build/trunk'
I, [2024-05-25T07:19:33.889807 #688717]  INFO -- : make[1]: Nothing to be done for 'trans'.
I, [2024-05-25T07:19:33.889820 #688717]  INFO -- : make[1]: Leaving directory '/tmp/ruby/build/trunk'
I, [2024-05-25T07:19:33.980327 #688717]  INFO -- : making encs
I, [2024-05-25T07:19:34.026987 #688717]  INFO -- : make[1]: Entering directory '/tmp/ruby/build/trunk'
I, [2024-05-25T07:19:34.027043 #688717]  INFO -- : make[1]: Nothing to be done for 'encs'.
I, [2024-05-25T07:19:34.027052 #688717]  INFO -- : make[1]: Leaving directory '/tmp/ruby/build/trunk'
I, [2024-05-25T07:19:34.041466 #688717]  INFO -- : make[1]: Leaving directory '/tmp/ruby/build/trunk'
I, [2024-05-25T07:19:34.041521 #688717]  INFO -- : generating makefile exts.mk
I, [2024-05-25T07:19:34.078971 #688717]  INFO -- : exts.mk unchanged
I, [2024-05-25T07:19:34.084677 #688717]  INFO -- : make[1]: Entering directory '/tmp/ruby/build/trunk'
I, [2024-05-25T07:19:34.104455 #688717]  INFO -- : make[2]: Entering directory '/tmp/ruby/build/trunk/ext/digest'
I, [2024-05-25T07:19:34.105567 #688717]  INFO -- : make[2]: Entering directory '/tmp/ruby/build/trunk/ext/coverage'
I, [2024-05-25T07:19:34.106004 #688717]  INFO -- : make[2]: Entering directory '/tmp/ruby/build/trunk/ext/date'
I, [2024-05-25T07:19:34.106025 #688717]  INFO -- : make[2]: Entering directory '/tmp/ruby/build/trunk/ext/json'
I, [2024-05-25T07:19:34.106754 #688717]  INFO -- : make[2]: Entering directory '/tmp/ruby/build/trunk/ext/monitor'
I, [2024-05-25T07:19:34.106809 #688717]  INFO -- : make[2]: Entering directory '/tmp/ruby/build/trunk/ext/io/console'
I, [2024-05-25T07:19:34.108565 #688717]  INFO -- : make[2]: Leaving directory '/tmp/ruby/build/trunk/ext/date'
I, [2024-05-25T07:19:34.108752 #688717]  INFO -- : make[2]: Leaving directory '/tmp/ruby/build/trunk/ext/coverage'
I, [2024-05-25T07:19:34.108837 #688717]  INFO -- : make[2]: Entering directory '/tmp/ruby/build/trunk/ext/fiddle'
I, [2024-05-25T07:19:34.109297 #688717]  INFO -- : make[2]: Leaving directory '/tmp/ruby/build/trunk/ext/monitor'
I, [2024-05-25T07:19:34.109498 #688717]  INFO -- : make[2]: Entering directory '/tmp/ruby/build/trunk/ext/objspace'
I, [2024-05-25T07:19:34.109517 #688717]  INFO -- : make[2]: Leaving directory '/tmp/ruby/build/trunk/ext/io/console'
I, [2024-05-25T07:19:34.109522 #688717]  INFO -- : make[2]: Entering directory '/tmp/ruby/build/trunk/ext/rubyvm'
I, [2024-05-25T07:19:34.109638 #688717]  INFO -- : make[2]: Leaving directory '/tmp/ruby/build/trunk/ext/digest'
I, [2024-05-25T07:19:34.110374 #688717]  INFO -- : make[2]: Entering directory '/tmp/ruby/build/trunk/ext/pathname'
I, [2024-05-25T07:19:34.110808 #688717]  INFO -- : make[2]: Entering directory '/tmp/ruby/build/trunk/ext/pty'
I, [2024-05-25T07:19:34.111209 #688717]  INFO -- : make[2]: Leaving directory '/tmp/ruby/build/trunk/ext/json'
I, [2024-05-25T07:19:34.111415 #688717]  INFO -- : make[2]: Entering directory '/tmp/ruby/build/trunk/ext/psych'
I, [2024-05-25T07:19:34.111515 #688717]  INFO -- : make[2]: Leaving directory '/tmp/ruby/build/trunk/ext/rubyvm'
I, [2024-05-25T07:19:34.112722 #688717]  INFO -- : make[2]: Leaving directory '/tmp/ruby/build/trunk/ext/pty'
I, [2024-05-25T07:19:34.113093 #688717]  INFO -- : make[2]: Leaving directory '/tmp/ruby/build/trunk/ext/pathname'
I, [2024-05-25T07:19:34.113591 #688717]  INFO -- : make[2]: Leaving directory '/tmp/ruby/build/trunk/ext/objspace'
I, [2024-05-25T07:19:34.113882 #688717]  INFO -- : make[2]: Entering directory '/tmp/ruby/build/trunk/.bundle/gems/bigdecimal-3.1.8/ext/bigdecimal'
I, [2024-05-25T07:19:34.114552 #688717]  INFO -- : make[2]: Entering directory '/tmp/ruby/build/trunk/.bundle/gems/debug-1.9.2/ext/debug'
I, [2024-05-25T07:19:34.114631 #688717]  INFO -- : make[2]: Entering directory '/tmp/ruby/build/trunk/.bundle/gems/nkf-0.2.0/ext/nkf'
I, [2024-05-25T07:19:34.114763 #688717]  INFO -- : make[2]: Entering directory '/tmp/ruby/build/trunk/.bundle/gems/racc-1.8.0/ext/racc/cparse'
I, [2024-05-25T07:19:34.114789 #688717]  INFO -- : make[2]: Entering directory '/tmp/ruby/build/trunk/.bundle/gems/syslog-0.1.2/ext/syslog'
I, [2024-05-25T07:19:34.114864 #688717]  INFO -- : make[2]: Entering directory '/tmp/ruby/build/trunk/.bundle/gems/racc-1.7.3/ext/racc/cparse'
I, [2024-05-25T07:19:34.114993 #688717]  INFO -- : make[2]: Entering directory '/tmp/ruby/build/trunk/ext/ripper'
I, [2024-05-25T07:19:34.115403 #688717]  INFO -- : make[2]: Entering directory '/tmp/ruby/build/trunk/.bundle/gems/rbs-3.4.4/ext/rbs_extension'
I, [2024-05-25T07:19:34.115543 #688717]  INFO -- : make[2]: Leaving directory '/tmp/ruby/build/trunk/ext/fiddle'
I, [2024-05-25T07:19:34.117989 #688717]  INFO -- : make[2]: Entering directory '/tmp/ruby/build/trunk/ext/digest/sha2'
I, [2024-05-25T07:19:34.118129 #688717]  INFO -- : make[2]: Entering directory '/tmp/ruby/build/trunk/ext/socket'
I, [2024-05-25T07:19:34.121266 #688717]  INFO -- : make[2]: Leaving directory '/tmp/ruby/build/trunk/ext/digest/sha2'
I, [2024-05-25T07:19:34.121567 #688717]  INFO -- : make[2]: Leaving directory '/tmp/ruby/build/trunk/ext/psych'
I, [2024-05-25T07:19:34.122496 #688717]  INFO -- : make[2]: Leaving directory '/tmp/ruby/build/trunk/ext/ripper'
I, [2024-05-25T07:19:34.123082 #688717]  INFO -- : make[2]: Entering directory '/tmp/ruby/build/trunk/ext/openssl'
I, [2024-05-25T07:19:34.126846 #688717]  INFO -- : make[2]: Leaving directory '/tmp/ruby/build/trunk/ext/socket'
I, [2024-05-25T07:19:34.134475 #688717]  INFO -- : make[2]: Leaving directory '/tmp/ruby/build/trunk/ext/openssl'
I, [2024-05-25T07:19:34.138180 #688717]  INFO -- : make[2]: Leaving directory '/tmp/ruby/build/trunk/.bundle/gems/syslog-0.1.2/ext/syslog'
I, [2024-05-25T07:19:34.138225 #688717]  INFO -- : make[2]: Leaving directory '/tmp/ruby/build/trunk/.bundle/gems/bigdecimal-3.1.8/ext/bigdecimal'
I, [2024-05-25T07:19:34.138627 #688717]  INFO -- : make[2]: Leaving directory '/tmp/ruby/build/trunk/.bundle/gems/racc-1.7.3/ext/racc/cparse'
I, [2024-05-25T07:19:34.138754 #688717]  INFO -- : make[2]: Leaving directory '/tmp/ruby/build/trunk/.bundle/gems/racc-1.8.0/ext/racc/cparse'
I, [2024-05-25T07:19:34.144864 #688717]  INFO -- : make[2]: Leaving directory '/tmp/ruby/build/trunk/.bundle/gems/nkf-0.2.0/ext/nkf'
I, [2024-05-25T07:19:34.147286 #688717]  INFO -- : make[2]: Leaving directory '/tmp/ruby/build/trunk/.bundle/gems/rbs-3.4.4/ext/rbs_extension'
I, [2024-05-25T07:19:34.147312 #688717]  INFO -- : make[2]: Leaving directory '/tmp/ruby/build/trunk/.bundle/gems/debug-1.9.2/ext/debug'
I, [2024-05-25T07:19:34.171992 #688717]  INFO -- : make[2]: Entering directory '/tmp/ruby/build/trunk'
I, [2024-05-25T07:19:34.245139 #688717]  INFO -- : linking ruby
I, [2024-05-25T07:19:34.268722 #688717]  INFO -- : make[2]: Leaving directory '/tmp/ruby/build/trunk'
I, [2024-05-25T07:19:34.269433 #688717]  INFO -- : make[1]: Leaving directory '/tmp/ruby/build/trunk'
I, [2024-05-25T07:19:34.273702 #688717]  INFO -- : make[1]: Entering directory '/tmp/ruby/build/trunk'
I, [2024-05-25T07:19:34.273728 #688717]  INFO -- : make[1]: Nothing to be done for 'note'.
I, [2024-05-25T07:19:34.273738 #688717]  INFO -- : make[1]: Leaving directory '/tmp/ruby/build/trunk'
I, [2024-05-25T07:19:34.274661 #688717]  INFO -- : $$$[end] "make all -j20" exit with 0.
I, [2024-05-25T07:19:34.274816 #688717]  INFO -- : $$$[beg] make install -j20
I, [2024-05-25T07:19:34.339799 #688717]  INFO -- : Update power_assert to 84e85124c5014a139af39161d484156cfe87a9ed
I, [2024-05-25T07:19:34.339843 #688717]  INFO -- : Update rbs to ba7872795d5de04adb8ff500c0e6afdc81a041dd
I, [2024-05-25T07:19:34.340072 #688717]  INFO -- : Update typeprof to b19a6416da3a05d57fadd6ffdadb382b6d236ca5
I, [2024-05-25T07:19:34.341669 #688717]  INFO -- : 	BASERUBY = /usr/bin/ruby --disable=gems
I, [2024-05-25T07:19:34.341692 #688717]  INFO -- : 	CC = gcc
I, [2024-05-25T07:19:34.341697 #688717]  INFO -- : 	LD = ld
I, [2024-05-25T07:19:34.341702 #688717]  INFO -- : 	LDSHARED = gcc -shared
I, [2024-05-25T07:19:34.341709 #688717]  INFO -- : 	CFLAGS = -O3 -fno-fast-math -ggdb3 -Wall -Wextra -Wdeprecated-declarations -Wdiv-by-zero -Wduplicated-cond -Wimplicit-function-declaration -Wimplicit-int -Wpointer-arith -Wwrite-strings -Wold-style-definition -Wimplicit-fallthrough=0 -Wmissing-noreturn -Wno-cast-function-type -Wno-constant-logical-operand -Wno-long-long -Wno-missing-field-initializers -Wno-overlength-strings -Wno-packed-bitfield-compat -Wno-parentheses-equality -Wno-self-assign -Wno-tautological-compare -Wno-unused-parameter -Wno-unused-value -Wsuggest-attribute=format -Wsuggest-attribute=noreturn -Wunused-variable -Wmisleading-indentation -Wundef   -fPIC 
I, [2024-05-25T07:19:34.341714 #688717]  INFO -- : 	XCFLAGS = -U_FORTIFY_SOURCE -D_FORTIFY_SOURCE=2 -fstack-protector-strong -fno-strict-overflow -fvisibility=hidden -fexcess-precision=standard -DRUBY_EXPORT -I. -I.ext/include/x86_64-linux -I/tmp/ruby/src/trunk/include -I/tmp/ruby/src/trunk -I/tmp/ruby/src/trunk/prism -I/tmp/ruby/src/trunk/enc/unicode/15.0.0  
I, [2024-05-25T07:19:34.341718 #688717]  INFO -- : 	CPPFLAGS =   
I, [2024-05-25T07:19:34.341722 #688717]  INFO -- : 	DLDFLAGS = -Wl,--compress-debug-sections=zlib -Wl,-soname,libruby.so.3.4  -fstack-protector-strong  
I, [2024-05-25T07:19:34.341726 #688717]  INFO -- : 	SOLIBS = -lz -lrt -lrt -lgmp -ldl -lcrypt -lm -lpthread 
I, [2024-05-25T07:19:34.341729 #688717]  INFO -- : 	LANG = en_US.UTF-8
I, [2024-05-25T07:19:34.341733 #688717]  INFO -- : 	LC_ALL = 
I, [2024-05-25T07:19:34.341736 #688717]  INFO -- : 	LC_CTYPE = 
I, [2024-05-25T07:19:34.341740 #688717]  INFO -- : 	MFLAGS = -j20 --jobserver-auth=4,5
I, [2024-05-25T07:19:34.341743 #688717]  INFO -- : 	RUSTC = no
I, [2024-05-25T07:19:34.341747 #688717]  INFO -- : 	YJIT_RUSTC_ARGS = --crate-name=yjit --crate-type=staticlib --edition=2021 -g -C lto=thin -C opt-level=3 -C overflow-checks=on '--out-dir=/tmp/ruby/build/trunk/yjit/target/release/' /tmp/ruby/src/trunk/yjit/src/lib.rs
I, [2024-05-25T07:19:34.369025 #688717]  INFO -- : echo 84e85124c5014a139af39161d484156cfe87a9ed | /bin/sh /tmp/ruby/src/trunk/tool/ifchange /tmp/ruby/src/trunk/.bundle/.timestamp/power_assert.revision -
I, [2024-05-25T07:19:34.369181 #688717]  INFO -- : echo ba7872795d5de04adb8ff500c0e6afdc81a041dd | /bin/sh /tmp/ruby/src/trunk/tool/ifchange /tmp/ruby/src/trunk/.bundle/.timestamp/rbs.revision -
I, [2024-05-25T07:19:34.369355 #688717]  INFO -- : echo b19a6416da3a05d57fadd6ffdadb382b6d236ca5 | /bin/sh /tmp/ruby/src/trunk/tool/ifchange /tmp/ruby/src/trunk/.bundle/.timestamp/typeprof.revision -
I, [2024-05-25T07:19:34.369836 #688717]  INFO -- : generating encdb.h
I, [2024-05-25T07:19:34.369859 #688717]  INFO -- : gcc (Ubuntu 11.4.0-1ubuntu1~22.04) 11.4.0
I, [2024-05-25T07:19:34.369865 #688717]  INFO -- : Copyright (C) 2021 Free Software Foundation, Inc.
I, [2024-05-25T07:19:34.369869 #688717]  INFO -- : This is free software; see the source for copying conditions.  There is NO
I, [2024-05-25T07:19:34.369876 #688717]  INFO -- : warranty; not even for MERCHANTABILITY or FITNESS FOR A PARTICULAR PURPOSE.
I, [2024-05-25T07:19:34.369886 #688717]  INFO -- : 
I, [2024-05-25T07:19:34.371027 #688717]  INFO -- : /tmp/ruby/src/trunk/.bundle/.timestamp/power_assert.revision unchanged
I, [2024-05-25T07:19:34.371059 #688717]  INFO -- : generating enc.mk
I, [2024-05-25T07:19:34.371219 #688717]  INFO -- : /tmp/ruby/src/trunk/.bundle/.timestamp/rbs.revision unchanged
I, [2024-05-25T07:19:34.371357 #688717]  INFO -- : /tmp/ruby/src/trunk/.bundle/.timestamp/typeprof.revision unchanged
I, [2024-05-25T07:19:34.394223 #688717]  INFO -- : encdb.h unchanged
I, [2024-05-25T07:19:34.395524 #688717]  INFO -- : Building power_assert@84e85124c5014a139af39161d484156cfe87a9ed to /tmp/ruby/src/trunk/gems/power_assert-2.0.3.gem
I, [2024-05-25T07:19:34.464427 #688717]  INFO -- :   Successfully built RubyGem
I, [2024-05-25T07:19:34.464474 #688717]  INFO -- :   Name: power_assert
I, [2024-05-25T07:19:34.464493 #688717]  INFO -- :   Version: 2.0.4dev
I, [2024-05-25T07:19:34.464505 #688717]  INFO -- :   File: power_assert-2.0.4dev.gem
I, [2024-05-25T07:19:34.466459 #688717]  INFO -- : Extracting bundle gem power_assert-2.0.3...
I, [2024-05-25T07:19:34.492713 #688717]  INFO -- : making srcs under enc
I, [2024-05-25T07:19:34.493138 #688717]  INFO -- : making enc
I, [2024-05-25T07:19:34.510179 #688717]  INFO -- : make[1]: Entering directory '/tmp/ruby/build/trunk'
I, [2024-05-25T07:19:34.510227 #688717]  INFO -- : make[1]: Nothing to be done for 'enc'.
I, [2024-05-25T07:19:34.510240 #688717]  INFO -- : make[1]: Leaving directory '/tmp/ruby/build/trunk'
I, [2024-05-25T07:19:34.522987 #688717]  INFO -- : make[1]: Entering directory '/tmp/ruby/build/trunk'
I, [2024-05-25T07:19:34.523048 #688717]  INFO -- : make[1]: Nothing to be done for 'srcs'.
I, [2024-05-25T07:19:34.523067 #688717]  INFO -- : make[1]: Leaving directory '/tmp/ruby/build/trunk'
I, [2024-05-25T07:19:34.523710 #688717]  INFO -- : generating transdb.h
I, [2024-05-25T07:19:34.528348 #688717]  INFO -- : Try with hash version of bundled gems instead of gems/power_assert-2.0.3.gem. We don't use this gem with release version of Ruby.
I, [2024-05-25T07:19:34.533357 #688717]  INFO -- : Unpacked gems/power_assert-2.0.4dev.gem
I, [2024-05-25T07:19:34.619921 #688717]  INFO -- : transdb.h unchanged
I, [2024-05-25T07:19:34.621553 #688717]  INFO -- : generating makefiles ext/configure-ext.mk
I, [2024-05-25T07:19:34.621797 #688717]  INFO -- : making trans
I, [2024-05-25T07:19:34.648985 #688717]  INFO -- : ext/configure-ext.mk unchanged
I, [2024-05-25T07:19:34.651212 #688717]  INFO -- : make[1]: Entering directory '/tmp/ruby/build/trunk'
I, [2024-05-25T07:19:34.656536 #688717]  INFO -- : make[1]: Entering directory '/tmp/ruby/build/trunk'
I, [2024-05-25T07:19:34.656623 #688717]  INFO -- : make[1]: Nothing to be done for 'trans'.
I, [2024-05-25T07:19:34.656634 #688717]  INFO -- : make[1]: Leaving directory '/tmp/ruby/build/trunk'
I, [2024-05-25T07:19:34.728493 #688717]  INFO -- : making encs
I, [2024-05-25T07:19:34.789648 #688717]  INFO -- : make[1]: Entering directory '/tmp/ruby/build/trunk'
I, [2024-05-25T07:19:34.789695 #688717]  INFO -- : make[1]: Nothing to be done for 'encs'.
I, [2024-05-25T07:19:34.789701 #688717]  INFO -- : make[1]: Leaving directory '/tmp/ruby/build/trunk'
I, [2024-05-25T07:19:34.802603 #688717]  INFO -- : make[1]: Leaving directory '/tmp/ruby/build/trunk'
I, [2024-05-25T07:19:34.803295 #688717]  INFO -- : generating makefile exts.mk
I, [2024-05-25T07:19:34.840720 #688717]  INFO -- : exts.mk unchanged
I, [2024-05-25T07:19:34.845729 #688717]  INFO -- : make[1]: Entering directory '/tmp/ruby/build/trunk'
I, [2024-05-25T07:19:34.864114 #688717]  INFO -- : make[2]: Entering directory '/tmp/ruby/build/trunk/ext/digest'
I, [2024-05-25T07:19:34.865256 #688717]  INFO -- : make[2]: Entering directory '/tmp/ruby/build/trunk/ext/json'
I, [2024-05-25T07:19:34.865438 #688717]  INFO -- : make[2]: Entering directory '/tmp/ruby/build/trunk/ext/coverage'
I, [2024-05-25T07:19:34.866382 #688717]  INFO -- : make[2]: Entering directory '/tmp/ruby/build/trunk/ext/date'
I, [2024-05-25T07:19:34.866748 #688717]  INFO -- : make[2]: Entering directory '/tmp/ruby/build/trunk/ext/io/console'
I, [2024-05-25T07:19:34.866963 #688717]  INFO -- : make[2]: Entering directory '/tmp/ruby/build/trunk/ext/rubyvm'
I, [2024-05-25T07:19:34.867549 #688717]  INFO -- : make[2]: Entering directory '/tmp/ruby/build/trunk/ext/monitor'
I, [2024-05-25T07:19:34.868138 #688717]  INFO -- : make[2]: Entering directory '/tmp/ruby/build/trunk/ext/pathname'
I, [2024-05-25T07:19:34.868329 #688717]  INFO -- : make[2]: Leaving directory '/tmp/ruby/build/trunk/ext/coverage'
I, [2024-05-25T07:19:34.868464 #688717]  INFO -- : make[2]: Entering directory '/tmp/ruby/build/trunk/ext/fiddle'
I, [2024-05-25T07:19:34.868486 #688717]  INFO -- : make[2]: Entering directory '/tmp/ruby/build/trunk/ext/pty'
I, [2024-05-25T07:19:34.868890 #688717]  INFO -- : make[2]: Leaving directory '/tmp/ruby/build/trunk/ext/rubyvm'
I, [2024-05-25T07:19:34.869638 #688717]  INFO -- : make[2]: Leaving directory '/tmp/ruby/build/trunk/ext/io/console'
I, [2024-05-25T07:19:34.869696 #688717]  INFO -- : make[2]: Entering directory '/tmp/ruby/build/trunk/ext/objspace'
I, [2024-05-25T07:19:34.869989 #688717]  INFO -- : make[2]: Entering directory '/tmp/ruby/build/trunk/ext/psych'
I, [2024-05-25T07:19:34.870092 #688717]  INFO -- : make[2]: Leaving directory '/tmp/ruby/build/trunk/ext/digest'
I, [2024-05-25T07:19:34.870122 #688717]  INFO -- : make[2]: Leaving directory '/tmp/ruby/build/trunk/ext/date'
I, [2024-05-25T07:19:34.870197 #688717]  INFO -- : make[2]: Leaving directory '/tmp/ruby/build/trunk/ext/monitor'
I, [2024-05-25T07:19:34.870227 #688717]  INFO -- : make[2]: Leaving directory '/tmp/ruby/build/trunk/ext/pathname'
I, [2024-05-25T07:19:34.870677 #688717]  INFO -- : make[2]: Leaving directory '/tmp/ruby/build/trunk/ext/json'
I, [2024-05-25T07:19:34.871634 #688717]  INFO -- : make[2]: Leaving directory '/tmp/ruby/build/trunk/ext/pty'
I, [2024-05-25T07:19:34.871969 #688717]  INFO -- : make[2]: Entering directory '/tmp/ruby/build/trunk/.bundle/gems/bigdecimal-3.1.8/ext/bigdecimal'
I, [2024-05-25T07:19:34.872515 #688717]  INFO -- : make[2]: Entering directory '/tmp/ruby/build/trunk/.bundle/gems/racc-1.7.3/ext/racc/cparse'
I, [2024-05-25T07:19:34.872824 #688717]  INFO -- : make[2]: Entering directory '/tmp/ruby/build/trunk/ext/ripper'
I, [2024-05-25T07:19:34.872856 #688717]  INFO -- : make[2]: Entering directory '/tmp/ruby/build/trunk/.bundle/gems/debug-1.9.2/ext/debug'
I, [2024-05-25T07:19:34.872908 #688717]  INFO -- : make[2]: Entering directory '/tmp/ruby/build/trunk/.bundle/gems/nkf-0.2.0/ext/nkf'
I, [2024-05-25T07:19:34.873129 #688717]  INFO -- : make[2]: Entering directory '/tmp/ruby/build/trunk/.bundle/gems/racc-1.8.0/ext/racc/cparse'
I, [2024-05-25T07:19:34.873225 #688717]  INFO -- : make[2]: Entering directory '/tmp/ruby/build/trunk/.bundle/gems/syslog-0.1.2/ext/syslog'
I, [2024-05-25T07:19:34.873636 #688717]  INFO -- : make[2]: Entering directory '/tmp/ruby/build/trunk/.bundle/gems/rbs-3.4.4/ext/rbs_extension'
I, [2024-05-25T07:19:34.873853 #688717]  INFO -- : make[2]: Leaving directory '/tmp/ruby/build/trunk/ext/objspace'
I, [2024-05-25T07:19:34.875381 #688717]  INFO -- : make[2]: Leaving directory '/tmp/ruby/build/trunk/ext/fiddle'
I, [2024-05-25T07:19:34.878734 #688717]  INFO -- : make[2]: Entering directory '/tmp/ruby/build/trunk/ext/digest/sha2'
I, [2024-05-25T07:19:34.879408 #688717]  INFO -- : make[2]: Entering directory '/tmp/ruby/build/trunk/ext/socket'
I, [2024-05-25T07:19:34.879892 #688717]  INFO -- : make[2]: Entering directory '/tmp/ruby/build/trunk/ext/openssl'
I, [2024-05-25T07:19:34.880167 #688717]  INFO -- : make[2]: Leaving directory '/tmp/ruby/build/trunk/ext/ripper'
I, [2024-05-25T07:19:34.882070 #688717]  INFO -- : make[2]: Leaving directory '/tmp/ruby/build/trunk/ext/digest/sha2'
I, [2024-05-25T07:19:34.882852 #688717]  INFO -- : make[2]: Leaving directory '/tmp/ruby/build/trunk/ext/psych'
I, [2024-05-25T07:19:34.888364 #688717]  INFO -- : make[2]: Leaving directory '/tmp/ruby/build/trunk/ext/socket'
I, [2024-05-25T07:19:34.894729 #688717]  INFO -- : make[2]: Leaving directory '/tmp/ruby/build/trunk/ext/openssl'
I, [2024-05-25T07:19:34.895136 #688717]  INFO -- : make[2]: Leaving directory '/tmp/ruby/build/trunk/.bundle/gems/racc-1.7.3/ext/racc/cparse'
I, [2024-05-25T07:19:34.895632 #688717]  INFO -- : make[2]: Leaving directory '/tmp/ruby/build/trunk/.bundle/gems/bigdecimal-3.1.8/ext/bigdecimal'
I, [2024-05-25T07:19:34.896595 #688717]  INFO -- : make[2]: Leaving directory '/tmp/ruby/build/trunk/.bundle/gems/syslog-0.1.2/ext/syslog'
I, [2024-05-25T07:19:34.897274 #688717]  INFO -- : make[2]: Leaving directory '/tmp/ruby/build/trunk/.bundle/gems/racc-1.8.0/ext/racc/cparse'
I, [2024-05-25T07:19:34.898106 #688717]  INFO -- : make[2]: Leaving directory '/tmp/ruby/build/trunk/.bundle/gems/debug-1.9.2/ext/debug'
I, [2024-05-25T07:19:34.906649 #688717]  INFO -- : make[2]: Leaving directory '/tmp/ruby/build/trunk/.bundle/gems/rbs-3.4.4/ext/rbs_extension'
I, [2024-05-25T07:19:34.906675 #688717]  INFO -- : make[2]: Leaving directory '/tmp/ruby/build/trunk/.bundle/gems/nkf-0.2.0/ext/nkf'
I, [2024-05-25T07:19:34.930381 #688717]  INFO -- : make[2]: Entering directory '/tmp/ruby/build/trunk'
I, [2024-05-25T07:19:34.997506 #688717]  INFO -- : make[2]: 'ruby' is up to date.
I, [2024-05-25T07:19:34.997540 #688717]  INFO -- : make[2]: Leaving directory '/tmp/ruby/build/trunk'
I, [2024-05-25T07:19:34.997765 #688717]  INFO -- : make[1]: Leaving directory '/tmp/ruby/build/trunk'
I, [2024-05-25T07:19:35.001628 #688717]  INFO -- : make[1]: Entering directory '/tmp/ruby/build/trunk'
I, [2024-05-25T07:19:35.001650 #688717]  INFO -- : make[1]: Nothing to be done for 'note'.
I, [2024-05-25T07:19:35.001656 #688717]  INFO -- : make[1]: Leaving directory '/tmp/ruby/build/trunk'
I, [2024-05-25T07:19:35.002135 #688717]  INFO -- : ./miniruby -I/tmp/ruby/src/trunk/lib -I. -I.ext/common  /tmp/ruby/src/trunk/tool/runruby.rb --extout=.ext  -- --disable-gems -r./x86_64-linux-fake /tmp/ruby/src/trunk/tool/rbinstall.rb --make="make" --dest-dir="" --extout=".ext" --ext-build-dir="./ext" --mflags="-j20 --jobserver-auth=4,5" --make-flags=" -j20 --jobserver-auth=4,5" --data-mode=0644 --prog-mode=0755 --installed-list .installed.list --mantype="doc"  --gnumake --install=all --exclude=doc
I, [2024-05-25T07:19:35.101487 #688717]  INFO -- : Installing to 
I, [2024-05-25T07:19:35.101553 #688717]  INFO -- : installing binary commands:         /tmp/ruby/install/trunk/bin
I, [2024-05-25T07:19:35.101640 #688717]  INFO -- : installing base libraries:          /tmp/ruby/install/trunk/lib
I, [2024-05-25T07:19:35.108534 #688717]  INFO -- : installing arch files:              /tmp/ruby/install/trunk/lib/ruby/3.4.0+0/x86_64-linux
I, [2024-05-25T07:19:35.108558 #688717]  INFO -- : installing pkgconfig data:          /tmp/ruby/install/trunk/lib/pkgconfig
I, [2024-05-25T07:19:35.108564 #688717]  INFO -- : installing extension objects:       /tmp/ruby/install/trunk/lib/ruby/3.4.0+0/x86_64-linux
I, [2024-05-25T07:19:35.118089 #688717]  INFO -- : installing extension objects:       /tmp/ruby/install/trunk/lib/ruby/site_ruby/3.4.0+0/x86_64-linux
I, [2024-05-25T07:19:35.118121 #688717]  INFO -- : installing extension objects:       /tmp/ruby/install/trunk/lib/ruby/vendor_ruby/3.4.0+0/x86_64-linux
I, [2024-05-25T07:19:35.118129 #688717]  INFO -- : installing extension headers:       /tmp/ruby/install/trunk/include/ruby-3.4.0+0/x86_64-linux
I, [2024-05-25T07:19:35.118266 #688717]  INFO -- : installing extension scripts:       /tmp/ruby/install/trunk/lib/ruby/3.4.0+0
I, [2024-05-25T07:19:35.121013 #688717]  INFO -- : installing extension scripts:       /tmp/ruby/install/trunk/lib/ruby/site_ruby/3.4.0+0
I, [2024-05-25T07:19:35.121034 #688717]  INFO -- : installing extension scripts:       /tmp/ruby/install/trunk/lib/ruby/vendor_ruby/3.4.0+0
I, [2024-05-25T07:19:35.121040 #688717]  INFO -- : installing extension headers:       /tmp/ruby/install/trunk/include/ruby-3.4.0+0/ruby
I, [2024-05-25T07:19:35.121044 #688717]  INFO -- : installing command scripts:         /tmp/ruby/install/trunk/bin
I, [2024-05-25T07:19:35.121059 #688717]  INFO -- : installing library scripts:         /tmp/ruby/install/trunk/lib/ruby/3.4.0+0
I, [2024-05-25T07:19:35.153626 #688717]  INFO -- : installing common headers:          /tmp/ruby/install/trunk/include/ruby-3.4.0+0
I, [2024-05-25T07:19:35.159960 #688717]  INFO -- : installing manpages:                /tmp/ruby/install/trunk/share/man/man1
I, [2024-05-25T07:19:35.159987 #688717]  INFO -- : installing default gems from lib:   /tmp/ruby/install/trunk/lib/ruby/gems/3.4.0+0
I, [2024-05-25T07:19:35.182987 #688717]  INFO -- :                                     benchmark 0.3.0
I, [2024-05-25T07:19:35.184931 #688717]  INFO -- :                                     bundler 2.6.0.dev
I, [2024-05-25T07:19:35.187042 #688717]  INFO -- :                                     cgi 0.4.1
I, [2024-05-25T07:19:35.187606 #688717]  INFO -- :                                     delegate 0.3.1
I, [2024-05-25T07:19:35.188121 #688717]  INFO -- :                                     did_you_mean 1.6.3
I, [2024-05-25T07:19:35.188602 #688717]  INFO -- :                                     english 0.8.0
I, [2024-05-25T07:19:35.189089 #688717]  INFO -- :                                     erb 4.0.4
I, [2024-05-25T07:19:35.190089 #688717]  INFO -- :                                     error_highlight 0.6.0
I, [2024-05-25T07:19:35.190932 #688717]  INFO -- :                                     fileutils 1.7.2
I, [2024-05-25T07:19:35.191681 #688717]  INFO -- :                                     find 0.2.0
I, [2024-05-25T07:19:35.192536 #688717]  INFO -- :                                     forwardable 1.3.3
I, [2024-05-25T07:19:35.193578 #688717]  INFO -- :                                     ipaddr 1.2.6
I, [2024-05-25T07:19:35.194208 #688717]  INFO -- :                                     irb 1.13.1
I, [2024-05-25T07:19:35.194995 #688717]  INFO -- :                                     logger 1.6.0
I, [2024-05-25T07:19:35.195482 #688717]  INFO -- :                                     net-http 0.4.1
I, [2024-05-25T07:19:35.196023 #688717]  INFO -- :                                     net-protocol 0.2.2
I, [2024-05-25T07:19:35.196503 #688717]  INFO -- :                                     open-uri 0.4.1
I, [2024-05-25T07:19:35.196988 #688717]  INFO -- :                                     open3 0.2.1
I, [2024-05-25T07:19:35.197457 #688717]  INFO -- :                                     optparse 0.5.0
I, [2024-05-25T07:19:35.197877 #688717]  INFO -- :                                     ostruct 0.6.0
I, [2024-05-25T07:19:35.198299 #688717]  INFO -- :                                     pp 0.5.0
I, [2024-05-25T07:19:35.198902 #688717]  INFO -- :                                     prettyprint 0.2.0
I, [2024-05-25T07:19:35.199366 #688717]  INFO -- :                                     prism 0.29.0
I, [2024-05-25T07:19:35.199825 #688717]  INFO -- :                                     pstore 0.1.3
I, [2024-05-25T07:19:35.200365 #688717]  INFO -- :                                     rdoc 6.7.0
I, [2024-05-25T07:19:35.201336 #688717]  INFO -- :                                     readline 0.0.4
I, [2024-05-25T07:19:35.201883 #688717]  INFO -- :                                     reline 0.5.7
I, [2024-05-25T07:19:35.202395 #688717]  INFO -- :                                     resolv 0.4.0
I, [2024-05-25T07:19:35.202879 #688717]  INFO -- :                                     ruby2_keywords 0.0.5
I, [2024-05-25T07:19:35.203385 #688717]  INFO -- :                                     securerandom 0.3.1
I, [2024-05-25T07:19:35.204528 #688717]  INFO -- :                                     set 1.1.0
I, [2024-05-25T07:19:35.205177 #688717]  INFO -- :                                     shellwords 0.2.0
I, [2024-05-25T07:19:35.205676 #688717]  INFO -- :                                     singleton 0.2.0
I, [2024-05-25T07:19:35.206045 #688717]  INFO -- :                                     syntax_suggest 2.0.0
I, [2024-05-25T07:19:35.206828 #688717]  INFO -- :                                     tempfile 0.2.1
I, [2024-05-25T07:19:35.207283 #688717]  INFO -- :                                     time 0.3.0
I, [2024-05-25T07:19:35.207786 #688717]  INFO -- :                                     timeout 0.4.1
I, [2024-05-25T07:19:35.208243 #688717]  INFO -- :                                     tmpdir 0.2.0
I, [2024-05-25T07:19:35.208718 #688717]  INFO -- :                                     tsort 0.2.0
I, [2024-05-25T07:19:35.209094 #688717]  INFO -- :                                     un 0.3.0
I, [2024-05-25T07:19:35.209631 #688717]  INFO -- :                                     uri 0.13.0
I, [2024-05-25T07:19:35.210141 #688717]  INFO -- :                                     weakref 0.1.3
I, [2024-05-25T07:19:35.210593 #688717]  INFO -- :                                     yaml 0.3.0
I, [2024-05-25T07:19:35.210947 #688717]  INFO -- : installing default gems from ext:   /tmp/ruby/install/trunk/lib/ruby/gems/3.4.0+0
I, [2024-05-25T07:19:35.217638 #688717]  INFO -- :                                     date 3.3.4
I, [2024-05-25T07:19:35.218198 #688717]  INFO -- :                                     digest 3.1.1
I, [2024-05-25T07:19:35.218670 #688717]  INFO -- :                                     etc 1.4.3
I, [2024-05-25T07:19:35.219170 #688717]  INFO -- :                                     fcntl 1.1.0
I, [2024-05-25T07:19:35.219639 #688717]  INFO -- :                                     fiddle 1.1.3
I, [2024-05-25T07:19:35.220152 #688717]  INFO -- :                                     io-console 0.7.2
I, [2024-05-25T07:19:35.220619 #688717]  INFO -- :                                     io-nonblock 0.3.0
I, [2024-05-25T07:19:35.221004 #688717]  INFO -- :                                     io-wait 0.3.1
I, [2024-05-25T07:19:35.221488 #688717]  INFO -- :                                     json 2.7.2
I, [2024-05-25T07:19:35.222112 #688717]  INFO -- :                                     openssl 3.2.0
I, [2024-05-25T07:19:35.222615 #688717]  INFO -- :                                     pathname 0.3.0
I, [2024-05-25T07:19:35.223081 #688717]  INFO -- :                                     psych 5.1.2
I, [2024-05-25T07:19:35.223631 #688717]  INFO -- :                                     stringio 3.1.1
I, [2024-05-25T07:19:35.224231 #688717]  INFO -- :                                     strscan 3.1.1
I, [2024-05-25T07:19:35.224707 #688717]  INFO -- :                                     zlib 3.1.0
I, [2024-05-25T07:19:35.225001 #688717]  INFO -- : installing bundled gems:            /tmp/ruby/install/trunk/lib/ruby/gems/3.4.0+0
I, [2024-05-25T07:19:35.225576 #688717]  INFO -- :                                     minitest 5.23.1
I, [2024-05-25T07:19:35.234383 #688717]  INFO -- :                                     rake 13.2.1
I, [2024-05-25T07:19:35.237811 #688717]  INFO -- :                                     test-unit 3.6.2
I, [2024-05-25T07:19:35.242700 #688717]  INFO -- :                                     rexml 3.2.8
I, [2024-05-25T07:19:35.246481 #688717]  INFO -- :                                     rss 0.3.0
I, [2024-05-25T07:19:35.249152 #688717]  INFO -- :                                     net-ftp 0.3.4
I, [2024-05-25T07:19:35.250763 #688717]  INFO -- :                                     net-imap 0.4.11
I, [2024-05-25T07:19:35.254459 #688717]  INFO -- :                                     net-pop 0.1.2
I, [2024-05-25T07:19:35.255473 #688717]  INFO -- :                                     net-smtp 0.5.0
I, [2024-05-25T07:19:35.256817 #688717]  INFO -- :                                     matrix 0.4.2
I, [2024-05-25T07:19:35.260123 #688717]  INFO -- :                                     prime 0.1.2
I, [2024-05-25T07:19:35.264972 #688717]  INFO -- :                                     rbs 3.4.4
I, [2024-05-25T07:19:35.287155 #688717]  INFO -- :                                     typeprof 0.21.11
I, [2024-05-25T07:19:35.289479 #688717]  INFO -- :                                     debug 1.9.2
I, [2024-05-25T07:19:35.292740 #688717]  INFO -- :                                     racc 1.8.0
I, [2024-05-25T07:19:35.295446 #688717]  INFO -- :                                     mutex_m 0.2.0
I, [2024-05-25T07:19:35.297208 #688717]  INFO -- :                                     getoptlong 0.2.1
I, [2024-05-25T07:19:35.298593 #688717]  INFO -- :                                     base64 0.2.0
I, [2024-05-25T07:19:35.299705 #688717]  INFO -- :                                     bigdecimal 3.1.8
I, [2024-05-25T07:19:35.302198 #688717]  INFO -- :                                     observer 0.1.2
I, [2024-05-25T07:19:35.303391 #688717]  INFO -- :                                     abbrev 0.1.2
I, [2024-05-25T07:19:35.304672 #688717]  INFO -- :                                     resolv-replace 0.1.1
I, [2024-05-25T07:19:35.305929 #688717]  INFO -- :                                     rinda 0.2.0
I, [2024-05-25T07:19:35.307261 #688717]  INFO -- :                                     drb 2.2.1
I, [2024-05-25T07:19:35.308871 #688717]  INFO -- :                                     nkf 0.2.0
I, [2024-05-25T07:19:35.311338 #688717]  INFO -- :                                     syslog 0.1.2
I, [2024-05-25T07:19:35.313779 #688717]  INFO -- :                                     csv 3.3.0
I, [2024-05-25T07:19:35.316218 #688717]  INFO -- : installing bundled gem cache:       /tmp/ruby/install/trunk/lib/ruby/gems/3.4.0+0/cache
I, [2024-05-25T07:19:35.317617 #688717]  INFO -- : skipped bundled gems:
I, [2024-05-25T07:19:35.317638 #688717]  INFO -- :     power_assert-2.0.4dev.gem       not found in bundled_gems
I, [2024-05-25T07:19:35.321125 #688717]  INFO -- : $$$[end] "make install -j20" exit with 0.
I, [2024-05-25T07:19:35.321250 #688717]  INFO -- : $$$[beg] make yes-btest TESTOPTS='-q -j20'
I, [2024-05-25T07:19:41.366833 #688717]  INFO -- : PASS all 1936 tests
E, [2024-05-25T07:19:41.372409 #688717] ERROR -- :  
I, [2024-05-25T07:19:41.372659 #688717]  INFO -- : $$$[end] "make yes-btest TESTOPTS='-q -j20'" exit with 0.
I, [2024-05-25T07:19:41.372755 #688717]  INFO -- : $$$[beg] make yes-test-basic TESTS='-j20'
I, [2024-05-25T07:19:41.435089 #688717]  INFO -- : 	BASERUBY = /usr/bin/ruby --disable=gems
I, [2024-05-25T07:19:41.435120 #688717]  INFO -- : 	CC = gcc
I, [2024-05-25T07:19:41.435127 #688717]  INFO -- : 	LD = ld
I, [2024-05-25T07:19:41.435132 #688717]  INFO -- : 	LDSHARED = gcc -shared
I, [2024-05-25T07:19:41.435138 #688717]  INFO -- : 	CFLAGS = -O3 -fno-fast-math -ggdb3 -Wall -Wextra -Wdeprecated-declarations -Wdiv-by-zero -Wduplicated-cond -Wimplicit-function-declaration -Wimplicit-int -Wpointer-arith -Wwrite-strings -Wold-style-definition -Wimplicit-fallthrough=0 -Wmissing-noreturn -Wno-cast-function-type -Wno-constant-logical-operand -Wno-long-long -Wno-missing-field-initializers -Wno-overlength-strings -Wno-packed-bitfield-compat -Wno-parentheses-equality -Wno-self-assign -Wno-tautological-compare -Wno-unused-parameter -Wno-unused-value -Wsuggest-attribute=format -Wsuggest-attribute=noreturn -Wunused-variable -Wmisleading-indentation -Wundef   -fPIC 
I, [2024-05-25T07:19:41.435151 #688717]  INFO -- : 	XCFLAGS = -U_FORTIFY_SOURCE -D_FORTIFY_SOURCE=2 -fstack-protector-strong -fno-strict-overflow -fvisibility=hidden -fexcess-precision=standard -DRUBY_EXPORT -I. -I.ext/include/x86_64-linux -I/tmp/ruby/src/trunk/include -I/tmp/ruby/src/trunk -I/tmp/ruby/src/trunk/prism -I/tmp/ruby/src/trunk/enc/unicode/15.0.0  
I, [2024-05-25T07:19:41.435156 #688717]  INFO -- : 	CPPFLAGS =   
I, [2024-05-25T07:19:41.435161 #688717]  INFO -- : 	DLDFLAGS = -Wl,--compress-debug-sections=zlib -Wl,-soname,libruby.so.3.4  -fstack-protector-strong  
I, [2024-05-25T07:19:41.435166 #688717]  INFO -- : 	SOLIBS = -lz -lrt -lrt -lgmp -ldl -lcrypt -lm -lpthread 
I, [2024-05-25T07:19:41.435171 #688717]  INFO -- : 	LANG = en_US.UTF-8
I, [2024-05-25T07:19:41.435175 #688717]  INFO -- : 	LC_ALL = 
I, [2024-05-25T07:19:41.435180 #688717]  INFO -- : 	LC_CTYPE = 
I, [2024-05-25T07:19:41.435184 #688717]  INFO -- : 	MFLAGS = 
I, [2024-05-25T07:19:41.435189 #688717]  INFO -- : 	RUSTC = no
I, [2024-05-25T07:19:41.435194 #688717]  INFO -- : 	YJIT_RUSTC_ARGS = --crate-name=yjit --crate-type=staticlib --edition=2021 -g -C lto=thin -C opt-level=3 -C overflow-checks=on '--out-dir=/tmp/ruby/build/trunk/yjit/target/release/' /tmp/ruby/src/trunk/yjit/src/lib.rs
I, [2024-05-25T07:19:41.435845 #688717]  INFO -- : gcc (Ubuntu 11.4.0-1ubuntu1~22.04) 11.4.0
I, [2024-05-25T07:19:41.435873 #688717]  INFO -- : Copyright (C) 2021 Free Software Foundation, Inc.
I, [2024-05-25T07:19:41.435886 #688717]  INFO -- : This is free software; see the source for copying conditions.  There is NO
I, [2024-05-25T07:19:41.435892 #688717]  INFO -- : warranty; not even for MERCHANTABILITY or FITNESS FOR A PARTICULAR PURPOSE.
I, [2024-05-25T07:19:41.435897 #688717]  INFO -- : 
I, [2024-05-25T07:19:41.543078 #688717]  INFO -- : Checking leaked global symbols...none
I, [2024-05-25T07:19:41.583805 #688717]  INFO -- : /tmp/ruby/src/trunk/basictest/test.rb:assignment ....................................................................................................................................................................................................................................................................................................................................................................................OK 372
I, [2024-05-25T07:19:41.583864 #688717]  INFO -- : /tmp/ruby/src/trunk/basictest/test.rb:condition ..OK 2
I, [2024-05-25T07:19:41.583871 #688717]  INFO -- : /tmp/ruby/src/trunk/basictest/test.rb:if/unless ...OK 3
I, [2024-05-25T07:19:41.583883 #688717]  INFO -- : /tmp/ruby/src/trunk/basictest/test.rb:case .....OK 5
I, [2024-05-25T07:19:41.584093 #688717]  INFO -- : /tmp/ruby/src/trunk/basictest/test.rb:while/until ........OK 8
I, [2024-05-25T07:19:41.584147 #688717]  INFO -- : /tmp/ruby/src/trunk/basictest/test.rb:exception ..........OK 10
I, [2024-05-25T07:19:41.584434 #688717]  INFO -- : /tmp/ruby/src/trunk/basictest/test.rb:array .......................................OK 39
I, [2024-05-25T07:19:41.584542 #688717]  INFO -- : /tmp/ruby/src/trunk/basictest/test.rb:hash ...........................OK 27
I, [2024-05-25T07:19:41.585289 #688717]  INFO -- : /tmp/ruby/src/trunk/basictest/test.rb:iterator ...........................................................................................................OK 107
I, [2024-05-25T07:19:41.585580 #688717]  INFO -- : /tmp/ruby/src/trunk/basictest/test.rb:float ................................................................................OK 80
I, [2024-05-25T07:19:41.587556 #688717]  INFO -- : /tmp/ruby/src/trunk/basictest/test.rb:bignum ...............................OK 31
I, [2024-05-25T07:19:41.588353 #688717]  INFO -- : /tmp/ruby/src/trunk/basictest/test.rb:string & char ..............................................................OK 62
I, [2024-05-25T07:19:41.588387 #688717]  INFO -- : /tmp/ruby/src/trunk/basictest/test.rb:assignment ..........OK 10
I, [2024-05-25T07:19:41.588416 #688717]  INFO -- : /tmp/ruby/src/trunk/basictest/test.rb:call ......OK 6
I, [2024-05-25T07:19:41.588471 #688717]  INFO -- : /tmp/ruby/src/trunk/basictest/test.rb:proc .........OK 9
I, [2024-05-25T07:19:41.689138 #688717]  INFO -- : /tmp/ruby/src/trunk/basictest/test.rb:signal ..OK 2
I, [2024-05-25T07:19:41.691844 #688717]  INFO -- : /tmp/ruby/src/trunk/basictest/test.rb:eval ...........................OK 27
I, [2024-05-25T07:19:41.815697 #688717]  INFO -- : /tmp/ruby/src/trunk/basictest/test.rb:system ........OK 8
I, [2024-05-25T07:19:41.815778 #688717]  INFO -- : /tmp/ruby/src/trunk/basictest/test.rb:const .....OK 5
I, [2024-05-25T07:19:41.815833 #688717]  INFO -- : /tmp/ruby/src/trunk/basictest/test.rb:clone .....OK 5
I, [2024-05-25T07:19:41.815992 #688717]  INFO -- : /tmp/ruby/src/trunk/basictest/test.rb:marshal ....OK 4
I, [2024-05-25T07:19:41.816055 #688717]  INFO -- : /tmp/ruby/src/trunk/basictest/test.rb:pack ....OK 4
I, [2024-05-25T07:19:41.816077 #688717]  INFO -- : /tmp/ruby/src/trunk/basictest/test.rb:math ..OK 2
I, [2024-05-25T07:19:41.816142 #688717]  INFO -- : /tmp/ruby/src/trunk/basictest/test.rb:struct ......OK 6
I, [2024-05-25T07:19:41.816258 #688717]  INFO -- : /tmp/ruby/src/trunk/basictest/test.rb:variable ............OK 12
I, [2024-05-25T07:19:41.816288 #688717]  INFO -- : /tmp/ruby/src/trunk/basictest/test.rb:trace ...OK 3
I, [2024-05-25T07:19:41.816369 #688717]  INFO -- : /tmp/ruby/src/trunk/basictest/test.rb:defined? ............OK 12
I, [2024-05-25T07:19:41.816424 #688717]  INFO -- : /tmp/ruby/src/trunk/basictest/test.rb:alias ......OK 6
I, [2024-05-25T07:19:41.816782 #688717]  INFO -- : /tmp/ruby/src/trunk/basictest/test.rb:path .......................OK 23
I, [2024-05-25T07:19:41.854261 #688717]  INFO -- : /tmp/ruby/src/trunk/basictest/test.rb:gc ....OK 4
I, [2024-05-25T07:19:41.856871 #688717]  INFO -- : 
I, [2024-05-25T07:19:41.856900 #688717]  INFO -- : test succeeded
I, [2024-05-25T07:19:41.858322 #688717]  INFO -- : $$$[end] "make yes-test-basic TESTS='-j20'" exit with 0.
I, [2024-05-25T07:19:41.858405 #688717]  INFO -- : $$$[beg] make yes-test-all TESTOPTS='--stderr-on-failure' TESTS='-j20'
I, [2024-05-25T07:19:41.946127 #688717]  INFO -- : 	BASERUBY = /usr/bin/ruby --disable=gems
I, [2024-05-25T07:19:41.946170 #688717]  INFO -- : 	CC = gcc
I, [2024-05-25T07:19:41.946176 #688717]  INFO -- : 	LD = ld
I, [2024-05-25T07:19:41.946180 #688717]  INFO -- : 	LDSHARED = gcc -shared
I, [2024-05-25T07:19:41.946186 #688717]  INFO -- : 	CFLAGS = -O3 -fno-fast-math -ggdb3 -Wall -Wextra -Wdeprecated-declarations -Wdiv-by-zero -Wduplicated-cond -Wimplicit-function-declaration -Wimplicit-int -Wpointer-arith -Wwrite-strings -Wold-style-definition -Wimplicit-fallthrough=0 -Wmissing-noreturn -Wno-cast-function-type -Wno-constant-logical-operand -Wno-long-long -Wno-missing-field-initializers -Wno-overlength-strings -Wno-packed-bitfield-compat -Wno-parentheses-equality -Wno-self-assign -Wno-tautological-compare -Wno-unused-parameter -Wno-unused-value -Wsuggest-attribute=format -Wsuggest-attribute=noreturn -Wunused-variable -Wmisleading-indentation -Wundef   -fPIC 
I, [2024-05-25T07:19:41.946190 #688717]  INFO -- : 	XCFLAGS = -U_FORTIFY_SOURCE -D_FORTIFY_SOURCE=2 -fstack-protector-strong -fno-strict-overflow -fvisibility=hidden -fexcess-precision=standard -DRUBY_EXPORT -I. -I.ext/include/x86_64-linux -I/tmp/ruby/src/trunk/include -I/tmp/ruby/src/trunk -I/tmp/ruby/src/trunk/prism -I/tmp/ruby/src/trunk/enc/unicode/15.0.0  
I, [2024-05-25T07:19:41.946194 #688717]  INFO -- : 	CPPFLAGS =   
I, [2024-05-25T07:19:41.946198 #688717]  INFO -- : 	DLDFLAGS = -Wl,--compress-debug-sections=zlib -Wl,-soname,libruby.so.3.4  -fstack-protector-strong  
I, [2024-05-25T07:19:41.946201 #688717]  INFO -- : 	SOLIBS = -lz -lrt -lrt -lgmp -ldl -lcrypt -lm -lpthread 
I, [2024-05-25T07:19:41.946205 #688717]  INFO -- : 	LANG = en_US.UTF-8
I, [2024-05-25T07:19:41.946208 #688717]  INFO -- : 	LC_ALL = 
I, [2024-05-25T07:19:41.946212 #688717]  INFO -- : 	LC_CTYPE = 
I, [2024-05-25T07:19:41.946215 #688717]  INFO -- : 	MFLAGS = 
I, [2024-05-25T07:19:41.946226 #688717]  INFO -- : 	RUSTC = no
I, [2024-05-25T07:19:41.946231 #688717]  INFO -- : 	YJIT_RUSTC_ARGS = --crate-name=yjit --crate-type=staticlib --edition=2021 -g -C lto=thin -C opt-level=3 -C overflow-checks=on '--out-dir=/tmp/ruby/build/trunk/yjit/target/release/' /tmp/ruby/src/trunk/yjit/src/lib.rs
I, [2024-05-25T07:19:41.946722 #688717]  INFO -- : gcc (Ubuntu 11.4.0-1ubuntu1~22.04) 11.4.0
I, [2024-05-25T07:19:41.946747 #688717]  INFO -- : Copyright (C) 2021 Free Software Foundation, Inc.
I, [2024-05-25T07:19:41.946756 #688717]  INFO -- : This is free software; see the source for copying conditions.  There is NO
I, [2024-05-25T07:19:41.946763 #688717]  INFO -- : warranty; not even for MERCHANTABILITY or FITNESS FOR A PARTICULAR PURPOSE.
I, [2024-05-25T07:19:41.946770 #688717]  INFO -- : 
I, [2024-05-25T07:19:41.948281 #688717]  INFO -- : generating enc.mk
I, [2024-05-25T07:19:42.065837 #688717]  INFO -- : generating encdb.h
I, [2024-05-25T07:19:42.089547 #688717]  INFO -- : encdb.h unchanged
I, [2024-05-25T07:19:42.090774 #688717]  INFO -- : making enc
I, [2024-05-25T07:19:42.108019 #688717]  INFO -- : make[1]: Entering directory '/tmp/ruby/build/trunk'
I, [2024-05-25T07:19:42.108052 #688717]  INFO -- : make[1]: Nothing to be done for 'enc'.
I, [2024-05-25T07:19:42.108060 #688717]  INFO -- : make[1]: Leaving directory '/tmp/ruby/build/trunk'
I, [2024-05-25T07:19:42.108931 #688717]  INFO -- : making srcs under enc
I, [2024-05-25T07:19:42.138280 #688717]  INFO -- : make[1]: Entering directory '/tmp/ruby/build/trunk'
I, [2024-05-25T07:19:42.138306 #688717]  INFO -- : make[1]: Nothing to be done for 'srcs'.
I, [2024-05-25T07:19:42.138312 #688717]  INFO -- : make[1]: Leaving directory '/tmp/ruby/build/trunk'
I, [2024-05-25T07:19:42.139282 #688717]  INFO -- : generating transdb.h
I, [2024-05-25T07:19:42.239473 #688717]  INFO -- : transdb.h unchanged
I, [2024-05-25T07:19:42.241088 #688717]  INFO -- : making trans
I, [2024-05-25T07:19:42.275634 #688717]  INFO -- : make[1]: Entering directory '/tmp/ruby/build/trunk'
I, [2024-05-25T07:19:42.275658 #688717]  INFO -- : make[1]: Nothing to be done for 'trans'.
I, [2024-05-25T07:19:42.275665 #688717]  INFO -- : make[1]: Leaving directory '/tmp/ruby/build/trunk'
I, [2024-05-25T07:19:42.276361 #688717]  INFO -- : making encs
I, [2024-05-25T07:19:42.314368 #688717]  INFO -- : make[1]: Entering directory '/tmp/ruby/build/trunk'
I, [2024-05-25T07:19:42.314389 #688717]  INFO -- : make[1]: Nothing to be done for 'encs'.
I, [2024-05-25T07:19:42.314394 #688717]  INFO -- : make[1]: Leaving directory '/tmp/ruby/build/trunk'
I, [2024-05-25T07:19:42.316366 #688717]  INFO -- : generating makefiles ext/configure-ext.mk
I, [2024-05-25T07:19:42.343296 #688717]  INFO -- : ext/configure-ext.mk updated
I, [2024-05-25T07:19:42.345763 #688717]  INFO -- : make[1]: Entering directory '/tmp/ruby/build/trunk'
I, [2024-05-25T07:19:43.738184 #688717]  INFO -- : make[1]: Leaving directory '/tmp/ruby/build/trunk'
I, [2024-05-25T07:19:43.738893 #688717]  INFO -- : generating makefile exts.mk
I, [2024-05-25T07:19:43.775728 #688717]  INFO -- : exts.mk unchanged
I, [2024-05-25T07:19:43.780577 #688717]  INFO -- : make[1]: Entering directory '/tmp/ruby/build/trunk'
I, [2024-05-25T07:19:44.098649 #688717]  INFO -- : make[2]: Entering directory '/tmp/ruby/build/trunk/ext/coverage'
I, [2024-05-25T07:19:44.103469 #688717]  INFO -- : make[2]: Leaving directory '/tmp/ruby/build/trunk/ext/coverage'
I, [2024-05-25T07:19:44.109965 #688717]  INFO -- : make[2]: Entering directory '/tmp/ruby/build/trunk/ext/date'
I, [2024-05-25T07:19:44.115099 #688717]  INFO -- : make[2]: Leaving directory '/tmp/ruby/build/trunk/ext/date'
I, [2024-05-25T07:19:44.118877 #688717]  INFO -- : make[2]: Entering directory '/tmp/ruby/build/trunk/ext/digest'
I, [2024-05-25T07:19:44.127832 #688717]  INFO -- : make[2]: Leaving directory '/tmp/ruby/build/trunk/ext/digest'
I, [2024-05-25T07:19:44.154565 #688717]  INFO -- : make[2]: Entering directory '/tmp/ruby/build/trunk/ext/digest/sha2'
I, [2024-05-25T07:19:44.159407 #688717]  INFO -- : make[2]: Leaving directory '/tmp/ruby/build/trunk/ext/digest/sha2'
I, [2024-05-25T07:19:44.181142 #688717]  INFO -- : make[2]: Entering directory '/tmp/ruby/build/trunk/ext/fiddle'
I, [2024-05-25T07:19:44.191831 #688717]  INFO -- : make[2]: Leaving directory '/tmp/ruby/build/trunk/ext/fiddle'
I, [2024-05-25T07:19:44.196797 #688717]  INFO -- : make[2]: Entering directory '/tmp/ruby/build/trunk/ext/io/console'
I, [2024-05-25T07:19:44.200869 #688717]  INFO -- : make[2]: Leaving directory '/tmp/ruby/build/trunk/ext/io/console'
I, [2024-05-25T07:19:44.213666 #688717]  INFO -- : make[2]: Entering directory '/tmp/ruby/build/trunk/ext/json'
I, [2024-05-25T07:19:44.224207 #688717]  INFO -- : make[2]: Leaving directory '/tmp/ruby/build/trunk/ext/json'
I, [2024-05-25T07:19:44.239474 #688717]  INFO -- : make[2]: Entering directory '/tmp/ruby/build/trunk/ext/monitor'
I, [2024-05-25T07:19:44.243415 #688717]  INFO -- : make[2]: Leaving directory '/tmp/ruby/build/trunk/ext/monitor'
I, [2024-05-25T07:19:44.250430 #688717]  INFO -- : make[2]: Entering directory '/tmp/ruby/build/trunk/ext/objspace'
I, [2024-05-25T07:19:44.256780 #688717]  INFO -- : make[2]: Leaving directory '/tmp/ruby/build/trunk/ext/objspace'
I, [2024-05-25T07:19:44.275114 #688717]  INFO -- : make[2]: Entering directory '/tmp/ruby/build/trunk/ext/openssl'
I, [2024-05-25T07:19:44.294018 #688717]  INFO -- : make[2]: Leaving directory '/tmp/ruby/build/trunk/ext/openssl'
I, [2024-05-25T07:19:44.297527 #688717]  INFO -- : make[2]: Entering directory '/tmp/ruby/build/trunk/ext/pathname'
I, [2024-05-25T07:19:44.300540 #688717]  INFO -- : make[2]: Leaving directory '/tmp/ruby/build/trunk/ext/pathname'
I, [2024-05-25T07:19:44.307213 #688717]  INFO -- : make[2]: Entering directory '/tmp/ruby/build/trunk/ext/psych'
I, [2024-05-25T07:19:44.332720 #688717]  INFO -- : make[2]: Leaving directory '/tmp/ruby/build/trunk/ext/psych'
I, [2024-05-25T07:19:44.337871 #688717]  INFO -- : make[2]: Entering directory '/tmp/ruby/build/trunk/ext/pty'
I, [2024-05-25T07:19:44.341973 #688717]  INFO -- : make[2]: Leaving directory '/tmp/ruby/build/trunk/ext/pty'
I, [2024-05-25T07:19:44.358508 #688717]  INFO -- : make[2]: Entering directory '/tmp/ruby/build/trunk/ext/ripper'
I, [2024-05-25T07:19:44.366828 #688717]  INFO -- : make[2]: Leaving directory '/tmp/ruby/build/trunk/ext/ripper'
I, [2024-05-25T07:19:44.369383 #688717]  INFO -- : make[2]: Entering directory '/tmp/ruby/build/trunk/ext/rubyvm'
I, [2024-05-25T07:19:44.372618 #688717]  INFO -- : make[2]: Leaving directory '/tmp/ruby/build/trunk/ext/rubyvm'
I, [2024-05-25T07:19:44.385467 #688717]  INFO -- : make[2]: Entering directory '/tmp/ruby/build/trunk/ext/socket'
I, [2024-05-25T07:19:44.394250 #688717]  INFO -- : make[2]: Leaving directory '/tmp/ruby/build/trunk/ext/socket'
I, [2024-05-25T07:19:44.412650 #688717]  INFO -- : make[2]: Entering directory '/tmp/ruby/build/trunk/.bundle/gems/bigdecimal-3.1.8/ext/bigdecimal'
I, [2024-05-25T07:19:44.441371 #688717]  INFO -- : make[2]: Leaving directory '/tmp/ruby/build/trunk/.bundle/gems/bigdecimal-3.1.8/ext/bigdecimal'
I, [2024-05-25T07:19:44.443318 #688717]  INFO -- : make[2]: Entering directory '/tmp/ruby/build/trunk/.bundle/gems/debug-1.9.2/ext/debug'
I, [2024-05-25T07:19:44.464744 #688717]  INFO -- : make[2]: Leaving directory '/tmp/ruby/build/trunk/.bundle/gems/debug-1.9.2/ext/debug'
I, [2024-05-25T07:19:44.466796 #688717]  INFO -- : make[2]: Entering directory '/tmp/ruby/build/trunk/.bundle/gems/nkf-0.2.0/ext/nkf'
I, [2024-05-25T07:19:44.488537 #688717]  INFO -- : make[2]: Leaving directory '/tmp/ruby/build/trunk/.bundle/gems/nkf-0.2.0/ext/nkf'
I, [2024-05-25T07:19:44.490510 #688717]  INFO -- : make[2]: Entering directory '/tmp/ruby/build/trunk/.bundle/gems/racc-1.7.3/ext/racc/cparse'
I, [2024-05-25T07:19:44.512418 #688717]  INFO -- : make[2]: Leaving directory '/tmp/ruby/build/trunk/.bundle/gems/racc-1.7.3/ext/racc/cparse'
I, [2024-05-25T07:19:44.514635 #688717]  INFO -- : make[2]: Entering directory '/tmp/ruby/build/trunk/.bundle/gems/racc-1.8.0/ext/racc/cparse'
I, [2024-05-25T07:19:44.544831 #688717]  INFO -- : make[2]: Leaving directory '/tmp/ruby/build/trunk/.bundle/gems/racc-1.8.0/ext/racc/cparse'
I, [2024-05-25T07:19:44.547144 #688717]  INFO -- : make[2]: Entering directory '/tmp/ruby/build/trunk/.bundle/gems/rbs-3.4.4/ext/rbs_extension'
I, [2024-05-25T07:19:44.569599 #688717]  INFO -- : make[2]: Leaving directory '/tmp/ruby/build/trunk/.bundle/gems/rbs-3.4.4/ext/rbs_extension'
I, [2024-05-25T07:19:44.571427 #688717]  INFO -- : make[2]: Entering directory '/tmp/ruby/build/trunk/.bundle/gems/syslog-0.1.2/ext/syslog'
I, [2024-05-25T07:19:44.592754 #688717]  INFO -- : make[2]: Leaving directory '/tmp/ruby/build/trunk/.bundle/gems/syslog-0.1.2/ext/syslog'
I, [2024-05-25T07:19:44.615936 #688717]  INFO -- : make[2]: Entering directory '/tmp/ruby/build/trunk'
I, [2024-05-25T07:19:44.679643 #688717]  INFO -- : make[2]: 'ruby' is up to date.
I, [2024-05-25T07:19:44.679683 #688717]  INFO -- : make[2]: Leaving directory '/tmp/ruby/build/trunk'
I, [2024-05-25T07:19:44.679946 #688717]  INFO -- : make[1]: Leaving directory '/tmp/ruby/build/trunk'
I, [2024-05-25T07:19:44.683554 #688717]  INFO -- : make[1]: Entering directory '/tmp/ruby/build/trunk'
I, [2024-05-25T07:19:44.683582 #688717]  INFO -- : make[1]: Nothing to be done for 'note'.
I, [2024-05-25T07:19:44.683589 #688717]  INFO -- : make[1]: Leaving directory '/tmp/ruby/build/trunk'
I, [2024-05-25T07:19:44.758217 #688717]  INFO -- : Run options: 
I, [2024-05-25T07:19:44.758274 #688717]  INFO -- :   --seed=36834
I, [2024-05-25T07:19:44.758280 #688717]  INFO -- :   "--ruby=./miniruby -I/tmp/ruby/src/trunk/lib -I. -I.ext/common  /tmp/ruby/src/trunk/tool/runruby.rb --extout=.ext  -- --disable-gems"
I, [2024-05-25T07:19:44.758285 #688717]  INFO -- :   --excludes-dir=/tmp/ruby/src/trunk/test/.excludes
I, [2024-05-25T07:19:44.758288 #688717]  INFO -- :   --name=!/memory_leak/
I, [2024-05-25T07:19:44.758292 #688717]  INFO -- :   --stderr-on-failure
I, [2024-05-25T07:19:44.758296 #688717]  INFO -- :   -j20
I, [2024-05-25T07:19:44.758299 #688717]  INFO -- : 
I, [2024-05-25T07:19:44.758303 #688717]  INFO -- : # Running tests:
I, [2024-05-25T07:19:44.758307 #688717]  INFO -- : 
I, [2024-05-25T07:19:44.908205 #688717]  INFO -- : [  1/883] 730067=test_continuation
I, [2024-05-25T07:19:44.908269 #688717]  INFO -- : [  2/883] 730068=test_fd_setsize
I, [2024-05-25T07:19:44.908320 #688717]  INFO -- : [  3/883] 730069=test_keyword
I, [2024-05-25T07:19:44.908422 #688717]  INFO -- : [  4/883] 730071=test_class_name_check
I, [2024-05-25T07:19:44.908586 #688717]  INFO -- : [  5/883] 730070=test_delete
I, [2024-05-25T07:19:44.909182 #688717]  INFO -- : [  6/883] 730076=test_win32ole_method
I, [2024-05-25T07:19:44.911294 #688717]  INFO -- : [  7/883] 730068=test_rdoc_markup_hard_break
I, [2024-05-25T07:19:44.911346 #688717]  INFO -- : [  8/883] 730081=test_date_strptime
I, [2024-05-25T07:19:44.912629 #688717]  INFO -- : [  9/883] 730082=test_gem_package_task
I, [2024-05-25T07:19:44.912684 #688717]  INFO -- : [ 10/883] 730067=test_placearg
I, [2024-05-25T07:19:44.912700 #688717]  INFO -- : [ 11/883] 730076=test_gem_platform
I, [2024-05-25T07:19:44.912713 #688717]  INFO -- : [ 12/883] 730084=test_pkey_rsa
I, [2024-05-25T07:19:44.912724 #688717]  INFO -- : [ 13/883] 730085=test_numhash
I, [2024-05-25T07:19:44.912809 #688717]  INFO -- : [ 14/883] 730086=test_weakkeymap
I, [2024-05-25T07:19:44.915562 #688717]  INFO -- : [ 15/883] 730070=test_gem_commands_push_command
I, [2024-05-25T07:19:44.917075 #688717]  INFO -- : [ 16/883] 730085=test_rdoc_parser_markdown
I, [2024-05-25T07:19:44.924552 #688717]  INFO -- : [ 17/883] 730078=test_import
I, [2024-05-25T07:19:44.933497 #688717]  INFO -- : [ 18/883] 730071=test_gem_resolver_lock_set
I, [2024-05-25T07:19:44.939919 #688717]  INFO -- : [ 19/883] 730074=test_not
I, [2024-05-25T07:19:44.940464 #688717]  INFO -- : [ 20/883] 730075=test_logger
I, [2024-05-25T07:19:44.940503 #688717]  INFO -- : [ 21/883] 730073=test_files_test
I, [2024-05-25T07:19:44.941143 #688717]  INFO -- : [ 22/883] 730072=test_gem_update_suggestion
I, [2024-05-25T07:19:44.941324 #688717]  INFO -- : [ 23/883] 730083=test_file_exhaustive
I, [2024-05-25T07:19:44.941749 #688717]  INFO -- : [ 24/883] 730074=test_arithmetic_sequence
I, [2024-05-25T07:19:44.942685 #688717]  INFO -- : [ 25/883] 730077=test_key_actor_emacs
I, [2024-05-25T07:19:44.942813 #688717]  INFO -- : [ 26/883] 730080=test_gem_command_manager
I, [2024-05-25T07:19:44.943343 #688717]  INFO -- : [ 27/883] 730079=test_gem_gemcutter_utilities
I, [2024-05-25T07:19:44.963281 #688717]  INFO -- : [ 28/883] 730075=test_basicinstructions
I, [2024-05-25T07:19:44.969667 #688717]  INFO -- : [ 29/883] 730074=version_test
I, [2024-05-25T07:19:45.022566 #688717]  INFO -- : [ 30/883] 730086=test_cgi_header
I, [2024-05-25T07:19:45.026437 #688717]  INFO -- : [ 31/883] 730081=heredoc_dedent_test
I, [2024-05-25T07:19:45.044581 #688717]  INFO -- : [ 32/883] 730073=test_object
I, [2024-05-25T07:19:45.044645 #688717]  INFO -- : [ 33/883] 730068=test_rdoc_rd_block_parser
I, [2024-05-25T07:19:45.044655 #688717]  INFO -- : [ 34/883] 730086=test_tsort
I, [2024-05-25T07:19:45.056975 #688717]  INFO -- : [ 35/883] 730086=test_signedness
I, [2024-05-25T07:19:45.057285 #688717]  INFO -- : [ 36/883] 730074=test_type
I, [2024-05-25T07:19:45.057318 #688717]  INFO -- : [ 37/883] 730067=test_ractor
I, [2024-05-25T07:19:45.057561 #688717]  INFO -- : [ 38/883] 730073=test_big5
I, [2024-05-25T07:19:45.060406 #688717]  INFO -- : [ 39/883] 730075=test_func
I, [2024-05-25T07:19:45.068697 #688717]  INFO -- : [ 40/883] 730074=test_pointer
I, [2024-05-25T07:19:45.075311 #688717]  INFO -- : [ 41/883] 730073=test_gem_local_remote_options
I, [2024-05-25T07:19:45.087645 #688717]  INFO -- : [ 42/883] 730068=test_date_arith
I, [2024-05-25T07:19:45.090600 #688717]  INFO -- : [ 43/883] 730082=test_object
I, [2024-05-25T07:19:45.091194 #688717]  INFO -- : [ 44/883] 730081=test_ruby_lex
I, [2024-05-25T07:19:45.100161 #688717]  INFO -- : [ 45/883] 730068=test_sleep
I, [2024-05-25T07:19:45.117155 #688717]  INFO -- : [ 46/883] 730067=compiler_test
I, [2024-05-25T07:19:45.121309 #688717]  INFO -- : [ 47/883] 730071=test_flip
I, [2024-05-25T07:19:45.125282 #688717]  INFO -- : [ 48/883] 730085=test_change_word
I, [2024-05-25T07:19:45.137140 #688717]  INFO -- : [ 49/883] 730085=test_normalize
I, [2024-05-25T07:19:45.138853 #688717]  INFO -- : [ 50/883] 730085=test_ossl
I, [2024-05-25T07:19:45.139301 #688717]  INFO -- : [ 51/883] 730071=test_timeout
I, [2024-05-25T07:19:45.144330 #688717]  INFO -- : [ 52/883] 730078=static_inspect_test
I, [2024-05-25T07:19:45.147394 #688717]  INFO -- : [ 53/883] 730071=test_force_exit
I, [2024-05-25T07:19:45.152233 #688717]  INFO -- : [ 54/883] 730076=test_file
I, [2024-05-25T07:19:45.152715 #688717]  INFO -- : [ 55/883] 730077=unescape_test
I, [2024-05-25T07:19:45.177104 #688717]  INFO -- : [ 56/883] 730067=test_ostruct
I, [2024-05-25T07:19:45.202721 #688717]  INFO -- : [ 57/883] 730078=test_data_error
I, [2024-05-25T07:19:45.211829 #688717]  INFO -- : [ 58/883] 730072=bom_test
I, [2024-05-25T07:19:45.229704 #688717]  INFO -- : [ 59/883] 730071=test_udp
I, [2024-05-25T07:19:45.233711 #688717]  INFO -- : [ 60/883] 730071=test_vm_dump
I, [2024-05-25T07:19:45.237372 #688717]  INFO -- : [ 61/883] 730071=test_tmpdir
I, [2024-05-25T07:19:45.263885 #688717]  INFO -- : [ 62/883] 730072=test_rdoc_markup_document
I, [2024-05-25T07:19:45.271582 #688717]  INFO -- : [ 63/883] 730084=test_integer_comb
I, [2024-05-25T07:19:45.272806 #688717]  INFO -- : [ 64/883] 730074=test_regexp
I, [2024-05-25T07:19:45.282188 #688717]  INFO -- : [ 65/883] 730073=test_gem_commands_check_command
I, [2024-05-25T07:19:45.286373 #688717]  INFO -- : [ 66/883] 730078=errors_test
I, [2024-05-25T07:19:45.286736 #688717]  INFO -- : [ 67/883] 730081=test_ts
I, [2024-05-25T07:19:45.300656 #688717]  INFO -- : [ 68/883] 730080=library_symbols_test
I, [2024-05-25T07:19:45.300796 #688717]  INFO -- : [ 69/883] 730067=test_addr
I, [2024-05-25T07:19:45.301168 #688717]  INFO -- : [ 70/883] 730073=test_locale
I, [2024-05-25T07:19:45.326282 #688717]  INFO -- : [ 71/883] 730071=test_ensured
I, [2024-05-25T07:19:45.336927 #688717]  INFO -- : [ 72/883] 730067=test_rdoc_ri_paths
I, [2024-05-25T07:19:45.370677 #688717]  INFO -- : [ 73/883] 730072=test_pty
I, [2024-05-25T07:19:45.372788 #688717]  INFO -- : [ 74/883] 730071=test_dup
I, [2024-05-25T07:19:45.372896 #688717]  INFO -- : [ 75/883] 730080=test_constant
I, [2024-05-25T07:19:45.378166 #688717]  INFO -- : [ 76/883] 730078=command_line_test
I, [2024-05-25T07:19:45.386123 #688717]  INFO -- : [ 77/883] 730078=test_project_sanity
I, [2024-05-25T07:19:45.398822 #688717]  INFO -- : [ 78/883] 730073=test_range
I, [2024-05-25T07:19:45.462482 #688717]  INFO -- : [ 79/883] 730075=test_gem_uri_formatter
I, [2024-05-25T07:19:45.481942 #688717]  INFO -- : [ 80/883] 730069=test_encoding
I, [2024-05-25T07:19:45.485236 #688717]  INFO -- : [ 81/883] 730082=test_erb_command
I, [2024-05-25T07:19:45.508137 #688717]  INFO -- : [ 82/883] 730079=test_helper
I, [2024-05-25T07:19:45.516106 #688717]  INFO -- : [ 83/883] 730079=test_eval
I, [2024-05-25T07:19:45.523544 #688717]  INFO -- : [ 84/883] 730082=json_generator_test
I, [2024-05-25T07:19:45.542830 #688717]  INFO -- : [ 85/883] 730067=test_transcode
I, [2024-05-25T07:19:45.545771 #688717]  INFO -- : [ 86/883] 730071=test_gem_safe_marshal
I, [2024-05-25T07:19:45.587876 #688717]  INFO -- : [ 87/883] 730078=test_gem_resolver_api_set
I, [2024-05-25T07:19:45.601246 #688717]  INFO -- : [ 88/883] 730070=test_gem_resolver_vendor_set
I, [2024-05-25T07:19:45.609798 #688717]  INFO -- : [ 89/883] 730082=test_config
I, [2024-05-25T07:19:45.624698 #688717]  INFO -- : [ 90/883] 730070=test_enumerable
I, [2024-05-25T07:19:45.632260 #688717]  INFO -- : [ 91/883] 730070=test_webauthn_listener
I, [2024-05-25T07:19:45.650922 #688717]  INFO -- : [ 92/883] 730069=test_lambda
I, [2024-05-25T07:19:45.658018 #688717]  INFO -- : [ 93/883] 730078=test_ast
I, [2024-05-25T07:19:45.682475 #688717]  INFO -- : [ 94/883] 730075=test_gem_request_set_gem_dependency_api
I, [2024-05-25T07:19:45.687290 #688717]  INFO -- : [ 95/883] 730070=test_jaro_winkler
I, [2024-05-25T07:19:45.697018 #688717]  INFO -- : [ 96/883] 730070=test_random_formatter
I, [2024-05-25T07:19:45.705895 #688717]  INFO -- : [ 97/883] 730069=test_helper
I, [2024-05-25T07:19:45.712600 #688717]  INFO -- : [ 98/883] 730070=test_fips
I, [2024-05-25T07:19:45.721592 #688717]  INFO -- : [ 99/883] 730079=test_x509name
I, [2024-05-25T07:19:45.735833 #688717]  INFO -- : [100/883] 730079=test_update
I, [2024-05-25T07:19:45.741456 #688717]  INFO -- : [101/883] 730079=test_rdoc_code_object
I, [2024-05-25T07:19:45.773187 #688717]  INFO -- : [102/883] 730067=test_x509store
I, [2024-05-25T07:19:45.787121 #688717]  INFO -- : [103/883] 730081=test_have_func
I, [2024-05-25T07:19:45.794201 #688717]  INFO -- : [104/883] 730072=test_gem_request_set_lockfile_tokenizer
I, [2024-05-25T07:19:45.795220 #688717]  INFO -- : [105/883] 730069=test_stat
I, [2024-05-25T07:19:45.797864 #688717]  INFO -- : [106/883] 730069=test_capacity
I, [2024-05-25T07:19:45.801369 #688717]  INFO -- : [107/883] 730069=test_nextafter
I, [2024-05-25T07:19:45.858450 #688717]  INFO -- : [108/883] 730072=test_usrmarshal
I, [2024-05-25T07:19:45.869574 #688717]  INFO -- : [109/883] 730069=test_object_references
I, [2024-05-25T07:19:45.901889 #688717]  INFO -- : [110/883] 730069=test_gem_resolver_git_specification
I, [2024-05-25T07:19:45.903882 #688717]  INFO -- : [111/883] 730070=test_rubyoptions
I, [2024-05-25T07:19:45.934997 #688717]  INFO -- : [112/883] 730075=test_super
I, [2024-05-25T07:19:45.949423 #688717]  INFO -- : [113/883] 730071=test_integer
I, [2024-05-25T07:19:46.006750 #688717]  INFO -- : [114/883] 730082=test_cgi_modruby
I, [2024-05-25T07:19:46.017757 #688717]  INFO -- : [115/883] 730082=test_rubygems
I, [2024-05-25T07:19:46.028839 #688717]  INFO -- : [116/883] 730067=test_call
I, [2024-05-25T07:19:46.052647 #688717]  INFO -- : [117/883] 730073=test_https_proxy
I, [2024-05-25T07:19:46.088223 #688717]  INFO -- : [118/883] 730073=test_gem_commands_setup_command
I, [2024-05-25T07:19:46.097389 #688717]  INFO -- : [119/883] 730072=test_env
I, [2024-05-25T07:19:46.151086 #688717]  INFO -- : [120/883] 730067=test_rdoc_attr
I, [2024-05-25T07:19:46.165155 #688717]  INFO -- : [121/883] 730067=test_dryrun
I, [2024-05-25T07:19:46.177338 #688717]  INFO -- : [122/883] 730067=test_integer
I, [2024-05-25T07:19:46.218661 #688717]  INFO -- : [123/883] 730082=desugar_compiler_test
I, [2024-05-25T07:19:46.239268 #688717]  INFO -- : [124/883] 730079=test_registry
I, [2024-05-25T07:19:46.241911 #688717]  INFO -- : [125/883] 730079=parse_stream_test
I, [2024-05-25T07:19:46.251444 #688717]  INFO -- : [126/883] 730067=test_gem
I, [2024-05-25T07:19:46.259835 #688717]  INFO -- : [127/883] 730077=test_gem_source_lock
I, [2024-05-25T07:19:46.307677 #688717]  INFO -- : [128/883] 730082=test_ractor
I, [2024-05-25T07:19:46.315509 #688717]  INFO -- : [129/883] 730079=test_dns
I, [2024-05-25T07:19:46.323730 #688717]  INFO -- : [130/883] 730082=test_gem_commands_open_command
I, [2024-05-25T07:19:46.368164 #688717]  INFO -- : [131/883] 730069=test_cgi_core
I, [2024-05-25T07:19:46.385431 #688717]  INFO -- : [132/883] 730069=test_parser
I, [2024-05-25T07:19:46.398900 #688717]  INFO -- : [133/883] 730069=test_timeout
I, [2024-05-25T07:19:46.428830 #688717]  INFO -- : [134/883] 730082=test_alias
I, [2024-05-25T07:19:46.459995 #688717]  INFO -- : [135/883] 730077=test_weakref
I, [2024-05-25T07:19:46.460496 #688717]  INFO -- : [136/883] 730075=test_nonblock
I, [2024-05-25T07:19:46.473095 #688717]  INFO -- : [137/883] 730075=test_marshal
I, [2024-05-25T07:19:46.542256 #688717]  INFO -- : [138/883] 730077=test_unicode_normalize
I, [2024-05-25T07:19:46.562353 #688717]  INFO -- : [139/883] 730082=test_reline_key
I, [2024-05-25T07:19:46.634361 #688717]  INFO -- : [140/883] 730082=test_rb_str_dup
I, [2024-05-25T07:19:46.637234 #688717]  INFO -- : [141/883] 730082=test_singleton_function
I, [2024-05-25T07:19:46.640623 #688717]  INFO -- : [142/883] 730082=test_ancdata
I, [2024-05-25T07:19:46.659318 #688717]  INFO -- : [143/883] 730082=test_ssl
I, [2024-05-25T07:19:46.768674 #688717]  INFO -- : [144/883] 730073=test_rendering
I, [2024-05-25T07:19:46.780856 #688717]  INFO -- : [145/883] 730073=test_debugger_integration
I, [2024-05-25T07:19:46.787309 #688717]  INFO -- : [146/883] 730079=test_my_integer
I, [2024-05-25T07:19:46.792373 #688717]  INFO -- : [147/883] 730075=test_thread
I, [2024-05-25T07:19:46.796515 #688717]  INFO -- : [148/883] 730079=json_ext_parser_test
I, [2024-05-25T07:19:46.796573 #688717]  INFO -- : [149/883] 730073=test_ractor
I, [2024-05-25T07:19:46.799783 #688717]  INFO -- : [150/883] 730079=test_gem_package
I, [2024-05-25T07:19:47.066305 #688717]  INFO -- : [151/883] 730081=test_complex2
I, [2024-05-25T07:19:47.084369 #688717]  INFO -- : [152/883] 730081=test_resolve_symbol
I, [2024-05-25T07:19:47.159386 #688717]  INFO -- : [153/883] 730081=test_have_macro
I, [2024-05-25T07:19:47.173948 #688717]  INFO -- : [154/883] 730073=test_enum
I, [2024-05-25T07:19:47.202129 #688717]  INFO -- : [155/883] 730082=test_gem_specification
I, [2024-05-25T07:19:47.324233 #688717]  INFO -- : [156/883] 730086=test_threadgroup
I, [2024-05-25T07:19:47.342075 #688717]  INFO -- : [157/883] 730069=test_rdoc_class_module
I, [2024-05-25T07:19:47.500644 #688717]  INFO -- : [158/883] 730081=test_bignum
I, [2024-05-25T07:19:47.516055 #688717]  INFO -- : [159/883] 730079=test_gem_ci_detector
I, [2024-05-25T07:19:47.527288 #688717]  INFO -- : [160/883] 730079=test_stringio
I, [2024-05-25T07:19:47.615070 #688717]  INFO -- : [161/883] 730080=test_arity
I, [2024-05-25T07:19:47.617700 #688717]  INFO -- : [162/883] 730080=test_io_wait_uncommon
I, [2024-05-25T07:19:47.624058 #688717]  INFO -- : [163/883] 730080=test_win32ole_variable
I, [2024-05-25T07:19:47.625700 #688717]  INFO -- : [164/883] 730080=test_trace
I, [2024-05-25T07:19:47.636900 #688717]  INFO -- : [165/883] 730080=ractor_test
I, [2024-05-25T07:19:47.645001 #688717]  INFO -- : [166/883] 730079=test_time_tz
I, [2024-05-25T07:19:47.702851 #688717]  INFO -- : [167/883] 730079=test_win32ole_event
I, [2024-05-25T07:19:47.708748 #688717]  INFO -- : [168/883] 730079=test_rdoc_generator_json_index
I, [2024-05-25T07:19:47.736131 #688717]  INFO -- : [169/883] 730080=test_gem_resolver_api_specification
I, [2024-05-25T07:19:47.747147 #688717]  INFO -- : [170/883] 730079=test_win32ole_variant
I, [2024-05-25T07:19:47.752151 #688717]  INFO -- : [171/883] 730079=test_mixed_unicode_escapes
I, [2024-05-25T07:19:47.758603 #688717]  INFO -- : [172/883] 730079=test_history
I, [2024-05-25T07:19:47.824078 #688717]  INFO -- : [173/883] 730080=test_rdoc_markup_to_ansi
I, [2024-05-25T07:19:47.847709 #688717]  INFO -- : [174/883] 730079=test_ipaddr
I, [2024-05-25T07:19:47.890296 #688717]  INFO -- : [175/883] 730079=test_rdoc_extend
I, [2024-05-25T07:19:47.913977 #688717]  INFO -- : [176/883] 730079=test_merge_keys
I, [2024-05-25T07:19:47.926494 #688717]  INFO -- : [177/883] 730079=test_rdoc_comment
I, [2024-05-25T07:19:47.969331 #688717]  INFO -- : [178/883] 730079=test_error_highlight
I, [2024-05-25T07:19:48.016511 #688717]  INFO -- : [179/883] 730080=test_resize
I, [2024-05-25T07:19:48.021412 #688717]  INFO -- : [180/883] 730080=test_rdoc_generator_darkfish
I, [2024-05-25T07:19:48.039044 #688717]  INFO -- : [181/883] 730073=test_http_request
I, [2024-05-25T07:19:48.042858 #688717]  INFO -- : [182/883] 730073=test_gem_source_fetch_problem
I, [2024-05-25T07:19:48.054678 #688717]  INFO -- : [183/883] 730073=json_generic_object_test
I, [2024-05-25T07:19:48.065270 #688717]  INFO -- : [184/883] 730073=location_test
I, [2024-05-25T07:19:48.082601 #688717]  INFO -- : [185/883] 730071=test_symbol
I, [2024-05-25T07:19:48.096641 #688717]  INFO -- : [186/883] 730071=test_coderange
I, [2024-05-25T07:19:48.097366 #688717]  INFO -- : [187/883] 730084=test_mailto
I, [2024-05-25T07:19:48.101880 #688717]  INFO -- : [188/883] 730071=test_date_ractor
I, [2024-05-25T07:19:48.122675 #688717]  INFO -- : [189/883] 730084=test_gem_console_ui
I, [2024-05-25T07:19:48.150168 #688717]  INFO -- : [190/883] 730073=test_dir
I, [2024-05-25T07:19:48.183122 #688717]  INFO -- : [191/883] 730069=test_autoconf
I, [2024-05-25T07:19:48.189086 #688717]  INFO -- : [192/883] 730069=test_eval
I, [2024-05-25T07:19:48.196589 #688717]  INFO -- : [193/883] 730069=test_ractor_compatibility
I, [2024-05-25T07:19:48.245520 #688717]  INFO -- : [194/883] 730067=test_member
I, [2024-05-25T07:19:48.248918 #688717]  INFO -- : [195/883] 730067=test_numeric
I, [2024-05-25T07:19:48.255870 #688717]  INFO -- : [196/883] 730067=test_cgi_multipart
I, [2024-05-25T07:19:48.279495 #688717]  INFO -- : [197/883] 730080=test_gem_commands_cleanup_command
I, [2024-05-25T07:19:48.288788 #688717]  INFO -- : [198/883] 730084=test_word
I, [2024-05-25T07:19:48.291392 #688717]  INFO -- : [199/883] 730084=test_find_executable
I, [2024-05-25T07:19:48.310118 #688717]  INFO -- : [200/883] 730084=ruby_api_test
I, [2024-05-25T07:19:48.314032 #688717]  INFO -- : [201/883] 730071=test_gem_commands_pristine_command
I, [2024-05-25T07:19:48.325314 #688717]  INFO -- : [202/883] 730086=test_context
I, [2024-05-25T07:19:48.375353 #688717]  INFO -- : [203/883] 730073=test_nofree
I, [2024-05-25T07:19:48.378487 #688717]  INFO -- : [204/883] 730073=test_coder
I, [2024-05-25T07:19:48.396248 #688717]  INFO -- : [205/883] 730073=test_symbol
I, [2024-05-25T07:19:48.405637 #688717]  INFO -- : [206/883] 730067=test_unix
I, [2024-05-25T07:19:48.451640 #688717]  INFO -- : [207/883] 730067=test_enc_associate
I, [2024-05-25T07:19:48.495474 #688717]  INFO -- : [208/883] 730084=test_lazy_enumerator
I, [2024-05-25T07:19:48.497649 #688717]  INFO -- : [209/883] 730079=test_pkcs7
I, [2024-05-25T07:19:48.509507 #688717]  INFO -- : [210/883] 730086=test_arith_seq_beg_len_step
I, [2024-05-25T07:19:48.569092 #688717]  INFO -- : [211/883] 730069=test_gem_resolver_requirement_list
I, [2024-05-25T07:19:48.572113 #688717]  INFO -- : [212/883] 730086=test_function_entry
I, [2024-05-25T07:19:48.573743 #688717]  INFO -- : [213/883] 730069=test_parser
I, [2024-05-25T07:19:48.574316 #688717]  INFO -- : [214/883] 730086=test_arith_seq_extract
I, [2024-05-25T07:19:48.575276 #688717]  INFO -- : [215/883] 730086=test_method_name_check
I, [2024-05-25T07:19:48.589251 #688717]  INFO -- : [216/883] 730086=test_gem_request_set
I, [2024-05-25T07:19:48.619974 #688717]  INFO -- : [217/883] 730069=test_module
I, [2024-05-25T07:19:48.677035 #688717]  INFO -- : [218/883] 730079=test_gem_ext_cargo_builder
I, [2024-05-25T07:19:48.693874 #688717]  INFO -- : [219/883] 730080=test_ssl
I, [2024-05-25T07:19:48.701306 #688717]  INFO -- : [220/883] 730079=constant_path_node_test
I, [2024-05-25T07:19:48.706226 #688717]  INFO -- : [221/883] 730079=test_stringify_symbols
I, [2024-05-25T07:19:48.713406 #688717]  INFO -- : [222/883] 730079=test_instrumentation_api
I, [2024-05-25T07:19:48.787890 #688717]  INFO -- : [223/883] 730077=integer_parse_test
I, [2024-05-25T07:19:48.795745 #688717]  INFO -- : [224/883] 730077=test_boolean
I, [2024-05-25T07:19:48.811459 #688717]  INFO -- : [225/883] 730077=test_rdoc_generator_markup
I, [2024-05-25T07:19:48.865941 #688717]  INFO -- : [226/883] 730082=test_whileuntil
I, [2024-05-25T07:19:48.868703 #688717]  INFO -- : [227/883] 730082=test_buffered_io
I, [2024-05-25T07:19:48.872367 #688717]  INFO -- : [228/883] 730082=test_monitor
I, [2024-05-25T07:19:48.886631 #688717]  INFO -- : [229/883] 730084=test_rubyvm
I, [2024-05-25T07:19:48.890900 #688717]  INFO -- : [230/883] 730084=test_configuration
I, [2024-05-25T07:19:48.910074 #688717]  INFO -- : [231/883] 730072=test_evaluation
I, [2024-05-25T07:19:48.926592 #688717]  INFO -- : [232/883] 730072=test_gem_ext_builder
I, [2024-05-25T07:19:48.950889 #688717]  INFO -- : [233/883] 730077=test_https
I, [2024-05-25T07:19:48.978986 #688717]  INFO -- : [234/883] 730084=test_load
I, [2024-05-25T07:19:48.979990 #688717]  INFO -- : [235/883] 730084=test_gem_commands_rebuild_command
I, [2024-05-25T07:19:49.011983 #688717]  INFO -- : [236/883] 730067=test_yamldbm
I, [2024-05-25T07:19:49.017185 #688717]  INFO -- : [237/883] 730067=test_rdoc_parser_simple
I, [2024-05-25T07:19:49.046080 #688717]  INFO -- : [238/883] 730067=test_provider
I, [2024-05-25T07:19:49.050078 #688717]  INFO -- : [239/883] 730084=test_abi
I, [2024-05-25T07:19:49.085315 #688717]  INFO -- : [240/883] 730082=test_array
I, [2024-05-25T07:19:49.101855 #688717]  INFO -- : [241/883] 730086=test_gem_package_tar_writer
I, [2024-05-25T07:19:49.223480 #688717]  INFO -- : [242/883] 730086=test_helper_method
I, [2024-05-25T07:19:49.226886 #688717]  INFO -- : [243/883] 730086=test_gem_commands_outdated_command
I, [2024-05-25T07:19:49.228825 #688717]  INFO -- : [244/883] 730084=test_scalar_scanner
I, [2024-05-25T07:19:49.241575 #688717]  INFO -- : [245/883] 730084=test_gem_source
I, [2024-05-25T07:19:49.259247 #688717]  INFO -- : [246/883] 730083=test_nesting_parser
I, [2024-05-25T07:19:49.275252 #688717]  INFO -- : [247/883] 730086=test_win32ole_method_event
I, [2024-05-25T07:19:49.278094 #688717]  INFO -- : [248/883] 730086=test_benchmark
I, [2024-05-25T07:19:49.314245 #688717]  INFO -- : [249/883] 730077=test_gem_dependency_list
I, [2024-05-25T07:19:49.363127 #688717]  INFO -- : [250/883] 730083=test_spell_checker
I, [2024-05-25T07:19:49.370761 #688717]  INFO -- : [251/883] 730083=attribute_write_test
I, [2024-05-25T07:19:49.403076 #688717]  INFO -- : [252/883] 730067=test_propertyputref
I, [2024-05-25T07:19:49.404775 #688717]  INFO -- : [253/883] 730067=test_assembler
I, [2024-05-25T07:19:49.406256 #688717]  INFO -- : [254/883] 730067=test_rational2
I, [2024-05-25T07:19:49.412937 #688717]  INFO -- : [255/883] 730077=test_rational
I, [2024-05-25T07:19:49.417388 #688717]  INFO -- : [256/883] 730067=test_gem_commands_cert_command
I, [2024-05-25T07:19:49.424974 #688717]  INFO -- : [257/883] 730083=test_completion
I, [2024-05-25T07:19:49.427626 #688717]  INFO -- : [258/883] 730077=test_yield_block
I, [2024-05-25T07:19:49.433391 #688717]  INFO -- : [259/883] 730077=test_len
I, [2024-05-25T07:19:49.441138 #688717]  INFO -- : [260/883] 730077=test_gem_source_installed
I, [2024-05-25T07:19:49.446495 #688717]  INFO -- : [261/883] 730084=test_x509ext
I, [2024-05-25T07:19:49.448924 #688717]  INFO -- : [262/883] 730084=test_erb
I, [2024-05-25T07:19:49.453451 #688717]  INFO -- : [263/883] 730077=test_windows_1252
I, [2024-05-25T07:19:49.461240 #688717]  INFO -- : [264/883] 730077=test_input_method
I, [2024-05-25T07:19:49.489639 #688717]  INFO -- : [265/883] 730084=test_process
I, [2024-05-25T07:19:49.501551 #688717]  INFO -- : [266/883] 730084=test_x509crl
I, [2024-05-25T07:19:49.564064 #688717]  INFO -- : [267/883] 730077=test_signal
I, [2024-05-25T07:19:49.619866 #688717]  INFO -- : [268/883] 730071=test_fixnum
I, [2024-05-25T07:19:49.639322 #688717]  INFO -- : [269/883] 730071=test_rdoc_top_level
I, [2024-05-25T07:19:49.675847 #688717]  INFO -- : [270/883] 730084=test_metaclass
I, [2024-05-25T07:19:49.684495 #688717]  INFO -- : [271/883] 730084=test_cgi_session
I, [2024-05-25T07:19:49.699617 #688717]  INFO -- : [272/883] 730084=test_rdoc_rd
I, [2024-05-25T07:19:49.760826 #688717]  INFO -- : [273/883] 730072=test_gem_resolver_installer_set
I, [2024-05-25T07:19:49.833972 #688717]  INFO -- : [274/883] 730084=test_dir_m17n
I, [2024-05-25T07:19:49.861178 #688717]  INFO -- : [275/883] 730083=test_gem_source_git
I, [2024-05-25T07:19:49.988079 #688717]  INFO -- : [276/883] 730072=test_regex_casefold
I, [2024-05-25T07:19:50.108237 #688717]  INFO -- : [277/883] 730068=test_refinement
I, [2024-05-25T07:19:50.115275 #688717]  INFO -- : [278/883] 730073=test_gem_commands_signout_command
I, [2024-05-25T07:19:50.120509 #688717]  INFO -- : [279/883] 730071=test_require
I, [2024-05-25T07:19:50.127900 #688717]  INFO -- : [280/883] 730073=test_cgi_cookie
I, [2024-05-25T07:19:50.152002 #688717]  INFO -- : [281/883] 730073=test_float
I, [2024-05-25T07:19:50.351396 #688717]  INFO -- : [282/883] 730072=test_gem_resolver_git_set
I, [2024-05-25T07:19:50.412064 #688717]  INFO -- : [283/883] 730081=test_storage
I, [2024-05-25T07:19:50.417719 #688717]  INFO -- : [284/883] 730081=test_gem_security_signer
I, [2024-05-25T07:19:50.473215 #688717]  INFO -- : [285/883] 730083=test_cipher
I, [2024-05-25T07:19:50.513611 #688717]  INFO -- : [286/883] 730083=test_new
I, [2024-05-25T07:19:50.522741 #688717]  INFO -- : [287/883] 730083=test_shellwords
I, [2024-05-25T07:19:50.525812 #688717]  INFO -- : [288/883] 730083=pattern_test
I, [2024-05-25T07:19:50.532116 #688717]  INFO -- : [289/883] 730086=test_memory_view
I, [2024-05-25T07:19:50.549710 #688717]  INFO -- : [290/883] 730086=test_debug
I, [2024-05-25T07:19:50.552687 #688717]  INFO -- : [291/883] 730083=test_omap
I, [2024-05-25T07:19:50.554604 #688717]  INFO -- : [292/883] 730086=test_string
I, [2024-05-25T07:19:50.560787 #688717]  INFO -- : [293/883] 730086=test_iterator
I, [2024-05-25T07:19:50.577332 #688717]  INFO -- : [294/883] 730083=test_digest_extend
I, [2024-05-25T07:19:50.597098 #688717]  INFO -- : [295/883] 730083=test_variable
I, [2024-05-25T07:19:50.621455 #688717]  INFO -- : [296/883] 730086=fuzzer_test
I, [2024-05-25T07:19:50.658322 #688717]  INFO -- : [297/883] 730072=test_sexp
I, [2024-05-25T07:19:50.659524 #688717]  INFO -- : [298/883] 730081=test_rdoc_markup_include
I, [2024-05-25T07:19:50.668488 #688717]  INFO -- : [299/883] 730072=test_rdoc_markup_to_html_snippet
I, [2024-05-25T07:19:50.686061 #688717]  INFO -- : [300/883] 730083=magic_comment_test
I, [2024-05-25T07:19:50.693622 #688717]  INFO -- : [301/883] 730083=test_struct
I, [2024-05-25T07:19:50.704404 #688717]  INFO -- : [302/883] 730083=test_cparser
I, [2024-05-25T07:19:50.710993 #688717]  INFO -- : [303/883] 730086=test_pkg_config
I, [2024-05-25T07:19:50.735073 #688717]  INFO -- : [304/883] 730086=test_config
I, [2024-05-25T07:19:50.756015 #688717]  INFO -- : [305/883] 730072=json_parser_test
I, [2024-05-25T07:19:50.763156 #688717]  INFO -- : [306/883] 730086=test_nomethod_error
I, [2024-05-25T07:19:50.769246 #688717]  INFO -- : [307/883] 730086=json_common_interface_test
I, [2024-05-25T07:19:50.785962 #688717]  INFO -- : [308/883] 730086=test_gem_source_subpath_problem
I, [2024-05-25T07:19:50.799727 #688717]  INFO -- : [309/883] 730072=test_dln
I, [2024-05-25T07:19:50.800257 #688717]  INFO -- : [310/883] 730072=test_win32ole_variant_outarg
I, [2024-05-25T07:19:50.802072 #688717]  INFO -- : [311/883] 730081=test_rdoc_rd_inline
I, [2024-05-25T07:19:50.804316 #688717]  INFO -- : [312/883] 730072=test_x509req
I, [2024-05-25T07:19:50.808465 #688717]  INFO -- : [313/883] 730081=test_mutex
I, [2024-05-25T07:19:50.820016 #688717]  INFO -- : [314/883] 730069=test_struct
I, [2024-05-25T07:19:50.866894 #688717]  INFO -- : [315/883] 730086=test_gem_path_support
I, [2024-05-25T07:19:50.902436 #688717]  INFO -- : [316/883] 730086=test_set
I, [2024-05-25T07:19:50.917702 #688717]  INFO -- : [317/883] 730086=test_files_test_1
I, [2024-05-25T07:19:50.996591 #688717]  INFO -- : [318/883] 730072=test_color_printer
I, [2024-05-25T07:19:51.066562 #688717]  INFO -- : [319/883] 730072=test_deprecated
I, [2024-05-25T07:19:51.074966 #688717]  INFO -- : [320/883] 730072=test_insns_leaf
I, [2024-05-25T07:19:51.081276 #688717]  INFO -- : [321/883] 730072=test_serialize_subclasses
I, [2024-05-25T07:19:51.086294 #688717]  INFO -- : [322/883] 730072=test_key_error
I, [2024-05-25T07:19:51.088926 #688717]  INFO -- : [323/883] 730072=test_win32ole_variant_m
I, [2024-05-25T07:19:51.089936 #688717]  INFO -- : [324/883] 730072=test_engine
I, [2024-05-25T07:19:51.091840 #688717]  INFO -- : [325/883] 730072=test_allocation
I, [2024-05-25T07:19:51.137363 #688717]  INFO -- : [326/883] 730069=test_div
I, [2024-05-25T07:19:51.144761 #688717]  INFO -- : [327/883] 730069=test_option
I, [2024-05-25T07:19:51.184335 #688717]  INFO -- : [328/883] 730083=test_append
I, [2024-05-25T07:19:51.187439 #688717]  INFO -- : [329/883] 730083=test_tracer
I, [2024-05-25T07:19:51.189588 #688717]  INFO -- : [330/883] 730083=test_cmethod
I, [2024-05-25T07:19:51.193426 #688717]  INFO -- : [331/883] 730083=test_did_you_mean
I, [2024-05-25T07:19:51.204730 #688717]  INFO -- : [332/883] 730084=test_io_m17n
I, [2024-05-25T07:19:51.221747 #688717]  INFO -- : [333/883] 730076=test_variable_name_check
I, [2024-05-25T07:19:51.253480 #688717]  INFO -- : [334/883] 730076=test_gem_commands_server_command
I, [2024-05-25T07:19:51.255452 #688717]  INFO -- : [335/883] 730076=test_case_comprehensive
I, [2024-05-25T07:19:51.296318 #688717]  INFO -- : [336/883] 730069=test_interned_str
I, [2024-05-25T07:19:51.299472 #688717]  INFO -- : [337/883] 730069=test_gem_commands_build_command
I, [2024-05-25T07:19:51.307279 #688717]  INFO -- : [338/883] 730083=test_scheduler
I, [2024-05-25T07:19:51.451646 #688717]  INFO -- : [339/883] 730083=test_ocsp
I, [2024-05-25T07:19:51.505074 #688717]  INFO -- : [340/883] 730069=test_class
I, [2024-05-25T07:19:51.506563 #688717]  INFO -- : [341/883] 730069=test_pkey_dsa
I, [2024-05-25T07:19:51.567265 #688717]  INFO -- : [342/883] 730067=test_exception_at_throwing
I, [2024-05-25T07:19:51.646199 #688717]  INFO -- : [343/883] 730067=test_iseq
I, [2024-05-25T07:19:51.688900 #688717]  INFO -- : [344/883] 730079=test_rdoc_markup_heading
I, [2024-05-25T07:19:51.698859 #688717]  INFO -- : [345/883] 730079=test_pinned
I, [2024-05-25T07:19:51.712777 #688717]  INFO -- : [346/883] 730077=test_rdoc_markup_pre_process
I, [2024-05-25T07:19:51.737866 #688717]  INFO -- : [347/883] 730079=test_printf
I, [2024-05-25T07:19:51.749128 #688717]  INFO -- : [348/883] 730079=test_stream
I, [2024-05-25T07:19:51.757580 #688717]  INFO -- : [349/883] 730079=test_to_ary_concat
I, [2024-05-25T07:19:51.779402 #688717]  INFO -- : [350/883] 730073=test_webauthn_listener_response
I, [2024-05-25T07:19:51.803496 #688717]  INFO -- : [351/883] 730073=test_time
I, [2024-05-25T07:19:51.813221 #688717]  INFO -- : [352/883] 730083=test_beginendblock
I, [2024-05-25T07:19:51.888547 #688717]  INFO -- : [353/883] 730077=test_files_lib
I, [2024-05-25T07:19:51.944141 #688717]  INFO -- : [354/883] 730081=test_gem_commands_unpack_command
I, [2024-05-25T07:19:51.974968 #688717]  INFO -- : [355/883] 730073=test_rdoc_markup_to_bs
I, [2024-05-25T07:19:52.139954 #688717]  INFO -- : [356/883] 730073=test_help
I, [2024-05-25T07:19:52.145002 #688717]  INFO -- : [357/883] 730073=test_within_pipe
I, [2024-05-25T07:19:52.165719 #688717]  INFO -- : [358/883] 730073=test_emoji_breaks
I, [2024-05-25T07:19:52.170981 #688717]  INFO -- : [359/883] 730073=test_gem_bundler_version_finder
I, [2024-05-25T07:19:52.204745 #688717]  INFO -- : [360/883] 730073=reflection_test
I, [2024-05-25T07:19:52.216861 #688717]  INFO -- : [361/883] 730073=test_open3
I, [2024-05-25T07:19:52.251837 #688717]  INFO -- : [362/883] 730081=test_multi_irb_commands
I, [2024-05-25T07:19:52.252441 #688717]  INFO -- : [363/883] 730081=test_fiber
I, [2024-05-25T07:19:52.304845 #688717]  INFO -- : [364/883] 730067=test_bundled_ca
I, [2024-05-25T07:19:52.348455 #688717]  INFO -- : [365/883] 730083=test_closure
I, [2024-05-25T07:19:52.589738 #688717]  INFO -- : [366/883] 730084=test_digest
I, [2024-05-25T07:19:52.596622 #688717]  INFO -- : [367/883] 730084=test_gem_security
I, [2024-05-25T07:19:52.609927 #688717]  INFO -- : [368/883] 730083=test_rdoc_servlet
I, [2024-05-25T07:19:52.625433 #688717]  INFO -- : [369/883] 730074=test_ractor
I, [2024-05-25T07:19:52.671062 #688717]  INFO -- : [370/883] 730074=test_recursion
I, [2024-05-25T07:19:52.676161 #688717]  INFO -- : [371/883] 730074=test_exit
I, [2024-05-25T07:19:52.680690 #688717]  INFO -- : [372/883] 730069=test_popen_deadlock
I, [2024-05-25T07:19:52.874729 #688717]  INFO -- : [373/883] 730083=test_delegate
I, [2024-05-25T07:19:52.890179 #688717]  INFO -- : [374/883] 730083=test_mkmf
I, [2024-05-25T07:19:52.905308 #688717]  INFO -- : [375/883] 730083=test_date_marshal
I, [2024-05-25T07:19:52.908264 #688717]  INFO -- : [376/883] 730083=test_history
I, [2024-05-25T07:19:52.923855 #688717]  INFO -- : [377/883] 730083=test_rdoc_i18n_locale
I, [2024-05-25T07:19:52.935275 #688717]  INFO -- : [378/883] 730083=test_chilled
I, [2024-05-25T07:19:52.942884 #688717]  INFO -- : [379/883] 730074=test_name_error_extension
I, [2024-05-25T07:19:52.944255 #688717]  INFO -- : [380/883] 730083=test_acceptable
I, [2024-05-25T07:19:52.946133 #688717]  INFO -- : [381/883] 730071=test_rdoc_generator_pot_po_entry
I, [2024-05-25T07:19:52.948845 #688717]  INFO -- : [382/883] 730074=test_euc_jp
I, [2024-05-25T07:19:52.950671 #688717]  INFO -- : [383/883] 730074=test_document
I, [2024-05-25T07:19:52.953022 #688717]  INFO -- : [384/883] 730071=test_pair
I, [2024-05-25T07:19:52.985847 #688717]  INFO -- : [385/883] 730074=test_win32ole_param
I, [2024-05-25T07:19:52.993615 #688717]  INFO -- : [386/883] 730074=test_gem_commands_yank_command
I, [2024-05-25T07:19:53.009878 #688717]  INFO -- : [387/883] 730083=test_rbconfig
I, [2024-05-25T07:19:53.015594 #688717]  INFO -- : [388/883] 730083=test_primitive
I, [2024-05-25T07:19:53.019019 #688717]  INFO -- : [389/883] 730083=test_human_typo
I, [2024-05-25T07:19:53.036148 #688717]  INFO -- : [390/883] 730083=test_key_stroke
I, [2024-05-25T07:19:53.042288 #688717]  INFO -- : [391/883] 730083=json_encoding_test
I, [2024-05-25T07:19:53.054295 #688717]  INFO -- : [392/883] 730083=test_color
I, [2024-05-25T07:19:53.066122 #688717]  INFO -- : [393/883] 730068=test_sockopt
I, [2024-05-25T07:19:53.074076 #688717]  INFO -- : [394/883] 730068=test_rdoc_markup_to_label
I, [2024-05-25T07:19:53.101585 #688717]  INFO -- : [395/883] 730068=test_install
I, [2024-05-25T07:19:53.113466 #688717]  INFO -- : [396/883] 730083=test_rdoc_ri_driver
I, [2024-05-25T07:19:53.146174 #688717]  INFO -- : [397/883] 730079=test_httpheader
I, [2024-05-25T07:19:53.168303 #688717]  INFO -- : [398/883] 730082=test_gem_resolver_local_specification
I, [2024-05-25T07:19:53.194415 #688717]  INFO -- : [399/883] 730082=test_set_len
I, [2024-05-25T07:19:53.198291 #688717]  INFO -- : [400/883] 730079=test_encoding
I, [2024-05-25T07:19:53.199266 #688717]  INFO -- : [401/883] 730082=test_httpresponses
I, [2024-05-25T07:19:53.203634 #688717]  INFO -- : [402/883] 730082=test_tree_spell_checker
I, [2024-05-25T07:19:53.212789 #688717]  INFO -- : [403/883] 730079=test_http
I, [2024-05-25T07:19:53.235483 #688717]  INFO -- : [404/883] 730082=test_addrinfo
I, [2024-05-25T07:19:53.258024 #688717]  INFO -- : [405/883] 730082=test_win32ole_param_event
I, [2024-05-25T07:19:53.261614 #688717]  INFO -- : [406/883] 730082=test_bn
I, [2024-05-25T07:19:53.278882 #688717]  INFO -- : [407/883] 730082=redundant_return_test
I, [2024-05-25T07:19:53.286893 #688717]  INFO -- : [408/883] 730082=test_case_mapping
I, [2024-05-25T07:19:53.293939 #688717]  INFO -- : [409/883] 730082=test_path
I, [2024-05-25T07:19:53.302852 #688717]  INFO -- : [410/883] 730082=test_terminfo
I, [2024-05-25T07:19:53.303294 #688717]  INFO -- : [411/883] 730082=test_compile_prism
I, [2024-05-25T07:19:53.315781 #688717]  INFO -- : [412/883] 730069=test_bug-14834
I, [2024-05-25T07:19:53.322360 #688717]  INFO -- : [413/883] 730068=test_rdoc_markup_to_html
I, [2024-05-25T07:19:53.351056 #688717]  INFO -- : [414/883] 730083=test_date_compat
I, [2024-05-25T07:19:53.351620 #688717]  INFO -- : [415/883] 730067=test_gem_resolver_vendor_specification
I, [2024-05-25T07:19:53.353185 #688717]  INFO -- : [416/883] 730083=test_gem_commands_update_command
I, [2024-05-25T07:19:53.375390 #688717]  INFO -- : [417/883] 730067=test_notimplement
I, [2024-05-25T07:19:53.378724 #688717]  INFO -- : [418/883] 730067=test_random
I, [2024-05-25T07:19:53.386366 #688717]  INFO -- : [419/883] 730067=test_gem_uri
I, [2024-05-25T07:19:53.399390 #688717]  INFO -- : [420/883] 730069=test_key_event_record
I, [2024-05-25T07:19:53.409333 #688717]  INFO -- : [421/883] 730067=test_ssl_session
I, [2024-05-25T07:19:53.419438 #688717]  INFO -- : [422/883] 730068=test_thread_cv
I, [2024-05-25T07:19:53.459009 #688717]  INFO -- : [423/883] 730074=test_lexer
I, [2024-05-25T07:19:53.464788 #688717]  INFO -- : [424/883] 730074=test_rdoc_generator_pot
I, [2024-05-25T07:19:53.481095 #688717]  INFO -- : [425/883] 730069=test_unicode
I, [2024-05-25T07:19:53.487399 #688717]  INFO -- : [426/883] 730069=test_enumerator
I, [2024-05-25T07:19:53.490465 #688717]  INFO -- : [427/883] 730069=test_rdoc_parser_changelog
I, [2024-05-25T07:19:53.528893 #688717]  INFO -- : [428/883] 730082=parameters_signature_test
I, [2024-05-25T07:19:53.533666 #688717]  INFO -- : [429/883] 730082=test_koi8
I, [2024-05-25T07:19:53.534226 #688717]  INFO -- : [430/883] 730082=test_rdoc_method_attr
I, [2024-05-25T07:19:53.556316 #688717]  INFO -- : [431/883] 730069=test_data
I, [2024-05-25T07:19:53.563647 #688717]  INFO -- : [432/883] 730069=static_literals_test
I, [2024-05-25T07:19:53.565441 #688717]  INFO -- : [433/883] 730069=test_filter
I, [2024-05-25T07:19:53.599490 #688717]  INFO -- : [434/883] 730069=test_gem_gem_runner
I, [2024-05-25T07:19:53.609707 #688717]  INFO -- : [435/883] 730074=test_remote_fetch_error
I, [2024-05-25T07:19:53.619573 #688717]  INFO -- : [436/883] 730074=test_have_library
I, [2024-05-25T07:19:53.648741 #688717]  INFO -- : [437/883] 730069=test_lock_native_thread
I, [2024-05-25T07:19:53.769352 #688717]  INFO -- : [438/883] 730082=test_c_struct_entry
I, [2024-05-25T07:19:53.797518 #688717]  INFO -- : [439/883] 730085=test_gem_commands_stale_command
I, [2024-05-25T07:19:53.894420 #688717]  INFO -- : [440/883] 730072=test_set
I, [2024-05-25T07:19:53.903133 #688717]  INFO -- : [441/883] 730072=test_show_source
I, [2024-05-25T07:19:53.922697 #688717]  INFO -- : [442/883] 730069=comments_test
I, [2024-05-25T07:19:53.926024 #688717]  INFO -- : [443/883] 730069=test_gem_requirement
I, [2024-05-25T07:19:53.969041 #688717]  INFO -- : [444/883] 730082=test_sprintf
I, [2024-05-25T07:19:53.973444 #688717]  INFO -- : [445/883] 730072=test_string_memory
I, [2024-05-25T07:19:53.993961 #688717]  INFO -- : [446/883] 730085=test_gem_security_trust_dir
I, [2024-05-25T07:19:54.033349 #688717]  INFO -- : [447/883] 730085=test_undef
I, [2024-05-25T07:19:54.037341 #688717]  INFO -- : [448/883] 730085=test_objspace
I, [2024-05-25T07:19:54.039773 #688717]  INFO -- : [449/883] 730072=ripper_test
I, [2024-05-25T07:19:54.049266 #688717]  INFO -- : [450/883] 730068=test_line_editor
I, [2024-05-25T07:19:54.058105 #688717]  INFO -- : [451/883] 730086=test_kill_ring
I, [2024-05-25T07:19:54.067397 #688717]  INFO -- : [452/883] 730069=test_framework
I, [2024-05-25T07:19:54.069725 #688717]  INFO -- : [453/883] 730086=test_ns_spki
I, [2024-05-25T07:19:54.082347 #688717]  INFO -- : [454/883] 730069=test_argf
I, [2024-05-25T07:19:54.089954 #688717]  INFO -- : [455/883] 730086=test_gem_commands_environment_command
I, [2024-05-25T07:19:54.122629 #688717]  INFO -- : [456/883] 730068=test_m17n
I, [2024-05-25T07:19:54.128174 #688717]  INFO -- : [457/883] 730082=test_ws
I, [2024-05-25T07:19:54.132073 #688717]  INFO -- : [458/883] 730082=test_yjit
I, [2024-05-25T07:19:54.135461 #688717]  INFO -- : [459/883] 730086=test_workspace
I, [2024-05-25T07:19:54.139493 #688717]  INFO -- : [460/883] 730082=test_weakmap
I, [2024-05-25T07:19:54.210973 #688717]  INFO -- : [461/883] 730068=test_protect
I, [2024-05-25T07:19:54.215388 #688717]  INFO -- : [462/883] 730068=test_win32ole_typelib
I, [2024-05-25T07:19:54.220226 #688717]  INFO -- : [463/883] 730068=test_gem_request_set_lockfile
I, [2024-05-25T07:19:54.237745 #688717]  INFO -- : [464/883] 730086=test_raise_exception
I, [2024-05-25T07:19:54.469763 #688717]  INFO -- : [465/883] 730072=test_postponed_job
I, [2024-05-25T07:19:54.494993 #688717]  INFO -- : [466/883] 730067=test_alias_and_anchor
I, [2024-05-25T07:19:54.504398 #688717]  INFO -- : [467/883] 730067=test_external_new
I, [2024-05-25T07:19:54.511256 #688717]  INFO -- : [468/883] 730067=test_gem_resolver_dependency_request
I, [2024-05-25T07:19:54.532342 #688717]  INFO -- : [469/883] 730067=test_tree_builder
I, [2024-05-25T07:19:54.533778 #688717]  INFO -- : [470/883] 730083=test_hash
I, [2024-05-25T07:19:54.535348 #688717]  INFO -- : [471/883] 730067=test_gem_commands_uninstall_command
I, [2024-05-25T07:19:54.546768 #688717]  INFO -- : [472/883] 730083=test_condition
I, [2024-05-25T07:19:54.554633 #688717]  INFO -- : [473/883] 730083=test_gem_source_specific_file
I, [2024-05-25T07:19:54.623462 #688717]  INFO -- : [474/883] 730083=test_foreach
I, [2024-05-25T07:19:54.629194 #688717]  INFO -- : [475/883] 730083=test_cp949
I, [2024-05-25T07:19:54.631381 #688717]  INFO -- : [476/883] 730083=test_win32ole_record
I, [2024-05-25T07:19:54.635656 #688717]  INFO -- : [477/883] 730083=test_gem_unsatisfiable_dependency_error
I, [2024-05-25T07:19:54.648851 #688717]  INFO -- : [478/883] 730083=test_hash
I, [2024-05-25T07:19:54.676321 #688717]  INFO -- : [479/883] 730068=test_ubf_async_safe
I, [2024-05-25T07:19:54.687409 #688717]  INFO -- : [480/883] 730068=test_sorted_set
I, [2024-05-25T07:19:54.713513 #688717]  INFO -- : [481/883] 730074=test_emoji
I, [2024-05-25T07:19:54.737523 #688717]  INFO -- : [482/883] 730074=test_win32ole_type_event
I, [2024-05-25T07:19:54.742844 #688717]  INFO -- : [483/883] 730074=test_io
I, [2024-05-25T07:19:54.754719 #688717]  INFO -- : [484/883] 730073=test_date_attr
I, [2024-05-25T07:19:54.779474 #688717]  INFO -- : [485/883] 730073=test_ellipsize
I, [2024-05-25T07:19:54.791769 #688717]  INFO -- : [486/883] 730073=warnings_test
I, [2024-05-25T07:19:54.795590 #688717]  INFO -- : [487/883] 730072=test_kwargs
I, [2024-05-25T07:19:54.795939 #688717]  INFO -- : [488/883] 730072=test_io_wait
I, [2024-05-25T07:19:54.802186 #688717]  INFO -- : [489/883] 730073=test_gem_commands_exec_command
I, [2024-05-25T07:19:54.878262 #688717]  INFO -- : [490/883] 730068=test_type_completor
I, [2024-05-25T07:19:54.888400 #688717]  INFO -- : [491/883] 730068=test_summary
I, [2024-05-25T07:19:54.900874 #688717]  INFO -- : [492/883] 730086=test_console_attr
I, [2024-05-25T07:19:54.904796 #688717]  INFO -- : [493/883] 730086=test_euc_kr
I, [2024-05-25T07:19:54.907062 #688717]  INFO -- : [494/883] 730086=test_rdoc_context_section
I, [2024-05-25T07:19:54.940078 #688717]  INFO -- : [495/883] 730070=test_ftp
I, [2024-05-25T07:19:54.949815 #688717]  INFO -- : [496/883] 730077=test_pattern_key_name_check
I, [2024-05-25T07:19:54.956416 #688717]  INFO -- : [497/883] 730070=test_to_ruby
I, [2024-05-25T07:19:54.959773 #688717]  INFO -- : [498/883] 730077=test_pack
I, [2024-05-25T07:19:54.969535 #688717]  INFO -- : [499/883] 730070=test_array_create
I, [2024-05-25T07:19:54.974266 #688717]  INFO -- : [500/883] 730070=test_gem_impossible_dependencies_error
I, [2024-05-25T07:19:54.977279 #688717]  INFO -- : [501/883] 730070=test_gem_commands_query_command
I, [2024-05-25T07:19:54.982039 #688717]  INFO -- : [502/883] 730074=test_method
I, [2024-05-25T07:19:55.026314 #688717]  INFO -- : [503/883] 730068=test_rdoc_rubygems_hook
I, [2024-05-25T07:19:55.029987 #688717]  INFO -- : [504/883] 730086=test_etc
I, [2024-05-25T07:19:55.088036 #688717]  INFO -- : [505/883] 730068=test_yjit_exit_locations
I, [2024-05-25T07:19:55.092690 #688717]  INFO -- : [506/883] 730068=test_gem_resolver_activation_request
I, [2024-05-25T07:19:55.102756 #688717]  INFO -- : [507/883] 730068=test_getopts
I, [2024-05-25T07:19:55.107941 #688717]  INFO -- : [508/883] 730086=test_protocol
I, [2024-05-25T07:19:55.111479 #688717]  INFO -- : [509/883] 730068=test_ripper
I, [2024-05-25T07:19:55.126857 #688717]  INFO -- : [510/883] 730072=test_gem_config_file
I, [2024-05-25T07:19:55.212743 #688717]  INFO -- : [511/883] 730077=test_gem_util
I, [2024-05-25T07:19:55.227075 #688717]  INFO -- : [512/883] 730072=test_iseq_load
I, [2024-05-25T07:19:55.312613 #688717]  INFO -- : [513/883] 730067=test_gem_package_tar_header
I, [2024-05-25T07:19:55.344018 #688717]  INFO -- : [514/883] 730067=test_pkey_dh
I, [2024-05-25T07:19:55.380793 #688717]  INFO -- : [515/883] 730077=test_bigzero
I, [2024-05-25T07:19:55.388031 #688717]  INFO -- : [516/883] 730077=test_pkcs12
I, [2024-05-25T07:19:55.418234 #688717]  INFO -- : [517/883] 730086=test_system
I, [2024-05-25T07:19:55.420782 #688717]  INFO -- : [518/883] 730067=test_rendering
I, [2024-05-25T07:19:55.435887 #688717]  INFO -- : [519/883] 730068=test_face
I, [2024-05-25T07:19:55.448660 #688717]  INFO -- : [520/883] 730068=test_sizeof
I, [2024-05-25T07:19:55.459090 #688717]  INFO -- : [521/883] 730070=test_case
I, [2024-05-25T07:19:55.490941 #688717]  INFO -- : [522/883] 730070=test_unicode_escape
I, [2024-05-25T07:19:55.521779 #688717]  INFO -- : [523/883] 730067=test_io
I, [2024-05-25T07:19:55.583182 #688717]  INFO -- : [524/883] 730070=test_utf16
I, [2024-05-25T07:19:55.595283 #688717]  INFO -- : [525/883] 730070=test_autoload
I, [2024-05-25T07:19:55.621056 #688717]  INFO -- : [526/883] 730075=test_config
I, [2024-05-25T07:19:55.690489 #688717]  INFO -- : [527/883] 730075=test_sleep
I, [2024-05-25T07:19:55.729178 #688717]  INFO -- : [528/883] 730073=test_gem_commands_fetch_command
I, [2024-05-25T07:19:55.763756 #688717]  INFO -- : [529/883] 730077=test_math
I, [2024-05-25T07:19:55.767934 #688717]  INFO -- : [530/883] 730077=test_gc
I, [2024-05-25T07:19:55.772003 #688717]  INFO -- : [531/883] 730077=test_libs
I, [2024-05-25T07:19:55.804648 #688717]  INFO -- : [532/883] 730077=test_yaml_tree
I, [2024-05-25T07:19:55.822682 #688717]  INFO -- : [533/883] 730077=test_readpartial
I, [2024-05-25T07:19:55.890795 #688717]  INFO -- : [534/883] 730073=test_gem_commands_install_command
I, [2024-05-25T07:19:56.244554 #688717]  INFO -- : [535/883] 730077=test_clone
I, [2024-05-25T07:19:56.277988 #688717]  INFO -- : [536/883] 730086=test_rdoc_require
I, [2024-05-25T07:19:56.315646 #688717]  INFO -- : [537/883] 730086=locals_test
I, [2024-05-25T07:19:56.319160 #688717]  INFO -- : [538/883] 730072=test_rdoc_markup_indented_paragraph
I, [2024-05-25T07:19:56.328942 #688717]  INFO -- : [539/883] 730072=test_rdoc_task
I, [2024-05-25T07:19:56.332230 #688717]  INFO -- : [540/883] 730072=test_gem_resolver_conflict
I, [2024-05-25T07:19:56.341198 #688717]  INFO -- : [541/883] 730072=ruby_parser_test
I, [2024-05-25T07:19:56.348946 #688717]  INFO -- : [542/883] 730072=test_backtrace
I, [2024-05-25T07:19:56.361721 #688717]  INFO -- : [543/883] 730071=test_pack
I, [2024-05-25T07:19:56.379042 #688717]  INFO -- : [544/883] 730071=test_io_buffer
I, [2024-05-25T07:19:56.423064 #688717]  INFO -- : [545/883] 730077=test_yield
I, [2024-05-25T07:19:56.486866 #688717]  INFO -- : [546/883] 730071=test_rdoc_alias
I, [2024-05-25T07:19:56.495929 #688717]  INFO -- : [547/883] 730071=test_convertible
I, [2024-05-25T07:19:56.599607 #688717]  INFO -- : [548/883] 730086=parser_test
I, [2024-05-25T07:19:56.600505 #688717]  INFO -- : [549/883] 730086=test_files_sample
I, [2024-05-25T07:19:56.600929 #688717]  INFO -- : [550/883] 730086=test_stringscanner
I, [2024-05-25T07:19:56.641095 #688717]  INFO -- : [551/883] 730086=test_gem_resolver_best_set
I, [2024-05-25T07:19:56.711324 #688717]  INFO -- : [552/883] 730086=encoding_test
I, [2024-05-25T07:19:56.849093 #688717]  INFO -- : [553/883] 730086=test_typeddata
I, [2024-05-25T07:19:57.040663 #688717]  INFO -- : [554/883] 730080=test_rdoc_markup_to_html_crossref
I, [2024-05-25T07:19:57.110539 #688717]  INFO -- : [555/883] 730086=test_rdoc_markup_raw
I, [2024-05-25T07:19:57.120234 #688717]  INFO -- : [556/883] 730086=test_webauthn_poller
I, [2024-05-25T07:19:57.220584 #688717]  INFO -- : [557/883] 730082=test_rat
I, [2024-05-25T07:19:57.224967 #688717]  INFO -- : [558/883] 730082=test_optparse
I, [2024-05-25T07:19:57.237275 #688717]  INFO -- : [559/883] 730073=test_array
I, [2024-05-25T07:19:57.244783 #688717]  INFO -- : [560/883] 730073=test_fstring
I, [2024-05-25T07:19:57.256423 #688717]  INFO -- : [561/883] 730086=test_nowrite
I, [2024-05-25T07:19:57.287557 #688717]  INFO -- : [562/883] 730082=test_thread_queue
I, [2024-05-25T07:19:57.293234 #688717]  INFO -- : [563/883] 730086=test_rdoc_markup_formatter
I, [2024-05-25T07:19:57.305535 #688717]  INFO -- : [564/883] 730086=test_bmethod
I, [2024-05-25T07:19:57.313271 #688717]  INFO -- : [565/883] 730086=test_ractor
I, [2024-05-25T07:19:57.325604 #688717]  INFO -- : [566/883] 730086=test_euc_tw
I, [2024-05-25T07:19:57.331240 #688717]  INFO -- : [567/883] 730086=test_ansi_without_terminfo
I, [2024-05-25T07:19:57.337595 #688717]  INFO -- : [568/883] 730086=test_gem_commands_sources_command
I, [2024-05-25T07:19:57.370532 #688717]  INFO -- : [569/883] 730080=test_big2str
I, [2024-05-25T07:19:57.371415 #688717]  INFO -- : [570/883] 730080=test_yaml
I, [2024-05-25T07:19:57.390704 #688717]  INFO -- : [571/883] 730073=test_forwardable
I, [2024-05-25T07:19:57.412733 #688717]  INFO -- : [572/883] 730073=test_wait
I, [2024-05-25T07:19:57.433983 #688717]  INFO -- : [573/883] 730080=test_handle
I, [2024-05-25T07:19:57.490604 #688717]  INFO -- : [574/883] 730073=test_gbk
I, [2024-05-25T07:19:57.496038 #688717]  INFO -- : [575/883] 730073=test_class2name
I, [2024-05-25T07:19:57.499375 #688717]  INFO -- : [576/883] 730073=test_enc_str_buf_cat
I, [2024-05-25T07:19:57.503021 #688717]  INFO -- : [577/883] 730073=test_pstore
I, [2024-05-25T07:19:57.516281 #688717]  INFO -- : [578/883] 730086=test_cstr
I, [2024-05-25T07:19:57.531166 #688717]  INFO -- : [579/883] 730073=test_profile_frames
I, [2024-05-25T07:19:57.619344 #688717]  INFO -- : [580/883] 730080=test_io_timeout
I, [2024-05-25T07:19:57.622943 #688717]  INFO -- : [581/883] 730080=test_shapes
I, [2024-05-25T07:19:57.625368 #688717]  INFO -- : [582/883] 730080=json_fixtures_test
I, [2024-05-25T07:19:57.627729 #688717]  INFO -- : [583/883] 730080=test_comparable
I, [2024-05-25T07:19:57.630470 #688717]  INFO -- : [584/883] 730080=test_rdoc_parser_c
I, [2024-05-25T07:19:57.702567 #688717]  INFO -- : [585/883] 730073=test_fiddle
I, [2024-05-25T07:19:57.739265 #688717]  INFO -- : [586/883] 730075=test_wss
I, [2024-05-25T07:19:57.761174 #688717]  INFO -- : [587/883] 730075=test_ractor
I, [2024-05-25T07:19:57.779510 #688717]  INFO -- : [588/883] 730073=test_find
I, [2024-05-25T07:19:57.788289 #688717]  INFO -- : [589/883] 730073=test_marshalable
I, [2024-05-25T07:19:57.789880 #688717]  INFO -- : [590/883] 730072=test_digest
I, [2024-05-25T07:19:57.792176 #688717]  INFO -- : [591/883] 730073=test_gem_ext_cmake_builder
I, [2024-05-25T07:19:57.807981 #688717]  INFO -- : [592/883] 730073=test_gem_commands_contents_command
I, [2024-05-25T07:19:57.820319 #688717]  INFO -- : [593/883] 730080=test_cgi_util
I, [2024-05-25T07:19:57.872781 #688717]  INFO -- : [594/883] 730075=test_require
I, [2024-05-25T07:19:57.874525 #688717]  INFO -- : [595/883] 730073=test_deprecate
I, [2024-05-25T07:19:57.903642 #688717]  INFO -- : [596/883] 730073=test_rdoc_constant
I, [2024-05-25T07:19:58.003039 #688717]  INFO -- : [597/883] 730073=test_formatter
I, [2024-05-25T07:19:58.009820 #688717]  INFO -- : [598/883] 730073=test_bash_completion
I, [2024-05-25T07:19:58.015425 #688717]  INFO -- : [599/883] 730073=test_gem_source_vendor
I, [2024-05-25T07:19:58.023382 #688717]  INFO -- : [600/883] 730073=test_gem_commands_owner_command
I, [2024-05-25T07:19:58.025982 #688717]  INFO -- : [601/883] 730080=test_recorder
I, [2024-05-25T07:19:58.028520 #688717]  INFO -- : [602/883] 730080=test_coverage
I, [2024-05-25T07:19:58.033662 #688717]  INFO -- : [603/883] 730074=test_rdoc_encoding
I, [2024-05-25T07:19:58.033964 #688717]  INFO -- : [604/883] 730069=regexp_test
I, [2024-05-25T07:19:58.046300 #688717]  INFO -- : [605/883] 730069=test_gem_package_tar_reader
I, [2024-05-25T07:19:58.059547 #688717]  INFO -- : [606/883] 730074=test_init
I, [2024-05-25T07:19:58.097595 #688717]  INFO -- : [607/883] 730069=test_complexrational
I, [2024-05-25T07:19:58.101793 #688717]  INFO -- : [608/883] 730069=test_pathname
I, [2024-05-25T07:19:58.118891 #688717]  INFO -- : [609/883] 730086=test_rdoc_markdown
I, [2024-05-25T07:19:58.252641 #688717]  INFO -- : [610/883] 730069=test_gem_available_set
I, [2024-05-25T07:19:58.268943 #688717]  INFO -- : [611/883] 730083=test_rdoc_any_method
I, [2024-05-25T07:19:58.272386 #688717]  INFO -- : [612/883] 730081=test_modify_expand
I, [2024-05-25T07:19:58.274757 #688717]  INFO -- : [613/883] 730081=test_file
I, [2024-05-25T07:19:58.281046 #688717]  INFO -- : [614/883] 730086=test_class
I, [2024-05-25T07:19:58.295303 #688717]  INFO -- : [615/883] 730081=test_rdoc_normal_class
I, [2024-05-25T07:19:58.322406 #688717]  INFO -- : [616/883] 730069=test_const
I, [2024-05-25T07:19:58.324556 #688717]  INFO -- : [617/883] 730069=json_string_matching_test
I, [2024-05-25T07:19:58.335538 #688717]  INFO -- : [618/883] 730069=test_load
I, [2024-05-25T07:19:58.340565 #688717]  INFO -- : [619/883] 730069=test_random
I, [2024-05-25T07:19:58.340977 #688717]  INFO -- : [620/883] 730069=test_asn1
I, [2024-05-25T07:19:58.357354 #688717]  INFO -- : [621/883] 730069=test_irb
I, [2024-05-25T07:19:58.379573 #688717]  INFO -- : [622/883] 730081=test_rdoc_parser_rd
I, [2024-05-25T07:19:58.402857 #688717]  INFO -- : [623/883] 730081=test_date_strftime
I, [2024-05-25T07:19:58.441383 #688717]  INFO -- : [624/883] 730068=test_yamlstore
I, [2024-05-25T07:19:58.452276 #688717]  INFO -- : [625/883] 730068=test_gem_installer
I, [2024-05-25T07:19:58.521414 #688717]  INFO -- : [626/883] 730074=test_utf32
I, [2024-05-25T07:19:58.525227 #688717]  INFO -- : [627/883] 730069=test_basicsocket
I, [2024-05-25T07:19:58.528548 #688717]  INFO -- : [628/883] 730074=test_duplicate
I, [2024-05-25T07:19:58.531853 #688717]  INFO -- : [629/883] 730074=test_rdoc_markup
I, [2024-05-25T07:19:58.533349 #688717]  INFO -- : [630/883] 730069=test_gem_commands_help_command
I, [2024-05-25T07:19:58.538346 #688717]  INFO -- : [631/883] 730074=test_tracepoint
I, [2024-05-25T07:19:58.556772 #688717]  INFO -- : [632/883] 730084=test_prettyprint
I, [2024-05-25T07:19:58.571944 #688717]  INFO -- : [633/883] 730084=test_internal_ivar
I, [2024-05-25T07:19:58.574820 #688717]  INFO -- : [634/883] 730073=test_gem_resolver_index_specification
I, [2024-05-25T07:19:58.577280 #688717]  INFO -- : [635/883] 730084=test_function
I, [2024-05-25T07:19:58.619764 #688717]  INFO -- : [636/883] 730072=test_queue
I, [2024-05-25T07:19:58.622102 #688717]  INFO -- : [637/883] 730073=test_tempfile
I, [2024-05-25T07:19:58.624088 #688717]  INFO -- : [638/883] 730072=parse_comments_test
I, [2024-05-25T07:19:58.627740 #688717]  INFO -- : [639/883] 730069=test_noarg
I, [2024-05-25T07:19:58.634450 #688717]  INFO -- : [640/883] 730072=test_gem_version
I, [2024-05-25T07:19:58.703194 #688717]  INFO -- : [641/883] 730072=test_rdoc_options
I, [2024-05-25T07:19:58.703974 #688717]  INFO -- : [642/883] 730074=test_econv
I, [2024-05-25T07:19:58.738709 #688717]  INFO -- : [643/883] 730083=test_cesu8
I, [2024-05-25T07:19:58.745480 #688717]  INFO -- : [644/883] 730083=test_fileutils
I, [2024-05-25T07:19:58.789183 #688717]  INFO -- : [645/883] 730081=test_string_processing
I, [2024-05-25T07:19:58.799187 #688717]  INFO -- : [646/883] 730081=test_emitter
I, [2024-05-25T07:19:58.800161 #688717]  INFO -- : [647/883] 730084=test_resource
I, [2024-05-25T07:19:58.805841 #688717]  INFO -- : [648/883] 730081=test_gem_commands_signin_command
I, [2024-05-25T07:19:58.812900 #688717]  INFO -- : [649/883] 730069=test_ldap
I, [2024-05-25T07:19:58.818138 #688717]  INFO -- : [650/883] 730084=test_stack
I, [2024-05-25T07:19:58.818806 #688717]  INFO -- : [651/883] 730069=test_gem_commands_list_command
I, [2024-05-25T07:19:58.830485 #688717]  INFO -- : [652/883] 730069=test_reqarg
I, [2024-05-25T07:19:58.831877 #688717]  INFO -- : [653/883] 730080=test_rdoc_include
I, [2024-05-25T07:19:58.888993 #688717]  INFO -- : [654/883] 730081=test_too_many_dummy_encodings
I, [2024-05-25T07:19:58.893606 #688717]  INFO -- : [655/883] 730080=test_mdns
I, [2024-05-25T07:19:58.912802 #688717]  INFO -- : [656/883] 730073=test_parse
I, [2024-05-25T07:19:58.914785 #688717]  INFO -- : [657/883] 730080=test_gem_remote_fetcher
I, [2024-05-25T07:19:58.925471 #688717]  INFO -- : [658/883] 730072=test_scanner_events
I, [2024-05-25T07:19:58.953532 #688717]  INFO -- : [659/883] 730072=test_gem_resolver_installed_specification
I, [2024-05-25T07:19:58.965090 #688717]  INFO -- : [660/883] 730081=test_gem_ext_ext_conf_builder
I, [2024-05-25T07:19:58.971148 #688717]  INFO -- : [661/883] 730072=test_method_cache
I, [2024-05-25T07:19:58.972764 #688717]  INFO -- : [662/883] 730072=test_gem_stub_specification
I, [2024-05-25T07:19:59.049405 #688717]  INFO -- : [663/883] 730083=test_frozen_error
I, [2024-05-25T07:19:59.054193 #688717]  INFO -- : [664/883] 730083=test_gem_commands_search_command
I, [2024-05-25T07:19:59.061578 #688717]  INFO -- : [665/883] 730083=test_complex
I, [2024-05-25T07:19:59.099012 #688717]  INFO -- : [666/883] 730072=test_inlinecache
I, [2024-05-25T07:19:59.124174 #688717]  INFO -- : [667/883] 730069=test_rdoc_markup_verbatim
I, [2024-05-25T07:19:59.127135 #688717]  INFO -- : [668/883] 730069=test_gem_resolver_specification
I, [2024-05-25T07:19:59.136796 #688717]  INFO -- : [669/883] 730075=test_gem_dependency
I, [2024-05-25T07:19:59.139601 #688717]  INFO -- : [670/883] 730072=test_path_to_class
I, [2024-05-25T07:19:59.145969 #688717]  INFO -- : [671/883] 730072=test_thread_fd_close
I, [2024-05-25T07:19:59.148406 #688717]  INFO -- : [672/883] 730069=test_passing_block
I, [2024-05-25T07:19:59.149403 #688717]  INFO -- : [673/883] 730072=test_stringchar
I, [2024-05-25T07:19:59.152688 #688717]  INFO -- : [674/883] 730069=test_hash_create
I, [2024-05-25T07:19:59.155782 #688717]  INFO -- : [675/883] 730069=newline_test
I, [2024-05-25T07:19:59.185887 #688717]  INFO -- : [676/883] 730083=test_uncorrectable_name_check
I, [2024-05-25T07:19:59.193227 #688717]  INFO -- : [677/883] 730083=test_switch_hitter
I, [2024-05-25T07:19:59.209657 #688717]  INFO -- : [678/883] 730083=test_singleton
I, [2024-05-25T07:19:59.214085 #688717]  INFO -- : [679/883] 730075=test_flush
I, [2024-05-25T07:19:59.215176 #688717]  INFO -- : [680/883] 730083=test_io_console
I, [2024-05-25T07:19:59.217839 #688717]  INFO -- : [681/883] 730075=test_logperiod
I, [2024-05-25T07:19:59.221173 #688717]  INFO -- : [682/883] 730069=test_rdoc_markdown_test
I, [2024-05-25T07:19:59.221864 #688717]  INFO -- : [683/883] 730075=test_c_union_entity
I, [2024-05-25T07:19:59.245245 #688717]  INFO -- : [684/883] 730072=test_rdoc_normal_module
I, [2024-05-25T07:19:59.246399 #688717]  INFO -- : [685/883] 730075=test_securerandom
I, [2024-05-25T07:19:59.265718 #688717]  INFO -- : [686/883] 730075=test_x509cert
I, [2024-05-25T07:19:59.306515 #688717]  INFO -- : [687/883] 730072=test_gc
I, [2024-05-25T07:19:59.482055 #688717]  INFO -- : [688/883] 730075=test_gem_resolver_lock_specification
I, [2024-05-25T07:19:59.498950 #688717]  INFO -- : [689/883] 730075=test_err_in_callback
I, [2024-05-25T07:19:59.500707 #688717]  INFO -- : [690/883] 730073=test_logdevice
I, [2024-05-25T07:19:59.501509 #688717]  INFO -- : [691/883] 730075=test_arity
I, [2024-05-25T07:19:59.507600 #688717]  INFO -- : [692/883] 730075=test_gem_ext_rake_builder
I, [2024-05-25T07:19:59.573953 #688717]  INFO -- : [693/883] 730084=test_gem_security_policy
I, [2024-05-25T07:19:59.641196 #688717]  INFO -- : [694/883] 730074=test_gem_source_local
I, [2024-05-25T07:19:59.679517 #688717]  INFO -- : [695/883] 730070=test_pack
I, [2024-05-25T07:19:59.848611 #688717]  INFO -- : [696/883] 730084=test_last_thread
I, [2024-05-25T07:19:59.888398 #688717]  INFO -- : [697/883] 730070=test_process
I, [2024-05-25T07:19:59.950385 #688717]  INFO -- : [698/883] 730074=test_name_error
I, [2024-05-25T07:19:59.996982 #688717]  INFO -- : [699/883] 730077=test_rdoc_markup_attribute_manager
I, [2024-05-25T07:20:00.008398 #688717]  INFO -- : [700/883] 730074=test_gem_resolver
I, [2024-05-25T07:20:00.020822 #688717]  INFO -- : [701/883] 730077=test_gem_resolver_composed_set
I, [2024-05-25T07:20:00.036664 #688717]  INFO -- : [702/883] 730077=test_safe_load
I, [2024-05-25T07:20:00.037523 #688717]  INFO -- : [703/883] 730081=test_gem_commands_dependency_command
I, [2024-05-25T07:20:00.043208 #688717]  INFO -- : [704/883] 730077=test_gem_commands_specification_command
I, [2024-05-25T07:20:00.123131 #688717]  INFO -- : [705/883] 730081=test_flags
I, [2024-05-25T07:20:00.172510 #688717]  INFO -- : [706/883] 730077=test_inadvertent_creation
I, [2024-05-25T07:20:00.203821 #688717]  INFO -- : [707/883] 730073=test_enumerator
I, [2024-05-25T07:20:00.209681 #688717]  INFO -- : [708/883] 730075=test_http
I, [2024-05-25T07:20:00.212861 #688717]  INFO -- : [709/883] 730075=test_gem_commands_which_command
I, [2024-05-25T07:20:00.233796 #688717]  INFO -- : [710/883] 730074=test_shift_jis
I, [2024-05-25T07:20:00.239015 #688717]  INFO -- : [711/883] 730074=test_require
I, [2024-05-25T07:20:00.240145 #688717]  INFO -- : [712/883] 730075=test_rdoc_markup_to_joined_paragraph
I, [2024-05-25T07:20:00.240178 #688717]  INFO -- : [713/883] 730074=test_date_time
I, [2024-05-25T07:20:00.253818 #688717]  INFO -- : [714/883] 730074=test_date_new
I, [2024-05-25T07:20:00.260106 #688717]  INFO -- : [715/883] 730074=index_write_test
I, [2024-05-25T07:20:00.264674 #688717]  INFO -- : [716/883] 730074=test_data
I, [2024-05-25T07:20:00.269129 #688717]  INFO -- : [717/883] 730074=test_syntax
I, [2024-05-25T07:20:00.286519 #688717]  INFO -- : [718/883] 730086=test_gem_safe_yaml
I, [2024-05-25T07:20:00.297531 #688717]  INFO -- : [719/883] 730086=test_rdoc_text
I, [2024-05-25T07:20:00.309395 #688717]  INFO -- : [720/883] 730077=test_tcp
I, [2024-05-25T07:20:00.340345 #688717]  INFO -- : [721/883] 730086=test_iso_8859
I, [2024-05-25T07:20:00.353949 #688717]  INFO -- : [722/883] 730075=test_nil2vtempty
I, [2024-05-25T07:20:00.355482 #688717]  INFO -- : [723/883] 730075=test_stream
I, [2024-05-25T07:20:00.360392 #688717]  INFO -- : [724/883] 730075=test_rdoc_context
I, [2024-05-25T07:20:00.360782 #688717]  INFO -- : [725/883] 730086=test_open-uri
I, [2024-05-25T07:20:00.371379 #688717]  INFO -- : [726/883] 730077=test_httpresponse
I, [2024-05-25T07:20:00.387523 #688717]  INFO -- : [727/883] 730077=test_rdoc_parser_ruby
I, [2024-05-25T07:20:00.582057 #688717]  INFO -- : [728/883] 730069=test_gem_package_tar_reader_entry
I, [2024-05-25T07:20:00.584449 #688717]  INFO -- : [729/883] 730080=test_gem_name_tuple
I, [2024-05-25T07:20:00.597294 #688717]  INFO -- : [730/883] 730080=test_rand
I, [2024-05-25T07:20:00.754153 #688717]  INFO -- : [731/883] 730086=test_bug_reporter
I, [2024-05-25T07:20:00.817511 #688717]  INFO -- : [732/883] 730069=test_exception
I, [2024-05-25T07:20:00.870030 #688717]  INFO -- : [733/883] 730075=test_store
I, [2024-05-25T07:20:00.883443 #688717]  INFO -- : [734/883] 730071=test_case_options
I, [2024-05-25T07:20:00.885100 #688717]  INFO -- : [735/883] 730071=test_gem_commands_info_command
I, [2024-05-25T07:20:00.892961 #688717]  INFO -- : [736/883] 730084=test_gem_dependency_installer
I, [2024-05-25T07:20:00.905546 #688717]  INFO -- : [737/883] 730071=test_scalar
I, [2024-05-25T07:20:00.906761 #688717]  INFO -- : [738/883] 730071=test_rdoc_cross_reference
I, [2024-05-25T07:20:00.924628 #688717]  INFO -- : [739/883] 730080=test_settracefunc
I, [2024-05-25T07:20:00.975018 #688717]  INFO -- : [740/883] 730075=test_gem_text
I, [2024-05-25T07:20:01.017494 #688717]  INFO -- : [741/883] 730075=test_enumerator_kw
I, [2024-05-25T07:20:01.021827 #688717]  INFO -- : [742/883] 730075=test_scan_args
I, [2024-05-25T07:20:01.031057 #688717]  INFO -- : [743/883] 730075=test_generic
I, [2024-05-25T07:20:01.054726 #688717]  INFO -- : [744/883] 730075=test_win32ole
I, [2024-05-25T07:20:01.062734 #688717]  INFO -- : [745/883] 730075=test_sprintf_comb
I, [2024-05-25T07:20:01.181619 #688717]  INFO -- : [746/883] 730086=test_method_cache
I, [2024-05-25T07:20:01.185855 #688717]  INFO -- : [747/883] 730086=test_gem_request
I, [2024-05-25T07:20:01.192232 #688717]  INFO -- : [748/883] 730075=test_gem_ext_cargo_builder_link_flag_converter
I, [2024-05-25T07:20:01.230328 #688717]  INFO -- : [749/883] 730075=test_gem_commands_mirror
I, [2024-05-25T07:20:01.237225 #688717]  INFO -- : [750/883] 730075=test_rdoc_markup_to_markdown
I, [2024-05-25T07:20:01.240464 #688717]  INFO -- : [751/883] 730081=test_json_tree
I, [2024-05-25T07:20:01.246389 #688717]  INFO -- : [752/883] 730081=test_ansi_with_terminfo
I, [2024-05-25T07:20:01.250162 #688717]  INFO -- : [753/883] 730081=test_rdoc_generator_pot_po
I, [2024-05-25T07:20:01.258171 #688717]  INFO -- : [754/883] 730081=test_ractor
I, [2024-05-25T07:20:01.268194 #688717]  INFO -- : [755/883] 730075=test_memory_view
I, [2024-05-25T07:20:01.321500 #688717]  INFO -- : [756/883] 730071=test_m17n_comb
I, [2024-05-25T07:20:01.338919 #688717]  INFO -- : [757/883] 730081=test_grapheme_breaks
I, [2024-05-25T07:20:01.355538 #688717]  INFO -- : [758/883] 730081=test_gem_version_option
I, [2024-05-25T07:20:01.379722 #688717]  INFO -- : [759/883] 730086=test_gem_request_connection_pools
I, [2024-05-25T07:20:01.388188 #688717]  INFO -- : [760/883] 730081=test_cclass
I, [2024-05-25T07:20:01.405234 #688717]  INFO -- : [761/883] 730075=test_parser_events
I, [2024-05-25T07:20:01.411539 #688717]  INFO -- : [762/883] 730077=test_reline
I, [2024-05-25T07:20:01.451586 #688717]  INFO -- : [763/883] 730075=test_case
I, [2024-05-25T07:20:01.452550 #688717]  INFO -- : [764/883] 730075=test_pkey
I, [2024-05-25T07:20:01.473824 #688717]  INFO -- : [765/883] 730082=test_objectspace
I, [2024-05-25T07:20:01.504018 #688717]  INFO -- : [766/883] 730075=test_thread
I, [2024-05-25T07:20:01.524454 #688717]  INFO -- : [767/883] 730081=test_socket
I, [2024-05-25T07:20:01.723908 #688717]  INFO -- : [768/883] 730075=test_rdoc_markup_to_table_of_contents
I, [2024-05-25T07:20:01.738961 #688717]  INFO -- : [769/883] 730075=test_dot_dot
I, [2024-05-25T07:20:01.752126 #688717]  INFO -- : [770/883] 730075=test_c_struct_builder
I, [2024-05-25T07:20:01.765524 #688717]  INFO -- : [771/883] 730077=test_str2big
I, [2024-05-25T07:20:01.777408 #688717]  INFO -- : [772/883] 730077=test_literal
I, [2024-05-25T07:20:01.843151 #688717]  INFO -- : [773/883] 730075=test_rdoc_generator_ri
I, [2024-05-25T07:20:01.851710 #688717]  INFO -- : [774/883] 730075=test_extlibs
I, [2024-05-25T07:20:01.882437 #688717]  INFO -- : [775/883] 730083=test_gem_stream_ui
I, [2024-05-25T07:20:01.913507 #688717]  INFO -- : [776/883] 730080=test_gem_install_update_options
I, [2024-05-25T07:20:02.006647 #688717]  INFO -- : [777/883] 730083=parse_test
I, [2024-05-25T07:20:02.016988 #688717]  INFO -- : [778/883] 730080=test_require_lib
I, [2024-05-25T07:20:02.394059 #688717]  INFO -- : [779/883] 730082=test_ractor
I, [2024-05-25T07:20:02.409974 #688717]  INFO -- : [780/883] 730082=test_severity
I, [2024-05-25T07:20:02.415089 #688717]  INFO -- : [781/883] 730082=test_files_test_2
I, [2024-05-25T07:20:02.419379 #688717]  INFO -- : [782/883] 730086=test_fnmatch
I, [2024-05-25T07:20:02.421014 #688717]  INFO -- : [783/883] 730079=test_require_path_check
I, [2024-05-25T07:20:02.458956 #688717]  INFO -- : [784/883] 730086=test_rdoc_markup_parser
I, [2024-05-25T07:20:02.478132 #688717]  INFO -- : [785/883] 730077=test_folderitem2_invokeverb
I, [2024-05-25T07:20:02.483372 #688717]  INFO -- : [786/883] 730077=test_gem_validator
I, [2024-05-25T07:20:02.498111 #688717]  INFO -- : [787/883] 730079=test_gem_package_old
I, [2024-05-25T07:20:02.508456 #688717]  INFO -- : [788/883] 730086=test_gem_resolver_index_set
I, [2024-05-25T07:20:02.510621 #688717]  INFO -- : [789/883] 730077=test_gc_compact
I, [2024-05-25T07:20:02.540405 #688717]  INFO -- : [790/883] 730086=test_proc
I, [2024-05-25T07:20:02.553830 #688717]  INFO -- : [791/883] 730079=test_string
I, [2024-05-25T07:20:03.008361 #688717]  INFO -- : [792/883] 730084=test_date_conv
I, [2024-05-25T07:20:03.014958 #688717]  INFO -- : [793/883] 730084=test_optimization
I, [2024-05-25T07:20:03.045840 #688717]  INFO -- : [794/883] 730071=test_ole_methods
I, [2024-05-25T07:20:03.050279 #688717]  INFO -- : [795/883] 730071=test_erb_m17n
I, [2024-05-25T07:20:03.058209 #688717]  INFO -- : [796/883] 730071=test_egrep_cpp
I, [2024-05-25T07:20:03.101866 #688717]  INFO -- : [797/883] 730068=test_cgi_tag_helper
I, [2024-05-25T07:20:03.125894 #688717]  INFO -- : [798/883] 730068=test_zlib
I, [2024-05-25T07:20:03.167615 #688717]  INFO -- : [799/883] 730071=test_gem_dependency_resolution_error
I, [2024-05-25T07:20:03.176033 #688717]  INFO -- : [800/883] 730071=test_rdoc_parser
I, [2024-05-25T07:20:03.201014 #688717]  INFO -- : [801/883] 730071=test_qsort
I, [2024-05-25T07:20:03.237330 #688717]  INFO -- : [802/883] 730071=json_addition_test
I, [2024-05-25T07:20:03.248909 #688717]  INFO -- : [803/883] 730071=test_custom_command
I, [2024-05-25T07:20:03.253524 #688717]  INFO -- : [804/883] 730071=test_raise
I, [2024-05-25T07:20:03.254346 #688717]  INFO -- : [805/883] 730071=test_x509attr
I, [2024-05-25T07:20:03.260448 #688717]  INFO -- : [806/883] 730071=test_gem_request_set_lockfile_parser
I, [2024-05-25T07:20:03.300398 #688717]  INFO -- : [807/883] 730086=test_depth_first
I, [2024-05-25T07:20:03.310291 #688717]  INFO -- : [808/883] 730086=test_rdoc_store
I, [2024-05-25T07:20:03.315233 #688717]  INFO -- : [809/883] 730081=test_string
I, [2024-05-25T07:20:03.328004 #688717]  INFO -- : [810/883] 730081=test_rdoc_stats
I, [2024-05-25T07:20:03.372303 #688717]  INFO -- : [811/883] 730081=test_pattern_matching
I, [2024-05-25T07:20:03.390833 #688717]  INFO -- : [812/883] 730071=test_pkey_ec
I, [2024-05-25T07:20:03.407862 #688717]  INFO -- : [813/883] 730081=test_trick
I, [2024-05-25T07:20:03.473599 #688717]  INFO -- : [814/883] 730071=test_thread
I, [2024-05-25T07:20:03.473970 #688717]  INFO -- : [815/883] 730071=test_pipe
I, [2024-05-25T07:20:03.486429 #688717]  INFO -- : [816/883] 730067=test_date_parse
I, [2024-05-25T07:20:03.620858 #688717]  INFO -- : [817/883] 730067=test_rdoc_markup_attributes
I, [2024-05-25T07:20:03.624595 #688717]  INFO -- : [818/883] 730067=test_default_gems
I, [2024-05-25T07:20:03.633825 #688717]  INFO -- : [819/883] 730071=test_rdoc_rd_inline_parser
I, [2024-05-25T07:20:03.676728 #688717]  INFO -- : [820/883] 730067=test_rdoc_markup_to_rdoc
I, [2024-05-25T07:20:03.685207 #688717]  INFO -- : [821/883] 730071=test_mul
I, [2024-05-25T07:20:03.697775 #688717]  INFO -- : [822/883] 730071=test_win32ole_type
I, [2024-05-25T07:20:03.700255 #688717]  INFO -- : [823/883] 730071=test_null
I, [2024-05-25T07:20:03.705296 #688717]  INFO -- : [824/883] 730071=test_gb18030
I, [2024-05-25T07:20:03.711742 #688717]  INFO -- : [825/883] 730071=test_svcb_https
I, [2024-05-25T07:20:03.730675 #688717]  INFO -- : [826/883] 730071=test_buffering
I, [2024-05-25T07:20:03.736442 #688717]  INFO -- : [827/883] 730067=test_gem_uninstaller
I, [2024-05-25T07:20:03.739454 #688717]  INFO -- : [828/883] 730071=test_rdoc_rdoc
I, [2024-05-25T07:20:03.752246 #688717]  INFO -- : [829/883] 730069=test_windows_1251
I, [2024-05-25T07:20:03.754340 #688717]  INFO -- : [830/883] 730069=test_time
I, [2024-05-25T07:20:03.781064 #688717]  INFO -- : [831/883] 730075=test_rdoc_i18n_text
I, [2024-05-25T07:20:03.787083 #688717]  INFO -- : [832/883] 730075=test_io_buffer
I, [2024-05-25T07:20:03.818306 #688717]  INFO -- : [833/883] 730071=test_defined
I, [2024-05-25T07:20:03.842969 #688717]  INFO -- : [834/883] 730075=test_backtrace
I, [2024-05-25T07:20:03.846836 #688717]  INFO -- : [835/883] 730075=test_key_name_check
I, [2024-05-25T07:20:03.852565 #688717]  INFO -- : [836/883] 730075=test_eval_history
I, [2024-05-25T07:20:03.891693 #688717]  INFO -- : [837/883] 730069=dispatcher_test
I, [2024-05-25T07:20:03.906638 #688717]  INFO -- : [838/883] 730071=test_kernel
I, [2024-05-25T07:20:03.908082 #688717]  INFO -- : [839/883] 730069=test_kdf
I, [2024-05-25T07:20:03.979498 #688717]  INFO -- : [840/883] 730075=test_gem_doctor
I, [2024-05-25T07:20:03.984339 #688717]  INFO -- : [841/883] 730069=test_gem_silent_ui
I, [2024-05-25T07:20:03.987309 #688717]  INFO -- : [842/883] 730086=test_emitter
I, [2024-05-25T07:20:04.018631 #688717]  INFO -- : [843/883] 730069=test_bug-5832
I, [2024-05-25T07:20:04.023432 #688717]  INFO -- : [844/883] 730086=test_files_ext
I, [2024-05-25T07:20:04.023506 #688717]  INFO -- : [845/883] 730069=test_gem_ext_cargo_builder_unit
I, [2024-05-25T07:20:04.027988 #688717]  INFO -- : [846/883] 730086=test_date
I, [2024-05-25T07:20:04.031143 #688717]  INFO -- : [847/883] 730086=test_gem_rdoc
I, [2024-05-25T07:20:04.040180 #688717]  INFO -- : [848/883] 730075=test_command
I, [2024-05-25T07:20:04.055551 #688717]  INFO -- : [849/883] 730069=test_at_exit
I, [2024-05-25T07:20:04.106731 #688717]  INFO -- : [850/883] 730069=test_object_create_start
I, [2024-05-25T07:20:04.108401 #688717]  INFO -- : [851/883] 730069=test_rdoc_markup_paragraph
I, [2024-05-25T07:20:04.111647 #688717]  INFO -- : [852/883] 730069=!Nothing_to_test
I, [2024-05-25T07:20:04.113666 #688717]  INFO -- : [853/883] 730069=test_enc_raise
I, [2024-05-25T07:20:04.117820 #688717]  INFO -- : [854/883] 730069=test_psych
I, [2024-05-25T07:20:04.137831 #688717]  INFO -- : [855/883] 730086=test_gem_spec_fetcher
I, [2024-05-25T07:20:04.138907 #688717]  INFO -- : [856/883] 730069=test_common
I, [2024-05-25T07:20:04.277447 #688717]  INFO -- : [857/883] 730086=test_key_actor_vi
I, [2024-05-25T07:20:04.360277 #688717]  INFO -- : [858/883] 730069=test_bug-3571
I, [2024-05-25T07:20:04.382021 #688717]  INFO -- : [859/883] 730086=test_gem_command
I, [2024-05-25T07:20:04.383846 #688717]  INFO -- : [860/883] 730075=test_gem_commands_lock_command
I, [2024-05-25T07:20:04.408670 #688717]  INFO -- : [861/883] 730075=test_ifunless
I, [2024-05-25T07:20:04.412514 #688717]  INFO -- : [862/883] 730069=test_assignment
I, [2024-05-25T07:20:04.417800 #688717]  INFO -- : [863/883] 730075=test_numeric
I, [2024-05-25T07:20:04.456880 #688717]  INFO -- : [864/883] 730086=test_rdoc_tom_doc
I, [2024-05-25T07:20:04.477509 #688717]  INFO -- : [865/883] 730086=test_hmac
I, [2024-05-25T07:20:04.483247 #688717]  INFO -- : [866/883] 730086=test_rdoc_markup_to_tt_only
I, [2024-05-25T07:20:04.510438 #688717]  INFO -- : [867/883] 730075=test_iter_break
I, [2024-05-25T07:20:04.514547 #688717]  INFO -- : [868/883] 730086=test_zsh_completion
I, [2024-05-25T07:20:04.517509 #688717]  INFO -- : [869/883] 730075=test_exception
I, [2024-05-25T07:20:04.520692 #688717]  INFO -- : [870/883] 730086=test_gem_ext_configure_builder
I, [2024-05-25T07:20:04.527542 #688717]  INFO -- : [871/883] 730075=test_frozen
I, [2024-05-25T07:20:04.535908 #688717]  INFO -- : [872/883] 730075=test_pp
I, [2024-05-25T07:20:04.559387 #688717]  INFO -- : [873/883] 730071=test_macro
I, [2024-05-25T07:20:04.568766 #688717]  INFO -- : [874/883] 730071=test_nil
I, [2024-05-25T07:20:04.573656 #688717]  INFO -- : [875/883] 730071=test_num2int
I, [2024-05-25T07:20:04.585196 #688717]  INFO -- : [876/883] 730075=test_rdoc_single_class
I, [2024-05-25T07:20:04.588194 #688717]  INFO -- : [877/883] 730071=test_verbose
I, [2024-05-25T07:20:04.590402 #688717]  INFO -- : [878/883] 730075=test_config
I, [2024-05-25T07:20:04.620697 #688717]  INFO -- : [879/883] 730071=test_gem_source_list
I, [2024-05-25T07:20:04.635855 #688717]  INFO -- : [880/883] 730086=test_yaml_special_cases
I, [2024-05-25T07:20:04.641189 #688717]  INFO -- : [881/883] 730075=test_optarg
I, [2024-05-25T07:20:04.648230 #688717]  INFO -- : [882/883] 730086=test_address_resolve
I, [2024-05-25T07:20:04.664726 #688717]  INFO -- : [883/883] 730071=test_rdoc_token_stream
I, [2024-05-25T07:20:14.545357 #688717]  INFO -- : Finished tests in 29.791912s, 885.6766 tests/s, 313955.3134 assertions/s.
I, [2024-05-25T07:20:14.546195 #688717]  INFO -- : 26386 tests, 9353329 assertions, 0 failures, 0 errors, 306 skips
I, [2024-05-25T07:20:14.546261 #688717]  INFO -- : 
I, [2024-05-25T07:20:14.546278 #688717]  INFO -- : ruby -v: ruby 3.4.0dev (2024-05-24T21:04:21Z master 4d0c5486a2) [x86_64-linux]
I, [2024-05-25T07:20:14.548477 #688717]  INFO -- : $$$[end] "make yes-test-all TESTOPTS='--stderr-on-failure' TESTS='-j20'" exit with 0.
I, [2024-05-25T07:20:14.548658 #688717]  INFO -- : $$$[beg] make yes-test-rubyspec MSPECOPT='--error-output stderr --debug -j' TESTS='-j20'
I, [2024-05-25T07:20:14.638997 #688717]  INFO -- : 	BASERUBY = /usr/bin/ruby --disable=gems
I, [2024-05-25T07:20:14.639036 #688717]  INFO -- : 	CC = gcc
I, [2024-05-25T07:20:14.639043 #688717]  INFO -- : 	LD = ld
I, [2024-05-25T07:20:14.639048 #688717]  INFO -- : 	LDSHARED = gcc -shared
I, [2024-05-25T07:20:14.639053 #688717]  INFO -- : 	CFLAGS = -O3 -fno-fast-math -ggdb3 -Wall -Wextra -Wdeprecated-declarations -Wdiv-by-zero -Wduplicated-cond -Wimplicit-function-declaration -Wimplicit-int -Wpointer-arith -Wwrite-strings -Wold-style-definition -Wimplicit-fallthrough=0 -Wmissing-noreturn -Wno-cast-function-type -Wno-constant-logical-operand -Wno-long-long -Wno-missing-field-initializers -Wno-overlength-strings -Wno-packed-bitfield-compat -Wno-parentheses-equality -Wno-self-assign -Wno-tautological-compare -Wno-unused-parameter -Wno-unused-value -Wsuggest-attribute=format -Wsuggest-attribute=noreturn -Wunused-variable -Wmisleading-indentation -Wundef   -fPIC 
I, [2024-05-25T07:20:14.639067 #688717]  INFO -- : 	XCFLAGS = -U_FORTIFY_SOURCE -D_FORTIFY_SOURCE=2 -fstack-protector-strong -fno-strict-overflow -fvisibility=hidden -fexcess-precision=standard -DRUBY_EXPORT -I. -I.ext/include/x86_64-linux -I/tmp/ruby/src/trunk/include -I/tmp/ruby/src/trunk -I/tmp/ruby/src/trunk/prism -I/tmp/ruby/src/trunk/enc/unicode/15.0.0  
I, [2024-05-25T07:20:14.639072 #688717]  INFO -- : 	CPPFLAGS =   
I, [2024-05-25T07:20:14.639077 #688717]  INFO -- : 	DLDFLAGS = -Wl,--compress-debug-sections=zlib -Wl,-soname,libruby.so.3.4  -fstack-protector-strong  
I, [2024-05-25T07:20:14.639082 #688717]  INFO -- : 	SOLIBS = -lz -lrt -lrt -lgmp -ldl -lcrypt -lm -lpthread 
I, [2024-05-25T07:20:14.639086 #688717]  INFO -- : 	LANG = en_US.UTF-8
I, [2024-05-25T07:20:14.639091 #688717]  INFO -- : 	LC_ALL = 
I, [2024-05-25T07:20:14.639096 #688717]  INFO -- : 	LC_CTYPE = 
I, [2024-05-25T07:20:14.639101 #688717]  INFO -- : 	MFLAGS = 
I, [2024-05-25T07:20:14.639105 #688717]  INFO -- : 	RUSTC = no
I, [2024-05-25T07:20:14.639110 #688717]  INFO -- : 	YJIT_RUSTC_ARGS = --crate-name=yjit --crate-type=staticlib --edition=2021 -g -C lto=thin -C opt-level=3 -C overflow-checks=on '--out-dir=/tmp/ruby/build/trunk/yjit/target/release/' /tmp/ruby/src/trunk/yjit/src/lib.rs
I, [2024-05-25T07:20:14.639506 #688717]  INFO -- : gcc (Ubuntu 11.4.0-1ubuntu1~22.04) 11.4.0
I, [2024-05-25T07:20:14.639511 #688717]  INFO -- : Copyright (C) 2021 Free Software Foundation, Inc.
I, [2024-05-25T07:20:14.639515 #688717]  INFO -- : This is free software; see the source for copying conditions.  There is NO
I, [2024-05-25T07:20:14.639520 #688717]  INFO -- : warranty; not even for MERCHANTABILITY or FITNESS FOR A PARTICULAR PURPOSE.
I, [2024-05-25T07:20:14.639524 #688717]  INFO -- : 
I, [2024-05-25T07:20:14.641300 #688717]  INFO -- : generating enc.mk
I, [2024-05-25T07:20:14.759100 #688717]  INFO -- : generating encdb.h
I, [2024-05-25T07:20:14.782906 #688717]  INFO -- : encdb.h unchanged
I, [2024-05-25T07:20:14.784095 #688717]  INFO -- : making enc
I, [2024-05-25T07:20:14.801503 #688717]  INFO -- : make[1]: Entering directory '/tmp/ruby/build/trunk'
I, [2024-05-25T07:20:14.801525 #688717]  INFO -- : make[1]: Nothing to be done for 'enc'.
I, [2024-05-25T07:20:14.801530 #688717]  INFO -- : make[1]: Leaving directory '/tmp/ruby/build/trunk'
I, [2024-05-25T07:20:14.802272 #688717]  INFO -- : making srcs under enc
I, [2024-05-25T07:20:14.834240 #688717]  INFO -- : make[1]: Entering directory '/tmp/ruby/build/trunk'
I, [2024-05-25T07:20:14.834261 #688717]  INFO -- : make[1]: Nothing to be done for 'srcs'.
I, [2024-05-25T07:20:14.834267 #688717]  INFO -- : make[1]: Leaving directory '/tmp/ruby/build/trunk'
I, [2024-05-25T07:20:14.835221 #688717]  INFO -- : generating transdb.h
I, [2024-05-25T07:20:14.932583 #688717]  INFO -- : transdb.h unchanged
I, [2024-05-25T07:20:14.934124 #688717]  INFO -- : making trans
I, [2024-05-25T07:20:14.968529 #688717]  INFO -- : make[1]: Entering directory '/tmp/ruby/build/trunk'
I, [2024-05-25T07:20:14.968551 #688717]  INFO -- : make[1]: Nothing to be done for 'trans'.
I, [2024-05-25T07:20:14.968558 #688717]  INFO -- : make[1]: Leaving directory '/tmp/ruby/build/trunk'
I, [2024-05-25T07:20:14.969223 #688717]  INFO -- : making encs
I, [2024-05-25T07:20:15.006951 #688717]  INFO -- : make[1]: Entering directory '/tmp/ruby/build/trunk'
I, [2024-05-25T07:20:15.006972 #688717]  INFO -- : make[1]: Nothing to be done for 'encs'.
I, [2024-05-25T07:20:15.006978 #688717]  INFO -- : make[1]: Leaving directory '/tmp/ruby/build/trunk'
I, [2024-05-25T07:20:15.008729 #688717]  INFO -- : generating makefiles ext/configure-ext.mk
I, [2024-05-25T07:20:15.035889 #688717]  INFO -- : ext/configure-ext.mk updated
I, [2024-05-25T07:20:15.038292 #688717]  INFO -- : make[1]: Entering directory '/tmp/ruby/build/trunk'
I, [2024-05-25T07:20:16.430408 #688717]  INFO -- : make[1]: Leaving directory '/tmp/ruby/build/trunk'
I, [2024-05-25T07:20:16.430975 #688717]  INFO -- : generating makefile exts.mk
I, [2024-05-25T07:20:16.467443 #688717]  INFO -- : exts.mk unchanged
I, [2024-05-25T07:20:16.471815 #688717]  INFO -- : make[1]: Entering directory '/tmp/ruby/build/trunk'
I, [2024-05-25T07:20:16.762588 #688717]  INFO -- : make[2]: Entering directory '/tmp/ruby/build/trunk/ext/coverage'
I, [2024-05-25T07:20:16.766650 #688717]  INFO -- : make[2]: Leaving directory '/tmp/ruby/build/trunk/ext/coverage'
I, [2024-05-25T07:20:16.772045 #688717]  INFO -- : make[2]: Entering directory '/tmp/ruby/build/trunk/ext/date'
I, [2024-05-25T07:20:16.777176 #688717]  INFO -- : make[2]: Leaving directory '/tmp/ruby/build/trunk/ext/date'
I, [2024-05-25T07:20:16.780826 #688717]  INFO -- : make[2]: Entering directory '/tmp/ruby/build/trunk/ext/digest'
I, [2024-05-25T07:20:16.789619 #688717]  INFO -- : make[2]: Leaving directory '/tmp/ruby/build/trunk/ext/digest'
I, [2024-05-25T07:20:16.816026 #688717]  INFO -- : make[2]: Entering directory '/tmp/ruby/build/trunk/ext/digest/sha2'
I, [2024-05-25T07:20:16.820837 #688717]  INFO -- : make[2]: Leaving directory '/tmp/ruby/build/trunk/ext/digest/sha2'
I, [2024-05-25T07:20:16.842085 #688717]  INFO -- : make[2]: Entering directory '/tmp/ruby/build/trunk/ext/fiddle'
I, [2024-05-25T07:20:16.852072 #688717]  INFO -- : make[2]: Leaving directory '/tmp/ruby/build/trunk/ext/fiddle'
I, [2024-05-25T07:20:16.857113 #688717]  INFO -- : make[2]: Entering directory '/tmp/ruby/build/trunk/ext/io/console'
I, [2024-05-25T07:20:16.861332 #688717]  INFO -- : make[2]: Leaving directory '/tmp/ruby/build/trunk/ext/io/console'
I, [2024-05-25T07:20:16.874112 #688717]  INFO -- : make[2]: Entering directory '/tmp/ruby/build/trunk/ext/json'
I, [2024-05-25T07:20:16.884835 #688717]  INFO -- : make[2]: Leaving directory '/tmp/ruby/build/trunk/ext/json'
I, [2024-05-25T07:20:16.900736 #688717]  INFO -- : make[2]: Entering directory '/tmp/ruby/build/trunk/ext/monitor'
I, [2024-05-25T07:20:16.904722 #688717]  INFO -- : make[2]: Leaving directory '/tmp/ruby/build/trunk/ext/monitor'
I, [2024-05-25T07:20:16.911847 #688717]  INFO -- : make[2]: Entering directory '/tmp/ruby/build/trunk/ext/objspace'
I, [2024-05-25T07:20:16.918404 #688717]  INFO -- : make[2]: Leaving directory '/tmp/ruby/build/trunk/ext/objspace'
I, [2024-05-25T07:20:16.935815 #688717]  INFO -- : make[2]: Entering directory '/tmp/ruby/build/trunk/ext/openssl'
I, [2024-05-25T07:20:16.955557 #688717]  INFO -- : make[2]: Leaving directory '/tmp/ruby/build/trunk/ext/openssl'
I, [2024-05-25T07:20:16.959474 #688717]  INFO -- : make[2]: Entering directory '/tmp/ruby/build/trunk/ext/pathname'
I, [2024-05-25T07:20:16.963346 #688717]  INFO -- : make[2]: Leaving directory '/tmp/ruby/build/trunk/ext/pathname'
I, [2024-05-25T07:20:16.970169 #688717]  INFO -- : make[2]: Entering directory '/tmp/ruby/build/trunk/ext/psych'
I, [2024-05-25T07:20:16.992621 #688717]  INFO -- : make[2]: Leaving directory '/tmp/ruby/build/trunk/ext/psych'
I, [2024-05-25T07:20:16.997918 #688717]  INFO -- : make[2]: Entering directory '/tmp/ruby/build/trunk/ext/pty'
I, [2024-05-25T07:20:17.002044 #688717]  INFO -- : make[2]: Leaving directory '/tmp/ruby/build/trunk/ext/pty'
I, [2024-05-25T07:20:17.018082 #688717]  INFO -- : make[2]: Entering directory '/tmp/ruby/build/trunk/ext/ripper'
I, [2024-05-25T07:20:17.025653 #688717]  INFO -- : make[2]: Leaving directory '/tmp/ruby/build/trunk/ext/ripper'
I, [2024-05-25T07:20:17.028039 #688717]  INFO -- : make[2]: Entering directory '/tmp/ruby/build/trunk/ext/rubyvm'
I, [2024-05-25T07:20:17.031360 #688717]  INFO -- : make[2]: Leaving directory '/tmp/ruby/build/trunk/ext/rubyvm'
I, [2024-05-25T07:20:17.045051 #688717]  INFO -- : make[2]: Entering directory '/tmp/ruby/build/trunk/ext/socket'
I, [2024-05-25T07:20:17.055799 #688717]  INFO -- : make[2]: Leaving directory '/tmp/ruby/build/trunk/ext/socket'
I, [2024-05-25T07:20:17.074550 #688717]  INFO -- : make[2]: Entering directory '/tmp/ruby/build/trunk/.bundle/gems/bigdecimal-3.1.8/ext/bigdecimal'
I, [2024-05-25T07:20:17.105003 #688717]  INFO -- : make[2]: Leaving directory '/tmp/ruby/build/trunk/.bundle/gems/bigdecimal-3.1.8/ext/bigdecimal'
I, [2024-05-25T07:20:17.107028 #688717]  INFO -- : make[2]: Entering directory '/tmp/ruby/build/trunk/.bundle/gems/debug-1.9.2/ext/debug'
I, [2024-05-25T07:20:17.128630 #688717]  INFO -- : make[2]: Leaving directory '/tmp/ruby/build/trunk/.bundle/gems/debug-1.9.2/ext/debug'
I, [2024-05-25T07:20:17.130590 #688717]  INFO -- : make[2]: Entering directory '/tmp/ruby/build/trunk/.bundle/gems/nkf-0.2.0/ext/nkf'
I, [2024-05-25T07:20:17.152791 #688717]  INFO -- : make[2]: Leaving directory '/tmp/ruby/build/trunk/.bundle/gems/nkf-0.2.0/ext/nkf'
I, [2024-05-25T07:20:17.154839 #688717]  INFO -- : make[2]: Entering directory '/tmp/ruby/build/trunk/.bundle/gems/racc-1.7.3/ext/racc/cparse'
I, [2024-05-25T07:20:17.176792 #688717]  INFO -- : make[2]: Leaving directory '/tmp/ruby/build/trunk/.bundle/gems/racc-1.7.3/ext/racc/cparse'
I, [2024-05-25T07:20:17.178849 #688717]  INFO -- : make[2]: Entering directory '/tmp/ruby/build/trunk/.bundle/gems/racc-1.8.0/ext/racc/cparse'
I, [2024-05-25T07:20:17.201105 #688717]  INFO -- : make[2]: Leaving directory '/tmp/ruby/build/trunk/.bundle/gems/racc-1.8.0/ext/racc/cparse'
I, [2024-05-25T07:20:17.203361 #688717]  INFO -- : make[2]: Entering directory '/tmp/ruby/build/trunk/.bundle/gems/rbs-3.4.4/ext/rbs_extension'
I, [2024-05-25T07:20:17.225560 #688717]  INFO -- : make[2]: Leaving directory '/tmp/ruby/build/trunk/.bundle/gems/rbs-3.4.4/ext/rbs_extension'
I, [2024-05-25T07:20:17.227745 #688717]  INFO -- : make[2]: Entering directory '/tmp/ruby/build/trunk/.bundle/gems/syslog-0.1.2/ext/syslog'
I, [2024-05-25T07:20:17.248828 #688717]  INFO -- : make[2]: Leaving directory '/tmp/ruby/build/trunk/.bundle/gems/syslog-0.1.2/ext/syslog'
I, [2024-05-25T07:20:17.272180 #688717]  INFO -- : make[2]: Entering directory '/tmp/ruby/build/trunk'
I, [2024-05-25T07:20:17.345288 #688717]  INFO -- : make[2]: 'ruby' is up to date.
I, [2024-05-25T07:20:17.345323 #688717]  INFO -- : make[2]: Leaving directory '/tmp/ruby/build/trunk'
I, [2024-05-25T07:20:17.345676 #688717]  INFO -- : make[1]: Leaving directory '/tmp/ruby/build/trunk'
I, [2024-05-25T07:20:17.349372 #688717]  INFO -- : make[1]: Entering directory '/tmp/ruby/build/trunk'
I, [2024-05-25T07:20:17.349397 #688717]  INFO -- : make[1]: Nothing to be done for 'note'.
I, [2024-05-25T07:20:17.349404 #688717]  INFO -- : make[1]: Leaving directory '/tmp/ruby/build/trunk'
E, [2024-05-25T07:20:17.406364 #688717] ERROR -- : $ /tmp/ruby/build/trunk/miniruby -I/tmp/ruby/src/trunk/lib /tmp/ruby/src/trunk/tool/runruby.rb --archdir=/tmp/ruby/build/trunk --extout=.ext -- /tmp/ruby/src/trunk/spec/mspec/bin/mspec-run -B /tmp/ruby/src/trunk/spec/default.mspec --error-output stderr --debug -fy -o /tmp/rubytest.gmtrra/1-mspec-multi-0
E, [2024-05-25T07:20:17.406604 #688717] ERROR -- : $ /tmp/ruby/build/trunk/miniruby -I/tmp/ruby/src/trunk/lib /tmp/ruby/src/trunk/tool/runruby.rb --archdir=/tmp/ruby/build/trunk --extout=.ext -- /tmp/ruby/src/trunk/spec/mspec/bin/mspec-run -B /tmp/ruby/src/trunk/spec/default.mspec --error-output stderr --debug -fy -o /tmp/rubytest.gmtrra/2-mspec-multi-1
E, [2024-05-25T07:20:17.406907 #688717] ERROR -- : $ /tmp/ruby/build/trunk/miniruby -I/tmp/ruby/src/trunk/lib /tmp/ruby/src/trunk/tool/runruby.rb --archdir=/tmp/ruby/build/trunk --extout=.ext -- /tmp/ruby/src/trunk/spec/mspec/bin/mspec-run -B /tmp/ruby/src/trunk/spec/default.mspec --error-output stderr --debug -fy -o /tmp/rubytest.gmtrra/3-mspec-multi-2
E, [2024-05-25T07:20:17.407184 #688717] ERROR -- : $ /tmp/ruby/build/trunk/miniruby -I/tmp/ruby/src/trunk/lib /tmp/ruby/src/trunk/tool/runruby.rb --archdir=/tmp/ruby/build/trunk --extout=.ext -- /tmp/ruby/src/trunk/spec/mspec/bin/mspec-run -B /tmp/ruby/src/trunk/spec/default.mspec --error-output stderr --debug -fy -o /tmp/rubytest.gmtrra/4-mspec-multi-3
E, [2024-05-25T07:20:17.407471 #688717] ERROR -- : $ /tmp/ruby/build/trunk/miniruby -I/tmp/ruby/src/trunk/lib /tmp/ruby/src/trunk/tool/runruby.rb --archdir=/tmp/ruby/build/trunk --extout=.ext -- /tmp/ruby/src/trunk/spec/mspec/bin/mspec-run -B /tmp/ruby/src/trunk/spec/default.mspec --error-output stderr --debug -fy -o /tmp/rubytest.gmtrra/5-mspec-multi-4
E, [2024-05-25T07:20:17.407632 #688717] ERROR -- : $ /tmp/ruby/build/trunk/miniruby -I/tmp/ruby/src/trunk/lib /tmp/ruby/src/trunk/tool/runruby.rb --archdir=/tmp/ruby/build/trunk --extout=.ext -- /tmp/ruby/src/trunk/spec/mspec/bin/mspec-run -B /tmp/ruby/src/trunk/spec/default.mspec --error-output stderr --debug -fy -o /tmp/rubytest.gmtrra/6-mspec-multi-5
E, [2024-05-25T07:20:17.407879 #688717] ERROR -- : $ /tmp/ruby/build/trunk/miniruby -I/tmp/ruby/src/trunk/lib /tmp/ruby/src/trunk/tool/runruby.rb --archdir=/tmp/ruby/build/trunk --extout=.ext -- /tmp/ruby/src/trunk/spec/mspec/bin/mspec-run -B /tmp/ruby/src/trunk/spec/default.mspec --error-output stderr --debug -fy -o /tmp/rubytest.gmtrra/7-mspec-multi-6
E, [2024-05-25T07:20:17.408171 #688717] ERROR -- : $ /tmp/ruby/build/trunk/miniruby -I/tmp/ruby/src/trunk/lib /tmp/ruby/src/trunk/tool/runruby.rb --archdir=/tmp/ruby/build/trunk --extout=.ext -- /tmp/ruby/src/trunk/spec/mspec/bin/mspec-run -B /tmp/ruby/src/trunk/spec/default.mspec --error-output stderr --debug -fy -o /tmp/rubytest.gmtrra/8-mspec-multi-7
E, [2024-05-25T07:20:17.408452 #688717] ERROR -- : $ /tmp/ruby/build/trunk/miniruby -I/tmp/ruby/src/trunk/lib /tmp/ruby/src/trunk/tool/runruby.rb --archdir=/tmp/ruby/build/trunk --extout=.ext -- /tmp/ruby/src/trunk/spec/mspec/bin/mspec-run -B /tmp/ruby/src/trunk/spec/default.mspec --error-output stderr --debug -fy -o /tmp/rubytest.gmtrra/9-mspec-multi-8
E, [2024-05-25T07:20:17.408762 #688717] ERROR -- : $ /tmp/ruby/build/trunk/miniruby -I/tmp/ruby/src/trunk/lib /tmp/ruby/src/trunk/tool/runruby.rb --archdir=/tmp/ruby/build/trunk --extout=.ext -- /tmp/ruby/src/trunk/spec/mspec/bin/mspec-run -B /tmp/ruby/src/trunk/spec/default.mspec --error-output stderr --debug -fy -o /tmp/rubytest.gmtrra/10-mspec-multi-9
E, [2024-05-25T07:20:17.409142 #688717] ERROR -- : $ /tmp/ruby/build/trunk/miniruby -I/tmp/ruby/src/trunk/lib /tmp/ruby/src/trunk/tool/runruby.rb --archdir=/tmp/ruby/build/trunk --extout=.ext -- /tmp/ruby/src/trunk/spec/mspec/bin/mspec-run -B /tmp/ruby/src/trunk/spec/default.mspec --error-output stderr --debug -fy -o /tmp/rubytest.gmtrra/11-mspec-multi-10
E, [2024-05-25T07:20:17.409408 #688717] ERROR -- : $ /tmp/ruby/build/trunk/miniruby -I/tmp/ruby/src/trunk/lib /tmp/ruby/src/trunk/tool/runruby.rb --archdir=/tmp/ruby/build/trunk --extout=.ext -- /tmp/ruby/src/trunk/spec/mspec/bin/mspec-run -B /tmp/ruby/src/trunk/spec/default.mspec --error-output stderr --debug -fy -o /tmp/rubytest.gmtrra/12-mspec-multi-11
E, [2024-05-25T07:20:17.409677 #688717] ERROR -- : $ /tmp/ruby/build/trunk/miniruby -I/tmp/ruby/src/trunk/lib /tmp/ruby/src/trunk/tool/runruby.rb --archdir=/tmp/ruby/build/trunk --extout=.ext -- /tmp/ruby/src/trunk/spec/mspec/bin/mspec-run -B /tmp/ruby/src/trunk/spec/default.mspec --error-output stderr --debug -fy -o /tmp/rubytest.gmtrra/13-mspec-multi-12
E, [2024-05-25T07:20:17.409916 #688717] ERROR -- : $ /tmp/ruby/build/trunk/miniruby -I/tmp/ruby/src/trunk/lib /tmp/ruby/src/trunk/tool/runruby.rb --archdir=/tmp/ruby/build/trunk --extout=.ext -- /tmp/ruby/src/trunk/spec/mspec/bin/mspec-run -B /tmp/ruby/src/trunk/spec/default.mspec --error-output stderr --debug -fy -o /tmp/rubytest.gmtrra/14-mspec-multi-13
E, [2024-05-25T07:20:17.410063 #688717] ERROR -- : $ /tmp/ruby/build/trunk/miniruby -I/tmp/ruby/src/trunk/lib /tmp/ruby/src/trunk/tool/runruby.rb --archdir=/tmp/ruby/build/trunk --extout=.ext -- /tmp/ruby/src/trunk/spec/mspec/bin/mspec-run -B /tmp/ruby/src/trunk/spec/default.mspec --error-output stderr --debug -fy -o /tmp/rubytest.gmtrra/15-mspec-multi-14
E, [2024-05-25T07:20:17.410284 #688717] ERROR -- : $ /tmp/ruby/build/trunk/miniruby -I/tmp/ruby/src/trunk/lib /tmp/ruby/src/trunk/tool/runruby.rb --archdir=/tmp/ruby/build/trunk --extout=.ext -- /tmp/ruby/src/trunk/spec/mspec/bin/mspec-run -B /tmp/ruby/src/trunk/spec/default.mspec --error-output stderr --debug -fy -o /tmp/rubytest.gmtrra/16-mspec-multi-15
E, [2024-05-25T07:20:17.410497 #688717] ERROR -- : $ /tmp/ruby/build/trunk/miniruby -I/tmp/ruby/src/trunk/lib /tmp/ruby/src/trunk/tool/runruby.rb --archdir=/tmp/ruby/build/trunk --extout=.ext -- /tmp/ruby/src/trunk/spec/mspec/bin/mspec-run -B /tmp/ruby/src/trunk/spec/default.mspec --error-output stderr --debug -fy -o /tmp/rubytest.gmtrra/17-mspec-multi-16
E, [2024-05-25T07:20:17.410619 #688717] ERROR -- : $ /tmp/ruby/build/trunk/miniruby -I/tmp/ruby/src/trunk/lib /tmp/ruby/src/trunk/tool/runruby.rb --archdir=/tmp/ruby/build/trunk --extout=.ext -- /tmp/ruby/src/trunk/spec/mspec/bin/mspec-run -B /tmp/ruby/src/trunk/spec/default.mspec --error-output stderr --debug -fy -o /tmp/rubytest.gmtrra/18-mspec-multi-17
E, [2024-05-25T07:20:17.413598 #688717] ERROR -- : $ /tmp/ruby/build/trunk/miniruby -I/tmp/ruby/src/trunk/lib /tmp/ruby/src/trunk/tool/runruby.rb --archdir=/tmp/ruby/build/trunk --extout=.ext -- /tmp/ruby/src/trunk/spec/mspec/bin/mspec-run -B /tmp/ruby/src/trunk/spec/default.mspec --error-output stderr --debug -fy -o /tmp/rubytest.gmtrra/19-mspec-multi-18
E, [2024-05-25T07:20:17.413879 #688717] ERROR -- : $ /tmp/ruby/build/trunk/miniruby -I/tmp/ruby/src/trunk/lib /tmp/ruby/src/trunk/tool/runruby.rb --archdir=/tmp/ruby/build/trunk --extout=.ext -- /tmp/ruby/src/trunk/spec/mspec/bin/mspec-run -B /tmp/ruby/src/trunk/spec/default.mspec --error-output stderr --debug -fy -o /tmp/rubytest.gmtrra/20-mspec-multi-19
I, [2024-05-25T07:20:17.581028 #688717]  INFO -- : ruby 3.4.0dev (2024-05-24T21:04:21Z master 4d0c5486a2) [x86_64-linux]
I, [2024-05-25T07:20:18.203488 #688717]  INFO -- :      0 .........................................................................
I, [2024-05-25T07:20:18.574495 #688717]  INFO -- :     73 .........................................................................
I, [2024-05-25T07:20:18.729188 #688717]  INFO -- :    146 .........................................................................
I, [2024-05-25T07:20:18.776735 #688717]  INFO -- :    219 .........................................................................
I, [2024-05-25T07:20:18.830275 #688717]  INFO -- :    292 .........................................................................
I, [2024-05-25T07:20:18.881195 #688717]  INFO -- :    365 .........................................................................
I, [2024-05-25T07:20:18.901111 #688717]  INFO -- :    438 .........................................................................
I, [2024-05-25T07:20:18.920782 #688717]  INFO -- :    511 .........................................................................
I, [2024-05-25T07:20:18.938049 #688717]  INFO -- :    584 .........................................................................
I, [2024-05-25T07:20:18.995023 #688717]  INFO -- :    657 .........................................................................
I, [2024-05-25T07:20:19.023214 #688717]  INFO -- :    730 .........................................................................
I, [2024-05-25T07:20:19.042477 #688717]  INFO -- :    803 .........................................................................
I, [2024-05-25T07:20:19.068998 #688717]  INFO -- :    876 .........................................................................
I, [2024-05-25T07:20:19.117632 #688717]  INFO -- :    949 .........................................................................
I, [2024-05-25T07:20:19.197439 #688717]  INFO -- :   1022 .........................................................................
I, [2024-05-25T07:20:19.363488 #688717]  INFO -- :   1095 .........................................................................
I, [2024-05-25T07:20:19.496228 #688717]  INFO -- :   1168 .........................................................................
I, [2024-05-25T07:20:19.559340 #688717]  INFO -- :   1241 .........................................................................
I, [2024-05-25T07:20:19.607610 #688717]  INFO -- :   1314 .........................................................................
I, [2024-05-25T07:20:19.634887 #688717]  INFO -- :   1387 .........................................................................
I, [2024-05-25T07:20:19.735293 #688717]  INFO -- :   1460 .........................................................................
I, [2024-05-25T07:20:20.175774 #688717]  INFO -- :   1533 .........................................................................
I, [2024-05-25T07:20:20.261056 #688717]  INFO -- :   1606 .........................................................................
I, [2024-05-25T07:20:20.375822 #688717]  INFO -- :   1679 .........................................................................
I, [2024-05-25T07:20:20.507227 #688717]  INFO -- :   1752 .........................................................................
I, [2024-05-25T07:20:20.597180 #688717]  INFO -- :   1825 .........................................................................
I, [2024-05-25T07:20:20.721105 #688717]  INFO -- :   1898 .........................................................................
I, [2024-05-25T07:20:20.799318 #688717]  INFO -- :   1971 .........................................................................
I, [2024-05-25T07:20:20.855383 #688717]  INFO -- :   2044 .........................................................................
I, [2024-05-25T07:20:20.897646 #688717]  INFO -- :   2117 .........................................................................
I, [2024-05-25T07:20:20.913029 #688717]  INFO -- :   2190 .........................................................................
I, [2024-05-25T07:20:20.932701 #688717]  INFO -- :   2263 .........................................................................
I, [2024-05-25T07:20:20.948371 #688717]  INFO -- :   2336 .........................................................................
I, [2024-05-25T07:20:20.978334 #688717]  INFO -- :   2409 .........................................................................
I, [2024-05-25T07:20:21.079070 #688717]  INFO -- :   2482 .........................................................................
I, [2024-05-25T07:20:21.100856 #688717]  INFO -- :   2555 .........................................................................
I, [2024-05-25T07:20:21.198292 #688717]  INFO -- :   2628 .........................................................................
I, [2024-05-25T07:20:21.295287 #688717]  INFO -- :   2701 .........................................................................
I, [2024-05-25T07:20:21.330530 #688717]  INFO -- :   2774 .........................................................................
I, [2024-05-25T07:20:21.394297 #688717]  INFO -- :   2847 .........................................................................
I, [2024-05-25T07:20:21.432371 #688717]  INFO -- :   2920 .........................................................................
I, [2024-05-25T07:20:21.458757 #688717]  INFO -- :   2993 .........................................................................
I, [2024-05-25T07:20:21.488931 #688717]  INFO -- :   3066 .........................................................................
I, [2024-05-25T07:20:21.502157 #688717]  INFO -- :   3139 .........................................................................
I, [2024-05-25T07:20:21.513636 #688717]  INFO -- :   3212 .........................................................................
I, [2024-05-25T07:20:21.543526 #688717]  INFO -- :   3285 .........................................................................
I, [2024-05-25T07:20:25.483959 #688717]  INFO -- :   3358 .........................................................................
I, [2024-05-25T07:20:25.506959 #688717]  INFO -- : 
I, [2024-05-25T07:20:25.507028 #688717]  INFO -- : 
I, [2024-05-25T07:20:25.507046 #688717]  INFO -- : Finished in 8.099837 seconds
I, [2024-05-25T07:20:25.507073 #688717]  INFO -- : 
I, [2024-05-25T07:20:25.507089 #688717]  INFO -- : 3430 files, 32652 examples, 220319 expectations, 0 failures, 0 errors, 0 tagged
I, [2024-05-25T07:20:25.508844 #688717]  INFO -- : $$$[end] "make yes-test-rubyspec MSPECOPT='--error-output stderr --debug -j' TESTS='-j20'" exit with 0.