# Logfile created on 2024-05-24 16:49:20 +0000 by logger.rb/v1.4.3 I, [2024-05-24T16:49:20.806694 #738999] INFO -- : #, @formatter=nil, @logdev=#, @binmode=false, @mon_data=#, @mon_data_owner_object_id=860>>> I, [2024-05-24T16:49:20.806823 #738999] INFO -- : $$$[beg] make update-unicode -j20 I, [2024-05-24T16:49:20.867011 #738999] INFO -- : Downloading Unicode emoji 15.0 files... I, [2024-05-24T16:49:20.867302 #738999] INFO -- : Downloading Unicode emoji 15.0 files... I, [2024-05-24T16:49:20.867719 #738999] INFO -- : Downloading Unicode emoji 15.0 files... I, [2024-05-24T16:49:20.910957 #738999] INFO -- : made symlink emoji/15.0/emoji-sequences.txt to /tmp/ruby/src/trunk/.downloaded-cache/emoji/15.0/emoji-sequences.txt I, [2024-05-24T16:49:20.911243 #738999] INFO -- : downloading emoji/15.0/emoji-test.txt ... /tmp/ruby/src/trunk/enc/unicode/data/emoji/15.0/emoji-sequences.txt already exists I, [2024-05-24T16:49:20.912473 #738999] INFO -- : downloading emoji/15.0/emoji-test.txt ... /tmp/ruby/src/trunk/enc/unicode/data/emoji/15.0/emoji-sequences.txt already exists E, [2024-05-24T16:49:21.360052 #738999] ERROR -- : /tmp/ruby/src/trunk/tool/downloader.rb:302:in `rescue in download': failed to download emoji/15.0/emoji-test.txt (RuntimeError) E, [2024-05-24T16:49:21.360178 #738999] ERROR -- : OpenURI::HTTPError: 403 Forbidden: https://www.unicode.org/Public/emoji/15.0/emoji-test.txt E, [2024-05-24T16:49:21.360199 #738999] ERROR -- : from /tmp/ruby/src/trunk/tool/downloader.rb:201:in `download' E, [2024-05-24T16:49:21.360213 #738999] ERROR -- : from /tmp/ruby/src/trunk/tool/downloader.rb:136:in `download' E, [2024-05-24T16:49:21.360225 #738999] ERROR -- : from /tmp/ruby/src/trunk/tool/downloader.rb:482:in `block in
' E, [2024-05-24T16:49:21.360237 #738999] ERROR -- : from /tmp/ruby/src/trunk/tool/downloader.rb:465:in `each' E, [2024-05-24T16:49:21.360249 #738999] ERROR -- : from /tmp/ruby/src/trunk/tool/downloader.rb:465:in `
' E, [2024-05-24T16:49:21.360262 #738999] ERROR -- : /usr/lib/ruby/3.0.0/open-uri.rb:364:in `open_http': 403 Forbidden (OpenURI::HTTPError) E, [2024-05-24T16:49:21.360274 #738999] ERROR -- : from /usr/lib/ruby/3.0.0/open-uri.rb:741:in `buffer_open' E, [2024-05-24T16:49:21.360289 #738999] ERROR -- : from /usr/lib/ruby/3.0.0/open-uri.rb:212:in `block in open_loop' E, [2024-05-24T16:49:21.360302 #738999] ERROR -- : from /usr/lib/ruby/3.0.0/open-uri.rb:210:in `catch' E, [2024-05-24T16:49:21.360313 #738999] ERROR -- : from /usr/lib/ruby/3.0.0/open-uri.rb:210:in `open_loop' E, [2024-05-24T16:49:21.360325 #738999] ERROR -- : from /usr/lib/ruby/3.0.0/open-uri.rb:151:in `open_uri' E, [2024-05-24T16:49:21.360336 #738999] ERROR -- : from /usr/lib/ruby/3.0.0/open-uri.rb:721:in `open' E, [2024-05-24T16:49:21.360348 #738999] ERROR -- : from /usr/lib/ruby/3.0.0/open-uri.rb:729:in `read' E, [2024-05-24T16:49:21.360382 #738999] ERROR -- : from /tmp/ruby/src/trunk/tool/downloader.rb:247:in `block in download' E, [2024-05-24T16:49:21.360395 #738999] ERROR -- : from /tmp/ruby/src/trunk/tool/downloader.rb:378:in `with_retry' E, [2024-05-24T16:49:21.360407 #738999] ERROR -- : from /tmp/ruby/src/trunk/tool/downloader.rb:246:in `download' E, [2024-05-24T16:49:21.360423 #738999] ERROR -- : from /tmp/ruby/src/trunk/tool/downloader.rb:136:in `download' E, [2024-05-24T16:49:21.360434 #738999] ERROR -- : from /tmp/ruby/src/trunk/tool/downloader.rb:482:in `block in
' E, [2024-05-24T16:49:21.360453 #738999] ERROR -- : from /tmp/ruby/src/trunk/tool/downloader.rb:465:in `each' E, [2024-05-24T16:49:21.360473 #738999] ERROR -- : from /tmp/ruby/src/trunk/tool/downloader.rb:465:in `
' E, [2024-05-24T16:49:21.364467 #738999] ERROR -- : make: *** [uncommon.mk:1756: /tmp/ruby/src/trunk/enc/unicode/data/emoji/15.0/emoji-test.txt] Error 1 E, [2024-05-24T16:49:21.364524 #738999] ERROR -- : make: *** Waiting for unfinished jobs.... E, [2024-05-24T16:49:21.369626 #738999] ERROR -- : /tmp/ruby/src/trunk/tool/downloader.rb:302:in `rescue in download': failed to download emoji/15.0/emoji-test.txt (RuntimeError) E, [2024-05-24T16:49:21.369701 #738999] ERROR -- : OpenURI::HTTPError: 403 Forbidden: https://www.unicode.org/Public/emoji/15.0/emoji-test.txt E, [2024-05-24T16:49:21.369717 #738999] ERROR -- : from /tmp/ruby/src/trunk/tool/downloader.rb:201:in `download' E, [2024-05-24T16:49:21.369727 #738999] ERROR -- : from /tmp/ruby/src/trunk/tool/downloader.rb:136:in `download' E, [2024-05-24T16:49:21.369736 #738999] ERROR -- : from /tmp/ruby/src/trunk/tool/downloader.rb:482:in `block in
' E, [2024-05-24T16:49:21.369746 #738999] ERROR -- : from /tmp/ruby/src/trunk/tool/downloader.rb:465:in `each' E, [2024-05-24T16:49:21.369755 #738999] ERROR -- : from /tmp/ruby/src/trunk/tool/downloader.rb:465:in `
' E, [2024-05-24T16:49:21.369764 #738999] ERROR -- : /usr/lib/ruby/3.0.0/open-uri.rb:364:in `open_http': 403 Forbidden (OpenURI::HTTPError) E, [2024-05-24T16:49:21.369774 #738999] ERROR -- : from /usr/lib/ruby/3.0.0/open-uri.rb:741:in `buffer_open' E, [2024-05-24T16:49:21.369786 #738999] ERROR -- : from /usr/lib/ruby/3.0.0/open-uri.rb:212:in `block in open_loop' E, [2024-05-24T16:49:21.369796 #738999] ERROR -- : from /usr/lib/ruby/3.0.0/open-uri.rb:210:in `catch' E, [2024-05-24T16:49:21.369805 #738999] ERROR -- : from /usr/lib/ruby/3.0.0/open-uri.rb:210:in `open_loop' E, [2024-05-24T16:49:21.369814 #738999] ERROR -- : from /usr/lib/ruby/3.0.0/open-uri.rb:151:in `open_uri' E, [2024-05-24T16:49:21.369824 #738999] ERROR -- : from /usr/lib/ruby/3.0.0/open-uri.rb:721:in `open' E, [2024-05-24T16:49:21.369833 #738999] ERROR -- : from /usr/lib/ruby/3.0.0/open-uri.rb:729:in `read' E, [2024-05-24T16:49:21.369842 #738999] ERROR -- : from /tmp/ruby/src/trunk/tool/downloader.rb:247:in `block in download' E, [2024-05-24T16:49:21.369850 #738999] ERROR -- : from /tmp/ruby/src/trunk/tool/downloader.rb:378:in `with_retry' E, [2024-05-24T16:49:21.369861 #738999] ERROR -- : from /tmp/ruby/src/trunk/tool/downloader.rb:246:in `download' E, [2024-05-24T16:49:21.369870 #738999] ERROR -- : from /tmp/ruby/src/trunk/tool/downloader.rb:136:in `download' E, [2024-05-24T16:49:21.369878 #738999] ERROR -- : from /tmp/ruby/src/trunk/tool/downloader.rb:482:in `block in
' E, [2024-05-24T16:49:21.369887 #738999] ERROR -- : from /tmp/ruby/src/trunk/tool/downloader.rb:465:in `each' E, [2024-05-24T16:49:21.369896 #738999] ERROR -- : from /tmp/ruby/src/trunk/tool/downloader.rb:465:in `
' E, [2024-05-24T16:49:21.373294 #738999] ERROR -- : make: *** [uncommon.mk:1756: /tmp/ruby/src/trunk/enc/unicode/data/emoji/15.0/emoji-zwj-sequences.txt] Error 1 E, [2024-05-24T16:49:21.379902 #738999] ERROR -- : /tmp/ruby/src/trunk/tool/downloader.rb:302:in `rescue in download': failed to download emoji/15.0/emoji-test.txt (RuntimeError) E, [2024-05-24T16:49:21.379991 #738999] ERROR -- : OpenURI::HTTPError: 403 Forbidden: https://www.unicode.org/Public/emoji/15.0/emoji-test.txt E, [2024-05-24T16:49:21.380023 #738999] ERROR -- : from /tmp/ruby/src/trunk/tool/downloader.rb:201:in `download' E, [2024-05-24T16:49:21.380036 #738999] ERROR -- : from /tmp/ruby/src/trunk/tool/downloader.rb:136:in `download' E, [2024-05-24T16:49:21.380047 #738999] ERROR -- : from /tmp/ruby/src/trunk/tool/downloader.rb:482:in `block in
' E, [2024-05-24T16:49:21.380071 #738999] ERROR -- : from /tmp/ruby/src/trunk/tool/downloader.rb:465:in `each' E, [2024-05-24T16:49:21.380082 #738999] ERROR -- : from /tmp/ruby/src/trunk/tool/downloader.rb:465:in `
' E, [2024-05-24T16:49:21.380093 #738999] ERROR -- : /usr/lib/ruby/3.0.0/open-uri.rb:364:in `open_http': 403 Forbidden (OpenURI::HTTPError) E, [2024-05-24T16:49:21.380104 #738999] ERROR -- : from /usr/lib/ruby/3.0.0/open-uri.rb:741:in `buffer_open' E, [2024-05-24T16:49:21.380117 #738999] ERROR -- : from /usr/lib/ruby/3.0.0/open-uri.rb:212:in `block in open_loop' E, [2024-05-24T16:49:21.380128 #738999] ERROR -- : from /usr/lib/ruby/3.0.0/open-uri.rb:210:in `catch' E, [2024-05-24T16:49:21.380139 #738999] ERROR -- : from /usr/lib/ruby/3.0.0/open-uri.rb:210:in `open_loop' E, [2024-05-24T16:49:21.380149 #738999] ERROR -- : from /usr/lib/ruby/3.0.0/open-uri.rb:151:in `open_uri' E, [2024-05-24T16:49:21.380160 #738999] ERROR -- : from /usr/lib/ruby/3.0.0/open-uri.rb:721:in `open' E, [2024-05-24T16:49:21.380346 #738999] ERROR -- : from /usr/lib/ruby/3.0.0/open-uri.rb:729:in `read' E, [2024-05-24T16:49:21.380358 #738999] ERROR -- : from /tmp/ruby/src/trunk/tool/downloader.rb:247:in `block in download' E, [2024-05-24T16:49:21.380372 #738999] ERROR -- : from /tmp/ruby/src/trunk/tool/downloader.rb:378:in `with_retry' E, [2024-05-24T16:49:21.380382 #738999] ERROR -- : from /tmp/ruby/src/trunk/tool/downloader.rb:246:in `download' E, [2024-05-24T16:49:21.380393 #738999] ERROR -- : from /tmp/ruby/src/trunk/tool/downloader.rb:136:in `download' E, [2024-05-24T16:49:21.380404 #738999] ERROR -- : from /tmp/ruby/src/trunk/tool/downloader.rb:482:in `block in
' E, [2024-05-24T16:49:21.380415 #738999] ERROR -- : from /tmp/ruby/src/trunk/tool/downloader.rb:465:in `each' E, [2024-05-24T16:49:21.380426 #738999] ERROR -- : from /tmp/ruby/src/trunk/tool/downloader.rb:465:in `
' E, [2024-05-24T16:49:21.384207 #738999] ERROR -- : make: *** [uncommon.mk:1756: /tmp/ruby/src/trunk/enc/unicode/data/emoji/15.0/emoji-sequences.txt] Error 1 E, [2024-05-24T16:49:21.384328 #738999] ERROR -- : make: *** Deleting file '/tmp/ruby/src/trunk/enc/unicode/data/emoji/15.0/emoji-sequences.txt' I, [2024-05-24T16:49:21.384283 #738999] INFO -- : downloading emoji/15.0/emoji-test.txt ... I, [2024-05-24T16:49:21.384818 #738999] INFO -- : $$$[end] "make update-unicode -j20" exit with 512. I, [2024-05-24T16:49:21.384883 #738999] INFO -- : $$$[beg] make update-download -j20 I, [2024-05-24T16:49:21.501048 #738999] INFO -- : tool/config.guess already exists I, [2024-05-24T16:49:21.501086 #738999] INFO -- : tool/config.sub already exists I, [2024-05-24T16:49:21.503093 #738999] INFO -- : Update power_assert to 84e85124c5014a139af39161d484156cfe87a9ed I, [2024-05-24T16:49:21.503259 #738999] INFO -- : Update rbs to ba7872795d5de04adb8ff500c0e6afdc81a041dd I, [2024-05-24T16:49:21.503558 #738999] INFO -- : Update typeprof to b19a6416da3a05d57fadd6ffdadb382b6d236ca5 I, [2024-05-24T16:49:21.504190 #738999] INFO -- : echo 84e85124c5014a139af39161d484156cfe87a9ed | /bin/sh /tmp/ruby/src/trunk/tool/ifchange /tmp/ruby/src/trunk/.bundle/.timestamp/power_assert.revision - I, [2024-05-24T16:49:21.504587 #738999] INFO -- : echo ba7872795d5de04adb8ff500c0e6afdc81a041dd | /bin/sh /tmp/ruby/src/trunk/tool/ifchange /tmp/ruby/src/trunk/.bundle/.timestamp/rbs.revision - I, [2024-05-24T16:49:21.504762 #738999] INFO -- : echo b19a6416da3a05d57fadd6ffdadb382b6d236ca5 | /bin/sh /tmp/ruby/src/trunk/tool/ifchange /tmp/ruby/src/trunk/.bundle/.timestamp/typeprof.revision - I, [2024-05-24T16:49:21.506316 #738999] INFO -- : /tmp/ruby/src/trunk/.bundle/.timestamp/power_assert.revision unchanged I, [2024-05-24T16:49:21.506584 #738999] INFO -- : /tmp/ruby/src/trunk/.bundle/.timestamp/typeprof.revision unchanged I, [2024-05-24T16:49:21.506688 #738999] INFO -- : /tmp/ruby/src/trunk/.bundle/.timestamp/rbs.revision unchanged I, [2024-05-24T16:49:21.507349 #738999] INFO -- : Building power_assert@84e85124c5014a139af39161d484156cfe87a9ed to /tmp/ruby/src/trunk/gems/power_assert-2.0.3.gem I, [2024-05-24T16:49:21.577084 #738999] INFO -- : Successfully built RubyGem I, [2024-05-24T16:49:21.577137 #738999] INFO -- : Name: power_assert I, [2024-05-24T16:49:21.577145 #738999] INFO -- : Version: 2.0.4dev I, [2024-05-24T16:49:21.577150 #738999] INFO -- : File: power_assert-2.0.4dev.gem I, [2024-05-24T16:49:21.622745 #738999] INFO -- : $$$[end] "make update-download -j20" exit with 0. I, [2024-05-24T16:49:21.622799 #738999] INFO -- : $$$[beg] make update-rubyspec -j20 I, [2024-05-24T16:49:21.685434 #738999] INFO -- : make: Nothing to be done for 'update-rubyspec'. I, [2024-05-24T16:49:21.685754 #738999] INFO -- : $$$[end] "make update-rubyspec -j20" exit with 0. I, [2024-05-24T16:49:21.685780 #738999] INFO -- : $$$[beg] make update-src -j20 I, [2024-05-24T16:49:22.302897 #738999] INFO -- : Already up to date. I, [2024-05-24T16:49:22.319828 #738999] INFO -- : Latest commit hash = 47f0965269 I, [2024-05-24T16:49:22.321494 #738999] INFO -- : $$$[end] "make update-src -j20" exit with 0. I, [2024-05-24T16:49:22.321541 #738999] INFO -- : $$$[beg] make after-update -j20 I, [2024-05-24T16:49:22.398496 #738999] INFO -- : generating /tmp/ruby/src/trunk/ext/ripper/eventids2table.c I, [2024-05-24T16:49:22.402871 #738999] INFO -- : make[1]: Entering directory '/tmp/ruby/src/trunk/ext/ripper' I, [2024-05-24T16:49:22.402894 #738999] INFO -- : make[1]: Nothing to be done for 'src'. I, [2024-05-24T16:49:22.402900 #738999] INFO -- : make[1]: Leaving directory '/tmp/ruby/src/trunk/ext/ripper' I, [2024-05-24T16:49:22.419153 #738999] INFO -- : /tmp/ruby/src/trunk/revision.h updated I, [2024-05-24T16:49:22.420281 #738999] INFO -- : generating x86_64-linux-fake.rb I, [2024-05-24T16:49:22.471251 #738999] INFO -- : x86_64-linux-fake.rb updated I, [2024-05-24T16:49:22.472612 #738999] INFO -- : generating enc.mk I, [2024-05-24T16:49:22.591850 #738999] INFO -- : making srcs under enc I, [2024-05-24T16:49:22.621798 #738999] INFO -- : make[1]: Entering directory '/tmp/ruby/build/trunk' I, [2024-05-24T16:49:22.621829 #738999] INFO -- : make[1]: Nothing to be done for 'srcs'. I, [2024-05-24T16:49:22.621838 #738999] INFO -- : make[1]: Leaving directory '/tmp/ruby/build/trunk' I, [2024-05-24T16:49:22.666763 #738999] INFO -- : Update power_assert to 84e85124c5014a139af39161d484156cfe87a9ed I, [2024-05-24T16:49:22.667010 #738999] INFO -- : Update rbs to ba7872795d5de04adb8ff500c0e6afdc81a041dd I, [2024-05-24T16:49:22.667314 #738999] INFO -- : Update typeprof to b19a6416da3a05d57fadd6ffdadb382b6d236ca5 I, [2024-05-24T16:49:22.667930 #738999] INFO -- : echo 84e85124c5014a139af39161d484156cfe87a9ed | /bin/sh /tmp/ruby/src/trunk/tool/ifchange /tmp/ruby/src/trunk/.bundle/.timestamp/power_assert.revision - I, [2024-05-24T16:49:22.668624 #738999] INFO -- : echo ba7872795d5de04adb8ff500c0e6afdc81a041dd | /bin/sh /tmp/ruby/src/trunk/tool/ifchange /tmp/ruby/src/trunk/.bundle/.timestamp/rbs.revision - I, [2024-05-24T16:49:22.668856 #738999] INFO -- : echo b19a6416da3a05d57fadd6ffdadb382b6d236ca5 | /bin/sh /tmp/ruby/src/trunk/tool/ifchange /tmp/ruby/src/trunk/.bundle/.timestamp/typeprof.revision - I, [2024-05-24T16:49:22.669893 #738999] INFO -- : /tmp/ruby/src/trunk/.bundle/.timestamp/power_assert.revision unchanged I, [2024-05-24T16:49:22.670419 #738999] INFO -- : /tmp/ruby/src/trunk/.bundle/.timestamp/rbs.revision unchanged I, [2024-05-24T16:49:22.670976 #738999] INFO -- : /tmp/ruby/src/trunk/.bundle/.timestamp/typeprof.revision unchanged I, [2024-05-24T16:49:22.670997 #738999] INFO -- : Building power_assert@84e85124c5014a139af39161d484156cfe87a9ed to /tmp/ruby/src/trunk/gems/power_assert-2.0.3.gem I, [2024-05-24T16:49:22.740427 #738999] INFO -- : Successfully built RubyGem I, [2024-05-24T16:49:22.740473 #738999] INFO -- : Name: power_assert I, [2024-05-24T16:49:22.740483 #738999] INFO -- : Version: 2.0.4dev I, [2024-05-24T16:49:22.740487 #738999] INFO -- : File: power_assert-2.0.4dev.gem I, [2024-05-24T16:49:22.742769 #738999] INFO -- : Extracting bundle gem power_assert-2.0.3... I, [2024-05-24T16:49:22.803429 #738999] INFO -- : Try with hash version of bundled gems instead of gems/power_assert-2.0.3.gem. We don't use this gem with release version of Ruby. I, [2024-05-24T16:49:22.808402 #738999] INFO -- : Unpacked gems/power_assert-2.0.4dev.gem I, [2024-05-24T16:49:22.810280 #738999] INFO -- : $$$[end] "make after-update -j20" exit with 0. I, [2024-05-24T16:49:22.810437 #738999] INFO -- : $$$[beg] make miniruby -j20 I, [2024-05-24T16:49:22.867557 #738999] INFO -- : BASERUBY = /usr/bin/ruby --disable=gems I, [2024-05-24T16:49:22.867585 #738999] INFO -- : CC = gcc I, [2024-05-24T16:49:22.867591 #738999] INFO -- : LD = ld I, [2024-05-24T16:49:22.867594 #738999] INFO -- : LDSHARED = gcc -shared I, [2024-05-24T16:49:22.867598 #738999] INFO -- : CFLAGS = -O3 -fno-fast-math -ggdb3 -Wall -Wextra -Wdeprecated-declarations -Wdiv-by-zero -Wduplicated-cond -Wimplicit-function-declaration -Wimplicit-int -Wpointer-arith -Wwrite-strings -Wold-style-definition -Wimplicit-fallthrough=0 -Wmissing-noreturn -Wno-cast-function-type -Wno-constant-logical-operand -Wno-long-long -Wno-missing-field-initializers -Wno-overlength-strings -Wno-packed-bitfield-compat -Wno-parentheses-equality -Wno-self-assign -Wno-tautological-compare -Wno-unused-parameter -Wno-unused-value -Wsuggest-attribute=format -Wsuggest-attribute=noreturn -Wunused-variable -Wmisleading-indentation -Wundef -fPIC I, [2024-05-24T16:49:22.867602 #738999] INFO -- : XCFLAGS = -U_FORTIFY_SOURCE -D_FORTIFY_SOURCE=2 -fstack-protector-strong -fno-strict-overflow -fvisibility=hidden -fexcess-precision=standard -DRUBY_EXPORT -I. -I.ext/include/x86_64-linux -I/tmp/ruby/src/trunk/include -I/tmp/ruby/src/trunk -I/tmp/ruby/src/trunk/prism -I/tmp/ruby/src/trunk/enc/unicode/15.0.0 I, [2024-05-24T16:49:22.867606 #738999] INFO -- : CPPFLAGS = I, [2024-05-24T16:49:22.867610 #738999] INFO -- : DLDFLAGS = -Wl,--compress-debug-sections=zlib -Wl,-soname,libruby.so.3.4 -fstack-protector-strong I, [2024-05-24T16:49:22.867614 #738999] INFO -- : SOLIBS = -lz -lrt -lrt -lgmp -ldl -lcrypt -lm -lpthread I, [2024-05-24T16:49:22.867618 #738999] INFO -- : LANG = en_US.UTF-8 I, [2024-05-24T16:49:22.867622 #738999] INFO -- : LC_ALL = I, [2024-05-24T16:49:22.867626 #738999] INFO -- : LC_CTYPE = I, [2024-05-24T16:49:22.867629 #738999] INFO -- : MFLAGS = -j20 --jobserver-auth=4,5 I, [2024-05-24T16:49:22.867632 #738999] INFO -- : RUSTC = no I, [2024-05-24T16:49:22.867636 #738999] INFO -- : YJIT_RUSTC_ARGS = --crate-name=yjit --crate-type=staticlib --edition=2021 -g -C lto=thin -C opt-level=3 -C overflow-checks=on '--out-dir=/tmp/ruby/build/trunk/yjit/target/release/' /tmp/ruby/src/trunk/yjit/src/lib.rs I, [2024-05-24T16:49:22.868933 #738999] INFO -- : gcc (Ubuntu 11.4.0-1ubuntu1~22.04) 11.4.0 I, [2024-05-24T16:49:22.868953 #738999] INFO -- : Copyright (C) 2021 Free Software Foundation, Inc. I, [2024-05-24T16:49:22.868959 #738999] INFO -- : This is free software; see the source for copying conditions. There is NO I, [2024-05-24T16:49:22.868965 #738999] INFO -- : warranty; not even for MERCHANTABILITY or FITNESS FOR A PARTICULAR PURPOSE. I, [2024-05-24T16:49:22.868969 #738999] INFO -- : I, [2024-05-24T16:49:22.891231 #738999] INFO -- : compiling /tmp/ruby/src/trunk/version.c I, [2024-05-24T16:49:22.993721 #738999] INFO -- : linking miniruby I, [2024-05-24T16:49:23.552950 #738999] INFO -- : $$$[end] "make miniruby -j20" exit with 0. I, [2024-05-24T16:49:23.553054 #738999] INFO -- : $$$[beg] make ruby -j20 I, [2024-05-24T16:49:23.611227 #738999] INFO -- : BASERUBY = /usr/bin/ruby --disable=gems I, [2024-05-24T16:49:23.611258 #738999] INFO -- : CC = gcc I, [2024-05-24T16:49:23.611270 #738999] INFO -- : LD = ld I, [2024-05-24T16:49:23.611274 #738999] INFO -- : LDSHARED = gcc -shared I, [2024-05-24T16:49:23.611278 #738999] INFO -- : CFLAGS = -O3 -fno-fast-math -ggdb3 -Wall -Wextra -Wdeprecated-declarations -Wdiv-by-zero -Wduplicated-cond -Wimplicit-function-declaration -Wimplicit-int -Wpointer-arith -Wwrite-strings -Wold-style-definition -Wimplicit-fallthrough=0 -Wmissing-noreturn -Wno-cast-function-type -Wno-constant-logical-operand -Wno-long-long -Wno-missing-field-initializers -Wno-overlength-strings -Wno-packed-bitfield-compat -Wno-parentheses-equality -Wno-self-assign -Wno-tautological-compare -Wno-unused-parameter -Wno-unused-value -Wsuggest-attribute=format -Wsuggest-attribute=noreturn -Wunused-variable -Wmisleading-indentation -Wundef -fPIC I, [2024-05-24T16:49:23.611285 #738999] INFO -- : XCFLAGS = -U_FORTIFY_SOURCE -D_FORTIFY_SOURCE=2 -fstack-protector-strong -fno-strict-overflow -fvisibility=hidden -fexcess-precision=standard -DRUBY_EXPORT -I. -I.ext/include/x86_64-linux -I/tmp/ruby/src/trunk/include -I/tmp/ruby/src/trunk -I/tmp/ruby/src/trunk/prism -I/tmp/ruby/src/trunk/enc/unicode/15.0.0 I, [2024-05-24T16:49:23.611289 #738999] INFO -- : CPPFLAGS = I, [2024-05-24T16:49:23.611293 #738999] INFO -- : DLDFLAGS = -Wl,--compress-debug-sections=zlib -Wl,-soname,libruby.so.3.4 -fstack-protector-strong I, [2024-05-24T16:49:23.611296 #738999] INFO -- : SOLIBS = -lz -lrt -lrt -lgmp -ldl -lcrypt -lm -lpthread I, [2024-05-24T16:49:23.611300 #738999] INFO -- : LANG = en_US.UTF-8 I, [2024-05-24T16:49:23.611304 #738999] INFO -- : LC_ALL = I, [2024-05-24T16:49:23.611307 #738999] INFO -- : LC_CTYPE = I, [2024-05-24T16:49:23.611310 #738999] INFO -- : MFLAGS = -j20 --jobserver-auth=4,5 I, [2024-05-24T16:49:23.611314 #738999] INFO -- : RUSTC = no I, [2024-05-24T16:49:23.611318 #738999] INFO -- : YJIT_RUSTC_ARGS = --crate-name=yjit --crate-type=staticlib --edition=2021 -g -C lto=thin -C opt-level=3 -C overflow-checks=on '--out-dir=/tmp/ruby/build/trunk/yjit/target/release/' /tmp/ruby/src/trunk/yjit/src/lib.rs I, [2024-05-24T16:49:23.612693 #738999] INFO -- : gcc (Ubuntu 11.4.0-1ubuntu1~22.04) 11.4.0 I, [2024-05-24T16:49:23.612718 #738999] INFO -- : Copyright (C) 2021 Free Software Foundation, Inc. I, [2024-05-24T16:49:23.612729 #738999] INFO -- : This is free software; see the source for copying conditions. There is NO I, [2024-05-24T16:49:23.612734 #738999] INFO -- : warranty; not even for MERCHANTABILITY or FITNESS FOR A PARTICULAR PURPOSE. I, [2024-05-24T16:49:23.612738 #738999] INFO -- : I, [2024-05-24T16:49:23.722832 #738999] INFO -- : builtin_binary.inc updated I, [2024-05-24T16:49:23.727504 #738999] INFO -- : c86294a81d0df6836359a6b5498b71b1ddba3062aa6ec87c7b2896368a948a19 builtin_binary.inc I, [2024-05-24T16:49:23.728304 #738999] INFO -- : compiling /tmp/ruby/src/trunk/builtin.c I, [2024-05-24T16:49:23.911481 #738999] INFO -- : linking static-library libruby-static.a I, [2024-05-24T16:49:24.222989 #738999] INFO -- : linking shared-library libruby.so.3.4.0 I, [2024-05-24T16:49:25.777653 #738999] INFO -- : linking ruby I, [2024-05-24T16:49:25.805201 #738999] INFO -- : $$$[end] "make ruby -j20" exit with 0. I, [2024-05-24T16:49:25.805310 #738999] INFO -- : $$$[beg] make all -j20 I, [2024-05-24T16:49:25.862610 #738999] INFO -- : BASERUBY = /usr/bin/ruby --disable=gems I, [2024-05-24T16:49:25.862644 #738999] INFO -- : CC = gcc I, [2024-05-24T16:49:25.862650 #738999] INFO -- : LD = ld I, [2024-05-24T16:49:25.862655 #738999] INFO -- : LDSHARED = gcc -shared I, [2024-05-24T16:49:25.862660 #738999] INFO -- : CFLAGS = -O3 -fno-fast-math -ggdb3 -Wall -Wextra -Wdeprecated-declarations -Wdiv-by-zero -Wduplicated-cond -Wimplicit-function-declaration -Wimplicit-int -Wpointer-arith -Wwrite-strings -Wold-style-definition -Wimplicit-fallthrough=0 -Wmissing-noreturn -Wno-cast-function-type -Wno-constant-logical-operand -Wno-long-long -Wno-missing-field-initializers -Wno-overlength-strings -Wno-packed-bitfield-compat -Wno-parentheses-equality -Wno-self-assign -Wno-tautological-compare -Wno-unused-parameter -Wno-unused-value -Wsuggest-attribute=format -Wsuggest-attribute=noreturn -Wunused-variable -Wmisleading-indentation -Wundef -fPIC I, [2024-05-24T16:49:25.862673 #738999] INFO -- : XCFLAGS = -U_FORTIFY_SOURCE -D_FORTIFY_SOURCE=2 -fstack-protector-strong -fno-strict-overflow -fvisibility=hidden -fexcess-precision=standard -DRUBY_EXPORT -I. -I.ext/include/x86_64-linux -I/tmp/ruby/src/trunk/include -I/tmp/ruby/src/trunk -I/tmp/ruby/src/trunk/prism -I/tmp/ruby/src/trunk/enc/unicode/15.0.0 I, [2024-05-24T16:49:25.862677 #738999] INFO -- : CPPFLAGS = I, [2024-05-24T16:49:25.862682 #738999] INFO -- : DLDFLAGS = -Wl,--compress-debug-sections=zlib -Wl,-soname,libruby.so.3.4 -fstack-protector-strong I, [2024-05-24T16:49:25.862686 #738999] INFO -- : SOLIBS = -lz -lrt -lrt -lgmp -ldl -lcrypt -lm -lpthread I, [2024-05-24T16:49:25.862690 #738999] INFO -- : LANG = en_US.UTF-8 I, [2024-05-24T16:49:25.862695 #738999] INFO -- : LC_ALL = I, [2024-05-24T16:49:25.862699 #738999] INFO -- : LC_CTYPE = I, [2024-05-24T16:49:25.862703 #738999] INFO -- : MFLAGS = -j20 --jobserver-auth=4,5 I, [2024-05-24T16:49:25.862708 #738999] INFO -- : RUSTC = no I, [2024-05-24T16:49:25.862712 #738999] INFO -- : YJIT_RUSTC_ARGS = --crate-name=yjit --crate-type=staticlib --edition=2021 -g -C lto=thin -C opt-level=3 -C overflow-checks=on '--out-dir=/tmp/ruby/build/trunk/yjit/target/release/' /tmp/ruby/src/trunk/yjit/src/lib.rs I, [2024-05-24T16:49:25.864378 #738999] INFO -- : gcc (Ubuntu 11.4.0-1ubuntu1~22.04) 11.4.0 I, [2024-05-24T16:49:25.864407 #738999] INFO -- : Copyright (C) 2021 Free Software Foundation, Inc. I, [2024-05-24T16:49:25.864418 #738999] INFO -- : This is free software; see the source for copying conditions. There is NO I, [2024-05-24T16:49:25.864423 #738999] INFO -- : warranty; not even for MERCHANTABILITY or FITNESS FOR A PARTICULAR PURPOSE. I, [2024-05-24T16:49:25.864428 #738999] INFO -- : I, [2024-05-24T16:49:25.903114 #738999] INFO -- : generating encdb.h I, [2024-05-24T16:49:25.904708 #738999] INFO -- : generating enc.mk I, [2024-05-24T16:49:25.906693 #738999] INFO -- : building spec/ruby/optional/capi/ext/array_spec.so I, [2024-05-24T16:49:25.906904 #738999] INFO -- : building spec/ruby/optional/capi/ext/basic_object_spec.so I, [2024-05-24T16:49:25.907538 #738999] INFO -- : building spec/ruby/optional/capi/ext/bignum_spec.so I, [2024-05-24T16:49:25.908316 #738999] INFO -- : building spec/ruby/optional/capi/ext/binding_spec.so I, [2024-05-24T16:49:25.909056 #738999] INFO -- : building spec/ruby/optional/capi/ext/boolean_spec.so I, [2024-05-24T16:49:25.909553 #738999] INFO -- : building spec/ruby/optional/capi/ext/class_id_under_autoload_spec.so I, [2024-05-24T16:49:25.910036 #738999] INFO -- : building spec/ruby/optional/capi/ext/class_spec.so I, [2024-05-24T16:49:25.910548 #738999] INFO -- : building spec/ruby/optional/capi/ext/class_under_autoload_spec.so I, [2024-05-24T16:49:25.911785 #738999] INFO -- : building spec/ruby/optional/capi/ext/complex_spec.so I, [2024-05-24T16:49:25.913230 #738999] INFO -- : building spec/ruby/optional/capi/ext/constants_spec.so I, [2024-05-24T16:49:25.913965 #738999] INFO -- : building spec/ruby/optional/capi/ext/data_spec.so I, [2024-05-24T16:49:25.915001 #738999] INFO -- : building spec/ruby/optional/capi/ext/debug_spec.so I, [2024-05-24T16:49:25.915305 #738999] INFO -- : building spec/ruby/optional/capi/ext/encoding_spec.so I, [2024-05-24T16:49:25.915895 #738999] INFO -- : building spec/ruby/optional/capi/ext/enumerator_spec.so I, [2024-05-24T16:49:25.916139 #738999] INFO -- : building spec/ruby/optional/capi/ext/exception_spec.so I, [2024-05-24T16:49:25.916955 #738999] INFO -- : building spec/ruby/optional/capi/ext/fiber_spec.so I, [2024-05-24T16:49:25.917207 #738999] INFO -- : building spec/ruby/optional/capi/ext/file_spec.so I, [2024-05-24T16:49:25.932177 #738999] INFO -- : building spec/ruby/optional/capi/ext/fixnum_spec.so I, [2024-05-24T16:49:25.942581 #738999] INFO -- : encdb.h unchanged I, [2024-05-24T16:49:25.948362 #738999] INFO -- : building spec/ruby/optional/capi/ext/float_spec.so I, [2024-05-24T16:49:26.024518 #738999] INFO -- : building spec/ruby/optional/capi/ext/gc_spec.so I, [2024-05-24T16:49:26.053387 #738999] INFO -- : building spec/ruby/optional/capi/ext/globals_spec.so I, [2024-05-24T16:49:26.064364 #738999] INFO -- : building spec/ruby/optional/capi/ext/hash_spec.so I, [2024-05-24T16:49:26.066357 #738999] INFO -- : building spec/ruby/optional/capi/ext/integer_spec.so I, [2024-05-24T16:49:26.072835 #738999] INFO -- : building spec/ruby/optional/capi/ext/kernel_spec.so I, [2024-05-24T16:49:26.073067 #738999] INFO -- : building spec/ruby/optional/capi/ext/io_spec.so I, [2024-05-24T16:49:26.074099 #738999] INFO -- : building spec/ruby/optional/capi/ext/language_spec.so I, [2024-05-24T16:49:26.083372 #738999] INFO -- : building spec/ruby/optional/capi/ext/marshal_spec.so I, [2024-05-24T16:49:26.087133 #738999] INFO -- : building spec/ruby/optional/capi/ext/module_spec.so I, [2024-05-24T16:49:26.092712 #738999] INFO -- : building spec/ruby/optional/capi/ext/module_under_autoload_spec.so I, [2024-05-24T16:49:26.094036 #738999] INFO -- : building spec/ruby/optional/capi/ext/mutex_spec.so I, [2024-05-24T16:49:26.095651 #738999] INFO -- : building spec/ruby/optional/capi/ext/numeric_spec.so I, [2024-05-24T16:49:26.103871 #738999] INFO -- : building spec/ruby/optional/capi/ext/proc_spec.so I, [2024-05-24T16:49:26.104008 #738999] INFO -- : building spec/ruby/optional/capi/ext/object_spec.so I, [2024-05-24T16:49:26.105468 #738999] INFO -- : building spec/ruby/optional/capi/ext/range_spec.so I, [2024-05-24T16:49:26.116474 #738999] INFO -- : building spec/ruby/optional/capi/ext/rational_spec.so I, [2024-05-24T16:49:26.157222 #738999] INFO -- : building spec/ruby/optional/capi/ext/rbasic_spec.so I, [2024-05-24T16:49:26.177315 #738999] INFO -- : building spec/ruby/optional/capi/ext/regexp_spec.so I, [2024-05-24T16:49:26.196757 #738999] INFO -- : building spec/ruby/optional/capi/ext/string_spec.so I, [2024-05-24T16:49:26.214066 #738999] INFO -- : building spec/ruby/optional/capi/ext/struct_spec.so I, [2024-05-24T16:49:26.219024 #738999] INFO -- : building spec/ruby/optional/capi/ext/st_spec.so I, [2024-05-24T16:49:26.233362 #738999] INFO -- : building spec/ruby/optional/capi/ext/symbol_spec.so I, [2024-05-24T16:49:26.234550 #738999] INFO -- : building spec/ruby/optional/capi/ext/thread_spec.so I, [2024-05-24T16:49:26.235893 #738999] INFO -- : building spec/ruby/optional/capi/ext/time_spec.so I, [2024-05-24T16:49:26.241291 #738999] INFO -- : building spec/ruby/optional/capi/ext/tracepoint_spec.so I, [2024-05-24T16:49:26.243186 #738999] INFO -- : building spec/ruby/optional/capi/ext/typed_data_spec.so I, [2024-05-24T16:49:26.262663 #738999] INFO -- : building spec/ruby/optional/capi/ext/util_spec.so I, [2024-05-24T16:49:26.280929 #738999] INFO -- : making enc I, [2024-05-24T16:49:26.291848 #738999] INFO -- : making srcs under enc I, [2024-05-24T16:49:26.308067 #738999] INFO -- : make[1]: Entering directory '/tmp/ruby/build/trunk' I, [2024-05-24T16:49:26.308126 #738999] INFO -- : make[1]: Nothing to be done for 'enc'. I, [2024-05-24T16:49:26.308138 #738999] INFO -- : make[1]: Leaving directory '/tmp/ruby/build/trunk' I, [2024-05-24T16:49:26.340371 #738999] INFO -- : make[1]: Entering directory '/tmp/ruby/build/trunk' I, [2024-05-24T16:49:26.340431 #738999] INFO -- : make[1]: Nothing to be done for 'srcs'. I, [2024-05-24T16:49:26.340441 #738999] INFO -- : make[1]: Leaving directory '/tmp/ruby/build/trunk' I, [2024-05-24T16:49:26.341231 #738999] INFO -- : generating transdb.h I, [2024-05-24T16:49:26.451977 #738999] INFO -- : transdb.h unchanged I, [2024-05-24T16:49:26.453203 #738999] INFO -- : generating makefiles ext/configure-ext.mk I, [2024-05-24T16:49:26.453455 #738999] INFO -- : making trans I, [2024-05-24T16:49:26.480249 #738999] INFO -- : ext/configure-ext.mk updated I, [2024-05-24T16:49:26.482745 #738999] INFO -- : make[1]: Entering directory '/tmp/ruby/build/trunk' I, [2024-05-24T16:49:26.489821 #738999] INFO -- : make[1]: Entering directory '/tmp/ruby/build/trunk' I, [2024-05-24T16:49:26.489904 #738999] INFO -- : make[1]: Nothing to be done for 'trans'. I, [2024-05-24T16:49:26.489913 #738999] INFO -- : make[1]: Leaving directory '/tmp/ruby/build/trunk' I, [2024-05-24T16:49:26.550506 #738999] INFO -- : making encs I, [2024-05-24T16:49:26.612262 #738999] INFO -- : make[1]: Entering directory '/tmp/ruby/build/trunk' I, [2024-05-24T16:49:26.612319 #738999] INFO -- : make[1]: Nothing to be done for 'encs'. I, [2024-05-24T16:49:26.612329 #738999] INFO -- : make[1]: Leaving directory '/tmp/ruby/build/trunk' I, [2024-05-24T16:49:26.637918 #738999] INFO -- : make[1]: Leaving directory '/tmp/ruby/build/trunk' I, [2024-05-24T16:49:26.638723 #738999] INFO -- : generating makefile exts.mk I, [2024-05-24T16:49:26.676470 #738999] INFO -- : exts.mk unchanged I, [2024-05-24T16:49:26.681600 #738999] INFO -- : make[1]: Entering directory '/tmp/ruby/build/trunk' I, [2024-05-24T16:49:26.700782 #738999] INFO -- : make[2]: Entering directory '/tmp/ruby/build/trunk/ext/digest' I, [2024-05-24T16:49:26.701898 #738999] INFO -- : make[2]: Entering directory '/tmp/ruby/build/trunk/ext/coverage' I, [2024-05-24T16:49:26.702181 #738999] INFO -- : make[2]: Entering directory '/tmp/ruby/build/trunk/ext/json' I, [2024-05-24T16:49:26.702840 #738999] INFO -- : make[2]: Entering directory '/tmp/ruby/build/trunk/ext/io/console' I, [2024-05-24T16:49:26.703002 #738999] INFO -- : make[2]: Entering directory '/tmp/ruby/build/trunk/ext/date' I, [2024-05-24T16:49:26.704089 #738999] INFO -- : make[2]: Entering directory '/tmp/ruby/build/trunk/ext/monitor' I, [2024-05-24T16:49:26.704111 #738999] INFO -- : make[2]: Leaving directory '/tmp/ruby/build/trunk/ext/digest' I, [2024-05-24T16:49:26.704720 #738999] INFO -- : make[2]: Leaving directory '/tmp/ruby/build/trunk/ext/coverage' I, [2024-05-24T16:49:26.705034 #738999] INFO -- : make[2]: Entering directory '/tmp/ruby/build/trunk/ext/objspace' I, [2024-05-24T16:49:26.705207 #738999] INFO -- : make[2]: Leaving directory '/tmp/ruby/build/trunk/ext/monitor' I, [2024-05-24T16:49:26.705255 #738999] INFO -- : make[2]: Entering directory '/tmp/ruby/build/trunk/ext/fiddle' I, [2024-05-24T16:49:26.705709 #738999] INFO -- : make[2]: Leaving directory '/tmp/ruby/build/trunk/ext/io/console' I, [2024-05-24T16:49:26.706201 #738999] INFO -- : make[2]: Leaving directory '/tmp/ruby/build/trunk/ext/json' I, [2024-05-24T16:49:26.706542 #738999] INFO -- : make[2]: Leaving directory '/tmp/ruby/build/trunk/ext/date' I, [2024-05-24T16:49:26.706904 #738999] INFO -- : make[2]: Entering directory '/tmp/ruby/build/trunk/ext/rubyvm' I, [2024-05-24T16:49:26.707163 #738999] INFO -- : make[2]: Entering directory '/tmp/ruby/build/trunk/ext/pathname' I, [2024-05-24T16:49:26.707325 #738999] INFO -- : make[2]: Entering directory '/tmp/ruby/build/trunk/ext/psych' I, [2024-05-24T16:49:26.707643 #738999] INFO -- : make[2]: Entering directory '/tmp/ruby/build/trunk/ext/pty' I, [2024-05-24T16:49:26.708258 #738999] INFO -- : make[2]: Leaving directory '/tmp/ruby/build/trunk/ext/objspace' I, [2024-05-24T16:49:26.709068 #738999] INFO -- : make[2]: Leaving directory '/tmp/ruby/build/trunk/ext/rubyvm' I, [2024-05-24T16:49:26.709469 #738999] INFO -- : make[2]: Entering directory '/tmp/ruby/build/trunk/.bundle/gems/bigdecimal-3.1.8/ext/bigdecimal' I, [2024-05-24T16:49:26.709707 #738999] INFO -- : make[2]: Entering directory '/tmp/ruby/build/trunk/.bundle/gems/debug-1.9.2/ext/debug' I, [2024-05-24T16:49:26.709793 #738999] INFO -- : make[2]: Leaving directory '/tmp/ruby/build/trunk/ext/pathname' I, [2024-05-24T16:49:26.709822 #738999] INFO -- : make[2]: Entering directory '/tmp/ruby/build/trunk/.bundle/gems/nkf-0.2.0/ext/nkf' I, [2024-05-24T16:49:26.710371 #738999] INFO -- : make[2]: Leaving directory '/tmp/ruby/build/trunk/ext/pty' I, [2024-05-24T16:49:26.710428 #738999] INFO -- : make[2]: Entering directory '/tmp/ruby/build/trunk/.bundle/gems/racc-1.7.3/ext/racc/cparse' I, [2024-05-24T16:49:26.710647 #738999] INFO -- : make[2]: Entering directory '/tmp/ruby/build/trunk/.bundle/gems/racc-1.8.0/ext/racc/cparse' I, [2024-05-24T16:49:26.711300 #738999] INFO -- : make[2]: Entering directory '/tmp/ruby/build/trunk/.bundle/gems/rbs-3.4.4/ext/rbs_extension' I, [2024-05-24T16:49:26.711347 #738999] INFO -- : make[2]: Entering directory '/tmp/ruby/build/trunk/.bundle/gems/syslog-0.1.2/ext/syslog' I, [2024-05-24T16:49:26.712140 #738999] INFO -- : make[2]: Leaving directory '/tmp/ruby/build/trunk/ext/fiddle' I, [2024-05-24T16:49:26.713157 #738999] INFO -- : make[2]: Entering directory '/tmp/ruby/build/trunk/ext/ripper' I, [2024-05-24T16:49:26.715602 #738999] INFO -- : make[2]: Entering directory '/tmp/ruby/build/trunk/ext/digest/sha2' I, [2024-05-24T16:49:26.716507 #738999] INFO -- : make[2]: Entering directory '/tmp/ruby/build/trunk/ext/socket' I, [2024-05-24T16:49:26.718690 #738999] INFO -- : make[2]: Entering directory '/tmp/ruby/build/trunk/ext/openssl' I, [2024-05-24T16:49:26.718832 #738999] INFO -- : make[2]: Leaving directory '/tmp/ruby/build/trunk/ext/digest/sha2' I, [2024-05-24T16:49:26.719916 #738999] INFO -- : make[2]: Leaving directory '/tmp/ruby/build/trunk/ext/psych' I, [2024-05-24T16:49:26.721279 #738999] INFO -- : make[2]: Leaving directory '/tmp/ruby/build/trunk/ext/ripper' I, [2024-05-24T16:49:26.722505 #738999] INFO -- : make[2]: Leaving directory '/tmp/ruby/build/trunk/ext/socket' I, [2024-05-24T16:49:26.732950 #738999] INFO -- : make[2]: Leaving directory '/tmp/ruby/build/trunk/.bundle/gems/racc-1.7.3/ext/racc/cparse' I, [2024-05-24T16:49:26.733089 #738999] INFO -- : make[2]: Leaving directory '/tmp/ruby/build/trunk/.bundle/gems/bigdecimal-3.1.8/ext/bigdecimal' I, [2024-05-24T16:49:26.733237 #738999] INFO -- : make[2]: Leaving directory '/tmp/ruby/build/trunk/.bundle/gems/nkf-0.2.0/ext/nkf' I, [2024-05-24T16:49:26.734747 #738999] INFO -- : make[2]: Leaving directory '/tmp/ruby/build/trunk/.bundle/gems/racc-1.8.0/ext/racc/cparse' I, [2024-05-24T16:49:26.734909 #738999] INFO -- : make[2]: Leaving directory '/tmp/ruby/build/trunk/ext/openssl' I, [2024-05-24T16:49:26.737755 #738999] INFO -- : make[2]: Leaving directory '/tmp/ruby/build/trunk/.bundle/gems/rbs-3.4.4/ext/rbs_extension' I, [2024-05-24T16:49:26.741763 #738999] INFO -- : make[2]: Leaving directory '/tmp/ruby/build/trunk/.bundle/gems/debug-1.9.2/ext/debug' I, [2024-05-24T16:49:26.743092 #738999] INFO -- : make[2]: Leaving directory '/tmp/ruby/build/trunk/.bundle/gems/syslog-0.1.2/ext/syslog' I, [2024-05-24T16:49:26.767163 #738999] INFO -- : make[2]: Entering directory '/tmp/ruby/build/trunk' I, [2024-05-24T16:49:26.837396 #738999] INFO -- : linking ruby I, [2024-05-24T16:49:26.859630 #738999] INFO -- : make[2]: Leaving directory '/tmp/ruby/build/trunk' I, [2024-05-24T16:49:26.860049 #738999] INFO -- : make[1]: Leaving directory '/tmp/ruby/build/trunk' I, [2024-05-24T16:49:26.864170 #738999] INFO -- : make[1]: Entering directory '/tmp/ruby/build/trunk' I, [2024-05-24T16:49:26.864243 #738999] INFO -- : make[1]: Nothing to be done for 'note'. I, [2024-05-24T16:49:26.864256 #738999] INFO -- : make[1]: Leaving directory '/tmp/ruby/build/trunk' I, [2024-05-24T16:49:26.865277 #738999] INFO -- : $$$[end] "make all -j20" exit with 0. I, [2024-05-24T16:49:26.865428 #738999] INFO -- : $$$[beg] make install -j20 I, [2024-05-24T16:49:26.933839 #738999] INFO -- : Update power_assert to 84e85124c5014a139af39161d484156cfe87a9ed I, [2024-05-24T16:49:26.933959 #738999] INFO -- : Update rbs to ba7872795d5de04adb8ff500c0e6afdc81a041dd I, [2024-05-24T16:49:26.934136 #738999] INFO -- : Update typeprof to b19a6416da3a05d57fadd6ffdadb382b6d236ca5 I, [2024-05-24T16:49:26.935493 #738999] INFO -- : BASERUBY = /usr/bin/ruby --disable=gems I, [2024-05-24T16:49:26.935514 #738999] INFO -- : CC = gcc I, [2024-05-24T16:49:26.935520 #738999] INFO -- : LD = ld I, [2024-05-24T16:49:26.935525 #738999] INFO -- : LDSHARED = gcc -shared I, [2024-05-24T16:49:26.935529 #738999] INFO -- : CFLAGS = -O3 -fno-fast-math -ggdb3 -Wall -Wextra -Wdeprecated-declarations -Wdiv-by-zero -Wduplicated-cond -Wimplicit-function-declaration -Wimplicit-int -Wpointer-arith -Wwrite-strings -Wold-style-definition -Wimplicit-fallthrough=0 -Wmissing-noreturn -Wno-cast-function-type -Wno-constant-logical-operand -Wno-long-long -Wno-missing-field-initializers -Wno-overlength-strings -Wno-packed-bitfield-compat -Wno-parentheses-equality -Wno-self-assign -Wno-tautological-compare -Wno-unused-parameter -Wno-unused-value -Wsuggest-attribute=format -Wsuggest-attribute=noreturn -Wunused-variable -Wmisleading-indentation -Wundef -fPIC I, [2024-05-24T16:49:26.935539 #738999] INFO -- : XCFLAGS = -U_FORTIFY_SOURCE -D_FORTIFY_SOURCE=2 -fstack-protector-strong -fno-strict-overflow -fvisibility=hidden -fexcess-precision=standard -DRUBY_EXPORT -I. -I.ext/include/x86_64-linux -I/tmp/ruby/src/trunk/include -I/tmp/ruby/src/trunk -I/tmp/ruby/src/trunk/prism -I/tmp/ruby/src/trunk/enc/unicode/15.0.0 I, [2024-05-24T16:49:26.935543 #738999] INFO -- : CPPFLAGS = I, [2024-05-24T16:49:26.935547 #738999] INFO -- : DLDFLAGS = -Wl,--compress-debug-sections=zlib -Wl,-soname,libruby.so.3.4 -fstack-protector-strong I, [2024-05-24T16:49:26.935551 #738999] INFO -- : SOLIBS = -lz -lrt -lrt -lgmp -ldl -lcrypt -lm -lpthread I, [2024-05-24T16:49:26.935556 #738999] INFO -- : LANG = en_US.UTF-8 I, [2024-05-24T16:49:26.935560 #738999] INFO -- : LC_ALL = I, [2024-05-24T16:49:26.935563 #738999] INFO -- : LC_CTYPE = I, [2024-05-24T16:49:26.935567 #738999] INFO -- : MFLAGS = -j20 --jobserver-auth=4,5 I, [2024-05-24T16:49:26.935570 #738999] INFO -- : RUSTC = no I, [2024-05-24T16:49:26.935574 #738999] INFO -- : YJIT_RUSTC_ARGS = --crate-name=yjit --crate-type=staticlib --edition=2021 -g -C lto=thin -C opt-level=3 -C overflow-checks=on '--out-dir=/tmp/ruby/build/trunk/yjit/target/release/' /tmp/ruby/src/trunk/yjit/src/lib.rs I, [2024-05-24T16:49:26.960384 #738999] INFO -- : echo 84e85124c5014a139af39161d484156cfe87a9ed | /bin/sh /tmp/ruby/src/trunk/tool/ifchange /tmp/ruby/src/trunk/.bundle/.timestamp/power_assert.revision - I, [2024-05-24T16:49:26.960539 #738999] INFO -- : echo ba7872795d5de04adb8ff500c0e6afdc81a041dd | /bin/sh /tmp/ruby/src/trunk/tool/ifchange /tmp/ruby/src/trunk/.bundle/.timestamp/rbs.revision - I, [2024-05-24T16:49:26.960677 #738999] INFO -- : echo b19a6416da3a05d57fadd6ffdadb382b6d236ca5 | /bin/sh /tmp/ruby/src/trunk/tool/ifchange /tmp/ruby/src/trunk/.bundle/.timestamp/typeprof.revision - I, [2024-05-24T16:49:26.961357 #738999] INFO -- : generating encdb.h I, [2024-05-24T16:49:26.961379 #738999] INFO -- : gcc (Ubuntu 11.4.0-1ubuntu1~22.04) 11.4.0 I, [2024-05-24T16:49:26.961385 #738999] INFO -- : Copyright (C) 2021 Free Software Foundation, Inc. I, [2024-05-24T16:49:26.961389 #738999] INFO -- : This is free software; see the source for copying conditions. There is NO I, [2024-05-24T16:49:26.961392 #738999] INFO -- : warranty; not even for MERCHANTABILITY or FITNESS FOR A PARTICULAR PURPOSE. I, [2024-05-24T16:49:26.961397 #738999] INFO -- : I, [2024-05-24T16:49:26.962400 #738999] INFO -- : /tmp/ruby/src/trunk/.bundle/.timestamp/rbs.revision unchanged I, [2024-05-24T16:49:26.962422 #738999] INFO -- : /tmp/ruby/src/trunk/.bundle/.timestamp/power_assert.revision unchanged I, [2024-05-24T16:49:26.962431 #738999] INFO -- : generating enc.mk I, [2024-05-24T16:49:26.962731 #738999] INFO -- : /tmp/ruby/src/trunk/.bundle/.timestamp/typeprof.revision unchanged I, [2024-05-24T16:49:26.985844 #738999] INFO -- : encdb.h unchanged I, [2024-05-24T16:49:26.987080 #738999] INFO -- : Building power_assert@84e85124c5014a139af39161d484156cfe87a9ed to /tmp/ruby/src/trunk/gems/power_assert-2.0.3.gem I, [2024-05-24T16:49:27.055967 #738999] INFO -- : Successfully built RubyGem I, [2024-05-24T16:49:27.056002 #738999] INFO -- : Name: power_assert I, [2024-05-24T16:49:27.056007 #738999] INFO -- : Version: 2.0.4dev I, [2024-05-24T16:49:27.056011 #738999] INFO -- : File: power_assert-2.0.4dev.gem I, [2024-05-24T16:49:27.058083 #738999] INFO -- : Extracting bundle gem power_assert-2.0.3... I, [2024-05-24T16:49:27.085622 #738999] INFO -- : making srcs under enc I, [2024-05-24T16:49:27.085870 #738999] INFO -- : making enc I, [2024-05-24T16:49:27.102844 #738999] INFO -- : make[1]: Entering directory '/tmp/ruby/build/trunk' I, [2024-05-24T16:49:27.102893 #738999] INFO -- : make[1]: Nothing to be done for 'enc'. I, [2024-05-24T16:49:27.102909 #738999] INFO -- : make[1]: Leaving directory '/tmp/ruby/build/trunk' I, [2024-05-24T16:49:27.115342 #738999] INFO -- : make[1]: Entering directory '/tmp/ruby/build/trunk' I, [2024-05-24T16:49:27.115391 #738999] INFO -- : make[1]: Nothing to be done for 'srcs'. I, [2024-05-24T16:49:27.115404 #738999] INFO -- : make[1]: Leaving directory '/tmp/ruby/build/trunk' I, [2024-05-24T16:49:27.116072 #738999] INFO -- : generating transdb.h I, [2024-05-24T16:49:27.119314 #738999] INFO -- : Try with hash version of bundled gems instead of gems/power_assert-2.0.3.gem. We don't use this gem with release version of Ruby. I, [2024-05-24T16:49:27.124308 #738999] INFO -- : Unpacked gems/power_assert-2.0.4dev.gem I, [2024-05-24T16:49:27.212730 #738999] INFO -- : transdb.h unchanged I, [2024-05-24T16:49:27.214350 #738999] INFO -- : generating makefiles ext/configure-ext.mk I, [2024-05-24T16:49:27.214699 #738999] INFO -- : making trans I, [2024-05-24T16:49:27.241478 #738999] INFO -- : ext/configure-ext.mk unchanged I, [2024-05-24T16:49:27.243794 #738999] INFO -- : make[1]: Entering directory '/tmp/ruby/build/trunk' I, [2024-05-24T16:49:27.249869 #738999] INFO -- : make[1]: Entering directory '/tmp/ruby/build/trunk' I, [2024-05-24T16:49:27.249977 #738999] INFO -- : make[1]: Nothing to be done for 'trans'. I, [2024-05-24T16:49:27.250007 #738999] INFO -- : make[1]: Leaving directory '/tmp/ruby/build/trunk' I, [2024-05-24T16:49:27.251024 #738999] INFO -- : making encs I, [2024-05-24T16:49:27.310019 #738999] INFO -- : make[1]: Entering directory '/tmp/ruby/build/trunk' I, [2024-05-24T16:49:27.310097 #738999] INFO -- : make[1]: Nothing to be done for 'encs'. I, [2024-05-24T16:49:27.310123 #738999] INFO -- : make[1]: Leaving directory '/tmp/ruby/build/trunk' I, [2024-05-24T16:49:27.396535 #738999] INFO -- : make[1]: Leaving directory '/tmp/ruby/build/trunk' I, [2024-05-24T16:49:27.397320 #738999] INFO -- : generating makefile exts.mk I, [2024-05-24T16:49:27.434060 #738999] INFO -- : exts.mk unchanged I, [2024-05-24T16:49:27.438767 #738999] INFO -- : make[1]: Entering directory '/tmp/ruby/build/trunk' I, [2024-05-24T16:49:27.456664 #738999] INFO -- : make[2]: Entering directory '/tmp/ruby/build/trunk/ext/digest' I, [2024-05-24T16:49:27.458018 #738999] INFO -- : make[2]: Entering directory '/tmp/ruby/build/trunk/ext/json' I, [2024-05-24T16:49:27.458380 #738999] INFO -- : make[2]: Entering directory '/tmp/ruby/build/trunk/ext/coverage' I, [2024-05-24T16:49:27.458942 #738999] INFO -- : make[2]: Entering directory '/tmp/ruby/build/trunk/ext/io/console' I, [2024-05-24T16:49:27.458969 #738999] INFO -- : make[2]: Entering directory '/tmp/ruby/build/trunk/ext/date' I, [2024-05-24T16:49:27.459991 #738999] INFO -- : make[2]: Entering directory '/tmp/ruby/build/trunk/ext/monitor' I, [2024-05-24T16:49:27.460951 #738999] INFO -- : make[2]: Entering directory '/tmp/ruby/build/trunk/ext/pty' I, [2024-05-24T16:49:27.461002 #738999] INFO -- : make[2]: Entering directory '/tmp/ruby/build/trunk/ext/pathname' I, [2024-05-24T16:49:27.461481 #738999] INFO -- : make[2]: Entering directory '/tmp/ruby/build/trunk/ext/fiddle' I, [2024-05-24T16:49:27.461530 #738999] INFO -- : make[2]: Leaving directory '/tmp/ruby/build/trunk/ext/coverage' I, [2024-05-24T16:49:27.461655 #738999] INFO -- : make[2]: Leaving directory '/tmp/ruby/build/trunk/ext/io/console' I, [2024-05-24T16:49:27.462074 #738999] INFO -- : make[2]: Leaving directory '/tmp/ruby/build/trunk/ext/monitor' I, [2024-05-24T16:49:27.462137 #738999] INFO -- : make[2]: Leaving directory '/tmp/ruby/build/trunk/ext/digest' I, [2024-05-24T16:49:27.462240 #738999] INFO -- : make[2]: Entering directory '/tmp/ruby/build/trunk/ext/psych' I, [2024-05-24T16:49:27.462574 #738999] INFO -- : make[2]: Leaving directory '/tmp/ruby/build/trunk/ext/date' I, [2024-05-24T16:49:27.462745 #738999] INFO -- : make[2]: Entering directory '/tmp/ruby/build/trunk/ext/objspace' I, [2024-05-24T16:49:27.463044 #738999] INFO -- : make[2]: Leaving directory '/tmp/ruby/build/trunk/ext/pathname' I, [2024-05-24T16:49:27.463184 #738999] INFO -- : make[2]: Leaving directory '/tmp/ruby/build/trunk/ext/json' I, [2024-05-24T16:49:27.463661 #738999] INFO -- : make[2]: Leaving directory '/tmp/ruby/build/trunk/ext/pty' I, [2024-05-24T16:49:27.463852 #738999] INFO -- : make[2]: Entering directory '/tmp/ruby/build/trunk/ext/rubyvm' I, [2024-05-24T16:49:27.465034 #738999] INFO -- : make[2]: Entering directory '/tmp/ruby/build/trunk/.bundle/gems/debug-1.9.2/ext/debug' I, [2024-05-24T16:49:27.465057 #738999] INFO -- : make[2]: Entering directory '/tmp/ruby/build/trunk/.bundle/gems/bigdecimal-3.1.8/ext/bigdecimal' I, [2024-05-24T16:49:27.465065 #738999] INFO -- : make[2]: Entering directory '/tmp/ruby/build/trunk/.bundle/gems/nkf-0.2.0/ext/nkf' I, [2024-05-24T16:49:27.465533 #738999] INFO -- : make[2]: Entering directory '/tmp/ruby/build/trunk/.bundle/gems/racc-1.8.0/ext/racc/cparse' I, [2024-05-24T16:49:27.465714 #738999] INFO -- : make[2]: Entering directory '/tmp/ruby/build/trunk/.bundle/gems/syslog-0.1.2/ext/syslog' I, [2024-05-24T16:49:27.465919 #738999] INFO -- : make[2]: Entering directory '/tmp/ruby/build/trunk/ext/ripper' I, [2024-05-24T16:49:27.465948 #738999] INFO -- : make[2]: Entering directory '/tmp/ruby/build/trunk/.bundle/gems/racc-1.7.3/ext/racc/cparse' I, [2024-05-24T16:49:27.466043 #738999] INFO -- : make[2]: Entering directory '/tmp/ruby/build/trunk/.bundle/gems/rbs-3.4.4/ext/rbs_extension' I, [2024-05-24T16:49:27.466526 #738999] INFO -- : make[2]: Leaving directory '/tmp/ruby/build/trunk/ext/rubyvm' I, [2024-05-24T16:49:27.466904 #738999] INFO -- : make[2]: Leaving directory '/tmp/ruby/build/trunk/ext/objspace' I, [2024-05-24T16:49:27.468272 #738999] INFO -- : make[2]: Leaving directory '/tmp/ruby/build/trunk/ext/fiddle' I, [2024-05-24T16:49:27.471991 #738999] INFO -- : make[2]: Entering directory '/tmp/ruby/build/trunk/ext/digest/sha2' I, [2024-05-24T16:49:27.472417 #738999] INFO -- : make[2]: Entering directory '/tmp/ruby/build/trunk/ext/openssl' I, [2024-05-24T16:49:27.473335 #738999] INFO -- : make[2]: Leaving directory '/tmp/ruby/build/trunk/ext/ripper' I, [2024-05-24T16:49:27.474145 #738999] INFO -- : make[2]: Entering directory '/tmp/ruby/build/trunk/ext/socket' I, [2024-05-24T16:49:27.474572 #738999] INFO -- : make[2]: Leaving directory '/tmp/ruby/build/trunk/ext/psych' I, [2024-05-24T16:49:27.475169 #738999] INFO -- : make[2]: Leaving directory '/tmp/ruby/build/trunk/ext/digest/sha2' I, [2024-05-24T16:49:27.480247 #738999] INFO -- : make[2]: Leaving directory '/tmp/ruby/build/trunk/ext/socket' I, [2024-05-24T16:49:27.483630 #738999] INFO -- : make[2]: Leaving directory '/tmp/ruby/build/trunk/ext/openssl' I, [2024-05-24T16:49:27.489116 #738999] INFO -- : make[2]: Leaving directory '/tmp/ruby/build/trunk/.bundle/gems/bigdecimal-3.1.8/ext/bigdecimal' I, [2024-05-24T16:49:27.489295 #738999] INFO -- : make[2]: Leaving directory '/tmp/ruby/build/trunk/.bundle/gems/nkf-0.2.0/ext/nkf' I, [2024-05-24T16:49:27.490380 #738999] INFO -- : make[2]: Leaving directory '/tmp/ruby/build/trunk/.bundle/gems/rbs-3.4.4/ext/rbs_extension' I, [2024-05-24T16:49:27.491107 #738999] INFO -- : make[2]: Leaving directory '/tmp/ruby/build/trunk/.bundle/gems/debug-1.9.2/ext/debug' I, [2024-05-24T16:49:27.495013 #738999] INFO -- : make[2]: Leaving directory '/tmp/ruby/build/trunk/.bundle/gems/racc-1.8.0/ext/racc/cparse' I, [2024-05-24T16:49:27.496879 #738999] INFO -- : make[2]: Leaving directory '/tmp/ruby/build/trunk/.bundle/gems/syslog-0.1.2/ext/syslog' I, [2024-05-24T16:49:27.498376 #738999] INFO -- : make[2]: Leaving directory '/tmp/ruby/build/trunk/.bundle/gems/racc-1.7.3/ext/racc/cparse' I, [2024-05-24T16:49:27.521996 #738999] INFO -- : make[2]: Entering directory '/tmp/ruby/build/trunk' I, [2024-05-24T16:49:27.587156 #738999] INFO -- : make[2]: 'ruby' is up to date. I, [2024-05-24T16:49:27.587217 #738999] INFO -- : make[2]: Leaving directory '/tmp/ruby/build/trunk' I, [2024-05-24T16:49:27.587479 #738999] INFO -- : make[1]: Leaving directory '/tmp/ruby/build/trunk' I, [2024-05-24T16:49:27.591355 #738999] INFO -- : make[1]: Entering directory '/tmp/ruby/build/trunk' I, [2024-05-24T16:49:27.591403 #738999] INFO -- : make[1]: Nothing to be done for 'note'. I, [2024-05-24T16:49:27.591418 #738999] INFO -- : make[1]: Leaving directory '/tmp/ruby/build/trunk' I, [2024-05-24T16:49:27.591468 #738999] INFO -- : ./miniruby -I/tmp/ruby/src/trunk/lib -I. -I.ext/common /tmp/ruby/src/trunk/tool/runruby.rb --extout=.ext -- --disable-gems -r./x86_64-linux-fake /tmp/ruby/src/trunk/tool/rbinstall.rb --make="make" --dest-dir="" --extout=".ext" --ext-build-dir="./ext" --mflags="-j20 --jobserver-auth=4,5" --make-flags=" -j20 --jobserver-auth=4,5" --data-mode=0644 --prog-mode=0755 --installed-list .installed.list --mantype="doc" --gnumake --install=all --exclude=doc I, [2024-05-24T16:49:27.687988 #738999] INFO -- : Installing to I, [2024-05-24T16:49:27.688052 #738999] INFO -- : installing binary commands: /tmp/ruby/install/trunk/bin I, [2024-05-24T16:49:27.688067 #738999] INFO -- : installing base libraries: /tmp/ruby/install/trunk/lib I, [2024-05-24T16:49:27.695319 #738999] INFO -- : installing arch files: /tmp/ruby/install/trunk/lib/ruby/3.4.0+0/x86_64-linux I, [2024-05-24T16:49:27.695379 #738999] INFO -- : installing pkgconfig data: /tmp/ruby/install/trunk/lib/pkgconfig I, [2024-05-24T16:49:27.695392 #738999] INFO -- : installing extension objects: /tmp/ruby/install/trunk/lib/ruby/3.4.0+0/x86_64-linux I, [2024-05-24T16:49:27.705105 #738999] INFO -- : installing extension objects: /tmp/ruby/install/trunk/lib/ruby/site_ruby/3.4.0+0/x86_64-linux I, [2024-05-24T16:49:27.705169 #738999] INFO -- : installing extension objects: /tmp/ruby/install/trunk/lib/ruby/vendor_ruby/3.4.0+0/x86_64-linux I, [2024-05-24T16:49:27.705185 #738999] INFO -- : installing extension headers: /tmp/ruby/install/trunk/include/ruby-3.4.0+0/x86_64-linux I, [2024-05-24T16:49:27.705226 #738999] INFO -- : installing extension scripts: /tmp/ruby/install/trunk/lib/ruby/3.4.0+0 I, [2024-05-24T16:49:27.708002 #738999] INFO -- : installing extension scripts: /tmp/ruby/install/trunk/lib/ruby/site_ruby/3.4.0+0 I, [2024-05-24T16:49:27.708064 #738999] INFO -- : installing extension scripts: /tmp/ruby/install/trunk/lib/ruby/vendor_ruby/3.4.0+0 I, [2024-05-24T16:49:27.708078 #738999] INFO -- : installing extension headers: /tmp/ruby/install/trunk/include/ruby-3.4.0+0/ruby I, [2024-05-24T16:49:27.708091 #738999] INFO -- : installing command scripts: /tmp/ruby/install/trunk/bin I, [2024-05-24T16:49:27.708102 #738999] INFO -- : installing library scripts: /tmp/ruby/install/trunk/lib/ruby/3.4.0+0 I, [2024-05-24T16:49:27.740797 #738999] INFO -- : installing common headers: /tmp/ruby/install/trunk/include/ruby-3.4.0+0 I, [2024-05-24T16:49:27.747230 #738999] INFO -- : installing manpages: /tmp/ruby/install/trunk/share/man/man1 I, [2024-05-24T16:49:27.747297 #738999] INFO -- : installing default gems from lib: /tmp/ruby/install/trunk/lib/ruby/gems/3.4.0+0 I, [2024-05-24T16:49:27.770243 #738999] INFO -- : benchmark 0.3.0 I, [2024-05-24T16:49:27.772125 #738999] INFO -- : bundler 2.6.0.dev I, [2024-05-24T16:49:27.774306 #738999] INFO -- : cgi 0.4.1 I, [2024-05-24T16:49:27.774874 #738999] INFO -- : delegate 0.3.1 I, [2024-05-24T16:49:27.775318 #738999] INFO -- : did_you_mean 1.6.3 I, [2024-05-24T16:49:27.775660 #738999] INFO -- : english 0.8.0 I, [2024-05-24T16:49:27.776305 #738999] INFO -- : erb 4.0.4 I, [2024-05-24T16:49:27.777255 #738999] INFO -- : error_highlight 0.6.0 I, [2024-05-24T16:49:27.778010 #738999] INFO -- : fileutils 1.7.2 I, [2024-05-24T16:49:27.778652 #738999] INFO -- : find 0.2.0 I, [2024-05-24T16:49:27.779515 #738999] INFO -- : forwardable 1.3.3 I, [2024-05-24T16:49:27.780791 #738999] INFO -- : ipaddr 1.2.6 I, [2024-05-24T16:49:27.781435 #738999] INFO -- : irb 1.13.1 I, [2024-05-24T16:49:27.782226 #738999] INFO -- : logger 1.6.0 I, [2024-05-24T16:49:27.782667 #738999] INFO -- : net-http 0.4.1 I, [2024-05-24T16:49:27.783145 #738999] INFO -- : net-protocol 0.2.2 I, [2024-05-24T16:49:27.783628 #738999] INFO -- : open-uri 0.4.1 I, [2024-05-24T16:49:27.784159 #738999] INFO -- : open3 0.2.1 I, [2024-05-24T16:49:27.784612 #738999] INFO -- : optparse 0.5.0 I, [2024-05-24T16:49:27.785090 #738999] INFO -- : ostruct 0.6.0 I, [2024-05-24T16:49:27.785469 #738999] INFO -- : pp 0.5.0 I, [2024-05-24T16:49:27.785973 #738999] INFO -- : prettyprint 0.2.0 I, [2024-05-24T16:49:27.786428 #738999] INFO -- : prism 0.29.0 I, [2024-05-24T16:49:27.786922 #738999] INFO -- : pstore 0.1.3 I, [2024-05-24T16:49:27.787456 #738999] INFO -- : rdoc 6.7.0 I, [2024-05-24T16:49:27.788428 #738999] INFO -- : readline 0.0.4 I, [2024-05-24T16:49:27.788949 #738999] INFO -- : reline 0.5.7 I, [2024-05-24T16:49:27.789490 #738999] INFO -- : resolv 0.4.0 I, [2024-05-24T16:49:27.789956 #738999] INFO -- : ruby2_keywords 0.0.5 I, [2024-05-24T16:49:27.790452 #738999] INFO -- : securerandom 0.3.1 I, [2024-05-24T16:49:27.791375 #738999] INFO -- : set 1.1.0 I, [2024-05-24T16:49:27.792225 #738999] INFO -- : shellwords 0.2.0 I, [2024-05-24T16:49:27.792730 #738999] INFO -- : singleton 0.2.0 I, [2024-05-24T16:49:27.793127 #738999] INFO -- : syntax_suggest 2.0.0 I, [2024-05-24T16:49:27.793800 #738999] INFO -- : tempfile 0.2.1 I, [2024-05-24T16:49:27.794315 #738999] INFO -- : time 0.3.0 I, [2024-05-24T16:49:27.794752 #738999] INFO -- : timeout 0.4.1 I, [2024-05-24T16:49:27.795272 #738999] INFO -- : tmpdir 0.2.0 I, [2024-05-24T16:49:27.795685 #738999] INFO -- : tsort 0.2.0 I, [2024-05-24T16:49:27.796107 #738999] INFO -- : un 0.3.0 I, [2024-05-24T16:49:27.796597 #738999] INFO -- : uri 0.13.0 I, [2024-05-24T16:49:27.797114 #738999] INFO -- : weakref 0.1.3 I, [2024-05-24T16:49:27.797629 #738999] INFO -- : yaml 0.3.0 I, [2024-05-24T16:49:27.797954 #738999] INFO -- : installing default gems from ext: /tmp/ruby/install/trunk/lib/ruby/gems/3.4.0+0 I, [2024-05-24T16:49:27.804562 #738999] INFO -- : date 3.3.4 I, [2024-05-24T16:49:27.805105 #738999] INFO -- : digest 3.1.1 I, [2024-05-24T16:49:27.805553 #738999] INFO -- : etc 1.4.3 I, [2024-05-24T16:49:27.806080 #738999] INFO -- : fcntl 1.1.0 I, [2024-05-24T16:49:27.806570 #738999] INFO -- : fiddle 1.1.3 I, [2024-05-24T16:49:27.807062 #738999] INFO -- : io-console 0.7.2 I, [2024-05-24T16:49:27.807367 #738999] INFO -- : io-nonblock 0.3.0 I, [2024-05-24T16:49:27.807882 #738999] INFO -- : io-wait 0.3.1 I, [2024-05-24T16:49:27.808426 #738999] INFO -- : json 2.7.2 I, [2024-05-24T16:49:27.808967 #738999] INFO -- : openssl 3.2.0 I, [2024-05-24T16:49:27.809560 #738999] INFO -- : pathname 0.3.0 I, [2024-05-24T16:49:27.810041 #738999] INFO -- : psych 5.1.2 I, [2024-05-24T16:49:27.810585 #738999] INFO -- : stringio 3.1.1 I, [2024-05-24T16:49:27.811034 #738999] INFO -- : strscan 3.1.1 I, [2024-05-24T16:49:27.811475 #738999] INFO -- : zlib 3.1.0 I, [2024-05-24T16:49:27.811797 #738999] INFO -- : installing bundled gems: /tmp/ruby/install/trunk/lib/ruby/gems/3.4.0+0 I, [2024-05-24T16:49:27.812402 #738999] INFO -- : minitest 5.23.1 I, [2024-05-24T16:49:27.820999 #738999] INFO -- : rake 13.2.1 I, [2024-05-24T16:49:27.824591 #738999] INFO -- : test-unit 3.6.2 I, [2024-05-24T16:49:27.829387 #738999] INFO -- : rexml 3.2.8 I, [2024-05-24T16:49:27.833136 #738999] INFO -- : rss 0.3.0 I, [2024-05-24T16:49:27.835780 #738999] INFO -- : net-ftp 0.3.4 I, [2024-05-24T16:49:27.837393 #738999] INFO -- : net-imap 0.4.11 I, [2024-05-24T16:49:27.841329 #738999] INFO -- : net-pop 0.1.2 I, [2024-05-24T16:49:27.842343 #738999] INFO -- : net-smtp 0.5.0 I, [2024-05-24T16:49:27.843507 #738999] INFO -- : matrix 0.4.2 I, [2024-05-24T16:49:27.846791 #738999] INFO -- : prime 0.1.2 I, [2024-05-24T16:49:27.851490 #738999] INFO -- : rbs 3.4.4 I, [2024-05-24T16:49:27.874507 #738999] INFO -- : typeprof 0.21.11 I, [2024-05-24T16:49:27.876833 #738999] INFO -- : debug 1.9.2 I, [2024-05-24T16:49:27.880120 #738999] INFO -- : racc 1.8.0 I, [2024-05-24T16:49:27.883026 #738999] INFO -- : mutex_m 0.2.0 I, [2024-05-24T16:49:27.884357 #738999] INFO -- : getoptlong 0.2.1 I, [2024-05-24T16:49:27.885735 #738999] INFO -- : base64 0.2.0 I, [2024-05-24T16:49:27.886846 #738999] INFO -- : bigdecimal 3.1.8 I, [2024-05-24T16:49:27.889127 #738999] INFO -- : observer 0.1.2 I, [2024-05-24T16:49:27.890716 #738999] INFO -- : abbrev 0.1.2 I, [2024-05-24T16:49:27.891799 #738999] INFO -- : resolv-replace 0.1.1 I, [2024-05-24T16:49:27.893293 #738999] INFO -- : rinda 0.2.0 I, [2024-05-24T16:49:27.894622 #738999] INFO -- : drb 2.2.1 I, [2024-05-24T16:49:27.896200 #738999] INFO -- : nkf 0.2.0 I, [2024-05-24T16:49:27.898697 #738999] INFO -- : syslog 0.1.2 I, [2024-05-24T16:49:27.900974 #738999] INFO -- : csv 3.3.0 I, [2024-05-24T16:49:27.903272 #738999] INFO -- : installing bundled gem cache: /tmp/ruby/install/trunk/lib/ruby/gems/3.4.0+0/cache I, [2024-05-24T16:49:27.904837 #738999] INFO -- : skipped bundled gems: I, [2024-05-24T16:49:27.904904 #738999] INFO -- : power_assert-2.0.4dev.gem not found in bundled_gems I, [2024-05-24T16:49:27.907926 #738999] INFO -- : $$$[end] "make install -j20" exit with 0. I, [2024-05-24T16:49:27.908065 #738999] INFO -- : $$$[beg] make yes-btest TESTOPTS='-q -j20' I, [2024-05-24T16:49:33.269311 #738999] INFO -- : PASS all 1936 tests E, [2024-05-24T16:49:33.276823 #738999] ERROR -- : I, [2024-05-24T16:49:33.277154 #738999] INFO -- : $$$[end] "make yes-btest TESTOPTS='-q -j20'" exit with 0. I, [2024-05-24T16:49:33.277242 #738999] INFO -- : $$$[beg] make yes-test-basic TESTS='-j20' I, [2024-05-24T16:49:33.337205 #738999] INFO -- : BASERUBY = /usr/bin/ruby --disable=gems I, [2024-05-24T16:49:33.337258 #738999] INFO -- : CC = gcc I, [2024-05-24T16:49:33.337274 #738999] INFO -- : LD = ld I, [2024-05-24T16:49:33.337291 #738999] INFO -- : LDSHARED = gcc -shared I, [2024-05-24T16:49:33.337306 #738999] INFO -- : CFLAGS = -O3 -fno-fast-math -ggdb3 -Wall -Wextra -Wdeprecated-declarations -Wdiv-by-zero -Wduplicated-cond -Wimplicit-function-declaration -Wimplicit-int -Wpointer-arith -Wwrite-strings -Wold-style-definition -Wimplicit-fallthrough=0 -Wmissing-noreturn -Wno-cast-function-type -Wno-constant-logical-operand -Wno-long-long -Wno-missing-field-initializers -Wno-overlength-strings -Wno-packed-bitfield-compat -Wno-parentheses-equality -Wno-self-assign -Wno-tautological-compare -Wno-unused-parameter -Wno-unused-value -Wsuggest-attribute=format -Wsuggest-attribute=noreturn -Wunused-variable -Wmisleading-indentation -Wundef -fPIC I, [2024-05-24T16:49:33.337321 #738999] INFO -- : XCFLAGS = -U_FORTIFY_SOURCE -D_FORTIFY_SOURCE=2 -fstack-protector-strong -fno-strict-overflow -fvisibility=hidden -fexcess-precision=standard -DRUBY_EXPORT -I. -I.ext/include/x86_64-linux -I/tmp/ruby/src/trunk/include -I/tmp/ruby/src/trunk -I/tmp/ruby/src/trunk/prism -I/tmp/ruby/src/trunk/enc/unicode/15.0.0 I, [2024-05-24T16:49:33.337334 #738999] INFO -- : CPPFLAGS = I, [2024-05-24T16:49:33.337347 #738999] INFO -- : DLDFLAGS = -Wl,--compress-debug-sections=zlib -Wl,-soname,libruby.so.3.4 -fstack-protector-strong I, [2024-05-24T16:49:33.337361 #738999] INFO -- : SOLIBS = -lz -lrt -lrt -lgmp -ldl -lcrypt -lm -lpthread I, [2024-05-24T16:49:33.337374 #738999] INFO -- : LANG = en_US.UTF-8 I, [2024-05-24T16:49:33.337387 #738999] INFO -- : LC_ALL = I, [2024-05-24T16:49:33.337400 #738999] INFO -- : LC_CTYPE = I, [2024-05-24T16:49:33.337413 #738999] INFO -- : MFLAGS = I, [2024-05-24T16:49:33.337425 #738999] INFO -- : RUSTC = no I, [2024-05-24T16:49:33.337438 #738999] INFO -- : YJIT_RUSTC_ARGS = --crate-name=yjit --crate-type=staticlib --edition=2021 -g -C lto=thin -C opt-level=3 -C overflow-checks=on '--out-dir=/tmp/ruby/build/trunk/yjit/target/release/' /tmp/ruby/src/trunk/yjit/src/lib.rs I, [2024-05-24T16:49:33.337824 #738999] INFO -- : gcc (Ubuntu 11.4.0-1ubuntu1~22.04) 11.4.0 I, [2024-05-24T16:49:33.337869 #738999] INFO -- : Copyright (C) 2021 Free Software Foundation, Inc. I, [2024-05-24T16:49:33.337886 #738999] INFO -- : This is free software; see the source for copying conditions. There is NO I, [2024-05-24T16:49:33.337901 #738999] INFO -- : warranty; not even for MERCHANTABILITY or FITNESS FOR A PARTICULAR PURPOSE. I, [2024-05-24T16:49:33.337915 #738999] INFO -- : I, [2024-05-24T16:49:33.444721 #738999] INFO -- : Checking leaked global symbols...none I, [2024-05-24T16:49:33.485416 #738999] INFO -- : /tmp/ruby/src/trunk/basictest/test.rb:assignment ....................................................................................................................................................................................................................................................................................................................................................................................OK 372 I, [2024-05-24T16:49:33.485512 #738999] INFO -- : /tmp/ruby/src/trunk/basictest/test.rb:condition ..OK 2 I, [2024-05-24T16:49:33.485527 #738999] INFO -- : /tmp/ruby/src/trunk/basictest/test.rb:if/unless ...OK 3 I, [2024-05-24T16:49:33.485539 #738999] INFO -- : /tmp/ruby/src/trunk/basictest/test.rb:case .....OK 5 I, [2024-05-24T16:49:33.485692 #738999] INFO -- : /tmp/ruby/src/trunk/basictest/test.rb:while/until ........OK 8 I, [2024-05-24T16:49:33.485743 #738999] INFO -- : /tmp/ruby/src/trunk/basictest/test.rb:exception ..........OK 10 I, [2024-05-24T16:49:33.486016 #738999] INFO -- : /tmp/ruby/src/trunk/basictest/test.rb:array .......................................OK 39 I, [2024-05-24T16:49:33.486123 #738999] INFO -- : /tmp/ruby/src/trunk/basictest/test.rb:hash ...........................OK 27 I, [2024-05-24T16:49:33.486843 #738999] INFO -- : /tmp/ruby/src/trunk/basictest/test.rb:iterator ...........................................................................................................OK 107 I, [2024-05-24T16:49:33.487121 #738999] INFO -- : /tmp/ruby/src/trunk/basictest/test.rb:float ................................................................................OK 80 I, [2024-05-24T16:49:33.489034 #738999] INFO -- : /tmp/ruby/src/trunk/basictest/test.rb:bignum ...............................OK 31 I, [2024-05-24T16:49:33.489812 #738999] INFO -- : /tmp/ruby/src/trunk/basictest/test.rb:string & char ..............................................................OK 62 I, [2024-05-24T16:49:33.489841 #738999] INFO -- : /tmp/ruby/src/trunk/basictest/test.rb:assignment ..........OK 10 I, [2024-05-24T16:49:33.489870 #738999] INFO -- : /tmp/ruby/src/trunk/basictest/test.rb:call ......OK 6 I, [2024-05-24T16:49:33.489920 #738999] INFO -- : /tmp/ruby/src/trunk/basictest/test.rb:proc .........OK 9 I, [2024-05-24T16:49:33.590438 #738999] INFO -- : /tmp/ruby/src/trunk/basictest/test.rb:signal ..OK 2 I, [2024-05-24T16:49:33.592054 #738999] INFO -- : /tmp/ruby/src/trunk/basictest/test.rb:eval ...........................OK 27 I, [2024-05-24T16:49:33.704901 #738999] INFO -- : /tmp/ruby/src/trunk/basictest/test.rb:system ........OK 8 I, [2024-05-24T16:49:33.704993 #738999] INFO -- : /tmp/ruby/src/trunk/basictest/test.rb:const .....OK 5 I, [2024-05-24T16:49:33.705012 #738999] INFO -- : /tmp/ruby/src/trunk/basictest/test.rb:clone .....OK 5 I, [2024-05-24T16:49:33.705113 #738999] INFO -- : /tmp/ruby/src/trunk/basictest/test.rb:marshal ....OK 4 I, [2024-05-24T16:49:33.705143 #738999] INFO -- : /tmp/ruby/src/trunk/basictest/test.rb:pack ....OK 4 I, [2024-05-24T16:49:33.705160 #738999] INFO -- : /tmp/ruby/src/trunk/basictest/test.rb:math ..OK 2 I, [2024-05-24T16:49:33.705198 #738999] INFO -- : /tmp/ruby/src/trunk/basictest/test.rb:struct ......OK 6 I, [2024-05-24T16:49:33.705309 #738999] INFO -- : /tmp/ruby/src/trunk/basictest/test.rb:variable ............OK 12 I, [2024-05-24T16:49:33.705339 #738999] INFO -- : /tmp/ruby/src/trunk/basictest/test.rb:trace ...OK 3 I, [2024-05-24T16:49:33.705394 #738999] INFO -- : /tmp/ruby/src/trunk/basictest/test.rb:defined? ............OK 12 I, [2024-05-24T16:49:33.705501 #738999] INFO -- : /tmp/ruby/src/trunk/basictest/test.rb:alias ......OK 6 I, [2024-05-24T16:49:33.705881 #738999] INFO -- : /tmp/ruby/src/trunk/basictest/test.rb:path .......................OK 23 I, [2024-05-24T16:49:33.738399 #738999] INFO -- : /tmp/ruby/src/trunk/basictest/test.rb:gc ....OK 4 I, [2024-05-24T16:49:33.740903 #738999] INFO -- : I, [2024-05-24T16:49:33.740969 #738999] INFO -- : test succeeded I, [2024-05-24T16:49:33.742469 #738999] INFO -- : $$$[end] "make yes-test-basic TESTS='-j20'" exit with 0. I, [2024-05-24T16:49:33.742578 #738999] INFO -- : $$$[beg] make yes-test-all TESTOPTS='--stderr-on-failure' TESTS='-j20' I, [2024-05-24T16:49:33.836415 #738999] INFO -- : BASERUBY = /usr/bin/ruby --disable=gems I, [2024-05-24T16:49:33.836472 #738999] INFO -- : CC = gcc I, [2024-05-24T16:49:33.836495 #738999] INFO -- : LD = ld I, [2024-05-24T16:49:33.836507 #738999] INFO -- : LDSHARED = gcc -shared I, [2024-05-24T16:49:33.836521 #738999] INFO -- : CFLAGS = -O3 -fno-fast-math -ggdb3 -Wall -Wextra -Wdeprecated-declarations -Wdiv-by-zero -Wduplicated-cond -Wimplicit-function-declaration -Wimplicit-int -Wpointer-arith -Wwrite-strings -Wold-style-definition -Wimplicit-fallthrough=0 -Wmissing-noreturn -Wno-cast-function-type -Wno-constant-logical-operand -Wno-long-long -Wno-missing-field-initializers -Wno-overlength-strings -Wno-packed-bitfield-compat -Wno-parentheses-equality -Wno-self-assign -Wno-tautological-compare -Wno-unused-parameter -Wno-unused-value -Wsuggest-attribute=format -Wsuggest-attribute=noreturn -Wunused-variable -Wmisleading-indentation -Wundef -fPIC I, [2024-05-24T16:49:33.836533 #738999] INFO -- : XCFLAGS = -U_FORTIFY_SOURCE -D_FORTIFY_SOURCE=2 -fstack-protector-strong -fno-strict-overflow -fvisibility=hidden -fexcess-precision=standard -DRUBY_EXPORT -I. -I.ext/include/x86_64-linux -I/tmp/ruby/src/trunk/include -I/tmp/ruby/src/trunk -I/tmp/ruby/src/trunk/prism -I/tmp/ruby/src/trunk/enc/unicode/15.0.0 I, [2024-05-24T16:49:33.836545 #738999] INFO -- : CPPFLAGS = I, [2024-05-24T16:49:33.836555 #738999] INFO -- : DLDFLAGS = -Wl,--compress-debug-sections=zlib -Wl,-soname,libruby.so.3.4 -fstack-protector-strong I, [2024-05-24T16:49:33.836571 #738999] INFO -- : SOLIBS = -lz -lrt -lrt -lgmp -ldl -lcrypt -lm -lpthread I, [2024-05-24T16:49:33.836580 #738999] INFO -- : LANG = en_US.UTF-8 I, [2024-05-24T16:49:33.836590 #738999] INFO -- : LC_ALL = I, [2024-05-24T16:49:33.836599 #738999] INFO -- : LC_CTYPE = I, [2024-05-24T16:49:33.836609 #738999] INFO -- : MFLAGS = I, [2024-05-24T16:49:33.836619 #738999] INFO -- : RUSTC = no I, [2024-05-24T16:49:33.836631 #738999] INFO -- : YJIT_RUSTC_ARGS = --crate-name=yjit --crate-type=staticlib --edition=2021 -g -C lto=thin -C opt-level=3 -C overflow-checks=on '--out-dir=/tmp/ruby/build/trunk/yjit/target/release/' /tmp/ruby/src/trunk/yjit/src/lib.rs I, [2024-05-24T16:49:33.837148 #738999] INFO -- : gcc (Ubuntu 11.4.0-1ubuntu1~22.04) 11.4.0 I, [2024-05-24T16:49:33.837199 #738999] INFO -- : Copyright (C) 2021 Free Software Foundation, Inc. I, [2024-05-24T16:49:33.837213 #738999] INFO -- : This is free software; see the source for copying conditions. There is NO I, [2024-05-24T16:49:33.837224 #738999] INFO -- : warranty; not even for MERCHANTABILITY or FITNESS FOR A PARTICULAR PURPOSE. I, [2024-05-24T16:49:33.837234 #738999] INFO -- : I, [2024-05-24T16:49:33.838872 #738999] INFO -- : generating enc.mk I, [2024-05-24T16:49:33.956007 #738999] INFO -- : generating encdb.h I, [2024-05-24T16:49:33.979847 #738999] INFO -- : encdb.h unchanged I, [2024-05-24T16:49:33.980933 #738999] INFO -- : making enc I, [2024-05-24T16:49:33.998372 #738999] INFO -- : make[1]: Entering directory '/tmp/ruby/build/trunk' I, [2024-05-24T16:49:33.998424 #738999] INFO -- : make[1]: Nothing to be done for 'enc'. I, [2024-05-24T16:49:33.998438 #738999] INFO -- : make[1]: Leaving directory '/tmp/ruby/build/trunk' I, [2024-05-24T16:49:33.999119 #738999] INFO -- : making srcs under enc I, [2024-05-24T16:49:34.028533 #738999] INFO -- : make[1]: Entering directory '/tmp/ruby/build/trunk' I, [2024-05-24T16:49:34.028596 #738999] INFO -- : make[1]: Nothing to be done for 'srcs'. I, [2024-05-24T16:49:34.028612 #738999] INFO -- : make[1]: Leaving directory '/tmp/ruby/build/trunk' I, [2024-05-24T16:49:34.029477 #738999] INFO -- : generating transdb.h I, [2024-05-24T16:49:34.125086 #738999] INFO -- : transdb.h unchanged I, [2024-05-24T16:49:34.126427 #738999] INFO -- : making trans I, [2024-05-24T16:49:34.160489 #738999] INFO -- : make[1]: Entering directory '/tmp/ruby/build/trunk' I, [2024-05-24T16:49:34.160553 #738999] INFO -- : make[1]: Nothing to be done for 'trans'. I, [2024-05-24T16:49:34.160566 #738999] INFO -- : make[1]: Leaving directory '/tmp/ruby/build/trunk' I, [2024-05-24T16:49:34.161137 #738999] INFO -- : making encs I, [2024-05-24T16:49:34.197889 #738999] INFO -- : make[1]: Entering directory '/tmp/ruby/build/trunk' I, [2024-05-24T16:49:34.197965 #738999] INFO -- : make[1]: Nothing to be done for 'encs'. I, [2024-05-24T16:49:34.197979 #738999] INFO -- : make[1]: Leaving directory '/tmp/ruby/build/trunk' I, [2024-05-24T16:49:34.199586 #738999] INFO -- : generating makefiles ext/configure-ext.mk I, [2024-05-24T16:49:34.226448 #738999] INFO -- : ext/configure-ext.mk updated I, [2024-05-24T16:49:34.228926 #738999] INFO -- : make[1]: Entering directory '/tmp/ruby/build/trunk' I, [2024-05-24T16:49:35.617494 #738999] INFO -- : make[1]: Leaving directory '/tmp/ruby/build/trunk' I, [2024-05-24T16:49:35.618282 #738999] INFO -- : generating makefile exts.mk I, [2024-05-24T16:49:35.654833 #738999] INFO -- : exts.mk unchanged I, [2024-05-24T16:49:35.659325 #738999] INFO -- : make[1]: Entering directory '/tmp/ruby/build/trunk' I, [2024-05-24T16:49:35.959440 #738999] INFO -- : make[2]: Entering directory '/tmp/ruby/build/trunk/ext/coverage' I, [2024-05-24T16:49:35.964073 #738999] INFO -- : make[2]: Leaving directory '/tmp/ruby/build/trunk/ext/coverage' I, [2024-05-24T16:49:35.970464 #738999] INFO -- : make[2]: Entering directory '/tmp/ruby/build/trunk/ext/date' I, [2024-05-24T16:49:35.975609 #738999] INFO -- : make[2]: Leaving directory '/tmp/ruby/build/trunk/ext/date' I, [2024-05-24T16:49:35.979377 #738999] INFO -- : make[2]: Entering directory '/tmp/ruby/build/trunk/ext/digest' I, [2024-05-24T16:49:35.988228 #738999] INFO -- : make[2]: Leaving directory '/tmp/ruby/build/trunk/ext/digest' I, [2024-05-24T16:49:36.014784 #738999] INFO -- : make[2]: Entering directory '/tmp/ruby/build/trunk/ext/digest/sha2' I, [2024-05-24T16:49:36.019630 #738999] INFO -- : make[2]: Leaving directory '/tmp/ruby/build/trunk/ext/digest/sha2' I, [2024-05-24T16:49:36.040153 #738999] INFO -- : make[2]: Entering directory '/tmp/ruby/build/trunk/ext/fiddle' I, [2024-05-24T16:49:36.049261 #738999] INFO -- : make[2]: Leaving directory '/tmp/ruby/build/trunk/ext/fiddle' I, [2024-05-24T16:49:36.054155 #738999] INFO -- : make[2]: Entering directory '/tmp/ruby/build/trunk/ext/io/console' I, [2024-05-24T16:49:36.058351 #738999] INFO -- : make[2]: Leaving directory '/tmp/ruby/build/trunk/ext/io/console' I, [2024-05-24T16:49:36.071075 #738999] INFO -- : make[2]: Entering directory '/tmp/ruby/build/trunk/ext/json' I, [2024-05-24T16:49:36.081603 #738999] INFO -- : make[2]: Leaving directory '/tmp/ruby/build/trunk/ext/json' I, [2024-05-24T16:49:36.096932 #738999] INFO -- : make[2]: Entering directory '/tmp/ruby/build/trunk/ext/monitor' I, [2024-05-24T16:49:36.100863 #738999] INFO -- : make[2]: Leaving directory '/tmp/ruby/build/trunk/ext/monitor' I, [2024-05-24T16:49:36.108398 #738999] INFO -- : make[2]: Entering directory '/tmp/ruby/build/trunk/ext/objspace' I, [2024-05-24T16:49:36.114695 #738999] INFO -- : make[2]: Leaving directory '/tmp/ruby/build/trunk/ext/objspace' I, [2024-05-24T16:49:36.130589 #738999] INFO -- : make[2]: Entering directory '/tmp/ruby/build/trunk/ext/openssl' I, [2024-05-24T16:49:36.143955 #738999] INFO -- : make[2]: Leaving directory '/tmp/ruby/build/trunk/ext/openssl' I, [2024-05-24T16:49:36.147941 #738999] INFO -- : make[2]: Entering directory '/tmp/ruby/build/trunk/ext/pathname' I, [2024-05-24T16:49:36.151928 #738999] INFO -- : make[2]: Leaving directory '/tmp/ruby/build/trunk/ext/pathname' I, [2024-05-24T16:49:36.158681 #738999] INFO -- : make[2]: Entering directory '/tmp/ruby/build/trunk/ext/psych' I, [2024-05-24T16:49:36.180028 #738999] INFO -- : make[2]: Leaving directory '/tmp/ruby/build/trunk/ext/psych' I, [2024-05-24T16:49:36.185152 #738999] INFO -- : make[2]: Entering directory '/tmp/ruby/build/trunk/ext/pty' I, [2024-05-24T16:49:36.189242 #738999] INFO -- : make[2]: Leaving directory '/tmp/ruby/build/trunk/ext/pty' I, [2024-05-24T16:49:36.205123 #738999] INFO -- : make[2]: Entering directory '/tmp/ruby/build/trunk/ext/ripper' I, [2024-05-24T16:49:36.212928 #738999] INFO -- : make[2]: Leaving directory '/tmp/ruby/build/trunk/ext/ripper' I, [2024-05-24T16:49:36.215363 #738999] INFO -- : make[2]: Entering directory '/tmp/ruby/build/trunk/ext/rubyvm' I, [2024-05-24T16:49:36.218604 #738999] INFO -- : make[2]: Leaving directory '/tmp/ruby/build/trunk/ext/rubyvm' I, [2024-05-24T16:49:36.230036 #738999] INFO -- : make[2]: Entering directory '/tmp/ruby/build/trunk/ext/socket' I, [2024-05-24T16:49:36.237138 #738999] INFO -- : make[2]: Leaving directory '/tmp/ruby/build/trunk/ext/socket' I, [2024-05-24T16:49:36.254891 #738999] INFO -- : make[2]: Entering directory '/tmp/ruby/build/trunk/.bundle/gems/bigdecimal-3.1.8/ext/bigdecimal' I, [2024-05-24T16:49:36.279417 #738999] INFO -- : make[2]: Leaving directory '/tmp/ruby/build/trunk/.bundle/gems/bigdecimal-3.1.8/ext/bigdecimal' I, [2024-05-24T16:49:36.281422 #738999] INFO -- : make[2]: Entering directory '/tmp/ruby/build/trunk/.bundle/gems/debug-1.9.2/ext/debug' I, [2024-05-24T16:49:36.303298 #738999] INFO -- : make[2]: Leaving directory '/tmp/ruby/build/trunk/.bundle/gems/debug-1.9.2/ext/debug' I, [2024-05-24T16:49:36.305672 #738999] INFO -- : make[2]: Entering directory '/tmp/ruby/build/trunk/.bundle/gems/nkf-0.2.0/ext/nkf' I, [2024-05-24T16:49:36.330740 #738999] INFO -- : make[2]: Leaving directory '/tmp/ruby/build/trunk/.bundle/gems/nkf-0.2.0/ext/nkf' I, [2024-05-24T16:49:36.332744 #738999] INFO -- : make[2]: Entering directory '/tmp/ruby/build/trunk/.bundle/gems/racc-1.7.3/ext/racc/cparse' I, [2024-05-24T16:49:36.355652 #738999] INFO -- : make[2]: Leaving directory '/tmp/ruby/build/trunk/.bundle/gems/racc-1.7.3/ext/racc/cparse' I, [2024-05-24T16:49:36.357871 #738999] INFO -- : make[2]: Entering directory '/tmp/ruby/build/trunk/.bundle/gems/racc-1.8.0/ext/racc/cparse' I, [2024-05-24T16:49:36.382402 #738999] INFO -- : make[2]: Leaving directory '/tmp/ruby/build/trunk/.bundle/gems/racc-1.8.0/ext/racc/cparse' I, [2024-05-24T16:49:36.385052 #738999] INFO -- : make[2]: Entering directory '/tmp/ruby/build/trunk/.bundle/gems/rbs-3.4.4/ext/rbs_extension' I, [2024-05-24T16:49:36.408284 #738999] INFO -- : make[2]: Leaving directory '/tmp/ruby/build/trunk/.bundle/gems/rbs-3.4.4/ext/rbs_extension' I, [2024-05-24T16:49:36.410395 #738999] INFO -- : make[2]: Entering directory '/tmp/ruby/build/trunk/.bundle/gems/syslog-0.1.2/ext/syslog' I, [2024-05-24T16:49:36.431755 #738999] INFO -- : make[2]: Leaving directory '/tmp/ruby/build/trunk/.bundle/gems/syslog-0.1.2/ext/syslog' I, [2024-05-24T16:49:36.455072 #738999] INFO -- : make[2]: Entering directory '/tmp/ruby/build/trunk' I, [2024-05-24T16:49:36.519482 #738999] INFO -- : make[2]: 'ruby' is up to date. I, [2024-05-24T16:49:36.519523 #738999] INFO -- : make[2]: Leaving directory '/tmp/ruby/build/trunk' I, [2024-05-24T16:49:36.519858 #738999] INFO -- : make[1]: Leaving directory '/tmp/ruby/build/trunk' I, [2024-05-24T16:49:36.523432 #738999] INFO -- : make[1]: Entering directory '/tmp/ruby/build/trunk' I, [2024-05-24T16:49:36.523453 #738999] INFO -- : make[1]: Nothing to be done for 'note'. I, [2024-05-24T16:49:36.523459 #738999] INFO -- : make[1]: Leaving directory '/tmp/ruby/build/trunk' I, [2024-05-24T16:49:36.603379 #738999] INFO -- : Run options: I, [2024-05-24T16:49:36.603439 #738999] INFO -- : --seed=46756 I, [2024-05-24T16:49:36.603445 #738999] INFO -- : "--ruby=./miniruby -I/tmp/ruby/src/trunk/lib -I. -I.ext/common /tmp/ruby/src/trunk/tool/runruby.rb --extout=.ext -- --disable-gems" I, [2024-05-24T16:49:36.603450 #738999] INFO -- : --excludes-dir=/tmp/ruby/src/trunk/test/.excludes I, [2024-05-24T16:49:36.603454 #738999] INFO -- : --name=!/memory_leak/ I, [2024-05-24T16:49:36.603458 #738999] INFO -- : --stderr-on-failure I, [2024-05-24T16:49:36.603461 #738999] INFO -- : -j20 I, [2024-05-24T16:49:36.603465 #738999] INFO -- : I, [2024-05-24T16:49:36.603469 #738999] INFO -- : # Running tests: I, [2024-05-24T16:49:36.603473 #738999] INFO -- : I, [2024-05-24T16:49:36.745801 #738999] INFO -- : [ 1/885] 780369=test_rbconfig I, [2024-05-24T16:49:36.751249 #738999] INFO -- : [ 2/885] 780369=test_human_typo I, [2024-05-24T16:49:36.753302 #738999] INFO -- : [ 3/885] 780369=test_primitive I, [2024-05-24T16:49:36.753386 #738999] INFO -- : [ 4/885] 780358=test_rdoc_i18n_locale I, [2024-05-24T16:49:36.753454 #738999] INFO -- : [ 5/885] 780354=test_chilled I, [2024-05-24T16:49:36.753522 #738999] INFO -- : [ 6/885] 780355=test_name_error_extension I, [2024-05-24T16:49:36.753597 #738999] INFO -- : [ 7/885] 780357=test_pair I, [2024-05-24T16:49:36.755731 #738999] INFO -- : [ 8/885] 780359=test_win32ole_param I, [2024-05-24T16:49:36.755796 #738999] INFO -- : [ 9/885] 780370=test_gem_commands_yank_command I, [2024-05-24T16:49:36.756141 #738999] INFO -- : [ 10/885] 780368=test_acceptable I, [2024-05-24T16:49:36.756303 #738999] INFO -- : [ 11/885] 780371=test_rdoc_generator_pot_po_entry I, [2024-05-24T16:49:36.757091 #738999] INFO -- : [ 12/885] 780359=test_euc_jp I, [2024-05-24T16:49:36.757468 #738999] INFO -- : [ 13/885] 780372=test_document I, [2024-05-24T16:49:36.758068 #738999] INFO -- : [ 14/885] 780373=test_rdoc_markup_to_label I, [2024-05-24T16:49:36.758094 #738999] INFO -- : [ 15/885] 780354=test_install I, [2024-05-24T16:49:36.761418 #738999] INFO -- : [ 16/885] 780359=test_sockopt I, [2024-05-24T16:49:36.765225 #738999] INFO -- : [ 17/885] 780369=test_set_len I, [2024-05-24T16:49:36.768167 #738999] INFO -- : [ 18/885] 780369=test_httpresponses I, [2024-05-24T16:49:36.769529 #738999] INFO -- : [ 19/885] 780355=test_encoding I, [2024-05-24T16:49:36.781908 #738999] INFO -- : [ 20/885] 780359=test_rdoc_ri_driver I, [2024-05-24T16:49:36.782147 #738999] INFO -- : [ 21/885] 780356=test_httpheader I, [2024-05-24T16:49:36.783304 #738999] INFO -- : [ 22/885] 780362=test_gem_resolver_local_specification I, [2024-05-24T16:49:36.788200 #738999] INFO -- : [ 23/885] 780372=json_encoding_test I, [2024-05-24T16:49:36.788290 #738999] INFO -- : [ 24/885] 780364=test_color I, [2024-05-24T16:49:36.788411 #738999] INFO -- : [ 25/885] 780366=test_key_stroke I, [2024-05-24T16:49:36.788496 #738999] INFO -- : [ 26/885] 780360=test_terminfo I, [2024-05-24T16:49:36.788606 #738999] INFO -- : [ 27/885] 780363=test_compile_prism I, [2024-05-24T16:49:36.792115 #738999] INFO -- : [ 28/885] 780365=test_rdoc_markup_to_html I, [2024-05-24T16:49:36.793889 #738999] INFO -- : [ 29/885] 780367=test_date_compat I, [2024-05-24T16:49:36.794794 #738999] INFO -- : [ 30/885] 780372=test_bug-14834 I, [2024-05-24T16:49:36.795927 #738999] INFO -- : [ 31/885] 780361=test_addrinfo I, [2024-05-24T16:49:36.801701 #738999] INFO -- : [ 32/885] 780367=test_http I, [2024-05-24T16:49:36.805925 #738999] INFO -- : [ 33/885] 780355=test_tree_spell_checker I, [2024-05-24T16:49:36.827628 #738999] INFO -- : [ 34/885] 780369=redundant_return_test I, [2024-05-24T16:49:36.828752 #738999] INFO -- : [ 35/885] 780355=test_case_mapping I, [2024-05-24T16:49:36.847595 #738999] INFO -- : [ 36/885] 780355=test_path I, [2024-05-24T16:49:36.855557 #738999] INFO -- : [ 37/885] 780355=test_win32ole_param_event I, [2024-05-24T16:49:36.856726 #738999] INFO -- : [ 38/885] 780355=test_bn I, [2024-05-24T16:49:36.860520 #738999] INFO -- : [ 39/885] 780360=test_unicode I, [2024-05-24T16:49:36.862604 #738999] INFO -- : [ 40/885] 780366=test_rdoc_parser_changelog I, [2024-05-24T16:49:36.867176 #738999] INFO -- : [ 41/885] 780358=test_enumerator I, [2024-05-24T16:49:36.870075 #738999] INFO -- : [ 42/885] 780372=test_koi8 I, [2024-05-24T16:49:36.871751 #738999] INFO -- : [ 43/885] 780372=parameters_signature_test I, [2024-05-24T16:49:36.872701 #738999] INFO -- : [ 44/885] 780358=test_rdoc_generator_pot I, [2024-05-24T16:49:36.874121 #738999] INFO -- : [ 45/885] 780360=static_literals_test I, [2024-05-24T16:49:36.884203 #738999] INFO -- : [ 46/885] 780356=test_data I, [2024-05-24T16:49:36.889947 #738999] INFO -- : [ 47/885] 780356=test_filter I, [2024-05-24T16:49:36.893343 #738999] INFO -- : [ 48/885] 780369=test_gem_gem_runner I, [2024-05-24T16:49:36.893933 #738999] INFO -- : [ 49/885] 780368=test_rdoc_method_attr I, [2024-05-24T16:49:36.900511 #738999] INFO -- : [ 50/885] 780371=test_notimplement I, [2024-05-24T16:49:36.903511 #738999] INFO -- : [ 51/885] 780371=test_random I, [2024-05-24T16:49:36.904570 #738999] INFO -- : [ 52/885] 780373=test_gem_uri I, [2024-05-24T16:49:36.905734 #738999] INFO -- : [ 53/885] 780358=test_key_event_record I, [2024-05-24T16:49:36.913059 #738999] INFO -- : [ 54/885] 780371=test_gem_resolver_vendor_specification I, [2024-05-24T16:49:36.931744 #738999] INFO -- : [ 55/885] 780356=test_gem_commands_update_command I, [2024-05-24T16:49:36.932279 #738999] INFO -- : [ 56/885] 780364=test_ssl_session I, [2024-05-24T16:49:36.936083 #738999] INFO -- : [ 57/885] 780355=test_lexer I, [2024-05-24T16:49:36.949263 #738999] INFO -- : [ 58/885] 780372=test_thread_cv I, [2024-05-24T16:49:36.949427 #738999] INFO -- : [ 59/885] 780360=test_case_comprehensive I, [2024-05-24T16:49:36.952155 #738999] INFO -- : [ 60/885] 780355=test_interned_str I, [2024-05-24T16:49:36.954914 #738999] INFO -- : [ 61/885] 780358=test_gem_commands_build_command I, [2024-05-24T16:49:36.955642 #738999] INFO -- : [ 62/885] 780355=test_tracer I, [2024-05-24T16:49:36.976034 #738999] INFO -- : [ 63/885] 780361=test_cmethod I, [2024-05-24T16:49:36.979613 #738999] INFO -- : [ 64/885] 780361=test_option I, [2024-05-24T16:49:36.985879 #738999] INFO -- : [ 65/885] 780354=test_append I, [2024-05-24T16:49:36.988630 #738999] INFO -- : [ 66/885] 780354=test_gem_commands_server_command I, [2024-05-24T16:49:37.008912 #738999] INFO -- : [ 67/885] 780362=test_did_you_mean I, [2024-05-24T16:49:37.041274 #738999] INFO -- : [ 68/885] 780365=test_io_m17n I, [2024-05-24T16:49:37.061850 #738999] INFO -- : [ 69/885] 780355=test_variable_name_check I, [2024-05-24T16:49:37.075731 #738999] INFO -- : [ 70/885] 780363=test_rdoc_markup_heading I, [2024-05-24T16:49:37.092139 #738999] INFO -- : [ 71/885] 780355=test_exception_at_throwing I, [2024-05-24T16:49:37.103704 #738999] INFO -- : [ 72/885] 780369=test_iseq I, [2024-05-24T16:49:37.111655 #738999] INFO -- : [ 73/885] 780371=test_scheduler I, [2024-05-24T16:49:37.126613 #738999] INFO -- : [ 74/885] 780354=test_pkey_dsa I, [2024-05-24T16:49:37.127022 #738999] INFO -- : [ 75/885] 780373=test_ocsp I, [2024-05-24T16:49:37.131897 #738999] INFO -- : [ 76/885] 780361=test_class I, [2024-05-24T16:49:37.133095 #738999] INFO -- : [ 77/885] 780366=test_help I, [2024-05-24T16:49:37.139814 #738999] INFO -- : [ 78/885] 780362=test_rdoc_markup_to_bs I, [2024-05-24T16:49:37.140348 #738999] INFO -- : [ 79/885] 780368=test_beginendblock I, [2024-05-24T16:49:37.142996 #738999] INFO -- : [ 80/885] 780366=test_files_lib I, [2024-05-24T16:49:37.164495 #738999] INFO -- : [ 81/885] 780355=test_gem_commands_unpack_command I, [2024-05-24T16:49:37.166845 #738999] INFO -- : [ 82/885] 780361=reflection_test I, [2024-05-24T16:49:37.186597 #738999] INFO -- : [ 83/885] 780363=test_within_pipe I, [2024-05-24T16:49:37.253967 #738999] INFO -- : [ 84/885] 780361=test_emoji_breaks I, [2024-05-24T16:49:37.255080 #738999] INFO -- : [ 85/885] 780361=test_gem_bundler_version_finder I, [2024-05-24T16:49:37.258334 #738999] INFO -- : [ 86/885] 780363=test_pinned I, [2024-05-24T16:49:37.259240 #738999] INFO -- : [ 87/885] 780371=test_stream I, [2024-05-24T16:49:37.273489 #738999] INFO -- : [ 88/885] 780363=test_to_ary_concat I, [2024-05-24T16:49:37.282156 #738999] INFO -- : [ 89/885] 780359=test_time I, [2024-05-24T16:49:37.283647 #738999] INFO -- : [ 90/885] 780371=test_webauthn_listener_response I, [2024-05-24T16:49:37.303353 #738999] INFO -- : [ 91/885] 780362=test_printf I, [2024-05-24T16:49:37.305048 #738999] INFO -- : [ 92/885] 780371=test_rdoc_markup_pre_process I, [2024-05-24T16:49:37.316855 #738999] INFO -- : [ 93/885] 780362=test_exit I, [2024-05-24T16:49:37.366199 #738999] INFO -- : [ 94/885] 780371=test_recursion I, [2024-05-24T16:49:37.370156 #738999] INFO -- : [ 95/885] 780371=test_mkmf I, [2024-05-24T16:49:37.372565 #738999] INFO -- : [ 96/885] 780358=test_date_marshal I, [2024-05-24T16:49:37.376637 #738999] INFO -- : [ 97/885] 780358=test_history I, [2024-05-24T16:49:37.389837 #738999] INFO -- : [ 98/885] 780362=test_popen_deadlock I, [2024-05-24T16:49:37.395478 #738999] INFO -- : [ 99/885] 780370=test_delegate I, [2024-05-24T16:49:37.398815 #738999] INFO -- : [100/885] 780373=test_bundled_ca I, [2024-05-24T16:49:37.402394 #738999] INFO -- : [101/885] 780371=test_closure I, [2024-05-24T16:49:37.412357 #738999] INFO -- : [102/885] 780370=test_open3 I, [2024-05-24T16:49:37.442231 #738999] INFO -- : [103/885] 780358=test_multi_irb_commands I, [2024-05-24T16:49:37.448113 #738999] INFO -- : [104/885] 780368=test_fiber I, [2024-05-24T16:49:37.450637 #738999] INFO -- : [105/885] 780359=test_rdoc_servlet I, [2024-05-24T16:49:37.455511 #738999] INFO -- : [106/885] 780358=test_gem_security I, [2024-05-24T16:49:37.487010 #738999] INFO -- : [107/885] 780361=test_ractor I, [2024-05-24T16:49:37.559808 #738999] INFO -- : [108/885] 780361=test_digest I, [2024-05-24T16:49:37.572153 #738999] INFO -- : [109/885] 780361=test_gem_source_git I, [2024-05-24T16:49:37.580573 #738999] INFO -- : [110/885] 780359=test_regex_casefold I, [2024-05-24T16:49:37.583006 #738999] INFO -- : [111/885] 780355=test_gem_commands_signout_command I, [2024-05-24T16:49:37.583463 #738999] INFO -- : [112/885] 780372=test_refinement I, [2024-05-24T16:49:37.599553 #738999] INFO -- : [113/885] 780355=test_gem_resolver_installer_set I, [2024-05-24T16:49:37.654677 #738999] INFO -- : [114/885] 780363=test_dir_m17n I, [2024-05-24T16:49:37.677892 #738999] INFO -- : [115/885] 780371=test_require I, [2024-05-24T16:49:37.731258 #738999] INFO -- : [116/885] 780369=test_cgi_cookie I, [2024-05-24T16:49:37.734926 #738999] INFO -- : [117/885] 780354=test_float I, [2024-05-24T16:49:37.744758 #738999] INFO -- : [118/885] 780369=test_process I, [2024-05-24T16:49:37.776142 #738999] INFO -- : [119/885] 780369=test_input_method I, [2024-05-24T16:49:37.792612 #738999] INFO -- : [120/885] 780355=test_windows_1252 I, [2024-05-24T16:49:37.797888 #738999] INFO -- : [121/885] 780355=test_rdoc_top_level I, [2024-05-24T16:49:37.933577 #738999] INFO -- : [122/885] 780362=test_metaclass I, [2024-05-24T16:49:37.935919 #738999] INFO -- : [123/885] 780362=test_rdoc_rd I, [2024-05-24T16:49:37.952310 #738999] INFO -- : [124/885] 780362=test_cgi_session I, [2024-05-24T16:49:37.969278 #738999] INFO -- : [125/885] 780362=test_x509crl I, [2024-05-24T16:49:37.970551 #738999] INFO -- : [126/885] 780364=test_fixnum I, [2024-05-24T16:49:37.985036 #738999] INFO -- : [127/885] 780364=test_signal I, [2024-05-24T16:49:38.051028 #738999] INFO -- : [128/885] 780359=test_memory_view I, [2024-05-24T16:49:38.068369 #738999] INFO -- : [129/885] 780359=pattern_test I, [2024-05-24T16:49:38.085077 #738999] INFO -- : [130/885] 780361=test_debug I, [2024-05-24T16:49:38.085286 #738999] INFO -- : [131/885] 780369=test_shellwords I, [2024-05-24T16:49:38.088649 #738999] INFO -- : [132/885] 780361=test_digest_extend I, [2024-05-24T16:49:38.091383 #738999] INFO -- : [133/885] 780369=test_omap I, [2024-05-24T16:49:38.099511 #738999] INFO -- : [134/885] 780361=test_iterator I, [2024-05-24T16:49:38.118975 #738999] INFO -- : [135/885] 780359=test_string I, [2024-05-24T16:49:38.120449 #738999] INFO -- : [136/885] 780362=test_storage I, [2024-05-24T16:49:38.121536 #738999] INFO -- : [137/885] 780369=test_gem_resolver_git_set I, [2024-05-24T16:49:38.122260 #738999] INFO -- : [138/885] 780359=test_new I, [2024-05-24T16:49:38.124385 #738999] INFO -- : [139/885] 780362=test_gem_security_signer I, [2024-05-24T16:49:38.125309 #738999] INFO -- : [140/885] 780359=test_cipher I, [2024-05-24T16:49:38.132026 #738999] INFO -- : [141/885] 780355=test_nomethod_error I, [2024-05-24T16:49:38.143633 #738999] INFO -- : [142/885] 780355=json_parser_test I, [2024-05-24T16:49:38.160718 #738999] INFO -- : [143/885] 780355=memsize_test I, [2024-05-24T16:49:38.175446 #738999] INFO -- : [144/885] 780361=test_config I, [2024-05-24T16:49:38.197678 #738999] INFO -- : [145/885] 780361=test_win32ole_variant_outarg I, [2024-05-24T16:49:38.200821 #738999] INFO -- : [146/885] 780361=json_common_interface_test I, [2024-05-24T16:49:38.210278 #738999] INFO -- : [147/885] 780359=test_dln I, [2024-05-24T16:49:38.221095 #738999] INFO -- : [148/885] 780359=test_gem_source_subpath_problem I, [2024-05-24T16:49:38.234830 #738999] INFO -- : [149/885] 780361=magic_comment_test I, [2024-05-24T16:49:38.237766 #738999] INFO -- : [150/885] 780355=test_rdoc_markup_to_html_snippet I, [2024-05-24T16:49:38.238869 #738999] INFO -- : [151/885] 780361=test_struct I, [2024-05-24T16:49:38.243124 #738999] INFO -- : [152/885] 780361=test_variable I, [2024-05-24T16:49:38.243934 #738999] INFO -- : [153/885] 780362=fuzzer_test I, [2024-05-24T16:49:38.304838 #738999] INFO -- : [154/885] 780355=test_sexp I, [2024-05-24T16:49:38.309845 #738999] INFO -- : [155/885] 780365=test_rdoc_markup_include I, [2024-05-24T16:49:38.310292 #738999] INFO -- : [156/885] 780365=test_pkg_config I, [2024-05-24T16:49:38.324208 #738999] INFO -- : [157/885] 780355=test_cparser I, [2024-05-24T16:49:38.347084 #738999] INFO -- : [158/885] 780365=test_insns_leaf I, [2024-05-24T16:49:38.352242 #738999] INFO -- : [159/885] 780365=test_serialize_subclasses I, [2024-05-24T16:49:38.357606 #738999] INFO -- : [160/885] 780356=test_color_printer I, [2024-05-24T16:49:38.359013 #738999] INFO -- : [161/885] 780362=test_deprecated I, [2024-05-24T16:49:38.364073 #738999] INFO -- : [162/885] 780361=test_div I, [2024-05-24T16:49:38.365117 #738999] INFO -- : [163/885] 780362=test_allocation I, [2024-05-24T16:49:38.365519 #738999] INFO -- : [164/885] 780361=test_engine I, [2024-05-24T16:49:38.366813 #738999] INFO -- : [165/885] 780361=test_win32ole_variant_m I, [2024-05-24T16:49:38.369605 #738999] INFO -- : [166/885] 780361=test_key_error I, [2024-05-24T16:49:38.371198 #738999] INFO -- : [167/885] 780361=test_mutex I, [2024-05-24T16:49:38.371722 #738999] INFO -- : [168/885] 780365=test_x509req I, [2024-05-24T16:49:38.431970 #738999] INFO -- : [169/885] 780356=test_rdoc_rd_inline I, [2024-05-24T16:49:38.440656 #738999] INFO -- : [170/885] 780373=test_files_test_1 I, [2024-05-24T16:49:38.448563 #738999] INFO -- : [171/885] 780356=test_struct I, [2024-05-24T16:49:38.480507 #738999] INFO -- : [172/885] 780359=test_gem_path_support I, [2024-05-24T16:49:38.489828 #738999] INFO -- : [173/885] 780369=test_set I, [2024-05-24T16:49:38.504568 #738999] INFO -- : [174/885] 780359=test_module I, [2024-05-24T16:49:38.520927 #738999] INFO -- : [175/885] 780369=test_gem_request_set I, [2024-05-24T16:49:38.605448 #738999] INFO -- : [176/885] 780365=constant_path_node_test I, [2024-05-24T16:49:38.704632 #738999] INFO -- : [177/885] 780365=test_ssl I, [2024-05-24T16:49:38.746618 #738999] INFO -- : [178/885] 780355=test_gem_ext_cargo_builder I, [2024-05-24T16:49:38.764090 #738999] INFO -- : [179/885] 780355=test_method_name_check I, [2024-05-24T16:49:38.774501 #738999] INFO -- : [180/885] 780355=test_arith_seq_extract I, [2024-05-24T16:49:38.913651 #738999] INFO -- : [181/885] 780363=test_parser I, [2024-05-24T16:49:38.939654 #738999] INFO -- : [182/885] 780355=test_whileuntil I, [2024-05-24T16:49:38.943063 #738999] INFO -- : [183/885] 780355=test_rdoc_generator_markup I, [2024-05-24T16:49:38.947964 #738999] INFO -- : [184/885] 780355=test_rubyvm I, [2024-05-24T16:49:38.950131 #738999] INFO -- : [185/885] 780369=test_configuration I, [2024-05-24T16:49:38.952032 #738999] INFO -- : [186/885] 780355=test_monitor I, [2024-05-24T16:49:38.956107 #738999] INFO -- : [187/885] 780363=test_buffered_io I, [2024-05-24T16:49:39.059159 #738999] INFO -- : [188/885] 780369=test_stringify_symbols I, [2024-05-24T16:49:39.063027 #738999] INFO -- : [189/885] 780356=test_instrumentation_api I, [2024-05-24T16:49:39.069487 #738999] INFO -- : [190/885] 780369=integer_parse_test I, [2024-05-24T16:49:39.071548 #738999] INFO -- : [191/885] 780369=test_boolean I, [2024-05-24T16:49:39.075244 #738999] INFO -- : [192/885] 780369=test_scalar_scanner I, [2024-05-24T16:49:39.080203 #738999] INFO -- : [193/885] 780369=test_gem_source I, [2024-05-24T16:49:39.089327 #738999] INFO -- : [194/885] 780363=test_array I, [2024-05-24T16:49:39.102575 #738999] INFO -- : [195/885] 780354=test_helper_method I, [2024-05-24T16:49:39.170114 #738999] INFO -- : [196/885] 780355=test_gem_package_tar_writer I, [2024-05-24T16:49:39.176920 #738999] INFO -- : [197/885] 780354=test_gem_commands_outdated_command I, [2024-05-24T16:49:39.235327 #738999] INFO -- : [198/885] 780354=test_benchmark I, [2024-05-24T16:49:39.245355 #738999] INFO -- : [199/885] 780369=test_gem_dependency_list I, [2024-05-24T16:49:39.282752 #738999] INFO -- : [200/885] 780369=test_nesting_parser I, [2024-05-24T16:49:39.290209 #738999] INFO -- : [201/885] 780355=test_win32ole_method_event I, [2024-05-24T16:49:39.293769 #738999] INFO -- : [202/885] 780369=test_gem_ext_builder I, [2024-05-24T16:49:39.302987 #738999] INFO -- : [203/885] 780355=test_https I, [2024-05-24T16:49:39.516877 #738999] INFO -- : [204/885] 780361=test_evaluation I, [2024-05-24T16:49:39.526441 #738999] INFO -- : [205/885] 780361=test_provider I, [2024-05-24T16:49:39.683002 #738999] INFO -- : [206/885] 780366=test_abi I, [2024-05-24T16:49:39.729411 #738999] INFO -- : [207/885] 780355=test_load I, [2024-05-24T16:49:39.731721 #738999] INFO -- : [208/885] 780355=test_yamldbm I, [2024-05-24T16:49:39.742003 #738999] INFO -- : [209/885] 780355=test_gem_commands_rebuild_command I, [2024-05-24T16:49:39.744103 #738999] INFO -- : [210/885] 780370=test_rdoc_parser_simple I, [2024-05-24T16:49:39.798815 #738999] INFO -- : [211/885] 780355=test_yield_block I, [2024-05-24T16:49:39.805073 #738999] INFO -- : [212/885] 780355=test_len I, [2024-05-24T16:49:39.811380 #738999] INFO -- : [213/885] 780355=test_gem_commands_cert_command I, [2024-05-24T16:49:39.820831 #738999] INFO -- : [214/885] 780366=test_completion I, [2024-05-24T16:49:39.863242 #738999] INFO -- : [215/885] 780361=test_gem_source_installed I, [2024-05-24T16:49:39.895147 #738999] INFO -- : [216/885] 780361=test_erb I, [2024-05-24T16:49:39.944476 #738999] INFO -- : [217/885] 780361=test_x509ext I, [2024-05-24T16:49:39.950671 #738999] INFO -- : [218/885] 780361=test_propertyputref I, [2024-05-24T16:49:39.957318 #738999] INFO -- : [219/885] 780370=attribute_write_test I, [2024-05-24T16:49:39.962079 #738999] INFO -- : [220/885] 780361=test_spell_checker I, [2024-05-24T16:49:39.975647 #738999] INFO -- : [221/885] 780361=test_assembler I, [2024-05-24T16:49:39.983710 #738999] INFO -- : [222/885] 780361=test_rational I, [2024-05-24T16:49:39.992118 #738999] INFO -- : [223/885] 780370=test_rational2 I, [2024-05-24T16:49:40.004201 #738999] INFO -- : [224/885] 780361=test_arity I, [2024-05-24T16:49:40.004959 #738999] INFO -- : [225/885] 780370=test_stringio I, [2024-05-24T16:49:40.009284 #738999] INFO -- : [226/885] 780361=test_io_wait_uncommon I, [2024-05-24T16:49:40.012908 #738999] INFO -- : [227/885] 780361=test_win32ole_variable I, [2024-05-24T16:49:40.013559 #738999] INFO -- : [228/885] 780361=test_bignum I, [2024-05-24T16:49:40.103833 #738999] INFO -- : [229/885] 780370=test_rdoc_class_module I, [2024-05-24T16:49:40.125460 #738999] INFO -- : [230/885] 780364=test_gem_ci_detector I, [2024-05-24T16:49:40.201396 #738999] INFO -- : [231/885] 780369=test_win32ole_event I, [2024-05-24T16:49:40.204222 #738999] INFO -- : [232/885] 780366=test_time_tz I, [2024-05-24T16:49:40.207134 #738999] INFO -- : [233/885] 780371=test_rdoc_generator_json_index I, [2024-05-24T16:49:40.207335 #738999] INFO -- : [234/885] 780369=ractor_test I, [2024-05-24T16:49:40.211158 #738999] INFO -- : [235/885] 780357=test_trace I, [2024-05-24T16:49:40.214237 #738999] INFO -- : [236/885] 780357=test_resolve_symbol I, [2024-05-24T16:49:40.233015 #738999] INFO -- : [237/885] 780364=test_complex2 I, [2024-05-24T16:49:40.245650 #738999] INFO -- : [238/885] 780364=test_gem_package I, [2024-05-24T16:49:40.257063 #738999] INFO -- : [239/885] 780357=test_have_macro I, [2024-05-24T16:49:40.260025 #738999] INFO -- : [240/885] 780369=test_threadgroup I, [2024-05-24T16:49:40.270770 #738999] INFO -- : [241/885] 780366=test_gem_specification I, [2024-05-24T16:49:40.282193 #738999] INFO -- : [242/885] 780371=test_enum I, [2024-05-24T16:49:40.426825 #738999] INFO -- : [243/885] 780354=test_rdoc_extend I, [2024-05-24T16:49:40.485783 #738999] INFO -- : [244/885] 780370=test_merge_keys I, [2024-05-24T16:49:40.503613 #738999] INFO -- : [245/885] 780370=test_gem_resolver_api_specification I, [2024-05-24T16:49:40.518424 #738999] INFO -- : [246/885] 780362=test_history I, [2024-05-24T16:49:40.539803 #738999] INFO -- : [247/885] 780370=test_mixed_unicode_escapes I, [2024-05-24T16:49:40.542419 #738999] INFO -- : [248/885] 780370=test_rdoc_markup_to_ansi I, [2024-05-24T16:49:40.570679 #738999] INFO -- : [249/885] 780370=test_ipaddr I, [2024-05-24T16:49:40.575890 #738999] INFO -- : [250/885] 780362=test_win32ole_variant I, [2024-05-24T16:49:40.585587 #738999] INFO -- : [251/885] 780362=format_errors_test I, [2024-05-24T16:49:40.588743 #738999] INFO -- : [252/885] 780354=test_dir I, [2024-05-24T16:49:40.593421 #738999] INFO -- : [253/885] 780362=test_date_ractor I, [2024-05-24T16:49:40.599780 #738999] INFO -- : [254/885] 780370=test_gem_console_ui I, [2024-05-24T16:49:40.602576 #738999] INFO -- : [255/885] 780370=test_eval I, [2024-05-24T16:49:40.607296 #738999] INFO -- : [256/885] 780370=test_autoconf I, [2024-05-24T16:49:40.610984 #738999] INFO -- : [257/885] 780370=test_ractor_compatibility I, [2024-05-24T16:49:40.633266 #738999] INFO -- : [258/885] 780364=test_cgi_multipart I, [2024-05-24T16:49:40.680593 #738999] INFO -- : [259/885] 780359=test_word I, [2024-05-24T16:49:40.688112 #738999] INFO -- : [260/885] 780359=test_gem_commands_cleanup_command I, [2024-05-24T16:49:40.702235 #738999] INFO -- : [261/885] 780357=test_member I, [2024-05-24T16:49:40.706144 #738999] INFO -- : [262/885] 780357=test_numeric I, [2024-05-24T16:49:40.718646 #738999] INFO -- : [263/885] 780357=test_http_request I, [2024-05-24T16:49:40.765707 #738999] INFO -- : [264/885] 780357=test_gem_source_fetch_problem I, [2024-05-24T16:49:40.773838 #738999] INFO -- : [265/885] 780362=json_generic_object_test I, [2024-05-24T16:49:40.786413 #738999] INFO -- : [266/885] 780362=test_rdoc_comment I, [2024-05-24T16:49:40.793234 #738999] INFO -- : [267/885] 780364=test_resize I, [2024-05-24T16:49:40.797547 #738999] INFO -- : [268/885] 780364=test_error_highlight I, [2024-05-24T16:49:40.829330 #738999] INFO -- : [269/885] 780362=test_rdoc_generator_darkfish I, [2024-05-24T16:49:40.848188 #738999] INFO -- : [270/885] 780354=test_mailto I, [2024-05-24T16:49:40.859185 #738999] INFO -- : [271/885] 780354=location_test I, [2024-05-24T16:49:40.869363 #738999] INFO -- : [272/885] 780357=test_symbol I, [2024-05-24T16:49:40.873137 #738999] INFO -- : [273/885] 780357=test_coderange I, [2024-05-24T16:49:40.874141 #738999] INFO -- : [274/885] 780357=test_arith_seq_beg_len_step I, [2024-05-24T16:49:40.897620 #738999] INFO -- : [275/885] 780370=test_gem_resolver_requirement_list I, [2024-05-24T16:49:40.903764 #738999] INFO -- : [276/885] 780370=test_pkcs7 I, [2024-05-24T16:49:40.912685 #738999] INFO -- : [277/885] 780372=test_function_entry I, [2024-05-24T16:49:40.913803 #738999] INFO -- : [278/885] 780357=test_context I, [2024-05-24T16:49:40.915595 #738999] INFO -- : [279/885] 780372=test_gem_commands_pristine_command I, [2024-05-24T16:49:40.935252 #738999] INFO -- : [280/885] 780354=test_nofree I, [2024-05-24T16:49:40.940112 #738999] INFO -- : [281/885] 780354=test_coder I, [2024-05-24T16:49:40.945879 #738999] INFO -- : [282/885] 780354=test_symbol I, [2024-05-24T16:49:41.036522 #738999] INFO -- : [283/885] 780370=test_find_executable I, [2024-05-24T16:49:41.051473 #738999] INFO -- : [284/885] 780371=ruby_api_test I, [2024-05-24T16:49:41.053341 #738999] INFO -- : [285/885] 780357=test_lazy_enumerator I, [2024-05-24T16:49:41.057432 #738999] INFO -- : [286/885] 780370=test_enc_associate I, [2024-05-24T16:49:41.223364 #738999] INFO -- : [287/885] 780362=test_unix I, [2024-05-24T16:49:41.232020 #738999] INFO -- : [288/885] 780359=test_integer I, [2024-05-24T16:49:41.251979 #738999] INFO -- : [289/885] 780364=test_cgi_modruby I, [2024-05-24T16:49:41.258956 #738999] INFO -- : [290/885] 780364=test_rubyoptions I, [2024-05-24T16:49:41.262237 #738999] INFO -- : [291/885] 780362=test_super I, [2024-05-24T16:49:41.263212 #738999] INFO -- : [292/885] 780369=test_rubygems I, [2024-05-24T16:49:41.287508 #738999] INFO -- : [293/885] 780357=test_call I, [2024-05-24T16:49:41.291186 #738999] INFO -- : [294/885] 780371=test_https_proxy I, [2024-05-24T16:49:41.366865 #738999] INFO -- : [295/885] 780371=test_capacity I, [2024-05-24T16:49:41.368503 #738999] INFO -- : [296/885] 780371=test_nextafter I, [2024-05-24T16:49:41.417835 #738999] INFO -- : [297/885] 780369=test_have_func I, [2024-05-24T16:49:41.458824 #738999] INFO -- : [298/885] 780371=test_stat I, [2024-05-24T16:49:41.463737 #738999] INFO -- : [299/885] 780371=test_gem_request_set_lockfile_tokenizer I, [2024-05-24T16:49:41.468081 #738999] INFO -- : [300/885] 780357=test_gem_resolver_git_specification I, [2024-05-24T16:49:41.487071 #738999] INFO -- : [301/885] 780370=test_usrmarshal I, [2024-05-24T16:49:41.528704 #738999] INFO -- : [302/885] 780371=test_object_references I, [2024-05-24T16:49:41.542824 #738999] INFO -- : [303/885] 780371=test_rdoc_attr I, [2024-05-24T16:49:41.545531 #738999] INFO -- : [304/885] 780371=test_env I, [2024-05-24T16:49:41.648174 #738999] INFO -- : [305/885] 780357=test_integer I, [2024-05-24T16:49:41.693434 #738999] INFO -- : [306/885] 780357=desugar_compiler_test I, [2024-05-24T16:49:41.703414 #738999] INFO -- : [307/885] 780370=test_dryrun I, [2024-05-24T16:49:41.722348 #738999] INFO -- : [308/885] 780370=test_gem_commands_setup_command I, [2024-05-24T16:49:41.763151 #738999] INFO -- : [309/885] 780357=test_cgi_core I, [2024-05-24T16:49:41.779133 #738999] INFO -- : [310/885] 780357=test_parser I, [2024-05-24T16:49:41.807386 #738999] INFO -- : [311/885] 780357=test_registry I, [2024-05-24T16:49:41.808177 #738999] INFO -- : [312/885] 780357=parse_stream_test I, [2024-05-24T16:49:41.815342 #738999] INFO -- : [313/885] 780357=test_ractor I, [2024-05-24T16:49:41.818723 #738999] INFO -- : [314/885] 780355=test_gem_commands_open_command I, [2024-05-24T16:49:41.826116 #738999] INFO -- : [315/885] 780357=test_dns I, [2024-05-24T16:49:41.843573 #738999] INFO -- : [316/885] 780362=test_gem I, [2024-05-24T16:49:41.923559 #738999] INFO -- : [317/885] 780355=test_gem_source_lock I, [2024-05-24T16:49:41.995316 #738999] INFO -- : [318/885] 780355=test_ssl I, [2024-05-24T16:49:42.030891 #738999] INFO -- : [319/885] 780356=test_ractor I, [2024-05-24T16:49:42.080295 #738999] INFO -- : [320/885] 780372=test_debugger_integration I, [2024-05-24T16:49:42.091993 #738999] INFO -- : [321/885] 780372=test_rendering I, [2024-05-24T16:49:42.163833 #738999] INFO -- : [322/885] 780372=test_my_integer I, [2024-05-24T16:49:42.169292 #738999] INFO -- : [323/885] 780372=json_ext_parser_test I, [2024-05-24T16:49:42.175960 #738999] INFO -- : [324/885] 780372=test_thread I, [2024-05-24T16:49:42.180903 #738999] INFO -- : [325/885] 780373=test_nonblock I, [2024-05-24T16:49:42.189386 #738999] INFO -- : [326/885] 780373=test_weakref I, [2024-05-24T16:49:42.274181 #738999] INFO -- : [327/885] 780357=test_marshal I, [2024-05-24T16:49:42.338017 #738999] INFO -- : [328/885] 780373=test_unicode_normalize I, [2024-05-24T16:49:42.340163 #738999] INFO -- : [329/885] 780370=test_timeout I, [2024-05-24T16:49:42.389009 #738999] INFO -- : [330/885] 780355=test_alias I, [2024-05-24T16:49:42.434058 #738999] INFO -- : [331/885] 780356=test_ancdata I, [2024-05-24T16:49:42.437339 #738999] INFO -- : [332/885] 780356=test_singleton_function I, [2024-05-24T16:49:42.440743 #738999] INFO -- : [333/885] 780356=test_reline_key I, [2024-05-24T16:49:42.460005 #738999] INFO -- : [334/885] 780356=test_rb_str_dup I, [2024-05-24T16:49:42.463376 #738999] INFO -- : [335/885] 780356=test_integer_comb I, [2024-05-24T16:49:42.467015 #738999] INFO -- : [336/885] 780363=test_rdoc_markup_document I, [2024-05-24T16:49:42.475510 #738999] INFO -- : [337/885] 780363=test_tmpdir I, [2024-05-24T16:49:42.538976 #738999] INFO -- : [338/885] 780355=test_vm_dump I, [2024-05-24T16:49:42.542543 #738999] INFO -- : [339/885] 780355=test_gem_commands_check_command I, [2024-05-24T16:49:42.559033 #738999] INFO -- : [340/885] 780363=test_regexp I, [2024-05-24T16:49:42.576044 #738999] INFO -- : [341/885] 780355=errors_test I, [2024-05-24T16:49:42.608034 #738999] INFO -- : [342/885] 780369=static_inspect_test I, [2024-05-24T16:49:42.612696 #738999] INFO -- : [343/885] 780369=test_udp I, [2024-05-24T16:49:42.616671 #738999] INFO -- : [344/885] 780369=unescape_test I, [2024-05-24T16:49:42.644787 #738999] INFO -- : [345/885] 780355=test_ostruct I, [2024-05-24T16:49:42.648524 #738999] INFO -- : [346/885] 780354=test_file I, [2024-05-24T16:49:42.706215 #738999] INFO -- : [347/885] 780366=test_force_exit I, [2024-05-24T16:49:42.718616 #738999] INFO -- : [348/885] 780366=test_data_error I, [2024-05-24T16:49:42.790605 #738999] INFO -- : [349/885] 780366=bom_test I, [2024-05-24T16:49:42.813472 #738999] INFO -- : [350/885] 780355=test_constant I, [2024-05-24T16:49:42.826228 #738999] INFO -- : [351/885] 780357=test_dup I, [2024-05-24T16:49:42.861568 #738999] INFO -- : [352/885] 780366=test_pty I, [2024-05-24T16:49:42.923045 #738999] INFO -- : [353/885] 780361=command_line_test I, [2024-05-24T16:49:42.930803 #738999] INFO -- : [354/885] 780361=test_range I, [2024-05-24T16:49:43.021639 #738999] INFO -- : [355/885] 780357=test_project_sanity I, [2024-05-24T16:49:43.073376 #738999] INFO -- : [356/885] 780357=test_encoding I, [2024-05-24T16:49:43.146523 #738999] INFO -- : [357/885] 780370=test_helper I, [2024-05-24T16:49:43.156915 #738999] INFO -- : [358/885] 780370=test_erb_command I, [2024-05-24T16:49:43.195951 #738999] INFO -- : [359/885] 780370=test_gem_uri_formatter I, [2024-05-24T16:49:43.210815 #738999] INFO -- : [360/885] 780370=library_symbols_test I, [2024-05-24T16:49:43.212910 #738999] INFO -- : [361/885] 780370=test_locale I, [2024-05-24T16:49:43.281715 #738999] INFO -- : [362/885] 780368=test_addr I, [2024-05-24T16:49:43.291943 #738999] INFO -- : [363/885] 780370=test_ensured I, [2024-05-24T16:49:43.300323 #738999] INFO -- : [364/885] 780357=test_ts I, [2024-05-24T16:49:43.332053 #738999] INFO -- : [365/885] 780366=test_rdoc_ri_paths I, [2024-05-24T16:49:43.332989 #738999] INFO -- : [366/885] 780368=test_gem_resolver_api_set I, [2024-05-24T16:49:43.338404 #738999] INFO -- : [367/885] 780370=test_gem_safe_marshal I, [2024-05-24T16:49:43.346054 #738999] INFO -- : [368/885] 780366=test_enumerable I, [2024-05-24T16:49:43.351291 #738999] INFO -- : [369/885] 780366=test_gem_resolver_vendor_set I, [2024-05-24T16:49:43.376582 #738999] INFO -- : [370/885] 780366=test_config I, [2024-05-24T16:49:43.546822 #738999] INFO -- : [371/885] 780368=json_generator_test I, [2024-05-24T16:49:43.648302 #738999] INFO -- : [372/885] 780368=test_eval I, [2024-05-24T16:49:43.709601 #738999] INFO -- : [373/885] 780369=test_transcode I, [2024-05-24T16:49:43.723950 #738999] INFO -- : [374/885] 780362=test_fips I, [2024-05-24T16:49:43.727474 #738999] INFO -- : [375/885] 780361=test_x509name I, [2024-05-24T16:49:43.739067 #738999] INFO -- : [376/885] 780361=test_update I, [2024-05-24T16:49:43.744939 #738999] INFO -- : [377/885] 780361=test_x509store I, [2024-05-24T16:49:43.800980 #738999] INFO -- : [378/885] 780358=test_rdoc_code_object I, [2024-05-24T16:49:43.832404 #738999] INFO -- : [379/885] 780357=test_webauthn_listener I, [2024-05-24T16:49:43.851622 #738999] INFO -- : [380/885] 780370=test_jaro_winkler I, [2024-05-24T16:49:43.857398 #738999] INFO -- : [381/885] 780370=test_random_formatter I, [2024-05-24T16:49:43.869691 #738999] INFO -- : [382/885] 780366=test_helper I, [2024-05-24T16:49:43.869752 #738999] INFO -- : [383/885] 780366=test_gem_request_set_gem_dependency_api I, [2024-05-24T16:49:43.871249 #738999] INFO -- : [384/885] 780370=test_ast I, [2024-05-24T16:49:43.887508 #738999] INFO -- : [385/885] 780357=test_lambda I, [2024-05-24T16:49:43.921763 #738999] INFO -- : [386/885] 780368=test_gem_platform I, [2024-05-24T16:49:43.930265 #738999] INFO -- : [387/885] 780369=test_rdoc_markup_hard_break I, [2024-05-24T16:49:43.949033 #738999] INFO -- : [388/885] 780369=test_gem_package_task I, [2024-05-24T16:49:43.953589 #738999] INFO -- : [389/885] 780369=test_date_strptime I, [2024-05-24T16:49:43.954773 #738999] INFO -- : [390/885] 780357=test_placearg I, [2024-05-24T16:49:43.982290 #738999] INFO -- : [391/885] 780362=test_numhash I, [2024-05-24T16:49:43.985649 #738999] INFO -- : [392/885] 780362=test_gem_commands_push_command I, [2024-05-24T16:49:43.999737 #738999] INFO -- : [393/885] 780368=test_weakkeymap I, [2024-05-24T16:49:44.090120 #738999] INFO -- : [394/885] 780357=test_pkey_rsa I, [2024-05-24T16:49:44.101040 #738999] INFO -- : [395/885] 780366=test_class_name_check I, [2024-05-24T16:49:44.103019 #738999] INFO -- : [396/885] 780358=test_keyword I, [2024-05-24T16:49:44.120488 #738999] INFO -- : [397/885] 780369=test_continuation I, [2024-05-24T16:49:44.120557 #738999] INFO -- : [398/885] 780369=test_fd_setsize I, [2024-05-24T16:49:44.122771 #738999] INFO -- : [399/885] 780369=test_win32ole_method I, [2024-05-24T16:49:44.125515 #738999] INFO -- : [400/885] 780369=test_delete I, [2024-05-24T16:49:44.130575 #738999] INFO -- : [401/885] 780366=test_logger I, [2024-05-24T16:49:44.131330 #738999] INFO -- : [402/885] 780369=test_gem_update_suggestion I, [2024-05-24T16:49:44.135268 #738999] INFO -- : [403/885] 780368=test_files_test I, [2024-05-24T16:49:44.142527 #738999] INFO -- : [404/885] 780361=test_file_exhaustive I, [2024-05-24T16:49:44.144394 #738999] INFO -- : [405/885] 780366=test_rdoc_parser_markdown I, [2024-05-24T16:49:44.159400 #738999] INFO -- : [406/885] 780366=test_gem_resolver_lock_set I, [2024-05-24T16:49:44.183229 #738999] INFO -- : [407/885] 780366=test_not I, [2024-05-24T16:49:44.187932 #738999] INFO -- : [408/885] 780369=test_import I, [2024-05-24T16:49:44.189696 #738999] INFO -- : [409/885] 780366=version_test I, [2024-05-24T16:49:44.192816 #738999] INFO -- : [410/885] 780366=test_object I, [2024-05-24T16:49:44.195714 #738999] INFO -- : [411/885] 780366=test_cgi_header I, [2024-05-24T16:49:44.202919 #738999] INFO -- : [412/885] 780366=heredoc_dedent_test I, [2024-05-24T16:49:44.210086 #738999] INFO -- : [413/885] 780366=test_arithmetic_sequence I, [2024-05-24T16:49:44.216142 #738999] INFO -- : [414/885] 780366=test_gem_command_manager I, [2024-05-24T16:49:44.229935 #738999] INFO -- : [415/885] 780368=test_basicinstructions I, [2024-05-24T16:49:44.232048 #738999] INFO -- : [416/885] 780371=test_gem_gemcutter_utilities I, [2024-05-24T16:49:44.289182 #738999] INFO -- : [417/885] 780368=test_key_actor_emacs I, [2024-05-24T16:49:44.310019 #738999] INFO -- : [418/885] 780359=test_sleep I, [2024-05-24T16:49:44.358343 #738999] INFO -- : [419/885] 780357=test_gem_local_remote_options I, [2024-05-24T16:49:44.367361 #738999] INFO -- : [420/885] 780366=test_date_arith I, [2024-05-24T16:49:44.372522 #738999] INFO -- : [421/885] 780366=test_ruby_lex I, [2024-05-24T16:49:44.390048 #738999] INFO -- : [422/885] 780357=test_object I, [2024-05-24T16:49:44.441025 #738999] INFO -- : [423/885] 780368=test_ossl I, [2024-05-24T16:49:44.509606 #738999] INFO -- : [424/885] 780362=test_normalize I, [2024-05-24T16:49:44.514851 #738999] INFO -- : [425/885] 780362=test_timeout I, [2024-05-24T16:49:44.521148 #738999] INFO -- : [426/885] 780362=test_flip I, [2024-05-24T16:49:44.528956 #738999] INFO -- : [427/885] 780366=compiler_test I, [2024-05-24T16:49:44.544944 #738999] INFO -- : [428/885] 780366=test_change_word I, [2024-05-24T16:49:44.546151 #738999] INFO -- : [429/885] 780366=test_tsort I, [2024-05-24T16:49:44.553263 #738999] INFO -- : [430/885] 780366=test_signedness I, [2024-05-24T16:49:44.554435 #738999] INFO -- : [431/885] 780362=test_rdoc_rd_block_parser I, [2024-05-24T16:49:44.568667 #738999] INFO -- : [432/885] 780358=test_pointer I, [2024-05-24T16:49:44.578856 #738999] INFO -- : [433/885] 780371=test_func I, [2024-05-24T16:49:44.584488 #738999] INFO -- : [434/885] 780362=test_big5 I, [2024-05-24T16:49:44.587272 #738999] INFO -- : [435/885] 780362=test_type I, [2024-05-24T16:49:44.596051 #738999] INFO -- : [436/885] 780362=test_ractor I, [2024-05-24T16:49:44.619164 #738999] INFO -- : [437/885] 780356=test_emitter I, [2024-05-24T16:49:44.632438 #738999] INFO -- : [438/885] 780356=test_gem_silent_ui I, [2024-05-24T16:49:44.648615 #738999] INFO -- : [439/885] 780362=test_files_ext I, [2024-05-24T16:49:44.665360 #738999] INFO -- : [440/885] 780356=test_bug-5832 I, [2024-05-24T16:49:44.668476 #738999] INFO -- : [441/885] 780356=test_kernel I, [2024-05-24T16:49:44.753208 #738999] INFO -- : [442/885] 780362=test_eval_history I, [2024-05-24T16:49:44.806295 #738999] INFO -- : [443/885] 780357=dispatcher_test I, [2024-05-24T16:49:44.826043 #738999] INFO -- : [444/885] 780362=test_gem_doctor I, [2024-05-24T16:49:44.828279 #738999] INFO -- : [445/885] 780357=test_kdf I, [2024-05-24T16:49:44.877040 #738999] INFO -- : [446/885] 780362=!Nothing_to_test I, [2024-05-24T16:49:44.877238 #738999] INFO -- : [447/885] 780362=test_enc_raise I, [2024-05-24T16:49:44.888953 #738999] INFO -- : [448/885] 780362=test_psych I, [2024-05-24T16:49:44.902889 #738999] INFO -- : [449/885] 780357=test_rdoc_markup_paragraph I, [2024-05-24T16:49:44.907574 #738999] INFO -- : [450/885] 780362=test_gem_ext_cargo_builder_unit I, [2024-05-24T16:49:44.934681 #738999] INFO -- : [451/885] 780362=test_gem_rdoc I, [2024-05-24T16:49:45.064559 #738999] INFO -- : [452/885] 780362=test_date I, [2024-05-24T16:49:45.071660 #738999] INFO -- : [453/885] 780362=test_at_exit I, [2024-05-24T16:49:45.072704 #738999] INFO -- : [454/885] 780357=test_command I, [2024-05-24T16:49:45.087092 #738999] INFO -- : [455/885] 780362=test_object_create_start I, [2024-05-24T16:49:45.088297 #738999] INFO -- : [456/885] 780362=test_rdoc_tom_doc I, [2024-05-24T16:49:45.090563 #738999] INFO -- : [457/885] 780358=test_hmac I, [2024-05-24T16:49:45.100400 #738999] INFO -- : [458/885] 780362=test_rdoc_markup_to_tt_only I, [2024-05-24T16:49:45.101408 #738999] INFO -- : [459/885] 780358=test_bug-3571 I, [2024-05-24T16:49:45.110729 #738999] INFO -- : [460/885] 780358=test_key_actor_vi I, [2024-05-24T16:49:45.128517 #738999] INFO -- : [461/885] 780362=test_gem_command I, [2024-05-24T16:49:45.168878 #738999] INFO -- : [462/885] 780358=test_gem_spec_fetcher I, [2024-05-24T16:49:45.229540 #738999] INFO -- : [463/885] 780362=test_common I, [2024-05-24T16:49:45.254605 #738999] INFO -- : [464/885] 780355=test_numeric I, [2024-05-24T16:49:45.271552 #738999] INFO -- : [465/885] 780356=test_gem_commands_lock_command I, [2024-05-24T16:49:45.286965 #738999] INFO -- : [466/885] 780356=test_assignment I, [2024-05-24T16:49:45.305014 #738999] INFO -- : [467/885] 780358=test_ifunless I, [2024-05-24T16:49:45.310089 #738999] INFO -- : [468/885] 780358=test_config I, [2024-05-24T16:49:45.314188 #738999] INFO -- : [469/885] 780355=test_optarg I, [2024-05-24T16:49:45.331837 #738999] INFO -- : [470/885] 780358=test_yaml_special_cases I, [2024-05-24T16:49:45.346567 #738999] INFO -- : [471/885] 780358=test_gem_source_list I, [2024-05-24T16:49:45.356078 #738999] INFO -- : [472/885] 780357=test_rdoc_token_stream I, [2024-05-24T16:49:45.361086 #738999] INFO -- : [473/885] 780357=test_address_resolve I, [2024-05-24T16:49:45.376586 #738999] INFO -- : [474/885] 780358=test_iter_break I, [2024-05-24T16:49:45.378852 #738999] INFO -- : [475/885] 780358=test_zsh_completion I, [2024-05-24T16:49:45.382219 #738999] INFO -- : [476/885] 780358=test_exception I, [2024-05-24T16:49:45.393713 #738999] INFO -- : [477/885] 780358=test_rdoc_single_class I, [2024-05-24T16:49:45.394263 #738999] INFO -- : [478/885] 780369=test_num2int I, [2024-05-24T16:49:45.397178 #738999] INFO -- : [479/885] 780358=test_nil I, [2024-05-24T16:49:45.400323 #738999] INFO -- : [480/885] 780357=test_verbose I, [2024-05-24T16:49:45.401696 #738999] INFO -- : [481/885] 780358=test_frozen I, [2024-05-24T16:49:45.405153 #738999] INFO -- : [482/885] 780358=test_gem_ext_configure_builder I, [2024-05-24T16:49:45.406294 #738999] INFO -- : [483/885] 780369=test_pp I, [2024-05-24T16:49:45.419235 #738999] INFO -- : [484/885] 780357=test_macro I, [2024-05-24T16:49:45.428168 #738999] INFO -- : [485/885] 780357=test_gc_compact I, [2024-05-24T16:49:45.434088 #738999] INFO -- : [486/885] 780358=test_string I, [2024-05-24T16:49:45.444436 #738999] INFO -- : [487/885] 780369=test_proc I, [2024-05-24T16:49:45.460288 #738999] INFO -- : [488/885] 780355=test_gem_package_old I, [2024-05-24T16:49:45.474257 #738999] INFO -- : [489/885] 780362=test_gem_resolver_index_set I, [2024-05-24T16:49:45.500426 #738999] INFO -- : [490/885] 780355=test_egrep_cpp I, [2024-05-24T16:49:45.514257 #738999] INFO -- : [491/885] 780362=test_zlib I, [2024-05-24T16:49:45.596236 #738999] INFO -- : [492/885] 780373=test_cgi_tag_helper I, [2024-05-24T16:49:45.619462 #738999] INFO -- : [493/885] 780355=test_date_conv I, [2024-05-24T16:49:45.620646 #738999] INFO -- : [494/885] 780373=test_optimization I, [2024-05-24T16:49:45.625160 #738999] INFO -- : [495/885] 780355=test_ole_methods I, [2024-05-24T16:49:45.628754 #738999] INFO -- : [496/885] 780355=test_erb_m17n I, [2024-05-24T16:49:45.631874 #738999] INFO -- : [497/885] 780355=test_rdoc_markup_parser I, [2024-05-24T16:49:45.691485 #738999] INFO -- : [498/885] 780355=test_require_path_check I, [2024-05-24T16:49:45.760730 #738999] INFO -- : [499/885] 780355=test_folderitem2_invokeverb I, [2024-05-24T16:49:45.769783 #738999] INFO -- : [500/885] 780355=test_files_test_2 I, [2024-05-24T16:49:45.853312 #738999] INFO -- : [501/885] 780371=test_fnmatch I, [2024-05-24T16:49:45.888962 #738999] INFO -- : [502/885] 780371=test_gem_validator I, [2024-05-24T16:49:45.927323 #738999] INFO -- : [503/885] 780371=test_rdoc_store I, [2024-05-24T16:49:46.247411 #738999] INFO -- : [504/885] 780367=test_x509attr I, [2024-05-24T16:49:46.259148 #738999] INFO -- : [505/885] 780367=test_raise I, [2024-05-24T16:49:46.262389 #738999] INFO -- : [506/885] 780367=test_depth_first I, [2024-05-24T16:49:46.285312 #738999] INFO -- : [507/885] 780367=test_gem_request_set_lockfile_parser I, [2024-05-24T16:49:46.330687 #738999] INFO -- : [508/885] 780356=test_rdoc_stats I, [2024-05-24T16:49:46.332067 #738999] INFO -- : [509/885] 780369=test_pattern_matching I, [2024-05-24T16:49:46.362657 #738999] INFO -- : [510/885] 780369=test_string I, [2024-05-24T16:49:46.365675 #738999] INFO -- : [511/885] 780356=test_gem_dependency_resolution_error I, [2024-05-24T16:49:46.372439 #738999] INFO -- : [512/885] 780356=test_qsort I, [2024-05-24T16:49:46.376504 #738999] INFO -- : [513/885] 780356=test_rdoc_parser I, [2024-05-24T16:49:46.379344 #738999] INFO -- : [514/885] 780369=test_custom_command I, [2024-05-24T16:49:46.383875 #738999] INFO -- : [515/885] 780369=json_addition_test I, [2024-05-24T16:49:46.389301 #738999] INFO -- : [516/885] 780356=test_rdoc_markup_attributes I, [2024-05-24T16:49:46.395927 #738999] INFO -- : [517/885] 780356=test_mul I, [2024-05-24T16:49:46.400181 #738999] INFO -- : [518/885] 780356=test_null I, [2024-05-24T16:49:46.402541 #738999] INFO -- : [519/885] 780369=test_win32ole_type I, [2024-05-24T16:49:46.403403 #738999] INFO -- : [520/885] 780356=test_default_gems I, [2024-05-24T16:49:46.411372 #738999] INFO -- : [521/885] 780369=test_rdoc_markup_to_rdoc I, [2024-05-24T16:49:46.443225 #738999] INFO -- : [522/885] 780369=test_rdoc_rd_inline_parser I, [2024-05-24T16:49:46.461032 #738999] INFO -- : [523/885] 780356=test_thread I, [2024-05-24T16:49:46.466180 #738999] INFO -- : [524/885] 780356=test_trick I, [2024-05-24T16:49:46.473136 #738999] INFO -- : [525/885] 780369=test_pipe I, [2024-05-24T16:49:46.493237 #738999] INFO -- : [526/885] 780371=test_pkey_ec I, [2024-05-24T16:49:46.504338 #738999] INFO -- : [527/885] 780367=test_date_parse I, [2024-05-24T16:49:46.567746 #738999] INFO -- : [528/885] 780371=test_io_buffer I, [2024-05-24T16:49:46.607181 #738999] INFO -- : [529/885] 780369=test_key_name_check I, [2024-05-24T16:49:46.611822 #738999] INFO -- : [530/885] 780369=test_backtrace I, [2024-05-24T16:49:46.614962 #738999] INFO -- : [531/885] 780371=test_defined I, [2024-05-24T16:49:46.617052 #738999] INFO -- : [532/885] 780369=test_rdoc_i18n_text I, [2024-05-24T16:49:46.619774 #738999] INFO -- : [533/885] 780367=test_gem_uninstaller I, [2024-05-24T16:49:46.621675 #738999] INFO -- : [534/885] 780369=test_gb18030 I, [2024-05-24T16:49:46.625544 #738999] INFO -- : [535/885] 780369=test_buffering I, [2024-05-24T16:49:46.636311 #738999] INFO -- : [536/885] 780369=test_svcb_https I, [2024-05-24T16:49:46.642202 #738999] INFO -- : [537/885] 780369=test_time I, [2024-05-24T16:49:46.676477 #738999] INFO -- : [538/885] 780371=test_windows_1251 I, [2024-05-24T16:49:46.681707 #738999] INFO -- : [539/885] 780371=test_rdoc_rdoc I, [2024-05-24T16:49:46.754997 #738999] INFO -- : [540/885] 780371=test_case_options I, [2024-05-24T16:49:46.757032 #738999] INFO -- : [541/885] 780371=test_store I, [2024-05-24T16:49:46.781158 #738999] INFO -- : [542/885] 780369=test_rdoc_cross_reference I, [2024-05-24T16:49:46.931069 #738999] INFO -- : [543/885] 780366=test_gem_commands_info_command I, [2024-05-24T16:49:46.935592 #738999] INFO -- : [544/885] 780371=test_scalar I, [2024-05-24T16:49:46.944261 #738999] INFO -- : [545/885] 780371=test_gem_dependency_installer I, [2024-05-24T16:49:46.944750 #738999] INFO -- : [546/885] 780366=test_bug_reporter I, [2024-05-24T16:49:47.039585 #738999] INFO -- : [547/885] 780365=test_gem_package_tar_reader_entry I, [2024-05-24T16:49:47.239065 #738999] INFO -- : [548/885] 780366=test_gem_name_tuple I, [2024-05-24T16:49:47.256556 #738999] INFO -- : [549/885] 780366=test_rand I, [2024-05-24T16:49:47.297936 #738999] INFO -- : [550/885] 780369=test_exception I, [2024-05-24T16:49:47.364272 #738999] INFO -- : [551/885] 780365=test_method_cache I, [2024-05-24T16:49:47.370775 #738999] INFO -- : [552/885] 780365=test_gem_request I, [2024-05-24T16:49:47.504476 #738999] INFO -- : [553/885] 780367=test_sprintf_comb I, [2024-05-24T16:49:47.520244 #738999] INFO -- : [554/885] 780366=test_gem_ext_cargo_builder_link_flag_converter I, [2024-05-24T16:49:47.520619 #738999] INFO -- : [555/885] 780365=test_gem_commands_mirror I, [2024-05-24T16:49:47.527181 #738999] INFO -- : [556/885] 780365=test_enumerator_kw I, [2024-05-24T16:49:47.530263 #738999] INFO -- : [557/885] 780365=test_gem_text I, [2024-05-24T16:49:47.567981 #738999] INFO -- : [558/885] 780366=test_settracefunc I, [2024-05-24T16:49:47.571522 #738999] INFO -- : [559/885] 780365=test_win32ole I, [2024-05-24T16:49:47.576435 #738999] INFO -- : [560/885] 780365=test_generic I, [2024-05-24T16:49:47.596748 #738999] INFO -- : [561/885] 780365=test_scan_args I, [2024-05-24T16:49:47.602158 #738999] INFO -- : [562/885] 780365=test_cclass I, [2024-05-24T16:49:47.643514 #738999] INFO -- : [563/885] 780367=test_gem_version_option I, [2024-05-24T16:49:47.695629 #738999] INFO -- : [564/885] 780367=test_grapheme_breaks I, [2024-05-24T16:49:47.720920 #738999] INFO -- : [565/885] 780365=test_gem_request_connection_pools I, [2024-05-24T16:49:47.722240 #738999] INFO -- : [566/885] 780367=test_case I, [2024-05-24T16:49:47.726686 #738999] INFO -- : [567/885] 780367=test_pkey I, [2024-05-24T16:49:47.774082 #738999] INFO -- : [568/885] 780367=test_parser_events I, [2024-05-24T16:49:47.871338 #738999] INFO -- : [569/885] 780367=test_reline I, [2024-05-24T16:49:48.246233 #738999] INFO -- : [570/885] 780357=test_ansi_with_terminfo I, [2024-05-24T16:49:48.249636 #738999] INFO -- : [571/885] 780356=test_rdoc_generator_pot_po I, [2024-05-24T16:49:48.251097 #738999] INFO -- : [572/885] 780357=test_json_tree I, [2024-05-24T16:49:48.254632 #738999] INFO -- : [573/885] 780356=test_rdoc_markup_to_markdown I, [2024-05-24T16:49:48.257525 #738999] INFO -- : [574/885] 780357=test_m17n_comb I, [2024-05-24T16:49:48.286456 #738999] INFO -- : [575/885] 780356=test_memory_view I, [2024-05-24T16:49:48.303440 #738999] INFO -- : [576/885] 780367=test_ractor I, [2024-05-24T16:49:48.353665 #738999] INFO -- : [577/885] 780367=test_extlibs I, [2024-05-24T16:49:48.467546 #738999] INFO -- : [578/885] 780356=test_rdoc_generator_ri I, [2024-05-24T16:49:48.476697 #738999] INFO -- : [579/885] 780356=test_gem_stream_ui I, [2024-05-24T16:49:48.536380 #738999] INFO -- : [580/885] 780366=test_ractor I, [2024-05-24T16:49:48.550278 #738999] INFO -- : [581/885] 780366=test_severity I, [2024-05-24T16:49:48.556773 #738999] INFO -- : [582/885] 780366=test_gem_install_update_options I, [2024-05-24T16:49:48.565406 #738999] INFO -- : [583/885] 780356=parse_test I, [2024-05-24T16:49:48.656972 #738999] INFO -- : [584/885] 780366=test_require_lib I, [2024-05-24T16:49:48.714257 #738999] INFO -- : [585/885] 780354=test_rdoc_markup_to_table_of_contents I, [2024-05-24T16:49:48.732453 #738999] INFO -- : [586/885] 780354=test_objectspace I, [2024-05-24T16:49:48.755755 #738999] INFO -- : [587/885] 780365=test_thread I, [2024-05-24T16:49:48.824917 #738999] INFO -- : [588/885] 780362=test_socket I, [2024-05-24T16:49:48.972657 #738999] INFO -- : [589/885] 780365=test_literal I, [2024-05-24T16:49:49.006272 #738999] INFO -- : [590/885] 780371=test_dot_dot I, [2024-05-24T16:49:49.012546 #738999] INFO -- : [591/885] 780371=test_c_struct_builder I, [2024-05-24T16:49:49.066342 #738999] INFO -- : [592/885] 780355=test_str2big I, [2024-05-24T16:49:49.071112 #738999] INFO -- : [593/885] 780355=test_flush I, [2024-05-24T16:49:49.075003 #738999] INFO -- : [594/885] 780355=test_singleton I, [2024-05-24T16:49:49.081604 #738999] INFO -- : [595/885] 780355=test_io_console I, [2024-05-24T16:49:49.160945 #738999] INFO -- : [596/885] 780371=test_switch_hitter I, [2024-05-24T16:49:49.176275 #738999] INFO -- : [597/885] 780371=test_securerandom I, [2024-05-24T16:49:49.212377 #738999] INFO -- : [598/885] 780371=test_logperiod I, [2024-05-24T16:49:49.220719 #738999] INFO -- : [599/885] 780371=test_c_union_entity I, [2024-05-24T16:49:49.297085 #738999] INFO -- : [600/885] 780371=test_rdoc_normal_module I, [2024-05-24T16:49:49.316902 #738999] INFO -- : [601/885] 780359=test_rdoc_markdown_test I, [2024-05-24T16:49:49.343661 #738999] INFO -- : [602/885] 780371=test_passing_block I, [2024-05-24T16:49:49.350312 #738999] INFO -- : [603/885] 780371=test_thread_fd_close I, [2024-05-24T16:49:49.354873 #738999] INFO -- : [604/885] 780371=newline_test I, [2024-05-24T16:49:49.409605 #738999] INFO -- : [605/885] 780365=test_uncorrectable_name_check I, [2024-05-24T16:49:49.422977 #738999] INFO -- : [606/885] 780365=test_stringchar I, [2024-05-24T16:49:49.427539 #738999] INFO -- : [607/885] 780371=test_hash_create I, [2024-05-24T16:49:49.431647 #738999] INFO -- : [608/885] 780371=test_gem_source_local I, [2024-05-24T16:49:49.505642 #738999] INFO -- : [609/885] 780365=test_gem_security_policy I, [2024-05-24T16:49:49.660280 #738999] INFO -- : [610/885] 780354=test_last_thread I, [2024-05-24T16:49:49.684957 #738999] INFO -- : [611/885] 780361=test_process I, [2024-05-24T16:49:49.701320 #738999] INFO -- : [612/885] 780371=test_pack I, [2024-05-24T16:49:49.848063 #738999] INFO -- : [613/885] 780365=test_gem_resolver_lock_specification I, [2024-05-24T16:49:49.884277 #738999] INFO -- : [614/885] 780365=test_err_in_callback I, [2024-05-24T16:49:49.886643 #738999] INFO -- : [615/885] 780365=test_x509cert I, [2024-05-24T16:49:50.014357 #738999] INFO -- : [616/885] 780371=test_gc I, [2024-05-24T16:49:50.043773 #738999] INFO -- : [617/885] 780369=test_arity I, [2024-05-24T16:49:50.065783 #738999] INFO -- : [618/885] 780369=test_gem_ext_rake_builder I, [2024-05-24T16:49:50.071165 #738999] INFO -- : [619/885] 780359=test_logdevice I, [2024-05-24T16:49:50.125242 #738999] INFO -- : [620/885] 780365=test_gem_commands_specification_command I, [2024-05-24T16:49:50.139542 #738999] INFO -- : [621/885] 780367=test_http I, [2024-05-24T16:49:50.146087 #738999] INFO -- : [622/885] 780367=test_gem_commands_which_command I, [2024-05-24T16:49:50.162527 #738999] INFO -- : [623/885] 780362=test_shift_jis I, [2024-05-24T16:49:50.166708 #738999] INFO -- : [624/885] 780367=test_flags I, [2024-05-24T16:49:50.167246 #738999] INFO -- : [625/885] 780362=test_inadvertent_creation I, [2024-05-24T16:49:50.210971 #738999] INFO -- : [626/885] 780357=test_enumerator I, [2024-05-24T16:49:50.227970 #738999] INFO -- : [627/885] 780365=test_rdoc_markup_attribute_manager I, [2024-05-24T16:49:50.252993 #738999] INFO -- : [628/885] 780364=test_name_error I, [2024-05-24T16:49:50.255081 #738999] INFO -- : [629/885] 780365=test_gem_commands_dependency_command I, [2024-05-24T16:49:50.305733 #738999] INFO -- : [630/885] 780362=test_gem_resolver I, [2024-05-24T16:49:50.322294 #738999] INFO -- : [631/885] 780365=test_safe_load I, [2024-05-24T16:49:50.334738 #738999] INFO -- : [632/885] 780365=test_gem_resolver_composed_set I, [2024-05-24T16:49:50.353837 #738999] INFO -- : [633/885] 780365=test_rdoc_context I, [2024-05-24T16:49:50.378900 #738999] INFO -- : [634/885] 780364=test_nil2vtempty I, [2024-05-24T16:49:50.389108 #738999] INFO -- : [635/885] 780364=test_stream I, [2024-05-24T16:49:50.400404 #738999] INFO -- : [636/885] 780364=test_rdoc_parser_ruby I, [2024-05-24T16:49:50.607167 #738999] INFO -- : [637/885] 780362=test_httpresponse I, [2024-05-24T16:49:50.613266 #738999] INFO -- : [638/885] 780356=test_open-uri I, [2024-05-24T16:49:50.675621 #738999] INFO -- : [639/885] 780362=test_syntax I, [2024-05-24T16:49:50.721564 #738999] INFO -- : [640/885] 780354=test_gem_safe_yaml I, [2024-05-24T16:49:50.730060 #738999] INFO -- : [641/885] 780354=test_require I, [2024-05-24T16:49:50.732633 #738999] INFO -- : [642/885] 780354=test_date_time I, [2024-05-24T16:49:50.742763 #738999] INFO -- : [643/885] 780354=test_rdoc_markup_to_joined_paragraph I, [2024-05-24T16:49:50.746709 #738999] INFO -- : [644/885] 780354=test_data I, [2024-05-24T16:49:50.753140 #738999] INFO -- : [645/885] 780354=test_date_new I, [2024-05-24T16:49:50.766022 #738999] INFO -- : [646/885] 780354=index_write_test I, [2024-05-24T16:49:50.771196 #738999] INFO -- : [647/885] 780354=test_tcp I, [2024-05-24T16:49:50.827517 #738999] INFO -- : [648/885] 780369=test_iso_8859 I, [2024-05-24T16:49:50.839523 #738999] INFO -- : [649/885] 780354=test_rdoc_text I, [2024-05-24T16:49:50.847580 #738999] INFO -- : [650/885] 780369=test_date_strftime I, [2024-05-24T16:49:50.887225 #738999] INFO -- : [651/885] 780354=test_rdoc_parser_rd I, [2024-05-24T16:49:50.895947 #738999] INFO -- : [652/885] 780354=test_gem_installer I, [2024-05-24T16:49:50.977740 #738999] INFO -- : [653/885] 780359=test_yamlstore I, [2024-05-24T16:49:50.989275 #738999] INFO -- : [654/885] 780359=test_random I, [2024-05-24T16:49:50.993450 #738999] INFO -- : [655/885] 780359=test_asn1 I, [2024-05-24T16:49:51.011805 #738999] INFO -- : [656/885] 780359=test_rdoc_normal_class I, [2024-05-24T16:49:51.028270 #738999] INFO -- : [657/885] 780356=test_class I, [2024-05-24T16:49:51.063947 #738999] INFO -- : [658/885] 780365=test_const I, [2024-05-24T16:49:51.066649 #738999] INFO -- : [659/885] 780359=json_string_matching_test I, [2024-05-24T16:49:51.069562 #738999] INFO -- : [660/885] 780365=test_load I, [2024-05-24T16:49:51.075256 #738999] INFO -- : [661/885] 780372=test_irb I, [2024-05-24T16:49:51.080469 #738999] INFO -- : [662/885] 780359=test_function I, [2024-05-24T16:49:51.096327 #738999] INFO -- : [663/885] 780365=test_queue I, [2024-05-24T16:49:51.100805 #738999] INFO -- : [664/885] 780365=test_noarg I, [2024-05-24T16:49:51.141412 #738999] INFO -- : [665/885] 780364=parse_comments_test I, [2024-05-24T16:49:51.147790 #738999] INFO -- : [666/885] 780367=test_tempfile I, [2024-05-24T16:49:51.153930 #738999] INFO -- : [667/885] 780368=test_gem_commands_help_command I, [2024-05-24T16:49:51.193834 #738999] INFO -- : [668/885] 780364=test_rdoc_markup I, [2024-05-24T16:49:51.198738 #738999] INFO -- : [669/885] 780364=test_prettyprint I, [2024-05-24T16:49:51.230784 #738999] INFO -- : [670/885] 780365=test_tracepoint I, [2024-05-24T16:49:51.241805 #738999] INFO -- : [671/885] 780364=test_utf32 I, [2024-05-24T16:49:51.248068 #738999] INFO -- : [672/885] 780364=test_basicsocket I, [2024-05-24T16:49:51.255983 #738999] INFO -- : [673/885] 780368=test_duplicate I, [2024-05-24T16:49:51.259440 #738999] INFO -- : [674/885] 780364=test_gem_resolver_index_specification I, [2024-05-24T16:49:51.262735 #738999] INFO -- : [675/885] 780368=test_internal_ivar I, [2024-05-24T16:49:51.267167 #738999] INFO -- : [676/885] 780368=test_rdoc_include I, [2024-05-24T16:49:51.315581 #738999] INFO -- : [677/885] 780359=test_reqarg I, [2024-05-24T16:49:51.326073 #738999] INFO -- : [678/885] 780364=test_gem_commands_list_command I, [2024-05-24T16:49:51.330749 #738999] INFO -- : [679/885] 780368=test_stack I, [2024-05-24T16:49:51.336527 #738999] INFO -- : [680/885] 780372=test_too_many_dummy_encodings I, [2024-05-24T16:49:51.344227 #738999] INFO -- : [681/885] 780364=test_rdoc_options I, [2024-05-24T16:49:51.361839 #738999] INFO -- : [682/885] 780369=test_econv I, [2024-05-24T16:49:51.395016 #738999] INFO -- : [683/885] 780372=test_cesu8 I, [2024-05-24T16:49:51.401053 #738999] INFO -- : [684/885] 780372=test_gem_version I, [2024-05-24T16:49:51.405943 #738999] INFO -- : [685/885] 780367=test_emitter I, [2024-05-24T16:49:51.411939 #738999] INFO -- : [686/885] 780367=test_gem_commands_signin_command I, [2024-05-24T16:49:51.475807 #738999] INFO -- : [687/885] 780365=test_resource I, [2024-05-24T16:49:51.475873 #738999] INFO -- : [688/885] 780372=test_ldap I, [2024-05-24T16:49:51.491847 #738999] INFO -- : [689/885] 780372=test_string_processing I, [2024-05-24T16:49:51.494087 #738999] INFO -- : [690/885] 780365=test_fileutils I, [2024-05-24T16:49:51.499196 #738999] INFO -- : [691/885] 780372=test_gem_commands_search_command I, [2024-05-24T16:49:51.517780 #738999] INFO -- : [692/885] 780367=test_complex I, [2024-05-24T16:49:51.520392 #738999] INFO -- : [693/885] 780372=test_gem_ext_ext_conf_builder I, [2024-05-24T16:49:51.663939 #738999] INFO -- : [694/885] 780364=test_frozen_error I, [2024-05-24T16:49:51.684701 #738999] INFO -- : [695/885] 780364=test_method_cache I, [2024-05-24T16:49:51.688547 #738999] INFO -- : [696/885] 780364=test_gem_stub_specification I, [2024-05-24T16:49:51.702526 #738999] INFO -- : [697/885] 780367=test_gem_resolver_specification I, [2024-05-24T16:49:51.706884 #738999] INFO -- : [698/885] 780359=test_gem_dependency I, [2024-05-24T16:49:51.721326 #738999] INFO -- : [699/885] 780367=test_path_to_class I, [2024-05-24T16:49:51.724315 #738999] INFO -- : [700/885] 780367=test_inlinecache I, [2024-05-24T16:49:51.777490 #738999] INFO -- : [701/885] 780367=test_rdoc_markup_verbatim I, [2024-05-24T16:49:51.791869 #738999] INFO -- : [702/885] 780355=test_gem_remote_fetcher I, [2024-05-24T16:49:51.850353 #738999] INFO -- : [703/885] 780359=test_mdns I, [2024-05-24T16:49:51.865685 #738999] INFO -- : [704/885] 780364=test_parse I, [2024-05-24T16:49:51.871773 #738999] INFO -- : [705/885] 780359=test_gem_resolver_installed_specification I, [2024-05-24T16:49:51.879377 #738999] INFO -- : [706/885] 780367=test_scanner_events I, [2024-05-24T16:49:51.885946 #738999] INFO -- : [707/885] 780359=test_big2str I, [2024-05-24T16:49:51.891096 #738999] INFO -- : [708/885] 780359=test_wait I, [2024-05-24T16:49:51.936359 #738999] INFO -- : [709/885] 780367=test_handle I, [2024-05-24T16:49:51.956679 #738999] INFO -- : [710/885] 780359=test_yaml I, [2024-05-24T16:49:51.967916 #738999] INFO -- : [711/885] 780373=test_forwardable I, [2024-05-24T16:49:51.981943 #738999] INFO -- : [712/885] 780373=test_rdoc_markup_formatter I, [2024-05-24T16:49:51.996768 #738999] INFO -- : [713/885] 780373=test_nowrite I, [2024-05-24T16:49:52.019931 #738999] INFO -- : [714/885] 780373=test_thread_queue I, [2024-05-24T16:49:52.046550 #738999] INFO -- : [715/885] 780365=test_gem_commands_sources_command I, [2024-05-24T16:49:52.055822 #738999] INFO -- : [716/885] 780359=test_ansi_without_terminfo I, [2024-05-24T16:49:52.119430 #738999] INFO -- : [717/885] 780359=test_bmethod I, [2024-05-24T16:49:52.124470 #738999] INFO -- : [718/885] 780359=test_ractor I, [2024-05-24T16:49:52.140194 #738999] INFO -- : [719/885] 780359=test_euc_tw I, [2024-05-24T16:49:52.146051 #738999] INFO -- : [720/885] 780359=test_shapes I, [2024-05-24T16:49:52.148623 #738999] INFO -- : [721/885] 780359=json_fixtures_test I, [2024-05-24T16:49:52.154945 #738999] INFO -- : [722/885] 780359=test_io_timeout I, [2024-05-24T16:49:52.175099 #738999] INFO -- : [723/885] 780359=test_rdoc_parser_c I, [2024-05-24T16:49:52.228899 #738999] INFO -- : [724/885] 780367=test_comparable I, [2024-05-24T16:49:52.234164 #738999] INFO -- : [725/885] 780367=test_enc_str_buf_cat I, [2024-05-24T16:49:52.239013 #738999] INFO -- : [726/885] 780367=test_gbk I, [2024-05-24T16:49:52.245675 #738999] INFO -- : [727/885] 780367=test_class2name I, [2024-05-24T16:49:52.247802 #738999] INFO -- : [728/885] 780367=test_profile_frames I, [2024-05-24T16:49:52.248959 #738999] INFO -- : [729/885] 780365=test_pstore I, [2024-05-24T16:49:52.298117 #738999] INFO -- : [730/885] 780365=test_cstr I, [2024-05-24T16:49:52.408247 #738999] INFO -- : [731/885] 780369=test_digest I, [2024-05-24T16:49:52.427686 #738999] INFO -- : [732/885] 780364=test_marshalable I, [2024-05-24T16:49:52.432601 #738999] INFO -- : [733/885] 780364=test_cgi_util I, [2024-05-24T16:49:52.460628 #738999] INFO -- : [734/885] 780368=test_require I, [2024-05-24T16:49:52.465035 #738999] INFO -- : [735/885] 780367=test_gem_ext_cmake_builder I, [2024-05-24T16:49:52.479100 #738999] INFO -- : [736/885] 780367=test_gem_commands_contents_command I, [2024-05-24T16:49:52.488031 #738999] INFO -- : [737/885] 780359=test_wss I, [2024-05-24T16:49:52.494312 #738999] INFO -- : [738/885] 780359=test_fiddle I, [2024-05-24T16:49:52.523636 #738999] INFO -- : [739/885] 780366=test_find I, [2024-05-24T16:49:52.558827 #738999] INFO -- : [740/885] 780367=test_ractor I, [2024-05-24T16:49:52.560568 #738999] INFO -- : [741/885] 780366=test_complexrational I, [2024-05-24T16:49:52.567439 #738999] INFO -- : [742/885] 780366=test_init I, [2024-05-24T16:49:52.573015 #738999] INFO -- : [743/885] 780359=test_pathname I, [2024-05-24T16:49:52.662660 #738999] INFO -- : [744/885] 780364=test_rdoc_encoding I, [2024-05-24T16:49:52.693988 #738999] INFO -- : [745/885] 780367=test_coverage I, [2024-05-24T16:49:52.702882 #738999] INFO -- : [746/885] 780364=regexp_test I, [2024-05-24T16:49:52.703103 #738999] INFO -- : [747/885] 780372=test_gem_package_tar_reader I, [2024-05-24T16:49:52.714835 #738999] INFO -- : [748/885] 780359=test_file I, [2024-05-24T16:49:52.720725 #738999] INFO -- : [749/885] 780364=test_rdoc_markdown I, [2024-05-24T16:49:52.725912 #738999] INFO -- : [750/885] 780359=test_gem_available_set I, [2024-05-24T16:49:52.735742 #738999] INFO -- : [751/885] 780372=test_rdoc_any_method I, [2024-05-24T16:49:52.802678 #738999] INFO -- : [752/885] 780359=test_modify_expand I, [2024-05-24T16:49:52.809082 #738999] INFO -- : [753/885] 780359=test_bash_completion I, [2024-05-24T16:49:52.816148 #738999] INFO -- : [754/885] 780359=test_formatter I, [2024-05-24T16:49:52.822680 #738999] INFO -- : [755/885] 780359=test_deprecate I, [2024-05-24T16:49:52.840760 #738999] INFO -- : [756/885] 780359=test_rdoc_constant I, [2024-05-24T16:49:52.912041 #738999] INFO -- : [757/885] 780359=test_gem_source_vendor I, [2024-05-24T16:49:52.918502 #738999] INFO -- : [758/885] 780366=test_gem_commands_owner_command I, [2024-05-24T16:49:52.921577 #738999] INFO -- : [759/885] 780359=test_recorder I, [2024-05-24T16:49:52.927789 #738999] INFO -- : [760/885] 780359=test_pkey_dh I, [2024-05-24T16:49:52.986289 #738999] INFO -- : [761/885] 780359=test_bigzero I, [2024-05-24T16:49:52.989681 #738999] INFO -- : [762/885] 780359=test_gem_util I, [2024-05-24T16:49:53.014058 #738999] INFO -- : [763/885] 780364=test_iseq_load I, [2024-05-24T16:49:53.101563 #738999] INFO -- : [764/885] 780359=test_gem_package_tar_header I, [2024-05-24T16:49:53.128959 #738999] INFO -- : [765/885] 780359=test_pkcs12 I, [2024-05-24T16:49:53.204642 #738999] INFO -- : [766/885] 780365=test_system I, [2024-05-24T16:49:53.268672 #738999] INFO -- : [767/885] 780369=test_yjit_exit_locations I, [2024-05-24T16:49:53.271458 #738999] INFO -- : [768/885] 780369=test_etc I, [2024-05-24T16:49:53.296774 #738999] INFO -- : [769/885] 780372=test_ripper I, [2024-05-24T16:49:53.370101 #738999] INFO -- : [770/885] 780369=test_gem_config_file I, [2024-05-24T16:49:53.439963 #738999] INFO -- : [771/885] 780359=test_gem_resolver_activation_request I, [2024-05-24T16:49:53.450798 #738999] INFO -- : [772/885] 780367=test_getopts I, [2024-05-24T16:49:53.453628 #738999] INFO -- : [773/885] 780359=test_protocol I, [2024-05-24T16:49:53.458637 #738999] INFO -- : [774/885] 780367=test_gem_commands_fetch_command I, [2024-05-24T16:49:53.474225 #738999] INFO -- : [775/885] 780366=test_math I, [2024-05-24T16:49:53.487694 #738999] INFO -- : [776/885] 780366=test_gc I, [2024-05-24T16:49:53.488884 #738999] INFO -- : [777/885] 780366=test_libs I, [2024-05-24T16:49:53.501205 #738999] INFO -- : [778/885] 780366=test_config I, [2024-05-24T16:49:53.538051 #738999] INFO -- : [779/885] 780366=test_sleep I, [2024-05-24T16:49:53.556793 #738999] INFO -- : [780/885] 780369=test_yaml_tree I, [2024-05-24T16:49:53.571970 #738999] INFO -- : [781/885] 780367=test_face I, [2024-05-24T16:49:53.585977 #738999] INFO -- : [782/885] 780367=test_sizeof I, [2024-05-24T16:49:53.594494 #738999] INFO -- : [783/885] 780369=test_case I, [2024-05-24T16:49:53.599963 #738999] INFO -- : [784/885] 780368=test_rendering I, [2024-05-24T16:49:53.625371 #738999] INFO -- : [785/885] 780369=test_utf16 I, [2024-05-24T16:49:53.631322 #738999] INFO -- : [786/885] 780369=test_autoload I, [2024-05-24T16:49:53.637833 #738999] INFO -- : [787/885] 780368=test_unicode_escape I, [2024-05-24T16:49:53.659761 #738999] INFO -- : [788/885] 780372=test_io I, [2024-05-24T16:49:53.690338 #738999] INFO -- : [789/885] 780368=test_rdoc_markup_indented_paragraph I, [2024-05-24T16:49:53.697809 #738999] INFO -- : [790/885] 780368=test_pack I, [2024-05-24T16:49:53.713374 #738999] INFO -- : [791/885] 780368=test_backtrace I, [2024-05-24T16:49:53.768211 #738999] INFO -- : [792/885] 780359=ruby_parser_test I, [2024-05-24T16:49:53.768867 #738999] INFO -- : [793/885] 780359=test_io_buffer I, [2024-05-24T16:49:53.793910 #738999] INFO -- : [794/885] 780363=test_rdoc_task I, [2024-05-24T16:49:53.795643 #738999] INFO -- : [795/885] 780363=test_gem_resolver_conflict I, [2024-05-24T16:49:53.810186 #738999] INFO -- : [796/885] 780355=test_gem_commands_install_command I, [2024-05-24T16:49:53.879228 #738999] INFO -- : [797/885] 780359=test_clone I, [2024-05-24T16:49:53.982158 #738999] INFO -- : [798/885] 780363=test_readpartial I, [2024-05-24T16:49:54.015594 #738999] INFO -- : [799/885] 780359=locals_test I, [2024-05-24T16:49:54.078099 #738999] INFO -- : [800/885] 780365=test_rdoc_require I, [2024-05-24T16:49:54.085751 #738999] INFO -- : [801/885] 780365=test_webauthn_poller I, [2024-05-24T16:49:54.217398 #738999] INFO -- : [802/885] 780365=test_rdoc_markup_raw I, [2024-05-24T16:49:54.224154 #738999] INFO -- : [803/885] 780365=test_rat I, [2024-05-24T16:49:54.229516 #738999] INFO -- : [804/885] 780365=encoding_test I, [2024-05-24T16:49:54.274614 #738999] INFO -- : [805/885] 780359=test_gem_resolver_best_set I, [2024-05-24T16:49:54.301204 #738999] INFO -- : [806/885] 780365=test_typeddata I, [2024-05-24T16:49:54.306565 #738999] INFO -- : [807/885] 780359=test_rdoc_markup_to_html_crossref I, [2024-05-24T16:49:54.392621 #738999] INFO -- : [808/885] 780363=test_fstring I, [2024-05-24T16:49:54.445254 #738999] INFO -- : [809/885] 780356=test_optparse I, [2024-05-24T16:49:54.459418 #738999] INFO -- : [810/885] 780364=test_array I, [2024-05-24T16:49:54.466038 #738999] INFO -- : [811/885] 780364=parser_test I, [2024-05-24T16:49:54.472142 #738999] INFO -- : [812/885] 780364=test_convertible I, [2024-05-24T16:49:54.497454 #738999] INFO -- : [813/885] 780359=test_yield I, [2024-05-24T16:49:54.504108 #738999] INFO -- : [814/885] 780356=test_rdoc_alias I, [2024-05-24T16:49:54.516319 #738999] INFO -- : [815/885] 780365=test_files_sample I, [2024-05-24T16:49:54.520572 #738999] INFO -- : [816/885] 780356=test_stringscanner I, [2024-05-24T16:49:54.538101 #738999] INFO -- : [817/885] 780363=test_gem_security_trust_dir I, [2024-05-24T16:49:54.548805 #738999] INFO -- : [818/885] 780356=comments_test I, [2024-05-24T16:49:54.553693 #738999] INFO -- : [819/885] 780356=test_sprintf I, [2024-05-24T16:49:54.576866 #738999] INFO -- : [820/885] 780363=test_gem_requirement I, [2024-05-24T16:49:54.594936 #738999] INFO -- : [821/885] 780365=test_string_memory I, [2024-05-24T16:49:54.665886 #738999] INFO -- : [822/885] 780365=test_undef I, [2024-05-24T16:49:54.670616 #738999] INFO -- : [823/885] 780365=test_line_editor I, [2024-05-24T16:49:54.693828 #738999] INFO -- : [824/885] 780363=test_objspace I, [2024-05-24T16:49:54.752449 #738999] INFO -- : [825/885] 780365=ripper_test I, [2024-05-24T16:49:54.850113 #738999] INFO -- : [826/885] 780356=test_have_library I, [2024-05-24T16:49:54.964844 #738999] INFO -- : [827/885] 780355=test_remote_fetch_error I, [2024-05-24T16:49:54.975726 #738999] INFO -- : [828/885] 780355=test_lock_native_thread I, [2024-05-24T16:49:54.992681 #738999] INFO -- : [829/885] 780368=test_c_struct_entry I, [2024-05-24T16:49:55.209698 #738999] INFO -- : [830/885] 780368=test_gem_commands_stale_command I, [2024-05-24T16:49:55.220446 #738999] INFO -- : [831/885] 780368=test_set I, [2024-05-24T16:49:55.226472 #738999] INFO -- : [832/885] 780368=test_show_source I, [2024-05-24T16:49:55.239292 #738999] INFO -- : [833/885] 780368=test_alias_and_anchor I, [2024-05-24T16:49:55.244184 #738999] INFO -- : [834/885] 780368=test_postponed_job I, [2024-05-24T16:49:55.259471 #738999] INFO -- : [835/885] 780355=test_external_new I, [2024-05-24T16:49:55.263815 #738999] INFO -- : [836/885] 780355=test_tree_builder I, [2024-05-24T16:49:55.267504 #738999] INFO -- : [837/885] 780365=test_gem_resolver_dependency_request I, [2024-05-24T16:49:55.272841 #738999] INFO -- : [838/885] 780355=test_hash I, [2024-05-24T16:49:55.281114 #738999] INFO -- : [839/885] 780355=test_protect I, [2024-05-24T16:49:55.286096 #738999] INFO -- : [840/885] 780355=test_win32ole_typelib I, [2024-05-24T16:49:55.286232 #738999] INFO -- : [841/885] 780355=test_gem_request_set_lockfile I, [2024-05-24T16:49:55.308003 #738999] INFO -- : [842/885] 780365=test_raise_exception I, [2024-05-24T16:49:55.584506 #738999] INFO -- : [843/885] 780355=test_argf I, [2024-05-24T16:49:55.587061 #738999] INFO -- : [844/885] 780366=test_kill_ring I, [2024-05-24T16:49:55.592382 #738999] INFO -- : [845/885] 780358=test_ns_spki I, [2024-05-24T16:49:55.595782 #738999] INFO -- : [846/885] 780366=test_framework I, [2024-05-24T16:49:55.601984 #738999] INFO -- : [847/885] 780366=test_yjit I, [2024-05-24T16:49:55.602401 #738999] INFO -- : [848/885] 780366=test_weakmap I, [2024-05-24T16:49:55.605840 #738999] INFO -- : [849/885] 780368=test_workspace I, [2024-05-24T16:49:55.611088 #738999] INFO -- : [850/885] 780358=test_gem_commands_environment_command I, [2024-05-24T16:49:55.672935 #738999] INFO -- : [851/885] 780358=test_m17n I, [2024-05-24T16:49:55.745663 #738999] INFO -- : [852/885] 780358=test_ws I, [2024-05-24T16:49:55.764647 #738999] INFO -- : [853/885] 780354=test_kwargs I, [2024-05-24T16:49:55.766610 #738999] INFO -- : [854/885] 780358=warnings_test I, [2024-05-24T16:49:55.770143 #738999] INFO -- : [855/885] 780354=test_io_wait I, [2024-05-24T16:49:55.772607 #738999] INFO -- : [856/885] 780368=test_gem_commands_exec_command I, [2024-05-24T16:49:55.878005 #738999] INFO -- : [857/885] 780358=test_date_attr I, [2024-05-24T16:49:55.887025 #738999] INFO -- : [858/885] 780358=test_ellipsize I, [2024-05-24T16:49:55.890390 #738999] INFO -- : [859/885] 780358=test_summary I, [2024-05-24T16:49:56.004025 #738999] INFO -- : [860/885] 780358=test_console_attr I, [2024-05-24T16:49:56.011958 #738999] INFO -- : [861/885] 780358=test_type_completor I, [2024-05-24T16:49:56.012717 #738999] INFO -- : [862/885] 780358=test_win32ole_record I, [2024-05-24T16:49:56.022682 #738999] INFO -- : [863/885] 780358=test_gem_unsatisfiable_dependency_error I, [2024-05-24T16:49:56.033113 #738999] INFO -- : [864/885] 780358=test_gem_commands_uninstall_command I, [2024-05-24T16:49:56.067411 #738999] INFO -- : [865/885] 780365=test_foreach I, [2024-05-24T16:49:56.067735 #738999] INFO -- : [866/885] 780356=test_gem_source_specific_file I, [2024-05-24T16:49:56.071567 #738999] INFO -- : [867/885] 780365=test_condition I, [2024-05-24T16:49:56.074976 #738999] INFO -- : [868/885] 780365=test_cp949 I, [2024-05-24T16:49:56.083242 #738999] INFO -- : [869/885] 780365=test_io I, [2024-05-24T16:49:56.102544 #738999] INFO -- : [870/885] 780354=test_ubf_async_safe I, [2024-05-24T16:49:56.108054 #738999] INFO -- : [871/885] 780354=test_hash I, [2024-05-24T16:49:56.171412 #738999] INFO -- : [872/885] 780356=test_sorted_set I, [2024-05-24T16:49:56.254056 #738999] INFO -- : [873/885] 780371=test_win32ole_type_event I, [2024-05-24T16:49:56.260858 #738999] INFO -- : [874/885] 780371=test_emoji I, [2024-05-24T16:49:56.301627 #738999] INFO -- : [875/885] 780371=test_array_create I, [2024-05-24T16:49:56.303021 #738999] INFO -- : [876/885] 780371=test_pack I, [2024-05-24T16:49:56.314291 #738999] INFO -- : [877/885] 780365=test_gem_impossible_dependencies_error I, [2024-05-24T16:49:56.320056 #738999] INFO -- : [878/885] 780373=test_to_ruby I, [2024-05-24T16:49:56.342551 #738999] INFO -- : [879/885] 780365=test_pattern_key_name_check I, [2024-05-24T16:49:56.346518 #738999] INFO -- : [880/885] 780365=test_rdoc_rubygems_hook I, [2024-05-24T16:49:56.351872 #738999] INFO -- : [881/885] 780373=test_gem_commands_query_command I, [2024-05-24T16:49:56.382303 #738999] INFO -- : [882/885] 780356=test_method I, [2024-05-24T16:49:56.427011 #738999] INFO -- : [883/885] 780365=test_rdoc_context_section I, [2024-05-24T16:49:56.434384 #738999] INFO -- : [884/885] 780365=test_euc_kr I, [2024-05-24T16:49:56.438714 #738999] INFO -- : [885/885] 780365=test_ftp I, [2024-05-24T16:50:13.138487 #738999] INFO -- : Finished tests in 36.539933s, 722.9077 tests/s, 255988.8107 assertions/s. I, [2024-05-24T16:50:13.139314 #738999] INFO -- : 26415 tests, 9353814 assertions, 0 failures, 0 errors, 306 skips I, [2024-05-24T16:50:13.139343 #738999] INFO -- : I, [2024-05-24T16:50:13.139352 #738999] INFO -- : ruby -v: ruby 3.4.0dev (2024-05-24T16:36:54Z master 47f0965269) [x86_64-linux] I, [2024-05-24T16:50:13.141306 #738999] INFO -- : $$$[end] "make yes-test-all TESTOPTS='--stderr-on-failure' TESTS='-j20'" exit with 0. I, [2024-05-24T16:50:13.141440 #738999] INFO -- : $$$[beg] make yes-test-rubyspec MSPECOPT='--error-output stderr --debug -j' TESTS='-j20' I, [2024-05-24T16:50:13.241482 #738999] INFO -- : BASERUBY = /usr/bin/ruby --disable=gems I, [2024-05-24T16:50:13.241520 #738999] INFO -- : CC = gcc I, [2024-05-24T16:50:13.241527 #738999] INFO -- : LD = ld I, [2024-05-24T16:50:13.241531 #738999] INFO -- : LDSHARED = gcc -shared I, [2024-05-24T16:50:13.241534 #738999] INFO -- : CFLAGS = -O3 -fno-fast-math -ggdb3 -Wall -Wextra -Wdeprecated-declarations -Wdiv-by-zero -Wduplicated-cond -Wimplicit-function-declaration -Wimplicit-int -Wpointer-arith -Wwrite-strings -Wold-style-definition -Wimplicit-fallthrough=0 -Wmissing-noreturn -Wno-cast-function-type -Wno-constant-logical-operand -Wno-long-long -Wno-missing-field-initializers -Wno-overlength-strings -Wno-packed-bitfield-compat -Wno-parentheses-equality -Wno-self-assign -Wno-tautological-compare -Wno-unused-parameter -Wno-unused-value -Wsuggest-attribute=format -Wsuggest-attribute=noreturn -Wunused-variable -Wmisleading-indentation -Wundef -fPIC I, [2024-05-24T16:50:13.241539 #738999] INFO -- : XCFLAGS = -U_FORTIFY_SOURCE -D_FORTIFY_SOURCE=2 -fstack-protector-strong -fno-strict-overflow -fvisibility=hidden -fexcess-precision=standard -DRUBY_EXPORT -I. -I.ext/include/x86_64-linux -I/tmp/ruby/src/trunk/include -I/tmp/ruby/src/trunk -I/tmp/ruby/src/trunk/prism -I/tmp/ruby/src/trunk/enc/unicode/15.0.0 I, [2024-05-24T16:50:13.241542 #738999] INFO -- : CPPFLAGS = I, [2024-05-24T16:50:13.241546 #738999] INFO -- : DLDFLAGS = -Wl,--compress-debug-sections=zlib -Wl,-soname,libruby.so.3.4 -fstack-protector-strong I, [2024-05-24T16:50:13.241557 #738999] INFO -- : SOLIBS = -lz -lrt -lrt -lgmp -ldl -lcrypt -lm -lpthread I, [2024-05-24T16:50:13.241561 #738999] INFO -- : LANG = en_US.UTF-8 I, [2024-05-24T16:50:13.241564 #738999] INFO -- : LC_ALL = I, [2024-05-24T16:50:13.241568 #738999] INFO -- : LC_CTYPE = I, [2024-05-24T16:50:13.241571 #738999] INFO -- : MFLAGS = I, [2024-05-24T16:50:13.241574 #738999] INFO -- : RUSTC = no I, [2024-05-24T16:50:13.241578 #738999] INFO -- : YJIT_RUSTC_ARGS = --crate-name=yjit --crate-type=staticlib --edition=2021 -g -C lto=thin -C opt-level=3 -C overflow-checks=on '--out-dir=/tmp/ruby/build/trunk/yjit/target/release/' /tmp/ruby/src/trunk/yjit/src/lib.rs I, [2024-05-24T16:50:13.242192 #738999] INFO -- : gcc (Ubuntu 11.4.0-1ubuntu1~22.04) 11.4.0 I, [2024-05-24T16:50:13.242212 #738999] INFO -- : Copyright (C) 2021 Free Software Foundation, Inc. I, [2024-05-24T16:50:13.242218 #738999] INFO -- : This is free software; see the source for copying conditions. There is NO I, [2024-05-24T16:50:13.242222 #738999] INFO -- : warranty; not even for MERCHANTABILITY or FITNESS FOR A PARTICULAR PURPOSE. I, [2024-05-24T16:50:13.242226 #738999] INFO -- : I, [2024-05-24T16:50:13.243828 #738999] INFO -- : generating enc.mk I, [2024-05-24T16:50:13.361333 #738999] INFO -- : generating encdb.h I, [2024-05-24T16:50:13.385056 #738999] INFO -- : encdb.h unchanged I, [2024-05-24T16:50:13.386170 #738999] INFO -- : making enc I, [2024-05-24T16:50:13.403581 #738999] INFO -- : make[1]: Entering directory '/tmp/ruby/build/trunk' I, [2024-05-24T16:50:13.403602 #738999] INFO -- : make[1]: Nothing to be done for 'enc'. I, [2024-05-24T16:50:13.403607 #738999] INFO -- : make[1]: Leaving directory '/tmp/ruby/build/trunk' I, [2024-05-24T16:50:13.404317 #738999] INFO -- : making srcs under enc I, [2024-05-24T16:50:13.434265 #738999] INFO -- : make[1]: Entering directory '/tmp/ruby/build/trunk' I, [2024-05-24T16:50:13.434286 #738999] INFO -- : make[1]: Nothing to be done for 'srcs'. I, [2024-05-24T16:50:13.434291 #738999] INFO -- : make[1]: Leaving directory '/tmp/ruby/build/trunk' I, [2024-05-24T16:50:13.435309 #738999] INFO -- : generating transdb.h I, [2024-05-24T16:50:13.534670 #738999] INFO -- : transdb.h unchanged I, [2024-05-24T16:50:13.536241 #738999] INFO -- : making trans I, [2024-05-24T16:50:13.570017 #738999] INFO -- : make[1]: Entering directory '/tmp/ruby/build/trunk' I, [2024-05-24T16:50:13.570038 #738999] INFO -- : make[1]: Nothing to be done for 'trans'. I, [2024-05-24T16:50:13.570045 #738999] INFO -- : make[1]: Leaving directory '/tmp/ruby/build/trunk' I, [2024-05-24T16:50:13.570807 #738999] INFO -- : making encs I, [2024-05-24T16:50:13.607633 #738999] INFO -- : make[1]: Entering directory '/tmp/ruby/build/trunk' I, [2024-05-24T16:50:13.607656 #738999] INFO -- : make[1]: Nothing to be done for 'encs'. I, [2024-05-24T16:50:13.607662 #738999] INFO -- : make[1]: Leaving directory '/tmp/ruby/build/trunk' I, [2024-05-24T16:50:13.609408 #738999] INFO -- : generating makefiles ext/configure-ext.mk I, [2024-05-24T16:50:13.636473 #738999] INFO -- : ext/configure-ext.mk updated I, [2024-05-24T16:50:13.638951 #738999] INFO -- : make[1]: Entering directory '/tmp/ruby/build/trunk' I, [2024-05-24T16:50:15.031143 #738999] INFO -- : make[1]: Leaving directory '/tmp/ruby/build/trunk' I, [2024-05-24T16:50:15.031836 #738999] INFO -- : generating makefile exts.mk I, [2024-05-24T16:50:15.068438 #738999] INFO -- : exts.mk unchanged I, [2024-05-24T16:50:15.072996 #738999] INFO -- : make[1]: Entering directory '/tmp/ruby/build/trunk' I, [2024-05-24T16:50:15.383092 #738999] INFO -- : make[2]: Entering directory '/tmp/ruby/build/trunk/ext/coverage' I, [2024-05-24T16:50:15.387835 #738999] INFO -- : make[2]: Leaving directory '/tmp/ruby/build/trunk/ext/coverage' I, [2024-05-24T16:50:15.394153 #738999] INFO -- : make[2]: Entering directory '/tmp/ruby/build/trunk/ext/date' I, [2024-05-24T16:50:15.399165 #738999] INFO -- : make[2]: Leaving directory '/tmp/ruby/build/trunk/ext/date' I, [2024-05-24T16:50:15.402977 #738999] INFO -- : make[2]: Entering directory '/tmp/ruby/build/trunk/ext/digest' I, [2024-05-24T16:50:15.411906 #738999] INFO -- : make[2]: Leaving directory '/tmp/ruby/build/trunk/ext/digest' I, [2024-05-24T16:50:15.438130 #738999] INFO -- : make[2]: Entering directory '/tmp/ruby/build/trunk/ext/digest/sha2' I, [2024-05-24T16:50:15.442991 #738999] INFO -- : make[2]: Leaving directory '/tmp/ruby/build/trunk/ext/digest/sha2' I, [2024-05-24T16:50:15.464691 #738999] INFO -- : make[2]: Entering directory '/tmp/ruby/build/trunk/ext/fiddle' I, [2024-05-24T16:50:15.474091 #738999] INFO -- : make[2]: Leaving directory '/tmp/ruby/build/trunk/ext/fiddle' I, [2024-05-24T16:50:15.478680 #738999] INFO -- : make[2]: Entering directory '/tmp/ruby/build/trunk/ext/io/console' I, [2024-05-24T16:50:15.482891 #738999] INFO -- : make[2]: Leaving directory '/tmp/ruby/build/trunk/ext/io/console' I, [2024-05-24T16:50:15.495678 #738999] INFO -- : make[2]: Entering directory '/tmp/ruby/build/trunk/ext/json' I, [2024-05-24T16:50:15.506342 #738999] INFO -- : make[2]: Leaving directory '/tmp/ruby/build/trunk/ext/json' I, [2024-05-24T16:50:15.522166 #738999] INFO -- : make[2]: Entering directory '/tmp/ruby/build/trunk/ext/monitor' I, [2024-05-24T16:50:15.526207 #738999] INFO -- : make[2]: Leaving directory '/tmp/ruby/build/trunk/ext/monitor' I, [2024-05-24T16:50:15.533337 #738999] INFO -- : make[2]: Entering directory '/tmp/ruby/build/trunk/ext/objspace' I, [2024-05-24T16:50:15.539796 #738999] INFO -- : make[2]: Leaving directory '/tmp/ruby/build/trunk/ext/objspace' I, [2024-05-24T16:50:15.556333 #738999] INFO -- : make[2]: Entering directory '/tmp/ruby/build/trunk/ext/openssl' I, [2024-05-24T16:50:15.570670 #738999] INFO -- : make[2]: Leaving directory '/tmp/ruby/build/trunk/ext/openssl' I, [2024-05-24T16:50:15.574123 #738999] INFO -- : make[2]: Entering directory '/tmp/ruby/build/trunk/ext/pathname' I, [2024-05-24T16:50:15.578220 #738999] INFO -- : make[2]: Leaving directory '/tmp/ruby/build/trunk/ext/pathname' I, [2024-05-24T16:50:15.585428 #738999] INFO -- : make[2]: Entering directory '/tmp/ruby/build/trunk/ext/psych' I, [2024-05-24T16:50:15.610034 #738999] INFO -- : make[2]: Leaving directory '/tmp/ruby/build/trunk/ext/psych' I, [2024-05-24T16:50:15.614540 #738999] INFO -- : make[2]: Entering directory '/tmp/ruby/build/trunk/ext/pty' I, [2024-05-24T16:50:15.618791 #738999] INFO -- : make[2]: Leaving directory '/tmp/ruby/build/trunk/ext/pty' I, [2024-05-24T16:50:15.634081 #738999] INFO -- : make[2]: Entering directory '/tmp/ruby/build/trunk/ext/ripper' I, [2024-05-24T16:50:15.642520 #738999] INFO -- : make[2]: Leaving directory '/tmp/ruby/build/trunk/ext/ripper' I, [2024-05-24T16:50:15.645064 #738999] INFO -- : make[2]: Entering directory '/tmp/ruby/build/trunk/ext/rubyvm' I, [2024-05-24T16:50:15.648401 #738999] INFO -- : make[2]: Leaving directory '/tmp/ruby/build/trunk/ext/rubyvm' I, [2024-05-24T16:50:15.662790 #738999] INFO -- : make[2]: Entering directory '/tmp/ruby/build/trunk/ext/socket' I, [2024-05-24T16:50:15.673093 #738999] INFO -- : make[2]: Leaving directory '/tmp/ruby/build/trunk/ext/socket' I, [2024-05-24T16:50:15.691230 #738999] INFO -- : make[2]: Entering directory '/tmp/ruby/build/trunk/.bundle/gems/bigdecimal-3.1.8/ext/bigdecimal' I, [2024-05-24T16:50:15.716146 #738999] INFO -- : make[2]: Leaving directory '/tmp/ruby/build/trunk/.bundle/gems/bigdecimal-3.1.8/ext/bigdecimal' I, [2024-05-24T16:50:15.718421 #738999] INFO -- : make[2]: Entering directory '/tmp/ruby/build/trunk/.bundle/gems/debug-1.9.2/ext/debug' I, [2024-05-24T16:50:15.742083 #738999] INFO -- : make[2]: Leaving directory '/tmp/ruby/build/trunk/.bundle/gems/debug-1.9.2/ext/debug' I, [2024-05-24T16:50:15.744031 #738999] INFO -- : make[2]: Entering directory '/tmp/ruby/build/trunk/.bundle/gems/nkf-0.2.0/ext/nkf' I, [2024-05-24T16:50:15.766583 #738999] INFO -- : make[2]: Leaving directory '/tmp/ruby/build/trunk/.bundle/gems/nkf-0.2.0/ext/nkf' I, [2024-05-24T16:50:15.768544 #738999] INFO -- : make[2]: Entering directory '/tmp/ruby/build/trunk/.bundle/gems/racc-1.7.3/ext/racc/cparse' I, [2024-05-24T16:50:15.791791 #738999] INFO -- : make[2]: Leaving directory '/tmp/ruby/build/trunk/.bundle/gems/racc-1.7.3/ext/racc/cparse' I, [2024-05-24T16:50:15.793713 #738999] INFO -- : make[2]: Entering directory '/tmp/ruby/build/trunk/.bundle/gems/racc-1.8.0/ext/racc/cparse' I, [2024-05-24T16:50:15.815219 #738999] INFO -- : make[2]: Leaving directory '/tmp/ruby/build/trunk/.bundle/gems/racc-1.8.0/ext/racc/cparse' I, [2024-05-24T16:50:15.817494 #738999] INFO -- : make[2]: Entering directory '/tmp/ruby/build/trunk/.bundle/gems/rbs-3.4.4/ext/rbs_extension' I, [2024-05-24T16:50:15.839589 #738999] INFO -- : make[2]: Leaving directory '/tmp/ruby/build/trunk/.bundle/gems/rbs-3.4.4/ext/rbs_extension' I, [2024-05-24T16:50:15.841607 #738999] INFO -- : make[2]: Entering directory '/tmp/ruby/build/trunk/.bundle/gems/syslog-0.1.2/ext/syslog' I, [2024-05-24T16:50:15.864191 #738999] INFO -- : make[2]: Leaving directory '/tmp/ruby/build/trunk/.bundle/gems/syslog-0.1.2/ext/syslog' I, [2024-05-24T16:50:15.889137 #738999] INFO -- : make[2]: Entering directory '/tmp/ruby/build/trunk' I, [2024-05-24T16:50:15.964823 #738999] INFO -- : make[2]: 'ruby' is up to date. I, [2024-05-24T16:50:15.964861 #738999] INFO -- : make[2]: Leaving directory '/tmp/ruby/build/trunk' I, [2024-05-24T16:50:15.965293 #738999] INFO -- : make[1]: Leaving directory '/tmp/ruby/build/trunk' I, [2024-05-24T16:50:15.969080 #738999] INFO -- : make[1]: Entering directory '/tmp/ruby/build/trunk' I, [2024-05-24T16:50:15.969104 #738999] INFO -- : make[1]: Nothing to be done for 'note'. I, [2024-05-24T16:50:15.969111 #738999] INFO -- : make[1]: Leaving directory '/tmp/ruby/build/trunk' E, [2024-05-24T16:50:16.032097 #738999] ERROR -- : $ /tmp/ruby/build/trunk/miniruby -I/tmp/ruby/src/trunk/lib /tmp/ruby/src/trunk/tool/runruby.rb --archdir=/tmp/ruby/build/trunk --extout=.ext -- /tmp/ruby/src/trunk/spec/mspec/bin/mspec-run -B /tmp/ruby/src/trunk/spec/default.mspec --error-output stderr --debug -fy -o /tmp/rubytest.0hpvr0/1-mspec-multi-0 E, [2024-05-24T16:50:16.032293 #738999] ERROR -- : $ /tmp/ruby/build/trunk/miniruby -I/tmp/ruby/src/trunk/lib /tmp/ruby/src/trunk/tool/runruby.rb --archdir=/tmp/ruby/build/trunk --extout=.ext -- /tmp/ruby/src/trunk/spec/mspec/bin/mspec-run -B /tmp/ruby/src/trunk/spec/default.mspec --error-output stderr --debug -fy -o /tmp/rubytest.0hpvr0/2-mspec-multi-1 E, [2024-05-24T16:50:16.032596 #738999] ERROR -- : $ /tmp/ruby/build/trunk/miniruby -I/tmp/ruby/src/trunk/lib /tmp/ruby/src/trunk/tool/runruby.rb --archdir=/tmp/ruby/build/trunk --extout=.ext -- /tmp/ruby/src/trunk/spec/mspec/bin/mspec-run -B /tmp/ruby/src/trunk/spec/default.mspec --error-output stderr --debug -fy -o /tmp/rubytest.0hpvr0/3-mspec-multi-2 E, [2024-05-24T16:50:16.032887 #738999] ERROR -- : $ /tmp/ruby/build/trunk/miniruby -I/tmp/ruby/src/trunk/lib /tmp/ruby/src/trunk/tool/runruby.rb --archdir=/tmp/ruby/build/trunk --extout=.ext -- /tmp/ruby/src/trunk/spec/mspec/bin/mspec-run -B /tmp/ruby/src/trunk/spec/default.mspec --error-output stderr --debug -fy -o /tmp/rubytest.0hpvr0/4-mspec-multi-3 E, [2024-05-24T16:50:16.033180 #738999] ERROR -- : $ /tmp/ruby/build/trunk/miniruby -I/tmp/ruby/src/trunk/lib /tmp/ruby/src/trunk/tool/runruby.rb --archdir=/tmp/ruby/build/trunk --extout=.ext -- /tmp/ruby/src/trunk/spec/mspec/bin/mspec-run -B /tmp/ruby/src/trunk/spec/default.mspec --error-output stderr --debug -fy -o /tmp/rubytest.0hpvr0/5-mspec-multi-4 E, [2024-05-24T16:50:16.033397 #738999] ERROR -- : $ /tmp/ruby/build/trunk/miniruby -I/tmp/ruby/src/trunk/lib /tmp/ruby/src/trunk/tool/runruby.rb --archdir=/tmp/ruby/build/trunk --extout=.ext -- /tmp/ruby/src/trunk/spec/mspec/bin/mspec-run -B /tmp/ruby/src/trunk/spec/default.mspec --error-output stderr --debug -fy -o /tmp/rubytest.0hpvr0/6-mspec-multi-5 E, [2024-05-24T16:50:16.033528 #738999] ERROR -- : $ /tmp/ruby/build/trunk/miniruby -I/tmp/ruby/src/trunk/lib /tmp/ruby/src/trunk/tool/runruby.rb --archdir=/tmp/ruby/build/trunk --extout=.ext -- /tmp/ruby/src/trunk/spec/mspec/bin/mspec-run -B /tmp/ruby/src/trunk/spec/default.mspec --error-output stderr --debug -fy -o /tmp/rubytest.0hpvr0/7-mspec-multi-6 E, [2024-05-24T16:50:16.033736 #738999] ERROR -- : $ /tmp/ruby/build/trunk/miniruby -I/tmp/ruby/src/trunk/lib /tmp/ruby/src/trunk/tool/runruby.rb --archdir=/tmp/ruby/build/trunk --extout=.ext -- /tmp/ruby/src/trunk/spec/mspec/bin/mspec-run -B /tmp/ruby/src/trunk/spec/default.mspec --error-output stderr --debug -fy -o /tmp/rubytest.0hpvr0/8-mspec-multi-7 E, [2024-05-24T16:50:16.033896 #738999] ERROR -- : $ /tmp/ruby/build/trunk/miniruby -I/tmp/ruby/src/trunk/lib /tmp/ruby/src/trunk/tool/runruby.rb --archdir=/tmp/ruby/build/trunk --extout=.ext -- /tmp/ruby/src/trunk/spec/mspec/bin/mspec-run -B /tmp/ruby/src/trunk/spec/default.mspec --error-output stderr --debug -fy -o /tmp/rubytest.0hpvr0/9-mspec-multi-8 E, [2024-05-24T16:50:16.034043 #738999] ERROR -- : $ /tmp/ruby/build/trunk/miniruby -I/tmp/ruby/src/trunk/lib /tmp/ruby/src/trunk/tool/runruby.rb --archdir=/tmp/ruby/build/trunk --extout=.ext -- /tmp/ruby/src/trunk/spec/mspec/bin/mspec-run -B /tmp/ruby/src/trunk/spec/default.mspec --error-output stderr --debug -fy -o /tmp/rubytest.0hpvr0/10-mspec-multi-9 E, [2024-05-24T16:50:16.034216 #738999] ERROR -- : $ /tmp/ruby/build/trunk/miniruby -I/tmp/ruby/src/trunk/lib /tmp/ruby/src/trunk/tool/runruby.rb --archdir=/tmp/ruby/build/trunk --extout=.ext -- /tmp/ruby/src/trunk/spec/mspec/bin/mspec-run -B /tmp/ruby/src/trunk/spec/default.mspec --error-output stderr --debug -fy -o /tmp/rubytest.0hpvr0/11-mspec-multi-10 E, [2024-05-24T16:50:16.034539 #738999] ERROR -- : $ /tmp/ruby/build/trunk/miniruby -I/tmp/ruby/src/trunk/lib /tmp/ruby/src/trunk/tool/runruby.rb --archdir=/tmp/ruby/build/trunk --extout=.ext -- /tmp/ruby/src/trunk/spec/mspec/bin/mspec-run -B /tmp/ruby/src/trunk/spec/default.mspec --error-output stderr --debug -fy -o /tmp/rubytest.0hpvr0/12-mspec-multi-11 E, [2024-05-24T16:50:16.034764 #738999] ERROR -- : $ /tmp/ruby/build/trunk/miniruby -I/tmp/ruby/src/trunk/lib /tmp/ruby/src/trunk/tool/runruby.rb --archdir=/tmp/ruby/build/trunk --extout=.ext -- /tmp/ruby/src/trunk/spec/mspec/bin/mspec-run -B /tmp/ruby/src/trunk/spec/default.mspec --error-output stderr --debug -fy -o /tmp/rubytest.0hpvr0/13-mspec-multi-12 E, [2024-05-24T16:50:16.034939 #738999] ERROR -- : $ /tmp/ruby/build/trunk/miniruby -I/tmp/ruby/src/trunk/lib /tmp/ruby/src/trunk/tool/runruby.rb --archdir=/tmp/ruby/build/trunk --extout=.ext -- /tmp/ruby/src/trunk/spec/mspec/bin/mspec-run -B /tmp/ruby/src/trunk/spec/default.mspec --error-output stderr --debug -fy -o /tmp/rubytest.0hpvr0/14-mspec-multi-13 E, [2024-05-24T16:50:16.035161 #738999] ERROR -- : $ /tmp/ruby/build/trunk/miniruby -I/tmp/ruby/src/trunk/lib /tmp/ruby/src/trunk/tool/runruby.rb --archdir=/tmp/ruby/build/trunk --extout=.ext -- /tmp/ruby/src/trunk/spec/mspec/bin/mspec-run -B /tmp/ruby/src/trunk/spec/default.mspec --error-output stderr --debug -fy -o /tmp/rubytest.0hpvr0/15-mspec-multi-14 E, [2024-05-24T16:50:16.035360 #738999] ERROR -- : $ /tmp/ruby/build/trunk/miniruby -I/tmp/ruby/src/trunk/lib /tmp/ruby/src/trunk/tool/runruby.rb --archdir=/tmp/ruby/build/trunk --extout=.ext -- /tmp/ruby/src/trunk/spec/mspec/bin/mspec-run -B /tmp/ruby/src/trunk/spec/default.mspec --error-output stderr --debug -fy -o /tmp/rubytest.0hpvr0/16-mspec-multi-15 E, [2024-05-24T16:50:16.035539 #738999] ERROR -- : $ /tmp/ruby/build/trunk/miniruby -I/tmp/ruby/src/trunk/lib /tmp/ruby/src/trunk/tool/runruby.rb --archdir=/tmp/ruby/build/trunk --extout=.ext -- /tmp/ruby/src/trunk/spec/mspec/bin/mspec-run -B /tmp/ruby/src/trunk/spec/default.mspec --error-output stderr --debug -fy -o /tmp/rubytest.0hpvr0/17-mspec-multi-16 E, [2024-05-24T16:50:16.035677 #738999] ERROR -- : $ /tmp/ruby/build/trunk/miniruby -I/tmp/ruby/src/trunk/lib /tmp/ruby/src/trunk/tool/runruby.rb --archdir=/tmp/ruby/build/trunk --extout=.ext -- /tmp/ruby/src/trunk/spec/mspec/bin/mspec-run -B /tmp/ruby/src/trunk/spec/default.mspec --error-output stderr --debug -fy -o /tmp/rubytest.0hpvr0/18-mspec-multi-17 E, [2024-05-24T16:50:16.037956 #738999] ERROR -- : $ /tmp/ruby/build/trunk/miniruby -I/tmp/ruby/src/trunk/lib /tmp/ruby/src/trunk/tool/runruby.rb --archdir=/tmp/ruby/build/trunk --extout=.ext -- /tmp/ruby/src/trunk/spec/mspec/bin/mspec-run -B /tmp/ruby/src/trunk/spec/default.mspec --error-output stderr --debug -fy -o /tmp/rubytest.0hpvr0/19-mspec-multi-18 E, [2024-05-24T16:50:16.038238 #738999] ERROR -- : $ /tmp/ruby/build/trunk/miniruby -I/tmp/ruby/src/trunk/lib /tmp/ruby/src/trunk/tool/runruby.rb --archdir=/tmp/ruby/build/trunk --extout=.ext -- /tmp/ruby/src/trunk/spec/mspec/bin/mspec-run -B /tmp/ruby/src/trunk/spec/default.mspec --error-output stderr --debug -fy -o /tmp/rubytest.0hpvr0/20-mspec-multi-19 I, [2024-05-24T16:50:16.205121 #738999] INFO -- : ruby 3.4.0dev (2024-05-24T16:36:54Z master 47f0965269) [x86_64-linux] I, [2024-05-24T16:50:16.820751 #738999] INFO -- : 0 ......................................................................... I, [2024-05-24T16:50:17.176866 #738999] INFO -- : 73 ......................................................................... I, [2024-05-24T16:50:17.361497 #738999] INFO -- : 146 ......................................................................... I, [2024-05-24T16:50:17.399922 #738999] INFO -- : 219 ......................................................................... I, [2024-05-24T16:50:17.458629 #738999] INFO -- : 292 ......................................................................... I, [2024-05-24T16:50:17.507887 #738999] INFO -- : 365 ......................................................................... I, [2024-05-24T16:50:17.520269 #738999] INFO -- : 438 ......................................................................... I, [2024-05-24T16:50:17.538265 #738999] INFO -- : 511 ......................................................................... I, [2024-05-24T16:50:17.555256 #738999] INFO -- : 584 ......................................................................... I, [2024-05-24T16:50:17.613658 #738999] INFO -- : 657 ......................................................................... I, [2024-05-24T16:50:17.647081 #738999] INFO -- : 730 ......................................................................... I, [2024-05-24T16:50:17.673028 #738999] INFO -- : 803 ......................................................................... I, [2024-05-24T16:50:17.703101 #738999] INFO -- : 876 ......................................................................... I, [2024-05-24T16:50:17.744977 #738999] INFO -- : 949 ......................................................................... I, [2024-05-24T16:50:17.834836 #738999] INFO -- : 1022 ......................................................................... I, [2024-05-24T16:50:18.024643 #738999] INFO -- : 1095 ......................................................................... I, [2024-05-24T16:50:18.127184 #738999] INFO -- : 1168 ......................................................................... I, [2024-05-24T16:50:18.177955 #738999] INFO -- : 1241 ......................................................................... I, [2024-05-24T16:50:18.225038 #738999] INFO -- : 1314 ......................................................................... I, [2024-05-24T16:50:18.256191 #738999] INFO -- : 1387 ......................................................................... I, [2024-05-24T16:50:18.353768 #738999] INFO -- : 1460 ......................................................................... I, [2024-05-24T16:50:18.812831 #738999] INFO -- : 1533 ......................................................................... I, [2024-05-24T16:50:18.882486 #738999] INFO -- : 1606 ......................................................................... I, [2024-05-24T16:50:19.006668 #738999] INFO -- : 1679 ......................................................................... I, [2024-05-24T16:50:19.142921 #738999] INFO -- : 1752 ......................................................................... I, [2024-05-24T16:50:19.222898 #738999] INFO -- : 1825 ......................................................................... I, [2024-05-24T16:50:19.297551 #738999] INFO -- : 1898 ......................................................................... I, [2024-05-24T16:50:19.384141 #738999] INFO -- : 1971 ......................................................................... I, [2024-05-24T16:50:19.480011 #738999] INFO -- : 2044 ......................................................................... I, [2024-05-24T16:50:19.516108 #738999] INFO -- : 2117 ......................................................................... I, [2024-05-24T16:50:19.530039 #738999] INFO -- : 2190 ......................................................................... I, [2024-05-24T16:50:19.547625 #738999] INFO -- : 2263 ......................................................................... I, [2024-05-24T16:50:19.563963 #738999] INFO -- : 2336 ......................................................................... I, [2024-05-24T16:50:19.596057 #738999] INFO -- : 2409 ......................................................................... I, [2024-05-24T16:50:19.706629 #738999] INFO -- : 2482 ......................................................................... I, [2024-05-24T16:50:19.733846 #738999] INFO -- : 2555 ......................................................................... I, [2024-05-24T16:50:19.835423 #738999] INFO -- : 2628 ......................................................................... I, [2024-05-24T16:50:19.944207 #738999] INFO -- : 2701 ......................................................................... I, [2024-05-24T16:50:19.974014 #738999] INFO -- : 2774 ......................................................................... I, [2024-05-24T16:50:20.032236 #738999] INFO -- : 2847 ......................................................................... I, [2024-05-24T16:50:20.065087 #738999] INFO -- : 2920 ......................................................................... I, [2024-05-24T16:50:20.088597 #738999] INFO -- : 2993 ......................................................................... I, [2024-05-24T16:50:20.114269 #738999] INFO -- : 3066 ......................................................................... I, [2024-05-24T16:50:20.128594 #738999] INFO -- : 3139 ......................................................................... I, [2024-05-24T16:50:20.136319 #738999] INFO -- : 3212 ......................................................................... I, [2024-05-24T16:50:20.166865 #738999] INFO -- : 3285 ......................................................................... I, [2024-05-24T16:50:24.113650 #738999] INFO -- : 3358 ......................................................................... I, [2024-05-24T16:50:24.144737 #738999] INFO -- : I, [2024-05-24T16:50:24.144774 #738999] INFO -- : I, [2024-05-24T16:50:24.144783 #738999] INFO -- : Finished in 8.110980 seconds I, [2024-05-24T16:50:24.144789 #738999] INFO -- : I, [2024-05-24T16:50:24.144800 #738999] INFO -- : 3430 files, 32652 examples, 169802 expectations, 0 failures, 0 errors, 0 tagged I, [2024-05-24T16:50:24.147306 #738999] INFO -- : $$$[end] "make yes-test-rubyspec MSPECOPT='--error-output stderr --debug -j' TESTS='-j20'" exit with 0.