# Logfile created on 2024-05-24 14:31:51 +0000 by logger.rb/v1.4.3 I, [2024-05-24T14:31:51.050710 #1849325] INFO -- : #, @formatter=nil, @logdev=#, @binmode=false, @mon_data=#, @mon_data_owner_object_id=860>>> I, [2024-05-24T14:31:51.050837 #1849325] INFO -- : $$$[beg] make update-unicode -j20 I, [2024-05-24T14:31:51.109917 #1849325] INFO -- : Downloading Unicode emoji 15.0 files... I, [2024-05-24T14:31:51.110112 #1849325] INFO -- : Downloading Unicode emoji 15.0 files... I, [2024-05-24T14:31:51.110834 #1849325] INFO -- : Downloading Unicode emoji 15.0 files... I, [2024-05-24T14:31:51.152212 #1849325] INFO -- : made symlink emoji/15.0/emoji-sequences.txt to /tmp/ruby/src/trunk/.downloaded-cache/emoji/15.0/emoji-sequences.txt E, [2024-05-24T14:31:51.609175 #1849325] ERROR -- : /tmp/ruby/src/trunk/tool/downloader.rb:302:in `rescue in download': failed to download emoji/15.0/emoji-test.txt (RuntimeError) E, [2024-05-24T14:31:51.609319 #1849325] ERROR -- : OpenURI::HTTPError: 403 Forbidden: https://www.unicode.org/Public/emoji/15.0/emoji-test.txt E, [2024-05-24T14:31:51.609341 #1849325] ERROR -- : from /tmp/ruby/src/trunk/tool/downloader.rb:201:in `download' E, [2024-05-24T14:31:51.609355 #1849325] ERROR -- : from /tmp/ruby/src/trunk/tool/downloader.rb:136:in `download' E, [2024-05-24T14:31:51.609368 #1849325] ERROR -- : from /tmp/ruby/src/trunk/tool/downloader.rb:482:in `block in
' E, [2024-05-24T14:31:51.609381 #1849325] ERROR -- : from /tmp/ruby/src/trunk/tool/downloader.rb:465:in `each' E, [2024-05-24T14:31:51.609396 #1849325] ERROR -- : from /tmp/ruby/src/trunk/tool/downloader.rb:465:in `
' E, [2024-05-24T14:31:51.609409 #1849325] ERROR -- : /usr/lib/ruby/3.0.0/open-uri.rb:364:in `open_http': 403 Forbidden (OpenURI::HTTPError) E, [2024-05-24T14:31:51.609422 #1849325] ERROR -- : from /usr/lib/ruby/3.0.0/open-uri.rb:741:in `buffer_open' E, [2024-05-24T14:31:51.609440 #1849325] ERROR -- : from /usr/lib/ruby/3.0.0/open-uri.rb:212:in `block in open_loop' E, [2024-05-24T14:31:51.609453 #1849325] ERROR -- : from /usr/lib/ruby/3.0.0/open-uri.rb:210:in `catch' E, [2024-05-24T14:31:51.609466 #1849325] ERROR -- : from /usr/lib/ruby/3.0.0/open-uri.rb:210:in `open_loop' E, [2024-05-24T14:31:51.609479 #1849325] ERROR -- : from /usr/lib/ruby/3.0.0/open-uri.rb:151:in `open_uri' E, [2024-05-24T14:31:51.609492 #1849325] ERROR -- : from /usr/lib/ruby/3.0.0/open-uri.rb:721:in `open' E, [2024-05-24T14:31:51.609505 #1849325] ERROR -- : from /usr/lib/ruby/3.0.0/open-uri.rb:729:in `read' E, [2024-05-24T14:31:51.609518 #1849325] ERROR -- : from /tmp/ruby/src/trunk/tool/downloader.rb:247:in `block in download' E, [2024-05-24T14:31:51.609530 #1849325] ERROR -- : from /tmp/ruby/src/trunk/tool/downloader.rb:378:in `with_retry' E, [2024-05-24T14:31:51.609549 #1849325] ERROR -- : from /tmp/ruby/src/trunk/tool/downloader.rb:246:in `download' E, [2024-05-24T14:31:51.609579 #1849325] ERROR -- : from /tmp/ruby/src/trunk/tool/downloader.rb:136:in `download' E, [2024-05-24T14:31:51.609592 #1849325] ERROR -- : from /tmp/ruby/src/trunk/tool/downloader.rb:482:in `block in
' E, [2024-05-24T14:31:51.609604 #1849325] ERROR -- : from /tmp/ruby/src/trunk/tool/downloader.rb:465:in `each' E, [2024-05-24T14:31:51.609616 #1849325] ERROR -- : from /tmp/ruby/src/trunk/tool/downloader.rb:465:in `
' E, [2024-05-24T14:31:51.613717 #1849325] ERROR -- : make: *** [uncommon.mk:1756: /tmp/ruby/src/trunk/enc/unicode/data/emoji/15.0/emoji-zwj-sequences.txt] Error 1 E, [2024-05-24T14:31:51.613776 #1849325] ERROR -- : make: *** Waiting for unfinished jobs.... E, [2024-05-24T14:31:52.045196 #1849325] ERROR -- : /tmp/ruby/src/trunk/tool/downloader.rb:302:in `rescue in download': failed to download emoji/15.0/emoji-sequences.txt (RuntimeError) E, [2024-05-24T14:31:52.045323 #1849325] ERROR -- : EOFError: end of file reached: https://www.unicode.org/Public/emoji/15.0/emoji-sequences.txt E, [2024-05-24T14:31:52.045342 #1849325] ERROR -- : from /tmp/ruby/src/trunk/tool/downloader.rb:201:in `download' E, [2024-05-24T14:31:52.045354 #1849325] ERROR -- : from /tmp/ruby/src/trunk/tool/downloader.rb:136:in `download' E, [2024-05-24T14:31:52.045366 #1849325] ERROR -- : from /tmp/ruby/src/trunk/tool/downloader.rb:482:in `block in
' E, [2024-05-24T14:31:52.045377 #1849325] ERROR -- : from /tmp/ruby/src/trunk/tool/downloader.rb:465:in `each' E, [2024-05-24T14:31:52.045388 #1849325] ERROR -- : from /tmp/ruby/src/trunk/tool/downloader.rb:465:in `
' E, [2024-05-24T14:31:52.045399 #1849325] ERROR -- : /usr/lib/ruby/3.0.0/net/protocol.rb:227:in `rbuf_fill': end of file reached (EOFError) E, [2024-05-24T14:31:52.045409 #1849325] ERROR -- : from /usr/lib/ruby/3.0.0/net/protocol.rb:193:in `readuntil' E, [2024-05-24T14:31:52.045424 #1849325] ERROR -- : from /usr/lib/ruby/3.0.0/net/protocol.rb:203:in `readline' E, [2024-05-24T14:31:52.045436 #1849325] ERROR -- : from /usr/lib/ruby/3.0.0/net/http/response.rb:42:in `read_status_line' E, [2024-05-24T14:31:52.045447 #1849325] ERROR -- : from /usr/lib/ruby/3.0.0/net/http/response.rb:31:in `read_new' E, [2024-05-24T14:31:52.045458 #1849325] ERROR -- : from /usr/lib/ruby/3.0.0/net/http.rb:1557:in `block in transport_request' E, [2024-05-24T14:31:52.045469 #1849325] ERROR -- : from /usr/lib/ruby/3.0.0/net/http.rb:1548:in `catch' E, [2024-05-24T14:31:52.045480 #1849325] ERROR -- : from /usr/lib/ruby/3.0.0/net/http.rb:1548:in `transport_request' E, [2024-05-24T14:31:52.045491 #1849325] ERROR -- : from /usr/lib/ruby/3.0.0/net/http.rb:1521:in `request' E, [2024-05-24T14:31:52.045502 #1849325] ERROR -- : from /usr/lib/ruby/3.0.0/open-uri.rb:329:in `block in open_http' E, [2024-05-24T14:31:52.045515 #1849325] ERROR -- : from /usr/lib/ruby/3.0.0/net/http.rb:960:in `start' E, [2024-05-24T14:31:52.045526 #1849325] ERROR -- : from /usr/lib/ruby/3.0.0/open-uri.rb:323:in `open_http' E, [2024-05-24T14:31:52.045536 #1849325] ERROR -- : from /usr/lib/ruby/3.0.0/open-uri.rb:741:in `buffer_open' E, [2024-05-24T14:31:52.045547 #1849325] ERROR -- : from /usr/lib/ruby/3.0.0/open-uri.rb:212:in `block in open_loop' E, [2024-05-24T14:31:52.045558 #1849325] ERROR -- : from /usr/lib/ruby/3.0.0/open-uri.rb:210:in `catch' E, [2024-05-24T14:31:52.045568 #1849325] ERROR -- : from /usr/lib/ruby/3.0.0/open-uri.rb:210:in `open_loop' E, [2024-05-24T14:31:52.045579 #1849325] ERROR -- : from /usr/lib/ruby/3.0.0/open-uri.rb:151:in `open_uri' E, [2024-05-24T14:31:52.045589 #1849325] ERROR -- : from /usr/lib/ruby/3.0.0/open-uri.rb:721:in `open' E, [2024-05-24T14:31:52.045603 #1849325] ERROR -- : from /usr/lib/ruby/3.0.0/open-uri.rb:729:in `read' E, [2024-05-24T14:31:52.045613 #1849325] ERROR -- : from /tmp/ruby/src/trunk/tool/downloader.rb:247:in `block in download' E, [2024-05-24T14:31:52.045624 #1849325] ERROR -- : from /tmp/ruby/src/trunk/tool/downloader.rb:378:in `with_retry' E, [2024-05-24T14:31:52.045634 #1849325] ERROR -- : from /tmp/ruby/src/trunk/tool/downloader.rb:246:in `download' E, [2024-05-24T14:31:52.045659 #1849325] ERROR -- : from /tmp/ruby/src/trunk/tool/downloader.rb:136:in `download' E, [2024-05-24T14:31:52.045671 #1849325] ERROR -- : from /tmp/ruby/src/trunk/tool/downloader.rb:482:in `block in
' E, [2024-05-24T14:31:52.045681 #1849325] ERROR -- : from /tmp/ruby/src/trunk/tool/downloader.rb:465:in `each' E, [2024-05-24T14:31:52.045692 #1849325] ERROR -- : from /tmp/ruby/src/trunk/tool/downloader.rb:465:in `
' E, [2024-05-24T14:31:52.049413 #1849325] ERROR -- : make: *** [uncommon.mk:1756: /tmp/ruby/src/trunk/enc/unicode/data/emoji/15.0/emoji-sequences.txt] Error 1 E, [2024-05-24T14:31:52.049467 #1849325] ERROR -- : make: *** Deleting file '/tmp/ruby/src/trunk/enc/unicode/data/emoji/15.0/emoji-sequences.txt' E, [2024-05-24T14:31:52.066498 #1849325] ERROR -- : /tmp/ruby/src/trunk/tool/downloader.rb:302:in `rescue in download': failed to download emoji/15.0/emoji-sequences.txt (RuntimeError) E, [2024-05-24T14:31:52.066587 #1849325] ERROR -- : EOFError: end of file reached: https://www.unicode.org/Public/emoji/15.0/emoji-sequences.txt E, [2024-05-24T14:31:52.066608 #1849325] ERROR -- : from /tmp/ruby/src/trunk/tool/downloader.rb:201:in `download' E, [2024-05-24T14:31:52.066620 #1849325] ERROR -- : from /tmp/ruby/src/trunk/tool/downloader.rb:136:in `download' E, [2024-05-24T14:31:52.066846 #1849325] ERROR -- : from /tmp/ruby/src/trunk/tool/downloader.rb:482:in `block in
' E, [2024-05-24T14:31:52.066863 #1849325] ERROR -- : from /tmp/ruby/src/trunk/tool/downloader.rb:465:in `each' E, [2024-05-24T14:31:52.066875 #1849325] ERROR -- : from /tmp/ruby/src/trunk/tool/downloader.rb:465:in `
' E, [2024-05-24T14:31:52.066887 #1849325] ERROR -- : /usr/lib/ruby/3.0.0/net/protocol.rb:227:in `rbuf_fill': end of file reached (EOFError) E, [2024-05-24T14:31:52.066899 #1849325] ERROR -- : from /usr/lib/ruby/3.0.0/net/protocol.rb:193:in `readuntil' E, [2024-05-24T14:31:52.066927 #1849325] ERROR -- : from /usr/lib/ruby/3.0.0/net/protocol.rb:203:in `readline' E, [2024-05-24T14:31:52.066939 #1849325] ERROR -- : from /usr/lib/ruby/3.0.0/net/http/response.rb:42:in `read_status_line' E, [2024-05-24T14:31:52.066952 #1849325] ERROR -- : from /usr/lib/ruby/3.0.0/net/http/response.rb:31:in `read_new' E, [2024-05-24T14:31:52.066962 #1849325] ERROR -- : from /usr/lib/ruby/3.0.0/net/http.rb:1557:in `block in transport_request' E, [2024-05-24T14:31:52.066973 #1849325] ERROR -- : from /usr/lib/ruby/3.0.0/net/http.rb:1548:in `catch' E, [2024-05-24T14:31:52.066984 #1849325] ERROR -- : from /usr/lib/ruby/3.0.0/net/http.rb:1548:in `transport_request' E, [2024-05-24T14:31:52.066994 #1849325] ERROR -- : from /usr/lib/ruby/3.0.0/net/http.rb:1521:in `request' E, [2024-05-24T14:31:52.067005 #1849325] ERROR -- : from /usr/lib/ruby/3.0.0/open-uri.rb:329:in `block in open_http' E, [2024-05-24T14:31:52.067016 #1849325] ERROR -- : from /usr/lib/ruby/3.0.0/net/http.rb:960:in `start' E, [2024-05-24T14:31:52.067029 #1849325] ERROR -- : from /usr/lib/ruby/3.0.0/open-uri.rb:323:in `open_http' E, [2024-05-24T14:31:52.067040 #1849325] ERROR -- : from /usr/lib/ruby/3.0.0/open-uri.rb:741:in `buffer_open' E, [2024-05-24T14:31:52.067050 #1849325] ERROR -- : from /usr/lib/ruby/3.0.0/open-uri.rb:212:in `block in open_loop' E, [2024-05-24T14:31:52.067061 #1849325] ERROR -- : from /usr/lib/ruby/3.0.0/open-uri.rb:210:in `catch' E, [2024-05-24T14:31:52.067072 #1849325] ERROR -- : from /usr/lib/ruby/3.0.0/open-uri.rb:210:in `open_loop' E, [2024-05-24T14:31:52.067082 #1849325] ERROR -- : from /usr/lib/ruby/3.0.0/open-uri.rb:151:in `open_uri' E, [2024-05-24T14:31:52.067093 #1849325] ERROR -- : from /usr/lib/ruby/3.0.0/open-uri.rb:721:in `open' E, [2024-05-24T14:31:52.067103 #1849325] ERROR -- : from /usr/lib/ruby/3.0.0/open-uri.rb:729:in `read' E, [2024-05-24T14:31:52.067114 #1849325] ERROR -- : from /tmp/ruby/src/trunk/tool/downloader.rb:247:in `block in download' E, [2024-05-24T14:31:52.067127 #1849325] ERROR -- : from /tmp/ruby/src/trunk/tool/downloader.rb:378:in `with_retry' E, [2024-05-24T14:31:52.067151 #1849325] ERROR -- : from /tmp/ruby/src/trunk/tool/downloader.rb:246:in `download' E, [2024-05-24T14:31:52.067168 #1849325] ERROR -- : from /tmp/ruby/src/trunk/tool/downloader.rb:136:in `download' E, [2024-05-24T14:31:52.067179 #1849325] ERROR -- : from /tmp/ruby/src/trunk/tool/downloader.rb:482:in `block in
' E, [2024-05-24T14:31:52.067189 #1849325] ERROR -- : from /tmp/ruby/src/trunk/tool/downloader.rb:465:in `each' E, [2024-05-24T14:31:52.067200 #1849325] ERROR -- : from /tmp/ruby/src/trunk/tool/downloader.rb:465:in `
' E, [2024-05-24T14:31:52.071078 #1849325] ERROR -- : make: *** [uncommon.mk:1756: /tmp/ruby/src/trunk/enc/unicode/data/emoji/15.0/emoji-test.txt] Error 1 I, [2024-05-24T14:31:52.071149 #1849325] INFO -- : downloading emoji/15.0/emoji-test.txt ... downloading emoji/15.0/emoji-sequences.txt ... downloading emoji/15.0/emoji-sequences.txt ... I, [2024-05-24T14:31:52.071648 #1849325] INFO -- : $$$[end] "make update-unicode -j20" exit with 512. I, [2024-05-24T14:31:52.071740 #1849325] INFO -- : $$$[beg] make update-download -j20 I, [2024-05-24T14:31:52.178905 #1849325] INFO -- : tool/config.guess already exists I, [2024-05-24T14:31:52.178945 #1849325] INFO -- : tool/config.sub already exists I, [2024-05-24T14:31:52.180943 #1849325] INFO -- : Update power_assert to 84e85124c5014a139af39161d484156cfe87a9ed I, [2024-05-24T14:31:52.181082 #1849325] INFO -- : Update rbs to ba7872795d5de04adb8ff500c0e6afdc81a041dd I, [2024-05-24T14:31:52.181787 #1849325] INFO -- : Update typeprof to b19a6416da3a05d57fadd6ffdadb382b6d236ca5 I, [2024-05-24T14:31:52.182322 #1849325] INFO -- : echo 84e85124c5014a139af39161d484156cfe87a9ed | /bin/sh /tmp/ruby/src/trunk/tool/ifchange /tmp/ruby/src/trunk/.bundle/.timestamp/power_assert.revision - I, [2024-05-24T14:31:52.182521 #1849325] INFO -- : echo ba7872795d5de04adb8ff500c0e6afdc81a041dd | /bin/sh /tmp/ruby/src/trunk/tool/ifchange /tmp/ruby/src/trunk/.bundle/.timestamp/rbs.revision - I, [2024-05-24T14:31:52.182925 #1849325] INFO -- : echo b19a6416da3a05d57fadd6ffdadb382b6d236ca5 | /bin/sh /tmp/ruby/src/trunk/tool/ifchange /tmp/ruby/src/trunk/.bundle/.timestamp/typeprof.revision - I, [2024-05-24T14:31:52.184290 #1849325] INFO -- : /tmp/ruby/src/trunk/.bundle/.timestamp/power_assert.revision unchanged I, [2024-05-24T14:31:52.184362 #1849325] INFO -- : /tmp/ruby/src/trunk/.bundle/.timestamp/rbs.revision unchanged I, [2024-05-24T14:31:52.184787 #1849325] INFO -- : /tmp/ruby/src/trunk/.bundle/.timestamp/typeprof.revision unchanged I, [2024-05-24T14:31:52.185290 #1849325] INFO -- : Building power_assert@84e85124c5014a139af39161d484156cfe87a9ed to /tmp/ruby/src/trunk/gems/power_assert-2.0.3.gem I, [2024-05-24T14:31:52.254317 #1849325] INFO -- : Successfully built RubyGem I, [2024-05-24T14:31:52.254357 #1849325] INFO -- : Name: power_assert I, [2024-05-24T14:31:52.254363 #1849325] INFO -- : Version: 2.0.4dev I, [2024-05-24T14:31:52.254367 #1849325] INFO -- : File: power_assert-2.0.4dev.gem I, [2024-05-24T14:31:52.302065 #1849325] INFO -- : $$$[end] "make update-download -j20" exit with 0. I, [2024-05-24T14:31:52.302106 #1849325] INFO -- : $$$[beg] make update-rubyspec -j20 I, [2024-05-24T14:31:52.359823 #1849325] INFO -- : make: Nothing to be done for 'update-rubyspec'. I, [2024-05-24T14:31:52.360118 #1849325] INFO -- : $$$[end] "make update-rubyspec -j20" exit with 0. I, [2024-05-24T14:31:52.360153 #1849325] INFO -- : $$$[beg] make update-src -j20 I, [2024-05-24T14:31:53.238060 #1849325] INFO -- : Already up to date. I, [2024-05-24T14:31:53.253315 #1849325] INFO -- : Latest commit hash = e49d68bf27 I, [2024-05-24T14:31:53.254951 #1849325] INFO -- : $$$[end] "make update-src -j20" exit with 0. I, [2024-05-24T14:31:53.255005 #1849325] INFO -- : $$$[beg] make after-update -j20 I, [2024-05-24T14:31:53.338307 #1849325] INFO -- : generating /tmp/ruby/src/trunk/ext/ripper/eventids1.h I, [2024-05-24T14:31:53.342674 #1849325] INFO -- : make[1]: Entering directory '/tmp/ruby/src/trunk/ext/ripper' I, [2024-05-24T14:31:53.342703 #1849325] INFO -- : make[1]: Nothing to be done for 'src'. I, [2024-05-24T14:31:53.342709 #1849325] INFO -- : make[1]: Leaving directory '/tmp/ruby/src/trunk/ext/ripper' I, [2024-05-24T14:31:53.343276 #1849325] INFO -- : generating /tmp/ruby/src/trunk/ext/ripper/eventids1.c I, [2024-05-24T14:31:53.345260 #1849325] INFO -- : make[1]: Entering directory '/tmp/ruby/src/trunk/ext/ripper' I, [2024-05-24T14:31:53.345281 #1849325] INFO -- : make[1]: Nothing to be done for 'src'. I, [2024-05-24T14:31:53.345286 #1849325] INFO -- : make[1]: Leaving directory '/tmp/ruby/src/trunk/ext/ripper' I, [2024-05-24T14:31:53.345860 #1849325] INFO -- : generating /tmp/ruby/src/trunk/ext/ripper/eventids2table.c I, [2024-05-24T14:31:53.347814 #1849325] INFO -- : make[1]: Entering directory '/tmp/ruby/src/trunk/ext/ripper' I, [2024-05-24T14:31:53.347835 #1849325] INFO -- : make[1]: Nothing to be done for 'src'. I, [2024-05-24T14:31:53.347840 #1849325] INFO -- : make[1]: Leaving directory '/tmp/ruby/src/trunk/ext/ripper' I, [2024-05-24T14:31:53.358808 #1849325] INFO -- : /tmp/ruby/src/trunk/revision.h updated I, [2024-05-24T14:31:53.359956 #1849325] INFO -- : generating x86_64-linux-fake.rb I, [2024-05-24T14:31:53.410357 #1849325] INFO -- : x86_64-linux-fake.rb updated I, [2024-05-24T14:31:53.411672 #1849325] INFO -- : generating enc.mk I, [2024-05-24T14:31:53.528780 #1849325] INFO -- : making srcs under enc I, [2024-05-24T14:31:53.558983 #1849325] INFO -- : make[1]: Entering directory '/tmp/ruby/build/trunk' I, [2024-05-24T14:31:53.559011 #1849325] INFO -- : make[1]: Nothing to be done for 'srcs'. I, [2024-05-24T14:31:53.559017 #1849325] INFO -- : make[1]: Leaving directory '/tmp/ruby/build/trunk' I, [2024-05-24T14:31:53.607954 #1849325] INFO -- : Update power_assert to 84e85124c5014a139af39161d484156cfe87a9ed I, [2024-05-24T14:31:53.608158 #1849325] INFO -- : Update rbs to ba7872795d5de04adb8ff500c0e6afdc81a041dd I, [2024-05-24T14:31:53.608767 #1849325] INFO -- : Update typeprof to b19a6416da3a05d57fadd6ffdadb382b6d236ca5 I, [2024-05-24T14:31:53.609382 #1849325] INFO -- : echo 84e85124c5014a139af39161d484156cfe87a9ed | /bin/sh /tmp/ruby/src/trunk/tool/ifchange /tmp/ruby/src/trunk/.bundle/.timestamp/power_assert.revision - I, [2024-05-24T14:31:53.609629 #1849325] INFO -- : echo ba7872795d5de04adb8ff500c0e6afdc81a041dd | /bin/sh /tmp/ruby/src/trunk/tool/ifchange /tmp/ruby/src/trunk/.bundle/.timestamp/rbs.revision - I, [2024-05-24T14:31:53.610315 #1849325] INFO -- : echo b19a6416da3a05d57fadd6ffdadb382b6d236ca5 | /bin/sh /tmp/ruby/src/trunk/tool/ifchange /tmp/ruby/src/trunk/.bundle/.timestamp/typeprof.revision - I, [2024-05-24T14:31:53.611143 #1849325] INFO -- : /tmp/ruby/src/trunk/.bundle/.timestamp/power_assert.revision unchanged I, [2024-05-24T14:31:53.611385 #1849325] INFO -- : /tmp/ruby/src/trunk/.bundle/.timestamp/rbs.revision unchanged I, [2024-05-24T14:31:53.612123 #1849325] INFO -- : /tmp/ruby/src/trunk/.bundle/.timestamp/typeprof.revision unchanged I, [2024-05-24T14:31:53.612144 #1849325] INFO -- : Building power_assert@84e85124c5014a139af39161d484156cfe87a9ed to /tmp/ruby/src/trunk/gems/power_assert-2.0.3.gem I, [2024-05-24T14:31:53.681806 #1849325] INFO -- : Successfully built RubyGem I, [2024-05-24T14:31:53.681852 #1849325] INFO -- : Name: power_assert I, [2024-05-24T14:31:53.681859 #1849325] INFO -- : Version: 2.0.4dev I, [2024-05-24T14:31:53.681865 #1849325] INFO -- : File: power_assert-2.0.4dev.gem I, [2024-05-24T14:31:53.683998 #1849325] INFO -- : Extracting bundle gem power_assert-2.0.3... I, [2024-05-24T14:31:53.744993 #1849325] INFO -- : Try with hash version of bundled gems instead of gems/power_assert-2.0.3.gem. We don't use this gem with release version of Ruby. I, [2024-05-24T14:31:53.749968 #1849325] INFO -- : Unpacked gems/power_assert-2.0.4dev.gem I, [2024-05-24T14:31:53.751690 #1849325] INFO -- : $$$[end] "make after-update -j20" exit with 0. I, [2024-05-24T14:31:53.751849 #1849325] INFO -- : $$$[beg] make miniruby -j20 I, [2024-05-24T14:31:53.813354 #1849325] INFO -- : BASERUBY = /usr/bin/ruby --disable=gems I, [2024-05-24T14:31:53.813394 #1849325] INFO -- : CC = gcc I, [2024-05-24T14:31:53.813402 #1849325] INFO -- : LD = ld I, [2024-05-24T14:31:53.813408 #1849325] INFO -- : LDSHARED = gcc -shared I, [2024-05-24T14:31:53.813414 #1849325] INFO -- : CFLAGS = -O3 -fno-fast-math -ggdb3 -Wall -Wextra -Wdeprecated-declarations -Wdiv-by-zero -Wduplicated-cond -Wimplicit-function-declaration -Wimplicit-int -Wpointer-arith -Wwrite-strings -Wold-style-definition -Wimplicit-fallthrough=0 -Wmissing-noreturn -Wno-cast-function-type -Wno-constant-logical-operand -Wno-long-long -Wno-missing-field-initializers -Wno-overlength-strings -Wno-packed-bitfield-compat -Wno-parentheses-equality -Wno-self-assign -Wno-tautological-compare -Wno-unused-parameter -Wno-unused-value -Wsuggest-attribute=format -Wsuggest-attribute=noreturn -Wunused-variable -Wmisleading-indentation -Wundef -fPIC I, [2024-05-24T14:31:53.813421 #1849325] INFO -- : XCFLAGS = -U_FORTIFY_SOURCE -D_FORTIFY_SOURCE=2 -fstack-protector-strong -fno-strict-overflow -fvisibility=hidden -fexcess-precision=standard -DRUBY_EXPORT -I. -I.ext/include/x86_64-linux -I/tmp/ruby/src/trunk/include -I/tmp/ruby/src/trunk -I/tmp/ruby/src/trunk/prism -I/tmp/ruby/src/trunk/enc/unicode/15.0.0 I, [2024-05-24T14:31:53.813426 #1849325] INFO -- : CPPFLAGS = I, [2024-05-24T14:31:53.813432 #1849325] INFO -- : DLDFLAGS = -Wl,--compress-debug-sections=zlib -Wl,-soname,libruby.so.3.4 -fstack-protector-strong I, [2024-05-24T14:31:53.813437 #1849325] INFO -- : SOLIBS = -lz -lrt -lrt -lgmp -ldl -lcrypt -lm -lpthread I, [2024-05-24T14:31:53.813443 #1849325] INFO -- : LANG = en_US.UTF-8 I, [2024-05-24T14:31:53.813450 #1849325] INFO -- : LC_ALL = I, [2024-05-24T14:31:53.813455 #1849325] INFO -- : LC_CTYPE = I, [2024-05-24T14:31:53.813466 #1849325] INFO -- : MFLAGS = -j20 --jobserver-auth=4,5 I, [2024-05-24T14:31:53.813473 #1849325] INFO -- : RUSTC = no I, [2024-05-24T14:31:53.813479 #1849325] INFO -- : YJIT_RUSTC_ARGS = --crate-name=yjit --crate-type=staticlib --edition=2021 -g -C lto=thin -C opt-level=3 -C overflow-checks=on '--out-dir=/tmp/ruby/build/trunk/yjit/target/release/' /tmp/ruby/src/trunk/yjit/src/lib.rs I, [2024-05-24T14:31:53.815265 #1849325] INFO -- : gcc (Ubuntu 11.4.0-1ubuntu1~22.04) 11.4.0 I, [2024-05-24T14:31:53.815293 #1849325] INFO -- : Copyright (C) 2021 Free Software Foundation, Inc. I, [2024-05-24T14:31:53.815301 #1849325] INFO -- : This is free software; see the source for copying conditions. There is NO I, [2024-05-24T14:31:53.815311 #1849325] INFO -- : warranty; not even for MERCHANTABILITY or FITNESS FOR A PARTICULAR PURPOSE. I, [2024-05-24T14:31:53.815316 #1849325] INFO -- : I, [2024-05-24T14:31:53.836085 #1849325] INFO -- : compiling /tmp/ruby/src/trunk/version.c I, [2024-05-24T14:31:53.938252 #1849325] INFO -- : linking miniruby I, [2024-05-24T14:31:54.468209 #1849325] INFO -- : $$$[end] "make miniruby -j20" exit with 0. I, [2024-05-24T14:31:54.468320 #1849325] INFO -- : $$$[beg] make ruby -j20 I, [2024-05-24T14:31:54.526520 #1849325] INFO -- : BASERUBY = /usr/bin/ruby --disable=gems I, [2024-05-24T14:31:54.526550 #1849325] INFO -- : CC = gcc I, [2024-05-24T14:31:54.526555 #1849325] INFO -- : LD = ld I, [2024-05-24T14:31:54.526559 #1849325] INFO -- : LDSHARED = gcc -shared I, [2024-05-24T14:31:54.526563 #1849325] INFO -- : CFLAGS = -O3 -fno-fast-math -ggdb3 -Wall -Wextra -Wdeprecated-declarations -Wdiv-by-zero -Wduplicated-cond -Wimplicit-function-declaration -Wimplicit-int -Wpointer-arith -Wwrite-strings -Wold-style-definition -Wimplicit-fallthrough=0 -Wmissing-noreturn -Wno-cast-function-type -Wno-constant-logical-operand -Wno-long-long -Wno-missing-field-initializers -Wno-overlength-strings -Wno-packed-bitfield-compat -Wno-parentheses-equality -Wno-self-assign -Wno-tautological-compare -Wno-unused-parameter -Wno-unused-value -Wsuggest-attribute=format -Wsuggest-attribute=noreturn -Wunused-variable -Wmisleading-indentation -Wundef -fPIC I, [2024-05-24T14:31:54.526572 #1849325] INFO -- : XCFLAGS = -U_FORTIFY_SOURCE -D_FORTIFY_SOURCE=2 -fstack-protector-strong -fno-strict-overflow -fvisibility=hidden -fexcess-precision=standard -DRUBY_EXPORT -I. -I.ext/include/x86_64-linux -I/tmp/ruby/src/trunk/include -I/tmp/ruby/src/trunk -I/tmp/ruby/src/trunk/prism -I/tmp/ruby/src/trunk/enc/unicode/15.0.0 I, [2024-05-24T14:31:54.526576 #1849325] INFO -- : CPPFLAGS = I, [2024-05-24T14:31:54.526580 #1849325] INFO -- : DLDFLAGS = -Wl,--compress-debug-sections=zlib -Wl,-soname,libruby.so.3.4 -fstack-protector-strong I, [2024-05-24T14:31:54.526584 #1849325] INFO -- : SOLIBS = -lz -lrt -lrt -lgmp -ldl -lcrypt -lm -lpthread I, [2024-05-24T14:31:54.526587 #1849325] INFO -- : LANG = en_US.UTF-8 I, [2024-05-24T14:31:54.526590 #1849325] INFO -- : LC_ALL = I, [2024-05-24T14:31:54.526594 #1849325] INFO -- : LC_CTYPE = I, [2024-05-24T14:31:54.526597 #1849325] INFO -- : MFLAGS = -j20 --jobserver-auth=4,5 I, [2024-05-24T14:31:54.526601 #1849325] INFO -- : RUSTC = no I, [2024-05-24T14:31:54.526605 #1849325] INFO -- : YJIT_RUSTC_ARGS = --crate-name=yjit --crate-type=staticlib --edition=2021 -g -C lto=thin -C opt-level=3 -C overflow-checks=on '--out-dir=/tmp/ruby/build/trunk/yjit/target/release/' /tmp/ruby/src/trunk/yjit/src/lib.rs I, [2024-05-24T14:31:54.527806 #1849325] INFO -- : gcc (Ubuntu 11.4.0-1ubuntu1~22.04) 11.4.0 I, [2024-05-24T14:31:54.527827 #1849325] INFO -- : Copyright (C) 2021 Free Software Foundation, Inc. I, [2024-05-24T14:31:54.527833 #1849325] INFO -- : This is free software; see the source for copying conditions. There is NO I, [2024-05-24T14:31:54.527836 #1849325] INFO -- : warranty; not even for MERCHANTABILITY or FITNESS FOR A PARTICULAR PURPOSE. I, [2024-05-24T14:31:54.527840 #1849325] INFO -- : I, [2024-05-24T14:31:54.635844 #1849325] INFO -- : builtin_binary.inc updated I, [2024-05-24T14:31:54.640497 #1849325] INFO -- : c86294a81d0df6836359a6b5498b71b1ddba3062aa6ec87c7b2896368a948a19 builtin_binary.inc I, [2024-05-24T14:31:54.641229 #1849325] INFO -- : compiling /tmp/ruby/src/trunk/builtin.c I, [2024-05-24T14:31:54.825782 #1849325] INFO -- : linking static-library libruby-static.a I, [2024-05-24T14:31:55.136397 #1849325] INFO -- : linking shared-library libruby.so.3.4.0 I, [2024-05-24T14:31:56.721695 #1849325] INFO -- : linking ruby I, [2024-05-24T14:31:56.747093 #1849325] INFO -- : $$$[end] "make ruby -j20" exit with 0. I, [2024-05-24T14:31:56.747206 #1849325] INFO -- : $$$[beg] make all -j20 I, [2024-05-24T14:31:56.805345 #1849325] INFO -- : BASERUBY = /usr/bin/ruby --disable=gems I, [2024-05-24T14:31:56.805392 #1849325] INFO -- : CC = gcc I, [2024-05-24T14:31:56.805406 #1849325] INFO -- : LD = ld I, [2024-05-24T14:31:56.805419 #1849325] INFO -- : LDSHARED = gcc -shared I, [2024-05-24T14:31:56.805431 #1849325] INFO -- : CFLAGS = -O3 -fno-fast-math -ggdb3 -Wall -Wextra -Wdeprecated-declarations -Wdiv-by-zero -Wduplicated-cond -Wimplicit-function-declaration -Wimplicit-int -Wpointer-arith -Wwrite-strings -Wold-style-definition -Wimplicit-fallthrough=0 -Wmissing-noreturn -Wno-cast-function-type -Wno-constant-logical-operand -Wno-long-long -Wno-missing-field-initializers -Wno-overlength-strings -Wno-packed-bitfield-compat -Wno-parentheses-equality -Wno-self-assign -Wno-tautological-compare -Wno-unused-parameter -Wno-unused-value -Wsuggest-attribute=format -Wsuggest-attribute=noreturn -Wunused-variable -Wmisleading-indentation -Wundef -fPIC I, [2024-05-24T14:31:56.805443 #1849325] INFO -- : XCFLAGS = -U_FORTIFY_SOURCE -D_FORTIFY_SOURCE=2 -fstack-protector-strong -fno-strict-overflow -fvisibility=hidden -fexcess-precision=standard -DRUBY_EXPORT -I. -I.ext/include/x86_64-linux -I/tmp/ruby/src/trunk/include -I/tmp/ruby/src/trunk -I/tmp/ruby/src/trunk/prism -I/tmp/ruby/src/trunk/enc/unicode/15.0.0 I, [2024-05-24T14:31:56.805455 #1849325] INFO -- : CPPFLAGS = I, [2024-05-24T14:31:56.805470 #1849325] INFO -- : DLDFLAGS = -Wl,--compress-debug-sections=zlib -Wl,-soname,libruby.so.3.4 -fstack-protector-strong I, [2024-05-24T14:31:56.805490 #1849325] INFO -- : SOLIBS = -lz -lrt -lrt -lgmp -ldl -lcrypt -lm -lpthread I, [2024-05-24T14:31:56.805501 #1849325] INFO -- : LANG = en_US.UTF-8 I, [2024-05-24T14:31:56.805511 #1849325] INFO -- : LC_ALL = I, [2024-05-24T14:31:56.805521 #1849325] INFO -- : LC_CTYPE = I, [2024-05-24T14:31:56.805532 #1849325] INFO -- : MFLAGS = -j20 --jobserver-auth=4,5 I, [2024-05-24T14:31:56.805542 #1849325] INFO -- : RUSTC = no I, [2024-05-24T14:31:56.805553 #1849325] INFO -- : YJIT_RUSTC_ARGS = --crate-name=yjit --crate-type=staticlib --edition=2021 -g -C lto=thin -C opt-level=3 -C overflow-checks=on '--out-dir=/tmp/ruby/build/trunk/yjit/target/release/' /tmp/ruby/src/trunk/yjit/src/lib.rs I, [2024-05-24T14:31:56.806794 #1849325] INFO -- : gcc (Ubuntu 11.4.0-1ubuntu1~22.04) 11.4.0 I, [2024-05-24T14:31:56.806838 #1849325] INFO -- : Copyright (C) 2021 Free Software Foundation, Inc. I, [2024-05-24T14:31:56.806856 #1849325] INFO -- : This is free software; see the source for copying conditions. There is NO I, [2024-05-24T14:31:56.806868 #1849325] INFO -- : warranty; not even for MERCHANTABILITY or FITNESS FOR A PARTICULAR PURPOSE. I, [2024-05-24T14:31:56.806878 #1849325] INFO -- : I, [2024-05-24T14:31:56.836712 #1849325] INFO -- : generating encdb.h I, [2024-05-24T14:31:56.838129 #1849325] INFO -- : generating enc.mk I, [2024-05-24T14:31:56.839962 #1849325] INFO -- : building spec/ruby/optional/capi/ext/array_spec.so I, [2024-05-24T14:31:56.840091 #1849325] INFO -- : building spec/ruby/optional/capi/ext/basic_object_spec.so I, [2024-05-24T14:31:56.841713 #1849325] INFO -- : building spec/ruby/optional/capi/ext/bignum_spec.so I, [2024-05-24T14:31:56.842302 #1849325] INFO -- : building spec/ruby/optional/capi/ext/binding_spec.so I, [2024-05-24T14:31:56.843119 #1849325] INFO -- : building spec/ruby/optional/capi/ext/boolean_spec.so I, [2024-05-24T14:31:56.843589 #1849325] INFO -- : building spec/ruby/optional/capi/ext/class_id_under_autoload_spec.so I, [2024-05-24T14:31:56.844317 #1849325] INFO -- : building spec/ruby/optional/capi/ext/class_spec.so I, [2024-05-24T14:31:56.845024 #1849325] INFO -- : building spec/ruby/optional/capi/ext/class_under_autoload_spec.so I, [2024-05-24T14:31:56.845270 #1849325] INFO -- : building spec/ruby/optional/capi/ext/complex_spec.so I, [2024-05-24T14:31:56.846106 #1849325] INFO -- : building spec/ruby/optional/capi/ext/constants_spec.so I, [2024-05-24T14:31:56.847014 #1849325] INFO -- : building spec/ruby/optional/capi/ext/data_spec.so I, [2024-05-24T14:31:56.847765 #1849325] INFO -- : building spec/ruby/optional/capi/ext/debug_spec.so I, [2024-05-24T14:31:56.848032 #1849325] INFO -- : building spec/ruby/optional/capi/ext/encoding_spec.so I, [2024-05-24T14:31:56.848820 #1849325] INFO -- : building spec/ruby/optional/capi/ext/enumerator_spec.so I, [2024-05-24T14:31:56.849507 #1849325] INFO -- : building spec/ruby/optional/capi/ext/exception_spec.so I, [2024-05-24T14:31:56.849753 #1849325] INFO -- : building spec/ruby/optional/capi/ext/fiber_spec.so I, [2024-05-24T14:31:56.850426 #1849325] INFO -- : building spec/ruby/optional/capi/ext/file_spec.so I, [2024-05-24T14:31:56.850759 #1849325] INFO -- : building spec/ruby/optional/capi/ext/fixnum_spec.so I, [2024-05-24T14:31:56.868428 #1849325] INFO -- : encdb.h unchanged I, [2024-05-24T14:31:56.880557 #1849325] INFO -- : building spec/ruby/optional/capi/ext/float_spec.so I, [2024-05-24T14:31:56.965545 #1849325] INFO -- : building spec/ruby/optional/capi/ext/gc_spec.so I, [2024-05-24T14:31:56.986412 #1849325] INFO -- : building spec/ruby/optional/capi/ext/globals_spec.so I, [2024-05-24T14:31:56.990642 #1849325] INFO -- : building spec/ruby/optional/capi/ext/hash_spec.so I, [2024-05-24T14:31:56.992529 #1849325] INFO -- : building spec/ruby/optional/capi/ext/integer_spec.so I, [2024-05-24T14:31:56.999239 #1849325] INFO -- : building spec/ruby/optional/capi/ext/io_spec.so I, [2024-05-24T14:31:57.002297 #1849325] INFO -- : building spec/ruby/optional/capi/ext/kernel_spec.so I, [2024-05-24T14:31:57.004600 #1849325] INFO -- : building spec/ruby/optional/capi/ext/language_spec.so I, [2024-05-24T14:31:57.016218 #1849325] INFO -- : building spec/ruby/optional/capi/ext/marshal_spec.so I, [2024-05-24T14:31:57.026009 #1849325] INFO -- : building spec/ruby/optional/capi/ext/module_spec.so I, [2024-05-24T14:31:57.027113 #1849325] INFO -- : building spec/ruby/optional/capi/ext/module_under_autoload_spec.so I, [2024-05-24T14:31:57.031047 #1849325] INFO -- : building spec/ruby/optional/capi/ext/mutex_spec.so I, [2024-05-24T14:31:57.032538 #1849325] INFO -- : building spec/ruby/optional/capi/ext/numeric_spec.so I, [2024-05-24T14:31:57.034655 #1849325] INFO -- : building spec/ruby/optional/capi/ext/object_spec.so I, [2024-05-24T14:31:57.038490 #1849325] INFO -- : building spec/ruby/optional/capi/ext/proc_spec.so I, [2024-05-24T14:31:57.041779 #1849325] INFO -- : building spec/ruby/optional/capi/ext/range_spec.so I, [2024-05-24T14:31:57.048115 #1849325] INFO -- : building spec/ruby/optional/capi/ext/rational_spec.so I, [2024-05-24T14:31:57.081178 #1849325] INFO -- : building spec/ruby/optional/capi/ext/rbasic_spec.so I, [2024-05-24T14:31:57.084930 #1849325] INFO -- : building spec/ruby/optional/capi/ext/regexp_spec.so I, [2024-05-24T14:31:57.137408 #1849325] INFO -- : building spec/ruby/optional/capi/ext/string_spec.so I, [2024-05-24T14:31:57.142129 #1849325] INFO -- : building spec/ruby/optional/capi/ext/struct_spec.so I, [2024-05-24T14:31:57.152886 #1849325] INFO -- : building spec/ruby/optional/capi/ext/st_spec.so I, [2024-05-24T14:31:57.155628 #1849325] INFO -- : building spec/ruby/optional/capi/ext/symbol_spec.so I, [2024-05-24T14:31:57.156978 #1849325] INFO -- : building spec/ruby/optional/capi/ext/thread_spec.so I, [2024-05-24T14:31:57.166832 #1849325] INFO -- : building spec/ruby/optional/capi/ext/time_spec.so I, [2024-05-24T14:31:57.180491 #1849325] INFO -- : building spec/ruby/optional/capi/ext/tracepoint_spec.so I, [2024-05-24T14:31:57.183586 #1849325] INFO -- : building spec/ruby/optional/capi/ext/typed_data_spec.so I, [2024-05-24T14:31:57.190603 #1849325] INFO -- : building spec/ruby/optional/capi/ext/util_spec.so I, [2024-05-24T14:31:57.212415 #1849325] INFO -- : making enc I, [2024-05-24T14:31:57.219851 #1849325] INFO -- : making srcs under enc I, [2024-05-24T14:31:57.235134 #1849325] INFO -- : make[1]: Entering directory '/tmp/ruby/build/trunk' I, [2024-05-24T14:31:57.235199 #1849325] INFO -- : make[1]: Nothing to be done for 'enc'. I, [2024-05-24T14:31:57.235209 #1849325] INFO -- : make[1]: Leaving directory '/tmp/ruby/build/trunk' I, [2024-05-24T14:31:57.266722 #1849325] INFO -- : make[1]: Entering directory '/tmp/ruby/build/trunk' I, [2024-05-24T14:31:57.266790 #1849325] INFO -- : make[1]: Nothing to be done for 'srcs'. I, [2024-05-24T14:31:57.266803 #1849325] INFO -- : make[1]: Leaving directory '/tmp/ruby/build/trunk' I, [2024-05-24T14:31:57.267510 #1849325] INFO -- : generating transdb.h I, [2024-05-24T14:31:57.383972 #1849325] INFO -- : transdb.h unchanged I, [2024-05-24T14:31:57.385488 #1849325] INFO -- : generating makefiles ext/configure-ext.mk I, [2024-05-24T14:31:57.385817 #1849325] INFO -- : making trans I, [2024-05-24T14:31:57.412923 #1849325] INFO -- : ext/configure-ext.mk updated I, [2024-05-24T14:31:57.415576 #1849325] INFO -- : make[1]: Entering directory '/tmp/ruby/build/trunk' I, [2024-05-24T14:31:57.420980 #1849325] INFO -- : make[1]: Entering directory '/tmp/ruby/build/trunk' I, [2024-05-24T14:31:57.421091 #1849325] INFO -- : make[1]: Nothing to be done for 'trans'. I, [2024-05-24T14:31:57.421123 #1849325] INFO -- : make[1]: Leaving directory '/tmp/ruby/build/trunk' I, [2024-05-24T14:31:57.422260 #1849325] INFO -- : making encs I, [2024-05-24T14:31:57.481066 #1849325] INFO -- : make[1]: Entering directory '/tmp/ruby/build/trunk' I, [2024-05-24T14:31:57.481250 #1849325] INFO -- : make[1]: Nothing to be done for 'encs'. I, [2024-05-24T14:31:57.481286 #1849325] INFO -- : make[1]: Leaving directory '/tmp/ruby/build/trunk' I, [2024-05-24T14:31:57.574643 #1849325] INFO -- : make[1]: Leaving directory '/tmp/ruby/build/trunk' I, [2024-05-24T14:31:57.575484 #1849325] INFO -- : generating makefile exts.mk I, [2024-05-24T14:31:57.612891 #1849325] INFO -- : exts.mk unchanged I, [2024-05-24T14:31:57.617483 #1849325] INFO -- : make[1]: Entering directory '/tmp/ruby/build/trunk' I, [2024-05-24T14:31:57.636119 #1849325] INFO -- : make[2]: Entering directory '/tmp/ruby/build/trunk/ext/digest' I, [2024-05-24T14:31:57.637588 #1849325] INFO -- : make[2]: Entering directory '/tmp/ruby/build/trunk/ext/coverage' I, [2024-05-24T14:31:57.637710 #1849325] INFO -- : make[2]: Entering directory '/tmp/ruby/build/trunk/ext/json' I, [2024-05-24T14:31:57.638285 #1849325] INFO -- : make[2]: Entering directory '/tmp/ruby/build/trunk/ext/io/console' I, [2024-05-24T14:31:57.638598 #1849325] INFO -- : make[2]: Entering directory '/tmp/ruby/build/trunk/ext/date' I, [2024-05-24T14:31:57.638813 #1849325] INFO -- : make[2]: Entering directory '/tmp/ruby/build/trunk/ext/rubyvm' I, [2024-05-24T14:31:57.639808 #1849325] INFO -- : make[2]: Entering directory '/tmp/ruby/build/trunk/ext/monitor' I, [2024-05-24T14:31:57.640503 #1849325] INFO -- : make[2]: Entering directory '/tmp/ruby/build/trunk/ext/pathname' I, [2024-05-24T14:31:57.640663 #1849325] INFO -- : make[2]: Entering directory '/tmp/ruby/build/trunk/ext/fiddle' I, [2024-05-24T14:31:57.640921 #1849325] INFO -- : make[2]: Entering directory '/tmp/ruby/build/trunk/ext/pty' I, [2024-05-24T14:31:57.640953 #1849325] INFO -- : make[2]: Leaving directory '/tmp/ruby/build/trunk/ext/rubyvm' I, [2024-05-24T14:31:57.641244 #1849325] INFO -- : make[2]: Leaving directory '/tmp/ruby/build/trunk/ext/coverage' I, [2024-05-24T14:31:57.641665 #1849325] INFO -- : make[2]: Leaving directory '/tmp/ruby/build/trunk/ext/io/console' I, [2024-05-24T14:31:57.642112 #1849325] INFO -- : make[2]: Entering directory '/tmp/ruby/build/trunk/ext/psych' I, [2024-05-24T14:31:57.642198 #1849325] INFO -- : make[2]: Entering directory '/tmp/ruby/build/trunk/ext/objspace' I, [2024-05-24T14:31:57.642227 #1849325] INFO -- : make[2]: Leaving directory '/tmp/ruby/build/trunk/ext/date' I, [2024-05-24T14:31:57.642456 #1849325] INFO -- : make[2]: Leaving directory '/tmp/ruby/build/trunk/ext/monitor' I, [2024-05-24T14:31:57.642658 #1849325] INFO -- : make[2]: Leaving directory '/tmp/ruby/build/trunk/ext/digest' I, [2024-05-24T14:31:57.643182 #1849325] INFO -- : make[2]: Leaving directory '/tmp/ruby/build/trunk/ext/pathname' I, [2024-05-24T14:31:57.643201 #1849325] INFO -- : make[2]: Leaving directory '/tmp/ruby/build/trunk/ext/json' I, [2024-05-24T14:31:57.644244 #1849325] INFO -- : make[2]: Leaving directory '/tmp/ruby/build/trunk/ext/pty' I, [2024-05-24T14:31:57.644862 #1849325] INFO -- : make[2]: Entering directory '/tmp/ruby/build/trunk/ext/ripper' I, [2024-05-24T14:31:57.645289 #1849325] INFO -- : make[2]: Entering directory '/tmp/ruby/build/trunk/.bundle/gems/debug-1.9.2/ext/debug' I, [2024-05-24T14:31:57.645372 #1849325] INFO -- : make[2]: Entering directory '/tmp/ruby/build/trunk/.bundle/gems/bigdecimal-3.1.8/ext/bigdecimal' I, [2024-05-24T14:31:57.645429 #1849325] INFO -- : make[2]: Entering directory '/tmp/ruby/build/trunk/.bundle/gems/nkf-0.2.0/ext/nkf' I, [2024-05-24T14:31:57.645644 #1849325] INFO -- : make[2]: Entering directory '/tmp/ruby/build/trunk/.bundle/gems/racc-1.7.3/ext/racc/cparse' I, [2024-05-24T14:31:57.645675 #1849325] INFO -- : make[2]: Leaving directory '/tmp/ruby/build/trunk/ext/objspace' I, [2024-05-24T14:31:57.645750 #1849325] INFO -- : make[2]: Entering directory '/tmp/ruby/build/trunk/.bundle/gems/racc-1.8.0/ext/racc/cparse' I, [2024-05-24T14:31:57.645851 #1849325] INFO -- : make[2]: Entering directory '/tmp/ruby/build/trunk/.bundle/gems/syslog-0.1.2/ext/syslog' I, [2024-05-24T14:31:57.646304 #1849325] INFO -- : make[2]: Entering directory '/tmp/ruby/build/trunk/.bundle/gems/rbs-3.4.4/ext/rbs_extension' I, [2024-05-24T14:31:57.647514 #1849325] INFO -- : make[2]: Leaving directory '/tmp/ruby/build/trunk/ext/fiddle' I, [2024-05-24T14:31:57.648161 #1849325] INFO -- : make[2]: Entering directory '/tmp/ruby/build/trunk/ext/socket' I, [2024-05-24T14:31:57.651454 #1849325] INFO -- : make[2]: Entering directory '/tmp/ruby/build/trunk/ext/digest/sha2' I, [2024-05-24T14:31:57.652116 #1849325] INFO -- : make[2]: Leaving directory '/tmp/ruby/build/trunk/ext/ripper' I, [2024-05-24T14:31:57.653886 #1849325] INFO -- : make[2]: Leaving directory '/tmp/ruby/build/trunk/ext/digest/sha2' I, [2024-05-24T14:31:57.654329 #1849325] INFO -- : make[2]: Entering directory '/tmp/ruby/build/trunk/ext/openssl' I, [2024-05-24T14:31:57.654709 #1849325] INFO -- : make[2]: Leaving directory '/tmp/ruby/build/trunk/ext/psych' I, [2024-05-24T14:31:57.656555 #1849325] INFO -- : make[2]: Leaving directory '/tmp/ruby/build/trunk/ext/socket' I, [2024-05-24T14:31:57.665796 #1849325] INFO -- : make[2]: Leaving directory '/tmp/ruby/build/trunk/ext/openssl' I, [2024-05-24T14:31:57.671885 #1849325] INFO -- : make[2]: Leaving directory '/tmp/ruby/build/trunk/.bundle/gems/syslog-0.1.2/ext/syslog' I, [2024-05-24T14:31:57.671948 #1849325] INFO -- : make[2]: Leaving directory '/tmp/ruby/build/trunk/.bundle/gems/rbs-3.4.4/ext/rbs_extension' I, [2024-05-24T14:31:57.676346 #1849325] INFO -- : make[2]: Leaving directory '/tmp/ruby/build/trunk/.bundle/gems/debug-1.9.2/ext/debug' I, [2024-05-24T14:31:57.678062 #1849325] INFO -- : make[2]: Leaving directory '/tmp/ruby/build/trunk/.bundle/gems/racc-1.7.3/ext/racc/cparse' I, [2024-05-24T14:31:57.679361 #1849325] INFO -- : make[2]: Leaving directory '/tmp/ruby/build/trunk/.bundle/gems/bigdecimal-3.1.8/ext/bigdecimal' I, [2024-05-24T14:31:57.680054 #1849325] INFO -- : make[2]: Leaving directory '/tmp/ruby/build/trunk/.bundle/gems/nkf-0.2.0/ext/nkf' I, [2024-05-24T14:31:57.680274 #1849325] INFO -- : make[2]: Leaving directory '/tmp/ruby/build/trunk/.bundle/gems/racc-1.8.0/ext/racc/cparse' I, [2024-05-24T14:31:57.704497 #1849325] INFO -- : make[2]: Entering directory '/tmp/ruby/build/trunk' I, [2024-05-24T14:31:57.772186 #1849325] INFO -- : linking ruby I, [2024-05-24T14:31:57.794807 #1849325] INFO -- : make[2]: Leaving directory '/tmp/ruby/build/trunk' I, [2024-05-24T14:31:57.795367 #1849325] INFO -- : make[1]: Leaving directory '/tmp/ruby/build/trunk' I, [2024-05-24T14:31:57.799609 #1849325] INFO -- : make[1]: Entering directory '/tmp/ruby/build/trunk' I, [2024-05-24T14:31:57.799662 #1849325] INFO -- : make[1]: Nothing to be done for 'note'. I, [2024-05-24T14:31:57.799674 #1849325] INFO -- : make[1]: Leaving directory '/tmp/ruby/build/trunk' I, [2024-05-24T14:31:57.800372 #1849325] INFO -- : $$$[end] "make all -j20" exit with 0. I, [2024-05-24T14:31:57.800551 #1849325] INFO -- : $$$[beg] make install -j20 I, [2024-05-24T14:31:57.867964 #1849325] INFO -- : Update power_assert to 84e85124c5014a139af39161d484156cfe87a9ed I, [2024-05-24T14:31:57.868156 #1849325] INFO -- : Update rbs to ba7872795d5de04adb8ff500c0e6afdc81a041dd I, [2024-05-24T14:31:57.868443 #1849325] INFO -- : Update typeprof to b19a6416da3a05d57fadd6ffdadb382b6d236ca5 I, [2024-05-24T14:31:57.871064 #1849325] INFO -- : BASERUBY = /usr/bin/ruby --disable=gems I, [2024-05-24T14:31:57.871104 #1849325] INFO -- : CC = gcc I, [2024-05-24T14:31:57.871113 #1849325] INFO -- : LD = ld I, [2024-05-24T14:31:57.871120 #1849325] INFO -- : LDSHARED = gcc -shared I, [2024-05-24T14:31:57.871129 #1849325] INFO -- : CFLAGS = -O3 -fno-fast-math -ggdb3 -Wall -Wextra -Wdeprecated-declarations -Wdiv-by-zero -Wduplicated-cond -Wimplicit-function-declaration -Wimplicit-int -Wpointer-arith -Wwrite-strings -Wold-style-definition -Wimplicit-fallthrough=0 -Wmissing-noreturn -Wno-cast-function-type -Wno-constant-logical-operand -Wno-long-long -Wno-missing-field-initializers -Wno-overlength-strings -Wno-packed-bitfield-compat -Wno-parentheses-equality -Wno-self-assign -Wno-tautological-compare -Wno-unused-parameter -Wno-unused-value -Wsuggest-attribute=format -Wsuggest-attribute=noreturn -Wunused-variable -Wmisleading-indentation -Wundef -fPIC I, [2024-05-24T14:31:57.871145 #1849325] INFO -- : XCFLAGS = -U_FORTIFY_SOURCE -D_FORTIFY_SOURCE=2 -fstack-protector-strong -fno-strict-overflow -fvisibility=hidden -fexcess-precision=standard -DRUBY_EXPORT -I. -I.ext/include/x86_64-linux -I/tmp/ruby/src/trunk/include -I/tmp/ruby/src/trunk -I/tmp/ruby/src/trunk/prism -I/tmp/ruby/src/trunk/enc/unicode/15.0.0 I, [2024-05-24T14:31:57.871153 #1849325] INFO -- : CPPFLAGS = I, [2024-05-24T14:31:57.871160 #1849325] INFO -- : DLDFLAGS = -Wl,--compress-debug-sections=zlib -Wl,-soname,libruby.so.3.4 -fstack-protector-strong I, [2024-05-24T14:31:57.871167 #1849325] INFO -- : SOLIBS = -lz -lrt -lrt -lgmp -ldl -lcrypt -lm -lpthread I, [2024-05-24T14:31:57.871173 #1849325] INFO -- : LANG = en_US.UTF-8 I, [2024-05-24T14:31:57.871179 #1849325] INFO -- : LC_ALL = I, [2024-05-24T14:31:57.871185 #1849325] INFO -- : LC_CTYPE = I, [2024-05-24T14:31:57.871193 #1849325] INFO -- : MFLAGS = -j20 --jobserver-auth=4,5 I, [2024-05-24T14:31:57.871198 #1849325] INFO -- : RUSTC = no I, [2024-05-24T14:31:57.871205 #1849325] INFO -- : YJIT_RUSTC_ARGS = --crate-name=yjit --crate-type=staticlib --edition=2021 -g -C lto=thin -C opt-level=3 -C overflow-checks=on '--out-dir=/tmp/ruby/build/trunk/yjit/target/release/' /tmp/ruby/src/trunk/yjit/src/lib.rs I, [2024-05-24T14:31:57.903441 #1849325] INFO -- : echo 84e85124c5014a139af39161d484156cfe87a9ed | /bin/sh /tmp/ruby/src/trunk/tool/ifchange /tmp/ruby/src/trunk/.bundle/.timestamp/power_assert.revision - I, [2024-05-24T14:31:57.903560 #1849325] INFO -- : echo ba7872795d5de04adb8ff500c0e6afdc81a041dd | /bin/sh /tmp/ruby/src/trunk/tool/ifchange /tmp/ruby/src/trunk/.bundle/.timestamp/rbs.revision - I, [2024-05-24T14:31:57.903826 #1849325] INFO -- : echo b19a6416da3a05d57fadd6ffdadb382b6d236ca5 | /bin/sh /tmp/ruby/src/trunk/tool/ifchange /tmp/ruby/src/trunk/.bundle/.timestamp/typeprof.revision - I, [2024-05-24T14:31:57.904626 #1849325] INFO -- : gcc (Ubuntu 11.4.0-1ubuntu1~22.04) 11.4.0 I, [2024-05-24T14:31:57.904663 #1849325] INFO -- : Copyright (C) 2021 Free Software Foundation, Inc. I, [2024-05-24T14:31:57.904677 #1849325] INFO -- : This is free software; see the source for copying conditions. There is NO I, [2024-05-24T14:31:57.904688 #1849325] INFO -- : warranty; not even for MERCHANTABILITY or FITNESS FOR A PARTICULAR PURPOSE. I, [2024-05-24T14:31:57.904699 #1849325] INFO -- : I, [2024-05-24T14:31:57.904709 #1849325] INFO -- : generating encdb.h I, [2024-05-24T14:31:57.905287 #1849325] INFO -- : generating enc.mk I, [2024-05-24T14:31:57.905318 #1849325] INFO -- : /tmp/ruby/src/trunk/.bundle/.timestamp/rbs.revision unchanged I, [2024-05-24T14:31:57.905332 #1849325] INFO -- : /tmp/ruby/src/trunk/.bundle/.timestamp/power_assert.revision unchanged I, [2024-05-24T14:31:57.905834 #1849325] INFO -- : /tmp/ruby/src/trunk/.bundle/.timestamp/typeprof.revision unchanged I, [2024-05-24T14:31:57.928850 #1849325] INFO -- : encdb.h unchanged I, [2024-05-24T14:31:57.930146 #1849325] INFO -- : Building power_assert@84e85124c5014a139af39161d484156cfe87a9ed to /tmp/ruby/src/trunk/gems/power_assert-2.0.3.gem I, [2024-05-24T14:31:57.999566 #1849325] INFO -- : Successfully built RubyGem I, [2024-05-24T14:31:57.999626 #1849325] INFO -- : Name: power_assert I, [2024-05-24T14:31:57.999639 #1849325] INFO -- : Version: 2.0.4dev I, [2024-05-24T14:31:57.999650 #1849325] INFO -- : File: power_assert-2.0.4dev.gem I, [2024-05-24T14:31:58.001949 #1849325] INFO -- : Extracting bundle gem power_assert-2.0.3... I, [2024-05-24T14:31:58.026186 #1849325] INFO -- : making srcs under enc I, [2024-05-24T14:31:58.026237 #1849325] INFO -- : making enc I, [2024-05-24T14:31:58.044278 #1849325] INFO -- : make[1]: Entering directory '/tmp/ruby/build/trunk' I, [2024-05-24T14:31:58.044326 #1849325] INFO -- : make[1]: Nothing to be done for 'enc'. I, [2024-05-24T14:31:58.044345 #1849325] INFO -- : make[1]: Leaving directory '/tmp/ruby/build/trunk' I, [2024-05-24T14:31:58.055623 #1849325] INFO -- : make[1]: Entering directory '/tmp/ruby/build/trunk' I, [2024-05-24T14:31:58.055731 #1849325] INFO -- : make[1]: Nothing to be done for 'srcs'. I, [2024-05-24T14:31:58.055756 #1849325] INFO -- : make[1]: Leaving directory '/tmp/ruby/build/trunk' I, [2024-05-24T14:31:58.056301 #1849325] INFO -- : generating transdb.h I, [2024-05-24T14:31:58.064571 #1849325] INFO -- : Try with hash version of bundled gems instead of gems/power_assert-2.0.3.gem. We don't use this gem with release version of Ruby. I, [2024-05-24T14:31:58.069549 #1849325] INFO -- : Unpacked gems/power_assert-2.0.4dev.gem I, [2024-05-24T14:31:58.152469 #1849325] INFO -- : transdb.h unchanged I, [2024-05-24T14:31:58.153954 #1849325] INFO -- : generating makefiles ext/configure-ext.mk I, [2024-05-24T14:31:58.154262 #1849325] INFO -- : making trans I, [2024-05-24T14:31:58.181344 #1849325] INFO -- : ext/configure-ext.mk unchanged I, [2024-05-24T14:31:58.183477 #1849325] INFO -- : make[1]: Entering directory '/tmp/ruby/build/trunk' I, [2024-05-24T14:31:58.190491 #1849325] INFO -- : make[1]: Entering directory '/tmp/ruby/build/trunk' I, [2024-05-24T14:31:58.190575 #1849325] INFO -- : make[1]: Nothing to be done for 'trans'. I, [2024-05-24T14:31:58.190584 #1849325] INFO -- : make[1]: Leaving directory '/tmp/ruby/build/trunk' I, [2024-05-24T14:31:58.259052 #1849325] INFO -- : making encs I, [2024-05-24T14:31:58.320496 #1849325] INFO -- : make[1]: Entering directory '/tmp/ruby/build/trunk' I, [2024-05-24T14:31:58.320552 #1849325] INFO -- : make[1]: Nothing to be done for 'encs'. I, [2024-05-24T14:31:58.320561 #1849325] INFO -- : make[1]: Leaving directory '/tmp/ruby/build/trunk' I, [2024-05-24T14:31:58.337425 #1849325] INFO -- : make[1]: Leaving directory '/tmp/ruby/build/trunk' I, [2024-05-24T14:31:58.338274 #1849325] INFO -- : generating makefile exts.mk I, [2024-05-24T14:31:58.375185 #1849325] INFO -- : exts.mk unchanged I, [2024-05-24T14:31:58.379978 #1849325] INFO -- : make[1]: Entering directory '/tmp/ruby/build/trunk' I, [2024-05-24T14:31:58.398659 #1849325] INFO -- : make[2]: Entering directory '/tmp/ruby/build/trunk/ext/digest' I, [2024-05-24T14:31:58.399826 #1849325] INFO -- : make[2]: Entering directory '/tmp/ruby/build/trunk/ext/json' I, [2024-05-24T14:31:58.400503 #1849325] INFO -- : make[2]: Entering directory '/tmp/ruby/build/trunk/ext/coverage' I, [2024-05-24T14:31:58.400530 #1849325] INFO -- : make[2]: Entering directory '/tmp/ruby/build/trunk/ext/io/console' I, [2024-05-24T14:31:58.401109 #1849325] INFO -- : make[2]: Entering directory '/tmp/ruby/build/trunk/ext/date' I, [2024-05-24T14:31:58.401954 #1849325] INFO -- : make[2]: Entering directory '/tmp/ruby/build/trunk/ext/monitor' I, [2024-05-24T14:31:58.402697 #1849325] INFO -- : make[2]: Leaving directory '/tmp/ruby/build/trunk/ext/digest' I, [2024-05-24T14:31:58.402708 #1849325] INFO -- : make[2]: Entering directory '/tmp/ruby/build/trunk/ext/pathname' I, [2024-05-24T14:31:58.402950 #1849325] INFO -- : make[2]: Leaving directory '/tmp/ruby/build/trunk/ext/io/console' I, [2024-05-24T14:31:58.403435 #1849325] INFO -- : make[2]: Leaving directory '/tmp/ruby/build/trunk/ext/coverage' I, [2024-05-24T14:31:58.403461 #1849325] INFO -- : make[2]: Entering directory '/tmp/ruby/build/trunk/ext/pty' I, [2024-05-24T14:31:58.403470 #1849325] INFO -- : make[2]: Entering directory '/tmp/ruby/build/trunk/ext/fiddle' I, [2024-05-24T14:31:58.404120 #1849325] INFO -- : make[2]: Leaving directory '/tmp/ruby/build/trunk/ext/date' I, [2024-05-24T14:31:58.404299 #1849325] INFO -- : make[2]: Leaving directory '/tmp/ruby/build/trunk/ext/json' I, [2024-05-24T14:31:58.404320 #1849325] INFO -- : make[2]: Entering directory '/tmp/ruby/build/trunk/ext/objspace' I, [2024-05-24T14:31:58.404538 #1849325] INFO -- : make[2]: Leaving directory '/tmp/ruby/build/trunk/ext/monitor' I, [2024-05-24T14:31:58.404678 #1849325] INFO -- : make[2]: Entering directory '/tmp/ruby/build/trunk/ext/psych' I, [2024-05-24T14:31:58.404704 #1849325] INFO -- : make[2]: Entering directory '/tmp/ruby/build/trunk/ext/rubyvm' I, [2024-05-24T14:31:58.405185 #1849325] INFO -- : make[2]: Leaving directory '/tmp/ruby/build/trunk/ext/pathname' I, [2024-05-24T14:31:58.405979 #1849325] INFO -- : make[2]: Entering directory '/tmp/ruby/build/trunk/.bundle/gems/bigdecimal-3.1.8/ext/bigdecimal' I, [2024-05-24T14:31:58.406006 #1849325] INFO -- : make[2]: Leaving directory '/tmp/ruby/build/trunk/ext/pty' I, [2024-05-24T14:31:58.406363 #1849325] INFO -- : make[2]: Entering directory '/tmp/ruby/build/trunk/.bundle/gems/nkf-0.2.0/ext/nkf' I, [2024-05-24T14:31:58.406397 #1849325] INFO -- : make[2]: Entering directory '/tmp/ruby/build/trunk/.bundle/gems/debug-1.9.2/ext/debug' I, [2024-05-24T14:31:58.406668 #1849325] INFO -- : make[2]: Entering directory '/tmp/ruby/build/trunk/.bundle/gems/racc-1.7.3/ext/racc/cparse' I, [2024-05-24T14:31:58.406880 #1849325] INFO -- : make[2]: Entering directory '/tmp/ruby/build/trunk/.bundle/gems/racc-1.8.0/ext/racc/cparse' I, [2024-05-24T14:31:58.407312 #1849325] INFO -- : make[2]: Leaving directory '/tmp/ruby/build/trunk/ext/rubyvm' I, [2024-05-24T14:31:58.407435 #1849325] INFO -- : make[2]: Entering directory '/tmp/ruby/build/trunk/.bundle/gems/rbs-3.4.4/ext/rbs_extension' I, [2024-05-24T14:31:58.409550 #1849325] INFO -- : make[2]: Leaving directory '/tmp/ruby/build/trunk/ext/objspace' I, [2024-05-24T14:31:58.410142 #1849325] INFO -- : make[2]: Entering directory '/tmp/ruby/build/trunk/.bundle/gems/syslog-0.1.2/ext/syslog' I, [2024-05-24T14:31:58.410297 #1849325] INFO -- : make[2]: Leaving directory '/tmp/ruby/build/trunk/ext/fiddle' I, [2024-05-24T14:31:58.411051 #1849325] INFO -- : make[2]: Entering directory '/tmp/ruby/build/trunk/ext/ripper' I, [2024-05-24T14:31:58.413365 #1849325] INFO -- : make[2]: Entering directory '/tmp/ruby/build/trunk/ext/digest/sha2' I, [2024-05-24T14:31:58.414382 #1849325] INFO -- : make[2]: Entering directory '/tmp/ruby/build/trunk/ext/socket' I, [2024-05-24T14:31:58.415769 #1849325] INFO -- : make[2]: Entering directory '/tmp/ruby/build/trunk/ext/openssl' I, [2024-05-24T14:31:58.416302 #1849325] INFO -- : make[2]: Leaving directory '/tmp/ruby/build/trunk/ext/digest/sha2' I, [2024-05-24T14:31:58.416499 #1849325] INFO -- : make[2]: Leaving directory '/tmp/ruby/build/trunk/ext/ripper' I, [2024-05-24T14:31:58.418366 #1849325] INFO -- : make[2]: Leaving directory '/tmp/ruby/build/trunk/ext/psych' I, [2024-05-24T14:31:58.420180 #1849325] INFO -- : make[2]: Leaving directory '/tmp/ruby/build/trunk/ext/socket' I, [2024-05-24T14:31:58.429919 #1849325] INFO -- : make[2]: Leaving directory '/tmp/ruby/build/trunk/.bundle/gems/debug-1.9.2/ext/debug' I, [2024-05-24T14:31:58.430449 #1849325] INFO -- : make[2]: Leaving directory '/tmp/ruby/build/trunk/ext/openssl' I, [2024-05-24T14:31:58.431648 #1849325] INFO -- : make[2]: Leaving directory '/tmp/ruby/build/trunk/.bundle/gems/racc-1.7.3/ext/racc/cparse' I, [2024-05-24T14:31:58.433425 #1849325] INFO -- : make[2]: Leaving directory '/tmp/ruby/build/trunk/.bundle/gems/racc-1.8.0/ext/racc/cparse' I, [2024-05-24T14:31:58.439184 #1849325] INFO -- : make[2]: Leaving directory '/tmp/ruby/build/trunk/.bundle/gems/bigdecimal-3.1.8/ext/bigdecimal' I, [2024-05-24T14:31:58.439932 #1849325] INFO -- : make[2]: Leaving directory '/tmp/ruby/build/trunk/.bundle/gems/rbs-3.4.4/ext/rbs_extension' I, [2024-05-24T14:31:58.442075 #1849325] INFO -- : make[2]: Leaving directory '/tmp/ruby/build/trunk/.bundle/gems/nkf-0.2.0/ext/nkf' I, [2024-05-24T14:31:58.444773 #1849325] INFO -- : make[2]: Leaving directory '/tmp/ruby/build/trunk/.bundle/gems/syslog-0.1.2/ext/syslog' I, [2024-05-24T14:31:58.468907 #1849325] INFO -- : make[2]: Entering directory '/tmp/ruby/build/trunk' I, [2024-05-24T14:31:58.536204 #1849325] INFO -- : make[2]: 'ruby' is up to date. I, [2024-05-24T14:31:58.536272 #1849325] INFO -- : make[2]: Leaving directory '/tmp/ruby/build/trunk' I, [2024-05-24T14:31:58.536498 #1849325] INFO -- : make[1]: Leaving directory '/tmp/ruby/build/trunk' I, [2024-05-24T14:31:58.540470 #1849325] INFO -- : make[1]: Entering directory '/tmp/ruby/build/trunk' I, [2024-05-24T14:31:58.540526 #1849325] INFO -- : make[1]: Nothing to be done for 'note'. I, [2024-05-24T14:31:58.540571 #1849325] INFO -- : make[1]: Leaving directory '/tmp/ruby/build/trunk' I, [2024-05-24T14:31:58.540788 #1849325] INFO -- : ./miniruby -I/tmp/ruby/src/trunk/lib -I. -I.ext/common /tmp/ruby/src/trunk/tool/runruby.rb --extout=.ext -- --disable-gems -r./x86_64-linux-fake /tmp/ruby/src/trunk/tool/rbinstall.rb --make="make" --dest-dir="" --extout=".ext" --ext-build-dir="./ext" --mflags="-j20 --jobserver-auth=4,5" --make-flags=" -j20 --jobserver-auth=4,5" --data-mode=0644 --prog-mode=0755 --installed-list .installed.list --mantype="doc" --gnumake --install=all --exclude=doc I, [2024-05-24T14:31:58.639110 #1849325] INFO -- : Installing to I, [2024-05-24T14:31:58.639196 #1849325] INFO -- : installing binary commands: /tmp/ruby/install/trunk/bin I, [2024-05-24T14:31:58.639214 #1849325] INFO -- : installing base libraries: /tmp/ruby/install/trunk/lib I, [2024-05-24T14:31:58.646598 #1849325] INFO -- : installing arch files: /tmp/ruby/install/trunk/lib/ruby/3.4.0+0/x86_64-linux I, [2024-05-24T14:31:58.646661 #1849325] INFO -- : installing pkgconfig data: /tmp/ruby/install/trunk/lib/pkgconfig I, [2024-05-24T14:31:58.646690 #1849325] INFO -- : installing extension objects: /tmp/ruby/install/trunk/lib/ruby/3.4.0+0/x86_64-linux I, [2024-05-24T14:31:58.656187 #1849325] INFO -- : installing extension objects: /tmp/ruby/install/trunk/lib/ruby/site_ruby/3.4.0+0/x86_64-linux I, [2024-05-24T14:31:58.656249 #1849325] INFO -- : installing extension objects: /tmp/ruby/install/trunk/lib/ruby/vendor_ruby/3.4.0+0/x86_64-linux I, [2024-05-24T14:31:58.656263 #1849325] INFO -- : installing extension headers: /tmp/ruby/install/trunk/include/ruby-3.4.0+0/x86_64-linux I, [2024-05-24T14:31:58.656277 #1849325] INFO -- : installing extension scripts: /tmp/ruby/install/trunk/lib/ruby/3.4.0+0 I, [2024-05-24T14:31:58.659146 #1849325] INFO -- : installing extension scripts: /tmp/ruby/install/trunk/lib/ruby/site_ruby/3.4.0+0 I, [2024-05-24T14:31:58.659219 #1849325] INFO -- : installing extension scripts: /tmp/ruby/install/trunk/lib/ruby/vendor_ruby/3.4.0+0 I, [2024-05-24T14:31:58.659235 #1849325] INFO -- : installing extension headers: /tmp/ruby/install/trunk/include/ruby-3.4.0+0/ruby I, [2024-05-24T14:31:58.659248 #1849325] INFO -- : installing command scripts: /tmp/ruby/install/trunk/bin I, [2024-05-24T14:31:58.659260 #1849325] INFO -- : installing library scripts: /tmp/ruby/install/trunk/lib/ruby/3.4.0+0 I, [2024-05-24T14:31:58.691944 #1849325] INFO -- : installing common headers: /tmp/ruby/install/trunk/include/ruby-3.4.0+0 I, [2024-05-24T14:31:58.697915 #1849325] INFO -- : installing manpages: /tmp/ruby/install/trunk/share/man/man1 I, [2024-05-24T14:31:58.697979 #1849325] INFO -- : installing default gems from lib: /tmp/ruby/install/trunk/lib/ruby/gems/3.4.0+0 I, [2024-05-24T14:31:58.721081 #1849325] INFO -- : benchmark 0.3.0 I, [2024-05-24T14:31:58.722994 #1849325] INFO -- : bundler 2.6.0.dev I, [2024-05-24T14:31:58.725140 #1849325] INFO -- : cgi 0.4.1 I, [2024-05-24T14:31:58.725688 #1849325] INFO -- : delegate 0.3.1 I, [2024-05-24T14:31:58.726197 #1849325] INFO -- : did_you_mean 1.6.3 I, [2024-05-24T14:31:58.726640 #1849325] INFO -- : english 0.8.0 I, [2024-05-24T14:31:58.727500 #1849325] INFO -- : erb 4.0.4 I, [2024-05-24T14:31:58.728621 #1849325] INFO -- : error_highlight 0.6.0 I, [2024-05-24T14:31:58.729432 #1849325] INFO -- : fileutils 1.7.2 I, [2024-05-24T14:31:58.730175 #1849325] INFO -- : find 0.2.0 I, [2024-05-24T14:31:58.731224 #1849325] INFO -- : forwardable 1.3.3 I, [2024-05-24T14:31:58.731873 #1849325] INFO -- : ipaddr 1.2.6 I, [2024-05-24T14:31:58.732305 #1849325] INFO -- : irb 1.13.1 I, [2024-05-24T14:31:58.733055 #1849325] INFO -- : logger 1.6.0 I, [2024-05-24T14:31:58.733537 #1849325] INFO -- : net-http 0.4.1 I, [2024-05-24T14:31:58.734049 #1849325] INFO -- : net-protocol 0.2.2 I, [2024-05-24T14:31:58.734539 #1849325] INFO -- : open-uri 0.4.1 I, [2024-05-24T14:31:58.735022 #1849325] INFO -- : open3 0.2.1 I, [2024-05-24T14:31:58.735433 #1849325] INFO -- : optparse 0.5.0 I, [2024-05-24T14:31:58.736204 #1849325] INFO -- : ostruct 0.6.0 I, [2024-05-24T14:31:58.736765 #1849325] INFO -- : pp 0.5.0 I, [2024-05-24T14:31:58.737221 #1849325] INFO -- : prettyprint 0.2.0 I, [2024-05-24T14:31:58.737753 #1849325] INFO -- : prism 0.29.0 I, [2024-05-24T14:31:58.738304 #1849325] INFO -- : pstore 0.1.3 I, [2024-05-24T14:31:58.738774 #1849325] INFO -- : rdoc 6.7.0 I, [2024-05-24T14:31:58.739822 #1849325] INFO -- : readline 0.0.4 I, [2024-05-24T14:31:58.740313 #1849325] INFO -- : reline 0.5.7 I, [2024-05-24T14:31:58.740759 #1849325] INFO -- : resolv 0.4.0 I, [2024-05-24T14:31:58.741315 #1849325] INFO -- : ruby2_keywords 0.0.5 I, [2024-05-24T14:31:58.742357 #1849325] INFO -- : securerandom 0.3.1 I, [2024-05-24T14:31:58.743065 #1849325] INFO -- : set 1.1.0 I, [2024-05-24T14:31:58.743538 #1849325] INFO -- : shellwords 0.2.0 I, [2024-05-24T14:31:58.744007 #1849325] INFO -- : singleton 0.2.0 I, [2024-05-24T14:31:58.744466 #1849325] INFO -- : syntax_suggest 2.0.0 I, [2024-05-24T14:31:58.745165 #1849325] INFO -- : tempfile 0.2.1 I, [2024-05-24T14:31:58.745645 #1849325] INFO -- : time 0.3.0 I, [2024-05-24T14:31:58.746132 #1849325] INFO -- : timeout 0.4.1 I, [2024-05-24T14:31:58.746592 #1849325] INFO -- : tmpdir 0.2.0 I, [2024-05-24T14:31:58.747083 #1849325] INFO -- : tsort 0.2.0 I, [2024-05-24T14:31:58.747547 #1849325] INFO -- : un 0.3.0 I, [2024-05-24T14:31:58.747940 #1849325] INFO -- : uri 0.13.0 I, [2024-05-24T14:31:58.748471 #1849325] INFO -- : weakref 0.1.3 I, [2024-05-24T14:31:58.748922 #1849325] INFO -- : yaml 0.3.0 I, [2024-05-24T14:31:58.749350 #1849325] INFO -- : installing default gems from ext: /tmp/ruby/install/trunk/lib/ruby/gems/3.4.0+0 I, [2024-05-24T14:31:58.756014 #1849325] INFO -- : date 3.3.4 I, [2024-05-24T14:31:58.756547 #1849325] INFO -- : digest 3.1.1 I, [2024-05-24T14:31:58.757029 #1849325] INFO -- : etc 1.4.3 I, [2024-05-24T14:31:58.757522 #1849325] INFO -- : fcntl 1.1.0 I, [2024-05-24T14:31:58.757994 #1849325] INFO -- : fiddle 1.1.3 I, [2024-05-24T14:31:58.758489 #1849325] INFO -- : io-console 0.7.2 I, [2024-05-24T14:31:58.758951 #1849325] INFO -- : io-nonblock 0.3.0 I, [2024-05-24T14:31:58.759333 #1849325] INFO -- : io-wait 0.3.1 I, [2024-05-24T14:31:58.759881 #1849325] INFO -- : json 2.7.2 I, [2024-05-24T14:31:58.760509 #1849325] INFO -- : openssl 3.2.0 I, [2024-05-24T14:31:58.760989 #1849325] INFO -- : pathname 0.3.0 I, [2024-05-24T14:31:58.761470 #1849325] INFO -- : psych 5.1.2 I, [2024-05-24T14:31:58.762015 #1849325] INFO -- : stringio 3.1.1 I, [2024-05-24T14:31:58.762483 #1849325] INFO -- : strscan 3.1.1 I, [2024-05-24T14:31:58.762946 #1849325] INFO -- : zlib 3.1.0 I, [2024-05-24T14:31:58.763235 #1849325] INFO -- : installing bundled gems: /tmp/ruby/install/trunk/lib/ruby/gems/3.4.0+0 I, [2024-05-24T14:31:58.763788 #1849325] INFO -- : minitest 5.23.1 I, [2024-05-24T14:31:58.772572 #1849325] INFO -- : rake 13.2.1 I, [2024-05-24T14:31:58.776035 #1849325] INFO -- : test-unit 3.6.2 I, [2024-05-24T14:31:58.780832 #1849325] INFO -- : rexml 3.2.8 I, [2024-05-24T14:31:58.784691 #1849325] INFO -- : rss 0.3.0 I, [2024-05-24T14:31:58.787279 #1849325] INFO -- : net-ftp 0.3.4 I, [2024-05-24T14:31:58.788890 #1849325] INFO -- : net-imap 0.4.11 I, [2024-05-24T14:31:58.792670 #1849325] INFO -- : net-pop 0.1.2 I, [2024-05-24T14:31:58.793685 #1849325] INFO -- : net-smtp 0.5.0 I, [2024-05-24T14:31:58.794829 #1849325] INFO -- : matrix 0.4.2 I, [2024-05-24T14:31:58.798074 #1849325] INFO -- : prime 0.1.2 I, [2024-05-24T14:31:58.802771 #1849325] INFO -- : rbs 3.4.4 I, [2024-05-24T14:31:58.825472 #1849325] INFO -- : typeprof 0.21.11 I, [2024-05-24T14:31:58.827772 #1849325] INFO -- : debug 1.9.2 I, [2024-05-24T14:31:58.831055 #1849325] INFO -- : racc 1.8.0 I, [2024-05-24T14:31:58.833740 #1849325] INFO -- : mutex_m 0.2.0 I, [2024-05-24T14:31:58.835048 #1849325] INFO -- : getoptlong 0.2.1 I, [2024-05-24T14:31:58.836452 #1849325] INFO -- : base64 0.2.0 I, [2024-05-24T14:31:58.837580 #1849325] INFO -- : bigdecimal 3.1.8 I, [2024-05-24T14:31:58.840382 #1849325] INFO -- : observer 0.1.2 I, [2024-05-24T14:31:58.841568 #1849325] INFO -- : abbrev 0.1.2 I, [2024-05-24T14:31:58.842813 #1849325] INFO -- : resolv-replace 0.1.1 I, [2024-05-24T14:31:58.844011 #1849325] INFO -- : rinda 0.2.0 I, [2024-05-24T14:31:58.845411 #1849325] INFO -- : drb 2.2.1 I, [2024-05-24T14:31:58.847015 #1849325] INFO -- : nkf 0.2.0 I, [2024-05-24T14:31:58.849480 #1849325] INFO -- : syslog 0.1.2 I, [2024-05-24T14:31:58.851651 #1849325] INFO -- : csv 3.3.0 I, [2024-05-24T14:31:58.854119 #1849325] INFO -- : installing bundled gem cache: /tmp/ruby/install/trunk/lib/ruby/gems/3.4.0+0/cache I, [2024-05-24T14:31:58.855514 #1849325] INFO -- : skipped bundled gems: I, [2024-05-24T14:31:58.855597 #1849325] INFO -- : power_assert-2.0.4dev.gem not found in bundled_gems I, [2024-05-24T14:31:58.858685 #1849325] INFO -- : $$$[end] "make install -j20" exit with 0. I, [2024-05-24T14:31:58.858842 #1849325] INFO -- : $$$[beg] make yes-btest TESTOPTS='-q -j20' I, [2024-05-24T14:32:05.059329 #1849325] INFO -- : PASS all 1936 tests E, [2024-05-24T14:32:05.064772 #1849325] ERROR -- : I, [2024-05-24T14:32:05.065043 #1849325] INFO -- : $$$[end] "make yes-btest TESTOPTS='-q -j20'" exit with 0. I, [2024-05-24T14:32:05.065129 #1849325] INFO -- : $$$[beg] make yes-test-basic TESTS='-j20' I, [2024-05-24T14:32:05.130400 #1849325] INFO -- : BASERUBY = /usr/bin/ruby --disable=gems I, [2024-05-24T14:32:05.130463 #1849325] INFO -- : CC = gcc I, [2024-05-24T14:32:05.130483 #1849325] INFO -- : LD = ld I, [2024-05-24T14:32:05.130499 #1849325] INFO -- : LDSHARED = gcc -shared I, [2024-05-24T14:32:05.130515 #1849325] INFO -- : CFLAGS = -O3 -fno-fast-math -ggdb3 -Wall -Wextra -Wdeprecated-declarations -Wdiv-by-zero -Wduplicated-cond -Wimplicit-function-declaration -Wimplicit-int -Wpointer-arith -Wwrite-strings -Wold-style-definition -Wimplicit-fallthrough=0 -Wmissing-noreturn -Wno-cast-function-type -Wno-constant-logical-operand -Wno-long-long -Wno-missing-field-initializers -Wno-overlength-strings -Wno-packed-bitfield-compat -Wno-parentheses-equality -Wno-self-assign -Wno-tautological-compare -Wno-unused-parameter -Wno-unused-value -Wsuggest-attribute=format -Wsuggest-attribute=noreturn -Wunused-variable -Wmisleading-indentation -Wundef -fPIC I, [2024-05-24T14:32:05.130532 #1849325] INFO -- : XCFLAGS = -U_FORTIFY_SOURCE -D_FORTIFY_SOURCE=2 -fstack-protector-strong -fno-strict-overflow -fvisibility=hidden -fexcess-precision=standard -DRUBY_EXPORT -I. -I.ext/include/x86_64-linux -I/tmp/ruby/src/trunk/include -I/tmp/ruby/src/trunk -I/tmp/ruby/src/trunk/prism -I/tmp/ruby/src/trunk/enc/unicode/15.0.0 I, [2024-05-24T14:32:05.130548 #1849325] INFO -- : CPPFLAGS = I, [2024-05-24T14:32:05.130564 #1849325] INFO -- : DLDFLAGS = -Wl,--compress-debug-sections=zlib -Wl,-soname,libruby.so.3.4 -fstack-protector-strong I, [2024-05-24T14:32:05.130580 #1849325] INFO -- : SOLIBS = -lz -lrt -lrt -lgmp -ldl -lcrypt -lm -lpthread I, [2024-05-24T14:32:05.130595 #1849325] INFO -- : LANG = en_US.UTF-8 I, [2024-05-24T14:32:05.130609 #1849325] INFO -- : LC_ALL = I, [2024-05-24T14:32:05.130624 #1849325] INFO -- : LC_CTYPE = I, [2024-05-24T14:32:05.130639 #1849325] INFO -- : MFLAGS = I, [2024-05-24T14:32:05.130654 #1849325] INFO -- : RUSTC = no I, [2024-05-24T14:32:05.130670 #1849325] INFO -- : YJIT_RUSTC_ARGS = --crate-name=yjit --crate-type=staticlib --edition=2021 -g -C lto=thin -C opt-level=3 -C overflow-checks=on '--out-dir=/tmp/ruby/build/trunk/yjit/target/release/' /tmp/ruby/src/trunk/yjit/src/lib.rs I, [2024-05-24T14:32:05.131599 #1849325] INFO -- : gcc (Ubuntu 11.4.0-1ubuntu1~22.04) 11.4.0 I, [2024-05-24T14:32:05.131668 #1849325] INFO -- : Copyright (C) 2021 Free Software Foundation, Inc. I, [2024-05-24T14:32:05.131697 #1849325] INFO -- : This is free software; see the source for copying conditions. There is NO I, [2024-05-24T14:32:05.131717 #1849325] INFO -- : warranty; not even for MERCHANTABILITY or FITNESS FOR A PARTICULAR PURPOSE. I, [2024-05-24T14:32:05.131732 #1849325] INFO -- : I, [2024-05-24T14:32:05.243511 #1849325] INFO -- : Checking leaked global symbols...none I, [2024-05-24T14:32:05.283895 #1849325] INFO -- : /tmp/ruby/src/trunk/basictest/test.rb:assignment ....................................................................................................................................................................................................................................................................................................................................................................................OK 372 I, [2024-05-24T14:32:05.283983 #1849325] INFO -- : /tmp/ruby/src/trunk/basictest/test.rb:condition ..OK 2 I, [2024-05-24T14:32:05.284000 #1849325] INFO -- : /tmp/ruby/src/trunk/basictest/test.rb:if/unless ...OK 3 I, [2024-05-24T14:32:05.284013 #1849325] INFO -- : /tmp/ruby/src/trunk/basictest/test.rb:case .....OK 5 I, [2024-05-24T14:32:05.284134 #1849325] INFO -- : /tmp/ruby/src/trunk/basictest/test.rb:while/until ........OK 8 I, [2024-05-24T14:32:05.284190 #1849325] INFO -- : /tmp/ruby/src/trunk/basictest/test.rb:exception ..........OK 10 I, [2024-05-24T14:32:05.284461 #1849325] INFO -- : /tmp/ruby/src/trunk/basictest/test.rb:array .......................................OK 39 I, [2024-05-24T14:32:05.284568 #1849325] INFO -- : /tmp/ruby/src/trunk/basictest/test.rb:hash ...........................OK 27 I, [2024-05-24T14:32:05.285286 #1849325] INFO -- : /tmp/ruby/src/trunk/basictest/test.rb:iterator ...........................................................................................................OK 107 I, [2024-05-24T14:32:05.285563 #1849325] INFO -- : /tmp/ruby/src/trunk/basictest/test.rb:float ................................................................................OK 80 I, [2024-05-24T14:32:05.287469 #1849325] INFO -- : /tmp/ruby/src/trunk/basictest/test.rb:bignum ...............................OK 31 I, [2024-05-24T14:32:05.288342 #1849325] INFO -- : /tmp/ruby/src/trunk/basictest/test.rb:string & char ..............................................................OK 62 I, [2024-05-24T14:32:05.288368 #1849325] INFO -- : /tmp/ruby/src/trunk/basictest/test.rb:assignment ..........OK 10 I, [2024-05-24T14:32:05.288399 #1849325] INFO -- : /tmp/ruby/src/trunk/basictest/test.rb:call ......OK 6 I, [2024-05-24T14:32:05.288467 #1849325] INFO -- : /tmp/ruby/src/trunk/basictest/test.rb:proc .........OK 9 I, [2024-05-24T14:32:05.389083 #1849325] INFO -- : /tmp/ruby/src/trunk/basictest/test.rb:signal ..OK 2 I, [2024-05-24T14:32:05.391110 #1849325] INFO -- : /tmp/ruby/src/trunk/basictest/test.rb:eval ...........................OK 27 I, [2024-05-24T14:32:05.497579 #1849325] INFO -- : /tmp/ruby/src/trunk/basictest/test.rb:system ........OK 8 I, [2024-05-24T14:32:05.497665 #1849325] INFO -- : /tmp/ruby/src/trunk/basictest/test.rb:const .....OK 5 I, [2024-05-24T14:32:05.497682 #1849325] INFO -- : /tmp/ruby/src/trunk/basictest/test.rb:clone .....OK 5 I, [2024-05-24T14:32:05.497697 #1849325] INFO -- : /tmp/ruby/src/trunk/basictest/test.rb:marshal ....OK 4 I, [2024-05-24T14:32:05.497824 #1849325] INFO -- : /tmp/ruby/src/trunk/basictest/test.rb:pack ....OK 4 I, [2024-05-24T14:32:05.497851 #1849325] INFO -- : /tmp/ruby/src/trunk/basictest/test.rb:math ..OK 2 I, [2024-05-24T14:32:05.497877 #1849325] INFO -- : /tmp/ruby/src/trunk/basictest/test.rb:struct ......OK 6 I, [2024-05-24T14:32:05.497903 #1849325] INFO -- : /tmp/ruby/src/trunk/basictest/test.rb:variable ............OK 12 I, [2024-05-24T14:32:05.497925 #1849325] INFO -- : /tmp/ruby/src/trunk/basictest/test.rb:trace ...OK 3 I, [2024-05-24T14:32:05.497984 #1849325] INFO -- : /tmp/ruby/src/trunk/basictest/test.rb:defined? ............OK 12 I, [2024-05-24T14:32:05.498073 #1849325] INFO -- : /tmp/ruby/src/trunk/basictest/test.rb:alias ......OK 6 I, [2024-05-24T14:32:05.498377 #1849325] INFO -- : /tmp/ruby/src/trunk/basictest/test.rb:path .......................OK 23 I, [2024-05-24T14:32:05.531380 #1849325] INFO -- : /tmp/ruby/src/trunk/basictest/test.rb:gc ....OK 4 I, [2024-05-24T14:32:05.533776 #1849325] INFO -- : I, [2024-05-24T14:32:05.533852 #1849325] INFO -- : test succeeded I, [2024-05-24T14:32:05.535352 #1849325] INFO -- : $$$[end] "make yes-test-basic TESTS='-j20'" exit with 0. I, [2024-05-24T14:32:05.535478 #1849325] INFO -- : $$$[beg] make yes-test-all TESTOPTS='--stderr-on-failure' TESTS='-j20' I, [2024-05-24T14:32:05.628006 #1849325] INFO -- : BASERUBY = /usr/bin/ruby --disable=gems I, [2024-05-24T14:32:05.628044 #1849325] INFO -- : CC = gcc I, [2024-05-24T14:32:05.628050 #1849325] INFO -- : LD = ld I, [2024-05-24T14:32:05.628054 #1849325] INFO -- : LDSHARED = gcc -shared I, [2024-05-24T14:32:05.628058 #1849325] INFO -- : CFLAGS = -O3 -fno-fast-math -ggdb3 -Wall -Wextra -Wdeprecated-declarations -Wdiv-by-zero -Wduplicated-cond -Wimplicit-function-declaration -Wimplicit-int -Wpointer-arith -Wwrite-strings -Wold-style-definition -Wimplicit-fallthrough=0 -Wmissing-noreturn -Wno-cast-function-type -Wno-constant-logical-operand -Wno-long-long -Wno-missing-field-initializers -Wno-overlength-strings -Wno-packed-bitfield-compat -Wno-parentheses-equality -Wno-self-assign -Wno-tautological-compare -Wno-unused-parameter -Wno-unused-value -Wsuggest-attribute=format -Wsuggest-attribute=noreturn -Wunused-variable -Wmisleading-indentation -Wundef -fPIC I, [2024-05-24T14:32:05.628075 #1849325] INFO -- : XCFLAGS = -U_FORTIFY_SOURCE -D_FORTIFY_SOURCE=2 -fstack-protector-strong -fno-strict-overflow -fvisibility=hidden -fexcess-precision=standard -DRUBY_EXPORT -I. -I.ext/include/x86_64-linux -I/tmp/ruby/src/trunk/include -I/tmp/ruby/src/trunk -I/tmp/ruby/src/trunk/prism -I/tmp/ruby/src/trunk/enc/unicode/15.0.0 I, [2024-05-24T14:32:05.628086 #1849325] INFO -- : CPPFLAGS = I, [2024-05-24T14:32:05.628090 #1849325] INFO -- : DLDFLAGS = -Wl,--compress-debug-sections=zlib -Wl,-soname,libruby.so.3.4 -fstack-protector-strong I, [2024-05-24T14:32:05.628095 #1849325] INFO -- : SOLIBS = -lz -lrt -lrt -lgmp -ldl -lcrypt -lm -lpthread I, [2024-05-24T14:32:05.628100 #1849325] INFO -- : LANG = en_US.UTF-8 I, [2024-05-24T14:32:05.628104 #1849325] INFO -- : LC_ALL = I, [2024-05-24T14:32:05.628108 #1849325] INFO -- : LC_CTYPE = I, [2024-05-24T14:32:05.628112 #1849325] INFO -- : MFLAGS = I, [2024-05-24T14:32:05.628115 #1849325] INFO -- : RUSTC = no I, [2024-05-24T14:32:05.628120 #1849325] INFO -- : YJIT_RUSTC_ARGS = --crate-name=yjit --crate-type=staticlib --edition=2021 -g -C lto=thin -C opt-level=3 -C overflow-checks=on '--out-dir=/tmp/ruby/build/trunk/yjit/target/release/' /tmp/ruby/src/trunk/yjit/src/lib.rs I, [2024-05-24T14:32:05.628684 #1849325] INFO -- : gcc (Ubuntu 11.4.0-1ubuntu1~22.04) 11.4.0 I, [2024-05-24T14:32:05.628708 #1849325] INFO -- : Copyright (C) 2021 Free Software Foundation, Inc. I, [2024-05-24T14:32:05.628714 #1849325] INFO -- : This is free software; see the source for copying conditions. There is NO I, [2024-05-24T14:32:05.628719 #1849325] INFO -- : warranty; not even for MERCHANTABILITY or FITNESS FOR A PARTICULAR PURPOSE. I, [2024-05-24T14:32:05.628727 #1849325] INFO -- : I, [2024-05-24T14:32:05.630408 #1849325] INFO -- : generating enc.mk I, [2024-05-24T14:32:05.747134 #1849325] INFO -- : generating encdb.h I, [2024-05-24T14:32:05.770773 #1849325] INFO -- : encdb.h unchanged I, [2024-05-24T14:32:05.771777 #1849325] INFO -- : making enc I, [2024-05-24T14:32:05.789650 #1849325] INFO -- : make[1]: Entering directory '/tmp/ruby/build/trunk' I, [2024-05-24T14:32:05.789672 #1849325] INFO -- : make[1]: Nothing to be done for 'enc'. I, [2024-05-24T14:32:05.789678 #1849325] INFO -- : make[1]: Leaving directory '/tmp/ruby/build/trunk' I, [2024-05-24T14:32:05.790379 #1849325] INFO -- : making srcs under enc I, [2024-05-24T14:32:05.820021 #1849325] INFO -- : make[1]: Entering directory '/tmp/ruby/build/trunk' I, [2024-05-24T14:32:05.820042 #1849325] INFO -- : make[1]: Nothing to be done for 'srcs'. I, [2024-05-24T14:32:05.820052 #1849325] INFO -- : make[1]: Leaving directory '/tmp/ruby/build/trunk' I, [2024-05-24T14:32:05.821136 #1849325] INFO -- : generating transdb.h I, [2024-05-24T14:32:05.919642 #1849325] INFO -- : transdb.h unchanged I, [2024-05-24T14:32:05.921188 #1849325] INFO -- : making trans I, [2024-05-24T14:32:05.955314 #1849325] INFO -- : make[1]: Entering directory '/tmp/ruby/build/trunk' I, [2024-05-24T14:32:05.955337 #1849325] INFO -- : make[1]: Nothing to be done for 'trans'. I, [2024-05-24T14:32:05.955344 #1849325] INFO -- : make[1]: Leaving directory '/tmp/ruby/build/trunk' I, [2024-05-24T14:32:05.956080 #1849325] INFO -- : making encs I, [2024-05-24T14:32:05.992705 #1849325] INFO -- : make[1]: Entering directory '/tmp/ruby/build/trunk' I, [2024-05-24T14:32:05.992725 #1849325] INFO -- : make[1]: Nothing to be done for 'encs'. I, [2024-05-24T14:32:05.992734 #1849325] INFO -- : make[1]: Leaving directory '/tmp/ruby/build/trunk' I, [2024-05-24T14:32:05.994644 #1849325] INFO -- : generating makefiles ext/configure-ext.mk I, [2024-05-24T14:32:06.021711 #1849325] INFO -- : ext/configure-ext.mk updated I, [2024-05-24T14:32:06.024058 #1849325] INFO -- : make[1]: Entering directory '/tmp/ruby/build/trunk' I, [2024-05-24T14:32:07.420248 #1849325] INFO -- : make[1]: Leaving directory '/tmp/ruby/build/trunk' I, [2024-05-24T14:32:07.421057 #1849325] INFO -- : generating makefile exts.mk I, [2024-05-24T14:32:07.458059 #1849325] INFO -- : exts.mk unchanged I, [2024-05-24T14:32:07.462720 #1849325] INFO -- : make[1]: Entering directory '/tmp/ruby/build/trunk' I, [2024-05-24T14:32:07.782445 #1849325] INFO -- : make[2]: Entering directory '/tmp/ruby/build/trunk/ext/coverage' I, [2024-05-24T14:32:07.787126 #1849325] INFO -- : make[2]: Leaving directory '/tmp/ruby/build/trunk/ext/coverage' I, [2024-05-24T14:32:07.793628 #1849325] INFO -- : make[2]: Entering directory '/tmp/ruby/build/trunk/ext/date' I, [2024-05-24T14:32:07.798275 #1849325] INFO -- : make[2]: Leaving directory '/tmp/ruby/build/trunk/ext/date' I, [2024-05-24T14:32:07.802194 #1849325] INFO -- : make[2]: Entering directory '/tmp/ruby/build/trunk/ext/digest' I, [2024-05-24T14:32:07.811256 #1849325] INFO -- : make[2]: Leaving directory '/tmp/ruby/build/trunk/ext/digest' I, [2024-05-24T14:32:07.837531 #1849325] INFO -- : make[2]: Entering directory '/tmp/ruby/build/trunk/ext/digest/sha2' I, [2024-05-24T14:32:07.842817 #1849325] INFO -- : make[2]: Leaving directory '/tmp/ruby/build/trunk/ext/digest/sha2' I, [2024-05-24T14:32:07.864144 #1849325] INFO -- : make[2]: Entering directory '/tmp/ruby/build/trunk/ext/fiddle' I, [2024-05-24T14:32:07.873569 #1849325] INFO -- : make[2]: Leaving directory '/tmp/ruby/build/trunk/ext/fiddle' I, [2024-05-24T14:32:07.878429 #1849325] INFO -- : make[2]: Entering directory '/tmp/ruby/build/trunk/ext/io/console' I, [2024-05-24T14:32:07.881946 #1849325] INFO -- : make[2]: Leaving directory '/tmp/ruby/build/trunk/ext/io/console' I, [2024-05-24T14:32:07.894202 #1849325] INFO -- : make[2]: Entering directory '/tmp/ruby/build/trunk/ext/json' I, [2024-05-24T14:32:07.905403 #1849325] INFO -- : make[2]: Leaving directory '/tmp/ruby/build/trunk/ext/json' I, [2024-05-24T14:32:07.920954 #1849325] INFO -- : make[2]: Entering directory '/tmp/ruby/build/trunk/ext/monitor' I, [2024-05-24T14:32:07.925053 #1849325] INFO -- : make[2]: Leaving directory '/tmp/ruby/build/trunk/ext/monitor' I, [2024-05-24T14:32:07.931718 #1849325] INFO -- : make[2]: Entering directory '/tmp/ruby/build/trunk/ext/objspace' I, [2024-05-24T14:32:07.936519 #1849325] INFO -- : make[2]: Leaving directory '/tmp/ruby/build/trunk/ext/objspace' I, [2024-05-24T14:32:07.953997 #1849325] INFO -- : make[2]: Entering directory '/tmp/ruby/build/trunk/ext/openssl' I, [2024-05-24T14:32:07.967205 #1849325] INFO -- : make[2]: Leaving directory '/tmp/ruby/build/trunk/ext/openssl' I, [2024-05-24T14:32:07.970091 #1849325] INFO -- : make[2]: Entering directory '/tmp/ruby/build/trunk/ext/pathname' I, [2024-05-24T14:32:07.972504 #1849325] INFO -- : make[2]: Leaving directory '/tmp/ruby/build/trunk/ext/pathname' I, [2024-05-24T14:32:07.976636 #1849325] INFO -- : make[2]: Entering directory '/tmp/ruby/build/trunk/ext/psych' I, [2024-05-24T14:32:07.998256 #1849325] INFO -- : make[2]: Leaving directory '/tmp/ruby/build/trunk/ext/psych' I, [2024-05-24T14:32:08.003082 #1849325] INFO -- : make[2]: Entering directory '/tmp/ruby/build/trunk/ext/pty' I, [2024-05-24T14:32:08.007158 #1849325] INFO -- : make[2]: Leaving directory '/tmp/ruby/build/trunk/ext/pty' I, [2024-05-24T14:32:08.023238 #1849325] INFO -- : make[2]: Entering directory '/tmp/ruby/build/trunk/ext/ripper' I, [2024-05-24T14:32:08.030893 #1849325] INFO -- : make[2]: Leaving directory '/tmp/ruby/build/trunk/ext/ripper' I, [2024-05-24T14:32:08.033278 #1849325] INFO -- : make[2]: Entering directory '/tmp/ruby/build/trunk/ext/rubyvm' I, [2024-05-24T14:32:08.036506 #1849325] INFO -- : make[2]: Leaving directory '/tmp/ruby/build/trunk/ext/rubyvm' I, [2024-05-24T14:32:08.049611 #1849325] INFO -- : make[2]: Entering directory '/tmp/ruby/build/trunk/ext/socket' I, [2024-05-24T14:32:08.059028 #1849325] INFO -- : make[2]: Leaving directory '/tmp/ruby/build/trunk/ext/socket' I, [2024-05-24T14:32:08.077201 #1849325] INFO -- : make[2]: Entering directory '/tmp/ruby/build/trunk/.bundle/gems/bigdecimal-3.1.8/ext/bigdecimal' I, [2024-05-24T14:32:08.102657 #1849325] INFO -- : make[2]: Leaving directory '/tmp/ruby/build/trunk/.bundle/gems/bigdecimal-3.1.8/ext/bigdecimal' I, [2024-05-24T14:32:08.104743 #1849325] INFO -- : make[2]: Entering directory '/tmp/ruby/build/trunk/.bundle/gems/debug-1.9.2/ext/debug' I, [2024-05-24T14:32:08.126624 #1849325] INFO -- : make[2]: Leaving directory '/tmp/ruby/build/trunk/.bundle/gems/debug-1.9.2/ext/debug' I, [2024-05-24T14:32:08.128658 #1849325] INFO -- : make[2]: Entering directory '/tmp/ruby/build/trunk/.bundle/gems/nkf-0.2.0/ext/nkf' I, [2024-05-24T14:32:08.149959 #1849325] INFO -- : make[2]: Leaving directory '/tmp/ruby/build/trunk/.bundle/gems/nkf-0.2.0/ext/nkf' I, [2024-05-24T14:32:08.151954 #1849325] INFO -- : make[2]: Entering directory '/tmp/ruby/build/trunk/.bundle/gems/racc-1.7.3/ext/racc/cparse' I, [2024-05-24T14:32:08.173313 #1849325] INFO -- : make[2]: Leaving directory '/tmp/ruby/build/trunk/.bundle/gems/racc-1.7.3/ext/racc/cparse' I, [2024-05-24T14:32:08.175239 #1849325] INFO -- : make[2]: Entering directory '/tmp/ruby/build/trunk/.bundle/gems/racc-1.8.0/ext/racc/cparse' I, [2024-05-24T14:32:08.201615 #1849325] INFO -- : make[2]: Leaving directory '/tmp/ruby/build/trunk/.bundle/gems/racc-1.8.0/ext/racc/cparse' I, [2024-05-24T14:32:08.203817 #1849325] INFO -- : make[2]: Entering directory '/tmp/ruby/build/trunk/.bundle/gems/rbs-3.4.4/ext/rbs_extension' I, [2024-05-24T14:32:08.225742 #1849325] INFO -- : make[2]: Leaving directory '/tmp/ruby/build/trunk/.bundle/gems/rbs-3.4.4/ext/rbs_extension' I, [2024-05-24T14:32:08.227905 #1849325] INFO -- : make[2]: Entering directory '/tmp/ruby/build/trunk/.bundle/gems/syslog-0.1.2/ext/syslog' I, [2024-05-24T14:32:08.250953 #1849325] INFO -- : make[2]: Leaving directory '/tmp/ruby/build/trunk/.bundle/gems/syslog-0.1.2/ext/syslog' I, [2024-05-24T14:32:08.275533 #1849325] INFO -- : make[2]: Entering directory '/tmp/ruby/build/trunk' I, [2024-05-24T14:32:08.342075 #1849325] INFO -- : make[2]: 'ruby' is up to date. I, [2024-05-24T14:32:08.342112 #1849325] INFO -- : make[2]: Leaving directory '/tmp/ruby/build/trunk' I, [2024-05-24T14:32:08.342524 #1849325] INFO -- : make[1]: Leaving directory '/tmp/ruby/build/trunk' I, [2024-05-24T14:32:08.346857 #1849325] INFO -- : make[1]: Entering directory '/tmp/ruby/build/trunk' I, [2024-05-24T14:32:08.346879 #1849325] INFO -- : make[1]: Nothing to be done for 'note'. I, [2024-05-24T14:32:08.346885 #1849325] INFO -- : make[1]: Leaving directory '/tmp/ruby/build/trunk' I, [2024-05-24T14:32:08.424435 #1849325] INFO -- : Run options: I, [2024-05-24T14:32:08.424477 #1849325] INFO -- : --seed=61631 I, [2024-05-24T14:32:08.424483 #1849325] INFO -- : "--ruby=./miniruby -I/tmp/ruby/src/trunk/lib -I. -I.ext/common /tmp/ruby/src/trunk/tool/runruby.rb --extout=.ext -- --disable-gems" I, [2024-05-24T14:32:08.424488 #1849325] INFO -- : --excludes-dir=/tmp/ruby/src/trunk/test/.excludes I, [2024-05-24T14:32:08.424495 #1849325] INFO -- : --name=!/memory_leak/ I, [2024-05-24T14:32:08.424498 #1849325] INFO -- : --stderr-on-failure I, [2024-05-24T14:32:08.424502 #1849325] INFO -- : -j20 I, [2024-05-24T14:32:08.424519 #1849325] INFO -- : I, [2024-05-24T14:32:08.424522 #1849325] INFO -- : # Running tests: I, [2024-05-24T14:32:08.424526 #1849325] INFO -- : I, [2024-05-24T14:32:08.573987 #1849325] INFO -- : [ 1/885] 1890710=test_x509req I, [2024-05-24T14:32:08.574083 #1849325] INFO -- : [ 2/885] 1890697=test_mutex I, [2024-05-24T14:32:08.574369 #1849325] INFO -- : [ 3/885] 1890695=test_rdoc_rd_inline I, [2024-05-24T14:32:08.574931 #1849325] INFO -- : [ 4/885] 1890692=test_files_test_1 I, [2024-05-24T14:32:08.575162 #1849325] INFO -- : [ 5/885] 1890694=test_struct I, [2024-05-24T14:32:08.577712 #1849325] INFO -- : [ 6/885] 1890693=test_gem_path_support I, [2024-05-24T14:32:08.578007 #1849325] INFO -- : [ 7/885] 1890711=test_set I, [2024-05-24T14:32:08.578210 #1849325] INFO -- : [ 8/885] 1890706=test_insns_leaf I, [2024-05-24T14:32:08.578513 #1849325] INFO -- : [ 9/885] 1890709=test_serialize_subclasses I, [2024-05-24T14:32:08.579005 #1849325] INFO -- : [ 10/885] 1890708=test_color_printer I, [2024-05-24T14:32:08.582055 #1849325] INFO -- : [ 11/885] 1890707=test_deprecated I, [2024-05-24T14:32:08.585218 #1849325] INFO -- : [ 12/885] 1890706=test_engine I, [2024-05-24T14:32:08.600593 #1849325] INFO -- : [ 13/885] 1890709=test_win32ole_variant_m I, [2024-05-24T14:32:08.601798 #1849325] INFO -- : [ 14/885] 1890711=test_div I, [2024-05-24T14:32:08.602031 #1849325] INFO -- : [ 15/885] 1890709=test_allocation I, [2024-05-24T14:32:08.602754 #1849325] INFO -- : [ 16/885] 1890707=test_key_error I, [2024-05-24T14:32:08.604790 #1849325] INFO -- : [ 17/885] 1890711=test_rdoc_markup_to_html_snippet I, [2024-05-24T14:32:08.605097 #1849325] INFO -- : [ 18/885] 1890707=magic_comment_test I, [2024-05-24T14:32:08.610978 #1849325] INFO -- : [ 19/885] 1890698=test_struct I, [2024-05-24T14:32:08.611037 #1849325] INFO -- : [ 20/885] 1890699=test_variable I, [2024-05-24T14:32:08.611045 #1849325] INFO -- : [ 21/885] 1890700=fuzzer_test I, [2024-05-24T14:32:08.611659 #1849325] INFO -- : [ 22/885] 1890701=test_sexp I, [2024-05-24T14:32:08.611675 #1849325] INFO -- : [ 23/885] 1890702=test_rdoc_markup_include I, [2024-05-24T14:32:08.611870 #1849325] INFO -- : [ 24/885] 1890704=test_pkg_config I, [2024-05-24T14:32:08.612381 #1849325] INFO -- : [ 25/885] 1890696=test_cparser I, [2024-05-24T14:32:08.612404 #1849325] INFO -- : [ 26/885] 1890705=json_parser_test I, [2024-05-24T14:32:08.616600 #1849325] INFO -- : [ 27/885] 1890703=test_nomethod_error I, [2024-05-24T14:32:08.617674 #1849325] INFO -- : [ 28/885] 1890703=memsize_test I, [2024-05-24T14:32:08.620901 #1849325] INFO -- : [ 29/885] 1890706=test_config I, [2024-05-24T14:32:08.631956 #1849325] INFO -- : [ 30/885] 1890706=test_win32ole_variant_outarg I, [2024-05-24T14:32:08.635436 #1849325] INFO -- : [ 31/885] 1890706=json_common_interface_test I, [2024-05-24T14:32:08.647615 #1849325] INFO -- : [ 32/885] 1890701=test_gem_source_subpath_problem I, [2024-05-24T14:32:08.647684 #1849325] INFO -- : [ 33/885] 1890698=test_dln I, [2024-05-24T14:32:08.649383 #1849325] INFO -- : [ 34/885] 1890698=test_gem_resolver_git_set I, [2024-05-24T14:32:08.651354 #1849325] INFO -- : [ 35/885] 1890706=test_storage I, [2024-05-24T14:32:08.652674 #1849325] INFO -- : [ 36/885] 1890705=test_new I, [2024-05-24T14:32:08.654494 #1849325] INFO -- : [ 37/885] 1890704=test_gem_security_signer I, [2024-05-24T14:32:08.655120 #1849325] INFO -- : [ 38/885] 1890705=test_cipher I, [2024-05-24T14:32:08.657204 #1849325] INFO -- : [ 39/885] 1890706=pattern_test I, [2024-05-24T14:32:08.678618 #1849325] INFO -- : [ 40/885] 1890708=test_memory_view I, [2024-05-24T14:32:08.696003 #1849325] INFO -- : [ 41/885] 1890695=test_debug I, [2024-05-24T14:32:08.704791 #1849325] INFO -- : [ 42/885] 1890695=test_shellwords I, [2024-05-24T14:32:08.704966 #1849325] INFO -- : [ 43/885] 1890703=test_digest_extend I, [2024-05-24T14:32:08.705784 #1849325] INFO -- : [ 44/885] 1890707=test_omap I, [2024-05-24T14:32:08.709193 #1849325] INFO -- : [ 45/885] 1890708=test_string I, [2024-05-24T14:32:08.709263 #1849325] INFO -- : [ 46/885] 1890700=test_iterator I, [2024-05-24T14:32:08.711222 #1849325] INFO -- : [ 47/885] 1890695=test_process I, [2024-05-24T14:32:08.711675 #1849325] INFO -- : [ 48/885] 1890708=test_windows_1252 I, [2024-05-24T14:32:08.714216 #1849325] INFO -- : [ 49/885] 1890707=test_input_method I, [2024-05-24T14:32:08.716619 #1849325] INFO -- : [ 50/885] 1890708=test_rdoc_top_level I, [2024-05-24T14:32:08.724932 #1849325] INFO -- : [ 51/885] 1890703=test_metaclass I, [2024-05-24T14:32:08.730754 #1849325] INFO -- : [ 52/885] 1890703=test_cgi_session I, [2024-05-24T14:32:08.736922 #1849325] INFO -- : [ 53/885] 1890706=test_rdoc_rd I, [2024-05-24T14:32:08.738773 #1849325] INFO -- : [ 54/885] 1890702=test_x509crl I, [2024-05-24T14:32:08.742910 #1849325] INFO -- : [ 55/885] 1890695=test_signal I, [2024-05-24T14:32:08.744966 #1849325] INFO -- : [ 56/885] 1890699=test_fixnum I, [2024-05-24T14:32:08.745504 #1849325] INFO -- : [ 57/885] 1890705=test_gem_source_git I, [2024-05-24T14:32:08.756325 #1849325] INFO -- : [ 58/885] 1890699=test_regex_casefold I, [2024-05-24T14:32:08.765989 #1849325] INFO -- : [ 59/885] 1890703=test_gem_commands_signout_command I, [2024-05-24T14:32:08.783251 #1849325] INFO -- : [ 60/885] 1890710=test_refinement I, [2024-05-24T14:32:08.786301 #1849325] INFO -- : [ 61/885] 1890693=test_gem_resolver_installer_set I, [2024-05-24T14:32:08.802409 #1849325] INFO -- : [ 62/885] 1890700=test_dir_m17n I, [2024-05-24T14:32:08.805427 #1849325] INFO -- : [ 63/885] 1890696=test_require I, [2024-05-24T14:32:08.808641 #1849325] INFO -- : [ 64/885] 1890711=test_cgi_cookie I, [2024-05-24T14:32:08.820216 #1849325] INFO -- : [ 65/885] 1890711=test_float I, [2024-05-24T14:32:08.857965 #1849325] INFO -- : [ 66/885] 1890704=attribute_write_test I, [2024-05-24T14:32:08.875175 #1849325] INFO -- : [ 67/885] 1890706=test_propertyputref I, [2024-05-24T14:32:08.881311 #1849325] INFO -- : [ 68/885] 1890706=test_spell_checker I, [2024-05-24T14:32:08.887641 #1849325] INFO -- : [ 69/885] 1890706=test_assembler I, [2024-05-24T14:32:08.889496 #1849325] INFO -- : [ 70/885] 1890706=test_rational I, [2024-05-24T14:32:08.904297 #1849325] INFO -- : [ 71/885] 1890706=test_rational2 I, [2024-05-24T14:32:08.915069 #1849325] INFO -- : [ 72/885] 1890706=test_yield_block I, [2024-05-24T14:32:08.917339 #1849325] INFO -- : [ 73/885] 1890706=test_len I, [2024-05-24T14:32:08.918758 #1849325] INFO -- : [ 74/885] 1890703=test_gem_commands_cert_command I, [2024-05-24T14:32:08.919802 #1849325] INFO -- : [ 75/885] 1890706=test_completion I, [2024-05-24T14:32:08.953574 #1849325] INFO -- : [ 76/885] 1890704=test_gem_source_installed I, [2024-05-24T14:32:08.966547 #1849325] INFO -- : [ 77/885] 1890702=test_x509ext I, [2024-05-24T14:32:08.972127 #1849325] INFO -- : [ 78/885] 1890702=test_erb I, [2024-05-24T14:32:08.977920 #1849325] INFO -- : [ 79/885] 1890701=test_gem_ext_builder I, [2024-05-24T14:32:09.003575 #1849325] INFO -- : [ 80/885] 1890693=test_https I, [2024-05-24T14:32:09.009425 #1849325] INFO -- : [ 81/885] 1890704=test_evaluation I, [2024-05-24T14:32:09.012704 #1849325] INFO -- : [ 82/885] 1890707=test_provider I, [2024-05-24T14:32:09.013621 #1849325] INFO -- : [ 83/885] 1890702=test_abi I, [2024-05-24T14:32:09.016824 #1849325] INFO -- : [ 84/885] 1890704=test_load I, [2024-05-24T14:32:09.022798 #1849325] INFO -- : [ 85/885] 1890704=test_gem_commands_rebuild_command I, [2024-05-24T14:32:09.039116 #1849325] INFO -- : [ 86/885] 1890694=test_yamldbm I, [2024-05-24T14:32:09.057019 #1849325] INFO -- : [ 87/885] 1890704=test_rdoc_parser_simple I, [2024-05-24T14:32:09.062883 #1849325] INFO -- : [ 88/885] 1890694=test_scalar_scanner I, [2024-05-24T14:32:09.071594 #1849325] INFO -- : [ 89/885] 1890694=test_gem_source I, [2024-05-24T14:32:09.159817 #1849325] INFO -- : [ 90/885] 1890708=test_array I, [2024-05-24T14:32:09.164133 #1849325] INFO -- : [ 91/885] 1890698=test_gem_package_tar_writer I, [2024-05-24T14:32:09.186535 #1849325] INFO -- : [ 92/885] 1890702=test_helper_method I, [2024-05-24T14:32:09.218871 #1849325] INFO -- : [ 93/885] 1890698=test_gem_commands_outdated_command I, [2024-05-24T14:32:09.220412 #1849325] INFO -- : [ 94/885] 1890704=test_benchmark I, [2024-05-24T14:32:09.257974 #1849325] INFO -- : [ 95/885] 1890698=test_gem_dependency_list I, [2024-05-24T14:32:09.273344 #1849325] INFO -- : [ 96/885] 1890702=test_nesting_parser I, [2024-05-24T14:32:09.291058 #1849325] INFO -- : [ 97/885] 1890702=test_win32ole_method_event I, [2024-05-24T14:32:09.295538 #1849325] INFO -- : [ 98/885] 1890702=test_stringify_symbols I, [2024-05-24T14:32:09.304050 #1849325] INFO -- : [ 99/885] 1890698=test_instrumentation_api I, [2024-05-24T14:32:09.308750 #1849325] INFO -- : [100/885] 1890702=integer_parse_test I, [2024-05-24T14:32:09.318606 #1849325] INFO -- : [101/885] 1890699=test_boolean I, [2024-05-24T14:32:09.325345 #1849325] INFO -- : [102/885] 1890707=test_whileuntil I, [2024-05-24T14:32:09.331433 #1849325] INFO -- : [103/885] 1890707=test_rdoc_generator_markup I, [2024-05-24T14:32:09.351892 #1849325] INFO -- : [104/885] 1890699=test_rubyvm I, [2024-05-24T14:32:09.352448 #1849325] INFO -- : [105/885] 1890699=test_configuration I, [2024-05-24T14:32:09.353970 #1849325] INFO -- : [106/885] 1890707=test_buffered_io I, [2024-05-24T14:32:09.356622 #1849325] INFO -- : [107/885] 1890702=test_monitor I, [2024-05-24T14:32:09.412932 #1849325] INFO -- : [108/885] 1890693=test_arith_seq_extract I, [2024-05-24T14:32:09.415235 #1849325] INFO -- : [109/885] 1890705=test_method_name_check I, [2024-05-24T14:32:09.425211 #1849325] INFO -- : [110/885] 1890707=test_parser I, [2024-05-24T14:32:09.439839 #1849325] INFO -- : [111/885] 1890707=test_module I, [2024-05-24T14:32:09.444260 #1849325] INFO -- : [112/885] 1890705=test_gem_request_set I, [2024-05-24T14:32:09.448124 #1849325] INFO -- : [113/885] 1890699=constant_path_node_test I, [2024-05-24T14:32:09.506923 #1849325] INFO -- : [114/885] 1890699=test_gem_ext_cargo_builder I, [2024-05-24T14:32:09.539347 #1849325] INFO -- : [115/885] 1890693=test_ssl I, [2024-05-24T14:32:09.545622 #1849325] INFO -- : [116/885] 1890694=test_notimplement I, [2024-05-24T14:32:09.553225 #1849325] INFO -- : [117/885] 1890694=test_random I, [2024-05-24T14:32:09.560051 #1849325] INFO -- : [118/885] 1890694=test_gem_uri I, [2024-05-24T14:32:09.562839 #1849325] INFO -- : [119/885] 1890702=test_key_event_record I, [2024-05-24T14:32:09.565871 #1849325] INFO -- : [120/885] 1890702=test_gem_resolver_vendor_specification I, [2024-05-24T14:32:09.584424 #1849325] INFO -- : [121/885] 1890694=test_gem_commands_update_command I, [2024-05-24T14:32:09.658450 #1849325] INFO -- : [122/885] 1890699=test_ssl_session I, [2024-05-24T14:32:09.670632 #1849325] INFO -- : [123/885] 1890706=test_thread_cv I, [2024-05-24T14:32:09.707394 #1849325] INFO -- : [124/885] 1890702=test_lexer I, [2024-05-24T14:32:09.710381 #1849325] INFO -- : [125/885] 1890697=test_unicode I, [2024-05-24T14:32:09.726298 #1849325] INFO -- : [126/885] 1890702=test_rdoc_parser_changelog I, [2024-05-24T14:32:09.752791 #1849325] INFO -- : [127/885] 1890697=test_enumerator I, [2024-05-24T14:32:09.758166 #1849325] INFO -- : [128/885] 1890697=test_koi8 I, [2024-05-24T14:32:09.765831 #1849325] INFO -- : [129/885] 1890697=parameters_signature_test I, [2024-05-24T14:32:09.788198 #1849325] INFO -- : [130/885] 1890705=test_rdoc_generator_pot I, [2024-05-24T14:32:09.799614 #1849325] INFO -- : [131/885] 1890702=static_literals_test I, [2024-05-24T14:32:09.803478 #1849325] INFO -- : [132/885] 1890702=test_data I, [2024-05-24T14:32:09.809787 #1849325] INFO -- : [133/885] 1890702=test_filter I, [2024-05-24T14:32:09.836854 #1849325] INFO -- : [134/885] 1890702=test_gem_gem_runner I, [2024-05-24T14:32:09.856888 #1849325] INFO -- : [135/885] 1890697=test_rdoc_method_attr I, [2024-05-24T14:32:09.886938 #1849325] INFO -- : [136/885] 1890702=test_addrinfo I, [2024-05-24T14:32:09.916252 #1849325] INFO -- : [137/885] 1890702=test_http I, [2024-05-24T14:32:09.940909 #1849325] INFO -- : [138/885] 1890701=test_tree_spell_checker I, [2024-05-24T14:32:09.975266 #1849325] INFO -- : [139/885] 1890701=redundant_return_test I, [2024-05-24T14:32:09.999027 #1849325] INFO -- : [140/885] 1890705=test_case_mapping I, [2024-05-24T14:32:10.007287 #1849325] INFO -- : [141/885] 1890705=test_path I, [2024-05-24T14:32:10.011913 #1849325] INFO -- : [142/885] 1890701=test_win32ole_param_event I, [2024-05-24T14:32:10.014043 #1849325] INFO -- : [143/885] 1890705=test_bn I, [2024-05-24T14:32:10.017102 #1849325] INFO -- : [144/885] 1890701=test_terminfo I, [2024-05-24T14:32:10.032536 #1849325] INFO -- : [145/885] 1890705=test_compile_prism I, [2024-05-24T14:32:10.056493 #1849325] INFO -- : [146/885] 1890701=test_rdoc_markup_to_html I, [2024-05-24T14:32:10.100316 #1849325] INFO -- : [147/885] 1890697=test_date_compat I, [2024-05-24T14:32:10.101803 #1849325] INFO -- : [148/885] 1890697=test_bug-14834 I, [2024-05-24T14:32:10.155146 #1849325] INFO -- : [149/885] 1890711=json_encoding_test I, [2024-05-24T14:32:10.163090 #1849325] INFO -- : [150/885] 1890697=test_color I, [2024-05-24T14:32:10.165209 #1849325] INFO -- : [151/885] 1890711=test_key_stroke I, [2024-05-24T14:32:10.174315 #1849325] INFO -- : [152/885] 1890700=test_rdoc_markup_to_label I, [2024-05-24T14:32:10.203567 #1849325] INFO -- : [153/885] 1890697=test_install I, [2024-05-24T14:32:10.232272 #1849325] INFO -- : [154/885] 1890711=test_sockopt I, [2024-05-24T14:32:10.234224 #1849325] INFO -- : [155/885] 1890701=test_set_len I, [2024-05-24T14:32:10.242911 #1849325] INFO -- : [156/885] 1890701=test_encoding I, [2024-05-24T14:32:10.246473 #1849325] INFO -- : [157/885] 1890711=test_httpresponses I, [2024-05-24T14:32:10.257651 #1849325] INFO -- : [158/885] 1890701=test_rdoc_ri_driver I, [2024-05-24T14:32:10.308332 #1849325] INFO -- : [159/885] 1890706=test_httpheader I, [2024-05-24T14:32:10.317312 #1849325] INFO -- : [160/885] 1890711=test_gem_resolver_local_specification I, [2024-05-24T14:32:10.355213 #1849325] INFO -- : [161/885] 1890706=test_rdoc_i18n_locale I, [2024-05-24T14:32:10.370576 #1849325] INFO -- : [162/885] 1890705=test_chilled I, [2024-05-24T14:32:10.374124 #1849325] INFO -- : [163/885] 1890705=test_name_error_extension I, [2024-05-24T14:32:10.375097 #1849325] INFO -- : [164/885] 1890706=test_pair I, [2024-05-24T14:32:10.379706 #1849325] INFO -- : [165/885] 1890700=test_win32ole_param I, [2024-05-24T14:32:10.380651 #1849325] INFO -- : [166/885] 1890705=test_gem_commands_yank_command I, [2024-05-24T14:32:10.381506 #1849325] INFO -- : [167/885] 1890697=test_acceptable I, [2024-05-24T14:32:10.382341 #1849325] INFO -- : [168/885] 1890700=test_rdoc_generator_pot_po_entry I, [2024-05-24T14:32:10.391240 #1849325] INFO -- : [169/885] 1890700=test_euc_jp I, [2024-05-24T14:32:10.395628 #1849325] INFO -- : [170/885] 1890700=test_document I, [2024-05-24T14:32:10.417829 #1849325] INFO -- : [171/885] 1890704=test_rbconfig I, [2024-05-24T14:32:10.418398 #1849325] INFO -- : [172/885] 1890700=test_human_typo I, [2024-05-24T14:32:10.424653 #1849325] INFO -- : [173/885] 1890704=test_primitive I, [2024-05-24T14:32:10.427314 #1849325] INFO -- : [174/885] 1890700=test_bundled_ca I, [2024-05-24T14:32:10.430671 #1849325] INFO -- : [175/885] 1890704=test_closure I, [2024-05-24T14:32:10.500060 #1849325] INFO -- : [176/885] 1890711=test_open3 I, [2024-05-24T14:32:10.526316 #1849325] INFO -- : [177/885] 1890697=test_multi_irb_commands I, [2024-05-24T14:32:10.526375 #1849325] INFO -- : [178/885] 1890697=test_fiber I, [2024-05-24T14:32:10.560102 #1849325] INFO -- : [179/885] 1890701=test_gem_security I, [2024-05-24T14:32:10.577170 #1849325] INFO -- : [180/885] 1890699=test_rdoc_servlet I, [2024-05-24T14:32:10.640577 #1849325] INFO -- : [181/885] 1890704=test_ractor I, [2024-05-24T14:32:10.662879 #1849325] INFO -- : [182/885] 1890703=test_digest I, [2024-05-24T14:32:10.683614 #1849325] INFO -- : [183/885] 1890703=test_exit I, [2024-05-24T14:32:10.713656 #1849325] INFO -- : [184/885] 1890704=test_recursion I, [2024-05-24T14:32:10.714237 #1849325] INFO -- : [185/885] 1890704=test_mkmf I, [2024-05-24T14:32:10.729905 #1849325] INFO -- : [186/885] 1890704=test_date_marshal I, [2024-05-24T14:32:10.739340 #1849325] INFO -- : [187/885] 1890704=test_history I, [2024-05-24T14:32:10.754896 #1849325] INFO -- : [188/885] 1890694=test_popen_deadlock I, [2024-05-24T14:32:10.775325 #1849325] INFO -- : [189/885] 1890703=test_delegate I, [2024-05-24T14:32:10.787224 #1849325] INFO -- : [190/885] 1890703=test_pinned I, [2024-05-24T14:32:10.810580 #1849325] INFO -- : [191/885] 1890704=test_stream I, [2024-05-24T14:32:10.816032 #1849325] INFO -- : [192/885] 1890703=test_to_ary_concat I, [2024-05-24T14:32:10.823206 #1849325] INFO -- : [193/885] 1890704=test_time I, [2024-05-24T14:32:10.862994 #1849325] INFO -- : [194/885] 1890705=test_webauthn_listener_response I, [2024-05-24T14:32:10.865747 #1849325] INFO -- : [195/885] 1890692=test_printf I, [2024-05-24T14:32:10.871106 #1849325] INFO -- : [196/885] 1890699=test_rdoc_markup_pre_process I, [2024-05-24T14:32:10.875404 #1849325] INFO -- : [197/885] 1890705=test_rdoc_markup_to_bs I, [2024-05-24T14:32:10.881036 #1849325] INFO -- : [198/885] 1890692=test_help I, [2024-05-24T14:32:10.890331 #1849325] INFO -- : [199/885] 1890692=test_beginendblock I, [2024-05-24T14:32:10.893828 #1849325] INFO -- : [200/885] 1890695=test_files_lib I, [2024-05-24T14:32:10.903063 #1849325] INFO -- : [201/885] 1890705=test_gem_commands_unpack_command I, [2024-05-24T14:32:10.930828 #1849325] INFO -- : [202/885] 1890699=reflection_test I, [2024-05-24T14:32:10.937198 #1849325] INFO -- : [203/885] 1890699=test_within_pipe I, [2024-05-24T14:32:11.006570 #1849325] INFO -- : [204/885] 1890699=test_emoji_breaks I, [2024-05-24T14:32:11.011559 #1849325] INFO -- : [205/885] 1890699=test_gem_bundler_version_finder I, [2024-05-24T14:32:11.024104 #1849325] INFO -- : [206/885] 1890704=test_scheduler I, [2024-05-24T14:32:11.034799 #1849325] INFO -- : [207/885] 1890699=test_pkey_dsa I, [2024-05-24T14:32:11.155574 #1849325] INFO -- : [208/885] 1890710=test_ocsp I, [2024-05-24T14:32:11.163355 #1849325] INFO -- : [209/885] 1890705=test_class I, [2024-05-24T14:32:11.166285 #1849325] INFO -- : [210/885] 1890709=test_rdoc_markup_heading I, [2024-05-24T14:32:11.167726 #1849325] INFO -- : [211/885] 1890705=test_exception_at_throwing I, [2024-05-24T14:32:11.178935 #1849325] INFO -- : [212/885] 1890704=test_iseq I, [2024-05-24T14:32:11.222403 #1849325] INFO -- : [213/885] 1890692=test_tracer I, [2024-05-24T14:32:11.228191 #1849325] INFO -- : [214/885] 1890705=test_cmethod I, [2024-05-24T14:32:11.232510 #1849325] INFO -- : [215/885] 1890705=test_option I, [2024-05-24T14:32:11.286157 #1849325] INFO -- : [216/885] 1890709=test_append I, [2024-05-24T14:32:11.293279 #1849325] INFO -- : [217/885] 1890709=test_gem_commands_server_command I, [2024-05-24T14:32:11.343634 #1849325] INFO -- : [218/885] 1890692=test_did_you_mean I, [2024-05-24T14:32:11.384266 #1849325] INFO -- : [219/885] 1890705=test_io_m17n I, [2024-05-24T14:32:11.417863 #1849325] INFO -- : [220/885] 1890694=test_variable_name_check I, [2024-05-24T14:32:11.442973 #1849325] INFO -- : [221/885] 1890694=test_case_comprehensive I, [2024-05-24T14:32:11.447014 #1849325] INFO -- : [222/885] 1890709=test_interned_str I, [2024-05-24T14:32:11.447940 #1849325] INFO -- : [223/885] 1890709=test_gem_commands_build_command I, [2024-05-24T14:32:11.464321 #1849325] INFO -- : [224/885] 1890707=test_webauthn_listener I, [2024-05-24T14:32:11.466594 #1849325] INFO -- : [225/885] 1890710=test_jaro_winkler I, [2024-05-24T14:32:11.476675 #1849325] INFO -- : [226/885] 1890710=test_random_formatter I, [2024-05-24T14:32:11.495007 #1849325] INFO -- : [227/885] 1890710=test_helper I, [2024-05-24T14:32:11.506004 #1849325] INFO -- : [228/885] 1890692=test_lambda I, [2024-05-24T14:32:11.557880 #1849325] INFO -- : [229/885] 1890692=test_ast I, [2024-05-24T14:32:11.583415 #1849325] INFO -- : [230/885] 1890710=test_gem_request_set_gem_dependency_api I, [2024-05-24T14:32:11.621084 #1849325] INFO -- : [231/885] 1890707=test_fips I, [2024-05-24T14:32:11.627562 #1849325] INFO -- : [232/885] 1890703=test_x509name I, [2024-05-24T14:32:11.636994 #1849325] INFO -- : [233/885] 1890703=test_update I, [2024-05-24T14:32:11.643772 #1849325] INFO -- : [234/885] 1890703=test_x509store I, [2024-05-24T14:32:11.658159 #1849325] INFO -- : [235/885] 1890699=test_rdoc_code_object I, [2024-05-24T14:32:11.680358 #1849325] INFO -- : [236/885] 1890709=json_generator_test I, [2024-05-24T14:32:11.772074 #1849325] INFO -- : [237/885] 1890709=test_eval I, [2024-05-24T14:32:11.791444 #1849325] INFO -- : [238/885] 1890708=test_transcode I, [2024-05-24T14:32:11.820966 #1849325] INFO -- : [239/885] 1890707=test_gem_resolver_api_set I, [2024-05-24T14:32:11.823798 #1849325] INFO -- : [240/885] 1890704=test_gem_safe_marshal I, [2024-05-24T14:32:11.830760 #1849325] INFO -- : [241/885] 1890696=test_enumerable I, [2024-05-24T14:32:11.857209 #1849325] INFO -- : [242/885] 1890696=test_gem_resolver_vendor_set I, [2024-05-24T14:32:11.875342 #1849325] INFO -- : [243/885] 1890707=test_config I, [2024-05-24T14:32:11.945847 #1849325] INFO -- : [244/885] 1890699=library_symbols_test I, [2024-05-24T14:32:11.951409 #1849325] INFO -- : [245/885] 1890699=test_addr I, [2024-05-24T14:32:11.969906 #1849325] INFO -- : [246/885] 1890710=test_locale I, [2024-05-24T14:32:11.975622 #1849325] INFO -- : [247/885] 1890699=test_ensured I, [2024-05-24T14:32:11.978002 #1849325] INFO -- : [248/885] 1890708=test_ts I, [2024-05-24T14:32:12.037774 #1849325] INFO -- : [249/885] 1890699=test_rdoc_ri_paths I, [2024-05-24T14:32:12.039332 #1849325] INFO -- : [250/885] 1890703=test_dup I, [2024-05-24T14:32:12.041657 #1849325] INFO -- : [251/885] 1890696=test_pty I, [2024-05-24T14:32:12.051341 #1849325] INFO -- : [252/885] 1890709=test_constant I, [2024-05-24T14:32:12.054879 #1849325] INFO -- : [253/885] 1890699=command_line_test I, [2024-05-24T14:32:12.061560 #1849325] INFO -- : [254/885] 1890699=test_range I, [2024-05-24T14:32:12.088582 #1849325] INFO -- : [255/885] 1890710=test_project_sanity I, [2024-05-24T14:32:12.130983 #1849325] INFO -- : [256/885] 1890710=test_encoding I, [2024-05-24T14:32:12.192905 #1849325] INFO -- : [257/885] 1890703=test_erb_command I, [2024-05-24T14:32:12.206285 #1849325] INFO -- : [258/885] 1890704=test_helper I, [2024-05-24T14:32:12.209506 #1849325] INFO -- : [259/885] 1890704=test_gem_uri_formatter I, [2024-05-24T14:32:12.218976 #1849325] INFO -- : [260/885] 1890703=static_inspect_test I, [2024-05-24T14:32:12.221472 #1849325] INFO -- : [261/885] 1890703=test_udp I, [2024-05-24T14:32:12.223221 #1849325] INFO -- : [262/885] 1890704=unescape_test I, [2024-05-24T14:32:12.228624 #1849325] INFO -- : [263/885] 1890703=test_ostruct I, [2024-05-24T14:32:12.260170 #1849325] INFO -- : [264/885] 1890698=test_force_exit I, [2024-05-24T14:32:12.266571 #1849325] INFO -- : [265/885] 1890700=test_file I, [2024-05-24T14:32:12.288467 #1849325] INFO -- : [266/885] 1890707=test_data_error I, [2024-05-24T14:32:12.341373 #1849325] INFO -- : [267/885] 1890703=bom_test I, [2024-05-24T14:32:12.346361 #1849325] INFO -- : [268/885] 1890703=test_tmpdir I, [2024-05-24T14:32:12.358087 #1849325] INFO -- : [269/885] 1890707=test_integer_comb I, [2024-05-24T14:32:12.368292 #1849325] INFO -- : [270/885] 1890710=test_rdoc_markup_document I, [2024-05-24T14:32:12.391845 #1849325] INFO -- : [271/885] 1890698=test_vm_dump I, [2024-05-24T14:32:12.392679 #1849325] INFO -- : [272/885] 1890698=test_regexp I, [2024-05-24T14:32:12.405484 #1849325] INFO -- : [273/885] 1890703=test_gem_commands_check_command I, [2024-05-24T14:32:12.429206 #1849325] INFO -- : [274/885] 1890703=errors_test I, [2024-05-24T14:32:12.469652 #1849325] INFO -- : [275/885] 1890696=test_tsort I, [2024-05-24T14:32:12.475360 #1849325] INFO -- : [276/885] 1890696=test_signedness I, [2024-05-24T14:32:12.526862 #1849325] INFO -- : [277/885] 1890703=test_rdoc_rd_block_parser I, [2024-05-24T14:32:12.535287 #1849325] INFO -- : [278/885] 1890710=test_big5 I, [2024-05-24T14:32:12.543303 #1849325] INFO -- : [279/885] 1890710=test_func I, [2024-05-24T14:32:12.566949 #1849325] INFO -- : [280/885] 1890708=test_pointer I, [2024-05-24T14:32:12.733822 #1849325] INFO -- : [281/885] 1890705=test_type I, [2024-05-24T14:32:12.739409 #1849325] INFO -- : [282/885] 1890705=test_ractor I, [2024-05-24T14:32:12.752344 #1849325] INFO -- : [283/885] 1890703=test_sleep I, [2024-05-24T14:32:12.763813 #1849325] INFO -- : [284/885] 1890699=test_gem_local_remote_options I, [2024-05-24T14:32:12.802905 #1849325] INFO -- : [285/885] 1890705=test_date_arith I, [2024-05-24T14:32:12.806031 #1849325] INFO -- : [286/885] 1890699=test_object I, [2024-05-24T14:32:12.815148 #1849325] INFO -- : [287/885] 1890705=test_ruby_lex I, [2024-05-24T14:32:12.927142 #1849325] INFO -- : [288/885] 1890708=test_normalize I, [2024-05-24T14:32:12.929646 #1849325] INFO -- : [289/885] 1890708=test_ossl I, [2024-05-24T14:32:12.985007 #1849325] INFO -- : [290/885] 1890711=test_timeout I, [2024-05-24T14:32:13.002258 #1849325] INFO -- : [291/885] 1890711=test_flip I, [2024-05-24T14:32:13.031334 #1849325] INFO -- : [292/885] 1890711=compiler_test I, [2024-05-24T14:32:13.058937 #1849325] INFO -- : [293/885] 1890704=test_change_word I, [2024-05-24T14:32:13.066662 #1849325] INFO -- : [294/885] 1890704=test_arithmetic_sequence I, [2024-05-24T14:32:13.072149 #1849325] INFO -- : [295/885] 1890704=test_gem_command_manager I, [2024-05-24T14:32:13.079405 #1849325] INFO -- : [296/885] 1890705=test_basicinstructions I, [2024-05-24T14:32:13.116702 #1849325] INFO -- : [297/885] 1890711=test_gem_gemcutter_utilities I, [2024-05-24T14:32:13.136775 #1849325] INFO -- : [298/885] 1890705=test_key_actor_emacs I, [2024-05-24T14:32:13.191696 #1849325] INFO -- : [299/885] 1890704=version_test I, [2024-05-24T14:32:13.192245 #1849325] INFO -- : [300/885] 1890704=test_object I, [2024-05-24T14:32:13.196739 #1849325] INFO -- : [301/885] 1890704=test_cgi_header I, [2024-05-24T14:32:13.202535 #1849325] INFO -- : [302/885] 1890704=heredoc_dedent_test I, [2024-05-24T14:32:13.208147 #1849325] INFO -- : [303/885] 1890704=test_rdoc_parser_markdown I, [2024-05-24T14:32:13.223514 #1849325] INFO -- : [304/885] 1890705=test_gem_resolver_lock_set I, [2024-05-24T14:32:13.225613 #1849325] INFO -- : [305/885] 1890704=test_not I, [2024-05-24T14:32:13.226014 #1849325] INFO -- : [306/885] 1890704=test_import I, [2024-05-24T14:32:13.238035 #1849325] INFO -- : [307/885] 1890699=test_logger I, [2024-05-24T14:32:13.244944 #1849325] INFO -- : [308/885] 1890705=test_files_test I, [2024-05-24T14:32:13.251268 #1849325] INFO -- : [309/885] 1890699=test_gem_update_suggestion I, [2024-05-24T14:32:13.285832 #1849325] INFO -- : [310/885] 1890695=test_file_exhaustive I, [2024-05-24T14:32:13.306280 #1849325] INFO -- : [311/885] 1890699=test_keyword I, [2024-05-24T14:32:13.352623 #1849325] INFO -- : [312/885] 1890705=test_class_name_check I, [2024-05-24T14:32:13.369237 #1849325] INFO -- : [313/885] 1890705=test_continuation I, [2024-05-24T14:32:13.374773 #1849325] INFO -- : [314/885] 1890705=test_fd_setsize I, [2024-05-24T14:32:13.375567 #1849325] INFO -- : [315/885] 1890705=test_win32ole_method I, [2024-05-24T14:32:13.383099 #1849325] INFO -- : [316/885] 1890705=test_delete I, [2024-05-24T14:32:13.390995 #1849325] INFO -- : [317/885] 1890705=test_gem_platform I, [2024-05-24T14:32:13.479535 #1849325] INFO -- : [318/885] 1890711=test_rdoc_markup_hard_break I, [2024-05-24T14:32:13.481381 #1849325] INFO -- : [319/885] 1890705=test_gem_package_task I, [2024-05-24T14:32:13.483636 #1849325] INFO -- : [320/885] 1890711=test_date_strptime I, [2024-05-24T14:32:13.486145 #1849325] INFO -- : [321/885] 1890705=test_placearg I, [2024-05-24T14:32:13.576270 #1849325] INFO -- : [322/885] 1890711=test_numhash I, [2024-05-24T14:32:13.580879 #1849325] INFO -- : [323/885] 1890711=test_gem_commands_push_command I, [2024-05-24T14:32:13.621542 #1849325] INFO -- : [324/885] 1890705=test_weakkeymap I, [2024-05-24T14:32:13.658641 #1849325] INFO -- : [325/885] 1890706=test_pkey_rsa I, [2024-05-24T14:32:13.672150 #1849325] INFO -- : [326/885] 1890699=test_context I, [2024-05-24T14:32:13.848604 #1849325] INFO -- : [327/885] 1890706=test_gem_commands_pristine_command I, [2024-05-24T14:32:13.853973 #1849325] INFO -- : [328/885] 1890699=test_nofree I, [2024-05-24T14:32:13.856672 #1849325] INFO -- : [329/885] 1890704=test_coder I, [2024-05-24T14:32:13.859431 #1849325] INFO -- : [330/885] 1890699=test_symbol I, [2024-05-24T14:32:13.866067 #1849325] INFO -- : [331/885] 1890704=test_find_executable I, [2024-05-24T14:32:13.867519 #1849325] INFO -- : [332/885] 1890705=ruby_api_test I, [2024-05-24T14:32:13.874270 #1849325] INFO -- : [333/885] 1890704=test_enc_associate I, [2024-05-24T14:32:14.001230 #1849325] INFO -- : [334/885] 1890705=test_lazy_enumerator I, [2024-05-24T14:32:14.056712 #1849325] INFO -- : [335/885] 1890707=test_unix I, [2024-05-24T14:32:14.060808 #1849325] INFO -- : [336/885] 1890710=test_arith_seq_beg_len_step I, [2024-05-24T14:32:14.078527 #1849325] INFO -- : [337/885] 1890707=test_gem_resolver_requirement_list I, [2024-05-24T14:32:14.092317 #1849325] INFO -- : [338/885] 1890707=test_pkcs7 I, [2024-05-24T14:32:14.102753 #1849325] INFO -- : [339/885] 1890710=test_function_entry I, [2024-05-24T14:32:14.105477 #1849325] INFO -- : [340/885] 1890710=test_http_request I, [2024-05-24T14:32:14.114179 #1849325] INFO -- : [341/885] 1890711=test_gem_source_fetch_problem I, [2024-05-24T14:32:14.124526 #1849325] INFO -- : [342/885] 1890711=json_generic_object_test I, [2024-05-24T14:32:14.136319 #1849325] INFO -- : [343/885] 1890711=test_rdoc_comment I, [2024-05-24T14:32:14.144254 #1849325] INFO -- : [344/885] 1890710=test_error_highlight I, [2024-05-24T14:32:14.193053 #1849325] INFO -- : [345/885] 1890711=test_resize I, [2024-05-24T14:32:14.203565 #1849325] INFO -- : [346/885] 1890711=test_rdoc_generator_darkfish I, [2024-05-24T14:32:14.254389 #1849325] INFO -- : [347/885] 1890704=test_mailto I, [2024-05-24T14:32:14.269637 #1849325] INFO -- : [348/885] 1890704=location_test I, [2024-05-24T14:32:14.271219 #1849325] INFO -- : [349/885] 1890707=test_symbol I, [2024-05-24T14:32:14.278948 #1849325] INFO -- : [350/885] 1890707=test_coderange I, [2024-05-24T14:32:14.280616 #1849325] INFO -- : [351/885] 1890705=test_date_ractor I, [2024-05-24T14:32:14.283057 #1849325] INFO -- : [352/885] 1890707=test_gem_console_ui I, [2024-05-24T14:32:14.289274 #1849325] INFO -- : [353/885] 1890707=format_errors_test I, [2024-05-24T14:32:14.292848 #1849325] INFO -- : [354/885] 1890707=test_dir I, [2024-05-24T14:32:14.306450 #1849325] INFO -- : [355/885] 1890704=test_eval I, [2024-05-24T14:32:14.306728 #1849325] INFO -- : [356/885] 1890704=test_autoconf I, [2024-05-24T14:32:14.312381 #1849325] INFO -- : [357/885] 1890704=test_ractor_compatibility I, [2024-05-24T14:32:14.323306 #1849325] INFO -- : [358/885] 1890709=test_cgi_multipart I, [2024-05-24T14:32:14.467106 #1849325] INFO -- : [359/885] 1890705=test_gem_commands_cleanup_command I, [2024-05-24T14:32:14.472995 #1849325] INFO -- : [360/885] 1890709=test_word I, [2024-05-24T14:32:14.474337 #1849325] INFO -- : [361/885] 1890709=test_member I, [2024-05-24T14:32:14.475582 #1849325] INFO -- : [362/885] 1890709=test_numeric I, [2024-05-24T14:32:14.481812 #1849325] INFO -- : [363/885] 1890709=test_gem_resolver_api_specification I, [2024-05-24T14:32:14.509498 #1849325] INFO -- : [364/885] 1890709=test_mixed_unicode_escapes I, [2024-05-24T14:32:14.514177 #1849325] INFO -- : [365/885] 1890709=test_history I, [2024-05-24T14:32:14.544233 #1849325] INFO -- : [366/885] 1890707=test_rdoc_markup_to_ansi I, [2024-05-24T14:32:14.562150 #1849325] INFO -- : [367/885] 1890711=test_ipaddr I, [2024-05-24T14:32:14.567805 #1849325] INFO -- : [368/885] 1890709=test_win32ole_variant I, [2024-05-24T14:32:14.571272 #1849325] INFO -- : [369/885] 1890709=test_rdoc_extend I, [2024-05-24T14:32:14.580375 #1849325] INFO -- : [370/885] 1890707=test_merge_keys I, [2024-05-24T14:32:14.589149 #1849325] INFO -- : [371/885] 1890711=test_gem_package I, [2024-05-24T14:32:14.594023 #1849325] INFO -- : [372/885] 1890707=test_complex2 I, [2024-05-24T14:32:14.604985 #1849325] INFO -- : [373/885] 1890707=test_resolve_symbol I, [2024-05-24T14:32:14.618909 #1849325] INFO -- : [374/885] 1890709=test_have_macro I, [2024-05-24T14:32:14.628183 #1849325] INFO -- : [375/885] 1890696=test_threadgroup I, [2024-05-24T14:32:14.652998 #1849325] INFO -- : [376/885] 1890710=test_enum I, [2024-05-24T14:32:14.662188 #1849325] INFO -- : [377/885] 1890704=test_gem_specification I, [2024-05-24T14:32:14.684492 #1849325] INFO -- : [378/885] 1890707=test_stringio I, [2024-05-24T14:32:14.799272 #1849325] INFO -- : [379/885] 1890705=test_arity I, [2024-05-24T14:32:14.800631 #1849325] INFO -- : [380/885] 1890705=test_io_wait_uncommon I, [2024-05-24T14:32:14.803169 #1849325] INFO -- : [381/885] 1890705=test_win32ole_variable I, [2024-05-24T14:32:14.805760 #1849325] INFO -- : [382/885] 1890705=test_rdoc_class_module I, [2024-05-24T14:32:14.833530 #1849325] INFO -- : [383/885] 1890707=test_bignum I, [2024-05-24T14:32:14.870036 #1849325] INFO -- : [384/885] 1890709=test_gem_ci_detector I, [2024-05-24T14:32:14.894593 #1849325] INFO -- : [385/885] 1890709=test_win32ole_event I, [2024-05-24T14:32:14.900007 #1849325] INFO -- : [386/885] 1890709=test_time_tz I, [2024-05-24T14:32:14.962953 #1849325] INFO -- : [387/885] 1890709=test_rdoc_generator_json_index I, [2024-05-24T14:32:14.989728 #1849325] INFO -- : [388/885] 1890709=test_trace I, [2024-05-24T14:32:15.003860 #1849325] INFO -- : [389/885] 1890709=ractor_test I, [2024-05-24T14:32:15.084471 #1849325] INFO -- : [390/885] 1890709=test_nonblock I, [2024-05-24T14:32:15.099888 #1849325] INFO -- : [391/885] 1890709=test_weakref I, [2024-05-24T14:32:15.129877 #1849325] INFO -- : [392/885] 1890706=test_marshal I, [2024-05-24T14:32:15.133521 #1849325] INFO -- : [393/885] 1890705=test_unicode_normalize I, [2024-05-24T14:32:15.243408 #1849325] INFO -- : [394/885] 1890709=test_timeout I, [2024-05-24T14:32:15.254422 #1849325] INFO -- : [395/885] 1890711=test_alias I, [2024-05-24T14:32:15.365449 #1849325] INFO -- : [396/885] 1890711=test_singleton_function I, [2024-05-24T14:32:15.372724 #1849325] INFO -- : [397/885] 1890711=test_ancdata I, [2024-05-24T14:32:15.373882 #1849325] INFO -- : [398/885] 1890711=test_reline_key I, [2024-05-24T14:32:15.379835 #1849325] INFO -- : [399/885] 1890711=test_rb_str_dup I, [2024-05-24T14:32:15.385542 #1849325] INFO -- : [400/885] 1890711=test_ssl I, [2024-05-24T14:32:15.414445 #1849325] INFO -- : [401/885] 1890710=test_ractor I, [2024-05-24T14:32:15.581592 #1849325] INFO -- : [402/885] 1890706=test_rendering I, [2024-05-24T14:32:15.587904 #1849325] INFO -- : [403/885] 1890706=test_debugger_integration I, [2024-05-24T14:32:15.595141 #1849325] INFO -- : [404/885] 1890706=test_my_integer I, [2024-05-24T14:32:15.598062 #1849325] INFO -- : [405/885] 1890706=test_thread I, [2024-05-24T14:32:15.629881 #1849325] INFO -- : [406/885] 1890696=json_ext_parser_test I, [2024-05-24T14:32:15.641061 #1849325] INFO -- : [407/885] 1890696=test_registry I, [2024-05-24T14:32:15.650000 #1849325] INFO -- : [408/885] 1890696=parse_stream_test I, [2024-05-24T14:32:15.685809 #1849325] INFO -- : [409/885] 1890710=test_ractor I, [2024-05-24T14:32:15.697961 #1849325] INFO -- : [410/885] 1890710=test_dns I, [2024-05-24T14:32:15.710403 #1849325] INFO -- : [411/885] 1890696=test_gem_commands_open_command I, [2024-05-24T14:32:15.763431 #1849325] INFO -- : [412/885] 1890696=test_gem I, [2024-05-24T14:32:15.832164 #1849325] INFO -- : [413/885] 1890711=test_gem_source_lock I, [2024-05-24T14:32:15.857650 #1849325] INFO -- : [414/885] 1890699=test_cgi_core I, [2024-05-24T14:32:15.875324 #1849325] INFO -- : [415/885] 1890711=test_parser I, [2024-05-24T14:32:15.877582 #1849325] INFO -- : [416/885] 1890699=test_gem_commands_setup_command I, [2024-05-24T14:32:15.886832 #1849325] INFO -- : [417/885] 1890711=test_rdoc_attr I, [2024-05-24T14:32:15.894706 #1849325] INFO -- : [418/885] 1890711=test_env I, [2024-05-24T14:32:15.931178 #1849325] INFO -- : [419/885] 1890709=test_integer I, [2024-05-24T14:32:15.982559 #1849325] INFO -- : [420/885] 1890709=desugar_compiler_test I, [2024-05-24T14:32:16.083986 #1849325] INFO -- : [421/885] 1890709=test_dryrun I, [2024-05-24T14:32:16.112730 #1849325] INFO -- : [422/885] 1890709=test_capacity I, [2024-05-24T14:32:16.119880 #1849325] INFO -- : [423/885] 1890709=test_nextafter I, [2024-05-24T14:32:16.143284 #1849325] INFO -- : [424/885] 1890710=test_have_func I, [2024-05-24T14:32:16.197221 #1849325] INFO -- : [425/885] 1890709=test_gem_request_set_lockfile_tokenizer I, [2024-05-24T14:32:16.250260 #1849325] INFO -- : [426/885] 1890699=test_stat I, [2024-05-24T14:32:16.254875 #1849325] INFO -- : [427/885] 1890709=test_gem_resolver_git_specification I, [2024-05-24T14:32:16.261494 #1849325] INFO -- : [428/885] 1890699=test_usrmarshal I, [2024-05-24T14:32:16.280009 #1849325] INFO -- : [429/885] 1890697=test_object_references I, [2024-05-24T14:32:16.315317 #1849325] INFO -- : [430/885] 1890697=test_integer I, [2024-05-24T14:32:16.428236 #1849325] INFO -- : [431/885] 1890709=test_cgi_modruby I, [2024-05-24T14:32:16.431504 #1849325] INFO -- : [432/885] 1890709=test_rubyoptions I, [2024-05-24T14:32:16.480581 #1849325] INFO -- : [433/885] 1890704=test_super I, [2024-05-24T14:32:16.506117 #1849325] INFO -- : [434/885] 1890699=test_rubygems I, [2024-05-24T14:32:16.697641 #1849325] INFO -- : [435/885] 1890699=test_call I, [2024-05-24T14:32:16.823369 #1849325] INFO -- : [436/885] 1890699=test_https_proxy I, [2024-05-24T14:32:16.849797 #1849325] INFO -- : [437/885] 1890699=test_rdoc_markup_to_table_of_contents I, [2024-05-24T14:32:16.869386 #1849325] INFO -- : [438/885] 1890699=test_objectspace I, [2024-05-24T14:32:17.140938 #1849325] INFO -- : [439/885] 1890693=test_thread I, [2024-05-24T14:32:17.236900 #1849325] INFO -- : [440/885] 1890701=test_socket I, [2024-05-24T14:32:17.305218 #1849325] INFO -- : [441/885] 1890704=test_literal I, [2024-05-24T14:32:17.364936 #1849325] INFO -- : [442/885] 1890707=test_dot_dot I, [2024-05-24T14:32:17.369246 #1849325] INFO -- : [443/885] 1890707=test_c_struct_builder I, [2024-05-24T14:32:17.372615 #1849325] INFO -- : [444/885] 1890693=test_str2big I, [2024-05-24T14:32:17.380083 #1849325] INFO -- : [445/885] 1890693=test_extlibs I, [2024-05-24T14:32:17.386047 #1849325] INFO -- : [446/885] 1890710=test_rdoc_generator_ri I, [2024-05-24T14:32:17.392176 #1849325] INFO -- : [447/885] 1890710=test_gem_stream_ui I, [2024-05-24T14:32:17.464302 #1849325] INFO -- : [448/885] 1890710=test_ractor I, [2024-05-24T14:32:17.476667 #1849325] INFO -- : [449/885] 1890710=test_severity I, [2024-05-24T14:32:17.481217 #1849325] INFO -- : [450/885] 1890707=test_gem_install_update_options I, [2024-05-24T14:32:17.489901 #1849325] INFO -- : [451/885] 1890710=parse_test I, [2024-05-24T14:32:17.627118 #1849325] INFO -- : [452/885] 1890707=test_require_lib I, [2024-05-24T14:32:17.753836 #1849325] INFO -- : [453/885] 1890703=test_ansi_with_terminfo I, [2024-05-24T14:32:17.772405 #1849325] INFO -- : [454/885] 1890696=test_rdoc_generator_pot_po I, [2024-05-24T14:32:17.775048 #1849325] INFO -- : [455/885] 1890704=test_json_tree I, [2024-05-24T14:32:17.789669 #1849325] INFO -- : [456/885] 1890704=test_rdoc_markup_to_markdown I, [2024-05-24T14:32:17.821761 #1849325] INFO -- : [457/885] 1890703=test_memory_view I, [2024-05-24T14:32:17.837513 #1849325] INFO -- : [458/885] 1890704=test_m17n_comb I, [2024-05-24T14:32:17.871302 #1849325] INFO -- : [459/885] 1890699=test_ractor I, [2024-05-24T14:32:17.889091 #1849325] INFO -- : [460/885] 1890696=test_cclass I, [2024-05-24T14:32:17.897809 #1849325] INFO -- : [461/885] 1890695=test_gem_version_option I, [2024-05-24T14:32:17.933680 #1849325] INFO -- : [462/885] 1890699=test_grapheme_breaks I, [2024-05-24T14:32:17.944570 #1849325] INFO -- : [463/885] 1890703=test_gem_request_connection_pools I, [2024-05-24T14:32:17.949289 #1849325] INFO -- : [464/885] 1890699=test_case I, [2024-05-24T14:32:17.949509 #1849325] INFO -- : [465/885] 1890699=test_pkey I, [2024-05-24T14:32:18.004317 #1849325] INFO -- : [466/885] 1890699=test_parser_events I, [2024-05-24T14:32:18.009979 #1849325] INFO -- : [467/885] 1890696=test_reline I, [2024-05-24T14:32:18.057958 #1849325] INFO -- : [468/885] 1890699=test_enumerator_kw I, [2024-05-24T14:32:18.059882 #1849325] INFO -- : [469/885] 1890695=test_settracefunc I, [2024-05-24T14:32:18.063038 #1849325] INFO -- : [470/885] 1890699=test_gem_text I, [2024-05-24T14:32:18.109741 #1849325] INFO -- : [471/885] 1890699=test_generic I, [2024-05-24T14:32:18.131714 #1849325] INFO -- : [472/885] 1890699=test_win32ole I, [2024-05-24T14:32:18.137436 #1849325] INFO -- : [473/885] 1890699=test_scan_args I, [2024-05-24T14:32:18.153128 #1849325] INFO -- : [474/885] 1890699=test_method_cache I, [2024-05-24T14:32:18.156681 #1849325] INFO -- : [475/885] 1890699=test_gem_request I, [2024-05-24T14:32:18.284392 #1849325] INFO -- : [476/885] 1890699=test_sprintf_comb I, [2024-05-24T14:32:18.321266 #1849325] INFO -- : [477/885] 1890700=test_gem_ext_cargo_builder_link_flag_converter I, [2024-05-24T14:32:18.332495 #1849325] INFO -- : [478/885] 1890696=test_gem_commands_mirror I, [2024-05-24T14:32:18.337640 #1849325] INFO -- : [479/885] 1890696=test_bug_reporter I, [2024-05-24T14:32:18.368901 #1849325] INFO -- : [480/885] 1890701=test_gem_package_tar_reader_entry I, [2024-05-24T14:32:18.372856 #1849325] INFO -- : [481/885] 1890700=test_gem_name_tuple I, [2024-05-24T14:32:18.384872 #1849325] INFO -- : [482/885] 1890700=test_rand I, [2024-05-24T14:32:18.404985 #1849325] INFO -- : [483/885] 1890699=test_exception I, [2024-05-24T14:32:18.543246 #1849325] INFO -- : [484/885] 1890701=test_case_options I, [2024-05-24T14:32:18.546404 #1849325] INFO -- : [485/885] 1890701=test_store I, [2024-05-24T14:32:18.612161 #1849325] INFO -- : [486/885] 1890700=test_rdoc_cross_reference I, [2024-05-24T14:32:18.703366 #1849325] INFO -- : [487/885] 1890711=test_gem_commands_info_command I, [2024-05-24T14:32:18.723867 #1849325] INFO -- : [488/885] 1890711=test_scalar I, [2024-05-24T14:32:18.727969 #1849325] INFO -- : [489/885] 1890711=test_gem_dependency_installer I, [2024-05-24T14:32:18.742245 #1849325] INFO -- : [490/885] 1890696=test_syntax I, [2024-05-24T14:32:18.749074 #1849325] INFO -- : [491/885] 1890701=test_gem_safe_yaml I, [2024-05-24T14:32:18.758008 #1849325] INFO -- : [492/885] 1890701=test_require I, [2024-05-24T14:32:18.761982 #1849325] INFO -- : [493/885] 1890701=test_rdoc_markup_to_joined_paragraph I, [2024-05-24T14:32:18.765007 #1849325] INFO -- : [494/885] 1890701=test_date_time I, [2024-05-24T14:32:18.777994 #1849325] INFO -- : [495/885] 1890701=test_date_new I, [2024-05-24T14:32:18.787614 #1849325] INFO -- : [496/885] 1890701=index_write_test I, [2024-05-24T14:32:18.792915 #1849325] INFO -- : [497/885] 1890701=test_data I, [2024-05-24T14:32:18.801304 #1849325] INFO -- : [498/885] 1890701=test_tcp I, [2024-05-24T14:32:18.840640 #1849325] INFO -- : [499/885] 1890701=test_iso_8859 I, [2024-05-24T14:32:18.875103 #1849325] INFO -- : [500/885] 1890701=test_rdoc_text I, [2024-05-24T14:32:18.909114 #1849325] INFO -- : [501/885] 1890695=test_rdoc_context I, [2024-05-24T14:32:18.922814 #1849325] INFO -- : [502/885] 1890701=test_nil2vtempty I, [2024-05-24T14:32:18.926099 #1849325] INFO -- : [503/885] 1890701=test_stream I, [2024-05-24T14:32:18.936871 #1849325] INFO -- : [504/885] 1890701=test_open-uri I, [2024-05-24T14:32:18.975127 #1849325] INFO -- : [505/885] 1890703=test_httpresponse I, [2024-05-24T14:32:19.000831 #1849325] INFO -- : [506/885] 1890697=test_rdoc_parser_ruby I, [2024-05-24T14:32:19.034220 #1849325] INFO -- : [507/885] 1890705=test_name_error I, [2024-05-24T14:32:19.042046 #1849325] INFO -- : [508/885] 1890703=test_rdoc_markup_attribute_manager I, [2024-05-24T14:32:19.081640 #1849325] INFO -- : [509/885] 1890703=test_gem_commands_dependency_command I, [2024-05-24T14:32:19.105326 #1849325] INFO -- : [510/885] 1890700=test_gem_resolver I, [2024-05-24T14:32:19.127984 #1849325] INFO -- : [511/885] 1890705=test_safe_load I, [2024-05-24T14:32:19.138919 #1849325] INFO -- : [512/885] 1890705=test_gem_resolver_composed_set I, [2024-05-24T14:32:19.163949 #1849325] INFO -- : [513/885] 1890705=test_gem_commands_specification_command I, [2024-05-24T14:32:19.174432 #1849325] INFO -- : [514/885] 1890703=test_http I, [2024-05-24T14:32:19.180690 #1849325] INFO -- : [515/885] 1890703=test_gem_commands_which_command I, [2024-05-24T14:32:19.192742 #1849325] INFO -- : [516/885] 1890693=test_shift_jis I, [2024-05-24T14:32:19.210647 #1849325] INFO -- : [517/885] 1890693=test_flags I, [2024-05-24T14:32:19.217511 #1849325] INFO -- : [518/885] 1890703=test_inadvertent_creation I, [2024-05-24T14:32:19.263847 #1849325] INFO -- : [519/885] 1890702=test_enumerator I, [2024-05-24T14:32:19.280326 #1849325] INFO -- : [520/885] 1890705=test_gem_resolver_lock_specification I, [2024-05-24T14:32:19.325094 #1849325] INFO -- : [521/885] 1890705=test_err_in_callback I, [2024-05-24T14:32:19.330304 #1849325] INFO -- : [522/885] 1890705=test_x509cert I, [2024-05-24T14:32:19.340614 #1849325] INFO -- : [523/885] 1890700=test_gc I, [2024-05-24T14:32:19.350023 #1849325] INFO -- : [524/885] 1890703=test_arity I, [2024-05-24T14:32:19.357579 #1849325] INFO -- : [525/885] 1890703=test_gem_ext_rake_builder I, [2024-05-24T14:32:19.393293 #1849325] INFO -- : [526/885] 1890701=test_logdevice I, [2024-05-24T14:32:19.455487 #1849325] INFO -- : [527/885] 1890697=test_gem_security_policy I, [2024-05-24T14:32:19.623483 #1849325] INFO -- : [528/885] 1890705=test_gem_source_local I, [2024-05-24T14:32:19.785117 #1849325] INFO -- : [529/885] 1890695=test_last_thread I, [2024-05-24T14:32:19.882997 #1849325] INFO -- : [530/885] 1890705=test_process I, [2024-05-24T14:32:19.955614 #1849325] INFO -- : [531/885] 1890697=test_pack I, [2024-05-24T14:32:20.189381 #1849325] INFO -- : [532/885] 1890703=test_passing_block I, [2024-05-24T14:32:20.191572 #1849325] INFO -- : [533/885] 1890703=test_thread_fd_close I, [2024-05-24T14:32:20.193180 #1849325] INFO -- : [534/885] 1890703=newline_test I, [2024-05-24T14:32:20.202961 #1849325] INFO -- : [535/885] 1890701=test_uncorrectable_name_check I, [2024-05-24T14:32:20.206625 #1849325] INFO -- : [536/885] 1890701=test_stringchar I, [2024-05-24T14:32:20.209437 #1849325] INFO -- : [537/885] 1890697=test_hash_create I, [2024-05-24T14:32:20.213219 #1849325] INFO -- : [538/885] 1890697=test_singleton I, [2024-05-24T14:32:20.221058 #1849325] INFO -- : [539/885] 1890697=test_flush I, [2024-05-24T14:32:20.225904 #1849325] INFO -- : [540/885] 1890697=test_io_console I, [2024-05-24T14:32:20.264651 #1849325] INFO -- : [541/885] 1890704=test_switch_hitter I, [2024-05-24T14:32:20.273784 #1849325] INFO -- : [542/885] 1890701=test_securerandom I, [2024-05-24T14:32:20.278009 #1849325] INFO -- : [543/885] 1890703=test_logperiod I, [2024-05-24T14:32:20.282785 #1849325] INFO -- : [544/885] 1890704=test_rdoc_markdown_test I, [2024-05-24T14:32:20.285494 #1849325] INFO -- : [545/885] 1890703=test_c_union_entity I, [2024-05-24T14:32:20.319512 #1849325] INFO -- : [546/885] 1890701=test_rdoc_normal_module I, [2024-05-24T14:32:20.335952 #1849325] INFO -- : [547/885] 1890703=test_iter_break I, [2024-05-24T14:32:20.340185 #1849325] INFO -- : [548/885] 1890703=test_zsh_completion I, [2024-05-24T14:32:20.343312 #1849325] INFO -- : [549/885] 1890703=test_exception I, [2024-05-24T14:32:20.349824 #1849325] INFO -- : [550/885] 1890693=test_num2int I, [2024-05-24T14:32:20.355137 #1849325] INFO -- : [551/885] 1890703=test_nil I, [2024-05-24T14:32:20.358046 #1849325] INFO -- : [552/885] 1890703=test_rdoc_single_class I, [2024-05-24T14:32:20.362419 #1849325] INFO -- : [553/885] 1890693=test_verbose I, [2024-05-24T14:32:20.371046 #1849325] INFO -- : [554/885] 1890703=test_gem_ext_configure_builder I, [2024-05-24T14:32:20.375811 #1849325] INFO -- : [555/885] 1890701=test_frozen I, [2024-05-24T14:32:20.381114 #1849325] INFO -- : [556/885] 1890701=test_pp I, [2024-05-24T14:32:20.384025 #1849325] INFO -- : [557/885] 1890693=test_macro I, [2024-05-24T14:32:20.390236 #1849325] INFO -- : [558/885] 1890703=test_config I, [2024-05-24T14:32:20.411274 #1849325] INFO -- : [559/885] 1890703=test_gem_source_list I, [2024-05-24T14:32:20.423594 #1849325] INFO -- : [560/885] 1890701=test_yaml_special_cases I, [2024-05-24T14:32:20.431326 #1849325] INFO -- : [561/885] 1890701=test_optarg I, [2024-05-24T14:32:20.456030 #1849325] INFO -- : [562/885] 1890703=test_rdoc_token_stream I, [2024-05-24T14:32:20.461772 #1849325] INFO -- : [563/885] 1890703=test_address_resolve I, [2024-05-24T14:32:20.463677 #1849325] INFO -- : [564/885] 1890693=test_bug-3571 I, [2024-05-24T14:32:20.470316 #1849325] INFO -- : [565/885] 1890703=test_key_actor_vi I, [2024-05-24T14:32:20.480800 #1849325] INFO -- : [566/885] 1890693=test_gem_command I, [2024-05-24T14:32:20.549484 #1849325] INFO -- : [567/885] 1890703=test_gem_spec_fetcher I, [2024-05-24T14:32:20.566681 #1849325] INFO -- : [568/885] 1890693=test_common I, [2024-05-24T14:32:20.573955 #1849325] INFO -- : [569/885] 1890701=test_numeric I, [2024-05-24T14:32:20.589774 #1849325] INFO -- : [570/885] 1890710=test_gem_commands_lock_command I, [2024-05-24T14:32:20.602184 #1849325] INFO -- : [571/885] 1890710=test_ifunless I, [2024-05-24T14:32:20.609750 #1849325] INFO -- : [572/885] 1890710=test_assignment I, [2024-05-24T14:32:20.642693 #1849325] INFO -- : [573/885] 1890701=test_rdoc_tom_doc I, [2024-05-24T14:32:20.658108 #1849325] INFO -- : [574/885] 1890701=test_hmac I, [2024-05-24T14:32:20.669053 #1849325] INFO -- : [575/885] 1890701=test_rdoc_markup_to_tt_only I, [2024-05-24T14:32:20.680263 #1849325] INFO -- : [576/885] 1890703=test_gem_ext_cargo_builder_unit I, [2024-05-24T14:32:20.700545 #1849325] INFO -- : [577/885] 1890701=test_date I, [2024-05-24T14:32:20.700984 #1849325] INFO -- : [578/885] 1890703=test_gem_rdoc I, [2024-05-24T14:32:20.712635 #1849325] INFO -- : [579/885] 1890701=test_command I, [2024-05-24T14:32:20.759959 #1849325] INFO -- : [580/885] 1890693=test_at_exit I, [2024-05-24T14:32:20.778056 #1849325] INFO -- : [581/885] 1890693=test_object_create_start I, [2024-05-24T14:32:20.781179 #1849325] INFO -- : [582/885] 1890693=!Nothing_to_test I, [2024-05-24T14:32:20.782739 #1849325] INFO -- : [583/885] 1890693=test_enc_raise I, [2024-05-24T14:32:20.787624 #1849325] INFO -- : [584/885] 1890693=test_psych I, [2024-05-24T14:32:20.800877 #1849325] INFO -- : [585/885] 1890703=test_rdoc_markup_paragraph I, [2024-05-24T14:32:20.807204 #1849325] INFO -- : [586/885] 1890693=test_kernel I, [2024-05-24T14:32:20.831996 #1849325] INFO -- : [587/885] 1890703=test_eval_history I, [2024-05-24T14:32:20.878340 #1849325] INFO -- : [588/885] 1890695=dispatcher_test I, [2024-05-24T14:32:20.893679 #1849325] INFO -- : [589/885] 1890703=test_gem_doctor I, [2024-05-24T14:32:20.928085 #1849325] INFO -- : [590/885] 1890703=test_kdf I, [2024-05-24T14:32:20.956498 #1849325] INFO -- : [591/885] 1890695=test_emitter I, [2024-05-24T14:32:20.966063 #1849325] INFO -- : [592/885] 1890711=test_gem_silent_ui I, [2024-05-24T14:32:20.979171 #1849325] INFO -- : [593/885] 1890695=test_files_ext I, [2024-05-24T14:32:20.981372 #1849325] INFO -- : [594/885] 1890695=test_bug-5832 I, [2024-05-24T14:32:20.991934 #1849325] INFO -- : [595/885] 1890695=test_gem_uninstaller I, [2024-05-24T14:32:20.994460 #1849325] INFO -- : [596/885] 1890711=test_gb18030 I, [2024-05-24T14:32:20.997777 #1849325] INFO -- : [597/885] 1890703=test_svcb_https I, [2024-05-24T14:32:21.002898 #1849325] INFO -- : [598/885] 1890711=test_buffering I, [2024-05-24T14:32:21.019917 #1849325] INFO -- : [599/885] 1890711=test_time I, [2024-05-24T14:32:21.021284 #1849325] INFO -- : [600/885] 1890703=test_windows_1251 I, [2024-05-24T14:32:21.021426 #1849325] INFO -- : [601/885] 1890701=test_rdoc_rdoc I, [2024-05-24T14:32:21.028123 #1849325] INFO -- : [602/885] 1890703=test_io_buffer I, [2024-05-24T14:32:21.090891 #1849325] INFO -- : [603/885] 1890701=test_backtrace I, [2024-05-24T14:32:21.094702 #1849325] INFO -- : [604/885] 1890703=test_defined I, [2024-05-24T14:32:21.095625 #1849325] INFO -- : [605/885] 1890701=test_key_name_check I, [2024-05-24T14:32:21.106034 #1849325] INFO -- : [606/885] 1890711=test_rdoc_i18n_text I, [2024-05-24T14:32:21.107971 #1849325] INFO -- : [607/885] 1890701=test_thread I, [2024-05-24T14:32:21.109455 #1849325] INFO -- : [608/885] 1890701=test_trick I, [2024-05-24T14:32:21.112151 #1849325] INFO -- : [609/885] 1890711=test_pipe I, [2024-05-24T14:32:21.156026 #1849325] INFO -- : [610/885] 1890703=test_pkey_ec I, [2024-05-24T14:32:21.164852 #1849325] INFO -- : [611/885] 1890708=test_date_parse I, [2024-05-24T14:32:21.170156 #1849325] INFO -- : [612/885] 1890707=test_rdoc_markup_attributes I, [2024-05-24T14:32:21.192205 #1849325] INFO -- : [613/885] 1890707=test_mul I, [2024-05-24T14:32:21.203959 #1849325] INFO -- : [614/885] 1890707=test_win32ole_type I, [2024-05-24T14:32:21.209384 #1849325] INFO -- : [615/885] 1890707=test_null I, [2024-05-24T14:32:21.209992 #1849325] INFO -- : [616/885] 1890707=test_default_gems I, [2024-05-24T14:32:21.231397 #1849325] INFO -- : [617/885] 1890699=test_rdoc_rd_inline_parser I, [2024-05-24T14:32:21.246361 #1849325] INFO -- : [618/885] 1890711=test_rdoc_markup_to_rdoc I, [2024-05-24T14:32:21.260951 #1849325] INFO -- : [619/885] 1890699=test_gem_dependency_resolution_error I, [2024-05-24T14:32:21.262982 #1849325] INFO -- : [620/885] 1890703=test_qsort I, [2024-05-24T14:32:21.267939 #1849325] INFO -- : [621/885] 1890699=test_rdoc_parser I, [2024-05-24T14:32:21.269089 #1849325] INFO -- : [622/885] 1890703=json_addition_test I, [2024-05-24T14:32:21.271708 #1849325] INFO -- : [623/885] 1890707=test_custom_command I, [2024-05-24T14:32:21.276748 #1849325] INFO -- : [624/885] 1890707=test_rdoc_store I, [2024-05-24T14:32:21.276816 #1849325] INFO -- : [625/885] 1890711=test_x509attr I, [2024-05-24T14:32:21.282206 #1849325] INFO -- : [626/885] 1890711=test_raise I, [2024-05-24T14:32:21.282648 #1849325] INFO -- : [627/885] 1890711=test_gem_request_set_lockfile_parser I, [2024-05-24T14:32:21.285801 #1849325] INFO -- : [628/885] 1890703=test_depth_first I, [2024-05-24T14:32:21.288339 #1849325] INFO -- : [629/885] 1890699=test_rdoc_stats I, [2024-05-24T14:32:21.288580 #1849325] INFO -- : [630/885] 1890703=test_pattern_matching I, [2024-05-24T14:32:21.292256 #1849325] INFO -- : [631/885] 1890708=test_string I, [2024-05-24T14:32:21.317364 #1849325] INFO -- : [632/885] 1890699=test_require_path_check I, [2024-05-24T14:32:21.332026 #1849325] INFO -- : [633/885] 1890708=test_rdoc_markup_parser I, [2024-05-24T14:32:21.336175 #1849325] INFO -- : [634/885] 1890703=test_folderitem2_invokeverb I, [2024-05-24T14:32:21.338755 #1849325] INFO -- : [635/885] 1890703=test_files_test_2 I, [2024-05-24T14:32:21.374556 #1849325] INFO -- : [636/885] 1890711=test_fnmatch I, [2024-05-24T14:32:21.385399 #1849325] INFO -- : [637/885] 1890699=test_gem_validator I, [2024-05-24T14:32:21.405523 #1849325] INFO -- : [638/885] 1890711=test_gc_compact I, [2024-05-24T14:32:21.406915 #1849325] INFO -- : [639/885] 1890699=test_string I, [2024-05-24T14:32:21.425606 #1849325] INFO -- : [640/885] 1890693=test_proc I, [2024-05-24T14:32:21.448619 #1849325] INFO -- : [641/885] 1890698=test_gem_package_old I, [2024-05-24T14:32:21.476288 #1849325] INFO -- : [642/885] 1890708=test_gem_resolver_index_set I, [2024-05-24T14:32:21.476878 #1849325] INFO -- : [643/885] 1890698=test_egrep_cpp I, [2024-05-24T14:32:21.629962 #1849325] INFO -- : [644/885] 1890708=test_cgi_tag_helper I, [2024-05-24T14:32:21.635112 #1849325] INFO -- : [645/885] 1890698=test_zlib I, [2024-05-24T14:32:21.647870 #1849325] INFO -- : [646/885] 1890708=test_date_conv I, [2024-05-24T14:32:21.652310 #1849325] INFO -- : [647/885] 1890708=test_optimization I, [2024-05-24T14:32:21.684027 #1849325] INFO -- : [648/885] 1890704=test_ole_methods I, [2024-05-24T14:32:21.693657 #1849325] INFO -- : [649/885] 1890704=test_erb_m17n I, [2024-05-24T14:32:21.697962 #1849325] INFO -- : [650/885] 1890704=test_convertible I, [2024-05-24T14:32:21.742012 #1849325] INFO -- : [651/885] 1890710=parser_test I, [2024-05-24T14:32:21.742561 #1849325] INFO -- : [652/885] 1890710=test_yield I, [2024-05-24T14:32:22.173749 #1849325] INFO -- : [653/885] 1890707=test_rdoc_alias I, [2024-05-24T14:32:22.174971 #1849325] INFO -- : [654/885] 1890695=test_files_sample I, [2024-05-24T14:32:22.184543 #1849325] INFO -- : [655/885] 1890695=test_stringscanner I, [2024-05-24T14:32:22.187399 #1849325] INFO -- : [656/885] 1890707=test_rdoc_markup_raw I, [2024-05-24T14:32:22.192160 #1849325] INFO -- : [657/885] 1890707=test_webauthn_poller I, [2024-05-24T14:32:22.216834 #1849325] INFO -- : [658/885] 1890695=test_rat I, [2024-05-24T14:32:22.240759 #1849325] INFO -- : [659/885] 1890695=test_gem_resolver_best_set I, [2024-05-24T14:32:22.304119 #1849325] INFO -- : [660/885] 1890695=encoding_test I, [2024-05-24T14:32:22.309230 #1849325] INFO -- : [661/885] 1890693=test_typeddata I, [2024-05-24T14:32:22.345668 #1849325] INFO -- : [662/885] 1890707=test_rdoc_markup_to_html_crossref I, [2024-05-24T14:32:22.385118 #1849325] INFO -- : [663/885] 1890695=test_fstring I, [2024-05-24T14:32:22.521441 #1849325] INFO -- : [664/885] 1890695=test_optparse I, [2024-05-24T14:32:22.578827 #1849325] INFO -- : [665/885] 1890693=test_array I, [2024-05-24T14:32:22.581924 #1849325] INFO -- : [666/885] 1890695=test_gem_commands_install_command I, [2024-05-24T14:32:22.587541 #1849325] INFO -- : [667/885] 1890693=test_clone I, [2024-05-24T14:32:22.745520 #1849325] INFO -- : [668/885] 1890707=test_readpartial I, [2024-05-24T14:32:22.807311 #1849325] INFO -- : [669/885] 1890693=locals_test I, [2024-05-24T14:32:22.950932 #1849325] INFO -- : [670/885] 1890697=test_rdoc_require I, [2024-05-24T14:32:22.966941 #1849325] INFO -- : [671/885] 1890697=test_rdoc_markup_indented_paragraph I, [2024-05-24T14:32:22.971051 #1849325] INFO -- : [672/885] 1890697=ruby_parser_test I, [2024-05-24T14:32:22.976916 #1849325] INFO -- : [673/885] 1890697=test_pack I, [2024-05-24T14:32:22.998053 #1849325] INFO -- : [674/885] 1890697=test_backtrace I, [2024-05-24T14:32:23.137343 #1849325] INFO -- : [675/885] 1890701=test_io_buffer I, [2024-05-24T14:32:23.147569 #1849325] INFO -- : [676/885] 1890707=test_rdoc_task I, [2024-05-24T14:32:23.153314 #1849325] INFO -- : [677/885] 1890707=test_gem_resolver_conflict I, [2024-05-24T14:32:23.168883 #1849325] INFO -- : [678/885] 1890707=test_face I, [2024-05-24T14:32:23.208377 #1849325] INFO -- : [679/885] 1890707=test_sizeof I, [2024-05-24T14:32:23.262066 #1849325] INFO -- : [680/885] 1890701=test_case I, [2024-05-24T14:32:23.286740 #1849325] INFO -- : [681/885] 1890701=test_rendering I, [2024-05-24T14:32:23.292104 #1849325] INFO -- : [682/885] 1890701=test_utf16 I, [2024-05-24T14:32:23.296569 #1849325] INFO -- : [683/885] 1890693=test_autoload I, [2024-05-24T14:32:23.309079 #1849325] INFO -- : [684/885] 1890701=test_unicode_escape I, [2024-05-24T14:32:23.411188 #1849325] INFO -- : [685/885] 1890701=test_io I, [2024-05-24T14:32:23.774691 #1849325] INFO -- : [686/885] 1890698=test_gem_commands_fetch_command I, [2024-05-24T14:32:23.900565 #1849325] INFO -- : [687/885] 1890698=test_math I, [2024-05-24T14:32:23.915302 #1849325] INFO -- : [688/885] 1890698=test_gc I, [2024-05-24T14:32:23.918581 #1849325] INFO -- : [689/885] 1890698=test_libs I, [2024-05-24T14:32:23.929440 #1849325] INFO -- : [690/885] 1890698=test_config I, [2024-05-24T14:32:23.962847 #1849325] INFO -- : [691/885] 1890698=test_sleep I, [2024-05-24T14:32:24.001871 #1849325] INFO -- : [692/885] 1890695=test_yaml_tree I, [2024-05-24T14:32:24.020685 #1849325] INFO -- : [693/885] 1890695=test_yjit_exit_locations I, [2024-05-24T14:32:24.025733 #1849325] INFO -- : [694/885] 1890695=test_etc I, [2024-05-24T14:32:24.094738 #1849325] INFO -- : [695/885] 1890695=test_ripper I, [2024-05-24T14:32:24.273574 #1849325] INFO -- : [696/885] 1890711=test_gem_config_file I, [2024-05-24T14:32:24.317400 #1849325] INFO -- : [697/885] 1890697=test_gem_resolver_activation_request I, [2024-05-24T14:32:24.324915 #1849325] INFO -- : [698/885] 1890697=test_getopts I, [2024-05-24T14:32:24.328399 #1849325] INFO -- : [699/885] 1890697=test_protocol I, [2024-05-24T14:32:24.377181 #1849325] INFO -- : [700/885] 1890710=test_pkey_dh I, [2024-05-24T14:32:24.404158 #1849325] INFO -- : [701/885] 1890711=test_bigzero I, [2024-05-24T14:32:24.409055 #1849325] INFO -- : [702/885] 1890711=test_gem_util I, [2024-05-24T14:32:24.434318 #1849325] INFO -- : [703/885] 1890695=test_iseq_load I, [2024-05-24T14:32:24.498124 #1849325] INFO -- : [704/885] 1890710=test_gem_package_tar_header I, [2024-05-24T14:32:24.506965 #1849325] INFO -- : [705/885] 1890703=test_pkcs12 I, [2024-05-24T14:32:24.555943 #1849325] INFO -- : [706/885] 1890710=test_system I, [2024-05-24T14:32:24.563337 #1849325] INFO -- : [707/885] 1890706=test_euc_kr I, [2024-05-24T14:32:24.590318 #1849325] INFO -- : [708/885] 1890706=test_rdoc_context_section I, [2024-05-24T14:32:24.595951 #1849325] INFO -- : [709/885] 1890706=test_ftp I, [2024-05-24T14:32:24.597199 #1849325] INFO -- : [710/885] 1890711=test_pack I, [2024-05-24T14:32:24.601246 #1849325] INFO -- : [711/885] 1890706=test_array_create I, [2024-05-24T14:32:24.604774 #1849325] INFO -- : [712/885] 1890706=test_gem_impossible_dependencies_error I, [2024-05-24T14:32:24.607299 #1849325] INFO -- : [713/885] 1890706=test_to_ruby I, [2024-05-24T14:32:24.623686 #1849325] INFO -- : [714/885] 1890706=test_pattern_key_name_check I, [2024-05-24T14:32:24.624948 #1849325] INFO -- : [715/885] 1890706=test_rdoc_rubygems_hook I, [2024-05-24T14:32:24.645647 #1849325] INFO -- : [716/885] 1890697=test_gem_commands_query_command I, [2024-05-24T14:32:24.728599 #1849325] INFO -- : [717/885] 1890706=test_method I, [2024-05-24T14:32:24.781942 #1849325] INFO -- : [718/885] 1890711=test_win32ole_record I, [2024-05-24T14:32:24.786098 #1849325] INFO -- : [719/885] 1890711=test_gem_unsatisfiable_dependency_error I, [2024-05-24T14:32:24.795646 #1849325] INFO -- : [720/885] 1890711=test_gem_commands_uninstall_command I, [2024-05-24T14:32:25.080323 #1849325] INFO -- : [721/885] 1890703=test_condition I, [2024-05-24T14:32:25.084413 #1849325] INFO -- : [722/885] 1890703=test_foreach I, [2024-05-24T14:32:25.085014 #1849325] INFO -- : [723/885] 1890703=test_gem_source_specific_file I, [2024-05-24T14:32:25.196405 #1849325] INFO -- : [724/885] 1890703=test_cp949 I, [2024-05-24T14:32:25.198179 #1849325] INFO -- : [725/885] 1890696=test_io I, [2024-05-24T14:32:25.202187 #1849325] INFO -- : [726/885] 1890703=test_hash I, [2024-05-24T14:32:25.231807 #1849325] INFO -- : [727/885] 1890697=test_ubf_async_safe I, [2024-05-24T14:32:25.241566 #1849325] INFO -- : [728/885] 1890697=test_sorted_set I, [2024-05-24T14:32:25.260926 #1849325] INFO -- : [729/885] 1890695=test_emoji I, [2024-05-24T14:32:25.293753 #1849325] INFO -- : [730/885] 1890695=test_win32ole_type_event I, [2024-05-24T14:32:25.296003 #1849325] INFO -- : [731/885] 1890695=test_kwargs I, [2024-05-24T14:32:25.309503 #1849325] INFO -- : [732/885] 1890695=warnings_test I, [2024-05-24T14:32:25.323095 #1849325] INFO -- : [733/885] 1890695=test_io_wait I, [2024-05-24T14:32:25.438582 #1849325] INFO -- : [734/885] 1890696=test_gem_commands_exec_command I, [2024-05-24T14:32:25.475139 #1849325] INFO -- : [735/885] 1890697=test_date_attr I, [2024-05-24T14:32:25.479335 #1849325] INFO -- : [736/885] 1890697=test_ellipsize I, [2024-05-24T14:32:25.492425 #1849325] INFO -- : [737/885] 1890697=test_summary I, [2024-05-24T14:32:25.569746 #1849325] INFO -- : [738/885] 1890710=test_console_attr I, [2024-05-24T14:32:25.570277 #1849325] INFO -- : [739/885] 1890697=test_type_completor I, [2024-05-24T14:32:25.588873 #1849325] INFO -- : [740/885] 1890710=test_argf I, [2024-05-24T14:32:25.593796 #1849325] INFO -- : [741/885] 1890697=test_kill_ring I, [2024-05-24T14:32:25.605574 #1849325] INFO -- : [742/885] 1890697=test_framework I, [2024-05-24T14:32:25.608499 #1849325] INFO -- : [743/885] 1890697=test_ns_spki I, [2024-05-24T14:32:25.633139 #1849325] INFO -- : [744/885] 1890697=test_yjit I, [2024-05-24T14:32:25.641020 #1849325] INFO -- : [745/885] 1890697=test_weakmap I, [2024-05-24T14:32:25.659388 #1849325] INFO -- : [746/885] 1890695=test_workspace I, [2024-05-24T14:32:25.768040 #1849325] INFO -- : [747/885] 1890711=test_gem_commands_environment_command I, [2024-05-24T14:32:25.805805 #1849325] INFO -- : [748/885] 1890709=test_m17n I, [2024-05-24T14:32:25.818119 #1849325] INFO -- : [749/885] 1890711=test_ws I, [2024-05-24T14:32:25.830030 #1849325] INFO -- : [750/885] 1890711=test_alias_and_anchor I, [2024-05-24T14:32:25.838022 #1849325] INFO -- : [751/885] 1890711=test_postponed_job I, [2024-05-24T14:32:25.851572 #1849325] INFO -- : [752/885] 1890695=test_external_new I, [2024-05-24T14:32:25.859273 #1849325] INFO -- : [753/885] 1890695=test_gem_resolver_dependency_request I, [2024-05-24T14:32:25.877893 #1849325] INFO -- : [754/885] 1890695=test_tree_builder I, [2024-05-24T14:32:25.886362 #1849325] INFO -- : [755/885] 1890695=test_hash I, [2024-05-24T14:32:25.889054 #1849325] INFO -- : [756/885] 1890709=test_protect I, [2024-05-24T14:32:25.896257 #1849325] INFO -- : [757/885] 1890709=test_win32ole_typelib I, [2024-05-24T14:32:25.901001 #1849325] INFO -- : [758/885] 1890695=test_gem_request_set_lockfile I, [2024-05-24T14:32:25.902271 #1849325] INFO -- : [759/885] 1890709=test_raise_exception I, [2024-05-24T14:32:26.021336 #1849325] INFO -- : [760/885] 1890698=test_have_library I, [2024-05-24T14:32:26.271041 #1849325] INFO -- : [761/885] 1890711=test_remote_fetch_error I, [2024-05-24T14:32:26.280295 #1849325] INFO -- : [762/885] 1890711=test_lock_native_thread I, [2024-05-24T14:32:26.285497 #1849325] INFO -- : [763/885] 1890695=test_c_struct_entry I, [2024-05-24T14:32:26.398317 #1849325] INFO -- : [764/885] 1890694=test_gem_commands_stale_command I, [2024-05-24T14:32:26.406035 #1849325] INFO -- : [765/885] 1890694=test_set I, [2024-05-24T14:32:26.410227 #1849325] INFO -- : [766/885] 1890694=test_show_source I, [2024-05-24T14:32:26.477988 #1849325] INFO -- : [767/885] 1890707=test_gem_security_trust_dir I, [2024-05-24T14:32:26.484151 #1849325] INFO -- : [768/885] 1890696=comments_test I, [2024-05-24T14:32:26.488455 #1849325] INFO -- : [769/885] 1890696=test_gem_requirement I, [2024-05-24T14:32:26.513131 #1849325] INFO -- : [770/885] 1890707=test_sprintf I, [2024-05-24T14:32:26.524093 #1849325] INFO -- : [771/885] 1890694=test_string_memory I, [2024-05-24T14:32:26.567929 #1849325] INFO -- : [772/885] 1890711=test_undef I, [2024-05-24T14:32:26.577339 #1849325] INFO -- : [773/885] 1890711=test_objspace I, [2024-05-24T14:32:26.581923 #1849325] INFO -- : [774/885] 1890695=ripper_test I, [2024-05-24T14:32:26.605783 #1849325] INFO -- : [775/885] 1890696=test_line_editor I, [2024-05-24T14:32:26.611052 #1849325] INFO -- : [776/885] 1890696=test_gem_remote_fetcher I, [2024-05-24T14:32:26.635538 #1849325] INFO -- : [777/885] 1890694=test_mdns I, [2024-05-24T14:32:26.652956 #1849325] INFO -- : [778/885] 1890709=test_parse I, [2024-05-24T14:32:26.655406 #1849325] INFO -- : [779/885] 1890694=test_gem_resolver_installed_specification I, [2024-05-24T14:32:26.678301 #1849325] INFO -- : [780/885] 1890694=test_scanner_events I, [2024-05-24T14:32:26.684657 #1849325] INFO -- : [781/885] 1890704=test_gem_commands_search_command I, [2024-05-24T14:32:26.693693 #1849325] INFO -- : [782/885] 1890704=test_complex I, [2024-05-24T14:32:26.723539 #1849325] INFO -- : [783/885] 1890694=test_gem_ext_ext_conf_builder I, [2024-05-24T14:32:26.728692 #1849325] INFO -- : [784/885] 1890707=test_method_cache I, [2024-05-24T14:32:26.732027 #1849325] INFO -- : [785/885] 1890707=test_gem_stub_specification I, [2024-05-24T14:32:26.771927 #1849325] INFO -- : [786/885] 1890700=test_frozen_error I, [2024-05-24T14:32:26.778209 #1849325] INFO -- : [787/885] 1890700=test_gem_resolver_specification I, [2024-05-24T14:32:26.818260 #1849325] INFO -- : [788/885] 1890700=test_gem_dependency I, [2024-05-24T14:32:26.819867 #1849325] INFO -- : [789/885] 1890704=test_path_to_class I, [2024-05-24T14:32:26.827849 #1849325] INFO -- : [790/885] 1890704=test_inlinecache I, [2024-05-24T14:32:26.889765 #1849325] INFO -- : [791/885] 1890707=test_rdoc_markup_verbatim I, [2024-05-24T14:32:26.893753 #1849325] INFO -- : [792/885] 1890707=test_rdoc_options I, [2024-05-24T14:32:26.908751 #1849325] INFO -- : [793/885] 1890704=test_econv I, [2024-05-24T14:32:26.974417 #1849325] INFO -- : [794/885] 1890700=test_cesu8 I, [2024-05-24T14:32:26.982939 #1849325] INFO -- : [795/885] 1890700=test_gem_version I, [2024-05-24T14:32:27.065955 #1849325] INFO -- : [796/885] 1890700=test_emitter I, [2024-05-24T14:32:27.074384 #1849325] INFO -- : [797/885] 1890700=test_gem_commands_signin_command I, [2024-05-24T14:32:27.147219 #1849325] INFO -- : [798/885] 1890707=test_resource I, [2024-05-24T14:32:27.152358 #1849325] INFO -- : [799/885] 1890707=test_ldap I, [2024-05-24T14:32:27.156847 #1849325] INFO -- : [800/885] 1890707=test_fileutils I, [2024-05-24T14:32:27.177528 #1849325] INFO -- : [801/885] 1890700=test_string_processing I, [2024-05-24T14:32:27.184244 #1849325] INFO -- : [802/885] 1890695=test_stack I, [2024-05-24T14:32:27.278770 #1849325] INFO -- : [803/885] 1890698=test_gem_commands_list_command I, [2024-05-24T14:32:27.286318 #1849325] INFO -- : [804/885] 1890700=test_reqarg I, [2024-05-24T14:32:27.293893 #1849325] INFO -- : [805/885] 1890698=test_rdoc_include I, [2024-05-24T14:32:27.324308 #1849325] INFO -- : [806/885] 1890709=test_too_many_dummy_encodings I, [2024-05-24T14:32:27.412566 #1849325] INFO -- : [807/885] 1890709=test_rdoc_markup I, [2024-05-24T14:32:27.421240 #1849325] INFO -- : [808/885] 1890709=test_gem_commands_help_command I, [2024-05-24T14:32:27.500445 #1849325] INFO -- : [809/885] 1890709=test_tracepoint I, [2024-05-24T14:32:27.554458 #1849325] INFO -- : [810/885] 1890698=test_prettyprint I, [2024-05-24T14:32:27.576668 #1849325] INFO -- : [811/885] 1890698=test_utf32 I, [2024-05-24T14:32:27.581417 #1849325] INFO -- : [812/885] 1890698=test_basicsocket I, [2024-05-24T14:32:27.602911 #1849325] INFO -- : [813/885] 1890707=test_duplicate I, [2024-05-24T14:32:27.607413 #1849325] INFO -- : [814/885] 1890698=test_gem_resolver_index_specification I, [2024-05-24T14:32:27.612734 #1849325] INFO -- : [815/885] 1890707=test_internal_ivar I, [2024-05-24T14:32:27.620884 #1849325] INFO -- : [816/885] 1890707=test_function I, [2024-05-24T14:32:27.661303 #1849325] INFO -- : [817/885] 1890698=test_queue I, [2024-05-24T14:32:27.671147 #1849325] INFO -- : [818/885] 1890698=test_noarg I, [2024-05-24T14:32:27.759673 #1849325] INFO -- : [819/885] 1890700=parse_comments_test I, [2024-05-24T14:32:27.777967 #1849325] INFO -- : [820/885] 1890700=test_tempfile I, [2024-05-24T14:32:27.828508 #1849325] INFO -- : [821/885] 1890709=test_random I, [2024-05-24T14:32:27.839191 #1849325] INFO -- : [822/885] 1890709=test_asn1 I, [2024-05-24T14:32:27.847339 #1849325] INFO -- : [823/885] 1890709=test_rdoc_normal_class I, [2024-05-24T14:32:27.862788 #1849325] INFO -- : [824/885] 1890698=test_class I, [2024-05-24T14:32:27.877060 #1849325] INFO -- : [825/885] 1890707=test_const I, [2024-05-24T14:32:27.884701 #1849325] INFO -- : [826/885] 1890707=json_string_matching_test I, [2024-05-24T14:32:27.891326 #1849325] INFO -- : [827/885] 1890707=test_load I, [2024-05-24T14:32:27.905880 #1849325] INFO -- : [828/885] 1890707=test_irb I, [2024-05-24T14:32:27.922908 #1849325] INFO -- : [829/885] 1890709=test_rdoc_parser_rd I, [2024-05-24T14:32:27.942087 #1849325] INFO -- : [830/885] 1890709=test_date_strftime I, [2024-05-24T14:32:27.995195 #1849325] INFO -- : [831/885] 1890694=test_gem_installer I, [2024-05-24T14:32:28.046544 #1849325] INFO -- : [832/885] 1890704=test_yamlstore I, [2024-05-24T14:32:28.086765 #1849325] INFO -- : [833/885] 1890704=test_formatter I, [2024-05-24T14:32:28.090095 #1849325] INFO -- : [834/885] 1890695=test_bash_completion I, [2024-05-24T14:32:28.091428 #1849325] INFO -- : [835/885] 1890700=test_deprecate I, [2024-05-24T14:32:28.094419 #1849325] INFO -- : [836/885] 1890704=test_rdoc_constant I, [2024-05-24T14:32:28.098850 #1849325] INFO -- : [837/885] 1890695=test_gem_source_vendor I, [2024-05-24T14:32:28.103713 #1849325] INFO -- : [838/885] 1890695=test_gem_commands_owner_command I, [2024-05-24T14:32:28.147410 #1849325] INFO -- : [839/885] 1890700=test_recorder I, [2024-05-24T14:32:28.158299 #1849325] INFO -- : [840/885] 1890700=test_init I, [2024-05-24T14:32:28.159928 #1849325] INFO -- : [841/885] 1890707=test_complexrational I, [2024-05-24T14:32:28.164469 #1849325] INFO -- : [842/885] 1890707=test_pathname I, [2024-05-24T14:32:28.220364 #1849325] INFO -- : [843/885] 1890704=test_coverage I, [2024-05-24T14:32:28.278033 #1849325] INFO -- : [844/885] 1890709=test_rdoc_encoding I, [2024-05-24T14:32:28.305016 #1849325] INFO -- : [845/885] 1890709=regexp_test I, [2024-05-24T14:32:28.319717 #1849325] INFO -- : [846/885] 1890709=test_gem_package_tar_reader I, [2024-05-24T14:32:28.332397 #1849325] INFO -- : [847/885] 1890707=test_file I, [2024-05-24T14:32:28.335173 #1849325] INFO -- : [848/885] 1890707=test_rdoc_markdown I, [2024-05-24T14:32:28.347761 #1849325] INFO -- : [849/885] 1890709=test_gem_available_set I, [2024-05-24T14:32:28.414272 #1849325] INFO -- : [850/885] 1890709=test_rdoc_any_method I, [2024-05-24T14:32:28.511863 #1849325] INFO -- : [851/885] 1890693=test_modify_expand I, [2024-05-24T14:32:28.514123 #1849325] INFO -- : [852/885] 1890693=test_wss I, [2024-05-24T14:32:28.520242 #1849325] INFO -- : [853/885] 1890693=test_fiddle I, [2024-05-24T14:32:28.567714 #1849325] INFO -- : [854/885] 1890707=test_find I, [2024-05-24T14:32:28.583552 #1849325] INFO -- : [855/885] 1890707=test_ractor I, [2024-05-24T14:32:28.618690 #1849325] INFO -- : [856/885] 1890693=test_digest I, [2024-05-24T14:32:28.636790 #1849325] INFO -- : [857/885] 1890700=test_marshalable I, [2024-05-24T14:32:28.645434 #1849325] INFO -- : [858/885] 1890700=test_cgi_util I, [2024-05-24T14:32:28.681422 #1849325] INFO -- : [859/885] 1890707=test_require I, [2024-05-24T14:32:28.693121 #1849325] INFO -- : [860/885] 1890709=test_gem_ext_cmake_builder I, [2024-05-24T14:32:28.712317 #1849325] INFO -- : [861/885] 1890695=test_gem_commands_contents_command I, [2024-05-24T14:32:28.713860 #1849325] INFO -- : [862/885] 1890709=test_enc_str_buf_cat I, [2024-05-24T14:32:28.721478 #1849325] INFO -- : [863/885] 1890709=test_gbk I, [2024-05-24T14:32:28.723458 #1849325] INFO -- : [864/885] 1890709=test_class2name I, [2024-05-24T14:32:28.730300 #1849325] INFO -- : [865/885] 1890696=test_profile_frames I, [2024-05-24T14:32:28.732685 #1849325] INFO -- : [866/885] 1890709=test_pstore I, [2024-05-24T14:32:28.786669 #1849325] INFO -- : [867/885] 1890709=test_cstr I, [2024-05-24T14:32:28.799868 #1849325] INFO -- : [868/885] 1890695=test_shapes I, [2024-05-24T14:32:28.800013 #1849325] INFO -- : [869/885] 1890695=json_fixtures_test I, [2024-05-24T14:32:28.809219 #1849325] INFO -- : [870/885] 1890695=test_io_timeout I, [2024-05-24T14:32:28.815864 #1849325] INFO -- : [871/885] 1890695=test_rdoc_parser_c I, [2024-05-24T14:32:28.824575 #1849325] INFO -- : [872/885] 1890706=test_comparable I, [2024-05-24T14:32:28.830636 #1849325] INFO -- : [873/885] 1890706=test_rdoc_markup_formatter I, [2024-05-24T14:32:28.838323 #1849325] INFO -- : [874/885] 1890706=test_nowrite I, [2024-05-24T14:32:28.860036 #1849325] INFO -- : [875/885] 1890700=test_thread_queue I, [2024-05-24T14:32:28.862754 #1849325] INFO -- : [876/885] 1890706=test_ansi_without_terminfo I, [2024-05-24T14:32:28.893226 #1849325] INFO -- : [877/885] 1890706=test_gem_commands_sources_command I, [2024-05-24T14:32:28.903972 #1849325] INFO -- : [878/885] 1890696=test_bmethod I, [2024-05-24T14:32:28.908391 #1849325] INFO -- : [879/885] 1890696=test_ractor I, [2024-05-24T14:32:28.927469 #1849325] INFO -- : [880/885] 1890696=test_euc_tw I, [2024-05-24T14:32:28.931668 #1849325] INFO -- : [881/885] 1890696=test_big2str I, [2024-05-24T14:32:28.936115 #1849325] INFO -- : [882/885] 1890696=test_wait I, [2024-05-24T14:32:29.001230 #1849325] INFO -- : [883/885] 1890696=test_handle I, [2024-05-24T14:32:29.005193 #1849325] INFO -- : [884/885] 1890706=test_yaml I, [2024-05-24T14:32:29.050100 #1849325] INFO -- : [885/885] 1890695=test_forwardable I, [2024-05-24T14:32:41.130494 #1849325] INFO -- : Finished tests in 32.711043s, 807.4643 tests/s, 285930.2585 assertions/s. I, [2024-05-24T14:32:41.131241 #1849325] INFO -- : 26413 tests, 9353077 assertions, 0 failures, 0 errors, 306 skips I, [2024-05-24T14:32:41.131249 #1849325] INFO -- : I, [2024-05-24T14:32:41.131254 #1849325] INFO -- : ruby -v: ruby 3.4.0dev (2024-05-24T08:00:15Z master e49d68bf27) [x86_64-linux] I, [2024-05-24T14:32:41.133362 #1849325] INFO -- : $$$[end] "make yes-test-all TESTOPTS='--stderr-on-failure' TESTS='-j20'" exit with 0. I, [2024-05-24T14:32:41.133522 #1849325] INFO -- : $$$[beg] make yes-test-rubyspec MSPECOPT='--error-output stderr --debug -j' TESTS='-j20' I, [2024-05-24T14:32:41.221553 #1849325] INFO -- : BASERUBY = /usr/bin/ruby --disable=gems I, [2024-05-24T14:32:41.221596 #1849325] INFO -- : CC = gcc I, [2024-05-24T14:32:41.221603 #1849325] INFO -- : LD = ld I, [2024-05-24T14:32:41.221609 #1849325] INFO -- : LDSHARED = gcc -shared I, [2024-05-24T14:32:41.221619 #1849325] INFO -- : CFLAGS = -O3 -fno-fast-math -ggdb3 -Wall -Wextra -Wdeprecated-declarations -Wdiv-by-zero -Wduplicated-cond -Wimplicit-function-declaration -Wimplicit-int -Wpointer-arith -Wwrite-strings -Wold-style-definition -Wimplicit-fallthrough=0 -Wmissing-noreturn -Wno-cast-function-type -Wno-constant-logical-operand -Wno-long-long -Wno-missing-field-initializers -Wno-overlength-strings -Wno-packed-bitfield-compat -Wno-parentheses-equality -Wno-self-assign -Wno-tautological-compare -Wno-unused-parameter -Wno-unused-value -Wsuggest-attribute=format -Wsuggest-attribute=noreturn -Wunused-variable -Wmisleading-indentation -Wundef -fPIC I, [2024-05-24T14:32:41.221625 #1849325] INFO -- : XCFLAGS = -U_FORTIFY_SOURCE -D_FORTIFY_SOURCE=2 -fstack-protector-strong -fno-strict-overflow -fvisibility=hidden -fexcess-precision=standard -DRUBY_EXPORT -I. -I.ext/include/x86_64-linux -I/tmp/ruby/src/trunk/include -I/tmp/ruby/src/trunk -I/tmp/ruby/src/trunk/prism -I/tmp/ruby/src/trunk/enc/unicode/15.0.0 I, [2024-05-24T14:32:41.221630 #1849325] INFO -- : CPPFLAGS = I, [2024-05-24T14:32:41.221636 #1849325] INFO -- : DLDFLAGS = -Wl,--compress-debug-sections=zlib -Wl,-soname,libruby.so.3.4 -fstack-protector-strong I, [2024-05-24T14:32:41.221641 #1849325] INFO -- : SOLIBS = -lz -lrt -lrt -lgmp -ldl -lcrypt -lm -lpthread I, [2024-05-24T14:32:41.221646 #1849325] INFO -- : LANG = en_US.UTF-8 I, [2024-05-24T14:32:41.221651 #1849325] INFO -- : LC_ALL = I, [2024-05-24T14:32:41.221657 #1849325] INFO -- : LC_CTYPE = I, [2024-05-24T14:32:41.221661 #1849325] INFO -- : MFLAGS = I, [2024-05-24T14:32:41.221666 #1849325] INFO -- : RUSTC = no I, [2024-05-24T14:32:41.221671 #1849325] INFO -- : YJIT_RUSTC_ARGS = --crate-name=yjit --crate-type=staticlib --edition=2021 -g -C lto=thin -C opt-level=3 -C overflow-checks=on '--out-dir=/tmp/ruby/build/trunk/yjit/target/release/' /tmp/ruby/src/trunk/yjit/src/lib.rs I, [2024-05-24T14:32:41.222218 #1849325] INFO -- : gcc (Ubuntu 11.4.0-1ubuntu1~22.04) 11.4.0 I, [2024-05-24T14:32:41.222245 #1849325] INFO -- : Copyright (C) 2021 Free Software Foundation, Inc. I, [2024-05-24T14:32:41.222252 #1849325] INFO -- : This is free software; see the source for copying conditions. There is NO I, [2024-05-24T14:32:41.222258 #1849325] INFO -- : warranty; not even for MERCHANTABILITY or FITNESS FOR A PARTICULAR PURPOSE. I, [2024-05-24T14:32:41.222263 #1849325] INFO -- : I, [2024-05-24T14:32:41.224062 #1849325] INFO -- : generating enc.mk I, [2024-05-24T14:32:41.343259 #1849325] INFO -- : generating encdb.h I, [2024-05-24T14:32:41.367094 #1849325] INFO -- : encdb.h unchanged I, [2024-05-24T14:32:41.368224 #1849325] INFO -- : making enc I, [2024-05-24T14:32:41.386229 #1849325] INFO -- : make[1]: Entering directory '/tmp/ruby/build/trunk' I, [2024-05-24T14:32:41.386283 #1849325] INFO -- : make[1]: Nothing to be done for 'enc'. I, [2024-05-24T14:32:41.386296 #1849325] INFO -- : make[1]: Leaving directory '/tmp/ruby/build/trunk' I, [2024-05-24T14:32:41.386983 #1849325] INFO -- : making srcs under enc I, [2024-05-24T14:32:41.419506 #1849325] INFO -- : make[1]: Entering directory '/tmp/ruby/build/trunk' I, [2024-05-24T14:32:41.419564 #1849325] INFO -- : make[1]: Nothing to be done for 'srcs'. I, [2024-05-24T14:32:41.419578 #1849325] INFO -- : make[1]: Leaving directory '/tmp/ruby/build/trunk' I, [2024-05-24T14:32:41.420313 #1849325] INFO -- : generating transdb.h I, [2024-05-24T14:32:41.516962 #1849325] INFO -- : transdb.h unchanged I, [2024-05-24T14:32:41.518308 #1849325] INFO -- : making trans I, [2024-05-24T14:32:41.552211 #1849325] INFO -- : make[1]: Entering directory '/tmp/ruby/build/trunk' I, [2024-05-24T14:32:41.552290 #1849325] INFO -- : make[1]: Nothing to be done for 'trans'. I, [2024-05-24T14:32:41.552307 #1849325] INFO -- : make[1]: Leaving directory '/tmp/ruby/build/trunk' I, [2024-05-24T14:32:41.553047 #1849325] INFO -- : making encs I, [2024-05-24T14:32:41.591821 #1849325] INFO -- : make[1]: Entering directory '/tmp/ruby/build/trunk' I, [2024-05-24T14:32:41.591883 #1849325] INFO -- : make[1]: Nothing to be done for 'encs'. I, [2024-05-24T14:32:41.591895 #1849325] INFO -- : make[1]: Leaving directory '/tmp/ruby/build/trunk' I, [2024-05-24T14:32:41.593553 #1849325] INFO -- : generating makefiles ext/configure-ext.mk I, [2024-05-24T14:32:41.620303 #1849325] INFO -- : ext/configure-ext.mk updated I, [2024-05-24T14:32:41.622796 #1849325] INFO -- : make[1]: Entering directory '/tmp/ruby/build/trunk' I, [2024-05-24T14:32:43.018833 #1849325] INFO -- : make[1]: Leaving directory '/tmp/ruby/build/trunk' I, [2024-05-24T14:32:43.019532 #1849325] INFO -- : generating makefile exts.mk I, [2024-05-24T14:32:43.056042 #1849325] INFO -- : exts.mk unchanged I, [2024-05-24T14:32:43.060583 #1849325] INFO -- : make[1]: Entering directory '/tmp/ruby/build/trunk' I, [2024-05-24T14:32:43.393870 #1849325] INFO -- : make[2]: Entering directory '/tmp/ruby/build/trunk/ext/coverage' I, [2024-05-24T14:32:43.398892 #1849325] INFO -- : make[2]: Leaving directory '/tmp/ruby/build/trunk/ext/coverage' I, [2024-05-24T14:32:43.405483 #1849325] INFO -- : make[2]: Entering directory '/tmp/ruby/build/trunk/ext/date' I, [2024-05-24T14:32:43.410625 #1849325] INFO -- : make[2]: Leaving directory '/tmp/ruby/build/trunk/ext/date' I, [2024-05-24T14:32:43.414726 #1849325] INFO -- : make[2]: Entering directory '/tmp/ruby/build/trunk/ext/digest' I, [2024-05-24T14:32:43.424061 #1849325] INFO -- : make[2]: Leaving directory '/tmp/ruby/build/trunk/ext/digest' I, [2024-05-24T14:32:43.450320 #1849325] INFO -- : make[2]: Entering directory '/tmp/ruby/build/trunk/ext/digest/sha2' I, [2024-05-24T14:32:43.455176 #1849325] INFO -- : make[2]: Leaving directory '/tmp/ruby/build/trunk/ext/digest/sha2' I, [2024-05-24T14:32:43.476692 #1849325] INFO -- : make[2]: Entering directory '/tmp/ruby/build/trunk/ext/fiddle' I, [2024-05-24T14:32:43.487363 #1849325] INFO -- : make[2]: Leaving directory '/tmp/ruby/build/trunk/ext/fiddle' I, [2024-05-24T14:32:43.492355 #1849325] INFO -- : make[2]: Entering directory '/tmp/ruby/build/trunk/ext/io/console' I, [2024-05-24T14:32:43.496568 #1849325] INFO -- : make[2]: Leaving directory '/tmp/ruby/build/trunk/ext/io/console' I, [2024-05-24T14:32:43.509579 #1849325] INFO -- : make[2]: Entering directory '/tmp/ruby/build/trunk/ext/json' I, [2024-05-24T14:32:43.519989 #1849325] INFO -- : make[2]: Leaving directory '/tmp/ruby/build/trunk/ext/json' I, [2024-05-24T14:32:43.534878 #1849325] INFO -- : make[2]: Entering directory '/tmp/ruby/build/trunk/ext/monitor' I, [2024-05-24T14:32:43.538486 #1849325] INFO -- : make[2]: Leaving directory '/tmp/ruby/build/trunk/ext/monitor' I, [2024-05-24T14:32:43.545689 #1849325] INFO -- : make[2]: Entering directory '/tmp/ruby/build/trunk/ext/objspace' I, [2024-05-24T14:32:43.551026 #1849325] INFO -- : make[2]: Leaving directory '/tmp/ruby/build/trunk/ext/objspace' I, [2024-05-24T14:32:43.571608 #1849325] INFO -- : make[2]: Entering directory '/tmp/ruby/build/trunk/ext/openssl' I, [2024-05-24T14:32:43.592018 #1849325] INFO -- : make[2]: Leaving directory '/tmp/ruby/build/trunk/ext/openssl' I, [2024-05-24T14:32:43.594827 #1849325] INFO -- : make[2]: Entering directory '/tmp/ruby/build/trunk/ext/pathname' I, [2024-05-24T14:32:43.597808 #1849325] INFO -- : make[2]: Leaving directory '/tmp/ruby/build/trunk/ext/pathname' I, [2024-05-24T14:32:43.603295 #1849325] INFO -- : make[2]: Entering directory '/tmp/ruby/build/trunk/ext/psych' I, [2024-05-24T14:32:43.618043 #1849325] INFO -- : make[2]: Leaving directory '/tmp/ruby/build/trunk/ext/psych' I, [2024-05-24T14:32:43.621189 #1849325] INFO -- : make[2]: Entering directory '/tmp/ruby/build/trunk/ext/pty' I, [2024-05-24T14:32:43.623794 #1849325] INFO -- : make[2]: Leaving directory '/tmp/ruby/build/trunk/ext/pty' I, [2024-05-24T14:32:43.633646 #1849325] INFO -- : make[2]: Entering directory '/tmp/ruby/build/trunk/ext/ripper' I, [2024-05-24T14:32:43.641724 #1849325] INFO -- : make[2]: Leaving directory '/tmp/ruby/build/trunk/ext/ripper' I, [2024-05-24T14:32:43.644296 #1849325] INFO -- : make[2]: Entering directory '/tmp/ruby/build/trunk/ext/rubyvm' I, [2024-05-24T14:32:43.647636 #1849325] INFO -- : make[2]: Leaving directory '/tmp/ruby/build/trunk/ext/rubyvm' I, [2024-05-24T14:32:43.660057 #1849325] INFO -- : make[2]: Entering directory '/tmp/ruby/build/trunk/ext/socket' I, [2024-05-24T14:32:43.668490 #1849325] INFO -- : make[2]: Leaving directory '/tmp/ruby/build/trunk/ext/socket' I, [2024-05-24T14:32:43.686853 #1849325] INFO -- : make[2]: Entering directory '/tmp/ruby/build/trunk/.bundle/gems/bigdecimal-3.1.8/ext/bigdecimal' I, [2024-05-24T14:32:43.712341 #1849325] INFO -- : make[2]: Leaving directory '/tmp/ruby/build/trunk/.bundle/gems/bigdecimal-3.1.8/ext/bigdecimal' I, [2024-05-24T14:32:43.714367 #1849325] INFO -- : make[2]: Entering directory '/tmp/ruby/build/trunk/.bundle/gems/debug-1.9.2/ext/debug' I, [2024-05-24T14:32:43.735963 #1849325] INFO -- : make[2]: Leaving directory '/tmp/ruby/build/trunk/.bundle/gems/debug-1.9.2/ext/debug' I, [2024-05-24T14:32:43.737832 #1849325] INFO -- : make[2]: Entering directory '/tmp/ruby/build/trunk/.bundle/gems/nkf-0.2.0/ext/nkf' I, [2024-05-24T14:32:43.759996 #1849325] INFO -- : make[2]: Leaving directory '/tmp/ruby/build/trunk/.bundle/gems/nkf-0.2.0/ext/nkf' I, [2024-05-24T14:32:43.761864 #1849325] INFO -- : make[2]: Entering directory '/tmp/ruby/build/trunk/.bundle/gems/racc-1.7.3/ext/racc/cparse' I, [2024-05-24T14:32:43.783372 #1849325] INFO -- : make[2]: Leaving directory '/tmp/ruby/build/trunk/.bundle/gems/racc-1.7.3/ext/racc/cparse' I, [2024-05-24T14:32:43.785348 #1849325] INFO -- : make[2]: Entering directory '/tmp/ruby/build/trunk/.bundle/gems/racc-1.8.0/ext/racc/cparse' I, [2024-05-24T14:32:43.812080 #1849325] INFO -- : make[2]: Leaving directory '/tmp/ruby/build/trunk/.bundle/gems/racc-1.8.0/ext/racc/cparse' I, [2024-05-24T14:32:43.815141 #1849325] INFO -- : make[2]: Entering directory '/tmp/ruby/build/trunk/.bundle/gems/rbs-3.4.4/ext/rbs_extension' I, [2024-05-24T14:32:43.844678 #1849325] INFO -- : make[2]: Leaving directory '/tmp/ruby/build/trunk/.bundle/gems/rbs-3.4.4/ext/rbs_extension' I, [2024-05-24T14:32:43.846619 #1849325] INFO -- : make[2]: Entering directory '/tmp/ruby/build/trunk/.bundle/gems/syslog-0.1.2/ext/syslog' I, [2024-05-24T14:32:43.868450 #1849325] INFO -- : make[2]: Leaving directory '/tmp/ruby/build/trunk/.bundle/gems/syslog-0.1.2/ext/syslog' I, [2024-05-24T14:32:43.891962 #1849325] INFO -- : make[2]: Entering directory '/tmp/ruby/build/trunk' I, [2024-05-24T14:32:43.956130 #1849325] INFO -- : make[2]: 'ruby' is up to date. I, [2024-05-24T14:32:43.956206 #1849325] INFO -- : make[2]: Leaving directory '/tmp/ruby/build/trunk' I, [2024-05-24T14:32:43.956427 #1849325] INFO -- : make[1]: Leaving directory '/tmp/ruby/build/trunk' I, [2024-05-24T14:32:43.960330 #1849325] INFO -- : make[1]: Entering directory '/tmp/ruby/build/trunk' I, [2024-05-24T14:32:43.960388 #1849325] INFO -- : make[1]: Nothing to be done for 'note'. I, [2024-05-24T14:32:43.960401 #1849325] INFO -- : make[1]: Leaving directory '/tmp/ruby/build/trunk' E, [2024-05-24T14:32:44.017996 #1849325] ERROR -- : $ /tmp/ruby/build/trunk/miniruby -I/tmp/ruby/src/trunk/lib /tmp/ruby/src/trunk/tool/runruby.rb --archdir=/tmp/ruby/build/trunk --extout=.ext -- /tmp/ruby/src/trunk/spec/mspec/bin/mspec-run -B /tmp/ruby/src/trunk/spec/default.mspec --error-output stderr --debug -fy -o /tmp/rubytest.z2fiwj/1-mspec-multi-0 E, [2024-05-24T14:32:44.018185 #1849325] ERROR -- : $ /tmp/ruby/build/trunk/miniruby -I/tmp/ruby/src/trunk/lib /tmp/ruby/src/trunk/tool/runruby.rb --archdir=/tmp/ruby/build/trunk --extout=.ext -- /tmp/ruby/src/trunk/spec/mspec/bin/mspec-run -B /tmp/ruby/src/trunk/spec/default.mspec --error-output stderr --debug -fy -o /tmp/rubytest.z2fiwj/2-mspec-multi-1 E, [2024-05-24T14:32:44.018502 #1849325] ERROR -- : $ /tmp/ruby/build/trunk/miniruby -I/tmp/ruby/src/trunk/lib /tmp/ruby/src/trunk/tool/runruby.rb --archdir=/tmp/ruby/build/trunk --extout=.ext -- /tmp/ruby/src/trunk/spec/mspec/bin/mspec-run -B /tmp/ruby/src/trunk/spec/default.mspec --error-output stderr --debug -fy -o /tmp/rubytest.z2fiwj/3-mspec-multi-2 E, [2024-05-24T14:32:44.018789 #1849325] ERROR -- : $ /tmp/ruby/build/trunk/miniruby -I/tmp/ruby/src/trunk/lib /tmp/ruby/src/trunk/tool/runruby.rb --archdir=/tmp/ruby/build/trunk --extout=.ext -- /tmp/ruby/src/trunk/spec/mspec/bin/mspec-run -B /tmp/ruby/src/trunk/spec/default.mspec --error-output stderr --debug -fy -o /tmp/rubytest.z2fiwj/4-mspec-multi-3 E, [2024-05-24T14:32:44.019060 #1849325] ERROR -- : $ /tmp/ruby/build/trunk/miniruby -I/tmp/ruby/src/trunk/lib /tmp/ruby/src/trunk/tool/runruby.rb --archdir=/tmp/ruby/build/trunk --extout=.ext -- /tmp/ruby/src/trunk/spec/mspec/bin/mspec-run -B /tmp/ruby/src/trunk/spec/default.mspec --error-output stderr --debug -fy -o /tmp/rubytest.z2fiwj/5-mspec-multi-4 E, [2024-05-24T14:32:44.019166 #1849325] ERROR -- : $ /tmp/ruby/build/trunk/miniruby -I/tmp/ruby/src/trunk/lib /tmp/ruby/src/trunk/tool/runruby.rb --archdir=/tmp/ruby/build/trunk --extout=.ext -- /tmp/ruby/src/trunk/spec/mspec/bin/mspec-run -B /tmp/ruby/src/trunk/spec/default.mspec --error-output stderr --debug -fy -o /tmp/rubytest.z2fiwj/6-mspec-multi-5 E, [2024-05-24T14:32:44.019302 #1849325] ERROR -- : $ /tmp/ruby/build/trunk/miniruby -I/tmp/ruby/src/trunk/lib /tmp/ruby/src/trunk/tool/runruby.rb --archdir=/tmp/ruby/build/trunk --extout=.ext -- /tmp/ruby/src/trunk/spec/mspec/bin/mspec-run -B /tmp/ruby/src/trunk/spec/default.mspec --error-output stderr --debug -fy -o /tmp/rubytest.z2fiwj/7-mspec-multi-6 E, [2024-05-24T14:32:44.019587 #1849325] ERROR -- : $ /tmp/ruby/build/trunk/miniruby -I/tmp/ruby/src/trunk/lib /tmp/ruby/src/trunk/tool/runruby.rb --archdir=/tmp/ruby/build/trunk --extout=.ext -- /tmp/ruby/src/trunk/spec/mspec/bin/mspec-run -B /tmp/ruby/src/trunk/spec/default.mspec --error-output stderr --debug -fy -o /tmp/rubytest.z2fiwj/8-mspec-multi-7 E, [2024-05-24T14:32:44.019891 #1849325] ERROR -- : $ /tmp/ruby/build/trunk/miniruby -I/tmp/ruby/src/trunk/lib /tmp/ruby/src/trunk/tool/runruby.rb --archdir=/tmp/ruby/build/trunk --extout=.ext -- /tmp/ruby/src/trunk/spec/mspec/bin/mspec-run -B /tmp/ruby/src/trunk/spec/default.mspec --error-output stderr --debug -fy -o /tmp/rubytest.z2fiwj/9-mspec-multi-8 E, [2024-05-24T14:32:44.020187 #1849325] ERROR -- : $ /tmp/ruby/build/trunk/miniruby -I/tmp/ruby/src/trunk/lib /tmp/ruby/src/trunk/tool/runruby.rb --archdir=/tmp/ruby/build/trunk --extout=.ext -- /tmp/ruby/src/trunk/spec/mspec/bin/mspec-run -B /tmp/ruby/src/trunk/spec/default.mspec --error-output stderr --debug -fy -o /tmp/rubytest.z2fiwj/10-mspec-multi-9 E, [2024-05-24T14:32:44.020490 #1849325] ERROR -- : $ /tmp/ruby/build/trunk/miniruby -I/tmp/ruby/src/trunk/lib /tmp/ruby/src/trunk/tool/runruby.rb --archdir=/tmp/ruby/build/trunk --extout=.ext -- /tmp/ruby/src/trunk/spec/mspec/bin/mspec-run -B /tmp/ruby/src/trunk/spec/default.mspec --error-output stderr --debug -fy -o /tmp/rubytest.z2fiwj/11-mspec-multi-10 E, [2024-05-24T14:32:44.020792 #1849325] ERROR -- : $ /tmp/ruby/build/trunk/miniruby -I/tmp/ruby/src/trunk/lib /tmp/ruby/src/trunk/tool/runruby.rb --archdir=/tmp/ruby/build/trunk --extout=.ext -- /tmp/ruby/src/trunk/spec/mspec/bin/mspec-run -B /tmp/ruby/src/trunk/spec/default.mspec --error-output stderr --debug -fy -o /tmp/rubytest.z2fiwj/12-mspec-multi-11 E, [2024-05-24T14:32:44.021086 #1849325] ERROR -- : $ /tmp/ruby/build/trunk/miniruby -I/tmp/ruby/src/trunk/lib /tmp/ruby/src/trunk/tool/runruby.rb --archdir=/tmp/ruby/build/trunk --extout=.ext -- /tmp/ruby/src/trunk/spec/mspec/bin/mspec-run -B /tmp/ruby/src/trunk/spec/default.mspec --error-output stderr --debug -fy -o /tmp/rubytest.z2fiwj/13-mspec-multi-12 E, [2024-05-24T14:32:44.021448 #1849325] ERROR -- : $ /tmp/ruby/build/trunk/miniruby -I/tmp/ruby/src/trunk/lib /tmp/ruby/src/trunk/tool/runruby.rb --archdir=/tmp/ruby/build/trunk --extout=.ext -- /tmp/ruby/src/trunk/spec/mspec/bin/mspec-run -B /tmp/ruby/src/trunk/spec/default.mspec --error-output stderr --debug -fy -o /tmp/rubytest.z2fiwj/14-mspec-multi-13 E, [2024-05-24T14:32:44.021757 #1849325] ERROR -- : $ /tmp/ruby/build/trunk/miniruby -I/tmp/ruby/src/trunk/lib /tmp/ruby/src/trunk/tool/runruby.rb --archdir=/tmp/ruby/build/trunk --extout=.ext -- /tmp/ruby/src/trunk/spec/mspec/bin/mspec-run -B /tmp/ruby/src/trunk/spec/default.mspec --error-output stderr --debug -fy -o /tmp/rubytest.z2fiwj/15-mspec-multi-14 E, [2024-05-24T14:32:44.022059 #1849325] ERROR -- : $ /tmp/ruby/build/trunk/miniruby -I/tmp/ruby/src/trunk/lib /tmp/ruby/src/trunk/tool/runruby.rb --archdir=/tmp/ruby/build/trunk --extout=.ext -- /tmp/ruby/src/trunk/spec/mspec/bin/mspec-run -B /tmp/ruby/src/trunk/spec/default.mspec --error-output stderr --debug -fy -o /tmp/rubytest.z2fiwj/16-mspec-multi-15 E, [2024-05-24T14:32:44.022355 #1849325] ERROR -- : $ /tmp/ruby/build/trunk/miniruby -I/tmp/ruby/src/trunk/lib /tmp/ruby/src/trunk/tool/runruby.rb --archdir=/tmp/ruby/build/trunk --extout=.ext -- /tmp/ruby/src/trunk/spec/mspec/bin/mspec-run -B /tmp/ruby/src/trunk/spec/default.mspec --error-output stderr --debug -fy -o /tmp/rubytest.z2fiwj/17-mspec-multi-16 E, [2024-05-24T14:32:44.022649 #1849325] ERROR -- : $ /tmp/ruby/build/trunk/miniruby -I/tmp/ruby/src/trunk/lib /tmp/ruby/src/trunk/tool/runruby.rb --archdir=/tmp/ruby/build/trunk --extout=.ext -- /tmp/ruby/src/trunk/spec/mspec/bin/mspec-run -B /tmp/ruby/src/trunk/spec/default.mspec --error-output stderr --debug -fy -o /tmp/rubytest.z2fiwj/18-mspec-multi-17 E, [2024-05-24T14:32:44.025700 #1849325] ERROR -- : $ /tmp/ruby/build/trunk/miniruby -I/tmp/ruby/src/trunk/lib /tmp/ruby/src/trunk/tool/runruby.rb --archdir=/tmp/ruby/build/trunk --extout=.ext -- /tmp/ruby/src/trunk/spec/mspec/bin/mspec-run -B /tmp/ruby/src/trunk/spec/default.mspec --error-output stderr --debug -fy -o /tmp/rubytest.z2fiwj/19-mspec-multi-18 E, [2024-05-24T14:32:44.026043 #1849325] ERROR -- : $ /tmp/ruby/build/trunk/miniruby -I/tmp/ruby/src/trunk/lib /tmp/ruby/src/trunk/tool/runruby.rb --archdir=/tmp/ruby/build/trunk --extout=.ext -- /tmp/ruby/src/trunk/spec/mspec/bin/mspec-run -B /tmp/ruby/src/trunk/spec/default.mspec --error-output stderr --debug -fy -o /tmp/rubytest.z2fiwj/20-mspec-multi-19 I, [2024-05-24T14:32:44.193065 #1849325] INFO -- : ruby 3.4.0dev (2024-05-24T08:00:15Z master e49d68bf27) [x86_64-linux] I, [2024-05-24T14:32:44.792189 #1849325] INFO -- : 0 ......................................................................... I, [2024-05-24T14:32:45.178699 #1849325] INFO -- : 73 ......................................................................... I, [2024-05-24T14:32:45.318735 #1849325] INFO -- : 146 ......................................................................... I, [2024-05-24T14:32:45.385019 #1849325] INFO -- : 219 ......................................................................... I, [2024-05-24T14:32:45.444909 #1849325] INFO -- : 292 ......................................................................... I, [2024-05-24T14:32:45.483096 #1849325] INFO -- : 365 ......................................................................... I, [2024-05-24T14:32:45.503120 #1849325] INFO -- : 438 ......................................................................... I, [2024-05-24T14:32:45.522952 #1849325] INFO -- : 511 ......................................................................... I, [2024-05-24T14:32:45.542960 #1849325] INFO -- : 584 ......................................................................... I, [2024-05-24T14:32:45.599160 #1849325] INFO -- : 657 ......................................................................... I, [2024-05-24T14:32:45.622997 #1849325] INFO -- : 730 ......................................................................... I, [2024-05-24T14:32:45.648304 #1849325] INFO -- : 803 ......................................................................... I, [2024-05-24T14:32:45.684425 #1849325] INFO -- : 876 ......................................................................... I, [2024-05-24T14:32:45.742780 #1849325] INFO -- : 949 ......................................................................... I, [2024-05-24T14:32:45.831262 #1849325] INFO -- : 1022 ......................................................................... I, [2024-05-24T14:32:45.983890 #1849325] INFO -- : 1095 ......................................................................... I, [2024-05-24T14:32:46.107870 #1849325] INFO -- : 1168 ......................................................................... I, [2024-05-24T14:32:46.169940 #1849325] INFO -- : 1241 ......................................................................... I, [2024-05-24T14:32:46.216006 #1849325] INFO -- : 1314 ......................................................................... I, [2024-05-24T14:32:46.235621 #1849325] INFO -- : 1387 ......................................................................... I, [2024-05-24T14:32:46.338980 #1849325] INFO -- : 1460 ......................................................................... I, [2024-05-24T14:32:46.766854 #1849325] INFO -- : 1533 ......................................................................... I, [2024-05-24T14:32:46.847902 #1849325] INFO -- : 1606 ......................................................................... I, [2024-05-24T14:32:47.025870 #1849325] INFO -- : 1679 ......................................................................... I, [2024-05-24T14:32:47.115931 #1849325] INFO -- : 1752 ......................................................................... I, [2024-05-24T14:32:47.191497 #1849325] INFO -- : 1825 ......................................................................... I, [2024-05-24T14:32:47.278132 #1849325] INFO -- : 1898 ......................................................................... I, [2024-05-24T14:32:47.362916 #1849325] INFO -- : 1971 ......................................................................... I, [2024-05-24T14:32:47.467072 #1849325] INFO -- : 2044 ......................................................................... I, [2024-05-24T14:32:47.515728 #1849325] INFO -- : 2117 ......................................................................... I, [2024-05-24T14:32:47.534350 #1849325] INFO -- : 2190 ......................................................................... I, [2024-05-24T14:32:47.554616 #1849325] INFO -- : 2263 ......................................................................... I, [2024-05-24T14:32:47.567627 #1849325] INFO -- : 2336 ......................................................................... I, [2024-05-24T14:32:47.601778 #1849325] INFO -- : 2409 ......................................................................... I, [2024-05-24T14:32:47.710828 #1849325] INFO -- : 2482 ......................................................................... I, [2024-05-24T14:32:47.737593 #1849325] INFO -- : 2555 ......................................................................... I, [2024-05-24T14:32:47.841320 #1849325] INFO -- : 2628 ......................................................................... I, [2024-05-24T14:32:47.926129 #1849325] INFO -- : 2701 ......................................................................... I, [2024-05-24T14:32:47.961372 #1849325] INFO -- : 2774 ......................................................................... I, [2024-05-24T14:32:48.021351 #1849325] INFO -- : 2847 ......................................................................... I, [2024-05-24T14:32:48.056735 #1849325] INFO -- : 2920 ......................................................................... I, [2024-05-24T14:32:48.078811 #1849325] INFO -- : 2993 ......................................................................... I, [2024-05-24T14:32:48.097852 #1849325] INFO -- : 3066 ......................................................................... I, [2024-05-24T14:32:48.110424 #1849325] INFO -- : 3139 ......................................................................... I, [2024-05-24T14:32:48.119630 #1849325] INFO -- : 3212 ......................................................................... I, [2024-05-24T14:32:48.152900 #1849325] INFO -- : 3285 ......................................................................... I, [2024-05-24T14:32:52.099280 #1849325] INFO -- : 3358 ......................................................................... I, [2024-05-24T14:32:52.127400 #1849325] INFO -- : I, [2024-05-24T14:32:52.127426 #1849325] INFO -- : I, [2024-05-24T14:32:52.127432 #1849325] INFO -- : Finished in 8.108696 seconds I, [2024-05-24T14:32:52.127436 #1849325] INFO -- : I, [2024-05-24T14:32:52.127440 #1849325] INFO -- : 3430 files, 32652 examples, 172089 expectations, 0 failures, 0 errors, 0 tagged I, [2024-05-24T14:32:52.129681 #1849325] INFO -- : $$$[end] "make yes-test-rubyspec MSPECOPT='--error-output stderr --debug -j' TESTS='-j20'" exit with 0.