# Logfile created on 2024-05-24 07:44:45 +0000 by logger.rb/v1.4.3 I, [2024-05-24T07:44:45.240218 #209631] INFO -- : #, @formatter=nil, @logdev=#, @binmode=false, @mon_data=#, @mon_data_owner_object_id=860>>> I, [2024-05-24T07:44:45.240339 #209631] INFO -- : $$$[beg] make update-unicode -j20 I, [2024-05-24T07:44:45.298922 #209631] INFO -- : Downloading Unicode emoji 15.0 files... I, [2024-05-24T07:44:45.299191 #209631] INFO -- : Downloading Unicode emoji 15.0 files... I, [2024-05-24T07:44:45.299718 #209631] INFO -- : Downloading Unicode emoji 15.0 files... I, [2024-05-24T07:44:45.340556 #209631] INFO -- : made symlink emoji/15.0/emoji-sequences.txt to /tmp/ruby/src/trunk/.downloaded-cache/emoji/15.0/emoji-sequences.txt I, [2024-05-24T07:44:45.341008 #209631] INFO -- : downloading emoji/15.0/emoji-sequences.txt ... downloading emoji/15.0/emoji-test.txt ... /tmp/ruby/src/trunk/enc/unicode/data/emoji/15.0/emoji-sequences.txt already exists E, [2024-05-24T07:44:45.801818 #209631] ERROR -- : /tmp/ruby/src/trunk/tool/downloader.rb:302:in `rescue in download': failed to download emoji/15.0/emoji-test.txt (RuntimeError) E, [2024-05-24T07:44:45.801958 #209631] ERROR -- : OpenURI::HTTPError: 403 Forbidden: https://www.unicode.org/Public/emoji/15.0/emoji-test.txt E, [2024-05-24T07:44:45.801980 #209631] ERROR -- : from /tmp/ruby/src/trunk/tool/downloader.rb:201:in `download' E, [2024-05-24T07:44:45.801993 #209631] ERROR -- : from /tmp/ruby/src/trunk/tool/downloader.rb:136:in `download' E, [2024-05-24T07:44:45.802006 #209631] ERROR -- : from /tmp/ruby/src/trunk/tool/downloader.rb:482:in `block in
' E, [2024-05-24T07:44:45.802021 #209631] ERROR -- : from /tmp/ruby/src/trunk/tool/downloader.rb:465:in `each' E, [2024-05-24T07:44:45.802034 #209631] ERROR -- : from /tmp/ruby/src/trunk/tool/downloader.rb:465:in `
' E, [2024-05-24T07:44:45.802047 #209631] ERROR -- : /usr/lib/ruby/3.0.0/open-uri.rb:364:in `open_http': 403 Forbidden (OpenURI::HTTPError) E, [2024-05-24T07:44:45.802060 #209631] ERROR -- : from /usr/lib/ruby/3.0.0/open-uri.rb:741:in `buffer_open' E, [2024-05-24T07:44:45.802083 #209631] ERROR -- : from /usr/lib/ruby/3.0.0/open-uri.rb:212:in `block in open_loop' E, [2024-05-24T07:44:45.802096 #209631] ERROR -- : from /usr/lib/ruby/3.0.0/open-uri.rb:210:in `catch' E, [2024-05-24T07:44:45.802109 #209631] ERROR -- : from /usr/lib/ruby/3.0.0/open-uri.rb:210:in `open_loop' E, [2024-05-24T07:44:45.802121 #209631] ERROR -- : from /usr/lib/ruby/3.0.0/open-uri.rb:151:in `open_uri' E, [2024-05-24T07:44:45.802134 #209631] ERROR -- : from /usr/lib/ruby/3.0.0/open-uri.rb:721:in `open' E, [2024-05-24T07:44:45.802146 #209631] ERROR -- : from /usr/lib/ruby/3.0.0/open-uri.rb:729:in `read' E, [2024-05-24T07:44:45.802159 #209631] ERROR -- : from /tmp/ruby/src/trunk/tool/downloader.rb:247:in `block in download' E, [2024-05-24T07:44:45.802192 #209631] ERROR -- : from /tmp/ruby/src/trunk/tool/downloader.rb:378:in `with_retry' E, [2024-05-24T07:44:45.802210 #209631] ERROR -- : from /tmp/ruby/src/trunk/tool/downloader.rb:246:in `download' E, [2024-05-24T07:44:45.802223 #209631] ERROR -- : from /tmp/ruby/src/trunk/tool/downloader.rb:136:in `download' E, [2024-05-24T07:44:45.802236 #209631] ERROR -- : from /tmp/ruby/src/trunk/tool/downloader.rb:482:in `block in
' E, [2024-05-24T07:44:45.802250 #209631] ERROR -- : from /tmp/ruby/src/trunk/tool/downloader.rb:465:in `each' E, [2024-05-24T07:44:45.802261 #209631] ERROR -- : from /tmp/ruby/src/trunk/tool/downloader.rb:465:in `
' E, [2024-05-24T07:44:45.802934 #209631] ERROR -- : /tmp/ruby/src/trunk/tool/downloader.rb:302:in `rescue in download': failed to download emoji/15.0/emoji-test.txt (RuntimeError) E, [2024-05-24T07:44:45.803023 #209631] ERROR -- : OpenURI::HTTPError: 403 Forbidden: https://www.unicode.org/Public/emoji/15.0/emoji-test.txt E, [2024-05-24T07:44:45.803044 #209631] ERROR -- : from /tmp/ruby/src/trunk/tool/downloader.rb:201:in `download' E, [2024-05-24T07:44:45.803075 #209631] ERROR -- : from /tmp/ruby/src/trunk/tool/downloader.rb:136:in `download' E, [2024-05-24T07:44:45.803087 #209631] ERROR -- : from /tmp/ruby/src/trunk/tool/downloader.rb:482:in `block in
' E, [2024-05-24T07:44:45.803099 #209631] ERROR -- : from /tmp/ruby/src/trunk/tool/downloader.rb:465:in `each' E, [2024-05-24T07:44:45.803111 #209631] ERROR -- : from /tmp/ruby/src/trunk/tool/downloader.rb:465:in `
' E, [2024-05-24T07:44:45.803123 #209631] ERROR -- : /usr/lib/ruby/3.0.0/open-uri.rb:364:in `open_http': 403 Forbidden (OpenURI::HTTPError) E, [2024-05-24T07:44:45.803135 #209631] ERROR -- : from /usr/lib/ruby/3.0.0/open-uri.rb:741:in `buffer_open' E, [2024-05-24T07:44:45.803146 #209631] ERROR -- : from /usr/lib/ruby/3.0.0/open-uri.rb:212:in `block in open_loop' E, [2024-05-24T07:44:45.803158 #209631] ERROR -- : from /usr/lib/ruby/3.0.0/open-uri.rb:210:in `catch' E, [2024-05-24T07:44:45.803175 #209631] ERROR -- : from /usr/lib/ruby/3.0.0/open-uri.rb:210:in `open_loop' E, [2024-05-24T07:44:45.803187 #209631] ERROR -- : from /usr/lib/ruby/3.0.0/open-uri.rb:151:in `open_uri' E, [2024-05-24T07:44:45.803199 #209631] ERROR -- : from /usr/lib/ruby/3.0.0/open-uri.rb:721:in `open' E, [2024-05-24T07:44:45.803210 #209631] ERROR -- : from /usr/lib/ruby/3.0.0/open-uri.rb:729:in `read' E, [2024-05-24T07:44:45.803222 #209631] ERROR -- : from /tmp/ruby/src/trunk/tool/downloader.rb:247:in `block in download' E, [2024-05-24T07:44:45.803234 #209631] ERROR -- : from /tmp/ruby/src/trunk/tool/downloader.rb:378:in `with_retry' E, [2024-05-24T07:44:45.803245 #209631] ERROR -- : from /tmp/ruby/src/trunk/tool/downloader.rb:246:in `download' E, [2024-05-24T07:44:45.803257 #209631] ERROR -- : from /tmp/ruby/src/trunk/tool/downloader.rb:136:in `download' E, [2024-05-24T07:44:45.803283 #209631] ERROR -- : from /tmp/ruby/src/trunk/tool/downloader.rb:482:in `block in
' E, [2024-05-24T07:44:45.803295 #209631] ERROR -- : from /tmp/ruby/src/trunk/tool/downloader.rb:465:in `each' E, [2024-05-24T07:44:45.803305 #209631] ERROR -- : from /tmp/ruby/src/trunk/tool/downloader.rb:465:in `
' E, [2024-05-24T07:44:45.806385 #209631] ERROR -- : make: *** [uncommon.mk:1756: /tmp/ruby/src/trunk/enc/unicode/data/emoji/15.0/emoji-zwj-sequences.txt] Error 1 E, [2024-05-24T07:44:45.806444 #209631] ERROR -- : make: *** Waiting for unfinished jobs.... E, [2024-05-24T07:44:45.808428 #209631] ERROR -- : make: *** [uncommon.mk:1756: /tmp/ruby/src/trunk/enc/unicode/data/emoji/15.0/emoji-test.txt] Error 1 E, [2024-05-24T07:44:46.256103 #209631] ERROR -- : /tmp/ruby/src/trunk/tool/downloader.rb:302:in `rescue in download': failed to download emoji/15.0/emoji-sequences.txt (RuntimeError) E, [2024-05-24T07:44:46.256269 #209631] ERROR -- : EOFError: end of file reached: https://www.unicode.org/Public/emoji/15.0/emoji-sequences.txt E, [2024-05-24T07:44:46.256296 #209631] ERROR -- : from /tmp/ruby/src/trunk/tool/downloader.rb:201:in `download' E, [2024-05-24T07:44:46.256333 #209631] ERROR -- : from /tmp/ruby/src/trunk/tool/downloader.rb:136:in `download' E, [2024-05-24T07:44:46.256347 #209631] ERROR -- : from /tmp/ruby/src/trunk/tool/downloader.rb:482:in `block in
' E, [2024-05-24T07:44:46.256360 #209631] ERROR -- : from /tmp/ruby/src/trunk/tool/downloader.rb:465:in `each' E, [2024-05-24T07:44:46.256373 #209631] ERROR -- : from /tmp/ruby/src/trunk/tool/downloader.rb:465:in `
' E, [2024-05-24T07:44:46.256386 #209631] ERROR -- : /usr/lib/ruby/3.0.0/net/protocol.rb:227:in `rbuf_fill': end of file reached (EOFError) E, [2024-05-24T07:44:46.256399 #209631] ERROR -- : from /usr/lib/ruby/3.0.0/net/protocol.rb:193:in `readuntil' E, [2024-05-24T07:44:46.256415 #209631] ERROR -- : from /usr/lib/ruby/3.0.0/net/protocol.rb:203:in `readline' E, [2024-05-24T07:44:46.256429 #209631] ERROR -- : from /usr/lib/ruby/3.0.0/net/http/response.rb:42:in `read_status_line' E, [2024-05-24T07:44:46.256446 #209631] ERROR -- : from /usr/lib/ruby/3.0.0/net/http/response.rb:31:in `read_new' E, [2024-05-24T07:44:46.256460 #209631] ERROR -- : from /usr/lib/ruby/3.0.0/net/http.rb:1557:in `block in transport_request' E, [2024-05-24T07:44:46.256473 #209631] ERROR -- : from /usr/lib/ruby/3.0.0/net/http.rb:1548:in `catch' E, [2024-05-24T07:44:46.256485 #209631] ERROR -- : from /usr/lib/ruby/3.0.0/net/http.rb:1548:in `transport_request' E, [2024-05-24T07:44:46.256746 #209631] ERROR -- : from /usr/lib/ruby/3.0.0/net/http.rb:1521:in `request' E, [2024-05-24T07:44:46.256760 #209631] ERROR -- : from /usr/lib/ruby/3.0.0/open-uri.rb:329:in `block in open_http' E, [2024-05-24T07:44:46.256773 #209631] ERROR -- : from /usr/lib/ruby/3.0.0/net/http.rb:960:in `start' E, [2024-05-24T07:44:46.256785 #209631] ERROR -- : from /usr/lib/ruby/3.0.0/open-uri.rb:323:in `open_http' E, [2024-05-24T07:44:46.256798 #209631] ERROR -- : from /usr/lib/ruby/3.0.0/open-uri.rb:741:in `buffer_open' E, [2024-05-24T07:44:46.256811 #209631] ERROR -- : from /usr/lib/ruby/3.0.0/open-uri.rb:212:in `block in open_loop' E, [2024-05-24T07:44:46.256836 #209631] ERROR -- : from /usr/lib/ruby/3.0.0/open-uri.rb:210:in `catch' E, [2024-05-24T07:44:46.256849 #209631] ERROR -- : from /usr/lib/ruby/3.0.0/open-uri.rb:210:in `open_loop' E, [2024-05-24T07:44:46.256862 #209631] ERROR -- : from /usr/lib/ruby/3.0.0/open-uri.rb:151:in `open_uri' E, [2024-05-24T07:44:46.256875 #209631] ERROR -- : from /usr/lib/ruby/3.0.0/open-uri.rb:721:in `open' E, [2024-05-24T07:44:46.256888 #209631] ERROR -- : from /usr/lib/ruby/3.0.0/open-uri.rb:729:in `read' E, [2024-05-24T07:44:46.256900 #209631] ERROR -- : from /tmp/ruby/src/trunk/tool/downloader.rb:247:in `block in download' E, [2024-05-24T07:44:46.256913 #209631] ERROR -- : from /tmp/ruby/src/trunk/tool/downloader.rb:378:in `with_retry' E, [2024-05-24T07:44:46.256926 #209631] ERROR -- : from /tmp/ruby/src/trunk/tool/downloader.rb:246:in `download' E, [2024-05-24T07:44:46.256939 #209631] ERROR -- : from /tmp/ruby/src/trunk/tool/downloader.rb:136:in `download' E, [2024-05-24T07:44:46.256955 #209631] ERROR -- : from /tmp/ruby/src/trunk/tool/downloader.rb:482:in `block in
' E, [2024-05-24T07:44:46.256967 #209631] ERROR -- : from /tmp/ruby/src/trunk/tool/downloader.rb:465:in `each' E, [2024-05-24T07:44:46.256980 #209631] ERROR -- : from /tmp/ruby/src/trunk/tool/downloader.rb:465:in `
' E, [2024-05-24T07:44:46.261165 #209631] ERROR -- : make: *** [uncommon.mk:1756: /tmp/ruby/src/trunk/enc/unicode/data/emoji/15.0/emoji-sequences.txt] Error 1 E, [2024-05-24T07:44:46.261249 #209631] ERROR -- : make: *** Deleting file '/tmp/ruby/src/trunk/enc/unicode/data/emoji/15.0/emoji-sequences.txt' I, [2024-05-24T07:44:46.261327 #209631] INFO -- : downloading emoji/15.0/emoji-test.txt ... I, [2024-05-24T07:44:46.261819 #209631] INFO -- : $$$[end] "make update-unicode -j20" exit with 512. I, [2024-05-24T07:44:46.261911 #209631] INFO -- : $$$[beg] make update-download -j20 I, [2024-05-24T07:44:46.368768 #209631] INFO -- : tool/config.guess already exists I, [2024-05-24T07:44:46.368809 #209631] INFO -- : tool/config.sub already exists I, [2024-05-24T07:44:46.370879 #209631] INFO -- : Update power_assert to 84e85124c5014a139af39161d484156cfe87a9ed I, [2024-05-24T07:44:46.371012 #209631] INFO -- : Update rbs to ba7872795d5de04adb8ff500c0e6afdc81a041dd I, [2024-05-24T07:44:46.371543 #209631] INFO -- : Update typeprof to b19a6416da3a05d57fadd6ffdadb382b6d236ca5 I, [2024-05-24T07:44:46.371984 #209631] INFO -- : echo 84e85124c5014a139af39161d484156cfe87a9ed | /bin/sh /tmp/ruby/src/trunk/tool/ifchange /tmp/ruby/src/trunk/.bundle/.timestamp/power_assert.revision - I, [2024-05-24T07:44:46.372184 #209631] INFO -- : echo ba7872795d5de04adb8ff500c0e6afdc81a041dd | /bin/sh /tmp/ruby/src/trunk/tool/ifchange /tmp/ruby/src/trunk/.bundle/.timestamp/rbs.revision - I, [2024-05-24T07:44:46.372777 #209631] INFO -- : echo b19a6416da3a05d57fadd6ffdadb382b6d236ca5 | /bin/sh /tmp/ruby/src/trunk/tool/ifchange /tmp/ruby/src/trunk/.bundle/.timestamp/typeprof.revision - I, [2024-05-24T07:44:46.373725 #209631] INFO -- : /tmp/ruby/src/trunk/.bundle/.timestamp/power_assert.revision unchanged I, [2024-05-24T07:44:46.374171 #209631] INFO -- : /tmp/ruby/src/trunk/.bundle/.timestamp/rbs.revision unchanged I, [2024-05-24T07:44:46.374682 #209631] INFO -- : /tmp/ruby/src/trunk/.bundle/.timestamp/typeprof.revision unchanged I, [2024-05-24T07:44:46.374737 #209631] INFO -- : Building power_assert@84e85124c5014a139af39161d484156cfe87a9ed to /tmp/ruby/src/trunk/gems/power_assert-2.0.3.gem I, [2024-05-24T07:44:46.443947 #209631] INFO -- : Successfully built RubyGem I, [2024-05-24T07:44:46.443992 #209631] INFO -- : Name: power_assert I, [2024-05-24T07:44:46.443999 #209631] INFO -- : Version: 2.0.4dev I, [2024-05-24T07:44:46.444004 #209631] INFO -- : File: power_assert-2.0.4dev.gem I, [2024-05-24T07:44:46.489231 #209631] INFO -- : $$$[end] "make update-download -j20" exit with 0. I, [2024-05-24T07:44:46.489271 #209631] INFO -- : $$$[beg] make update-rubyspec -j20 I, [2024-05-24T07:44:46.546977 #209631] INFO -- : make: Nothing to be done for 'update-rubyspec'. I, [2024-05-24T07:44:46.547244 #209631] INFO -- : $$$[end] "make update-rubyspec -j20" exit with 0. I, [2024-05-24T07:44:46.547286 #209631] INFO -- : $$$[beg] make update-src -j20 I, [2024-05-24T07:44:47.187034 #209631] INFO -- : Already up to date. I, [2024-05-24T07:44:47.204272 #209631] INFO -- : Latest commit hash = acdd19facc I, [2024-05-24T07:44:47.206115 #209631] INFO -- : $$$[end] "make update-src -j20" exit with 0. I, [2024-05-24T07:44:47.206162 #209631] INFO -- : $$$[beg] make after-update -j20 I, [2024-05-24T07:44:47.284858 #209631] INFO -- : generating /tmp/ruby/src/trunk/ext/ripper/eventids1.h I, [2024-05-24T07:44:47.289154 #209631] INFO -- : make[1]: Entering directory '/tmp/ruby/src/trunk/ext/ripper' I, [2024-05-24T07:44:47.289201 #209631] INFO -- : make[1]: Nothing to be done for 'src'. I, [2024-05-24T07:44:47.289215 #209631] INFO -- : make[1]: Leaving directory '/tmp/ruby/src/trunk/ext/ripper' I, [2024-05-24T07:44:47.289781 #209631] INFO -- : generating /tmp/ruby/src/trunk/ext/ripper/eventids1.c I, [2024-05-24T07:44:47.291865 #209631] INFO -- : make[1]: Entering directory '/tmp/ruby/src/trunk/ext/ripper' I, [2024-05-24T07:44:47.291923 #209631] INFO -- : make[1]: Nothing to be done for 'src'. I, [2024-05-24T07:44:47.291938 #209631] INFO -- : make[1]: Leaving directory '/tmp/ruby/src/trunk/ext/ripper' I, [2024-05-24T07:44:47.292401 #209631] INFO -- : generating /tmp/ruby/src/trunk/ext/ripper/eventids2table.c I, [2024-05-24T07:44:47.294483 #209631] INFO -- : make[1]: Entering directory '/tmp/ruby/src/trunk/ext/ripper' I, [2024-05-24T07:44:47.294540 #209631] INFO -- : make[1]: Nothing to be done for 'src'. I, [2024-05-24T07:44:47.294554 #209631] INFO -- : make[1]: Leaving directory '/tmp/ruby/src/trunk/ext/ripper' I, [2024-05-24T07:44:47.305284 #209631] INFO -- : /tmp/ruby/src/trunk/revision.h updated I, [2024-05-24T07:44:47.306461 #209631] INFO -- : generating x86_64-linux-fake.rb I, [2024-05-24T07:44:47.356952 #209631] INFO -- : x86_64-linux-fake.rb updated I, [2024-05-24T07:44:47.358336 #209631] INFO -- : generating enc.mk I, [2024-05-24T07:44:47.475151 #209631] INFO -- : making srcs under enc I, [2024-05-24T07:44:47.504990 #209631] INFO -- : make[1]: Entering directory '/tmp/ruby/build/trunk' I, [2024-05-24T07:44:47.505051 #209631] INFO -- : make[1]: Nothing to be done for 'srcs'. I, [2024-05-24T07:44:47.505064 #209631] INFO -- : make[1]: Leaving directory '/tmp/ruby/build/trunk' I, [2024-05-24T07:44:47.549921 #209631] INFO -- : Update power_assert to 84e85124c5014a139af39161d484156cfe87a9ed I, [2024-05-24T07:44:47.550091 #209631] INFO -- : Update rbs to ba7872795d5de04adb8ff500c0e6afdc81a041dd I, [2024-05-24T07:44:47.550916 #209631] INFO -- : Update typeprof to b19a6416da3a05d57fadd6ffdadb382b6d236ca5 I, [2024-05-24T07:44:47.551484 #209631] INFO -- : echo 84e85124c5014a139af39161d484156cfe87a9ed | /bin/sh /tmp/ruby/src/trunk/tool/ifchange /tmp/ruby/src/trunk/.bundle/.timestamp/power_assert.revision - I, [2024-05-24T07:44:47.551629 #209631] INFO -- : echo ba7872795d5de04adb8ff500c0e6afdc81a041dd | /bin/sh /tmp/ruby/src/trunk/tool/ifchange /tmp/ruby/src/trunk/.bundle/.timestamp/rbs.revision - I, [2024-05-24T07:44:47.552944 #209631] INFO -- : echo b19a6416da3a05d57fadd6ffdadb382b6d236ca5 | /bin/sh /tmp/ruby/src/trunk/tool/ifchange /tmp/ruby/src/trunk/.bundle/.timestamp/typeprof.revision - I, [2024-05-24T07:44:47.553467 #209631] INFO -- : /tmp/ruby/src/trunk/.bundle/.timestamp/power_assert.revision unchanged I, [2024-05-24T07:44:47.553606 #209631] INFO -- : /tmp/ruby/src/trunk/.bundle/.timestamp/rbs.revision unchanged I, [2024-05-24T07:44:47.554618 #209631] INFO -- : Building power_assert@84e85124c5014a139af39161d484156cfe87a9ed to /tmp/ruby/src/trunk/gems/power_assert-2.0.3.gem I, [2024-05-24T07:44:47.555033 #209631] INFO -- : /tmp/ruby/src/trunk/.bundle/.timestamp/typeprof.revision unchanged I, [2024-05-24T07:44:47.624390 #209631] INFO -- : Successfully built RubyGem I, [2024-05-24T07:44:47.624447 #209631] INFO -- : Name: power_assert I, [2024-05-24T07:44:47.624461 #209631] INFO -- : Version: 2.0.4dev I, [2024-05-24T07:44:47.624472 #209631] INFO -- : File: power_assert-2.0.4dev.gem I, [2024-05-24T07:44:47.626633 #209631] INFO -- : Extracting bundle gem power_assert-2.0.3... I, [2024-05-24T07:44:47.686964 #209631] INFO -- : Try with hash version of bundled gems instead of gems/power_assert-2.0.3.gem. We don't use this gem with release version of Ruby. I, [2024-05-24T07:44:47.691860 #209631] INFO -- : Unpacked gems/power_assert-2.0.4dev.gem I, [2024-05-24T07:44:47.694250 #209631] INFO -- : $$$[end] "make after-update -j20" exit with 0. I, [2024-05-24T07:44:47.694370 #209631] INFO -- : $$$[beg] make miniruby -j20 I, [2024-05-24T07:44:47.751829 #209631] INFO -- : BASERUBY = /usr/bin/ruby --disable=gems I, [2024-05-24T07:44:47.751858 #209631] INFO -- : CC = gcc I, [2024-05-24T07:44:47.751863 #209631] INFO -- : LD = ld I, [2024-05-24T07:44:47.751867 #209631] INFO -- : LDSHARED = gcc -shared I, [2024-05-24T07:44:47.751871 #209631] INFO -- : CFLAGS = -O3 -fno-fast-math -ggdb3 -Wall -Wextra -Wdeprecated-declarations -Wdiv-by-zero -Wduplicated-cond -Wimplicit-function-declaration -Wimplicit-int -Wpointer-arith -Wwrite-strings -Wold-style-definition -Wimplicit-fallthrough=0 -Wmissing-noreturn -Wno-cast-function-type -Wno-constant-logical-operand -Wno-long-long -Wno-missing-field-initializers -Wno-overlength-strings -Wno-packed-bitfield-compat -Wno-parentheses-equality -Wno-self-assign -Wno-tautological-compare -Wno-unused-parameter -Wno-unused-value -Wsuggest-attribute=format -Wsuggest-attribute=noreturn -Wunused-variable -Wmisleading-indentation -Wundef -fPIC I, [2024-05-24T07:44:47.751875 #209631] INFO -- : XCFLAGS = -U_FORTIFY_SOURCE -D_FORTIFY_SOURCE=2 -fstack-protector-strong -fno-strict-overflow -fvisibility=hidden -fexcess-precision=standard -DRUBY_EXPORT -I. -I.ext/include/x86_64-linux -I/tmp/ruby/src/trunk/include -I/tmp/ruby/src/trunk -I/tmp/ruby/src/trunk/prism -I/tmp/ruby/src/trunk/enc/unicode/15.0.0 I, [2024-05-24T07:44:47.751885 #209631] INFO -- : CPPFLAGS = I, [2024-05-24T07:44:47.751889 #209631] INFO -- : DLDFLAGS = -Wl,--compress-debug-sections=zlib -Wl,-soname,libruby.so.3.4 -fstack-protector-strong I, [2024-05-24T07:44:47.751893 #209631] INFO -- : SOLIBS = -lz -lrt -lrt -lgmp -ldl -lcrypt -lm -lpthread I, [2024-05-24T07:44:47.751897 #209631] INFO -- : LANG = en_US.UTF-8 I, [2024-05-24T07:44:47.751902 #209631] INFO -- : LC_ALL = I, [2024-05-24T07:44:47.751905 #209631] INFO -- : LC_CTYPE = I, [2024-05-24T07:44:47.751909 #209631] INFO -- : MFLAGS = -j20 --jobserver-auth=4,5 I, [2024-05-24T07:44:47.751912 #209631] INFO -- : RUSTC = no I, [2024-05-24T07:44:47.751916 #209631] INFO -- : YJIT_RUSTC_ARGS = --crate-name=yjit --crate-type=staticlib --edition=2021 -g -C lto=thin -C opt-level=3 -C overflow-checks=on '--out-dir=/tmp/ruby/build/trunk/yjit/target/release/' /tmp/ruby/src/trunk/yjit/src/lib.rs I, [2024-05-24T07:44:47.753361 #209631] INFO -- : gcc (Ubuntu 11.4.0-1ubuntu1~22.04) 11.4.0 I, [2024-05-24T07:44:47.753385 #209631] INFO -- : Copyright (C) 2021 Free Software Foundation, Inc. I, [2024-05-24T07:44:47.753392 #209631] INFO -- : This is free software; see the source for copying conditions. There is NO I, [2024-05-24T07:44:47.753401 #209631] INFO -- : warranty; not even for MERCHANTABILITY or FITNESS FOR A PARTICULAR PURPOSE. I, [2024-05-24T07:44:47.753405 #209631] INFO -- : I, [2024-05-24T07:44:47.776372 #209631] INFO -- : compiling /tmp/ruby/src/trunk/version.c I, [2024-05-24T07:44:47.878384 #209631] INFO -- : linking miniruby I, [2024-05-24T07:44:48.405704 #209631] INFO -- : $$$[end] "make miniruby -j20" exit with 0. I, [2024-05-24T07:44:48.405830 #209631] INFO -- : $$$[beg] make ruby -j20 I, [2024-05-24T07:44:48.464345 #209631] INFO -- : BASERUBY = /usr/bin/ruby --disable=gems I, [2024-05-24T07:44:48.464388 #209631] INFO -- : CC = gcc I, [2024-05-24T07:44:48.464401 #209631] INFO -- : LD = ld I, [2024-05-24T07:44:48.464412 #209631] INFO -- : LDSHARED = gcc -shared I, [2024-05-24T07:44:48.464425 #209631] INFO -- : CFLAGS = -O3 -fno-fast-math -ggdb3 -Wall -Wextra -Wdeprecated-declarations -Wdiv-by-zero -Wduplicated-cond -Wimplicit-function-declaration -Wimplicit-int -Wpointer-arith -Wwrite-strings -Wold-style-definition -Wimplicit-fallthrough=0 -Wmissing-noreturn -Wno-cast-function-type -Wno-constant-logical-operand -Wno-long-long -Wno-missing-field-initializers -Wno-overlength-strings -Wno-packed-bitfield-compat -Wno-parentheses-equality -Wno-self-assign -Wno-tautological-compare -Wno-unused-parameter -Wno-unused-value -Wsuggest-attribute=format -Wsuggest-attribute=noreturn -Wunused-variable -Wmisleading-indentation -Wundef -fPIC I, [2024-05-24T07:44:48.464438 #209631] INFO -- : XCFLAGS = -U_FORTIFY_SOURCE -D_FORTIFY_SOURCE=2 -fstack-protector-strong -fno-strict-overflow -fvisibility=hidden -fexcess-precision=standard -DRUBY_EXPORT -I. -I.ext/include/x86_64-linux -I/tmp/ruby/src/trunk/include -I/tmp/ruby/src/trunk -I/tmp/ruby/src/trunk/prism -I/tmp/ruby/src/trunk/enc/unicode/15.0.0 I, [2024-05-24T07:44:48.464449 #209631] INFO -- : CPPFLAGS = I, [2024-05-24T07:44:48.464460 #209631] INFO -- : DLDFLAGS = -Wl,--compress-debug-sections=zlib -Wl,-soname,libruby.so.3.4 -fstack-protector-strong I, [2024-05-24T07:44:48.464470 #209631] INFO -- : SOLIBS = -lz -lrt -lrt -lgmp -ldl -lcrypt -lm -lpthread I, [2024-05-24T07:44:48.464480 #209631] INFO -- : LANG = en_US.UTF-8 I, [2024-05-24T07:44:48.464490 #209631] INFO -- : LC_ALL = I, [2024-05-24T07:44:48.464501 #209631] INFO -- : LC_CTYPE = I, [2024-05-24T07:44:48.464511 #209631] INFO -- : MFLAGS = -j20 --jobserver-auth=4,5 I, [2024-05-24T07:44:48.464524 #209631] INFO -- : RUSTC = no I, [2024-05-24T07:44:48.464535 #209631] INFO -- : YJIT_RUSTC_ARGS = --crate-name=yjit --crate-type=staticlib --edition=2021 -g -C lto=thin -C opt-level=3 -C overflow-checks=on '--out-dir=/tmp/ruby/build/trunk/yjit/target/release/' /tmp/ruby/src/trunk/yjit/src/lib.rs I, [2024-05-24T07:44:48.465785 #209631] INFO -- : gcc (Ubuntu 11.4.0-1ubuntu1~22.04) 11.4.0 I, [2024-05-24T07:44:48.465825 #209631] INFO -- : Copyright (C) 2021 Free Software Foundation, Inc. I, [2024-05-24T07:44:48.465838 #209631] INFO -- : This is free software; see the source for copying conditions. There is NO I, [2024-05-24T07:44:48.465850 #209631] INFO -- : warranty; not even for MERCHANTABILITY or FITNESS FOR A PARTICULAR PURPOSE. I, [2024-05-24T07:44:48.465860 #209631] INFO -- : I, [2024-05-24T07:44:48.575216 #209631] INFO -- : builtin_binary.inc updated I, [2024-05-24T07:44:48.579557 #209631] INFO -- : c86294a81d0df6836359a6b5498b71b1ddba3062aa6ec87c7b2896368a948a19 builtin_binary.inc I, [2024-05-24T07:44:48.580266 #209631] INFO -- : compiling /tmp/ruby/src/trunk/builtin.c I, [2024-05-24T07:44:48.763735 #209631] INFO -- : linking static-library libruby-static.a I, [2024-05-24T07:44:49.080167 #209631] INFO -- : linking shared-library libruby.so.3.4.0 I, [2024-05-24T07:44:50.665205 #209631] INFO -- : linking ruby I, [2024-05-24T07:44:50.691879 #209631] INFO -- : $$$[end] "make ruby -j20" exit with 0. I, [2024-05-24T07:44:50.692027 #209631] INFO -- : $$$[beg] make all -j20 I, [2024-05-24T07:44:50.757356 #209631] INFO -- : BASERUBY = /usr/bin/ruby --disable=gems I, [2024-05-24T07:44:50.757412 #209631] INFO -- : CC = gcc I, [2024-05-24T07:44:50.757429 #209631] INFO -- : LD = ld I, [2024-05-24T07:44:50.757443 #209631] INFO -- : LDSHARED = gcc -shared I, [2024-05-24T07:44:50.757457 #209631] INFO -- : CFLAGS = -O3 -fno-fast-math -ggdb3 -Wall -Wextra -Wdeprecated-declarations -Wdiv-by-zero -Wduplicated-cond -Wimplicit-function-declaration -Wimplicit-int -Wpointer-arith -Wwrite-strings -Wold-style-definition -Wimplicit-fallthrough=0 -Wmissing-noreturn -Wno-cast-function-type -Wno-constant-logical-operand -Wno-long-long -Wno-missing-field-initializers -Wno-overlength-strings -Wno-packed-bitfield-compat -Wno-parentheses-equality -Wno-self-assign -Wno-tautological-compare -Wno-unused-parameter -Wno-unused-value -Wsuggest-attribute=format -Wsuggest-attribute=noreturn -Wunused-variable -Wmisleading-indentation -Wundef -fPIC I, [2024-05-24T07:44:50.757472 #209631] INFO -- : XCFLAGS = -U_FORTIFY_SOURCE -D_FORTIFY_SOURCE=2 -fstack-protector-strong -fno-strict-overflow -fvisibility=hidden -fexcess-precision=standard -DRUBY_EXPORT -I. -I.ext/include/x86_64-linux -I/tmp/ruby/src/trunk/include -I/tmp/ruby/src/trunk -I/tmp/ruby/src/trunk/prism -I/tmp/ruby/src/trunk/enc/unicode/15.0.0 I, [2024-05-24T07:44:50.757486 #209631] INFO -- : CPPFLAGS = I, [2024-05-24T07:44:50.757500 #209631] INFO -- : DLDFLAGS = -Wl,--compress-debug-sections=zlib -Wl,-soname,libruby.so.3.4 -fstack-protector-strong I, [2024-05-24T07:44:50.757514 #209631] INFO -- : SOLIBS = -lz -lrt -lrt -lgmp -ldl -lcrypt -lm -lpthread I, [2024-05-24T07:44:50.757527 #209631] INFO -- : LANG = en_US.UTF-8 I, [2024-05-24T07:44:50.757539 #209631] INFO -- : LC_ALL = I, [2024-05-24T07:44:50.757552 #209631] INFO -- : LC_CTYPE = I, [2024-05-24T07:44:50.757565 #209631] INFO -- : MFLAGS = -j20 --jobserver-auth=4,5 I, [2024-05-24T07:44:50.757578 #209631] INFO -- : RUSTC = no I, [2024-05-24T07:44:50.757592 #209631] INFO -- : YJIT_RUSTC_ARGS = --crate-name=yjit --crate-type=staticlib --edition=2021 -g -C lto=thin -C opt-level=3 -C overflow-checks=on '--out-dir=/tmp/ruby/build/trunk/yjit/target/release/' /tmp/ruby/src/trunk/yjit/src/lib.rs I, [2024-05-24T07:44:50.759680 #209631] INFO -- : gcc (Ubuntu 11.4.0-1ubuntu1~22.04) 11.4.0 I, [2024-05-24T07:44:50.759765 #209631] INFO -- : Copyright (C) 2021 Free Software Foundation, Inc. I, [2024-05-24T07:44:50.759793 #209631] INFO -- : This is free software; see the source for copying conditions. There is NO I, [2024-05-24T07:44:50.759809 #209631] INFO -- : warranty; not even for MERCHANTABILITY or FITNESS FOR A PARTICULAR PURPOSE. I, [2024-05-24T07:44:50.759823 #209631] INFO -- : I, [2024-05-24T07:44:50.791623 #209631] INFO -- : generating encdb.h I, [2024-05-24T07:44:50.792870 #209631] INFO -- : generating enc.mk I, [2024-05-24T07:44:50.794704 #209631] INFO -- : building spec/ruby/optional/capi/ext/array_spec.so I, [2024-05-24T07:44:50.795269 #209631] INFO -- : building spec/ruby/optional/capi/ext/basic_object_spec.so I, [2024-05-24T07:44:50.795747 #209631] INFO -- : building spec/ruby/optional/capi/ext/bignum_spec.so I, [2024-05-24T07:44:50.795931 #209631] INFO -- : building spec/ruby/optional/capi/ext/binding_spec.so I, [2024-05-24T07:44:50.796173 #209631] INFO -- : building spec/ruby/optional/capi/ext/boolean_spec.so I, [2024-05-24T07:44:50.797512 #209631] INFO -- : building spec/ruby/optional/capi/ext/class_id_under_autoload_spec.so I, [2024-05-24T07:44:50.798111 #209631] INFO -- : building spec/ruby/optional/capi/ext/class_spec.so I, [2024-05-24T07:44:50.798498 #209631] INFO -- : building spec/ruby/optional/capi/ext/class_under_autoload_spec.so I, [2024-05-24T07:44:50.799167 #209631] INFO -- : building spec/ruby/optional/capi/ext/complex_spec.so I, [2024-05-24T07:44:50.799992 #209631] INFO -- : building spec/ruby/optional/capi/ext/constants_spec.so I, [2024-05-24T07:44:50.800310 #209631] INFO -- : building spec/ruby/optional/capi/ext/data_spec.so I, [2024-05-24T07:44:50.801137 #209631] INFO -- : building spec/ruby/optional/capi/ext/debug_spec.so I, [2024-05-24T07:44:50.801957 #209631] INFO -- : building spec/ruby/optional/capi/ext/encoding_spec.so I, [2024-05-24T07:44:50.802249 #209631] INFO -- : building spec/ruby/optional/capi/ext/enumerator_spec.so I, [2024-05-24T07:44:50.802847 #209631] INFO -- : building spec/ruby/optional/capi/ext/exception_spec.so I, [2024-05-24T07:44:50.803195 #209631] INFO -- : building spec/ruby/optional/capi/ext/fiber_spec.so I, [2024-05-24T07:44:50.803872 #209631] INFO -- : building spec/ruby/optional/capi/ext/file_spec.so I, [2024-05-24T07:44:50.804344 #209631] INFO -- : building spec/ruby/optional/capi/ext/fixnum_spec.so I, [2024-05-24T07:44:50.828076 #209631] INFO -- : encdb.h unchanged I, [2024-05-24T07:44:50.830155 #209631] INFO -- : building spec/ruby/optional/capi/ext/float_spec.so I, [2024-05-24T07:44:50.937789 #209631] INFO -- : building spec/ruby/optional/capi/ext/gc_spec.so I, [2024-05-24T07:44:50.938553 #209631] INFO -- : building spec/ruby/optional/capi/ext/globals_spec.so I, [2024-05-24T07:44:50.941187 #209631] INFO -- : building spec/ruby/optional/capi/ext/hash_spec.so I, [2024-05-24T07:44:50.946492 #209631] INFO -- : building spec/ruby/optional/capi/ext/integer_spec.so I, [2024-05-24T07:44:50.948434 #209631] INFO -- : building spec/ruby/optional/capi/ext/io_spec.so I, [2024-05-24T07:44:50.954150 #209631] INFO -- : building spec/ruby/optional/capi/ext/kernel_spec.so I, [2024-05-24T07:44:50.954382 #209631] INFO -- : building spec/ruby/optional/capi/ext/language_spec.so I, [2024-05-24T07:44:50.965554 #209631] INFO -- : building spec/ruby/optional/capi/ext/marshal_spec.so I, [2024-05-24T07:44:50.973095 #209631] INFO -- : building spec/ruby/optional/capi/ext/module_spec.so I, [2024-05-24T07:44:50.974396 #209631] INFO -- : building spec/ruby/optional/capi/ext/module_under_autoload_spec.so I, [2024-05-24T07:44:50.979438 #209631] INFO -- : building spec/ruby/optional/capi/ext/mutex_spec.so I, [2024-05-24T07:44:50.981584 #209631] INFO -- : building spec/ruby/optional/capi/ext/numeric_spec.so I, [2024-05-24T07:44:50.990546 #209631] INFO -- : building spec/ruby/optional/capi/ext/object_spec.so I, [2024-05-24T07:44:50.991500 #209631] INFO -- : building spec/ruby/optional/capi/ext/proc_spec.so I, [2024-05-24T07:44:50.996364 #209631] INFO -- : building spec/ruby/optional/capi/ext/range_spec.so I, [2024-05-24T07:44:50.998485 #209631] INFO -- : building spec/ruby/optional/capi/ext/rational_spec.so I, [2024-05-24T07:44:51.042226 #209631] INFO -- : building spec/ruby/optional/capi/ext/rbasic_spec.so I, [2024-05-24T07:44:51.066006 #209631] INFO -- : building spec/ruby/optional/capi/ext/regexp_spec.so I, [2024-05-24T07:44:51.096251 #209631] INFO -- : building spec/ruby/optional/capi/ext/string_spec.so I, [2024-05-24T07:44:51.111302 #209631] INFO -- : building spec/ruby/optional/capi/ext/struct_spec.so I, [2024-05-24T07:44:51.112016 #209631] INFO -- : building spec/ruby/optional/capi/ext/st_spec.so I, [2024-05-24T07:44:51.112994 #209631] INFO -- : building spec/ruby/optional/capi/ext/symbol_spec.so I, [2024-05-24T07:44:51.113556 #209631] INFO -- : building spec/ruby/optional/capi/ext/thread_spec.so I, [2024-05-24T07:44:51.125364 #209631] INFO -- : building spec/ruby/optional/capi/ext/time_spec.so I, [2024-05-24T07:44:51.128974 #209631] INFO -- : building spec/ruby/optional/capi/ext/tracepoint_spec.so I, [2024-05-24T07:44:51.141949 #209631] INFO -- : building spec/ruby/optional/capi/ext/typed_data_spec.so I, [2024-05-24T07:44:51.150022 #209631] INFO -- : building spec/ruby/optional/capi/ext/util_spec.so I, [2024-05-24T07:44:51.157570 #209631] INFO -- : making enc I, [2024-05-24T07:44:51.161972 #209631] INFO -- : making srcs under enc I, [2024-05-24T07:44:51.187404 #209631] INFO -- : make[1]: Entering directory '/tmp/ruby/build/trunk' I, [2024-05-24T07:44:51.187481 #209631] INFO -- : make[1]: Nothing to be done for 'enc'. I, [2024-05-24T07:44:51.187520 #209631] INFO -- : make[1]: Leaving directory '/tmp/ruby/build/trunk' I, [2024-05-24T07:44:51.209512 #209631] INFO -- : make[1]: Entering directory '/tmp/ruby/build/trunk' I, [2024-05-24T07:44:51.209580 #209631] INFO -- : make[1]: Nothing to be done for 'srcs'. I, [2024-05-24T07:44:51.209595 #209631] INFO -- : make[1]: Leaving directory '/tmp/ruby/build/trunk' I, [2024-05-24T07:44:51.210288 #209631] INFO -- : generating transdb.h I, [2024-05-24T07:44:51.338658 #209631] INFO -- : transdb.h unchanged I, [2024-05-24T07:44:51.340021 #209631] INFO -- : generating makefiles ext/configure-ext.mk I, [2024-05-24T07:44:51.341107 #209631] INFO -- : making trans I, [2024-05-24T07:44:51.366693 #209631] INFO -- : ext/configure-ext.mk updated I, [2024-05-24T07:44:51.369190 #209631] INFO -- : make[1]: Entering directory '/tmp/ruby/build/trunk' I, [2024-05-24T07:44:51.377209 #209631] INFO -- : make[1]: Entering directory '/tmp/ruby/build/trunk' I, [2024-05-24T07:44:51.377297 #209631] INFO -- : make[1]: Nothing to be done for 'trans'. I, [2024-05-24T07:44:51.377306 #209631] INFO -- : make[1]: Leaving directory '/tmp/ruby/build/trunk' I, [2024-05-24T07:44:51.378064 #209631] INFO -- : making encs I, [2024-05-24T07:44:51.437692 #209631] INFO -- : make[1]: Entering directory '/tmp/ruby/build/trunk' I, [2024-05-24T07:44:51.437755 #209631] INFO -- : make[1]: Nothing to be done for 'encs'. I, [2024-05-24T07:44:51.437762 #209631] INFO -- : make[1]: Leaving directory '/tmp/ruby/build/trunk' I, [2024-05-24T07:44:51.522311 #209631] INFO -- : make[1]: Leaving directory '/tmp/ruby/build/trunk' I, [2024-05-24T07:44:51.523168 #209631] INFO -- : generating makefile exts.mk I, [2024-05-24T07:44:51.560560 #209631] INFO -- : exts.mk unchanged I, [2024-05-24T07:44:51.565602 #209631] INFO -- : make[1]: Entering directory '/tmp/ruby/build/trunk' I, [2024-05-24T07:44:51.584157 #209631] INFO -- : make[2]: Entering directory '/tmp/ruby/build/trunk/ext/digest' I, [2024-05-24T07:44:51.585362 #209631] INFO -- : make[2]: Entering directory '/tmp/ruby/build/trunk/ext/json' I, [2024-05-24T07:44:51.585782 #209631] INFO -- : make[2]: Entering directory '/tmp/ruby/build/trunk/ext/coverage' I, [2024-05-24T07:44:51.586366 #209631] INFO -- : make[2]: Entering directory '/tmp/ruby/build/trunk/ext/io/console' I, [2024-05-24T07:44:51.586403 #209631] INFO -- : make[2]: Entering directory '/tmp/ruby/build/trunk/ext/date' I, [2024-05-24T07:44:51.586849 #209631] INFO -- : make[2]: Entering directory '/tmp/ruby/build/trunk/ext/rubyvm' I, [2024-05-24T07:44:51.587567 #209631] INFO -- : make[2]: Entering directory '/tmp/ruby/build/trunk/ext/monitor' I, [2024-05-24T07:44:51.588245 #209631] INFO -- : make[2]: Entering directory '/tmp/ruby/build/trunk/ext/pathname' I, [2024-05-24T07:44:51.588583 #209631] INFO -- : make[2]: Entering directory '/tmp/ruby/build/trunk/ext/pty' I, [2024-05-24T07:44:51.588608 #209631] INFO -- : make[2]: Entering directory '/tmp/ruby/build/trunk/ext/fiddle' I, [2024-05-24T07:44:51.589502 #209631] INFO -- : make[2]: Leaving directory '/tmp/ruby/build/trunk/ext/rubyvm' I, [2024-05-24T07:44:51.589698 #209631] INFO -- : make[2]: Leaving directory '/tmp/ruby/build/trunk/ext/coverage' I, [2024-05-24T07:44:51.589729 #209631] INFO -- : make[2]: Leaving directory '/tmp/ruby/build/trunk/ext/io/console' I, [2024-05-24T07:44:51.589926 #209631] INFO -- : make[2]: Entering directory '/tmp/ruby/build/trunk/ext/objspace' I, [2024-05-24T07:44:51.590409 #209631] INFO -- : make[2]: Entering directory '/tmp/ruby/build/trunk/ext/psych' I, [2024-05-24T07:44:51.590435 #209631] INFO -- : make[2]: Leaving directory '/tmp/ruby/build/trunk/ext/digest' I, [2024-05-24T07:44:51.590521 #209631] INFO -- : make[2]: Leaving directory '/tmp/ruby/build/trunk/ext/date' I, [2024-05-24T07:44:51.590773 #209631] INFO -- : make[2]: Leaving directory '/tmp/ruby/build/trunk/ext/monitor' I, [2024-05-24T07:44:51.590984 #209631] INFO -- : make[2]: Entering directory '/tmp/ruby/build/trunk/.bundle/gems/bigdecimal-3.1.8/ext/bigdecimal' I, [2024-05-24T07:44:51.591607 #209631] INFO -- : make[2]: Leaving directory '/tmp/ruby/build/trunk/ext/pathname' I, [2024-05-24T07:44:51.591839 #209631] INFO -- : make[2]: Leaving directory '/tmp/ruby/build/trunk/ext/pty' I, [2024-05-24T07:44:51.591909 #209631] INFO -- : make[2]: Entering directory '/tmp/ruby/build/trunk/.bundle/gems/nkf-0.2.0/ext/nkf' I, [2024-05-24T07:44:51.592018 #209631] INFO -- : make[2]: Entering directory '/tmp/ruby/build/trunk/.bundle/gems/debug-1.9.2/ext/debug' I, [2024-05-24T07:44:51.592254 #209631] INFO -- : make[2]: Entering directory '/tmp/ruby/build/trunk/.bundle/gems/racc-1.7.3/ext/racc/cparse' I, [2024-05-24T07:44:51.592814 #209631] INFO -- : make[2]: Entering directory '/tmp/ruby/build/trunk/.bundle/gems/racc-1.8.0/ext/racc/cparse' I, [2024-05-24T07:44:51.593029 #209631] INFO -- : make[2]: Entering directory '/tmp/ruby/build/trunk/ext/ripper' I, [2024-05-24T07:44:51.593413 #209631] INFO -- : make[2]: Entering directory '/tmp/ruby/build/trunk/.bundle/gems/rbs-3.4.4/ext/rbs_extension' I, [2024-05-24T07:44:51.593448 #209631] INFO -- : make[2]: Entering directory '/tmp/ruby/build/trunk/.bundle/gems/syslog-0.1.2/ext/syslog' I, [2024-05-24T07:44:51.593954 #209631] INFO -- : make[2]: Leaving directory '/tmp/ruby/build/trunk/ext/objspace' I, [2024-05-24T07:44:51.595041 #209631] INFO -- : make[2]: Leaving directory '/tmp/ruby/build/trunk/ext/json' I, [2024-05-24T07:44:51.597258 #209631] INFO -- : make[2]: Entering directory '/tmp/ruby/build/trunk/ext/socket' I, [2024-05-24T07:44:51.598192 #209631] INFO -- : make[2]: Leaving directory '/tmp/ruby/build/trunk/ext/fiddle' I, [2024-05-24T07:44:51.598439 #209631] INFO -- : make[2]: Leaving directory '/tmp/ruby/build/trunk/ext/ripper' I, [2024-05-24T07:44:51.600721 #209631] INFO -- : make[2]: Entering directory '/tmp/ruby/build/trunk/ext/digest/sha2' I, [2024-05-24T07:44:51.601937 #209631] INFO -- : make[2]: Entering directory '/tmp/ruby/build/trunk/ext/openssl' I, [2024-05-24T07:44:51.603096 #209631] INFO -- : make[2]: Leaving directory '/tmp/ruby/build/trunk/ext/digest/sha2' I, [2024-05-24T07:44:51.603551 #209631] INFO -- : make[2]: Leaving directory '/tmp/ruby/build/trunk/ext/socket' I, [2024-05-24T07:44:51.607811 #209631] INFO -- : make[2]: Leaving directory '/tmp/ruby/build/trunk/ext/psych' I, [2024-05-24T07:44:51.613723 #209631] INFO -- : make[2]: Leaving directory '/tmp/ruby/build/trunk/ext/openssl' I, [2024-05-24T07:44:51.615853 #209631] INFO -- : make[2]: Leaving directory '/tmp/ruby/build/trunk/.bundle/gems/debug-1.9.2/ext/debug' I, [2024-05-24T07:44:51.616175 #209631] INFO -- : make[2]: Leaving directory '/tmp/ruby/build/trunk/.bundle/gems/racc-1.8.0/ext/racc/cparse' I, [2024-05-24T07:44:51.616394 #209631] INFO -- : make[2]: Leaving directory '/tmp/ruby/build/trunk/.bundle/gems/rbs-3.4.4/ext/rbs_extension' I, [2024-05-24T07:44:51.617460 #209631] INFO -- : make[2]: Leaving directory '/tmp/ruby/build/trunk/.bundle/gems/syslog-0.1.2/ext/syslog' I, [2024-05-24T07:44:51.622831 #209631] INFO -- : make[2]: Leaving directory '/tmp/ruby/build/trunk/.bundle/gems/bigdecimal-3.1.8/ext/bigdecimal' I, [2024-05-24T07:44:51.623489 #209631] INFO -- : make[2]: Leaving directory '/tmp/ruby/build/trunk/.bundle/gems/racc-1.7.3/ext/racc/cparse' I, [2024-05-24T07:44:51.623520 #209631] INFO -- : make[2]: Leaving directory '/tmp/ruby/build/trunk/.bundle/gems/nkf-0.2.0/ext/nkf' I, [2024-05-24T07:44:51.647053 #209631] INFO -- : make[2]: Entering directory '/tmp/ruby/build/trunk' I, [2024-05-24T07:44:51.724195 #209631] INFO -- : linking ruby I, [2024-05-24T07:44:51.746444 #209631] INFO -- : make[2]: Leaving directory '/tmp/ruby/build/trunk' I, [2024-05-24T07:44:51.746939 #209631] INFO -- : make[1]: Leaving directory '/tmp/ruby/build/trunk' I, [2024-05-24T07:44:51.751195 #209631] INFO -- : make[1]: Entering directory '/tmp/ruby/build/trunk' I, [2024-05-24T07:44:51.751221 #209631] INFO -- : make[1]: Nothing to be done for 'note'. I, [2024-05-24T07:44:51.751229 #209631] INFO -- : make[1]: Leaving directory '/tmp/ruby/build/trunk' I, [2024-05-24T07:44:51.751935 #209631] INFO -- : $$$[end] "make all -j20" exit with 0. I, [2024-05-24T07:44:51.752102 #209631] INFO -- : $$$[beg] make install -j20 I, [2024-05-24T07:44:51.825751 #209631] INFO -- : Update power_assert to 84e85124c5014a139af39161d484156cfe87a9ed I, [2024-05-24T07:44:51.826029 #209631] INFO -- : Update rbs to ba7872795d5de04adb8ff500c0e6afdc81a041dd I, [2024-05-24T07:44:51.826609 #209631] INFO -- : Update typeprof to b19a6416da3a05d57fadd6ffdadb382b6d236ca5 I, [2024-05-24T07:44:51.827630 #209631] INFO -- : echo 84e85124c5014a139af39161d484156cfe87a9ed | /bin/sh /tmp/ruby/src/trunk/tool/ifchange /tmp/ruby/src/trunk/.bundle/.timestamp/power_assert.revision - I, [2024-05-24T07:44:51.828637 #209631] INFO -- : BASERUBY = /usr/bin/ruby --disable=gems I, [2024-05-24T07:44:51.828703 #209631] INFO -- : CC = gcc I, [2024-05-24T07:44:51.828722 #209631] INFO -- : LD = ld I, [2024-05-24T07:44:51.828739 #209631] INFO -- : LDSHARED = gcc -shared I, [2024-05-24T07:44:51.828755 #209631] INFO -- : CFLAGS = -O3 -fno-fast-math -ggdb3 -Wall -Wextra -Wdeprecated-declarations -Wdiv-by-zero -Wduplicated-cond -Wimplicit-function-declaration -Wimplicit-int -Wpointer-arith -Wwrite-strings -Wold-style-definition -Wimplicit-fallthrough=0 -Wmissing-noreturn -Wno-cast-function-type -Wno-constant-logical-operand -Wno-long-long -Wno-missing-field-initializers -Wno-overlength-strings -Wno-packed-bitfield-compat -Wno-parentheses-equality -Wno-self-assign -Wno-tautological-compare -Wno-unused-parameter -Wno-unused-value -Wsuggest-attribute=format -Wsuggest-attribute=noreturn -Wunused-variable -Wmisleading-indentation -Wundef -fPIC I, [2024-05-24T07:44:51.828772 #209631] INFO -- : XCFLAGS = -U_FORTIFY_SOURCE -D_FORTIFY_SOURCE=2 -fstack-protector-strong -fno-strict-overflow -fvisibility=hidden -fexcess-precision=standard -DRUBY_EXPORT -I. -I.ext/include/x86_64-linux -I/tmp/ruby/src/trunk/include -I/tmp/ruby/src/trunk -I/tmp/ruby/src/trunk/prism -I/tmp/ruby/src/trunk/enc/unicode/15.0.0 I, [2024-05-24T07:44:51.828788 #209631] INFO -- : CPPFLAGS = I, [2024-05-24T07:44:51.828803 #209631] INFO -- : DLDFLAGS = -Wl,--compress-debug-sections=zlib -Wl,-soname,libruby.so.3.4 -fstack-protector-strong I, [2024-05-24T07:44:51.828817 #209631] INFO -- : SOLIBS = -lz -lrt -lrt -lgmp -ldl -lcrypt -lm -lpthread I, [2024-05-24T07:44:51.828835 #209631] INFO -- : LANG = en_US.UTF-8 I, [2024-05-24T07:44:51.828851 #209631] INFO -- : LC_ALL = I, [2024-05-24T07:44:51.828866 #209631] INFO -- : LC_CTYPE = I, [2024-05-24T07:44:51.828880 #209631] INFO -- : MFLAGS = -j20 --jobserver-auth=4,5 I, [2024-05-24T07:44:51.828894 #209631] INFO -- : RUSTC = no I, [2024-05-24T07:44:51.828909 #209631] INFO -- : YJIT_RUSTC_ARGS = --crate-name=yjit --crate-type=staticlib --edition=2021 -g -C lto=thin -C opt-level=3 -C overflow-checks=on '--out-dir=/tmp/ruby/build/trunk/yjit/target/release/' /tmp/ruby/src/trunk/yjit/src/lib.rs I, [2024-05-24T07:44:51.830576 #209631] INFO -- : /tmp/ruby/src/trunk/.bundle/.timestamp/power_assert.revision unchanged I, [2024-05-24T07:44:51.860443 #209631] INFO -- : echo ba7872795d5de04adb8ff500c0e6afdc81a041dd | /bin/sh /tmp/ruby/src/trunk/tool/ifchange /tmp/ruby/src/trunk/.bundle/.timestamp/rbs.revision - I, [2024-05-24T07:44:51.860572 #209631] INFO -- : echo b19a6416da3a05d57fadd6ffdadb382b6d236ca5 | /bin/sh /tmp/ruby/src/trunk/tool/ifchange /tmp/ruby/src/trunk/.bundle/.timestamp/typeprof.revision - I, [2024-05-24T07:44:51.861387 #209631] INFO -- : gcc (Ubuntu 11.4.0-1ubuntu1~22.04) 11.4.0 I, [2024-05-24T07:44:51.861437 #209631] INFO -- : Copyright (C) 2021 Free Software Foundation, Inc. I, [2024-05-24T07:44:51.861450 #209631] INFO -- : This is free software; see the source for copying conditions. There is NO I, [2024-05-24T07:44:51.861462 #209631] INFO -- : warranty; not even for MERCHANTABILITY or FITNESS FOR A PARTICULAR PURPOSE. I, [2024-05-24T07:44:51.861473 #209631] INFO -- : I, [2024-05-24T07:44:51.861484 #209631] INFO -- : generating encdb.h I, [2024-05-24T07:44:51.862572 #209631] INFO -- : generating enc.mk I, [2024-05-24T07:44:51.862624 #209631] INFO -- : /tmp/ruby/src/trunk/.bundle/.timestamp/rbs.revision unchanged I, [2024-05-24T07:44:51.862751 #209631] INFO -- : /tmp/ruby/src/trunk/.bundle/.timestamp/typeprof.revision unchanged I, [2024-05-24T07:44:51.885952 #209631] INFO -- : encdb.h unchanged I, [2024-05-24T07:44:51.887192 #209631] INFO -- : Building power_assert@84e85124c5014a139af39161d484156cfe87a9ed to /tmp/ruby/src/trunk/gems/power_assert-2.0.3.gem I, [2024-05-24T07:44:51.957206 #209631] INFO -- : Successfully built RubyGem I, [2024-05-24T07:44:51.957257 #209631] INFO -- : Name: power_assert I, [2024-05-24T07:44:51.957271 #209631] INFO -- : Version: 2.0.4dev I, [2024-05-24T07:44:51.957283 #209631] INFO -- : File: power_assert-2.0.4dev.gem I, [2024-05-24T07:44:51.959238 #209631] INFO -- : Extracting bundle gem power_assert-2.0.3... I, [2024-05-24T07:44:51.984453 #209631] INFO -- : making srcs under enc I, [2024-05-24T07:44:51.984520 #209631] INFO -- : making enc I, [2024-05-24T07:44:52.001577 #209631] INFO -- : make[1]: Entering directory '/tmp/ruby/build/trunk' I, [2024-05-24T07:44:52.001631 #209631] INFO -- : make[1]: Nothing to be done for 'enc'. I, [2024-05-24T07:44:52.001646 #209631] INFO -- : make[1]: Leaving directory '/tmp/ruby/build/trunk' I, [2024-05-24T07:44:52.013880 #209631] INFO -- : make[1]: Entering directory '/tmp/ruby/build/trunk' I, [2024-05-24T07:44:52.013941 #209631] INFO -- : make[1]: Nothing to be done for 'srcs'. I, [2024-05-24T07:44:52.013955 #209631] INFO -- : make[1]: Leaving directory '/tmp/ruby/build/trunk' I, [2024-05-24T07:44:52.014579 #209631] INFO -- : generating transdb.h I, [2024-05-24T07:44:52.022305 #209631] INFO -- : Try with hash version of bundled gems instead of gems/power_assert-2.0.3.gem. We don't use this gem with release version of Ruby. I, [2024-05-24T07:44:52.027276 #209631] INFO -- : Unpacked gems/power_assert-2.0.4dev.gem I, [2024-05-24T07:44:52.111175 #209631] INFO -- : transdb.h unchanged I, [2024-05-24T07:44:52.112756 #209631] INFO -- : generating makefiles ext/configure-ext.mk I, [2024-05-24T07:44:52.113107 #209631] INFO -- : making trans I, [2024-05-24T07:44:52.139980 #209631] INFO -- : ext/configure-ext.mk unchanged I, [2024-05-24T07:44:52.142352 #209631] INFO -- : make[1]: Entering directory '/tmp/ruby/build/trunk' I, [2024-05-24T07:44:52.147390 #209631] INFO -- : make[1]: Entering directory '/tmp/ruby/build/trunk' I, [2024-05-24T07:44:52.147482 #209631] INFO -- : make[1]: Nothing to be done for 'trans'. I, [2024-05-24T07:44:52.147492 #209631] INFO -- : make[1]: Leaving directory '/tmp/ruby/build/trunk' I, [2024-05-24T07:44:52.210159 #209631] INFO -- : making encs I, [2024-05-24T07:44:52.267109 #209631] INFO -- : make[1]: Entering directory '/tmp/ruby/build/trunk' I, [2024-05-24T07:44:52.267165 #209631] INFO -- : make[1]: Nothing to be done for 'encs'. I, [2024-05-24T07:44:52.267175 #209631] INFO -- : make[1]: Leaving directory '/tmp/ruby/build/trunk' I, [2024-05-24T07:44:52.298641 #209631] INFO -- : make[1]: Leaving directory '/tmp/ruby/build/trunk' I, [2024-05-24T07:44:52.299330 #209631] INFO -- : generating makefile exts.mk I, [2024-05-24T07:44:52.336518 #209631] INFO -- : exts.mk unchanged I, [2024-05-24T07:44:52.341531 #209631] INFO -- : make[1]: Entering directory '/tmp/ruby/build/trunk' I, [2024-05-24T07:44:52.360331 #209631] INFO -- : make[2]: Entering directory '/tmp/ruby/build/trunk/ext/digest' I, [2024-05-24T07:44:52.360623 #209631] INFO -- : make[2]: Entering directory '/tmp/ruby/build/trunk/ext/json' I, [2024-05-24T07:44:52.361818 #209631] INFO -- : make[2]: Entering directory '/tmp/ruby/build/trunk/ext/coverage' I, [2024-05-24T07:44:52.362140 #209631] INFO -- : make[2]: Entering directory '/tmp/ruby/build/trunk/ext/io/console' I, [2024-05-24T07:44:52.362560 #209631] INFO -- : make[2]: Entering directory '/tmp/ruby/build/trunk/ext/date' I, [2024-05-24T07:44:52.363341 #209631] INFO -- : make[2]: Entering directory '/tmp/ruby/build/trunk/ext/monitor' I, [2024-05-24T07:44:52.363781 #209631] INFO -- : make[2]: Entering directory '/tmp/ruby/build/trunk/ext/rubyvm' I, [2024-05-24T07:44:52.364013 #209631] INFO -- : make[2]: Entering directory '/tmp/ruby/build/trunk/ext/pathname' I, [2024-05-24T07:44:52.364659 #209631] INFO -- : make[2]: Entering directory '/tmp/ruby/build/trunk/ext/fiddle' I, [2024-05-24T07:44:52.364801 #209631] INFO -- : make[2]: Leaving directory '/tmp/ruby/build/trunk/ext/coverage' I, [2024-05-24T07:44:52.364837 #209631] INFO -- : make[2]: Entering directory '/tmp/ruby/build/trunk/ext/pty' I, [2024-05-24T07:44:52.365494 #209631] INFO -- : make[2]: Leaving directory '/tmp/ruby/build/trunk/ext/io/console' I, [2024-05-24T07:44:52.365518 #209631] INFO -- : make[2]: Entering directory '/tmp/ruby/build/trunk/ext/objspace' I, [2024-05-24T07:44:52.365917 #209631] INFO -- : make[2]: Leaving directory '/tmp/ruby/build/trunk/ext/monitor' I, [2024-05-24T07:44:52.366047 #209631] INFO -- : make[2]: Leaving directory '/tmp/ruby/build/trunk/ext/date' I, [2024-05-24T07:44:52.366388 #209631] INFO -- : make[2]: Entering directory '/tmp/ruby/build/trunk/ext/psych' I, [2024-05-24T07:44:52.366404 #209631] INFO -- : make[2]: Leaving directory '/tmp/ruby/build/trunk/ext/rubyvm' I, [2024-05-24T07:44:52.366570 #209631] INFO -- : make[2]: Leaving directory '/tmp/ruby/build/trunk/ext/digest' I, [2024-05-24T07:44:52.366798 #209631] INFO -- : make[2]: Leaving directory '/tmp/ruby/build/trunk/ext/json' I, [2024-05-24T07:44:52.367173 #209631] INFO -- : make[2]: Entering directory '/tmp/ruby/build/trunk/.bundle/gems/bigdecimal-3.1.8/ext/bigdecimal' I, [2024-05-24T07:44:52.367253 #209631] INFO -- : make[2]: Leaving directory '/tmp/ruby/build/trunk/ext/pathname' I, [2024-05-24T07:44:52.367421 #209631] INFO -- : make[2]: Leaving directory '/tmp/ruby/build/trunk/ext/pty' I, [2024-05-24T07:44:52.368580 #209631] INFO -- : make[2]: Entering directory '/tmp/ruby/build/trunk/ext/ripper' I, [2024-05-24T07:44:52.368602 #209631] INFO -- : make[2]: Leaving directory '/tmp/ruby/build/trunk/ext/objspace' I, [2024-05-24T07:44:52.369149 #209631] INFO -- : make[2]: Entering directory '/tmp/ruby/build/trunk/.bundle/gems/racc-1.8.0/ext/racc/cparse' I, [2024-05-24T07:44:52.369576 #209631] INFO -- : make[2]: Entering directory '/tmp/ruby/build/trunk/.bundle/gems/syslog-0.1.2/ext/syslog' I, [2024-05-24T07:44:52.369602 #209631] INFO -- : make[2]: Entering directory '/tmp/ruby/build/trunk/.bundle/gems/debug-1.9.2/ext/debug' I, [2024-05-24T07:44:52.369783 #209631] INFO -- : make[2]: Entering directory '/tmp/ruby/build/trunk/.bundle/gems/racc-1.7.3/ext/racc/cparse' I, [2024-05-24T07:44:52.369894 #209631] INFO -- : make[2]: Entering directory '/tmp/ruby/build/trunk/.bundle/gems/rbs-3.4.4/ext/rbs_extension' I, [2024-05-24T07:44:52.371815 #209631] INFO -- : make[2]: Entering directory '/tmp/ruby/build/trunk/.bundle/gems/nkf-0.2.0/ext/nkf' I, [2024-05-24T07:44:52.373530 #209631] INFO -- : make[2]: Leaving directory '/tmp/ruby/build/trunk/ext/fiddle' I, [2024-05-24T07:44:52.373651 #209631] INFO -- : make[2]: Leaving directory '/tmp/ruby/build/trunk/ext/ripper' I, [2024-05-24T07:44:52.373678 #209631] INFO -- : make[2]: Entering directory '/tmp/ruby/build/trunk/ext/digest/sha2' I, [2024-05-24T07:44:52.375201 #209631] INFO -- : make[2]: Entering directory '/tmp/ruby/build/trunk/ext/socket' I, [2024-05-24T07:44:52.375839 #209631] INFO -- : make[2]: Leaving directory '/tmp/ruby/build/trunk/ext/digest/sha2' I, [2024-05-24T07:44:52.377102 #209631] INFO -- : make[2]: Leaving directory '/tmp/ruby/build/trunk/ext/psych' I, [2024-05-24T07:44:52.377354 #209631] INFO -- : make[2]: Entering directory '/tmp/ruby/build/trunk/ext/openssl' I, [2024-05-24T07:44:52.383788 #209631] INFO -- : make[2]: Leaving directory '/tmp/ruby/build/trunk/ext/socket' I, [2024-05-24T07:44:52.388649 #209631] INFO -- : make[2]: Leaving directory '/tmp/ruby/build/trunk/ext/openssl' I, [2024-05-24T07:44:52.390746 #209631] INFO -- : make[2]: Leaving directory '/tmp/ruby/build/trunk/.bundle/gems/bigdecimal-3.1.8/ext/bigdecimal' I, [2024-05-24T07:44:52.393141 #209631] INFO -- : make[2]: Leaving directory '/tmp/ruby/build/trunk/.bundle/gems/syslog-0.1.2/ext/syslog' I, [2024-05-24T07:44:52.394133 #209631] INFO -- : make[2]: Leaving directory '/tmp/ruby/build/trunk/.bundle/gems/racc-1.8.0/ext/racc/cparse' I, [2024-05-24T07:44:52.394788 #209631] INFO -- : make[2]: Leaving directory '/tmp/ruby/build/trunk/.bundle/gems/rbs-3.4.4/ext/rbs_extension' I, [2024-05-24T07:44:52.395509 #209631] INFO -- : make[2]: Leaving directory '/tmp/ruby/build/trunk/.bundle/gems/racc-1.7.3/ext/racc/cparse' I, [2024-05-24T07:44:52.400741 #209631] INFO -- : make[2]: Leaving directory '/tmp/ruby/build/trunk/.bundle/gems/nkf-0.2.0/ext/nkf' I, [2024-05-24T07:44:52.402258 #209631] INFO -- : make[2]: Leaving directory '/tmp/ruby/build/trunk/.bundle/gems/debug-1.9.2/ext/debug' I, [2024-05-24T07:44:52.427816 #209631] INFO -- : make[2]: Entering directory '/tmp/ruby/build/trunk' I, [2024-05-24T07:44:52.496646 #209631] INFO -- : make[2]: 'ruby' is up to date. I, [2024-05-24T07:44:52.496682 #209631] INFO -- : make[2]: Leaving directory '/tmp/ruby/build/trunk' I, [2024-05-24T07:44:52.497096 #209631] INFO -- : make[1]: Leaving directory '/tmp/ruby/build/trunk' I, [2024-05-24T07:44:52.501167 #209631] INFO -- : make[1]: Entering directory '/tmp/ruby/build/trunk' I, [2024-05-24T07:44:52.501192 #209631] INFO -- : make[1]: Nothing to be done for 'note'. I, [2024-05-24T07:44:52.501199 #209631] INFO -- : make[1]: Leaving directory '/tmp/ruby/build/trunk' I, [2024-05-24T07:44:52.501516 #209631] INFO -- : ./miniruby -I/tmp/ruby/src/trunk/lib -I. -I.ext/common /tmp/ruby/src/trunk/tool/runruby.rb --extout=.ext -- --disable-gems -r./x86_64-linux-fake /tmp/ruby/src/trunk/tool/rbinstall.rb --make="make" --dest-dir="" --extout=".ext" --ext-build-dir="./ext" --mflags="-j20 --jobserver-auth=4,5" --make-flags=" -j20 --jobserver-auth=4,5" --data-mode=0644 --prog-mode=0755 --installed-list .installed.list --mantype="doc" --gnumake --install=all --exclude=doc I, [2024-05-24T07:44:52.597757 #209631] INFO -- : Installing to I, [2024-05-24T07:44:52.597823 #209631] INFO -- : installing binary commands: /tmp/ruby/install/trunk/bin I, [2024-05-24T07:44:52.597917 #209631] INFO -- : installing base libraries: /tmp/ruby/install/trunk/lib I, [2024-05-24T07:44:52.605490 #209631] INFO -- : installing arch files: /tmp/ruby/install/trunk/lib/ruby/3.4.0+0/x86_64-linux I, [2024-05-24T07:44:52.605516 #209631] INFO -- : installing pkgconfig data: /tmp/ruby/install/trunk/lib/pkgconfig I, [2024-05-24T07:44:52.605522 #209631] INFO -- : installing extension objects: /tmp/ruby/install/trunk/lib/ruby/3.4.0+0/x86_64-linux I, [2024-05-24T07:44:52.615304 #209631] INFO -- : installing extension objects: /tmp/ruby/install/trunk/lib/ruby/site_ruby/3.4.0+0/x86_64-linux I, [2024-05-24T07:44:52.615327 #209631] INFO -- : installing extension objects: /tmp/ruby/install/trunk/lib/ruby/vendor_ruby/3.4.0+0/x86_64-linux I, [2024-05-24T07:44:52.615342 #209631] INFO -- : installing extension headers: /tmp/ruby/install/trunk/include/ruby-3.4.0+0/x86_64-linux I, [2024-05-24T07:44:52.615497 #209631] INFO -- : installing extension scripts: /tmp/ruby/install/trunk/lib/ruby/3.4.0+0 I, [2024-05-24T07:44:52.618256 #209631] INFO -- : installing extension scripts: /tmp/ruby/install/trunk/lib/ruby/site_ruby/3.4.0+0 I, [2024-05-24T07:44:52.618277 #209631] INFO -- : installing extension scripts: /tmp/ruby/install/trunk/lib/ruby/vendor_ruby/3.4.0+0 I, [2024-05-24T07:44:52.618289 #209631] INFO -- : installing extension headers: /tmp/ruby/install/trunk/include/ruby-3.4.0+0/ruby I, [2024-05-24T07:44:52.618295 #209631] INFO -- : installing command scripts: /tmp/ruby/install/trunk/bin I, [2024-05-24T07:44:52.618299 #209631] INFO -- : installing library scripts: /tmp/ruby/install/trunk/lib/ruby/3.4.0+0 I, [2024-05-24T07:44:52.651223 #209631] INFO -- : installing common headers: /tmp/ruby/install/trunk/include/ruby-3.4.0+0 I, [2024-05-24T07:44:52.657311 #209631] INFO -- : installing manpages: /tmp/ruby/install/trunk/share/man/man1 I, [2024-05-24T07:44:52.657336 #209631] INFO -- : installing default gems from lib: /tmp/ruby/install/trunk/lib/ruby/gems/3.4.0+0 I, [2024-05-24T07:44:52.680238 #209631] INFO -- : benchmark 0.3.0 I, [2024-05-24T07:44:52.682177 #209631] INFO -- : bundler 2.6.0.dev I, [2024-05-24T07:44:52.684339 #209631] INFO -- : cgi 0.4.1 I, [2024-05-24T07:44:52.684873 #209631] INFO -- : delegate 0.3.1 I, [2024-05-24T07:44:52.685339 #209631] INFO -- : did_you_mean 1.6.3 I, [2024-05-24T07:44:52.685824 #209631] INFO -- : english 0.8.0 I, [2024-05-24T07:44:52.686657 #209631] INFO -- : erb 4.0.4 I, [2024-05-24T07:44:52.687763 #209631] INFO -- : error_highlight 0.6.0 I, [2024-05-24T07:44:52.688566 #209631] INFO -- : fileutils 1.7.2 I, [2024-05-24T07:44:52.689321 #209631] INFO -- : find 0.2.0 I, [2024-05-24T07:44:52.690360 #209631] INFO -- : forwardable 1.3.3 I, [2024-05-24T07:44:52.690986 #209631] INFO -- : ipaddr 1.2.6 I, [2024-05-24T07:44:52.691462 #209631] INFO -- : irb 1.13.1 I, [2024-05-24T07:44:52.692261 #209631] INFO -- : logger 1.6.0 I, [2024-05-24T07:44:52.692732 #209631] INFO -- : net-http 0.4.1 I, [2024-05-24T07:44:52.693229 #209631] INFO -- : net-protocol 0.2.2 I, [2024-05-24T07:44:52.693712 #209631] INFO -- : open-uri 0.4.1 I, [2024-05-24T07:44:52.694198 #209631] INFO -- : open3 0.2.1 I, [2024-05-24T07:44:52.694609 #209631] INFO -- : optparse 0.5.0 I, [2024-05-24T07:44:52.695073 #209631] INFO -- : ostruct 0.6.0 I, [2024-05-24T07:44:52.695616 #209631] INFO -- : pp 0.5.0 I, [2024-05-24T07:44:52.696107 #209631] INFO -- : prettyprint 0.2.0 I, [2024-05-24T07:44:52.696577 #209631] INFO -- : prism 0.29.0 I, [2024-05-24T07:44:52.697110 #209631] INFO -- : pstore 0.1.3 I, [2024-05-24T07:44:52.697547 #209631] INFO -- : rdoc 6.7.0 I, [2024-05-24T07:44:52.698565 #209631] INFO -- : readline 0.0.4 I, [2024-05-24T07:44:52.699033 #209631] INFO -- : reline 0.5.7 I, [2024-05-24T07:44:52.699451 #209631] INFO -- : resolv 0.4.0 I, [2024-05-24T07:44:52.700101 #209631] INFO -- : ruby2_keywords 0.0.5 I, [2024-05-24T07:44:52.701090 #209631] INFO -- : securerandom 0.3.1 I, [2024-05-24T07:44:52.701838 #209631] INFO -- : set 1.1.0 I, [2024-05-24T07:44:52.702337 #209631] INFO -- : shellwords 0.2.0 I, [2024-05-24T07:44:52.702807 #209631] INFO -- : singleton 0.2.0 I, [2024-05-24T07:44:52.703254 #209631] INFO -- : syntax_suggest 2.0.0 I, [2024-05-24T07:44:52.703889 #209631] INFO -- : tempfile 0.2.1 I, [2024-05-24T07:44:52.704418 #209631] INFO -- : time 0.3.0 I, [2024-05-24T07:44:52.704902 #209631] INFO -- : timeout 0.4.1 I, [2024-05-24T07:44:52.705374 #209631] INFO -- : tmpdir 0.2.0 I, [2024-05-24T07:44:52.705856 #209631] INFO -- : tsort 0.2.0 I, [2024-05-24T07:44:52.706297 #209631] INFO -- : un 0.3.0 I, [2024-05-24T07:44:52.706783 #209631] INFO -- : uri 0.13.0 I, [2024-05-24T07:44:52.707288 #209631] INFO -- : weakref 0.1.3 I, [2024-05-24T07:44:52.707734 #209631] INFO -- : yaml 0.3.0 I, [2024-05-24T07:44:52.708101 #209631] INFO -- : installing default gems from ext: /tmp/ruby/install/trunk/lib/ruby/gems/3.4.0+0 I, [2024-05-24T07:44:52.714717 #209631] INFO -- : date 3.3.4 I, [2024-05-24T07:44:52.715246 #209631] INFO -- : digest 3.1.1 I, [2024-05-24T07:44:52.715723 #209631] INFO -- : etc 1.4.3 I, [2024-05-24T07:44:52.716341 #209631] INFO -- : fcntl 1.1.0 I, [2024-05-24T07:44:52.716815 #209631] INFO -- : fiddle 1.1.3 I, [2024-05-24T07:44:52.717282 #209631] INFO -- : io-console 0.7.2 I, [2024-05-24T07:44:52.717745 #209631] INFO -- : io-nonblock 0.3.0 I, [2024-05-24T07:44:52.718143 #209631] INFO -- : io-wait 0.3.1 I, [2024-05-24T07:44:52.718626 #209631] INFO -- : json 2.7.2 I, [2024-05-24T07:44:52.719147 #209631] INFO -- : openssl 3.2.0 I, [2024-05-24T07:44:52.719754 #209631] INFO -- : pathname 0.3.0 I, [2024-05-24T07:44:52.720211 #209631] INFO -- : psych 5.1.2 I, [2024-05-24T07:44:52.720760 #209631] INFO -- : stringio 3.1.1 I, [2024-05-24T07:44:52.721227 #209631] INFO -- : strscan 3.1.1 I, [2024-05-24T07:44:52.721672 #209631] INFO -- : zlib 3.1.0 I, [2024-05-24T07:44:52.722034 #209631] INFO -- : installing bundled gems: /tmp/ruby/install/trunk/lib/ruby/gems/3.4.0+0 I, [2024-05-24T07:44:52.722604 #209631] INFO -- : minitest 5.23.1 I, [2024-05-24T07:44:52.731132 #209631] INFO -- : rake 13.2.1 I, [2024-05-24T07:44:52.734623 #209631] INFO -- : test-unit 3.6.2 I, [2024-05-24T07:44:52.739446 #209631] INFO -- : rexml 3.2.8 I, [2024-05-24T07:44:52.743334 #209631] INFO -- : rss 0.3.0 I, [2024-05-24T07:44:52.745934 #209631] INFO -- : net-ftp 0.3.4 I, [2024-05-24T07:44:52.747536 #209631] INFO -- : net-imap 0.4.11 I, [2024-05-24T07:44:52.751416 #209631] INFO -- : net-pop 0.1.2 I, [2024-05-24T07:44:52.752421 #209631] INFO -- : net-smtp 0.5.0 I, [2024-05-24T07:44:52.753578 #209631] INFO -- : matrix 0.4.2 I, [2024-05-24T07:44:52.757043 #209631] INFO -- : prime 0.1.2 I, [2024-05-24T07:44:52.761727 #209631] INFO -- : rbs 3.4.4 I, [2024-05-24T07:44:52.784128 #209631] INFO -- : typeprof 0.21.11 I, [2024-05-24T07:44:52.786440 #209631] INFO -- : debug 1.9.2 I, [2024-05-24T07:44:52.790043 #209631] INFO -- : racc 1.8.0 I, [2024-05-24T07:44:52.792744 #209631] INFO -- : mutex_m 0.2.0 I, [2024-05-24T07:44:52.794073 #209631] INFO -- : getoptlong 0.2.1 I, [2024-05-24T07:44:52.795444 #209631] INFO -- : base64 0.2.0 I, [2024-05-24T07:44:52.796557 #209631] INFO -- : bigdecimal 3.1.8 I, [2024-05-24T07:44:52.799096 #209631] INFO -- : observer 0.1.2 I, [2024-05-24T07:44:52.800277 #209631] INFO -- : abbrev 0.1.2 I, [2024-05-24T07:44:52.801542 #209631] INFO -- : resolv-replace 0.1.1 I, [2024-05-24T07:44:52.802778 #209631] INFO -- : rinda 0.2.0 I, [2024-05-24T07:44:52.804348 #209631] INFO -- : drb 2.2.1 I, [2024-05-24T07:44:52.805955 #209631] INFO -- : nkf 0.2.0 I, [2024-05-24T07:44:52.808418 #209631] INFO -- : syslog 0.1.2 I, [2024-05-24T07:44:52.810599 #209631] INFO -- : csv 3.3.0 I, [2024-05-24T07:44:52.813251 #209631] INFO -- : installing bundled gem cache: /tmp/ruby/install/trunk/lib/ruby/gems/3.4.0+0/cache I, [2024-05-24T07:44:52.814674 #209631] INFO -- : skipped bundled gems: I, [2024-05-24T07:44:52.814700 #209631] INFO -- : power_assert-2.0.4dev.gem not found in bundled_gems I, [2024-05-24T07:44:52.817582 #209631] INFO -- : $$$[end] "make install -j20" exit with 0. I, [2024-05-24T07:44:52.817679 #209631] INFO -- : $$$[beg] make yes-btest TESTOPTS='-q -j20' I, [2024-05-24T07:44:57.970201 #209631] INFO -- : PASS all 1936 tests E, [2024-05-24T07:44:57.975603 #209631] ERROR -- : I, [2024-05-24T07:44:57.975677 #209631] INFO -- : $$$[end] "make yes-btest TESTOPTS='-q -j20'" exit with 0. I, [2024-05-24T07:44:57.975796 #209631] INFO -- : $$$[beg] make yes-test-basic TESTS='-j20' I, [2024-05-24T07:44:58.036384 #209631] INFO -- : BASERUBY = /usr/bin/ruby --disable=gems I, [2024-05-24T07:44:58.036413 #209631] INFO -- : CC = gcc I, [2024-05-24T07:44:58.036418 #209631] INFO -- : LD = ld I, [2024-05-24T07:44:58.036422 #209631] INFO -- : LDSHARED = gcc -shared I, [2024-05-24T07:44:58.036426 #209631] INFO -- : CFLAGS = -O3 -fno-fast-math -ggdb3 -Wall -Wextra -Wdeprecated-declarations -Wdiv-by-zero -Wduplicated-cond -Wimplicit-function-declaration -Wimplicit-int -Wpointer-arith -Wwrite-strings -Wold-style-definition -Wimplicit-fallthrough=0 -Wmissing-noreturn -Wno-cast-function-type -Wno-constant-logical-operand -Wno-long-long -Wno-missing-field-initializers -Wno-overlength-strings -Wno-packed-bitfield-compat -Wno-parentheses-equality -Wno-self-assign -Wno-tautological-compare -Wno-unused-parameter -Wno-unused-value -Wsuggest-attribute=format -Wsuggest-attribute=noreturn -Wunused-variable -Wmisleading-indentation -Wundef -fPIC I, [2024-05-24T07:44:58.036430 #209631] INFO -- : XCFLAGS = -U_FORTIFY_SOURCE -D_FORTIFY_SOURCE=2 -fstack-protector-strong -fno-strict-overflow -fvisibility=hidden -fexcess-precision=standard -DRUBY_EXPORT -I. -I.ext/include/x86_64-linux -I/tmp/ruby/src/trunk/include -I/tmp/ruby/src/trunk -I/tmp/ruby/src/trunk/prism -I/tmp/ruby/src/trunk/enc/unicode/15.0.0 I, [2024-05-24T07:44:58.036440 #209631] INFO -- : CPPFLAGS = I, [2024-05-24T07:44:58.036444 #209631] INFO -- : DLDFLAGS = -Wl,--compress-debug-sections=zlib -Wl,-soname,libruby.so.3.4 -fstack-protector-strong I, [2024-05-24T07:44:58.036447 #209631] INFO -- : SOLIBS = -lz -lrt -lrt -lgmp -ldl -lcrypt -lm -lpthread I, [2024-05-24T07:44:58.036451 #209631] INFO -- : LANG = en_US.UTF-8 I, [2024-05-24T07:44:58.036454 #209631] INFO -- : LC_ALL = I, [2024-05-24T07:44:58.036458 #209631] INFO -- : LC_CTYPE = I, [2024-05-24T07:44:58.036461 #209631] INFO -- : MFLAGS = I, [2024-05-24T07:44:58.036465 #209631] INFO -- : RUSTC = no I, [2024-05-24T07:44:58.036468 #209631] INFO -- : YJIT_RUSTC_ARGS = --crate-name=yjit --crate-type=staticlib --edition=2021 -g -C lto=thin -C opt-level=3 -C overflow-checks=on '--out-dir=/tmp/ruby/build/trunk/yjit/target/release/' /tmp/ruby/src/trunk/yjit/src/lib.rs I, [2024-05-24T07:44:58.037016 #209631] INFO -- : gcc (Ubuntu 11.4.0-1ubuntu1~22.04) 11.4.0 I, [2024-05-24T07:44:58.037035 #209631] INFO -- : Copyright (C) 2021 Free Software Foundation, Inc. I, [2024-05-24T07:44:58.037041 #209631] INFO -- : This is free software; see the source for copying conditions. There is NO I, [2024-05-24T07:44:58.037045 #209631] INFO -- : warranty; not even for MERCHANTABILITY or FITNESS FOR A PARTICULAR PURPOSE. I, [2024-05-24T07:44:58.037049 #209631] INFO -- : I, [2024-05-24T07:44:58.148169 #209631] INFO -- : Checking leaked global symbols...none I, [2024-05-24T07:44:58.188307 #209631] INFO -- : /tmp/ruby/src/trunk/basictest/test.rb:assignment ....................................................................................................................................................................................................................................................................................................................................................................................OK 372 I, [2024-05-24T07:44:58.188373 #209631] INFO -- : /tmp/ruby/src/trunk/basictest/test.rb:condition ..OK 2 I, [2024-05-24T07:44:58.188381 #209631] INFO -- : /tmp/ruby/src/trunk/basictest/test.rb:if/unless ...OK 3 I, [2024-05-24T07:44:58.188385 #209631] INFO -- : /tmp/ruby/src/trunk/basictest/test.rb:case .....OK 5 I, [2024-05-24T07:44:58.188583 #209631] INFO -- : /tmp/ruby/src/trunk/basictest/test.rb:while/until ........OK 8 I, [2024-05-24T07:44:58.188637 #209631] INFO -- : /tmp/ruby/src/trunk/basictest/test.rb:exception ..........OK 10 I, [2024-05-24T07:44:58.188916 #209631] INFO -- : /tmp/ruby/src/trunk/basictest/test.rb:array .......................................OK 39 I, [2024-05-24T07:44:58.189022 #209631] INFO -- : /tmp/ruby/src/trunk/basictest/test.rb:hash ...........................OK 27 I, [2024-05-24T07:44:58.189748 #209631] INFO -- : /tmp/ruby/src/trunk/basictest/test.rb:iterator ...........................................................................................................OK 107 I, [2024-05-24T07:44:58.190029 #209631] INFO -- : /tmp/ruby/src/trunk/basictest/test.rb:float ................................................................................OK 80 I, [2024-05-24T07:44:58.191964 #209631] INFO -- : /tmp/ruby/src/trunk/basictest/test.rb:bignum ...............................OK 31 I, [2024-05-24T07:44:58.192747 #209631] INFO -- : /tmp/ruby/src/trunk/basictest/test.rb:string & char ..............................................................OK 62 I, [2024-05-24T07:44:58.192780 #209631] INFO -- : /tmp/ruby/src/trunk/basictest/test.rb:assignment ..........OK 10 I, [2024-05-24T07:44:58.192808 #209631] INFO -- : /tmp/ruby/src/trunk/basictest/test.rb:call ......OK 6 I, [2024-05-24T07:44:58.192861 #209631] INFO -- : /tmp/ruby/src/trunk/basictest/test.rb:proc .........OK 9 I, [2024-05-24T07:44:58.293628 #209631] INFO -- : /tmp/ruby/src/trunk/basictest/test.rb:signal ..OK 2 I, [2024-05-24T07:44:58.296634 #209631] INFO -- : /tmp/ruby/src/trunk/basictest/test.rb:eval ...........................OK 27 I, [2024-05-24T07:44:58.424680 #209631] INFO -- : /tmp/ruby/src/trunk/basictest/test.rb:system ........OK 8 I, [2024-05-24T07:44:58.424741 #209631] INFO -- : /tmp/ruby/src/trunk/basictest/test.rb:const .....OK 5 I, [2024-05-24T07:44:58.424751 #209631] INFO -- : /tmp/ruby/src/trunk/basictest/test.rb:clone .....OK 5 I, [2024-05-24T07:44:58.424876 #209631] INFO -- : /tmp/ruby/src/trunk/basictest/test.rb:marshal ....OK 4 I, [2024-05-24T07:44:58.425008 #209631] INFO -- : /tmp/ruby/src/trunk/basictest/test.rb:pack ....OK 4 I, [2024-05-24T07:44:58.425037 #209631] INFO -- : /tmp/ruby/src/trunk/basictest/test.rb:math ..OK 2 I, [2024-05-24T07:44:58.425048 #209631] INFO -- : /tmp/ruby/src/trunk/basictest/test.rb:struct ......OK 6 I, [2024-05-24T07:44:58.425161 #209631] INFO -- : /tmp/ruby/src/trunk/basictest/test.rb:variable ............OK 12 I, [2024-05-24T07:44:58.425190 #209631] INFO -- : /tmp/ruby/src/trunk/basictest/test.rb:trace ...OK 3 I, [2024-05-24T07:44:58.425229 #209631] INFO -- : /tmp/ruby/src/trunk/basictest/test.rb:defined? ............OK 12 I, [2024-05-24T07:44:58.425289 #209631] INFO -- : /tmp/ruby/src/trunk/basictest/test.rb:alias ......OK 6 I, [2024-05-24T07:44:58.425673 #209631] INFO -- : /tmp/ruby/src/trunk/basictest/test.rb:path .......................OK 23 I, [2024-05-24T07:44:58.463225 #209631] INFO -- : /tmp/ruby/src/trunk/basictest/test.rb:gc ....OK 4 I, [2024-05-24T07:44:58.465532 #209631] INFO -- : I, [2024-05-24T07:44:58.465555 #209631] INFO -- : test succeeded I, [2024-05-24T07:44:58.466923 #209631] INFO -- : $$$[end] "make yes-test-basic TESTS='-j20'" exit with 0. I, [2024-05-24T07:44:58.467026 #209631] INFO -- : $$$[beg] make yes-test-all TESTOPTS='--stderr-on-failure' TESTS='-j20' I, [2024-05-24T07:44:58.552558 #209631] INFO -- : BASERUBY = /usr/bin/ruby --disable=gems I, [2024-05-24T07:44:58.552606 #209631] INFO -- : CC = gcc I, [2024-05-24T07:44:58.552613 #209631] INFO -- : LD = ld I, [2024-05-24T07:44:58.552616 #209631] INFO -- : LDSHARED = gcc -shared I, [2024-05-24T07:44:58.552622 #209631] INFO -- : CFLAGS = -O3 -fno-fast-math -ggdb3 -Wall -Wextra -Wdeprecated-declarations -Wdiv-by-zero -Wduplicated-cond -Wimplicit-function-declaration -Wimplicit-int -Wpointer-arith -Wwrite-strings -Wold-style-definition -Wimplicit-fallthrough=0 -Wmissing-noreturn -Wno-cast-function-type -Wno-constant-logical-operand -Wno-long-long -Wno-missing-field-initializers -Wno-overlength-strings -Wno-packed-bitfield-compat -Wno-parentheses-equality -Wno-self-assign -Wno-tautological-compare -Wno-unused-parameter -Wno-unused-value -Wsuggest-attribute=format -Wsuggest-attribute=noreturn -Wunused-variable -Wmisleading-indentation -Wundef -fPIC I, [2024-05-24T07:44:58.552627 #209631] INFO -- : XCFLAGS = -U_FORTIFY_SOURCE -D_FORTIFY_SOURCE=2 -fstack-protector-strong -fno-strict-overflow -fvisibility=hidden -fexcess-precision=standard -DRUBY_EXPORT -I. -I.ext/include/x86_64-linux -I/tmp/ruby/src/trunk/include -I/tmp/ruby/src/trunk -I/tmp/ruby/src/trunk/prism -I/tmp/ruby/src/trunk/enc/unicode/15.0.0 I, [2024-05-24T07:44:58.552631 #209631] INFO -- : CPPFLAGS = I, [2024-05-24T07:44:58.552635 #209631] INFO -- : DLDFLAGS = -Wl,--compress-debug-sections=zlib -Wl,-soname,libruby.so.3.4 -fstack-protector-strong I, [2024-05-24T07:44:58.552639 #209631] INFO -- : SOLIBS = -lz -lrt -lrt -lgmp -ldl -lcrypt -lm -lpthread I, [2024-05-24T07:44:58.552643 #209631] INFO -- : LANG = en_US.UTF-8 I, [2024-05-24T07:44:58.552646 #209631] INFO -- : LC_ALL = I, [2024-05-24T07:44:58.552650 #209631] INFO -- : LC_CTYPE = I, [2024-05-24T07:44:58.552653 #209631] INFO -- : MFLAGS = I, [2024-05-24T07:44:58.552658 #209631] INFO -- : RUSTC = no I, [2024-05-24T07:44:58.552662 #209631] INFO -- : YJIT_RUSTC_ARGS = --crate-name=yjit --crate-type=staticlib --edition=2021 -g -C lto=thin -C opt-level=3 -C overflow-checks=on '--out-dir=/tmp/ruby/build/trunk/yjit/target/release/' /tmp/ruby/src/trunk/yjit/src/lib.rs I, [2024-05-24T07:44:58.553229 #209631] INFO -- : gcc (Ubuntu 11.4.0-1ubuntu1~22.04) 11.4.0 I, [2024-05-24T07:44:58.553263 #209631] INFO -- : Copyright (C) 2021 Free Software Foundation, Inc. I, [2024-05-24T07:44:58.553273 #209631] INFO -- : This is free software; see the source for copying conditions. There is NO I, [2024-05-24T07:44:58.553279 #209631] INFO -- : warranty; not even for MERCHANTABILITY or FITNESS FOR A PARTICULAR PURPOSE. I, [2024-05-24T07:44:58.553285 #209631] INFO -- : I, [2024-05-24T07:44:58.554931 #209631] INFO -- : generating enc.mk I, [2024-05-24T07:44:58.672217 #209631] INFO -- : generating encdb.h I, [2024-05-24T07:44:58.695802 #209631] INFO -- : encdb.h unchanged I, [2024-05-24T07:44:58.697023 #209631] INFO -- : making enc I, [2024-05-24T07:44:58.714902 #209631] INFO -- : make[1]: Entering directory '/tmp/ruby/build/trunk' I, [2024-05-24T07:44:58.714926 #209631] INFO -- : make[1]: Nothing to be done for 'enc'. I, [2024-05-24T07:44:58.714933 #209631] INFO -- : make[1]: Leaving directory '/tmp/ruby/build/trunk' I, [2024-05-24T07:44:58.715660 #209631] INFO -- : making srcs under enc I, [2024-05-24T07:44:58.745699 #209631] INFO -- : make[1]: Entering directory '/tmp/ruby/build/trunk' I, [2024-05-24T07:44:58.745724 #209631] INFO -- : make[1]: Nothing to be done for 'srcs'. I, [2024-05-24T07:44:58.745733 #209631] INFO -- : make[1]: Leaving directory '/tmp/ruby/build/trunk' I, [2024-05-24T07:44:58.746946 #209631] INFO -- : generating transdb.h I, [2024-05-24T07:44:58.845690 #209631] INFO -- : transdb.h unchanged I, [2024-05-24T07:44:58.847323 #209631] INFO -- : making trans I, [2024-05-24T07:44:58.882090 #209631] INFO -- : make[1]: Entering directory '/tmp/ruby/build/trunk' I, [2024-05-24T07:44:58.882111 #209631] INFO -- : make[1]: Nothing to be done for 'trans'. I, [2024-05-24T07:44:58.882116 #209631] INFO -- : make[1]: Leaving directory '/tmp/ruby/build/trunk' I, [2024-05-24T07:44:58.882791 #209631] INFO -- : making encs I, [2024-05-24T07:44:58.923305 #209631] INFO -- : make[1]: Entering directory '/tmp/ruby/build/trunk' I, [2024-05-24T07:44:58.923329 #209631] INFO -- : make[1]: Nothing to be done for 'encs'. I, [2024-05-24T07:44:58.923338 #209631] INFO -- : make[1]: Leaving directory '/tmp/ruby/build/trunk' I, [2024-05-24T07:44:58.925336 #209631] INFO -- : generating makefiles ext/configure-ext.mk I, [2024-05-24T07:44:58.954220 #209631] INFO -- : ext/configure-ext.mk updated I, [2024-05-24T07:44:58.956607 #209631] INFO -- : make[1]: Entering directory '/tmp/ruby/build/trunk' I, [2024-05-24T07:45:00.348900 #209631] INFO -- : make[1]: Leaving directory '/tmp/ruby/build/trunk' I, [2024-05-24T07:45:00.349510 #209631] INFO -- : generating makefile exts.mk I, [2024-05-24T07:45:00.386328 #209631] INFO -- : exts.mk unchanged I, [2024-05-24T07:45:00.391533 #209631] INFO -- : make[1]: Entering directory '/tmp/ruby/build/trunk' I, [2024-05-24T07:45:00.692247 #209631] INFO -- : make[2]: Entering directory '/tmp/ruby/build/trunk/ext/coverage' I, [2024-05-24T07:45:00.696407 #209631] INFO -- : make[2]: Leaving directory '/tmp/ruby/build/trunk/ext/coverage' I, [2024-05-24T07:45:00.702991 #209631] INFO -- : make[2]: Entering directory '/tmp/ruby/build/trunk/ext/date' I, [2024-05-24T07:45:00.708207 #209631] INFO -- : make[2]: Leaving directory '/tmp/ruby/build/trunk/ext/date' I, [2024-05-24T07:45:00.711946 #209631] INFO -- : make[2]: Entering directory '/tmp/ruby/build/trunk/ext/digest' I, [2024-05-24T07:45:00.720739 #209631] INFO -- : make[2]: Leaving directory '/tmp/ruby/build/trunk/ext/digest' I, [2024-05-24T07:45:00.747583 #209631] INFO -- : make[2]: Entering directory '/tmp/ruby/build/trunk/ext/digest/sha2' I, [2024-05-24T07:45:00.752551 #209631] INFO -- : make[2]: Leaving directory '/tmp/ruby/build/trunk/ext/digest/sha2' I, [2024-05-24T07:45:00.774180 #209631] INFO -- : make[2]: Entering directory '/tmp/ruby/build/trunk/ext/fiddle' I, [2024-05-24T07:45:00.783612 #209631] INFO -- : make[2]: Leaving directory '/tmp/ruby/build/trunk/ext/fiddle' I, [2024-05-24T07:45:00.788643 #209631] INFO -- : make[2]: Entering directory '/tmp/ruby/build/trunk/ext/io/console' I, [2024-05-24T07:45:00.792749 #209631] INFO -- : make[2]: Leaving directory '/tmp/ruby/build/trunk/ext/io/console' I, [2024-05-24T07:45:00.805432 #209631] INFO -- : make[2]: Entering directory '/tmp/ruby/build/trunk/ext/json' I, [2024-05-24T07:45:00.816329 #209631] INFO -- : make[2]: Leaving directory '/tmp/ruby/build/trunk/ext/json' I, [2024-05-24T07:45:00.831529 #209631] INFO -- : make[2]: Entering directory '/tmp/ruby/build/trunk/ext/monitor' I, [2024-05-24T07:45:00.835579 #209631] INFO -- : make[2]: Leaving directory '/tmp/ruby/build/trunk/ext/monitor' I, [2024-05-24T07:45:00.842606 #209631] INFO -- : make[2]: Entering directory '/tmp/ruby/build/trunk/ext/objspace' I, [2024-05-24T07:45:00.848716 #209631] INFO -- : make[2]: Leaving directory '/tmp/ruby/build/trunk/ext/objspace' I, [2024-05-24T07:45:00.866048 #209631] INFO -- : make[2]: Entering directory '/tmp/ruby/build/trunk/ext/openssl' I, [2024-05-24T07:45:00.880009 #209631] INFO -- : make[2]: Leaving directory '/tmp/ruby/build/trunk/ext/openssl' I, [2024-05-24T07:45:00.884563 #209631] INFO -- : make[2]: Entering directory '/tmp/ruby/build/trunk/ext/pathname' I, [2024-05-24T07:45:00.888568 #209631] INFO -- : make[2]: Leaving directory '/tmp/ruby/build/trunk/ext/pathname' I, [2024-05-24T07:45:00.895734 #209631] INFO -- : make[2]: Entering directory '/tmp/ruby/build/trunk/ext/psych' I, [2024-05-24T07:45:00.918712 #209631] INFO -- : make[2]: Leaving directory '/tmp/ruby/build/trunk/ext/psych' I, [2024-05-24T07:45:00.923490 #209631] INFO -- : make[2]: Entering directory '/tmp/ruby/build/trunk/ext/pty' I, [2024-05-24T07:45:00.927634 #209631] INFO -- : make[2]: Leaving directory '/tmp/ruby/build/trunk/ext/pty' I, [2024-05-24T07:45:00.943329 #209631] INFO -- : make[2]: Entering directory '/tmp/ruby/build/trunk/ext/ripper' I, [2024-05-24T07:45:00.951472 #209631] INFO -- : make[2]: Leaving directory '/tmp/ruby/build/trunk/ext/ripper' I, [2024-05-24T07:45:00.953978 #209631] INFO -- : make[2]: Entering directory '/tmp/ruby/build/trunk/ext/rubyvm' I, [2024-05-24T07:45:00.957277 #209631] INFO -- : make[2]: Leaving directory '/tmp/ruby/build/trunk/ext/rubyvm' I, [2024-05-24T07:45:00.968744 #209631] INFO -- : make[2]: Entering directory '/tmp/ruby/build/trunk/ext/socket' I, [2024-05-24T07:45:00.976013 #209631] INFO -- : make[2]: Leaving directory '/tmp/ruby/build/trunk/ext/socket' I, [2024-05-24T07:45:00.993918 #209631] INFO -- : make[2]: Entering directory '/tmp/ruby/build/trunk/.bundle/gems/bigdecimal-3.1.8/ext/bigdecimal' I, [2024-05-24T07:45:01.019730 #209631] INFO -- : make[2]: Leaving directory '/tmp/ruby/build/trunk/.bundle/gems/bigdecimal-3.1.8/ext/bigdecimal' I, [2024-05-24T07:45:01.021781 #209631] INFO -- : make[2]: Entering directory '/tmp/ruby/build/trunk/.bundle/gems/debug-1.9.2/ext/debug' I, [2024-05-24T07:45:01.043184 #209631] INFO -- : make[2]: Leaving directory '/tmp/ruby/build/trunk/.bundle/gems/debug-1.9.2/ext/debug' I, [2024-05-24T07:45:01.045141 #209631] INFO -- : make[2]: Entering directory '/tmp/ruby/build/trunk/.bundle/gems/nkf-0.2.0/ext/nkf' I, [2024-05-24T07:45:01.067179 #209631] INFO -- : make[2]: Leaving directory '/tmp/ruby/build/trunk/.bundle/gems/nkf-0.2.0/ext/nkf' I, [2024-05-24T07:45:01.069154 #209631] INFO -- : make[2]: Entering directory '/tmp/ruby/build/trunk/.bundle/gems/racc-1.7.3/ext/racc/cparse' I, [2024-05-24T07:45:01.090262 #209631] INFO -- : make[2]: Leaving directory '/tmp/ruby/build/trunk/.bundle/gems/racc-1.7.3/ext/racc/cparse' I, [2024-05-24T07:45:01.092162 #209631] INFO -- : make[2]: Entering directory '/tmp/ruby/build/trunk/.bundle/gems/racc-1.8.0/ext/racc/cparse' I, [2024-05-24T07:45:01.118220 #209631] INFO -- : make[2]: Leaving directory '/tmp/ruby/build/trunk/.bundle/gems/racc-1.8.0/ext/racc/cparse' I, [2024-05-24T07:45:01.121488 #209631] INFO -- : make[2]: Entering directory '/tmp/ruby/build/trunk/.bundle/gems/rbs-3.4.4/ext/rbs_extension' I, [2024-05-24T07:45:01.146728 #209631] INFO -- : make[2]: Leaving directory '/tmp/ruby/build/trunk/.bundle/gems/rbs-3.4.4/ext/rbs_extension' I, [2024-05-24T07:45:01.148681 #209631] INFO -- : make[2]: Entering directory '/tmp/ruby/build/trunk/.bundle/gems/syslog-0.1.2/ext/syslog' I, [2024-05-24T07:45:01.170145 #209631] INFO -- : make[2]: Leaving directory '/tmp/ruby/build/trunk/.bundle/gems/syslog-0.1.2/ext/syslog' I, [2024-05-24T07:45:01.193445 #209631] INFO -- : make[2]: Entering directory '/tmp/ruby/build/trunk' I, [2024-05-24T07:45:01.258753 #209631] INFO -- : make[2]: 'ruby' is up to date. I, [2024-05-24T07:45:01.258791 #209631] INFO -- : make[2]: Leaving directory '/tmp/ruby/build/trunk' I, [2024-05-24T07:45:01.259202 #209631] INFO -- : make[1]: Leaving directory '/tmp/ruby/build/trunk' I, [2024-05-24T07:45:01.263308 #209631] INFO -- : make[1]: Entering directory '/tmp/ruby/build/trunk' I, [2024-05-24T07:45:01.263330 #209631] INFO -- : make[1]: Nothing to be done for 'note'. I, [2024-05-24T07:45:01.263336 #209631] INFO -- : make[1]: Leaving directory '/tmp/ruby/build/trunk' I, [2024-05-24T07:45:01.340210 #209631] INFO -- : Run options: I, [2024-05-24T07:45:01.340269 #209631] INFO -- : --seed=27704 I, [2024-05-24T07:45:01.340275 #209631] INFO -- : "--ruby=./miniruby -I/tmp/ruby/src/trunk/lib -I. -I.ext/common /tmp/ruby/src/trunk/tool/runruby.rb --extout=.ext -- --disable-gems" I, [2024-05-24T07:45:01.340280 #209631] INFO -- : --excludes-dir=/tmp/ruby/src/trunk/test/.excludes I, [2024-05-24T07:45:01.340283 #209631] INFO -- : --name=!/memory_leak/ I, [2024-05-24T07:45:01.340287 #209631] INFO -- : --stderr-on-failure I, [2024-05-24T07:45:01.340291 #209631] INFO -- : -j20 I, [2024-05-24T07:45:01.340294 #209631] INFO -- : I, [2024-05-24T07:45:01.340299 #209631] INFO -- : # Running tests: I, [2024-05-24T07:45:01.340302 #209631] INFO -- : I, [2024-05-24T07:45:01.465443 #209631] INFO -- : [ 1/885] 251000=test_arity I, [2024-05-24T07:45:01.487950 #209631] INFO -- : [ 2/885] 251000=test_gem_ext_rake_builder I, [2024-05-24T07:45:01.488781 #209631] INFO -- : [ 3/885] 250989=test_logdevice I, [2024-05-24T07:45:01.488870 #209631] INFO -- : [ 4/885] 250988=test_err_in_callback I, [2024-05-24T07:45:01.489321 #209631] INFO -- : [ 5/885] 250986=test_gem_resolver_lock_specification I, [2024-05-24T07:45:01.489410 #209631] INFO -- : [ 6/885] 250990=test_gc I, [2024-05-24T07:45:01.491572 #209631] INFO -- : [ 7/885] 250991=test_x509cert I, [2024-05-24T07:45:01.492674 #209631] INFO -- : [ 8/885] 250988=test_last_thread I, [2024-05-24T07:45:01.492999 #209631] INFO -- : [ 9/885] 251005=test_process I, [2024-05-24T07:45:01.493060 #209631] INFO -- : [ 10/885] 251002=test_pack I, [2024-05-24T07:45:01.493225 #209631] INFO -- : [ 11/885] 251003=test_gem_source_local I, [2024-05-24T07:45:01.493324 #209631] INFO -- : [ 12/885] 251001=test_gem_security_policy I, [2024-05-24T07:45:01.500887 #209631] INFO -- : [ 13/885] 251004=test_uncorrectable_name_check I, [2024-05-24T07:45:01.511852 #209631] INFO -- : [ 14/885] 251004=newline_test I, [2024-05-24T07:45:01.518231 #209631] INFO -- : [ 15/885] 250987=test_hash_create I, [2024-05-24T07:45:01.521186 #209631] INFO -- : [ 16/885] 250987=test_stringchar I, [2024-05-24T07:45:01.526199 #209631] INFO -- : [ 17/885] 250992=test_passing_block I, [2024-05-24T07:45:01.526260 #209631] INFO -- : [ 18/885] 250993=test_thread_fd_close I, [2024-05-24T07:45:01.526399 #209631] INFO -- : [ 19/885] 250995=test_securerandom I, [2024-05-24T07:45:01.527016 #209631] INFO -- : [ 20/885] 250999=test_rdoc_markdown_test I, [2024-05-24T07:45:01.527042 #209631] INFO -- : [ 21/885] 250996=test_rdoc_normal_module I, [2024-05-24T07:45:01.533630 #209631] INFO -- : [ 22/885] 250998=test_c_union_entity I, [2024-05-24T07:45:01.545997 #209631] INFO -- : [ 23/885] 250992=test_logperiod I, [2024-05-24T07:45:01.546531 #209631] INFO -- : [ 24/885] 250994=test_flush I, [2024-05-24T07:45:01.552284 #209631] INFO -- : [ 25/885] 250994=test_singleton I, [2024-05-24T07:45:01.554556 #209631] INFO -- : [ 26/885] 250998=test_io_console I, [2024-05-24T07:45:01.556088 #209631] INFO -- : [ 27/885] 250993=test_switch_hitter I, [2024-05-24T07:45:01.556828 #209631] INFO -- : [ 28/885] 250994=test_iso_8859 I, [2024-05-24T07:45:01.558261 #209631] INFO -- : [ 29/885] 250992=test_tcp I, [2024-05-24T07:45:01.567945 #209631] INFO -- : [ 30/885] 250997=test_rdoc_text I, [2024-05-24T07:45:01.579068 #209631] INFO -- : [ 31/885] 250993=test_gem_safe_yaml I, [2024-05-24T07:45:01.591488 #209631] INFO -- : [ 32/885] 250987=test_syntax I, [2024-05-24T07:45:01.601145 #209631] INFO -- : [ 33/885] 250994=test_data I, [2024-05-24T07:45:01.609397 #209631] INFO -- : [ 34/885] 250994=index_write_test I, [2024-05-24T07:45:01.620573 #209631] INFO -- : [ 35/885] 250995=test_date_new I, [2024-05-24T07:45:01.629419 #209631] INFO -- : [ 36/885] 250995=test_require I, [2024-05-24T07:45:01.637512 #209631] INFO -- : [ 37/885] 251004=test_date_time I, [2024-05-24T07:45:01.649592 #209631] INFO -- : [ 38/885] 250995=test_rdoc_markup_to_joined_paragraph I, [2024-05-24T07:45:01.651949 #209631] INFO -- : [ 39/885] 250992=test_rdoc_parser_ruby I, [2024-05-24T07:45:01.666083 #209631] INFO -- : [ 40/885] 251004=test_open-uri I, [2024-05-24T07:45:01.670870 #209631] INFO -- : [ 41/885] 250994=test_httpresponse I, [2024-05-24T07:45:01.721990 #209631] INFO -- : [ 42/885] 250986=test_rdoc_context I, [2024-05-24T07:45:01.739967 #209631] INFO -- : [ 43/885] 250994=test_stream I, [2024-05-24T07:45:01.741290 #209631] INFO -- : [ 44/885] 251002=test_nil2vtempty I, [2024-05-24T07:45:01.745377 #209631] INFO -- : [ 45/885] 251002=test_gem_commands_dependency_command I, [2024-05-24T07:45:01.749526 #209631] INFO -- : [ 46/885] 250996=test_gem_resolver_composed_set I, [2024-05-24T07:45:01.763067 #209631] INFO -- : [ 47/885] 250994=test_safe_load I, [2024-05-24T07:45:01.774630 #209631] INFO -- : [ 48/885] 250994=test_gem_resolver I, [2024-05-24T07:45:01.792337 #209631] INFO -- : [ 49/885] 250995=test_rdoc_markup_attribute_manager I, [2024-05-24T07:45:01.801160 #209631] INFO -- : [ 50/885] 250997=test_name_error I, [2024-05-24T07:45:01.804558 #209631] INFO -- : [ 51/885] 250991=test_gem_commands_which_command I, [2024-05-24T07:45:01.817983 #209631] INFO -- : [ 52/885] 250993=test_shift_jis I, [2024-05-24T07:45:01.821442 #209631] INFO -- : [ 53/885] 250993=test_http I, [2024-05-24T07:45:01.826163 #209631] INFO -- : [ 54/885] 250995=test_enumerator I, [2024-05-24T07:45:01.844161 #209631] INFO -- : [ 55/885] 250993=test_flags I, [2024-05-24T07:45:01.867096 #209631] INFO -- : [ 56/885] 251003=test_inadvertent_creation I, [2024-05-24T07:45:01.921482 #209631] INFO -- : [ 57/885] 250997=test_gem_commands_specification_command I, [2024-05-24T07:45:01.926818 #209631] INFO -- : [ 58/885] 251001=test_win32ole I, [2024-05-24T07:45:01.932768 #209631] INFO -- : [ 59/885] 251001=test_generic I, [2024-05-24T07:45:01.950020 #209631] INFO -- : [ 60/885] 251003=test_scan_args I, [2024-05-24T07:45:01.961897 #209631] INFO -- : [ 61/885] 251003=test_enumerator_kw I, [2024-05-24T07:45:01.965033 #209631] INFO -- : [ 62/885] 251003=test_gem_text I, [2024-05-24T07:45:01.965670 #209631] INFO -- : [ 63/885] 250996=test_settracefunc I, [2024-05-24T07:45:01.974912 #209631] INFO -- : [ 64/885] 251001=test_gem_commands_mirror I, [2024-05-24T07:45:01.979789 #209631] INFO -- : [ 65/885] 251001=test_gem_ext_cargo_builder_link_flag_converter I, [2024-05-24T07:45:02.015943 #209631] INFO -- : [ 66/885] 251003=test_method_cache I, [2024-05-24T07:45:02.018686 #209631] INFO -- : [ 67/885] 251003=test_gem_request I, [2024-05-24T07:45:02.025403 #209631] INFO -- : [ 68/885] 250991=test_sprintf_comb I, [2024-05-24T07:45:02.026810 #209631] INFO -- : [ 69/885] 251001=test_exception I, [2024-05-24T07:45:02.077196 #209631] INFO -- : [ 70/885] 250992=test_bug_reporter I, [2024-05-24T07:45:02.079167 #209631] INFO -- : [ 71/885] 251002=test_rand I, [2024-05-24T07:45:02.181296 #209631] INFO -- : [ 72/885] 250994=test_gem_package_tar_reader_entry I, [2024-05-24T07:45:02.181383 #209631] INFO -- : [ 73/885] 251004=test_gem_name_tuple I, [2024-05-24T07:45:02.181608 #209631] INFO -- : [ 74/885] 251003=test_rdoc_cross_reference I, [2024-05-24T07:45:02.198630 #209631] INFO -- : [ 75/885] 250991=test_gem_dependency_installer I, [2024-05-24T07:45:02.322576 #209631] INFO -- : [ 76/885] 251002=test_scalar I, [2024-05-24T07:45:02.328700 #209631] INFO -- : [ 77/885] 251002=test_gem_commands_info_command I, [2024-05-24T07:45:02.333845 #209631] INFO -- : [ 78/885] 250997=test_case_options I, [2024-05-24T07:45:02.341343 #209631] INFO -- : [ 79/885] 250989=test_store I, [2024-05-24T07:45:02.346601 #209631] INFO -- : [ 80/885] 250994=test_literal I, [2024-05-24T07:45:02.347768 #209631] INFO -- : [ 81/885] 251000=test_str2big I, [2024-05-24T07:45:02.349478 #209631] INFO -- : [ 82/885] 251002=test_dot_dot I, [2024-05-24T07:45:02.351031 #209631] INFO -- : [ 83/885] 250997=test_c_struct_builder I, [2024-05-24T07:45:02.352785 #209631] INFO -- : [ 84/885] 251002=test_rdoc_markup_to_table_of_contents I, [2024-05-24T07:45:02.353803 #209631] INFO -- : [ 85/885] 251000=test_thread I, [2024-05-24T07:45:02.409021 #209631] INFO -- : [ 86/885] 251004=test_socket I, [2024-05-24T07:45:02.431057 #209631] INFO -- : [ 87/885] 250997=test_objectspace I, [2024-05-24T07:45:02.448851 #209631] INFO -- : [ 88/885] 250999=test_ractor I, [2024-05-24T07:45:02.456914 #209631] INFO -- : [ 89/885] 250992=test_severity I, [2024-05-24T07:45:02.458069 #209631] INFO -- : [ 90/885] 250992=test_require_lib I, [2024-05-24T07:45:02.465216 #209631] INFO -- : [ 91/885] 250999=test_gem_install_update_options I, [2024-05-24T07:45:02.469779 #209631] INFO -- : [ 92/885] 250989=parse_test I, [2024-05-24T07:45:02.492497 #209631] INFO -- : [ 93/885] 250986=test_gem_stream_ui I, [2024-05-24T07:45:02.536168 #209631] INFO -- : [ 94/885] 250986=test_rdoc_generator_ri I, [2024-05-24T07:45:02.539094 #209631] INFO -- : [ 95/885] 250986=test_extlibs I, [2024-05-24T07:45:02.549366 #209631] INFO -- : [ 96/885] 251002=test_memory_view I, [2024-05-24T07:45:02.562423 #209631] INFO -- : [ 97/885] 250988=test_m17n_comb I, [2024-05-24T07:45:02.571903 #209631] INFO -- : [ 98/885] 251000=test_ractor I, [2024-05-24T07:45:02.658531 #209631] INFO -- : [ 99/885] 251000=test_rdoc_generator_pot_po I, [2024-05-24T07:45:02.677138 #209631] INFO -- : [100/885] 251002=test_ansi_with_terminfo I, [2024-05-24T07:45:02.738501 #209631] INFO -- : [101/885] 251002=test_rdoc_markup_to_markdown I, [2024-05-24T07:45:02.750991 #209631] INFO -- : [102/885] 251003=test_json_tree I, [2024-05-24T07:45:02.757888 #209631] INFO -- : [103/885] 251003=test_case I, [2024-05-24T07:45:02.757956 #209631] INFO -- : [104/885] 251003=test_pkey I, [2024-05-24T07:45:02.775999 #209631] INFO -- : [105/885] 251002=test_parser_events I, [2024-05-24T07:45:02.795437 #209631] INFO -- : [106/885] 250999=test_reline I, [2024-05-24T07:45:02.811680 #209631] INFO -- : [107/885] 251003=test_cclass I, [2024-05-24T07:45:02.828699 #209631] INFO -- : [108/885] 251000=test_gem_request_connection_pools I, [2024-05-24T07:45:02.873565 #209631] INFO -- : [109/885] 250994=test_grapheme_breaks I, [2024-05-24T07:45:02.897965 #209631] INFO -- : [110/885] 251002=test_gem_version_option I, [2024-05-24T07:45:02.899415 #209631] INFO -- : [111/885] 250994=test_custom_command I, [2024-05-24T07:45:02.938687 #209631] INFO -- : [112/885] 251003=json_addition_test I, [2024-05-24T07:45:02.939027 #209631] INFO -- : [113/885] 251002=test_gem_dependency_resolution_error I, [2024-05-24T07:45:02.943629 #209631] INFO -- : [114/885] 251002=test_rdoc_parser I, [2024-05-24T07:45:02.963649 #209631] INFO -- : [115/885] 250996=test_qsort I, [2024-05-24T07:45:02.964134 #209631] INFO -- : [116/885] 250993=test_rdoc_stats I, [2024-05-24T07:45:02.964544 #209631] INFO -- : [117/885] 251003=test_pattern_matching I, [2024-05-24T07:45:02.966705 #209631] INFO -- : [118/885] 250996=test_string I, [2024-05-24T07:45:02.983481 #209631] INFO -- : [119/885] 251002=test_rdoc_store I, [2024-05-24T07:45:02.986199 #209631] INFO -- : [120/885] 251003=test_depth_first I, [2024-05-24T07:45:02.993281 #209631] INFO -- : [121/885] 251003=test_gem_request_set_lockfile_parser I, [2024-05-24T07:45:03.004690 #209631] INFO -- : [122/885] 250994=test_raise I, [2024-05-24T07:45:03.008393 #209631] INFO -- : [123/885] 250994=test_x509attr I, [2024-05-24T07:45:03.016972 #209631] INFO -- : [124/885] 250994=test_gem_validator I, [2024-05-24T07:45:03.025296 #209631] INFO -- : [125/885] 250996=test_rdoc_markup_parser I, [2024-05-24T07:45:03.041251 #209631] INFO -- : [126/885] 250994=test_require_path_check I, [2024-05-24T07:45:03.075070 #209631] INFO -- : [127/885] 250996=test_folderitem2_invokeverb I, [2024-05-24T07:45:03.075878 #209631] INFO -- : [128/885] 251003=test_fnmatch I, [2024-05-24T07:45:03.080112 #209631] INFO -- : [129/885] 250996=test_files_test_2 I, [2024-05-24T07:45:03.115811 #209631] INFO -- : [130/885] 251003=test_zlib I, [2024-05-24T07:45:03.143009 #209631] INFO -- : [131/885] 250993=test_cgi_tag_helper I, [2024-05-24T07:45:03.159586 #209631] INFO -- : [132/885] 250993=test_egrep_cpp I, [2024-05-24T07:45:03.165244 #209631] INFO -- : [133/885] 250994=test_erb_m17n I, [2024-05-24T07:45:03.172655 #209631] INFO -- : [134/885] 250994=test_ole_methods I, [2024-05-24T07:45:03.174351 #209631] INFO -- : [135/885] 250999=test_date_conv I, [2024-05-24T07:45:03.174793 #209631] INFO -- : [136/885] 250994=test_optimization I, [2024-05-24T07:45:03.198102 #209631] INFO -- : [137/885] 250999=test_gc_compact I, [2024-05-24T07:45:03.275816 #209631] INFO -- : [138/885] 250993=test_proc I, [2024-05-24T07:45:03.338827 #209631] INFO -- : [139/885] 250997=test_string I, [2024-05-24T07:45:03.457692 #209631] INFO -- : [140/885] 251002=test_gem_resolver_index_set I, [2024-05-24T07:45:03.472764 #209631] INFO -- : [141/885] 251002=test_gem_package_old I, [2024-05-24T07:45:03.497261 #209631] INFO -- : [142/885] 251001=test_windows_1251 I, [2024-05-24T07:45:03.502913 #209631] INFO -- : [143/885] 251001=test_time I, [2024-05-24T07:45:03.509307 #209631] INFO -- : [144/885] 251002=test_rdoc_rdoc I, [2024-05-24T07:45:03.599048 #209631] INFO -- : [145/885] 251002=test_gem_uninstaller I, [2024-05-24T07:45:03.656556 #209631] INFO -- : [146/885] 251001=test_buffering I, [2024-05-24T07:45:03.657809 #209631] INFO -- : [147/885] 251001=test_svcb_https I, [2024-05-24T07:45:03.680133 #209631] INFO -- : [148/885] 251001=test_gb18030 I, [2024-05-24T07:45:03.681547 #209631] INFO -- : [149/885] 251001=test_io_buffer I, [2024-05-24T07:45:03.717077 #209631] INFO -- : [150/885] 251001=test_key_name_check I, [2024-05-24T07:45:03.727635 #209631] INFO -- : [151/885] 251001=test_defined I, [2024-05-24T07:45:03.799657 #209631] INFO -- : [152/885] 251001=test_backtrace I, [2024-05-24T07:45:03.807672 #209631] INFO -- : [153/885] 251001=test_rdoc_i18n_text I, [2024-05-24T07:45:03.839999 #209631] INFO -- : [154/885] 251004=test_date_parse I, [2024-05-24T07:45:03.877852 #209631] INFO -- : [155/885] 251000=test_trick I, [2024-05-24T07:45:03.952964 #209631] INFO -- : [156/885] 251004=test_thread I, [2024-05-24T07:45:03.956526 #209631] INFO -- : [157/885] 251004=test_pipe I, [2024-05-24T07:45:03.979213 #209631] INFO -- : [158/885] 251001=test_pkey_ec I, [2024-05-24T07:45:04.054606 #209631] INFO -- : [159/885] 250993=test_null I, [2024-05-24T07:45:04.059570 #209631] INFO -- : [160/885] 250993=test_win32ole_type I, [2024-05-24T07:45:04.061725 #209631] INFO -- : [161/885] 251001=test_mul I, [2024-05-24T07:45:04.063804 #209631] INFO -- : [162/885] 250993=test_rdoc_markup_to_rdoc I, [2024-05-24T07:45:04.071019 #209631] INFO -- : [163/885] 251001=test_rdoc_rd_inline_parser I, [2024-05-24T07:45:04.092803 #209631] INFO -- : [164/885] 251004=test_default_gems I, [2024-05-24T07:45:04.095888 #209631] INFO -- : [165/885] 251001=test_rdoc_markup_attributes I, [2024-05-24T07:45:04.099847 #209631] INFO -- : [166/885] 251001=test_object_create_start I, [2024-05-24T07:45:04.101590 #209631] INFO -- : [167/885] 250993=test_at_exit I, [2024-05-24T07:45:04.104524 #209631] INFO -- : [168/885] 251001=test_command I, [2024-05-24T07:45:04.120803 #209631] INFO -- : [169/885] 250993=test_gem_ext_cargo_builder_unit I, [2024-05-24T07:45:04.152096 #209631] INFO -- : [170/885] 250993=test_gem_rdoc I, [2024-05-24T07:45:04.156184 #209631] INFO -- : [171/885] 251004=test_date I, [2024-05-24T07:45:04.159556 #209631] INFO -- : [172/885] 251004=test_enc_raise I, [2024-05-24T07:45:04.167623 #209631] INFO -- : [173/885] 251004=test_psych I, [2024-05-24T07:45:04.188764 #209631] INFO -- : [174/885] 251004=!Nothing_to_test I, [2024-05-24T07:45:04.191450 #209631] INFO -- : [175/885] 251004=test_rdoc_markup_paragraph I, [2024-05-24T07:45:04.222050 #209631] INFO -- : [176/885] 250998=test_kdf I, [2024-05-24T07:45:04.252189 #209631] INFO -- : [177/885] 250993=test_gem_doctor I, [2024-05-24T07:45:04.283598 #209631] INFO -- : [178/885] 250993=test_kernel I, [2024-05-24T07:45:04.291650 #209631] INFO -- : [179/885] 251004=test_eval_history I, [2024-05-24T07:45:04.292604 #209631] INFO -- : [180/885] 250986=dispatcher_test I, [2024-05-24T07:45:04.336410 #209631] INFO -- : [181/885] 250998=test_bug-5832 I, [2024-05-24T07:45:04.337659 #209631] INFO -- : [182/885] 250998=test_files_ext I, [2024-05-24T07:45:04.384361 #209631] INFO -- : [183/885] 250986=test_emitter I, [2024-05-24T07:45:04.391425 #209631] INFO -- : [184/885] 250986=test_gem_silent_ui I, [2024-05-24T07:45:04.424309 #209631] INFO -- : [185/885] 250986=test_verbose I, [2024-05-24T07:45:04.433374 #209631] INFO -- : [186/885] 251004=test_nil I, [2024-05-24T07:45:04.451060 #209631] INFO -- : [187/885] 251004=test_num2int I, [2024-05-24T07:45:04.452260 #209631] INFO -- : [188/885] 250986=test_rdoc_single_class I, [2024-05-24T07:45:04.459157 #209631] INFO -- : [189/885] 250986=test_macro I, [2024-05-24T07:45:04.460768 #209631] INFO -- : [190/885] 251004=test_frozen I, [2024-05-24T07:45:04.463925 #209631] INFO -- : [191/885] 251004=test_gem_ext_configure_builder I, [2024-05-24T07:45:04.471000 #209631] INFO -- : [192/885] 250998=test_pp I, [2024-05-24T07:45:04.508759 #209631] INFO -- : [193/885] 250988=test_zsh_completion I, [2024-05-24T07:45:04.509134 #209631] INFO -- : [194/885] 250991=test_exception I, [2024-05-24T07:45:04.511513 #209631] INFO -- : [195/885] 250988=test_iter_break I, [2024-05-24T07:45:04.516343 #209631] INFO -- : [196/885] 250988=test_rdoc_token_stream I, [2024-05-24T07:45:04.520971 #209631] INFO -- : [197/885] 250986=test_address_resolve I, [2024-05-24T07:45:04.523717 #209631] INFO -- : [198/885] 250998=test_config I, [2024-05-24T07:45:04.528242 #209631] INFO -- : [199/885] 250991=test_yaml_special_cases I, [2024-05-24T07:45:04.533086 #209631] INFO -- : [200/885] 250986=test_optarg I, [2024-05-24T07:45:04.541496 #209631] INFO -- : [201/885] 250991=test_gem_source_list I, [2024-05-24T07:45:04.545154 #209631] INFO -- : [202/885] 251001=test_numeric I, [2024-05-24T07:45:04.588516 #209631] INFO -- : [203/885] 251002=test_assignment I, [2024-05-24T07:45:04.595548 #209631] INFO -- : [204/885] 250991=test_ifunless I, [2024-05-24T07:45:04.596928 #209631] INFO -- : [205/885] 251004=test_gem_commands_lock_command I, [2024-05-24T07:45:04.597442 #209631] INFO -- : [206/885] 250991=test_gem_command I, [2024-05-24T07:45:04.599402 #209631] INFO -- : [207/885] 250998=test_key_actor_vi I, [2024-05-24T07:45:04.622258 #209631] INFO -- : [208/885] 251004=test_bug-3571 I, [2024-05-24T07:45:04.638680 #209631] INFO -- : [209/885] 251001=test_common I, [2024-05-24T07:45:04.638749 #209631] INFO -- : [210/885] 251004=test_gem_spec_fetcher I, [2024-05-24T07:45:04.644547 #209631] INFO -- : [211/885] 250988=test_hmac I, [2024-05-24T07:45:04.667061 #209631] INFO -- : [212/885] 250991=test_rdoc_markup_to_tt_only I, [2024-05-24T07:45:04.672975 #209631] INFO -- : [213/885] 250986=test_rdoc_tom_doc I, [2024-05-24T07:45:04.691185 #209631] INFO -- : [214/885] 250986=test_workspace I, [2024-05-24T07:45:04.727106 #209631] INFO -- : [215/885] 250988=test_weakmap I, [2024-05-24T07:45:04.735756 #209631] INFO -- : [216/885] 250998=test_yjit I, [2024-05-24T07:45:04.735834 #209631] INFO -- : [217/885] 250998=test_ws I, [2024-05-24T07:45:04.765390 #209631] INFO -- : [218/885] 250998=test_gem_commands_environment_command I, [2024-05-24T07:45:04.792905 #209631] INFO -- : [219/885] 250993=test_m17n I, [2024-05-24T07:45:04.813020 #209631] INFO -- : [220/885] 251004=test_argf I, [2024-05-24T07:45:04.845178 #209631] INFO -- : [221/885] 250991=test_kill_ring I, [2024-05-24T07:45:04.859101 #209631] INFO -- : [222/885] 250993=test_ns_spki I, [2024-05-24T07:45:04.867140 #209631] INFO -- : [223/885] 251001=test_framework I, [2024-05-24T07:45:04.888132 #209631] INFO -- : [224/885] 251001=test_tree_builder I, [2024-05-24T07:45:04.903644 #209631] INFO -- : [225/885] 250991=test_gem_resolver_dependency_request I, [2024-05-24T07:45:04.907334 #209631] INFO -- : [226/885] 250993=test_hash I, [2024-05-24T07:45:04.915588 #209631] INFO -- : [227/885] 251001=test_postponed_job I, [2024-05-24T07:45:04.917501 #209631] INFO -- : [228/885] 250989=test_alias_and_anchor I, [2024-05-24T07:45:04.920516 #209631] INFO -- : [229/885] 250993=test_external_new I, [2024-05-24T07:45:04.924028 #209631] INFO -- : [230/885] 250991=test_gem_request_set_lockfile I, [2024-05-24T07:45:04.928010 #209631] INFO -- : [231/885] 250989=test_raise_exception I, [2024-05-24T07:45:04.928815 #209631] INFO -- : [232/885] 250993=test_protect I, [2024-05-24T07:45:04.938521 #209631] INFO -- : [233/885] 250993=test_win32ole_typelib I, [2024-05-24T07:45:04.950092 #209631] INFO -- : [234/885] 250993=test_show_source I, [2024-05-24T07:45:04.972626 #209631] INFO -- : [235/885] 250986=test_set I, [2024-05-24T07:45:04.977191 #209631] INFO -- : [236/885] 250986=test_lock_native_thread I, [2024-05-24T07:45:05.020644 #209631] INFO -- : [237/885] 250998=test_c_struct_entry I, [2024-05-24T07:45:05.110226 #209631] INFO -- : [238/885] 250993=test_gem_commands_stale_command I, [2024-05-24T07:45:05.129085 #209631] INFO -- : [239/885] 250993=test_remote_fetch_error I, [2024-05-24T07:45:05.154227 #209631] INFO -- : [240/885] 250993=test_have_library I, [2024-05-24T07:45:05.201835 #209631] INFO -- : [241/885] 250998=test_line_editor I, [2024-05-24T07:45:05.204807 #209631] INFO -- : [242/885] 250998=ripper_test I, [2024-05-24T07:45:05.235411 #209631] INFO -- : [243/885] 250986=test_objspace I, [2024-05-24T07:45:05.299425 #209631] INFO -- : [244/885] 250991=test_undef I, [2024-05-24T07:45:05.303695 #209631] INFO -- : [245/885] 250991=test_gem_security_trust_dir I, [2024-05-24T07:45:05.345701 #209631] INFO -- : [246/885] 250991=test_string_memory I, [2024-05-24T07:45:05.390869 #209631] INFO -- : [247/885] 251003=comments_test I, [2024-05-24T07:45:05.390937 #209631] INFO -- : [248/885] 251001=test_sprintf I, [2024-05-24T07:45:05.419540 #209631] INFO -- : [249/885] 250991=test_gem_requirement I, [2024-05-24T07:45:05.474414 #209631] INFO -- : [250/885] 251003=test_ftp I, [2024-05-24T07:45:05.482155 #209631] INFO -- : [251/885] 251003=test_rdoc_context_section I, [2024-05-24T07:45:05.487259 #209631] INFO -- : [252/885] 251003=test_euc_kr I, [2024-05-24T07:45:05.507769 #209631] INFO -- : [253/885] 251003=test_rdoc_rubygems_hook I, [2024-05-24T07:45:05.549614 #209631] INFO -- : [254/885] 250991=test_gem_commands_query_command I, [2024-05-24T07:45:05.590485 #209631] INFO -- : [255/885] 251001=test_method I, [2024-05-24T07:45:05.614040 #209631] INFO -- : [256/885] 251003=test_gem_impossible_dependencies_error I, [2024-05-24T07:45:05.620870 #209631] INFO -- : [257/885] 251003=test_array_create I, [2024-05-24T07:45:05.623231 #209631] INFO -- : [258/885] 251003=test_pack I, [2024-05-24T07:45:05.640660 #209631] INFO -- : [259/885] 250999=test_pattern_key_name_check I, [2024-05-24T07:45:05.649301 #209631] INFO -- : [260/885] 250999=test_to_ruby I, [2024-05-24T07:45:05.670609 #209631] INFO -- : [261/885] 250999=test_io I, [2024-05-24T07:45:05.751465 #209631] INFO -- : [262/885] 250989=test_sorted_set I, [2024-05-24T07:45:05.755407 #209631] INFO -- : [263/885] 250998=test_win32ole_type_event I, [2024-05-24T07:45:05.758896 #209631] INFO -- : [264/885] 250998=test_emoji I, [2024-05-24T07:45:05.791143 #209631] INFO -- : [265/885] 250998=test_ubf_async_safe I, [2024-05-24T07:45:05.791879 #209631] INFO -- : [266/885] 250998=test_hash I, [2024-05-24T07:45:05.810774 #209631] INFO -- : [267/885] 251002=test_gem_unsatisfiable_dependency_error I, [2024-05-24T07:45:05.820666 #209631] INFO -- : [268/885] 251002=test_win32ole_record I, [2024-05-24T07:45:05.826580 #209631] INFO -- : [269/885] 251002=test_cp949 I, [2024-05-24T07:45:05.828832 #209631] INFO -- : [270/885] 251002=test_gem_commands_uninstall_command I, [2024-05-24T07:45:05.851296 #209631] INFO -- : [271/885] 251003=test_gem_source_specific_file I, [2024-05-24T07:45:05.900848 #209631] INFO -- : [272/885] 250999=test_foreach I, [2024-05-24T07:45:05.908142 #209631] INFO -- : [273/885] 250999=test_condition I, [2024-05-24T07:45:05.911015 #209631] INFO -- : [274/885] 250999=test_console_attr I, [2024-05-24T07:45:05.915604 #209631] INFO -- : [275/885] 250999=test_summary I, [2024-05-24T07:45:05.929856 #209631] INFO -- : [276/885] 251003=test_type_completor I, [2024-05-24T07:45:05.931249 #209631] INFO -- : [277/885] 251003=test_io_wait I, [2024-05-24T07:45:05.976060 #209631] INFO -- : [278/885] 250989=test_gem_commands_exec_command I, [2024-05-24T07:45:06.058189 #209631] INFO -- : [279/885] 250999=warnings_test I, [2024-05-24T07:45:06.129832 #209631] INFO -- : [280/885] 250991=test_kwargs I, [2024-05-24T07:45:06.130828 #209631] INFO -- : [281/885] 250991=test_ellipsize I, [2024-05-24T07:45:06.137883 #209631] INFO -- : [282/885] 250992=test_date_attr I, [2024-05-24T07:45:06.140382 #209631] INFO -- : [283/885] 250992=test_utf16 I, [2024-05-24T07:45:06.145737 #209631] INFO -- : [284/885] 250991=test_autoload I, [2024-05-24T07:45:06.145883 #209631] INFO -- : [285/885] 250999=test_io I, [2024-05-24T07:45:06.158238 #209631] INFO -- : [286/885] 250992=test_unicode_escape I, [2024-05-24T07:45:06.258655 #209631] INFO -- : [287/885] 250992=test_sizeof I, [2024-05-24T07:45:06.267175 #209631] INFO -- : [288/885] 251000=test_case I, [2024-05-24T07:45:06.293669 #209631] INFO -- : [289/885] 251000=test_face I, [2024-05-24T07:45:06.299960 #209631] INFO -- : [290/885] 251003=test_rendering I, [2024-05-24T07:45:06.302862 #209631] INFO -- : [291/885] 250996=test_yaml_tree I, [2024-05-24T07:45:06.337041 #209631] INFO -- : [292/885] 250996=test_libs I, [2024-05-24T07:45:06.366156 #209631] INFO -- : [293/885] 250996=test_math I, [2024-05-24T07:45:06.369714 #209631] INFO -- : [294/885] 251000=test_gem_commands_fetch_command I, [2024-05-24T07:45:06.384726 #209631] INFO -- : [295/885] 250996=test_gc I, [2024-05-24T07:45:06.393531 #209631] INFO -- : [296/885] 250996=test_sleep I, [2024-05-24T07:45:06.403242 #209631] INFO -- : [297/885] 251003=test_config I, [2024-05-24T07:45:06.438548 #209631] INFO -- : [298/885] 251003=test_gem_config_file I, [2024-05-24T07:45:06.502502 #209631] INFO -- : [299/885] 250993=test_ripper I, [2024-05-24T07:45:06.510003 #209631] INFO -- : [300/885] 251000=test_getopts I, [2024-05-24T07:45:06.514433 #209631] INFO -- : [301/885] 251000=test_protocol I, [2024-05-24T07:45:06.521526 #209631] INFO -- : [302/885] 250995=test_gem_resolver_activation_request I, [2024-05-24T07:45:06.559243 #209631] INFO -- : [303/885] 251002=test_yjit_exit_locations I, [2024-05-24T07:45:06.562991 #209631] INFO -- : [304/885] 251002=test_etc I, [2024-05-24T07:45:06.595602 #209631] INFO -- : [305/885] 251003=test_system I, [2024-05-24T07:45:06.616086 #209631] INFO -- : [306/885] 250988=test_pkcs12 I, [2024-05-24T07:45:06.641278 #209631] INFO -- : [307/885] 251002=test_pkey_dh I, [2024-05-24T07:45:06.657410 #209631] INFO -- : [308/885] 250995=test_bigzero I, [2024-05-24T07:45:06.667961 #209631] INFO -- : [309/885] 250995=test_gem_package_tar_header I, [2024-05-24T07:45:06.699433 #209631] INFO -- : [310/885] 250995=test_gem_util I, [2024-05-24T07:45:06.721858 #209631] INFO -- : [311/885] 251002=test_iseq_load I, [2024-05-24T07:45:06.828765 #209631] INFO -- : [312/885] 251000=test_stringscanner I, [2024-05-24T07:45:06.847136 #209631] INFO -- : [313/885] 251000=test_files_sample I, [2024-05-24T07:45:06.866619 #209631] INFO -- : [314/885] 250995=parser_test I, [2024-05-24T07:45:06.873967 #209631] INFO -- : [315/885] 250993=test_convertible I, [2024-05-24T07:45:06.919698 #209631] INFO -- : [316/885] 251000=test_rdoc_alias I, [2024-05-24T07:45:06.942210 #209631] INFO -- : [317/885] 250995=test_yield I, [2024-05-24T07:45:06.950250 #209631] INFO -- : [318/885] 251000=test_fstring I, [2024-05-24T07:45:07.065410 #209631] INFO -- : [319/885] 251000=test_optparse I, [2024-05-24T07:45:07.091223 #209631] INFO -- : [320/885] 250989=test_array I, [2024-05-24T07:45:07.091650 #209631] INFO -- : [321/885] 250989=test_rat I, [2024-05-24T07:45:07.117816 #209631] INFO -- : [322/885] 250989=test_rdoc_markup_raw I, [2024-05-24T07:45:07.138370 #209631] INFO -- : [323/885] 251000=test_webauthn_poller I, [2024-05-24T07:45:07.207198 #209631] INFO -- : [324/885] 250988=test_rdoc_markup_to_html_crossref I, [2024-05-24T07:45:07.260036 #209631] INFO -- : [325/885] 250989=encoding_test I, [2024-05-24T07:45:07.280322 #209631] INFO -- : [326/885] 251000=test_gem_resolver_best_set I, [2024-05-24T07:45:07.341096 #209631] INFO -- : [327/885] 250989=test_typeddata I, [2024-05-24T07:45:07.353568 #209631] INFO -- : [328/885] 251000=locals_test I, [2024-05-24T07:45:07.540782 #209631] INFO -- : [329/885] 251002=test_rdoc_require I, [2024-05-24T07:45:07.552638 #209631] INFO -- : [330/885] 251002=test_clone I, [2024-05-24T07:45:07.564501 #209631] INFO -- : [331/885] 251003=test_gem_commands_install_command I, [2024-05-24T07:45:07.593836 #209631] INFO -- : [332/885] 250989=test_readpartial I, [2024-05-24T07:45:07.618375 #209631] INFO -- : [333/885] 250987=test_backtrace I, [2024-05-24T07:45:07.626820 #209631] INFO -- : [334/885] 250988=test_pack I, [2024-05-24T07:45:07.640667 #209631] INFO -- : [335/885] 250988=ruby_parser_test I, [2024-05-24T07:45:07.718476 #209631] INFO -- : [336/885] 250988=test_io_buffer I, [2024-05-24T07:45:07.722868 #209631] INFO -- : [337/885] 251002=test_gem_resolver_conflict I, [2024-05-24T07:45:07.736237 #209631] INFO -- : [338/885] 251002=test_rdoc_task I, [2024-05-24T07:45:07.744039 #209631] INFO -- : [339/885] 251002=test_rdoc_markup_indented_paragraph I, [2024-05-24T07:45:07.758521 #209631] INFO -- : [340/885] 251002=test_profile_frames I, [2024-05-24T07:45:07.769734 #209631] INFO -- : [341/885] 251000=test_pstore I, [2024-05-24T07:45:07.822826 #209631] INFO -- : [342/885] 251000=test_cstr I, [2024-05-24T07:45:07.830142 #209631] INFO -- : [343/885] 250988=test_enc_str_buf_cat I, [2024-05-24T07:45:07.834355 #209631] INFO -- : [344/885] 250988=test_class2name I, [2024-05-24T07:45:07.835336 #209631] INFO -- : [345/885] 250988=test_gbk I, [2024-05-24T07:45:07.839994 #209631] INFO -- : [346/885] 250988=test_rdoc_parser_c I, [2024-05-24T07:45:07.912366 #209631] INFO -- : [347/885] 251002=test_comparable I, [2024-05-24T07:45:07.918025 #209631] INFO -- : [348/885] 251002=test_shapes I, [2024-05-24T07:45:07.923033 #209631] INFO -- : [349/885] 251002=json_fixtures_test I, [2024-05-24T07:45:07.929953 #209631] INFO -- : [350/885] 251002=test_io_timeout I, [2024-05-24T07:45:07.932502 #209631] INFO -- : [351/885] 251002=test_gem_commands_sources_command I, [2024-05-24T07:45:07.979604 #209631] INFO -- : [352/885] 250988=test_ansi_without_terminfo I, [2024-05-24T07:45:08.001885 #209631] INFO -- : [353/885] 250989=test_euc_tw I, [2024-05-24T07:45:08.003744 #209631] INFO -- : [354/885] 250989=test_ractor I, [2024-05-24T07:45:08.019779 #209631] INFO -- : [355/885] 250989=test_bmethod I, [2024-05-24T07:45:08.023174 #209631] INFO -- : [356/885] 250988=test_rdoc_markup_formatter I, [2024-05-24T07:45:08.025211 #209631] INFO -- : [357/885] 250989=test_thread_queue I, [2024-05-24T07:45:08.031206 #209631] INFO -- : [358/885] 250988=test_nowrite I, [2024-05-24T07:45:08.051291 #209631] INFO -- : [359/885] 250988=test_wait I, [2024-05-24T07:45:08.085227 #209631] INFO -- : [360/885] 251002=test_handle I, [2024-05-24T07:45:08.129616 #209631] INFO -- : [361/885] 250988=test_forwardable I, [2024-05-24T07:45:08.147725 #209631] INFO -- : [362/885] 250988=test_yaml I, [2024-05-24T07:45:08.219836 #209631] INFO -- : [363/885] 250988=test_big2str I, [2024-05-24T07:45:08.236717 #209631] INFO -- : [364/885] 250988=test_recorder I, [2024-05-24T07:45:08.240193 #209631] INFO -- : [365/885] 250988=test_gem_source_vendor I, [2024-05-24T07:45:08.355955 #209631] INFO -- : [366/885] 250988=test_gem_commands_owner_command I, [2024-05-24T07:45:08.403868 #209631] INFO -- : [367/885] 251002=test_formatter I, [2024-05-24T07:45:08.414727 #209631] INFO -- : [368/885] 251002=test_bash_completion I, [2024-05-24T07:45:08.423356 #209631] INFO -- : [369/885] 251002=test_deprecate I, [2024-05-24T07:45:08.437992 #209631] INFO -- : [370/885] 250996=test_rdoc_constant I, [2024-05-24T07:45:08.460040 #209631] INFO -- : [371/885] 251002=test_file I, [2024-05-24T07:45:08.469757 #209631] INFO -- : [372/885] 251002=test_rdoc_any_method I, [2024-05-24T07:45:08.525115 #209631] INFO -- : [373/885] 250996=test_modify_expand I, [2024-05-24T07:45:08.525619 #209631] INFO -- : [374/885] 250996=test_rdoc_markdown I, [2024-05-24T07:45:08.536609 #209631] INFO -- : [375/885] 251000=test_gem_available_set I, [2024-05-24T07:45:08.636676 #209631] INFO -- : [376/885] 251000=test_pathname I, [2024-05-24T07:45:08.685279 #209631] INFO -- : [377/885] 250996=test_complexrational I, [2024-05-24T07:45:08.688130 #209631] INFO -- : [378/885] 250996=test_init I, [2024-05-24T07:45:08.788142 #209631] INFO -- : [379/885] 251003=regexp_test I, [2024-05-24T07:45:08.799381 #209631] INFO -- : [380/885] 251003=test_gem_package_tar_reader I, [2024-05-24T07:45:08.828859 #209631] INFO -- : [381/885] 251003=test_rdoc_encoding I, [2024-05-24T07:45:08.833081 #209631] INFO -- : [382/885] 251000=test_coverage I, [2024-05-24T07:45:08.860787 #209631] INFO -- : [383/885] 251003=test_find I, [2024-05-24T07:45:08.868574 #209631] INFO -- : [384/885] 251003=test_ractor I, [2024-05-24T07:45:08.885049 #209631] INFO -- : [385/885] 250987=test_wss I, [2024-05-24T07:45:08.899736 #209631] INFO -- : [386/885] 250987=test_fiddle I, [2024-05-24T07:45:08.910841 #209631] INFO -- : [387/885] 250988=test_require I, [2024-05-24T07:45:08.923200 #209631] INFO -- : [388/885] 250987=test_cgi_util I, [2024-05-24T07:45:08.938436 #209631] INFO -- : [389/885] 251002=test_gem_commands_contents_command I, [2024-05-24T07:45:08.974268 #209631] INFO -- : [390/885] 251003=test_gem_ext_cmake_builder I, [2024-05-24T07:45:08.990862 #209631] INFO -- : [391/885] 251003=test_digest I, [2024-05-24T07:45:09.027612 #209631] INFO -- : [392/885] 251002=test_marshalable I, [2024-05-24T07:45:09.029377 #209631] INFO -- : [393/885] 251002=test_gem_resolver_index_specification I, [2024-05-24T07:45:09.033063 #209631] INFO -- : [394/885] 251004=test_internal_ivar I, [2024-05-24T07:45:09.033584 #209631] INFO -- : [395/885] 251004=test_tracepoint I, [2024-05-24T07:45:09.048424 #209631] INFO -- : [396/885] 250995=test_prettyprint I, [2024-05-24T07:45:09.051269 #209631] INFO -- : [397/885] 250996=test_gem_commands_help_command I, [2024-05-24T07:45:09.064534 #209631] INFO -- : [398/885] 250995=test_rdoc_markup I, [2024-05-24T07:45:09.071763 #209631] INFO -- : [399/885] 250995=test_duplicate I, [2024-05-24T07:45:09.079664 #209631] INFO -- : [400/885] 250995=test_utf32 I, [2024-05-24T07:45:09.080277 #209631] INFO -- : [401/885] 251002=test_basicsocket I, [2024-05-24T07:45:09.085697 #209631] INFO -- : [402/885] 250995=parse_comments_test I, [2024-05-24T07:45:09.089548 #209631] INFO -- : [403/885] 250995=test_noarg I, [2024-05-24T07:45:09.094671 #209631] INFO -- : [404/885] 251002=test_tempfile I, [2024-05-24T07:45:09.095293 #209631] INFO -- : [405/885] 250990=test_function I, [2024-05-24T07:45:09.145386 #209631] INFO -- : [406/885] 250996=test_queue I, [2024-05-24T07:45:09.147754 #209631] INFO -- : [407/885] 250987=test_irb I, [2024-05-24T07:45:09.152040 #209631] INFO -- : [408/885] 250996=test_asn1 I, [2024-05-24T07:45:09.192602 #209631] INFO -- : [409/885] 250996=test_random I, [2024-05-24T07:45:09.202557 #209631] INFO -- : [410/885] 250996=json_string_matching_test I, [2024-05-24T07:45:09.206269 #209631] INFO -- : [411/885] 250996=test_load I, [2024-05-24T07:45:09.213740 #209631] INFO -- : [412/885] 250996=test_class I, [2024-05-24T07:45:09.237565 #209631] INFO -- : [413/885] 251004=test_rdoc_normal_class I, [2024-05-24T07:45:09.264233 #209631] INFO -- : [414/885] 250992=test_const I, [2024-05-24T07:45:09.266190 #209631] INFO -- : [415/885] 250992=test_gem_installer I, [2024-05-24T07:45:09.290526 #209631] INFO -- : [416/885] 250995=test_yamlstore I, [2024-05-24T07:45:09.308206 #209631] INFO -- : [417/885] 251004=test_rdoc_parser_rd I, [2024-05-24T07:45:09.316513 #209631] INFO -- : [418/885] 250995=test_date_strftime I, [2024-05-24T07:45:09.328736 #209631] INFO -- : [419/885] 251004=test_gem_resolver_installed_specification I, [2024-05-24T07:45:09.341559 #209631] INFO -- : [420/885] 250990=test_scanner_events I, [2024-05-24T07:45:09.354934 #209631] INFO -- : [421/885] 251004=test_gem_remote_fetcher I, [2024-05-24T07:45:09.379669 #209631] INFO -- : [422/885] 250990=test_parse I, [2024-05-24T07:45:09.384955 #209631] INFO -- : [423/885] 251002=test_mdns I, [2024-05-24T07:45:09.399862 #209631] INFO -- : [424/885] 251002=test_path_to_class I, [2024-05-24T07:45:09.400310 #209631] INFO -- : [425/885] 251002=test_gem_resolver_specification I, [2024-05-24T07:45:09.418006 #209631] INFO -- : [426/885] 250987=test_gem_dependency I, [2024-05-24T07:45:09.420138 #209631] INFO -- : [427/885] 251002=test_inlinecache I, [2024-05-24T07:45:09.485438 #209631] INFO -- : [428/885] 251002=test_rdoc_markup_verbatim I, [2024-05-24T07:45:09.500957 #209631] INFO -- : [429/885] 251002=test_complex I, [2024-05-24T07:45:09.635790 #209631] INFO -- : [430/885] 251002=test_gem_commands_search_command I, [2024-05-24T07:45:09.640570 #209631] INFO -- : [431/885] 251002=test_gem_stub_specification I, [2024-05-24T07:45:09.670595 #209631] INFO -- : [432/885] 251000=test_method_cache I, [2024-05-24T07:45:09.675182 #209631] INFO -- : [433/885] 251000=test_frozen_error I, [2024-05-24T07:45:09.689050 #209631] INFO -- : [434/885] 250995=test_gem_ext_ext_conf_builder I, [2024-05-24T07:45:09.691971 #209631] INFO -- : [435/885] 250994=test_ldap I, [2024-05-24T07:45:09.694776 #209631] INFO -- : [436/885] 251000=test_emitter I, [2024-05-24T07:45:09.716936 #209631] INFO -- : [437/885] 250994=test_resource I, [2024-05-24T07:45:09.718577 #209631] INFO -- : [438/885] 250987=test_gem_commands_signin_command I, [2024-05-24T07:45:09.724280 #209631] INFO -- : [439/885] 250994=test_string_processing I, [2024-05-24T07:45:09.729783 #209631] INFO -- : [440/885] 251000=test_fileutils I, [2024-05-24T07:45:09.732023 #209631] INFO -- : [441/885] 250994=test_econv I, [2024-05-24T07:45:09.798807 #209631] INFO -- : [442/885] 251002=test_cesu8 I, [2024-05-24T07:45:09.803585 #209631] INFO -- : [443/885] 250987=test_rdoc_options I, [2024-05-24T07:45:09.812116 #209631] INFO -- : [444/885] 251002=test_gem_version I, [2024-05-24T07:45:09.816971 #209631] INFO -- : [445/885] 251003=test_too_many_dummy_encodings I, [2024-05-24T07:45:09.866035 #209631] INFO -- : [446/885] 251003=test_reqarg I, [2024-05-24T07:45:09.882938 #209631] INFO -- : [447/885] 251002=test_rdoc_include I, [2024-05-24T07:45:09.916341 #209631] INFO -- : [448/885] 251002=test_stack I, [2024-05-24T07:45:09.959006 #209631] INFO -- : [449/885] 250990=test_gem_commands_list_command I, [2024-05-24T07:45:10.105374 #209631] INFO -- : [450/885] 250998=test_boolean I, [2024-05-24T07:45:10.118331 #209631] INFO -- : [451/885] 251000=test_stringify_symbols I, [2024-05-24T07:45:10.126528 #209631] INFO -- : [452/885] 250998=integer_parse_test I, [2024-05-24T07:45:10.129374 #209631] INFO -- : [453/885] 250998=test_instrumentation_api I, [2024-05-24T07:45:10.133032 #209631] INFO -- : [454/885] 251000=test_configuration I, [2024-05-24T07:45:10.143601 #209631] INFO -- : [455/885] 250990=test_rubyvm I, [2024-05-24T07:45:10.150670 #209631] INFO -- : [456/885] 250990=test_monitor I, [2024-05-24T07:45:10.182889 #209631] INFO -- : [457/885] 251003=test_buffered_io I, [2024-05-24T07:45:10.183033 #209631] INFO -- : [458/885] 250988=test_whileuntil I, [2024-05-24T07:45:10.189227 #209631] INFO -- : [459/885] 250988=test_rdoc_generator_markup I, [2024-05-24T07:45:10.194209 #209631] INFO -- : [460/885] 250988=test_method_name_check I, [2024-05-24T07:45:10.210751 #209631] INFO -- : [461/885] 250988=test_arith_seq_extract I, [2024-05-24T07:45:10.248032 #209631] INFO -- : [462/885] 251003=test_parser I, [2024-05-24T07:45:10.252272 #209631] INFO -- : [463/885] 251000=constant_path_node_test I, [2024-05-24T07:45:10.261331 #209631] INFO -- : [464/885] 251000=test_ssl I, [2024-05-24T07:45:10.270994 #209631] INFO -- : [465/885] 251003=test_gem_ext_cargo_builder I, [2024-05-24T07:45:10.294246 #209631] INFO -- : [466/885] 251003=test_module I, [2024-05-24T07:45:10.310052 #209631] INFO -- : [467/885] 251001=test_gem_request_set I, [2024-05-24T07:45:10.317975 #209631] INFO -- : [468/885] 250987=test_rational I, [2024-05-24T07:45:10.337669 #209631] INFO -- : [469/885] 250987=test_rational2 I, [2024-05-24T07:45:10.340363 #209631] INFO -- : [470/885] 250988=test_assembler I, [2024-05-24T07:45:10.343437 #209631] INFO -- : [471/885] 250988=test_spell_checker I, [2024-05-24T07:45:10.347136 #209631] INFO -- : [472/885] 250988=attribute_write_test I, [2024-05-24T07:45:10.347449 #209631] INFO -- : [473/885] 250987=test_propertyputref I, [2024-05-24T07:45:10.351041 #209631] INFO -- : [474/885] 250987=test_erb I, [2024-05-24T07:45:10.355763 #209631] INFO -- : [475/885] 250988=test_x509ext I, [2024-05-24T07:45:10.357026 #209631] INFO -- : [476/885] 250988=test_gem_source_installed I, [2024-05-24T07:45:10.360681 #209631] INFO -- : [477/885] 250990=test_len I, [2024-05-24T07:45:10.365033 #209631] INFO -- : [478/885] 250988=test_yield_block I, [2024-05-24T07:45:10.366296 #209631] INFO -- : [479/885] 250990=test_gem_commands_cert_command I, [2024-05-24T07:45:10.368770 #209631] INFO -- : [480/885] 250988=test_completion I, [2024-05-24T07:45:10.408425 #209631] INFO -- : [481/885] 250987=test_abi I, [2024-05-24T07:45:10.499442 #209631] INFO -- : [482/885] 250997=test_provider I, [2024-05-24T07:45:10.601664 #209631] INFO -- : [483/885] 250987=test_rdoc_parser_simple I, [2024-05-24T07:45:10.616549 #209631] INFO -- : [484/885] 250987=test_load I, [2024-05-24T07:45:10.617064 #209631] INFO -- : [485/885] 250987=test_yamldbm I, [2024-05-24T07:45:10.630433 #209631] INFO -- : [486/885] 250987=test_gem_commands_rebuild_command I, [2024-05-24T07:45:10.687379 #209631] INFO -- : [487/885] 250987=test_https I, [2024-05-24T07:45:10.754967 #209631] INFO -- : [488/885] 251001=test_gem_ext_builder I, [2024-05-24T07:45:10.761635 #209631] INFO -- : [489/885] 250995=test_evaluation I, [2024-05-24T07:45:10.774845 #209631] INFO -- : [490/885] 250995=test_gem_dependency_list I, [2024-05-24T07:45:10.819769 #209631] INFO -- : [491/885] 251002=test_benchmark I, [2024-05-24T07:45:10.833241 #209631] INFO -- : [492/885] 250994=test_win32ole_method_event I, [2024-05-24T07:45:10.833514 #209631] INFO -- : [493/885] 250994=test_nesting_parser I, [2024-05-24T07:45:10.837494 #209631] INFO -- : [494/885] 250988=test_gem_source I, [2024-05-24T07:45:10.837965 #209631] INFO -- : [495/885] 250995=test_scalar_scanner I, [2024-05-24T07:45:10.842517 #209631] INFO -- : [496/885] 250991=test_gem_commands_outdated_command I, [2024-05-24T07:45:10.844937 #209631] INFO -- : [497/885] 250995=test_array I, [2024-05-24T07:45:10.855603 #209631] INFO -- : [498/885] 250994=test_helper_method I, [2024-05-24T07:45:10.867651 #209631] INFO -- : [499/885] 250994=test_gem_package_tar_writer I, [2024-05-24T07:45:10.874949 #209631] INFO -- : [500/885] 250991=test_new I, [2024-05-24T07:45:10.877728 #209631] INFO -- : [501/885] 250997=test_cipher I, [2024-05-24T07:45:10.878737 #209631] INFO -- : [502/885] 250991=test_gem_security_signer I, [2024-05-24T07:45:10.912680 #209631] INFO -- : [503/885] 250997=test_gem_resolver_git_set I, [2024-05-24T07:45:10.985056 #209631] INFO -- : [504/885] 250994=test_storage I, [2024-05-24T07:45:10.988826 #209631] INFO -- : [505/885] 250994=test_digest_extend I, [2024-05-24T07:45:10.992220 #209631] INFO -- : [506/885] 250991=test_iterator I, [2024-05-24T07:45:10.997426 #209631] INFO -- : [507/885] 250994=test_string I, [2024-05-24T07:45:11.000483 #209631] INFO -- : [508/885] 250994=test_omap I, [2024-05-24T07:45:11.002105 #209631] INFO -- : [509/885] 250994=test_debug I, [2024-05-24T07:45:11.006971 #209631] INFO -- : [510/885] 250994=pattern_test I, [2024-05-24T07:45:11.015992 #209631] INFO -- : [511/885] 250988=test_memory_view I, [2024-05-24T07:45:11.039649 #209631] INFO -- : [512/885] 250994=test_shellwords I, [2024-05-24T07:45:11.041521 #209631] INFO -- : [513/885] 250988=test_rdoc_rd I, [2024-05-24T07:45:11.045710 #209631] INFO -- : [514/885] 250994=test_cgi_session I, [2024-05-24T07:45:11.063843 #209631] INFO -- : [515/885] 250988=test_rdoc_top_level I, [2024-05-24T07:45:11.066369 #209631] INFO -- : [516/885] 250994=test_metaclass I, [2024-05-24T07:45:11.073044 #209631] INFO -- : [517/885] 250994=test_fixnum I, [2024-05-24T07:45:11.080851 #209631] INFO -- : [518/885] 250994=test_signal I, [2024-05-24T07:45:11.092949 #209631] INFO -- : [519/885] 250987=test_x509crl I, [2024-05-24T07:45:11.101386 #209631] INFO -- : [520/885] 250991=test_process I, [2024-05-24T07:45:11.106805 #209631] INFO -- : [521/885] 251004=test_input_method I, [2024-05-24T07:45:11.127984 #209631] INFO -- : [522/885] 250991=test_windows_1252 I, [2024-05-24T07:45:11.135927 #209631] INFO -- : [523/885] 250991=test_float I, [2024-05-24T07:45:11.139309 #209631] INFO -- : [524/885] 251004=test_require I, [2024-05-24T07:45:11.218600 #209631] INFO -- : [525/885] 250997=test_cgi_cookie I, [2024-05-24T07:45:11.223521 #209631] INFO -- : [526/885] 250997=test_regex_casefold I, [2024-05-24T07:45:11.280572 #209631] INFO -- : [527/885] 250987=test_refinement I, [2024-05-24T07:45:11.371799 #209631] INFO -- : [528/885] 250993=test_gem_commands_signout_command I, [2024-05-24T07:45:11.372220 #209631] INFO -- : [529/885] 250988=test_gem_source_git I, [2024-05-24T07:45:11.391487 #209631] INFO -- : [530/885] 250993=test_dir_m17n I, [2024-05-24T07:45:11.758094 #209631] INFO -- : [531/885] 251001=test_gem_resolver_installer_set I, [2024-05-24T07:45:11.801191 #209631] INFO -- : [532/885] 250997=test_files_test_1 I, [2024-05-24T07:45:11.844335 #209631] INFO -- : [533/885] 250996=test_set I, [2024-05-24T07:45:11.855686 #209631] INFO -- : [534/885] 250996=test_struct I, [2024-05-24T07:45:11.887338 #209631] INFO -- : [535/885] 250988=test_gem_path_support I, [2024-05-24T07:45:11.918371 #209631] INFO -- : [536/885] 250988=test_mutex I, [2024-05-24T07:45:11.941997 #209631] INFO -- : [537/885] 251001=test_x509req I, [2024-05-24T07:45:12.069502 #209631] INFO -- : [538/885] 250990=test_rdoc_rd_inline I, [2024-05-24T07:45:12.070403 #209631] INFO -- : [539/885] 251001=test_allocation I, [2024-05-24T07:45:12.108359 #209631] INFO -- : [540/885] 251002=test_div I, [2024-05-24T07:45:12.112168 #209631] INFO -- : [541/885] 251002=test_win32ole_variant_m I, [2024-05-24T07:45:12.113136 #209631] INFO -- : [542/885] 251002=test_engine I, [2024-05-24T07:45:12.116183 #209631] INFO -- : [543/885] 251002=test_key_error I, [2024-05-24T07:45:12.120886 #209631] INFO -- : [544/885] 251002=test_insns_leaf I, [2024-05-24T07:45:12.123876 #209631] INFO -- : [545/885] 251002=test_serialize_subclasses I, [2024-05-24T07:45:12.124547 #209631] INFO -- : [546/885] 251002=test_deprecated I, [2024-05-24T07:45:12.129420 #209631] INFO -- : [547/885] 251002=test_color_printer I, [2024-05-24T07:45:12.144010 #209631] INFO -- : [548/885] 251002=test_pkg_config I, [2024-05-24T07:45:12.191040 #209631] INFO -- : [549/885] 251002=test_cparser I, [2024-05-24T07:45:12.205431 #209631] INFO -- : [550/885] 250989=test_struct I, [2024-05-24T07:45:12.208187 #209631] INFO -- : [551/885] 250989=magic_comment_test I, [2024-05-24T07:45:12.210746 #209631] INFO -- : [552/885] 250989=test_rdoc_markup_to_html_snippet I, [2024-05-24T07:45:12.247130 #209631] INFO -- : [553/885] 250990=fuzzer_test I, [2024-05-24T07:45:12.317006 #209631] INFO -- : [554/885] 250989=test_rdoc_markup_include I, [2024-05-24T07:45:12.328426 #209631] INFO -- : [555/885] 250989=test_sexp I, [2024-05-24T07:45:12.338019 #209631] INFO -- : [556/885] 250989=test_variable I, [2024-05-24T07:45:12.352756 #209631] INFO -- : [557/885] 250990=test_win32ole_variant_outarg I, [2024-05-24T07:45:12.354815 #209631] INFO -- : [558/885] 250990=test_gem_source_subpath_problem I, [2024-05-24T07:45:12.423221 #209631] INFO -- : [559/885] 250996=test_dln I, [2024-05-24T07:45:12.433441 #209631] INFO -- : [560/885] 250996=json_common_interface_test I, [2024-05-24T07:45:12.446601 #209631] INFO -- : [561/885] 250996=json_parser_test I, [2024-05-24T07:45:12.456635 #209631] INFO -- : [562/885] 250989=test_nomethod_error I, [2024-05-24T07:45:12.458303 #209631] INFO -- : [563/885] 250990=memsize_test I, [2024-05-24T07:45:12.461486 #209631] INFO -- : [564/885] 250989=test_config I, [2024-05-24T07:45:12.469039 #209631] INFO -- : [565/885] 250990=test_pkey_dsa I, [2024-05-24T07:45:12.477577 #209631] INFO -- : [566/885] 250996=test_ocsp I, [2024-05-24T07:45:12.511483 #209631] INFO -- : [567/885] 250989=test_class I, [2024-05-24T07:45:12.515659 #209631] INFO -- : [568/885] 250989=test_scheduler I, [2024-05-24T07:45:12.538597 #209631] INFO -- : [569/885] 250993=test_rdoc_markup_heading I, [2024-05-24T07:45:12.541491 #209631] INFO -- : [570/885] 250993=test_exception_at_throwing I, [2024-05-24T07:45:12.614562 #209631] INFO -- : [571/885] 250993=test_iseq I, [2024-05-24T07:45:12.620460 #209631] INFO -- : [572/885] 250991=test_gem_commands_server_command I, [2024-05-24T07:45:12.626680 #209631] INFO -- : [573/885] 250991=test_io_m17n I, [2024-05-24T07:45:12.665066 #209631] INFO -- : [574/885] 250989=test_variable_name_check I, [2024-05-24T07:45:12.700341 #209631] INFO -- : [575/885] 250989=test_did_you_mean I, [2024-05-24T07:45:12.811868 #209631] INFO -- : [576/885] 250996=test_cmethod I, [2024-05-24T07:45:12.817167 #209631] INFO -- : [577/885] 250996=test_tracer I, [2024-05-24T07:45:12.817671 #209631] INFO -- : [578/885] 250996=test_append I, [2024-05-24T07:45:12.822972 #209631] INFO -- : [579/885] 250996=test_option I, [2024-05-24T07:45:12.846670 #209631] INFO -- : [580/885] 250989=test_gem_commands_build_command I, [2024-05-24T07:45:12.877401 #209631] INFO -- : [581/885] 251003=test_interned_str I, [2024-05-24T07:45:12.904673 #209631] INFO -- : [582/885] 251003=test_case_comprehensive I, [2024-05-24T07:45:12.980201 #209631] INFO -- : [583/885] 250996=test_ractor I, [2024-05-24T07:45:12.981878 #209631] INFO -- : [584/885] 250990=test_rdoc_servlet I, [2024-05-24T07:45:13.014950 #209631] INFO -- : [585/885] 251002=test_gem_security I, [2024-05-24T07:45:13.050305 #209631] INFO -- : [586/885] 250996=test_digest I, [2024-05-24T07:45:13.052568 #209631] INFO -- : [587/885] 250988=test_closure I, [2024-05-24T07:45:13.076713 #209631] INFO -- : [588/885] 250996=test_bundled_ca I, [2024-05-24T07:45:13.087666 #209631] INFO -- : [589/885] 250989=test_multi_irb_commands I, [2024-05-24T07:45:13.088798 #209631] INFO -- : [590/885] 250989=test_fiber I, [2024-05-24T07:45:13.096820 #209631] INFO -- : [591/885] 250998=test_open3 I, [2024-05-24T07:45:13.147994 #209631] INFO -- : [592/885] 250994=test_history I, [2024-05-24T07:45:13.158496 #209631] INFO -- : [593/885] 250990=test_mkmf I, [2024-05-24T07:45:13.179442 #209631] INFO -- : [594/885] 250994=test_date_marshal I, [2024-05-24T07:45:13.179505 #209631] INFO -- : [595/885] 250994=test_delegate I, [2024-05-24T07:45:13.192399 #209631] INFO -- : [596/885] 250994=test_popen_deadlock I, [2024-05-24T07:45:13.192583 #209631] INFO -- : [597/885] 250990=test_exit I, [2024-05-24T07:45:13.245460 #209631] INFO -- : [598/885] 250993=test_recursion I, [2024-05-24T07:45:13.246789 #209631] INFO -- : [599/885] 250993=test_to_ary_concat I, [2024-05-24T07:45:13.274006 #209631] INFO -- : [600/885] 250990=test_webauthn_listener_response I, [2024-05-24T07:45:13.288470 #209631] INFO -- : [601/885] 250990=test_time I, [2024-05-24T07:45:13.456982 #209631] INFO -- : [602/885] 250990=test_stream I, [2024-05-24T07:45:13.486681 #209631] INFO -- : [603/885] 250990=test_rdoc_markup_pre_process I, [2024-05-24T07:45:13.561933 #209631] INFO -- : [604/885] 250988=test_printf I, [2024-05-24T07:45:13.575741 #209631] INFO -- : [605/885] 250988=test_pinned I, [2024-05-24T07:45:13.595739 #209631] INFO -- : [606/885] 250990=reflection_test I, [2024-05-24T07:45:13.596929 #209631] INFO -- : [607/885] 250990=test_emoji_breaks I, [2024-05-24T07:45:13.601667 #209631] INFO -- : [608/885] 250990=test_gem_bundler_version_finder I, [2024-05-24T07:45:13.626704 #209631] INFO -- : [609/885] 250990=test_within_pipe I, [2024-05-24T07:45:13.630030 #209631] INFO -- : [610/885] 250988=test_help I, [2024-05-24T07:45:13.640309 #209631] INFO -- : [611/885] 250988=test_rdoc_markup_to_bs I, [2024-05-24T07:45:13.672542 #209631] INFO -- : [612/885] 250988=test_files_lib I, [2024-05-24T07:45:13.713574 #209631] INFO -- : [613/885] 250990=test_gem_commands_unpack_command I, [2024-05-24T07:45:13.789148 #209631] INFO -- : [614/885] 250999=test_beginendblock I, [2024-05-24T07:45:13.841885 #209631] INFO -- : [615/885] 250994=json_encoding_test I, [2024-05-24T07:45:13.852608 #209631] INFO -- : [616/885] 251004=test_color I, [2024-05-24T07:45:13.867987 #209631] INFO -- : [617/885] 250994=test_key_stroke I, [2024-05-24T07:45:13.877380 #209631] INFO -- : [618/885] 250994=test_set_len I, [2024-05-24T07:45:13.877919 #209631] INFO -- : [619/885] 250994=test_httpresponses I, [2024-05-24T07:45:13.888489 #209631] INFO -- : [620/885] 250994=test_encoding I, [2024-05-24T07:45:13.902480 #209631] INFO -- : [621/885] 250994=test_gem_resolver_local_specification I, [2024-05-24T07:45:13.907926 #209631] INFO -- : [622/885] 251004=test_httpheader I, [2024-05-24T07:45:13.931157 #209631] INFO -- : [623/885] 250994=test_rdoc_ri_driver I, [2024-05-24T07:45:13.944202 #209631] INFO -- : [624/885] 250991=test_install I, [2024-05-24T07:45:13.958358 #209631] INFO -- : [625/885] 251004=test_rdoc_markup_to_label I, [2024-05-24T07:45:13.985671 #209631] INFO -- : [626/885] 250990=test_sockopt I, [2024-05-24T07:45:13.990517 #209631] INFO -- : [627/885] 250987=test_pair I, [2024-05-24T07:45:13.993812 #209631] INFO -- : [628/885] 250990=test_gem_commands_yank_command I, [2024-05-24T07:45:14.009699 #209631] INFO -- : [629/885] 251004=test_win32ole_param I, [2024-05-24T07:45:14.011461 #209631] INFO -- : [630/885] 251004=test_document I, [2024-05-24T07:45:14.012254 #209631] INFO -- : [631/885] 250992=test_acceptable I, [2024-05-24T07:45:14.017729 #209631] INFO -- : [632/885] 251004=test_euc_jp I, [2024-05-24T07:45:14.021121 #209631] INFO -- : [633/885] 251004=test_rdoc_generator_pot_po_entry I, [2024-05-24T07:45:14.030818 #209631] INFO -- : [634/885] 251004=test_chilled I, [2024-05-24T07:45:14.035262 #209631] INFO -- : [635/885] 251004=test_name_error_extension I, [2024-05-24T07:45:14.045297 #209631] INFO -- : [636/885] 251004=test_rdoc_i18n_locale I, [2024-05-24T07:45:14.053425 #209631] INFO -- : [637/885] 251004=test_human_typo I, [2024-05-24T07:45:14.058044 #209631] INFO -- : [638/885] 251004=test_primitive I, [2024-05-24T07:45:14.065474 #209631] INFO -- : [639/885] 251004=test_rbconfig I, [2024-05-24T07:45:14.068600 #209631] INFO -- : [640/885] 251004=test_ssl_session I, [2024-05-24T07:45:14.136884 #209631] INFO -- : [641/885] 250992=test_lexer I, [2024-05-24T07:45:14.139485 #209631] INFO -- : [642/885] 250993=test_thread_cv I, [2024-05-24T07:45:14.149071 #209631] INFO -- : [643/885] 250992=test_gem_uri I, [2024-05-24T07:45:14.168477 #209631] INFO -- : [644/885] 250992=test_key_event_record I, [2024-05-24T07:45:14.193984 #209631] INFO -- : [645/885] 250991=test_notimplement I, [2024-05-24T07:45:14.199625 #209631] INFO -- : [646/885] 250991=test_random I, [2024-05-24T07:45:14.205761 #209631] INFO -- : [647/885] 250991=test_gem_resolver_vendor_specification I, [2024-05-24T07:45:14.220347 #209631] INFO -- : [648/885] 250992=test_gem_commands_update_command I, [2024-05-24T07:45:14.226140 #209631] INFO -- : [649/885] 250991=test_filter I, [2024-05-24T07:45:14.244577 #209631] INFO -- : [650/885] 250991=test_gem_gem_runner I, [2024-05-24T07:45:14.259577 #209631] INFO -- : [651/885] 250999=test_data I, [2024-05-24T07:45:14.265201 #209631] INFO -- : [652/885] 250999=static_literals_test I, [2024-05-24T07:45:14.271787 #209631] INFO -- : [653/885] 250999=test_rdoc_method_attr I, [2024-05-24T07:45:14.272398 #209631] INFO -- : [654/885] 250991=test_enumerator I, [2024-05-24T07:45:14.276164 #209631] INFO -- : [655/885] 250991=test_rdoc_parser_changelog I, [2024-05-24T07:45:14.390608 #209631] INFO -- : [656/885] 250991=parameters_signature_test I, [2024-05-24T07:45:14.396627 #209631] INFO -- : [657/885] 250999=test_koi8 I, [2024-05-24T07:45:14.398449 #209631] INFO -- : [658/885] 250999=test_unicode I, [2024-05-24T07:45:14.402924 #209631] INFO -- : [659/885] 250999=test_rdoc_generator_pot I, [2024-05-24T07:45:14.408389 #209631] INFO -- : [660/885] 250999=test_path I, [2024-05-24T07:45:14.411756 #209631] INFO -- : [661/885] 250999=redundant_return_test I, [2024-05-24T07:45:14.416435 #209631] INFO -- : [662/885] 250999=test_case_mapping I, [2024-05-24T07:45:14.422432 #209631] INFO -- : [663/885] 250999=test_bn I, [2024-05-24T07:45:14.435930 #209631] INFO -- : [664/885] 250999=test_win32ole_param_event I, [2024-05-24T07:45:14.438270 #209631] INFO -- : [665/885] 250999=test_http I, [2024-05-24T07:45:14.464160 #209631] INFO -- : [666/885] 250990=test_addrinfo I, [2024-05-24T07:45:14.465661 #209631] INFO -- : [667/885] 250991=test_tree_spell_checker I, [2024-05-24T07:45:14.475197 #209631] INFO -- : [668/885] 250994=test_date_compat I, [2024-05-24T07:45:14.480487 #209631] INFO -- : [669/885] 250994=test_rdoc_markup_to_html I, [2024-05-24T07:45:14.492727 #209631] INFO -- : [670/885] 250990=test_bug-14834 I, [2024-05-24T07:45:14.554097 #209631] INFO -- : [671/885] 250991=test_terminfo I, [2024-05-24T07:45:14.554989 #209631] INFO -- : [672/885] 250991=test_compile_prism I, [2024-05-24T07:45:14.570120 #209631] INFO -- : [673/885] 250990=test_gem_resolver_lock_set I, [2024-05-24T07:45:14.572264 #209631] INFO -- : [674/885] 250994=test_not I, [2024-05-24T07:45:14.595033 #209631] INFO -- : [675/885] 250990=test_import I, [2024-05-24T07:45:14.595644 #209631] INFO -- : [676/885] 250994=test_rdoc_parser_markdown I, [2024-05-24T07:45:14.611585 #209631] INFO -- : [677/885] 250994=test_file_exhaustive I, [2024-05-24T07:45:14.615184 #209631] INFO -- : [678/885] 250996=test_gem_update_suggestion I, [2024-05-24T07:45:14.677457 #209631] INFO -- : [679/885] 250996=test_files_test I, [2024-05-24T07:45:14.678539 #209631] INFO -- : [680/885] 250996=test_logger I, [2024-05-24T07:45:14.693686 #209631] INFO -- : [681/885] 250996=test_win32ole_method I, [2024-05-24T07:45:14.696236 #209631] INFO -- : [682/885] 250996=test_delete I, [2024-05-24T07:45:14.700471 #209631] INFO -- : [683/885] 250996=test_class_name_check I, [2024-05-24T07:45:14.752603 #209631] INFO -- : [684/885] 250996=test_keyword I, [2024-05-24T07:45:14.769019 #209631] INFO -- : [685/885] 250993=test_fd_setsize I, [2024-05-24T07:45:14.772837 #209631] INFO -- : [686/885] 250993=test_continuation I, [2024-05-24T07:45:14.778917 #209631] INFO -- : [687/885] 250993=test_weakkeymap I, [2024-05-24T07:45:14.818197 #209631] INFO -- : [688/885] 250991=test_gem_commands_push_command I, [2024-05-24T07:45:14.851208 #209631] INFO -- : [689/885] 251001=test_numhash I, [2024-05-24T07:45:14.870379 #209631] INFO -- : [690/885] 251001=test_pkey_rsa I, [2024-05-24T07:45:14.947328 #209631] INFO -- : [691/885] 250993=test_gem_platform I, [2024-05-24T07:45:15.001430 #209631] INFO -- : [692/885] 250995=test_date_strptime I, [2024-05-24T07:45:15.006213 #209631] INFO -- : [693/885] 250993=test_gem_package_task I, [2024-05-24T07:45:15.011465 #209631] INFO -- : [694/885] 250993=test_placearg I, [2024-05-24T07:45:15.076637 #209631] INFO -- : [695/885] 251004=test_rdoc_markup_hard_break I, [2024-05-24T07:45:15.077753 #209631] INFO -- : [696/885] 251004=test_pointer I, [2024-05-24T07:45:15.120818 #209631] INFO -- : [697/885] 250997=test_big5 I, [2024-05-24T07:45:15.127195 #209631] INFO -- : [698/885] 250997=test_func I, [2024-05-24T07:45:15.155048 #209631] INFO -- : [699/885] 250993=test_ractor I, [2024-05-24T07:45:15.162644 #209631] INFO -- : [700/885] 250995=test_type I, [2024-05-24T07:45:15.167039 #209631] INFO -- : [701/885] 250995=test_signedness I, [2024-05-24T07:45:15.173193 #209631] INFO -- : [702/885] 251001=test_tsort I, [2024-05-24T07:45:15.192121 #209631] INFO -- : [703/885] 251001=test_rdoc_rd_block_parser I, [2024-05-24T07:45:15.219649 #209631] INFO -- : [704/885] 250996=test_timeout I, [2024-05-24T07:45:15.223534 #209631] INFO -- : [705/885] 251001=test_normalize I, [2024-05-24T07:45:15.226847 #209631] INFO -- : [706/885] 251001=test_ossl I, [2024-05-24T07:45:15.238626 #209631] INFO -- : [707/885] 250996=test_change_word I, [2024-05-24T07:45:15.247297 #209631] INFO -- : [708/885] 250996=compiler_test I, [2024-05-24T07:45:15.253537 #209631] INFO -- : [709/885] 250993=test_flip I, [2024-05-24T07:45:15.279310 #209631] INFO -- : [710/885] 250993=test_sleep I, [2024-05-24T07:45:15.300485 #209631] INFO -- : [711/885] 250996=test_date_arith I, [2024-05-24T07:45:15.309816 #209631] INFO -- : [712/885] 250996=test_ruby_lex I, [2024-05-24T07:45:15.329215 #209631] INFO -- : [713/885] 250992=test_object I, [2024-05-24T07:45:15.368622 #209631] INFO -- : [714/885] 250991=test_gem_local_remote_options I, [2024-05-24T07:45:15.385590 #209631] INFO -- : [715/885] 250998=test_gem_gemcutter_utilities I, [2024-05-24T07:45:15.391718 #209631] INFO -- : [716/885] 250991=test_basicinstructions I, [2024-05-24T07:45:15.445370 #209631] INFO -- : [717/885] 250991=test_gem_command_manager I, [2024-05-24T07:45:15.464661 #209631] INFO -- : [718/885] 250996=test_key_actor_emacs I, [2024-05-24T07:45:15.534271 #209631] INFO -- : [719/885] 250991=test_arithmetic_sequence I, [2024-05-24T07:45:15.547382 #209631] INFO -- : [720/885] 250991=test_object I, [2024-05-24T07:45:15.554571 #209631] INFO -- : [721/885] 250991=test_cgi_header I, [2024-05-24T07:45:15.563956 #209631] INFO -- : [722/885] 250991=heredoc_dedent_test I, [2024-05-24T07:45:15.569756 #209631] INFO -- : [723/885] 250991=version_test I, [2024-05-24T07:45:15.573050 #209631] INFO -- : [724/885] 250991=test_rdoc_ri_paths I, [2024-05-24T07:45:15.612774 #209631] INFO -- : [725/885] 250996=test_ensured I, [2024-05-24T07:45:15.622938 #209631] INFO -- : [726/885] 250991=library_symbols_test I, [2024-05-24T07:45:15.630362 #209631] INFO -- : [727/885] 250991=test_locale I, [2024-05-24T07:45:15.655080 #209631] INFO -- : [728/885] 250996=test_addr I, [2024-05-24T07:45:15.679002 #209631] INFO -- : [729/885] 250996=test_ts I, [2024-05-24T07:45:15.679481 #209631] INFO -- : [730/885] 250990=test_erb_command I, [2024-05-24T07:45:15.695213 #209631] INFO -- : [731/885] 250992=test_helper I, [2024-05-24T07:45:15.697877 #209631] INFO -- : [732/885] 250992=test_encoding I, [2024-05-24T07:45:15.701555 #209631] INFO -- : [733/885] 250991=test_gem_uri_formatter I, [2024-05-24T07:45:15.714674 #209631] INFO -- : [734/885] 250991=test_project_sanity I, [2024-05-24T07:45:15.717179 #209631] INFO -- : [735/885] 250990=test_range I, [2024-05-24T07:45:15.757525 #209631] INFO -- : [736/885] 250991=test_constant I, [2024-05-24T07:45:15.780655 #209631] INFO -- : [737/885] 250998=test_pty I, [2024-05-24T07:45:15.829152 #209631] INFO -- : [738/885] 251004=test_dup I, [2024-05-24T07:45:15.902986 #209631] INFO -- : [739/885] 250992=command_line_test I, [2024-05-24T07:45:15.981839 #209631] INFO -- : [740/885] 250992=test_udp I, [2024-05-24T07:45:15.983797 #209631] INFO -- : [741/885] 250992=test_data_error I, [2024-05-24T07:45:16.000848 #209631] INFO -- : [742/885] 251004=bom_test I, [2024-05-24T07:45:16.006390 #209631] INFO -- : [743/885] 251004=test_force_exit I, [2024-05-24T07:45:16.014796 #209631] INFO -- : [744/885] 251004=test_file I, [2024-05-24T07:45:16.035432 #209631] INFO -- : [745/885] 250992=test_ostruct I, [2024-05-24T07:45:16.055905 #209631] INFO -- : [746/885] 250996=unescape_test I, [2024-05-24T07:45:16.119021 #209631] INFO -- : [747/885] 250990=static_inspect_test I, [2024-05-24T07:45:16.149723 #209631] INFO -- : [748/885] 250990=errors_test I, [2024-05-24T07:45:16.208474 #209631] INFO -- : [749/885] 250992=test_gem_commands_check_command I, [2024-05-24T07:45:16.211517 #209631] INFO -- : [750/885] 250990=test_regexp I, [2024-05-24T07:45:16.227402 #209631] INFO -- : [751/885] 250998=test_rdoc_markup_document I, [2024-05-24T07:45:16.250667 #209631] INFO -- : [752/885] 250992=test_integer_comb I, [2024-05-24T07:45:16.335308 #209631] INFO -- : [753/885] 250998=test_tmpdir I, [2024-05-24T07:45:16.385404 #209631] INFO -- : [754/885] 250998=test_vm_dump I, [2024-05-24T07:45:16.386025 #209631] INFO -- : [755/885] 250998=test_random_formatter I, [2024-05-24T07:45:16.408423 #209631] INFO -- : [756/885] 250998=test_helper I, [2024-05-24T07:45:16.410279 #209631] INFO -- : [757/885] 250998=test_jaro_winkler I, [2024-05-24T07:45:16.424042 #209631] INFO -- : [758/885] 250998=test_ast I, [2024-05-24T07:45:16.445597 #209631] INFO -- : [759/885] 250997=test_gem_request_set_gem_dependency_api I, [2024-05-24T07:45:16.645744 #209631] INFO -- : [760/885] 250997=test_lambda I, [2024-05-24T07:45:16.692995 #209631] INFO -- : [761/885] 250997=test_webauthn_listener I, [2024-05-24T07:45:16.732863 #209631] INFO -- : [762/885] 250997=test_x509store I, [2024-05-24T07:45:16.918596 #209631] INFO -- : [763/885] 250988=test_rdoc_code_object I, [2024-05-24T07:45:16.950256 #209631] INFO -- : [764/885] 250996=test_update I, [2024-05-24T07:45:16.953329 #209631] INFO -- : [765/885] 250996=test_fips I, [2024-05-24T07:45:16.963144 #209631] INFO -- : [766/885] 250997=test_x509name I, [2024-05-24T07:45:16.968696 #209631] INFO -- : [767/885] 250997=test_transcode I, [2024-05-24T07:45:17.093313 #209631] INFO -- : [768/885] 250995=json_generator_test I, [2024-05-24T07:45:17.123392 #209631] INFO -- : [769/885] 250997=test_eval I, [2024-05-24T07:45:17.127106 #209631] INFO -- : [770/885] 250996=test_enumerable I, [2024-05-24T07:45:17.130938 #209631] INFO -- : [771/885] 250996=test_config I, [2024-05-24T07:45:17.173220 #209631] INFO -- : [772/885] 250995=test_gem_resolver_vendor_set I, [2024-05-24T07:45:17.185477 #209631] INFO -- : [773/885] 250988=test_gem_resolver_api_set I, [2024-05-24T07:45:17.199908 #209631] INFO -- : [774/885] 250995=test_gem_safe_marshal I, [2024-05-24T07:45:17.220945 #209631] INFO -- : [775/885] 250988=test_gem_commands_setup_command I, [2024-05-24T07:45:17.302361 #209631] INFO -- : [776/885] 250987=test_integer I, [2024-05-24T07:45:17.373286 #209631] INFO -- : [777/885] 250987=desugar_compiler_test I, [2024-05-24T07:45:17.392722 #209631] INFO -- : [778/885] 250997=test_dryrun I, [2024-05-24T07:45:17.406136 #209631] INFO -- : [779/885] 250997=test_rdoc_attr I, [2024-05-24T07:45:17.407452 #209631] INFO -- : [780/885] 251005=test_env I, [2024-05-24T07:45:17.415159 #209631] INFO -- : [781/885] 250997=test_gem_resolver_git_specification I, [2024-05-24T07:45:17.464657 #209631] INFO -- : [782/885] 250987=test_object_references I, [2024-05-24T07:45:17.472531 #209631] INFO -- : [783/885] 250987=test_usrmarshal I, [2024-05-24T07:45:17.591151 #209631] INFO -- : [784/885] 250997=test_nextafter I, [2024-05-24T07:45:17.596084 #209631] INFO -- : [785/885] 250988=test_capacity I, [2024-05-24T07:45:17.598603 #209631] INFO -- : [786/885] 250996=test_stat I, [2024-05-24T07:45:17.599708 #209631] INFO -- : [787/885] 250988=test_gem_request_set_lockfile_tokenizer I, [2024-05-24T07:45:17.601790 #209631] INFO -- : [788/885] 250996=test_have_func I, [2024-05-24T07:45:17.602253 #209631] INFO -- : [789/885] 250986=test_call I, [2024-05-24T07:45:17.649012 #209631] INFO -- : [790/885] 250988=test_https_proxy I, [2024-05-24T07:45:17.672840 #209631] INFO -- : [791/885] 250997=test_rubygems I, [2024-05-24T07:45:17.680488 #209631] INFO -- : [792/885] 250987=test_cgi_modruby I, [2024-05-24T07:45:17.683545 #209631] INFO -- : [793/885] 250987=test_integer I, [2024-05-24T07:45:17.696334 #209631] INFO -- : [794/885] 250988=test_super I, [2024-05-24T07:45:17.715208 #209631] INFO -- : [795/885] 250986=test_rubyoptions I, [2024-05-24T07:45:17.819336 #209631] INFO -- : [796/885] 250995=test_singleton_function I, [2024-05-24T07:45:17.823548 #209631] INFO -- : [797/885] 250995=test_ancdata I, [2024-05-24T07:45:17.828784 #209631] INFO -- : [798/885] 250995=test_rb_str_dup I, [2024-05-24T07:45:17.841758 #209631] INFO -- : [799/885] 250995=test_reline_key I, [2024-05-24T07:45:17.850986 #209631] INFO -- : [800/885] 250991=test_marshal I, [2024-05-24T07:45:17.864588 #209631] INFO -- : [801/885] 250997=test_unicode_normalize I, [2024-05-24T07:45:17.899532 #209631] INFO -- : [802/885] 250995=test_weakref I, [2024-05-24T07:45:18.064949 #209631] INFO -- : [803/885] 250995=test_nonblock I, [2024-05-24T07:45:18.078263 #209631] INFO -- : [804/885] 250995=test_alias I, [2024-05-24T07:45:18.244912 #209631] INFO -- : [805/885] 250988=test_timeout I, [2024-05-24T07:45:18.250951 #209631] INFO -- : [806/885] 250995=test_ractor I, [2024-05-24T07:45:18.363420 #209631] INFO -- : [807/885] 251000=test_my_integer I, [2024-05-24T07:45:18.367469 #209631] INFO -- : [808/885] 251000=test_thread I, [2024-05-24T07:45:18.628056 #209631] INFO -- : [809/885] 250991=json_ext_parser_test I, [2024-05-24T07:45:18.632621 #209631] INFO -- : [810/885] 250991=test_debugger_integration I, [2024-05-24T07:45:18.649329 #209631] INFO -- : [811/885] 250991=test_rendering I, [2024-05-24T07:45:18.684737 #209631] INFO -- : [812/885] 250991=test_ssl I, [2024-05-24T07:45:18.708283 #209631] INFO -- : [813/885] 250995=test_ractor I, [2024-05-24T07:45:18.723988 #209631] INFO -- : [814/885] 250995=test_gem_commands_open_command I, [2024-05-24T07:45:18.845898 #209631] INFO -- : [815/885] 250995=test_dns I, [2024-05-24T07:45:19.060630 #209631] INFO -- : [816/885] 250989=test_gem_source_lock I, [2024-05-24T07:45:19.092579 #209631] INFO -- : [817/885] 250988=test_gem I, [2024-05-24T07:45:19.104826 #209631] INFO -- : [818/885] 250989=parse_stream_test I, [2024-05-24T07:45:19.111537 #209631] INFO -- : [819/885] 250989=test_registry I, [2024-05-24T07:45:19.113489 #209631] INFO -- : [820/885] 250989=test_parser I, [2024-05-24T07:45:19.132669 #209631] INFO -- : [821/885] 250989=test_cgi_core I, [2024-05-24T07:45:19.153341 #209631] INFO -- : [822/885] 250989=test_ipaddr I, [2024-05-24T07:45:19.180347 #209631] INFO -- : [823/885] 250989=test_history I, [2024-05-24T07:45:19.182380 #209631] INFO -- : [824/885] 250991=test_mixed_unicode_escapes I, [2024-05-24T07:45:19.192304 #209631] INFO -- : [825/885] 250991=test_rdoc_markup_to_ansi I, [2024-05-24T07:45:19.204485 #209631] INFO -- : [826/885] 250996=test_win32ole_variant I, [2024-05-24T07:45:19.208944 #209631] INFO -- : [827/885] 250996=test_gem_resolver_api_specification I, [2024-05-24T07:45:19.240787 #209631] INFO -- : [828/885] 250991=test_merge_keys I, [2024-05-24T07:45:19.246139 #209631] INFO -- : [829/885] 250989=test_rdoc_extend I, [2024-05-24T07:45:19.250438 #209631] INFO -- : [830/885] 250991=test_threadgroup I, [2024-05-24T07:45:19.273099 #209631] INFO -- : [831/885] 250992=test_gem_specification I, [2024-05-24T07:45:19.275797 #209631] INFO -- : [832/885] 250996=test_enum I, [2024-05-24T07:45:19.283444 #209631] INFO -- : [833/885] 250995=test_have_macro I, [2024-05-24T07:45:19.293265 #209631] INFO -- : [834/885] 250989=test_complex2 I, [2024-05-24T07:45:19.305710 #209631] INFO -- : [835/885] 250989=test_resolve_symbol I, [2024-05-24T07:45:19.385355 #209631] INFO -- : [836/885] 250989=test_gem_package I, [2024-05-24T07:45:19.669342 #209631] INFO -- : [837/885] 250995=test_rdoc_generator_json_index I, [2024-05-24T07:45:19.714398 #209631] INFO -- : [838/885] 250995=test_time_tz I, [2024-05-24T07:45:19.766197 #209631] INFO -- : [839/885] 250995=test_win32ole_event I, [2024-05-24T07:45:19.771778 #209631] INFO -- : [840/885] 250995=ractor_test I, [2024-05-24T07:45:19.852856 #209631] INFO -- : [841/885] 250995=test_trace I, [2024-05-24T07:45:19.870542 #209631] INFO -- : [842/885] 250995=test_win32ole_variable I, [2024-05-24T07:45:19.871194 #209631] INFO -- : [843/885] 250995=test_arity I, [2024-05-24T07:45:19.879669 #209631] INFO -- : [844/885] 250995=test_stringio I, [2024-05-24T07:45:19.972940 #209631] INFO -- : [845/885] 250987=test_io_wait_uncommon I, [2024-05-24T07:45:19.979017 #209631] INFO -- : [846/885] 250987=test_bignum I, [2024-05-24T07:45:20.005491 #209631] INFO -- : [847/885] 251005=test_rdoc_class_module I, [2024-05-24T07:45:20.009363 #209631] INFO -- : [848/885] 250989=test_gem_ci_detector I, [2024-05-24T07:45:20.018443 #209631] INFO -- : [849/885] 250989=test_enc_associate I, [2024-05-24T07:45:20.029080 #209631] INFO -- : [850/885] 250995=test_lazy_enumerator I, [2024-05-24T07:45:20.181814 #209631] INFO -- : [851/885] 250997=test_unix I, [2024-05-24T07:45:20.215790 #209631] INFO -- : [852/885] 250997=test_coder I, [2024-05-24T07:45:20.230682 #209631] INFO -- : [853/885] 250997=test_symbol I, [2024-05-24T07:45:20.256514 #209631] INFO -- : [854/885] 250991=test_gem_commands_pristine_command I, [2024-05-24T07:45:20.287241 #209631] INFO -- : [855/885] 250993=test_context I, [2024-05-24T07:45:20.362592 #209631] INFO -- : [856/885] 250996=test_nofree I, [2024-05-24T07:45:20.365828 #209631] INFO -- : [857/885] 250996=ruby_api_test I, [2024-05-24T07:45:20.383113 #209631] INFO -- : [858/885] 250993=test_find_executable I, [2024-05-24T07:45:20.386577 #209631] INFO -- : [859/885] 250993=test_function_entry I, [2024-05-24T07:45:20.390367 #209631] INFO -- : [860/885] 250993=test_gem_resolver_requirement_list I, [2024-05-24T07:45:20.394723 #209631] INFO -- : [861/885] 250993=test_arith_seq_beg_len_step I, [2024-05-24T07:45:20.413612 #209631] INFO -- : [862/885] 250989=test_pkcs7 I, [2024-05-24T07:45:20.458468 #209631] INFO -- : [863/885] 250993=test_mailto I, [2024-05-24T07:45:20.469467 #209631] INFO -- : [864/885] 250993=test_coderange I, [2024-05-24T07:45:20.474207 #209631] INFO -- : [865/885] 250993=location_test I, [2024-05-24T07:45:20.504629 #209631] INFO -- : [866/885] 250995=test_symbol I, [2024-05-24T07:45:20.506461 #209631] INFO -- : [867/885] 250995=test_http_request I, [2024-05-24T07:45:20.519356 #209631] INFO -- : [868/885] 251005=json_generic_object_test I, [2024-05-24T07:45:20.527806 #209631] INFO -- : [869/885] 251005=test_gem_source_fetch_problem I, [2024-05-24T07:45:20.548109 #209631] INFO -- : [870/885] 250996=test_rdoc_generator_darkfish I, [2024-05-24T07:45:20.569870 #209631] INFO -- : [871/885] 250993=test_rdoc_comment I, [2024-05-24T07:45:20.575481 #209631] INFO -- : [872/885] 250995=test_resize I, [2024-05-24T07:45:20.583793 #209631] INFO -- : [873/885] 250995=test_error_highlight I, [2024-05-24T07:45:20.608582 #209631] INFO -- : [874/885] 250993=test_cgi_multipart I, [2024-05-24T07:45:20.613440 #209631] INFO -- : [875/885] 250989=test_word I, [2024-05-24T07:45:20.614646 #209631] INFO -- : [876/885] 250989=test_gem_commands_cleanup_command I, [2024-05-24T07:45:20.659845 #209631] INFO -- : [877/885] 251005=test_numeric I, [2024-05-24T07:45:20.679376 #209631] INFO -- : [878/885] 251005=test_member I, [2024-05-24T07:45:20.684989 #209631] INFO -- : [879/885] 251005=test_ractor_compatibility I, [2024-05-24T07:45:20.753748 #209631] INFO -- : [880/885] 250993=test_dir I, [2024-05-24T07:45:20.930517 #209631] INFO -- : [881/885] 250996=format_errors_test I, [2024-05-24T07:45:20.938006 #209631] INFO -- : [882/885] 250996=test_gem_console_ui I, [2024-05-24T07:45:20.946115 #209631] INFO -- : [883/885] 250996=test_date_ractor I, [2024-05-24T07:45:21.018940 #209631] INFO -- : [884/885] 250994=test_autoconf I, [2024-05-24T07:45:21.022656 #209631] INFO -- : [885/885] 250994=test_eval I, [2024-05-24T07:45:39.954388 #209631] INFO -- : Finished tests in 38.619004s, 683.9638 tests/s, 242199.2050 assertions/s. I, [2024-05-24T07:45:39.955184 #209631] INFO -- : 26414 tests, 9353492 assertions, 0 failures, 0 errors, 306 skips I, [2024-05-24T07:45:39.955213 #209631] INFO -- : I, [2024-05-24T07:45:39.955219 #209631] INFO -- : ruby -v: ruby 3.4.0dev (2024-05-24T01:53:35Z master acdd19facc) [x86_64-linux] I, [2024-05-24T07:45:39.957377 #209631] INFO -- : $$$[end] "make yes-test-all TESTOPTS='--stderr-on-failure' TESTS='-j20'" exit with 0. I, [2024-05-24T07:45:39.957506 #209631] INFO -- : $$$[beg] make yes-test-rubyspec MSPECOPT='--error-output stderr --debug -j' TESTS='-j20' I, [2024-05-24T07:45:40.047647 #209631] INFO -- : BASERUBY = /usr/bin/ruby --disable=gems I, [2024-05-24T07:45:40.047683 #209631] INFO -- : CC = gcc I, [2024-05-24T07:45:40.047715 #209631] INFO -- : LD = ld I, [2024-05-24T07:45:40.047733 #209631] INFO -- : LDSHARED = gcc -shared I, [2024-05-24T07:45:40.047739 #209631] INFO -- : CFLAGS = -O3 -fno-fast-math -ggdb3 -Wall -Wextra -Wdeprecated-declarations -Wdiv-by-zero -Wduplicated-cond -Wimplicit-function-declaration -Wimplicit-int -Wpointer-arith -Wwrite-strings -Wold-style-definition -Wimplicit-fallthrough=0 -Wmissing-noreturn -Wno-cast-function-type -Wno-constant-logical-operand -Wno-long-long -Wno-missing-field-initializers -Wno-overlength-strings -Wno-packed-bitfield-compat -Wno-parentheses-equality -Wno-self-assign -Wno-tautological-compare -Wno-unused-parameter -Wno-unused-value -Wsuggest-attribute=format -Wsuggest-attribute=noreturn -Wunused-variable -Wmisleading-indentation -Wundef -fPIC I, [2024-05-24T07:45:40.047743 #209631] INFO -- : XCFLAGS = -U_FORTIFY_SOURCE -D_FORTIFY_SOURCE=2 -fstack-protector-strong -fno-strict-overflow -fvisibility=hidden -fexcess-precision=standard -DRUBY_EXPORT -I. -I.ext/include/x86_64-linux -I/tmp/ruby/src/trunk/include -I/tmp/ruby/src/trunk -I/tmp/ruby/src/trunk/prism -I/tmp/ruby/src/trunk/enc/unicode/15.0.0 I, [2024-05-24T07:45:40.047747 #209631] INFO -- : CPPFLAGS = I, [2024-05-24T07:45:40.047751 #209631] INFO -- : DLDFLAGS = -Wl,--compress-debug-sections=zlib -Wl,-soname,libruby.so.3.4 -fstack-protector-strong I, [2024-05-24T07:45:40.047755 #209631] INFO -- : SOLIBS = -lz -lrt -lrt -lgmp -ldl -lcrypt -lm -lpthread I, [2024-05-24T07:45:40.047759 #209631] INFO -- : LANG = en_US.UTF-8 I, [2024-05-24T07:45:40.047763 #209631] INFO -- : LC_ALL = I, [2024-05-24T07:45:40.047766 #209631] INFO -- : LC_CTYPE = I, [2024-05-24T07:45:40.047769 #209631] INFO -- : MFLAGS = I, [2024-05-24T07:45:40.047773 #209631] INFO -- : RUSTC = no I, [2024-05-24T07:45:40.047778 #209631] INFO -- : YJIT_RUSTC_ARGS = --crate-name=yjit --crate-type=staticlib --edition=2021 -g -C lto=thin -C opt-level=3 -C overflow-checks=on '--out-dir=/tmp/ruby/build/trunk/yjit/target/release/' /tmp/ruby/src/trunk/yjit/src/lib.rs I, [2024-05-24T07:45:40.048258 #209631] INFO -- : gcc (Ubuntu 11.4.0-1ubuntu1~22.04) 11.4.0 I, [2024-05-24T07:45:40.048277 #209631] INFO -- : Copyright (C) 2021 Free Software Foundation, Inc. I, [2024-05-24T07:45:40.048283 #209631] INFO -- : This is free software; see the source for copying conditions. There is NO I, [2024-05-24T07:45:40.048287 #209631] INFO -- : warranty; not even for MERCHANTABILITY or FITNESS FOR A PARTICULAR PURPOSE. I, [2024-05-24T07:45:40.048291 #209631] INFO -- : I, [2024-05-24T07:45:40.050091 #209631] INFO -- : generating enc.mk I, [2024-05-24T07:45:40.167104 #209631] INFO -- : generating encdb.h I, [2024-05-24T07:45:40.190877 #209631] INFO -- : encdb.h unchanged I, [2024-05-24T07:45:40.191824 #209631] INFO -- : making enc I, [2024-05-24T07:45:40.208935 #209631] INFO -- : make[1]: Entering directory '/tmp/ruby/build/trunk' I, [2024-05-24T07:45:40.208955 #209631] INFO -- : make[1]: Nothing to be done for 'enc'. I, [2024-05-24T07:45:40.208960 #209631] INFO -- : make[1]: Leaving directory '/tmp/ruby/build/trunk' I, [2024-05-24T07:45:40.209674 #209631] INFO -- : making srcs under enc I, [2024-05-24T07:45:40.239815 #209631] INFO -- : make[1]: Entering directory '/tmp/ruby/build/trunk' I, [2024-05-24T07:45:40.239835 #209631] INFO -- : make[1]: Nothing to be done for 'srcs'. I, [2024-05-24T07:45:40.239849 #209631] INFO -- : make[1]: Leaving directory '/tmp/ruby/build/trunk' I, [2024-05-24T07:45:40.240808 #209631] INFO -- : generating transdb.h I, [2024-05-24T07:45:40.338396 #209631] INFO -- : transdb.h unchanged I, [2024-05-24T07:45:40.339881 #209631] INFO -- : making trans I, [2024-05-24T07:45:40.374677 #209631] INFO -- : make[1]: Entering directory '/tmp/ruby/build/trunk' I, [2024-05-24T07:45:40.374698 #209631] INFO -- : make[1]: Nothing to be done for 'trans'. I, [2024-05-24T07:45:40.374704 #209631] INFO -- : make[1]: Leaving directory '/tmp/ruby/build/trunk' I, [2024-05-24T07:45:40.375300 #209631] INFO -- : making encs I, [2024-05-24T07:45:40.412414 #209631] INFO -- : make[1]: Entering directory '/tmp/ruby/build/trunk' I, [2024-05-24T07:45:40.412435 #209631] INFO -- : make[1]: Nothing to be done for 'encs'. I, [2024-05-24T07:45:40.412440 #209631] INFO -- : make[1]: Leaving directory '/tmp/ruby/build/trunk' I, [2024-05-24T07:45:40.414237 #209631] INFO -- : generating makefiles ext/configure-ext.mk I, [2024-05-24T07:45:40.441056 #209631] INFO -- : ext/configure-ext.mk updated I, [2024-05-24T07:45:40.443545 #209631] INFO -- : make[1]: Entering directory '/tmp/ruby/build/trunk' I, [2024-05-24T07:45:41.831580 #209631] INFO -- : make[1]: Leaving directory '/tmp/ruby/build/trunk' I, [2024-05-24T07:45:41.832368 #209631] INFO -- : generating makefile exts.mk I, [2024-05-24T07:45:41.868898 #209631] INFO -- : exts.mk unchanged I, [2024-05-24T07:45:41.874422 #209631] INFO -- : make[1]: Entering directory '/tmp/ruby/build/trunk' I, [2024-05-24T07:45:42.187697 #209631] INFO -- : make[2]: Entering directory '/tmp/ruby/build/trunk/ext/coverage' I, [2024-05-24T07:45:42.192431 #209631] INFO -- : make[2]: Leaving directory '/tmp/ruby/build/trunk/ext/coverage' I, [2024-05-24T07:45:42.198906 #209631] INFO -- : make[2]: Entering directory '/tmp/ruby/build/trunk/ext/date' I, [2024-05-24T07:45:42.203918 #209631] INFO -- : make[2]: Leaving directory '/tmp/ruby/build/trunk/ext/date' I, [2024-05-24T07:45:42.207685 #209631] INFO -- : make[2]: Entering directory '/tmp/ruby/build/trunk/ext/digest' I, [2024-05-24T07:45:42.216946 #209631] INFO -- : make[2]: Leaving directory '/tmp/ruby/build/trunk/ext/digest' I, [2024-05-24T07:45:42.243840 #209631] INFO -- : make[2]: Entering directory '/tmp/ruby/build/trunk/ext/digest/sha2' I, [2024-05-24T07:45:42.248637 #209631] INFO -- : make[2]: Leaving directory '/tmp/ruby/build/trunk/ext/digest/sha2' I, [2024-05-24T07:45:42.269387 #209631] INFO -- : make[2]: Entering directory '/tmp/ruby/build/trunk/ext/fiddle' I, [2024-05-24T07:45:42.278731 #209631] INFO -- : make[2]: Leaving directory '/tmp/ruby/build/trunk/ext/fiddle' I, [2024-05-24T07:45:42.283617 #209631] INFO -- : make[2]: Entering directory '/tmp/ruby/build/trunk/ext/io/console' I, [2024-05-24T07:45:42.287817 #209631] INFO -- : make[2]: Leaving directory '/tmp/ruby/build/trunk/ext/io/console' I, [2024-05-24T07:45:42.298463 #209631] INFO -- : make[2]: Entering directory '/tmp/ruby/build/trunk/ext/json' I, [2024-05-24T07:45:42.307828 #209631] INFO -- : make[2]: Leaving directory '/tmp/ruby/build/trunk/ext/json' I, [2024-05-24T07:45:42.321715 #209631] INFO -- : make[2]: Entering directory '/tmp/ruby/build/trunk/ext/monitor' I, [2024-05-24T07:45:42.325666 #209631] INFO -- : make[2]: Leaving directory '/tmp/ruby/build/trunk/ext/monitor' I, [2024-05-24T07:45:42.332539 #209631] INFO -- : make[2]: Entering directory '/tmp/ruby/build/trunk/ext/objspace' I, [2024-05-24T07:45:42.337892 #209631] INFO -- : make[2]: Leaving directory '/tmp/ruby/build/trunk/ext/objspace' I, [2024-05-24T07:45:42.358201 #209631] INFO -- : make[2]: Entering directory '/tmp/ruby/build/trunk/ext/openssl' I, [2024-05-24T07:45:42.374674 #209631] INFO -- : make[2]: Leaving directory '/tmp/ruby/build/trunk/ext/openssl' I, [2024-05-24T07:45:42.377664 #209631] INFO -- : make[2]: Entering directory '/tmp/ruby/build/trunk/ext/pathname' I, [2024-05-24T07:45:42.380195 #209631] INFO -- : make[2]: Leaving directory '/tmp/ruby/build/trunk/ext/pathname' I, [2024-05-24T07:45:42.384478 #209631] INFO -- : make[2]: Entering directory '/tmp/ruby/build/trunk/ext/psych' I, [2024-05-24T07:45:42.400788 #209631] INFO -- : make[2]: Leaving directory '/tmp/ruby/build/trunk/ext/psych' I, [2024-05-24T07:45:42.405271 #209631] INFO -- : make[2]: Entering directory '/tmp/ruby/build/trunk/ext/pty' I, [2024-05-24T07:45:42.408089 #209631] INFO -- : make[2]: Leaving directory '/tmp/ruby/build/trunk/ext/pty' I, [2024-05-24T07:45:42.423028 #209631] INFO -- : make[2]: Entering directory '/tmp/ruby/build/trunk/ext/ripper' I, [2024-05-24T07:45:42.429381 #209631] INFO -- : make[2]: Leaving directory '/tmp/ruby/build/trunk/ext/ripper' I, [2024-05-24T07:45:42.431438 #209631] INFO -- : make[2]: Entering directory '/tmp/ruby/build/trunk/ext/rubyvm' I, [2024-05-24T07:45:42.434287 #209631] INFO -- : make[2]: Leaving directory '/tmp/ruby/build/trunk/ext/rubyvm' I, [2024-05-24T07:45:42.445162 #209631] INFO -- : make[2]: Entering directory '/tmp/ruby/build/trunk/ext/socket' I, [2024-05-24T07:45:42.454460 #209631] INFO -- : make[2]: Leaving directory '/tmp/ruby/build/trunk/ext/socket' I, [2024-05-24T07:45:42.472433 #209631] INFO -- : make[2]: Entering directory '/tmp/ruby/build/trunk/.bundle/gems/bigdecimal-3.1.8/ext/bigdecimal' I, [2024-05-24T07:45:42.499316 #209631] INFO -- : make[2]: Leaving directory '/tmp/ruby/build/trunk/.bundle/gems/bigdecimal-3.1.8/ext/bigdecimal' I, [2024-05-24T07:45:42.501240 #209631] INFO -- : make[2]: Entering directory '/tmp/ruby/build/trunk/.bundle/gems/debug-1.9.2/ext/debug' I, [2024-05-24T07:45:42.524689 #209631] INFO -- : make[2]: Leaving directory '/tmp/ruby/build/trunk/.bundle/gems/debug-1.9.2/ext/debug' I, [2024-05-24T07:45:42.526566 #209631] INFO -- : make[2]: Entering directory '/tmp/ruby/build/trunk/.bundle/gems/nkf-0.2.0/ext/nkf' I, [2024-05-24T07:45:42.556255 #209631] INFO -- : make[2]: Leaving directory '/tmp/ruby/build/trunk/.bundle/gems/nkf-0.2.0/ext/nkf' I, [2024-05-24T07:45:42.558365 #209631] INFO -- : make[2]: Entering directory '/tmp/ruby/build/trunk/.bundle/gems/racc-1.7.3/ext/racc/cparse' I, [2024-05-24T07:45:42.585499 #209631] INFO -- : make[2]: Leaving directory '/tmp/ruby/build/trunk/.bundle/gems/racc-1.7.3/ext/racc/cparse' I, [2024-05-24T07:45:42.587562 #209631] INFO -- : make[2]: Entering directory '/tmp/ruby/build/trunk/.bundle/gems/racc-1.8.0/ext/racc/cparse' I, [2024-05-24T07:45:42.608598 #209631] INFO -- : make[2]: Leaving directory '/tmp/ruby/build/trunk/.bundle/gems/racc-1.8.0/ext/racc/cparse' I, [2024-05-24T07:45:42.610981 #209631] INFO -- : make[2]: Entering directory '/tmp/ruby/build/trunk/.bundle/gems/rbs-3.4.4/ext/rbs_extension' I, [2024-05-24T07:45:42.632811 #209631] INFO -- : make[2]: Leaving directory '/tmp/ruby/build/trunk/.bundle/gems/rbs-3.4.4/ext/rbs_extension' I, [2024-05-24T07:45:42.634793 #209631] INFO -- : make[2]: Entering directory '/tmp/ruby/build/trunk/.bundle/gems/syslog-0.1.2/ext/syslog' I, [2024-05-24T07:45:42.657039 #209631] INFO -- : make[2]: Leaving directory '/tmp/ruby/build/trunk/.bundle/gems/syslog-0.1.2/ext/syslog' I, [2024-05-24T07:45:42.680465 #209631] INFO -- : make[2]: Entering directory '/tmp/ruby/build/trunk' I, [2024-05-24T07:45:42.745016 #209631] INFO -- : make[2]: 'ruby' is up to date. I, [2024-05-24T07:45:42.745053 #209631] INFO -- : make[2]: Leaving directory '/tmp/ruby/build/trunk' I, [2024-05-24T07:45:42.745489 #209631] INFO -- : make[1]: Leaving directory '/tmp/ruby/build/trunk' I, [2024-05-24T07:45:42.749246 #209631] INFO -- : make[1]: Entering directory '/tmp/ruby/build/trunk' I, [2024-05-24T07:45:42.749267 #209631] INFO -- : make[1]: Nothing to be done for 'note'. I, [2024-05-24T07:45:42.749272 #209631] INFO -- : make[1]: Leaving directory '/tmp/ruby/build/trunk' E, [2024-05-24T07:45:42.805952 #209631] ERROR -- : $ /tmp/ruby/build/trunk/miniruby -I/tmp/ruby/src/trunk/lib /tmp/ruby/src/trunk/tool/runruby.rb --archdir=/tmp/ruby/build/trunk --extout=.ext -- /tmp/ruby/src/trunk/spec/mspec/bin/mspec-run -B /tmp/ruby/src/trunk/spec/default.mspec --error-output stderr --debug -fy -o /tmp/rubytest.pwkdms/1-mspec-multi-0 E, [2024-05-24T07:45:42.806205 #209631] ERROR -- : $ /tmp/ruby/build/trunk/miniruby -I/tmp/ruby/src/trunk/lib /tmp/ruby/src/trunk/tool/runruby.rb --archdir=/tmp/ruby/build/trunk --extout=.ext -- /tmp/ruby/src/trunk/spec/mspec/bin/mspec-run -B /tmp/ruby/src/trunk/spec/default.mspec --error-output stderr --debug -fy -o /tmp/rubytest.pwkdms/2-mspec-multi-1 E, [2024-05-24T07:45:42.806505 #209631] ERROR -- : $ /tmp/ruby/build/trunk/miniruby -I/tmp/ruby/src/trunk/lib /tmp/ruby/src/trunk/tool/runruby.rb --archdir=/tmp/ruby/build/trunk --extout=.ext -- /tmp/ruby/src/trunk/spec/mspec/bin/mspec-run -B /tmp/ruby/src/trunk/spec/default.mspec --error-output stderr --debug -fy -o /tmp/rubytest.pwkdms/3-mspec-multi-2 E, [2024-05-24T07:45:42.806771 #209631] ERROR -- : $ /tmp/ruby/build/trunk/miniruby -I/tmp/ruby/src/trunk/lib /tmp/ruby/src/trunk/tool/runruby.rb --archdir=/tmp/ruby/build/trunk --extout=.ext -- /tmp/ruby/src/trunk/spec/mspec/bin/mspec-run -B /tmp/ruby/src/trunk/spec/default.mspec --error-output stderr --debug -fy -o /tmp/rubytest.pwkdms/4-mspec-multi-3 E, [2024-05-24T07:45:42.807029 #209631] ERROR -- : $ /tmp/ruby/build/trunk/miniruby -I/tmp/ruby/src/trunk/lib /tmp/ruby/src/trunk/tool/runruby.rb --archdir=/tmp/ruby/build/trunk --extout=.ext -- /tmp/ruby/src/trunk/spec/mspec/bin/mspec-run -B /tmp/ruby/src/trunk/spec/default.mspec --error-output stderr --debug -fy -o /tmp/rubytest.pwkdms/5-mspec-multi-4 E, [2024-05-24T07:45:42.807109 #209631] ERROR -- : $ /tmp/ruby/build/trunk/miniruby -I/tmp/ruby/src/trunk/lib /tmp/ruby/src/trunk/tool/runruby.rb --archdir=/tmp/ruby/build/trunk --extout=.ext -- /tmp/ruby/src/trunk/spec/mspec/bin/mspec-run -B /tmp/ruby/src/trunk/spec/default.mspec --error-output stderr --debug -fy -o /tmp/rubytest.pwkdms/6-mspec-multi-5 E, [2024-05-24T07:45:42.807418 #209631] ERROR -- : $ /tmp/ruby/build/trunk/miniruby -I/tmp/ruby/src/trunk/lib /tmp/ruby/src/trunk/tool/runruby.rb --archdir=/tmp/ruby/build/trunk --extout=.ext -- /tmp/ruby/src/trunk/spec/mspec/bin/mspec-run -B /tmp/ruby/src/trunk/spec/default.mspec --error-output stderr --debug -fy -o /tmp/rubytest.pwkdms/7-mspec-multi-6 E, [2024-05-24T07:45:42.807543 #209631] ERROR -- : $ /tmp/ruby/build/trunk/miniruby -I/tmp/ruby/src/trunk/lib /tmp/ruby/src/trunk/tool/runruby.rb --archdir=/tmp/ruby/build/trunk --extout=.ext -- /tmp/ruby/src/trunk/spec/mspec/bin/mspec-run -B /tmp/ruby/src/trunk/spec/default.mspec --error-output stderr --debug -fy -o /tmp/rubytest.pwkdms/8-mspec-multi-7 E, [2024-05-24T07:45:42.807743 #209631] ERROR -- : $ /tmp/ruby/build/trunk/miniruby -I/tmp/ruby/src/trunk/lib /tmp/ruby/src/trunk/tool/runruby.rb --archdir=/tmp/ruby/build/trunk --extout=.ext -- /tmp/ruby/src/trunk/spec/mspec/bin/mspec-run -B /tmp/ruby/src/trunk/spec/default.mspec --error-output stderr --debug -fy -o /tmp/rubytest.pwkdms/9-mspec-multi-8 E, [2024-05-24T07:45:42.807969 #209631] ERROR -- : $ /tmp/ruby/build/trunk/miniruby -I/tmp/ruby/src/trunk/lib /tmp/ruby/src/trunk/tool/runruby.rb --archdir=/tmp/ruby/build/trunk --extout=.ext -- /tmp/ruby/src/trunk/spec/mspec/bin/mspec-run -B /tmp/ruby/src/trunk/spec/default.mspec --error-output stderr --debug -fy -o /tmp/rubytest.pwkdms/10-mspec-multi-9 E, [2024-05-24T07:45:42.808296 #209631] ERROR -- : $ /tmp/ruby/build/trunk/miniruby -I/tmp/ruby/src/trunk/lib /tmp/ruby/src/trunk/tool/runruby.rb --archdir=/tmp/ruby/build/trunk --extout=.ext -- /tmp/ruby/src/trunk/spec/mspec/bin/mspec-run -B /tmp/ruby/src/trunk/spec/default.mspec --error-output stderr --debug -fy -o /tmp/rubytest.pwkdms/11-mspec-multi-10 E, [2024-05-24T07:45:42.808477 #209631] ERROR -- : $ /tmp/ruby/build/trunk/miniruby -I/tmp/ruby/src/trunk/lib /tmp/ruby/src/trunk/tool/runruby.rb --archdir=/tmp/ruby/build/trunk --extout=.ext -- /tmp/ruby/src/trunk/spec/mspec/bin/mspec-run -B /tmp/ruby/src/trunk/spec/default.mspec --error-output stderr --debug -fy -o /tmp/rubytest.pwkdms/12-mspec-multi-11 E, [2024-05-24T07:45:42.808690 #209631] ERROR -- : $ /tmp/ruby/build/trunk/miniruby -I/tmp/ruby/src/trunk/lib /tmp/ruby/src/trunk/tool/runruby.rb --archdir=/tmp/ruby/build/trunk --extout=.ext -- /tmp/ruby/src/trunk/spec/mspec/bin/mspec-run -B /tmp/ruby/src/trunk/spec/default.mspec --error-output stderr --debug -fy -o /tmp/rubytest.pwkdms/13-mspec-multi-12 E, [2024-05-24T07:45:42.808860 #209631] ERROR -- : $ /tmp/ruby/build/trunk/miniruby -I/tmp/ruby/src/trunk/lib /tmp/ruby/src/trunk/tool/runruby.rb --archdir=/tmp/ruby/build/trunk --extout=.ext -- /tmp/ruby/src/trunk/spec/mspec/bin/mspec-run -B /tmp/ruby/src/trunk/spec/default.mspec --error-output stderr --debug -fy -o /tmp/rubytest.pwkdms/14-mspec-multi-13 E, [2024-05-24T07:45:42.809030 #209631] ERROR -- : $ /tmp/ruby/build/trunk/miniruby -I/tmp/ruby/src/trunk/lib /tmp/ruby/src/trunk/tool/runruby.rb --archdir=/tmp/ruby/build/trunk --extout=.ext -- /tmp/ruby/src/trunk/spec/mspec/bin/mspec-run -B /tmp/ruby/src/trunk/spec/default.mspec --error-output stderr --debug -fy -o /tmp/rubytest.pwkdms/15-mspec-multi-14 E, [2024-05-24T07:45:42.809359 #209631] ERROR -- : $ /tmp/ruby/build/trunk/miniruby -I/tmp/ruby/src/trunk/lib /tmp/ruby/src/trunk/tool/runruby.rb --archdir=/tmp/ruby/build/trunk --extout=.ext -- /tmp/ruby/src/trunk/spec/mspec/bin/mspec-run -B /tmp/ruby/src/trunk/spec/default.mspec --error-output stderr --debug -fy -o /tmp/rubytest.pwkdms/16-mspec-multi-15 E, [2024-05-24T07:45:42.809625 #209631] ERROR -- : $ /tmp/ruby/build/trunk/miniruby -I/tmp/ruby/src/trunk/lib /tmp/ruby/src/trunk/tool/runruby.rb --archdir=/tmp/ruby/build/trunk --extout=.ext -- /tmp/ruby/src/trunk/spec/mspec/bin/mspec-run -B /tmp/ruby/src/trunk/spec/default.mspec --error-output stderr --debug -fy -o /tmp/rubytest.pwkdms/17-mspec-multi-16 E, [2024-05-24T07:45:42.809881 #209631] ERROR -- : $ /tmp/ruby/build/trunk/miniruby -I/tmp/ruby/src/trunk/lib /tmp/ruby/src/trunk/tool/runruby.rb --archdir=/tmp/ruby/build/trunk --extout=.ext -- /tmp/ruby/src/trunk/spec/mspec/bin/mspec-run -B /tmp/ruby/src/trunk/spec/default.mspec --error-output stderr --debug -fy -o /tmp/rubytest.pwkdms/18-mspec-multi-17 E, [2024-05-24T07:45:42.812603 #209631] ERROR -- : $ /tmp/ruby/build/trunk/miniruby -I/tmp/ruby/src/trunk/lib /tmp/ruby/src/trunk/tool/runruby.rb --archdir=/tmp/ruby/build/trunk --extout=.ext -- /tmp/ruby/src/trunk/spec/mspec/bin/mspec-run -B /tmp/ruby/src/trunk/spec/default.mspec --error-output stderr --debug -fy -o /tmp/rubytest.pwkdms/19-mspec-multi-18 E, [2024-05-24T07:45:42.812959 #209631] ERROR -- : $ /tmp/ruby/build/trunk/miniruby -I/tmp/ruby/src/trunk/lib /tmp/ruby/src/trunk/tool/runruby.rb --archdir=/tmp/ruby/build/trunk --extout=.ext -- /tmp/ruby/src/trunk/spec/mspec/bin/mspec-run -B /tmp/ruby/src/trunk/spec/default.mspec --error-output stderr --debug -fy -o /tmp/rubytest.pwkdms/20-mspec-multi-19 I, [2024-05-24T07:45:42.987868 #209631] INFO -- : ruby 3.4.0dev (2024-05-24T01:53:35Z master acdd19facc) [x86_64-linux] I, [2024-05-24T07:45:43.592457 #209631] INFO -- : 0 ......................................................................... I, [2024-05-24T07:45:43.968181 #209631] INFO -- : 73 ......................................................................... I, [2024-05-24T07:45:44.132707 #209631] INFO -- : 146 ......................................................................... I, [2024-05-24T07:45:44.188307 #209631] INFO -- : 219 ......................................................................... I, [2024-05-24T07:45:44.244467 #209631] INFO -- : 292 ......................................................................... I, [2024-05-24T07:45:44.283350 #209631] INFO -- : 365 ......................................................................... I, [2024-05-24T07:45:44.301729 #209631] INFO -- : 438 ......................................................................... I, [2024-05-24T07:45:44.319295 #209631] INFO -- : 511 ......................................................................... I, [2024-05-24T07:45:44.335505 #209631] INFO -- : 584 ......................................................................... I, [2024-05-24T07:45:44.387133 #209631] INFO -- : 657 ......................................................................... I, [2024-05-24T07:45:44.418530 #209631] INFO -- : 730 ......................................................................... I, [2024-05-24T07:45:44.444845 #209631] INFO -- : 803 ......................................................................... I, [2024-05-24T07:45:44.480389 #209631] INFO -- : 876 ......................................................................... I, [2024-05-24T07:45:44.531288 #209631] INFO -- : 949 ......................................................................... I, [2024-05-24T07:45:44.614239 #209631] INFO -- : 1022 ......................................................................... I, [2024-05-24T07:45:44.792326 #209631] INFO -- : 1095 ......................................................................... I, [2024-05-24T07:45:44.917440 #209631] INFO -- : 1168 ......................................................................... I, [2024-05-24T07:45:44.971859 #209631] INFO -- : 1241 ......................................................................... I, [2024-05-24T07:45:45.020491 #209631] INFO -- : 1314 ......................................................................... I, [2024-05-24T07:45:45.053740 #209631] INFO -- : 1387 ......................................................................... I, [2024-05-24T07:45:45.157385 #209631] INFO -- : 1460 ......................................................................... I, [2024-05-24T07:45:45.598560 #209631] INFO -- : 1533 ......................................................................... I, [2024-05-24T07:45:45.669924 #209631] INFO -- : 1606 ......................................................................... I, [2024-05-24T07:45:45.847614 #209631] INFO -- : 1679 ......................................................................... I, [2024-05-24T07:45:45.932101 #209631] INFO -- : 1752 ......................................................................... I, [2024-05-24T07:45:46.008380 #209631] INFO -- : 1825 ......................................................................... I, [2024-05-24T07:45:46.113479 #209631] INFO -- : 1898 ......................................................................... I, [2024-05-24T07:45:46.204393 #209631] INFO -- : 1971 ......................................................................... I, [2024-05-24T07:45:46.293915 #209631] INFO -- : 2044 ......................................................................... I, [2024-05-24T07:45:46.326803 #209631] INFO -- : 2117 ......................................................................... I, [2024-05-24T07:45:46.343810 #209631] INFO -- : 2190 ......................................................................... I, [2024-05-24T07:45:46.363419 #209631] INFO -- : 2263 ......................................................................... I, [2024-05-24T07:45:46.375002 #209631] INFO -- : 2336 ......................................................................... I, [2024-05-24T07:45:46.407848 #209631] INFO -- : 2409 ......................................................................... I, [2024-05-24T07:45:46.513568 #209631] INFO -- : 2482 ......................................................................... I, [2024-05-24T07:45:46.536307 #209631] INFO -- : 2555 ......................................................................... I, [2024-05-24T07:45:46.644446 #209631] INFO -- : 2628 ......................................................................... I, [2024-05-24T07:45:46.749447 #209631] INFO -- : 2701 ......................................................................... I, [2024-05-24T07:45:46.777827 #209631] INFO -- : 2774 ......................................................................... I, [2024-05-24T07:45:46.839246 #209631] INFO -- : 2847 ......................................................................... I, [2024-05-24T07:45:46.879358 #209631] INFO -- : 2920 ......................................................................... I, [2024-05-24T07:45:46.902343 #209631] INFO -- : 2993 ......................................................................... I, [2024-05-24T07:45:46.923774 #209631] INFO -- : 3066 ......................................................................... I, [2024-05-24T07:45:46.935878 #209631] INFO -- : 3139 ......................................................................... I, [2024-05-24T07:45:46.943670 #209631] INFO -- : 3212 ......................................................................... I, [2024-05-24T07:45:46.968427 #209631] INFO -- : 3285 ......................................................................... I, [2024-05-24T07:45:50.922050 #209631] INFO -- : 3358 ......................................................................... I, [2024-05-24T07:45:50.943671 #209631] INFO -- : I, [2024-05-24T07:45:50.943775 #209631] INFO -- : I, [2024-05-24T07:45:50.943796 #209631] INFO -- : Finished in 8.136907 seconds I, [2024-05-24T07:45:50.943812 #209631] INFO -- : I, [2024-05-24T07:45:50.943827 #209631] INFO -- : 3430 files, 32652 examples, 195196 expectations, 0 failures, 0 errors, 0 tagged I, [2024-05-24T07:45:50.946075 #209631] INFO -- : $$$[end] "make yes-test-rubyspec MSPECOPT='--error-output stderr --debug -j' TESTS='-j20'" exit with 0.