# Logfile created on 2024-05-24 03:31:34 +0000 by logger.rb/v1.4.3 I, [2024-05-24T03:31:34.559635 #3324821] INFO -- : #, @formatter=nil, @logdev=#, @binmode=false, @mon_data=#, @mon_data_owner_object_id=860>>> I, [2024-05-24T03:31:34.559768 #3324821] INFO -- : $$$[beg] make update-unicode -j20 I, [2024-05-24T03:31:34.618827 #3324821] INFO -- : Downloading Unicode emoji 15.0 files... I, [2024-05-24T03:31:34.618939 #3324821] INFO -- : Downloading Unicode emoji 15.0 files... I, [2024-05-24T03:31:34.619109 #3324821] INFO -- : Downloading Unicode emoji 15.0 files... I, [2024-05-24T03:31:34.660075 #3324821] INFO -- : made symlink emoji/15.0/emoji-sequences.txt to /tmp/ruby/src/trunk/.downloaded-cache/emoji/15.0/emoji-sequences.txt I, [2024-05-24T03:31:34.661279 #3324821] INFO -- : downloading emoji/15.0/emoji-sequences.txt ... downloading emoji/15.0/emoji-test.txt ... /tmp/ruby/src/trunk/enc/unicode/data/emoji/15.0/emoji-sequences.txt already exists E, [2024-05-24T03:31:35.097479 #3324821] ERROR -- : /tmp/ruby/src/trunk/tool/downloader.rb:302:in `rescue in download': failed to download emoji/15.0/emoji-test.txt (RuntimeError) E, [2024-05-24T03:31:35.097628 #3324821] ERROR -- : OpenURI::HTTPError: 403 Forbidden: https://www.unicode.org/Public/emoji/15.0/emoji-test.txt E, [2024-05-24T03:31:35.097652 #3324821] ERROR -- : from /tmp/ruby/src/trunk/tool/downloader.rb:201:in `download' E, [2024-05-24T03:31:35.097667 #3324821] ERROR -- : from /tmp/ruby/src/trunk/tool/downloader.rb:136:in `download' E, [2024-05-24T03:31:35.097682 #3324821] ERROR -- : from /tmp/ruby/src/trunk/tool/downloader.rb:482:in `block in
' E, [2024-05-24T03:31:35.097696 #3324821] ERROR -- : from /tmp/ruby/src/trunk/tool/downloader.rb:465:in `each' E, [2024-05-24T03:31:35.097709 #3324821] ERROR -- : from /tmp/ruby/src/trunk/tool/downloader.rb:465:in `
' E, [2024-05-24T03:31:35.097723 #3324821] ERROR -- : /usr/lib/ruby/3.0.0/open-uri.rb:364:in `open_http': 403 Forbidden (OpenURI::HTTPError) E, [2024-05-24T03:31:35.097736 #3324821] ERROR -- : from /usr/lib/ruby/3.0.0/open-uri.rb:741:in `buffer_open' E, [2024-05-24T03:31:35.097753 #3324821] ERROR -- : from /usr/lib/ruby/3.0.0/open-uri.rb:212:in `block in open_loop' E, [2024-05-24T03:31:35.097766 #3324821] ERROR -- : from /usr/lib/ruby/3.0.0/open-uri.rb:210:in `catch' E, [2024-05-24T03:31:35.097779 #3324821] ERROR -- : from /usr/lib/ruby/3.0.0/open-uri.rb:210:in `open_loop' E, [2024-05-24T03:31:35.097792 #3324821] ERROR -- : from /usr/lib/ruby/3.0.0/open-uri.rb:151:in `open_uri' E, [2024-05-24T03:31:35.097805 #3324821] ERROR -- : from /usr/lib/ruby/3.0.0/open-uri.rb:721:in `open' E, [2024-05-24T03:31:35.097818 #3324821] ERROR -- : from /usr/lib/ruby/3.0.0/open-uri.rb:729:in `read' E, [2024-05-24T03:31:35.097831 #3324821] ERROR -- : from /tmp/ruby/src/trunk/tool/downloader.rb:247:in `block in download' E, [2024-05-24T03:31:35.097864 #3324821] ERROR -- : from /tmp/ruby/src/trunk/tool/downloader.rb:378:in `with_retry' E, [2024-05-24T03:31:35.097879 #3324821] ERROR -- : from /tmp/ruby/src/trunk/tool/downloader.rb:246:in `download' E, [2024-05-24T03:31:35.097896 #3324821] ERROR -- : from /tmp/ruby/src/trunk/tool/downloader.rb:136:in `download' E, [2024-05-24T03:31:35.097908 #3324821] ERROR -- : from /tmp/ruby/src/trunk/tool/downloader.rb:482:in `block in
' E, [2024-05-24T03:31:35.097920 #3324821] ERROR -- : from /tmp/ruby/src/trunk/tool/downloader.rb:465:in `each' E, [2024-05-24T03:31:35.097932 #3324821] ERROR -- : from /tmp/ruby/src/trunk/tool/downloader.rb:465:in `
' E, [2024-05-24T03:31:35.102227 #3324821] ERROR -- : make: *** [uncommon.mk:1756: /tmp/ruby/src/trunk/enc/unicode/data/emoji/15.0/emoji-test.txt] Error 1 E, [2024-05-24T03:31:35.102292 #3324821] ERROR -- : make: *** Waiting for unfinished jobs.... E, [2024-05-24T03:31:35.117561 #3324821] ERROR -- : /tmp/ruby/src/trunk/tool/downloader.rb:302:in `rescue in download': failed to download emoji/15.0/emoji-test.txt (RuntimeError) E, [2024-05-24T03:31:35.117686 #3324821] ERROR -- : OpenURI::HTTPError: 403 Forbidden: https://www.unicode.org/Public/emoji/15.0/emoji-test.txt E, [2024-05-24T03:31:35.117710 #3324821] ERROR -- : from /tmp/ruby/src/trunk/tool/downloader.rb:201:in `download' E, [2024-05-24T03:31:35.117725 #3324821] ERROR -- : from /tmp/ruby/src/trunk/tool/downloader.rb:136:in `download' E, [2024-05-24T03:31:35.117738 #3324821] ERROR -- : from /tmp/ruby/src/trunk/tool/downloader.rb:482:in `block in
' E, [2024-05-24T03:31:35.117751 #3324821] ERROR -- : from /tmp/ruby/src/trunk/tool/downloader.rb:465:in `each' E, [2024-05-24T03:31:35.117764 #3324821] ERROR -- : from /tmp/ruby/src/trunk/tool/downloader.rb:465:in `
' E, [2024-05-24T03:31:35.117777 #3324821] ERROR -- : /usr/lib/ruby/3.0.0/open-uri.rb:364:in `open_http': 403 Forbidden (OpenURI::HTTPError) E, [2024-05-24T03:31:35.117790 #3324821] ERROR -- : from /usr/lib/ruby/3.0.0/open-uri.rb:741:in `buffer_open' E, [2024-05-24T03:31:35.117806 #3324821] ERROR -- : from /usr/lib/ruby/3.0.0/open-uri.rb:212:in `block in open_loop' E, [2024-05-24T03:31:35.117821 #3324821] ERROR -- : from /usr/lib/ruby/3.0.0/open-uri.rb:210:in `catch' E, [2024-05-24T03:31:35.117833 #3324821] ERROR -- : from /usr/lib/ruby/3.0.0/open-uri.rb:210:in `open_loop' E, [2024-05-24T03:31:35.117846 #3324821] ERROR -- : from /usr/lib/ruby/3.0.0/open-uri.rb:151:in `open_uri' E, [2024-05-24T03:31:35.117859 #3324821] ERROR -- : from /usr/lib/ruby/3.0.0/open-uri.rb:721:in `open' E, [2024-05-24T03:31:35.117872 #3324821] ERROR -- : from /usr/lib/ruby/3.0.0/open-uri.rb:729:in `read' E, [2024-05-24T03:31:35.117885 #3324821] ERROR -- : from /tmp/ruby/src/trunk/tool/downloader.rb:247:in `block in download' E, [2024-05-24T03:31:35.117898 #3324821] ERROR -- : from /tmp/ruby/src/trunk/tool/downloader.rb:378:in `with_retry' E, [2024-05-24T03:31:35.117915 #3324821] ERROR -- : from /tmp/ruby/src/trunk/tool/downloader.rb:246:in `download' E, [2024-05-24T03:31:35.117928 #3324821] ERROR -- : from /tmp/ruby/src/trunk/tool/downloader.rb:136:in `download' E, [2024-05-24T03:31:35.117940 #3324821] ERROR -- : from /tmp/ruby/src/trunk/tool/downloader.rb:482:in `block in
' E, [2024-05-24T03:31:35.117953 #3324821] ERROR -- : from /tmp/ruby/src/trunk/tool/downloader.rb:465:in `each' E, [2024-05-24T03:31:35.117966 #3324821] ERROR -- : from /tmp/ruby/src/trunk/tool/downloader.rb:465:in `
' E, [2024-05-24T03:31:35.122311 #3324821] ERROR -- : make: *** [uncommon.mk:1756: /tmp/ruby/src/trunk/enc/unicode/data/emoji/15.0/emoji-sequences.txt] Error 1 E, [2024-05-24T03:31:35.122376 #3324821] ERROR -- : make: *** Deleting file '/tmp/ruby/src/trunk/enc/unicode/data/emoji/15.0/emoji-sequences.txt' E, [2024-05-24T03:31:35.588154 #3324821] ERROR -- : /tmp/ruby/src/trunk/tool/downloader.rb:302:in `rescue in download': failed to download emoji/15.0/emoji-sequences.txt (RuntimeError) E, [2024-05-24T03:31:35.588197 #3324821] ERROR -- : EOFError: end of file reached: https://www.unicode.org/Public/emoji/15.0/emoji-sequences.txt E, [2024-05-24T03:31:35.588215 #3324821] ERROR -- : from /tmp/ruby/src/trunk/tool/downloader.rb:201:in `download' E, [2024-05-24T03:31:35.588219 #3324821] ERROR -- : from /tmp/ruby/src/trunk/tool/downloader.rb:136:in `download' E, [2024-05-24T03:31:35.588223 #3324821] ERROR -- : from /tmp/ruby/src/trunk/tool/downloader.rb:482:in `block in
' E, [2024-05-24T03:31:35.588227 #3324821] ERROR -- : from /tmp/ruby/src/trunk/tool/downloader.rb:465:in `each' E, [2024-05-24T03:31:35.588230 #3324821] ERROR -- : from /tmp/ruby/src/trunk/tool/downloader.rb:465:in `
' E, [2024-05-24T03:31:35.588234 #3324821] ERROR -- : /usr/lib/ruby/3.0.0/net/protocol.rb:227:in `rbuf_fill': end of file reached (EOFError) E, [2024-05-24T03:31:35.588239 #3324821] ERROR -- : from /usr/lib/ruby/3.0.0/net/protocol.rb:193:in `readuntil' E, [2024-05-24T03:31:35.588243 #3324821] ERROR -- : from /usr/lib/ruby/3.0.0/net/protocol.rb:203:in `readline' E, [2024-05-24T03:31:35.588246 #3324821] ERROR -- : from /usr/lib/ruby/3.0.0/net/http/response.rb:42:in `read_status_line' E, [2024-05-24T03:31:35.588250 #3324821] ERROR -- : from /usr/lib/ruby/3.0.0/net/http/response.rb:31:in `read_new' E, [2024-05-24T03:31:35.588254 #3324821] ERROR -- : from /usr/lib/ruby/3.0.0/net/http.rb:1557:in `block in transport_request' E, [2024-05-24T03:31:35.588258 #3324821] ERROR -- : from /usr/lib/ruby/3.0.0/net/http.rb:1548:in `catch' E, [2024-05-24T03:31:35.588333 #3324821] ERROR -- : from /usr/lib/ruby/3.0.0/net/http.rb:1548:in `transport_request' E, [2024-05-24T03:31:35.588338 #3324821] ERROR -- : from /usr/lib/ruby/3.0.0/net/http.rb:1521:in `request' E, [2024-05-24T03:31:35.588341 #3324821] ERROR -- : from /usr/lib/ruby/3.0.0/open-uri.rb:329:in `block in open_http' E, [2024-05-24T03:31:35.588345 #3324821] ERROR -- : from /usr/lib/ruby/3.0.0/net/http.rb:960:in `start' E, [2024-05-24T03:31:35.588348 #3324821] ERROR -- : from /usr/lib/ruby/3.0.0/open-uri.rb:323:in `open_http' E, [2024-05-24T03:31:35.588352 #3324821] ERROR -- : from /usr/lib/ruby/3.0.0/open-uri.rb:741:in `buffer_open' E, [2024-05-24T03:31:35.588357 #3324821] ERROR -- : from /usr/lib/ruby/3.0.0/open-uri.rb:212:in `block in open_loop' E, [2024-05-24T03:31:35.588360 #3324821] ERROR -- : from /usr/lib/ruby/3.0.0/open-uri.rb:210:in `catch' E, [2024-05-24T03:31:35.588364 #3324821] ERROR -- : from /usr/lib/ruby/3.0.0/open-uri.rb:210:in `open_loop' E, [2024-05-24T03:31:35.588368 #3324821] ERROR -- : from /usr/lib/ruby/3.0.0/open-uri.rb:151:in `open_uri' E, [2024-05-24T03:31:35.588371 #3324821] ERROR -- : from /usr/lib/ruby/3.0.0/open-uri.rb:721:in `open' E, [2024-05-24T03:31:35.588375 #3324821] ERROR -- : from /usr/lib/ruby/3.0.0/open-uri.rb:729:in `read' E, [2024-05-24T03:31:35.588379 #3324821] ERROR -- : from /tmp/ruby/src/trunk/tool/downloader.rb:247:in `block in download' E, [2024-05-24T03:31:35.588382 #3324821] ERROR -- : from /tmp/ruby/src/trunk/tool/downloader.rb:378:in `with_retry' E, [2024-05-24T03:31:35.588386 #3324821] ERROR -- : from /tmp/ruby/src/trunk/tool/downloader.rb:246:in `download' E, [2024-05-24T03:31:35.588390 #3324821] ERROR -- : from /tmp/ruby/src/trunk/tool/downloader.rb:136:in `download' E, [2024-05-24T03:31:35.588394 #3324821] ERROR -- : from /tmp/ruby/src/trunk/tool/downloader.rb:482:in `block in
' E, [2024-05-24T03:31:35.588398 #3324821] ERROR -- : from /tmp/ruby/src/trunk/tool/downloader.rb:465:in `each' E, [2024-05-24T03:31:35.588401 #3324821] ERROR -- : from /tmp/ruby/src/trunk/tool/downloader.rb:465:in `
' E, [2024-05-24T03:31:35.590173 #3324821] ERROR -- : make: *** [uncommon.mk:1756: /tmp/ruby/src/trunk/enc/unicode/data/emoji/15.0/emoji-zwj-sequences.txt] Error 1 I, [2024-05-24T03:31:35.590284 #3324821] INFO -- : downloading emoji/15.0/emoji-test.txt ... I, [2024-05-24T03:31:35.590670 #3324821] INFO -- : $$$[end] "make update-unicode -j20" exit with 512. I, [2024-05-24T03:31:35.590739 #3324821] INFO -- : $$$[beg] make update-download -j20 I, [2024-05-24T03:31:35.691933 #3324821] INFO -- : tool/config.guess already exists I, [2024-05-24T03:31:35.691976 #3324821] INFO -- : tool/config.sub already exists I, [2024-05-24T03:31:35.694455 #3324821] INFO -- : Update power_assert to 84e85124c5014a139af39161d484156cfe87a9ed I, [2024-05-24T03:31:35.694633 #3324821] INFO -- : Update rbs to ba7872795d5de04adb8ff500c0e6afdc81a041dd I, [2024-05-24T03:31:35.695291 #3324821] INFO -- : Update typeprof to b19a6416da3a05d57fadd6ffdadb382b6d236ca5 I, [2024-05-24T03:31:35.695844 #3324821] INFO -- : echo 84e85124c5014a139af39161d484156cfe87a9ed | /bin/sh /tmp/ruby/src/trunk/tool/ifchange /tmp/ruby/src/trunk/.bundle/.timestamp/power_assert.revision - I, [2024-05-24T03:31:35.696002 #3324821] INFO -- : echo ba7872795d5de04adb8ff500c0e6afdc81a041dd | /bin/sh /tmp/ruby/src/trunk/tool/ifchange /tmp/ruby/src/trunk/.bundle/.timestamp/rbs.revision - I, [2024-05-24T03:31:35.696452 #3324821] INFO -- : echo b19a6416da3a05d57fadd6ffdadb382b6d236ca5 | /bin/sh /tmp/ruby/src/trunk/tool/ifchange /tmp/ruby/src/trunk/.bundle/.timestamp/typeprof.revision - I, [2024-05-24T03:31:35.698109 #3324821] INFO -- : /tmp/ruby/src/trunk/.bundle/.timestamp/power_assert.revision unchanged I, [2024-05-24T03:31:35.698135 #3324821] INFO -- : /tmp/ruby/src/trunk/.bundle/.timestamp/rbs.revision unchanged I, [2024-05-24T03:31:35.698175 #3324821] INFO -- : /tmp/ruby/src/trunk/.bundle/.timestamp/typeprof.revision unchanged I, [2024-05-24T03:31:35.699174 #3324821] INFO -- : Building power_assert@84e85124c5014a139af39161d484156cfe87a9ed to /tmp/ruby/src/trunk/gems/power_assert-2.0.3.gem I, [2024-05-24T03:31:35.767727 #3324821] INFO -- : Successfully built RubyGem I, [2024-05-24T03:31:35.767768 #3324821] INFO -- : Name: power_assert I, [2024-05-24T03:31:35.767774 #3324821] INFO -- : Version: 2.0.4dev I, [2024-05-24T03:31:35.767778 #3324821] INFO -- : File: power_assert-2.0.4dev.gem I, [2024-05-24T03:31:35.813286 #3324821] INFO -- : $$$[end] "make update-download -j20" exit with 0. I, [2024-05-24T03:31:35.813322 #3324821] INFO -- : $$$[beg] make update-rubyspec -j20 I, [2024-05-24T03:31:35.871184 #3324821] INFO -- : make: Nothing to be done for 'update-rubyspec'. I, [2024-05-24T03:31:35.871441 #3324821] INFO -- : $$$[end] "make update-rubyspec -j20" exit with 0. I, [2024-05-24T03:31:35.871470 #3324821] INFO -- : $$$[beg] make update-src -j20 I, [2024-05-24T03:31:36.607070 #3324821] INFO -- : Already up to date. I, [2024-05-24T03:31:36.622836 #3324821] INFO -- : Latest commit hash = acdd19facc I, [2024-05-24T03:31:36.624660 #3324821] INFO -- : $$$[end] "make update-src -j20" exit with 0. I, [2024-05-24T03:31:36.624713 #3324821] INFO -- : $$$[beg] make after-update -j20 I, [2024-05-24T03:31:36.709878 #3324821] INFO -- : generating /tmp/ruby/src/trunk/ext/ripper/eventids1.h I, [2024-05-24T03:31:36.714182 #3324821] INFO -- : make[1]: Entering directory '/tmp/ruby/src/trunk/ext/ripper' I, [2024-05-24T03:31:36.714230 #3324821] INFO -- : make[1]: Nothing to be done for 'src'. I, [2024-05-24T03:31:36.714243 #3324821] INFO -- : make[1]: Leaving directory '/tmp/ruby/src/trunk/ext/ripper' I, [2024-05-24T03:31:36.714844 #3324821] INFO -- : generating /tmp/ruby/src/trunk/ext/ripper/eventids1.c I, [2024-05-24T03:31:36.716787 #3324821] INFO -- : make[1]: Entering directory '/tmp/ruby/src/trunk/ext/ripper' I, [2024-05-24T03:31:36.716843 #3324821] INFO -- : make[1]: Nothing to be done for 'src'. I, [2024-05-24T03:31:36.716857 #3324821] INFO -- : make[1]: Leaving directory '/tmp/ruby/src/trunk/ext/ripper' I, [2024-05-24T03:31:36.717450 #3324821] INFO -- : generating /tmp/ruby/src/trunk/ext/ripper/eventids2table.c I, [2024-05-24T03:31:36.719464 #3324821] INFO -- : make[1]: Entering directory '/tmp/ruby/src/trunk/ext/ripper' I, [2024-05-24T03:31:36.719519 #3324821] INFO -- : make[1]: Nothing to be done for 'src'. I, [2024-05-24T03:31:36.719533 #3324821] INFO -- : make[1]: Leaving directory '/tmp/ruby/src/trunk/ext/ripper' I, [2024-05-24T03:31:36.730146 #3324821] INFO -- : /tmp/ruby/src/trunk/revision.h updated I, [2024-05-24T03:31:36.731397 #3324821] INFO -- : generating x86_64-linux-fake.rb I, [2024-05-24T03:31:36.782656 #3324821] INFO -- : x86_64-linux-fake.rb updated I, [2024-05-24T03:31:36.784191 #3324821] INFO -- : generating enc.mk I, [2024-05-24T03:31:36.903032 #3324821] INFO -- : making srcs under enc I, [2024-05-24T03:31:36.932994 #3324821] INFO -- : make[1]: Entering directory '/tmp/ruby/build/trunk' I, [2024-05-24T03:31:36.933059 #3324821] INFO -- : make[1]: Nothing to be done for 'srcs'. I, [2024-05-24T03:31:36.933077 #3324821] INFO -- : make[1]: Leaving directory '/tmp/ruby/build/trunk' I, [2024-05-24T03:31:36.981681 #3324821] INFO -- : Update power_assert to 84e85124c5014a139af39161d484156cfe87a9ed I, [2024-05-24T03:31:36.981850 #3324821] INFO -- : Update rbs to ba7872795d5de04adb8ff500c0e6afdc81a041dd I, [2024-05-24T03:31:36.982508 #3324821] INFO -- : Update typeprof to b19a6416da3a05d57fadd6ffdadb382b6d236ca5 I, [2024-05-24T03:31:36.983621 #3324821] INFO -- : echo 84e85124c5014a139af39161d484156cfe87a9ed | /bin/sh /tmp/ruby/src/trunk/tool/ifchange /tmp/ruby/src/trunk/.bundle/.timestamp/power_assert.revision - I, [2024-05-24T03:31:36.983802 #3324821] INFO -- : echo ba7872795d5de04adb8ff500c0e6afdc81a041dd | /bin/sh /tmp/ruby/src/trunk/tool/ifchange /tmp/ruby/src/trunk/.bundle/.timestamp/rbs.revision - I, [2024-05-24T03:31:36.985227 #3324821] INFO -- : echo b19a6416da3a05d57fadd6ffdadb382b6d236ca5 | /bin/sh /tmp/ruby/src/trunk/tool/ifchange /tmp/ruby/src/trunk/.bundle/.timestamp/typeprof.revision - I, [2024-05-24T03:31:36.985695 #3324821] INFO -- : /tmp/ruby/src/trunk/.bundle/.timestamp/power_assert.revision unchanged I, [2024-05-24T03:31:36.985970 #3324821] INFO -- : /tmp/ruby/src/trunk/.bundle/.timestamp/rbs.revision unchanged I, [2024-05-24T03:31:36.987162 #3324821] INFO -- : Building power_assert@84e85124c5014a139af39161d484156cfe87a9ed to /tmp/ruby/src/trunk/gems/power_assert-2.0.3.gem I, [2024-05-24T03:31:36.987183 #3324821] INFO -- : /tmp/ruby/src/trunk/.bundle/.timestamp/typeprof.revision unchanged I, [2024-05-24T03:31:37.056344 #3324821] INFO -- : Successfully built RubyGem I, [2024-05-24T03:31:37.056385 #3324821] INFO -- : Name: power_assert I, [2024-05-24T03:31:37.056391 #3324821] INFO -- : Version: 2.0.4dev I, [2024-05-24T03:31:37.056395 #3324821] INFO -- : File: power_assert-2.0.4dev.gem I, [2024-05-24T03:31:37.058834 #3324821] INFO -- : Extracting bundle gem power_assert-2.0.3... I, [2024-05-24T03:31:37.120050 #3324821] INFO -- : Try with hash version of bundled gems instead of gems/power_assert-2.0.3.gem. We don't use this gem with release version of Ruby. I, [2024-05-24T03:31:37.125041 #3324821] INFO -- : Unpacked gems/power_assert-2.0.4dev.gem I, [2024-05-24T03:31:37.127246 #3324821] INFO -- : $$$[end] "make after-update -j20" exit with 0. I, [2024-05-24T03:31:37.127403 #3324821] INFO -- : $$$[beg] make miniruby -j20 I, [2024-05-24T03:31:37.184572 #3324821] INFO -- : BASERUBY = /usr/bin/ruby --disable=gems I, [2024-05-24T03:31:37.184609 #3324821] INFO -- : CC = gcc I, [2024-05-24T03:31:37.184618 #3324821] INFO -- : LD = ld I, [2024-05-24T03:31:37.184622 #3324821] INFO -- : LDSHARED = gcc -shared I, [2024-05-24T03:31:37.184626 #3324821] INFO -- : CFLAGS = -O3 -fno-fast-math -ggdb3 -Wall -Wextra -Wdeprecated-declarations -Wdiv-by-zero -Wduplicated-cond -Wimplicit-function-declaration -Wimplicit-int -Wpointer-arith -Wwrite-strings -Wold-style-definition -Wimplicit-fallthrough=0 -Wmissing-noreturn -Wno-cast-function-type -Wno-constant-logical-operand -Wno-long-long -Wno-missing-field-initializers -Wno-overlength-strings -Wno-packed-bitfield-compat -Wno-parentheses-equality -Wno-self-assign -Wno-tautological-compare -Wno-unused-parameter -Wno-unused-value -Wsuggest-attribute=format -Wsuggest-attribute=noreturn -Wunused-variable -Wmisleading-indentation -Wundef -fPIC I, [2024-05-24T03:31:37.184631 #3324821] INFO -- : XCFLAGS = -U_FORTIFY_SOURCE -D_FORTIFY_SOURCE=2 -fstack-protector-strong -fno-strict-overflow -fvisibility=hidden -fexcess-precision=standard -DRUBY_EXPORT -I. -I.ext/include/x86_64-linux -I/tmp/ruby/src/trunk/include -I/tmp/ruby/src/trunk -I/tmp/ruby/src/trunk/prism -I/tmp/ruby/src/trunk/enc/unicode/15.0.0 I, [2024-05-24T03:31:37.184642 #3324821] INFO -- : CPPFLAGS = I, [2024-05-24T03:31:37.184646 #3324821] INFO -- : DLDFLAGS = -Wl,--compress-debug-sections=zlib -Wl,-soname,libruby.so.3.4 -fstack-protector-strong I, [2024-05-24T03:31:37.184650 #3324821] INFO -- : SOLIBS = -lz -lrt -lrt -lgmp -ldl -lcrypt -lm -lpthread I, [2024-05-24T03:31:37.184653 #3324821] INFO -- : LANG = en_US.UTF-8 I, [2024-05-24T03:31:37.184659 #3324821] INFO -- : LC_ALL = I, [2024-05-24T03:31:37.184663 #3324821] INFO -- : LC_CTYPE = I, [2024-05-24T03:31:37.184667 #3324821] INFO -- : MFLAGS = -j20 --jobserver-auth=4,5 I, [2024-05-24T03:31:37.184670 #3324821] INFO -- : RUSTC = no I, [2024-05-24T03:31:37.184674 #3324821] INFO -- : YJIT_RUSTC_ARGS = --crate-name=yjit --crate-type=staticlib --edition=2021 -g -C lto=thin -C opt-level=3 -C overflow-checks=on '--out-dir=/tmp/ruby/build/trunk/yjit/target/release/' /tmp/ruby/src/trunk/yjit/src/lib.rs I, [2024-05-24T03:31:37.186131 #3324821] INFO -- : gcc (Ubuntu 11.4.0-1ubuntu1~22.04) 11.4.0 I, [2024-05-24T03:31:37.186154 #3324821] INFO -- : Copyright (C) 2021 Free Software Foundation, Inc. I, [2024-05-24T03:31:37.186160 #3324821] INFO -- : This is free software; see the source for copying conditions. There is NO I, [2024-05-24T03:31:37.186168 #3324821] INFO -- : warranty; not even for MERCHANTABILITY or FITNESS FOR A PARTICULAR PURPOSE. I, [2024-05-24T03:31:37.186172 #3324821] INFO -- : I, [2024-05-24T03:31:37.210642 #3324821] INFO -- : compiling /tmp/ruby/src/trunk/version.c I, [2024-05-24T03:31:37.313195 #3324821] INFO -- : linking miniruby I, [2024-05-24T03:31:37.833220 #3324821] INFO -- : $$$[end] "make miniruby -j20" exit with 0. I, [2024-05-24T03:31:37.833331 #3324821] INFO -- : $$$[beg] make ruby -j20 I, [2024-05-24T03:31:37.893200 #3324821] INFO -- : BASERUBY = /usr/bin/ruby --disable=gems I, [2024-05-24T03:31:37.893256 #3324821] INFO -- : CC = gcc I, [2024-05-24T03:31:37.893273 #3324821] INFO -- : LD = ld I, [2024-05-24T03:31:37.893287 #3324821] INFO -- : LDSHARED = gcc -shared I, [2024-05-24T03:31:37.893305 #3324821] INFO -- : CFLAGS = -O3 -fno-fast-math -ggdb3 -Wall -Wextra -Wdeprecated-declarations -Wdiv-by-zero -Wduplicated-cond -Wimplicit-function-declaration -Wimplicit-int -Wpointer-arith -Wwrite-strings -Wold-style-definition -Wimplicit-fallthrough=0 -Wmissing-noreturn -Wno-cast-function-type -Wno-constant-logical-operand -Wno-long-long -Wno-missing-field-initializers -Wno-overlength-strings -Wno-packed-bitfield-compat -Wno-parentheses-equality -Wno-self-assign -Wno-tautological-compare -Wno-unused-parameter -Wno-unused-value -Wsuggest-attribute=format -Wsuggest-attribute=noreturn -Wunused-variable -Wmisleading-indentation -Wundef -fPIC I, [2024-05-24T03:31:37.893321 #3324821] INFO -- : XCFLAGS = -U_FORTIFY_SOURCE -D_FORTIFY_SOURCE=2 -fstack-protector-strong -fno-strict-overflow -fvisibility=hidden -fexcess-precision=standard -DRUBY_EXPORT -I. -I.ext/include/x86_64-linux -I/tmp/ruby/src/trunk/include -I/tmp/ruby/src/trunk -I/tmp/ruby/src/trunk/prism -I/tmp/ruby/src/trunk/enc/unicode/15.0.0 I, [2024-05-24T03:31:37.893336 #3324821] INFO -- : CPPFLAGS = I, [2024-05-24T03:31:37.893350 #3324821] INFO -- : DLDFLAGS = -Wl,--compress-debug-sections=zlib -Wl,-soname,libruby.so.3.4 -fstack-protector-strong I, [2024-05-24T03:31:37.893364 #3324821] INFO -- : SOLIBS = -lz -lrt -lrt -lgmp -ldl -lcrypt -lm -lpthread I, [2024-05-24T03:31:37.893376 #3324821] INFO -- : LANG = en_US.UTF-8 I, [2024-05-24T03:31:37.893389 #3324821] INFO -- : LC_ALL = I, [2024-05-24T03:31:37.893402 #3324821] INFO -- : LC_CTYPE = I, [2024-05-24T03:31:37.893415 #3324821] INFO -- : MFLAGS = -j20 --jobserver-auth=4,5 I, [2024-05-24T03:31:37.893432 #3324821] INFO -- : RUSTC = no I, [2024-05-24T03:31:37.893446 #3324821] INFO -- : YJIT_RUSTC_ARGS = --crate-name=yjit --crate-type=staticlib --edition=2021 -g -C lto=thin -C opt-level=3 -C overflow-checks=on '--out-dir=/tmp/ruby/build/trunk/yjit/target/release/' /tmp/ruby/src/trunk/yjit/src/lib.rs I, [2024-05-24T03:31:37.895503 #3324821] INFO -- : gcc (Ubuntu 11.4.0-1ubuntu1~22.04) 11.4.0 I, [2024-05-24T03:31:37.895562 #3324821] INFO -- : Copyright (C) 2021 Free Software Foundation, Inc. I, [2024-05-24T03:31:37.895580 #3324821] INFO -- : This is free software; see the source for copying conditions. There is NO I, [2024-05-24T03:31:37.895596 #3324821] INFO -- : warranty; not even for MERCHANTABILITY or FITNESS FOR A PARTICULAR PURPOSE. I, [2024-05-24T03:31:37.895610 #3324821] INFO -- : I, [2024-05-24T03:31:38.007876 #3324821] INFO -- : builtin_binary.inc updated I, [2024-05-24T03:31:38.012452 #3324821] INFO -- : c86294a81d0df6836359a6b5498b71b1ddba3062aa6ec87c7b2896368a948a19 builtin_binary.inc I, [2024-05-24T03:31:38.013146 #3324821] INFO -- : compiling /tmp/ruby/src/trunk/builtin.c I, [2024-05-24T03:31:38.197506 #3324821] INFO -- : linking static-library libruby-static.a I, [2024-05-24T03:31:38.511894 #3324821] INFO -- : linking shared-library libruby.so.3.4.0 I, [2024-05-24T03:31:40.063663 #3324821] INFO -- : linking ruby I, [2024-05-24T03:31:40.094435 #3324821] INFO -- : $$$[end] "make ruby -j20" exit with 0. I, [2024-05-24T03:31:40.094566 #3324821] INFO -- : $$$[beg] make all -j20 I, [2024-05-24T03:31:40.151831 #3324821] INFO -- : BASERUBY = /usr/bin/ruby --disable=gems I, [2024-05-24T03:31:40.151865 #3324821] INFO -- : CC = gcc I, [2024-05-24T03:31:40.151871 #3324821] INFO -- : LD = ld I, [2024-05-24T03:31:40.151875 #3324821] INFO -- : LDSHARED = gcc -shared I, [2024-05-24T03:31:40.151879 #3324821] INFO -- : CFLAGS = -O3 -fno-fast-math -ggdb3 -Wall -Wextra -Wdeprecated-declarations -Wdiv-by-zero -Wduplicated-cond -Wimplicit-function-declaration -Wimplicit-int -Wpointer-arith -Wwrite-strings -Wold-style-definition -Wimplicit-fallthrough=0 -Wmissing-noreturn -Wno-cast-function-type -Wno-constant-logical-operand -Wno-long-long -Wno-missing-field-initializers -Wno-overlength-strings -Wno-packed-bitfield-compat -Wno-parentheses-equality -Wno-self-assign -Wno-tautological-compare -Wno-unused-parameter -Wno-unused-value -Wsuggest-attribute=format -Wsuggest-attribute=noreturn -Wunused-variable -Wmisleading-indentation -Wundef -fPIC I, [2024-05-24T03:31:40.151884 #3324821] INFO -- : XCFLAGS = -U_FORTIFY_SOURCE -D_FORTIFY_SOURCE=2 -fstack-protector-strong -fno-strict-overflow -fvisibility=hidden -fexcess-precision=standard -DRUBY_EXPORT -I. -I.ext/include/x86_64-linux -I/tmp/ruby/src/trunk/include -I/tmp/ruby/src/trunk -I/tmp/ruby/src/trunk/prism -I/tmp/ruby/src/trunk/enc/unicode/15.0.0 I, [2024-05-24T03:31:40.151888 #3324821] INFO -- : CPPFLAGS = I, [2024-05-24T03:31:40.151892 #3324821] INFO -- : DLDFLAGS = -Wl,--compress-debug-sections=zlib -Wl,-soname,libruby.so.3.4 -fstack-protector-strong I, [2024-05-24T03:31:40.151895 #3324821] INFO -- : SOLIBS = -lz -lrt -lrt -lgmp -ldl -lcrypt -lm -lpthread I, [2024-05-24T03:31:40.151899 #3324821] INFO -- : LANG = en_US.UTF-8 I, [2024-05-24T03:31:40.151903 #3324821] INFO -- : LC_ALL = I, [2024-05-24T03:31:40.151907 #3324821] INFO -- : LC_CTYPE = I, [2024-05-24T03:31:40.151910 #3324821] INFO -- : MFLAGS = -j20 --jobserver-auth=4,5 I, [2024-05-24T03:31:40.151914 #3324821] INFO -- : RUSTC = no I, [2024-05-24T03:31:40.151918 #3324821] INFO -- : YJIT_RUSTC_ARGS = --crate-name=yjit --crate-type=staticlib --edition=2021 -g -C lto=thin -C opt-level=3 -C overflow-checks=on '--out-dir=/tmp/ruby/build/trunk/yjit/target/release/' /tmp/ruby/src/trunk/yjit/src/lib.rs I, [2024-05-24T03:31:40.153337 #3324821] INFO -- : gcc (Ubuntu 11.4.0-1ubuntu1~22.04) 11.4.0 I, [2024-05-24T03:31:40.153361 #3324821] INFO -- : Copyright (C) 2021 Free Software Foundation, Inc. I, [2024-05-24T03:31:40.153371 #3324821] INFO -- : This is free software; see the source for copying conditions. There is NO I, [2024-05-24T03:31:40.153376 #3324821] INFO -- : warranty; not even for MERCHANTABILITY or FITNESS FOR A PARTICULAR PURPOSE. I, [2024-05-24T03:31:40.153386 #3324821] INFO -- : I, [2024-05-24T03:31:40.182486 #3324821] INFO -- : generating encdb.h I, [2024-05-24T03:31:40.183808 #3324821] INFO -- : generating enc.mk I, [2024-05-24T03:31:40.185621 #3324821] INFO -- : building spec/ruby/optional/capi/ext/array_spec.so I, [2024-05-24T03:31:40.185940 #3324821] INFO -- : building spec/ruby/optional/capi/ext/basic_object_spec.so I, [2024-05-24T03:31:40.186256 #3324821] INFO -- : building spec/ruby/optional/capi/ext/bignum_spec.so I, [2024-05-24T03:31:40.186934 #3324821] INFO -- : building spec/ruby/optional/capi/ext/binding_spec.so I, [2024-05-24T03:31:40.187476 #3324821] INFO -- : building spec/ruby/optional/capi/ext/boolean_spec.so I, [2024-05-24T03:31:40.187604 #3324821] INFO -- : building spec/ruby/optional/capi/ext/class_id_under_autoload_spec.so I, [2024-05-24T03:31:40.188457 #3324821] INFO -- : building spec/ruby/optional/capi/ext/class_spec.so I, [2024-05-24T03:31:40.189694 #3324821] INFO -- : building spec/ruby/optional/capi/ext/class_under_autoload_spec.so I, [2024-05-24T03:31:40.190366 #3324821] INFO -- : building spec/ruby/optional/capi/ext/complex_spec.so I, [2024-05-24T03:31:40.190692 #3324821] INFO -- : building spec/ruby/optional/capi/ext/constants_spec.so I, [2024-05-24T03:31:40.191361 #3324821] INFO -- : building spec/ruby/optional/capi/ext/data_spec.so I, [2024-05-24T03:31:40.191904 #3324821] INFO -- : building spec/ruby/optional/capi/ext/debug_spec.so I, [2024-05-24T03:31:40.192140 #3324821] INFO -- : building spec/ruby/optional/capi/ext/encoding_spec.so I, [2024-05-24T03:31:40.192764 #3324821] INFO -- : building spec/ruby/optional/capi/ext/enumerator_spec.so I, [2024-05-24T03:31:40.193346 #3324821] INFO -- : building spec/ruby/optional/capi/ext/exception_spec.so I, [2024-05-24T03:31:40.193639 #3324821] INFO -- : building spec/ruby/optional/capi/ext/fiber_spec.so I, [2024-05-24T03:31:40.194320 #3324821] INFO -- : building spec/ruby/optional/capi/ext/file_spec.so I, [2024-05-24T03:31:40.195188 #3324821] INFO -- : building spec/ruby/optional/capi/ext/fixnum_spec.so I, [2024-05-24T03:31:40.219132 #3324821] INFO -- : encdb.h unchanged I, [2024-05-24T03:31:40.221224 #3324821] INFO -- : building spec/ruby/optional/capi/ext/float_spec.so I, [2024-05-24T03:31:40.320857 #3324821] INFO -- : building spec/ruby/optional/capi/ext/gc_spec.so I, [2024-05-24T03:31:40.332259 #3324821] INFO -- : building spec/ruby/optional/capi/ext/globals_spec.so I, [2024-05-24T03:31:40.340881 #3324821] INFO -- : building spec/ruby/optional/capi/ext/hash_spec.so I, [2024-05-24T03:31:40.341507 #3324821] INFO -- : building spec/ruby/optional/capi/ext/integer_spec.so I, [2024-05-24T03:31:40.344246 #3324821] INFO -- : building spec/ruby/optional/capi/ext/io_spec.so I, [2024-05-24T03:31:40.347943 #3324821] INFO -- : building spec/ruby/optional/capi/ext/language_spec.so I, [2024-05-24T03:31:40.348174 #3324821] INFO -- : building spec/ruby/optional/capi/ext/kernel_spec.so I, [2024-05-24T03:31:40.354372 #3324821] INFO -- : building spec/ruby/optional/capi/ext/marshal_spec.so I, [2024-05-24T03:31:40.363273 #3324821] INFO -- : building spec/ruby/optional/capi/ext/module_spec.so I, [2024-05-24T03:31:40.366750 #3324821] INFO -- : building spec/ruby/optional/capi/ext/mutex_spec.so I, [2024-05-24T03:31:40.366831 #3324821] INFO -- : building spec/ruby/optional/capi/ext/module_under_autoload_spec.so I, [2024-05-24T03:31:40.369782 #3324821] INFO -- : building spec/ruby/optional/capi/ext/numeric_spec.so I, [2024-05-24T03:31:40.377173 #3324821] INFO -- : building spec/ruby/optional/capi/ext/object_spec.so I, [2024-05-24T03:31:40.383973 #3324821] INFO -- : building spec/ruby/optional/capi/ext/proc_spec.so I, [2024-05-24T03:31:40.386208 #3324821] INFO -- : building spec/ruby/optional/capi/ext/range_spec.so I, [2024-05-24T03:31:40.411008 #3324821] INFO -- : building spec/ruby/optional/capi/ext/rational_spec.so I, [2024-05-24T03:31:40.426135 #3324821] INFO -- : building spec/ruby/optional/capi/ext/rbasic_spec.so I, [2024-05-24T03:31:40.432860 #3324821] INFO -- : building spec/ruby/optional/capi/ext/regexp_spec.so I, [2024-05-24T03:31:40.492723 #3324821] INFO -- : building spec/ruby/optional/capi/ext/string_spec.so I, [2024-05-24T03:31:40.497435 #3324821] INFO -- : building spec/ruby/optional/capi/ext/struct_spec.so I, [2024-05-24T03:31:40.511411 #3324821] INFO -- : building spec/ruby/optional/capi/ext/st_spec.so I, [2024-05-24T03:31:40.511850 #3324821] INFO -- : building spec/ruby/optional/capi/ext/symbol_spec.so I, [2024-05-24T03:31:40.514591 #3324821] INFO -- : building spec/ruby/optional/capi/ext/thread_spec.so I, [2024-05-24T03:31:40.518015 #3324821] INFO -- : building spec/ruby/optional/capi/ext/time_spec.so I, [2024-05-24T03:31:40.523509 #3324821] INFO -- : building spec/ruby/optional/capi/ext/tracepoint_spec.so I, [2024-05-24T03:31:40.527555 #3324821] INFO -- : building spec/ruby/optional/capi/ext/typed_data_spec.so I, [2024-05-24T03:31:40.528375 #3324821] INFO -- : building spec/ruby/optional/capi/ext/util_spec.so I, [2024-05-24T03:31:40.535764 #3324821] INFO -- : making enc I, [2024-05-24T03:31:40.550494 #3324821] INFO -- : making srcs under enc I, [2024-05-24T03:31:40.562186 #3324821] INFO -- : make[1]: Entering directory '/tmp/ruby/build/trunk' I, [2024-05-24T03:31:40.562271 #3324821] INFO -- : make[1]: Nothing to be done for 'enc'. I, [2024-05-24T03:31:40.562315 #3324821] INFO -- : make[1]: Leaving directory '/tmp/ruby/build/trunk' I, [2024-05-24T03:31:40.596916 #3324821] INFO -- : make[1]: Entering directory '/tmp/ruby/build/trunk' I, [2024-05-24T03:31:40.596984 #3324821] INFO -- : make[1]: Nothing to be done for 'srcs'. I, [2024-05-24T03:31:40.596993 #3324821] INFO -- : make[1]: Leaving directory '/tmp/ruby/build/trunk' I, [2024-05-24T03:31:40.597604 #3324821] INFO -- : generating transdb.h I, [2024-05-24T03:31:40.696559 #3324821] INFO -- : transdb.h unchanged I, [2024-05-24T03:31:40.697891 #3324821] INFO -- : generating makefiles ext/configure-ext.mk I, [2024-05-24T03:31:40.698273 #3324821] INFO -- : making trans I, [2024-05-24T03:31:40.725462 #3324821] INFO -- : ext/configure-ext.mk updated I, [2024-05-24T03:31:40.727341 #3324821] INFO -- : make[1]: Entering directory '/tmp/ruby/build/trunk' I, [2024-05-24T03:31:40.732745 #3324821] INFO -- : make[1]: Entering directory '/tmp/ruby/build/trunk' I, [2024-05-24T03:31:40.732836 #3324821] INFO -- : make[1]: Nothing to be done for 'trans'. I, [2024-05-24T03:31:40.732847 #3324821] INFO -- : make[1]: Leaving directory '/tmp/ruby/build/trunk' I, [2024-05-24T03:31:40.733785 #3324821] INFO -- : making encs I, [2024-05-24T03:31:40.793038 #3324821] INFO -- : make[1]: Entering directory '/tmp/ruby/build/trunk' I, [2024-05-24T03:31:40.793114 #3324821] INFO -- : make[1]: Nothing to be done for 'encs'. I, [2024-05-24T03:31:40.793142 #3324821] INFO -- : make[1]: Leaving directory '/tmp/ruby/build/trunk' I, [2024-05-24T03:31:40.883085 #3324821] INFO -- : make[1]: Leaving directory '/tmp/ruby/build/trunk' I, [2024-05-24T03:31:40.883852 #3324821] INFO -- : generating makefile exts.mk I, [2024-05-24T03:31:40.922029 #3324821] INFO -- : exts.mk unchanged I, [2024-05-24T03:31:40.926685 #3324821] INFO -- : make[1]: Entering directory '/tmp/ruby/build/trunk' I, [2024-05-24T03:31:40.944575 #3324821] INFO -- : make[2]: Entering directory '/tmp/ruby/build/trunk/ext/digest' I, [2024-05-24T03:31:40.946251 #3324821] INFO -- : make[2]: Entering directory '/tmp/ruby/build/trunk/ext/coverage' I, [2024-05-24T03:31:40.946377 #3324821] INFO -- : make[2]: Entering directory '/tmp/ruby/build/trunk/ext/json' I, [2024-05-24T03:31:40.946965 #3324821] INFO -- : make[2]: Entering directory '/tmp/ruby/build/trunk/ext/date' I, [2024-05-24T03:31:40.947484 #3324821] INFO -- : make[2]: Entering directory '/tmp/ruby/build/trunk/ext/io/console' I, [2024-05-24T03:31:40.948338 #3324821] INFO -- : make[2]: Entering directory '/tmp/ruby/build/trunk/ext/monitor' I, [2024-05-24T03:31:40.948363 #3324821] INFO -- : make[2]: Leaving directory '/tmp/ruby/build/trunk/ext/digest' I, [2024-05-24T03:31:40.948761 #3324821] INFO -- : make[2]: Entering directory '/tmp/ruby/build/trunk/ext/rubyvm' I, [2024-05-24T03:31:40.949007 #3324821] INFO -- : make[2]: Entering directory '/tmp/ruby/build/trunk/ext/pathname' I, [2024-05-24T03:31:40.949331 #3324821] INFO -- : make[2]: Entering directory '/tmp/ruby/build/trunk/ext/fiddle' I, [2024-05-24T03:31:40.949445 #3324821] INFO -- : make[2]: Entering directory '/tmp/ruby/build/trunk/ext/pty' I, [2024-05-24T03:31:40.950220 #3324821] INFO -- : make[2]: Leaving directory '/tmp/ruby/build/trunk/ext/coverage' I, [2024-05-24T03:31:40.950320 #3324821] INFO -- : make[2]: Leaving directory '/tmp/ruby/build/trunk/ext/io/console' I, [2024-05-24T03:31:40.950751 #3324821] INFO -- : make[2]: Leaving directory '/tmp/ruby/build/trunk/ext/date' I, [2024-05-24T03:31:40.950781 #3324821] INFO -- : make[2]: Entering directory '/tmp/ruby/build/trunk/ext/objspace' I, [2024-05-24T03:31:40.950954 #3324821] INFO -- : make[2]: Leaving directory '/tmp/ruby/build/trunk/ext/monitor' I, [2024-05-24T03:31:40.951405 #3324821] INFO -- : make[2]: Leaving directory '/tmp/ruby/build/trunk/ext/rubyvm' I, [2024-05-24T03:31:40.951435 #3324821] INFO -- : make[2]: Entering directory '/tmp/ruby/build/trunk/ext/psych' I, [2024-05-24T03:31:40.951608 #3324821] INFO -- : make[2]: Entering directory '/tmp/ruby/build/trunk/.bundle/gems/bigdecimal-3.1.8/ext/bigdecimal' I, [2024-05-24T03:31:40.952642 #3324821] INFO -- : make[2]: Leaving directory '/tmp/ruby/build/trunk/ext/pty' I, [2024-05-24T03:31:40.952667 #3324821] INFO -- : make[2]: Entering directory '/tmp/ruby/build/trunk/.bundle/gems/debug-1.9.2/ext/debug' I, [2024-05-24T03:31:40.952721 #3324821] INFO -- : make[2]: Entering directory '/tmp/ruby/build/trunk/.bundle/gems/nkf-0.2.0/ext/nkf' I, [2024-05-24T03:31:40.953020 #3324821] INFO -- : make[2]: Entering directory '/tmp/ruby/build/trunk/.bundle/gems/racc-1.7.3/ext/racc/cparse' I, [2024-05-24T03:31:40.953500 #3324821] INFO -- : make[2]: Entering directory '/tmp/ruby/build/trunk/.bundle/gems/syslog-0.1.2/ext/syslog' I, [2024-05-24T03:31:40.953609 #3324821] INFO -- : make[2]: Entering directory '/tmp/ruby/build/trunk/.bundle/gems/rbs-3.4.4/ext/rbs_extension' I, [2024-05-24T03:31:40.953865 #3324821] INFO -- : make[2]: Entering directory '/tmp/ruby/build/trunk/.bundle/gems/racc-1.8.0/ext/racc/cparse' I, [2024-05-24T03:31:40.954510 #3324821] INFO -- : make[2]: Entering directory '/tmp/ruby/build/trunk/ext/ripper' I, [2024-05-24T03:31:40.955067 #3324821] INFO -- : make[2]: Leaving directory '/tmp/ruby/build/trunk/ext/pathname' I, [2024-05-24T03:31:40.955251 #3324821] INFO -- : make[2]: Leaving directory '/tmp/ruby/build/trunk/ext/objspace' I, [2024-05-24T03:31:40.955868 #3324821] INFO -- : make[2]: Leaving directory '/tmp/ruby/build/trunk/ext/json' I, [2024-05-24T03:31:40.956596 #3324821] INFO -- : make[2]: Leaving directory '/tmp/ruby/build/trunk/ext/fiddle' I, [2024-05-24T03:31:40.958805 #3324821] INFO -- : make[2]: Entering directory '/tmp/ruby/build/trunk/ext/socket' I, [2024-05-24T03:31:40.959860 #3324821] INFO -- : make[2]: Leaving directory '/tmp/ruby/build/trunk/ext/ripper' I, [2024-05-24T03:31:40.960000 #3324821] INFO -- : make[2]: Entering directory '/tmp/ruby/build/trunk/ext/openssl' I, [2024-05-24T03:31:40.964107 #3324821] INFO -- : make[2]: Leaving directory '/tmp/ruby/build/trunk/ext/psych' I, [2024-05-24T03:31:40.964989 #3324821] INFO -- : make[2]: Leaving directory '/tmp/ruby/build/trunk/ext/socket' I, [2024-05-24T03:31:40.967010 #3324821] INFO -- : make[2]: Entering directory '/tmp/ruby/build/trunk/ext/digest/sha2' I, [2024-05-24T03:31:40.969371 #3324821] INFO -- : make[2]: Leaving directory '/tmp/ruby/build/trunk/ext/digest/sha2' I, [2024-05-24T03:31:40.972051 #3324821] INFO -- : make[2]: Leaving directory '/tmp/ruby/build/trunk/ext/openssl' I, [2024-05-24T03:31:40.976783 #3324821] INFO -- : make[2]: Leaving directory '/tmp/ruby/build/trunk/.bundle/gems/nkf-0.2.0/ext/nkf' I, [2024-05-24T03:31:40.977001 #3324821] INFO -- : make[2]: Leaving directory '/tmp/ruby/build/trunk/.bundle/gems/rbs-3.4.4/ext/rbs_extension' I, [2024-05-24T03:31:40.977204 #3324821] INFO -- : make[2]: Leaving directory '/tmp/ruby/build/trunk/.bundle/gems/bigdecimal-3.1.8/ext/bigdecimal' I, [2024-05-24T03:31:40.977244 #3324821] INFO -- : make[2]: Leaving directory '/tmp/ruby/build/trunk/.bundle/gems/debug-1.9.2/ext/debug' I, [2024-05-24T03:31:40.984030 #3324821] INFO -- : make[2]: Leaving directory '/tmp/ruby/build/trunk/.bundle/gems/syslog-0.1.2/ext/syslog' I, [2024-05-24T03:31:40.985982 #3324821] INFO -- : make[2]: Leaving directory '/tmp/ruby/build/trunk/.bundle/gems/racc-1.7.3/ext/racc/cparse' I, [2024-05-24T03:31:40.990535 #3324821] INFO -- : make[2]: Leaving directory '/tmp/ruby/build/trunk/.bundle/gems/racc-1.8.0/ext/racc/cparse' I, [2024-05-24T03:31:41.014874 #3324821] INFO -- : make[2]: Entering directory '/tmp/ruby/build/trunk' I, [2024-05-24T03:31:41.084813 #3324821] INFO -- : linking ruby I, [2024-05-24T03:31:41.107336 #3324821] INFO -- : make[2]: Leaving directory '/tmp/ruby/build/trunk' I, [2024-05-24T03:31:41.107910 #3324821] INFO -- : make[1]: Leaving directory '/tmp/ruby/build/trunk' I, [2024-05-24T03:31:41.111831 #3324821] INFO -- : make[1]: Entering directory '/tmp/ruby/build/trunk' I, [2024-05-24T03:31:41.111858 #3324821] INFO -- : make[1]: Nothing to be done for 'note'. I, [2024-05-24T03:31:41.111864 #3324821] INFO -- : make[1]: Leaving directory '/tmp/ruby/build/trunk' I, [2024-05-24T03:31:41.112518 #3324821] INFO -- : $$$[end] "make all -j20" exit with 0. I, [2024-05-24T03:31:41.112653 #3324821] INFO -- : $$$[beg] make install -j20 I, [2024-05-24T03:31:41.178843 #3324821] INFO -- : Update power_assert to 84e85124c5014a139af39161d484156cfe87a9ed I, [2024-05-24T03:31:41.179074 #3324821] INFO -- : Update rbs to ba7872795d5de04adb8ff500c0e6afdc81a041dd I, [2024-05-24T03:31:41.179788 #3324821] INFO -- : Update typeprof to b19a6416da3a05d57fadd6ffdadb382b6d236ca5 I, [2024-05-24T03:31:41.180956 #3324821] INFO -- : echo 84e85124c5014a139af39161d484156cfe87a9ed | /bin/sh /tmp/ruby/src/trunk/tool/ifchange /tmp/ruby/src/trunk/.bundle/.timestamp/power_assert.revision - I, [2024-05-24T03:31:41.182138 #3324821] INFO -- : BASERUBY = /usr/bin/ruby --disable=gems I, [2024-05-24T03:31:41.182174 #3324821] INFO -- : CC = gcc I, [2024-05-24T03:31:41.182183 #3324821] INFO -- : LD = ld I, [2024-05-24T03:31:41.182190 #3324821] INFO -- : LDSHARED = gcc -shared I, [2024-05-24T03:31:41.182196 #3324821] INFO -- : CFLAGS = -O3 -fno-fast-math -ggdb3 -Wall -Wextra -Wdeprecated-declarations -Wdiv-by-zero -Wduplicated-cond -Wimplicit-function-declaration -Wimplicit-int -Wpointer-arith -Wwrite-strings -Wold-style-definition -Wimplicit-fallthrough=0 -Wmissing-noreturn -Wno-cast-function-type -Wno-constant-logical-operand -Wno-long-long -Wno-missing-field-initializers -Wno-overlength-strings -Wno-packed-bitfield-compat -Wno-parentheses-equality -Wno-self-assign -Wno-tautological-compare -Wno-unused-parameter -Wno-unused-value -Wsuggest-attribute=format -Wsuggest-attribute=noreturn -Wunused-variable -Wmisleading-indentation -Wundef -fPIC I, [2024-05-24T03:31:41.182204 #3324821] INFO -- : XCFLAGS = -U_FORTIFY_SOURCE -D_FORTIFY_SOURCE=2 -fstack-protector-strong -fno-strict-overflow -fvisibility=hidden -fexcess-precision=standard -DRUBY_EXPORT -I. -I.ext/include/x86_64-linux -I/tmp/ruby/src/trunk/include -I/tmp/ruby/src/trunk -I/tmp/ruby/src/trunk/prism -I/tmp/ruby/src/trunk/enc/unicode/15.0.0 I, [2024-05-24T03:31:41.182213 #3324821] INFO -- : CPPFLAGS = I, [2024-05-24T03:31:41.182222 #3324821] INFO -- : DLDFLAGS = -Wl,--compress-debug-sections=zlib -Wl,-soname,libruby.so.3.4 -fstack-protector-strong I, [2024-05-24T03:31:41.182232 #3324821] INFO -- : SOLIBS = -lz -lrt -lrt -lgmp -ldl -lcrypt -lm -lpthread I, [2024-05-24T03:31:41.182244 #3324821] INFO -- : LANG = en_US.UTF-8 I, [2024-05-24T03:31:41.182253 #3324821] INFO -- : LC_ALL = I, [2024-05-24T03:31:41.182262 #3324821] INFO -- : LC_CTYPE = I, [2024-05-24T03:31:41.182272 #3324821] INFO -- : MFLAGS = -j20 --jobserver-auth=4,5 I, [2024-05-24T03:31:41.182290 #3324821] INFO -- : RUSTC = no I, [2024-05-24T03:31:41.182300 #3324821] INFO -- : YJIT_RUSTC_ARGS = --crate-name=yjit --crate-type=staticlib --edition=2021 -g -C lto=thin -C opt-level=3 -C overflow-checks=on '--out-dir=/tmp/ruby/build/trunk/yjit/target/release/' /tmp/ruby/src/trunk/yjit/src/lib.rs I, [2024-05-24T03:31:41.183951 #3324821] INFO -- : /tmp/ruby/src/trunk/.bundle/.timestamp/power_assert.revision unchanged I, [2024-05-24T03:31:41.213150 #3324821] INFO -- : echo ba7872795d5de04adb8ff500c0e6afdc81a041dd | /bin/sh /tmp/ruby/src/trunk/tool/ifchange /tmp/ruby/src/trunk/.bundle/.timestamp/rbs.revision - I, [2024-05-24T03:31:41.213314 #3324821] INFO -- : echo b19a6416da3a05d57fadd6ffdadb382b6d236ca5 | /bin/sh /tmp/ruby/src/trunk/tool/ifchange /tmp/ruby/src/trunk/.bundle/.timestamp/typeprof.revision - I, [2024-05-24T03:31:41.214080 #3324821] INFO -- : generating encdb.h I, [2024-05-24T03:31:41.214105 #3324821] INFO -- : gcc (Ubuntu 11.4.0-1ubuntu1~22.04) 11.4.0 I, [2024-05-24T03:31:41.214114 #3324821] INFO -- : Copyright (C) 2021 Free Software Foundation, Inc. I, [2024-05-24T03:31:41.214120 #3324821] INFO -- : This is free software; see the source for copying conditions. There is NO I, [2024-05-24T03:31:41.214125 #3324821] INFO -- : warranty; not even for MERCHANTABILITY or FITNESS FOR A PARTICULAR PURPOSE. I, [2024-05-24T03:31:41.214132 #3324821] INFO -- : I, [2024-05-24T03:31:41.214933 #3324821] INFO -- : generating enc.mk I, [2024-05-24T03:31:41.215067 #3324821] INFO -- : /tmp/ruby/src/trunk/.bundle/.timestamp/rbs.revision unchanged I, [2024-05-24T03:31:41.215285 #3324821] INFO -- : /tmp/ruby/src/trunk/.bundle/.timestamp/typeprof.revision unchanged I, [2024-05-24T03:31:41.238459 #3324821] INFO -- : encdb.h unchanged I, [2024-05-24T03:31:41.239654 #3324821] INFO -- : Building power_assert@84e85124c5014a139af39161d484156cfe87a9ed to /tmp/ruby/src/trunk/gems/power_assert-2.0.3.gem I, [2024-05-24T03:31:41.308414 #3324821] INFO -- : Successfully built RubyGem I, [2024-05-24T03:31:41.308466 #3324821] INFO -- : Name: power_assert I, [2024-05-24T03:31:41.308474 #3324821] INFO -- : Version: 2.0.4dev I, [2024-05-24T03:31:41.308480 #3324821] INFO -- : File: power_assert-2.0.4dev.gem I, [2024-05-24T03:31:41.310417 #3324821] INFO -- : Extracting bundle gem power_assert-2.0.3... I, [2024-05-24T03:31:41.336498 #3324821] INFO -- : making srcs under enc I, [2024-05-24T03:31:41.336744 #3324821] INFO -- : making enc I, [2024-05-24T03:31:41.354418 #3324821] INFO -- : make[1]: Entering directory '/tmp/ruby/build/trunk' I, [2024-05-24T03:31:41.354445 #3324821] INFO -- : make[1]: Nothing to be done for 'enc'. I, [2024-05-24T03:31:41.354451 #3324821] INFO -- : make[1]: Leaving directory '/tmp/ruby/build/trunk' I, [2024-05-24T03:31:41.367033 #3324821] INFO -- : make[1]: Entering directory '/tmp/ruby/build/trunk' I, [2024-05-24T03:31:41.367053 #3324821] INFO -- : make[1]: Nothing to be done for 'srcs'. I, [2024-05-24T03:31:41.367059 #3324821] INFO -- : make[1]: Leaving directory '/tmp/ruby/build/trunk' I, [2024-05-24T03:31:41.367747 #3324821] INFO -- : generating transdb.h I, [2024-05-24T03:31:41.372346 #3324821] INFO -- : Try with hash version of bundled gems instead of gems/power_assert-2.0.3.gem. We don't use this gem with release version of Ruby. I, [2024-05-24T03:31:41.377342 #3324821] INFO -- : Unpacked gems/power_assert-2.0.4dev.gem I, [2024-05-24T03:31:41.463818 #3324821] INFO -- : transdb.h unchanged I, [2024-05-24T03:31:41.465577 #3324821] INFO -- : generating makefiles ext/configure-ext.mk I, [2024-05-24T03:31:41.465796 #3324821] INFO -- : making trans I, [2024-05-24T03:31:41.493047 #3324821] INFO -- : ext/configure-ext.mk unchanged I, [2024-05-24T03:31:41.495334 #3324821] INFO -- : make[1]: Entering directory '/tmp/ruby/build/trunk' I, [2024-05-24T03:31:41.501432 #3324821] INFO -- : make[1]: Entering directory '/tmp/ruby/build/trunk' I, [2024-05-24T03:31:41.501520 #3324821] INFO -- : make[1]: Nothing to be done for 'trans'. I, [2024-05-24T03:31:41.501543 #3324821] INFO -- : make[1]: Leaving directory '/tmp/ruby/build/trunk' I, [2024-05-24T03:31:41.502527 #3324821] INFO -- : making encs I, [2024-05-24T03:31:41.560510 #3324821] INFO -- : make[1]: Entering directory '/tmp/ruby/build/trunk' I, [2024-05-24T03:31:41.560582 #3324821] INFO -- : make[1]: Nothing to be done for 'encs'. I, [2024-05-24T03:31:41.560611 #3324821] INFO -- : make[1]: Leaving directory '/tmp/ruby/build/trunk' I, [2024-05-24T03:31:41.646740 #3324821] INFO -- : make[1]: Leaving directory '/tmp/ruby/build/trunk' I, [2024-05-24T03:31:41.647284 #3324821] INFO -- : generating makefile exts.mk I, [2024-05-24T03:31:41.684249 #3324821] INFO -- : exts.mk unchanged I, [2024-05-24T03:31:41.689473 #3324821] INFO -- : make[1]: Entering directory '/tmp/ruby/build/trunk' I, [2024-05-24T03:31:41.707967 #3324821] INFO -- : make[2]: Entering directory '/tmp/ruby/build/trunk/ext/digest' I, [2024-05-24T03:31:41.709369 #3324821] INFO -- : make[2]: Entering directory '/tmp/ruby/build/trunk/ext/json' I, [2024-05-24T03:31:41.709475 #3324821] INFO -- : make[2]: Entering directory '/tmp/ruby/build/trunk/ext/io/console' I, [2024-05-24T03:31:41.709580 #3324821] INFO -- : make[2]: Entering directory '/tmp/ruby/build/trunk/ext/coverage' I, [2024-05-24T03:31:41.710328 #3324821] INFO -- : make[2]: Entering directory '/tmp/ruby/build/trunk/ext/date' I, [2024-05-24T03:31:41.710594 #3324821] INFO -- : make[2]: Entering directory '/tmp/ruby/build/trunk/ext/rubyvm' I, [2024-05-24T03:31:41.711255 #3324821] INFO -- : make[2]: Entering directory '/tmp/ruby/build/trunk/ext/monitor' I, [2024-05-24T03:31:41.712108 #3324821] INFO -- : make[2]: Entering directory '/tmp/ruby/build/trunk/ext/pathname' I, [2024-05-24T03:31:41.712304 #3324821] INFO -- : make[2]: Entering directory '/tmp/ruby/build/trunk/ext/pty' I, [2024-05-24T03:31:41.712330 #3324821] INFO -- : make[2]: Entering directory '/tmp/ruby/build/trunk/ext/fiddle' I, [2024-05-24T03:31:41.712793 #3324821] INFO -- : make[2]: Leaving directory '/tmp/ruby/build/trunk/ext/io/console' I, [2024-05-24T03:31:41.713258 #3324821] INFO -- : make[2]: Leaving directory '/tmp/ruby/build/trunk/ext/rubyvm' I, [2024-05-24T03:31:41.713486 #3324821] INFO -- : make[2]: Leaving directory '/tmp/ruby/build/trunk/ext/coverage' I, [2024-05-24T03:31:41.713518 #3324821] INFO -- : make[2]: Entering directory '/tmp/ruby/build/trunk/ext/objspace' I, [2024-05-24T03:31:41.714201 #3324821] INFO -- : make[2]: Entering directory '/tmp/ruby/build/trunk/ext/psych' I, [2024-05-24T03:31:41.714352 #3324821] INFO -- : make[2]: Leaving directory '/tmp/ruby/build/trunk/ext/digest' I, [2024-05-24T03:31:41.714373 #3324821] INFO -- : make[2]: Leaving directory '/tmp/ruby/build/trunk/ext/monitor' I, [2024-05-24T03:31:41.714485 #3324821] INFO -- : make[2]: Leaving directory '/tmp/ruby/build/trunk/ext/date' I, [2024-05-24T03:31:41.715068 #3324821] INFO -- : make[2]: Entering directory '/tmp/ruby/build/trunk/.bundle/gems/bigdecimal-3.1.8/ext/bigdecimal' I, [2024-05-24T03:31:41.715393 #3324821] INFO -- : make[2]: Leaving directory '/tmp/ruby/build/trunk/ext/pathname' I, [2024-05-24T03:31:41.715623 #3324821] INFO -- : make[2]: Leaving directory '/tmp/ruby/build/trunk/ext/pty' I, [2024-05-24T03:31:41.716914 #3324821] INFO -- : make[2]: Entering directory '/tmp/ruby/build/trunk/.bundle/gems/debug-1.9.2/ext/debug' I, [2024-05-24T03:31:41.717125 #3324821] INFO -- : make[2]: Entering directory '/tmp/ruby/build/trunk/ext/ripper' I, [2024-05-24T03:31:41.717264 #3324821] INFO -- : make[2]: Entering directory '/tmp/ruby/build/trunk/.bundle/gems/nkf-0.2.0/ext/nkf' I, [2024-05-24T03:31:41.717289 #3324821] INFO -- : make[2]: Entering directory '/tmp/ruby/build/trunk/.bundle/gems/racc-1.7.3/ext/racc/cparse' I, [2024-05-24T03:31:41.717669 #3324821] INFO -- : make[2]: Leaving directory '/tmp/ruby/build/trunk/ext/objspace' I, [2024-05-24T03:31:41.717859 #3324821] INFO -- : make[2]: Entering directory '/tmp/ruby/build/trunk/.bundle/gems/racc-1.8.0/ext/racc/cparse' I, [2024-05-24T03:31:41.718136 #3324821] INFO -- : make[2]: Entering directory '/tmp/ruby/build/trunk/.bundle/gems/syslog-0.1.2/ext/syslog' I, [2024-05-24T03:31:41.718447 #3324821] INFO -- : make[2]: Entering directory '/tmp/ruby/build/trunk/.bundle/gems/rbs-3.4.4/ext/rbs_extension' I, [2024-05-24T03:31:41.718940 #3324821] INFO -- : make[2]: Leaving directory '/tmp/ruby/build/trunk/ext/json' I, [2024-05-24T03:31:41.719717 #3324821] INFO -- : make[2]: Leaving directory '/tmp/ruby/build/trunk/ext/fiddle' I, [2024-05-24T03:31:41.721095 #3324821] INFO -- : make[2]: Entering directory '/tmp/ruby/build/trunk/ext/digest/sha2' I, [2024-05-24T03:31:41.721789 #3324821] INFO -- : make[2]: Entering directory '/tmp/ruby/build/trunk/ext/socket' I, [2024-05-24T03:31:41.724406 #3324821] INFO -- : make[2]: Leaving directory '/tmp/ruby/build/trunk/ext/digest/sha2' I, [2024-05-24T03:31:41.724537 #3324821] INFO -- : make[2]: Leaving directory '/tmp/ruby/build/trunk/ext/ripper' I, [2024-05-24T03:31:41.725963 #3324821] INFO -- : make[2]: Entering directory '/tmp/ruby/build/trunk/ext/openssl' I, [2024-05-24T03:31:41.726302 #3324821] INFO -- : make[2]: Leaving directory '/tmp/ruby/build/trunk/ext/psych' I, [2024-05-24T03:31:41.728316 #3324821] INFO -- : make[2]: Leaving directory '/tmp/ruby/build/trunk/ext/socket' I, [2024-05-24T03:31:41.737417 #3324821] INFO -- : make[2]: Leaving directory '/tmp/ruby/build/trunk/ext/openssl' I, [2024-05-24T03:31:41.739667 #3324821] INFO -- : make[2]: Leaving directory '/tmp/ruby/build/trunk/.bundle/gems/debug-1.9.2/ext/debug' I, [2024-05-24T03:31:41.739766 #3324821] INFO -- : make[2]: Leaving directory '/tmp/ruby/build/trunk/.bundle/gems/bigdecimal-3.1.8/ext/bigdecimal' I, [2024-05-24T03:31:41.742627 #3324821] INFO -- : make[2]: Leaving directory '/tmp/ruby/build/trunk/.bundle/gems/rbs-3.4.4/ext/rbs_extension' I, [2024-05-24T03:31:41.743562 #3324821] INFO -- : make[2]: Leaving directory '/tmp/ruby/build/trunk/.bundle/gems/racc-1.7.3/ext/racc/cparse' I, [2024-05-24T03:31:41.745646 #3324821] INFO -- : make[2]: Leaving directory '/tmp/ruby/build/trunk/.bundle/gems/syslog-0.1.2/ext/syslog' I, [2024-05-24T03:31:41.748395 #3324821] INFO -- : make[2]: Leaving directory '/tmp/ruby/build/trunk/.bundle/gems/nkf-0.2.0/ext/nkf' I, [2024-05-24T03:31:41.751808 #3324821] INFO -- : make[2]: Leaving directory '/tmp/ruby/build/trunk/.bundle/gems/racc-1.8.0/ext/racc/cparse' I, [2024-05-24T03:31:41.776656 #3324821] INFO -- : make[2]: Entering directory '/tmp/ruby/build/trunk' I, [2024-05-24T03:31:41.845488 #3324821] INFO -- : make[2]: 'ruby' is up to date. I, [2024-05-24T03:31:41.845550 #3324821] INFO -- : make[2]: Leaving directory '/tmp/ruby/build/trunk' I, [2024-05-24T03:31:41.845833 #3324821] INFO -- : make[1]: Leaving directory '/tmp/ruby/build/trunk' I, [2024-05-24T03:31:41.850025 #3324821] INFO -- : make[1]: Entering directory '/tmp/ruby/build/trunk' I, [2024-05-24T03:31:41.850078 #3324821] INFO -- : make[1]: Nothing to be done for 'note'. I, [2024-05-24T03:31:41.850091 #3324821] INFO -- : make[1]: Leaving directory '/tmp/ruby/build/trunk' I, [2024-05-24T03:31:41.850321 #3324821] INFO -- : ./miniruby -I/tmp/ruby/src/trunk/lib -I. -I.ext/common /tmp/ruby/src/trunk/tool/runruby.rb --extout=.ext -- --disable-gems -r./x86_64-linux-fake /tmp/ruby/src/trunk/tool/rbinstall.rb --make="make" --dest-dir="" --extout=".ext" --ext-build-dir="./ext" --mflags="-j20 --jobserver-auth=4,5" --make-flags=" -j20 --jobserver-auth=4,5" --data-mode=0644 --prog-mode=0755 --installed-list .installed.list --mantype="doc" --gnumake --install=all --exclude=doc I, [2024-05-24T03:31:41.949738 #3324821] INFO -- : Installing to I, [2024-05-24T03:31:41.949817 #3324821] INFO -- : installing binary commands: /tmp/ruby/install/trunk/bin I, [2024-05-24T03:31:41.949838 #3324821] INFO -- : installing base libraries: /tmp/ruby/install/trunk/lib I, [2024-05-24T03:31:41.956878 #3324821] INFO -- : installing arch files: /tmp/ruby/install/trunk/lib/ruby/3.4.0+0/x86_64-linux I, [2024-05-24T03:31:41.956938 #3324821] INFO -- : installing pkgconfig data: /tmp/ruby/install/trunk/lib/pkgconfig I, [2024-05-24T03:31:41.956961 #3324821] INFO -- : installing extension objects: /tmp/ruby/install/trunk/lib/ruby/3.4.0+0/x86_64-linux I, [2024-05-24T03:31:41.966620 #3324821] INFO -- : installing extension objects: /tmp/ruby/install/trunk/lib/ruby/site_ruby/3.4.0+0/x86_64-linux I, [2024-05-24T03:31:41.966682 #3324821] INFO -- : installing extension objects: /tmp/ruby/install/trunk/lib/ruby/vendor_ruby/3.4.0+0/x86_64-linux I, [2024-05-24T03:31:41.966698 #3324821] INFO -- : installing extension headers: /tmp/ruby/install/trunk/include/ruby-3.4.0+0/x86_64-linux I, [2024-05-24T03:31:41.966720 #3324821] INFO -- : installing extension scripts: /tmp/ruby/install/trunk/lib/ruby/3.4.0+0 I, [2024-05-24T03:31:41.969566 #3324821] INFO -- : installing extension scripts: /tmp/ruby/install/trunk/lib/ruby/site_ruby/3.4.0+0 I, [2024-05-24T03:31:41.969628 #3324821] INFO -- : installing extension scripts: /tmp/ruby/install/trunk/lib/ruby/vendor_ruby/3.4.0+0 I, [2024-05-24T03:31:41.969642 #3324821] INFO -- : installing extension headers: /tmp/ruby/install/trunk/include/ruby-3.4.0+0/ruby I, [2024-05-24T03:31:41.969654 #3324821] INFO -- : installing command scripts: /tmp/ruby/install/trunk/bin I, [2024-05-24T03:31:41.969668 #3324821] INFO -- : installing library scripts: /tmp/ruby/install/trunk/lib/ruby/3.4.0+0 I, [2024-05-24T03:31:42.002578 #3324821] INFO -- : installing common headers: /tmp/ruby/install/trunk/include/ruby-3.4.0+0 I, [2024-05-24T03:31:42.008731 #3324821] INFO -- : installing manpages: /tmp/ruby/install/trunk/share/man/man1 I, [2024-05-24T03:31:42.008799 #3324821] INFO -- : installing default gems from lib: /tmp/ruby/install/trunk/lib/ruby/gems/3.4.0+0 I, [2024-05-24T03:31:42.031417 #3324821] INFO -- : benchmark 0.3.0 I, [2024-05-24T03:31:42.033415 #3324821] INFO -- : bundler 2.6.0.dev I, [2024-05-24T03:31:42.035521 #3324821] INFO -- : cgi 0.4.1 I, [2024-05-24T03:31:42.036004 #3324821] INFO -- : delegate 0.3.1 I, [2024-05-24T03:31:42.036539 #3324821] INFO -- : did_you_mean 1.6.3 I, [2024-05-24T03:31:42.036984 #3324821] INFO -- : english 0.8.0 I, [2024-05-24T03:31:42.037849 #3324821] INFO -- : erb 4.0.4 I, [2024-05-24T03:31:42.038962 #3324821] INFO -- : error_highlight 0.6.0 I, [2024-05-24T03:31:42.039754 #3324821] INFO -- : fileutils 1.7.2 I, [2024-05-24T03:31:42.040508 #3324821] INFO -- : find 0.2.0 I, [2024-05-24T03:31:42.041561 #3324821] INFO -- : forwardable 1.3.3 I, [2024-05-24T03:31:42.042181 #3324821] INFO -- : ipaddr 1.2.6 I, [2024-05-24T03:31:42.042653 #3324821] INFO -- : irb 1.13.1 I, [2024-05-24T03:31:42.043423 #3324821] INFO -- : logger 1.6.0 I, [2024-05-24T03:31:42.043919 #3324821] INFO -- : net-http 0.4.1 I, [2024-05-24T03:31:42.044402 #3324821] INFO -- : net-protocol 0.2.2 I, [2024-05-24T03:31:42.044907 #3324821] INFO -- : open-uri 0.4.1 I, [2024-05-24T03:31:42.045318 #3324821] INFO -- : open3 0.2.1 I, [2024-05-24T03:31:42.045840 #3324821] INFO -- : optparse 0.5.0 I, [2024-05-24T03:31:42.046263 #3324821] INFO -- : ostruct 0.6.0 I, [2024-05-24T03:31:42.046728 #3324821] INFO -- : pp 0.5.0 I, [2024-05-24T03:31:42.047271 #3324821] INFO -- : prettyprint 0.2.0 I, [2024-05-24T03:31:42.047712 #3324821] INFO -- : prism 0.29.0 I, [2024-05-24T03:31:42.048283 #3324821] INFO -- : pstore 0.1.3 I, [2024-05-24T03:31:42.048740 #3324821] INFO -- : rdoc 6.7.0 I, [2024-05-24T03:31:42.049734 #3324821] INFO -- : readline 0.0.4 I, [2024-05-24T03:31:42.050216 #3324821] INFO -- : reline 0.5.7 I, [2024-05-24T03:31:42.050715 #3324821] INFO -- : resolv 0.4.0 I, [2024-05-24T03:31:42.051154 #3324821] INFO -- : ruby2_keywords 0.0.5 I, [2024-05-24T03:31:42.052230 #3324821] INFO -- : securerandom 0.3.1 I, [2024-05-24T03:31:42.052960 #3324821] INFO -- : set 1.1.0 I, [2024-05-24T03:31:42.053459 #3324821] INFO -- : shellwords 0.2.0 I, [2024-05-24T03:31:42.053936 #3324821] INFO -- : singleton 0.2.0 I, [2024-05-24T03:31:42.054373 #3324821] INFO -- : syntax_suggest 2.0.0 I, [2024-05-24T03:31:42.055052 #3324821] INFO -- : tempfile 0.2.1 I, [2024-05-24T03:31:42.055534 #3324821] INFO -- : time 0.3.0 I, [2024-05-24T03:31:42.056095 #3324821] INFO -- : timeout 0.4.1 I, [2024-05-24T03:31:42.056481 #3324821] INFO -- : tmpdir 0.2.0 I, [2024-05-24T03:31:42.057032 #3324821] INFO -- : tsort 0.2.0 I, [2024-05-24T03:31:42.057419 #3324821] INFO -- : un 0.3.0 I, [2024-05-24T03:31:42.057964 #3324821] INFO -- : uri 0.13.0 I, [2024-05-24T03:31:42.058456 #3324821] INFO -- : weakref 0.1.3 I, [2024-05-24T03:31:42.058868 #3324821] INFO -- : yaml 0.3.0 I, [2024-05-24T03:31:42.059280 #3324821] INFO -- : installing default gems from ext: /tmp/ruby/install/trunk/lib/ruby/gems/3.4.0+0 I, [2024-05-24T03:31:42.065823 #3324821] INFO -- : date 3.3.4 I, [2024-05-24T03:31:42.066420 #3324821] INFO -- : digest 3.1.1 I, [2024-05-24T03:31:42.066894 #3324821] INFO -- : etc 1.4.3 I, [2024-05-24T03:31:42.067420 #3324821] INFO -- : fcntl 1.1.0 I, [2024-05-24T03:31:42.067932 #3324821] INFO -- : fiddle 1.1.3 I, [2024-05-24T03:31:42.068368 #3324821] INFO -- : io-console 0.7.2 I, [2024-05-24T03:31:42.068843 #3324821] INFO -- : io-nonblock 0.3.0 I, [2024-05-24T03:31:42.069240 #3324821] INFO -- : io-wait 0.3.1 I, [2024-05-24T03:31:42.069712 #3324821] INFO -- : json 2.7.2 I, [2024-05-24T03:31:42.070319 #3324821] INFO -- : openssl 3.2.0 I, [2024-05-24T03:31:42.070811 #3324821] INFO -- : pathname 0.3.0 I, [2024-05-24T03:31:42.071279 #3324821] INFO -- : psych 5.1.2 I, [2024-05-24T03:31:42.071860 #3324821] INFO -- : stringio 3.1.1 I, [2024-05-24T03:31:42.072395 #3324821] INFO -- : strscan 3.1.1 I, [2024-05-24T03:31:42.072842 #3324821] INFO -- : zlib 3.1.0 I, [2024-05-24T03:31:42.073216 #3324821] INFO -- : installing bundled gems: /tmp/ruby/install/trunk/lib/ruby/gems/3.4.0+0 I, [2024-05-24T03:31:42.073785 #3324821] INFO -- : minitest 5.23.1 I, [2024-05-24T03:31:42.082396 #3324821] INFO -- : rake 13.2.1 I, [2024-05-24T03:31:42.085803 #3324821] INFO -- : test-unit 3.6.2 I, [2024-05-24T03:31:42.090798 #3324821] INFO -- : rexml 3.2.8 I, [2024-05-24T03:31:42.094542 #3324821] INFO -- : rss 0.3.0 I, [2024-05-24T03:31:42.097181 #3324821] INFO -- : net-ftp 0.3.4 I, [2024-05-24T03:31:42.098790 #3324821] INFO -- : net-imap 0.4.11 I, [2024-05-24T03:31:42.102535 #3324821] INFO -- : net-pop 0.1.2 I, [2024-05-24T03:31:42.103538 #3324821] INFO -- : net-smtp 0.5.0 I, [2024-05-24T03:31:42.104885 #3324821] INFO -- : matrix 0.4.2 I, [2024-05-24T03:31:42.108190 #3324821] INFO -- : prime 0.1.2 I, [2024-05-24T03:31:42.113087 #3324821] INFO -- : rbs 3.4.4 I, [2024-05-24T03:31:42.135086 #3324821] INFO -- : typeprof 0.21.11 I, [2024-05-24T03:31:42.137804 #3324821] INFO -- : debug 1.9.2 I, [2024-05-24T03:31:42.141076 #3324821] INFO -- : racc 1.8.0 I, [2024-05-24T03:31:42.143738 #3324821] INFO -- : mutex_m 0.2.0 I, [2024-05-24T03:31:42.145294 #3324821] INFO -- : getoptlong 0.2.1 I, [2024-05-24T03:31:42.146666 #3324821] INFO -- : base64 0.2.0 I, [2024-05-24T03:31:42.147770 #3324821] INFO -- : bigdecimal 3.1.8 I, [2024-05-24T03:31:42.150327 #3324821] INFO -- : observer 0.1.2 I, [2024-05-24T03:31:42.151481 #3324821] INFO -- : abbrev 0.1.2 I, [2024-05-24T03:31:42.152944 #3324821] INFO -- : resolv-replace 0.1.1 I, [2024-05-24T03:31:42.154190 #3324821] INFO -- : rinda 0.2.0 I, [2024-05-24T03:31:42.155531 #3324821] INFO -- : drb 2.2.1 I, [2024-05-24T03:31:42.157128 #3324821] INFO -- : nkf 0.2.0 I, [2024-05-24T03:31:42.159587 #3324821] INFO -- : syslog 0.1.2 I, [2024-05-24T03:31:42.161955 #3324821] INFO -- : csv 3.3.0 I, [2024-05-24T03:31:42.164412 #3324821] INFO -- : installing bundled gem cache: /tmp/ruby/install/trunk/lib/ruby/gems/3.4.0+0/cache I, [2024-05-24T03:31:42.165814 #3324821] INFO -- : skipped bundled gems: I, [2024-05-24T03:31:42.165843 #3324821] INFO -- : power_assert-2.0.4dev.gem not found in bundled_gems I, [2024-05-24T03:31:42.169028 #3324821] INFO -- : $$$[end] "make install -j20" exit with 0. I, [2024-05-24T03:31:42.169139 #3324821] INFO -- : $$$[beg] make yes-btest TESTOPTS='-q -j20' I, [2024-05-24T03:31:47.225373 #3324821] INFO -- : PASS all 1936 tests E, [2024-05-24T03:31:47.230747 #3324821] ERROR -- : I, [2024-05-24T03:31:47.230861 #3324821] INFO -- : $$$[end] "make yes-btest TESTOPTS='-q -j20'" exit with 0. I, [2024-05-24T03:31:47.230946 #3324821] INFO -- : $$$[beg] make yes-test-basic TESTS='-j20' I, [2024-05-24T03:31:47.291088 #3324821] INFO -- : BASERUBY = /usr/bin/ruby --disable=gems I, [2024-05-24T03:31:47.291125 #3324821] INFO -- : CC = gcc I, [2024-05-24T03:31:47.291133 #3324821] INFO -- : LD = ld I, [2024-05-24T03:31:47.291138 #3324821] INFO -- : LDSHARED = gcc -shared I, [2024-05-24T03:31:47.291144 #3324821] INFO -- : CFLAGS = -O3 -fno-fast-math -ggdb3 -Wall -Wextra -Wdeprecated-declarations -Wdiv-by-zero -Wduplicated-cond -Wimplicit-function-declaration -Wimplicit-int -Wpointer-arith -Wwrite-strings -Wold-style-definition -Wimplicit-fallthrough=0 -Wmissing-noreturn -Wno-cast-function-type -Wno-constant-logical-operand -Wno-long-long -Wno-missing-field-initializers -Wno-overlength-strings -Wno-packed-bitfield-compat -Wno-parentheses-equality -Wno-self-assign -Wno-tautological-compare -Wno-unused-parameter -Wno-unused-value -Wsuggest-attribute=format -Wsuggest-attribute=noreturn -Wunused-variable -Wmisleading-indentation -Wundef -fPIC I, [2024-05-24T03:31:47.291162 #3324821] INFO -- : XCFLAGS = -U_FORTIFY_SOURCE -D_FORTIFY_SOURCE=2 -fstack-protector-strong -fno-strict-overflow -fvisibility=hidden -fexcess-precision=standard -DRUBY_EXPORT -I. -I.ext/include/x86_64-linux -I/tmp/ruby/src/trunk/include -I/tmp/ruby/src/trunk -I/tmp/ruby/src/trunk/prism -I/tmp/ruby/src/trunk/enc/unicode/15.0.0 I, [2024-05-24T03:31:47.291168 #3324821] INFO -- : CPPFLAGS = I, [2024-05-24T03:31:47.291173 #3324821] INFO -- : DLDFLAGS = -Wl,--compress-debug-sections=zlib -Wl,-soname,libruby.so.3.4 -fstack-protector-strong I, [2024-05-24T03:31:47.291178 #3324821] INFO -- : SOLIBS = -lz -lrt -lrt -lgmp -ldl -lcrypt -lm -lpthread I, [2024-05-24T03:31:47.291183 #3324821] INFO -- : LANG = en_US.UTF-8 I, [2024-05-24T03:31:47.291188 #3324821] INFO -- : LC_ALL = I, [2024-05-24T03:31:47.291194 #3324821] INFO -- : LC_CTYPE = I, [2024-05-24T03:31:47.291199 #3324821] INFO -- : MFLAGS = I, [2024-05-24T03:31:47.291204 #3324821] INFO -- : RUSTC = no I, [2024-05-24T03:31:47.291209 #3324821] INFO -- : YJIT_RUSTC_ARGS = --crate-name=yjit --crate-type=staticlib --edition=2021 -g -C lto=thin -C opt-level=3 -C overflow-checks=on '--out-dir=/tmp/ruby/build/trunk/yjit/target/release/' /tmp/ruby/src/trunk/yjit/src/lib.rs I, [2024-05-24T03:31:47.291891 #3324821] INFO -- : gcc (Ubuntu 11.4.0-1ubuntu1~22.04) 11.4.0 I, [2024-05-24T03:31:47.291923 #3324821] INFO -- : Copyright (C) 2021 Free Software Foundation, Inc. I, [2024-05-24T03:31:47.291931 #3324821] INFO -- : This is free software; see the source for copying conditions. There is NO I, [2024-05-24T03:31:47.291937 #3324821] INFO -- : warranty; not even for MERCHANTABILITY or FITNESS FOR A PARTICULAR PURPOSE. I, [2024-05-24T03:31:47.291942 #3324821] INFO -- : I, [2024-05-24T03:31:47.399826 #3324821] INFO -- : Checking leaked global symbols...none I, [2024-05-24T03:31:47.439826 #3324821] INFO -- : /tmp/ruby/src/trunk/basictest/test.rb:assignment ....................................................................................................................................................................................................................................................................................................................................................................................OK 372 I, [2024-05-24T03:31:47.439880 #3324821] INFO -- : /tmp/ruby/src/trunk/basictest/test.rb:condition ..OK 2 I, [2024-05-24T03:31:47.439886 #3324821] INFO -- : /tmp/ruby/src/trunk/basictest/test.rb:if/unless ...OK 3 I, [2024-05-24T03:31:47.439891 #3324821] INFO -- : /tmp/ruby/src/trunk/basictest/test.rb:case .....OK 5 I, [2024-05-24T03:31:47.440093 #3324821] INFO -- : /tmp/ruby/src/trunk/basictest/test.rb:while/until ........OK 8 I, [2024-05-24T03:31:47.440149 #3324821] INFO -- : /tmp/ruby/src/trunk/basictest/test.rb:exception ..........OK 10 I, [2024-05-24T03:31:47.440423 #3324821] INFO -- : /tmp/ruby/src/trunk/basictest/test.rb:array .......................................OK 39 I, [2024-05-24T03:31:47.440524 #3324821] INFO -- : /tmp/ruby/src/trunk/basictest/test.rb:hash ...........................OK 27 I, [2024-05-24T03:31:47.441248 #3324821] INFO -- : /tmp/ruby/src/trunk/basictest/test.rb:iterator ...........................................................................................................OK 107 I, [2024-05-24T03:31:47.441522 #3324821] INFO -- : /tmp/ruby/src/trunk/basictest/test.rb:float ................................................................................OK 80 I, [2024-05-24T03:31:47.443433 #3324821] INFO -- : /tmp/ruby/src/trunk/basictest/test.rb:bignum ...............................OK 31 I, [2024-05-24T03:31:47.444211 #3324821] INFO -- : /tmp/ruby/src/trunk/basictest/test.rb:string & char ..............................................................OK 62 I, [2024-05-24T03:31:47.444246 #3324821] INFO -- : /tmp/ruby/src/trunk/basictest/test.rb:assignment ..........OK 10 I, [2024-05-24T03:31:47.444278 #3324821] INFO -- : /tmp/ruby/src/trunk/basictest/test.rb:call ......OK 6 I, [2024-05-24T03:31:47.444334 #3324821] INFO -- : /tmp/ruby/src/trunk/basictest/test.rb:proc .........OK 9 I, [2024-05-24T03:31:47.544944 #3324821] INFO -- : /tmp/ruby/src/trunk/basictest/test.rb:signal ..OK 2 I, [2024-05-24T03:31:47.547596 #3324821] INFO -- : /tmp/ruby/src/trunk/basictest/test.rb:eval ...........................OK 27 I, [2024-05-24T03:31:47.657499 #3324821] INFO -- : /tmp/ruby/src/trunk/basictest/test.rb:system ........OK 8 I, [2024-05-24T03:31:47.657560 #3324821] INFO -- : /tmp/ruby/src/trunk/basictest/test.rb:const .....OK 5 I, [2024-05-24T03:31:47.657567 #3324821] INFO -- : /tmp/ruby/src/trunk/basictest/test.rb:clone .....OK 5 I, [2024-05-24T03:31:47.657681 #3324821] INFO -- : /tmp/ruby/src/trunk/basictest/test.rb:marshal ....OK 4 I, [2024-05-24T03:31:47.657703 #3324821] INFO -- : /tmp/ruby/src/trunk/basictest/test.rb:pack ....OK 4 I, [2024-05-24T03:31:47.657723 #3324821] INFO -- : /tmp/ruby/src/trunk/basictest/test.rb:math ..OK 2 I, [2024-05-24T03:31:47.657767 #3324821] INFO -- : /tmp/ruby/src/trunk/basictest/test.rb:struct ......OK 6 I, [2024-05-24T03:31:47.657859 #3324821] INFO -- : /tmp/ruby/src/trunk/basictest/test.rb:variable ............OK 12 I, [2024-05-24T03:31:47.657883 #3324821] INFO -- : /tmp/ruby/src/trunk/basictest/test.rb:trace ...OK 3 I, [2024-05-24T03:31:47.657939 #3324821] INFO -- : /tmp/ruby/src/trunk/basictest/test.rb:defined? ............OK 12 I, [2024-05-24T03:31:47.657982 #3324821] INFO -- : /tmp/ruby/src/trunk/basictest/test.rb:alias ......OK 6 I, [2024-05-24T03:31:47.658330 #3324821] INFO -- : /tmp/ruby/src/trunk/basictest/test.rb:path .......................OK 23 I, [2024-05-24T03:31:47.691024 #3324821] INFO -- : /tmp/ruby/src/trunk/basictest/test.rb:gc ....OK 4 I, [2024-05-24T03:31:47.693363 #3324821] INFO -- : I, [2024-05-24T03:31:47.693387 #3324821] INFO -- : test succeeded I, [2024-05-24T03:31:47.694839 #3324821] INFO -- : $$$[end] "make yes-test-basic TESTS='-j20'" exit with 0. I, [2024-05-24T03:31:47.694935 #3324821] INFO -- : $$$[beg] make yes-test-all TESTOPTS='--stderr-on-failure' TESTS='-j20' I, [2024-05-24T03:31:47.782567 #3324821] INFO -- : BASERUBY = /usr/bin/ruby --disable=gems I, [2024-05-24T03:31:47.782603 #3324821] INFO -- : CC = gcc I, [2024-05-24T03:31:47.782608 #3324821] INFO -- : LD = ld I, [2024-05-24T03:31:47.782612 #3324821] INFO -- : LDSHARED = gcc -shared I, [2024-05-24T03:31:47.782617 #3324821] INFO -- : CFLAGS = -O3 -fno-fast-math -ggdb3 -Wall -Wextra -Wdeprecated-declarations -Wdiv-by-zero -Wduplicated-cond -Wimplicit-function-declaration -Wimplicit-int -Wpointer-arith -Wwrite-strings -Wold-style-definition -Wimplicit-fallthrough=0 -Wmissing-noreturn -Wno-cast-function-type -Wno-constant-logical-operand -Wno-long-long -Wno-missing-field-initializers -Wno-overlength-strings -Wno-packed-bitfield-compat -Wno-parentheses-equality -Wno-self-assign -Wno-tautological-compare -Wno-unused-parameter -Wno-unused-value -Wsuggest-attribute=format -Wsuggest-attribute=noreturn -Wunused-variable -Wmisleading-indentation -Wundef -fPIC I, [2024-05-24T03:31:47.782622 #3324821] INFO -- : XCFLAGS = -U_FORTIFY_SOURCE -D_FORTIFY_SOURCE=2 -fstack-protector-strong -fno-strict-overflow -fvisibility=hidden -fexcess-precision=standard -DRUBY_EXPORT -I. -I.ext/include/x86_64-linux -I/tmp/ruby/src/trunk/include -I/tmp/ruby/src/trunk -I/tmp/ruby/src/trunk/prism -I/tmp/ruby/src/trunk/enc/unicode/15.0.0 I, [2024-05-24T03:31:47.782626 #3324821] INFO -- : CPPFLAGS = I, [2024-05-24T03:31:47.782629 #3324821] INFO -- : DLDFLAGS = -Wl,--compress-debug-sections=zlib -Wl,-soname,libruby.so.3.4 -fstack-protector-strong I, [2024-05-24T03:31:47.782633 #3324821] INFO -- : SOLIBS = -lz -lrt -lrt -lgmp -ldl -lcrypt -lm -lpthread I, [2024-05-24T03:31:47.782644 #3324821] INFO -- : LANG = en_US.UTF-8 I, [2024-05-24T03:31:47.782648 #3324821] INFO -- : LC_ALL = I, [2024-05-24T03:31:47.782651 #3324821] INFO -- : LC_CTYPE = I, [2024-05-24T03:31:47.782655 #3324821] INFO -- : MFLAGS = I, [2024-05-24T03:31:47.782659 #3324821] INFO -- : RUSTC = no I, [2024-05-24T03:31:47.782663 #3324821] INFO -- : YJIT_RUSTC_ARGS = --crate-name=yjit --crate-type=staticlib --edition=2021 -g -C lto=thin -C opt-level=3 -C overflow-checks=on '--out-dir=/tmp/ruby/build/trunk/yjit/target/release/' /tmp/ruby/src/trunk/yjit/src/lib.rs I, [2024-05-24T03:31:47.783344 #3324821] INFO -- : gcc (Ubuntu 11.4.0-1ubuntu1~22.04) 11.4.0 I, [2024-05-24T03:31:47.783364 #3324821] INFO -- : Copyright (C) 2021 Free Software Foundation, Inc. I, [2024-05-24T03:31:47.783370 #3324821] INFO -- : This is free software; see the source for copying conditions. There is NO I, [2024-05-24T03:31:47.783376 #3324821] INFO -- : warranty; not even for MERCHANTABILITY or FITNESS FOR A PARTICULAR PURPOSE. I, [2024-05-24T03:31:47.783380 #3324821] INFO -- : I, [2024-05-24T03:31:47.785104 #3324821] INFO -- : generating enc.mk I, [2024-05-24T03:31:47.903324 #3324821] INFO -- : generating encdb.h I, [2024-05-24T03:31:47.927051 #3324821] INFO -- : encdb.h unchanged I, [2024-05-24T03:31:47.928172 #3324821] INFO -- : making enc I, [2024-05-24T03:31:47.946124 #3324821] INFO -- : make[1]: Entering directory '/tmp/ruby/build/trunk' I, [2024-05-24T03:31:47.946147 #3324821] INFO -- : make[1]: Nothing to be done for 'enc'. I, [2024-05-24T03:31:47.946153 #3324821] INFO -- : make[1]: Leaving directory '/tmp/ruby/build/trunk' I, [2024-05-24T03:31:47.946960 #3324821] INFO -- : making srcs under enc I, [2024-05-24T03:31:47.976659 #3324821] INFO -- : make[1]: Entering directory '/tmp/ruby/build/trunk' I, [2024-05-24T03:31:47.976684 #3324821] INFO -- : make[1]: Nothing to be done for 'srcs'. I, [2024-05-24T03:31:47.976689 #3324821] INFO -- : make[1]: Leaving directory '/tmp/ruby/build/trunk' I, [2024-05-24T03:31:47.977588 #3324821] INFO -- : generating transdb.h I, [2024-05-24T03:31:48.073455 #3324821] INFO -- : transdb.h unchanged I, [2024-05-24T03:31:48.074783 #3324821] INFO -- : making trans I, [2024-05-24T03:31:48.108368 #3324821] INFO -- : make[1]: Entering directory '/tmp/ruby/build/trunk' I, [2024-05-24T03:31:48.108399 #3324821] INFO -- : make[1]: Nothing to be done for 'trans'. I, [2024-05-24T03:31:48.108406 #3324821] INFO -- : make[1]: Leaving directory '/tmp/ruby/build/trunk' I, [2024-05-24T03:31:48.109139 #3324821] INFO -- : making encs I, [2024-05-24T03:31:48.147624 #3324821] INFO -- : make[1]: Entering directory '/tmp/ruby/build/trunk' I, [2024-05-24T03:31:48.147645 #3324821] INFO -- : make[1]: Nothing to be done for 'encs'. I, [2024-05-24T03:31:48.147650 #3324821] INFO -- : make[1]: Leaving directory '/tmp/ruby/build/trunk' I, [2024-05-24T03:31:48.149449 #3324821] INFO -- : generating makefiles ext/configure-ext.mk I, [2024-05-24T03:31:48.176221 #3324821] INFO -- : ext/configure-ext.mk updated I, [2024-05-24T03:31:48.178711 #3324821] INFO -- : make[1]: Entering directory '/tmp/ruby/build/trunk' I, [2024-05-24T03:31:49.567720 #3324821] INFO -- : make[1]: Leaving directory '/tmp/ruby/build/trunk' I, [2024-05-24T03:31:49.568486 #3324821] INFO -- : generating makefile exts.mk I, [2024-05-24T03:31:49.605346 #3324821] INFO -- : exts.mk unchanged I, [2024-05-24T03:31:49.609910 #3324821] INFO -- : make[1]: Entering directory '/tmp/ruby/build/trunk' I, [2024-05-24T03:31:49.945174 #3324821] INFO -- : make[2]: Entering directory '/tmp/ruby/build/trunk/ext/coverage' I, [2024-05-24T03:31:49.949922 #3324821] INFO -- : make[2]: Leaving directory '/tmp/ruby/build/trunk/ext/coverage' I, [2024-05-24T03:31:49.956298 #3324821] INFO -- : make[2]: Entering directory '/tmp/ruby/build/trunk/ext/date' I, [2024-05-24T03:31:49.961179 #3324821] INFO -- : make[2]: Leaving directory '/tmp/ruby/build/trunk/ext/date' I, [2024-05-24T03:31:49.965124 #3324821] INFO -- : make[2]: Entering directory '/tmp/ruby/build/trunk/ext/digest' I, [2024-05-24T03:31:49.974106 #3324821] INFO -- : make[2]: Leaving directory '/tmp/ruby/build/trunk/ext/digest' I, [2024-05-24T03:31:50.000486 #3324821] INFO -- : make[2]: Entering directory '/tmp/ruby/build/trunk/ext/digest/sha2' I, [2024-05-24T03:31:50.005318 #3324821] INFO -- : make[2]: Leaving directory '/tmp/ruby/build/trunk/ext/digest/sha2' I, [2024-05-24T03:31:50.027124 #3324821] INFO -- : make[2]: Entering directory '/tmp/ruby/build/trunk/ext/fiddle' I, [2024-05-24T03:31:50.037719 #3324821] INFO -- : make[2]: Leaving directory '/tmp/ruby/build/trunk/ext/fiddle' I, [2024-05-24T03:31:50.042962 #3324821] INFO -- : make[2]: Entering directory '/tmp/ruby/build/trunk/ext/io/console' I, [2024-05-24T03:31:50.047223 #3324821] INFO -- : make[2]: Leaving directory '/tmp/ruby/build/trunk/ext/io/console' I, [2024-05-24T03:31:50.059576 #3324821] INFO -- : make[2]: Entering directory '/tmp/ruby/build/trunk/ext/json' I, [2024-05-24T03:31:50.069175 #3324821] INFO -- : make[2]: Leaving directory '/tmp/ruby/build/trunk/ext/json' I, [2024-05-24T03:31:50.084452 #3324821] INFO -- : make[2]: Entering directory '/tmp/ruby/build/trunk/ext/monitor' I, [2024-05-24T03:31:50.088492 #3324821] INFO -- : make[2]: Leaving directory '/tmp/ruby/build/trunk/ext/monitor' I, [2024-05-24T03:31:50.095048 #3324821] INFO -- : make[2]: Entering directory '/tmp/ruby/build/trunk/ext/objspace' I, [2024-05-24T03:31:50.099153 #3324821] INFO -- : make[2]: Leaving directory '/tmp/ruby/build/trunk/ext/objspace' I, [2024-05-24T03:31:50.112786 #3324821] INFO -- : make[2]: Entering directory '/tmp/ruby/build/trunk/ext/openssl' I, [2024-05-24T03:31:50.127768 #3324821] INFO -- : make[2]: Leaving directory '/tmp/ruby/build/trunk/ext/openssl' I, [2024-05-24T03:31:50.131185 #3324821] INFO -- : make[2]: Entering directory '/tmp/ruby/build/trunk/ext/pathname' I, [2024-05-24T03:31:50.135116 #3324821] INFO -- : make[2]: Leaving directory '/tmp/ruby/build/trunk/ext/pathname' I, [2024-05-24T03:31:50.141993 #3324821] INFO -- : make[2]: Entering directory '/tmp/ruby/build/trunk/ext/psych' I, [2024-05-24T03:31:50.162577 #3324821] INFO -- : make[2]: Leaving directory '/tmp/ruby/build/trunk/ext/psych' I, [2024-05-24T03:31:50.165864 #3324821] INFO -- : make[2]: Entering directory '/tmp/ruby/build/trunk/ext/pty' I, [2024-05-24T03:31:50.168282 #3324821] INFO -- : make[2]: Leaving directory '/tmp/ruby/build/trunk/ext/pty' I, [2024-05-24T03:31:50.182019 #3324821] INFO -- : make[2]: Entering directory '/tmp/ruby/build/trunk/ext/ripper' I, [2024-05-24T03:31:50.188487 #3324821] INFO -- : make[2]: Leaving directory '/tmp/ruby/build/trunk/ext/ripper' I, [2024-05-24T03:31:50.190558 #3324821] INFO -- : make[2]: Entering directory '/tmp/ruby/build/trunk/ext/rubyvm' I, [2024-05-24T03:31:50.193716 #3324821] INFO -- : make[2]: Leaving directory '/tmp/ruby/build/trunk/ext/rubyvm' I, [2024-05-24T03:31:50.204415 #3324821] INFO -- : make[2]: Entering directory '/tmp/ruby/build/trunk/ext/socket' I, [2024-05-24T03:31:50.211107 #3324821] INFO -- : make[2]: Leaving directory '/tmp/ruby/build/trunk/ext/socket' I, [2024-05-24T03:31:50.227252 #3324821] INFO -- : make[2]: Entering directory '/tmp/ruby/build/trunk/.bundle/gems/bigdecimal-3.1.8/ext/bigdecimal' I, [2024-05-24T03:31:50.257228 #3324821] INFO -- : make[2]: Leaving directory '/tmp/ruby/build/trunk/.bundle/gems/bigdecimal-3.1.8/ext/bigdecimal' I, [2024-05-24T03:31:50.260079 #3324821] INFO -- : make[2]: Entering directory '/tmp/ruby/build/trunk/.bundle/gems/debug-1.9.2/ext/debug' I, [2024-05-24T03:31:50.288001 #3324821] INFO -- : make[2]: Leaving directory '/tmp/ruby/build/trunk/.bundle/gems/debug-1.9.2/ext/debug' I, [2024-05-24T03:31:50.290139 #3324821] INFO -- : make[2]: Entering directory '/tmp/ruby/build/trunk/.bundle/gems/nkf-0.2.0/ext/nkf' I, [2024-05-24T03:31:50.311887 #3324821] INFO -- : make[2]: Leaving directory '/tmp/ruby/build/trunk/.bundle/gems/nkf-0.2.0/ext/nkf' I, [2024-05-24T03:31:50.313822 #3324821] INFO -- : make[2]: Entering directory '/tmp/ruby/build/trunk/.bundle/gems/racc-1.7.3/ext/racc/cparse' I, [2024-05-24T03:31:50.334972 #3324821] INFO -- : make[2]: Leaving directory '/tmp/ruby/build/trunk/.bundle/gems/racc-1.7.3/ext/racc/cparse' I, [2024-05-24T03:31:50.337042 #3324821] INFO -- : make[2]: Entering directory '/tmp/ruby/build/trunk/.bundle/gems/racc-1.8.0/ext/racc/cparse' I, [2024-05-24T03:31:50.358253 #3324821] INFO -- : make[2]: Leaving directory '/tmp/ruby/build/trunk/.bundle/gems/racc-1.8.0/ext/racc/cparse' I, [2024-05-24T03:31:50.360836 #3324821] INFO -- : make[2]: Entering directory '/tmp/ruby/build/trunk/.bundle/gems/rbs-3.4.4/ext/rbs_extension' I, [2024-05-24T03:31:50.382092 #3324821] INFO -- : make[2]: Leaving directory '/tmp/ruby/build/trunk/.bundle/gems/rbs-3.4.4/ext/rbs_extension' I, [2024-05-24T03:31:50.384100 #3324821] INFO -- : make[2]: Entering directory '/tmp/ruby/build/trunk/.bundle/gems/syslog-0.1.2/ext/syslog' I, [2024-05-24T03:31:50.405614 #3324821] INFO -- : make[2]: Leaving directory '/tmp/ruby/build/trunk/.bundle/gems/syslog-0.1.2/ext/syslog' I, [2024-05-24T03:31:50.428944 #3324821] INFO -- : make[2]: Entering directory '/tmp/ruby/build/trunk' I, [2024-05-24T03:31:50.494199 #3324821] INFO -- : make[2]: 'ruby' is up to date. I, [2024-05-24T03:31:50.494247 #3324821] INFO -- : make[2]: Leaving directory '/tmp/ruby/build/trunk' I, [2024-05-24T03:31:50.494792 #3324821] INFO -- : make[1]: Leaving directory '/tmp/ruby/build/trunk' I, [2024-05-24T03:31:50.498511 #3324821] INFO -- : make[1]: Entering directory '/tmp/ruby/build/trunk' I, [2024-05-24T03:31:50.498536 #3324821] INFO -- : make[1]: Nothing to be done for 'note'. I, [2024-05-24T03:31:50.498544 #3324821] INFO -- : make[1]: Leaving directory '/tmp/ruby/build/trunk' I, [2024-05-24T03:31:50.574736 #3324821] INFO -- : Run options: I, [2024-05-24T03:31:50.574791 #3324821] INFO -- : --seed=36254 I, [2024-05-24T03:31:50.574796 #3324821] INFO -- : "--ruby=./miniruby -I/tmp/ruby/src/trunk/lib -I. -I.ext/common /tmp/ruby/src/trunk/tool/runruby.rb --extout=.ext -- --disable-gems" I, [2024-05-24T03:31:50.574801 #3324821] INFO -- : --excludes-dir=/tmp/ruby/src/trunk/test/.excludes I, [2024-05-24T03:31:50.574804 #3324821] INFO -- : --name=!/memory_leak/ I, [2024-05-24T03:31:50.574808 #3324821] INFO -- : --stderr-on-failure I, [2024-05-24T03:31:50.574812 #3324821] INFO -- : -j20 I, [2024-05-24T03:31:50.574816 #3324821] INFO -- : I, [2024-05-24T03:31:50.574824 #3324821] INFO -- : # Running tests: I, [2024-05-24T03:31:50.574829 #3324821] INFO -- : I, [2024-05-24T03:31:50.699885 #3324821] INFO -- : [ 1/885] 3366194=test_typeddata I, [2024-05-24T03:31:50.724414 #3324821] INFO -- : [ 2/885] 3366182=encoding_test I, [2024-05-24T03:31:50.724476 #3324821] INFO -- : [ 3/885] 3366180=test_gem_resolver_best_set I, [2024-05-24T03:31:50.724557 #3324821] INFO -- : [ 4/885] 3366181=test_rdoc_markup_to_html_crossref I, [2024-05-24T03:31:50.724652 #3324821] INFO -- : [ 5/885] 3366184=test_rdoc_markup_raw I, [2024-05-24T03:31:50.726704 #3324821] INFO -- : [ 6/885] 3366183=test_webauthn_poller I, [2024-05-24T03:31:50.726757 #3324821] INFO -- : [ 7/885] 3366196=test_rat I, [2024-05-24T03:31:50.727819 #3324821] INFO -- : [ 8/885] 3366192=test_array I, [2024-05-24T03:31:50.727913 #3324821] INFO -- : [ 9/885] 3366193=test_optparse I, [2024-05-24T03:31:50.727990 #3324821] INFO -- : [ 10/885] 3366195=test_fstring I, [2024-05-24T03:31:50.732091 #3324821] INFO -- : [ 11/885] 3366197=test_yield I, [2024-05-24T03:31:50.734856 #3324821] INFO -- : [ 12/885] 3366196=test_rdoc_alias I, [2024-05-24T03:31:50.759684 #3324821] INFO -- : [ 13/885] 3366192=parser_test I, [2024-05-24T03:31:50.759934 #3324821] INFO -- : [ 14/885] 3366185=test_convertible I, [2024-05-24T03:31:50.760576 #3324821] INFO -- : [ 15/885] 3366187=test_files_sample I, [2024-05-24T03:31:50.760743 #3324821] INFO -- : [ 16/885] 3366188=test_stringscanner I, [2024-05-24T03:31:50.761152 #3324821] INFO -- : [ 17/885] 3366189=test_rdoc_markup_indented_paragraph I, [2024-05-24T03:31:50.761284 #3324821] INFO -- : [ 18/885] 3366191=test_rdoc_task I, [2024-05-24T03:31:50.761404 #3324821] INFO -- : [ 19/885] 3366190=test_gem_resolver_conflict I, [2024-05-24T03:31:50.774565 #3324821] INFO -- : [ 20/885] 3366198=test_io_buffer I, [2024-05-24T03:31:50.785425 #3324821] INFO -- : [ 21/885] 3366193=test_pack I, [2024-05-24T03:31:50.787588 #3324821] INFO -- : [ 22/885] 3366186=test_backtrace I, [2024-05-24T03:31:50.790696 #3324821] INFO -- : [ 23/885] 3366179=ruby_parser_test I, [2024-05-24T03:31:50.794776 #3324821] INFO -- : [ 24/885] 3366193=test_readpartial I, [2024-05-24T03:31:50.795828 #3324821] INFO -- : [ 25/885] 3366191=test_clone I, [2024-05-24T03:31:50.809212 #3324821] INFO -- : [ 26/885] 3366188=test_gem_commands_install_command I, [2024-05-24T03:31:50.820941 #3324821] INFO -- : [ 27/885] 3366192=test_rdoc_require I, [2024-05-24T03:31:50.837732 #3324821] INFO -- : [ 28/885] 3366184=locals_test I, [2024-05-24T03:31:50.852382 #3324821] INFO -- : [ 29/885] 3366187=test_config I, [2024-05-24T03:31:50.876803 #3324821] INFO -- : [ 30/885] 3366194=test_sleep I, [2024-05-24T03:31:50.879112 #3324821] INFO -- : [ 31/885] 3366195=test_gc I, [2024-05-24T03:31:50.880815 #3324821] INFO -- : [ 32/885] 3366198=test_math I, [2024-05-24T03:31:50.882155 #3324821] INFO -- : [ 33/885] 3366195=test_gem_commands_fetch_command I, [2024-05-24T03:31:50.883354 #3324821] INFO -- : [ 34/885] 3366179=test_libs I, [2024-05-24T03:31:50.888459 #3324821] INFO -- : [ 35/885] 3366196=test_yaml_tree I, [2024-05-24T03:31:50.898677 #3324821] INFO -- : [ 36/885] 3366198=test_rendering I, [2024-05-24T03:31:50.903632 #3324821] INFO -- : [ 37/885] 3366182=test_face I, [2024-05-24T03:31:50.915504 #3324821] INFO -- : [ 38/885] 3366179=test_case I, [2024-05-24T03:31:50.923439 #3324821] INFO -- : [ 39/885] 3366189=test_sizeof I, [2024-05-24T03:31:50.926834 #3324821] INFO -- : [ 40/885] 3366196=test_unicode_escape I, [2024-05-24T03:31:50.943075 #3324821] INFO -- : [ 41/885] 3366179=test_io I, [2024-05-24T03:31:50.943499 #3324821] INFO -- : [ 42/885] 3366182=test_autoload I, [2024-05-24T03:31:50.946438 #3324821] INFO -- : [ 43/885] 3366190=test_utf16 I, [2024-05-24T03:31:50.948480 #3324821] INFO -- : [ 44/885] 3366180=test_iseq_load I, [2024-05-24T03:31:50.960102 #3324821] INFO -- : [ 45/885] 3366190=test_gem_util I, [2024-05-24T03:31:50.974006 #3324821] INFO -- : [ 46/885] 3366191=test_gem_package_tar_header I, [2024-05-24T03:31:50.978813 #3324821] INFO -- : [ 47/885] 3366196=test_bigzero I, [2024-05-24T03:31:50.980678 #3324821] INFO -- : [ 48/885] 3366196=test_pkey_dh I, [2024-05-24T03:31:50.994071 #3324821] INFO -- : [ 49/885] 3366192=test_pkcs12 I, [2024-05-24T03:31:51.026397 #3324821] INFO -- : [ 50/885] 3366183=test_system I, [2024-05-24T03:31:51.027643 #3324821] INFO -- : [ 51/885] 3366198=test_etc I, [2024-05-24T03:31:51.070161 #3324821] INFO -- : [ 52/885] 3366187=test_yjit_exit_locations I, [2024-05-24T03:31:51.072330 #3324821] INFO -- : [ 53/885] 3366187=test_gem_resolver_activation_request I, [2024-05-24T03:31:51.076383 #3324821] INFO -- : [ 54/885] 3366196=test_protocol I, [2024-05-24T03:31:51.080652 #3324821] INFO -- : [ 55/885] 3366187=test_getopts I, [2024-05-24T03:31:51.084417 #3324821] INFO -- : [ 56/885] 3366187=test_ripper I, [2024-05-24T03:31:51.109887 #3324821] INFO -- : [ 57/885] 3366198=test_gem_config_file I, [2024-05-24T03:31:51.149525 #3324821] INFO -- : [ 58/885] 3366190=test_to_ruby I, [2024-05-24T03:31:51.163623 #3324821] INFO -- : [ 59/885] 3366195=test_pattern_key_name_check I, [2024-05-24T03:31:51.168910 #3324821] INFO -- : [ 60/885] 3366195=test_array_create I, [2024-05-24T03:31:51.169690 #3324821] INFO -- : [ 61/885] 3366195=test_pack I, [2024-05-24T03:31:51.181101 #3324821] INFO -- : [ 62/885] 3366190=test_gem_impossible_dependencies_error I, [2024-05-24T03:31:51.192375 #3324821] INFO -- : [ 63/885] 3366190=test_method I, [2024-05-24T03:31:51.199352 #3324821] INFO -- : [ 64/885] 3366193=test_gem_commands_query_command I, [2024-05-24T03:31:51.221158 #3324821] INFO -- : [ 65/885] 3366191=test_rdoc_rubygems_hook I, [2024-05-24T03:31:51.273252 #3324821] INFO -- : [ 66/885] 3366181=test_rdoc_context_section I, [2024-05-24T03:31:51.281732 #3324821] INFO -- : [ 67/885] 3366181=test_euc_kr I, [2024-05-24T03:31:51.286532 #3324821] INFO -- : [ 68/885] 3366181=test_ftp I, [2024-05-24T03:31:51.289783 #3324821] INFO -- : [ 69/885] 3366184=test_date_attr I, [2024-05-24T03:31:51.293466 #3324821] INFO -- : [ 70/885] 3366184=test_ellipsize I, [2024-05-24T03:31:51.307940 #3324821] INFO -- : [ 71/885] 3366181=test_kwargs I, [2024-05-24T03:31:51.309848 #3324821] INFO -- : [ 72/885] 3366184=warnings_test I, [2024-05-24T03:31:51.312551 #3324821] INFO -- : [ 73/885] 3366181=test_gem_commands_exec_command I, [2024-05-24T03:31:51.322550 #3324821] INFO -- : [ 74/885] 3366184=test_io_wait I, [2024-05-24T03:31:51.373933 #3324821] INFO -- : [ 75/885] 3366195=test_type_completor I, [2024-05-24T03:31:51.377631 #3324821] INFO -- : [ 76/885] 3366195=test_summary I, [2024-05-24T03:31:51.384563 #3324821] INFO -- : [ 77/885] 3366196=test_console_attr I, [2024-05-24T03:31:51.385370 #3324821] INFO -- : [ 78/885] 3366196=test_foreach I, [2024-05-24T03:31:51.388219 #3324821] INFO -- : [ 79/885] 3366196=test_gem_source_specific_file I, [2024-05-24T03:31:51.411884 #3324821] INFO -- : [ 80/885] 3366187=test_condition I, [2024-05-24T03:31:51.416848 #3324821] INFO -- : [ 81/885] 3366187=test_gem_commands_uninstall_command I, [2024-05-24T03:31:51.424678 #3324821] INFO -- : [ 82/885] 3366198=test_cp949 I, [2024-05-24T03:31:51.431673 #3324821] INFO -- : [ 83/885] 3366198=test_win32ole_record I, [2024-05-24T03:31:51.433173 #3324821] INFO -- : [ 84/885] 3366198=test_gem_unsatisfiable_dependency_error I, [2024-05-24T03:31:51.440459 #3324821] INFO -- : [ 85/885] 3366198=test_ubf_async_safe I, [2024-05-24T03:31:51.454824 #3324821] INFO -- : [ 86/885] 3366198=test_hash I, [2024-05-24T03:31:51.496483 #3324821] INFO -- : [ 87/885] 3366195=test_win32ole_type_event I, [2024-05-24T03:31:51.498741 #3324821] INFO -- : [ 88/885] 3366195=test_emoji I, [2024-05-24T03:31:51.506395 #3324821] INFO -- : [ 89/885] 3366191=test_sorted_set I, [2024-05-24T03:31:51.526863 #3324821] INFO -- : [ 90/885] 3366195=test_io I, [2024-05-24T03:31:51.531714 #3324821] INFO -- : [ 91/885] 3366180=test_win32ole_typelib I, [2024-05-24T03:31:51.533592 #3324821] INFO -- : [ 92/885] 3366180=test_protect I, [2024-05-24T03:31:51.534339 #3324821] INFO -- : [ 93/885] 3366180=test_raise_exception I, [2024-05-24T03:31:51.594937 #3324821] INFO -- : [ 94/885] 3366192=test_gem_request_set_lockfile I, [2024-05-24T03:31:51.604619 #3324821] INFO -- : [ 95/885] 3366196=test_external_new I, [2024-05-24T03:31:51.606820 #3324821] INFO -- : [ 96/885] 3366196=test_alias_and_anchor I, [2024-05-24T03:31:51.612214 #3324821] INFO -- : [ 97/885] 3366196=test_postponed_job I, [2024-05-24T03:31:51.667275 #3324821] INFO -- : [ 98/885] 3366184=test_hash I, [2024-05-24T03:31:51.683634 #3324821] INFO -- : [ 99/885] 3366184=test_tree_builder I, [2024-05-24T03:31:51.692699 #3324821] INFO -- : [100/885] 3366184=test_gem_resolver_dependency_request I, [2024-05-24T03:31:51.723285 #3324821] INFO -- : [101/885] 3366183=test_ns_spki I, [2024-05-24T03:31:51.745790 #3324821] INFO -- : [102/885] 3366183=test_framework I, [2024-05-24T03:31:51.765315 #3324821] INFO -- : [103/885] 3366183=test_kill_ring I, [2024-05-24T03:31:51.767898 #3324821] INFO -- : [104/885] 3366195=test_argf I, [2024-05-24T03:31:51.779929 #3324821] INFO -- : [105/885] 3366191=test_m17n I, [2024-05-24T03:31:51.806361 #3324821] INFO -- : [106/885] 3366183=test_gem_commands_environment_command I, [2024-05-24T03:31:51.837604 #3324821] INFO -- : [107/885] 3366183=test_ws I, [2024-05-24T03:31:51.843854 #3324821] INFO -- : [108/885] 3366191=test_yjit I, [2024-05-24T03:31:51.849356 #3324821] INFO -- : [109/885] 3366191=test_weakmap I, [2024-05-24T03:31:51.851297 #3324821] INFO -- : [110/885] 3366183=test_workspace I, [2024-05-24T03:31:51.862049 #3324821] INFO -- : [111/885] 3366184=test_sprintf I, [2024-05-24T03:31:51.885889 #3324821] INFO -- : [112/885] 3366196=test_gem_requirement I, [2024-05-24T03:31:51.960283 #3324821] INFO -- : [113/885] 3366193=comments_test I, [2024-05-24T03:31:51.975802 #3324821] INFO -- : [114/885] 3366196=test_string_memory I, [2024-05-24T03:31:51.991590 #3324821] INFO -- : [115/885] 3366180=test_gem_security_trust_dir I, [2024-05-24T03:31:52.010927 #3324821] INFO -- : [116/885] 3366196=test_undef I, [2024-05-24T03:31:52.013350 #3324821] INFO -- : [117/885] 3366196=test_line_editor I, [2024-05-24T03:31:52.025628 #3324821] INFO -- : [118/885] 3366180=ripper_test I, [2024-05-24T03:31:52.029135 #3324821] INFO -- : [119/885] 3366183=test_objspace I, [2024-05-24T03:31:52.033477 #3324821] INFO -- : [120/885] 3366184=test_have_library I, [2024-05-24T03:31:52.036631 #3324821] INFO -- : [121/885] 3366193=test_remote_fetch_error I, [2024-05-24T03:31:52.051704 #3324821] INFO -- : [122/885] 3366186=test_gem_commands_stale_command I, [2024-05-24T03:31:52.052380 #3324821] INFO -- : [123/885] 3366193=test_c_struct_entry I, [2024-05-24T03:31:52.058618 #3324821] INFO -- : [124/885] 3366196=test_lock_native_thread I, [2024-05-24T03:31:52.117938 #3324821] INFO -- : [125/885] 3366192=test_set I, [2024-05-24T03:31:52.127478 #3324821] INFO -- : [126/885] 3366192=test_show_source I, [2024-05-24T03:31:52.202303 #3324821] INFO -- : [127/885] 3366193=test_gem_ext_ext_conf_builder I, [2024-05-24T03:31:52.253259 #3324821] INFO -- : [128/885] 3366186=test_gem_stub_specification I, [2024-05-24T03:31:52.278130 #3324821] INFO -- : [129/885] 3366192=test_method_cache I, [2024-05-24T03:31:52.279459 #3324821] INFO -- : [130/885] 3366192=test_frozen_error I, [2024-05-24T03:31:52.283144 #3324821] INFO -- : [131/885] 3366192=test_gem_commands_search_command I, [2024-05-24T03:31:52.291305 #3324821] INFO -- : [132/885] 3366192=test_complex I, [2024-05-24T03:31:52.307120 #3324821] INFO -- : [133/885] 3366187=test_rdoc_markup_verbatim I, [2024-05-24T03:31:52.330505 #3324821] INFO -- : [134/885] 3366196=test_inlinecache I, [2024-05-24T03:31:52.386477 #3324821] INFO -- : [135/885] 3366196=test_gem_dependency I, [2024-05-24T03:31:52.411283 #3324821] INFO -- : [136/885] 3366186=test_gem_resolver_specification I, [2024-05-24T03:31:52.429208 #3324821] INFO -- : [137/885] 3366192=test_path_to_class I, [2024-05-24T03:31:52.435658 #3324821] INFO -- : [138/885] 3366192=test_mdns I, [2024-05-24T03:31:52.444214 #3324821] INFO -- : [139/885] 3366187=test_parse I, [2024-05-24T03:31:52.456003 #3324821] INFO -- : [140/885] 3366192=test_gem_remote_fetcher I, [2024-05-24T03:31:52.458865 #3324821] INFO -- : [141/885] 3366186=test_scanner_events I, [2024-05-24T03:31:52.486265 #3324821] INFO -- : [142/885] 3366188=test_gem_resolver_installed_specification I, [2024-05-24T03:31:52.500313 #3324821] INFO -- : [143/885] 3366188=test_reqarg I, [2024-05-24T03:31:52.508719 #3324821] INFO -- : [144/885] 3366186=test_rdoc_include I, [2024-05-24T03:31:52.516275 #3324821] INFO -- : [145/885] 3366196=test_stack I, [2024-05-24T03:31:52.571464 #3324821] INFO -- : [146/885] 3366181=test_gem_commands_list_command I, [2024-05-24T03:31:52.578464 #3324821] INFO -- : [147/885] 3366181=test_too_many_dummy_encodings I, [2024-05-24T03:31:52.611121 #3324821] INFO -- : [148/885] 3366180=test_gem_version I, [2024-05-24T03:31:52.640684 #3324821] INFO -- : [149/885] 3366181=test_rdoc_options I, [2024-05-24T03:31:52.676168 #3324821] INFO -- : [150/885] 3366180=test_cesu8 I, [2024-05-24T03:31:52.680954 #3324821] INFO -- : [151/885] 3366180=test_econv I, [2024-05-24T03:31:52.709426 #3324821] INFO -- : [152/885] 3366186=test_string_processing I, [2024-05-24T03:31:52.751101 #3324821] INFO -- : [153/885] 3366186=test_fileutils I, [2024-05-24T03:31:52.908661 #3324821] INFO -- : [154/885] 3366188=test_gem_commands_signin_command I, [2024-05-24T03:31:52.917467 #3324821] INFO -- : [155/885] 3366181=test_resource I, [2024-05-24T03:31:52.928236 #3324821] INFO -- : [156/885] 3366194=test_emitter I, [2024-05-24T03:31:52.943292 #3324821] INFO -- : [157/885] 3366181=test_ldap I, [2024-05-24T03:31:52.946098 #3324821] INFO -- : [158/885] 3366181=test_queue I, [2024-05-24T03:31:52.958624 #3324821] INFO -- : [159/885] 3366181=test_function I, [2024-05-24T03:31:52.961849 #3324821] INFO -- : [160/885] 3366194=test_tempfile I, [2024-05-24T03:31:52.971445 #3324821] INFO -- : [161/885] 3366187=test_noarg I, [2024-05-24T03:31:53.017670 #3324821] INFO -- : [162/885] 3366188=parse_comments_test I, [2024-05-24T03:31:53.070991 #3324821] INFO -- : [163/885] 3366197=test_basicsocket I, [2024-05-24T03:31:53.088984 #3324821] INFO -- : [164/885] 3366197=test_utf32 I, [2024-05-24T03:31:53.095507 #3324821] INFO -- : [165/885] 3366188=test_duplicate I, [2024-05-24T03:31:53.096788 #3324821] INFO -- : [166/885] 3366197=test_gem_commands_help_command I, [2024-05-24T03:31:53.101562 #3324821] INFO -- : [167/885] 3366188=test_rdoc_markup I, [2024-05-24T03:31:53.134289 #3324821] INFO -- : [168/885] 3366188=test_tracepoint I, [2024-05-24T03:31:53.165989 #3324821] INFO -- : [169/885] 3366194=test_prettyprint I, [2024-05-24T03:31:53.169238 #3324821] INFO -- : [170/885] 3366186=test_internal_ivar I, [2024-05-24T03:31:53.172635 #3324821] INFO -- : [171/885] 3366186=test_gem_resolver_index_specification I, [2024-05-24T03:31:53.173359 #3324821] INFO -- : [172/885] 3366187=test_rdoc_parser_rd I, [2024-05-24T03:31:53.182851 #3324821] INFO -- : [173/885] 3366194=test_date_strftime I, [2024-05-24T03:31:53.190152 #3324821] INFO -- : [174/885] 3366181=test_yamlstore I, [2024-05-24T03:31:53.197043 #3324821] INFO -- : [175/885] 3366181=test_gem_installer I, [2024-05-24T03:31:53.212299 #3324821] INFO -- : [176/885] 3366186=test_const I, [2024-05-24T03:31:53.214964 #3324821] INFO -- : [177/885] 3366186=test_rdoc_normal_class I, [2024-05-24T03:31:53.227875 #3324821] INFO -- : [178/885] 3366187=test_class I, [2024-05-24T03:31:53.271431 #3324821] INFO -- : [179/885] 3366186=test_load I, [2024-05-24T03:31:53.277449 #3324821] INFO -- : [180/885] 3366186=json_string_matching_test I, [2024-05-24T03:31:53.284541 #3324821] INFO -- : [181/885] 3366184=test_random I, [2024-05-24T03:31:53.286072 #3324821] INFO -- : [182/885] 3366186=test_asn1 I, [2024-05-24T03:31:53.286776 #3324821] INFO -- : [183/885] 3366184=test_irb I, [2024-05-24T03:31:53.309416 #3324821] INFO -- : [184/885] 3366186=test_rdoc_encoding I, [2024-05-24T03:31:53.360238 #3324821] INFO -- : [185/885] 3366193=test_coverage I, [2024-05-24T03:31:53.372682 #3324821] INFO -- : [186/885] 3366186=test_gem_package_tar_reader I, [2024-05-24T03:31:53.384532 #3324821] INFO -- : [187/885] 3366188=regexp_test I, [2024-05-24T03:31:53.386737 #3324821] INFO -- : [188/885] 3366196=test_complexrational I, [2024-05-24T03:31:53.391032 #3324821] INFO -- : [189/885] 3366196=test_init I, [2024-05-24T03:31:53.395770 #3324821] INFO -- : [190/885] 3366188=test_pathname I, [2024-05-24T03:31:53.409938 #3324821] INFO -- : [191/885] 3366186=test_gem_available_set I, [2024-05-24T03:31:53.453730 #3324821] INFO -- : [192/885] 3366197=test_rdoc_markdown I, [2024-05-24T03:31:53.486206 #3324821] INFO -- : [193/885] 3366194=test_modify_expand I, [2024-05-24T03:31:53.488833 #3324821] INFO -- : [194/885] 3366194=test_rdoc_any_method I, [2024-05-24T03:31:53.496416 #3324821] INFO -- : [195/885] 3366186=test_file I, [2024-05-24T03:31:53.516414 #3324821] INFO -- : [196/885] 3366186=test_rdoc_constant I, [2024-05-24T03:31:53.583818 #3324821] INFO -- : [197/885] 3366184=test_deprecate I, [2024-05-24T03:31:53.593251 #3324821] INFO -- : [198/885] 3366188=test_formatter I, [2024-05-24T03:31:53.601569 #3324821] INFO -- : [199/885] 3366188=test_bash_completion I, [2024-05-24T03:31:53.603772 #3324821] INFO -- : [200/885] 3366188=test_gem_commands_owner_command I, [2024-05-24T03:31:53.622123 #3324821] INFO -- : [201/885] 3366184=test_gem_source_vendor I, [2024-05-24T03:31:53.634458 #3324821] INFO -- : [202/885] 3366186=test_recorder I, [2024-05-24T03:31:53.639379 #3324821] INFO -- : [203/885] 3366186=test_marshalable I, [2024-05-24T03:31:53.643592 #3324821] INFO -- : [204/885] 3366186=test_digest I, [2024-05-24T03:31:53.644085 #3324821] INFO -- : [205/885] 3366184=test_gem_ext_cmake_builder I, [2024-05-24T03:31:53.670290 #3324821] INFO -- : [206/885] 3366184=test_gem_commands_contents_command I, [2024-05-24T03:31:53.695557 #3324821] INFO -- : [207/885] 3366180=test_cgi_util I, [2024-05-24T03:31:53.737391 #3324821] INFO -- : [208/885] 3366184=test_require I, [2024-05-24T03:31:53.751023 #3324821] INFO -- : [209/885] 3366196=test_fiddle I, [2024-05-24T03:31:53.822950 #3324821] INFO -- : [210/885] 3366196=test_wss I, [2024-05-24T03:31:53.843335 #3324821] INFO -- : [211/885] 3366196=test_ractor I, [2024-05-24T03:31:53.843866 #3324821] INFO -- : [212/885] 3366197=test_find I, [2024-05-24T03:31:53.856499 #3324821] INFO -- : [213/885] 3366197=test_io_timeout I, [2024-05-24T03:31:53.861967 #3324821] INFO -- : [214/885] 3366197=json_fixtures_test I, [2024-05-24T03:31:53.870773 #3324821] INFO -- : [215/885] 3366191=test_shapes I, [2024-05-24T03:31:53.873202 #3324821] INFO -- : [216/885] 3366197=test_comparable I, [2024-05-24T03:31:53.873684 #3324821] INFO -- : [217/885] 3366191=test_rdoc_parser_c I, [2024-05-24T03:31:53.879394 #3324821] INFO -- : [218/885] 3366197=test_gbk I, [2024-05-24T03:31:53.880869 #3324821] INFO -- : [219/885] 3366197=test_class2name I, [2024-05-24T03:31:53.884775 #3324821] INFO -- : [220/885] 3366197=test_enc_str_buf_cat I, [2024-05-24T03:31:53.888304 #3324821] INFO -- : [221/885] 3366197=test_cstr I, [2024-05-24T03:31:53.926083 #3324821] INFO -- : [222/885] 3366180=test_pstore I, [2024-05-24T03:31:53.948676 #3324821] INFO -- : [223/885] 3366196=test_profile_frames I, [2024-05-24T03:31:53.967913 #3324821] INFO -- : [224/885] 3366180=test_big2str I, [2024-05-24T03:31:53.975051 #3324821] INFO -- : [225/885] 3366180=test_yaml I, [2024-05-24T03:31:53.981022 #3324821] INFO -- : [226/885] 3366194=test_forwardable I, [2024-05-24T03:31:53.984676 #3324821] INFO -- : [227/885] 3366189=test_handle I, [2024-05-24T03:31:54.004050 #3324821] INFO -- : [228/885] 3366194=test_wait I, [2024-05-24T03:31:54.018357 #3324821] INFO -- : [229/885] 3366191=test_nowrite I, [2024-05-24T03:31:54.032317 #3324821] INFO -- : [230/885] 3366191=test_thread_queue I, [2024-05-24T03:31:54.069681 #3324821] INFO -- : [231/885] 3366194=test_rdoc_markup_formatter I, [2024-05-24T03:31:54.083504 #3324821] INFO -- : [232/885] 3366194=test_bmethod I, [2024-05-24T03:31:54.085597 #3324821] INFO -- : [233/885] 3366194=test_euc_tw I, [2024-05-24T03:31:54.089223 #3324821] INFO -- : [234/885] 3366194=test_ractor I, [2024-05-24T03:31:54.097510 #3324821] INFO -- : [235/885] 3366180=test_gem_commands_sources_command I, [2024-05-24T03:31:54.104398 #3324821] INFO -- : [236/885] 3366194=test_ansi_without_terminfo I, [2024-05-24T03:31:54.110390 #3324821] INFO -- : [237/885] 3366196=test_extlibs I, [2024-05-24T03:31:54.127876 #3324821] INFO -- : [238/885] 3366189=test_rdoc_generator_ri I, [2024-05-24T03:31:54.137888 #3324821] INFO -- : [239/885] 3366189=test_gem_stream_ui I, [2024-05-24T03:31:54.155604 #3324821] INFO -- : [240/885] 3366188=parse_test I, [2024-05-24T03:31:54.174873 #3324821] INFO -- : [241/885] 3366194=test_gem_install_update_options I, [2024-05-24T03:31:54.230896 #3324821] INFO -- : [242/885] 3366197=test_require_lib I, [2024-05-24T03:31:54.236265 #3324821] INFO -- : [243/885] 3366193=test_severity I, [2024-05-24T03:31:54.248858 #3324821] INFO -- : [244/885] 3366193=test_ractor I, [2024-05-24T03:31:54.254520 #3324821] INFO -- : [245/885] 3366180=test_objectspace I, [2024-05-24T03:31:54.264684 #3324821] INFO -- : [246/885] 3366193=test_socket I, [2024-05-24T03:31:54.352658 #3324821] INFO -- : [247/885] 3366192=test_thread I, [2024-05-24T03:31:54.431005 #3324821] INFO -- : [248/885] 3366194=test_rdoc_markup_to_table_of_contents I, [2024-05-24T03:31:54.438079 #3324821] INFO -- : [249/885] 3366189=test_c_struct_builder I, [2024-05-24T03:31:54.443155 #3324821] INFO -- : [250/885] 3366194=test_dot_dot I, [2024-05-24T03:31:54.447010 #3324821] INFO -- : [251/885] 3366194=test_str2big I, [2024-05-24T03:31:54.448317 #3324821] INFO -- : [252/885] 3366194=test_literal I, [2024-05-24T03:31:54.479930 #3324821] INFO -- : [253/885] 3366186=test_gem_version_option I, [2024-05-24T03:31:54.527093 #3324821] INFO -- : [254/885] 3366189=test_grapheme_breaks I, [2024-05-24T03:31:54.538434 #3324821] INFO -- : [255/885] 3366186=test_gem_request_connection_pools I, [2024-05-24T03:31:54.551095 #3324821] INFO -- : [256/885] 3366189=test_cclass I, [2024-05-24T03:31:54.570814 #3324821] INFO -- : [257/885] 3366192=test_reline I, [2024-05-24T03:31:54.609480 #3324821] INFO -- : [258/885] 3366190=test_parser_events I, [2024-05-24T03:31:54.647384 #3324821] INFO -- : [259/885] 3366189=test_pkey I, [2024-05-24T03:31:54.690779 #3324821] INFO -- : [260/885] 3366190=test_case I, [2024-05-24T03:31:54.693458 #3324821] INFO -- : [261/885] 3366189=test_json_tree I, [2024-05-24T03:31:54.696865 #3324821] INFO -- : [262/885] 3366190=test_rdoc_markup_to_markdown I, [2024-05-24T03:31:54.726379 #3324821] INFO -- : [263/885] 3366189=test_ansi_with_terminfo I, [2024-05-24T03:31:54.748959 #3324821] INFO -- : [264/885] 3366189=test_rdoc_generator_pot_po I, [2024-05-24T03:31:54.757398 #3324821] INFO -- : [265/885] 3366189=test_ractor I, [2024-05-24T03:31:54.804239 #3324821] INFO -- : [266/885] 3366189=test_memory_view I, [2024-05-24T03:31:54.833295 #3324821] INFO -- : [267/885] 3366192=test_m17n_comb I, [2024-05-24T03:31:54.841628 #3324821] INFO -- : [268/885] 3366190=test_sprintf_comb I, [2024-05-24T03:31:54.857520 #3324821] INFO -- : [269/885] 3366184=test_gem_request I, [2024-05-24T03:31:54.889383 #3324821] INFO -- : [270/885] 3366194=test_method_cache I, [2024-05-24T03:31:54.890548 #3324821] INFO -- : [271/885] 3366189=test_gem_commands_mirror I, [2024-05-24T03:31:54.895393 #3324821] INFO -- : [272/885] 3366189=test_gem_ext_cargo_builder_link_flag_converter I, [2024-05-24T03:31:54.908312 #3324821] INFO -- : [273/885] 3366194=test_gem_text I, [2024-05-24T03:31:54.939625 #3324821] INFO -- : [274/885] 3366189=test_settracefunc I, [2024-05-24T03:31:54.949470 #3324821] INFO -- : [275/885] 3366190=test_enumerator_kw I, [2024-05-24T03:31:54.951388 #3324821] INFO -- : [276/885] 3366194=test_scan_args I, [2024-05-24T03:31:54.953762 #3324821] INFO -- : [277/885] 3366190=test_win32ole I, [2024-05-24T03:31:54.956078 #3324821] INFO -- : [278/885] 3366190=test_generic I, [2024-05-24T03:31:54.962261 #3324821] INFO -- : [279/885] 3366194=test_store I, [2024-05-24T03:31:54.990987 #3324821] INFO -- : [280/885] 3366190=test_case_options I, [2024-05-24T03:31:54.994469 #3324821] INFO -- : [281/885] 3366190=test_gem_commands_info_command I, [2024-05-24T03:31:54.999610 #3324821] INFO -- : [282/885] 3366184=test_scalar I, [2024-05-24T03:31:55.002980 #3324821] INFO -- : [283/885] 3366184=test_gem_dependency_installer I, [2024-05-24T03:31:55.013963 #3324821] INFO -- : [284/885] 3366190=test_rdoc_cross_reference I, [2024-05-24T03:31:55.076342 #3324821] INFO -- : [285/885] 3366194=test_gem_name_tuple I, [2024-05-24T03:31:55.086741 #3324821] INFO -- : [286/885] 3366187=test_gem_package_tar_reader_entry I, [2024-05-24T03:31:55.087045 #3324821] INFO -- : [287/885] 3366194=test_rand I, [2024-05-24T03:31:55.158258 #3324821] INFO -- : [288/885] 3366180=test_bug_reporter I, [2024-05-24T03:31:55.234850 #3324821] INFO -- : [289/885] 3366187=test_exception I, [2024-05-24T03:31:55.259483 #3324821] INFO -- : [290/885] 3366193=test_nil2vtempty I, [2024-05-24T03:31:55.261919 #3324821] INFO -- : [291/885] 3366185=test_stream I, [2024-05-24T03:31:55.268816 #3324821] INFO -- : [292/885] 3366193=test_rdoc_context I, [2024-05-24T03:31:55.286952 #3324821] INFO -- : [293/885] 3366185=test_rdoc_parser_ruby I, [2024-05-24T03:31:55.314449 #3324821] INFO -- : [294/885] 3366194=test_open-uri I, [2024-05-24T03:31:55.416284 #3324821] INFO -- : [295/885] 3366190=test_httpresponse I, [2024-05-24T03:31:55.453612 #3324821] INFO -- : [296/885] 3366180=test_date_time I, [2024-05-24T03:31:55.466159 #3324821] INFO -- : [297/885] 3366180=test_rdoc_markup_to_joined_paragraph I, [2024-05-24T03:31:55.472329 #3324821] INFO -- : [298/885] 3366190=test_require I, [2024-05-24T03:31:55.473208 #3324821] INFO -- : [299/885] 3366190=test_data I, [2024-05-24T03:31:55.478553 #3324821] INFO -- : [300/885] 3366190=index_write_test I, [2024-05-24T03:31:55.538685 #3324821] INFO -- : [301/885] 3366190=test_date_new I, [2024-05-24T03:31:55.543409 #3324821] INFO -- : [302/885] 3366190=test_syntax I, [2024-05-24T03:31:55.582970 #3324821] INFO -- : [303/885] 3366186=test_gem_safe_yaml I, [2024-05-24T03:31:55.590760 #3324821] INFO -- : [304/885] 3366186=test_rdoc_text I, [2024-05-24T03:31:55.600310 #3324821] INFO -- : [305/885] 3366180=test_tcp I, [2024-05-24T03:31:55.642688 #3324821] INFO -- : [306/885] 3366198=test_iso_8859 I, [2024-05-24T03:31:55.643972 #3324821] INFO -- : [307/885] 3366186=test_gem_commands_specification_command I, [2024-05-24T03:31:55.675180 #3324821] INFO -- : [308/885] 3366198=test_inadvertent_creation I, [2024-05-24T03:31:55.722009 #3324821] INFO -- : [309/885] 3366180=test_flags I, [2024-05-24T03:31:55.727640 #3324821] INFO -- : [310/885] 3366194=test_enumerator I, [2024-05-24T03:31:55.738225 #3324821] INFO -- : [311/885] 3366186=test_http I, [2024-05-24T03:31:55.744420 #3324821] INFO -- : [312/885] 3366186=test_shift_jis I, [2024-05-24T03:31:55.747194 #3324821] INFO -- : [313/885] 3366186=test_gem_commands_which_command I, [2024-05-24T03:31:55.775881 #3324821] INFO -- : [314/885] 3366186=test_rdoc_markup_attribute_manager I, [2024-05-24T03:31:55.789223 #3324821] INFO -- : [315/885] 3366195=test_name_error I, [2024-05-24T03:31:55.802660 #3324821] INFO -- : [316/885] 3366186=test_gem_resolver I, [2024-05-24T03:31:55.824884 #3324821] INFO -- : [317/885] 3366198=test_safe_load I, [2024-05-24T03:31:55.852089 #3324821] INFO -- : [318/885] 3366198=test_gem_resolver_composed_set I, [2024-05-24T03:31:55.859925 #3324821] INFO -- : [319/885] 3366196=test_gem_commands_dependency_command I, [2024-05-24T03:31:55.862776 #3324821] INFO -- : [320/885] 3366185=test_gem_source_local I, [2024-05-24T03:31:55.865419 #3324821] INFO -- : [321/885] 3366198=test_gem_security_policy I, [2024-05-24T03:31:55.902611 #3324821] INFO -- : [322/885] 3366182=test_pack I, [2024-05-24T03:31:55.910165 #3324821] INFO -- : [323/885] 3366195=test_process I, [2024-05-24T03:31:55.932279 #3324821] INFO -- : [324/885] 3366189=test_last_thread I, [2024-05-24T03:31:55.935806 #3324821] INFO -- : [325/885] 3366196=test_x509cert I, [2024-05-24T03:31:56.012152 #3324821] INFO -- : [326/885] 3366186=test_gc I, [2024-05-24T03:31:56.096062 #3324821] INFO -- : [327/885] 3366198=test_gem_resolver_lock_specification I, [2024-05-24T03:31:56.115841 #3324821] INFO -- : [328/885] 3366193=test_err_in_callback I, [2024-05-24T03:31:56.118571 #3324821] INFO -- : [329/885] 3366193=test_logdevice I, [2024-05-24T03:31:56.151129 #3324821] INFO -- : [330/885] 3366198=test_gem_ext_rake_builder I, [2024-05-24T03:31:56.174327 #3324821] INFO -- : [331/885] 3366182=test_arity I, [2024-05-24T03:31:56.175980 #3324821] INFO -- : [332/885] 3366182=test_switch_hitter I, [2024-05-24T03:31:56.197036 #3324821] INFO -- : [333/885] 3366182=test_io_console I, [2024-05-24T03:31:56.214636 #3324821] INFO -- : [334/885] 3366196=test_singleton I, [2024-05-24T03:31:56.219189 #3324821] INFO -- : [335/885] 3366196=test_flush I, [2024-05-24T03:31:56.220939 #3324821] INFO -- : [336/885] 3366196=test_logperiod I, [2024-05-24T03:31:56.231423 #3324821] INFO -- : [337/885] 3366196=test_rdoc_markdown_test I, [2024-05-24T03:31:56.243009 #3324821] INFO -- : [338/885] 3366185=test_rdoc_normal_module I, [2024-05-24T03:31:56.277022 #3324821] INFO -- : [339/885] 3366185=test_c_union_entity I, [2024-05-24T03:31:56.312241 #3324821] INFO -- : [340/885] 3366185=test_securerandom I, [2024-05-24T03:31:56.336119 #3324821] INFO -- : [341/885] 3366185=test_thread_fd_close I, [2024-05-24T03:31:56.340141 #3324821] INFO -- : [342/885] 3366185=test_passing_block I, [2024-05-24T03:31:56.343267 #3324821] INFO -- : [343/885] 3366185=test_stringchar I, [2024-05-24T03:31:56.396251 #3324821] INFO -- : [344/885] 3366185=test_hash_create I, [2024-05-24T03:31:56.397247 #3324821] INFO -- : [345/885] 3366185=newline_test I, [2024-05-24T03:31:56.532467 #3324821] INFO -- : [346/885] 3366185=test_uncorrectable_name_check I, [2024-05-24T03:31:56.539745 #3324821] INFO -- : [347/885] 3366185=test_yaml_special_cases I, [2024-05-24T03:31:56.544716 #3324821] INFO -- : [348/885] 3366185=test_optarg I, [2024-05-24T03:31:56.683164 #3324821] INFO -- : [349/885] 3366185=test_gem_source_list I, [2024-05-24T03:31:56.724209 #3324821] INFO -- : [350/885] 3366185=test_config I, [2024-05-24T03:31:56.752806 #3324821] INFO -- : [351/885] 3366180=test_address_resolve I, [2024-05-24T03:31:56.761695 #3324821] INFO -- : [352/885] 3366180=test_rdoc_token_stream I, [2024-05-24T03:31:56.769111 #3324821] INFO -- : [353/885] 3366180=test_iter_break I, [2024-05-24T03:31:56.771587 #3324821] INFO -- : [354/885] 3366180=test_exception I, [2024-05-24T03:31:56.776324 #3324821] INFO -- : [355/885] 3366198=test_zsh_completion I, [2024-05-24T03:31:56.779709 #3324821] INFO -- : [356/885] 3366198=test_pp I, [2024-05-24T03:31:56.780991 #3324821] INFO -- : [357/885] 3366180=test_frozen I, [2024-05-24T03:31:56.784751 #3324821] INFO -- : [358/885] 3366180=test_gem_ext_configure_builder I, [2024-05-24T03:31:56.790571 #3324821] INFO -- : [359/885] 3366185=test_macro I, [2024-05-24T03:31:56.793995 #3324821] INFO -- : [360/885] 3366185=test_nil I, [2024-05-24T03:31:56.797100 #3324821] INFO -- : [361/885] 3366185=test_num2int I, [2024-05-24T03:31:56.809566 #3324821] INFO -- : [362/885] 3366185=test_rdoc_single_class I, [2024-05-24T03:31:56.809816 #3324821] INFO -- : [363/885] 3366198=test_verbose I, [2024-05-24T03:31:56.812222 #3324821] INFO -- : [364/885] 3366185=test_rdoc_tom_doc I, [2024-05-24T03:31:56.817548 #3324821] INFO -- : [365/885] 3366180=test_rdoc_markup_to_tt_only I, [2024-05-24T03:31:56.819911 #3324821] INFO -- : [366/885] 3366198=test_hmac I, [2024-05-24T03:31:56.831120 #3324821] INFO -- : [367/885] 3366198=test_gem_spec_fetcher I, [2024-05-24T03:31:56.833258 #3324821] INFO -- : [368/885] 3366185=test_common I, [2024-05-24T03:31:56.846369 #3324821] INFO -- : [369/885] 3366180=test_bug-3571 I, [2024-05-24T03:31:56.860622 #3324821] INFO -- : [370/885] 3366180=test_key_actor_vi I, [2024-05-24T03:31:56.918431 #3324821] INFO -- : [371/885] 3366184=test_gem_command I, [2024-05-24T03:31:56.952624 #3324821] INFO -- : [372/885] 3366193=test_gem_commands_lock_command I, [2024-05-24T03:31:56.954420 #3324821] INFO -- : [373/885] 3366198=test_assignment I, [2024-05-24T03:31:56.971168 #3324821] INFO -- : [374/885] 3366193=test_ifunless I, [2024-05-24T03:31:56.973391 #3324821] INFO -- : [375/885] 3366193=test_numeric I, [2024-05-24T03:31:56.991363 #3324821] INFO -- : [376/885] 3366187=test_rdoc_markup_paragraph I, [2024-05-24T03:31:56.994051 #3324821] INFO -- : [377/885] 3366184=!Nothing_to_test I, [2024-05-24T03:31:56.994942 #3324821] INFO -- : [378/885] 3366184=test_psych I, [2024-05-24T03:31:56.997124 #3324821] INFO -- : [379/885] 3366187=test_enc_raise I, [2024-05-24T03:31:57.005764 #3324821] INFO -- : [380/885] 3366189=test_gem_rdoc I, [2024-05-24T03:31:57.010463 #3324821] INFO -- : [381/885] 3366180=test_date I, [2024-05-24T03:31:57.015679 #3324821] INFO -- : [382/885] 3366184=test_gem_ext_cargo_builder_unit I, [2024-05-24T03:31:57.016235 #3324821] INFO -- : [383/885] 3366180=test_at_exit I, [2024-05-24T03:31:57.020549 #3324821] INFO -- : [384/885] 3366187=test_command I, [2024-05-24T03:31:57.035009 #3324821] INFO -- : [385/885] 3366193=test_object_create_start I, [2024-05-24T03:31:57.035111 #3324821] INFO -- : [386/885] 3366180=test_gem_silent_ui I, [2024-05-24T03:31:57.035519 #3324821] INFO -- : [387/885] 3366184=test_emitter I, [2024-05-24T03:31:57.037923 #3324821] INFO -- : [388/885] 3366193=test_files_ext I, [2024-05-24T03:31:57.042125 #3324821] INFO -- : [389/885] 3366184=test_bug-5832 I, [2024-05-24T03:31:57.047157 #3324821] INFO -- : [390/885] 3366184=dispatcher_test I, [2024-05-24T03:31:57.060815 #3324821] INFO -- : [391/885] 3366184=test_eval_history I, [2024-05-24T03:31:57.069543 #3324821] INFO -- : [392/885] 3366180=test_kernel I, [2024-05-24T03:31:57.070537 #3324821] INFO -- : [393/885] 3366185=test_gem_doctor I, [2024-05-24T03:31:57.071547 #3324821] INFO -- : [394/885] 3366184=test_kdf I, [2024-05-24T03:31:57.078847 #3324821] INFO -- : [395/885] 3366179=test_rdoc_i18n_text I, [2024-05-24T03:31:57.087156 #3324821] INFO -- : [396/885] 3366196=test_key_name_check I, [2024-05-24T03:31:57.093599 #3324821] INFO -- : [397/885] 3366196=test_backtrace I, [2024-05-24T03:31:57.097074 #3324821] INFO -- : [398/885] 3366196=test_defined I, [2024-05-24T03:31:57.112505 #3324821] INFO -- : [399/885] 3366193=test_io_buffer I, [2024-05-24T03:31:57.114418 #3324821] INFO -- : [400/885] 3366185=test_gb18030 I, [2024-05-24T03:31:57.118568 #3324821] INFO -- : [401/885] 3366185=test_buffering I, [2024-05-24T03:31:57.138546 #3324821] INFO -- : [402/885] 3366185=test_svcb_https I, [2024-05-24T03:31:57.142802 #3324821] INFO -- : [403/885] 3366184=test_gem_uninstaller I, [2024-05-24T03:31:57.146434 #3324821] INFO -- : [404/885] 3366188=test_rdoc_rdoc I, [2024-05-24T03:31:57.152512 #3324821] INFO -- : [405/885] 3366193=test_time I, [2024-05-24T03:31:57.161636 #3324821] INFO -- : [406/885] 3366185=test_windows_1251 I, [2024-05-24T03:31:57.165564 #3324821] INFO -- : [407/885] 3366196=test_rdoc_markup_attributes I, [2024-05-24T03:31:57.166019 #3324821] INFO -- : [408/885] 3366185=test_default_gems I, [2024-05-24T03:31:57.166912 #3324821] INFO -- : [409/885] 3366189=test_rdoc_markup_to_rdoc I, [2024-05-24T03:31:57.173234 #3324821] INFO -- : [410/885] 3366196=test_rdoc_rd_inline_parser I, [2024-05-24T03:31:57.187829 #3324821] INFO -- : [411/885] 3366179=test_mul I, [2024-05-24T03:31:57.194483 #3324821] INFO -- : [412/885] 3366196=test_null I, [2024-05-24T03:31:57.196753 #3324821] INFO -- : [413/885] 3366179=test_win32ole_type I, [2024-05-24T03:31:57.196820 #3324821] INFO -- : [414/885] 3366179=test_pkey_ec I, [2024-05-24T03:31:57.197907 #3324821] INFO -- : [415/885] 3366196=test_pipe I, [2024-05-24T03:31:57.211147 #3324821] INFO -- : [416/885] 3366189=test_thread I, [2024-05-24T03:31:57.212451 #3324821] INFO -- : [417/885] 3366189=test_trick I, [2024-05-24T03:31:57.223057 #3324821] INFO -- : [418/885] 3366188=test_date_parse I, [2024-05-24T03:31:57.229755 #3324821] INFO -- : [419/885] 3366185=test_x509attr I, [2024-05-24T03:31:57.237011 #3324821] INFO -- : [420/885] 3366185=test_raise I, [2024-05-24T03:31:57.237272 #3324821] INFO -- : [421/885] 3366185=test_depth_first I, [2024-05-24T03:31:57.241162 #3324821] INFO -- : [422/885] 3366185=test_gem_request_set_lockfile_parser I, [2024-05-24T03:31:57.274106 #3324821] INFO -- : [423/885] 3366193=test_rdoc_store I, [2024-05-24T03:31:57.295129 #3324821] INFO -- : [424/885] 3366179=test_string I, [2024-05-24T03:31:57.317162 #3324821] INFO -- : [425/885] 3366179=test_pattern_matching I, [2024-05-24T03:31:57.330871 #3324821] INFO -- : [426/885] 3366179=test_rdoc_stats I, [2024-05-24T03:31:57.334250 #3324821] INFO -- : [427/885] 3366188=test_qsort I, [2024-05-24T03:31:57.336076 #3324821] INFO -- : [428/885] 3366185=test_rdoc_parser I, [2024-05-24T03:31:57.339607 #3324821] INFO -- : [429/885] 3366188=test_gem_dependency_resolution_error I, [2024-05-24T03:31:57.341786 #3324821] INFO -- : [430/885] 3366196=test_custom_command I, [2024-05-24T03:31:57.346102 #3324821] INFO -- : [431/885] 3366188=json_addition_test I, [2024-05-24T03:31:57.350737 #3324821] INFO -- : [432/885] 3366196=test_gem_package_old I, [2024-05-24T03:31:57.354284 #3324821] INFO -- : [433/885] 3366185=test_gem_resolver_index_set I, [2024-05-24T03:31:57.358995 #3324821] INFO -- : [434/885] 3366188=test_string I, [2024-05-24T03:31:57.381492 #3324821] INFO -- : [435/885] 3366179=test_proc I, [2024-05-24T03:31:57.382330 #3324821] INFO -- : [436/885] 3366185=test_gc_compact I, [2024-05-24T03:31:57.400126 #3324821] INFO -- : [437/885] 3366196=test_optimization I, [2024-05-24T03:31:57.400829 #3324821] INFO -- : [438/885] 3366187=test_date_conv I, [2024-05-24T03:31:57.409769 #3324821] INFO -- : [439/885] 3366187=test_erb_m17n I, [2024-05-24T03:31:57.415448 #3324821] INFO -- : [440/885] 3366187=test_ole_methods I, [2024-05-24T03:31:57.415511 #3324821] INFO -- : [441/885] 3366187=test_egrep_cpp I, [2024-05-24T03:31:57.425184 #3324821] INFO -- : [442/885] 3366181=test_zlib I, [2024-05-24T03:31:57.537313 #3324821] INFO -- : [443/885] 3366192=test_cgi_tag_helper I, [2024-05-24T03:31:57.557825 #3324821] INFO -- : [444/885] 3366192=test_files_test_2 I, [2024-05-24T03:31:57.567695 #3324821] INFO -- : [445/885] 3366197=test_fnmatch I, [2024-05-24T03:31:57.569150 #3324821] INFO -- : [446/885] 3366187=test_folderitem2_invokeverb I, [2024-05-24T03:31:57.570850 #3324821] INFO -- : [447/885] 3366180=test_rdoc_markup_parser I, [2024-05-24T03:31:57.571479 #3324821] INFO -- : [448/885] 3366187=test_require_path_check I, [2024-05-24T03:31:57.609684 #3324821] INFO -- : [449/885] 3366180=test_gem_validator I, [2024-05-24T03:31:57.615626 #3324821] INFO -- : [450/885] 3366197=test_x509name I, [2024-05-24T03:31:57.633021 #3324821] INFO -- : [451/885] 3366197=test_fips I, [2024-05-24T03:31:57.638973 #3324821] INFO -- : [452/885] 3366180=test_update I, [2024-05-24T03:31:57.641040 #3324821] INFO -- : [453/885] 3366187=test_rdoc_code_object I, [2024-05-24T03:31:57.647870 #3324821] INFO -- : [454/885] 3366180=test_x509store I, [2024-05-24T03:31:57.867827 #3324821] INFO -- : [455/885] 3366193=test_webauthn_listener I, [2024-05-24T03:31:57.919319 #3324821] INFO -- : [456/885] 3366197=test_ast I, [2024-05-24T03:31:57.925934 #3324821] INFO -- : [457/885] 3366193=test_gem_request_set_gem_dependency_api I, [2024-05-24T03:31:57.963345 #3324821] INFO -- : [458/885] 3366187=test_lambda I, [2024-05-24T03:31:57.999752 #3324821] INFO -- : [459/885] 3366184=test_jaro_winkler I, [2024-05-24T03:31:58.003814 #3324821] INFO -- : [460/885] 3366184=test_helper I, [2024-05-24T03:31:58.005034 #3324821] INFO -- : [461/885] 3366184=test_random_formatter I, [2024-05-24T03:31:58.012938 #3324821] INFO -- : [462/885] 3366187=test_gem_safe_marshal I, [2024-05-24T03:31:58.022548 #3324821] INFO -- : [463/885] 3366184=test_gem_resolver_api_set I, [2024-05-24T03:31:58.065385 #3324821] INFO -- : [464/885] 3366180=test_gem_resolver_vendor_set I, [2024-05-24T03:31:58.078015 #3324821] INFO -- : [465/885] 3366184=test_config I, [2024-05-24T03:31:58.088544 #3324821] INFO -- : [466/885] 3366180=test_enumerable I, [2024-05-24T03:31:58.095615 #3324821] INFO -- : [467/885] 3366180=test_eval I, [2024-05-24T03:31:58.103992 #3324821] INFO -- : [468/885] 3366193=json_generator_test I, [2024-05-24T03:31:58.104391 #3324821] INFO -- : [469/885] 3366198=test_transcode I, [2024-05-24T03:31:58.186020 #3324821] INFO -- : [470/885] 3366193=command_line_test I, [2024-05-24T03:31:58.194094 #3324821] INFO -- : [471/885] 3366193=test_constant I, [2024-05-24T03:31:58.196591 #3324821] INFO -- : [472/885] 3366179=test_dup I, [2024-05-24T03:31:58.209780 #3324821] INFO -- : [473/885] 3366191=test_pty I, [2024-05-24T03:31:58.291624 #3324821] INFO -- : [474/885] 3366198=test_range I, [2024-05-24T03:31:58.377413 #3324821] INFO -- : [475/885] 3366179=test_project_sanity I, [2024-05-24T03:31:58.428888 #3324821] INFO -- : [476/885] 3366180=test_gem_uri_formatter I, [2024-05-24T03:31:58.445139 #3324821] INFO -- : [477/885] 3366180=test_encoding I, [2024-05-24T03:31:58.503895 #3324821] INFO -- : [478/885] 3366187=test_erb_command I, [2024-05-24T03:31:58.520824 #3324821] INFO -- : [479/885] 3366184=test_helper I, [2024-05-24T03:31:58.526735 #3324821] INFO -- : [480/885] 3366184=test_ts I, [2024-05-24T03:31:58.548239 #3324821] INFO -- : [481/885] 3366187=test_locale I, [2024-05-24T03:31:58.563645 #3324821] INFO -- : [482/885] 3366179=test_addr I, [2024-05-24T03:31:58.571220 #3324821] INFO -- : [483/885] 3366179=library_symbols_test I, [2024-05-24T03:31:58.574906 #3324821] INFO -- : [484/885] 3366187=test_ensured I, [2024-05-24T03:31:58.581009 #3324821] INFO -- : [485/885] 3366179=test_rdoc_ri_paths I, [2024-05-24T03:31:58.601164 #3324821] INFO -- : [486/885] 3366179=test_vm_dump I, [2024-05-24T03:31:58.606709 #3324821] INFO -- : [487/885] 3366179=test_integer_comb I, [2024-05-24T03:31:58.618256 #3324821] INFO -- : [488/885] 3366180=test_rdoc_markup_document I, [2024-05-24T03:31:58.631835 #3324821] INFO -- : [489/885] 3366180=test_tmpdir I, [2024-05-24T03:31:58.664193 #3324821] INFO -- : [490/885] 3366187=test_gem_commands_check_command I, [2024-05-24T03:31:58.700527 #3324821] INFO -- : [491/885] 3366187=test_regexp I, [2024-05-24T03:31:58.707874 #3324821] INFO -- : [492/885] 3366180=errors_test I, [2024-05-24T03:31:58.719910 #3324821] INFO -- : [493/885] 3366191=static_inspect_test I, [2024-05-24T03:31:58.800426 #3324821] INFO -- : [494/885] 3366191=test_ostruct I, [2024-05-24T03:31:58.810817 #3324821] INFO -- : [495/885] 3366180=unescape_test I, [2024-05-24T03:31:58.922283 #3324821] INFO -- : [496/885] 3366182=test_force_exit I, [2024-05-24T03:31:58.971794 #3324821] INFO -- : [497/885] 3366182=test_file I, [2024-05-24T03:31:59.010808 #3324821] INFO -- : [498/885] 3366191=bom_test I, [2024-05-24T03:31:59.017428 #3324821] INFO -- : [499/885] 3366198=test_data_error I, [2024-05-24T03:31:59.025146 #3324821] INFO -- : [500/885] 3366191=test_udp I, [2024-05-24T03:31:59.029267 #3324821] INFO -- : [501/885] 3366191=test_gem_local_remote_options I, [2024-05-24T03:31:59.068595 #3324821] INFO -- : [502/885] 3366191=test_ruby_lex I, [2024-05-24T03:31:59.083415 #3324821] INFO -- : [503/885] 3366184=test_object I, [2024-05-24T03:31:59.097111 #3324821] INFO -- : [504/885] 3366198=test_date_arith I, [2024-05-24T03:31:59.103498 #3324821] INFO -- : [505/885] 3366198=test_sleep I, [2024-05-24T03:31:59.225800 #3324821] INFO -- : [506/885] 3366189=test_flip I, [2024-05-24T03:31:59.249747 #3324821] INFO -- : [507/885] 3366189=compiler_test I, [2024-05-24T03:31:59.266811 #3324821] INFO -- : [508/885] 3366191=test_change_word I, [2024-05-24T03:31:59.269164 #3324821] INFO -- : [509/885] 3366191=test_normalize I, [2024-05-24T03:31:59.285463 #3324821] INFO -- : [510/885] 3366191=test_ossl I, [2024-05-24T03:31:59.298907 #3324821] INFO -- : [511/885] 3366189=test_timeout I, [2024-05-24T03:31:59.303668 #3324821] INFO -- : [512/885] 3366189=test_rdoc_rd_block_parser I, [2024-05-24T03:31:59.361523 #3324821] INFO -- : [513/885] 3366189=test_tsort I, [2024-05-24T03:31:59.363122 #3324821] INFO -- : [514/885] 3366189=test_signedness I, [2024-05-24T03:31:59.493228 #3324821] INFO -- : [515/885] 3366184=test_type I, [2024-05-24T03:31:59.510685 #3324821] INFO -- : [516/885] 3366184=test_ractor I, [2024-05-24T03:31:59.600403 #3324821] INFO -- : [517/885] 3366184=test_pointer I, [2024-05-24T03:31:59.953104 #3324821] INFO -- : [518/885] 3366180=test_big5 I, [2024-05-24T03:31:59.955536 #3324821] INFO -- : [519/885] 3366180=test_func I, [2024-05-24T03:32:00.134757 #3324821] INFO -- : [520/885] 3366184=version_test I, [2024-05-24T03:32:00.140303 #3324821] INFO -- : [521/885] 3366184=heredoc_dedent_test I, [2024-05-24T03:32:00.144178 #3324821] INFO -- : [522/885] 3366184=test_cgi_header I, [2024-05-24T03:32:00.148930 #3324821] INFO -- : [523/885] 3366184=test_object I, [2024-05-24T03:32:00.150806 #3324821] INFO -- : [524/885] 3366184=test_arithmetic_sequence I, [2024-05-24T03:32:00.161586 #3324821] INFO -- : [525/885] 3366184=test_key_actor_emacs I, [2024-05-24T03:32:00.218402 #3324821] INFO -- : [526/885] 3366185=test_gem_command_manager I, [2024-05-24T03:32:00.247559 #3324821] INFO -- : [527/885] 3366184=test_basicinstructions I, [2024-05-24T03:32:00.330012 #3324821] INFO -- : [528/885] 3366184=test_gem_gemcutter_utilities I, [2024-05-24T03:32:00.342910 #3324821] INFO -- : [529/885] 3366185=test_logger I, [2024-05-24T03:32:00.354968 #3324821] INFO -- : [530/885] 3366185=test_gem_update_suggestion I, [2024-05-24T03:32:00.356447 #3324821] INFO -- : [531/885] 3366192=test_files_test I, [2024-05-24T03:32:00.359196 #3324821] INFO -- : [532/885] 3366192=test_file_exhaustive I, [2024-05-24T03:32:00.411681 #3324821] INFO -- : [533/885] 3366185=test_rdoc_parser_markdown I, [2024-05-24T03:32:00.430764 #3324821] INFO -- : [534/885] 3366185=test_import I, [2024-05-24T03:32:00.448550 #3324821] INFO -- : [535/885] 3366193=test_not I, [2024-05-24T03:32:00.454481 #3324821] INFO -- : [536/885] 3366193=test_gem_resolver_lock_set I, [2024-05-24T03:32:00.473700 #3324821] INFO -- : [537/885] 3366193=test_rdoc_markup_hard_break I, [2024-05-24T03:32:00.474469 #3324821] INFO -- : [538/885] 3366193=test_placearg I, [2024-05-24T03:32:00.534142 #3324821] INFO -- : [539/885] 3366193=test_gem_package_task I, [2024-05-24T03:32:00.544673 #3324821] INFO -- : [540/885] 3366193=test_date_strptime I, [2024-05-24T03:32:00.605553 #3324821] INFO -- : [541/885] 3366181=test_gem_platform I, [2024-05-24T03:32:00.607386 #3324821] INFO -- : [542/885] 3366193=test_pkey_rsa I, [2024-05-24T03:32:00.651664 #3324821] INFO -- : [543/885] 3366184=test_numhash I, [2024-05-24T03:32:00.657123 #3324821] INFO -- : [544/885] 3366184=test_gem_commands_push_command I, [2024-05-24T03:32:00.701819 #3324821] INFO -- : [545/885] 3366181=test_weakkeymap I, [2024-05-24T03:32:00.786928 #3324821] INFO -- : [546/885] 3366193=test_continuation I, [2024-05-24T03:32:00.791350 #3324821] INFO -- : [547/885] 3366193=test_fd_setsize I, [2024-05-24T03:32:00.793409 #3324821] INFO -- : [548/885] 3366193=test_class_name_check I, [2024-05-24T03:32:00.816847 #3324821] INFO -- : [549/885] 3366193=test_keyword I, [2024-05-24T03:32:00.844506 #3324821] INFO -- : [550/885] 3366181=test_delete I, [2024-05-24T03:32:00.851565 #3324821] INFO -- : [551/885] 3366181=test_win32ole_method I, [2024-05-24T03:32:00.867959 #3324821] INFO -- : [552/885] 3366181=test_pkcs7 I, [2024-05-24T03:32:00.990196 #3324821] INFO -- : [553/885] 3366181=test_arith_seq_beg_len_step I, [2024-05-24T03:32:01.037130 #3324821] INFO -- : [554/885] 3366181=test_gem_resolver_requirement_list I, [2024-05-24T03:32:01.037361 #3324821] INFO -- : [555/885] 3366181=test_function_entry I, [2024-05-24T03:32:01.039786 #3324821] INFO -- : [556/885] 3366181=test_find_executable I, [2024-05-24T03:32:01.060674 #3324821] INFO -- : [557/885] 3366181=ruby_api_test I, [2024-05-24T03:32:01.165011 #3324821] INFO -- : [558/885] 3366184=test_nofree I, [2024-05-24T03:32:01.168259 #3324821] INFO -- : [559/885] 3366184=test_context I, [2024-05-24T03:32:01.208569 #3324821] INFO -- : [560/885] 3366181=test_gem_commands_pristine_command I, [2024-05-24T03:32:01.214104 #3324821] INFO -- : [561/885] 3366179=test_symbol I, [2024-05-24T03:32:01.218442 #3324821] INFO -- : [562/885] 3366185=test_coder I, [2024-05-24T03:32:01.226124 #3324821] INFO -- : [563/885] 3366185=test_unix I, [2024-05-24T03:32:01.242703 #3324821] INFO -- : [564/885] 3366193=test_enc_associate I, [2024-05-24T03:32:01.255718 #3324821] INFO -- : [565/885] 3366185=test_lazy_enumerator I, [2024-05-24T03:32:01.269875 #3324821] INFO -- : [566/885] 3366184=test_eval I, [2024-05-24T03:32:01.271612 #3324821] INFO -- : [567/885] 3366184=test_autoconf I, [2024-05-24T03:32:01.277043 #3324821] INFO -- : [568/885] 3366184=format_errors_test I, [2024-05-24T03:32:01.289031 #3324821] INFO -- : [569/885] 3366184=test_dir I, [2024-05-24T03:32:01.347286 #3324821] INFO -- : [570/885] 3366189=test_gem_console_ui I, [2024-05-24T03:32:01.365306 #3324821] INFO -- : [571/885] 3366189=test_date_ractor I, [2024-05-24T03:32:01.577664 #3324821] INFO -- : [572/885] 3366184=test_ractor_compatibility I, [2024-05-24T03:32:01.578738 #3324821] INFO -- : [573/885] 3366189=test_member I, [2024-05-24T03:32:01.582252 #3324821] INFO -- : [574/885] 3366189=test_numeric I, [2024-05-24T03:32:01.593061 #3324821] INFO -- : [575/885] 3366189=test_word I, [2024-05-24T03:32:01.599244 #3324821] INFO -- : [576/885] 3366189=test_gem_commands_cleanup_command I, [2024-05-24T03:32:01.615629 #3324821] INFO -- : [577/885] 3366185=test_cgi_multipart I, [2024-05-24T03:32:01.712917 #3324821] INFO -- : [578/885] 3366180=test_resize I, [2024-05-24T03:32:01.728222 #3324821] INFO -- : [579/885] 3366180=test_error_highlight I, [2024-05-24T03:32:01.774624 #3324821] INFO -- : [580/885] 3366185=test_rdoc_comment I, [2024-05-24T03:32:01.789683 #3324821] INFO -- : [581/885] 3366190=test_rdoc_generator_darkfish I, [2024-05-24T03:32:01.824452 #3324821] INFO -- : [582/885] 3366185=json_generic_object_test I, [2024-05-24T03:32:01.834478 #3324821] INFO -- : [583/885] 3366193=test_gem_source_fetch_problem I, [2024-05-24T03:32:01.839305 #3324821] INFO -- : [584/885] 3366185=test_http_request I, [2024-05-24T03:32:01.845891 #3324821] INFO -- : [585/885] 3366193=test_symbol I, [2024-05-24T03:32:01.851560 #3324821] INFO -- : [586/885] 3366193=location_test I, [2024-05-24T03:32:01.870614 #3324821] INFO -- : [587/885] 3366185=test_coderange I, [2024-05-24T03:32:01.877221 #3324821] INFO -- : [588/885] 3366185=test_mailto I, [2024-05-24T03:32:01.881973 #3324821] INFO -- : [589/885] 3366193=test_rdoc_extend I, [2024-05-24T03:32:01.886531 #3324821] INFO -- : [590/885] 3366185=test_merge_keys I, [2024-05-24T03:32:01.892106 #3324821] INFO -- : [591/885] 3366185=test_gem_resolver_api_specification I, [2024-05-24T03:32:01.904717 #3324821] INFO -- : [592/885] 3366193=test_win32ole_variant I, [2024-05-24T03:32:01.904863 #3324821] INFO -- : [593/885] 3366193=test_rdoc_markup_to_ansi I, [2024-05-24T03:32:01.912684 #3324821] INFO -- : [594/885] 3366184=test_history I, [2024-05-24T03:32:01.924766 #3324821] INFO -- : [595/885] 3366184=test_mixed_unicode_escapes I, [2024-05-24T03:32:01.930899 #3324821] INFO -- : [596/885] 3366184=test_ipaddr I, [2024-05-24T03:32:01.932494 #3324821] INFO -- : [597/885] 3366193=test_gem_ci_detector I, [2024-05-24T03:32:01.938820 #3324821] INFO -- : [598/885] 3366185=test_bignum I, [2024-05-24T03:32:01.950069 #3324821] INFO -- : [599/885] 3366193=test_rdoc_class_module I, [2024-05-24T03:32:01.952051 #3324821] INFO -- : [600/885] 3366184=test_io_wait_uncommon I, [2024-05-24T03:32:01.955674 #3324821] INFO -- : [601/885] 3366184=test_arity I, [2024-05-24T03:32:01.959607 #3324821] INFO -- : [602/885] 3366184=test_stringio I, [2024-05-24T03:32:01.965062 #3324821] INFO -- : [603/885] 3366189=test_win32ole_variable I, [2024-05-24T03:32:01.967512 #3324821] INFO -- : [604/885] 3366189=ractor_test I, [2024-05-24T03:32:02.025446 #3324821] INFO -- : [605/885] 3366184=test_trace I, [2024-05-24T03:32:02.036643 #3324821] INFO -- : [606/885] 3366184=test_win32ole_event I, [2024-05-24T03:32:02.046860 #3324821] INFO -- : [607/885] 3366184=test_time_tz I, [2024-05-24T03:32:02.055374 #3324821] INFO -- : [608/885] 3366189=test_rdoc_generator_json_index I, [2024-05-24T03:32:02.103361 #3324821] INFO -- : [609/885] 3366189=test_complex2 I, [2024-05-24T03:32:02.112611 #3324821] INFO -- : [610/885] 3366189=test_resolve_symbol I, [2024-05-24T03:32:02.117248 #3324821] INFO -- : [611/885] 3366184=test_gem_package I, [2024-05-24T03:32:02.128002 #3324821] INFO -- : [612/885] 3366190=test_have_macro I, [2024-05-24T03:32:02.165046 #3324821] INFO -- : [613/885] 3366189=test_gem_specification I, [2024-05-24T03:32:02.302326 #3324821] INFO -- : [614/885] 3366180=test_enum I, [2024-05-24T03:32:02.322570 #3324821] INFO -- : [615/885] 3366193=test_threadgroup I, [2024-05-24T03:32:02.351371 #3324821] INFO -- : [616/885] 3366181=test_ssl I, [2024-05-24T03:32:02.625915 #3324821] INFO -- : [617/885] 3366190=test_debugger_integration I, [2024-05-24T03:32:02.641354 #3324821] INFO -- : [618/885] 3366190=test_rendering I, [2024-05-24T03:32:02.717159 #3324821] INFO -- : [619/885] 3366190=test_thread I, [2024-05-24T03:32:02.840388 #3324821] INFO -- : [620/885] 3366181=json_ext_parser_test I, [2024-05-24T03:32:02.846092 #3324821] INFO -- : [621/885] 3366181=test_my_integer I, [2024-05-24T03:32:02.852517 #3324821] INFO -- : [622/885] 3366181=test_ractor I, [2024-05-24T03:32:02.888502 #3324821] INFO -- : [623/885] 3366184=test_timeout I, [2024-05-24T03:32:03.021458 #3324821] INFO -- : [624/885] 3366179=test_alias I, [2024-05-24T03:32:03.078866 #3324821] INFO -- : [625/885] 3366180=test_nonblock I, [2024-05-24T03:32:03.084723 #3324821] INFO -- : [626/885] 3366180=test_weakref I, [2024-05-24T03:32:03.171390 #3324821] INFO -- : [627/885] 3366179=test_unicode_normalize I, [2024-05-24T03:32:03.191293 #3324821] INFO -- : [628/885] 3366180=test_marshal I, [2024-05-24T03:32:03.262626 #3324821] INFO -- : [629/885] 3366181=test_reline_key I, [2024-05-24T03:32:03.265697 #3324821] INFO -- : [630/885] 3366186=test_rb_str_dup I, [2024-05-24T03:32:03.268846 #3324821] INFO -- : [631/885] 3366186=test_singleton_function I, [2024-05-24T03:32:03.271175 #3324821] INFO -- : [632/885] 3366186=test_ancdata I, [2024-05-24T03:32:03.276137 #3324821] INFO -- : [633/885] 3366186=test_cgi_core I, [2024-05-24T03:32:03.281436 #3324821] INFO -- : [634/885] 3366186=test_parser I, [2024-05-24T03:32:03.289123 #3324821] INFO -- : [635/885] 3366186=test_registry I, [2024-05-24T03:32:03.289508 #3324821] INFO -- : [636/885] 3366186=parse_stream_test I, [2024-05-24T03:32:03.327175 #3324821] INFO -- : [637/885] 3366193=test_gem I, [2024-05-24T03:32:03.338556 #3324821] INFO -- : [638/885] 3366181=test_gem_source_lock I, [2024-05-24T03:32:03.350533 #3324821] INFO -- : [639/885] 3366186=test_gem_commands_open_command I, [2024-05-24T03:32:03.383283 #3324821] INFO -- : [640/885] 3366181=test_dns I, [2024-05-24T03:32:03.406428 #3324821] INFO -- : [641/885] 3366186=test_ractor I, [2024-05-24T03:32:03.422151 #3324821] INFO -- : [642/885] 3366186=test_env I, [2024-05-24T03:32:03.587078 #3324821] INFO -- : [643/885] 3366189=test_rdoc_attr I, [2024-05-24T03:32:03.589425 #3324821] INFO -- : [644/885] 3366189=test_dryrun I, [2024-05-24T03:32:03.603984 #3324821] INFO -- : [645/885] 3366189=desugar_compiler_test I, [2024-05-24T03:32:03.610140 #3324821] INFO -- : [646/885] 3366189=test_integer I, [2024-05-24T03:32:03.633522 #3324821] INFO -- : [647/885] 3366180=test_gem_commands_setup_command I, [2024-05-24T03:32:03.647441 #3324821] INFO -- : [648/885] 3366196=test_rubyoptions I, [2024-05-24T03:32:03.654395 #3324821] INFO -- : [649/885] 3366189=test_super I, [2024-05-24T03:32:03.808988 #3324821] INFO -- : [650/885] 3366184=test_integer I, [2024-05-24T03:32:03.838621 #3324821] INFO -- : [651/885] 3366181=test_cgi_modruby I, [2024-05-24T03:32:03.852444 #3324821] INFO -- : [652/885] 3366181=test_rubygems I, [2024-05-24T03:32:03.989382 #3324821] INFO -- : [653/885] 3366180=test_https_proxy I, [2024-05-24T03:32:04.027209 #3324821] INFO -- : [654/885] 3366180=test_call I, [2024-05-24T03:32:04.041926 #3324821] INFO -- : [655/885] 3366181=test_have_func I, [2024-05-24T03:32:04.103890 #3324821] INFO -- : [656/885] 3366198=test_stat I, [2024-05-24T03:32:04.107992 #3324821] INFO -- : [657/885] 3366198=test_gem_request_set_lockfile_tokenizer I, [2024-05-24T03:32:04.165248 #3324821] INFO -- : [658/885] 3366180=test_capacity I, [2024-05-24T03:32:04.170778 #3324821] INFO -- : [659/885] 3366180=test_nextafter I, [2024-05-24T03:32:04.177569 #3324821] INFO -- : [660/885] 3366198=test_usrmarshal I, [2024-05-24T03:32:04.188490 #3324821] INFO -- : [661/885] 3366189=test_object_references I, [2024-05-24T03:32:04.196649 #3324821] INFO -- : [662/885] 3366189=test_gem_resolver_git_specification I, [2024-05-24T03:32:04.251603 #3324821] INFO -- : [663/885] 3366180=test_deprecated I, [2024-05-24T03:32:04.258933 #3324821] INFO -- : [664/885] 3366180=test_color_printer I, [2024-05-24T03:32:04.265236 #3324821] INFO -- : [665/885] 3366180=test_serialize_subclasses I, [2024-05-24T03:32:04.267048 #3324821] INFO -- : [666/885] 3366180=test_insns_leaf I, [2024-05-24T03:32:04.276310 #3324821] INFO -- : [667/885] 3366180=test_key_error I, [2024-05-24T03:32:04.280615 #3324821] INFO -- : [668/885] 3366180=test_div I, [2024-05-24T03:32:04.281389 #3324821] INFO -- : [669/885] 3366180=test_allocation I, [2024-05-24T03:32:04.355636 #3324821] INFO -- : [670/885] 3366198=test_engine I, [2024-05-24T03:32:04.359640 #3324821] INFO -- : [671/885] 3366198=test_win32ole_variant_m I, [2024-05-24T03:32:04.366803 #3324821] INFO -- : [672/885] 3366198=test_rdoc_rd_inline I, [2024-05-24T03:32:04.420668 #3324821] INFO -- : [673/885] 3366189=test_mutex I, [2024-05-24T03:32:04.507418 #3324821] INFO -- : [674/885] 3366198=test_x509req I, [2024-05-24T03:32:04.737381 #3324821] INFO -- : [675/885] 3366198=test_gem_path_support I, [2024-05-24T03:32:04.757867 #3324821] INFO -- : [676/885] 3366183=test_struct I, [2024-05-24T03:32:04.762568 #3324821] INFO -- : [677/885] 3366198=test_set I, [2024-05-24T03:32:04.782907 #3324821] INFO -- : [678/885] 3366198=test_files_test_1 I, [2024-05-24T03:32:04.840470 #3324821] INFO -- : [679/885] 3366185=test_config I, [2024-05-24T03:32:04.880534 #3324821] INFO -- : [680/885] 3366185=memsize_test I, [2024-05-24T03:32:04.881896 #3324821] INFO -- : [681/885] 3366185=json_parser_test I, [2024-05-24T03:32:04.930411 #3324821] INFO -- : [682/885] 3366185=test_nomethod_error I, [2024-05-24T03:32:04.935620 #3324821] INFO -- : [683/885] 3366185=json_common_interface_test I, [2024-05-24T03:32:04.941724 #3324821] INFO -- : [684/885] 3366185=test_gem_source_subpath_problem I, [2024-05-24T03:32:05.041049 #3324821] INFO -- : [685/885] 3366182=test_dln I, [2024-05-24T03:32:05.042828 #3324821] INFO -- : [686/885] 3366185=test_win32ole_variant_outarg I, [2024-05-24T03:32:05.045976 #3324821] INFO -- : [687/885] 3366182=test_variable I, [2024-05-24T03:32:05.047485 #3324821] INFO -- : [688/885] 3366185=test_rdoc_markup_include I, [2024-05-24T03:32:05.054604 #3324821] INFO -- : [689/885] 3366185=test_sexp I, [2024-05-24T03:32:05.080889 #3324821] INFO -- : [690/885] 3366185=fuzzer_test I, [2024-05-24T03:32:05.093191 #3324821] INFO -- : [691/885] 3366185=magic_comment_test I, [2024-05-24T03:32:05.099038 #3324821] INFO -- : [692/885] 3366185=test_rdoc_markup_to_html_snippet I, [2024-05-24T03:32:05.116187 #3324821] INFO -- : [693/885] 3366193=test_struct I, [2024-05-24T03:32:05.144031 #3324821] INFO -- : [694/885] 3366193=test_cparser I, [2024-05-24T03:32:05.172562 #3324821] INFO -- : [695/885] 3366182=test_pkg_config I, [2024-05-24T03:32:05.177772 #3324821] INFO -- : [696/885] 3366185=test_shellwords I, [2024-05-24T03:32:05.186608 #3324821] INFO -- : [697/885] 3366185=pattern_test I, [2024-05-24T03:32:05.195048 #3324821] INFO -- : [698/885] 3366183=test_memory_view I, [2024-05-24T03:32:05.204773 #3324821] INFO -- : [699/885] 3366182=test_debug I, [2024-05-24T03:32:05.208533 #3324821] INFO -- : [700/885] 3366182=test_omap I, [2024-05-24T03:32:05.212924 #3324821] INFO -- : [701/885] 3366185=test_iterator I, [2024-05-24T03:32:05.220785 #3324821] INFO -- : [702/885] 3366183=test_string I, [2024-05-24T03:32:05.224026 #3324821] INFO -- : [703/885] 3366183=test_digest_extend I, [2024-05-24T03:32:05.236264 #3324821] INFO -- : [704/885] 3366183=test_gem_resolver_git_set I, [2024-05-24T03:32:05.244049 #3324821] INFO -- : [705/885] 3366182=test_storage I, [2024-05-24T03:32:05.248030 #3324821] INFO -- : [706/885] 3366182=test_gem_security_signer I, [2024-05-24T03:32:05.320305 #3324821] INFO -- : [707/885] 3366185=test_cipher I, [2024-05-24T03:32:05.373186 #3324821] INFO -- : [708/885] 3366185=test_new I, [2024-05-24T03:32:05.375731 #3324821] INFO -- : [709/885] 3366185=test_gem_resolver_installer_set I, [2024-05-24T03:32:05.458676 #3324821] INFO -- : [710/885] 3366181=test_dir_m17n I, [2024-05-24T03:32:05.503103 #3324821] INFO -- : [711/885] 3366182=test_gem_source_git I, [2024-05-24T03:32:05.552017 #3324821] INFO -- : [712/885] 3366189=test_gem_commands_signout_command I, [2024-05-24T03:32:05.564136 #3324821] INFO -- : [713/885] 3366189=test_refinement I, [2024-05-24T03:32:05.596038 #3324821] INFO -- : [714/885] 3366185=test_regex_casefold I, [2024-05-24T03:32:05.602146 #3324821] INFO -- : [715/885] 3366183=test_cgi_cookie I, [2024-05-24T03:32:05.621043 #3324821] INFO -- : [716/885] 3366183=test_require I, [2024-05-24T03:32:05.774126 #3324821] INFO -- : [717/885] 3366191=test_float I, [2024-05-24T03:32:05.908967 #3324821] INFO -- : [718/885] 3366193=test_input_method I, [2024-05-24T03:32:06.030827 #3324821] INFO -- : [719/885] 3366193=test_windows_1252 I, [2024-05-24T03:32:06.032784 #3324821] INFO -- : [720/885] 3366193=test_process I, [2024-05-24T03:32:06.071257 #3324821] INFO -- : [721/885] 3366193=test_x509crl I, [2024-05-24T03:32:06.164804 #3324821] INFO -- : [722/885] 3366192=test_fixnum I, [2024-05-24T03:32:06.181466 #3324821] INFO -- : [723/885] 3366192=test_signal I, [2024-05-24T03:32:06.189043 #3324821] INFO -- : [724/885] 3366182=test_metaclass I, [2024-05-24T03:32:06.191097 #3324821] INFO -- : [725/885] 3366182=test_rdoc_top_level I, [2024-05-24T03:32:06.223603 #3324821] INFO -- : [726/885] 3366193=test_rdoc_rd I, [2024-05-24T03:32:06.228360 #3324821] INFO -- : [727/885] 3366193=test_cgi_session I, [2024-05-24T03:32:06.243724 #3324821] INFO -- : [728/885] 3366193=test_completion I, [2024-05-24T03:32:06.253968 #3324821] INFO -- : [729/885] 3366185=test_gem_commands_cert_command I, [2024-05-24T03:32:06.384305 #3324821] INFO -- : [730/885] 3366186=test_yield_block I, [2024-05-24T03:32:06.391581 #3324821] INFO -- : [731/885] 3366186=test_len I, [2024-05-24T03:32:06.400912 #3324821] INFO -- : [732/885] 3366186=test_gem_source_installed I, [2024-05-24T03:32:06.408499 #3324821] INFO -- : [733/885] 3366186=test_erb I, [2024-05-24T03:32:06.466861 #3324821] INFO -- : [734/885] 3366186=test_x509ext I, [2024-05-24T03:32:06.469790 #3324821] INFO -- : [735/885] 3366186=attribute_write_test I, [2024-05-24T03:32:06.474542 #3324821] INFO -- : [736/885] 3366186=test_propertyputref I, [2024-05-24T03:32:06.478383 #3324821] INFO -- : [737/885] 3366186=test_spell_checker I, [2024-05-24T03:32:06.487948 #3324821] INFO -- : [738/885] 3366186=test_assembler I, [2024-05-24T03:32:06.489761 #3324821] INFO -- : [739/885] 3366186=test_rational2 I, [2024-05-24T03:32:06.510764 #3324821] INFO -- : [740/885] 3366186=test_rational I, [2024-05-24T03:32:06.530045 #3324821] INFO -- : [741/885] 3366186=test_helper_method I, [2024-05-24T03:32:06.594418 #3324821] INFO -- : [742/885] 3366186=test_gem_package_tar_writer I, [2024-05-24T03:32:06.622276 #3324821] INFO -- : [743/885] 3366194=test_array I, [2024-05-24T03:32:06.682375 #3324821] INFO -- : [744/885] 3366182=test_gem_commands_outdated_command I, [2024-05-24T03:32:06.693677 #3324821] INFO -- : [745/885] 3366179=test_scalar_scanner I, [2024-05-24T03:32:06.700945 #3324821] INFO -- : [746/885] 3366186=test_gem_source I, [2024-05-24T03:32:06.711519 #3324821] INFO -- : [747/885] 3366179=test_nesting_parser I, [2024-05-24T03:32:06.722786 #3324821] INFO -- : [748/885] 3366184=test_win32ole_method_event I, [2024-05-24T03:32:06.722861 #3324821] INFO -- : [749/885] 3366184=test_benchmark I, [2024-05-24T03:32:06.734153 #3324821] INFO -- : [750/885] 3366182=test_gem_dependency_list I, [2024-05-24T03:32:06.787154 #3324821] INFO -- : [751/885] 3366182=test_evaluation I, [2024-05-24T03:32:06.792010 #3324821] INFO -- : [752/885] 3366182=test_gem_ext_builder I, [2024-05-24T03:32:06.812193 #3324821] INFO -- : [753/885] 3366179=test_https I, [2024-05-24T03:32:06.846384 #3324821] INFO -- : [754/885] 3366193=test_yamldbm I, [2024-05-24T03:32:06.848534 #3324821] INFO -- : [755/885] 3366193=test_gem_commands_rebuild_command I, [2024-05-24T03:32:06.880012 #3324821] INFO -- : [756/885] 3366193=test_load I, [2024-05-24T03:32:06.882190 #3324821] INFO -- : [757/885] 3366193=test_rdoc_parser_simple I, [2024-05-24T03:32:06.908476 #3324821] INFO -- : [758/885] 3366193=test_provider I, [2024-05-24T03:32:06.972744 #3324821] INFO -- : [759/885] 3366186=test_abi I, [2024-05-24T03:32:06.994316 #3324821] INFO -- : [760/885] 3366181=test_rdoc_generator_markup I, [2024-05-24T03:32:07.005452 #3324821] INFO -- : [761/885] 3366181=test_whileuntil I, [2024-05-24T03:32:07.011129 #3324821] INFO -- : [762/885] 3366181=test_monitor I, [2024-05-24T03:32:07.138954 #3324821] INFO -- : [763/885] 3366186=test_buffered_io I, [2024-05-24T03:32:07.147964 #3324821] INFO -- : [764/885] 3366191=test_rubyvm I, [2024-05-24T03:32:07.153945 #3324821] INFO -- : [765/885] 3366191=test_configuration I, [2024-05-24T03:32:07.216598 #3324821] INFO -- : [766/885] 3366186=integer_parse_test I, [2024-05-24T03:32:07.216717 #3324821] INFO -- : [767/885] 3366181=test_instrumentation_api I, [2024-05-24T03:32:07.222953 #3324821] INFO -- : [768/885] 3366186=test_stringify_symbols I, [2024-05-24T03:32:07.229893 #3324821] INFO -- : [769/885] 3366179=test_boolean I, [2024-05-24T03:32:07.233762 #3324821] INFO -- : [770/885] 3366186=test_gem_request_set I, [2024-05-24T03:32:07.243633 #3324821] INFO -- : [771/885] 3366193=test_module I, [2024-05-24T03:32:07.263343 #3324821] INFO -- : [772/885] 3366180=test_ssl I, [2024-05-24T03:32:07.272548 #3324821] INFO -- : [773/885] 3366191=test_gem_ext_cargo_builder I, [2024-05-24T03:32:07.277911 #3324821] INFO -- : [774/885] 3366179=constant_path_node_test I, [2024-05-24T03:32:07.286632 #3324821] INFO -- : [775/885] 3366179=test_parser I, [2024-05-24T03:32:07.300527 #3324821] INFO -- : [776/885] 3366191=test_method_name_check I, [2024-05-24T03:32:07.308781 #3324821] INFO -- : [777/885] 3366179=test_arith_seq_extract I, [2024-05-24T03:32:07.310851 #3324821] INFO -- : [778/885] 3366185=test_rdoc_generator_pot I, [2024-05-24T03:32:07.315258 #3324821] INFO -- : [779/885] 3366185=test_unicode I, [2024-05-24T03:32:07.319027 #3324821] INFO -- : [780/885] 3366185=test_koi8 I, [2024-05-24T03:32:07.321936 #3324821] INFO -- : [781/885] 3366191=parameters_signature_test I, [2024-05-24T03:32:07.324708 #3324821] INFO -- : [782/885] 3366185=test_rdoc_parser_changelog I, [2024-05-24T03:32:07.328934 #3324821] INFO -- : [783/885] 3366191=test_enumerator I, [2024-05-24T03:32:07.344717 #3324821] INFO -- : [784/885] 3366191=test_rdoc_method_attr I, [2024-05-24T03:32:07.414913 #3324821] INFO -- : [785/885] 3366185=static_literals_test I, [2024-05-24T03:32:07.426220 #3324821] INFO -- : [786/885] 3366185=test_data I, [2024-05-24T03:32:07.427382 #3324821] INFO -- : [787/885] 3366191=test_gem_gem_runner I, [2024-05-24T03:32:07.435219 #3324821] INFO -- : [788/885] 3366185=test_filter I, [2024-05-24T03:32:07.456719 #3324821] INFO -- : [789/885] 3366185=test_gem_commands_update_command I, [2024-05-24T03:32:07.461403 #3324821] INFO -- : [790/885] 3366191=test_gem_resolver_vendor_specification I, [2024-05-24T03:32:07.482573 #3324821] INFO -- : [791/885] 3366191=test_random I, [2024-05-24T03:32:07.487163 #3324821] INFO -- : [792/885] 3366179=test_notimplement I, [2024-05-24T03:32:07.491979 #3324821] INFO -- : [793/885] 3366179=test_key_event_record I, [2024-05-24T03:32:07.497071 #3324821] INFO -- : [794/885] 3366191=test_gem_uri I, [2024-05-24T03:32:07.497144 #3324821] INFO -- : [795/885] 3366179=test_lexer I, [2024-05-24T03:32:07.509152 #3324821] INFO -- : [796/885] 3366179=test_thread_cv I, [2024-05-24T03:32:07.520784 #3324821] INFO -- : [797/885] 3366191=test_ssl_session I, [2024-05-24T03:32:07.684721 #3324821] INFO -- : [798/885] 3366186=test_compile_prism I, [2024-05-24T03:32:07.789975 #3324821] INFO -- : [799/885] 3366182=test_terminfo I, [2024-05-24T03:32:07.791402 #3324821] INFO -- : [800/885] 3366182=test_bug-14834 I, [2024-05-24T03:32:07.853869 #3324821] INFO -- : [801/885] 3366182=test_rdoc_markup_to_html I, [2024-05-24T03:32:07.867498 #3324821] INFO -- : [802/885] 3366198=test_date_compat I, [2024-05-24T03:32:07.870205 #3324821] INFO -- : [803/885] 3366198=test_tree_spell_checker I, [2024-05-24T03:32:07.893125 #3324821] INFO -- : [804/885] 3366198=test_addrinfo I, [2024-05-24T03:32:07.920066 #3324821] INFO -- : [805/885] 3366198=test_http I, [2024-05-24T03:32:07.927113 #3324821] INFO -- : [806/885] 3366182=test_win32ole_param_event I, [2024-05-24T03:32:07.935928 #3324821] INFO -- : [807/885] 3366182=test_bn I, [2024-05-24T03:32:07.951209 #3324821] INFO -- : [808/885] 3366182=test_case_mapping I, [2024-05-24T03:32:07.961578 #3324821] INFO -- : [809/885] 3366182=redundant_return_test I, [2024-05-24T03:32:07.968688 #3324821] INFO -- : [810/885] 3366182=test_path I, [2024-05-24T03:32:07.973595 #3324821] INFO -- : [811/885] 3366182=test_sockopt I, [2024-05-24T03:32:07.979616 #3324821] INFO -- : [812/885] 3366186=test_rdoc_markup_to_label I, [2024-05-24T03:32:07.981913 #3324821] INFO -- : [813/885] 3366182=test_install I, [2024-05-24T03:32:08.012778 #3324821] INFO -- : [814/885] 3366186=test_rdoc_ri_driver I, [2024-05-24T03:32:08.039308 #3324821] INFO -- : [815/885] 3366184=test_gem_resolver_local_specification I, [2024-05-24T03:32:08.056529 #3324821] INFO -- : [816/885] 3366184=test_httpheader I, [2024-05-24T03:32:08.099026 #3324821] INFO -- : [817/885] 3366184=test_httpresponses I, [2024-05-24T03:32:08.103403 #3324821] INFO -- : [818/885] 3366184=test_encoding I, [2024-05-24T03:32:08.112796 #3324821] INFO -- : [819/885] 3366184=test_set_len I, [2024-05-24T03:32:08.121482 #3324821] INFO -- : [820/885] 3366184=test_key_stroke I, [2024-05-24T03:32:08.125207 #3324821] INFO -- : [821/885] 3366184=test_color I, [2024-05-24T03:32:08.151558 #3324821] INFO -- : [822/885] 3366179=json_encoding_test I, [2024-05-24T03:32:08.168937 #3324821] INFO -- : [823/885] 3366184=test_rbconfig I, [2024-05-24T03:32:08.173215 #3324821] INFO -- : [824/885] 3366179=test_primitive I, [2024-05-24T03:32:08.173888 #3324821] INFO -- : [825/885] 3366184=test_human_typo I, [2024-05-24T03:32:08.179924 #3324821] INFO -- : [826/885] 3366184=test_rdoc_i18n_locale I, [2024-05-24T03:32:08.185602 #3324821] INFO -- : [827/885] 3366179=test_name_error_extension I, [2024-05-24T03:32:08.188098 #3324821] INFO -- : [828/885] 3366184=test_chilled I, [2024-05-24T03:32:08.190326 #3324821] INFO -- : [829/885] 3366184=test_euc_jp I, [2024-05-24T03:32:08.193228 #3324821] INFO -- : [830/885] 3366184=test_rdoc_generator_pot_po_entry I, [2024-05-24T03:32:08.200184 #3324821] INFO -- : [831/885] 3366184=test_acceptable I, [2024-05-24T03:32:08.200745 #3324821] INFO -- : [832/885] 3366179=test_document I, [2024-05-24T03:32:08.206385 #3324821] INFO -- : [833/885] 3366179=test_gem_commands_yank_command I, [2024-05-24T03:32:08.236007 #3324821] INFO -- : [834/885] 3366182=test_win32ole_param I, [2024-05-24T03:32:08.237866 #3324821] INFO -- : [835/885] 3366182=test_pair I, [2024-05-24T03:32:08.297437 #3324821] INFO -- : [836/885] 3366183=test_recursion I, [2024-05-24T03:32:08.302571 #3324821] INFO -- : [837/885] 3366183=test_exit I, [2024-05-24T03:32:08.337786 #3324821] INFO -- : [838/885] 3366192=test_popen_deadlock I, [2024-05-24T03:32:08.342655 #3324821] INFO -- : [839/885] 3366186=test_delegate I, [2024-05-24T03:32:08.348108 #3324821] INFO -- : [840/885] 3366184=test_date_marshal I, [2024-05-24T03:32:08.352069 #3324821] INFO -- : [841/885] 3366184=test_mkmf I, [2024-05-24T03:32:08.358565 #3324821] INFO -- : [842/885] 3366186=test_history I, [2024-05-24T03:32:08.372883 #3324821] INFO -- : [843/885] 3366184=test_open3 I, [2024-05-24T03:32:08.386416 #3324821] INFO -- : [844/885] 3366186=test_fiber I, [2024-05-24T03:32:08.413855 #3324821] INFO -- : [845/885] 3366183=test_multi_irb_commands I, [2024-05-24T03:32:08.424575 #3324821] INFO -- : [846/885] 3366183=test_closure I, [2024-05-24T03:32:08.447262 #3324821] INFO -- : [847/885] 3366191=test_bundled_ca I, [2024-05-24T03:32:08.530834 #3324821] INFO -- : [848/885] 3366185=test_digest I, [2024-05-24T03:32:08.537214 #3324821] INFO -- : [849/885] 3366185=test_rdoc_servlet I, [2024-05-24T03:32:08.638131 #3324821] INFO -- : [850/885] 3366183=test_gem_security I, [2024-05-24T03:32:08.656526 #3324821] INFO -- : [851/885] 3366185=test_ractor I, [2024-05-24T03:32:08.723283 #3324821] INFO -- : [852/885] 3366185=test_beginendblock I, [2024-05-24T03:32:08.728987 #3324821] INFO -- : [853/885] 3366179=test_gem_commands_unpack_command I, [2024-05-24T03:32:08.970097 #3324821] INFO -- : [854/885] 3366192=test_files_lib I, [2024-05-24T03:32:08.972410 #3324821] INFO -- : [855/885] 3366192=test_help I, [2024-05-24T03:32:08.981083 #3324821] INFO -- : [856/885] 3366192=test_rdoc_markup_to_bs I, [2024-05-24T03:32:08.997257 #3324821] INFO -- : [857/885] 3366179=test_within_pipe I, [2024-05-24T03:32:09.011947 #3324821] INFO -- : [858/885] 3366192=test_gem_bundler_version_finder I, [2024-05-24T03:32:09.026205 #3324821] INFO -- : [859/885] 3366179=test_emoji_breaks I, [2024-05-24T03:32:09.033297 #3324821] INFO -- : [860/885] 3366179=reflection_test I, [2024-05-24T03:32:09.036035 #3324821] INFO -- : [861/885] 3366192=test_pinned I, [2024-05-24T03:32:09.046890 #3324821] INFO -- : [862/885] 3366179=test_printf I, [2024-05-24T03:32:09.072839 #3324821] INFO -- : [863/885] 3366179=test_rdoc_markup_pre_process I, [2024-05-24T03:32:09.073151 #3324821] INFO -- : [864/885] 3366192=test_stream I, [2024-05-24T03:32:09.083420 #3324821] INFO -- : [865/885] 3366192=test_webauthn_listener_response I, [2024-05-24T03:32:09.096893 #3324821] INFO -- : [866/885] 3366192=test_time I, [2024-05-24T03:32:09.097458 #3324821] INFO -- : [867/885] 3366185=test_to_ary_concat I, [2024-05-24T03:32:09.298385 #3324821] INFO -- : [868/885] 3366179=test_iseq I, [2024-05-24T03:32:09.303468 #3324821] INFO -- : [869/885] 3366192=test_exception_at_throwing I, [2024-05-24T03:32:09.381420 #3324821] INFO -- : [870/885] 3366192=test_rdoc_markup_heading I, [2024-05-24T03:32:09.387405 #3324821] INFO -- : [871/885] 3366192=test_scheduler I, [2024-05-24T03:32:09.536854 #3324821] INFO -- : [872/885] 3366192=test_class I, [2024-05-24T03:32:09.554063 #3324821] INFO -- : [873/885] 3366192=test_ocsp I, [2024-05-24T03:32:09.686845 #3324821] INFO -- : [874/885] 3366193=test_pkey_dsa I, [2024-05-24T03:32:09.813982 #3324821] INFO -- : [875/885] 3366191=test_case_comprehensive I, [2024-05-24T03:32:09.854387 #3324821] INFO -- : [876/885] 3366192=test_interned_str I, [2024-05-24T03:32:09.854784 #3324821] INFO -- : [877/885] 3366192=test_gem_commands_build_command I, [2024-05-24T03:32:09.869937 #3324821] INFO -- : [878/885] 3366189=test_option I, [2024-05-24T03:32:09.875096 #3324821] INFO -- : [879/885] 3366179=test_append I, [2024-05-24T03:32:09.882718 #3324821] INFO -- : [880/885] 3366179=test_tracer I, [2024-05-24T03:32:09.892902 #3324821] INFO -- : [881/885] 3366179=test_cmethod I, [2024-05-24T03:32:09.899963 #3324821] INFO -- : [882/885] 3366179=test_did_you_mean I, [2024-05-24T03:32:09.995639 #3324821] INFO -- : [883/885] 3366189=test_variable_name_check I, [2024-05-24T03:32:10.042356 #3324821] INFO -- : [884/885] 3366179=test_io_m17n I, [2024-05-24T03:32:10.088436 #3324821] INFO -- : [885/885] 3366189=test_gem_commands_server_command I, [2024-05-24T03:32:25.046610 #3324821] INFO -- : Finished tests in 34.476727s, 765.4729 tests/s, 271206.1365 assertions/s. I, [2024-05-24T03:32:25.047436 #3324821] INFO -- : 26391 tests, 9350300 assertions, 0 failures, 0 errors, 304 skips I, [2024-05-24T03:32:25.047471 #3324821] INFO -- : I, [2024-05-24T03:32:25.047479 #3324821] INFO -- : ruby -v: ruby 3.4.0dev (2024-05-24T01:53:35Z master acdd19facc) [x86_64-linux] I, [2024-05-24T03:32:25.050015 #3324821] INFO -- : $$$[end] "make yes-test-all TESTOPTS='--stderr-on-failure' TESTS='-j20'" exit with 0. I, [2024-05-24T03:32:25.050165 #3324821] INFO -- : $$$[beg] make yes-test-rubyspec MSPECOPT='--error-output stderr --debug -j' TESTS='-j20' I, [2024-05-24T03:32:25.136291 #3324821] INFO -- : BASERUBY = /usr/bin/ruby --disable=gems I, [2024-05-24T03:32:25.136325 #3324821] INFO -- : CC = gcc I, [2024-05-24T03:32:25.136332 #3324821] INFO -- : LD = ld I, [2024-05-24T03:32:25.136337 #3324821] INFO -- : LDSHARED = gcc -shared I, [2024-05-24T03:32:25.136347 #3324821] INFO -- : CFLAGS = -O3 -fno-fast-math -ggdb3 -Wall -Wextra -Wdeprecated-declarations -Wdiv-by-zero -Wduplicated-cond -Wimplicit-function-declaration -Wimplicit-int -Wpointer-arith -Wwrite-strings -Wold-style-definition -Wimplicit-fallthrough=0 -Wmissing-noreturn -Wno-cast-function-type -Wno-constant-logical-operand -Wno-long-long -Wno-missing-field-initializers -Wno-overlength-strings -Wno-packed-bitfield-compat -Wno-parentheses-equality -Wno-self-assign -Wno-tautological-compare -Wno-unused-parameter -Wno-unused-value -Wsuggest-attribute=format -Wsuggest-attribute=noreturn -Wunused-variable -Wmisleading-indentation -Wundef -fPIC I, [2024-05-24T03:32:25.136352 #3324821] INFO -- : XCFLAGS = -U_FORTIFY_SOURCE -D_FORTIFY_SOURCE=2 -fstack-protector-strong -fno-strict-overflow -fvisibility=hidden -fexcess-precision=standard -DRUBY_EXPORT -I. -I.ext/include/x86_64-linux -I/tmp/ruby/src/trunk/include -I/tmp/ruby/src/trunk -I/tmp/ruby/src/trunk/prism -I/tmp/ruby/src/trunk/enc/unicode/15.0.0 I, [2024-05-24T03:32:25.136363 #3324821] INFO -- : CPPFLAGS = I, [2024-05-24T03:32:25.136367 #3324821] INFO -- : DLDFLAGS = -Wl,--compress-debug-sections=zlib -Wl,-soname,libruby.so.3.4 -fstack-protector-strong I, [2024-05-24T03:32:25.136371 #3324821] INFO -- : SOLIBS = -lz -lrt -lrt -lgmp -ldl -lcrypt -lm -lpthread I, [2024-05-24T03:32:25.136375 #3324821] INFO -- : LANG = en_US.UTF-8 I, [2024-05-24T03:32:25.136378 #3324821] INFO -- : LC_ALL = I, [2024-05-24T03:32:25.136382 #3324821] INFO -- : LC_CTYPE = I, [2024-05-24T03:32:25.136385 #3324821] INFO -- : MFLAGS = I, [2024-05-24T03:32:25.136389 #3324821] INFO -- : RUSTC = no I, [2024-05-24T03:32:25.136393 #3324821] INFO -- : YJIT_RUSTC_ARGS = --crate-name=yjit --crate-type=staticlib --edition=2021 -g -C lto=thin -C opt-level=3 -C overflow-checks=on '--out-dir=/tmp/ruby/build/trunk/yjit/target/release/' /tmp/ruby/src/trunk/yjit/src/lib.rs I, [2024-05-24T03:32:25.136953 #3324821] INFO -- : gcc (Ubuntu 11.4.0-1ubuntu1~22.04) 11.4.0 I, [2024-05-24T03:32:25.136974 #3324821] INFO -- : Copyright (C) 2021 Free Software Foundation, Inc. I, [2024-05-24T03:32:25.136980 #3324821] INFO -- : This is free software; see the source for copying conditions. There is NO I, [2024-05-24T03:32:25.136985 #3324821] INFO -- : warranty; not even for MERCHANTABILITY or FITNESS FOR A PARTICULAR PURPOSE. I, [2024-05-24T03:32:25.136989 #3324821] INFO -- : I, [2024-05-24T03:32:25.138755 #3324821] INFO -- : generating enc.mk I, [2024-05-24T03:32:25.256262 #3324821] INFO -- : generating encdb.h I, [2024-05-24T03:32:25.279934 #3324821] INFO -- : encdb.h unchanged I, [2024-05-24T03:32:25.281128 #3324821] INFO -- : making enc I, [2024-05-24T03:32:25.298506 #3324821] INFO -- : make[1]: Entering directory '/tmp/ruby/build/trunk' I, [2024-05-24T03:32:25.298535 #3324821] INFO -- : make[1]: Nothing to be done for 'enc'. I, [2024-05-24T03:32:25.298544 #3324821] INFO -- : make[1]: Leaving directory '/tmp/ruby/build/trunk' I, [2024-05-24T03:32:25.299175 #3324821] INFO -- : making srcs under enc I, [2024-05-24T03:32:25.328388 #3324821] INFO -- : make[1]: Entering directory '/tmp/ruby/build/trunk' I, [2024-05-24T03:32:25.328409 #3324821] INFO -- : make[1]: Nothing to be done for 'srcs'. I, [2024-05-24T03:32:25.328414 #3324821] INFO -- : make[1]: Leaving directory '/tmp/ruby/build/trunk' I, [2024-05-24T03:32:25.329387 #3324821] INFO -- : generating transdb.h I, [2024-05-24T03:32:25.426640 #3324821] INFO -- : transdb.h unchanged I, [2024-05-24T03:32:25.428048 #3324821] INFO -- : making trans I, [2024-05-24T03:32:25.464509 #3324821] INFO -- : make[1]: Entering directory '/tmp/ruby/build/trunk' I, [2024-05-24T03:32:25.464533 #3324821] INFO -- : make[1]: Nothing to be done for 'trans'. I, [2024-05-24T03:32:25.464539 #3324821] INFO -- : make[1]: Leaving directory '/tmp/ruby/build/trunk' I, [2024-05-24T03:32:25.465246 #3324821] INFO -- : making encs I, [2024-05-24T03:32:25.505473 #3324821] INFO -- : make[1]: Entering directory '/tmp/ruby/build/trunk' I, [2024-05-24T03:32:25.505494 #3324821] INFO -- : make[1]: Nothing to be done for 'encs'. I, [2024-05-24T03:32:25.505500 #3324821] INFO -- : make[1]: Leaving directory '/tmp/ruby/build/trunk' I, [2024-05-24T03:32:25.507255 #3324821] INFO -- : generating makefiles ext/configure-ext.mk I, [2024-05-24T03:32:25.534014 #3324821] INFO -- : ext/configure-ext.mk updated I, [2024-05-24T03:32:25.536657 #3324821] INFO -- : make[1]: Entering directory '/tmp/ruby/build/trunk' I, [2024-05-24T03:32:26.925931 #3324821] INFO -- : make[1]: Leaving directory '/tmp/ruby/build/trunk' I, [2024-05-24T03:32:26.926599 #3324821] INFO -- : generating makefile exts.mk I, [2024-05-24T03:32:26.963088 #3324821] INFO -- : exts.mk unchanged I, [2024-05-24T03:32:26.967388 #3324821] INFO -- : make[1]: Entering directory '/tmp/ruby/build/trunk' I, [2024-05-24T03:32:27.283311 #3324821] INFO -- : make[2]: Entering directory '/tmp/ruby/build/trunk/ext/coverage' I, [2024-05-24T03:32:27.287953 #3324821] INFO -- : make[2]: Leaving directory '/tmp/ruby/build/trunk/ext/coverage' I, [2024-05-24T03:32:27.294266 #3324821] INFO -- : make[2]: Entering directory '/tmp/ruby/build/trunk/ext/date' I, [2024-05-24T03:32:27.298700 #3324821] INFO -- : make[2]: Leaving directory '/tmp/ruby/build/trunk/ext/date' I, [2024-05-24T03:32:27.302758 #3324821] INFO -- : make[2]: Entering directory '/tmp/ruby/build/trunk/ext/digest' I, [2024-05-24T03:32:27.312152 #3324821] INFO -- : make[2]: Leaving directory '/tmp/ruby/build/trunk/ext/digest' I, [2024-05-24T03:32:27.338349 #3324821] INFO -- : make[2]: Entering directory '/tmp/ruby/build/trunk/ext/digest/sha2' I, [2024-05-24T03:32:27.342954 #3324821] INFO -- : make[2]: Leaving directory '/tmp/ruby/build/trunk/ext/digest/sha2' I, [2024-05-24T03:32:27.364217 #3324821] INFO -- : make[2]: Entering directory '/tmp/ruby/build/trunk/ext/fiddle' I, [2024-05-24T03:32:27.373607 #3324821] INFO -- : make[2]: Leaving directory '/tmp/ruby/build/trunk/ext/fiddle' I, [2024-05-24T03:32:27.377005 #3324821] INFO -- : make[2]: Entering directory '/tmp/ruby/build/trunk/ext/io/console' I, [2024-05-24T03:32:27.380679 #3324821] INFO -- : make[2]: Leaving directory '/tmp/ruby/build/trunk/ext/io/console' I, [2024-05-24T03:32:27.393489 #3324821] INFO -- : make[2]: Entering directory '/tmp/ruby/build/trunk/ext/json' I, [2024-05-24T03:32:27.403984 #3324821] INFO -- : make[2]: Leaving directory '/tmp/ruby/build/trunk/ext/json' I, [2024-05-24T03:32:27.419965 #3324821] INFO -- : make[2]: Entering directory '/tmp/ruby/build/trunk/ext/monitor' I, [2024-05-24T03:32:27.423970 #3324821] INFO -- : make[2]: Leaving directory '/tmp/ruby/build/trunk/ext/monitor' I, [2024-05-24T03:32:27.431162 #3324821] INFO -- : make[2]: Entering directory '/tmp/ruby/build/trunk/ext/objspace' I, [2024-05-24T03:32:27.437171 #3324821] INFO -- : make[2]: Leaving directory '/tmp/ruby/build/trunk/ext/objspace' I, [2024-05-24T03:32:27.456357 #3324821] INFO -- : make[2]: Entering directory '/tmp/ruby/build/trunk/ext/openssl' I, [2024-05-24T03:32:27.470080 #3324821] INFO -- : make[2]: Leaving directory '/tmp/ruby/build/trunk/ext/openssl' I, [2024-05-24T03:32:27.473040 #3324821] INFO -- : make[2]: Entering directory '/tmp/ruby/build/trunk/ext/pathname' I, [2024-05-24T03:32:27.475573 #3324821] INFO -- : make[2]: Leaving directory '/tmp/ruby/build/trunk/ext/pathname' I, [2024-05-24T03:32:27.479827 #3324821] INFO -- : make[2]: Entering directory '/tmp/ruby/build/trunk/ext/psych' I, [2024-05-24T03:32:27.503563 #3324821] INFO -- : make[2]: Leaving directory '/tmp/ruby/build/trunk/ext/psych' I, [2024-05-24T03:32:27.506597 #3324821] INFO -- : make[2]: Entering directory '/tmp/ruby/build/trunk/ext/pty' I, [2024-05-24T03:32:27.509721 #3324821] INFO -- : make[2]: Leaving directory '/tmp/ruby/build/trunk/ext/pty' I, [2024-05-24T03:32:27.520837 #3324821] INFO -- : make[2]: Entering directory '/tmp/ruby/build/trunk/ext/ripper' I, [2024-05-24T03:32:27.525883 #3324821] INFO -- : make[2]: Leaving directory '/tmp/ruby/build/trunk/ext/ripper' I, [2024-05-24T03:32:27.527448 #3324821] INFO -- : make[2]: Entering directory '/tmp/ruby/build/trunk/ext/rubyvm' I, [2024-05-24T03:32:27.529628 #3324821] INFO -- : make[2]: Leaving directory '/tmp/ruby/build/trunk/ext/rubyvm' I, [2024-05-24T03:32:27.541937 #3324821] INFO -- : make[2]: Entering directory '/tmp/ruby/build/trunk/ext/socket' I, [2024-05-24T03:32:27.550738 #3324821] INFO -- : make[2]: Leaving directory '/tmp/ruby/build/trunk/ext/socket' I, [2024-05-24T03:32:27.566209 #3324821] INFO -- : make[2]: Entering directory '/tmp/ruby/build/trunk/.bundle/gems/bigdecimal-3.1.8/ext/bigdecimal' I, [2024-05-24T03:32:27.591943 #3324821] INFO -- : make[2]: Leaving directory '/tmp/ruby/build/trunk/.bundle/gems/bigdecimal-3.1.8/ext/bigdecimal' I, [2024-05-24T03:32:27.593898 #3324821] INFO -- : make[2]: Entering directory '/tmp/ruby/build/trunk/.bundle/gems/debug-1.9.2/ext/debug' I, [2024-05-24T03:32:27.615568 #3324821] INFO -- : make[2]: Leaving directory '/tmp/ruby/build/trunk/.bundle/gems/debug-1.9.2/ext/debug' I, [2024-05-24T03:32:27.617750 #3324821] INFO -- : make[2]: Entering directory '/tmp/ruby/build/trunk/.bundle/gems/nkf-0.2.0/ext/nkf' I, [2024-05-24T03:32:27.639828 #3324821] INFO -- : make[2]: Leaving directory '/tmp/ruby/build/trunk/.bundle/gems/nkf-0.2.0/ext/nkf' I, [2024-05-24T03:32:27.641892 #3324821] INFO -- : make[2]: Entering directory '/tmp/ruby/build/trunk/.bundle/gems/racc-1.7.3/ext/racc/cparse' I, [2024-05-24T03:32:27.663221 #3324821] INFO -- : make[2]: Leaving directory '/tmp/ruby/build/trunk/.bundle/gems/racc-1.7.3/ext/racc/cparse' I, [2024-05-24T03:32:27.665156 #3324821] INFO -- : make[2]: Entering directory '/tmp/ruby/build/trunk/.bundle/gems/racc-1.8.0/ext/racc/cparse' I, [2024-05-24T03:32:27.686538 #3324821] INFO -- : make[2]: Leaving directory '/tmp/ruby/build/trunk/.bundle/gems/racc-1.8.0/ext/racc/cparse' I, [2024-05-24T03:32:27.688916 #3324821] INFO -- : make[2]: Entering directory '/tmp/ruby/build/trunk/.bundle/gems/rbs-3.4.4/ext/rbs_extension' I, [2024-05-24T03:32:27.710514 #3324821] INFO -- : make[2]: Leaving directory '/tmp/ruby/build/trunk/.bundle/gems/rbs-3.4.4/ext/rbs_extension' I, [2024-05-24T03:32:27.712393 #3324821] INFO -- : make[2]: Entering directory '/tmp/ruby/build/trunk/.bundle/gems/syslog-0.1.2/ext/syslog' I, [2024-05-24T03:32:27.733795 #3324821] INFO -- : make[2]: Leaving directory '/tmp/ruby/build/trunk/.bundle/gems/syslog-0.1.2/ext/syslog' I, [2024-05-24T03:32:27.756957 #3324821] INFO -- : make[2]: Entering directory '/tmp/ruby/build/trunk' I, [2024-05-24T03:32:27.820468 #3324821] INFO -- : make[2]: 'ruby' is up to date. I, [2024-05-24T03:32:27.820502 #3324821] INFO -- : make[2]: Leaving directory '/tmp/ruby/build/trunk' I, [2024-05-24T03:32:27.820981 #3324821] INFO -- : make[1]: Leaving directory '/tmp/ruby/build/trunk' I, [2024-05-24T03:32:27.824668 #3324821] INFO -- : make[1]: Entering directory '/tmp/ruby/build/trunk' I, [2024-05-24T03:32:27.824690 #3324821] INFO -- : make[1]: Nothing to be done for 'note'. I, [2024-05-24T03:32:27.824696 #3324821] INFO -- : make[1]: Leaving directory '/tmp/ruby/build/trunk' E, [2024-05-24T03:32:27.889093 #3324821] ERROR -- : $ /tmp/ruby/build/trunk/miniruby -I/tmp/ruby/src/trunk/lib /tmp/ruby/src/trunk/tool/runruby.rb --archdir=/tmp/ruby/build/trunk --extout=.ext -- /tmp/ruby/src/trunk/spec/mspec/bin/mspec-run -B /tmp/ruby/src/trunk/spec/default.mspec --error-output stderr --debug -fy -o /tmp/rubytest.kt4tdn/1-mspec-multi-0 E, [2024-05-24T03:32:27.889271 #3324821] ERROR -- : $ /tmp/ruby/build/trunk/miniruby -I/tmp/ruby/src/trunk/lib /tmp/ruby/src/trunk/tool/runruby.rb --archdir=/tmp/ruby/build/trunk --extout=.ext -- /tmp/ruby/src/trunk/spec/mspec/bin/mspec-run -B /tmp/ruby/src/trunk/spec/default.mspec --error-output stderr --debug -fy -o /tmp/rubytest.kt4tdn/2-mspec-multi-1 E, [2024-05-24T03:32:27.889596 #3324821] ERROR -- : $ /tmp/ruby/build/trunk/miniruby -I/tmp/ruby/src/trunk/lib /tmp/ruby/src/trunk/tool/runruby.rb --archdir=/tmp/ruby/build/trunk --extout=.ext -- /tmp/ruby/src/trunk/spec/mspec/bin/mspec-run -B /tmp/ruby/src/trunk/spec/default.mspec --error-output stderr --debug -fy -o /tmp/rubytest.kt4tdn/3-mspec-multi-2 E, [2024-05-24T03:32:27.889880 #3324821] ERROR -- : $ /tmp/ruby/build/trunk/miniruby -I/tmp/ruby/src/trunk/lib /tmp/ruby/src/trunk/tool/runruby.rb --archdir=/tmp/ruby/build/trunk --extout=.ext -- /tmp/ruby/src/trunk/spec/mspec/bin/mspec-run -B /tmp/ruby/src/trunk/spec/default.mspec --error-output stderr --debug -fy -o /tmp/rubytest.kt4tdn/4-mspec-multi-3 E, [2024-05-24T03:32:27.890182 #3324821] ERROR -- : $ /tmp/ruby/build/trunk/miniruby -I/tmp/ruby/src/trunk/lib /tmp/ruby/src/trunk/tool/runruby.rb --archdir=/tmp/ruby/build/trunk --extout=.ext -- /tmp/ruby/src/trunk/spec/mspec/bin/mspec-run -B /tmp/ruby/src/trunk/spec/default.mspec --error-output stderr --debug -fy -o /tmp/rubytest.kt4tdn/5-mspec-multi-4 E, [2024-05-24T03:32:27.890383 #3324821] ERROR -- : $ /tmp/ruby/build/trunk/miniruby -I/tmp/ruby/src/trunk/lib /tmp/ruby/src/trunk/tool/runruby.rb --archdir=/tmp/ruby/build/trunk --extout=.ext -- /tmp/ruby/src/trunk/spec/mspec/bin/mspec-run -B /tmp/ruby/src/trunk/spec/default.mspec --error-output stderr --debug -fy -o /tmp/rubytest.kt4tdn/6-mspec-multi-5 E, [2024-05-24T03:32:27.890511 #3324821] ERROR -- : $ /tmp/ruby/build/trunk/miniruby -I/tmp/ruby/src/trunk/lib /tmp/ruby/src/trunk/tool/runruby.rb --archdir=/tmp/ruby/build/trunk --extout=.ext -- /tmp/ruby/src/trunk/spec/mspec/bin/mspec-run -B /tmp/ruby/src/trunk/spec/default.mspec --error-output stderr --debug -fy -o /tmp/rubytest.kt4tdn/7-mspec-multi-6 E, [2024-05-24T03:32:27.890804 #3324821] ERROR -- : $ /tmp/ruby/build/trunk/miniruby -I/tmp/ruby/src/trunk/lib /tmp/ruby/src/trunk/tool/runruby.rb --archdir=/tmp/ruby/build/trunk --extout=.ext -- /tmp/ruby/src/trunk/spec/mspec/bin/mspec-run -B /tmp/ruby/src/trunk/spec/default.mspec --error-output stderr --debug -fy -o /tmp/rubytest.kt4tdn/8-mspec-multi-7 E, [2024-05-24T03:32:27.891010 #3324821] ERROR -- : $ /tmp/ruby/build/trunk/miniruby -I/tmp/ruby/src/trunk/lib /tmp/ruby/src/trunk/tool/runruby.rb --archdir=/tmp/ruby/build/trunk --extout=.ext -- /tmp/ruby/src/trunk/spec/mspec/bin/mspec-run -B /tmp/ruby/src/trunk/spec/default.mspec --error-output stderr --debug -fy -o /tmp/rubytest.kt4tdn/9-mspec-multi-8 E, [2024-05-24T03:32:27.891240 #3324821] ERROR -- : $ /tmp/ruby/build/trunk/miniruby -I/tmp/ruby/src/trunk/lib /tmp/ruby/src/trunk/tool/runruby.rb --archdir=/tmp/ruby/build/trunk --extout=.ext -- /tmp/ruby/src/trunk/spec/mspec/bin/mspec-run -B /tmp/ruby/src/trunk/spec/default.mspec --error-output stderr --debug -fy -o /tmp/rubytest.kt4tdn/10-mspec-multi-9 E, [2024-05-24T03:32:27.891496 #3324821] ERROR -- : $ /tmp/ruby/build/trunk/miniruby -I/tmp/ruby/src/trunk/lib /tmp/ruby/src/trunk/tool/runruby.rb --archdir=/tmp/ruby/build/trunk --extout=.ext -- /tmp/ruby/src/trunk/spec/mspec/bin/mspec-run -B /tmp/ruby/src/trunk/spec/default.mspec --error-output stderr --debug -fy -o /tmp/rubytest.kt4tdn/11-mspec-multi-10 E, [2024-05-24T03:32:27.891770 #3324821] ERROR -- : $ /tmp/ruby/build/trunk/miniruby -I/tmp/ruby/src/trunk/lib /tmp/ruby/src/trunk/tool/runruby.rb --archdir=/tmp/ruby/build/trunk --extout=.ext -- /tmp/ruby/src/trunk/spec/mspec/bin/mspec-run -B /tmp/ruby/src/trunk/spec/default.mspec --error-output stderr --debug -fy -o /tmp/rubytest.kt4tdn/12-mspec-multi-11 E, [2024-05-24T03:32:27.891944 #3324821] ERROR -- : $ /tmp/ruby/build/trunk/miniruby -I/tmp/ruby/src/trunk/lib /tmp/ruby/src/trunk/tool/runruby.rb --archdir=/tmp/ruby/build/trunk --extout=.ext -- /tmp/ruby/src/trunk/spec/mspec/bin/mspec-run -B /tmp/ruby/src/trunk/spec/default.mspec --error-output stderr --debug -fy -o /tmp/rubytest.kt4tdn/13-mspec-multi-12 E, [2024-05-24T03:32:27.892095 #3324821] ERROR -- : $ /tmp/ruby/build/trunk/miniruby -I/tmp/ruby/src/trunk/lib /tmp/ruby/src/trunk/tool/runruby.rb --archdir=/tmp/ruby/build/trunk --extout=.ext -- /tmp/ruby/src/trunk/spec/mspec/bin/mspec-run -B /tmp/ruby/src/trunk/spec/default.mspec --error-output stderr --debug -fy -o /tmp/rubytest.kt4tdn/14-mspec-multi-13 E, [2024-05-24T03:32:27.892249 #3324821] ERROR -- : $ /tmp/ruby/build/trunk/miniruby -I/tmp/ruby/src/trunk/lib /tmp/ruby/src/trunk/tool/runruby.rb --archdir=/tmp/ruby/build/trunk --extout=.ext -- /tmp/ruby/src/trunk/spec/mspec/bin/mspec-run -B /tmp/ruby/src/trunk/spec/default.mspec --error-output stderr --debug -fy -o /tmp/rubytest.kt4tdn/15-mspec-multi-14 E, [2024-05-24T03:32:27.892471 #3324821] ERROR -- : $ /tmp/ruby/build/trunk/miniruby -I/tmp/ruby/src/trunk/lib /tmp/ruby/src/trunk/tool/runruby.rb --archdir=/tmp/ruby/build/trunk --extout=.ext -- /tmp/ruby/src/trunk/spec/mspec/bin/mspec-run -B /tmp/ruby/src/trunk/spec/default.mspec --error-output stderr --debug -fy -o /tmp/rubytest.kt4tdn/16-mspec-multi-15 E, [2024-05-24T03:32:27.892656 #3324821] ERROR -- : $ /tmp/ruby/build/trunk/miniruby -I/tmp/ruby/src/trunk/lib /tmp/ruby/src/trunk/tool/runruby.rb --archdir=/tmp/ruby/build/trunk --extout=.ext -- /tmp/ruby/src/trunk/spec/mspec/bin/mspec-run -B /tmp/ruby/src/trunk/spec/default.mspec --error-output stderr --debug -fy -o /tmp/rubytest.kt4tdn/17-mspec-multi-16 E, [2024-05-24T03:32:27.892847 #3324821] ERROR -- : $ /tmp/ruby/build/trunk/miniruby -I/tmp/ruby/src/trunk/lib /tmp/ruby/src/trunk/tool/runruby.rb --archdir=/tmp/ruby/build/trunk --extout=.ext -- /tmp/ruby/src/trunk/spec/mspec/bin/mspec-run -B /tmp/ruby/src/trunk/spec/default.mspec --error-output stderr --debug -fy -o /tmp/rubytest.kt4tdn/18-mspec-multi-17 E, [2024-05-24T03:32:27.895117 #3324821] ERROR -- : $ /tmp/ruby/build/trunk/miniruby -I/tmp/ruby/src/trunk/lib /tmp/ruby/src/trunk/tool/runruby.rb --archdir=/tmp/ruby/build/trunk --extout=.ext -- /tmp/ruby/src/trunk/spec/mspec/bin/mspec-run -B /tmp/ruby/src/trunk/spec/default.mspec --error-output stderr --debug -fy -o /tmp/rubytest.kt4tdn/19-mspec-multi-18 E, [2024-05-24T03:32:27.895446 #3324821] ERROR -- : $ /tmp/ruby/build/trunk/miniruby -I/tmp/ruby/src/trunk/lib /tmp/ruby/src/trunk/tool/runruby.rb --archdir=/tmp/ruby/build/trunk --extout=.ext -- /tmp/ruby/src/trunk/spec/mspec/bin/mspec-run -B /tmp/ruby/src/trunk/spec/default.mspec --error-output stderr --debug -fy -o /tmp/rubytest.kt4tdn/20-mspec-multi-19 I, [2024-05-24T03:32:28.066993 #3324821] INFO -- : ruby 3.4.0dev (2024-05-24T01:53:35Z master acdd19facc) [x86_64-linux] I, [2024-05-24T03:32:28.706307 #3324821] INFO -- : 0 ......................................................................... I, [2024-05-24T03:32:29.069783 #3324821] INFO -- : 73 ......................................................................... I, [2024-05-24T03:32:29.218538 #3324821] INFO -- : 146 ......................................................................... I, [2024-05-24T03:32:29.263068 #3324821] INFO -- : 219 ......................................................................... I, [2024-05-24T03:32:29.315749 #3324821] INFO -- : 292 ......................................................................... I, [2024-05-24T03:32:29.362588 #3324821] INFO -- : 365 ......................................................................... I, [2024-05-24T03:32:29.383328 #3324821] INFO -- : 438 ......................................................................... I, [2024-05-24T03:32:29.404357 #3324821] INFO -- : 511 ......................................................................... I, [2024-05-24T03:32:29.428774 #3324821] INFO -- : 584 ......................................................................... I, [2024-05-24T03:32:29.475840 #3324821] INFO -- : 657 ......................................................................... I, [2024-05-24T03:32:29.507017 #3324821] INFO -- : 730 ......................................................................... I, [2024-05-24T03:32:29.529108 #3324821] INFO -- : 803 ......................................................................... I, [2024-05-24T03:32:29.560567 #3324821] INFO -- : 876 ......................................................................... I, [2024-05-24T03:32:29.607062 #3324821] INFO -- : 949 ......................................................................... I, [2024-05-24T03:32:29.710227 #3324821] INFO -- : 1022 ......................................................................... I, [2024-05-24T03:32:29.862077 #3324821] INFO -- : 1095 ......................................................................... I, [2024-05-24T03:32:29.989817 #3324821] INFO -- : 1168 ......................................................................... I, [2024-05-24T03:32:30.048548 #3324821] INFO -- : 1241 ......................................................................... I, [2024-05-24T03:32:30.099551 #3324821] INFO -- : 1314 ......................................................................... I, [2024-05-24T03:32:30.118021 #3324821] INFO -- : 1387 ......................................................................... I, [2024-05-24T03:32:30.237522 #3324821] INFO -- : 1460 ......................................................................... I, [2024-05-24T03:32:30.725471 #3324821] INFO -- : 1533 ......................................................................... I, [2024-05-24T03:32:30.776034 #3324821] INFO -- : 1606 ......................................................................... I, [2024-05-24T03:32:30.896580 #3324821] INFO -- : 1679 ......................................................................... I, [2024-05-24T03:32:31.013354 #3324821] INFO -- : 1752 ......................................................................... I, [2024-05-24T03:32:31.098223 #3324821] INFO -- : 1825 ......................................................................... I, [2024-05-24T03:32:31.187231 #3324821] INFO -- : 1898 ......................................................................... I, [2024-05-24T03:32:31.281829 #3324821] INFO -- : 1971 ......................................................................... I, [2024-05-24T03:32:31.346839 #3324821] INFO -- : 2044 ......................................................................... I, [2024-05-24T03:32:31.399998 #3324821] INFO -- : 2117 ......................................................................... I, [2024-05-24T03:32:31.413941 #3324821] INFO -- : 2190 ......................................................................... I, [2024-05-24T03:32:31.434423 #3324821] INFO -- : 2263 ......................................................................... I, [2024-05-24T03:32:31.447910 #3324821] INFO -- : 2336 ......................................................................... I, [2024-05-24T03:32:31.477821 #3324821] INFO -- : 2409 ......................................................................... I, [2024-05-24T03:32:31.583861 #3324821] INFO -- : 2482 ......................................................................... I, [2024-05-24T03:32:31.616472 #3324821] INFO -- : 2555 ......................................................................... I, [2024-05-24T03:32:31.709380 #3324821] INFO -- : 2628 ......................................................................... I, [2024-05-24T03:32:31.813367 #3324821] INFO -- : 2701 ......................................................................... I, [2024-05-24T03:32:31.847253 #3324821] INFO -- : 2774 ......................................................................... I, [2024-05-24T03:32:31.909740 #3324821] INFO -- : 2847 ......................................................................... I, [2024-05-24T03:32:31.943995 #3324821] INFO -- : 2920 ......................................................................... I, [2024-05-24T03:32:31.969632 #3324821] INFO -- : 2993 ......................................................................... I, [2024-05-24T03:32:31.988034 #3324821] INFO -- : 3066 ......................................................................... I, [2024-05-24T03:32:32.000284 #3324821] INFO -- : 3139 ......................................................................... I, [2024-05-24T03:32:32.010506 #3324821] INFO -- : 3212 ......................................................................... I, [2024-05-24T03:32:32.036613 #3324821] INFO -- : 3285 ......................................................................... I, [2024-05-24T03:32:35.990978 #3324821] INFO -- : 3358 ......................................................................... I, [2024-05-24T03:32:36.012067 #3324821] INFO -- : I, [2024-05-24T03:32:36.012102 #3324821] INFO -- : I, [2024-05-24T03:32:36.012109 #3324821] INFO -- : Finished in 8.122254 seconds I, [2024-05-24T03:32:36.012115 #3324821] INFO -- : I, [2024-05-24T03:32:36.012120 #3324821] INFO -- : 3430 files, 32652 examples, 193398 expectations, 0 failures, 0 errors, 0 tagged I, [2024-05-24T03:32:36.014623 #3324821] INFO -- : $$$[end] "make yes-test-rubyspec MSPECOPT='--error-output stderr --debug -j' TESTS='-j20'" exit with 0.