# Logfile created on 2024-05-23 11:25:19 +0000 by logger.rb/v1.4.3 I, [2024-05-23T11:25:19.567141 #531024] INFO -- : #, @formatter=nil, @logdev=#, @binmode=false, @mon_data=#, @mon_data_owner_object_id=860>>> I, [2024-05-23T11:25:19.567262 #531024] INFO -- : $$$[beg] make update-unicode -j20 I, [2024-05-23T11:25:19.626236 #531024] INFO -- : Downloading Unicode emoji 15.0 files... I, [2024-05-23T11:25:19.626424 #531024] INFO -- : Downloading Unicode emoji 15.0 files... I, [2024-05-23T11:25:19.627134 #531024] INFO -- : Downloading Unicode emoji 15.0 files... I, [2024-05-23T11:25:19.668577 #531024] INFO -- : made symlink emoji/15.0/emoji-sequences.txt to /tmp/ruby/src/trunk/.downloaded-cache/emoji/15.0/emoji-sequences.txt I, [2024-05-23T11:25:19.668962 #531024] INFO -- : downloading emoji/15.0/emoji-sequences.txt ... downloading emoji/15.0/emoji-test.txt ... /tmp/ruby/src/trunk/enc/unicode/data/emoji/15.0/emoji-sequences.txt already exists E, [2024-05-23T11:25:20.120108 #531024] ERROR -- : /tmp/ruby/src/trunk/tool/downloader.rb:302:in `rescue in download': failed to download emoji/15.0/emoji-test.txt (RuntimeError) E, [2024-05-23T11:25:20.120231 #531024] ERROR -- : OpenURI::HTTPError: 403 Forbidden: https://www.unicode.org/Public/emoji/15.0/emoji-test.txt E, [2024-05-23T11:25:20.120251 #531024] ERROR -- : from /tmp/ruby/src/trunk/tool/downloader.rb:201:in `download' E, [2024-05-23T11:25:20.120265 #531024] ERROR -- : from /tmp/ruby/src/trunk/tool/downloader.rb:136:in `download' E, [2024-05-23T11:25:20.120278 #531024] ERROR -- : from /tmp/ruby/src/trunk/tool/downloader.rb:482:in `block in
' E, [2024-05-23T11:25:20.120290 #531024] ERROR -- : from /tmp/ruby/src/trunk/tool/downloader.rb:465:in `each' E, [2024-05-23T11:25:20.120301 #531024] ERROR -- : from /tmp/ruby/src/trunk/tool/downloader.rb:465:in `
' E, [2024-05-23T11:25:20.120313 #531024] ERROR -- : /usr/lib/ruby/3.0.0/open-uri.rb:364:in `open_http': 403 Forbidden (OpenURI::HTTPError) E, [2024-05-23T11:25:20.120325 #531024] ERROR -- : from /usr/lib/ruby/3.0.0/open-uri.rb:741:in `buffer_open' E, [2024-05-23T11:25:20.120339 #531024] ERROR -- : from /usr/lib/ruby/3.0.0/open-uri.rb:212:in `block in open_loop' E, [2024-05-23T11:25:20.120351 #531024] ERROR -- : from /usr/lib/ruby/3.0.0/open-uri.rb:210:in `catch' E, [2024-05-23T11:25:20.120363 #531024] ERROR -- : from /usr/lib/ruby/3.0.0/open-uri.rb:210:in `open_loop' E, [2024-05-23T11:25:20.120374 #531024] ERROR -- : from /usr/lib/ruby/3.0.0/open-uri.rb:151:in `open_uri' E, [2024-05-23T11:25:20.120386 #531024] ERROR -- : from /usr/lib/ruby/3.0.0/open-uri.rb:721:in `open' E, [2024-05-23T11:25:20.120399 #531024] ERROR -- : from /usr/lib/ruby/3.0.0/open-uri.rb:729:in `read' E, [2024-05-23T11:25:20.120418 #531024] ERROR -- : from /tmp/ruby/src/trunk/tool/downloader.rb:247:in `block in download' E, [2024-05-23T11:25:20.120448 #531024] ERROR -- : from /tmp/ruby/src/trunk/tool/downloader.rb:378:in `with_retry' E, [2024-05-23T11:25:20.120465 #531024] ERROR -- : from /tmp/ruby/src/trunk/tool/downloader.rb:246:in `download' E, [2024-05-23T11:25:20.120477 #531024] ERROR -- : from /tmp/ruby/src/trunk/tool/downloader.rb:136:in `download' E, [2024-05-23T11:25:20.120488 #531024] ERROR -- : from /tmp/ruby/src/trunk/tool/downloader.rb:482:in `block in
' E, [2024-05-23T11:25:20.120500 #531024] ERROR -- : from /tmp/ruby/src/trunk/tool/downloader.rb:465:in `each' E, [2024-05-23T11:25:20.120512 #531024] ERROR -- : from /tmp/ruby/src/trunk/tool/downloader.rb:465:in `
' E, [2024-05-23T11:25:20.124654 #531024] ERROR -- : make: *** [uncommon.mk:1756: /tmp/ruby/src/trunk/enc/unicode/data/emoji/15.0/emoji-zwj-sequences.txt] Error 1 E, [2024-05-23T11:25:20.124727 #531024] ERROR -- : make: *** Waiting for unfinished jobs.... E, [2024-05-23T11:25:20.140797 #531024] ERROR -- : /tmp/ruby/src/trunk/tool/downloader.rb:302:in `rescue in download': failed to download emoji/15.0/emoji-test.txt (RuntimeError) E, [2024-05-23T11:25:20.140920 #531024] ERROR -- : OpenURI::HTTPError: 403 Forbidden: https://www.unicode.org/Public/emoji/15.0/emoji-test.txt E, [2024-05-23T11:25:20.140944 #531024] ERROR -- : from /tmp/ruby/src/trunk/tool/downloader.rb:201:in `download' E, [2024-05-23T11:25:20.140958 #531024] ERROR -- : from /tmp/ruby/src/trunk/tool/downloader.rb:136:in `download' E, [2024-05-23T11:25:20.140971 #531024] ERROR -- : from /tmp/ruby/src/trunk/tool/downloader.rb:482:in `block in
' E, [2024-05-23T11:25:20.140991 #531024] ERROR -- : from /tmp/ruby/src/trunk/tool/downloader.rb:465:in `each' E, [2024-05-23T11:25:20.141004 #531024] ERROR -- : from /tmp/ruby/src/trunk/tool/downloader.rb:465:in `
' E, [2024-05-23T11:25:20.141019 #531024] ERROR -- : /usr/lib/ruby/3.0.0/open-uri.rb:364:in `open_http': 403 Forbidden (OpenURI::HTTPError) E, [2024-05-23T11:25:20.141033 #531024] ERROR -- : from /usr/lib/ruby/3.0.0/open-uri.rb:741:in `buffer_open' E, [2024-05-23T11:25:20.141050 #531024] ERROR -- : from /usr/lib/ruby/3.0.0/open-uri.rb:212:in `block in open_loop' E, [2024-05-23T11:25:20.141064 #531024] ERROR -- : from /usr/lib/ruby/3.0.0/open-uri.rb:210:in `catch' E, [2024-05-23T11:25:20.141077 #531024] ERROR -- : from /usr/lib/ruby/3.0.0/open-uri.rb:210:in `open_loop' E, [2024-05-23T11:25:20.141090 #531024] ERROR -- : from /usr/lib/ruby/3.0.0/open-uri.rb:151:in `open_uri' E, [2024-05-23T11:25:20.141102 #531024] ERROR -- : from /usr/lib/ruby/3.0.0/open-uri.rb:721:in `open' E, [2024-05-23T11:25:20.141116 #531024] ERROR -- : from /usr/lib/ruby/3.0.0/open-uri.rb:729:in `read' E, [2024-05-23T11:25:20.141129 #531024] ERROR -- : from /tmp/ruby/src/trunk/tool/downloader.rb:247:in `block in download' E, [2024-05-23T11:25:20.141141 #531024] ERROR -- : from /tmp/ruby/src/trunk/tool/downloader.rb:378:in `with_retry' E, [2024-05-23T11:25:20.141158 #531024] ERROR -- : from /tmp/ruby/src/trunk/tool/downloader.rb:246:in `download' E, [2024-05-23T11:25:20.141171 #531024] ERROR -- : from /tmp/ruby/src/trunk/tool/downloader.rb:136:in `download' E, [2024-05-23T11:25:20.141184 #531024] ERROR -- : from /tmp/ruby/src/trunk/tool/downloader.rb:482:in `block in
' E, [2024-05-23T11:25:20.141197 #531024] ERROR -- : from /tmp/ruby/src/trunk/tool/downloader.rb:465:in `each' E, [2024-05-23T11:25:20.141210 #531024] ERROR -- : from /tmp/ruby/src/trunk/tool/downloader.rb:465:in `
' E, [2024-05-23T11:25:20.145501 #531024] ERROR -- : make: *** [uncommon.mk:1756: /tmp/ruby/src/trunk/enc/unicode/data/emoji/15.0/emoji-sequences.txt] Error 1 E, [2024-05-23T11:25:20.145566 #531024] ERROR -- : make: *** Deleting file '/tmp/ruby/src/trunk/enc/unicode/data/emoji/15.0/emoji-sequences.txt' E, [2024-05-23T11:25:20.551398 #531024] ERROR -- : /tmp/ruby/src/trunk/tool/downloader.rb:302:in `rescue in download': failed to download emoji/15.0/emoji-sequences.txt (RuntimeError) E, [2024-05-23T11:25:20.551516 #531024] ERROR -- : EOFError: end of file reached: https://www.unicode.org/Public/emoji/15.0/emoji-sequences.txt E, [2024-05-23T11:25:20.551560 #531024] ERROR -- : from /tmp/ruby/src/trunk/tool/downloader.rb:201:in `download' E, [2024-05-23T11:25:20.551574 #531024] ERROR -- : from /tmp/ruby/src/trunk/tool/downloader.rb:136:in `download' E, [2024-05-23T11:25:20.551586 #531024] ERROR -- : from /tmp/ruby/src/trunk/tool/downloader.rb:482:in `block in
' E, [2024-05-23T11:25:20.551599 #531024] ERROR -- : from /tmp/ruby/src/trunk/tool/downloader.rb:465:in `each' E, [2024-05-23T11:25:20.551611 #531024] ERROR -- : from /tmp/ruby/src/trunk/tool/downloader.rb:465:in `
' E, [2024-05-23T11:25:20.551624 #531024] ERROR -- : /usr/lib/ruby/3.0.0/net/protocol.rb:227:in `rbuf_fill': end of file reached (EOFError) E, [2024-05-23T11:25:20.551647 #531024] ERROR -- : from /usr/lib/ruby/3.0.0/net/protocol.rb:193:in `readuntil' E, [2024-05-23T11:25:20.551659 #531024] ERROR -- : from /usr/lib/ruby/3.0.0/net/protocol.rb:203:in `readline' E, [2024-05-23T11:25:20.551671 #531024] ERROR -- : from /usr/lib/ruby/3.0.0/net/http/response.rb:42:in `read_status_line' E, [2024-05-23T11:25:20.551682 #531024] ERROR -- : from /usr/lib/ruby/3.0.0/net/http/response.rb:31:in `read_new' E, [2024-05-23T11:25:20.551946 #531024] ERROR -- : from /usr/lib/ruby/3.0.0/net/http.rb:1557:in `block in transport_request' E, [2024-05-23T11:25:20.551963 #531024] ERROR -- : from /usr/lib/ruby/3.0.0/net/http.rb:1548:in `catch' E, [2024-05-23T11:25:20.551981 #531024] ERROR -- : from /usr/lib/ruby/3.0.0/net/http.rb:1548:in `transport_request' E, [2024-05-23T11:25:20.551992 #531024] ERROR -- : from /usr/lib/ruby/3.0.0/net/http.rb:1521:in `request' E, [2024-05-23T11:25:20.552003 #531024] ERROR -- : from /usr/lib/ruby/3.0.0/open-uri.rb:329:in `block in open_http' E, [2024-05-23T11:25:20.552014 #531024] ERROR -- : from /usr/lib/ruby/3.0.0/net/http.rb:960:in `start' E, [2024-05-23T11:25:20.552025 #531024] ERROR -- : from /usr/lib/ruby/3.0.0/open-uri.rb:323:in `open_http' E, [2024-05-23T11:25:20.552035 #531024] ERROR -- : from /usr/lib/ruby/3.0.0/open-uri.rb:741:in `buffer_open' E, [2024-05-23T11:25:20.552062 #531024] ERROR -- : from /usr/lib/ruby/3.0.0/open-uri.rb:212:in `block in open_loop' E, [2024-05-23T11:25:20.552073 #531024] ERROR -- : from /usr/lib/ruby/3.0.0/open-uri.rb:210:in `catch' E, [2024-05-23T11:25:20.552084 #531024] ERROR -- : from /usr/lib/ruby/3.0.0/open-uri.rb:210:in `open_loop' E, [2024-05-23T11:25:20.552094 #531024] ERROR -- : from /usr/lib/ruby/3.0.0/open-uri.rb:151:in `open_uri' E, [2024-05-23T11:25:20.552105 #531024] ERROR -- : from /usr/lib/ruby/3.0.0/open-uri.rb:721:in `open' E, [2024-05-23T11:25:20.552116 #531024] ERROR -- : from /usr/lib/ruby/3.0.0/open-uri.rb:729:in `read' E, [2024-05-23T11:25:20.552126 #531024] ERROR -- : from /tmp/ruby/src/trunk/tool/downloader.rb:247:in `block in download' E, [2024-05-23T11:25:20.552137 #531024] ERROR -- : from /tmp/ruby/src/trunk/tool/downloader.rb:378:in `with_retry' E, [2024-05-23T11:25:20.552148 #531024] ERROR -- : from /tmp/ruby/src/trunk/tool/downloader.rb:246:in `download' E, [2024-05-23T11:25:20.552161 #531024] ERROR -- : from /tmp/ruby/src/trunk/tool/downloader.rb:136:in `download' E, [2024-05-23T11:25:20.552172 #531024] ERROR -- : from /tmp/ruby/src/trunk/tool/downloader.rb:482:in `block in
' E, [2024-05-23T11:25:20.552183 #531024] ERROR -- : from /tmp/ruby/src/trunk/tool/downloader.rb:465:in `each' E, [2024-05-23T11:25:20.552194 #531024] ERROR -- : from /tmp/ruby/src/trunk/tool/downloader.rb:465:in `
' E, [2024-05-23T11:25:20.555851 #531024] ERROR -- : make: *** [uncommon.mk:1756: /tmp/ruby/src/trunk/enc/unicode/data/emoji/15.0/emoji-test.txt] Error 1 I, [2024-05-23T11:25:20.556087 #531024] INFO -- : downloading emoji/15.0/emoji-test.txt ... I, [2024-05-23T11:25:20.556757 #531024] INFO -- : $$$[end] "make update-unicode -j20" exit with 512. I, [2024-05-23T11:25:20.556844 #531024] INFO -- : $$$[beg] make update-download -j20 I, [2024-05-23T11:25:20.663086 #531024] INFO -- : tool/config.guess already exists I, [2024-05-23T11:25:20.663134 #531024] INFO -- : tool/config.sub already exists I, [2024-05-23T11:25:20.665036 #531024] INFO -- : Update power_assert to 84e85124c5014a139af39161d484156cfe87a9ed I, [2024-05-23T11:25:20.665192 #531024] INFO -- : Update rbs to ba7872795d5de04adb8ff500c0e6afdc81a041dd I, [2024-05-23T11:25:20.665874 #531024] INFO -- : Update typeprof to b19a6416da3a05d57fadd6ffdadb382b6d236ca5 I, [2024-05-23T11:25:20.666337 #531024] INFO -- : echo ba7872795d5de04adb8ff500c0e6afdc81a041dd | /bin/sh /tmp/ruby/src/trunk/tool/ifchange /tmp/ruby/src/trunk/.bundle/.timestamp/rbs.revision - I, [2024-05-23T11:25:20.666438 #531024] INFO -- : echo 84e85124c5014a139af39161d484156cfe87a9ed | /bin/sh /tmp/ruby/src/trunk/tool/ifchange /tmp/ruby/src/trunk/.bundle/.timestamp/power_assert.revision - I, [2024-05-23T11:25:20.667096 #531024] INFO -- : echo b19a6416da3a05d57fadd6ffdadb382b6d236ca5 | /bin/sh /tmp/ruby/src/trunk/tool/ifchange /tmp/ruby/src/trunk/.bundle/.timestamp/typeprof.revision - I, [2024-05-23T11:25:20.668023 #531024] INFO -- : /tmp/ruby/src/trunk/.bundle/.timestamp/rbs.revision unchanged I, [2024-05-23T11:25:20.668176 #531024] INFO -- : /tmp/ruby/src/trunk/.bundle/.timestamp/power_assert.revision unchanged I, [2024-05-23T11:25:20.668842 #531024] INFO -- : /tmp/ruby/src/trunk/.bundle/.timestamp/typeprof.revision unchanged I, [2024-05-23T11:25:20.669168 #531024] INFO -- : Building power_assert@84e85124c5014a139af39161d484156cfe87a9ed to /tmp/ruby/src/trunk/gems/power_assert-2.0.3.gem I, [2024-05-23T11:25:20.737938 #531024] INFO -- : Successfully built RubyGem I, [2024-05-23T11:25:20.737982 #531024] INFO -- : Name: power_assert I, [2024-05-23T11:25:20.737989 #531024] INFO -- : Version: 2.0.4dev I, [2024-05-23T11:25:20.737994 #531024] INFO -- : File: power_assert-2.0.4dev.gem I, [2024-05-23T11:25:20.784400 #531024] INFO -- : $$$[end] "make update-download -j20" exit with 0. I, [2024-05-23T11:25:20.784439 #531024] INFO -- : $$$[beg] make update-rubyspec -j20 I, [2024-05-23T11:25:20.841963 #531024] INFO -- : make: Nothing to be done for 'update-rubyspec'. I, [2024-05-23T11:25:20.842304 #531024] INFO -- : $$$[end] "make update-rubyspec -j20" exit with 0. I, [2024-05-23T11:25:20.842366 #531024] INFO -- : $$$[beg] make update-src -j20 I, [2024-05-23T11:25:21.555923 #531024] INFO -- : Already up to date. I, [2024-05-23T11:25:21.571275 #531024] INFO -- : Latest commit hash = a99d79dd31 I, [2024-05-23T11:25:21.572879 #531024] INFO -- : $$$[end] "make update-src -j20" exit with 0. I, [2024-05-23T11:25:21.572928 #531024] INFO -- : $$$[beg] make after-update -j20 I, [2024-05-23T11:25:21.647355 #531024] INFO -- : generating /tmp/ruby/src/trunk/ext/ripper/eventids2table.c I, [2024-05-23T11:25:21.651610 #531024] INFO -- : make[1]: Entering directory '/tmp/ruby/src/trunk/ext/ripper' I, [2024-05-23T11:25:21.651658 #531024] INFO -- : make[1]: Nothing to be done for 'src'. I, [2024-05-23T11:25:21.651671 #531024] INFO -- : make[1]: Leaving directory '/tmp/ruby/src/trunk/ext/ripper' I, [2024-05-23T11:25:21.667947 #531024] INFO -- : /tmp/ruby/src/trunk/revision.h updated I, [2024-05-23T11:25:21.669257 #531024] INFO -- : generating x86_64-linux-fake.rb I, [2024-05-23T11:25:21.720566 #531024] INFO -- : x86_64-linux-fake.rb updated I, [2024-05-23T11:25:21.721915 #531024] INFO -- : generating enc.mk I, [2024-05-23T11:25:21.838921 #531024] INFO -- : making srcs under enc I, [2024-05-23T11:25:21.868692 #531024] INFO -- : make[1]: Entering directory '/tmp/ruby/build/trunk' I, [2024-05-23T11:25:21.868758 #531024] INFO -- : make[1]: Nothing to be done for 'srcs'. I, [2024-05-23T11:25:21.868773 #531024] INFO -- : make[1]: Leaving directory '/tmp/ruby/build/trunk' I, [2024-05-23T11:25:21.913370 #531024] INFO -- : Update power_assert to 84e85124c5014a139af39161d484156cfe87a9ed I, [2024-05-23T11:25:21.913507 #531024] INFO -- : Update rbs to ba7872795d5de04adb8ff500c0e6afdc81a041dd I, [2024-05-23T11:25:21.914309 #531024] INFO -- : Update typeprof to b19a6416da3a05d57fadd6ffdadb382b6d236ca5 I, [2024-05-23T11:25:21.914688 #531024] INFO -- : echo 84e85124c5014a139af39161d484156cfe87a9ed | /bin/sh /tmp/ruby/src/trunk/tool/ifchange /tmp/ruby/src/trunk/.bundle/.timestamp/power_assert.revision - I, [2024-05-23T11:25:21.914968 #531024] INFO -- : echo ba7872795d5de04adb8ff500c0e6afdc81a041dd | /bin/sh /tmp/ruby/src/trunk/tool/ifchange /tmp/ruby/src/trunk/.bundle/.timestamp/rbs.revision - I, [2024-05-23T11:25:21.916173 #531024] INFO -- : echo b19a6416da3a05d57fadd6ffdadb382b6d236ca5 | /bin/sh /tmp/ruby/src/trunk/tool/ifchange /tmp/ruby/src/trunk/.bundle/.timestamp/typeprof.revision - I, [2024-05-23T11:25:21.916975 #531024] INFO -- : /tmp/ruby/src/trunk/.bundle/.timestamp/rbs.revision unchanged I, [2024-05-23T11:25:21.917024 #531024] INFO -- : /tmp/ruby/src/trunk/.bundle/.timestamp/power_assert.revision unchanged I, [2024-05-23T11:25:21.917793 #531024] INFO -- : /tmp/ruby/src/trunk/.bundle/.timestamp/typeprof.revision unchanged I, [2024-05-23T11:25:21.918247 #531024] INFO -- : Building power_assert@84e85124c5014a139af39161d484156cfe87a9ed to /tmp/ruby/src/trunk/gems/power_assert-2.0.3.gem I, [2024-05-23T11:25:21.988097 #531024] INFO -- : Successfully built RubyGem I, [2024-05-23T11:25:21.988135 #531024] INFO -- : Name: power_assert I, [2024-05-23T11:25:21.988140 #531024] INFO -- : Version: 2.0.4dev I, [2024-05-23T11:25:21.988144 #531024] INFO -- : File: power_assert-2.0.4dev.gem I, [2024-05-23T11:25:21.990476 #531024] INFO -- : Extracting bundle gem power_assert-2.0.3... I, [2024-05-23T11:25:22.051618 #531024] INFO -- : Try with hash version of bundled gems instead of gems/power_assert-2.0.3.gem. We don't use this gem with release version of Ruby. I, [2024-05-23T11:25:22.056876 #531024] INFO -- : Unpacked gems/power_assert-2.0.4dev.gem I, [2024-05-23T11:25:22.059306 #531024] INFO -- : $$$[end] "make after-update -j20" exit with 0. I, [2024-05-23T11:25:22.059460 #531024] INFO -- : $$$[beg] make miniruby -j20 I, [2024-05-23T11:25:22.116835 #531024] INFO -- : BASERUBY = /usr/bin/ruby --disable=gems I, [2024-05-23T11:25:22.116868 #531024] INFO -- : CC = gcc I, [2024-05-23T11:25:22.116874 #531024] INFO -- : LD = ld I, [2024-05-23T11:25:22.116878 #531024] INFO -- : LDSHARED = gcc -shared I, [2024-05-23T11:25:22.116882 #531024] INFO -- : CFLAGS = -O3 -fno-fast-math -ggdb3 -Wall -Wextra -Wdeprecated-declarations -Wdiv-by-zero -Wduplicated-cond -Wimplicit-function-declaration -Wimplicit-int -Wpointer-arith -Wwrite-strings -Wold-style-definition -Wimplicit-fallthrough=0 -Wmissing-noreturn -Wno-cast-function-type -Wno-constant-logical-operand -Wno-long-long -Wno-missing-field-initializers -Wno-overlength-strings -Wno-packed-bitfield-compat -Wno-parentheses-equality -Wno-self-assign -Wno-tautological-compare -Wno-unused-parameter -Wno-unused-value -Wsuggest-attribute=format -Wsuggest-attribute=noreturn -Wunused-variable -Wmisleading-indentation -Wundef -fPIC I, [2024-05-23T11:25:22.116887 #531024] INFO -- : XCFLAGS = -U_FORTIFY_SOURCE -D_FORTIFY_SOURCE=2 -fstack-protector-strong -fno-strict-overflow -fvisibility=hidden -fexcess-precision=standard -DRUBY_EXPORT -I. -I.ext/include/x86_64-linux -I/tmp/ruby/src/trunk/include -I/tmp/ruby/src/trunk -I/tmp/ruby/src/trunk/prism -I/tmp/ruby/src/trunk/enc/unicode/15.0.0 I, [2024-05-23T11:25:22.116891 #531024] INFO -- : CPPFLAGS = I, [2024-05-23T11:25:22.116895 #531024] INFO -- : DLDFLAGS = -Wl,--compress-debug-sections=zlib -Wl,-soname,libruby.so.3.4 -fstack-protector-strong I, [2024-05-23T11:25:22.116899 #531024] INFO -- : SOLIBS = -lz -lrt -lrt -lgmp -ldl -lcrypt -lm -lpthread I, [2024-05-23T11:25:22.116903 #531024] INFO -- : LANG = en_US.UTF-8 I, [2024-05-23T11:25:22.116908 #531024] INFO -- : LC_ALL = I, [2024-05-23T11:25:22.116912 #531024] INFO -- : LC_CTYPE = I, [2024-05-23T11:25:22.116916 #531024] INFO -- : MFLAGS = -j20 --jobserver-auth=4,5 I, [2024-05-23T11:25:22.116919 #531024] INFO -- : RUSTC = no I, [2024-05-23T11:25:22.116923 #531024] INFO -- : YJIT_RUSTC_ARGS = --crate-name=yjit --crate-type=staticlib --edition=2021 -g -C lto=thin -C opt-level=3 -C overflow-checks=on '--out-dir=/tmp/ruby/build/trunk/yjit/target/release/' /tmp/ruby/src/trunk/yjit/src/lib.rs I, [2024-05-23T11:25:22.118360 #531024] INFO -- : gcc (Ubuntu 11.4.0-1ubuntu1~22.04) 11.4.0 I, [2024-05-23T11:25:22.118383 #531024] INFO -- : Copyright (C) 2021 Free Software Foundation, Inc. I, [2024-05-23T11:25:22.118389 #531024] INFO -- : This is free software; see the source for copying conditions. There is NO I, [2024-05-23T11:25:22.118397 #531024] INFO -- : warranty; not even for MERCHANTABILITY or FITNESS FOR A PARTICULAR PURPOSE. I, [2024-05-23T11:25:22.118401 #531024] INFO -- : I, [2024-05-23T11:25:22.142272 #531024] INFO -- : compiling /tmp/ruby/src/trunk/version.c I, [2024-05-23T11:25:22.244145 #531024] INFO -- : linking miniruby I, [2024-05-23T11:25:22.771138 #531024] INFO -- : $$$[end] "make miniruby -j20" exit with 0. I, [2024-05-23T11:25:22.771254 #531024] INFO -- : $$$[beg] make ruby -j20 I, [2024-05-23T11:25:22.829010 #531024] INFO -- : BASERUBY = /usr/bin/ruby --disable=gems I, [2024-05-23T11:25:22.829046 #531024] INFO -- : CC = gcc I, [2024-05-23T11:25:22.829053 #531024] INFO -- : LD = ld I, [2024-05-23T11:25:22.829060 #531024] INFO -- : LDSHARED = gcc -shared I, [2024-05-23T11:25:22.829070 #531024] INFO -- : CFLAGS = -O3 -fno-fast-math -ggdb3 -Wall -Wextra -Wdeprecated-declarations -Wdiv-by-zero -Wduplicated-cond -Wimplicit-function-declaration -Wimplicit-int -Wpointer-arith -Wwrite-strings -Wold-style-definition -Wimplicit-fallthrough=0 -Wmissing-noreturn -Wno-cast-function-type -Wno-constant-logical-operand -Wno-long-long -Wno-missing-field-initializers -Wno-overlength-strings -Wno-packed-bitfield-compat -Wno-parentheses-equality -Wno-self-assign -Wno-tautological-compare -Wno-unused-parameter -Wno-unused-value -Wsuggest-attribute=format -Wsuggest-attribute=noreturn -Wunused-variable -Wmisleading-indentation -Wundef -fPIC I, [2024-05-23T11:25:22.829078 #531024] INFO -- : XCFLAGS = -U_FORTIFY_SOURCE -D_FORTIFY_SOURCE=2 -fstack-protector-strong -fno-strict-overflow -fvisibility=hidden -fexcess-precision=standard -DRUBY_EXPORT -I. -I.ext/include/x86_64-linux -I/tmp/ruby/src/trunk/include -I/tmp/ruby/src/trunk -I/tmp/ruby/src/trunk/prism -I/tmp/ruby/src/trunk/enc/unicode/15.0.0 I, [2024-05-23T11:25:22.829085 #531024] INFO -- : CPPFLAGS = I, [2024-05-23T11:25:22.829091 #531024] INFO -- : DLDFLAGS = -Wl,--compress-debug-sections=zlib -Wl,-soname,libruby.so.3.4 -fstack-protector-strong I, [2024-05-23T11:25:22.829098 #531024] INFO -- : SOLIBS = -lz -lrt -lrt -lgmp -ldl -lcrypt -lm -lpthread I, [2024-05-23T11:25:22.829105 #531024] INFO -- : LANG = en_US.UTF-8 I, [2024-05-23T11:25:22.829111 #531024] INFO -- : LC_ALL = I, [2024-05-23T11:25:22.829117 #531024] INFO -- : LC_CTYPE = I, [2024-05-23T11:25:22.829123 #531024] INFO -- : MFLAGS = -j20 --jobserver-auth=4,5 I, [2024-05-23T11:25:22.829130 #531024] INFO -- : RUSTC = no I, [2024-05-23T11:25:22.829137 #531024] INFO -- : YJIT_RUSTC_ARGS = --crate-name=yjit --crate-type=staticlib --edition=2021 -g -C lto=thin -C opt-level=3 -C overflow-checks=on '--out-dir=/tmp/ruby/build/trunk/yjit/target/release/' /tmp/ruby/src/trunk/yjit/src/lib.rs I, [2024-05-23T11:25:22.830754 #531024] INFO -- : gcc (Ubuntu 11.4.0-1ubuntu1~22.04) 11.4.0 I, [2024-05-23T11:25:22.830789 #531024] INFO -- : Copyright (C) 2021 Free Software Foundation, Inc. I, [2024-05-23T11:25:22.830801 #531024] INFO -- : This is free software; see the source for copying conditions. There is NO I, [2024-05-23T11:25:22.830810 #531024] INFO -- : warranty; not even for MERCHANTABILITY or FITNESS FOR A PARTICULAR PURPOSE. I, [2024-05-23T11:25:22.830822 #531024] INFO -- : I, [2024-05-23T11:25:22.944427 #531024] INFO -- : builtin_binary.inc updated I, [2024-05-23T11:25:22.949154 #531024] INFO -- : c5234a9416e4f20f175185e840b25b0f08674d14078ed7083f37e655458e3ca9 builtin_binary.inc I, [2024-05-23T11:25:22.949920 #531024] INFO -- : compiling /tmp/ruby/src/trunk/builtin.c I, [2024-05-23T11:25:23.131980 #531024] INFO -- : linking static-library libruby-static.a I, [2024-05-23T11:25:23.444566 #531024] INFO -- : linking shared-library libruby.so.3.4.0 I, [2024-05-23T11:25:25.001449 #531024] INFO -- : linking ruby I, [2024-05-23T11:25:25.026191 #531024] INFO -- : $$$[end] "make ruby -j20" exit with 0. I, [2024-05-23T11:25:25.026315 #531024] INFO -- : $$$[beg] make all -j20 I, [2024-05-23T11:25:25.083816 #531024] INFO -- : BASERUBY = /usr/bin/ruby --disable=gems I, [2024-05-23T11:25:25.083844 #531024] INFO -- : CC = gcc I, [2024-05-23T11:25:25.083849 #531024] INFO -- : LD = ld I, [2024-05-23T11:25:25.083853 #531024] INFO -- : LDSHARED = gcc -shared I, [2024-05-23T11:25:25.083857 #531024] INFO -- : CFLAGS = -O3 -fno-fast-math -ggdb3 -Wall -Wextra -Wdeprecated-declarations -Wdiv-by-zero -Wduplicated-cond -Wimplicit-function-declaration -Wimplicit-int -Wpointer-arith -Wwrite-strings -Wold-style-definition -Wimplicit-fallthrough=0 -Wmissing-noreturn -Wno-cast-function-type -Wno-constant-logical-operand -Wno-long-long -Wno-missing-field-initializers -Wno-overlength-strings -Wno-packed-bitfield-compat -Wno-parentheses-equality -Wno-self-assign -Wno-tautological-compare -Wno-unused-parameter -Wno-unused-value -Wsuggest-attribute=format -Wsuggest-attribute=noreturn -Wunused-variable -Wmisleading-indentation -Wundef -fPIC I, [2024-05-23T11:25:25.083861 #531024] INFO -- : XCFLAGS = -U_FORTIFY_SOURCE -D_FORTIFY_SOURCE=2 -fstack-protector-strong -fno-strict-overflow -fvisibility=hidden -fexcess-precision=standard -DRUBY_EXPORT -I. -I.ext/include/x86_64-linux -I/tmp/ruby/src/trunk/include -I/tmp/ruby/src/trunk -I/tmp/ruby/src/trunk/prism -I/tmp/ruby/src/trunk/enc/unicode/15.0.0 I, [2024-05-23T11:25:25.083865 #531024] INFO -- : CPPFLAGS = I, [2024-05-23T11:25:25.083868 #531024] INFO -- : DLDFLAGS = -Wl,--compress-debug-sections=zlib -Wl,-soname,libruby.so.3.4 -fstack-protector-strong I, [2024-05-23T11:25:25.083872 #531024] INFO -- : SOLIBS = -lz -lrt -lrt -lgmp -ldl -lcrypt -lm -lpthread I, [2024-05-23T11:25:25.083875 #531024] INFO -- : LANG = en_US.UTF-8 I, [2024-05-23T11:25:25.083879 #531024] INFO -- : LC_ALL = I, [2024-05-23T11:25:25.083882 #531024] INFO -- : LC_CTYPE = I, [2024-05-23T11:25:25.083886 #531024] INFO -- : MFLAGS = -j20 --jobserver-auth=4,5 I, [2024-05-23T11:25:25.083889 #531024] INFO -- : RUSTC = no I, [2024-05-23T11:25:25.083893 #531024] INFO -- : YJIT_RUSTC_ARGS = --crate-name=yjit --crate-type=staticlib --edition=2021 -g -C lto=thin -C opt-level=3 -C overflow-checks=on '--out-dir=/tmp/ruby/build/trunk/yjit/target/release/' /tmp/ruby/src/trunk/yjit/src/lib.rs I, [2024-05-23T11:25:25.085271 #531024] INFO -- : gcc (Ubuntu 11.4.0-1ubuntu1~22.04) 11.4.0 I, [2024-05-23T11:25:25.085296 #531024] INFO -- : Copyright (C) 2021 Free Software Foundation, Inc. I, [2024-05-23T11:25:25.085306 #531024] INFO -- : This is free software; see the source for copying conditions. There is NO I, [2024-05-23T11:25:25.085311 #531024] INFO -- : warranty; not even for MERCHANTABILITY or FITNESS FOR A PARTICULAR PURPOSE. I, [2024-05-23T11:25:25.085316 #531024] INFO -- : I, [2024-05-23T11:25:25.114951 #531024] INFO -- : generating encdb.h I, [2024-05-23T11:25:25.116187 #531024] INFO -- : generating enc.mk I, [2024-05-23T11:25:25.118029 #531024] INFO -- : building spec/ruby/optional/capi/ext/array_spec.so I, [2024-05-23T11:25:25.118464 #531024] INFO -- : building spec/ruby/optional/capi/ext/basic_object_spec.so I, [2024-05-23T11:25:25.118767 #531024] INFO -- : building spec/ruby/optional/capi/ext/bignum_spec.so I, [2024-05-23T11:25:25.118994 #531024] INFO -- : building spec/ruby/optional/capi/ext/binding_spec.so I, [2024-05-23T11:25:25.120092 #531024] INFO -- : building spec/ruby/optional/capi/ext/boolean_spec.so I, [2024-05-23T11:25:25.120504 #531024] INFO -- : building spec/ruby/optional/capi/ext/class_id_under_autoload_spec.so I, [2024-05-23T11:25:25.120965 #531024] INFO -- : building spec/ruby/optional/capi/ext/class_spec.so I, [2024-05-23T11:25:25.121414 #531024] INFO -- : building spec/ruby/optional/capi/ext/class_under_autoload_spec.so I, [2024-05-23T11:25:25.122178 #531024] INFO -- : building spec/ruby/optional/capi/ext/complex_spec.so I, [2024-05-23T11:25:25.122481 #531024] INFO -- : building spec/ruby/optional/capi/ext/constants_spec.so I, [2024-05-23T11:25:25.122893 #531024] INFO -- : building spec/ruby/optional/capi/ext/data_spec.so I, [2024-05-23T11:25:25.123193 #531024] INFO -- : building spec/ruby/optional/capi/ext/debug_spec.so I, [2024-05-23T11:25:25.123870 #531024] INFO -- : building spec/ruby/optional/capi/ext/encoding_spec.so I, [2024-05-23T11:25:25.124182 #531024] INFO -- : building spec/ruby/optional/capi/ext/enumerator_spec.so I, [2024-05-23T11:25:25.124966 #531024] INFO -- : building spec/ruby/optional/capi/ext/exception_spec.so I, [2024-05-23T11:25:25.125605 #531024] INFO -- : building spec/ruby/optional/capi/ext/fiber_spec.so I, [2024-05-23T11:25:25.125879 #531024] INFO -- : building spec/ruby/optional/capi/ext/file_spec.so I, [2024-05-23T11:25:25.126281 #531024] INFO -- : building spec/ruby/optional/capi/ext/fixnum_spec.so I, [2024-05-23T11:25:25.152576 #531024] INFO -- : encdb.h unchanged I, [2024-05-23T11:25:25.154679 #531024] INFO -- : building spec/ruby/optional/capi/ext/float_spec.so I, [2024-05-23T11:25:25.251980 #531024] INFO -- : building spec/ruby/optional/capi/ext/gc_spec.so I, [2024-05-23T11:25:25.254435 #531024] INFO -- : building spec/ruby/optional/capi/ext/globals_spec.so I, [2024-05-23T11:25:25.259816 #531024] INFO -- : building spec/ruby/optional/capi/ext/hash_spec.so I, [2024-05-23T11:25:25.264009 #531024] INFO -- : building spec/ruby/optional/capi/ext/integer_spec.so I, [2024-05-23T11:25:25.268482 #531024] INFO -- : building spec/ruby/optional/capi/ext/io_spec.so I, [2024-05-23T11:25:25.275207 #531024] INFO -- : building spec/ruby/optional/capi/ext/kernel_spec.so I, [2024-05-23T11:25:25.284960 #531024] INFO -- : building spec/ruby/optional/capi/ext/language_spec.so I, [2024-05-23T11:25:25.290087 #531024] INFO -- : building spec/ruby/optional/capi/ext/marshal_spec.so I, [2024-05-23T11:25:25.290289 #531024] INFO -- : building spec/ruby/optional/capi/ext/module_spec.so I, [2024-05-23T11:25:25.307458 #531024] INFO -- : building spec/ruby/optional/capi/ext/module_under_autoload_spec.so I, [2024-05-23T11:25:25.308896 #531024] INFO -- : building spec/ruby/optional/capi/ext/mutex_spec.so I, [2024-05-23T11:25:25.309680 #531024] INFO -- : building spec/ruby/optional/capi/ext/numeric_spec.so I, [2024-05-23T11:25:25.311720 #531024] INFO -- : building spec/ruby/optional/capi/ext/object_spec.so I, [2024-05-23T11:25:25.316983 #531024] INFO -- : building spec/ruby/optional/capi/ext/proc_spec.so I, [2024-05-23T11:25:25.322026 #531024] INFO -- : building spec/ruby/optional/capi/ext/range_spec.so I, [2024-05-23T11:25:25.347424 #531024] INFO -- : building spec/ruby/optional/capi/ext/rational_spec.so I, [2024-05-23T11:25:25.357938 #531024] INFO -- : building spec/ruby/optional/capi/ext/rbasic_spec.so I, [2024-05-23T11:25:25.367706 #531024] INFO -- : building spec/ruby/optional/capi/ext/regexp_spec.so I, [2024-05-23T11:25:25.410069 #531024] INFO -- : building spec/ruby/optional/capi/ext/string_spec.so I, [2024-05-23T11:25:25.427361 #531024] INFO -- : building spec/ruby/optional/capi/ext/struct_spec.so I, [2024-05-23T11:25:25.429233 #531024] INFO -- : building spec/ruby/optional/capi/ext/st_spec.so I, [2024-05-23T11:25:25.432648 #531024] INFO -- : building spec/ruby/optional/capi/ext/symbol_spec.so I, [2024-05-23T11:25:25.436373 #531024] INFO -- : building spec/ruby/optional/capi/ext/thread_spec.so I, [2024-05-23T11:25:25.448496 #531024] INFO -- : building spec/ruby/optional/capi/ext/time_spec.so I, [2024-05-23T11:25:25.455957 #531024] INFO -- : building spec/ruby/optional/capi/ext/tracepoint_spec.so I, [2024-05-23T11:25:25.459552 #531024] INFO -- : building spec/ruby/optional/capi/ext/typed_data_spec.so I, [2024-05-23T11:25:25.467671 #531024] INFO -- : building spec/ruby/optional/capi/ext/util_spec.so I, [2024-05-23T11:25:25.488808 #531024] INFO -- : making enc I, [2024-05-23T11:25:25.489770 #531024] INFO -- : making srcs under enc I, [2024-05-23T11:25:25.515916 #531024] INFO -- : make[1]: Entering directory '/tmp/ruby/build/trunk' I, [2024-05-23T11:25:25.515976 #531024] INFO -- : make[1]: Nothing to be done for 'enc'. I, [2024-05-23T11:25:25.515987 #531024] INFO -- : make[1]: Leaving directory '/tmp/ruby/build/trunk' I, [2024-05-23T11:25:25.537365 #531024] INFO -- : make[1]: Entering directory '/tmp/ruby/build/trunk' I, [2024-05-23T11:25:25.537430 #531024] INFO -- : make[1]: Nothing to be done for 'srcs'. I, [2024-05-23T11:25:25.537439 #531024] INFO -- : make[1]: Leaving directory '/tmp/ruby/build/trunk' I, [2024-05-23T11:25:25.538034 #531024] INFO -- : generating transdb.h I, [2024-05-23T11:25:25.634686 #531024] INFO -- : transdb.h unchanged I, [2024-05-23T11:25:25.635768 #531024] INFO -- : generating makefiles ext/configure-ext.mk I, [2024-05-23T11:25:25.635897 #531024] INFO -- : making trans I, [2024-05-23T11:25:25.662209 #531024] INFO -- : ext/configure-ext.mk updated I, [2024-05-23T11:25:25.664561 #531024] INFO -- : make[1]: Entering directory '/tmp/ruby/build/trunk' I, [2024-05-23T11:25:25.671127 #531024] INFO -- : make[1]: Entering directory '/tmp/ruby/build/trunk' I, [2024-05-23T11:25:25.671211 #531024] INFO -- : make[1]: Nothing to be done for 'trans'. I, [2024-05-23T11:25:25.671225 #531024] INFO -- : make[1]: Leaving directory '/tmp/ruby/build/trunk' I, [2024-05-23T11:25:25.673235 #531024] INFO -- : making encs I, [2024-05-23T11:25:25.732157 #531024] INFO -- : make[1]: Entering directory '/tmp/ruby/build/trunk' I, [2024-05-23T11:25:25.732232 #531024] INFO -- : make[1]: Nothing to be done for 'encs'. I, [2024-05-23T11:25:25.732259 #531024] INFO -- : make[1]: Leaving directory '/tmp/ruby/build/trunk' I, [2024-05-23T11:25:25.825528 #531024] INFO -- : make[1]: Leaving directory '/tmp/ruby/build/trunk' I, [2024-05-23T11:25:25.826385 #531024] INFO -- : generating makefile exts.mk I, [2024-05-23T11:25:25.864314 #531024] INFO -- : exts.mk unchanged I, [2024-05-23T11:25:25.869030 #531024] INFO -- : make[1]: Entering directory '/tmp/ruby/build/trunk' I, [2024-05-23T11:25:25.887205 #531024] INFO -- : make[2]: Entering directory '/tmp/ruby/build/trunk/ext/digest' I, [2024-05-23T11:25:25.888616 #531024] INFO -- : make[2]: Entering directory '/tmp/ruby/build/trunk/ext/coverage' I, [2024-05-23T11:25:25.888668 #531024] INFO -- : make[2]: Entering directory '/tmp/ruby/build/trunk/ext/json' I, [2024-05-23T11:25:25.889535 #531024] INFO -- : make[2]: Entering directory '/tmp/ruby/build/trunk/ext/date' I, [2024-05-23T11:25:25.889561 #531024] INFO -- : make[2]: Entering directory '/tmp/ruby/build/trunk/ext/io/console' I, [2024-05-23T11:25:25.890614 #531024] INFO -- : make[2]: Entering directory '/tmp/ruby/build/trunk/ext/monitor' I, [2024-05-23T11:25:25.890921 #531024] INFO -- : make[2]: Entering directory '/tmp/ruby/build/trunk/ext/rubyvm' I, [2024-05-23T11:25:25.891261 #531024] INFO -- : make[2]: Entering directory '/tmp/ruby/build/trunk/ext/pty' I, [2024-05-23T11:25:25.891657 #531024] INFO -- : make[2]: Entering directory '/tmp/ruby/build/trunk/ext/pathname' I, [2024-05-23T11:25:25.892188 #531024] INFO -- : make[2]: Leaving directory '/tmp/ruby/build/trunk/ext/digest' I, [2024-05-23T11:25:25.892221 #531024] INFO -- : make[2]: Entering directory '/tmp/ruby/build/trunk/ext/fiddle' I, [2024-05-23T11:25:25.892312 #531024] INFO -- : make[2]: Leaving directory '/tmp/ruby/build/trunk/ext/coverage' I, [2024-05-23T11:25:25.892934 #531024] INFO -- : make[2]: Leaving directory '/tmp/ruby/build/trunk/ext/monitor' I, [2024-05-23T11:25:25.892960 #531024] INFO -- : make[2]: Leaving directory '/tmp/ruby/build/trunk/ext/io/console' I, [2024-05-23T11:25:25.893150 #531024] INFO -- : make[2]: Entering directory '/tmp/ruby/build/trunk/ext/objspace' I, [2024-05-23T11:25:25.893355 #531024] INFO -- : make[2]: Leaving directory '/tmp/ruby/build/trunk/ext/rubyvm' I, [2024-05-23T11:25:25.893915 #531024] INFO -- : make[2]: Leaving directory '/tmp/ruby/build/trunk/ext/date' I, [2024-05-23T11:25:25.894121 #531024] INFO -- : make[2]: Leaving directory '/tmp/ruby/build/trunk/ext/pty' I, [2024-05-23T11:25:25.894153 #531024] INFO -- : make[2]: Entering directory '/tmp/ruby/build/trunk/ext/psych' I, [2024-05-23T11:25:25.894853 #531024] INFO -- : make[2]: Leaving directory '/tmp/ruby/build/trunk/ext/pathname' I, [2024-05-23T11:25:25.894883 #531024] INFO -- : make[2]: Entering directory '/tmp/ruby/build/trunk/.bundle/gems/debug-1.9.2/ext/debug' I, [2024-05-23T11:25:25.894897 #531024] INFO -- : make[2]: Entering directory '/tmp/ruby/build/trunk/.bundle/gems/bigdecimal-3.1.8/ext/bigdecimal' I, [2024-05-23T11:25:25.895223 #531024] INFO -- : make[2]: Entering directory '/tmp/ruby/build/trunk/.bundle/gems/nkf-0.2.0/ext/nkf' I, [2024-05-23T11:25:25.895255 #531024] INFO -- : make[2]: Entering directory '/tmp/ruby/build/trunk/.bundle/gems/racc-1.7.3/ext/racc/cparse' I, [2024-05-23T11:25:25.895270 #531024] INFO -- : make[2]: Entering directory '/tmp/ruby/build/trunk/.bundle/gems/racc-1.8.0/ext/racc/cparse' I, [2024-05-23T11:25:25.896011 #531024] INFO -- : make[2]: Entering directory '/tmp/ruby/build/trunk/ext/ripper' I, [2024-05-23T11:25:25.896134 #531024] INFO -- : make[2]: Entering directory '/tmp/ruby/build/trunk/.bundle/gems/syslog-0.1.2/ext/syslog' I, [2024-05-23T11:25:25.896399 #531024] INFO -- : make[2]: Entering directory '/tmp/ruby/build/trunk/.bundle/gems/rbs-3.4.4/ext/rbs_extension' I, [2024-05-23T11:25:25.897271 #531024] INFO -- : make[2]: Leaving directory '/tmp/ruby/build/trunk/ext/json' I, [2024-05-23T11:25:25.898278 #531024] INFO -- : make[2]: Leaving directory '/tmp/ruby/build/trunk/ext/objspace' I, [2024-05-23T11:25:25.900438 #531024] INFO -- : make[2]: Entering directory '/tmp/ruby/build/trunk/ext/socket' I, [2024-05-23T11:25:25.900473 #531024] INFO -- : make[2]: Leaving directory '/tmp/ruby/build/trunk/ext/ripper' I, [2024-05-23T11:25:25.901678 #531024] INFO -- : make[2]: Leaving directory '/tmp/ruby/build/trunk/ext/fiddle' I, [2024-05-23T11:25:25.903104 #531024] INFO -- : make[2]: Entering directory '/tmp/ruby/build/trunk/ext/digest/sha2' I, [2024-05-23T11:25:25.905112 #531024] INFO -- : make[2]: Entering directory '/tmp/ruby/build/trunk/ext/openssl' I, [2024-05-23T11:25:25.905349 #531024] INFO -- : make[2]: Leaving directory '/tmp/ruby/build/trunk/ext/digest/sha2' I, [2024-05-23T11:25:25.906417 #531024] INFO -- : make[2]: Leaving directory '/tmp/ruby/build/trunk/ext/socket' I, [2024-05-23T11:25:25.908176 #531024] INFO -- : make[2]: Leaving directory '/tmp/ruby/build/trunk/ext/psych' I, [2024-05-23T11:25:25.916321 #531024] INFO -- : make[2]: Leaving directory '/tmp/ruby/build/trunk/ext/openssl' I, [2024-05-23T11:25:25.918889 #531024] INFO -- : make[2]: Leaving directory '/tmp/ruby/build/trunk/.bundle/gems/racc-1.8.0/ext/racc/cparse' I, [2024-05-23T11:25:25.921999 #531024] INFO -- : make[2]: Leaving directory '/tmp/ruby/build/trunk/.bundle/gems/bigdecimal-3.1.8/ext/bigdecimal' I, [2024-05-23T11:25:25.922136 #531024] INFO -- : make[2]: Leaving directory '/tmp/ruby/build/trunk/.bundle/gems/racc-1.7.3/ext/racc/cparse' I, [2024-05-23T11:25:25.922822 #531024] INFO -- : make[2]: Leaving directory '/tmp/ruby/build/trunk/.bundle/gems/syslog-0.1.2/ext/syslog' I, [2024-05-23T11:25:25.923937 #531024] INFO -- : make[2]: Leaving directory '/tmp/ruby/build/trunk/.bundle/gems/rbs-3.4.4/ext/rbs_extension' I, [2024-05-23T11:25:25.926684 #531024] INFO -- : make[2]: Leaving directory '/tmp/ruby/build/trunk/.bundle/gems/debug-1.9.2/ext/debug' I, [2024-05-23T11:25:25.927732 #531024] INFO -- : make[2]: Leaving directory '/tmp/ruby/build/trunk/.bundle/gems/nkf-0.2.0/ext/nkf' I, [2024-05-23T11:25:25.951875 #531024] INFO -- : make[2]: Entering directory '/tmp/ruby/build/trunk' I, [2024-05-23T11:25:26.019198 #531024] INFO -- : linking ruby I, [2024-05-23T11:25:26.041843 #531024] INFO -- : make[2]: Leaving directory '/tmp/ruby/build/trunk' I, [2024-05-23T11:25:26.042408 #531024] INFO -- : make[1]: Leaving directory '/tmp/ruby/build/trunk' I, [2024-05-23T11:25:26.047329 #531024] INFO -- : make[1]: Entering directory '/tmp/ruby/build/trunk' I, [2024-05-23T11:25:26.047351 #531024] INFO -- : make[1]: Nothing to be done for 'note'. I, [2024-05-23T11:25:26.047357 #531024] INFO -- : make[1]: Leaving directory '/tmp/ruby/build/trunk' I, [2024-05-23T11:25:26.047722 #531024] INFO -- : $$$[end] "make all -j20" exit with 0. I, [2024-05-23T11:25:26.047892 #531024] INFO -- : $$$[beg] make install -j20 I, [2024-05-23T11:25:26.122761 #531024] INFO -- : Update power_assert to 84e85124c5014a139af39161d484156cfe87a9ed I, [2024-05-23T11:25:26.123029 #531024] INFO -- : Update rbs to ba7872795d5de04adb8ff500c0e6afdc81a041dd I, [2024-05-23T11:25:26.123476 #531024] INFO -- : Update typeprof to b19a6416da3a05d57fadd6ffdadb382b6d236ca5 I, [2024-05-23T11:25:26.124852 #531024] INFO -- : echo 84e85124c5014a139af39161d484156cfe87a9ed | /bin/sh /tmp/ruby/src/trunk/tool/ifchange /tmp/ruby/src/trunk/.bundle/.timestamp/power_assert.revision - I, [2024-05-23T11:25:26.125976 #531024] INFO -- : BASERUBY = /usr/bin/ruby --disable=gems I, [2024-05-23T11:25:26.126040 #531024] INFO -- : CC = gcc I, [2024-05-23T11:25:26.126058 #531024] INFO -- : LD = ld I, [2024-05-23T11:25:26.126074 #531024] INFO -- : LDSHARED = gcc -shared I, [2024-05-23T11:25:26.126095 #531024] INFO -- : CFLAGS = -O3 -fno-fast-math -ggdb3 -Wall -Wextra -Wdeprecated-declarations -Wdiv-by-zero -Wduplicated-cond -Wimplicit-function-declaration -Wimplicit-int -Wpointer-arith -Wwrite-strings -Wold-style-definition -Wimplicit-fallthrough=0 -Wmissing-noreturn -Wno-cast-function-type -Wno-constant-logical-operand -Wno-long-long -Wno-missing-field-initializers -Wno-overlength-strings -Wno-packed-bitfield-compat -Wno-parentheses-equality -Wno-self-assign -Wno-tautological-compare -Wno-unused-parameter -Wno-unused-value -Wsuggest-attribute=format -Wsuggest-attribute=noreturn -Wunused-variable -Wmisleading-indentation -Wundef -fPIC I, [2024-05-23T11:25:26.126112 #531024] INFO -- : XCFLAGS = -U_FORTIFY_SOURCE -D_FORTIFY_SOURCE=2 -fstack-protector-strong -fno-strict-overflow -fvisibility=hidden -fexcess-precision=standard -DRUBY_EXPORT -I. -I.ext/include/x86_64-linux -I/tmp/ruby/src/trunk/include -I/tmp/ruby/src/trunk -I/tmp/ruby/src/trunk/prism -I/tmp/ruby/src/trunk/enc/unicode/15.0.0 I, [2024-05-23T11:25:26.126127 #531024] INFO -- : CPPFLAGS = I, [2024-05-23T11:25:26.126142 #531024] INFO -- : DLDFLAGS = -Wl,--compress-debug-sections=zlib -Wl,-soname,libruby.so.3.4 -fstack-protector-strong I, [2024-05-23T11:25:26.126161 #531024] INFO -- : SOLIBS = -lz -lrt -lrt -lgmp -ldl -lcrypt -lm -lpthread I, [2024-05-23T11:25:26.126177 #531024] INFO -- : LANG = en_US.UTF-8 I, [2024-05-23T11:25:26.126191 #531024] INFO -- : LC_ALL = I, [2024-05-23T11:25:26.126207 #531024] INFO -- : LC_CTYPE = I, [2024-05-23T11:25:26.126221 #531024] INFO -- : MFLAGS = -j20 --jobserver-auth=4,5 I, [2024-05-23T11:25:26.126236 #531024] INFO -- : RUSTC = no I, [2024-05-23T11:25:26.126250 #531024] INFO -- : YJIT_RUSTC_ARGS = --crate-name=yjit --crate-type=staticlib --edition=2021 -g -C lto=thin -C opt-level=3 -C overflow-checks=on '--out-dir=/tmp/ruby/build/trunk/yjit/target/release/' /tmp/ruby/src/trunk/yjit/src/lib.rs I, [2024-05-23T11:25:26.127736 #531024] INFO -- : /tmp/ruby/src/trunk/.bundle/.timestamp/power_assert.revision unchanged I, [2024-05-23T11:25:26.154915 #531024] INFO -- : echo ba7872795d5de04adb8ff500c0e6afdc81a041dd | /bin/sh /tmp/ruby/src/trunk/tool/ifchange /tmp/ruby/src/trunk/.bundle/.timestamp/rbs.revision - I, [2024-05-23T11:25:26.155060 #531024] INFO -- : echo b19a6416da3a05d57fadd6ffdadb382b6d236ca5 | /bin/sh /tmp/ruby/src/trunk/tool/ifchange /tmp/ruby/src/trunk/.bundle/.timestamp/typeprof.revision - I, [2024-05-23T11:25:26.155638 #531024] INFO -- : generating encdb.h I, [2024-05-23T11:25:26.155833 #531024] INFO -- : gcc (Ubuntu 11.4.0-1ubuntu1~22.04) 11.4.0 I, [2024-05-23T11:25:26.155860 #531024] INFO -- : Copyright (C) 2021 Free Software Foundation, Inc. I, [2024-05-23T11:25:26.155874 #531024] INFO -- : This is free software; see the source for copying conditions. There is NO I, [2024-05-23T11:25:26.155897 #531024] INFO -- : warranty; not even for MERCHANTABILITY or FITNESS FOR A PARTICULAR PURPOSE. I, [2024-05-23T11:25:26.155911 #531024] INFO -- : I, [2024-05-23T11:25:26.156521 #531024] INFO -- : generating enc.mk I, [2024-05-23T11:25:26.156948 #531024] INFO -- : /tmp/ruby/src/trunk/.bundle/.timestamp/rbs.revision unchanged I, [2024-05-23T11:25:26.157157 #531024] INFO -- : /tmp/ruby/src/trunk/.bundle/.timestamp/typeprof.revision unchanged I, [2024-05-23T11:25:26.180043 #531024] INFO -- : encdb.h unchanged I, [2024-05-23T11:25:26.181376 #531024] INFO -- : Building power_assert@84e85124c5014a139af39161d484156cfe87a9ed to /tmp/ruby/src/trunk/gems/power_assert-2.0.3.gem I, [2024-05-23T11:25:26.250677 #531024] INFO -- : Successfully built RubyGem I, [2024-05-23T11:25:26.250735 #531024] INFO -- : Name: power_assert I, [2024-05-23T11:25:26.250753 #531024] INFO -- : Version: 2.0.4dev I, [2024-05-23T11:25:26.250769 #531024] INFO -- : File: power_assert-2.0.4dev.gem I, [2024-05-23T11:25:26.252604 #531024] INFO -- : Extracting bundle gem power_assert-2.0.3... I, [2024-05-23T11:25:26.277579 #531024] INFO -- : making srcs under enc I, [2024-05-23T11:25:26.277849 #531024] INFO -- : making enc I, [2024-05-23T11:25:26.295109 #531024] INFO -- : make[1]: Entering directory '/tmp/ruby/build/trunk' I, [2024-05-23T11:25:26.295159 #531024] INFO -- : make[1]: Nothing to be done for 'enc'. I, [2024-05-23T11:25:26.295172 #531024] INFO -- : make[1]: Leaving directory '/tmp/ruby/build/trunk' I, [2024-05-23T11:25:26.307323 #531024] INFO -- : make[1]: Entering directory '/tmp/ruby/build/trunk' I, [2024-05-23T11:25:26.307381 #531024] INFO -- : make[1]: Nothing to be done for 'srcs'. I, [2024-05-23T11:25:26.307394 #531024] INFO -- : make[1]: Leaving directory '/tmp/ruby/build/trunk' I, [2024-05-23T11:25:26.308133 #531024] INFO -- : generating transdb.h I, [2024-05-23T11:25:26.314338 #531024] INFO -- : Try with hash version of bundled gems instead of gems/power_assert-2.0.3.gem. We don't use this gem with release version of Ruby. I, [2024-05-23T11:25:26.319292 #531024] INFO -- : Unpacked gems/power_assert-2.0.4dev.gem I, [2024-05-23T11:25:26.406461 #531024] INFO -- : transdb.h unchanged I, [2024-05-23T11:25:26.407915 #531024] INFO -- : generating makefiles ext/configure-ext.mk I, [2024-05-23T11:25:26.407977 #531024] INFO -- : making trans I, [2024-05-23T11:25:26.435031 #531024] INFO -- : ext/configure-ext.mk unchanged I, [2024-05-23T11:25:26.437236 #531024] INFO -- : make[1]: Entering directory '/tmp/ruby/build/trunk' I, [2024-05-23T11:25:26.444481 #531024] INFO -- : make[1]: Entering directory '/tmp/ruby/build/trunk' I, [2024-05-23T11:25:26.444585 #531024] INFO -- : make[1]: Nothing to be done for 'trans'. I, [2024-05-23T11:25:26.444617 #531024] INFO -- : make[1]: Leaving directory '/tmp/ruby/build/trunk' I, [2024-05-23T11:25:26.445863 #531024] INFO -- : making encs I, [2024-05-23T11:25:26.504814 #531024] INFO -- : make[1]: Entering directory '/tmp/ruby/build/trunk' I, [2024-05-23T11:25:26.504884 #531024] INFO -- : make[1]: Nothing to be done for 'encs'. I, [2024-05-23T11:25:26.504899 #531024] INFO -- : make[1]: Leaving directory '/tmp/ruby/build/trunk' I, [2024-05-23T11:25:26.592810 #531024] INFO -- : make[1]: Leaving directory '/tmp/ruby/build/trunk' I, [2024-05-23T11:25:26.593658 #531024] INFO -- : generating makefile exts.mk I, [2024-05-23T11:25:26.631248 #531024] INFO -- : exts.mk unchanged I, [2024-05-23T11:25:26.635894 #531024] INFO -- : make[1]: Entering directory '/tmp/ruby/build/trunk' I, [2024-05-23T11:25:26.654074 #531024] INFO -- : make[2]: Entering directory '/tmp/ruby/build/trunk/ext/digest' I, [2024-05-23T11:25:26.655055 #531024] INFO -- : make[2]: Entering directory '/tmp/ruby/build/trunk/ext/json' I, [2024-05-23T11:25:26.655984 #531024] INFO -- : make[2]: Entering directory '/tmp/ruby/build/trunk/ext/coverage' I, [2024-05-23T11:25:26.656062 #531024] INFO -- : make[2]: Entering directory '/tmp/ruby/build/trunk/ext/io/console' I, [2024-05-23T11:25:26.656470 #531024] INFO -- : make[2]: Entering directory '/tmp/ruby/build/trunk/ext/date' I, [2024-05-23T11:25:26.657410 #531024] INFO -- : make[2]: Entering directory '/tmp/ruby/build/trunk/ext/rubyvm' I, [2024-05-23T11:25:26.657435 #531024] INFO -- : make[2]: Entering directory '/tmp/ruby/build/trunk/ext/monitor' I, [2024-05-23T11:25:26.657950 #531024] INFO -- : make[2]: Entering directory '/tmp/ruby/build/trunk/ext/pathname' I, [2024-05-23T11:25:26.658261 #531024] INFO -- : make[2]: Entering directory '/tmp/ruby/build/trunk/ext/fiddle' I, [2024-05-23T11:25:26.658777 #531024] INFO -- : make[2]: Entering directory '/tmp/ruby/build/trunk/ext/pty' I, [2024-05-23T11:25:26.658991 #531024] INFO -- : make[2]: Leaving directory '/tmp/ruby/build/trunk/ext/digest' I, [2024-05-23T11:25:26.659429 #531024] INFO -- : make[2]: Leaving directory '/tmp/ruby/build/trunk/ext/io/console' I, [2024-05-23T11:25:26.659455 #531024] INFO -- : make[2]: Leaving directory '/tmp/ruby/build/trunk/ext/rubyvm' I, [2024-05-23T11:25:26.659807 #531024] INFO -- : make[2]: Leaving directory '/tmp/ruby/build/trunk/ext/coverage' I, [2024-05-23T11:25:26.659866 #531024] INFO -- : make[2]: Entering directory '/tmp/ruby/build/trunk/ext/objspace' I, [2024-05-23T11:25:26.660133 #531024] INFO -- : make[2]: Leaving directory '/tmp/ruby/build/trunk/ext/monitor' I, [2024-05-23T11:25:26.660475 #531024] INFO -- : make[2]: Entering directory '/tmp/ruby/build/trunk/ext/psych' I, [2024-05-23T11:25:26.660649 #531024] INFO -- : make[2]: Leaving directory '/tmp/ruby/build/trunk/ext/date' I, [2024-05-23T11:25:26.660937 #531024] INFO -- : make[2]: Leaving directory '/tmp/ruby/build/trunk/ext/pty' I, [2024-05-23T11:25:26.661297 #531024] INFO -- : make[2]: Leaving directory '/tmp/ruby/build/trunk/ext/pathname' I, [2024-05-23T11:25:26.661354 #531024] INFO -- : make[2]: Leaving directory '/tmp/ruby/build/trunk/ext/json' I, [2024-05-23T11:25:26.661783 #531024] INFO -- : make[2]: Entering directory '/tmp/ruby/build/trunk/.bundle/gems/debug-1.9.2/ext/debug' I, [2024-05-23T11:25:26.661940 #531024] INFO -- : make[2]: Entering directory '/tmp/ruby/build/trunk/.bundle/gems/racc-1.7.3/ext/racc/cparse' I, [2024-05-23T11:25:26.662238 #531024] INFO -- : make[2]: Entering directory '/tmp/ruby/build/trunk/.bundle/gems/bigdecimal-3.1.8/ext/bigdecimal' I, [2024-05-23T11:25:26.662281 #531024] INFO -- : make[2]: Entering directory '/tmp/ruby/build/trunk/.bundle/gems/nkf-0.2.0/ext/nkf' I, [2024-05-23T11:25:26.662996 #531024] INFO -- : make[2]: Entering directory '/tmp/ruby/build/trunk/ext/ripper' I, [2024-05-23T11:25:26.663241 #531024] INFO -- : make[2]: Leaving directory '/tmp/ruby/build/trunk/ext/objspace' I, [2024-05-23T11:25:26.664674 #531024] INFO -- : make[2]: Entering directory '/tmp/ruby/build/trunk/.bundle/gems/syslog-0.1.2/ext/syslog' I, [2024-05-23T11:25:26.664765 #531024] INFO -- : make[2]: Entering directory '/tmp/ruby/build/trunk/.bundle/gems/racc-1.8.0/ext/racc/cparse' I, [2024-05-23T11:25:26.665358 #531024] INFO -- : make[2]: Leaving directory '/tmp/ruby/build/trunk/ext/fiddle' I, [2024-05-23T11:25:26.665582 #531024] INFO -- : make[2]: Entering directory '/tmp/ruby/build/trunk/.bundle/gems/rbs-3.4.4/ext/rbs_extension' I, [2024-05-23T11:25:26.668304 #531024] INFO -- : make[2]: Leaving directory '/tmp/ruby/build/trunk/ext/ripper' I, [2024-05-23T11:25:26.668393 #531024] INFO -- : make[2]: Entering directory '/tmp/ruby/build/trunk/ext/socket' I, [2024-05-23T11:25:26.668431 #531024] INFO -- : make[2]: Entering directory '/tmp/ruby/build/trunk/ext/digest/sha2' I, [2024-05-23T11:25:26.671183 #531024] INFO -- : make[2]: Entering directory '/tmp/ruby/build/trunk/ext/openssl' I, [2024-05-23T11:25:26.671223 #531024] INFO -- : make[2]: Leaving directory '/tmp/ruby/build/trunk/ext/psych' I, [2024-05-23T11:25:26.671787 #531024] INFO -- : make[2]: Leaving directory '/tmp/ruby/build/trunk/ext/digest/sha2' I, [2024-05-23T11:25:26.674264 #531024] INFO -- : make[2]: Leaving directory '/tmp/ruby/build/trunk/ext/socket' I, [2024-05-23T11:25:26.682306 #531024] INFO -- : make[2]: Leaving directory '/tmp/ruby/build/trunk/ext/openssl' I, [2024-05-23T11:25:26.684428 #531024] INFO -- : make[2]: Leaving directory '/tmp/ruby/build/trunk/.bundle/gems/racc-1.7.3/ext/racc/cparse' I, [2024-05-23T11:25:26.685123 #531024] INFO -- : make[2]: Leaving directory '/tmp/ruby/build/trunk/.bundle/gems/debug-1.9.2/ext/debug' I, [2024-05-23T11:25:26.687101 #531024] INFO -- : make[2]: Leaving directory '/tmp/ruby/build/trunk/.bundle/gems/syslog-0.1.2/ext/syslog' I, [2024-05-23T11:25:26.690593 #531024] INFO -- : make[2]: Leaving directory '/tmp/ruby/build/trunk/.bundle/gems/rbs-3.4.4/ext/rbs_extension' I, [2024-05-23T11:25:26.694236 #531024] INFO -- : make[2]: Leaving directory '/tmp/ruby/build/trunk/.bundle/gems/bigdecimal-3.1.8/ext/bigdecimal' I, [2024-05-23T11:25:26.694722 #531024] INFO -- : make[2]: Leaving directory '/tmp/ruby/build/trunk/.bundle/gems/nkf-0.2.0/ext/nkf' I, [2024-05-23T11:25:26.696995 #531024] INFO -- : make[2]: Leaving directory '/tmp/ruby/build/trunk/.bundle/gems/racc-1.8.0/ext/racc/cparse' I, [2024-05-23T11:25:26.721216 #531024] INFO -- : make[2]: Entering directory '/tmp/ruby/build/trunk' I, [2024-05-23T11:25:26.786491 #531024] INFO -- : make[2]: 'ruby' is up to date. I, [2024-05-23T11:25:26.786546 #531024] INFO -- : make[2]: Leaving directory '/tmp/ruby/build/trunk' I, [2024-05-23T11:25:26.786936 #531024] INFO -- : make[1]: Leaving directory '/tmp/ruby/build/trunk' I, [2024-05-23T11:25:26.790775 #531024] INFO -- : make[1]: Entering directory '/tmp/ruby/build/trunk' I, [2024-05-23T11:25:26.790821 #531024] INFO -- : make[1]: Nothing to be done for 'note'. I, [2024-05-23T11:25:26.790834 #531024] INFO -- : make[1]: Leaving directory '/tmp/ruby/build/trunk' I, [2024-05-23T11:25:26.791112 #531024] INFO -- : ./miniruby -I/tmp/ruby/src/trunk/lib -I. -I.ext/common /tmp/ruby/src/trunk/tool/runruby.rb --extout=.ext -- --disable-gems -r./x86_64-linux-fake /tmp/ruby/src/trunk/tool/rbinstall.rb --make="make" --dest-dir="" --extout=".ext" --ext-build-dir="./ext" --mflags="-j20 --jobserver-auth=4,5" --make-flags=" -j20 --jobserver-auth=4,5" --data-mode=0644 --prog-mode=0755 --installed-list .installed.list --mantype="doc" --gnumake --install=all --exclude=doc I, [2024-05-23T11:25:26.887346 #531024] INFO -- : Installing to I, [2024-05-23T11:25:26.887428 #531024] INFO -- : installing binary commands: /tmp/ruby/install/trunk/bin I, [2024-05-23T11:25:26.887450 #531024] INFO -- : installing base libraries: /tmp/ruby/install/trunk/lib I, [2024-05-23T11:25:26.894585 #531024] INFO -- : installing arch files: /tmp/ruby/install/trunk/lib/ruby/3.4.0+0/x86_64-linux I, [2024-05-23T11:25:26.894647 #531024] INFO -- : installing pkgconfig data: /tmp/ruby/install/trunk/lib/pkgconfig I, [2024-05-23T11:25:26.894660 #531024] INFO -- : installing extension objects: /tmp/ruby/install/trunk/lib/ruby/3.4.0+0/x86_64-linux I, [2024-05-23T11:25:26.904414 #531024] INFO -- : installing extension objects: /tmp/ruby/install/trunk/lib/ruby/site_ruby/3.4.0+0/x86_64-linux I, [2024-05-23T11:25:26.904477 #531024] INFO -- : installing extension objects: /tmp/ruby/install/trunk/lib/ruby/vendor_ruby/3.4.0+0/x86_64-linux I, [2024-05-23T11:25:26.904497 #531024] INFO -- : installing extension headers: /tmp/ruby/install/trunk/include/ruby-3.4.0+0/x86_64-linux I, [2024-05-23T11:25:26.904511 #531024] INFO -- : installing extension scripts: /tmp/ruby/install/trunk/lib/ruby/3.4.0+0 I, [2024-05-23T11:25:26.907349 #531024] INFO -- : installing extension scripts: /tmp/ruby/install/trunk/lib/ruby/site_ruby/3.4.0+0 I, [2024-05-23T11:25:26.907411 #531024] INFO -- : installing extension scripts: /tmp/ruby/install/trunk/lib/ruby/vendor_ruby/3.4.0+0 I, [2024-05-23T11:25:26.907425 #531024] INFO -- : installing extension headers: /tmp/ruby/install/trunk/include/ruby-3.4.0+0/ruby I, [2024-05-23T11:25:26.907438 #531024] INFO -- : installing command scripts: /tmp/ruby/install/trunk/bin I, [2024-05-23T11:25:26.907460 #531024] INFO -- : installing library scripts: /tmp/ruby/install/trunk/lib/ruby/3.4.0+0 I, [2024-05-23T11:25:26.940084 #531024] INFO -- : installing common headers: /tmp/ruby/install/trunk/include/ruby-3.4.0+0 I, [2024-05-23T11:25:26.946590 #531024] INFO -- : installing manpages: /tmp/ruby/install/trunk/share/man/man1 I, [2024-05-23T11:25:26.946658 #531024] INFO -- : installing default gems from lib: /tmp/ruby/install/trunk/lib/ruby/gems/3.4.0+0 I, [2024-05-23T11:25:26.969332 #531024] INFO -- : benchmark 0.3.0 I, [2024-05-23T11:25:26.971244 #531024] INFO -- : bundler 2.6.0.dev I, [2024-05-23T11:25:26.973356 #531024] INFO -- : cgi 0.4.1 I, [2024-05-23T11:25:26.973915 #531024] INFO -- : delegate 0.3.1 I, [2024-05-23T11:25:26.974365 #531024] INFO -- : did_you_mean 1.6.3 I, [2024-05-23T11:25:26.974881 #531024] INFO -- : english 0.8.0 I, [2024-05-23T11:25:26.975319 #531024] INFO -- : erb 4.0.4 I, [2024-05-23T11:25:26.976364 #531024] INFO -- : error_highlight 0.6.0 I, [2024-05-23T11:25:26.977173 #531024] INFO -- : fileutils 1.7.2 I, [2024-05-23T11:25:26.977975 #531024] INFO -- : find 0.2.0 I, [2024-05-23T11:25:26.978790 #531024] INFO -- : forwardable 1.3.3 I, [2024-05-23T11:25:26.979887 #531024] INFO -- : ipaddr 1.2.6 I, [2024-05-23T11:25:26.980452 #531024] INFO -- : irb 1.13.1 I, [2024-05-23T11:25:26.981230 #531024] INFO -- : logger 1.6.0 I, [2024-05-23T11:25:26.981722 #531024] INFO -- : net-http 0.4.1 I, [2024-05-23T11:25:26.982195 #531024] INFO -- : net-protocol 0.2.2 I, [2024-05-23T11:25:26.982686 #531024] INFO -- : open-uri 0.4.1 I, [2024-05-23T11:25:26.983192 #531024] INFO -- : open3 0.2.1 I, [2024-05-23T11:25:26.983656 #531024] INFO -- : optparse 0.5.0 I, [2024-05-23T11:25:26.984129 #531024] INFO -- : ostruct 0.6.0 I, [2024-05-23T11:25:26.984631 #531024] INFO -- : pp 0.5.0 I, [2024-05-23T11:25:26.985077 #531024] INFO -- : prettyprint 0.2.0 I, [2024-05-23T11:25:26.985618 #531024] INFO -- : prism 0.29.0 I, [2024-05-23T11:25:26.986115 #531024] INFO -- : pstore 0.1.3 I, [2024-05-23T11:25:26.986581 #531024] INFO -- : rdoc 6.7.0 I, [2024-05-23T11:25:26.987538 #531024] INFO -- : readline 0.0.4 I, [2024-05-23T11:25:26.988229 #531024] INFO -- : reline 0.5.7 I, [2024-05-23T11:25:26.988578 #531024] INFO -- : resolv 0.4.0 I, [2024-05-23T11:25:26.989011 #531024] INFO -- : ruby2_keywords 0.0.5 I, [2024-05-23T11:25:26.989550 #531024] INFO -- : securerandom 0.3.1 I, [2024-05-23T11:25:26.990542 #531024] INFO -- : set 1.1.0 I, [2024-05-23T11:25:26.991273 #531024] INFO -- : shellwords 0.2.0 I, [2024-05-23T11:25:26.991767 #531024] INFO -- : singleton 0.2.0 I, [2024-05-23T11:25:26.992281 #531024] INFO -- : syntax_suggest 2.0.0 I, [2024-05-23T11:25:26.992984 #531024] INFO -- : tempfile 0.2.1 I, [2024-05-23T11:25:26.993455 #531024] INFO -- : time 0.3.0 I, [2024-05-23T11:25:26.993952 #531024] INFO -- : timeout 0.4.1 I, [2024-05-23T11:25:26.994421 #531024] INFO -- : tmpdir 0.2.0 I, [2024-05-23T11:25:26.994881 #531024] INFO -- : tsort 0.2.0 I, [2024-05-23T11:25:26.995324 #531024] INFO -- : un 0.3.0 I, [2024-05-23T11:25:26.995745 #531024] INFO -- : uri 0.13.0 I, [2024-05-23T11:25:26.996243 #531024] INFO -- : weakref 0.1.3 I, [2024-05-23T11:25:26.996778 #531024] INFO -- : yaml 0.3.0 I, [2024-05-23T11:25:26.997049 #531024] INFO -- : installing default gems from ext: /tmp/ruby/install/trunk/lib/ruby/gems/3.4.0+0 I, [2024-05-23T11:25:27.003741 #531024] INFO -- : date 3.3.4 I, [2024-05-23T11:25:27.004291 #531024] INFO -- : digest 3.1.1 I, [2024-05-23T11:25:27.004783 #531024] INFO -- : etc 1.4.3 I, [2024-05-23T11:25:27.005289 #531024] INFO -- : fcntl 1.1.0 I, [2024-05-23T11:25:27.005755 #531024] INFO -- : fiddle 1.1.3 I, [2024-05-23T11:25:27.006168 #531024] INFO -- : io-console 0.7.2 I, [2024-05-23T11:25:27.006715 #531024] INFO -- : io-nonblock 0.3.0 I, [2024-05-23T11:25:27.007172 #531024] INFO -- : io-wait 0.3.1 I, [2024-05-23T11:25:27.007610 #531024] INFO -- : json 2.7.2 I, [2024-05-23T11:25:27.008296 #531024] INFO -- : openssl 3.2.0 I, [2024-05-23T11:25:27.008791 #531024] INFO -- : pathname 0.3.0 I, [2024-05-23T11:25:27.009273 #531024] INFO -- : psych 5.1.2 I, [2024-05-23T11:25:27.009819 #531024] INFO -- : stringio 3.1.1 I, [2024-05-23T11:25:27.010241 #531024] INFO -- : strscan 3.1.1 I, [2024-05-23T11:25:27.010749 #531024] INFO -- : zlib 3.1.0 I, [2024-05-23T11:25:27.011114 #531024] INFO -- : installing bundled gems: /tmp/ruby/install/trunk/lib/ruby/gems/3.4.0+0 I, [2024-05-23T11:25:27.011679 #531024] INFO -- : minitest 5.23.1 I, [2024-05-23T11:25:27.020338 #531024] INFO -- : rake 13.2.1 I, [2024-05-23T11:25:27.023797 #531024] INFO -- : test-unit 3.6.2 I, [2024-05-23T11:25:27.028706 #531024] INFO -- : rexml 3.2.8 I, [2024-05-23T11:25:27.032562 #531024] INFO -- : rss 0.3.0 I, [2024-05-23T11:25:27.035171 #531024] INFO -- : net-ftp 0.3.4 I, [2024-05-23T11:25:27.036768 #531024] INFO -- : net-imap 0.4.11 I, [2024-05-23T11:25:27.040554 #531024] INFO -- : net-pop 0.1.2 I, [2024-05-23T11:25:27.041570 #531024] INFO -- : net-smtp 0.5.0 I, [2024-05-23T11:25:27.042724 #531024] INFO -- : matrix 0.4.2 I, [2024-05-23T11:25:27.046011 #531024] INFO -- : prime 0.1.2 I, [2024-05-23T11:25:27.050715 #531024] INFO -- : rbs 3.4.4 I, [2024-05-23T11:25:27.073444 #531024] INFO -- : typeprof 0.21.11 I, [2024-05-23T11:25:27.075780 #531024] INFO -- : debug 1.9.2 I, [2024-05-23T11:25:27.078901 #531024] INFO -- : racc 1.8.0 I, [2024-05-23T11:25:27.081782 #531024] INFO -- : mutex_m 0.2.0 I, [2024-05-23T11:25:27.083098 #531024] INFO -- : getoptlong 0.2.1 I, [2024-05-23T11:25:27.084525 #531024] INFO -- : base64 0.2.0 I, [2024-05-23T11:25:27.085610 #531024] INFO -- : bigdecimal 3.1.8 I, [2024-05-23T11:25:27.088387 #531024] INFO -- : observer 0.1.2 I, [2024-05-23T11:25:27.089579 #531024] INFO -- : abbrev 0.1.2 I, [2024-05-23T11:25:27.090868 #531024] INFO -- : resolv-replace 0.1.1 I, [2024-05-23T11:25:27.092087 #531024] INFO -- : rinda 0.2.0 I, [2024-05-23T11:25:27.093480 #531024] INFO -- : drb 2.2.1 I, [2024-05-23T11:25:27.095063 #531024] INFO -- : nkf 0.2.0 I, [2024-05-23T11:25:27.097527 #531024] INFO -- : syslog 0.1.2 I, [2024-05-23T11:25:27.099713 #531024] INFO -- : csv 3.3.0 I, [2024-05-23T11:25:27.102025 #531024] INFO -- : installing bundled gem cache: /tmp/ruby/install/trunk/lib/ruby/gems/3.4.0+0/cache I, [2024-05-23T11:25:27.103630 #531024] INFO -- : skipped bundled gems: I, [2024-05-23T11:25:27.103716 #531024] INFO -- : power_assert-2.0.4dev.gem not found in bundled_gems I, [2024-05-23T11:25:27.106978 #531024] INFO -- : $$$[end] "make install -j20" exit with 0. I, [2024-05-23T11:25:27.107115 #531024] INFO -- : $$$[beg] make yes-btest TESTOPTS='-q -j20' I, [2024-05-23T11:25:32.683432 #531024] INFO -- : PASS all 1936 tests E, [2024-05-23T11:25:32.688863 #531024] ERROR -- : I, [2024-05-23T11:25:32.689206 #531024] INFO -- : $$$[end] "make yes-btest TESTOPTS='-q -j20'" exit with 0. I, [2024-05-23T11:25:32.689313 #531024] INFO -- : $$$[beg] make yes-test-basic TESTS='-j20' I, [2024-05-23T11:25:32.749284 #531024] INFO -- : BASERUBY = /usr/bin/ruby --disable=gems I, [2024-05-23T11:25:32.749335 #531024] INFO -- : CC = gcc I, [2024-05-23T11:25:32.749351 #531024] INFO -- : LD = ld I, [2024-05-23T11:25:32.749365 #531024] INFO -- : LDSHARED = gcc -shared I, [2024-05-23T11:25:32.749379 #531024] INFO -- : CFLAGS = -O3 -fno-fast-math -ggdb3 -Wall -Wextra -Wdeprecated-declarations -Wdiv-by-zero -Wduplicated-cond -Wimplicit-function-declaration -Wimplicit-int -Wpointer-arith -Wwrite-strings -Wold-style-definition -Wimplicit-fallthrough=0 -Wmissing-noreturn -Wno-cast-function-type -Wno-constant-logical-operand -Wno-long-long -Wno-missing-field-initializers -Wno-overlength-strings -Wno-packed-bitfield-compat -Wno-parentheses-equality -Wno-self-assign -Wno-tautological-compare -Wno-unused-parameter -Wno-unused-value -Wsuggest-attribute=format -Wsuggest-attribute=noreturn -Wunused-variable -Wmisleading-indentation -Wundef -fPIC I, [2024-05-23T11:25:32.749392 #531024] INFO -- : XCFLAGS = -U_FORTIFY_SOURCE -D_FORTIFY_SOURCE=2 -fstack-protector-strong -fno-strict-overflow -fvisibility=hidden -fexcess-precision=standard -DRUBY_EXPORT -I. -I.ext/include/x86_64-linux -I/tmp/ruby/src/trunk/include -I/tmp/ruby/src/trunk -I/tmp/ruby/src/trunk/prism -I/tmp/ruby/src/trunk/enc/unicode/15.0.0 I, [2024-05-23T11:25:32.749405 #531024] INFO -- : CPPFLAGS = I, [2024-05-23T11:25:32.749417 #531024] INFO -- : DLDFLAGS = -Wl,--compress-debug-sections=zlib -Wl,-soname,libruby.so.3.4 -fstack-protector-strong I, [2024-05-23T11:25:32.749430 #531024] INFO -- : SOLIBS = -lz -lrt -lrt -lgmp -ldl -lcrypt -lm -lpthread I, [2024-05-23T11:25:32.749442 #531024] INFO -- : LANG = en_US.UTF-8 I, [2024-05-23T11:25:32.749454 #531024] INFO -- : LC_ALL = I, [2024-05-23T11:25:32.749465 #531024] INFO -- : LC_CTYPE = I, [2024-05-23T11:25:32.749477 #531024] INFO -- : MFLAGS = I, [2024-05-23T11:25:32.749488 #531024] INFO -- : RUSTC = no I, [2024-05-23T11:25:32.749500 #531024] INFO -- : YJIT_RUSTC_ARGS = --crate-name=yjit --crate-type=staticlib --edition=2021 -g -C lto=thin -C opt-level=3 -C overflow-checks=on '--out-dir=/tmp/ruby/build/trunk/yjit/target/release/' /tmp/ruby/src/trunk/yjit/src/lib.rs I, [2024-05-23T11:25:32.749925 #531024] INFO -- : gcc (Ubuntu 11.4.0-1ubuntu1~22.04) 11.4.0 I, [2024-05-23T11:25:32.749976 #531024] INFO -- : Copyright (C) 2021 Free Software Foundation, Inc. I, [2024-05-23T11:25:32.749992 #531024] INFO -- : This is free software; see the source for copying conditions. There is NO I, [2024-05-23T11:25:32.750004 #531024] INFO -- : warranty; not even for MERCHANTABILITY or FITNESS FOR A PARTICULAR PURPOSE. I, [2024-05-23T11:25:32.750016 #531024] INFO -- : I, [2024-05-23T11:25:32.854634 #531024] INFO -- : Checking leaked global symbols...none I, [2024-05-23T11:25:32.899545 #531024] INFO -- : /tmp/ruby/src/trunk/basictest/test.rb:assignment ....................................................................................................................................................................................................................................................................................................................................................................................OK 372 I, [2024-05-23T11:25:32.899644 #531024] INFO -- : /tmp/ruby/src/trunk/basictest/test.rb:condition ..OK 2 I, [2024-05-23T11:25:32.899663 #531024] INFO -- : /tmp/ruby/src/trunk/basictest/test.rb:if/unless ...OK 3 I, [2024-05-23T11:25:32.899679 #531024] INFO -- : /tmp/ruby/src/trunk/basictest/test.rb:case .....OK 5 I, [2024-05-23T11:25:32.900024 #531024] INFO -- : /tmp/ruby/src/trunk/basictest/test.rb:while/until ........OK 8 I, [2024-05-23T11:25:32.900114 #531024] INFO -- : /tmp/ruby/src/trunk/basictest/test.rb:exception ..........OK 10 I, [2024-05-23T11:25:32.900594 #531024] INFO -- : /tmp/ruby/src/trunk/basictest/test.rb:array .......................................OK 39 I, [2024-05-23T11:25:32.900754 #531024] INFO -- : /tmp/ruby/src/trunk/basictest/test.rb:hash ...........................OK 27 I, [2024-05-23T11:25:32.901883 #531024] INFO -- : /tmp/ruby/src/trunk/basictest/test.rb:iterator ...........................................................................................................OK 107 I, [2024-05-23T11:25:32.902318 #531024] INFO -- : /tmp/ruby/src/trunk/basictest/test.rb:float ................................................................................OK 80 I, [2024-05-23T11:25:32.904670 #531024] INFO -- : /tmp/ruby/src/trunk/basictest/test.rb:bignum ...............................OK 31 I, [2024-05-23T11:25:32.905484 #531024] INFO -- : /tmp/ruby/src/trunk/basictest/test.rb:string & char ..............................................................OK 62 I, [2024-05-23T11:25:32.905506 #531024] INFO -- : /tmp/ruby/src/trunk/basictest/test.rb:assignment ..........OK 10 I, [2024-05-23T11:25:32.905527 #531024] INFO -- : /tmp/ruby/src/trunk/basictest/test.rb:call ......OK 6 I, [2024-05-23T11:25:32.905579 #531024] INFO -- : /tmp/ruby/src/trunk/basictest/test.rb:proc .........OK 9 I, [2024-05-23T11:25:33.006266 #531024] INFO -- : /tmp/ruby/src/trunk/basictest/test.rb:signal ..OK 2 I, [2024-05-23T11:25:33.009595 #531024] INFO -- : /tmp/ruby/src/trunk/basictest/test.rb:eval ...........................OK 27 I, [2024-05-23T11:25:33.125123 #531024] INFO -- : /tmp/ruby/src/trunk/basictest/test.rb:system ........OK 8 I, [2024-05-23T11:25:33.125225 #531024] INFO -- : /tmp/ruby/src/trunk/basictest/test.rb:const .....OK 5 I, [2024-05-23T11:25:33.125240 #531024] INFO -- : /tmp/ruby/src/trunk/basictest/test.rb:clone .....OK 5 I, [2024-05-23T11:25:33.125266 #531024] INFO -- : /tmp/ruby/src/trunk/basictest/test.rb:marshal ....OK 4 I, [2024-05-23T11:25:33.125370 #531024] INFO -- : /tmp/ruby/src/trunk/basictest/test.rb:pack ....OK 4 I, [2024-05-23T11:25:33.125396 #531024] INFO -- : /tmp/ruby/src/trunk/basictest/test.rb:math ..OK 2 I, [2024-05-23T11:25:33.125412 #531024] INFO -- : /tmp/ruby/src/trunk/basictest/test.rb:struct ......OK 6 I, [2024-05-23T11:25:33.125541 #531024] INFO -- : /tmp/ruby/src/trunk/basictest/test.rb:variable ............OK 12 I, [2024-05-23T11:25:33.125578 #531024] INFO -- : /tmp/ruby/src/trunk/basictest/test.rb:trace ...OK 3 I, [2024-05-23T11:25:33.125594 #531024] INFO -- : /tmp/ruby/src/trunk/basictest/test.rb:defined? ............OK 12 I, [2024-05-23T11:25:33.125617 #531024] INFO -- : /tmp/ruby/src/trunk/basictest/test.rb:alias ......OK 6 I, [2024-05-23T11:25:33.126009 #531024] INFO -- : /tmp/ruby/src/trunk/basictest/test.rb:path .......................OK 23 I, [2024-05-23T11:25:33.164052 #531024] INFO -- : /tmp/ruby/src/trunk/basictest/test.rb:gc ....OK 4 I, [2024-05-23T11:25:33.166456 #531024] INFO -- : I, [2024-05-23T11:25:33.166538 #531024] INFO -- : test succeeded I, [2024-05-23T11:25:33.167890 #531024] INFO -- : $$$[end] "make yes-test-basic TESTS='-j20'" exit with 0. I, [2024-05-23T11:25:33.168018 #531024] INFO -- : $$$[beg] make yes-test-all TESTOPTS='--stderr-on-failure' TESTS='-j20' I, [2024-05-23T11:25:33.265193 #531024] INFO -- : BASERUBY = /usr/bin/ruby --disable=gems I, [2024-05-23T11:25:33.265250 #531024] INFO -- : CC = gcc I, [2024-05-23T11:25:33.265264 #531024] INFO -- : LD = ld I, [2024-05-23T11:25:33.265275 #531024] INFO -- : LDSHARED = gcc -shared I, [2024-05-23T11:25:33.265290 #531024] INFO -- : CFLAGS = -O3 -fno-fast-math -ggdb3 -Wall -Wextra -Wdeprecated-declarations -Wdiv-by-zero -Wduplicated-cond -Wimplicit-function-declaration -Wimplicit-int -Wpointer-arith -Wwrite-strings -Wold-style-definition -Wimplicit-fallthrough=0 -Wmissing-noreturn -Wno-cast-function-type -Wno-constant-logical-operand -Wno-long-long -Wno-missing-field-initializers -Wno-overlength-strings -Wno-packed-bitfield-compat -Wno-parentheses-equality -Wno-self-assign -Wno-tautological-compare -Wno-unused-parameter -Wno-unused-value -Wsuggest-attribute=format -Wsuggest-attribute=noreturn -Wunused-variable -Wmisleading-indentation -Wundef -fPIC I, [2024-05-23T11:25:33.265302 #531024] INFO -- : XCFLAGS = -U_FORTIFY_SOURCE -D_FORTIFY_SOURCE=2 -fstack-protector-strong -fno-strict-overflow -fvisibility=hidden -fexcess-precision=standard -DRUBY_EXPORT -I. -I.ext/include/x86_64-linux -I/tmp/ruby/src/trunk/include -I/tmp/ruby/src/trunk -I/tmp/ruby/src/trunk/prism -I/tmp/ruby/src/trunk/enc/unicode/15.0.0 I, [2024-05-23T11:25:33.265314 #531024] INFO -- : CPPFLAGS = I, [2024-05-23T11:25:33.265325 #531024] INFO -- : DLDFLAGS = -Wl,--compress-debug-sections=zlib -Wl,-soname,libruby.so.3.4 -fstack-protector-strong I, [2024-05-23T11:25:33.265335 #531024] INFO -- : SOLIBS = -lz -lrt -lrt -lgmp -ldl -lcrypt -lm -lpthread I, [2024-05-23T11:25:33.265346 #531024] INFO -- : LANG = en_US.UTF-8 I, [2024-05-23T11:25:33.265355 #531024] INFO -- : LC_ALL = I, [2024-05-23T11:25:33.265365 #531024] INFO -- : LC_CTYPE = I, [2024-05-23T11:25:33.265375 #531024] INFO -- : MFLAGS = I, [2024-05-23T11:25:33.265385 #531024] INFO -- : RUSTC = no I, [2024-05-23T11:25:33.265396 #531024] INFO -- : YJIT_RUSTC_ARGS = --crate-name=yjit --crate-type=staticlib --edition=2021 -g -C lto=thin -C opt-level=3 -C overflow-checks=on '--out-dir=/tmp/ruby/build/trunk/yjit/target/release/' /tmp/ruby/src/trunk/yjit/src/lib.rs I, [2024-05-23T11:25:33.265927 #531024] INFO -- : gcc (Ubuntu 11.4.0-1ubuntu1~22.04) 11.4.0 I, [2024-05-23T11:25:33.265980 #531024] INFO -- : Copyright (C) 2021 Free Software Foundation, Inc. I, [2024-05-23T11:25:33.265993 #531024] INFO -- : This is free software; see the source for copying conditions. There is NO I, [2024-05-23T11:25:33.266006 #531024] INFO -- : warranty; not even for MERCHANTABILITY or FITNESS FOR A PARTICULAR PURPOSE. I, [2024-05-23T11:25:33.266017 #531024] INFO -- : I, [2024-05-23T11:25:33.267637 #531024] INFO -- : generating enc.mk I, [2024-05-23T11:25:33.385927 #531024] INFO -- : generating encdb.h I, [2024-05-23T11:25:33.409861 #531024] INFO -- : encdb.h unchanged I, [2024-05-23T11:25:33.410970 #531024] INFO -- : making enc I, [2024-05-23T11:25:33.427952 #531024] INFO -- : make[1]: Entering directory '/tmp/ruby/build/trunk' I, [2024-05-23T11:25:33.427979 #531024] INFO -- : make[1]: Nothing to be done for 'enc'. I, [2024-05-23T11:25:33.427985 #531024] INFO -- : make[1]: Leaving directory '/tmp/ruby/build/trunk' I, [2024-05-23T11:25:33.428648 #531024] INFO -- : making srcs under enc I, [2024-05-23T11:25:33.458574 #531024] INFO -- : make[1]: Entering directory '/tmp/ruby/build/trunk' I, [2024-05-23T11:25:33.458594 #531024] INFO -- : make[1]: Nothing to be done for 'srcs'. I, [2024-05-23T11:25:33.458599 #531024] INFO -- : make[1]: Leaving directory '/tmp/ruby/build/trunk' I, [2024-05-23T11:25:33.459583 #531024] INFO -- : generating transdb.h I, [2024-05-23T11:25:33.556385 #531024] INFO -- : transdb.h unchanged I, [2024-05-23T11:25:33.557950 #531024] INFO -- : making trans I, [2024-05-23T11:25:33.592636 #531024] INFO -- : make[1]: Entering directory '/tmp/ruby/build/trunk' I, [2024-05-23T11:25:33.592660 #531024] INFO -- : make[1]: Nothing to be done for 'trans'. I, [2024-05-23T11:25:33.592667 #531024] INFO -- : make[1]: Leaving directory '/tmp/ruby/build/trunk' I, [2024-05-23T11:25:33.593379 #531024] INFO -- : making encs I, [2024-05-23T11:25:33.631013 #531024] INFO -- : make[1]: Entering directory '/tmp/ruby/build/trunk' I, [2024-05-23T11:25:33.631034 #531024] INFO -- : make[1]: Nothing to be done for 'encs'. I, [2024-05-23T11:25:33.631040 #531024] INFO -- : make[1]: Leaving directory '/tmp/ruby/build/trunk' I, [2024-05-23T11:25:33.632792 #531024] INFO -- : generating makefiles ext/configure-ext.mk I, [2024-05-23T11:25:33.659973 #531024] INFO -- : ext/configure-ext.mk updated I, [2024-05-23T11:25:33.662412 #531024] INFO -- : make[1]: Entering directory '/tmp/ruby/build/trunk' I, [2024-05-23T11:25:35.066717 #531024] INFO -- : make[1]: Leaving directory '/tmp/ruby/build/trunk' I, [2024-05-23T11:25:35.067519 #531024] INFO -- : generating makefile exts.mk I, [2024-05-23T11:25:35.104099 #531024] INFO -- : exts.mk unchanged I, [2024-05-23T11:25:35.108609 #531024] INFO -- : make[1]: Entering directory '/tmp/ruby/build/trunk' I, [2024-05-23T11:25:35.412503 #531024] INFO -- : make[2]: Entering directory '/tmp/ruby/build/trunk/ext/coverage' I, [2024-05-23T11:25:35.417227 #531024] INFO -- : make[2]: Leaving directory '/tmp/ruby/build/trunk/ext/coverage' I, [2024-05-23T11:25:35.423659 #531024] INFO -- : make[2]: Entering directory '/tmp/ruby/build/trunk/ext/date' I, [2024-05-23T11:25:35.428715 #531024] INFO -- : make[2]: Leaving directory '/tmp/ruby/build/trunk/ext/date' I, [2024-05-23T11:25:35.432576 #531024] INFO -- : make[2]: Entering directory '/tmp/ruby/build/trunk/ext/digest' I, [2024-05-23T11:25:35.441349 #531024] INFO -- : make[2]: Leaving directory '/tmp/ruby/build/trunk/ext/digest' I, [2024-05-23T11:25:35.467373 #531024] INFO -- : make[2]: Entering directory '/tmp/ruby/build/trunk/ext/digest/sha2' I, [2024-05-23T11:25:35.471994 #531024] INFO -- : make[2]: Leaving directory '/tmp/ruby/build/trunk/ext/digest/sha2' I, [2024-05-23T11:25:35.493228 #531024] INFO -- : make[2]: Entering directory '/tmp/ruby/build/trunk/ext/fiddle' I, [2024-05-23T11:25:35.503991 #531024] INFO -- : make[2]: Leaving directory '/tmp/ruby/build/trunk/ext/fiddle' I, [2024-05-23T11:25:35.509000 #531024] INFO -- : make[2]: Entering directory '/tmp/ruby/build/trunk/ext/io/console' I, [2024-05-23T11:25:35.513209 #531024] INFO -- : make[2]: Leaving directory '/tmp/ruby/build/trunk/ext/io/console' I, [2024-05-23T11:25:35.525898 #531024] INFO -- : make[2]: Entering directory '/tmp/ruby/build/trunk/ext/json' I, [2024-05-23T11:25:35.536672 #531024] INFO -- : make[2]: Leaving directory '/tmp/ruby/build/trunk/ext/json' I, [2024-05-23T11:25:35.551941 #531024] INFO -- : make[2]: Entering directory '/tmp/ruby/build/trunk/ext/monitor' I, [2024-05-23T11:25:35.555833 #531024] INFO -- : make[2]: Leaving directory '/tmp/ruby/build/trunk/ext/monitor' I, [2024-05-23T11:25:35.562833 #531024] INFO -- : make[2]: Entering directory '/tmp/ruby/build/trunk/ext/objspace' I, [2024-05-23T11:25:35.568959 #531024] INFO -- : make[2]: Leaving directory '/tmp/ruby/build/trunk/ext/objspace' I, [2024-05-23T11:25:35.587504 #531024] INFO -- : make[2]: Entering directory '/tmp/ruby/build/trunk/ext/openssl' I, [2024-05-23T11:25:35.603330 #531024] INFO -- : make[2]: Leaving directory '/tmp/ruby/build/trunk/ext/openssl' I, [2024-05-23T11:25:35.606869 #531024] INFO -- : make[2]: Entering directory '/tmp/ruby/build/trunk/ext/pathname' I, [2024-05-23T11:25:35.610655 #531024] INFO -- : make[2]: Leaving directory '/tmp/ruby/build/trunk/ext/pathname' I, [2024-05-23T11:25:35.617590 #531024] INFO -- : make[2]: Entering directory '/tmp/ruby/build/trunk/ext/psych' I, [2024-05-23T11:25:35.639256 #531024] INFO -- : make[2]: Leaving directory '/tmp/ruby/build/trunk/ext/psych' I, [2024-05-23T11:25:35.642305 #531024] INFO -- : make[2]: Entering directory '/tmp/ruby/build/trunk/ext/pty' I, [2024-05-23T11:25:35.645108 #531024] INFO -- : make[2]: Leaving directory '/tmp/ruby/build/trunk/ext/pty' I, [2024-05-23T11:25:35.660016 #531024] INFO -- : make[2]: Entering directory '/tmp/ruby/build/trunk/ext/ripper' I, [2024-05-23T11:25:35.668628 #531024] INFO -- : make[2]: Leaving directory '/tmp/ruby/build/trunk/ext/ripper' I, [2024-05-23T11:25:35.671123 #531024] INFO -- : make[2]: Entering directory '/tmp/ruby/build/trunk/ext/rubyvm' I, [2024-05-23T11:25:35.674412 #531024] INFO -- : make[2]: Leaving directory '/tmp/ruby/build/trunk/ext/rubyvm' I, [2024-05-23T11:25:35.687877 #531024] INFO -- : make[2]: Entering directory '/tmp/ruby/build/trunk/ext/socket' I, [2024-05-23T11:25:35.697834 #531024] INFO -- : make[2]: Leaving directory '/tmp/ruby/build/trunk/ext/socket' I, [2024-05-23T11:25:35.712626 #531024] INFO -- : make[2]: Entering directory '/tmp/ruby/build/trunk/.bundle/gems/bigdecimal-3.1.8/ext/bigdecimal' I, [2024-05-23T11:25:35.737113 #531024] INFO -- : make[2]: Leaving directory '/tmp/ruby/build/trunk/.bundle/gems/bigdecimal-3.1.8/ext/bigdecimal' I, [2024-05-23T11:25:35.739349 #531024] INFO -- : make[2]: Entering directory '/tmp/ruby/build/trunk/.bundle/gems/debug-1.9.2/ext/debug' I, [2024-05-23T11:25:35.760721 #531024] INFO -- : make[2]: Leaving directory '/tmp/ruby/build/trunk/.bundle/gems/debug-1.9.2/ext/debug' I, [2024-05-23T11:25:35.762645 #531024] INFO -- : make[2]: Entering directory '/tmp/ruby/build/trunk/.bundle/gems/nkf-0.2.0/ext/nkf' I, [2024-05-23T11:25:35.784445 #531024] INFO -- : make[2]: Leaving directory '/tmp/ruby/build/trunk/.bundle/gems/nkf-0.2.0/ext/nkf' I, [2024-05-23T11:25:35.786518 #531024] INFO -- : make[2]: Entering directory '/tmp/ruby/build/trunk/.bundle/gems/racc-1.7.3/ext/racc/cparse' I, [2024-05-23T11:25:35.808106 #531024] INFO -- : make[2]: Leaving directory '/tmp/ruby/build/trunk/.bundle/gems/racc-1.7.3/ext/racc/cparse' I, [2024-05-23T11:25:35.810164 #531024] INFO -- : make[2]: Entering directory '/tmp/ruby/build/trunk/.bundle/gems/racc-1.8.0/ext/racc/cparse' I, [2024-05-23T11:25:35.832270 #531024] INFO -- : make[2]: Leaving directory '/tmp/ruby/build/trunk/.bundle/gems/racc-1.8.0/ext/racc/cparse' I, [2024-05-23T11:25:35.834580 #531024] INFO -- : make[2]: Entering directory '/tmp/ruby/build/trunk/.bundle/gems/rbs-3.4.4/ext/rbs_extension' I, [2024-05-23T11:25:35.856771 #531024] INFO -- : make[2]: Leaving directory '/tmp/ruby/build/trunk/.bundle/gems/rbs-3.4.4/ext/rbs_extension' I, [2024-05-23T11:25:35.858688 #531024] INFO -- : make[2]: Entering directory '/tmp/ruby/build/trunk/.bundle/gems/syslog-0.1.2/ext/syslog' I, [2024-05-23T11:25:35.881503 #531024] INFO -- : make[2]: Leaving directory '/tmp/ruby/build/trunk/.bundle/gems/syslog-0.1.2/ext/syslog' I, [2024-05-23T11:25:35.907461 #531024] INFO -- : make[2]: Entering directory '/tmp/ruby/build/trunk' I, [2024-05-23T11:25:35.970759 #531024] INFO -- : make[2]: 'ruby' is up to date. I, [2024-05-23T11:25:35.970796 #531024] INFO -- : make[2]: Leaving directory '/tmp/ruby/build/trunk' I, [2024-05-23T11:25:35.971207 #531024] INFO -- : make[1]: Leaving directory '/tmp/ruby/build/trunk' I, [2024-05-23T11:25:35.974890 #531024] INFO -- : make[1]: Entering directory '/tmp/ruby/build/trunk' I, [2024-05-23T11:25:35.974919 #531024] INFO -- : make[1]: Nothing to be done for 'note'. I, [2024-05-23T11:25:35.974925 #531024] INFO -- : make[1]: Leaving directory '/tmp/ruby/build/trunk' I, [2024-05-23T11:25:36.051599 #531024] INFO -- : Run options: I, [2024-05-23T11:25:36.051657 #531024] INFO -- : --seed=16857 I, [2024-05-23T11:25:36.051663 #531024] INFO -- : "--ruby=./miniruby -I/tmp/ruby/src/trunk/lib -I. -I.ext/common /tmp/ruby/src/trunk/tool/runruby.rb --extout=.ext -- --disable-gems" I, [2024-05-23T11:25:36.051667 #531024] INFO -- : --excludes-dir=/tmp/ruby/src/trunk/test/.excludes I, [2024-05-23T11:25:36.051670 #531024] INFO -- : --name=!/memory_leak/ I, [2024-05-23T11:25:36.051674 #531024] INFO -- : --stderr-on-failure I, [2024-05-23T11:25:36.051681 #531024] INFO -- : -j20 I, [2024-05-23T11:25:36.051685 #531024] INFO -- : I, [2024-05-23T11:25:36.051694 #531024] INFO -- : # Running tests: I, [2024-05-23T11:25:36.051699 #531024] INFO -- : I, [2024-05-23T11:25:36.199882 #531024] INFO -- : [ 1/885] 572376=ractor_test I, [2024-05-23T11:25:36.200619 #531024] INFO -- : [ 2/885] 572377=test_trace I, [2024-05-23T11:25:36.201070 #531024] INFO -- : [ 3/885] 572380=test_rdoc_generator_json_index I, [2024-05-23T11:25:36.202138 #531024] INFO -- : [ 4/885] 572379=test_win32ole_event I, [2024-05-23T11:25:36.202166 #531024] INFO -- : [ 5/885] 572378=test_time_tz I, [2024-05-23T11:25:36.204030 #531024] INFO -- : [ 6/885] 572381=test_bignum I, [2024-05-23T11:25:36.204518 #531024] INFO -- : [ 7/885] 572391=test_rdoc_class_module I, [2024-05-23T11:25:36.204948 #531024] INFO -- : [ 8/885] 572390=test_gem_ci_detector I, [2024-05-23T11:25:36.205885 #531024] INFO -- : [ 9/885] 572379=test_win32ole_variable I, [2024-05-23T11:25:36.206050 #531024] INFO -- : [ 10/885] 572394=test_arity I, [2024-05-23T11:25:36.206085 #531024] INFO -- : [ 11/885] 572393=test_stringio I, [2024-05-23T11:25:36.207132 #531024] INFO -- : [ 12/885] 572395=test_io_wait_uncommon I, [2024-05-23T11:25:36.207167 #531024] INFO -- : [ 13/885] 572379=test_gem_specification I, [2024-05-23T11:25:36.212315 #531024] INFO -- : [ 14/885] 572377=test_enum I, [2024-05-23T11:25:36.212692 #531024] INFO -- : [ 15/885] 572394=test_threadgroup I, [2024-05-23T11:25:36.215768 #531024] INFO -- : [ 16/885] 572395=test_have_macro I, [2024-05-23T11:25:36.218038 #531024] INFO -- : [ 17/885] 572392=test_resolve_symbol I, [2024-05-23T11:25:36.222331 #531024] INFO -- : [ 18/885] 572386=test_complex2 I, [2024-05-23T11:25:36.230106 #531024] INFO -- : [ 19/885] 572389=test_gem_package I, [2024-05-23T11:25:36.236580 #531024] INFO -- : [ 20/885] 572386=test_merge_keys I, [2024-05-23T11:25:36.236785 #531024] INFO -- : [ 21/885] 572382=test_rdoc_extend I, [2024-05-23T11:25:36.236821 #531024] INFO -- : [ 22/885] 572383=test_win32ole_variant I, [2024-05-23T11:25:36.236926 #531024] INFO -- : [ 23/885] 572384=test_ipaddr I, [2024-05-23T11:25:36.237075 #531024] INFO -- : [ 24/885] 572387=test_history I, [2024-05-23T11:25:36.237100 #531024] INFO -- : [ 25/885] 572385=test_mixed_unicode_escapes I, [2024-05-23T11:25:36.237329 #531024] INFO -- : [ 26/885] 572388=test_rdoc_markup_to_ansi I, [2024-05-23T11:25:36.240427 #531024] INFO -- : [ 27/885] 572385=test_gem_resolver_api_specification I, [2024-05-23T11:25:36.246132 #531024] INFO -- : [ 28/885] 572383=test_numeric I, [2024-05-23T11:25:36.265667 #531024] INFO -- : [ 29/885] 572378=test_member I, [2024-05-23T11:25:36.267440 #531024] INFO -- : [ 30/885] 572378=test_cgi_multipart I, [2024-05-23T11:25:36.272119 #531024] INFO -- : [ 31/885] 572376=test_word I, [2024-05-23T11:25:36.274851 #531024] INFO -- : [ 32/885] 572376=test_gem_commands_cleanup_command I, [2024-05-23T11:25:36.275119 #531024] INFO -- : [ 33/885] 572383=test_ractor_compatibility I, [2024-05-23T11:25:36.278687 #531024] INFO -- : [ 34/885] 572384=format_errors_test I, [2024-05-23T11:25:36.283253 #531024] INFO -- : [ 35/885] 572386=test_dir I, [2024-05-23T11:25:36.290196 #531024] INFO -- : [ 36/885] 572392=test_date_ractor I, [2024-05-23T11:25:36.315201 #531024] INFO -- : [ 37/885] 572387=test_gem_console_ui I, [2024-05-23T11:25:36.327475 #531024] INFO -- : [ 38/885] 572393=test_eval I, [2024-05-23T11:25:36.330307 #531024] INFO -- : [ 39/885] 572393=test_autoconf I, [2024-05-23T11:25:36.334677 #531024] INFO -- : [ 40/885] 572393=test_coderange I, [2024-05-23T11:25:36.345335 #531024] INFO -- : [ 41/885] 572393=location_test I, [2024-05-23T11:25:36.352114 #531024] INFO -- : [ 42/885] 572384=test_symbol I, [2024-05-23T11:25:36.364425 #531024] INFO -- : [ 43/885] 572384=test_mailto I, [2024-05-23T11:25:36.382079 #531024] INFO -- : [ 44/885] 572384=test_rdoc_generator_darkfish I, [2024-05-23T11:25:36.384846 #531024] INFO -- : [ 45/885] 572390=test_rdoc_comment I, [2024-05-23T11:25:36.391023 #531024] INFO -- : [ 46/885] 572380=test_resize I, [2024-05-23T11:25:36.392034 #531024] INFO -- : [ 47/885] 572380=test_error_highlight I, [2024-05-23T11:25:36.423630 #531024] INFO -- : [ 48/885] 572378=test_http_request I, [2024-05-23T11:25:36.435583 #531024] INFO -- : [ 49/885] 572388=test_gem_source_fetch_problem I, [2024-05-23T11:25:36.440036 #531024] INFO -- : [ 50/885] 572393=json_generic_object_test I, [2024-05-23T11:25:36.449457 #531024] INFO -- : [ 51/885] 572393=test_function_entry I, [2024-05-23T11:25:36.458897 #531024] INFO -- : [ 52/885] 572393=test_pkcs7 I, [2024-05-23T11:25:36.463128 #531024] INFO -- : [ 53/885] 572382=test_gem_resolver_requirement_list I, [2024-05-23T11:25:36.478463 #531024] INFO -- : [ 54/885] 572378=test_arith_seq_beg_len_step I, [2024-05-23T11:25:36.481596 #531024] INFO -- : [ 55/885] 572387=test_unix I, [2024-05-23T11:25:36.509811 #531024] INFO -- : [ 56/885] 572387=test_lazy_enumerator I, [2024-05-23T11:25:36.513070 #531024] INFO -- : [ 57/885] 572386=test_enc_associate I, [2024-05-23T11:25:36.533356 #531024] INFO -- : [ 58/885] 572378=ruby_api_test I, [2024-05-23T11:25:36.535640 #531024] INFO -- : [ 59/885] 572385=test_find_executable I, [2024-05-23T11:25:36.559863 #531024] INFO -- : [ 60/885] 572392=test_coder I, [2024-05-23T11:25:36.568359 #531024] INFO -- : [ 61/885] 572385=test_symbol I, [2024-05-23T11:25:36.586370 #531024] INFO -- : [ 62/885] 572392=test_context I, [2024-05-23T11:25:36.602165 #531024] INFO -- : [ 63/885] 572390=test_gem_commands_pristine_command I, [2024-05-23T11:25:36.676972 #531024] INFO -- : [ 64/885] 572393=test_nofree I, [2024-05-23T11:25:36.677395 #531024] INFO -- : [ 65/885] 572393=test_call I, [2024-05-23T11:25:36.685591 #531024] INFO -- : [ 66/885] 572382=test_https_proxy I, [2024-05-23T11:25:36.686028 #531024] INFO -- : [ 67/885] 572383=test_rubygems I, [2024-05-23T11:25:36.693425 #531024] INFO -- : [ 68/885] 572388=test_super I, [2024-05-23T11:25:36.697423 #531024] INFO -- : [ 69/885] 572378=test_rubyoptions I, [2024-05-23T11:25:36.751481 #531024] INFO -- : [ 70/885] 572382=test_cgi_modruby I, [2024-05-23T11:25:36.764826 #531024] INFO -- : [ 71/885] 572382=test_integer I, [2024-05-23T11:25:36.777964 #531024] INFO -- : [ 72/885] 572395=test_object_references I, [2024-05-23T11:25:36.796527 #531024] INFO -- : [ 73/885] 572393=test_usrmarshal I, [2024-05-23T11:25:36.807579 #531024] INFO -- : [ 74/885] 572392=test_gem_resolver_git_specification I, [2024-05-23T11:25:36.810633 #531024] INFO -- : [ 75/885] 572395=test_stat I, [2024-05-23T11:25:36.814665 #531024] INFO -- : [ 76/885] 572395=test_gem_request_set_lockfile_tokenizer I, [2024-05-23T11:25:36.820426 #531024] INFO -- : [ 77/885] 572380=test_have_func I, [2024-05-23T11:25:36.866212 #531024] INFO -- : [ 78/885] 572389=test_nextafter I, [2024-05-23T11:25:36.883734 #531024] INFO -- : [ 79/885] 572384=test_capacity I, [2024-05-23T11:25:36.883803 #531024] INFO -- : [ 80/885] 572384=test_dryrun I, [2024-05-23T11:25:36.885128 #531024] INFO -- : [ 81/885] 572387=test_integer I, [2024-05-23T11:25:36.896564 #531024] INFO -- : [ 82/885] 572384=desugar_compiler_test I, [2024-05-23T11:25:36.916195 #531024] INFO -- : [ 83/885] 572389=test_env I, [2024-05-23T11:25:36.917720 #531024] INFO -- : [ 84/885] 572384=test_rdoc_attr I, [2024-05-23T11:25:36.925498 #531024] INFO -- : [ 85/885] 572384=test_gem_commands_setup_command I, [2024-05-23T11:25:36.945340 #531024] INFO -- : [ 86/885] 572387=test_parser I, [2024-05-23T11:25:36.974100 #531024] INFO -- : [ 87/885] 572387=test_cgi_core I, [2024-05-23T11:25:36.989660 #531024] INFO -- : [ 88/885] 572395=test_gem_source_lock I, [2024-05-23T11:25:36.992266 #531024] INFO -- : [ 89/885] 572387=test_gem I, [2024-05-23T11:25:37.023206 #531024] INFO -- : [ 90/885] 572383=test_ractor I, [2024-05-23T11:25:37.028448 #531024] INFO -- : [ 91/885] 572393=test_gem_commands_open_command I, [2024-05-23T11:25:37.041477 #531024] INFO -- : [ 92/885] 572395=test_dns I, [2024-05-23T11:25:37.054479 #531024] INFO -- : [ 93/885] 572383=parse_stream_test I, [2024-05-23T11:25:37.057479 #531024] INFO -- : [ 94/885] 572386=test_registry I, [2024-05-23T11:25:37.057699 #531024] INFO -- : [ 95/885] 572386=test_my_integer I, [2024-05-23T11:25:37.058544 #531024] INFO -- : [ 96/885] 572391=json_ext_parser_test I, [2024-05-23T11:25:37.061098 #531024] INFO -- : [ 97/885] 572386=test_thread I, [2024-05-23T11:25:37.068494 #531024] INFO -- : [ 98/885] 572377=test_debugger_integration I, [2024-05-23T11:25:37.071964 #531024] INFO -- : [ 99/885] 572391=test_rendering I, [2024-05-23T11:25:37.080790 #531024] INFO -- : [100/885] 572377=test_ractor I, [2024-05-23T11:25:37.114629 #531024] INFO -- : [101/885] 572376=test_ssl I, [2024-05-23T11:25:37.118752 #531024] INFO -- : [102/885] 572388=test_rb_str_dup I, [2024-05-23T11:25:37.122448 #531024] INFO -- : [103/885] 572388=test_reline_key I, [2024-05-23T11:25:37.126472 #531024] INFO -- : [104/885] 572383=test_ancdata I, [2024-05-23T11:25:37.127821 #531024] INFO -- : [105/885] 572383=test_singleton_function I, [2024-05-23T11:25:37.130822 #531024] INFO -- : [106/885] 572383=test_alias I, [2024-05-23T11:25:37.147801 #531024] INFO -- : [107/885] 572391=test_timeout I, [2024-05-23T11:25:37.168813 #531024] INFO -- : [108/885] 572388=test_marshal I, [2024-05-23T11:25:37.239008 #531024] INFO -- : [109/885] 572394=test_unicode_normalize I, [2024-05-23T11:25:37.257630 #531024] INFO -- : [110/885] 572392=test_nonblock I, [2024-05-23T11:25:37.269300 #531024] INFO -- : [111/885] 572392=test_weakref I, [2024-05-23T11:25:37.321563 #531024] INFO -- : [112/885] 572393=errors_test I, [2024-05-23T11:25:37.329106 #531024] INFO -- : [113/885] 572383=test_gem_commands_check_command I, [2024-05-23T11:25:37.381586 #531024] INFO -- : [114/885] 572383=test_regexp I, [2024-05-23T11:25:37.387526 #531024] INFO -- : [115/885] 572392=test_vm_dump I, [2024-05-23T11:25:37.388644 #531024] INFO -- : [116/885] 572392=test_integer_comb I, [2024-05-23T11:25:37.395461 #531024] INFO -- : [117/885] 572393=test_rdoc_markup_document I, [2024-05-23T11:25:37.495225 #531024] INFO -- : [118/885] 572395=test_tmpdir I, [2024-05-23T11:25:37.533153 #531024] INFO -- : [119/885] 572393=test_data_error I, [2024-05-23T11:25:37.559905 #531024] INFO -- : [120/885] 572377=bom_test I, [2024-05-23T11:25:37.576751 #531024] INFO -- : [121/885] 572395=unescape_test I, [2024-05-23T11:25:37.581379 #531024] INFO -- : [122/885] 572384=test_ostruct I, [2024-05-23T11:25:37.596906 #531024] INFO -- : [123/885] 572393=test_file I, [2024-05-23T11:25:37.611072 #531024] INFO -- : [124/885] 572388=test_force_exit I, [2024-05-23T11:25:37.649654 #531024] INFO -- : [125/885] 572377=test_udp I, [2024-05-23T11:25:37.662845 #531024] INFO -- : [126/885] 572377=static_inspect_test I, [2024-05-23T11:25:37.665948 #531024] INFO -- : [127/885] 572377=test_gem_uri_formatter I, [2024-05-23T11:25:37.668808 #531024] INFO -- : [128/885] 572376=test_helper I, [2024-05-23T11:25:37.669349 #531024] INFO -- : [129/885] 572376=test_erb_command I, [2024-05-23T11:25:37.671566 #531024] INFO -- : [130/885] 572388=test_encoding I, [2024-05-23T11:25:37.718310 #531024] INFO -- : [131/885] 572376=test_range I, [2024-05-23T11:25:37.735152 #531024] INFO -- : [132/885] 572384=test_project_sanity I, [2024-05-23T11:25:37.815123 #531024] INFO -- : [133/885] 572384=test_constant I, [2024-05-23T11:25:37.898757 #531024] INFO -- : [134/885] 572388=test_dup I, [2024-05-23T11:25:37.907931 #531024] INFO -- : [135/885] 572377=test_pty I, [2024-05-23T11:25:38.010983 #531024] INFO -- : [136/885] 572379=command_line_test I, [2024-05-23T11:25:38.016152 #531024] INFO -- : [137/885] 572390=test_rdoc_ri_paths I, [2024-05-23T11:25:38.039423 #531024] INFO -- : [138/885] 572390=test_ts I, [2024-05-23T11:25:38.064981 #531024] INFO -- : [139/885] 572379=test_ensured I, [2024-05-23T11:25:38.094559 #531024] INFO -- : [140/885] 572388=library_symbols_test I, [2024-05-23T11:25:38.104740 #531024] INFO -- : [141/885] 572380=test_locale I, [2024-05-23T11:25:38.106173 #531024] INFO -- : [142/885] 572379=test_addr I, [2024-05-23T11:25:38.132624 #531024] INFO -- : [143/885] 572379=test_config I, [2024-05-23T11:25:38.176662 #531024] INFO -- : [144/885] 572388=test_gem_resolver_vendor_set I, [2024-05-23T11:25:38.195477 #531024] INFO -- : [145/885] 572388=test_enumerable I, [2024-05-23T11:25:38.198680 #531024] INFO -- : [146/885] 572380=test_gem_safe_marshal I, [2024-05-23T11:25:38.208367 #531024] INFO -- : [147/885] 572391=test_gem_resolver_api_set I, [2024-05-23T11:25:38.232548 #531024] INFO -- : [148/885] 572388=test_transcode I, [2024-05-23T11:25:38.374456 #531024] INFO -- : [149/885] 572385=test_eval I, [2024-05-23T11:25:38.380215 #531024] INFO -- : [150/885] 572377=json_generator_test I, [2024-05-23T11:25:38.396358 #531024] INFO -- : [151/885] 572376=test_rdoc_code_object I, [2024-05-23T11:25:38.449081 #531024] INFO -- : [152/885] 572388=test_x509store I, [2024-05-23T11:25:38.462691 #531024] INFO -- : [153/885] 572391=test_update I, [2024-05-23T11:25:38.468942 #531024] INFO -- : [154/885] 572391=test_fips I, [2024-05-23T11:25:38.491323 #531024] INFO -- : [155/885] 572377=test_x509name I, [2024-05-23T11:25:38.494789 #531024] INFO -- : [156/885] 572390=test_gem_request_set_gem_dependency_api I, [2024-05-23T11:25:38.502861 #531024] INFO -- : [157/885] 572377=test_ast I, [2024-05-23T11:25:38.565625 #531024] INFO -- : [158/885] 572379=test_lambda I, [2024-05-23T11:25:38.644867 #531024] INFO -- : [159/885] 572379=test_random_formatter I, [2024-05-23T11:25:38.665782 #531024] INFO -- : [160/885] 572385=test_helper I, [2024-05-23T11:25:38.668129 #531024] INFO -- : [161/885] 572390=test_jaro_winkler I, [2024-05-23T11:25:38.675912 #531024] INFO -- : [162/885] 572390=test_webauthn_listener I, [2024-05-23T11:25:38.676688 #531024] INFO -- : [163/885] 572379=test_pkey_rsa I, [2024-05-23T11:25:38.716615 #531024] INFO -- : [164/885] 572388=test_gem_commands_push_command I, [2024-05-23T11:25:38.730930 #531024] INFO -- : [165/885] 572391=test_weakkeymap I, [2024-05-23T11:25:38.731197 #531024] INFO -- : [166/885] 572385=test_numhash I, [2024-05-23T11:25:38.735006 #531024] INFO -- : [167/885] 572385=test_gem_package_task I, [2024-05-23T11:25:38.747785 #531024] INFO -- : [168/885] 572390=test_date_strptime I, [2024-05-23T11:25:38.748983 #531024] INFO -- : [169/885] 572385=test_placearg I, [2024-05-23T11:25:38.846978 #531024] INFO -- : [170/885] 572376=test_rdoc_markup_hard_break I, [2024-05-23T11:25:38.850245 #531024] INFO -- : [171/885] 572376=test_gem_platform I, [2024-05-23T11:25:38.851841 #531024] INFO -- : [172/885] 572390=test_delete I, [2024-05-23T11:25:38.858815 #531024] INFO -- : [173/885] 572390=test_win32ole_method I, [2024-05-23T11:25:38.862828 #531024] INFO -- : [174/885] 572390=test_fd_setsize I, [2024-05-23T11:25:38.864873 #531024] INFO -- : [175/885] 572390=test_continuation I, [2024-05-23T11:25:38.869690 #531024] INFO -- : [176/885] 572390=test_class_name_check I, [2024-05-23T11:25:38.876906 #531024] INFO -- : [177/885] 572380=test_keyword I, [2024-05-23T11:25:38.884305 #531024] INFO -- : [178/885] 572390=test_file_exhaustive I, [2024-05-23T11:25:38.888185 #531024] INFO -- : [179/885] 572385=test_gem_update_suggestion I, [2024-05-23T11:25:38.927264 #531024] INFO -- : [180/885] 572387=test_files_test I, [2024-05-23T11:25:38.931421 #531024] INFO -- : [181/885] 572385=test_logger I, [2024-05-23T11:25:38.936777 #531024] INFO -- : [182/885] 572395=test_import I, [2024-05-23T11:25:38.939374 #531024] INFO -- : [183/885] 572391=test_gem_resolver_lock_set I, [2024-05-23T11:25:38.941273 #531024] INFO -- : [184/885] 572376=test_not I, [2024-05-23T11:25:38.944457 #531024] INFO -- : [185/885] 572385=test_rdoc_parser_markdown I, [2024-05-23T11:25:38.947594 #531024] INFO -- : [186/885] 572376=test_cgi_header I, [2024-05-23T11:25:38.959914 #531024] INFO -- : [187/885] 572376=heredoc_dedent_test I, [2024-05-23T11:25:38.975807 #531024] INFO -- : [188/885] 572391=test_object I, [2024-05-23T11:25:38.978486 #531024] INFO -- : [189/885] 572391=version_test I, [2024-05-23T11:25:38.996492 #531024] INFO -- : [190/885] 572379=test_key_actor_emacs I, [2024-05-23T11:25:39.013428 #531024] INFO -- : [191/885] 572376=test_basicinstructions I, [2024-05-23T11:25:39.035785 #531024] INFO -- : [192/885] 572391=test_gem_gemcutter_utilities I, [2024-05-23T11:25:39.043095 #531024] INFO -- : [193/885] 572387=test_gem_command_manager I, [2024-05-23T11:25:39.092189 #531024] INFO -- : [194/885] 572376=test_arithmetic_sequence I, [2024-05-23T11:25:39.112654 #531024] INFO -- : [195/885] 572376=test_change_word I, [2024-05-23T11:25:39.120379 #531024] INFO -- : [196/885] 572376=test_flip I, [2024-05-23T11:25:39.138869 #531024] INFO -- : [197/885] 572387=compiler_test I, [2024-05-23T11:25:39.140577 #531024] INFO -- : [198/885] 572376=test_timeout I, [2024-05-23T11:25:39.142772 #531024] INFO -- : [199/885] 572381=test_ossl I, [2024-05-23T11:25:39.152562 #531024] INFO -- : [200/885] 572385=test_normalize I, [2024-05-23T11:25:39.154166 #531024] INFO -- : [201/885] 572385=test_date_arith I, [2024-05-23T11:25:39.162200 #531024] INFO -- : [202/885] 572385=test_ruby_lex I, [2024-05-23T11:25:39.168737 #531024] INFO -- : [203/885] 572376=test_object I, [2024-05-23T11:25:39.204255 #531024] INFO -- : [204/885] 572379=test_gem_local_remote_options I, [2024-05-23T11:25:39.204867 #531024] INFO -- : [205/885] 572387=test_sleep I, [2024-05-23T11:25:39.236442 #531024] INFO -- : [206/885] 572388=test_ractor I, [2024-05-23T11:25:39.252816 #531024] INFO -- : [207/885] 572379=test_type I, [2024-05-23T11:25:39.256442 #531024] INFO -- : [208/885] 572382=test_pointer I, [2024-05-23T11:25:39.259912 #531024] INFO -- : [209/885] 572379=test_func I, [2024-05-23T11:25:39.315669 #531024] INFO -- : [210/885] 572388=test_big5 I, [2024-05-23T11:25:39.320118 #531024] INFO -- : [211/885] 572388=test_rdoc_rd_block_parser I, [2024-05-23T11:25:39.341171 #531024] INFO -- : [212/885] 572391=test_signedness I, [2024-05-23T11:25:39.368184 #531024] INFO -- : [213/885] 572388=test_tsort I, [2024-05-23T11:25:39.379677 #531024] INFO -- : [214/885] 572388=test_primitive I, [2024-05-23T11:25:39.411169 #531024] INFO -- : [215/885] 572388=test_human_typo I, [2024-05-23T11:25:39.416738 #531024] INFO -- : [216/885] 572385=test_rbconfig I, [2024-05-23T11:25:39.418889 #531024] INFO -- : [217/885] 572388=test_document I, [2024-05-23T11:25:39.420075 #531024] INFO -- : [218/885] 572385=test_acceptable I, [2024-05-23T11:25:39.422977 #531024] INFO -- : [219/885] 572388=test_rdoc_generator_pot_po_entry I, [2024-05-23T11:25:39.425993 #531024] INFO -- : [220/885] 572388=test_euc_jp I, [2024-05-23T11:25:39.433085 #531024] INFO -- : [221/885] 572388=test_pair I, [2024-05-23T11:25:39.478555 #531024] INFO -- : [222/885] 572385=test_win32ole_param I, [2024-05-23T11:25:39.481348 #531024] INFO -- : [223/885] 572385=test_gem_commands_yank_command I, [2024-05-23T11:25:39.491655 #531024] INFO -- : [224/885] 572380=test_chilled I, [2024-05-23T11:25:39.494189 #531024] INFO -- : [225/885] 572380=test_name_error_extension I, [2024-05-23T11:25:39.498494 #531024] INFO -- : [226/885] 572380=test_rdoc_i18n_locale I, [2024-05-23T11:25:39.506766 #531024] INFO -- : [227/885] 572380=test_httpheader I, [2024-05-23T11:25:39.546989 #531024] INFO -- : [228/885] 572392=test_gem_resolver_local_specification I, [2024-05-23T11:25:39.564040 #531024] INFO -- : [229/885] 572380=test_rdoc_ri_driver I, [2024-05-23T11:25:39.578500 #531024] INFO -- : [230/885] 572392=test_set_len I, [2024-05-23T11:25:39.581733 #531024] INFO -- : [231/885] 572392=test_httpresponses I, [2024-05-23T11:25:39.591054 #531024] INFO -- : [232/885] 572395=test_encoding I, [2024-05-23T11:25:39.596844 #531024] INFO -- : [233/885] 572376=test_sockopt I, [2024-05-23T11:25:39.601747 #531024] INFO -- : [234/885] 572376=test_install I, [2024-05-23T11:25:39.606831 #531024] INFO -- : [235/885] 572395=test_rdoc_markup_to_label I, [2024-05-23T11:25:39.636088 #531024] INFO -- : [236/885] 572392=test_key_stroke I, [2024-05-23T11:25:39.644227 #531024] INFO -- : [237/885] 572392=json_encoding_test I, [2024-05-23T11:25:39.660777 #531024] INFO -- : [238/885] 572392=test_color I, [2024-05-23T11:25:39.703111 #531024] INFO -- : [239/885] 572382=test_bug-14834 I, [2024-05-23T11:25:39.713595 #531024] INFO -- : [240/885] 572392=test_date_compat I, [2024-05-23T11:25:39.716395 #531024] INFO -- : [241/885] 572392=test_rdoc_markup_to_html I, [2024-05-23T11:25:39.732869 #531024] INFO -- : [242/885] 572395=test_terminfo I, [2024-05-23T11:25:39.765069 #531024] INFO -- : [243/885] 572382=test_compile_prism I, [2024-05-23T11:25:39.773691 #531024] INFO -- : [244/885] 572395=test_bn I, [2024-05-23T11:25:39.783890 #531024] INFO -- : [245/885] 572395=test_win32ole_param_event I, [2024-05-23T11:25:39.785616 #531024] INFO -- : [246/885] 572395=test_path I, [2024-05-23T11:25:39.796089 #531024] INFO -- : [247/885] 572395=redundant_return_test I, [2024-05-23T11:25:39.798985 #531024] INFO -- : [248/885] 572395=test_case_mapping I, [2024-05-23T11:25:39.807360 #531024] INFO -- : [249/885] 572395=test_tree_spell_checker I, [2024-05-23T11:25:39.837751 #531024] INFO -- : [250/885] 572376=test_addrinfo I, [2024-05-23T11:25:39.841027 #531024] INFO -- : [251/885] 572395=test_http I, [2024-05-23T11:25:39.873363 #531024] INFO -- : [252/885] 572380=test_rdoc_method_attr I, [2024-05-23T11:25:39.910227 #531024] INFO -- : [253/885] 572389=test_filter I, [2024-05-23T11:25:39.928522 #531024] INFO -- : [254/885] 572376=test_gem_gem_runner I, [2024-05-23T11:25:39.950097 #531024] INFO -- : [255/885] 572389=static_literals_test I, [2024-05-23T11:25:39.959529 #531024] INFO -- : [256/885] 572392=test_data I, [2024-05-23T11:25:39.965775 #531024] INFO -- : [257/885] 572392=test_rdoc_generator_pot I, [2024-05-23T11:25:39.967331 #531024] INFO -- : [258/885] 572385=test_rdoc_parser_changelog I, [2024-05-23T11:25:39.967913 #531024] INFO -- : [259/885] 572392=test_enumerator I, [2024-05-23T11:25:39.971800 #531024] INFO -- : [260/885] 572376=test_koi8 I, [2024-05-23T11:25:39.972968 #531024] INFO -- : [261/885] 572392=parameters_signature_test I, [2024-05-23T11:25:39.977459 #531024] INFO -- : [262/885] 572376=test_unicode I, [2024-05-23T11:25:39.996838 #531024] INFO -- : [263/885] 572380=test_ssl_session I, [2024-05-23T11:25:40.014817 #531024] INFO -- : [264/885] 572389=test_lexer I, [2024-05-23T11:25:40.025540 #531024] INFO -- : [265/885] 572376=test_thread_cv I, [2024-05-23T11:25:40.031438 #531024] INFO -- : [266/885] 572389=test_gem_resolver_vendor_specification I, [2024-05-23T11:25:40.042956 #531024] INFO -- : [267/885] 572385=test_gem_commands_update_command I, [2024-05-23T11:25:40.046017 #531024] INFO -- : [268/885] 572392=test_gem_uri I, [2024-05-23T11:25:40.053526 #531024] INFO -- : [269/885] 572389=test_key_event_record I, [2024-05-23T11:25:40.063913 #531024] INFO -- : [270/885] 572392=test_notimplement I, [2024-05-23T11:25:40.068636 #531024] INFO -- : [271/885] 572392=test_random I, [2024-05-23T11:25:40.078175 #531024] INFO -- : [272/885] 572392=test_gem_commands_build_command I, [2024-05-23T11:25:40.087666 #531024] INFO -- : [273/885] 572382=test_interned_str I, [2024-05-23T11:25:40.096956 #531024] INFO -- : [274/885] 572382=test_case_comprehensive I, [2024-05-23T11:25:40.109522 #531024] INFO -- : [275/885] 572389=test_io_m17n I, [2024-05-23T11:25:40.140677 #531024] INFO -- : [276/885] 572384=test_variable_name_check I, [2024-05-23T11:25:40.142942 #531024] INFO -- : [277/885] 572379=test_did_you_mean I, [2024-05-23T11:25:40.180766 #531024] INFO -- : [278/885] 572384=test_gem_commands_server_command I, [2024-05-23T11:25:40.187766 #531024] INFO -- : [279/885] 572384=test_append I, [2024-05-23T11:25:40.189450 #531024] INFO -- : [280/885] 572384=test_option I, [2024-05-23T11:25:40.260137 #531024] INFO -- : [281/885] 572379=test_cmethod I, [2024-05-23T11:25:40.263893 #531024] INFO -- : [282/885] 572379=test_tracer I, [2024-05-23T11:25:40.293102 #531024] INFO -- : [283/885] 572384=test_exception_at_throwing I, [2024-05-23T11:25:40.306609 #531024] INFO -- : [284/885] 572379=test_iseq I, [2024-05-23T11:25:40.357271 #531024] INFO -- : [285/885] 572384=test_rdoc_markup_heading I, [2024-05-23T11:25:40.360389 #531024] INFO -- : [286/885] 572384=test_ocsp I, [2024-05-23T11:25:40.382902 #531024] INFO -- : [287/885] 572392=test_class I, [2024-05-23T11:25:40.389822 #531024] INFO -- : [288/885] 572392=test_pkey_dsa I, [2024-05-23T11:25:40.640687 #531024] INFO -- : [289/885] 572384=test_scheduler I, [2024-05-23T11:25:40.659298 #531024] INFO -- : [290/885] 572376=test_emoji_breaks I, [2024-05-23T11:25:40.663110 #531024] INFO -- : [291/885] 572376=test_gem_bundler_version_finder I, [2024-05-23T11:25:40.694336 #531024] INFO -- : [292/885] 572376=test_within_pipe I, [2024-05-23T11:25:40.739267 #531024] INFO -- : [293/885] 572376=reflection_test I, [2024-05-23T11:25:40.753432 #531024] INFO -- : [294/885] 572376=test_files_lib I, [2024-05-23T11:25:40.762079 #531024] INFO -- : [295/885] 572384=test_gem_commands_unpack_command I, [2024-05-23T11:25:40.889799 #531024] INFO -- : [296/885] 572379=test_beginendblock I, [2024-05-23T11:25:40.974118 #531024] INFO -- : [297/885] 572392=test_help I, [2024-05-23T11:25:40.984433 #531024] INFO -- : [298/885] 572392=test_rdoc_markup_to_bs I, [2024-05-23T11:25:41.006726 #531024] INFO -- : [299/885] 572392=test_printf I, [2024-05-23T11:25:41.022512 #531024] INFO -- : [300/885] 572392=test_rdoc_markup_pre_process I, [2024-05-23T11:25:41.053484 #531024] INFO -- : [301/885] 572380=test_to_ary_concat I, [2024-05-23T11:25:41.087533 #531024] INFO -- : [302/885] 572392=test_time I, [2024-05-23T11:25:41.095889 #531024] INFO -- : [303/885] 572384=test_webauthn_listener_response I, [2024-05-23T11:25:41.115787 #531024] INFO -- : [304/885] 572384=test_stream I, [2024-05-23T11:25:41.125482 #531024] INFO -- : [305/885] 572384=test_pinned I, [2024-05-23T11:25:41.161087 #531024] INFO -- : [306/885] 572384=test_delegate I, [2024-05-23T11:25:41.171243 #531024] INFO -- : [307/885] 572384=test_popen_deadlock I, [2024-05-23T11:25:41.203664 #531024] INFO -- : [308/885] 572385=test_history I, [2024-05-23T11:25:41.211409 #531024] INFO -- : [309/885] 572385=test_mkmf I, [2024-05-23T11:25:41.231563 #531024] INFO -- : [310/885] 572385=test_date_marshal I, [2024-05-23T11:25:41.235977 #531024] INFO -- : [311/885] 572385=test_recursion I, [2024-05-23T11:25:41.237192 #531024] INFO -- : [312/885] 572385=test_exit I, [2024-05-23T11:25:41.298633 #531024] INFO -- : [313/885] 572392=test_digest I, [2024-05-23T11:25:41.301156 #531024] INFO -- : [314/885] 572392=test_ractor I, [2024-05-23T11:25:41.317702 #531024] INFO -- : [315/885] 572379=test_rdoc_servlet I, [2024-05-23T11:25:41.335469 #531024] INFO -- : [316/885] 572385=test_gem_security I, [2024-05-23T11:25:41.365898 #531024] INFO -- : [317/885] 572392=test_multi_irb_commands I, [2024-05-23T11:25:41.372131 #531024] INFO -- : [318/885] 572392=test_fiber I, [2024-05-23T11:25:41.389675 #531024] INFO -- : [319/885] 572389=test_open3 I, [2024-05-23T11:25:41.478314 #531024] INFO -- : [320/885] 572391=test_bundled_ca I, [2024-05-23T11:25:41.604178 #531024] INFO -- : [321/885] 572379=test_closure I, [2024-05-23T11:25:41.779416 #531024] INFO -- : [322/885] 572384=test_float I, [2024-05-23T11:25:41.934915 #531024] INFO -- : [323/885] 572380=test_require I, [2024-05-23T11:25:42.054162 #531024] INFO -- : [324/885] 572379=test_cgi_cookie I, [2024-05-23T11:25:42.062154 #531024] INFO -- : [325/885] 572379=test_dir_m17n I, [2024-05-23T11:25:42.533706 #531024] INFO -- : [326/885] 572394=test_gem_resolver_installer_set I, [2024-05-23T11:25:42.769203 #531024] INFO -- : [327/885] 572391=test_regex_casefold I, [2024-05-23T11:25:42.923019 #531024] INFO -- : [328/885] 572394=test_gem_commands_signout_command I, [2024-05-23T11:25:42.923358 #531024] INFO -- : [329/885] 572388=test_refinement I, [2024-05-23T11:25:42.942971 #531024] INFO -- : [330/885] 572394=test_gem_source_git I, [2024-05-23T11:25:43.097962 #531024] INFO -- : [331/885] 572391=test_fixnum I, [2024-05-23T11:25:43.106071 #531024] INFO -- : [332/885] 572391=test_signal I, [2024-05-23T11:25:43.266578 #531024] INFO -- : [333/885] 572384=test_x509crl I, [2024-05-23T11:25:43.369822 #531024] INFO -- : [334/885] 572379=test_rdoc_rd I, [2024-05-23T11:25:43.371029 #531024] INFO -- : [335/885] 572394=test_cgi_session I, [2024-05-23T11:25:43.395528 #531024] INFO -- : [336/885] 572394=test_rdoc_top_level I, [2024-05-23T11:25:43.411667 #531024] INFO -- : [337/885] 572384=test_metaclass I, [2024-05-23T11:25:43.415262 #531024] INFO -- : [338/885] 572379=test_input_method I, [2024-05-23T11:25:43.421283 #531024] INFO -- : [339/885] 572384=test_windows_1252 I, [2024-05-23T11:25:43.429891 #531024] INFO -- : [340/885] 572384=test_process I, [2024-05-23T11:25:43.449120 #531024] INFO -- : [341/885] 572384=test_iterator I, [2024-05-23T11:25:43.456778 #531024] INFO -- : [342/885] 572379=test_string I, [2024-05-23T11:25:43.457969 #531024] INFO -- : [343/885] 572379=test_omap I, [2024-05-23T11:25:43.477289 #531024] INFO -- : [344/885] 572379=test_digest_extend I, [2024-05-23T11:25:43.487591 #531024] INFO -- : [345/885] 572379=test_shellwords I, [2024-05-23T11:25:43.498975 #531024] INFO -- : [346/885] 572379=test_debug I, [2024-05-23T11:25:43.506422 #531024] INFO -- : [347/885] 572379=test_memory_view I, [2024-05-23T11:25:43.528045 #531024] INFO -- : [348/885] 572379=pattern_test I, [2024-05-23T11:25:43.548179 #531024] INFO -- : [349/885] 572384=test_cipher I, [2024-05-23T11:25:43.553761 #531024] INFO -- : [350/885] 572379=test_gem_security_signer I, [2024-05-23T11:25:43.600772 #531024] INFO -- : [351/885] 572384=test_new I, [2024-05-23T11:25:43.604050 #531024] INFO -- : [352/885] 572384=test_storage I, [2024-05-23T11:25:43.610940 #531024] INFO -- : [353/885] 572384=test_gem_resolver_git_set I, [2024-05-23T11:25:43.661759 #531024] INFO -- : [354/885] 572379=test_dln I, [2024-05-23T11:25:43.663106 #531024] INFO -- : [355/885] 572393=test_gem_source_subpath_problem I, [2024-05-23T11:25:43.664995 #531024] INFO -- : [356/885] 572379=json_common_interface_test I, [2024-05-23T11:25:43.686775 #531024] INFO -- : [357/885] 572379=test_win32ole_variant_outarg I, [2024-05-23T11:25:43.687155 #531024] INFO -- : [358/885] 572379=test_config I, [2024-05-23T11:25:43.734460 #531024] INFO -- : [359/885] 572379=test_nomethod_error I, [2024-05-23T11:25:43.765405 #531024] INFO -- : [360/885] 572379=json_parser_test I, [2024-05-23T11:25:43.815522 #531024] INFO -- : [361/885] 572379=memsize_test I, [2024-05-23T11:25:43.818121 #531024] INFO -- : [362/885] 572379=test_cparser I, [2024-05-23T11:25:43.824629 #531024] INFO -- : [363/885] 572394=test_pkg_config I, [2024-05-23T11:25:43.829150 #531024] INFO -- : [364/885] 572389=fuzzer_test I, [2024-05-23T11:25:43.834566 #531024] INFO -- : [365/885] 572389=test_sexp I, [2024-05-23T11:25:43.850939 #531024] INFO -- : [366/885] 572394=test_rdoc_markup_include I, [2024-05-23T11:25:43.854617 #531024] INFO -- : [367/885] 572393=test_variable I, [2024-05-23T11:25:43.856467 #531024] INFO -- : [368/885] 572376=test_struct I, [2024-05-23T11:25:43.856968 #531024] INFO -- : [369/885] 572394=magic_comment_test I, [2024-05-23T11:25:43.864602 #531024] INFO -- : [370/885] 572376=test_rdoc_markup_to_html_snippet I, [2024-05-23T11:25:43.874731 #531024] INFO -- : [371/885] 572389=test_key_error I, [2024-05-23T11:25:43.877985 #531024] INFO -- : [372/885] 572389=test_div I, [2024-05-23T11:25:43.880060 #531024] INFO -- : [373/885] 572389=test_allocation I, [2024-05-23T11:25:43.938704 #531024] INFO -- : [374/885] 572394=test_engine I, [2024-05-23T11:25:43.939307 #531024] INFO -- : [375/885] 572384=test_win32ole_variant_m I, [2024-05-23T11:25:43.942905 #531024] INFO -- : [376/885] 572376=test_color_printer I, [2024-05-23T11:25:43.942957 #531024] INFO -- : [377/885] 572384=test_deprecated I, [2024-05-23T11:25:43.947284 #531024] INFO -- : [378/885] 572393=test_insns_leaf I, [2024-05-23T11:25:43.948286 #531024] INFO -- : [379/885] 572384=test_serialize_subclasses I, [2024-05-23T11:25:43.950553 #531024] INFO -- : [380/885] 572393=test_set I, [2024-05-23T11:25:43.953753 #531024] INFO -- : [381/885] 572384=test_struct I, [2024-05-23T11:25:43.954361 #531024] INFO -- : [382/885] 572394=test_gem_path_support I, [2024-05-23T11:25:43.964624 #531024] INFO -- : [383/885] 572376=test_files_test_1 I, [2024-05-23T11:25:43.966354 #531024] INFO -- : [384/885] 572376=test_rdoc_rd_inline I, [2024-05-23T11:25:43.971565 #531024] INFO -- : [385/885] 572393=test_mutex I, [2024-05-23T11:25:43.972904 #531024] INFO -- : [386/885] 572376=test_x509req I, [2024-05-23T11:25:43.987381 #531024] INFO -- : [387/885] 572394=test_ssl I, [2024-05-23T11:25:44.144126 #531024] INFO -- : [388/885] 572376=test_gem_ext_cargo_builder I, [2024-05-23T11:25:44.153853 #531024] INFO -- : [389/885] 572376=constant_path_node_test I, [2024-05-23T11:25:44.164141 #531024] INFO -- : [390/885] 572376=test_gem_request_set I, [2024-05-23T11:25:44.207679 #531024] INFO -- : [391/885] 572387=test_module I, [2024-05-23T11:25:44.287119 #531024] INFO -- : [392/885] 572390=test_parser I, [2024-05-23T11:25:44.309656 #531024] INFO -- : [393/885] 572390=test_method_name_check I, [2024-05-23T11:25:44.313250 #531024] INFO -- : [394/885] 572380=test_arith_seq_extract I, [2024-05-23T11:25:44.321068 #531024] INFO -- : [395/885] 572390=test_monitor I, [2024-05-23T11:25:44.426310 #531024] INFO -- : [396/885] 572379=test_buffered_io I, [2024-05-23T11:25:44.427406 #531024] INFO -- : [397/885] 572379=test_configuration I, [2024-05-23T11:25:44.471506 #531024] INFO -- : [398/885] 572376=test_rubyvm I, [2024-05-23T11:25:44.477277 #531024] INFO -- : [399/885] 572376=test_rdoc_generator_markup I, [2024-05-23T11:25:44.484267 #531024] INFO -- : [400/885] 572376=test_whileuntil I, [2024-05-23T11:25:44.489071 #531024] INFO -- : [401/885] 572376=test_boolean I, [2024-05-23T11:25:44.489554 #531024] INFO -- : [402/885] 572379=test_stringify_symbols I, [2024-05-23T11:25:44.498203 #531024] INFO -- : [403/885] 572376=test_instrumentation_api I, [2024-05-23T11:25:44.502479 #531024] INFO -- : [404/885] 572379=integer_parse_test I, [2024-05-23T11:25:44.504043 #531024] INFO -- : [405/885] 572379=test_win32ole_method_event I, [2024-05-23T11:25:44.504147 #531024] INFO -- : [406/885] 572379=test_nesting_parser I, [2024-05-23T11:25:44.526375 #531024] INFO -- : [407/885] 572379=test_gem_dependency_list I, [2024-05-23T11:25:44.528505 #531024] INFO -- : [408/885] 572380=test_benchmark I, [2024-05-23T11:25:44.531643 #531024] INFO -- : [409/885] 572390=test_gem_commands_outdated_command I, [2024-05-23T11:25:44.573018 #531024] INFO -- : [410/885] 572390=test_array I, [2024-05-23T11:25:44.597163 #531024] INFO -- : [411/885] 572379=test_helper_method I, [2024-05-23T11:25:44.603734 #531024] INFO -- : [412/885] 572379=test_gem_package_tar_writer I, [2024-05-23T11:25:44.635505 #531024] INFO -- : [413/885] 572384=test_gem_source I, [2024-05-23T11:25:44.727615 #531024] INFO -- : [414/885] 572379=test_scalar_scanner I, [2024-05-23T11:25:44.736174 #531024] INFO -- : [415/885] 572379=test_rdoc_parser_simple I, [2024-05-23T11:25:44.753610 #531024] INFO -- : [416/885] 572379=test_load I, [2024-05-23T11:25:44.757685 #531024] INFO -- : [417/885] 572379=test_yamldbm I, [2024-05-23T11:25:44.767430 #531024] INFO -- : [418/885] 572379=test_gem_commands_rebuild_command I, [2024-05-23T11:25:44.790145 #531024] INFO -- : [419/885] 572379=test_abi I, [2024-05-23T11:25:44.906451 #531024] INFO -- : [420/885] 572384=test_provider I, [2024-05-23T11:25:44.941746 #531024] INFO -- : [421/885] 572379=test_evaluation I, [2024-05-23T11:25:44.943376 #531024] INFO -- : [422/885] 572379=test_https I, [2024-05-23T11:25:45.079699 #531024] INFO -- : [423/885] 572391=test_gem_ext_builder I, [2024-05-23T11:25:45.101164 #531024] INFO -- : [424/885] 572393=test_erb I, [2024-05-23T11:25:45.146121 #531024] INFO -- : [425/885] 572393=test_x509ext I, [2024-05-23T11:25:45.147348 #531024] INFO -- : [426/885] 572393=test_gem_source_installed I, [2024-05-23T11:25:45.161520 #531024] INFO -- : [427/885] 572393=test_gem_commands_cert_command I, [2024-05-23T11:25:45.219206 #531024] INFO -- : [428/885] 572384=test_completion I, [2024-05-23T11:25:45.271167 #531024] INFO -- : [429/885] 572379=test_len I, [2024-05-23T11:25:45.281462 #531024] INFO -- : [430/885] 572379=test_yield_block I, [2024-05-23T11:25:45.288198 #531024] INFO -- : [431/885] 572379=test_rational2 I, [2024-05-23T11:25:45.294496 #531024] INFO -- : [432/885] 572379=test_rational I, [2024-05-23T11:25:45.304968 #531024] INFO -- : [433/885] 572379=test_assembler I, [2024-05-23T11:25:45.311293 #531024] INFO -- : [434/885] 572379=test_propertyputref I, [2024-05-23T11:25:45.316489 #531024] INFO -- : [435/885] 572379=attribute_write_test I, [2024-05-23T11:25:45.318316 #531024] INFO -- : [436/885] 572379=test_spell_checker I, [2024-05-23T11:25:45.323562 #531024] INFO -- : [437/885] 572379=test_yamlstore I, [2024-05-23T11:25:45.339914 #531024] INFO -- : [438/885] 572379=test_gem_installer I, [2024-05-23T11:25:45.514550 #531024] INFO -- : [439/885] 572381=test_date_strftime I, [2024-05-23T11:25:45.620425 #531024] INFO -- : [440/885] 572378=test_rdoc_parser_rd I, [2024-05-23T11:25:45.652478 #531024] INFO -- : [441/885] 572383=test_irb I, [2024-05-23T11:25:45.803640 #531024] INFO -- : [442/885] 572380=json_string_matching_test I, [2024-05-23T11:25:45.811582 #531024] INFO -- : [443/885] 572380=test_load I, [2024-05-23T11:25:45.814552 #531024] INFO -- : [444/885] 572378=test_rdoc_normal_class I, [2024-05-23T11:25:45.820226 #531024] INFO -- : [445/885] 572380=test_class I, [2024-05-23T11:25:45.870908 #531024] INFO -- : [446/885] 572381=test_const I, [2024-05-23T11:25:45.874711 #531024] INFO -- : [447/885] 572381=test_asn1 I, [2024-05-23T11:25:45.886685 #531024] INFO -- : [448/885] 572381=test_random I, [2024-05-23T11:25:45.888729 #531024] INFO -- : [449/885] 572381=test_tempfile I, [2024-05-23T11:25:45.890883 #531024] INFO -- : [450/885] 572386=test_noarg I, [2024-05-23T11:25:45.892229 #531024] INFO -- : [451/885] 572378=parse_comments_test I, [2024-05-23T11:25:45.895377 #531024] INFO -- : [452/885] 572378=test_function I, [2024-05-23T11:25:45.902161 #531024] INFO -- : [453/885] 572384=test_queue I, [2024-05-23T11:25:45.907423 #531024] INFO -- : [454/885] 572384=test_internal_ivar I, [2024-05-23T11:25:45.910187 #531024] INFO -- : [455/885] 572384=test_gem_resolver_index_specification I, [2024-05-23T11:25:45.915095 #531024] INFO -- : [456/885] 572383=test_duplicate I, [2024-05-23T11:25:45.916903 #531024] INFO -- : [457/885] 572383=test_utf32 I, [2024-05-23T11:25:45.923486 #531024] INFO -- : [458/885] 572383=test_basicsocket I, [2024-05-23T11:25:45.930515 #531024] INFO -- : [459/885] 572383=test_prettyprint I, [2024-05-23T11:25:45.938982 #531024] INFO -- : [460/885] 572383=test_tracepoint I, [2024-05-23T11:25:45.948194 #531024] INFO -- : [461/885] 572384=test_gem_commands_help_command I, [2024-05-23T11:25:46.012806 #531024] INFO -- : [462/885] 572384=test_rdoc_markup I, [2024-05-23T11:25:46.017125 #531024] INFO -- : [463/885] 572384=test_too_many_dummy_encodings I, [2024-05-23T11:25:46.062972 #531024] INFO -- : [464/885] 572384=test_rdoc_include I, [2024-05-23T11:25:46.085715 #531024] INFO -- : [465/885] 572387=test_reqarg I, [2024-05-23T11:25:46.093031 #531024] INFO -- : [466/885] 572384=test_gem_commands_list_command I, [2024-05-23T11:25:46.095915 #531024] INFO -- : [467/885] 572381=test_stack I, [2024-05-23T11:25:46.097108 #531024] INFO -- : [468/885] 572384=test_string_processing I, [2024-05-23T11:25:46.104351 #531024] INFO -- : [469/885] 572386=test_fileutils I, [2024-05-23T11:25:46.106571 #531024] INFO -- : [470/885] 572383=test_ldap I, [2024-05-23T11:25:46.109210 #531024] INFO -- : [471/885] 572384=test_emitter I, [2024-05-23T11:25:46.115930 #531024] INFO -- : [472/885] 572384=test_gem_commands_signin_command I, [2024-05-23T11:25:46.120233 #531024] INFO -- : [473/885] 572378=test_resource I, [2024-05-23T11:25:46.121898 #531024] INFO -- : [474/885] 572383=test_gem_version I, [2024-05-23T11:25:46.124372 #531024] INFO -- : [475/885] 572378=test_econv I, [2024-05-23T11:25:46.167077 #531024] INFO -- : [476/885] 572391=test_cesu8 I, [2024-05-23T11:25:46.173478 #531024] INFO -- : [477/885] 572391=test_rdoc_options I, [2024-05-23T11:25:46.178493 #531024] INFO -- : [478/885] 572388=test_inlinecache I, [2024-05-23T11:25:46.192299 #531024] INFO -- : [479/885] 572384=test_rdoc_markup_verbatim I, [2024-05-23T11:25:46.197589 #531024] INFO -- : [480/885] 572384=test_path_to_class I, [2024-05-23T11:25:46.201642 #531024] INFO -- : [481/885] 572384=test_gem_resolver_specification I, [2024-05-23T11:25:46.220991 #531024] INFO -- : [482/885] 572383=test_gem_dependency I, [2024-05-23T11:25:46.221566 #531024] INFO -- : [483/885] 572384=test_frozen_error I, [2024-05-23T11:25:46.226693 #531024] INFO -- : [484/885] 572384=test_method_cache I, [2024-05-23T11:25:46.229544 #531024] INFO -- : [485/885] 572384=test_gem_stub_specification I, [2024-05-23T11:25:46.238493 #531024] INFO -- : [486/885] 572388=test_gem_ext_ext_conf_builder I, [2024-05-23T11:25:46.323258 #531024] INFO -- : [487/885] 572383=test_complex I, [2024-05-23T11:25:46.348223 #531024] INFO -- : [488/885] 572389=test_gem_commands_search_command I, [2024-05-23T11:25:46.356702 #531024] INFO -- : [489/885] 572389=test_scanner_events I, [2024-05-23T11:25:46.387941 #531024] INFO -- : [490/885] 572389=test_gem_resolver_installed_specification I, [2024-05-23T11:25:46.393866 #531024] INFO -- : [491/885] 572386=test_parse I, [2024-05-23T11:25:46.403282 #531024] INFO -- : [492/885] 572389=test_mdns I, [2024-05-23T11:25:46.407170 #531024] INFO -- : [493/885] 572384=test_gem_remote_fetcher I, [2024-05-23T11:25:46.416811 #531024] INFO -- : [494/885] 572387=test_forwardable I, [2024-05-23T11:25:46.421142 #531024] INFO -- : [495/885] 572389=test_yaml I, [2024-05-23T11:25:46.443078 #531024] INFO -- : [496/885] 572387=test_wait I, [2024-05-23T11:25:46.458847 #531024] INFO -- : [497/885] 572383=test_handle I, [2024-05-23T11:25:46.465312 #531024] INFO -- : [498/885] 572391=test_big2str I, [2024-05-23T11:25:46.467907 #531024] INFO -- : [499/885] 572391=test_ractor I, [2024-05-23T11:25:46.483101 #531024] INFO -- : [500/885] 572391=test_euc_tw I, [2024-05-23T11:25:46.491398 #531024] INFO -- : [501/885] 572391=test_bmethod I, [2024-05-23T11:25:46.496423 #531024] INFO -- : [502/885] 572391=test_gem_commands_sources_command I, [2024-05-23T11:25:46.505141 #531024] INFO -- : [503/885] 572389=test_ansi_without_terminfo I, [2024-05-23T11:25:46.513807 #531024] INFO -- : [504/885] 572389=test_thread_queue I, [2024-05-23T11:25:46.515808 #531024] INFO -- : [505/885] 572387=test_nowrite I, [2024-05-23T11:25:46.534260 #531024] INFO -- : [506/885] 572387=test_rdoc_markup_formatter I, [2024-05-23T11:25:46.640748 #531024] INFO -- : [507/885] 572383=test_comparable I, [2024-05-23T11:25:46.645403 #531024] INFO -- : [508/885] 572383=test_rdoc_parser_c I, [2024-05-23T11:25:46.652601 #531024] INFO -- : [509/885] 572387=test_io_timeout I, [2024-05-23T11:25:46.657721 #531024] INFO -- : [510/885] 572387=test_shapes I, [2024-05-23T11:25:46.663319 #531024] INFO -- : [511/885] 572387=json_fixtures_test I, [2024-05-23T11:25:46.665681 #531024] INFO -- : [512/885] 572391=test_pstore I, [2024-05-23T11:25:46.671263 #531024] INFO -- : [513/885] 572387=test_cstr I, [2024-05-23T11:25:46.682098 #531024] INFO -- : [514/885] 572393=test_profile_frames I, [2024-05-23T11:25:46.709711 #531024] INFO -- : [515/885] 572391=test_class2name I, [2024-05-23T11:25:46.715378 #531024] INFO -- : [516/885] 572391=test_gbk I, [2024-05-23T11:25:46.720458 #531024] INFO -- : [517/885] 572391=test_enc_str_buf_cat I, [2024-05-23T11:25:46.723606 #531024] INFO -- : [518/885] 572391=test_gem_commands_contents_command I, [2024-05-23T11:25:46.787388 #531024] INFO -- : [519/885] 572391=test_gem_ext_cmake_builder I, [2024-05-23T11:25:46.802366 #531024] INFO -- : [520/885] 572391=test_require I, [2024-05-23T11:25:46.870668 #531024] INFO -- : [521/885] 572393=test_cgi_util I, [2024-05-23T11:25:46.929311 #531024] INFO -- : [522/885] 572383=test_marshalable I, [2024-05-23T11:25:46.935360 #531024] INFO -- : [523/885] 572383=test_digest I, [2024-05-23T11:25:46.946383 #531024] INFO -- : [524/885] 572385=test_ractor I, [2024-05-23T11:25:46.983673 #531024] INFO -- : [525/885] 572386=test_find I, [2024-05-23T11:25:46.990080 #531024] INFO -- : [526/885] 572386=test_fiddle I, [2024-05-23T11:25:46.991877 #531024] INFO -- : [527/885] 572381=test_wss I, [2024-05-23T11:25:47.011812 #531024] INFO -- : [528/885] 572386=test_rdoc_any_method I, [2024-05-23T11:25:47.014157 #531024] INFO -- : [529/885] 572381=test_modify_expand I, [2024-05-23T11:25:47.020710 #531024] INFO -- : [530/885] 572381=test_rdoc_markdown I, [2024-05-23T11:25:47.045082 #531024] INFO -- : [531/885] 572385=test_gem_available_set I, [2024-05-23T11:25:47.118870 #531024] INFO -- : [532/885] 572393=test_file I, [2024-05-23T11:25:47.137563 #531024] INFO -- : [533/885] 572393=regexp_test I, [2024-05-23T11:25:47.146210 #531024] INFO -- : [534/885] 572393=test_gem_package_tar_reader I, [2024-05-23T11:25:47.148230 #531024] INFO -- : [535/885] 572385=test_rdoc_encoding I, [2024-05-23T11:25:47.150995 #531024] INFO -- : [536/885] 572378=test_coverage I, [2024-05-23T11:25:47.167566 #531024] INFO -- : [537/885] 572387=test_pathname I, [2024-05-23T11:25:47.170905 #531024] INFO -- : [538/885] 572393=test_complexrational I, [2024-05-23T11:25:47.174651 #531024] INFO -- : [539/885] 572393=test_init I, [2024-05-23T11:25:47.179745 #531024] INFO -- : [540/885] 572385=test_recorder I, [2024-05-23T11:25:47.187701 #531024] INFO -- : [541/885] 572385=test_gem_source_vendor I, [2024-05-23T11:25:47.200028 #531024] INFO -- : [542/885] 572385=test_gem_commands_owner_command I, [2024-05-23T11:25:47.343421 #531024] INFO -- : [543/885] 572381=test_deprecate I, [2024-05-23T11:25:47.373686 #531024] INFO -- : [544/885] 572388=test_rdoc_constant I, [2024-05-23T11:25:47.380512 #531024] INFO -- : [545/885] 572392=test_bash_completion I, [2024-05-23T11:25:47.384109 #531024] INFO -- : [546/885] 572387=test_formatter I, [2024-05-23T11:25:47.388913 #531024] INFO -- : [547/885] 572392=test_system I, [2024-05-23T11:25:47.398336 #531024] INFO -- : [548/885] 572387=test_pkcs12 I, [2024-05-23T11:25:47.459741 #531024] INFO -- : [549/885] 572381=test_gem_package_tar_header I, [2024-05-23T11:25:47.465356 #531024] INFO -- : [550/885] 572388=test_gem_util I, [2024-05-23T11:25:47.471469 #531024] INFO -- : [551/885] 572376=test_iseq_load I, [2024-05-23T11:25:47.497689 #531024] INFO -- : [552/885] 572381=test_pkey_dh I, [2024-05-23T11:25:47.568907 #531024] INFO -- : [553/885] 572388=test_bigzero I, [2024-05-23T11:25:47.571602 #531024] INFO -- : [554/885] 572388=test_getopts I, [2024-05-23T11:25:47.573192 #531024] INFO -- : [555/885] 572386=test_protocol I, [2024-05-23T11:25:47.575331 #531024] INFO -- : [556/885] 572388=test_gem_resolver_activation_request I, [2024-05-23T11:25:47.577204 #531024] INFO -- : [557/885] 572393=test_gem_config_file I, [2024-05-23T11:25:47.580707 #531024] INFO -- : [558/885] 572388=test_ripper I, [2024-05-23T11:25:47.609525 #531024] INFO -- : [559/885] 572381=test_etc I, [2024-05-23T11:25:47.657276 #531024] INFO -- : [560/885] 572381=test_yjit_exit_locations I, [2024-05-23T11:25:47.658098 #531024] INFO -- : [561/885] 572381=test_yaml_tree I, [2024-05-23T11:25:47.685104 #531024] INFO -- : [562/885] 572381=test_sleep I, [2024-05-23T11:25:47.721305 #531024] INFO -- : [563/885] 572393=test_config I, [2024-05-23T11:25:47.733823 #531024] INFO -- : [564/885] 572385=test_libs I, [2024-05-23T11:25:47.738091 #531024] INFO -- : [565/885] 572385=test_gem_commands_fetch_command I, [2024-05-23T11:25:47.771219 #531024] INFO -- : [566/885] 572383=test_math I, [2024-05-23T11:25:47.772681 #531024] INFO -- : [567/885] 572393=test_gc I, [2024-05-23T11:25:47.777725 #531024] INFO -- : [568/885] 572393=test_io I, [2024-05-23T11:25:47.784613 #531024] INFO -- : [569/885] 572383=test_unicode_escape I, [2024-05-23T11:25:47.797489 #531024] INFO -- : [570/885] 572391=test_utf16 I, [2024-05-23T11:25:47.804962 #531024] INFO -- : [571/885] 572391=test_autoload I, [2024-05-23T11:25:47.810921 #531024] INFO -- : [572/885] 572388=test_rendering I, [2024-05-23T11:25:47.812849 #531024] INFO -- : [573/885] 572388=test_sizeof I, [2024-05-23T11:25:47.869500 #531024] INFO -- : [574/885] 572385=test_case I, [2024-05-23T11:25:47.881110 #531024] INFO -- : [575/885] 572383=test_face I, [2024-05-23T11:25:47.889442 #531024] INFO -- : [576/885] 572386=test_gem_resolver_conflict I, [2024-05-23T11:25:47.897293 #531024] INFO -- : [577/885] 572385=test_rdoc_task I, [2024-05-23T11:25:47.900111 #531024] INFO -- : [578/885] 572383=test_pack I, [2024-05-23T11:25:47.904750 #531024] INFO -- : [579/885] 572385=test_backtrace I, [2024-05-23T11:25:47.916967 #531024] INFO -- : [580/885] 572390=ruby_parser_test I, [2024-05-23T11:25:47.921689 #531024] INFO -- : [581/885] 572383=test_io_buffer I, [2024-05-23T11:25:47.931801 #531024] INFO -- : [582/885] 572378=test_rdoc_markup_indented_paragraph I, [2024-05-23T11:25:47.944906 #531024] INFO -- : [583/885] 572378=test_rdoc_require I, [2024-05-23T11:25:47.962046 #531024] INFO -- : [584/885] 572378=locals_test I, [2024-05-23T11:25:47.973344 #531024] INFO -- : [585/885] 572390=test_readpartial I, [2024-05-23T11:25:47.984219 #531024] INFO -- : [586/885] 572387=test_gem_commands_install_command I, [2024-05-23T11:25:48.010384 #531024] INFO -- : [587/885] 572386=test_clone I, [2024-05-23T11:25:48.031744 #531024] INFO -- : [588/885] 572383=test_optparse I, [2024-05-23T11:25:48.051586 #531024] INFO -- : [589/885] 572376=test_array I, [2024-05-23T11:25:48.061735 #531024] INFO -- : [590/885] 572376=test_fstring I, [2024-05-23T11:25:48.089789 #531024] INFO -- : [591/885] 572380=test_rdoc_markup_to_html_crossref I, [2024-05-23T11:25:48.095567 #531024] INFO -- : [592/885] 572383=encoding_test I, [2024-05-23T11:25:48.143050 #531024] INFO -- : [593/885] 572383=test_gem_resolver_best_set I, [2024-05-23T11:25:48.146833 #531024] INFO -- : [594/885] 572386=test_typeddata I, [2024-05-23T11:25:48.159348 #531024] INFO -- : [595/885] 572384=test_rat I, [2024-05-23T11:25:48.169572 #531024] INFO -- : [596/885] 572384=test_webauthn_poller I, [2024-05-23T11:25:48.186221 #531024] INFO -- : [597/885] 572376=test_rdoc_markup_raw I, [2024-05-23T11:25:48.191355 #531024] INFO -- : [598/885] 572376=test_stringscanner I, [2024-05-23T11:25:48.205305 #531024] INFO -- : [599/885] 572383=test_files_sample I, [2024-05-23T11:25:48.225492 #531024] INFO -- : [600/885] 572376=test_rdoc_alias I, [2024-05-23T11:25:48.227352 #531024] INFO -- : [601/885] 572392=test_yield I, [2024-05-23T11:25:48.239112 #531024] INFO -- : [602/885] 572376=parser_test I, [2024-05-23T11:25:48.245314 #531024] INFO -- : [603/885] 572376=test_convertible I, [2024-05-23T11:25:48.265411 #531024] INFO -- : [604/885] 572383=test_line_editor I, [2024-05-23T11:25:48.270986 #531024] INFO -- : [605/885] 572383=test_objspace I, [2024-05-23T11:25:48.276001 #531024] INFO -- : [606/885] 572380=ripper_test I, [2024-05-23T11:25:48.299458 #531024] INFO -- : [607/885] 572378=test_undef I, [2024-05-23T11:25:48.303520 #531024] INFO -- : [608/885] 572378=test_string_memory I, [2024-05-23T11:25:48.306525 #531024] INFO -- : [609/885] 572384=comments_test I, [2024-05-23T11:25:48.309613 #531024] INFO -- : [610/885] 572386=test_sprintf I, [2024-05-23T11:25:48.312701 #531024] INFO -- : [611/885] 572384=test_gem_requirement I, [2024-05-23T11:25:48.340657 #531024] INFO -- : [612/885] 572378=test_gem_security_trust_dir I, [2024-05-23T11:25:48.373860 #531024] INFO -- : [613/885] 572390=test_show_source I, [2024-05-23T11:25:48.393633 #531024] INFO -- : [614/885] 572384=test_set I, [2024-05-23T11:25:48.397848 #531024] INFO -- : [615/885] 572384=test_lock_native_thread I, [2024-05-23T11:25:48.480192 #531024] INFO -- : [616/885] 572378=test_c_struct_entry I, [2024-05-23T11:25:48.492182 #531024] INFO -- : [617/885] 572390=test_gem_commands_stale_command I, [2024-05-23T11:25:48.511481 #531024] INFO -- : [618/885] 572390=test_have_library I, [2024-05-23T11:25:48.615953 #531024] INFO -- : [619/885] 572386=test_remote_fetch_error I, [2024-05-23T11:25:48.629565 #531024] INFO -- : [620/885] 572386=test_gem_request_set_lockfile I, [2024-05-23T11:25:48.655767 #531024] INFO -- : [621/885] 572378=test_raise_exception I, [2024-05-23T11:25:48.669474 #531024] INFO -- : [622/885] 572384=test_protect I, [2024-05-23T11:25:48.675087 #531024] INFO -- : [623/885] 572384=test_win32ole_typelib I, [2024-05-23T11:25:48.683669 #531024] INFO -- : [624/885] 572384=test_tree_builder I, [2024-05-23T11:25:48.688899 #531024] INFO -- : [625/885] 572384=test_gem_resolver_dependency_request I, [2024-05-23T11:25:48.715423 #531024] INFO -- : [626/885] 572384=test_hash I, [2024-05-23T11:25:48.733598 #531024] INFO -- : [627/885] 572384=test_alias_and_anchor I, [2024-05-23T11:25:48.740369 #531024] INFO -- : [628/885] 572384=test_postponed_job I, [2024-05-23T11:25:48.741236 #531024] INFO -- : [629/885] 572380=test_external_new I, [2024-05-23T11:25:48.750402 #531024] INFO -- : [630/885] 572380=test_ws I, [2024-05-23T11:25:48.753658 #531024] INFO -- : [631/885] 572380=test_gem_commands_environment_command I, [2024-05-23T11:25:48.808317 #531024] INFO -- : [632/885] 572380=test_m17n I, [2024-05-23T11:25:48.869353 #531024] INFO -- : [633/885] 572380=test_weakmap I, [2024-05-23T11:25:48.965954 #531024] INFO -- : [634/885] 572386=test_workspace I, [2024-05-23T11:25:49.098252 #531024] INFO -- : [635/885] 572384=test_yjit I, [2024-05-23T11:25:49.100079 #531024] INFO -- : [636/885] 572384=test_kill_ring I, [2024-05-23T11:25:49.107132 #531024] INFO -- : [637/885] 572384=test_ns_spki I, [2024-05-23T11:25:49.128395 #531024] INFO -- : [638/885] 572384=test_framework I, [2024-05-23T11:25:49.128520 #531024] INFO -- : [639/885] 572384=test_argf I, [2024-05-23T11:25:49.146694 #531024] INFO -- : [640/885] 572385=test_type_completor I, [2024-05-23T11:25:49.148522 #531024] INFO -- : [641/885] 572385=test_console_attr I, [2024-05-23T11:25:49.151926 #531024] INFO -- : [642/885] 572385=test_summary I, [2024-05-23T11:25:49.210609 #531024] INFO -- : [643/885] 572386=test_ellipsize I, [2024-05-23T11:25:49.213830 #531024] INFO -- : [644/885] 572385=test_date_attr I, [2024-05-23T11:25:49.222591 #531024] INFO -- : [645/885] 572385=test_io_wait I, [2024-05-23T11:25:49.225365 #531024] INFO -- : [646/885] 572386=test_gem_commands_exec_command I, [2024-05-23T11:25:49.258759 #531024] INFO -- : [647/885] 572378=test_kwargs I, [2024-05-23T11:25:49.263062 #531024] INFO -- : [648/885] 572378=warnings_test I, [2024-05-23T11:25:49.274578 #531024] INFO -- : [649/885] 572378=test_sorted_set I, [2024-05-23T11:25:49.284985 #531024] INFO -- : [650/885] 572387=test_win32ole_type_event I, [2024-05-23T11:25:49.289682 #531024] INFO -- : [651/885] 572395=test_emoji I, [2024-05-23T11:25:49.292305 #531024] INFO -- : [652/885] 572387=test_ubf_async_safe I, [2024-05-23T11:25:49.299303 #531024] INFO -- : [653/885] 572387=test_hash I, [2024-05-23T11:25:49.330908 #531024] INFO -- : [654/885] 572395=test_io I, [2024-05-23T11:25:49.514879 #531024] INFO -- : [655/885] 572378=test_cp949 I, [2024-05-23T11:25:49.534111 #531024] INFO -- : [656/885] 572378=test_gem_commands_uninstall_command I, [2024-05-23T11:25:49.536521 #531024] INFO -- : [657/885] 572395=test_foreach I, [2024-05-23T11:25:49.540369 #531024] INFO -- : [658/885] 572395=test_gem_source_specific_file I, [2024-05-23T11:25:49.547540 #531024] INFO -- : [659/885] 572385=test_condition I, [2024-05-23T11:25:49.550424 #531024] INFO -- : [660/885] 572390=test_gem_unsatisfiable_dependency_error I, [2024-05-23T11:25:49.553612 #531024] INFO -- : [661/885] 572385=test_win32ole_record I, [2024-05-23T11:25:49.555652 #531024] INFO -- : [662/885] 572385=test_gem_commands_query_command I, [2024-05-23T11:25:49.562883 #531024] INFO -- : [663/885] 572390=test_method I, [2024-05-23T11:25:49.633432 #531024] INFO -- : [664/885] 572395=test_rdoc_rubygems_hook I, [2024-05-23T11:25:49.722848 #531024] INFO -- : [665/885] 572395=test_to_ruby I, [2024-05-23T11:25:49.732369 #531024] INFO -- : [666/885] 572381=test_pattern_key_name_check I, [2024-05-23T11:25:49.739350 #531024] INFO -- : [667/885] 572395=test_gem_impossible_dependencies_error I, [2024-05-23T11:25:49.741240 #531024] INFO -- : [668/885] 572381=test_array_create I, [2024-05-23T11:25:49.742471 #531024] INFO -- : [669/885] 572395=test_pack I, [2024-05-23T11:25:49.742805 #531024] INFO -- : [670/885] 572381=test_ftp I, [2024-05-23T11:25:49.750655 #531024] INFO -- : [671/885] 572381=test_rdoc_context_section I, [2024-05-23T11:25:49.760621 #531024] INFO -- : [672/885] 572381=test_euc_kr I, [2024-05-23T11:25:49.785958 #531024] INFO -- : [673/885] 572381=test_files_ext I, [2024-05-23T11:25:49.899756 #531024] INFO -- : [674/885] 572381=test_bug-5832 I, [2024-05-23T11:25:49.902085 #531024] INFO -- : [675/885] 572381=test_gem_silent_ui I, [2024-05-23T11:25:49.923889 #531024] INFO -- : [676/885] 572379=test_emitter I, [2024-05-23T11:25:49.926023 #531024] INFO -- : [677/885] 572379=test_gem_doctor I, [2024-05-23T11:25:49.940875 #531024] INFO -- : [678/885] 572381=test_kdf I, [2024-05-23T11:25:49.951745 #531024] INFO -- : [679/885] 572395=test_eval_history I, [2024-05-23T11:25:49.955371 #531024] INFO -- : [680/885] 572379=dispatcher_test I, [2024-05-23T11:25:49.974841 #531024] INFO -- : [681/885] 572379=test_kernel I, [2024-05-23T11:25:49.997640 #531024] INFO -- : [682/885] 572381=test_rdoc_markup_paragraph I, [2024-05-23T11:25:49.998447 #531024] INFO -- : [683/885] 572381=test_enc_raise I, [2024-05-23T11:25:50.007052 #531024] INFO -- : [684/885] 572381=test_psych I, [2024-05-23T11:25:50.019371 #531024] INFO -- : [685/885] 572381=!Nothing_to_test I, [2024-05-23T11:25:50.020676 #531024] INFO -- : [686/885] 572381=test_object_create_start I, [2024-05-23T11:25:50.020721 #531024] INFO -- : [687/885] 572381=test_at_exit I, [2024-05-23T11:25:50.026345 #531024] INFO -- : [688/885] 572395=test_command I, [2024-05-23T11:25:50.040858 #531024] INFO -- : [689/885] 572381=test_gem_ext_cargo_builder_unit I, [2024-05-23T11:25:50.071807 #531024] INFO -- : [690/885] 572381=test_gem_rdoc I, [2024-05-23T11:25:50.154821 #531024] INFO -- : [691/885] 572385=test_date I, [2024-05-23T11:25:50.155392 #531024] INFO -- : [692/885] 572386=test_hmac I, [2024-05-23T11:25:50.163228 #531024] INFO -- : [693/885] 572385=test_rdoc_markup_to_tt_only I, [2024-05-23T11:25:50.168678 #531024] INFO -- : [694/885] 572386=test_rdoc_tom_doc I, [2024-05-23T11:25:50.177745 #531024] INFO -- : [695/885] 572386=test_assignment I, [2024-05-23T11:25:50.197972 #531024] INFO -- : [696/885] 572385=test_ifunless I, [2024-05-23T11:25:50.201524 #531024] INFO -- : [697/885] 572385=test_gem_commands_lock_command I, [2024-05-23T11:25:50.225171 #531024] INFO -- : [698/885] 572385=test_numeric I, [2024-05-23T11:25:50.231060 #531024] INFO -- : [699/885] 572381=test_common I, [2024-05-23T11:25:50.273022 #531024] INFO -- : [700/885] 572385=test_gem_spec_fetcher I, [2024-05-23T11:25:50.283360 #531024] INFO -- : [701/885] 572378=test_gem_command I, [2024-05-23T11:25:50.305437 #531024] INFO -- : [702/885] 572395=test_bug-3571 I, [2024-05-23T11:25:50.321962 #531024] INFO -- : [703/885] 572395=test_key_actor_vi I, [2024-05-23T11:25:50.354447 #531024] INFO -- : [704/885] 572378=test_address_resolve I, [2024-05-23T11:25:50.367132 #531024] INFO -- : [705/885] 572378=test_rdoc_token_stream I, [2024-05-23T11:25:50.378836 #531024] INFO -- : [706/885] 572378=test_config I, [2024-05-23T11:25:50.402875 #531024] INFO -- : [707/885] 572395=test_optarg I, [2024-05-23T11:25:50.413021 #531024] INFO -- : [708/885] 572385=test_yaml_special_cases I, [2024-05-23T11:25:50.425533 #531024] INFO -- : [709/885] 572385=test_gem_source_list I, [2024-05-23T11:25:50.435335 #531024] INFO -- : [710/885] 572381=test_macro I, [2024-05-23T11:25:50.446296 #531024] INFO -- : [711/885] 572378=test_frozen I, [2024-05-23T11:25:50.449300 #531024] INFO -- : [712/885] 572378=test_gem_ext_configure_builder I, [2024-05-23T11:25:50.464108 #531024] INFO -- : [713/885] 572385=test_pp I, [2024-05-23T11:25:50.503629 #531024] INFO -- : [714/885] 572385=test_verbose I, [2024-05-23T11:25:50.513598 #531024] INFO -- : [715/885] 572385=test_rdoc_single_class I, [2024-05-23T11:25:50.515310 #531024] INFO -- : [716/885] 572381=test_num2int I, [2024-05-23T11:25:50.519151 #531024] INFO -- : [717/885] 572385=test_nil I, [2024-05-23T11:25:50.521742 #531024] INFO -- : [718/885] 572385=test_zsh_completion I, [2024-05-23T11:25:50.524002 #531024] INFO -- : [719/885] 572381=test_exception I, [2024-05-23T11:25:50.525904 #531024] INFO -- : [720/885] 572385=test_iter_break I, [2024-05-23T11:25:50.526912 #531024] INFO -- : [721/885] 572378=test_ole_methods I, [2024-05-23T11:25:50.529544 #531024] INFO -- : [722/885] 572381=test_erb_m17n I, [2024-05-23T11:25:50.530216 #531024] INFO -- : [723/885] 572385=test_date_conv I, [2024-05-23T11:25:50.530417 #531024] INFO -- : [724/885] 572395=test_optimization I, [2024-05-23T11:25:50.530693 #531024] INFO -- : [725/885] 572378=test_zlib I, [2024-05-23T11:25:50.535318 #531024] INFO -- : [726/885] 572385=test_cgi_tag_helper I, [2024-05-23T11:25:50.540064 #531024] INFO -- : [727/885] 572381=test_egrep_cpp I, [2024-05-23T11:25:50.560903 #531024] INFO -- : [728/885] 572385=test_gem_resolver_index_set I, [2024-05-23T11:25:50.595800 #531024] INFO -- : [729/885] 572385=test_gem_package_old I, [2024-05-23T11:25:50.596349 #531024] INFO -- : [730/885] 572379=test_gc_compact I, [2024-05-23T11:25:50.633975 #531024] INFO -- : [731/885] 572385=test_string I, [2024-05-23T11:25:50.711918 #531024] INFO -- : [732/885] 572381=test_proc I, [2024-05-23T11:25:50.721237 #531024] INFO -- : [733/885] 572389=test_gem_validator I, [2024-05-23T11:25:50.747541 #531024] INFO -- : [734/885] 572389=test_fnmatch I, [2024-05-23T11:25:50.808733 #531024] INFO -- : [735/885] 572389=test_files_test_2 I, [2024-05-23T11:25:50.946249 #531024] INFO -- : [736/885] 572388=test_rdoc_markup_parser I, [2024-05-23T11:25:50.985829 #531024] INFO -- : [737/885] 572388=test_require_path_check I, [2024-05-23T11:25:51.088507 #531024] INFO -- : [738/885] 572388=test_folderitem2_invokeverb I, [2024-05-23T11:25:51.094939 #531024] INFO -- : [739/885] 572388=test_string I, [2024-05-23T11:25:51.126035 #531024] INFO -- : [740/885] 572388=test_rdoc_stats I, [2024-05-23T11:25:51.155487 #531024] INFO -- : [741/885] 572388=test_pattern_matching I, [2024-05-23T11:25:51.187595 #531024] INFO -- : [742/885] 572388=test_depth_first I, [2024-05-23T11:25:51.200797 #531024] INFO -- : [743/885] 572388=test_gem_request_set_lockfile_parser I, [2024-05-23T11:25:51.316829 #531024] INFO -- : [744/885] 572388=test_x509attr I, [2024-05-23T11:25:51.321981 #531024] INFO -- : [745/885] 572388=test_raise I, [2024-05-23T11:25:51.338312 #531024] INFO -- : [746/885] 572388=test_rdoc_store I, [2024-05-23T11:25:51.627631 #531024] INFO -- : [747/885] 572392=test_custom_command I, [2024-05-23T11:25:51.638844 #531024] INFO -- : [748/885] 572381=json_addition_test I, [2024-05-23T11:25:51.645552 #531024] INFO -- : [749/885] 572392=test_gem_dependency_resolution_error I, [2024-05-23T11:25:51.656657 #531024] INFO -- : [750/885] 572392=test_qsort I, [2024-05-23T11:25:51.660735 #531024] INFO -- : [751/885] 572381=test_rdoc_parser I, [2024-05-23T11:25:51.663830 #531024] INFO -- : [752/885] 572392=test_rdoc_markup_to_rdoc I, [2024-05-23T11:25:51.690235 #531024] INFO -- : [753/885] 572392=test_rdoc_rd_inline_parser I, [2024-05-23T11:25:51.724023 #531024] INFO -- : [754/885] 572392=test_default_gems I, [2024-05-23T11:25:51.739078 #531024] INFO -- : [755/885] 572381=test_null I, [2024-05-23T11:25:51.756973 #531024] INFO -- : [756/885] 572381=test_win32ole_type I, [2024-05-23T11:25:51.757980 #531024] INFO -- : [757/885] 572381=test_mul I, [2024-05-23T11:25:51.770483 #531024] INFO -- : [758/885] 572381=test_rdoc_markup_attributes I, [2024-05-23T11:25:51.774195 #531024] INFO -- : [759/885] 572381=test_date_parse I, [2024-05-23T11:25:51.774932 #531024] INFO -- : [760/885] 572392=test_pkey_ec I, [2024-05-23T11:25:51.858061 #531024] INFO -- : [761/885] 572392=test_thread I, [2024-05-23T11:25:51.860583 #531024] INFO -- : [762/885] 572392=test_trick I, [2024-05-23T11:25:51.909395 #531024] INFO -- : [763/885] 572381=test_pipe I, [2024-05-23T11:25:51.992662 #531024] INFO -- : [764/885] 572386=test_rdoc_i18n_text I, [2024-05-23T11:25:52.000163 #531024] INFO -- : [765/885] 572386=test_io_buffer I, [2024-05-23T11:25:52.050838 #531024] INFO -- : [766/885] 572386=test_key_name_check I, [2024-05-23T11:25:52.071782 #531024] INFO -- : [767/885] 572386=test_backtrace I, [2024-05-23T11:25:52.073965 #531024] INFO -- : [768/885] 572386=test_defined I, [2024-05-23T11:25:52.080859 #531024] INFO -- : [769/885] 572381=test_rdoc_rdoc I, [2024-05-23T11:25:52.126747 #531024] INFO -- : [770/885] 572388=test_time I, [2024-05-23T11:25:52.130548 #531024] INFO -- : [771/885] 572391=test_windows_1251 I, [2024-05-23T11:25:52.139651 #531024] INFO -- : [772/885] 572391=test_buffering I, [2024-05-23T11:25:52.141316 #531024] INFO -- : [773/885] 572391=test_svcb_https I, [2024-05-23T11:25:52.161808 #531024] INFO -- : [774/885] 572381=test_gb18030 I, [2024-05-23T11:25:52.165554 #531024] INFO -- : [775/885] 572386=test_gem_uninstaller I, [2024-05-23T11:25:52.166229 #531024] INFO -- : [776/885] 572381=test_scalar I, [2024-05-23T11:25:52.169550 #531024] INFO -- : [777/885] 572381=test_gem_dependency_installer I, [2024-05-23T11:25:52.198622 #531024] INFO -- : [778/885] 572391=test_gem_commands_info_command I, [2024-05-23T11:25:52.207833 #531024] INFO -- : [779/885] 572394=test_rdoc_cross_reference I, [2024-05-23T11:25:52.209017 #531024] INFO -- : [780/885] 572391=test_store I, [2024-05-23T11:25:52.284142 #531024] INFO -- : [781/885] 572388=test_case_options I, [2024-05-23T11:25:52.305951 #531024] INFO -- : [782/885] 572388=test_exception I, [2024-05-23T11:25:52.407267 #531024] INFO -- : [783/885] 572391=test_rand I, [2024-05-23T11:25:52.716192 #531024] INFO -- : [784/885] 572380=test_gem_package_tar_reader_entry I, [2024-05-23T11:25:52.753956 #531024] INFO -- : [785/885] 572394=test_gem_name_tuple I, [2024-05-23T11:25:52.773802 #531024] INFO -- : [786/885] 572394=test_bug_reporter I, [2024-05-23T11:25:52.781595 #531024] INFO -- : [787/885] 572391=test_gem_ext_cargo_builder_link_flag_converter I, [2024-05-23T11:25:52.823919 #531024] INFO -- : [788/885] 572391=test_gem_commands_mirror I, [2024-05-23T11:25:52.833676 #531024] INFO -- : [789/885] 572391=test_sprintf_comb I, [2024-05-23T11:25:52.874206 #531024] INFO -- : [790/885] 572376=test_method_cache I, [2024-05-23T11:25:52.890071 #531024] INFO -- : [791/885] 572376=test_gem_request I, [2024-05-23T11:25:52.914323 #531024] INFO -- : [792/885] 572380=test_scan_args I, [2024-05-23T11:25:52.928905 #531024] INFO -- : [793/885] 572380=test_generic I, [2024-05-23T11:25:52.960869 #531024] INFO -- : [794/885] 572380=test_win32ole I, [2024-05-23T11:25:52.969651 #531024] INFO -- : [795/885] 572380=test_gem_text I, [2024-05-23T11:25:52.983446 #531024] INFO -- : [796/885] 572391=test_settracefunc I, [2024-05-23T11:25:53.020994 #531024] INFO -- : [797/885] 572380=test_enumerator_kw I, [2024-05-23T11:25:53.032843 #531024] INFO -- : [798/885] 572380=test_parser_events I, [2024-05-23T11:25:53.077374 #531024] INFO -- : [799/885] 572376=test_reline I, [2024-05-23T11:25:53.114474 #531024] INFO -- : [800/885] 572380=test_case I, [2024-05-23T11:25:53.116334 #531024] INFO -- : [801/885] 572380=test_pkey I, [2024-05-23T11:25:53.169657 #531024] INFO -- : [802/885] 572380=test_gem_request_connection_pools I, [2024-05-23T11:25:53.211608 #531024] INFO -- : [803/885] 572394=test_gem_version_option I, [2024-05-23T11:25:53.259358 #531024] INFO -- : [804/885] 572394=test_grapheme_breaks I, [2024-05-23T11:25:53.283166 #531024] INFO -- : [805/885] 572394=test_cclass I, [2024-05-23T11:25:53.387172 #531024] INFO -- : [806/885] 572386=test_ractor I, [2024-05-23T11:25:53.402309 #531024] INFO -- : [807/885] 572394=test_m17n_comb I, [2024-05-23T11:25:53.418789 #531024] INFO -- : [808/885] 572376=test_memory_view I, [2024-05-23T11:25:53.456549 #531024] INFO -- : [809/885] 572386=test_json_tree I, [2024-05-23T11:25:53.463369 #531024] INFO -- : [810/885] 572386=test_rdoc_markup_to_markdown I, [2024-05-23T11:25:53.483063 #531024] INFO -- : [811/885] 572384=test_rdoc_generator_pot_po I, [2024-05-23T11:25:53.490539 #531024] INFO -- : [812/885] 572384=test_ansi_with_terminfo I, [2024-05-23T11:25:53.496204 #531024] INFO -- : [813/885] 572384=test_require_lib I, [2024-05-23T11:25:53.544168 #531024] INFO -- : [814/885] 572386=test_gem_install_update_options I, [2024-05-23T11:25:53.558079 #531024] INFO -- : [815/885] 572387=parse_test I, [2024-05-23T11:25:53.574595 #531024] INFO -- : [816/885] 572376=test_ractor I, [2024-05-23T11:25:53.590648 #531024] INFO -- : [817/885] 572376=test_severity I, [2024-05-23T11:25:53.596001 #531024] INFO -- : [818/885] 572376=test_gem_stream_ui I, [2024-05-23T11:25:53.636986 #531024] INFO -- : [819/885] 572379=test_extlibs I, [2024-05-23T11:25:53.663962 #531024] INFO -- : [820/885] 572376=test_rdoc_generator_ri I, [2024-05-23T11:25:53.668882 #531024] INFO -- : [821/885] 572386=test_str2big I, [2024-05-23T11:25:53.670423 #531024] INFO -- : [822/885] 572376=test_dot_dot I, [2024-05-23T11:25:53.672891 #531024] INFO -- : [823/885] 572386=test_c_struct_builder I, [2024-05-23T11:25:53.674797 #531024] INFO -- : [824/885] 572376=test_literal I, [2024-05-23T11:25:53.768803 #531024] INFO -- : [825/885] 572390=test_thread I, [2024-05-23T11:25:53.786014 #531024] INFO -- : [826/885] 572378=test_socket I, [2024-05-23T11:25:53.814964 #531024] INFO -- : [827/885] 572386=test_objectspace I, [2024-05-23T11:25:53.986655 #531024] INFO -- : [828/885] 572390=test_rdoc_markup_to_table_of_contents I, [2024-05-23T11:25:54.004487 #531024] INFO -- : [829/885] 572391=test_c_union_entity I, [2024-05-23T11:25:54.009363 #531024] INFO -- : [830/885] 572390=test_rdoc_normal_module I, [2024-05-23T11:25:54.055169 #531024] INFO -- : [831/885] 572392=test_rdoc_markdown_test I, [2024-05-23T11:25:54.071783 #531024] INFO -- : [832/885] 572391=test_logperiod I, [2024-05-23T11:25:54.080338 #531024] INFO -- : [833/885] 572391=test_securerandom I, [2024-05-23T11:25:54.102706 #531024] INFO -- : [834/885] 572390=test_switch_hitter I, [2024-05-23T11:25:54.113836 #531024] INFO -- : [835/885] 572391=test_singleton I, [2024-05-23T11:25:54.118562 #531024] INFO -- : [836/885] 572390=test_flush I, [2024-05-23T11:25:54.120196 #531024] INFO -- : [837/885] 572390=test_io_console I, [2024-05-23T11:25:54.125136 #531024] INFO -- : [838/885] 572391=test_hash_create I, [2024-05-23T11:25:54.126786 #531024] INFO -- : [839/885] 572391=test_stringchar I, [2024-05-23T11:25:54.227910 #531024] INFO -- : [840/885] 572380=test_uncorrectable_name_check I, [2024-05-23T11:25:54.232961 #531024] INFO -- : [841/885] 572380=newline_test I, [2024-05-23T11:25:54.240246 #531024] INFO -- : [842/885] 572391=test_thread_fd_close I, [2024-05-23T11:25:54.244856 #531024] INFO -- : [843/885] 572391=test_passing_block I, [2024-05-23T11:25:54.250328 #531024] INFO -- : [844/885] 572391=test_pack I, [2024-05-23T11:25:54.297883 #531024] INFO -- : [845/885] 572380=test_last_thread I, [2024-05-23T11:25:54.372314 #531024] INFO -- : .Leaked thread: TestSocket#test_accept_loop_multi_port: # I, [2024-05-23T11:25:54.406981 #531024] INFO -- : [846/885] 572376=test_process I, [2024-05-23T11:25:54.450031 #531024] INFO -- : Finished thread: TestSocket#test_tcp_socket_v6_address_passed: # I, [2024-05-23T11:25:54.464034 #531024] INFO -- : [847/885] 572391=test_gem_source_local I, [2024-05-23T11:25:54.522224 #531024] INFO -- : [848/885] 572389=test_gem_security_policy I, [2024-05-23T11:25:54.631052 #531024] INFO -- : [849/885] 572381=test_logdevice I, [2024-05-23T11:25:54.677175 #531024] INFO -- : [850/885] 572391=test_arity I, [2024-05-23T11:25:54.682744 #531024] INFO -- : [851/885] 572391=test_gem_ext_rake_builder I, [2024-05-23T11:25:54.765643 #531024] INFO -- : [852/885] 572386=test_gc I, [2024-05-23T11:25:54.794782 #531024] INFO -- : [853/885] 572389=test_x509cert I, [2024-05-23T11:25:54.898382 #531024] INFO -- : [854/885] 572378=test_err_in_callback I, [2024-05-23T11:25:54.899411 #531024] INFO -- : [855/885] 572378=test_gem_resolver_lock_specification I, [2024-05-23T11:25:54.905650 #531024] INFO -- : [856/885] 572382=test_enumerator I, [2024-05-23T11:25:54.931015 #531024] INFO -- : [857/885] 572378=test_flags I, [2024-05-23T11:25:55.046939 #531024] INFO -- : [858/885] 572389=test_inadvertent_creation I, [2024-05-23T11:25:55.065891 #531024] INFO -- : [859/885] 572388=test_gem_commands_which_command I, [2024-05-23T11:25:55.095733 #531024] INFO -- : [860/885] 572388=test_shift_jis I, [2024-05-23T11:25:55.100818 #531024] INFO -- : [861/885] 572388=test_http I, [2024-05-23T11:25:55.123617 #531024] INFO -- : [862/885] 572388=test_gem_commands_specification_command I, [2024-05-23T11:25:55.123998 #531024] INFO -- : [863/885] 572389=test_safe_load I, [2024-05-23T11:25:55.133102 #531024] INFO -- : [864/885] 572389=test_gem_resolver_composed_set I, [2024-05-23T11:25:55.145447 #531024] INFO -- : [865/885] 572389=test_gem_resolver I, [2024-05-23T11:25:55.153802 #531024] INFO -- : [866/885] 572394=test_gem_commands_dependency_command I, [2024-05-23T11:25:55.219682 #531024] INFO -- : [867/885] 572394=test_rdoc_markup_attribute_manager I, [2024-05-23T11:25:55.249910 #531024] INFO -- : [868/885] 572394=test_name_error I, [2024-05-23T11:25:55.300493 #531024] INFO -- : [869/885] 572388=test_rdoc_parser_ruby I, [2024-05-23T11:25:55.328929 #531024] INFO -- : [870/885] 572389=test_httpresponse I, [2024-05-23T11:25:55.331664 #531024] INFO -- : [871/885] 572394=test_open-uri I, [2024-05-23T11:25:55.374266 #531024] INFO -- : [872/885] 572380=test_stream I, [2024-05-23T11:25:55.383674 #531024] INFO -- : [873/885] 572380=test_nil2vtempty I, [2024-05-23T11:25:55.389270 #531024] INFO -- : [874/885] 572380=test_rdoc_context I, [2024-05-23T11:25:55.405821 #531024] INFO -- : [875/885] 572389=test_rdoc_text I, [2024-05-23T11:25:55.418126 #531024] INFO -- : [876/885] 572381=test_iso_8859 I, [2024-05-23T11:25:55.428497 #531024] INFO -- : [877/885] 572391=test_tcp I, [2024-05-23T11:25:55.466993 #531024] INFO -- : [878/885] 572392=test_data I, [2024-05-23T11:25:55.471305 #531024] INFO -- : [879/885] 572391=test_date_new I, [2024-05-23T11:25:55.478020 #531024] INFO -- : [880/885] 572392=index_write_test I, [2024-05-23T11:25:55.479863 #531024] INFO -- : [881/885] 572381=test_require I, [2024-05-23T11:25:55.481301 #531024] INFO -- : [882/885] 572391=test_date_time I, [2024-05-23T11:25:55.482429 #531024] INFO -- : [883/885] 572381=test_rdoc_markup_to_joined_paragraph I, [2024-05-23T11:25:55.484757 #531024] INFO -- : [884/885] 572392=test_gem_safe_yaml I, [2024-05-23T11:25:55.485397 #531024] INFO -- : [885/885] 572381=test_syntax I, [2024-05-23T11:26:10.372594 #531024] INFO -- : Finished tests in 34.325871s, 768.5748 tests/s, 272424.7230 assertions/s. I, [2024-05-23T11:26:10.373188 #531024] INFO -- : 26382 tests, 9351216 assertions, 0 failures, 0 errors, 304 skips I, [2024-05-23T11:26:10.373209 #531024] INFO -- : I, [2024-05-23T11:26:10.373216 #531024] INFO -- : ruby -v: ruby 3.4.0dev (2024-05-23T10:28:02Z master a99d79dd31) [x86_64-linux] I, [2024-05-23T11:26:10.375244 #531024] INFO -- : $$$[end] "make yes-test-all TESTOPTS='--stderr-on-failure' TESTS='-j20'" exit with 0. I, [2024-05-23T11:26:10.375389 #531024] INFO -- : $$$[beg] make yes-test-rubyspec MSPECOPT='--error-output stderr --debug -j' TESTS='-j20' I, [2024-05-23T11:26:10.465323 #531024] INFO -- : BASERUBY = /usr/bin/ruby --disable=gems I, [2024-05-23T11:26:10.465365 #531024] INFO -- : CC = gcc I, [2024-05-23T11:26:10.465372 #531024] INFO -- : LD = ld I, [2024-05-23T11:26:10.465376 #531024] INFO -- : LDSHARED = gcc -shared I, [2024-05-23T11:26:10.465380 #531024] INFO -- : CFLAGS = -O3 -fno-fast-math -ggdb3 -Wall -Wextra -Wdeprecated-declarations -Wdiv-by-zero -Wduplicated-cond -Wimplicit-function-declaration -Wimplicit-int -Wpointer-arith -Wwrite-strings -Wold-style-definition -Wimplicit-fallthrough=0 -Wmissing-noreturn -Wno-cast-function-type -Wno-constant-logical-operand -Wno-long-long -Wno-missing-field-initializers -Wno-overlength-strings -Wno-packed-bitfield-compat -Wno-parentheses-equality -Wno-self-assign -Wno-tautological-compare -Wno-unused-parameter -Wno-unused-value -Wsuggest-attribute=format -Wsuggest-attribute=noreturn -Wunused-variable -Wmisleading-indentation -Wundef -fPIC I, [2024-05-23T11:26:10.465385 #531024] INFO -- : XCFLAGS = -U_FORTIFY_SOURCE -D_FORTIFY_SOURCE=2 -fstack-protector-strong -fno-strict-overflow -fvisibility=hidden -fexcess-precision=standard -DRUBY_EXPORT -I. -I.ext/include/x86_64-linux -I/tmp/ruby/src/trunk/include -I/tmp/ruby/src/trunk -I/tmp/ruby/src/trunk/prism -I/tmp/ruby/src/trunk/enc/unicode/15.0.0 I, [2024-05-23T11:26:10.465389 #531024] INFO -- : CPPFLAGS = I, [2024-05-23T11:26:10.465393 #531024] INFO -- : DLDFLAGS = -Wl,--compress-debug-sections=zlib -Wl,-soname,libruby.so.3.4 -fstack-protector-strong I, [2024-05-23T11:26:10.465396 #531024] INFO -- : SOLIBS = -lz -lrt -lrt -lgmp -ldl -lcrypt -lm -lpthread I, [2024-05-23T11:26:10.465400 #531024] INFO -- : LANG = en_US.UTF-8 I, [2024-05-23T11:26:10.465403 #531024] INFO -- : LC_ALL = I, [2024-05-23T11:26:10.465407 #531024] INFO -- : LC_CTYPE = I, [2024-05-23T11:26:10.465410 #531024] INFO -- : MFLAGS = I, [2024-05-23T11:26:10.465414 #531024] INFO -- : RUSTC = no I, [2024-05-23T11:26:10.465418 #531024] INFO -- : YJIT_RUSTC_ARGS = --crate-name=yjit --crate-type=staticlib --edition=2021 -g -C lto=thin -C opt-level=3 -C overflow-checks=on '--out-dir=/tmp/ruby/build/trunk/yjit/target/release/' /tmp/ruby/src/trunk/yjit/src/lib.rs I, [2024-05-23T11:26:10.465985 #531024] INFO -- : gcc (Ubuntu 11.4.0-1ubuntu1~22.04) 11.4.0 I, [2024-05-23T11:26:10.466010 #531024] INFO -- : Copyright (C) 2021 Free Software Foundation, Inc. I, [2024-05-23T11:26:10.466020 #531024] INFO -- : This is free software; see the source for copying conditions. There is NO I, [2024-05-23T11:26:10.466027 #531024] INFO -- : warranty; not even for MERCHANTABILITY or FITNESS FOR A PARTICULAR PURPOSE. I, [2024-05-23T11:26:10.466034 #531024] INFO -- : I, [2024-05-23T11:26:10.467593 #531024] INFO -- : generating enc.mk I, [2024-05-23T11:26:10.584718 #531024] INFO -- : generating encdb.h I, [2024-05-23T11:26:10.608936 #531024] INFO -- : encdb.h unchanged I, [2024-05-23T11:26:10.610011 #531024] INFO -- : making enc I, [2024-05-23T11:26:10.630125 #531024] INFO -- : make[1]: Entering directory '/tmp/ruby/build/trunk' I, [2024-05-23T11:26:10.630154 #531024] INFO -- : make[1]: Nothing to be done for 'enc'. I, [2024-05-23T11:26:10.630161 #531024] INFO -- : make[1]: Leaving directory '/tmp/ruby/build/trunk' I, [2024-05-23T11:26:10.630966 #531024] INFO -- : making srcs under enc I, [2024-05-23T11:26:10.666521 #531024] INFO -- : make[1]: Entering directory '/tmp/ruby/build/trunk' I, [2024-05-23T11:26:10.666541 #531024] INFO -- : make[1]: Nothing to be done for 'srcs'. I, [2024-05-23T11:26:10.666547 #531024] INFO -- : make[1]: Leaving directory '/tmp/ruby/build/trunk' I, [2024-05-23T11:26:10.667275 #531024] INFO -- : generating transdb.h I, [2024-05-23T11:26:10.763062 #531024] INFO -- : transdb.h unchanged I, [2024-05-23T11:26:10.764374 #531024] INFO -- : making trans I, [2024-05-23T11:26:10.797893 #531024] INFO -- : make[1]: Entering directory '/tmp/ruby/build/trunk' I, [2024-05-23T11:26:10.797917 #531024] INFO -- : make[1]: Nothing to be done for 'trans'. I, [2024-05-23T11:26:10.797935 #531024] INFO -- : make[1]: Leaving directory '/tmp/ruby/build/trunk' I, [2024-05-23T11:26:10.798656 #531024] INFO -- : making encs I, [2024-05-23T11:26:10.837220 #531024] INFO -- : make[1]: Entering directory '/tmp/ruby/build/trunk' I, [2024-05-23T11:26:10.837241 #531024] INFO -- : make[1]: Nothing to be done for 'encs'. I, [2024-05-23T11:26:10.837246 #531024] INFO -- : make[1]: Leaving directory '/tmp/ruby/build/trunk' I, [2024-05-23T11:26:10.838903 #531024] INFO -- : generating makefiles ext/configure-ext.mk I, [2024-05-23T11:26:10.865585 #531024] INFO -- : ext/configure-ext.mk updated I, [2024-05-23T11:26:10.867943 #531024] INFO -- : make[1]: Entering directory '/tmp/ruby/build/trunk' I, [2024-05-23T11:26:12.270236 #531024] INFO -- : make[1]: Leaving directory '/tmp/ruby/build/trunk' I, [2024-05-23T11:26:12.270855 #531024] INFO -- : generating makefile exts.mk I, [2024-05-23T11:26:12.307750 #531024] INFO -- : exts.mk unchanged I, [2024-05-23T11:26:12.312634 #531024] INFO -- : make[1]: Entering directory '/tmp/ruby/build/trunk' I, [2024-05-23T11:26:12.635649 #531024] INFO -- : make[2]: Entering directory '/tmp/ruby/build/trunk/ext/coverage' I, [2024-05-23T11:26:12.640444 #531024] INFO -- : make[2]: Leaving directory '/tmp/ruby/build/trunk/ext/coverage' I, [2024-05-23T11:26:12.647257 #531024] INFO -- : make[2]: Entering directory '/tmp/ruby/build/trunk/ext/date' I, [2024-05-23T11:26:12.652471 #531024] INFO -- : make[2]: Leaving directory '/tmp/ruby/build/trunk/ext/date' I, [2024-05-23T11:26:12.656395 #531024] INFO -- : make[2]: Entering directory '/tmp/ruby/build/trunk/ext/digest' I, [2024-05-23T11:26:12.665159 #531024] INFO -- : make[2]: Leaving directory '/tmp/ruby/build/trunk/ext/digest' I, [2024-05-23T11:26:12.691508 #531024] INFO -- : make[2]: Entering directory '/tmp/ruby/build/trunk/ext/digest/sha2' I, [2024-05-23T11:26:12.696375 #531024] INFO -- : make[2]: Leaving directory '/tmp/ruby/build/trunk/ext/digest/sha2' I, [2024-05-23T11:26:12.717717 #531024] INFO -- : make[2]: Entering directory '/tmp/ruby/build/trunk/ext/fiddle' I, [2024-05-23T11:26:12.728545 #531024] INFO -- : make[2]: Leaving directory '/tmp/ruby/build/trunk/ext/fiddle' I, [2024-05-23T11:26:12.733639 #531024] INFO -- : make[2]: Entering directory '/tmp/ruby/build/trunk/ext/io/console' I, [2024-05-23T11:26:12.737840 #531024] INFO -- : make[2]: Leaving directory '/tmp/ruby/build/trunk/ext/io/console' I, [2024-05-23T11:26:12.750588 #531024] INFO -- : make[2]: Entering directory '/tmp/ruby/build/trunk/ext/json' I, [2024-05-23T11:26:12.761317 #531024] INFO -- : make[2]: Leaving directory '/tmp/ruby/build/trunk/ext/json' I, [2024-05-23T11:26:12.776481 #531024] INFO -- : make[2]: Entering directory '/tmp/ruby/build/trunk/ext/monitor' I, [2024-05-23T11:26:12.780541 #531024] INFO -- : make[2]: Leaving directory '/tmp/ruby/build/trunk/ext/monitor' I, [2024-05-23T11:26:12.787571 #531024] INFO -- : make[2]: Entering directory '/tmp/ruby/build/trunk/ext/objspace' I, [2024-05-23T11:26:12.793839 #531024] INFO -- : make[2]: Leaving directory '/tmp/ruby/build/trunk/ext/objspace' I, [2024-05-23T11:26:12.813285 #531024] INFO -- : make[2]: Entering directory '/tmp/ruby/build/trunk/ext/openssl' I, [2024-05-23T11:26:12.829408 #531024] INFO -- : make[2]: Leaving directory '/tmp/ruby/build/trunk/ext/openssl' I, [2024-05-23T11:26:12.832377 #531024] INFO -- : make[2]: Entering directory '/tmp/ruby/build/trunk/ext/pathname' I, [2024-05-23T11:26:12.834939 #531024] INFO -- : make[2]: Leaving directory '/tmp/ruby/build/trunk/ext/pathname' I, [2024-05-23T11:26:12.839196 #531024] INFO -- : make[2]: Entering directory '/tmp/ruby/build/trunk/ext/psych' I, [2024-05-23T11:26:12.859933 #531024] INFO -- : make[2]: Leaving directory '/tmp/ruby/build/trunk/ext/psych' I, [2024-05-23T11:26:12.864988 #531024] INFO -- : make[2]: Entering directory '/tmp/ruby/build/trunk/ext/pty' I, [2024-05-23T11:26:12.869116 #531024] INFO -- : make[2]: Leaving directory '/tmp/ruby/build/trunk/ext/pty' I, [2024-05-23T11:26:12.885459 #531024] INFO -- : make[2]: Entering directory '/tmp/ruby/build/trunk/ext/ripper' I, [2024-05-23T11:26:12.894069 #531024] INFO -- : make[2]: Leaving directory '/tmp/ruby/build/trunk/ext/ripper' I, [2024-05-23T11:26:12.896587 #531024] INFO -- : make[2]: Entering directory '/tmp/ruby/build/trunk/ext/rubyvm' I, [2024-05-23T11:26:12.899823 #531024] INFO -- : make[2]: Leaving directory '/tmp/ruby/build/trunk/ext/rubyvm' I, [2024-05-23T11:26:12.911820 #531024] INFO -- : make[2]: Entering directory '/tmp/ruby/build/trunk/ext/socket' I, [2024-05-23T11:26:12.919346 #531024] INFO -- : make[2]: Leaving directory '/tmp/ruby/build/trunk/ext/socket' I, [2024-05-23T11:26:12.937392 #531024] INFO -- : make[2]: Entering directory '/tmp/ruby/build/trunk/.bundle/gems/bigdecimal-3.1.8/ext/bigdecimal' I, [2024-05-23T11:26:12.967936 #531024] INFO -- : make[2]: Leaving directory '/tmp/ruby/build/trunk/.bundle/gems/bigdecimal-3.1.8/ext/bigdecimal' I, [2024-05-23T11:26:12.969959 #531024] INFO -- : make[2]: Entering directory '/tmp/ruby/build/trunk/.bundle/gems/debug-1.9.2/ext/debug' I, [2024-05-23T11:26:12.993572 #531024] INFO -- : make[2]: Leaving directory '/tmp/ruby/build/trunk/.bundle/gems/debug-1.9.2/ext/debug' I, [2024-05-23T11:26:12.995506 #531024] INFO -- : make[2]: Entering directory '/tmp/ruby/build/trunk/.bundle/gems/nkf-0.2.0/ext/nkf' I, [2024-05-23T11:26:13.020460 #531024] INFO -- : make[2]: Leaving directory '/tmp/ruby/build/trunk/.bundle/gems/nkf-0.2.0/ext/nkf' I, [2024-05-23T11:26:13.022485 #531024] INFO -- : make[2]: Entering directory '/tmp/ruby/build/trunk/.bundle/gems/racc-1.7.3/ext/racc/cparse' I, [2024-05-23T11:26:13.047919 #531024] INFO -- : make[2]: Leaving directory '/tmp/ruby/build/trunk/.bundle/gems/racc-1.7.3/ext/racc/cparse' I, [2024-05-23T11:26:13.049996 #531024] INFO -- : make[2]: Entering directory '/tmp/ruby/build/trunk/.bundle/gems/racc-1.8.0/ext/racc/cparse' I, [2024-05-23T11:26:13.071921 #531024] INFO -- : make[2]: Leaving directory '/tmp/ruby/build/trunk/.bundle/gems/racc-1.8.0/ext/racc/cparse' I, [2024-05-23T11:26:13.074111 #531024] INFO -- : make[2]: Entering directory '/tmp/ruby/build/trunk/.bundle/gems/rbs-3.4.4/ext/rbs_extension' I, [2024-05-23T11:26:13.096153 #531024] INFO -- : make[2]: Leaving directory '/tmp/ruby/build/trunk/.bundle/gems/rbs-3.4.4/ext/rbs_extension' I, [2024-05-23T11:26:13.098127 #531024] INFO -- : make[2]: Entering directory '/tmp/ruby/build/trunk/.bundle/gems/syslog-0.1.2/ext/syslog' I, [2024-05-23T11:26:13.125027 #531024] INFO -- : make[2]: Leaving directory '/tmp/ruby/build/trunk/.bundle/gems/syslog-0.1.2/ext/syslog' I, [2024-05-23T11:26:13.148359 #531024] INFO -- : make[2]: Entering directory '/tmp/ruby/build/trunk' I, [2024-05-23T11:26:13.212119 #531024] INFO -- : make[2]: 'ruby' is up to date. I, [2024-05-23T11:26:13.212167 #531024] INFO -- : make[2]: Leaving directory '/tmp/ruby/build/trunk' I, [2024-05-23T11:26:13.212538 #531024] INFO -- : make[1]: Leaving directory '/tmp/ruby/build/trunk' I, [2024-05-23T11:26:13.216310 #531024] INFO -- : make[1]: Entering directory '/tmp/ruby/build/trunk' I, [2024-05-23T11:26:13.216332 #531024] INFO -- : make[1]: Nothing to be done for 'note'. I, [2024-05-23T11:26:13.216338 #531024] INFO -- : make[1]: Leaving directory '/tmp/ruby/build/trunk' E, [2024-05-23T11:26:13.277339 #531024] ERROR -- : $ /tmp/ruby/build/trunk/miniruby -I/tmp/ruby/src/trunk/lib /tmp/ruby/src/trunk/tool/runruby.rb --archdir=/tmp/ruby/build/trunk --extout=.ext -- /tmp/ruby/src/trunk/spec/mspec/bin/mspec-run -B /tmp/ruby/src/trunk/spec/default.mspec --error-output stderr --debug -fy -o /tmp/rubytest.2f6maq/1-mspec-multi-0 E, [2024-05-23T11:26:13.277568 #531024] ERROR -- : $ /tmp/ruby/build/trunk/miniruby -I/tmp/ruby/src/trunk/lib /tmp/ruby/src/trunk/tool/runruby.rb --archdir=/tmp/ruby/build/trunk --extout=.ext -- /tmp/ruby/src/trunk/spec/mspec/bin/mspec-run -B /tmp/ruby/src/trunk/spec/default.mspec --error-output stderr --debug -fy -o /tmp/rubytest.2f6maq/2-mspec-multi-1 E, [2024-05-23T11:26:13.277829 #531024] ERROR -- : $ /tmp/ruby/build/trunk/miniruby -I/tmp/ruby/src/trunk/lib /tmp/ruby/src/trunk/tool/runruby.rb --archdir=/tmp/ruby/build/trunk --extout=.ext -- /tmp/ruby/src/trunk/spec/mspec/bin/mspec-run -B /tmp/ruby/src/trunk/spec/default.mspec --error-output stderr --debug -fy -o /tmp/rubytest.2f6maq/3-mspec-multi-2 E, [2024-05-23T11:26:13.278100 #531024] ERROR -- : $ /tmp/ruby/build/trunk/miniruby -I/tmp/ruby/src/trunk/lib /tmp/ruby/src/trunk/tool/runruby.rb --archdir=/tmp/ruby/build/trunk --extout=.ext -- /tmp/ruby/src/trunk/spec/mspec/bin/mspec-run -B /tmp/ruby/src/trunk/spec/default.mspec --error-output stderr --debug -fy -o /tmp/rubytest.2f6maq/4-mspec-multi-3 E, [2024-05-23T11:26:13.278372 #531024] ERROR -- : $ /tmp/ruby/build/trunk/miniruby -I/tmp/ruby/src/trunk/lib /tmp/ruby/src/trunk/tool/runruby.rb --archdir=/tmp/ruby/build/trunk --extout=.ext -- /tmp/ruby/src/trunk/spec/mspec/bin/mspec-run -B /tmp/ruby/src/trunk/spec/default.mspec --error-output stderr --debug -fy -o /tmp/rubytest.2f6maq/5-mspec-multi-4 E, [2024-05-23T11:26:13.278493 #531024] ERROR -- : $ /tmp/ruby/build/trunk/miniruby -I/tmp/ruby/src/trunk/lib /tmp/ruby/src/trunk/tool/runruby.rb --archdir=/tmp/ruby/build/trunk --extout=.ext -- /tmp/ruby/src/trunk/spec/mspec/bin/mspec-run -B /tmp/ruby/src/trunk/spec/default.mspec --error-output stderr --debug -fy -o /tmp/rubytest.2f6maq/6-mspec-multi-5 E, [2024-05-23T11:26:13.278866 #531024] ERROR -- : $ /tmp/ruby/build/trunk/miniruby -I/tmp/ruby/src/trunk/lib /tmp/ruby/src/trunk/tool/runruby.rb --archdir=/tmp/ruby/build/trunk --extout=.ext -- /tmp/ruby/src/trunk/spec/mspec/bin/mspec-run -B /tmp/ruby/src/trunk/spec/default.mspec --error-output stderr --debug -fy -o /tmp/rubytest.2f6maq/7-mspec-multi-6 E, [2024-05-23T11:26:13.279036 #531024] ERROR -- : $ /tmp/ruby/build/trunk/miniruby -I/tmp/ruby/src/trunk/lib /tmp/ruby/src/trunk/tool/runruby.rb --archdir=/tmp/ruby/build/trunk --extout=.ext -- /tmp/ruby/src/trunk/spec/mspec/bin/mspec-run -B /tmp/ruby/src/trunk/spec/default.mspec --error-output stderr --debug -fy -o /tmp/rubytest.2f6maq/8-mspec-multi-7 E, [2024-05-23T11:26:13.279243 #531024] ERROR -- : $ /tmp/ruby/build/trunk/miniruby -I/tmp/ruby/src/trunk/lib /tmp/ruby/src/trunk/tool/runruby.rb --archdir=/tmp/ruby/build/trunk --extout=.ext -- /tmp/ruby/src/trunk/spec/mspec/bin/mspec-run -B /tmp/ruby/src/trunk/spec/default.mspec --error-output stderr --debug -fy -o /tmp/rubytest.2f6maq/9-mspec-multi-8 E, [2024-05-23T11:26:13.279448 #531024] ERROR -- : $ /tmp/ruby/build/trunk/miniruby -I/tmp/ruby/src/trunk/lib /tmp/ruby/src/trunk/tool/runruby.rb --archdir=/tmp/ruby/build/trunk --extout=.ext -- /tmp/ruby/src/trunk/spec/mspec/bin/mspec-run -B /tmp/ruby/src/trunk/spec/default.mspec --error-output stderr --debug -fy -o /tmp/rubytest.2f6maq/10-mspec-multi-9 E, [2024-05-23T11:26:13.279946 #531024] ERROR -- : $ /tmp/ruby/build/trunk/miniruby -I/tmp/ruby/src/trunk/lib /tmp/ruby/src/trunk/tool/runruby.rb --archdir=/tmp/ruby/build/trunk --extout=.ext -- /tmp/ruby/src/trunk/spec/mspec/bin/mspec-run -B /tmp/ruby/src/trunk/spec/default.mspec --error-output stderr --debug -fy -o /tmp/rubytest.2f6maq/11-mspec-multi-10 E, [2024-05-23T11:26:13.280226 #531024] ERROR -- : $ /tmp/ruby/build/trunk/miniruby -I/tmp/ruby/src/trunk/lib /tmp/ruby/src/trunk/tool/runruby.rb --archdir=/tmp/ruby/build/trunk --extout=.ext -- /tmp/ruby/src/trunk/spec/mspec/bin/mspec-run -B /tmp/ruby/src/trunk/spec/default.mspec --error-output stderr --debug -fy -o /tmp/rubytest.2f6maq/12-mspec-multi-11 E, [2024-05-23T11:26:13.280521 #531024] ERROR -- : $ /tmp/ruby/build/trunk/miniruby -I/tmp/ruby/src/trunk/lib /tmp/ruby/src/trunk/tool/runruby.rb --archdir=/tmp/ruby/build/trunk --extout=.ext -- /tmp/ruby/src/trunk/spec/mspec/bin/mspec-run -B /tmp/ruby/src/trunk/spec/default.mspec --error-output stderr --debug -fy -o /tmp/rubytest.2f6maq/13-mspec-multi-12 E, [2024-05-23T11:26:13.280799 #531024] ERROR -- : $ /tmp/ruby/build/trunk/miniruby -I/tmp/ruby/src/trunk/lib /tmp/ruby/src/trunk/tool/runruby.rb --archdir=/tmp/ruby/build/trunk --extout=.ext -- /tmp/ruby/src/trunk/spec/mspec/bin/mspec-run -B /tmp/ruby/src/trunk/spec/default.mspec --error-output stderr --debug -fy -o /tmp/rubytest.2f6maq/14-mspec-multi-13 E, [2024-05-23T11:26:13.280981 #531024] ERROR -- : $ /tmp/ruby/build/trunk/miniruby -I/tmp/ruby/src/trunk/lib /tmp/ruby/src/trunk/tool/runruby.rb --archdir=/tmp/ruby/build/trunk --extout=.ext -- /tmp/ruby/src/trunk/spec/mspec/bin/mspec-run -B /tmp/ruby/src/trunk/spec/default.mspec --error-output stderr --debug -fy -o /tmp/rubytest.2f6maq/15-mspec-multi-14 E, [2024-05-23T11:26:13.281161 #531024] ERROR -- : $ /tmp/ruby/build/trunk/miniruby -I/tmp/ruby/src/trunk/lib /tmp/ruby/src/trunk/tool/runruby.rb --archdir=/tmp/ruby/build/trunk --extout=.ext -- /tmp/ruby/src/trunk/spec/mspec/bin/mspec-run -B /tmp/ruby/src/trunk/spec/default.mspec --error-output stderr --debug -fy -o /tmp/rubytest.2f6maq/16-mspec-multi-15 E, [2024-05-23T11:26:13.281343 #531024] ERROR -- : $ /tmp/ruby/build/trunk/miniruby -I/tmp/ruby/src/trunk/lib /tmp/ruby/src/trunk/tool/runruby.rb --archdir=/tmp/ruby/build/trunk --extout=.ext -- /tmp/ruby/src/trunk/spec/mspec/bin/mspec-run -B /tmp/ruby/src/trunk/spec/default.mspec --error-output stderr --debug -fy -o /tmp/rubytest.2f6maq/17-mspec-multi-16 E, [2024-05-23T11:26:13.281512 #531024] ERROR -- : $ /tmp/ruby/build/trunk/miniruby -I/tmp/ruby/src/trunk/lib /tmp/ruby/src/trunk/tool/runruby.rb --archdir=/tmp/ruby/build/trunk --extout=.ext -- /tmp/ruby/src/trunk/spec/mspec/bin/mspec-run -B /tmp/ruby/src/trunk/spec/default.mspec --error-output stderr --debug -fy -o /tmp/rubytest.2f6maq/18-mspec-multi-17 E, [2024-05-23T11:26:13.284406 #531024] ERROR -- : $ /tmp/ruby/build/trunk/miniruby -I/tmp/ruby/src/trunk/lib /tmp/ruby/src/trunk/tool/runruby.rb --archdir=/tmp/ruby/build/trunk --extout=.ext -- /tmp/ruby/src/trunk/spec/mspec/bin/mspec-run -B /tmp/ruby/src/trunk/spec/default.mspec --error-output stderr --debug -fy -o /tmp/rubytest.2f6maq/19-mspec-multi-18 E, [2024-05-23T11:26:13.284671 #531024] ERROR -- : $ /tmp/ruby/build/trunk/miniruby -I/tmp/ruby/src/trunk/lib /tmp/ruby/src/trunk/tool/runruby.rb --archdir=/tmp/ruby/build/trunk --extout=.ext -- /tmp/ruby/src/trunk/spec/mspec/bin/mspec-run -B /tmp/ruby/src/trunk/spec/default.mspec --error-output stderr --debug -fy -o /tmp/rubytest.2f6maq/20-mspec-multi-19 I, [2024-05-23T11:26:13.454130 #531024] INFO -- : ruby 3.4.0dev (2024-05-23T10:28:02Z master a99d79dd31) [x86_64-linux] I, [2024-05-23T11:26:14.059142 #531024] INFO -- : 0 ......................................................................... I, [2024-05-23T11:26:14.455275 #531024] INFO -- : 73 ......................................................................... I, [2024-05-23T11:26:14.601536 #531024] INFO -- : 146 ......................................................................... I, [2024-05-23T11:26:14.656354 #531024] INFO -- : 219 ......................................................................... I, [2024-05-23T11:26:14.719733 #531024] INFO -- : 292 ......................................................................... I, [2024-05-23T11:26:14.764141 #531024] INFO -- : 365 ......................................................................... I, [2024-05-23T11:26:14.784041 #531024] INFO -- : 438 ......................................................................... I, [2024-05-23T11:26:14.803202 #531024] INFO -- : 511 ......................................................................... I, [2024-05-23T11:26:14.824391 #531024] INFO -- : 584 ......................................................................... I, [2024-05-23T11:26:14.888848 #531024] INFO -- : 657 ......................................................................... I, [2024-05-23T11:26:14.919703 #531024] INFO -- : 730 ......................................................................... I, [2024-05-23T11:26:14.942896 #531024] INFO -- : 803 ......................................................................... I, [2024-05-23T11:26:14.976413 #531024] INFO -- : 876 ......................................................................... I, [2024-05-23T11:26:15.017358 #531024] INFO -- : 949 ......................................................................... I, [2024-05-23T11:26:15.092621 #531024] INFO -- : 1022 ......................................................................... I, [2024-05-23T11:26:15.289847 #531024] INFO -- : 1095 ......................................................................... I, [2024-05-23T11:26:15.392861 #531024] INFO -- : 1168 ......................................................................... I, [2024-05-23T11:26:15.447471 #531024] INFO -- : 1241 ......................................................................... I, [2024-05-23T11:26:15.506140 #531024] INFO -- : 1314 ......................................................................... I, [2024-05-23T11:26:15.525439 #531024] INFO -- : 1387 ......................................................................... I, [2024-05-23T11:26:15.630106 #531024] INFO -- : 1460 ......................................................................... I, [2024-05-23T11:26:16.098461 #531024] INFO -- : 1533 ......................................................................... I, [2024-05-23T11:26:16.160216 #531024] INFO -- : 1606 ......................................................................... I, [2024-05-23T11:26:16.287790 #531024] INFO -- : 1679 ......................................................................... I, [2024-05-23T11:26:16.403608 #531024] INFO -- : 1752 ......................................................................... I, [2024-05-23T11:26:16.479243 #531024] INFO -- : 1825 ......................................................................... I, [2024-05-23T11:26:16.591964 #531024] INFO -- : 1898 ......................................................................... I, [2024-05-23T11:26:16.683525 #531024] INFO -- : 1971 ......................................................................... I, [2024-05-23T11:26:16.748479 #531024] INFO -- : 2044 ......................................................................... I, [2024-05-23T11:26:16.806800 #531024] INFO -- : 2117 ......................................................................... I, [2024-05-23T11:26:16.824840 #531024] INFO -- : 2190 ......................................................................... I, [2024-05-23T11:26:16.841856 #531024] INFO -- : 2263 ......................................................................... I, [2024-05-23T11:26:16.855896 #531024] INFO -- : 2336 ......................................................................... I, [2024-05-23T11:26:16.888933 #531024] INFO -- : 2409 ......................................................................... I, [2024-05-23T11:26:16.984571 #531024] INFO -- : 2482 ......................................................................... I, [2024-05-23T11:26:17.010775 #531024] INFO -- : 2555 ......................................................................... I, [2024-05-23T11:26:17.113819 #531024] INFO -- : 2628 ......................................................................... I, [2024-05-23T11:26:17.206797 #531024] INFO -- : 2701 ......................................................................... I, [2024-05-23T11:26:17.244019 #531024] INFO -- : 2774 ......................................................................... I, [2024-05-23T11:26:17.301894 #531024] INFO -- : 2847 ......................................................................... I, [2024-05-23T11:26:17.345528 #531024] INFO -- : 2920 ......................................................................... I, [2024-05-23T11:26:17.369513 #531024] INFO -- : 2993 ......................................................................... I, [2024-05-23T11:26:17.393049 #531024] INFO -- : 3066 ......................................................................... I, [2024-05-23T11:26:17.408019 #531024] INFO -- : 3139 ......................................................................... I, [2024-05-23T11:26:17.418992 #531024] INFO -- : 3212 ......................................................................... I, [2024-05-23T11:26:17.448194 #531024] INFO -- : 3285 ......................................................................... I, [2024-05-23T11:26:21.393608 #531024] INFO -- : 3358 ......................................................................... I, [2024-05-23T11:26:21.417692 #531024] INFO -- : I, [2024-05-23T11:26:21.417753 #531024] INFO -- : I, [2024-05-23T11:26:21.417768 #531024] INFO -- : Finished in 8.139557 seconds I, [2024-05-23T11:26:21.417779 #531024] INFO -- : I, [2024-05-23T11:26:21.417791 #531024] INFO -- : 3430 files, 32652 examples, 178673 expectations, 0 failures, 0 errors, 0 tagged I, [2024-05-23T11:26:21.419873 #531024] INFO -- : $$$[end] "make yes-test-rubyspec MSPECOPT='--error-output stderr --debug -j' TESTS='-j20'" exit with 0.