# Logfile created on 2024-05-23 07:37:53 +0000 by logger.rb/v1.4.3 I, [2024-05-23T07:37:53.465672 #37630] INFO -- : #, @formatter=nil, @logdev=#, @binmode=false, @mon_data=#, @mon_data_owner_object_id=860>>> I, [2024-05-23T07:37:53.465794 #37630] INFO -- : $$$[beg] make update-unicode -j20 I, [2024-05-23T07:37:53.524787 #37630] INFO -- : Downloading Unicode emoji 15.0 files... I, [2024-05-23T07:37:53.525074 #37630] INFO -- : Downloading Unicode emoji 15.0 files... I, [2024-05-23T07:37:53.525732 #37630] INFO -- : Downloading Unicode emoji 15.0 files... I, [2024-05-23T07:37:53.566460 #37630] INFO -- : made symlink emoji/15.0/emoji-sequences.txt to /tmp/ruby/src/trunk/.downloaded-cache/emoji/15.0/emoji-sequences.txt I, [2024-05-23T07:37:53.568401 #37630] INFO -- : downloading emoji/15.0/emoji-sequences.txt ... downloading emoji/15.0/emoji-test.txt ... /tmp/ruby/src/trunk/enc/unicode/data/emoji/15.0/emoji-sequences.txt already exists E, [2024-05-23T07:37:54.013636 #37630] ERROR -- : /tmp/ruby/src/trunk/tool/downloader.rb:302:in `rescue in download': failed to download emoji/15.0/emoji-test.txt (RuntimeError) E, [2024-05-23T07:37:54.013786 #37630] ERROR -- : OpenURI::HTTPError: 403 Forbidden: https://www.unicode.org/Public/emoji/15.0/emoji-test.txt E, [2024-05-23T07:37:54.013808 #37630] ERROR -- : from /tmp/ruby/src/trunk/tool/downloader.rb:201:in `download' E, [2024-05-23T07:37:54.013823 #37630] ERROR -- : from /tmp/ruby/src/trunk/tool/downloader.rb:136:in `download' E, [2024-05-23T07:37:54.013836 #37630] ERROR -- : from /tmp/ruby/src/trunk/tool/downloader.rb:482:in `block in
' E, [2024-05-23T07:37:54.013850 #37630] ERROR -- : from /tmp/ruby/src/trunk/tool/downloader.rb:465:in `each' E, [2024-05-23T07:37:54.013865 #37630] ERROR -- : from /tmp/ruby/src/trunk/tool/downloader.rb:465:in `
' E, [2024-05-23T07:37:54.013879 #37630] ERROR -- : /usr/lib/ruby/3.0.0/open-uri.rb:364:in `open_http': 403 Forbidden (OpenURI::HTTPError) E, [2024-05-23T07:37:54.013892 #37630] ERROR -- : from /usr/lib/ruby/3.0.0/open-uri.rb:741:in `buffer_open' E, [2024-05-23T07:37:54.013908 #37630] ERROR -- : from /usr/lib/ruby/3.0.0/open-uri.rb:212:in `block in open_loop' E, [2024-05-23T07:37:54.013921 #37630] ERROR -- : from /usr/lib/ruby/3.0.0/open-uri.rb:210:in `catch' E, [2024-05-23T07:37:54.013934 #37630] ERROR -- : from /usr/lib/ruby/3.0.0/open-uri.rb:210:in `open_loop' E, [2024-05-23T07:37:54.013947 #37630] ERROR -- : from /usr/lib/ruby/3.0.0/open-uri.rb:151:in `open_uri' E, [2024-05-23T07:37:54.013960 #37630] ERROR -- : from /usr/lib/ruby/3.0.0/open-uri.rb:721:in `open' E, [2024-05-23T07:37:54.013972 #37630] ERROR -- : from /usr/lib/ruby/3.0.0/open-uri.rb:729:in `read' E, [2024-05-23T07:37:54.013985 #37630] ERROR -- : from /tmp/ruby/src/trunk/tool/downloader.rb:247:in `block in download' E, [2024-05-23T07:37:54.014018 #37630] ERROR -- : from /tmp/ruby/src/trunk/tool/downloader.rb:378:in `with_retry' E, [2024-05-23T07:37:54.014033 #37630] ERROR -- : from /tmp/ruby/src/trunk/tool/downloader.rb:246:in `download' E, [2024-05-23T07:37:54.014057 #37630] ERROR -- : from /tmp/ruby/src/trunk/tool/downloader.rb:136:in `download' E, [2024-05-23T07:37:54.014070 #37630] ERROR -- : from /tmp/ruby/src/trunk/tool/downloader.rb:482:in `block in
' E, [2024-05-23T07:37:54.014084 #37630] ERROR -- : from /tmp/ruby/src/trunk/tool/downloader.rb:465:in `each' E, [2024-05-23T07:37:54.014096 #37630] ERROR -- : from /tmp/ruby/src/trunk/tool/downloader.rb:465:in `
' E, [2024-05-23T07:37:54.018347 #37630] ERROR -- : make: *** [uncommon.mk:1756: /tmp/ruby/src/trunk/enc/unicode/data/emoji/15.0/emoji-test.txt] Error 1 E, [2024-05-23T07:37:54.018450 #37630] ERROR -- : make: *** Waiting for unfinished jobs.... E, [2024-05-23T07:37:54.038510 #37630] ERROR -- : /tmp/ruby/src/trunk/tool/downloader.rb:302:in `rescue in download': failed to download emoji/15.0/emoji-test.txt (RuntimeError) E, [2024-05-23T07:37:54.038655 #37630] ERROR -- : OpenURI::HTTPError: 403 Forbidden: https://www.unicode.org/Public/emoji/15.0/emoji-test.txt E, [2024-05-23T07:37:54.038680 #37630] ERROR -- : from /tmp/ruby/src/trunk/tool/downloader.rb:201:in `download' E, [2024-05-23T07:37:54.038695 #37630] ERROR -- : from /tmp/ruby/src/trunk/tool/downloader.rb:136:in `download' E, [2024-05-23T07:37:54.038708 #37630] ERROR -- : from /tmp/ruby/src/trunk/tool/downloader.rb:482:in `block in
' E, [2024-05-23T07:37:54.038721 #37630] ERROR -- : from /tmp/ruby/src/trunk/tool/downloader.rb:465:in `each' E, [2024-05-23T07:37:54.038745 #37630] ERROR -- : from /tmp/ruby/src/trunk/tool/downloader.rb:465:in `
' E, [2024-05-23T07:37:54.038762 #37630] ERROR -- : /usr/lib/ruby/3.0.0/open-uri.rb:364:in `open_http': 403 Forbidden (OpenURI::HTTPError) E, [2024-05-23T07:37:54.038776 #37630] ERROR -- : from /usr/lib/ruby/3.0.0/open-uri.rb:741:in `buffer_open' E, [2024-05-23T07:37:54.038794 #37630] ERROR -- : from /usr/lib/ruby/3.0.0/open-uri.rb:212:in `block in open_loop' E, [2024-05-23T07:37:54.038807 #37630] ERROR -- : from /usr/lib/ruby/3.0.0/open-uri.rb:210:in `catch' E, [2024-05-23T07:37:54.038822 #37630] ERROR -- : from /usr/lib/ruby/3.0.0/open-uri.rb:210:in `open_loop' E, [2024-05-23T07:37:54.038835 #37630] ERROR -- : from /usr/lib/ruby/3.0.0/open-uri.rb:151:in `open_uri' E, [2024-05-23T07:37:54.038849 #37630] ERROR -- : from /usr/lib/ruby/3.0.0/open-uri.rb:721:in `open' E, [2024-05-23T07:37:54.038863 #37630] ERROR -- : from /usr/lib/ruby/3.0.0/open-uri.rb:729:in `read' E, [2024-05-23T07:37:54.038876 #37630] ERROR -- : from /tmp/ruby/src/trunk/tool/downloader.rb:247:in `block in download' E, [2024-05-23T07:37:54.038888 #37630] ERROR -- : from /tmp/ruby/src/trunk/tool/downloader.rb:378:in `with_retry' E, [2024-05-23T07:37:54.038905 #37630] ERROR -- : from /tmp/ruby/src/trunk/tool/downloader.rb:246:in `download' E, [2024-05-23T07:37:54.038918 #37630] ERROR -- : from /tmp/ruby/src/trunk/tool/downloader.rb:136:in `download' E, [2024-05-23T07:37:54.038931 #37630] ERROR -- : from /tmp/ruby/src/trunk/tool/downloader.rb:482:in `block in
' E, [2024-05-23T07:37:54.038944 #37630] ERROR -- : from /tmp/ruby/src/trunk/tool/downloader.rb:465:in `each' E, [2024-05-23T07:37:54.038958 #37630] ERROR -- : from /tmp/ruby/src/trunk/tool/downloader.rb:465:in `
' E, [2024-05-23T07:37:54.043289 #37630] ERROR -- : make: *** [uncommon.mk:1756: /tmp/ruby/src/trunk/enc/unicode/data/emoji/15.0/emoji-zwj-sequences.txt] Error 1 E, [2024-05-23T07:37:54.463198 #37630] ERROR -- : /tmp/ruby/src/trunk/tool/downloader.rb:302:in `rescue in download': failed to download emoji/15.0/emoji-sequences.txt (RuntimeError) E, [2024-05-23T07:37:54.463331 #37630] ERROR -- : EOFError: end of file reached: https://www.unicode.org/Public/emoji/15.0/emoji-sequences.txt E, [2024-05-23T07:37:54.463353 #37630] ERROR -- : from /tmp/ruby/src/trunk/tool/downloader.rb:201:in `download' E, [2024-05-23T07:37:54.463385 #37630] ERROR -- : from /tmp/ruby/src/trunk/tool/downloader.rb:136:in `download' E, [2024-05-23T07:37:54.463398 #37630] ERROR -- : from /tmp/ruby/src/trunk/tool/downloader.rb:482:in `block in
' E, [2024-05-23T07:37:54.463410 #37630] ERROR -- : from /tmp/ruby/src/trunk/tool/downloader.rb:465:in `each' E, [2024-05-23T07:37:54.463422 #37630] ERROR -- : from /tmp/ruby/src/trunk/tool/downloader.rb:465:in `
' E, [2024-05-23T07:37:54.463434 #37630] ERROR -- : /usr/lib/ruby/3.0.0/net/protocol.rb:227:in `rbuf_fill': end of file reached (EOFError) E, [2024-05-23T07:37:54.463446 #37630] ERROR -- : from /usr/lib/ruby/3.0.0/net/protocol.rb:193:in `readuntil' E, [2024-05-23T07:37:54.463461 #37630] ERROR -- : from /usr/lib/ruby/3.0.0/net/protocol.rb:203:in `readline' E, [2024-05-23T07:37:54.463474 #37630] ERROR -- : from /usr/lib/ruby/3.0.0/net/http/response.rb:42:in `read_status_line' E, [2024-05-23T07:37:54.463486 #37630] ERROR -- : from /usr/lib/ruby/3.0.0/net/http/response.rb:31:in `read_new' E, [2024-05-23T07:37:54.463498 #37630] ERROR -- : from /usr/lib/ruby/3.0.0/net/http.rb:1557:in `block in transport_request' E, [2024-05-23T07:37:54.463509 #37630] ERROR -- : from /usr/lib/ruby/3.0.0/net/http.rb:1548:in `catch' E, [2024-05-23T07:37:54.463521 #37630] ERROR -- : from /usr/lib/ruby/3.0.0/net/http.rb:1548:in `transport_request' E, [2024-05-23T07:37:54.463533 #37630] ERROR -- : from /usr/lib/ruby/3.0.0/net/http.rb:1521:in `request' E, [2024-05-23T07:37:54.463776 #37630] ERROR -- : from /usr/lib/ruby/3.0.0/open-uri.rb:329:in `block in open_http' E, [2024-05-23T07:37:54.463792 #37630] ERROR -- : from /usr/lib/ruby/3.0.0/net/http.rb:960:in `start' E, [2024-05-23T07:37:54.463803 #37630] ERROR -- : from /usr/lib/ruby/3.0.0/open-uri.rb:323:in `open_http' E, [2024-05-23T07:37:54.463814 #37630] ERROR -- : from /usr/lib/ruby/3.0.0/open-uri.rb:741:in `buffer_open' E, [2024-05-23T07:37:54.463825 #37630] ERROR -- : from /usr/lib/ruby/3.0.0/open-uri.rb:212:in `block in open_loop' E, [2024-05-23T07:37:54.463839 #37630] ERROR -- : from /usr/lib/ruby/3.0.0/open-uri.rb:210:in `catch' E, [2024-05-23T07:37:54.463850 #37630] ERROR -- : from /usr/lib/ruby/3.0.0/open-uri.rb:210:in `open_loop' E, [2024-05-23T07:37:54.463860 #37630] ERROR -- : from /usr/lib/ruby/3.0.0/open-uri.rb:151:in `open_uri' E, [2024-05-23T07:37:54.463871 #37630] ERROR -- : from /usr/lib/ruby/3.0.0/open-uri.rb:721:in `open' E, [2024-05-23T07:37:54.463882 #37630] ERROR -- : from /usr/lib/ruby/3.0.0/open-uri.rb:729:in `read' E, [2024-05-23T07:37:54.463892 #37630] ERROR -- : from /tmp/ruby/src/trunk/tool/downloader.rb:247:in `block in download' E, [2024-05-23T07:37:54.463903 #37630] ERROR -- : from /tmp/ruby/src/trunk/tool/downloader.rb:378:in `with_retry' E, [2024-05-23T07:37:54.463913 #37630] ERROR -- : from /tmp/ruby/src/trunk/tool/downloader.rb:246:in `download' E, [2024-05-23T07:37:54.463924 #37630] ERROR -- : from /tmp/ruby/src/trunk/tool/downloader.rb:136:in `download' E, [2024-05-23T07:37:54.463937 #37630] ERROR -- : from /tmp/ruby/src/trunk/tool/downloader.rb:482:in `block in
' E, [2024-05-23T07:37:54.463948 #37630] ERROR -- : from /tmp/ruby/src/trunk/tool/downloader.rb:465:in `each' E, [2024-05-23T07:37:54.463959 #37630] ERROR -- : from /tmp/ruby/src/trunk/tool/downloader.rb:465:in `
' E, [2024-05-23T07:37:54.467660 #37630] ERROR -- : make: *** [uncommon.mk:1756: /tmp/ruby/src/trunk/enc/unicode/data/emoji/15.0/emoji-sequences.txt] Error 1 E, [2024-05-23T07:37:54.467734 #37630] ERROR -- : make: *** Deleting file '/tmp/ruby/src/trunk/enc/unicode/data/emoji/15.0/emoji-sequences.txt' I, [2024-05-23T07:37:54.467772 #37630] INFO -- : downloading emoji/15.0/emoji-test.txt ... I, [2024-05-23T07:37:54.468330 #37630] INFO -- : $$$[end] "make update-unicode -j20" exit with 512. I, [2024-05-23T07:37:54.468395 #37630] INFO -- : $$$[beg] make update-download -j20 I, [2024-05-23T07:37:54.573712 #37630] INFO -- : tool/config.guess already exists I, [2024-05-23T07:37:54.573752 #37630] INFO -- : tool/config.sub already exists I, [2024-05-23T07:37:54.575923 #37630] INFO -- : Update power_assert to 84e85124c5014a139af39161d484156cfe87a9ed I, [2024-05-23T07:37:54.575962 #37630] INFO -- : Update rbs to ba7872795d5de04adb8ff500c0e6afdc81a041dd I, [2024-05-23T07:37:54.576678 #37630] INFO -- : Update typeprof to b19a6416da3a05d57fadd6ffdadb382b6d236ca5 I, [2024-05-23T07:37:54.577294 #37630] INFO -- : echo 84e85124c5014a139af39161d484156cfe87a9ed | /bin/sh /tmp/ruby/src/trunk/tool/ifchange /tmp/ruby/src/trunk/.bundle/.timestamp/power_assert.revision - I, [2024-05-23T07:37:54.577398 #37630] INFO -- : echo ba7872795d5de04adb8ff500c0e6afdc81a041dd | /bin/sh /tmp/ruby/src/trunk/tool/ifchange /tmp/ruby/src/trunk/.bundle/.timestamp/rbs.revision - I, [2024-05-23T07:37:54.577777 #37630] INFO -- : echo b19a6416da3a05d57fadd6ffdadb382b6d236ca5 | /bin/sh /tmp/ruby/src/trunk/tool/ifchange /tmp/ruby/src/trunk/.bundle/.timestamp/typeprof.revision - I, [2024-05-23T07:37:54.579225 #37630] INFO -- : /tmp/ruby/src/trunk/.bundle/.timestamp/power_assert.revision unchanged I, [2024-05-23T07:37:54.579516 #37630] INFO -- : /tmp/ruby/src/trunk/.bundle/.timestamp/typeprof.revision unchanged I, [2024-05-23T07:37:54.579546 #37630] INFO -- : /tmp/ruby/src/trunk/.bundle/.timestamp/rbs.revision unchanged I, [2024-05-23T07:37:54.580167 #37630] INFO -- : Building power_assert@84e85124c5014a139af39161d484156cfe87a9ed to /tmp/ruby/src/trunk/gems/power_assert-2.0.3.gem I, [2024-05-23T07:37:54.649204 #37630] INFO -- : Successfully built RubyGem I, [2024-05-23T07:37:54.649271 #37630] INFO -- : Name: power_assert I, [2024-05-23T07:37:54.649288 #37630] INFO -- : Version: 2.0.4dev I, [2024-05-23T07:37:54.649304 #37630] INFO -- : File: power_assert-2.0.4dev.gem I, [2024-05-23T07:37:54.695544 #37630] INFO -- : $$$[end] "make update-download -j20" exit with 0. I, [2024-05-23T07:37:54.695604 #37630] INFO -- : $$$[beg] make update-rubyspec -j20 I, [2024-05-23T07:37:54.760802 #37630] INFO -- : make: Nothing to be done for 'update-rubyspec'. I, [2024-05-23T07:37:54.761221 #37630] INFO -- : $$$[end] "make update-rubyspec -j20" exit with 0. I, [2024-05-23T07:37:54.761272 #37630] INFO -- : $$$[beg] make update-src -j20 I, [2024-05-23T07:37:55.391290 #37630] INFO -- : Already up to date. I, [2024-05-23T07:37:55.409116 #37630] INFO -- : Latest commit hash = ce20367a0e I, [2024-05-23T07:37:55.410738 #37630] INFO -- : $$$[end] "make update-src -j20" exit with 0. I, [2024-05-23T07:37:55.410790 #37630] INFO -- : $$$[beg] make after-update -j20 I, [2024-05-23T07:37:55.510279 #37630] INFO -- : /tmp/ruby/src/trunk/revision.h updated I, [2024-05-23T07:37:55.511529 #37630] INFO -- : generating x86_64-linux-fake.rb I, [2024-05-23T07:37:55.564364 #37630] INFO -- : x86_64-linux-fake.rb updated I, [2024-05-23T07:37:55.566203 #37630] INFO -- : generating enc.mk I, [2024-05-23T07:37:55.687240 #37630] INFO -- : making srcs under enc I, [2024-05-23T07:37:55.716973 #37630] INFO -- : make[1]: Entering directory '/tmp/ruby/build/trunk' I, [2024-05-23T07:37:55.717012 #37630] INFO -- : make[1]: Nothing to be done for 'srcs'. I, [2024-05-23T07:37:55.717019 #37630] INFO -- : make[1]: Leaving directory '/tmp/ruby/build/trunk' I, [2024-05-23T07:37:55.765665 #37630] INFO -- : Update power_assert to 84e85124c5014a139af39161d484156cfe87a9ed I, [2024-05-23T07:37:55.765858 #37630] INFO -- : Update rbs to ba7872795d5de04adb8ff500c0e6afdc81a041dd I, [2024-05-23T07:37:55.766623 #37630] INFO -- : Update typeprof to b19a6416da3a05d57fadd6ffdadb382b6d236ca5 I, [2024-05-23T07:37:55.766946 #37630] INFO -- : echo 84e85124c5014a139af39161d484156cfe87a9ed | /bin/sh /tmp/ruby/src/trunk/tool/ifchange /tmp/ruby/src/trunk/.bundle/.timestamp/power_assert.revision - I, [2024-05-23T07:37:55.767201 #37630] INFO -- : echo ba7872795d5de04adb8ff500c0e6afdc81a041dd | /bin/sh /tmp/ruby/src/trunk/tool/ifchange /tmp/ruby/src/trunk/.bundle/.timestamp/rbs.revision - I, [2024-05-23T07:37:55.768294 #37630] INFO -- : echo b19a6416da3a05d57fadd6ffdadb382b6d236ca5 | /bin/sh /tmp/ruby/src/trunk/tool/ifchange /tmp/ruby/src/trunk/.bundle/.timestamp/typeprof.revision - I, [2024-05-23T07:37:55.769090 #37630] INFO -- : /tmp/ruby/src/trunk/.bundle/.timestamp/power_assert.revision unchanged I, [2024-05-23T07:37:55.769120 #37630] INFO -- : /tmp/ruby/src/trunk/.bundle/.timestamp/rbs.revision unchanged I, [2024-05-23T07:37:55.770021 #37630] INFO -- : /tmp/ruby/src/trunk/.bundle/.timestamp/typeprof.revision unchanged I, [2024-05-23T07:37:55.770264 #37630] INFO -- : Building power_assert@84e85124c5014a139af39161d484156cfe87a9ed to /tmp/ruby/src/trunk/gems/power_assert-2.0.3.gem I, [2024-05-23T07:37:55.838719 #37630] INFO -- : Successfully built RubyGem I, [2024-05-23T07:37:55.838779 #37630] INFO -- : Name: power_assert I, [2024-05-23T07:37:55.838791 #37630] INFO -- : Version: 2.0.4dev I, [2024-05-23T07:37:55.838802 #37630] INFO -- : File: power_assert-2.0.4dev.gem I, [2024-05-23T07:37:55.840729 #37630] INFO -- : Extracting bundle gem power_assert-2.0.3... I, [2024-05-23T07:37:55.902405 #37630] INFO -- : Try with hash version of bundled gems instead of gems/power_assert-2.0.3.gem. We don't use this gem with release version of Ruby. I, [2024-05-23T07:37:55.907398 #37630] INFO -- : Unpacked gems/power_assert-2.0.4dev.gem I, [2024-05-23T07:37:55.909479 #37630] INFO -- : $$$[end] "make after-update -j20" exit with 0. I, [2024-05-23T07:37:55.909642 #37630] INFO -- : $$$[beg] make miniruby -j20 I, [2024-05-23T07:37:55.970977 #37630] INFO -- : BASERUBY = /usr/bin/ruby --disable=gems I, [2024-05-23T07:37:55.971023 #37630] INFO -- : CC = gcc I, [2024-05-23T07:37:55.971041 #37630] INFO -- : LD = ld I, [2024-05-23T07:37:55.971049 #37630] INFO -- : LDSHARED = gcc -shared I, [2024-05-23T07:37:55.971056 #37630] INFO -- : CFLAGS = -O3 -fno-fast-math -ggdb3 -Wall -Wextra -Wdeprecated-declarations -Wdiv-by-zero -Wduplicated-cond -Wimplicit-function-declaration -Wimplicit-int -Wpointer-arith -Wwrite-strings -Wold-style-definition -Wimplicit-fallthrough=0 -Wmissing-noreturn -Wno-cast-function-type -Wno-constant-logical-operand -Wno-long-long -Wno-missing-field-initializers -Wno-overlength-strings -Wno-packed-bitfield-compat -Wno-parentheses-equality -Wno-self-assign -Wno-tautological-compare -Wno-unused-parameter -Wno-unused-value -Wsuggest-attribute=format -Wsuggest-attribute=noreturn -Wunused-variable -Wmisleading-indentation -Wundef -fPIC I, [2024-05-23T07:37:55.971063 #37630] INFO -- : XCFLAGS = -U_FORTIFY_SOURCE -D_FORTIFY_SOURCE=2 -fstack-protector-strong -fno-strict-overflow -fvisibility=hidden -fexcess-precision=standard -DRUBY_EXPORT -I. -I.ext/include/x86_64-linux -I/tmp/ruby/src/trunk/include -I/tmp/ruby/src/trunk -I/tmp/ruby/src/trunk/prism -I/tmp/ruby/src/trunk/enc/unicode/15.0.0 I, [2024-05-23T07:37:55.971070 #37630] INFO -- : CPPFLAGS = I, [2024-05-23T07:37:55.971076 #37630] INFO -- : DLDFLAGS = -Wl,--compress-debug-sections=zlib -Wl,-soname,libruby.so.3.4 -fstack-protector-strong I, [2024-05-23T07:37:55.971083 #37630] INFO -- : SOLIBS = -lz -lrt -lrt -lgmp -ldl -lcrypt -lm -lpthread I, [2024-05-23T07:37:55.971089 #37630] INFO -- : LANG = en_US.UTF-8 I, [2024-05-23T07:37:55.971098 #37630] INFO -- : LC_ALL = I, [2024-05-23T07:37:55.971104 #37630] INFO -- : LC_CTYPE = I, [2024-05-23T07:37:55.971110 #37630] INFO -- : MFLAGS = -j20 --jobserver-auth=4,5 I, [2024-05-23T07:37:55.971116 #37630] INFO -- : RUSTC = no I, [2024-05-23T07:37:55.971123 #37630] INFO -- : YJIT_RUSTC_ARGS = --crate-name=yjit --crate-type=staticlib --edition=2021 -g -C lto=thin -C opt-level=3 -C overflow-checks=on '--out-dir=/tmp/ruby/build/trunk/yjit/target/release/' /tmp/ruby/src/trunk/yjit/src/lib.rs I, [2024-05-23T07:37:55.973434 #37630] INFO -- : gcc (Ubuntu 11.4.0-1ubuntu1~22.04) 11.4.0 I, [2024-05-23T07:37:55.973482 #37630] INFO -- : Copyright (C) 2021 Free Software Foundation, Inc. I, [2024-05-23T07:37:55.973499 #37630] INFO -- : This is free software; see the source for copying conditions. There is NO I, [2024-05-23T07:37:55.973522 #37630] INFO -- : warranty; not even for MERCHANTABILITY or FITNESS FOR A PARTICULAR PURPOSE. I, [2024-05-23T07:37:55.973548 #37630] INFO -- : I, [2024-05-23T07:37:55.997901 #37630] INFO -- : compiling /tmp/ruby/src/trunk/version.c I, [2024-05-23T07:37:56.099644 #37630] INFO -- : linking miniruby I, [2024-05-23T07:37:56.627341 #37630] INFO -- : $$$[end] "make miniruby -j20" exit with 0. I, [2024-05-23T07:37:56.627449 #37630] INFO -- : $$$[beg] make ruby -j20 I, [2024-05-23T07:37:56.693358 #37630] INFO -- : BASERUBY = /usr/bin/ruby --disable=gems I, [2024-05-23T07:37:56.693413 #37630] INFO -- : CC = gcc I, [2024-05-23T07:37:56.693430 #37630] INFO -- : LD = ld I, [2024-05-23T07:37:56.693445 #37630] INFO -- : LDSHARED = gcc -shared I, [2024-05-23T07:37:56.693464 #37630] INFO -- : CFLAGS = -O3 -fno-fast-math -ggdb3 -Wall -Wextra -Wdeprecated-declarations -Wdiv-by-zero -Wduplicated-cond -Wimplicit-function-declaration -Wimplicit-int -Wpointer-arith -Wwrite-strings -Wold-style-definition -Wimplicit-fallthrough=0 -Wmissing-noreturn -Wno-cast-function-type -Wno-constant-logical-operand -Wno-long-long -Wno-missing-field-initializers -Wno-overlength-strings -Wno-packed-bitfield-compat -Wno-parentheses-equality -Wno-self-assign -Wno-tautological-compare -Wno-unused-parameter -Wno-unused-value -Wsuggest-attribute=format -Wsuggest-attribute=noreturn -Wunused-variable -Wmisleading-indentation -Wundef -fPIC I, [2024-05-23T07:37:56.693479 #37630] INFO -- : XCFLAGS = -U_FORTIFY_SOURCE -D_FORTIFY_SOURCE=2 -fstack-protector-strong -fno-strict-overflow -fvisibility=hidden -fexcess-precision=standard -DRUBY_EXPORT -I. -I.ext/include/x86_64-linux -I/tmp/ruby/src/trunk/include -I/tmp/ruby/src/trunk -I/tmp/ruby/src/trunk/prism -I/tmp/ruby/src/trunk/enc/unicode/15.0.0 I, [2024-05-23T07:37:56.693494 #37630] INFO -- : CPPFLAGS = I, [2024-05-23T07:37:56.693508 #37630] INFO -- : DLDFLAGS = -Wl,--compress-debug-sections=zlib -Wl,-soname,libruby.so.3.4 -fstack-protector-strong I, [2024-05-23T07:37:56.693523 #37630] INFO -- : SOLIBS = -lz -lrt -lrt -lgmp -ldl -lcrypt -lm -lpthread I, [2024-05-23T07:37:56.693536 #37630] INFO -- : LANG = en_US.UTF-8 I, [2024-05-23T07:37:56.693550 #37630] INFO -- : LC_ALL = I, [2024-05-23T07:37:56.693564 #37630] INFO -- : LC_CTYPE = I, [2024-05-23T07:37:56.693578 #37630] INFO -- : MFLAGS = -j20 --jobserver-auth=4,5 I, [2024-05-23T07:37:56.693591 #37630] INFO -- : RUSTC = no I, [2024-05-23T07:37:56.693606 #37630] INFO -- : YJIT_RUSTC_ARGS = --crate-name=yjit --crate-type=staticlib --edition=2021 -g -C lto=thin -C opt-level=3 -C overflow-checks=on '--out-dir=/tmp/ruby/build/trunk/yjit/target/release/' /tmp/ruby/src/trunk/yjit/src/lib.rs I, [2024-05-23T07:37:56.695720 #37630] INFO -- : gcc (Ubuntu 11.4.0-1ubuntu1~22.04) 11.4.0 I, [2024-05-23T07:37:56.695775 #37630] INFO -- : Copyright (C) 2021 Free Software Foundation, Inc. I, [2024-05-23T07:37:56.695792 #37630] INFO -- : This is free software; see the source for copying conditions. There is NO I, [2024-05-23T07:37:56.695875 #37630] INFO -- : warranty; not even for MERCHANTABILITY or FITNESS FOR A PARTICULAR PURPOSE. I, [2024-05-23T07:37:56.695895 #37630] INFO -- : I, [2024-05-23T07:37:56.811025 #37630] INFO -- : builtin_binary.inc updated I, [2024-05-23T07:37:56.815441 #37630] INFO -- : c5234a9416e4f20f175185e840b25b0f08674d14078ed7083f37e655458e3ca9 builtin_binary.inc I, [2024-05-23T07:37:56.816162 #37630] INFO -- : compiling /tmp/ruby/src/trunk/builtin.c I, [2024-05-23T07:37:57.001282 #37630] INFO -- : linking static-library libruby-static.a I, [2024-05-23T07:37:57.318364 #37630] INFO -- : linking shared-library libruby.so.3.4.0 I, [2024-05-23T07:37:58.869039 #37630] INFO -- : linking ruby I, [2024-05-23T07:37:58.891823 #37630] INFO -- : $$$[end] "make ruby -j20" exit with 0. I, [2024-05-23T07:37:58.891956 #37630] INFO -- : $$$[beg] make all -j20 I, [2024-05-23T07:37:58.951418 #37630] INFO -- : BASERUBY = /usr/bin/ruby --disable=gems I, [2024-05-23T07:37:58.951471 #37630] INFO -- : CC = gcc I, [2024-05-23T07:37:58.951486 #37630] INFO -- : LD = ld I, [2024-05-23T07:37:58.951511 #37630] INFO -- : LDSHARED = gcc -shared I, [2024-05-23T07:37:58.951526 #37630] INFO -- : CFLAGS = -O3 -fno-fast-math -ggdb3 -Wall -Wextra -Wdeprecated-declarations -Wdiv-by-zero -Wduplicated-cond -Wimplicit-function-declaration -Wimplicit-int -Wpointer-arith -Wwrite-strings -Wold-style-definition -Wimplicit-fallthrough=0 -Wmissing-noreturn -Wno-cast-function-type -Wno-constant-logical-operand -Wno-long-long -Wno-missing-field-initializers -Wno-overlength-strings -Wno-packed-bitfield-compat -Wno-parentheses-equality -Wno-self-assign -Wno-tautological-compare -Wno-unused-parameter -Wno-unused-value -Wsuggest-attribute=format -Wsuggest-attribute=noreturn -Wunused-variable -Wmisleading-indentation -Wundef -fPIC I, [2024-05-23T07:37:58.951539 #37630] INFO -- : XCFLAGS = -U_FORTIFY_SOURCE -D_FORTIFY_SOURCE=2 -fstack-protector-strong -fno-strict-overflow -fvisibility=hidden -fexcess-precision=standard -DRUBY_EXPORT -I. -I.ext/include/x86_64-linux -I/tmp/ruby/src/trunk/include -I/tmp/ruby/src/trunk -I/tmp/ruby/src/trunk/prism -I/tmp/ruby/src/trunk/enc/unicode/15.0.0 I, [2024-05-23T07:37:58.951552 #37630] INFO -- : CPPFLAGS = I, [2024-05-23T07:37:58.951565 #37630] INFO -- : DLDFLAGS = -Wl,--compress-debug-sections=zlib -Wl,-soname,libruby.so.3.4 -fstack-protector-strong I, [2024-05-23T07:37:58.951578 #37630] INFO -- : SOLIBS = -lz -lrt -lrt -lgmp -ldl -lcrypt -lm -lpthread I, [2024-05-23T07:37:58.951590 #37630] INFO -- : LANG = en_US.UTF-8 I, [2024-05-23T07:37:58.951603 #37630] INFO -- : LC_ALL = I, [2024-05-23T07:37:58.951615 #37630] INFO -- : LC_CTYPE = I, [2024-05-23T07:37:58.951627 #37630] INFO -- : MFLAGS = -j20 --jobserver-auth=4,5 I, [2024-05-23T07:37:58.951642 #37630] INFO -- : RUSTC = no I, [2024-05-23T07:37:58.951655 #37630] INFO -- : YJIT_RUSTC_ARGS = --crate-name=yjit --crate-type=staticlib --edition=2021 -g -C lto=thin -C opt-level=3 -C overflow-checks=on '--out-dir=/tmp/ruby/build/trunk/yjit/target/release/' /tmp/ruby/src/trunk/yjit/src/lib.rs I, [2024-05-23T07:37:58.953177 #37630] INFO -- : gcc (Ubuntu 11.4.0-1ubuntu1~22.04) 11.4.0 I, [2024-05-23T07:37:58.953233 #37630] INFO -- : Copyright (C) 2021 Free Software Foundation, Inc. I, [2024-05-23T07:37:58.953258 #37630] INFO -- : This is free software; see the source for copying conditions. There is NO I, [2024-05-23T07:37:58.953274 #37630] INFO -- : warranty; not even for MERCHANTABILITY or FITNESS FOR A PARTICULAR PURPOSE. I, [2024-05-23T07:37:58.953288 #37630] INFO -- : I, [2024-05-23T07:37:58.982678 #37630] INFO -- : generating encdb.h I, [2024-05-23T07:37:58.984323 #37630] INFO -- : generating enc.mk I, [2024-05-23T07:37:58.986339 #37630] INFO -- : building spec/ruby/optional/capi/ext/array_spec.so I, [2024-05-23T07:37:58.986592 #37630] INFO -- : building spec/ruby/optional/capi/ext/basic_object_spec.so I, [2024-05-23T07:37:58.987347 #37630] INFO -- : building spec/ruby/optional/capi/ext/bignum_spec.so I, [2024-05-23T07:37:58.987701 #37630] INFO -- : building spec/ruby/optional/capi/ext/binding_spec.so I, [2024-05-23T07:37:58.988029 #37630] INFO -- : building spec/ruby/optional/capi/ext/boolean_spec.so I, [2024-05-23T07:37:58.988943 #37630] INFO -- : building spec/ruby/optional/capi/ext/class_id_under_autoload_spec.so I, [2024-05-23T07:37:58.990123 #37630] INFO -- : building spec/ruby/optional/capi/ext/class_spec.so I, [2024-05-23T07:37:58.990614 #37630] INFO -- : building spec/ruby/optional/capi/ext/class_under_autoload_spec.so I, [2024-05-23T07:37:58.991595 #37630] INFO -- : building spec/ruby/optional/capi/ext/complex_spec.so I, [2024-05-23T07:37:58.992435 #37630] INFO -- : building spec/ruby/optional/capi/ext/constants_spec.so I, [2024-05-23T07:37:58.993072 #37630] INFO -- : building spec/ruby/optional/capi/ext/data_spec.so I, [2024-05-23T07:37:58.993406 #37630] INFO -- : building spec/ruby/optional/capi/ext/debug_spec.so I, [2024-05-23T07:37:58.994064 #37630] INFO -- : building spec/ruby/optional/capi/ext/encoding_spec.so I, [2024-05-23T07:37:58.994363 #37630] INFO -- : building spec/ruby/optional/capi/ext/enumerator_spec.so I, [2024-05-23T07:37:58.995048 #37630] INFO -- : building spec/ruby/optional/capi/ext/exception_spec.so I, [2024-05-23T07:37:58.995322 #37630] INFO -- : building spec/ruby/optional/capi/ext/fiber_spec.so I, [2024-05-23T07:37:58.996048 #37630] INFO -- : building spec/ruby/optional/capi/ext/file_spec.so I, [2024-05-23T07:37:59.000118 #37630] INFO -- : building spec/ruby/optional/capi/ext/fixnum_spec.so I, [2024-05-23T07:37:59.017964 #37630] INFO -- : encdb.h unchanged I, [2024-05-23T07:37:59.019746 #37630] INFO -- : building spec/ruby/optional/capi/ext/float_spec.so I, [2024-05-23T07:37:59.119953 #37630] INFO -- : building spec/ruby/optional/capi/ext/gc_spec.so I, [2024-05-23T07:37:59.133295 #37630] INFO -- : building spec/ruby/optional/capi/ext/globals_spec.so I, [2024-05-23T07:37:59.137425 #37630] INFO -- : building spec/ruby/optional/capi/ext/hash_spec.so I, [2024-05-23T07:37:59.144577 #37630] INFO -- : building spec/ruby/optional/capi/ext/integer_spec.so I, [2024-05-23T07:37:59.146948 #37630] INFO -- : building spec/ruby/optional/capi/ext/io_spec.so I, [2024-05-23T07:37:59.147182 #37630] INFO -- : building spec/ruby/optional/capi/ext/kernel_spec.so I, [2024-05-23T07:37:59.148354 #37630] INFO -- : building spec/ruby/optional/capi/ext/language_spec.so I, [2024-05-23T07:37:59.157894 #37630] INFO -- : building spec/ruby/optional/capi/ext/marshal_spec.so I, [2024-05-23T07:37:59.163394 #37630] INFO -- : building spec/ruby/optional/capi/ext/module_spec.so I, [2024-05-23T07:37:59.169931 #37630] INFO -- : building spec/ruby/optional/capi/ext/module_under_autoload_spec.so I, [2024-05-23T07:37:59.172311 #37630] INFO -- : building spec/ruby/optional/capi/ext/mutex_spec.so I, [2024-05-23T07:37:59.173506 #37630] INFO -- : building spec/ruby/optional/capi/ext/numeric_spec.so I, [2024-05-23T07:37:59.174648 #37630] INFO -- : building spec/ruby/optional/capi/ext/object_spec.so I, [2024-05-23T07:37:59.187991 #37630] INFO -- : building spec/ruby/optional/capi/ext/proc_spec.so I, [2024-05-23T07:37:59.188401 #37630] INFO -- : building spec/ruby/optional/capi/ext/range_spec.so I, [2024-05-23T07:37:59.216630 #37630] INFO -- : building spec/ruby/optional/capi/ext/rational_spec.so I, [2024-05-23T07:37:59.233847 #37630] INFO -- : building spec/ruby/optional/capi/ext/rbasic_spec.so I, [2024-05-23T07:37:59.245549 #37630] INFO -- : building spec/ruby/optional/capi/ext/regexp_spec.so I, [2024-05-23T07:37:59.298323 #37630] INFO -- : building spec/ruby/optional/capi/ext/string_spec.so I, [2024-05-23T07:37:59.303074 #37630] INFO -- : building spec/ruby/optional/capi/ext/struct_spec.so I, [2024-05-23T07:37:59.304913 #37630] INFO -- : building spec/ruby/optional/capi/ext/st_spec.so I, [2024-05-23T07:37:59.306390 #37630] INFO -- : building spec/ruby/optional/capi/ext/symbol_spec.so I, [2024-05-23T07:37:59.312433 #37630] INFO -- : building spec/ruby/optional/capi/ext/thread_spec.so I, [2024-05-23T07:37:59.312823 #37630] INFO -- : building spec/ruby/optional/capi/ext/time_spec.so I, [2024-05-23T07:37:59.317313 #37630] INFO -- : building spec/ruby/optional/capi/ext/tracepoint_spec.so I, [2024-05-23T07:37:59.341242 #37630] INFO -- : building spec/ruby/optional/capi/ext/typed_data_spec.so I, [2024-05-23T07:37:59.344875 #37630] INFO -- : building spec/ruby/optional/capi/ext/util_spec.so I, [2024-05-23T07:37:59.353522 #37630] INFO -- : making enc I, [2024-05-23T07:37:59.366060 #37630] INFO -- : making srcs under enc I, [2024-05-23T07:37:59.381311 #37630] INFO -- : make[1]: Entering directory '/tmp/ruby/build/trunk' I, [2024-05-23T07:37:59.381368 #37630] INFO -- : make[1]: Nothing to be done for 'enc'. I, [2024-05-23T07:37:59.381378 #37630] INFO -- : make[1]: Leaving directory '/tmp/ruby/build/trunk' I, [2024-05-23T07:37:59.414065 #37630] INFO -- : make[1]: Entering directory '/tmp/ruby/build/trunk' I, [2024-05-23T07:37:59.414127 #37630] INFO -- : make[1]: Nothing to be done for 'srcs'. I, [2024-05-23T07:37:59.414136 #37630] INFO -- : make[1]: Leaving directory '/tmp/ruby/build/trunk' I, [2024-05-23T07:37:59.414916 #37630] INFO -- : generating transdb.h I, [2024-05-23T07:37:59.527582 #37630] INFO -- : transdb.h unchanged I, [2024-05-23T07:37:59.529370 #37630] INFO -- : generating makefiles ext/configure-ext.mk I, [2024-05-23T07:37:59.529731 #37630] INFO -- : making trans I, [2024-05-23T07:37:59.556235 #37630] INFO -- : ext/configure-ext.mk updated I, [2024-05-23T07:37:59.558957 #37630] INFO -- : make[1]: Entering directory '/tmp/ruby/build/trunk' I, [2024-05-23T07:37:59.564459 #37630] INFO -- : make[1]: Entering directory '/tmp/ruby/build/trunk' I, [2024-05-23T07:37:59.564549 #37630] INFO -- : make[1]: Nothing to be done for 'trans'. I, [2024-05-23T07:37:59.564564 #37630] INFO -- : make[1]: Leaving directory '/tmp/ruby/build/trunk' I, [2024-05-23T07:37:59.641229 #37630] INFO -- : making encs I, [2024-05-23T07:37:59.699417 #37630] INFO -- : make[1]: Entering directory '/tmp/ruby/build/trunk' I, [2024-05-23T07:37:59.699483 #37630] INFO -- : make[1]: Nothing to be done for 'encs'. I, [2024-05-23T07:37:59.699499 #37630] INFO -- : make[1]: Leaving directory '/tmp/ruby/build/trunk' I, [2024-05-23T07:37:59.716538 #37630] INFO -- : make[1]: Leaving directory '/tmp/ruby/build/trunk' I, [2024-05-23T07:37:59.717322 #37630] INFO -- : generating makefile exts.mk I, [2024-05-23T07:37:59.755475 #37630] INFO -- : exts.mk unchanged I, [2024-05-23T07:37:59.760239 #37630] INFO -- : make[1]: Entering directory '/tmp/ruby/build/trunk' I, [2024-05-23T07:37:59.779821 #37630] INFO -- : make[2]: Entering directory '/tmp/ruby/build/trunk/ext/digest' I, [2024-05-23T07:37:59.781013 #37630] INFO -- : make[2]: Entering directory '/tmp/ruby/build/trunk/ext/json' I, [2024-05-23T07:37:59.781219 #37630] INFO -- : make[2]: Entering directory '/tmp/ruby/build/trunk/ext/coverage' I, [2024-05-23T07:37:59.781439 #37630] INFO -- : make[2]: Entering directory '/tmp/ruby/build/trunk/ext/io/console' I, [2024-05-23T07:37:59.782130 #37630] INFO -- : make[2]: Entering directory '/tmp/ruby/build/trunk/ext/date' I, [2024-05-23T07:37:59.782483 #37630] INFO -- : make[2]: Entering directory '/tmp/ruby/build/trunk/ext/rubyvm' I, [2024-05-23T07:37:59.783082 #37630] INFO -- : make[2]: Entering directory '/tmp/ruby/build/trunk/ext/monitor' I, [2024-05-23T07:37:59.783847 #37630] INFO -- : make[2]: Entering directory '/tmp/ruby/build/trunk/ext/fiddle' I, [2024-05-23T07:37:59.783962 #37630] INFO -- : make[2]: Entering directory '/tmp/ruby/build/trunk/ext/pathname' I, [2024-05-23T07:37:59.784262 #37630] INFO -- : make[2]: Leaving directory '/tmp/ruby/build/trunk/ext/coverage' I, [2024-05-23T07:37:59.784530 #37630] INFO -- : make[2]: Entering directory '/tmp/ruby/build/trunk/ext/pty' I, [2024-05-23T07:37:59.784782 #37630] INFO -- : make[2]: Leaving directory '/tmp/ruby/build/trunk/ext/rubyvm' I, [2024-05-23T07:37:59.784824 #37630] INFO -- : make[2]: Leaving directory '/tmp/ruby/build/trunk/ext/io/console' I, [2024-05-23T07:37:59.785286 #37630] INFO -- : make[2]: Entering directory '/tmp/ruby/build/trunk/ext/objspace' I, [2024-05-23T07:37:59.785771 #37630] INFO -- : make[2]: Leaving directory '/tmp/ruby/build/trunk/ext/date' I, [2024-05-23T07:37:59.786086 #37630] INFO -- : make[2]: Entering directory '/tmp/ruby/build/trunk/ext/psych' I, [2024-05-23T07:37:59.786301 #37630] INFO -- : make[2]: Leaving directory '/tmp/ruby/build/trunk/ext/monitor' I, [2024-05-23T07:37:59.786692 #37630] INFO -- : make[2]: Entering directory '/tmp/ruby/build/trunk/.bundle/gems/bigdecimal-3.1.8/ext/bigdecimal' I, [2024-05-23T07:37:59.786870 #37630] INFO -- : make[2]: Leaving directory '/tmp/ruby/build/trunk/ext/pathname' I, [2024-05-23T07:37:59.787124 #37630] INFO -- : make[2]: Leaving directory '/tmp/ruby/build/trunk/ext/digest' I, [2024-05-23T07:37:59.787133 #37630] INFO -- : make[2]: Entering directory '/tmp/ruby/build/trunk/.bundle/gems/debug-1.9.2/ext/debug' I, [2024-05-23T07:37:59.787224 #37630] INFO -- : make[2]: Leaving directory '/tmp/ruby/build/trunk/ext/pty' I, [2024-05-23T07:37:59.788854 #37630] INFO -- : make[2]: Entering directory '/tmp/ruby/build/trunk/ext/ripper' I, [2024-05-23T07:37:59.788969 #37630] INFO -- : make[2]: Entering directory '/tmp/ruby/build/trunk/.bundle/gems/racc-1.7.3/ext/racc/cparse' I, [2024-05-23T07:37:59.788990 #37630] INFO -- : make[2]: Leaving directory '/tmp/ruby/build/trunk/ext/json' I, [2024-05-23T07:37:59.789065 #37630] INFO -- : make[2]: Leaving directory '/tmp/ruby/build/trunk/ext/objspace' I, [2024-05-23T07:37:59.789615 #37630] INFO -- : make[2]: Entering directory '/tmp/ruby/build/trunk/.bundle/gems/nkf-0.2.0/ext/nkf' I, [2024-05-23T07:37:59.789863 #37630] INFO -- : make[2]: Entering directory '/tmp/ruby/build/trunk/.bundle/gems/racc-1.8.0/ext/racc/cparse' I, [2024-05-23T07:37:59.789952 #37630] INFO -- : make[2]: Entering directory '/tmp/ruby/build/trunk/.bundle/gems/syslog-0.1.2/ext/syslog' I, [2024-05-23T07:37:59.790367 #37630] INFO -- : make[2]: Entering directory '/tmp/ruby/build/trunk/.bundle/gems/rbs-3.4.4/ext/rbs_extension' I, [2024-05-23T07:37:59.792639 #37630] INFO -- : make[2]: Leaving directory '/tmp/ruby/build/trunk/ext/fiddle' I, [2024-05-23T07:37:59.793508 #37630] INFO -- : make[2]: Entering directory '/tmp/ruby/build/trunk/ext/socket' I, [2024-05-23T07:37:59.793686 #37630] INFO -- : make[2]: Entering directory '/tmp/ruby/build/trunk/ext/digest/sha2' I, [2024-05-23T07:37:59.793940 #37630] INFO -- : make[2]: Leaving directory '/tmp/ruby/build/trunk/ext/ripper' I, [2024-05-23T07:37:59.796821 #37630] INFO -- : make[2]: Leaving directory '/tmp/ruby/build/trunk/ext/digest/sha2' I, [2024-05-23T07:37:59.797880 #37630] INFO -- : make[2]: Leaving directory '/tmp/ruby/build/trunk/ext/psych' I, [2024-05-23T07:37:59.799826 #37630] INFO -- : make[2]: Leaving directory '/tmp/ruby/build/trunk/ext/socket' I, [2024-05-23T07:37:59.801251 #37630] INFO -- : make[2]: Entering directory '/tmp/ruby/build/trunk/ext/openssl' I, [2024-05-23T07:37:59.811328 #37630] INFO -- : make[2]: Leaving directory '/tmp/ruby/build/trunk/.bundle/gems/debug-1.9.2/ext/debug' I, [2024-05-23T07:37:59.812517 #37630] INFO -- : make[2]: Leaving directory '/tmp/ruby/build/trunk/ext/openssl' I, [2024-05-23T07:37:59.812948 #37630] INFO -- : make[2]: Leaving directory '/tmp/ruby/build/trunk/.bundle/gems/rbs-3.4.4/ext/rbs_extension' I, [2024-05-23T07:37:59.812976 #37630] INFO -- : make[2]: Leaving directory '/tmp/ruby/build/trunk/.bundle/gems/syslog-0.1.2/ext/syslog' I, [2024-05-23T07:37:59.813437 #37630] INFO -- : make[2]: Leaving directory '/tmp/ruby/build/trunk/.bundle/gems/racc-1.7.3/ext/racc/cparse' I, [2024-05-23T07:37:59.815699 #37630] INFO -- : make[2]: Leaving directory '/tmp/ruby/build/trunk/.bundle/gems/racc-1.8.0/ext/racc/cparse' I, [2024-05-23T07:37:59.818847 #37630] INFO -- : make[2]: Leaving directory '/tmp/ruby/build/trunk/.bundle/gems/bigdecimal-3.1.8/ext/bigdecimal' I, [2024-05-23T07:37:59.822796 #37630] INFO -- : make[2]: Leaving directory '/tmp/ruby/build/trunk/.bundle/gems/nkf-0.2.0/ext/nkf' I, [2024-05-23T07:37:59.846515 #37630] INFO -- : make[2]: Entering directory '/tmp/ruby/build/trunk' I, [2024-05-23T07:37:59.918021 #37630] INFO -- : linking ruby I, [2024-05-23T07:37:59.940489 #37630] INFO -- : make[2]: Leaving directory '/tmp/ruby/build/trunk' I, [2024-05-23T07:37:59.941025 #37630] INFO -- : make[1]: Leaving directory '/tmp/ruby/build/trunk' I, [2024-05-23T07:37:59.945403 #37630] INFO -- : make[1]: Entering directory '/tmp/ruby/build/trunk' I, [2024-05-23T07:37:59.945469 #37630] INFO -- : make[1]: Nothing to be done for 'note'. I, [2024-05-23T07:37:59.945485 #37630] INFO -- : make[1]: Leaving directory '/tmp/ruby/build/trunk' I, [2024-05-23T07:37:59.946513 #37630] INFO -- : $$$[end] "make all -j20" exit with 0. I, [2024-05-23T07:37:59.946660 #37630] INFO -- : $$$[beg] make install -j20 I, [2024-05-23T07:38:00.011084 #37630] INFO -- : Update power_assert to 84e85124c5014a139af39161d484156cfe87a9ed I, [2024-05-23T07:38:00.011153 #37630] INFO -- : Update rbs to ba7872795d5de04adb8ff500c0e6afdc81a041dd I, [2024-05-23T07:38:00.011318 #37630] INFO -- : Update typeprof to b19a6416da3a05d57fadd6ffdadb382b6d236ca5 I, [2024-05-23T07:38:00.012906 #37630] INFO -- : BASERUBY = /usr/bin/ruby --disable=gems I, [2024-05-23T07:38:00.012926 #37630] INFO -- : CC = gcc I, [2024-05-23T07:38:00.012932 #37630] INFO -- : LD = ld I, [2024-05-23T07:38:00.012937 #37630] INFO -- : LDSHARED = gcc -shared I, [2024-05-23T07:38:00.012942 #37630] INFO -- : CFLAGS = -O3 -fno-fast-math -ggdb3 -Wall -Wextra -Wdeprecated-declarations -Wdiv-by-zero -Wduplicated-cond -Wimplicit-function-declaration -Wimplicit-int -Wpointer-arith -Wwrite-strings -Wold-style-definition -Wimplicit-fallthrough=0 -Wmissing-noreturn -Wno-cast-function-type -Wno-constant-logical-operand -Wno-long-long -Wno-missing-field-initializers -Wno-overlength-strings -Wno-packed-bitfield-compat -Wno-parentheses-equality -Wno-self-assign -Wno-tautological-compare -Wno-unused-parameter -Wno-unused-value -Wsuggest-attribute=format -Wsuggest-attribute=noreturn -Wunused-variable -Wmisleading-indentation -Wundef -fPIC I, [2024-05-23T07:38:00.012946 #37630] INFO -- : XCFLAGS = -U_FORTIFY_SOURCE -D_FORTIFY_SOURCE=2 -fstack-protector-strong -fno-strict-overflow -fvisibility=hidden -fexcess-precision=standard -DRUBY_EXPORT -I. -I.ext/include/x86_64-linux -I/tmp/ruby/src/trunk/include -I/tmp/ruby/src/trunk -I/tmp/ruby/src/trunk/prism -I/tmp/ruby/src/trunk/enc/unicode/15.0.0 I, [2024-05-23T07:38:00.012950 #37630] INFO -- : CPPFLAGS = I, [2024-05-23T07:38:00.012954 #37630] INFO -- : DLDFLAGS = -Wl,--compress-debug-sections=zlib -Wl,-soname,libruby.so.3.4 -fstack-protector-strong I, [2024-05-23T07:38:00.012958 #37630] INFO -- : SOLIBS = -lz -lrt -lrt -lgmp -ldl -lcrypt -lm -lpthread I, [2024-05-23T07:38:00.012962 #37630] INFO -- : LANG = en_US.UTF-8 I, [2024-05-23T07:38:00.012965 #37630] INFO -- : LC_ALL = I, [2024-05-23T07:38:00.012969 #37630] INFO -- : LC_CTYPE = I, [2024-05-23T07:38:00.012973 #37630] INFO -- : MFLAGS = -j20 --jobserver-auth=4,5 I, [2024-05-23T07:38:00.012976 #37630] INFO -- : RUSTC = no I, [2024-05-23T07:38:00.012980 #37630] INFO -- : YJIT_RUSTC_ARGS = --crate-name=yjit --crate-type=staticlib --edition=2021 -g -C lto=thin -C opt-level=3 -C overflow-checks=on '--out-dir=/tmp/ruby/build/trunk/yjit/target/release/' /tmp/ruby/src/trunk/yjit/src/lib.rs I, [2024-05-23T07:38:00.046636 #37630] INFO -- : echo 84e85124c5014a139af39161d484156cfe87a9ed | /bin/sh /tmp/ruby/src/trunk/tool/ifchange /tmp/ruby/src/trunk/.bundle/.timestamp/power_assert.revision - I, [2024-05-23T07:38:00.046780 #37630] INFO -- : echo ba7872795d5de04adb8ff500c0e6afdc81a041dd | /bin/sh /tmp/ruby/src/trunk/tool/ifchange /tmp/ruby/src/trunk/.bundle/.timestamp/rbs.revision - I, [2024-05-23T07:38:00.046971 #37630] INFO -- : echo b19a6416da3a05d57fadd6ffdadb382b6d236ca5 | /bin/sh /tmp/ruby/src/trunk/tool/ifchange /tmp/ruby/src/trunk/.bundle/.timestamp/typeprof.revision - I, [2024-05-23T07:38:00.047528 #37630] INFO -- : generating encdb.h I, [2024-05-23T07:38:00.047612 #37630] INFO -- : gcc (Ubuntu 11.4.0-1ubuntu1~22.04) 11.4.0 I, [2024-05-23T07:38:00.047626 #37630] INFO -- : Copyright (C) 2021 Free Software Foundation, Inc. I, [2024-05-23T07:38:00.047637 #37630] INFO -- : This is free software; see the source for copying conditions. There is NO I, [2024-05-23T07:38:00.047648 #37630] INFO -- : warranty; not even for MERCHANTABILITY or FITNESS FOR A PARTICULAR PURPOSE. I, [2024-05-23T07:38:00.047659 #37630] INFO -- : I, [2024-05-23T07:38:00.048363 #37630] INFO -- : generating enc.mk I, [2024-05-23T07:38:00.048632 #37630] INFO -- : /tmp/ruby/src/trunk/.bundle/.timestamp/power_assert.revision unchanged I, [2024-05-23T07:38:00.048807 #37630] INFO -- : /tmp/ruby/src/trunk/.bundle/.timestamp/rbs.revision unchanged I, [2024-05-23T07:38:00.049321 #37630] INFO -- : /tmp/ruby/src/trunk/.bundle/.timestamp/typeprof.revision unchanged I, [2024-05-23T07:38:00.071863 #37630] INFO -- : encdb.h unchanged I, [2024-05-23T07:38:00.073195 #37630] INFO -- : Building power_assert@84e85124c5014a139af39161d484156cfe87a9ed to /tmp/ruby/src/trunk/gems/power_assert-2.0.3.gem I, [2024-05-23T07:38:00.142402 #37630] INFO -- : Successfully built RubyGem I, [2024-05-23T07:38:00.142461 #37630] INFO -- : Name: power_assert I, [2024-05-23T07:38:00.142477 #37630] INFO -- : Version: 2.0.4dev I, [2024-05-23T07:38:00.142492 #37630] INFO -- : File: power_assert-2.0.4dev.gem I, [2024-05-23T07:38:00.144530 #37630] INFO -- : Extracting bundle gem power_assert-2.0.3... I, [2024-05-23T07:38:00.170443 #37630] INFO -- : making srcs under enc I, [2024-05-23T07:38:00.170597 #37630] INFO -- : making enc I, [2024-05-23T07:38:00.188029 #37630] INFO -- : make[1]: Entering directory '/tmp/ruby/build/trunk' I, [2024-05-23T07:38:00.188081 #37630] INFO -- : make[1]: Nothing to be done for 'enc'. I, [2024-05-23T07:38:00.188094 #37630] INFO -- : make[1]: Leaving directory '/tmp/ruby/build/trunk' I, [2024-05-23T07:38:00.199881 #37630] INFO -- : make[1]: Entering directory '/tmp/ruby/build/trunk' I, [2024-05-23T07:38:00.199942 #37630] INFO -- : make[1]: Nothing to be done for 'srcs'. I, [2024-05-23T07:38:00.199955 #37630] INFO -- : make[1]: Leaving directory '/tmp/ruby/build/trunk' I, [2024-05-23T07:38:00.200631 #37630] INFO -- : generating transdb.h I, [2024-05-23T07:38:00.205577 #37630] INFO -- : Try with hash version of bundled gems instead of gems/power_assert-2.0.3.gem. We don't use this gem with release version of Ruby. I, [2024-05-23T07:38:00.210550 #37630] INFO -- : Unpacked gems/power_assert-2.0.4dev.gem I, [2024-05-23T07:38:00.297114 #37630] INFO -- : transdb.h unchanged I, [2024-05-23T07:38:00.298497 #37630] INFO -- : generating makefiles ext/configure-ext.mk I, [2024-05-23T07:38:00.298628 #37630] INFO -- : making trans I, [2024-05-23T07:38:00.325508 #37630] INFO -- : ext/configure-ext.mk unchanged I, [2024-05-23T07:38:00.327874 #37630] INFO -- : make[1]: Entering directory '/tmp/ruby/build/trunk' I, [2024-05-23T07:38:00.334496 #37630] INFO -- : make[1]: Entering directory '/tmp/ruby/build/trunk' I, [2024-05-23T07:38:00.334594 #37630] INFO -- : make[1]: Nothing to be done for 'trans'. I, [2024-05-23T07:38:00.334606 #37630] INFO -- : make[1]: Leaving directory '/tmp/ruby/build/trunk' I, [2024-05-23T07:38:00.335452 #37630] INFO -- : making encs I, [2024-05-23T07:38:00.394242 #37630] INFO -- : make[1]: Entering directory '/tmp/ruby/build/trunk' I, [2024-05-23T07:38:00.394316 #37630] INFO -- : make[1]: Nothing to be done for 'encs'. I, [2024-05-23T07:38:00.394343 #37630] INFO -- : make[1]: Leaving directory '/tmp/ruby/build/trunk' I, [2024-05-23T07:38:00.480280 #37630] INFO -- : make[1]: Leaving directory '/tmp/ruby/build/trunk' I, [2024-05-23T07:38:00.480949 #37630] INFO -- : generating makefile exts.mk I, [2024-05-23T07:38:00.518539 #37630] INFO -- : exts.mk unchanged I, [2024-05-23T07:38:00.523629 #37630] INFO -- : make[1]: Entering directory '/tmp/ruby/build/trunk' I, [2024-05-23T07:38:00.553941 #37630] INFO -- : make[2]: Entering directory '/tmp/ruby/build/trunk/ext/digest' I, [2024-05-23T07:38:00.555503 #37630] INFO -- : make[2]: Entering directory '/tmp/ruby/build/trunk/ext/coverage' I, [2024-05-23T07:38:00.556443 #37630] INFO -- : make[2]: Entering directory '/tmp/ruby/build/trunk/ext/json' I, [2024-05-23T07:38:00.556771 #37630] INFO -- : make[2]: Entering directory '/tmp/ruby/build/trunk/ext/io/console' I, [2024-05-23T07:38:00.557035 #37630] INFO -- : make[2]: Entering directory '/tmp/ruby/build/trunk/ext/date' I, [2024-05-23T07:38:00.558495 #37630] INFO -- : make[2]: Entering directory '/tmp/ruby/build/trunk/ext/rubyvm' I, [2024-05-23T07:38:00.559203 #37630] INFO -- : make[2]: Entering directory '/tmp/ruby/build/trunk/ext/monitor' I, [2024-05-23T07:38:00.559488 #37630] INFO -- : make[2]: Leaving directory '/tmp/ruby/build/trunk/ext/digest' I, [2024-05-23T07:38:00.559933 #37630] INFO -- : make[2]: Entering directory '/tmp/ruby/build/trunk/ext/pathname' I, [2024-05-23T07:38:00.560128 #37630] INFO -- : make[2]: Leaving directory '/tmp/ruby/build/trunk/ext/coverage' I, [2024-05-23T07:38:00.560207 #37630] INFO -- : make[2]: Entering directory '/tmp/ruby/build/trunk/ext/fiddle' I, [2024-05-23T07:38:00.560567 #37630] INFO -- : make[2]: Entering directory '/tmp/ruby/build/trunk/ext/pty' I, [2024-05-23T07:38:00.560743 #37630] INFO -- : make[2]: Leaving directory '/tmp/ruby/build/trunk/ext/io/console' I, [2024-05-23T07:38:00.561339 #37630] INFO -- : make[2]: Leaving directory '/tmp/ruby/build/trunk/ext/rubyvm' I, [2024-05-23T07:38:00.561730 #37630] INFO -- : make[2]: Entering directory '/tmp/ruby/build/trunk/ext/objspace' I, [2024-05-23T07:38:00.562184 #37630] INFO -- : make[2]: Leaving directory '/tmp/ruby/build/trunk/ext/date' I, [2024-05-23T07:38:00.562218 #37630] INFO -- : make[2]: Entering directory '/tmp/ruby/build/trunk/ext/psych' I, [2024-05-23T07:38:00.562892 #37630] INFO -- : make[2]: Entering directory '/tmp/ruby/build/trunk/.bundle/gems/bigdecimal-3.1.8/ext/bigdecimal' I, [2024-05-23T07:38:00.563122 #37630] INFO -- : make[2]: Leaving directory '/tmp/ruby/build/trunk/ext/pathname' I, [2024-05-23T07:38:00.563209 #37630] INFO -- : make[2]: Leaving directory '/tmp/ruby/build/trunk/ext/json' I, [2024-05-23T07:38:00.563360 #37630] INFO -- : make[2]: Entering directory '/tmp/ruby/build/trunk/.bundle/gems/debug-1.9.2/ext/debug' I, [2024-05-23T07:38:00.563709 #37630] INFO -- : make[2]: Entering directory '/tmp/ruby/build/trunk/.bundle/gems/nkf-0.2.0/ext/nkf' I, [2024-05-23T07:38:00.564136 #37630] INFO -- : make[2]: Entering directory '/tmp/ruby/build/trunk/.bundle/gems/racc-1.8.0/ext/racc/cparse' I, [2024-05-23T07:38:00.564159 #37630] INFO -- : make[2]: Entering directory '/tmp/ruby/build/trunk/.bundle/gems/racc-1.7.3/ext/racc/cparse' I, [2024-05-23T07:38:00.564205 #37630] INFO -- : make[2]: Leaving directory '/tmp/ruby/build/trunk/ext/pty' I, [2024-05-23T07:38:00.564361 #37630] INFO -- : make[2]: Entering directory '/tmp/ruby/build/trunk/ext/ripper' I, [2024-05-23T07:38:00.564569 #37630] INFO -- : make[2]: Entering directory '/tmp/ruby/build/trunk/.bundle/gems/syslog-0.1.2/ext/syslog' I, [2024-05-23T07:38:00.564634 #37630] INFO -- : make[2]: Leaving directory '/tmp/ruby/build/trunk/ext/monitor' I, [2024-05-23T07:38:00.565070 #37630] INFO -- : make[2]: Entering directory '/tmp/ruby/build/trunk/.bundle/gems/rbs-3.4.4/ext/rbs_extension' I, [2024-05-23T07:38:00.567495 #37630] INFO -- : make[2]: Leaving directory '/tmp/ruby/build/trunk/ext/objspace' I, [2024-05-23T07:38:00.568734 #37630] INFO -- : make[2]: Leaving directory '/tmp/ruby/build/trunk/ext/fiddle' I, [2024-05-23T07:38:00.568951 #37630] INFO -- : make[2]: Entering directory '/tmp/ruby/build/trunk/ext/socket' I, [2024-05-23T07:38:00.569691 #37630] INFO -- : make[2]: Leaving directory '/tmp/ruby/build/trunk/ext/ripper' I, [2024-05-23T07:38:00.570167 #37630] INFO -- : make[2]: Entering directory '/tmp/ruby/build/trunk/ext/openssl' I, [2024-05-23T07:38:00.575198 #37630] INFO -- : make[2]: Leaving directory '/tmp/ruby/build/trunk/ext/socket' I, [2024-05-23T07:38:00.575248 #37630] INFO -- : make[2]: Leaving directory '/tmp/ruby/build/trunk/ext/psych' I, [2024-05-23T07:38:00.580057 #37630] INFO -- : make[2]: Entering directory '/tmp/ruby/build/trunk/ext/digest/sha2' I, [2024-05-23T07:38:00.581571 #37630] INFO -- : make[2]: Leaving directory '/tmp/ruby/build/trunk/ext/openssl' I, [2024-05-23T07:38:00.583361 #37630] INFO -- : make[2]: Leaving directory '/tmp/ruby/build/trunk/ext/digest/sha2' I, [2024-05-23T07:38:00.586460 #37630] INFO -- : make[2]: Leaving directory '/tmp/ruby/build/trunk/.bundle/gems/racc-1.8.0/ext/racc/cparse' I, [2024-05-23T07:38:00.586697 #37630] INFO -- : make[2]: Leaving directory '/tmp/ruby/build/trunk/.bundle/gems/debug-1.9.2/ext/debug' I, [2024-05-23T07:38:00.589611 #37630] INFO -- : make[2]: Leaving directory '/tmp/ruby/build/trunk/.bundle/gems/bigdecimal-3.1.8/ext/bigdecimal' I, [2024-05-23T07:38:00.589675 #37630] INFO -- : make[2]: Leaving directory '/tmp/ruby/build/trunk/.bundle/gems/nkf-0.2.0/ext/nkf' I, [2024-05-23T07:38:00.589762 #37630] INFO -- : make[2]: Leaving directory '/tmp/ruby/build/trunk/.bundle/gems/rbs-3.4.4/ext/rbs_extension' I, [2024-05-23T07:38:00.595685 #37630] INFO -- : make[2]: Leaving directory '/tmp/ruby/build/trunk/.bundle/gems/racc-1.7.3/ext/racc/cparse' I, [2024-05-23T07:38:00.595880 #37630] INFO -- : make[2]: Leaving directory '/tmp/ruby/build/trunk/.bundle/gems/syslog-0.1.2/ext/syslog' I, [2024-05-23T07:38:00.620094 #37630] INFO -- : make[2]: Entering directory '/tmp/ruby/build/trunk' I, [2024-05-23T07:38:00.685974 #37630] INFO -- : make[2]: 'ruby' is up to date. I, [2024-05-23T07:38:00.686023 #37630] INFO -- : make[2]: Leaving directory '/tmp/ruby/build/trunk' I, [2024-05-23T07:38:00.686262 #37630] INFO -- : make[1]: Leaving directory '/tmp/ruby/build/trunk' I, [2024-05-23T07:38:00.690081 #37630] INFO -- : make[1]: Entering directory '/tmp/ruby/build/trunk' I, [2024-05-23T07:38:00.690102 #37630] INFO -- : make[1]: Nothing to be done for 'note'. I, [2024-05-23T07:38:00.690108 #37630] INFO -- : make[1]: Leaving directory '/tmp/ruby/build/trunk' I, [2024-05-23T07:38:00.690284 #37630] INFO -- : ./miniruby -I/tmp/ruby/src/trunk/lib -I. -I.ext/common /tmp/ruby/src/trunk/tool/runruby.rb --extout=.ext -- --disable-gems -r./x86_64-linux-fake /tmp/ruby/src/trunk/tool/rbinstall.rb --make="make" --dest-dir="" --extout=".ext" --ext-build-dir="./ext" --mflags="-j20 --jobserver-auth=4,5" --make-flags=" -j20 --jobserver-auth=4,5" --data-mode=0644 --prog-mode=0755 --installed-list .installed.list --mantype="doc" --gnumake --install=all --exclude=doc I, [2024-05-23T07:38:00.786697 #37630] INFO -- : Installing to I, [2024-05-23T07:38:00.786767 #37630] INFO -- : installing binary commands: /tmp/ruby/install/trunk/bin I, [2024-05-23T07:38:00.786793 #37630] INFO -- : installing base libraries: /tmp/ruby/install/trunk/lib I, [2024-05-23T07:38:00.793931 #37630] INFO -- : installing arch files: /tmp/ruby/install/trunk/lib/ruby/3.4.0+0/x86_64-linux I, [2024-05-23T07:38:00.793963 #37630] INFO -- : installing pkgconfig data: /tmp/ruby/install/trunk/lib/pkgconfig I, [2024-05-23T07:38:00.793969 #37630] INFO -- : installing extension objects: /tmp/ruby/install/trunk/lib/ruby/3.4.0+0/x86_64-linux I, [2024-05-23T07:38:00.803591 #37630] INFO -- : installing extension objects: /tmp/ruby/install/trunk/lib/ruby/site_ruby/3.4.0+0/x86_64-linux I, [2024-05-23T07:38:00.803616 #37630] INFO -- : installing extension objects: /tmp/ruby/install/trunk/lib/ruby/vendor_ruby/3.4.0+0/x86_64-linux I, [2024-05-23T07:38:00.803623 #37630] INFO -- : installing extension headers: /tmp/ruby/install/trunk/include/ruby-3.4.0+0/x86_64-linux I, [2024-05-23T07:38:00.803786 #37630] INFO -- : installing extension scripts: /tmp/ruby/install/trunk/lib/ruby/3.4.0+0 I, [2024-05-23T07:38:00.806545 #37630] INFO -- : installing extension scripts: /tmp/ruby/install/trunk/lib/ruby/site_ruby/3.4.0+0 I, [2024-05-23T07:38:00.806567 #37630] INFO -- : installing extension scripts: /tmp/ruby/install/trunk/lib/ruby/vendor_ruby/3.4.0+0 I, [2024-05-23T07:38:00.806573 #37630] INFO -- : installing extension headers: /tmp/ruby/install/trunk/include/ruby-3.4.0+0/ruby I, [2024-05-23T07:38:00.806578 #37630] INFO -- : installing command scripts: /tmp/ruby/install/trunk/bin I, [2024-05-23T07:38:00.806582 #37630] INFO -- : installing library scripts: /tmp/ruby/install/trunk/lib/ruby/3.4.0+0 I, [2024-05-23T07:38:00.839437 #37630] INFO -- : installing common headers: /tmp/ruby/install/trunk/include/ruby-3.4.0+0 I, [2024-05-23T07:38:00.845847 #37630] INFO -- : installing manpages: /tmp/ruby/install/trunk/share/man/man1 I, [2024-05-23T07:38:00.845873 #37630] INFO -- : installing default gems from lib: /tmp/ruby/install/trunk/lib/ruby/gems/3.4.0+0 I, [2024-05-23T07:38:00.868765 #37630] INFO -- : benchmark 0.3.0 I, [2024-05-23T07:38:00.870694 #37630] INFO -- : bundler 2.6.0.dev I, [2024-05-23T07:38:00.872846 #37630] INFO -- : cgi 0.4.1 I, [2024-05-23T07:38:00.873397 #37630] INFO -- : delegate 0.3.1 I, [2024-05-23T07:38:00.873891 #37630] INFO -- : did_you_mean 1.6.3 I, [2024-05-23T07:38:00.874376 #37630] INFO -- : english 0.8.0 I, [2024-05-23T07:38:00.874841 #37630] INFO -- : erb 4.0.4 I, [2024-05-23T07:38:00.875789 #37630] INFO -- : error_highlight 0.6.0 I, [2024-05-23T07:38:00.876548 #37630] INFO -- : fileutils 1.7.2 I, [2024-05-23T07:38:00.877287 #37630] INFO -- : find 0.2.0 I, [2024-05-23T07:38:00.878147 #37630] INFO -- : forwardable 1.3.3 I, [2024-05-23T07:38:00.879299 #37630] INFO -- : ipaddr 1.2.6 I, [2024-05-23T07:38:00.879933 #37630] INFO -- : irb 1.13.1 I, [2024-05-23T07:38:00.880719 #37630] INFO -- : logger 1.6.0 I, [2024-05-23T07:38:00.881217 #37630] INFO -- : net-http 0.4.1 I, [2024-05-23T07:38:00.881708 #37630] INFO -- : net-protocol 0.2.2 I, [2024-05-23T07:38:00.882194 #37630] INFO -- : open-uri 0.4.1 I, [2024-05-23T07:38:00.882694 #37630] INFO -- : open3 0.2.1 I, [2024-05-23T07:38:00.883163 #37630] INFO -- : optparse 0.5.0 I, [2024-05-23T07:38:00.883566 #37630] INFO -- : ostruct 0.6.0 I, [2024-05-23T07:38:00.884092 #37630] INFO -- : pp 0.5.0 I, [2024-05-23T07:38:00.884534 #37630] INFO -- : prettyprint 0.2.0 I, [2024-05-23T07:38:00.885062 #37630] INFO -- : prism 0.29.0 I, [2024-05-23T07:38:00.885554 #37630] INFO -- : pstore 0.1.3 I, [2024-05-23T07:38:00.886039 #37630] INFO -- : rdoc 6.7.0 I, [2024-05-23T07:38:00.887023 #37630] INFO -- : readline 0.0.4 I, [2024-05-23T07:38:00.887556 #37630] INFO -- : reline 0.5.7 I, [2024-05-23T07:38:00.888113 #37630] INFO -- : resolv 0.4.0 I, [2024-05-23T07:38:00.888589 #37630] INFO -- : ruby2_keywords 0.0.5 I, [2024-05-23T07:38:00.889094 #37630] INFO -- : securerandom 0.3.1 I, [2024-05-23T07:38:00.890089 #37630] INFO -- : set 1.1.0 I, [2024-05-23T07:38:00.890823 #37630] INFO -- : shellwords 0.2.0 I, [2024-05-23T07:38:00.891316 #37630] INFO -- : singleton 0.2.0 I, [2024-05-23T07:38:00.891685 #37630] INFO -- : syntax_suggest 2.0.0 I, [2024-05-23T07:38:00.892475 #37630] INFO -- : tempfile 0.2.1 I, [2024-05-23T07:38:00.892900 #37630] INFO -- : time 0.3.0 I, [2024-05-23T07:38:00.893450 #37630] INFO -- : timeout 0.4.1 I, [2024-05-23T07:38:00.893927 #37630] INFO -- : tmpdir 0.2.0 I, [2024-05-23T07:38:00.894411 #37630] INFO -- : tsort 0.2.0 I, [2024-05-23T07:38:00.894866 #37630] INFO -- : un 0.3.0 I, [2024-05-23T07:38:00.895314 #37630] INFO -- : uri 0.13.0 I, [2024-05-23T07:38:00.895841 #37630] INFO -- : weakref 0.1.3 I, [2024-05-23T07:38:00.896382 #37630] INFO -- : yaml 0.3.0 I, [2024-05-23T07:38:00.896691 #37630] INFO -- : installing default gems from ext: /tmp/ruby/install/trunk/lib/ruby/gems/3.4.0+0 I, [2024-05-23T07:38:00.903238 #37630] INFO -- : date 3.3.4 I, [2024-05-23T07:38:00.903778 #37630] INFO -- : digest 3.1.1 I, [2024-05-23T07:38:00.904423 #37630] INFO -- : etc 1.4.3 I, [2024-05-23T07:38:00.904937 #37630] INFO -- : fcntl 1.1.0 I, [2024-05-23T07:38:00.905398 #37630] INFO -- : fiddle 1.1.3 I, [2024-05-23T07:38:00.905883 #37630] INFO -- : io-console 0.7.2 I, [2024-05-23T07:38:00.906356 #37630] INFO -- : io-nonblock 0.3.0 I, [2024-05-23T07:38:00.906818 #37630] INFO -- : io-wait 0.3.1 I, [2024-05-23T07:38:00.907260 #37630] INFO -- : json 2.7.2 I, [2024-05-23T07:38:00.907774 #37630] INFO -- : openssl 3.2.0 I, [2024-05-23T07:38:00.908384 #37630] INFO -- : pathname 0.3.0 I, [2024-05-23T07:38:00.908872 #37630] INFO -- : psych 5.1.2 I, [2024-05-23T07:38:00.909417 #37630] INFO -- : stringio 3.1.1 I, [2024-05-23T07:38:00.909910 #37630] INFO -- : strscan 3.1.1 I, [2024-05-23T07:38:00.910376 #37630] INFO -- : zlib 3.1.0 I, [2024-05-23T07:38:00.910710 #37630] INFO -- : installing bundled gems: /tmp/ruby/install/trunk/lib/ruby/gems/3.4.0+0 I, [2024-05-23T07:38:00.911331 #37630] INFO -- : minitest 5.23.1 I, [2024-05-23T07:38:00.920073 #37630] INFO -- : rake 13.2.1 I, [2024-05-23T07:38:00.923497 #37630] INFO -- : test-unit 3.6.2 I, [2024-05-23T07:38:00.928418 #37630] INFO -- : rexml 3.2.8 I, [2024-05-23T07:38:00.932211 #37630] INFO -- : rss 0.3.0 I, [2024-05-23T07:38:00.934838 #37630] INFO -- : net-ftp 0.3.4 I, [2024-05-23T07:38:00.936497 #37630] INFO -- : net-imap 0.4.11 I, [2024-05-23T07:38:00.940193 #37630] INFO -- : net-pop 0.1.2 I, [2024-05-23T07:38:00.941192 #37630] INFO -- : net-smtp 0.5.0 I, [2024-05-23T07:38:00.942360 #37630] INFO -- : matrix 0.4.2 I, [2024-05-23T07:38:00.945831 #37630] INFO -- : prime 0.1.2 I, [2024-05-23T07:38:00.950460 #37630] INFO -- : rbs 3.4.4 I, [2024-05-23T07:38:00.973000 #37630] INFO -- : typeprof 0.21.11 I, [2024-05-23T07:38:00.975325 #37630] INFO -- : debug 1.9.2 I, [2024-05-23T07:38:00.978845 #37630] INFO -- : racc 1.8.0 I, [2024-05-23T07:38:00.981717 #37630] INFO -- : mutex_m 0.2.0 I, [2024-05-23T07:38:00.983043 #37630] INFO -- : getoptlong 0.2.1 I, [2024-05-23T07:38:00.984661 #37630] INFO -- : base64 0.2.0 I, [2024-05-23T07:38:00.985760 #37630] INFO -- : bigdecimal 3.1.8 I, [2024-05-23T07:38:00.988257 #37630] INFO -- : observer 0.1.2 I, [2024-05-23T07:38:00.989445 #37630] INFO -- : abbrev 0.1.2 I, [2024-05-23T07:38:00.990714 #37630] INFO -- : resolv-replace 0.1.1 I, [2024-05-23T07:38:00.992160 #37630] INFO -- : rinda 0.2.0 I, [2024-05-23T07:38:00.993482 #37630] INFO -- : drb 2.2.1 I, [2024-05-23T07:38:00.995067 #37630] INFO -- : nkf 0.2.0 I, [2024-05-23T07:38:00.997529 #37630] INFO -- : syslog 0.1.2 I, [2024-05-23T07:38:00.999712 #37630] INFO -- : csv 3.3.0 I, [2024-05-23T07:38:01.002170 #37630] INFO -- : installing bundled gem cache: /tmp/ruby/install/trunk/lib/ruby/gems/3.4.0+0/cache I, [2024-05-23T07:38:01.003723 #37630] INFO -- : skipped bundled gems: I, [2024-05-23T07:38:01.003744 #37630] INFO -- : power_assert-2.0.4dev.gem not found in bundled_gems I, [2024-05-23T07:38:01.006637 #37630] INFO -- : $$$[end] "make install -j20" exit with 0. I, [2024-05-23T07:38:01.006751 #37630] INFO -- : $$$[beg] make yes-btest TESTOPTS='-q -j20' I, [2024-05-23T07:38:07.024389 #37630] INFO -- : PASS all 1936 tests E, [2024-05-23T07:38:07.032494 #37630] ERROR -- : I, [2024-05-23T07:38:07.032947 #37630] INFO -- : $$$[end] "make yes-btest TESTOPTS='-q -j20'" exit with 0. I, [2024-05-23T07:38:07.033103 #37630] INFO -- : $$$[beg] make yes-test-basic TESTS='-j20' I, [2024-05-23T07:38:07.100884 #37630] INFO -- : BASERUBY = /usr/bin/ruby --disable=gems I, [2024-05-23T07:38:07.100943 #37630] INFO -- : CC = gcc I, [2024-05-23T07:38:07.100954 #37630] INFO -- : LD = ld I, [2024-05-23T07:38:07.100962 #37630] INFO -- : LDSHARED = gcc -shared I, [2024-05-23T07:38:07.100969 #37630] INFO -- : CFLAGS = -O3 -fno-fast-math -ggdb3 -Wall -Wextra -Wdeprecated-declarations -Wdiv-by-zero -Wduplicated-cond -Wimplicit-function-declaration -Wimplicit-int -Wpointer-arith -Wwrite-strings -Wold-style-definition -Wimplicit-fallthrough=0 -Wmissing-noreturn -Wno-cast-function-type -Wno-constant-logical-operand -Wno-long-long -Wno-missing-field-initializers -Wno-overlength-strings -Wno-packed-bitfield-compat -Wno-parentheses-equality -Wno-self-assign -Wno-tautological-compare -Wno-unused-parameter -Wno-unused-value -Wsuggest-attribute=format -Wsuggest-attribute=noreturn -Wunused-variable -Wmisleading-indentation -Wundef -fPIC I, [2024-05-23T07:38:07.100977 #37630] INFO -- : XCFLAGS = -U_FORTIFY_SOURCE -D_FORTIFY_SOURCE=2 -fstack-protector-strong -fno-strict-overflow -fvisibility=hidden -fexcess-precision=standard -DRUBY_EXPORT -I. -I.ext/include/x86_64-linux -I/tmp/ruby/src/trunk/include -I/tmp/ruby/src/trunk -I/tmp/ruby/src/trunk/prism -I/tmp/ruby/src/trunk/enc/unicode/15.0.0 I, [2024-05-23T07:38:07.100984 #37630] INFO -- : CPPFLAGS = I, [2024-05-23T07:38:07.100992 #37630] INFO -- : DLDFLAGS = -Wl,--compress-debug-sections=zlib -Wl,-soname,libruby.so.3.4 -fstack-protector-strong I, [2024-05-23T07:38:07.100999 #37630] INFO -- : SOLIBS = -lz -lrt -lrt -lgmp -ldl -lcrypt -lm -lpthread I, [2024-05-23T07:38:07.101005 #37630] INFO -- : LANG = en_US.UTF-8 I, [2024-05-23T07:38:07.101011 #37630] INFO -- : LC_ALL = I, [2024-05-23T07:38:07.101018 #37630] INFO -- : LC_CTYPE = I, [2024-05-23T07:38:07.101030 #37630] INFO -- : MFLAGS = I, [2024-05-23T07:38:07.101037 #37630] INFO -- : RUSTC = no I, [2024-05-23T07:38:07.101043 #37630] INFO -- : YJIT_RUSTC_ARGS = --crate-name=yjit --crate-type=staticlib --edition=2021 -g -C lto=thin -C opt-level=3 -C overflow-checks=on '--out-dir=/tmp/ruby/build/trunk/yjit/target/release/' /tmp/ruby/src/trunk/yjit/src/lib.rs I, [2024-05-23T07:38:07.101898 #37630] INFO -- : gcc (Ubuntu 11.4.0-1ubuntu1~22.04) 11.4.0 I, [2024-05-23T07:38:07.101945 #37630] INFO -- : Copyright (C) 2021 Free Software Foundation, Inc. I, [2024-05-23T07:38:07.101962 #37630] INFO -- : This is free software; see the source for copying conditions. There is NO I, [2024-05-23T07:38:07.101975 #37630] INFO -- : warranty; not even for MERCHANTABILITY or FITNESS FOR A PARTICULAR PURPOSE. I, [2024-05-23T07:38:07.101987 #37630] INFO -- : I, [2024-05-23T07:38:07.220451 #37630] INFO -- : Checking leaked global symbols...none I, [2024-05-23T07:38:07.262297 #37630] INFO -- : /tmp/ruby/src/trunk/basictest/test.rb:assignment ....................................................................................................................................................................................................................................................................................................................................................................................OK 372 I, [2024-05-23T07:38:07.262363 #37630] INFO -- : /tmp/ruby/src/trunk/basictest/test.rb:condition ..OK 2 I, [2024-05-23T07:38:07.262370 #37630] INFO -- : /tmp/ruby/src/trunk/basictest/test.rb:if/unless ...OK 3 I, [2024-05-23T07:38:07.262374 #37630] INFO -- : /tmp/ruby/src/trunk/basictest/test.rb:case .....OK 5 I, [2024-05-23T07:38:07.262574 #37630] INFO -- : /tmp/ruby/src/trunk/basictest/test.rb:while/until ........OK 8 I, [2024-05-23T07:38:07.262632 #37630] INFO -- : /tmp/ruby/src/trunk/basictest/test.rb:exception ..........OK 10 I, [2024-05-23T07:38:07.262902 #37630] INFO -- : /tmp/ruby/src/trunk/basictest/test.rb:array .......................................OK 39 I, [2024-05-23T07:38:07.263002 #37630] INFO -- : /tmp/ruby/src/trunk/basictest/test.rb:hash ...........................OK 27 I, [2024-05-23T07:38:07.263730 #37630] INFO -- : /tmp/ruby/src/trunk/basictest/test.rb:iterator ...........................................................................................................OK 107 I, [2024-05-23T07:38:07.264010 #37630] INFO -- : /tmp/ruby/src/trunk/basictest/test.rb:float ................................................................................OK 80 I, [2024-05-23T07:38:07.265943 #37630] INFO -- : /tmp/ruby/src/trunk/basictest/test.rb:bignum ...............................OK 31 I, [2024-05-23T07:38:07.266714 #37630] INFO -- : /tmp/ruby/src/trunk/basictest/test.rb:string & char ..............................................................OK 62 I, [2024-05-23T07:38:07.266749 #37630] INFO -- : /tmp/ruby/src/trunk/basictest/test.rb:assignment ..........OK 10 I, [2024-05-23T07:38:07.266786 #37630] INFO -- : /tmp/ruby/src/trunk/basictest/test.rb:call ......OK 6 I, [2024-05-23T07:38:07.266843 #37630] INFO -- : /tmp/ruby/src/trunk/basictest/test.rb:proc .........OK 9 I, [2024-05-23T07:38:07.367530 #37630] INFO -- : /tmp/ruby/src/trunk/basictest/test.rb:signal ..OK 2 I, [2024-05-23T07:38:07.370176 #37630] INFO -- : /tmp/ruby/src/trunk/basictest/test.rb:eval ...........................OK 27 I, [2024-05-23T07:38:07.503986 #37630] INFO -- : /tmp/ruby/src/trunk/basictest/test.rb:system ........OK 8 I, [2024-05-23T07:38:07.504066 #37630] INFO -- : /tmp/ruby/src/trunk/basictest/test.rb:const .....OK 5 I, [2024-05-23T07:38:07.504126 #37630] INFO -- : /tmp/ruby/src/trunk/basictest/test.rb:clone .....OK 5 I, [2024-05-23T07:38:07.504297 #37630] INFO -- : /tmp/ruby/src/trunk/basictest/test.rb:marshal ....OK 4 I, [2024-05-23T07:38:07.504366 #37630] INFO -- : /tmp/ruby/src/trunk/basictest/test.rb:pack ....OK 4 I, [2024-05-23T07:38:07.504391 #37630] INFO -- : /tmp/ruby/src/trunk/basictest/test.rb:math ..OK 2 I, [2024-05-23T07:38:07.504464 #37630] INFO -- : /tmp/ruby/src/trunk/basictest/test.rb:struct ......OK 6 I, [2024-05-23T07:38:07.504593 #37630] INFO -- : /tmp/ruby/src/trunk/basictest/test.rb:variable ............OK 12 I, [2024-05-23T07:38:07.504629 #37630] INFO -- : /tmp/ruby/src/trunk/basictest/test.rb:trace ...OK 3 I, [2024-05-23T07:38:07.504706 #37630] INFO -- : /tmp/ruby/src/trunk/basictest/test.rb:defined? ............OK 12 I, [2024-05-23T07:38:07.504769 #37630] INFO -- : /tmp/ruby/src/trunk/basictest/test.rb:alias ......OK 6 I, [2024-05-23T07:38:07.505167 #37630] INFO -- : /tmp/ruby/src/trunk/basictest/test.rb:path .......................OK 23 I, [2024-05-23T07:38:07.541752 #37630] INFO -- : /tmp/ruby/src/trunk/basictest/test.rb:gc ....OK 4 I, [2024-05-23T07:38:07.544159 #37630] INFO -- : I, [2024-05-23T07:38:07.544188 #37630] INFO -- : test succeeded I, [2024-05-23T07:38:07.545696 #37630] INFO -- : $$$[end] "make yes-test-basic TESTS='-j20'" exit with 0. I, [2024-05-23T07:38:07.545782 #37630] INFO -- : $$$[beg] make yes-test-all TESTOPTS='--stderr-on-failure' TESTS='-j20' I, [2024-05-23T07:38:07.633642 #37630] INFO -- : BASERUBY = /usr/bin/ruby --disable=gems I, [2024-05-23T07:38:07.633711 #37630] INFO -- : CC = gcc I, [2024-05-23T07:38:07.633728 #37630] INFO -- : LD = ld I, [2024-05-23T07:38:07.633740 #37630] INFO -- : LDSHARED = gcc -shared I, [2024-05-23T07:38:07.633755 #37630] INFO -- : CFLAGS = -O3 -fno-fast-math -ggdb3 -Wall -Wextra -Wdeprecated-declarations -Wdiv-by-zero -Wduplicated-cond -Wimplicit-function-declaration -Wimplicit-int -Wpointer-arith -Wwrite-strings -Wold-style-definition -Wimplicit-fallthrough=0 -Wmissing-noreturn -Wno-cast-function-type -Wno-constant-logical-operand -Wno-long-long -Wno-missing-field-initializers -Wno-overlength-strings -Wno-packed-bitfield-compat -Wno-parentheses-equality -Wno-self-assign -Wno-tautological-compare -Wno-unused-parameter -Wno-unused-value -Wsuggest-attribute=format -Wsuggest-attribute=noreturn -Wunused-variable -Wmisleading-indentation -Wundef -fPIC I, [2024-05-23T07:38:07.633766 #37630] INFO -- : XCFLAGS = -U_FORTIFY_SOURCE -D_FORTIFY_SOURCE=2 -fstack-protector-strong -fno-strict-overflow -fvisibility=hidden -fexcess-precision=standard -DRUBY_EXPORT -I. -I.ext/include/x86_64-linux -I/tmp/ruby/src/trunk/include -I/tmp/ruby/src/trunk -I/tmp/ruby/src/trunk/prism -I/tmp/ruby/src/trunk/enc/unicode/15.0.0 I, [2024-05-23T07:38:07.633776 #37630] INFO -- : CPPFLAGS = I, [2024-05-23T07:38:07.633796 #37630] INFO -- : DLDFLAGS = -Wl,--compress-debug-sections=zlib -Wl,-soname,libruby.so.3.4 -fstack-protector-strong I, [2024-05-23T07:38:07.633806 #37630] INFO -- : SOLIBS = -lz -lrt -lrt -lgmp -ldl -lcrypt -lm -lpthread I, [2024-05-23T07:38:07.633816 #37630] INFO -- : LANG = en_US.UTF-8 I, [2024-05-23T07:38:07.633826 #37630] INFO -- : LC_ALL = I, [2024-05-23T07:38:07.633835 #37630] INFO -- : LC_CTYPE = I, [2024-05-23T07:38:07.633845 #37630] INFO -- : MFLAGS = I, [2024-05-23T07:38:07.633854 #37630] INFO -- : RUSTC = no I, [2024-05-23T07:38:07.633863 #37630] INFO -- : YJIT_RUSTC_ARGS = --crate-name=yjit --crate-type=staticlib --edition=2021 -g -C lto=thin -C opt-level=3 -C overflow-checks=on '--out-dir=/tmp/ruby/build/trunk/yjit/target/release/' /tmp/ruby/src/trunk/yjit/src/lib.rs I, [2024-05-23T07:38:07.634396 #37630] INFO -- : gcc (Ubuntu 11.4.0-1ubuntu1~22.04) 11.4.0 I, [2024-05-23T07:38:07.634447 #37630] INFO -- : Copyright (C) 2021 Free Software Foundation, Inc. I, [2024-05-23T07:38:07.634459 #37630] INFO -- : This is free software; see the source for copying conditions. There is NO I, [2024-05-23T07:38:07.634475 #37630] INFO -- : warranty; not even for MERCHANTABILITY or FITNESS FOR A PARTICULAR PURPOSE. I, [2024-05-23T07:38:07.634487 #37630] INFO -- : I, [2024-05-23T07:38:07.636013 #37630] INFO -- : generating enc.mk I, [2024-05-23T07:38:07.753997 #37630] INFO -- : generating encdb.h I, [2024-05-23T07:38:07.777783 #37630] INFO -- : encdb.h unchanged I, [2024-05-23T07:38:07.779003 #37630] INFO -- : making enc I, [2024-05-23T07:38:07.796386 #37630] INFO -- : make[1]: Entering directory '/tmp/ruby/build/trunk' I, [2024-05-23T07:38:07.796440 #37630] INFO -- : make[1]: Nothing to be done for 'enc'. I, [2024-05-23T07:38:07.796453 #37630] INFO -- : make[1]: Leaving directory '/tmp/ruby/build/trunk' I, [2024-05-23T07:38:07.797148 #37630] INFO -- : making srcs under enc I, [2024-05-23T07:38:07.827522 #37630] INFO -- : make[1]: Entering directory '/tmp/ruby/build/trunk' I, [2024-05-23T07:38:07.827600 #37630] INFO -- : make[1]: Nothing to be done for 'srcs'. I, [2024-05-23T07:38:07.827616 #37630] INFO -- : make[1]: Leaving directory '/tmp/ruby/build/trunk' I, [2024-05-23T07:38:07.828707 #37630] INFO -- : generating transdb.h I, [2024-05-23T07:38:07.929058 #37630] INFO -- : transdb.h unchanged I, [2024-05-23T07:38:07.930518 #37630] INFO -- : making trans I, [2024-05-23T07:38:07.964836 #37630] INFO -- : make[1]: Entering directory '/tmp/ruby/build/trunk' I, [2024-05-23T07:38:07.964909 #37630] INFO -- : make[1]: Nothing to be done for 'trans'. I, [2024-05-23T07:38:07.964922 #37630] INFO -- : make[1]: Leaving directory '/tmp/ruby/build/trunk' I, [2024-05-23T07:38:07.965611 #37630] INFO -- : making encs I, [2024-05-23T07:38:08.002655 #37630] INFO -- : make[1]: Entering directory '/tmp/ruby/build/trunk' I, [2024-05-23T07:38:08.002728 #37630] INFO -- : make[1]: Nothing to be done for 'encs'. I, [2024-05-23T07:38:08.002742 #37630] INFO -- : make[1]: Leaving directory '/tmp/ruby/build/trunk' I, [2024-05-23T07:38:08.004475 #37630] INFO -- : generating makefiles ext/configure-ext.mk I, [2024-05-23T07:38:08.031928 #37630] INFO -- : ext/configure-ext.mk updated I, [2024-05-23T07:38:08.034551 #37630] INFO -- : make[1]: Entering directory '/tmp/ruby/build/trunk' I, [2024-05-23T07:38:09.442779 #37630] INFO -- : make[1]: Leaving directory '/tmp/ruby/build/trunk' I, [2024-05-23T07:38:09.443468 #37630] INFO -- : generating makefile exts.mk I, [2024-05-23T07:38:09.480711 #37630] INFO -- : exts.mk unchanged I, [2024-05-23T07:38:09.485840 #37630] INFO -- : make[1]: Entering directory '/tmp/ruby/build/trunk' I, [2024-05-23T07:38:09.756543 #37630] INFO -- : make[2]: Entering directory '/tmp/ruby/build/trunk/ext/coverage' I, [2024-05-23T07:38:09.761077 #37630] INFO -- : make[2]: Leaving directory '/tmp/ruby/build/trunk/ext/coverage' I, [2024-05-23T07:38:09.767468 #37630] INFO -- : make[2]: Entering directory '/tmp/ruby/build/trunk/ext/date' I, [2024-05-23T07:38:09.771299 #37630] INFO -- : make[2]: Leaving directory '/tmp/ruby/build/trunk/ext/date' I, [2024-05-23T07:38:09.774690 #37630] INFO -- : make[2]: Entering directory '/tmp/ruby/build/trunk/ext/digest' I, [2024-05-23T07:38:09.783617 #37630] INFO -- : make[2]: Leaving directory '/tmp/ruby/build/trunk/ext/digest' I, [2024-05-23T07:38:09.810528 #37630] INFO -- : make[2]: Entering directory '/tmp/ruby/build/trunk/ext/digest/sha2' I, [2024-05-23T07:38:09.815403 #37630] INFO -- : make[2]: Leaving directory '/tmp/ruby/build/trunk/ext/digest/sha2' I, [2024-05-23T07:38:09.836774 #37630] INFO -- : make[2]: Entering directory '/tmp/ruby/build/trunk/ext/fiddle' I, [2024-05-23T07:38:09.844211 #37630] INFO -- : make[2]: Leaving directory '/tmp/ruby/build/trunk/ext/fiddle' I, [2024-05-23T07:38:09.847412 #37630] INFO -- : make[2]: Entering directory '/tmp/ruby/build/trunk/ext/io/console' I, [2024-05-23T07:38:09.851054 #37630] INFO -- : make[2]: Leaving directory '/tmp/ruby/build/trunk/ext/io/console' I, [2024-05-23T07:38:09.863746 #37630] INFO -- : make[2]: Entering directory '/tmp/ruby/build/trunk/ext/json' I, [2024-05-23T07:38:09.874305 #37630] INFO -- : make[2]: Leaving directory '/tmp/ruby/build/trunk/ext/json' I, [2024-05-23T07:38:09.889980 #37630] INFO -- : make[2]: Entering directory '/tmp/ruby/build/trunk/ext/monitor' I, [2024-05-23T07:38:09.893618 #37630] INFO -- : make[2]: Leaving directory '/tmp/ruby/build/trunk/ext/monitor' I, [2024-05-23T07:38:09.900821 #37630] INFO -- : make[2]: Entering directory '/tmp/ruby/build/trunk/ext/objspace' I, [2024-05-23T07:38:09.906976 #37630] INFO -- : make[2]: Leaving directory '/tmp/ruby/build/trunk/ext/objspace' I, [2024-05-23T07:38:09.923668 #37630] INFO -- : make[2]: Entering directory '/tmp/ruby/build/trunk/ext/openssl' I, [2024-05-23T07:38:09.936757 #37630] INFO -- : make[2]: Leaving directory '/tmp/ruby/build/trunk/ext/openssl' I, [2024-05-23T07:38:09.939770 #37630] INFO -- : make[2]: Entering directory '/tmp/ruby/build/trunk/ext/pathname' I, [2024-05-23T07:38:09.942276 #37630] INFO -- : make[2]: Leaving directory '/tmp/ruby/build/trunk/ext/pathname' I, [2024-05-23T07:38:09.946564 #37630] INFO -- : make[2]: Entering directory '/tmp/ruby/build/trunk/ext/psych' I, [2024-05-23T07:38:09.969324 #37630] INFO -- : make[2]: Leaving directory '/tmp/ruby/build/trunk/ext/psych' I, [2024-05-23T07:38:09.973048 #37630] INFO -- : make[2]: Entering directory '/tmp/ruby/build/trunk/ext/pty' I, [2024-05-23T07:38:09.976834 #37630] INFO -- : make[2]: Leaving directory '/tmp/ruby/build/trunk/ext/pty' I, [2024-05-23T07:38:09.991418 #37630] INFO -- : make[2]: Entering directory '/tmp/ruby/build/trunk/ext/ripper' I, [2024-05-23T07:38:09.999490 #37630] INFO -- : make[2]: Leaving directory '/tmp/ruby/build/trunk/ext/ripper' I, [2024-05-23T07:38:10.001905 #37630] INFO -- : make[2]: Entering directory '/tmp/ruby/build/trunk/ext/rubyvm' I, [2024-05-23T07:38:10.005121 #37630] INFO -- : make[2]: Leaving directory '/tmp/ruby/build/trunk/ext/rubyvm' I, [2024-05-23T07:38:10.016743 #37630] INFO -- : make[2]: Entering directory '/tmp/ruby/build/trunk/ext/socket' I, [2024-05-23T07:38:10.024826 #37630] INFO -- : make[2]: Leaving directory '/tmp/ruby/build/trunk/ext/socket' I, [2024-05-23T07:38:10.043766 #37630] INFO -- : make[2]: Entering directory '/tmp/ruby/build/trunk/.bundle/gems/bigdecimal-3.1.8/ext/bigdecimal' I, [2024-05-23T07:38:10.073352 #37630] INFO -- : make[2]: Leaving directory '/tmp/ruby/build/trunk/.bundle/gems/bigdecimal-3.1.8/ext/bigdecimal' I, [2024-05-23T07:38:10.075314 #37630] INFO -- : make[2]: Entering directory '/tmp/ruby/build/trunk/.bundle/gems/debug-1.9.2/ext/debug' I, [2024-05-23T07:38:10.097641 #37630] INFO -- : make[2]: Leaving directory '/tmp/ruby/build/trunk/.bundle/gems/debug-1.9.2/ext/debug' I, [2024-05-23T07:38:10.099472 #37630] INFO -- : make[2]: Entering directory '/tmp/ruby/build/trunk/.bundle/gems/nkf-0.2.0/ext/nkf' I, [2024-05-23T07:38:10.121636 #37630] INFO -- : make[2]: Leaving directory '/tmp/ruby/build/trunk/.bundle/gems/nkf-0.2.0/ext/nkf' I, [2024-05-23T07:38:10.123921 #37630] INFO -- : make[2]: Entering directory '/tmp/ruby/build/trunk/.bundle/gems/racc-1.7.3/ext/racc/cparse' I, [2024-05-23T07:38:10.146036 #37630] INFO -- : make[2]: Leaving directory '/tmp/ruby/build/trunk/.bundle/gems/racc-1.7.3/ext/racc/cparse' I, [2024-05-23T07:38:10.147930 #37630] INFO -- : make[2]: Entering directory '/tmp/ruby/build/trunk/.bundle/gems/racc-1.8.0/ext/racc/cparse' I, [2024-05-23T07:38:10.170032 #37630] INFO -- : make[2]: Leaving directory '/tmp/ruby/build/trunk/.bundle/gems/racc-1.8.0/ext/racc/cparse' I, [2024-05-23T07:38:10.172686 #37630] INFO -- : make[2]: Entering directory '/tmp/ruby/build/trunk/.bundle/gems/rbs-3.4.4/ext/rbs_extension' I, [2024-05-23T07:38:10.196977 #37630] INFO -- : make[2]: Leaving directory '/tmp/ruby/build/trunk/.bundle/gems/rbs-3.4.4/ext/rbs_extension' I, [2024-05-23T07:38:10.198917 #37630] INFO -- : make[2]: Entering directory '/tmp/ruby/build/trunk/.bundle/gems/syslog-0.1.2/ext/syslog' I, [2024-05-23T07:38:10.221129 #37630] INFO -- : make[2]: Leaving directory '/tmp/ruby/build/trunk/.bundle/gems/syslog-0.1.2/ext/syslog' I, [2024-05-23T07:38:10.244389 #37630] INFO -- : make[2]: Entering directory '/tmp/ruby/build/trunk' I, [2024-05-23T07:38:10.308535 #37630] INFO -- : make[2]: 'ruby' is up to date. I, [2024-05-23T07:38:10.308573 #37630] INFO -- : make[2]: Leaving directory '/tmp/ruby/build/trunk' I, [2024-05-23T07:38:10.308831 #37630] INFO -- : make[1]: Leaving directory '/tmp/ruby/build/trunk' I, [2024-05-23T07:38:10.312652 #37630] INFO -- : make[1]: Entering directory '/tmp/ruby/build/trunk' I, [2024-05-23T07:38:10.312674 #37630] INFO -- : make[1]: Nothing to be done for 'note'. I, [2024-05-23T07:38:10.312679 #37630] INFO -- : make[1]: Leaving directory '/tmp/ruby/build/trunk' I, [2024-05-23T07:38:10.394735 #37630] INFO -- : Run options: I, [2024-05-23T07:38:10.394795 #37630] INFO -- : --seed=10384 I, [2024-05-23T07:38:10.394801 #37630] INFO -- : "--ruby=./miniruby -I/tmp/ruby/src/trunk/lib -I. -I.ext/common /tmp/ruby/src/trunk/tool/runruby.rb --extout=.ext -- --disable-gems" I, [2024-05-23T07:38:10.394805 #37630] INFO -- : --excludes-dir=/tmp/ruby/src/trunk/test/.excludes I, [2024-05-23T07:38:10.394813 #37630] INFO -- : --name=!/memory_leak/ I, [2024-05-23T07:38:10.394816 #37630] INFO -- : --stderr-on-failure I, [2024-05-23T07:38:10.394820 #37630] INFO -- : -j20 I, [2024-05-23T07:38:10.394824 #37630] INFO -- : I, [2024-05-23T07:38:10.394827 #37630] INFO -- : # Running tests: I, [2024-05-23T07:38:10.394830 #37630] INFO -- : I, [2024-05-23T07:38:10.545053 #37630] INFO -- : [ 1/885] 78979=test_gem_installer I, [2024-05-23T07:38:10.545444 #37630] INFO -- : [ 2/885] 78982=test_yamlstore I, [2024-05-23T07:38:10.545475 #37630] INFO -- : [ 3/885] 78984=test_date_strftime I, [2024-05-23T07:38:10.545493 #37630] INFO -- : [ 4/885] 78980=test_rdoc_parser_rd I, [2024-05-23T07:38:10.545500 #37630] INFO -- : [ 5/885] 78981=test_irb I, [2024-05-23T07:38:10.547125 #37630] INFO -- : [ 6/885] 78983=test_random I, [2024-05-23T07:38:10.547406 #37630] INFO -- : [ 7/885] 78997=test_asn1 I, [2024-05-23T07:38:10.548707 #37630] INFO -- : [ 8/885] 78994=test_const I, [2024-05-23T07:38:10.549180 #37630] INFO -- : [ 9/885] 78998=test_rdoc_normal_class I, [2024-05-23T07:38:10.549277 #37630] INFO -- : [ 10/885] 78995=test_class I, [2024-05-23T07:38:10.550275 #37630] INFO -- : [ 11/885] 78996=test_load I, [2024-05-23T07:38:10.554561 #37630] INFO -- : [ 12/885] 78994=json_string_matching_test I, [2024-05-23T07:38:10.568391 #37630] INFO -- : [ 13/885] 78994=test_noarg I, [2024-05-23T07:38:10.569686 #37630] INFO -- : [ 14/885] 78986=parse_comments_test I, [2024-05-23T07:38:10.576351 #37630] INFO -- : [ 15/885] 78996=test_tempfile I, [2024-05-23T07:38:10.578642 #37630] INFO -- : [ 16/885] 78991=test_queue I, [2024-05-23T07:38:10.578721 #37630] INFO -- : [ 17/885] 78987=test_function I, [2024-05-23T07:38:10.579060 #37630] INFO -- : [ 18/885] 78988=test_gem_resolver_index_specification I, [2024-05-23T07:38:10.579472 #37630] INFO -- : [ 19/885] 78989=test_internal_ivar I, [2024-05-23T07:38:10.580796 #37630] INFO -- : [ 20/885] 78992=test_rdoc_markup I, [2024-05-23T07:38:10.582026 #37630] INFO -- : [ 21/885] 78982=test_gem_commands_help_command I, [2024-05-23T07:38:10.583125 #37630] INFO -- : [ 22/885] 78985=test_prettyprint I, [2024-05-23T07:38:10.584430 #37630] INFO -- : [ 23/885] 78983=test_tracepoint I, [2024-05-23T07:38:10.585071 #37630] INFO -- : [ 24/885] 78989=test_basicsocket I, [2024-05-23T07:38:10.592328 #37630] INFO -- : [ 25/885] 78991=test_utf32 I, [2024-05-23T07:38:10.597526 #37630] INFO -- : [ 26/885] 78991=test_duplicate I, [2024-05-23T07:38:10.598018 #37630] INFO -- : [ 27/885] 78993=test_too_many_dummy_encodings I, [2024-05-23T07:38:10.599518 #37630] INFO -- : [ 28/885] 78991=test_gem_commands_list_command I, [2024-05-23T07:38:10.603927 #37630] INFO -- : [ 29/885] 78989=test_stack I, [2024-05-23T07:38:10.604747 #37630] INFO -- : [ 30/885] 78990=test_rdoc_include I, [2024-05-23T07:38:10.606240 #37630] INFO -- : [ 31/885] 78997=test_reqarg I, [2024-05-23T07:38:10.631887 #37630] INFO -- : [ 32/885] 78985=test_gem_commands_signin_command I, [2024-05-23T07:38:10.653932 #37630] INFO -- : [ 33/885] 78986=test_resource I, [2024-05-23T07:38:10.683809 #37630] INFO -- : [ 34/885] 78993=test_emitter I, [2024-05-23T07:38:10.689735 #37630] INFO -- : [ 35/885] 78986=test_ldap I, [2024-05-23T07:38:10.694951 #37630] INFO -- : [ 36/885] 78992=test_fileutils I, [2024-05-23T07:38:10.700298 #37630] INFO -- : [ 37/885] 78993=test_string_processing I, [2024-05-23T07:38:10.711334 #37630] INFO -- : [ 38/885] 78986=test_rdoc_options I, [2024-05-23T07:38:10.721365 #37630] INFO -- : [ 39/885] 78980=test_cesu8 I, [2024-05-23T07:38:10.727934 #37630] INFO -- : [ 40/885] 78980=test_econv I, [2024-05-23T07:38:10.752385 #37630] INFO -- : [ 41/885] 78998=test_gem_version I, [2024-05-23T07:38:10.752597 #37630] INFO -- : [ 42/885] 78993=test_gem_dependency I, [2024-05-23T07:38:10.771315 #37630] INFO -- : [ 43/885] 78991=test_gem_resolver_specification I, [2024-05-23T07:38:10.797206 #37630] INFO -- : [ 44/885] 78994=test_path_to_class I, [2024-05-23T07:38:10.798925 #37630] INFO -- : [ 45/885] 78996=test_rdoc_markup_verbatim I, [2024-05-23T07:38:10.802721 #37630] INFO -- : [ 46/885] 78987=test_inlinecache I, [2024-05-23T07:38:10.805209 #37630] INFO -- : [ 47/885] 78983=test_gem_commands_search_command I, [2024-05-23T07:38:10.815675 #37630] INFO -- : [ 48/885] 78994=test_complex I, [2024-05-23T07:38:10.838337 #37630] INFO -- : [ 49/885] 78991=test_gem_ext_ext_conf_builder I, [2024-05-23T07:38:10.841646 #37630] INFO -- : [ 50/885] 78990=test_frozen_error I, [2024-05-23T07:38:10.846254 #37630] INFO -- : [ 51/885] 78990=test_gem_stub_specification I, [2024-05-23T07:38:10.856905 #37630] INFO -- : [ 52/885] 78988=test_method_cache I, [2024-05-23T07:38:10.863486 #37630] INFO -- : [ 53/885] 78988=test_gem_resolver_installed_specification I, [2024-05-23T07:38:10.876590 #37630] INFO -- : [ 54/885] 78988=test_scanner_events I, [2024-05-23T07:38:10.888768 #37630] INFO -- : [ 55/885] 78987=test_gem_remote_fetcher I, [2024-05-23T07:38:10.897440 #37630] INFO -- : [ 56/885] 78984=test_mdns I, [2024-05-23T07:38:10.914474 #37630] INFO -- : [ 57/885] 78984=test_parse I, [2024-05-23T07:38:10.921234 #37630] INFO -- : [ 58/885] 78982=test_handle I, [2024-05-23T07:38:10.924185 #37630] INFO -- : [ 59/885] 78981=test_wait I, [2024-05-23T07:38:10.930809 #37630] INFO -- : [ 60/885] 78988=test_yaml I, [2024-05-23T07:38:10.939917 #37630] INFO -- : [ 61/885] 78985=test_forwardable I, [2024-05-23T07:38:10.953070 #37630] INFO -- : [ 62/885] 78996=test_big2str I, [2024-05-23T07:38:10.965161 #37630] INFO -- : [ 63/885] 78983=test_ansi_without_terminfo I, [2024-05-23T07:38:10.967093 #37630] INFO -- : [ 64/885] 78996=test_gem_commands_sources_command I, [2024-05-23T07:38:10.967167 #37630] INFO -- : [ 65/885] 78985=test_bmethod I, [2024-05-23T07:38:10.974236 #37630] INFO -- : [ 66/885] 78981=test_ractor I, [2024-05-23T07:38:10.977458 #37630] INFO -- : [ 67/885] 78997=test_euc_tw I, [2024-05-23T07:38:10.983092 #37630] INFO -- : [ 68/885] 78997=test_rdoc_markup_formatter I, [2024-05-23T07:38:10.986594 #37630] INFO -- : [ 69/885] 78985=test_nowrite I, [2024-05-23T07:38:10.988029 #37630] INFO -- : [ 70/885] 78981=test_thread_queue I, [2024-05-23T07:38:11.001101 #37630] INFO -- : [ 71/885] 78988=test_rdoc_parser_c I, [2024-05-23T07:38:11.002835 #37630] INFO -- : [ 72/885] 78994=test_comparable I, [2024-05-23T07:38:11.006490 #37630] INFO -- : [ 73/885] 78985=json_fixtures_test I, [2024-05-23T07:38:11.007601 #37630] INFO -- : [ 74/885] 78994=test_shapes I, [2024-05-23T07:38:11.012057 #37630] INFO -- : [ 75/885] 78994=test_io_timeout I, [2024-05-23T07:38:11.015207 #37630] INFO -- : [ 76/885] 78994=test_profile_frames I, [2024-05-23T07:38:11.021809 #37630] INFO -- : [ 77/885] 78985=test_cstr I, [2024-05-23T07:38:11.036700 #37630] INFO -- : [ 78/885] 78983=test_pstore I, [2024-05-23T07:38:11.051272 #37630] INFO -- : [ 79/885] 78993=test_enc_str_buf_cat I, [2024-05-23T07:38:11.054024 #37630] INFO -- : [ 80/885] 78993=test_gbk I, [2024-05-23T07:38:11.056532 #37630] INFO -- : [ 81/885] 78993=test_class2name I, [2024-05-23T07:38:11.060073 #37630] INFO -- : [ 82/885] 78993=test_cgi_util I, [2024-05-23T07:38:11.095350 #37630] INFO -- : [ 83/885] 78983=test_require I, [2024-05-23T07:38:11.097558 #37630] INFO -- : [ 84/885] 78986=test_gem_ext_cmake_builder I, [2024-05-23T07:38:11.114200 #37630] INFO -- : [ 85/885] 78998=test_gem_commands_contents_command I, [2024-05-23T07:38:11.132986 #37630] INFO -- : [ 86/885] 78982=test_digest I, [2024-05-23T07:38:11.147842 #37630] INFO -- : [ 87/885] 78997=test_marshalable I, [2024-05-23T07:38:11.176012 #37630] INFO -- : [ 88/885] 78997=test_find I, [2024-05-23T07:38:11.191933 #37630] INFO -- : [ 89/885] 78994=test_ractor I, [2024-05-23T07:38:11.192001 #37630] INFO -- : [ 90/885] 78997=test_wss I, [2024-05-23T07:38:11.207964 #37630] INFO -- : [ 91/885] 78998=test_fiddle I, [2024-05-23T07:38:11.208596 #37630] INFO -- : [ 92/885] 78992=test_file I, [2024-05-23T07:38:11.215295 #37630] INFO -- : [ 93/885] 78997=test_gem_available_set I, [2024-05-23T07:38:11.225590 #37630] INFO -- : [ 94/885] 78992=test_rdoc_markdown I, [2024-05-23T07:38:11.235404 #37630] INFO -- : [ 95/885] 78990=test_modify_expand I, [2024-05-23T07:38:11.238055 #37630] INFO -- : [ 96/885] 78990=test_rdoc_any_method I, [2024-05-23T07:38:11.244019 #37630] INFO -- : [ 97/885] 78998=test_init I, [2024-05-23T07:38:11.248995 #37630] INFO -- : [ 98/885] 78985=test_complexrational I, [2024-05-23T07:38:11.254260 #37630] INFO -- : [ 99/885] 78985=test_pathname I, [2024-05-23T07:38:11.279432 #37630] INFO -- : [100/885] 78986=test_coverage I, [2024-05-23T07:38:11.283951 #37630] INFO -- : [101/885] 78993=test_rdoc_encoding I, [2024-05-23T07:38:11.314484 #37630] INFO -- : [102/885] 78994=test_gem_package_tar_reader I, [2024-05-23T07:38:11.316494 #37630] INFO -- : [103/885] 78996=regexp_test I, [2024-05-23T07:38:11.395278 #37630] INFO -- : [104/885] 78996=test_gem_commands_owner_command I, [2024-05-23T07:38:11.427426 #37630] INFO -- : [105/885] 78988=test_gem_source_vendor I, [2024-05-23T07:38:11.429287 #37630] INFO -- : [106/885] 78985=test_recorder I, [2024-05-23T07:38:11.435798 #37630] INFO -- : [107/885] 78993=test_bash_completion I, [2024-05-23T07:38:11.436740 #37630] INFO -- : [108/885] 78988=test_formatter I, [2024-05-23T07:38:11.441073 #37630] INFO -- : [109/885] 78993=test_rdoc_constant I, [2024-05-23T07:38:11.443205 #37630] INFO -- : [110/885] 78988=test_deprecate I, [2024-05-23T07:38:11.454745 #37630] INFO -- : [111/885] 78985=test_pkcs12 I, [2024-05-23T07:38:11.461957 #37630] INFO -- : [112/885] 78997=test_system I, [2024-05-23T07:38:11.466836 #37630] INFO -- : [113/885] 78988=test_bigzero I, [2024-05-23T07:38:11.470839 #37630] INFO -- : [114/885] 78988=test_pkey_dh I, [2024-05-23T07:38:11.480572 #37630] INFO -- : [115/885] 78989=test_iseq_load I, [2024-05-23T07:38:11.487932 #37630] INFO -- : [116/885] 78992=test_gem_util I, [2024-05-23T07:38:11.544199 #37630] INFO -- : [117/885] 78993=test_gem_package_tar_header I, [2024-05-23T07:38:11.549570 #37630] INFO -- : [118/885] 78988=test_ripper I, [2024-05-23T07:38:11.555694 #37630] INFO -- : [119/885] 78984=test_gem_config_file I, [2024-05-23T07:38:11.558039 #37630] INFO -- : [120/885] 78994=test_gem_resolver_activation_request I, [2024-05-23T07:38:11.569664 #37630] INFO -- : [121/885] 78994=test_protocol I, [2024-05-23T07:38:11.573044 #37630] INFO -- : [122/885] 78993=test_getopts I, [2024-05-23T07:38:11.574758 #37630] INFO -- : [123/885] 78993=test_yjit_exit_locations I, [2024-05-23T07:38:11.574832 #37630] INFO -- : [124/885] 78993=test_etc I, [2024-05-23T07:38:11.577948 #37630] INFO -- : [125/885] 78990=test_yaml_tree I, [2024-05-23T07:38:11.620656 #37630] INFO -- : [126/885] 78990=test_gc I, [2024-05-23T07:38:11.624371 #37630] INFO -- : [127/885] 78990=test_math I, [2024-05-23T07:38:11.641355 #37630] INFO -- : [128/885] 78990=test_gem_commands_fetch_command I, [2024-05-23T07:38:11.647950 #37630] INFO -- : [129/885] 78993=test_libs I, [2024-05-23T07:38:11.668159 #37630] INFO -- : [130/885] 78998=test_config I, [2024-05-23T07:38:11.674760 #37630] INFO -- : [131/885] 78993=test_sleep I, [2024-05-23T07:38:11.741013 #37630] INFO -- : [132/885] 78998=test_autoload I, [2024-05-23T07:38:11.748279 #37630] INFO -- : [133/885] 78984=test_utf16 I, [2024-05-23T07:38:11.753426 #37630] INFO -- : [134/885] 78984=test_unicode_escape I, [2024-05-23T07:38:11.778501 #37630] INFO -- : [135/885] 78985=test_io I, [2024-05-23T07:38:11.800796 #37630] INFO -- : [136/885] 78990=test_face I, [2024-05-23T07:38:11.809323 #37630] INFO -- : [137/885] 78984=test_case I, [2024-05-23T07:38:11.835016 #37630] INFO -- : [138/885] 78984=test_sizeof I, [2024-05-23T07:38:11.852262 #37630] INFO -- : [139/885] 78992=test_rendering I, [2024-05-23T07:38:11.857863 #37630] INFO -- : [140/885] 78988=test_io_buffer I, [2024-05-23T07:38:11.880181 #37630] INFO -- : [141/885] 78994=ruby_parser_test I, [2024-05-23T07:38:11.883994 #37630] INFO -- : [142/885] 78990=test_pack I, [2024-05-23T07:38:11.906541 #37630] INFO -- : [143/885] 78990=test_backtrace I, [2024-05-23T07:38:11.922955 #37630] INFO -- : [144/885] 78980=test_rdoc_task I, [2024-05-23T07:38:11.925882 #37630] INFO -- : [145/885] 78980=test_gem_resolver_conflict I, [2024-05-23T07:38:11.938986 #37630] INFO -- : [146/885] 78982=test_rdoc_markup_indented_paragraph I, [2024-05-23T07:38:11.958969 #37630] INFO -- : [147/885] 78996=locals_test I, [2024-05-23T07:38:11.966417 #37630] INFO -- : [148/885] 78988=test_rdoc_require I, [2024-05-23T07:38:11.968650 #37630] INFO -- : [149/885] 78994=test_clone I, [2024-05-23T07:38:11.971305 #37630] INFO -- : [150/885] 78992=test_gem_commands_install_command I, [2024-05-23T07:38:11.978584 #37630] INFO -- : [151/885] 78988=test_readpartial I, [2024-05-23T07:38:12.005478 #37630] INFO -- : [152/885] 78986=test_fstring I, [2024-05-23T07:38:12.060969 #37630] INFO -- : [153/885] 78991=test_array I, [2024-05-23T07:38:12.069027 #37630] INFO -- : [154/885] 78991=test_optparse I, [2024-05-23T07:38:12.098565 #37630] INFO -- : [155/885] 78994=test_webauthn_poller I, [2024-05-23T07:38:12.109652 #37630] INFO -- : [156/885] 78982=test_rdoc_markup_raw I, [2024-05-23T07:38:12.115017 #37630] INFO -- : [157/885] 78982=test_rat I, [2024-05-23T07:38:12.119627 #37630] INFO -- : [158/885] 78991=test_typeddata I, [2024-05-23T07:38:12.120208 #37630] INFO -- : [159/885] 78982=test_gem_resolver_best_set I, [2024-05-23T07:38:12.133732 #37630] INFO -- : [160/885] 78986=encoding_test I, [2024-05-23T07:38:12.145037 #37630] INFO -- : [161/885] 78983=test_rdoc_markup_to_html_crossref I, [2024-05-23T07:38:12.149863 #37630] INFO -- : [162/885] 78980=test_files_sample I, [2024-05-23T07:38:12.190486 #37630] INFO -- : [163/885] 78982=test_stringscanner I, [2024-05-23T07:38:12.206712 #37630] INFO -- : [164/885] 78995=test_convertible I, [2024-05-23T07:38:12.209789 #37630] INFO -- : [165/885] 78986=parser_test I, [2024-05-23T07:38:12.216156 #37630] INFO -- : [166/885] 78986=test_yield I, [2024-05-23T07:38:12.226029 #37630] INFO -- : [167/885] 78982=test_rdoc_alias I, [2024-05-23T07:38:12.227339 #37630] INFO -- : [168/885] 78980=test_undef I, [2024-05-23T07:38:12.230094 #37630] INFO -- : [169/885] 78980=test_objspace I, [2024-05-23T07:38:12.231618 #37630] INFO -- : [170/885] 78997=ripper_test I, [2024-05-23T07:38:12.239782 #37630] INFO -- : [171/885] 78994=test_line_editor I, [2024-05-23T07:38:12.285705 #37630] INFO -- : [172/885] 78991=test_gem_security_trust_dir I, [2024-05-23T07:38:12.292401 #37630] INFO -- : [173/885] 78982=test_gem_requirement I, [2024-05-23T07:38:12.295353 #37630] INFO -- : [174/885] 78996=test_sprintf I, [2024-05-23T07:38:12.307109 #37630] INFO -- : [175/885] 78991=comments_test I, [2024-05-23T07:38:12.308406 #37630] INFO -- : [176/885] 78994=test_string_memory I, [2024-05-23T07:38:12.341513 #37630] INFO -- : [177/885] 78994=test_set I, [2024-05-23T07:38:12.354140 #37630] INFO -- : [178/885] 78991=test_show_source I, [2024-05-23T07:38:12.356136 #37630] INFO -- : [179/885] 78994=test_have_library I, [2024-05-23T07:38:12.379269 #37630] INFO -- : [180/885] 78989=test_remote_fetch_error I, [2024-05-23T07:38:12.383367 #37630] INFO -- : [181/885] 78988=test_gem_commands_stale_command I, [2024-05-23T07:38:12.391417 #37630] INFO -- : [182/885] 78988=test_c_struct_entry I, [2024-05-23T07:38:12.430206 #37630] INFO -- : [183/885] 78982=test_lock_native_thread I, [2024-05-23T07:38:12.445220 #37630] INFO -- : [184/885] 78991=test_external_new I, [2024-05-23T07:38:12.450611 #37630] INFO -- : [185/885] 78991=test_alias_and_anchor I, [2024-05-23T07:38:12.455250 #37630] INFO -- : [186/885] 78991=test_postponed_job I, [2024-05-23T07:38:12.462427 #37630] INFO -- : [187/885] 78996=test_hash I, [2024-05-23T07:38:12.474171 #37630] INFO -- : [188/885] 78996=test_gem_resolver_dependency_request I, [2024-05-23T07:38:12.495323 #37630] INFO -- : [189/885] 78996=test_tree_builder I, [2024-05-23T07:38:12.500032 #37630] INFO -- : [190/885] 78996=test_win32ole_typelib I, [2024-05-23T07:38:12.506400 #37630] INFO -- : [191/885] 78996=test_protect I, [2024-05-23T07:38:12.507955 #37630] INFO -- : [192/885] 78996=test_raise_exception I, [2024-05-23T07:38:12.543629 #37630] INFO -- : [193/885] 78989=test_gem_request_set_lockfile I, [2024-05-23T07:38:12.608052 #37630] INFO -- : [194/885] 78988=test_yjit I, [2024-05-23T07:38:12.612374 #37630] INFO -- : [195/885] 78988=test_weakmap I, [2024-05-23T07:38:12.727108 #37630] INFO -- : [196/885] 78983=test_workspace I, [2024-05-23T07:38:12.747554 #37630] INFO -- : [197/885] 78982=test_m17n I, [2024-05-23T07:38:12.804597 #37630] INFO -- : [198/885] 78997=test_gem_commands_environment_command I, [2024-05-23T07:38:12.823852 #37630] INFO -- : [199/885] 78987=test_ws I, [2024-05-23T07:38:12.824400 #37630] INFO -- : [200/885] 78982=test_argf I, [2024-05-23T07:38:12.826549 #37630] INFO -- : [201/885] 78987=test_framework I, [2024-05-23T07:38:12.836999 #37630] INFO -- : [202/885] 78997=test_ns_spki I, [2024-05-23T07:38:12.845531 #37630] INFO -- : [203/885] 78987=test_kill_ring I, [2024-05-23T07:38:12.847470 #37630] INFO -- : [204/885] 78991=test_summary I, [2024-05-23T07:38:12.848520 #37630] INFO -- : [205/885] 78989=test_console_attr I, [2024-05-23T07:38:12.851117 #37630] INFO -- : [206/885] 78989=test_type_completor I, [2024-05-23T07:38:12.853503 #37630] INFO -- : [207/885] 78997=test_kwargs I, [2024-05-23T07:38:12.853569 #37630] INFO -- : [208/885] 78989=warnings_test I, [2024-05-23T07:38:12.855212 #37630] INFO -- : [209/885] 78997=test_gem_commands_exec_command I, [2024-05-23T07:38:12.902617 #37630] INFO -- : [210/885] 78987=test_io_wait I, [2024-05-23T07:38:12.906892 #37630] INFO -- : [211/885] 78991=test_date_attr I, [2024-05-23T07:38:12.907373 #37630] INFO -- : [212/885] 78991=test_ellipsize I, [2024-05-23T07:38:12.921077 #37630] INFO -- : [213/885] 78991=test_io I, [2024-05-23T07:38:12.923788 #37630] INFO -- : [214/885] 78989=test_hash I, [2024-05-23T07:38:12.938562 #37630] INFO -- : [215/885] 78983=test_ubf_async_safe I, [2024-05-23T07:38:12.947496 #37630] INFO -- : [216/885] 78983=test_emoji I, [2024-05-23T07:38:12.983416 #37630] INFO -- : [217/885] 78983=test_win32ole_type_event I, [2024-05-23T07:38:12.984050 #37630] INFO -- : [218/885] 78983=test_sorted_set I, [2024-05-23T07:38:13.101817 #37630] INFO -- : [219/885] 78996=test_win32ole_record I, [2024-05-23T07:38:13.102373 #37630] INFO -- : [220/885] 78996=test_gem_unsatisfiable_dependency_error I, [2024-05-23T07:38:13.110847 #37630] INFO -- : [221/885] 78996=test_condition I, [2024-05-23T07:38:13.113054 #37630] INFO -- : [222/885] 78996=test_foreach I, [2024-05-23T07:38:13.120575 #37630] INFO -- : [223/885] 78996=test_gem_source_specific_file I, [2024-05-23T07:38:13.129875 #37630] INFO -- : [224/885] 78991=test_gem_commands_uninstall_command I, [2024-05-23T07:38:13.172436 #37630] INFO -- : [225/885] 78983=test_cp949 I, [2024-05-23T07:38:13.176209 #37630] INFO -- : [226/885] 78983=test_rdoc_rubygems_hook I, [2024-05-23T07:38:13.176560 #37630] INFO -- : [227/885] 78996=test_method I, [2024-05-23T07:38:13.205082 #37630] INFO -- : [228/885] 78990=test_gem_commands_query_command I, [2024-05-23T07:38:13.232387 #37630] INFO -- : [229/885] 78987=test_pack I, [2024-05-23T07:38:13.235391 #37630] INFO -- : [230/885] 78983=test_array_create I, [2024-05-23T07:38:13.239109 #37630] INFO -- : [231/885] 78983=test_gem_impossible_dependencies_error I, [2024-05-23T07:38:13.239572 #37630] INFO -- : [232/885] 78983=test_to_ruby I, [2024-05-23T07:38:13.251669 #37630] INFO -- : [233/885] 78983=test_pattern_key_name_check I, [2024-05-23T07:38:13.258301 #37630] INFO -- : [234/885] 78983=test_ftp I, [2024-05-23T07:38:13.275169 #37630] INFO -- : [235/885] 78983=test_euc_kr I, [2024-05-23T07:38:13.280442 #37630] INFO -- : [236/885] 78983=test_rdoc_context_section I, [2024-05-23T07:38:13.292639 #37630] INFO -- : [237/885] 78983=test_files_ext I, [2024-05-23T07:38:13.368772 #37630] INFO -- : [238/885] 78994=test_bug-5832 I, [2024-05-23T07:38:13.371427 #37630] INFO -- : [239/885] 78983=test_emitter I, [2024-05-23T07:38:13.373869 #37630] INFO -- : [240/885] 78994=test_gem_silent_ui I, [2024-05-23T07:38:13.378697 #37630] INFO -- : [241/885] 78983=test_gem_doctor I, [2024-05-23T07:38:13.383040 #37630] INFO -- : [242/885] 78992=test_kdf I, [2024-05-23T07:38:13.410412 #37630] INFO -- : [243/885] 78983=test_kernel I, [2024-05-23T07:38:13.416923 #37630] INFO -- : [244/885] 78994=dispatcher_test I, [2024-05-23T07:38:13.436178 #37630] INFO -- : [245/885] 78994=test_eval_history I, [2024-05-23T07:38:13.465919 #37630] INFO -- : [246/885] 78992=!Nothing_to_test I, [2024-05-23T07:38:13.470952 #37630] INFO -- : [247/885] 78992=test_psych I, [2024-05-23T07:38:13.496954 #37630] INFO -- : [248/885] 78992=test_enc_raise I, [2024-05-23T07:38:13.497949 #37630] INFO -- : [249/885] 78987=test_rdoc_markup_paragraph I, [2024-05-23T07:38:13.502395 #37630] INFO -- : [250/885] 78994=test_object_create_start I, [2024-05-23T07:38:13.502542 #37630] INFO -- : [251/885] 78994=test_date I, [2024-05-23T07:38:13.503617 #37630] INFO -- : [252/885] 78992=test_gem_rdoc I, [2024-05-23T07:38:13.507796 #37630] INFO -- : [253/885] 78994=test_gem_ext_cargo_builder_unit I, [2024-05-23T07:38:13.536958 #37630] INFO -- : [254/885] 78994=test_command I, [2024-05-23T07:38:13.593036 #37630] INFO -- : [255/885] 78992=test_at_exit I, [2024-05-23T07:38:13.612455 #37630] INFO -- : [256/885] 78992=test_rdoc_markup_to_tt_only I, [2024-05-23T07:38:13.623515 #37630] INFO -- : [257/885] 78987=test_hmac I, [2024-05-23T07:38:13.629812 #37630] INFO -- : [258/885] 78992=test_rdoc_tom_doc I, [2024-05-23T07:38:13.645228 #37630] INFO -- : [259/885] 78992=test_numeric I, [2024-05-23T07:38:13.648493 #37630] INFO -- : [260/885] 78987=test_gem_commands_lock_command I, [2024-05-23T07:38:13.663714 #37630] INFO -- : [261/885] 78990=test_ifunless I, [2024-05-23T07:38:13.664891 #37630] INFO -- : [262/885] 78990=test_assignment I, [2024-05-23T07:38:13.672812 #37630] INFO -- : [263/885] 78987=test_bug-3571 I, [2024-05-23T07:38:13.688700 #37630] INFO -- : [264/885] 78987=test_key_actor_vi I, [2024-05-23T07:38:13.716876 #37630] INFO -- : [265/885] 78992=test_gem_command I, [2024-05-23T07:38:13.722318 #37630] INFO -- : [266/885] 78993=test_gem_spec_fetcher I, [2024-05-23T07:38:13.764782 #37630] INFO -- : [267/885] 78987=test_common I, [2024-05-23T07:38:13.792507 #37630] INFO -- : [268/885] 78992=test_rdoc_token_stream I, [2024-05-23T07:38:13.798858 #37630] INFO -- : [269/885] 78992=test_address_resolve I, [2024-05-23T07:38:13.807678 #37630] INFO -- : [270/885] 78997=test_gem_source_list I, [2024-05-23T07:38:13.841636 #37630] INFO -- : [271/885] 78993=test_optarg I, [2024-05-23T07:38:13.844387 #37630] INFO -- : [272/885] 78983=test_yaml_special_cases I, [2024-05-23T07:38:13.850020 #37630] INFO -- : [273/885] 78992=test_config I, [2024-05-23T07:38:13.855444 #37630] INFO -- : [274/885] 78983=test_rdoc_single_class I, [2024-05-23T07:38:13.865157 #37630] INFO -- : [275/885] 78992=test_num2int I, [2024-05-23T07:38:13.874421 #37630] INFO -- : [276/885] 78983=test_nil I, [2024-05-23T07:38:13.874557 #37630] INFO -- : [277/885] 78992=test_verbose I, [2024-05-23T07:38:13.878401 #37630] INFO -- : [278/885] 78997=test_pp I, [2024-05-23T07:38:13.878887 #37630] INFO -- : [279/885] 78983=test_gem_ext_configure_builder I, [2024-05-23T07:38:13.891081 #37630] INFO -- : [280/885] 78992=test_frozen I, [2024-05-23T07:38:13.894549 #37630] INFO -- : [281/885] 78992=test_macro I, [2024-05-23T07:38:13.901055 #37630] INFO -- : [282/885] 78992=test_iter_break I, [2024-05-23T07:38:13.907206 #37630] INFO -- : [283/885] 78992=test_exception I, [2024-05-23T07:38:13.907849 #37630] INFO -- : [284/885] 78983=test_zsh_completion I, [2024-05-23T07:38:13.914562 #37630] INFO -- : [285/885] 78983=test_egrep_cpp I, [2024-05-23T07:38:13.918979 #37630] INFO -- : [286/885] 78992=test_cgi_tag_helper I, [2024-05-23T07:38:13.924979 #37630] INFO -- : [287/885] 78997=test_zlib I, [2024-05-23T07:38:13.937132 #37630] INFO -- : [288/885] 78992=test_optimization I, [2024-05-23T07:38:13.964705 #37630] INFO -- : [289/885] 78987=test_date_conv I, [2024-05-23T07:38:13.965294 #37630] INFO -- : [290/885] 78994=test_erb_m17n I, [2024-05-23T07:38:13.967586 #37630] INFO -- : [291/885] 78987=test_ole_methods I, [2024-05-23T07:38:13.973144 #37630] INFO -- : [292/885] 78987=test_string I, [2024-05-23T07:38:13.974715 #37630] INFO -- : [293/885] 78994=test_proc I, [2024-05-23T07:38:14.002739 #37630] INFO -- : [294/885] 78993=test_gc_compact I, [2024-05-23T07:38:14.029128 #37630] INFO -- : [295/885] 78991=test_gem_package_old I, [2024-05-23T07:38:14.043925 #37630] INFO -- : [296/885] 78983=test_gem_resolver_index_set I, [2024-05-23T07:38:14.067220 #37630] INFO -- : [297/885] 78991=test_gem_validator I, [2024-05-23T07:38:14.070280 #37630] INFO -- : [298/885] 78983=test_folderitem2_invokeverb I, [2024-05-23T07:38:14.074082 #37630] INFO -- : [299/885] 78983=test_require_path_check I, [2024-05-23T07:38:14.093698 #37630] INFO -- : [300/885] 78991=test_rdoc_markup_parser I, [2024-05-23T07:38:14.141974 #37630] INFO -- : [301/885] 78983=test_files_test_2 I, [2024-05-23T07:38:14.151069 #37630] INFO -- : [302/885] 78983=test_fnmatch I, [2024-05-23T07:38:14.194758 #37630] INFO -- : [303/885] 78983=test_pattern_matching I, [2024-05-23T07:38:14.208223 #37630] INFO -- : [304/885] 78983=test_rdoc_stats I, [2024-05-23T07:38:14.227992 #37630] INFO -- : [305/885] 78983=test_string I, [2024-05-23T07:38:14.244391 #37630] INFO -- : [306/885] 78983=test_rdoc_store I, [2024-05-23T07:38:14.263835 #37630] INFO -- : [307/885] 78991=test_x509attr I, [2024-05-23T07:38:14.279250 #37630] INFO -- : [308/885] 78991=test_raise I, [2024-05-23T07:38:14.284498 #37630] INFO -- : [309/885] 78991=test_gem_request_set_lockfile_parser I, [2024-05-23T07:38:14.392466 #37630] INFO -- : [310/885] 78991=test_depth_first I, [2024-05-23T07:38:14.399071 #37630] INFO -- : [311/885] 78991=json_addition_test I, [2024-05-23T07:38:14.418152 #37630] INFO -- : [312/885] 78991=test_custom_command I, [2024-05-23T07:38:14.421567 #37630] INFO -- : [313/885] 78991=test_qsort I, [2024-05-23T07:38:14.426179 #37630] INFO -- : [314/885] 78991=test_rdoc_parser I, [2024-05-23T07:38:14.478945 #37630] INFO -- : [315/885] 78991=test_gem_dependency_resolution_error I, [2024-05-23T07:38:14.485838 #37630] INFO -- : [316/885] 78991=test_mul I, [2024-05-23T07:38:14.493413 #37630] INFO -- : [317/885] 78991=test_win32ole_type I, [2024-05-23T07:38:14.499554 #37630] INFO -- : [318/885] 78991=test_null I, [2024-05-23T07:38:14.504938 #37630] INFO -- : [319/885] 78991=test_default_gems I, [2024-05-23T07:38:14.556771 #37630] INFO -- : [320/885] 78991=test_rdoc_rd_inline_parser I, [2024-05-23T07:38:14.595209 #37630] INFO -- : [321/885] 78991=test_rdoc_markup_to_rdoc I, [2024-05-23T07:38:14.630961 #37630] INFO -- : [322/885] 78991=test_rdoc_markup_attributes I, [2024-05-23T07:38:14.637801 #37630] INFO -- : [323/885] 78991=test_date_parse I, [2024-05-23T07:38:14.750371 #37630] INFO -- : [324/885] 78983=test_pipe I, [2024-05-23T07:38:14.752155 #37630] INFO -- : [325/885] 78991=test_thread I, [2024-05-23T07:38:14.753641 #37630] INFO -- : [326/885] 78991=test_trick I, [2024-05-23T07:38:14.794600 #37630] INFO -- : [327/885] 78984=test_pkey_ec I, [2024-05-23T07:38:14.817977 #37630] INFO -- : [328/885] 78988=test_backtrace I, [2024-05-23T07:38:14.821566 #37630] INFO -- : [329/885] 78994=test_defined I, [2024-05-23T07:38:14.824072 #37630] INFO -- : [330/885] 78988=test_key_name_check I, [2024-05-23T07:38:14.827352 #37630] INFO -- : [331/885] 78990=test_io_buffer I, [2024-05-23T07:38:14.832837 #37630] INFO -- : [332/885] 78988=test_rdoc_i18n_text I, [2024-05-23T07:38:14.834967 #37630] INFO -- : [333/885] 78988=test_time I, [2024-05-23T07:38:14.865417 #37630] INFO -- : [334/885] 78990=test_windows_1251 I, [2024-05-23T07:38:14.872608 #37630] INFO -- : [335/885] 78990=test_rdoc_rdoc I, [2024-05-23T07:38:14.887763 #37630] INFO -- : [336/885] 78984=test_gem_uninstaller I, [2024-05-23T07:38:14.895683 #37630] INFO -- : [337/885] 78994=test_gb18030 I, [2024-05-23T07:38:14.899726 #37630] INFO -- : [338/885] 78994=test_svcb_https I, [2024-05-23T07:38:14.920496 #37630] INFO -- : [339/885] 78983=test_buffering I, [2024-05-23T07:38:14.922055 #37630] INFO -- : [340/885] 78994=test_rdoc_cross_reference I, [2024-05-23T07:38:14.936724 #37630] INFO -- : [341/885] 78983=test_gem_commands_info_command I, [2024-05-23T07:38:14.940951 #37630] INFO -- : [342/885] 78988=test_scalar I, [2024-05-23T07:38:14.943812 #37630] INFO -- : [343/885] 78988=test_gem_dependency_installer I, [2024-05-23T07:38:14.950120 #37630] INFO -- : [344/885] 78983=test_case_options I, [2024-05-23T07:38:14.953777 #37630] INFO -- : [345/885] 78990=test_store I, [2024-05-23T07:38:14.960788 #37630] INFO -- : [346/885] 78983=test_exception I, [2024-05-23T07:38:15.115866 #37630] INFO -- : [347/885] 78979=test_bug_reporter I, [2024-05-23T07:38:15.150643 #37630] INFO -- : [348/885] 78990=test_gem_name_tuple I, [2024-05-23T07:38:15.165468 #37630] INFO -- : [349/885] 78990=test_gem_package_tar_reader_entry I, [2024-05-23T07:38:15.198340 #37630] INFO -- : [350/885] 78981=test_rand I, [2024-05-23T07:38:15.242600 #37630] INFO -- : [351/885] 78986=test_gem_commands_mirror I, [2024-05-23T07:38:15.252861 #37630] INFO -- : [352/885] 78986=test_gem_ext_cargo_builder_link_flag_converter I, [2024-05-23T07:38:15.304269 #37630] INFO -- : [353/885] 78986=test_gem_request I, [2024-05-23T07:38:15.377548 #37630] INFO -- : [354/885] 78981=test_method_cache I, [2024-05-23T07:38:15.378385 #37630] INFO -- : [355/885] 78981=test_sprintf_comb I, [2024-05-23T07:38:15.379580 #37630] INFO -- : [356/885] 78990=test_generic I, [2024-05-23T07:38:15.402045 #37630] INFO -- : [357/885] 78994=test_win32ole I, [2024-05-23T07:38:15.406850 #37630] INFO -- : [358/885] 78994=test_scan_args I, [2024-05-23T07:38:15.420757 #37630] INFO -- : [359/885] 78994=test_enumerator_kw I, [2024-05-23T07:38:15.425777 #37630] INFO -- : [360/885] 78994=test_settracefunc I, [2024-05-23T07:38:15.426411 #37630] INFO -- : [361/885] 78990=test_gem_text I, [2024-05-23T07:38:15.473706 #37630] INFO -- : [362/885] 78990=test_pkey I, [2024-05-23T07:38:15.490048 #37630] INFO -- : [363/885] 78986=test_case I, [2024-05-23T07:38:15.495033 #37630] INFO -- : [364/885] 78986=test_reline I, [2024-05-23T07:38:15.526525 #37630] INFO -- : [365/885] 78981=test_parser_events I, [2024-05-23T07:38:15.535042 #37630] INFO -- : [366/885] 78990=test_cclass I, [2024-05-23T07:38:15.537052 #37630] INFO -- : [367/885] 78979=test_gem_version_option I, [2024-05-23T07:38:15.568306 #37630] INFO -- : [368/885] 78979=test_grapheme_breaks I, [2024-05-23T07:38:15.587472 #37630] INFO -- : [369/885] 78981=test_gem_request_connection_pools I, [2024-05-23T07:38:15.593039 #37630] INFO -- : [370/885] 78979=test_m17n_comb I, [2024-05-23T07:38:15.654411 #37630] INFO -- : [371/885] 78990=test_memory_view I, [2024-05-23T07:38:15.787714 #37630] INFO -- : [372/885] 78990=test_ractor I, [2024-05-23T07:38:15.856414 #37630] INFO -- : [373/885] 78990=test_ansi_with_terminfo I, [2024-05-23T07:38:15.863750 #37630] INFO -- : [374/885] 78990=test_rdoc_generator_pot_po I, [2024-05-23T07:38:15.868946 #37630] INFO -- : [375/885] 78990=test_json_tree I, [2024-05-23T07:38:15.870443 #37630] INFO -- : [376/885] 78984=test_rdoc_markup_to_markdown I, [2024-05-23T07:38:15.877321 #37630] INFO -- : [377/885] 78990=test_severity I, [2024-05-23T07:38:15.880000 #37630] INFO -- : [378/885] 78990=test_ractor I, [2024-05-23T07:38:15.886109 #37630] INFO -- : [379/885] 78986=parse_test I, [2024-05-23T07:38:15.916121 #37630] INFO -- : [380/885] 78990=test_gem_install_update_options I, [2024-05-23T07:38:16.019567 #37630] INFO -- : [381/885] 78990=test_require_lib I, [2024-05-23T07:38:16.080891 #37630] INFO -- : [382/885] 78984=test_extlibs I, [2024-05-23T07:38:16.356342 #37630] INFO -- : [383/885] 78989=test_rdoc_generator_ri I, [2024-05-23T07:38:16.364311 #37630] INFO -- : [384/885] 78994=test_gem_stream_ui I, [2024-05-23T07:38:16.481433 #37630] INFO -- : [385/885] 78994=test_literal I, [2024-05-23T07:38:16.514319 #37630] INFO -- : [386/885] 78989=test_c_struct_builder I, [2024-05-23T07:38:16.565445 #37630] INFO -- : [387/885] 78998=test_dot_dot I, [2024-05-23T07:38:16.569959 #37630] INFO -- : [388/885] 78998=test_str2big I, [2024-05-23T07:38:16.577458 #37630] INFO -- : [389/885] 78998=test_rdoc_markup_to_table_of_contents I, [2024-05-23T07:38:16.605608 #37630] INFO -- : [390/885] 78989=test_objectspace I, [2024-05-23T07:38:16.611446 #37630] INFO -- : [391/885] 78998=test_socket I, [2024-05-23T07:38:16.696051 #37630] INFO -- : [392/885] 78993=test_thread I, [2024-05-23T07:38:16.792362 #37630] INFO -- : [393/885] 78981=test_securerandom I, [2024-05-23T07:38:16.828259 #37630] INFO -- : [394/885] 78981=test_logperiod I, [2024-05-23T07:38:16.842663 #37630] INFO -- : [395/885] 78981=test_c_union_entity I, [2024-05-23T07:38:16.853146 #37630] INFO -- : [396/885] 78991=test_rdoc_normal_module I, [2024-05-23T07:38:16.878035 #37630] INFO -- : [397/885] 78981=test_rdoc_markdown_test I, [2024-05-23T07:38:16.911124 #37630] INFO -- : [398/885] 78993=test_io_console I, [2024-05-23T07:38:16.918163 #37630] INFO -- : [399/885] 78991=test_singleton I, [2024-05-23T07:38:16.927593 #37630] INFO -- : [400/885] 78991=test_flush I, [2024-05-23T07:38:16.928388 #37630] INFO -- : [401/885] 78991=test_switch_hitter I, [2024-05-23T07:38:16.945811 #37630] INFO -- : [402/885] 78995=newline_test I, [2024-05-23T07:38:16.947524 #37630] INFO -- : [403/885] 78991=test_uncorrectable_name_check I, [2024-05-23T07:38:16.955993 #37630] INFO -- : [404/885] 78991=test_stringchar I, [2024-05-23T07:38:16.962443 #37630] INFO -- : [405/885] 78982=test_hash_create I, [2024-05-23T07:38:16.967815 #37630] INFO -- : [406/885] 78982=test_passing_block I, [2024-05-23T07:38:16.979142 #37630] INFO -- : [407/885] 78982=test_thread_fd_close I, [2024-05-23T07:38:16.990001 #37630] INFO -- : [408/885] 78982=test_process I, [2024-05-23T07:38:17.034223 #37630] INFO -- : [409/885] 78988=test_last_thread I, [2024-05-23T07:38:17.060529 #37630] INFO -- : [410/885] 78991=test_pack I, [2024-05-23T07:38:17.099085 #37630] INFO -- : [411/885] 78995=test_gem_security_policy I, [2024-05-23T07:38:17.161156 #37630] INFO -- : [412/885] 78979=test_gem_source_local I, [2024-05-23T07:38:17.294925 #37630] INFO -- : [413/885] 78991=test_gem_ext_rake_builder I, [2024-05-23T07:38:17.303738 #37630] INFO -- : [414/885] 78994=test_arity I, [2024-05-23T07:38:17.315321 #37630] INFO -- : [415/885] 78994=test_logdevice I, [2024-05-23T07:38:17.321798 #37630] INFO -- : [416/885] 78979=test_gem_resolver_lock_specification I, [2024-05-23T07:38:17.354475 #37630] INFO -- : [417/885] 78979=test_err_in_callback I, [2024-05-23T07:38:17.356112 #37630] INFO -- : [418/885] 78979=test_x509cert I, [2024-05-23T07:38:17.457526 #37630] INFO -- : [419/885] 78983=test_gc I, [2024-05-23T07:38:17.518147 #37630] INFO -- : [420/885] 78989=test_http I, [2024-05-23T07:38:17.519545 #37630] INFO -- : [421/885] 78995=test_shift_jis I, [2024-05-23T07:38:17.522359 #37630] INFO -- : [422/885] 78995=test_gem_commands_which_command I, [2024-05-23T07:38:17.535471 #37630] INFO -- : [423/885] 78989=test_inadvertent_creation I, [2024-05-23T07:38:17.548522 #37630] INFO -- : [424/885] 78995=test_flags I, [2024-05-23T07:38:17.592834 #37630] INFO -- : [425/885] 78979=test_enumerator I, [2024-05-23T07:38:17.671939 #37630] INFO -- : [426/885] 78989=test_gem_commands_specification_command I, [2024-05-23T07:38:17.707318 #37630] INFO -- : [427/885] 78996=test_gem_commands_dependency_command I, [2024-05-23T07:38:17.759506 #37630] INFO -- : [428/885] 78981=test_gem_resolver I, [2024-05-23T07:38:17.795090 #37630] INFO -- : [429/885] 78996=test_safe_load I, [2024-05-23T07:38:17.797762 #37630] INFO -- : [430/885] 78989=test_gem_resolver_composed_set I, [2024-05-23T07:38:17.804925 #37630] INFO -- : [431/885] 78996=test_name_error I, [2024-05-23T07:38:17.813729 #37630] INFO -- : [432/885] 78989=test_rdoc_markup_attribute_manager I, [2024-05-23T07:38:17.818885 #37630] INFO -- : [433/885] 78998=test_httpresponse I, [2024-05-23T07:38:17.839360 #37630] INFO -- : [434/885] 78989=test_open-uri I, [2024-05-23T07:38:17.878090 #37630] INFO -- : [435/885] 78996=test_rdoc_parser_ruby I, [2024-05-23T07:38:17.908807 #37630] INFO -- : [436/885] 78998=test_rdoc_context I, [2024-05-23T07:38:17.987423 #37630] INFO -- : [437/885] 78997=test_nil2vtempty I, [2024-05-23T07:38:17.990790 #37630] INFO -- : [438/885] 78997=test_stream I, [2024-05-23T07:38:17.994945 #37630] INFO -- : [439/885] 78984=test_tcp I, [2024-05-23T07:38:17.995169 #37630] INFO -- : [440/885] 78997=test_iso_8859 I, [2024-05-23T07:38:18.008691 #37630] INFO -- : [441/885] 78981=test_rdoc_text I, [2024-05-23T07:38:18.010047 #37630] INFO -- : [442/885] 78991=test_syntax I, [2024-05-23T07:38:18.030094 #37630] INFO -- : [443/885] 78997=test_gem_safe_yaml I, [2024-05-23T07:38:18.037165 #37630] INFO -- : [444/885] 78997=test_rdoc_markup_to_joined_paragraph I, [2024-05-23T07:38:18.040347 #37630] INFO -- : [445/885] 78997=test_date_time I, [2024-05-23T07:38:18.047694 #37630] INFO -- : [446/885] 78997=test_require I, [2024-05-23T07:38:18.050033 #37630] INFO -- : [447/885] 78997=index_write_test I, [2024-05-23T07:38:18.053104 #37630] INFO -- : [448/885] 78997=test_date_new I, [2024-05-23T07:38:18.063056 #37630] INFO -- : [449/885] 78981=test_data I, [2024-05-23T07:38:18.065814 #37630] INFO -- : [450/885] 78997=test_win32ole_event I, [2024-05-23T07:38:18.069583 #37630] INFO -- : [451/885] 78984=test_time_tz I, [2024-05-23T07:38:18.071953 #37630] INFO -- : [452/885] 78997=test_rdoc_generator_json_index I, [2024-05-23T07:38:18.075112 #37630] INFO -- : [453/885] 78981=test_trace I, [2024-05-23T07:38:18.088067 #37630] INFO -- : [454/885] 78981=ractor_test I, [2024-05-23T07:38:18.091645 #37630] INFO -- : [455/885] 78988=test_io_wait_uncommon I, [2024-05-23T07:38:18.096165 #37630] INFO -- : [456/885] 78988=test_stringio I, [2024-05-23T07:38:18.135730 #37630] INFO -- : [457/885] 78984=test_arity I, [2024-05-23T07:38:18.141663 #37630] INFO -- : [458/885] 78984=test_win32ole_variable I, [2024-05-23T07:38:18.142753 #37630] INFO -- : [459/885] 78997=test_gem_ci_detector I, [2024-05-23T07:38:18.143404 #37630] INFO -- : [460/885] 78984=test_rdoc_class_module I, [2024-05-23T07:38:18.147559 #37630] INFO -- : [461/885] 78994=test_bignum I, [2024-05-23T07:38:18.159199 #37630] INFO -- : [462/885] 78997=test_threadgroup I, [2024-05-23T07:38:18.167496 #37630] INFO -- : [463/885] 78981=test_enum I, [2024-05-23T07:38:18.191371 #37630] INFO -- : [464/885] 78988=test_gem_specification I, [2024-05-23T07:38:18.293964 #37630] INFO -- : [465/885] 78989=test_gem_package I, [2024-05-23T07:38:18.397499 #37630] INFO -- : [466/885] 78996=test_resolve_symbol I, [2024-05-23T07:38:18.471365 #37630] INFO -- : [467/885] 78995=test_complex2 I, [2024-05-23T07:38:18.476537 #37630] INFO -- : [468/885] 78996=test_have_macro I, [2024-05-23T07:38:18.477813 #37630] INFO -- : [469/885] 78995=test_merge_keys I, [2024-05-23T07:38:18.488087 #37630] INFO -- : [470/885] 78995=test_rdoc_extend I, [2024-05-23T07:38:18.547400 #37630] INFO -- : [471/885] 78986=test_rdoc_markup_to_ansi I, [2024-05-23T07:38:18.576787 #37630] INFO -- : [472/885] 78986=test_mixed_unicode_escapes I, [2024-05-23T07:38:18.577330 #37630] INFO -- : [473/885] 78986=test_history I, [2024-05-23T07:38:18.589643 #37630] INFO -- : [474/885] 78986=test_ipaddr I, [2024-05-23T07:38:18.614968 #37630] INFO -- : [475/885] 78986=test_win32ole_variant I, [2024-05-23T07:38:18.622725 #37630] INFO -- : [476/885] 78986=test_gem_resolver_api_specification I, [2024-05-23T07:38:18.649749 #37630] INFO -- : [477/885] 78995=test_gem_commands_cleanup_command I, [2024-05-23T07:38:18.680864 #37630] INFO -- : [478/885] 78986=test_word I, [2024-05-23T07:38:18.691286 #37630] INFO -- : [479/885] 78986=test_cgi_multipart I, [2024-05-23T07:38:18.741087 #37630] INFO -- : [480/885] 78985=test_member I, [2024-05-23T07:38:18.744261 #37630] INFO -- : [481/885] 78985=test_numeric I, [2024-05-23T07:38:18.765195 #37630] INFO -- : [482/885] 78985=test_eval I, [2024-05-23T07:38:18.769465 #37630] INFO -- : [483/885] 78985=test_autoconf I, [2024-05-23T07:38:18.772802 #37630] INFO -- : [484/885] 78985=test_gem_console_ui I, [2024-05-23T07:38:18.779059 #37630] INFO -- : [485/885] 78985=test_date_ractor I, [2024-05-23T07:38:18.784340 #37630] INFO -- : [486/885] 78989=format_errors_test I, [2024-05-23T07:38:18.788981 #37630] INFO -- : [487/885] 78989=test_dir I, [2024-05-23T07:38:18.820757 #37630] INFO -- : [488/885] 78998=test_ractor_compatibility I, [2024-05-23T07:38:18.830622 #37630] INFO -- : [489/885] 78986=test_mailto I, [2024-05-23T07:38:18.840153 #37630] INFO -- : [490/885] 78986=test_symbol I, [2024-05-23T07:38:18.851219 #37630] INFO -- : [491/885] 78986=location_test I, [2024-05-23T07:38:18.861742 #37630] INFO -- : [492/885] 78984=test_coderange I, [2024-05-23T07:38:18.871984 #37630] INFO -- : [493/885] 78984=json_generic_object_test I, [2024-05-23T07:38:18.872349 #37630] INFO -- : [494/885] 78996=test_gem_source_fetch_problem I, [2024-05-23T07:38:18.881901 #37630] INFO -- : [495/885] 78984=test_http_request I, [2024-05-23T07:38:18.884945 #37630] INFO -- : [496/885] 78996=test_error_highlight I, [2024-05-23T07:38:18.900120 #37630] INFO -- : [497/885] 78986=test_resize I, [2024-05-23T07:38:18.909932 #37630] INFO -- : [498/885] 78986=test_rdoc_comment I, [2024-05-23T07:38:18.924858 #37630] INFO -- : [499/885] 78984=test_rdoc_generator_darkfish I, [2024-05-23T07:38:18.974107 #37630] INFO -- : [500/885] 78986=test_function_entry I, [2024-05-23T07:38:18.978006 #37630] INFO -- : [501/885] 78986=test_arith_seq_beg_len_step I, [2024-05-23T07:38:18.980009 #37630] INFO -- : [502/885] 78981=test_gem_resolver_requirement_list I, [2024-05-23T07:38:18.989022 #37630] INFO -- : [503/885] 78981=test_pkcs7 I, [2024-05-23T07:38:19.012046 #37630] INFO -- : [504/885] 78985=test_lazy_enumerator I, [2024-05-23T07:38:19.037554 #37630] INFO -- : [505/885] 78989=test_enc_associate I, [2024-05-23T07:38:19.051626 #37630] INFO -- : [506/885] 78986=test_unix I, [2024-05-23T07:38:19.084904 #37630] INFO -- : [507/885] 78986=test_nofree I, [2024-05-23T07:38:19.089871 #37630] INFO -- : [508/885] 78986=test_context I, [2024-05-23T07:38:19.173070 #37630] INFO -- : [509/885] 78997=test_gem_commands_pristine_command I, [2024-05-23T07:38:19.174484 #37630] INFO -- : [510/885] 78981=test_symbol I, [2024-05-23T07:38:19.228136 #37630] INFO -- : [511/885] 78995=test_coder I, [2024-05-23T07:38:19.242077 #37630] INFO -- : [512/885] 78995=test_find_executable I, [2024-05-23T07:38:19.242356 #37630] INFO -- : [513/885] 78986=ruby_api_test I, [2024-05-23T07:38:19.246900 #37630] INFO -- : [514/885] 78995=test_rubygems I, [2024-05-23T07:38:19.285021 #37630] INFO -- : [515/885] 78984=test_https_proxy I, [2024-05-23T07:38:19.293195 #37630] INFO -- : [516/885] 78984=test_call I, [2024-05-23T07:38:19.313985 #37630] INFO -- : [517/885] 78998=test_integer I, [2024-05-23T07:38:19.384575 #37630] INFO -- : [518/885] 78986=test_cgi_modruby I, [2024-05-23T07:38:19.389921 #37630] INFO -- : [519/885] 78986=test_rubyoptions I, [2024-05-23T07:38:19.397363 #37630] INFO -- : [520/885] 78996=test_super I, [2024-05-23T07:38:19.418519 #37630] INFO -- : [521/885] 78995=test_gem_resolver_git_specification I, [2024-05-23T07:38:19.428286 #37630] INFO -- : [522/885] 78984=test_usrmarshal I, [2024-05-23T07:38:19.491120 #37630] INFO -- : [523/885] 78985=test_object_references I, [2024-05-23T07:38:19.500334 #37630] INFO -- : [524/885] 78985=test_capacity I, [2024-05-23T07:38:19.512240 #37630] INFO -- : [525/885] 78985=test_nextafter I, [2024-05-23T07:38:19.520834 #37630] INFO -- : [526/885] 78990=test_have_func I, [2024-05-23T07:38:19.596529 #37630] INFO -- : [527/885] 78985=test_gem_request_set_lockfile_tokenizer I, [2024-05-23T07:38:19.623418 #37630] INFO -- : [528/885] 78993=test_stat I, [2024-05-23T07:38:19.627969 #37630] INFO -- : [529/885] 78993=desugar_compiler_test I, [2024-05-23T07:38:19.648268 #37630] INFO -- : [530/885] 78984=test_integer I, [2024-05-23T07:38:19.652635 #37630] INFO -- : [531/885] 78985=test_dryrun I, [2024-05-23T07:38:19.669714 #37630] INFO -- : [532/885] 78985=test_rdoc_attr I, [2024-05-23T07:38:19.675950 #37630] INFO -- : [533/885] 78989=test_env I, [2024-05-23T07:38:19.709319 #37630] INFO -- : [534/885] 78984=test_gem_commands_setup_command I, [2024-05-23T07:38:19.709824 #37630] INFO -- : [535/885] 78995=test_parser I, [2024-05-23T07:38:19.731981 #37630] INFO -- : [536/885] 78995=test_cgi_core I, [2024-05-23T07:38:19.743326 #37630] INFO -- : [537/885] 78988=test_dns I, [2024-05-23T07:38:19.749124 #37630] INFO -- : [538/885] 78995=test_gem_commands_open_command I, [2024-05-23T07:38:19.759483 #37630] INFO -- : [539/885] 78993=test_ractor I, [2024-05-23T07:38:19.804318 #37630] INFO -- : [540/885] 78993=test_gem I, [2024-05-23T07:38:19.853642 #37630] INFO -- : [541/885] 78985=test_gem_source_lock I, [2024-05-23T07:38:19.857998 #37630] INFO -- : [542/885] 78995=test_registry I, [2024-05-23T07:38:19.862240 #37630] INFO -- : [543/885] 78995=parse_stream_test I, [2024-05-23T07:38:19.867681 #37630] INFO -- : [544/885] 78995=test_ractor I, [2024-05-23T07:38:19.914340 #37630] INFO -- : [545/885] 78985=test_rendering I, [2024-05-23T07:38:19.984706 #37630] INFO -- : [546/885] 78985=test_debugger_integration I, [2024-05-23T07:38:20.000392 #37630] INFO -- : [547/885] 78985=json_ext_parser_test I, [2024-05-23T07:38:20.005896 #37630] INFO -- : [548/885] 78985=test_thread I, [2024-05-23T07:38:20.126944 #37630] INFO -- : [549/885] 78996=test_my_integer I, [2024-05-23T07:38:20.128531 #37630] INFO -- : [550/885] 78996=test_ssl I, [2024-05-23T07:38:20.213537 #37630] INFO -- : [551/885] 78988=test_ancdata I, [2024-05-23T07:38:20.216709 #37630] INFO -- : [552/885] 78988=test_singleton_function I, [2024-05-23T07:38:20.219964 #37630] INFO -- : [553/885] 78988=test_reline_key I, [2024-05-23T07:38:20.230778 #37630] INFO -- : [554/885] 78984=test_rb_str_dup I, [2024-05-23T07:38:20.237936 #37630] INFO -- : [555/885] 78984=test_nonblock I, [2024-05-23T07:38:20.247811 #37630] INFO -- : [556/885] 78984=test_weakref I, [2024-05-23T07:38:20.278108 #37630] INFO -- : [557/885] 78988=test_unicode_normalize I, [2024-05-23T07:38:20.318846 #37630] INFO -- : [558/885] 78995=test_marshal I, [2024-05-23T07:38:20.400261 #37630] INFO -- : [559/885] 78984=test_timeout I, [2024-05-23T07:38:20.670062 #37630] INFO -- : [560/885] 78992=test_alias I, [2024-05-23T07:38:20.736698 #37630] INFO -- : [561/885] 78997=test_regexp I, [2024-05-23T07:38:20.747483 #37630] INFO -- : [562/885] 78996=test_gem_commands_check_command I, [2024-05-23T07:38:20.788516 #37630] INFO -- : [563/885] 78996=errors_test I, [2024-05-23T07:38:20.842560 #37630] INFO -- : [564/885] 78992=test_tmpdir I, [2024-05-23T07:38:20.870879 #37630] INFO -- : [565/885] 78996=test_integer_comb I, [2024-05-23T07:38:20.878765 #37630] INFO -- : [566/885] 78995=test_rdoc_markup_document I, [2024-05-23T07:38:20.895330 #37630] INFO -- : [567/885] 78995=test_vm_dump I, [2024-05-23T07:38:20.895942 #37630] INFO -- : [568/885] 78995=test_udp I, [2024-05-23T07:38:20.908562 #37630] INFO -- : [569/885] 78995=test_ostruct I, [2024-05-23T07:38:20.925207 #37630] INFO -- : [570/885] 78992=unescape_test I, [2024-05-23T07:38:21.031047 #37630] INFO -- : [571/885] 78994=test_file I, [2024-05-23T07:38:21.089671 #37630] INFO -- : [572/885] 78995=test_force_exit I, [2024-05-23T07:38:21.220214 #37630] INFO -- : [573/885] 78995=bom_test I, [2024-05-23T07:38:21.225120 #37630] INFO -- : [574/885] 78995=test_data_error I, [2024-05-23T07:38:21.299385 #37630] INFO -- : [575/885] 78990=static_inspect_test I, [2024-05-23T07:38:21.308038 #37630] INFO -- : [576/885] 78995=test_encoding I, [2024-05-23T07:38:21.321419 #37630] INFO -- : [577/885] 78984=test_helper I, [2024-05-23T07:38:21.321504 #37630] INFO -- : [578/885] 78984=test_erb_command I, [2024-05-23T07:38:21.366372 #37630] INFO -- : [579/885] 78984=test_gem_uri_formatter I, [2024-05-23T07:38:21.370487 #37630] INFO -- : [580/885] 78990=command_line_test I, [2024-05-23T07:38:21.378285 #37630] INFO -- : [581/885] 78990=test_dup I, [2024-05-23T07:38:21.390604 #37630] INFO -- : [582/885] 78984=test_pty I, [2024-05-23T07:38:21.558255 #37630] INFO -- : [583/885] 78995=test_constant I, [2024-05-23T07:38:21.587471 #37630] INFO -- : [584/885] 78990=test_range I, [2024-05-23T07:38:21.716366 #37630] INFO -- : [585/885] 78981=test_project_sanity I, [2024-05-23T07:38:21.780762 #37630] INFO -- : [586/885] 78981=test_rdoc_ri_paths I, [2024-05-23T07:38:21.800106 #37630] INFO -- : [587/885] 78981=test_addr I, [2024-05-23T07:38:21.830071 #37630] INFO -- : [588/885] 78981=test_locale I, [2024-05-23T07:38:21.878232 #37630] INFO -- : [589/885] 78981=library_symbols_test I, [2024-05-23T07:38:21.883268 #37630] INFO -- : [590/885] 78998=test_ensured I, [2024-05-23T07:38:21.918196 #37630] INFO -- : [591/885] 78984=test_ts I, [2024-05-23T07:38:21.954066 #37630] INFO -- : [592/885] 78993=test_enumerable I, [2024-05-23T07:38:21.957436 #37630] INFO -- : [593/885] 78993=test_gem_resolver_vendor_set I, [2024-05-23T07:38:21.958528 #37630] INFO -- : [594/885] 78981=test_config I, [2024-05-23T07:38:21.960717 #37630] INFO -- : [595/885] 78998=test_gem_resolver_api_set I, [2024-05-23T07:38:21.973056 #37630] INFO -- : [596/885] 78993=test_gem_safe_marshal I, [2024-05-23T07:38:22.014707 #37630] INFO -- : [597/885] 78998=test_transcode I, [2024-05-23T07:38:22.098792 #37630] INFO -- : [598/885] 78987=json_generator_test I, [2024-05-23T07:38:22.186624 #37630] INFO -- : [599/885] 78987=test_eval I, [2024-05-23T07:38:22.193052 #37630] INFO -- : [600/885] 78992=test_x509store I, [2024-05-23T07:38:22.240890 #37630] INFO -- : [601/885] 78998=test_rdoc_code_object I, [2024-05-23T07:38:22.337601 #37630] INFO -- : [602/885] 78990=test_x509name I, [2024-05-23T07:38:22.351774 #37630] INFO -- : [603/885] 78990=test_fips I, [2024-05-23T07:38:22.450049 #37630] INFO -- : [604/885] 78981=test_update I, [2024-05-23T07:38:22.458983 #37630] INFO -- : [605/885] 78981=test_jaro_winkler I, [2024-05-23T07:38:22.459040 #37630] INFO -- : [606/885] 78992=test_helper I, [2024-05-23T07:38:22.459870 #37630] INFO -- : [607/885] 78992=test_random_formatter I, [2024-05-23T07:38:22.464184 #37630] INFO -- : [608/885] 78981=test_lambda I, [2024-05-23T07:38:22.476180 #37630] INFO -- : [609/885] 78992=test_gem_request_set_gem_dependency_api I, [2024-05-23T07:38:22.478296 #37630] INFO -- : [610/885] 78984=test_ast I, [2024-05-23T07:38:22.479910 #37630] INFO -- : [611/885] 78987=test_webauthn_listener I, [2024-05-23T07:38:22.497522 #37630] INFO -- : Leaked file descriptor: WebauthnListenerTest#test_wait_for_otp_code_get_follows_options: 11 : # I, [2024-05-23T07:38:22.504286 #37630] INFO -- : [612/885] 78993=test_numhash I, [2024-05-23T07:38:22.508820 #37630] INFO -- : [613/885] 78993=test_gem_commands_push_command I, [2024-05-23T07:38:22.534800 #37630] INFO -- : [614/885] 78981=test_weakkeymap I, [2024-05-23T07:38:22.570061 #37630] INFO -- : COMMAND PID USER FD TYPE DEVICE SIZE/OFF NODE NAME I, [2024-05-23T07:38:22.570126 #37630] INFO -- : ruby 78987 ko1 11u IPv4 436341830 0t0 TCP localhost:41749->localhost:55938 (CLOSE_WAIT) I, [2024-05-23T07:38:22.631696 #37630] INFO -- : [615/885] 78990=test_pkey_rsa I, [2024-05-23T07:38:22.632880 #37630] INFO -- : .Closed file descriptor: WebauthnListenerTest#test_wait_for_otp_code_get_request: 11 I, [2024-05-23T07:38:22.634369 #37630] INFO -- : [616/885] 78979=test_gem_platform I, [2024-05-23T07:38:22.639639 #37630] INFO -- : [617/885] 78998=test_rdoc_markup_hard_break I, [2024-05-23T07:38:22.643118 #37630] INFO -- : [618/885] 78998=test_placearg I, [2024-05-23T07:38:22.656674 #37630] INFO -- : [619/885] 78987=test_gem_package_task I, [2024-05-23T07:38:22.661192 #37630] INFO -- : [620/885] 78987=test_date_strptime I, [2024-05-23T07:38:22.675132 #37630] INFO -- : [621/885] 78992=test_win32ole_method I, [2024-05-23T07:38:22.679816 #37630] INFO -- : [622/885] 78992=test_delete I, [2024-05-23T07:38:22.687142 #37630] INFO -- : [623/885] 78992=test_keyword I, [2024-05-23T07:38:22.690671 #37630] INFO -- : [624/885] 78979=test_class_name_check I, [2024-05-23T07:38:22.710662 #37630] INFO -- : [625/885] 78979=test_continuation I, [2024-05-23T07:38:22.717785 #37630] INFO -- : [626/885] 78979=test_fd_setsize I, [2024-05-23T07:38:22.718944 #37630] INFO -- : [627/885] 78979=test_files_test I, [2024-05-23T07:38:22.759034 #37630] INFO -- : [628/885] 78981=test_gem_update_suggestion I, [2024-05-23T07:38:22.760425 #37630] INFO -- : [629/885] 78998=test_file_exhaustive I, [2024-05-23T07:38:22.762343 #37630] INFO -- : [630/885] 78987=test_logger I, [2024-05-23T07:38:22.773500 #37630] INFO -- : [631/885] 78987=test_not I, [2024-05-23T07:38:22.778018 #37630] INFO -- : [632/885] 78987=test_gem_resolver_lock_set I, [2024-05-23T07:38:22.793504 #37630] INFO -- : [633/885] 78987=test_import I, [2024-05-23T07:38:22.836355 #37630] INFO -- : [634/885] 78979=test_rdoc_parser_markdown I, [2024-05-23T07:38:22.843974 #37630] INFO -- : [635/885] 78981=test_object I, [2024-05-23T07:38:22.870418 #37630] INFO -- : [636/885] 78981=heredoc_dedent_test I, [2024-05-23T07:38:22.878238 #37630] INFO -- : [637/885] 78989=test_cgi_header I, [2024-05-23T07:38:22.885337 #37630] INFO -- : [638/885] 78989=version_test I, [2024-05-23T07:38:22.887917 #37630] INFO -- : [639/885] 78989=test_gem_command_manager I, [2024-05-23T07:38:22.888150 #37630] INFO -- : [640/885] 78981=test_basicinstructions I, [2024-05-23T07:38:22.896110 #37630] INFO -- : [641/885] 78990=test_gem_gemcutter_utilities I, [2024-05-23T07:38:22.968418 #37630] INFO -- : [642/885] 78981=test_key_actor_emacs I, [2024-05-23T07:38:22.979201 #37630] INFO -- : [643/885] 78993=test_arithmetic_sequence I, [2024-05-23T07:38:22.987841 #37630] INFO -- : [644/885] 78988=test_ossl I, [2024-05-23T07:38:22.994157 #37630] INFO -- : [645/885] 78993=test_normalize I, [2024-05-23T07:38:22.996506 #37630] INFO -- : [646/885] 78993=test_timeout I, [2024-05-23T07:38:23.001994 #37630] INFO -- : [647/885] 78993=test_flip I, [2024-05-23T07:38:23.015420 #37630] INFO -- : [648/885] 78979=compiler_test I, [2024-05-23T07:38:23.045254 #37630] INFO -- : [649/885] 78993=test_change_word I, [2024-05-23T07:38:23.052553 #37630] INFO -- : [650/885] 78993=test_sleep I, [2024-05-23T07:38:23.056906 #37630] INFO -- : [651/885] 78981=test_gem_local_remote_options I, [2024-05-23T07:38:23.060721 #37630] INFO -- : [652/885] 78989=test_object I, [2024-05-23T07:38:23.065918 #37630] INFO -- : [653/885] 78979=test_ruby_lex I, [2024-05-23T07:38:23.088491 #37630] INFO -- : [654/885] 78981=test_date_arith I, [2024-05-23T07:38:23.093384 #37630] INFO -- : [655/885] 78981=test_func I, [2024-05-23T07:38:23.247437 #37630] INFO -- : [656/885] 78990=test_big5 I, [2024-05-23T07:38:23.257913 #37630] INFO -- : [657/885] 78990=test_pointer I, [2024-05-23T07:38:23.282236 #37630] INFO -- : [658/885] 78992=test_type I, [2024-05-23T07:38:23.285766 #37630] INFO -- : [659/885] 78979=test_ractor I, [2024-05-23T07:38:23.287005 #37630] INFO -- : [660/885] 78992=test_tsort I, [2024-05-23T07:38:23.296559 #37630] INFO -- : [661/885] 78992=test_signedness I, [2024-05-23T07:38:23.351353 #37630] INFO -- : [662/885] 78979=test_rdoc_rd_block_parser I, [2024-05-23T07:38:23.395845 #37630] INFO -- : [663/885] 78979=test_human_typo I, [2024-05-23T07:38:23.399241 #37630] INFO -- : [664/885] 78979=test_primitive I, [2024-05-23T07:38:23.406946 #37630] INFO -- : [665/885] 78979=test_rbconfig I, [2024-05-23T07:38:23.409765 #37630] INFO -- : [666/885] 78979=test_gem_commands_yank_command I, [2024-05-23T07:38:23.410197 #37630] INFO -- : [667/885] 78987=test_win32ole_param I, [2024-05-23T07:38:23.413254 #37630] INFO -- : [668/885] 78987=test_pair I, [2024-05-23T07:38:23.475796 #37630] INFO -- : [669/885] 78989=test_rdoc_generator_pot_po_entry I, [2024-05-23T07:38:23.480913 #37630] INFO -- : [670/885] 78989=test_euc_jp I, [2024-05-23T07:38:23.481633 #37630] INFO -- : [671/885] 78989=test_acceptable I, [2024-05-23T07:38:23.586836 #37630] INFO -- : [672/885] 78989=test_document I, [2024-05-23T07:38:23.589752 #37630] INFO -- : [673/885] 78989=test_rdoc_i18n_locale I, [2024-05-23T07:38:23.603135 #37630] INFO -- : [674/885] 78989=test_name_error_extension I, [2024-05-23T07:38:23.607757 #37630] INFO -- : [675/885] 78989=test_chilled I, [2024-05-23T07:38:23.610841 #37630] INFO -- : [676/885] 78989=test_encoding I, [2024-05-23T07:38:23.626392 #37630] INFO -- : [677/885] 78989=test_httpresponses I, [2024-05-23T07:38:23.629665 #37630] INFO -- : [678/885] 78989=test_set_len I, [2024-05-23T07:38:23.631433 #37630] INFO -- : [679/885] 78989=test_rdoc_ri_driver I, [2024-05-23T07:38:23.896589 #37630] INFO -- : [680/885] 78995=test_gem_resolver_local_specification I, [2024-05-23T07:38:23.900390 #37630] INFO -- : [681/885] 78979=test_httpheader I, [2024-05-23T07:38:23.903775 #37630] INFO -- : [682/885] 78990=test_rdoc_markup_to_label I, [2024-05-23T07:38:23.906672 #37630] INFO -- : [683/885] 78996=test_install I, [2024-05-23T07:38:23.922461 #37630] INFO -- : [684/885] 78990=test_sockopt I, [2024-05-23T07:38:23.924072 #37630] INFO -- : [685/885] 78995=test_color I, [2024-05-23T07:38:23.924594 #37630] INFO -- : [686/885] 78990=json_encoding_test I, [2024-05-23T07:38:23.933822 #37630] INFO -- : [687/885] 78990=test_key_stroke I, [2024-05-23T07:38:23.942853 #37630] INFO -- : [688/885] 78990=test_rdoc_markup_to_html I, [2024-05-23T07:38:23.958497 #37630] INFO -- : [689/885] 78989=test_date_compat I, [2024-05-23T07:38:23.959668 #37630] INFO -- : [690/885] 78989=test_bug-14834 I, [2024-05-23T07:38:23.966799 #37630] INFO -- : [691/885] 78979=test_compile_prism I, [2024-05-23T07:38:23.967341 #37630] INFO -- : [692/885] 78995=test_terminfo I, [2024-05-23T07:38:23.972321 #37630] INFO -- : [693/885] 78995=test_case_mapping I, [2024-05-23T07:38:23.979778 #37630] INFO -- : [694/885] 78995=redundant_return_test I, [2024-05-23T07:38:23.986230 #37630] INFO -- : [695/885] 78995=test_path I, [2024-05-23T07:38:23.989576 #37630] INFO -- : [696/885] 78995=test_win32ole_param_event I, [2024-05-23T07:38:23.992020 #37630] INFO -- : [697/885] 78995=test_bn I, [2024-05-23T07:38:24.002225 #37630] INFO -- : [698/885] 78990=test_addrinfo I, [2024-05-23T07:38:24.008416 #37630] INFO -- : [699/885] 78995=test_http I, [2024-05-23T07:38:24.026034 #37630] INFO -- : [700/885] 78989=test_tree_spell_checker I, [2024-05-23T07:38:24.050514 #37630] INFO -- : [701/885] 78989=static_literals_test I, [2024-05-23T07:38:24.054732 #37630] INFO -- : [702/885] 78989=test_data I, [2024-05-23T07:38:24.058380 #37630] INFO -- : [703/885] 78990=test_gem_gem_runner I, [2024-05-23T07:38:24.059213 #37630] INFO -- : [704/885] 78989=test_filter I, [2024-05-23T07:38:24.099066 #37630] INFO -- : [705/885] 78990=test_rdoc_method_attr I, [2024-05-23T07:38:24.104537 #37630] INFO -- : [706/885] 78989=test_unicode I, [2024-05-23T07:38:24.145796 #37630] INFO -- : [707/885] 78996=test_koi8 I, [2024-05-23T07:38:24.147935 #37630] INFO -- : [708/885] 78989=parameters_signature_test I, [2024-05-23T07:38:24.152641 #37630] INFO -- : [709/885] 78989=test_rdoc_parser_changelog I, [2024-05-23T07:38:24.154487 #37630] INFO -- : [710/885] 78996=test_enumerator I, [2024-05-23T07:38:24.172934 #37630] INFO -- : [711/885] 78996=test_rdoc_generator_pot I, [2024-05-23T07:38:24.174458 #37630] INFO -- : [712/885] 78996=test_thread_cv I, [2024-05-23T07:38:24.193635 #37630] INFO -- : [713/885] 78990=test_lexer I, [2024-05-23T07:38:24.204854 #37630] INFO -- : [714/885] 78990=test_ssl_session I, [2024-05-23T07:38:24.217154 #37630] INFO -- : [715/885] 78989=test_random I, [2024-05-23T07:38:24.226744 #37630] INFO -- : [716/885] 78989=test_notimplement I, [2024-05-23T07:38:24.231093 #37630] INFO -- : [717/885] 78989=test_key_event_record I, [2024-05-23T07:38:24.237397 #37630] INFO -- : [718/885] 78989=test_gem_uri I, [2024-05-23T07:38:24.260369 #37630] INFO -- : [719/885] 78989=test_gem_commands_update_command I, [2024-05-23T07:38:24.290549 #37630] INFO -- : [720/885] 78979=test_gem_resolver_vendor_specification I, [2024-05-23T07:38:24.328244 #37630] INFO -- : [721/885] 78979=test_gem_commands_build_command I, [2024-05-23T07:38:24.478946 #37630] INFO -- : [722/885] 78991=test_case_comprehensive I, [2024-05-23T07:38:24.582141 #37630] INFO -- : [723/885] 78980=test_interned_str I, [2024-05-23T07:38:24.588050 #37630] INFO -- : [724/885] 78980=test_gem_commands_server_command I, [2024-05-23T07:38:24.588737 #37630] INFO -- : [725/885] 78981=test_did_you_mean I, [2024-05-23T07:38:24.589727 #37630] INFO -- : [726/885] 78980=test_variable_name_check I, [2024-05-23T07:38:24.599606 #37630] INFO -- : [727/885] 78979=test_io_m17n I, [2024-05-23T07:38:24.616319 #37630] INFO -- : [728/885] 78980=test_tracer I, [2024-05-23T07:38:24.695242 #37630] INFO -- : [729/885] 78981=test_cmethod I, [2024-05-23T07:38:24.697667 #37630] INFO -- : [730/885] 78981=test_option I, [2024-05-23T07:38:24.720004 #37630] INFO -- : [731/885] 78980=test_append I, [2024-05-23T07:38:24.722174 #37630] INFO -- : [732/885] 78980=test_rdoc_markup_heading I, [2024-05-23T07:38:24.735383 #37630] INFO -- : [733/885] 78980=test_iseq I, [2024-05-23T07:38:24.813111 #37630] INFO -- : [734/885] 78996=test_exception_at_throwing I, [2024-05-23T07:38:24.852893 #37630] INFO -- : [735/885] 78981=test_pkey_dsa I, [2024-05-23T07:38:24.876428 #37630] INFO -- : [736/885] 78996=test_class I, [2024-05-23T07:38:24.880153 #37630] INFO -- : [737/885] 78983=test_ocsp I, [2024-05-23T07:38:24.882295 #37630] INFO -- : [738/885] 78996=test_scheduler I, [2024-05-23T07:38:25.034614 #37630] INFO -- : [739/885] 78996=reflection_test I, [2024-05-23T07:38:25.064749 #37630] INFO -- : [740/885] 78996=test_within_pipe I, [2024-05-23T07:38:25.127473 #37630] INFO -- : [741/885] 78996=test_gem_bundler_version_finder I, [2024-05-23T07:38:25.154712 #37630] INFO -- : [742/885] 78996=test_emoji_breaks I, [2024-05-23T07:38:25.160330 #37630] INFO -- : [743/885] 78996=test_rdoc_markup_to_bs I, [2024-05-23T07:38:25.166360 #37630] INFO -- : [744/885] 78990=test_help I, [2024-05-23T07:38:25.172099 #37630] INFO -- : [745/885] 78983=test_beginendblock I, [2024-05-23T07:38:25.177431 #37630] INFO -- : [746/885] 78990=test_gem_commands_unpack_command I, [2024-05-23T07:38:25.197244 #37630] INFO -- : [747/885] 78996=test_files_lib I, [2024-05-23T07:38:25.348078 #37630] INFO -- : [748/885] 78980=test_stream I, [2024-05-23T07:38:25.386921 #37630] INFO -- : [749/885] 78980=test_time I, [2024-05-23T07:38:25.416715 #37630] INFO -- : [750/885] 78989=test_webauthn_listener_response I, [2024-05-23T07:38:25.438715 #37630] INFO -- : [751/885] 78989=test_to_ary_concat I, [2024-05-23T07:38:25.510702 #37630] INFO -- : [752/885] 78990=test_printf I, [2024-05-23T07:38:25.522482 #37630] INFO -- : [753/885] 78990=test_rdoc_markup_pre_process I, [2024-05-23T07:38:25.547623 #37630] INFO -- : [754/885] 78980=test_pinned I, [2024-05-23T07:38:25.553435 #37630] INFO -- : [755/885] 78983=test_date_marshal I, [2024-05-23T07:38:25.565411 #37630] INFO -- : [756/885] 78983=test_mkmf I, [2024-05-23T07:38:25.588552 #37630] INFO -- : [757/885] 78980=test_history I, [2024-05-23T07:38:25.603441 #37630] INFO -- : [758/885] 78980=test_popen_deadlock I, [2024-05-23T07:38:25.605129 #37630] INFO -- : [759/885] 78992=test_delegate I, [2024-05-23T07:38:25.615228 #37630] INFO -- : [760/885] 78990=test_exit I, [2024-05-23T07:38:25.620415 #37630] INFO -- : [761/885] 78992=test_recursion I, [2024-05-23T07:38:25.625178 #37630] INFO -- : [762/885] 78992=test_gem_security I, [2024-05-23T07:38:25.651154 #37630] INFO -- : [763/885] 78983=test_rdoc_servlet I, [2024-05-23T07:38:25.706895 #37630] INFO -- : [764/885] 78990=test_ractor I, [2024-05-23T07:38:25.763839 #37630] INFO -- : [765/885] 78983=test_digest I, [2024-05-23T07:38:25.776156 #37630] INFO -- : [766/885] 78983=test_bundled_ca I, [2024-05-23T07:38:25.784132 #37630] INFO -- : [767/885] 78990=test_closure I, [2024-05-23T07:38:25.816710 #37630] INFO -- : [768/885] 78979=test_open3 I, [2024-05-23T07:38:26.256282 #37630] INFO -- : [769/885] 78990=test_fiber I, [2024-05-23T07:38:26.260794 #37630] INFO -- : [770/885] 78980=test_multi_irb_commands I, [2024-05-23T07:38:26.261343 #37630] INFO -- : [771/885] 78980=test_cgi_cookie I, [2024-05-23T07:38:26.287118 #37630] INFO -- : [772/885] 78980=test_require I, [2024-05-23T07:38:26.573558 #37630] INFO -- : [773/885] 78989=test_float I, [2024-05-23T07:38:26.724762 #37630] INFO -- : [774/885] 78983=test_gem_source_git I, [2024-05-23T07:38:26.837955 #37630] INFO -- : [775/885] 78987=test_gem_commands_signout_command I, [2024-05-23T07:38:26.850077 #37630] INFO -- : [776/885] 78987=test_refinement I, [2024-05-23T07:38:27.095372 #37630] INFO -- : [777/885] 78994=test_regex_casefold I, [2024-05-23T07:38:27.357474 #37630] INFO -- : [778/885] 78983=test_gem_resolver_installer_set I, [2024-05-23T07:38:27.531651 #37630] INFO -- : [779/885] 78994=test_dir_m17n I, [2024-05-23T07:38:27.589185 #37630] INFO -- : [780/885] 78983=test_metaclass I, [2024-05-23T07:38:27.599800 #37630] INFO -- : [781/885] 78983=test_rdoc_top_level I, [2024-05-23T07:38:27.605675 #37630] INFO -- : [782/885] 78981=test_cgi_session I, [2024-05-23T07:38:27.625925 #37630] INFO -- : [783/885] 78981=test_rdoc_rd I, [2024-05-23T07:38:27.633015 #37630] INFO -- : [784/885] 78981=test_x509crl I, [2024-05-23T07:38:27.769906 #37630] INFO -- : [785/885] 78981=test_signal I, [2024-05-23T07:38:27.940648 #37630] INFO -- : [786/885] 78983=test_fixnum I, [2024-05-23T07:38:27.952984 #37630] INFO -- : [787/885] 78983=test_process I, [2024-05-23T07:38:27.988444 #37630] INFO -- : [788/885] 78983=test_windows_1252 I, [2024-05-23T07:38:27.996410 #37630] INFO -- : [789/885] 78983=test_input_method I, [2024-05-23T07:38:28.030618 #37630] INFO -- : [790/885] 78983=test_digest_extend I, [2024-05-23T07:38:28.034339 #37630] INFO -- : [791/885] 78989=test_omap I, [2024-05-23T07:38:28.037639 #37630] INFO -- : [792/885] 78989=test_string I, [2024-05-23T07:38:28.039941 #37630] INFO -- : [793/885] 78989=test_iterator I, [2024-05-23T07:38:28.048261 #37630] INFO -- : [794/885] 78983=test_memory_view I, [2024-05-23T07:38:28.060395 #37630] INFO -- : [795/885] 78993=pattern_test I, [2024-05-23T07:38:28.077283 #37630] INFO -- : [796/885] 78983=test_debug I, [2024-05-23T07:38:28.083160 #37630] INFO -- : [797/885] 78983=test_shellwords I, [2024-05-23T07:38:28.087866 #37630] INFO -- : [798/885] 78993=test_new I, [2024-05-23T07:38:28.091290 #37630] INFO -- : [799/885] 78983=test_gem_security_signer I, [2024-05-23T07:38:28.098372 #37630] INFO -- : [800/885] 78993=test_cipher I, [2024-05-23T07:38:28.118233 #37630] INFO -- : [801/885] 78989=test_storage I, [2024-05-23T07:38:28.119188 #37630] INFO -- : [802/885] 78989=test_gem_resolver_git_set I, [2024-05-23T07:38:28.158763 #37630] INFO -- : [803/885] 78993=test_win32ole_variant_outarg I, [2024-05-23T07:38:28.165019 #37630] INFO -- : [804/885] 78993=json_common_interface_test I, [2024-05-23T07:38:28.182091 #37630] INFO -- : [805/885] 78993=test_dln I, [2024-05-23T07:38:28.184481 #37630] INFO -- : [806/885] 78993=test_gem_source_subpath_problem I, [2024-05-23T07:38:28.189754 #37630] INFO -- : [807/885] 78996=memsize_test I, [2024-05-23T07:38:28.190985 #37630] INFO -- : [808/885] 78996=test_nomethod_error I, [2024-05-23T07:38:28.200162 #37630] INFO -- : [809/885] 78996=json_parser_test I, [2024-05-23T07:38:28.204354 #37630] INFO -- : [810/885] 78983=test_config I, [2024-05-23T07:38:28.240767 #37630] INFO -- : [811/885] 78996=test_pkg_config I, [2024-05-23T07:38:28.255074 #37630] INFO -- : [812/885] 78996=test_cparser I, [2024-05-23T07:38:28.260075 #37630] INFO -- : [813/885] 78983=test_rdoc_markup_to_html_snippet I, [2024-05-23T07:38:28.312227 #37630] INFO -- : [814/885] 78979=magic_comment_test I, [2024-05-23T07:38:28.314943 #37630] INFO -- : [815/885] 78983=test_struct I, [2024-05-23T07:38:28.317685 #37630] INFO -- : [816/885] 78983=test_variable I, [2024-05-23T07:38:28.318232 #37630] INFO -- : [817/885] 78998=test_sexp I, [2024-05-23T07:38:28.318549 #37630] INFO -- : [818/885] 78993=test_rdoc_markup_include I, [2024-05-23T07:38:28.322585 #37630] INFO -- : [819/885] 78993=fuzzer_test I, [2024-05-23T07:38:28.328948 #37630] INFO -- : [820/885] 78993=test_engine I, [2024-05-23T07:38:28.330155 #37630] INFO -- : [821/885] 78993=test_win32ole_variant_m I, [2024-05-23T07:38:28.332704 #37630] INFO -- : [822/885] 78998=test_div I, [2024-05-23T07:38:28.333818 #37630] INFO -- : [823/885] 78993=test_allocation I, [2024-05-23T07:38:28.336258 #37630] INFO -- : [824/885] 78979=test_key_error I, [2024-05-23T07:38:28.337363 #37630] INFO -- : [825/885] 78998=test_serialize_subclasses I, [2024-05-23T07:38:28.338417 #37630] INFO -- : [826/885] 78979=test_insns_leaf I, [2024-05-23T07:38:28.343532 #37630] INFO -- : [827/885] 78979=test_color_printer I, [2024-05-23T07:38:28.346659 #37630] INFO -- : [828/885] 78998=test_deprecated I, [2024-05-23T07:38:28.349733 #37630] INFO -- : [829/885] 78998=test_files_test_1 I, [2024-05-23T07:38:28.357960 #37630] INFO -- : [830/885] 78979=test_gem_path_support I, [2024-05-23T07:38:28.390009 #37630] INFO -- : [831/885] 78979=test_struct I, [2024-05-23T07:38:28.437698 #37630] INFO -- : [832/885] 78983=test_set I, [2024-05-23T07:38:28.465259 #37630] INFO -- : [833/885] 78983=test_x509req I, [2024-05-23T07:38:28.495284 #37630] INFO -- : [834/885] 78989=test_mutex I, [2024-05-23T07:38:28.588741 #37630] INFO -- : [835/885] 78986=test_rdoc_rd_inline I, [2024-05-23T07:38:28.615126 #37630] INFO -- : [836/885] 78986=constant_path_node_test I, [2024-05-23T07:38:28.619614 #37630] INFO -- : [837/885] 78986=test_gem_ext_cargo_builder I, [2024-05-23T07:38:28.638207 #37630] INFO -- : [838/885] 78986=test_ssl I, [2024-05-23T07:38:28.638519 #37630] INFO -- : [839/885] 78992=test_module I, [2024-05-23T07:38:28.640166 #37630] INFO -- : [840/885] 78983=test_gem_request_set I, [2024-05-23T07:38:28.962274 #37630] INFO -- : [841/885] 78994=test_arith_seq_extract I, [2024-05-23T07:38:29.007255 #37630] INFO -- : [842/885] 78983=test_method_name_check I, [2024-05-23T07:38:29.014387 #37630] INFO -- : [843/885] 78980=test_parser I, [2024-05-23T07:38:29.036418 #37630] INFO -- : [844/885] 78983=test_rubyvm I, [2024-05-23T07:38:29.037593 #37630] INFO -- : [845/885] 78983=test_configuration I, [2024-05-23T07:38:29.057797 #37630] INFO -- : [846/885] 78980=test_buffered_io I, [2024-05-23T07:38:29.082843 #37630] INFO -- : [847/885] 78979=test_monitor I, [2024-05-23T07:38:29.095038 #37630] INFO -- : [848/885] 78994=test_whileuntil I, [2024-05-23T07:38:29.100819 #37630] INFO -- : [849/885] 78994=test_rdoc_generator_markup I, [2024-05-23T07:38:29.104135 #37630] INFO -- : [850/885] 78994=test_boolean I, [2024-05-23T07:38:29.117772 #37630] INFO -- : [851/885] 78994=test_instrumentation_api I, [2024-05-23T07:38:29.132887 #37630] INFO -- : [852/885] 78983=integer_parse_test I, [2024-05-23T07:38:29.149920 #37630] INFO -- : [853/885] 78980=test_stringify_symbols I, [2024-05-23T07:38:29.170443 #37630] INFO -- : [854/885] 78980=test_benchmark I, [2024-05-23T07:38:29.176440 #37630] INFO -- : [855/885] 78985=test_gem_dependency_list I, [2024-05-23T07:38:29.200074 #37630] INFO -- : [856/885] 78983=test_nesting_parser I, [2024-05-23T07:38:29.232580 #37630] INFO -- : [857/885] 78983=test_win32ole_method_event I, [2024-05-23T07:38:29.239602 #37630] INFO -- : [858/885] 78983=test_scalar_scanner I, [2024-05-23T07:38:29.249861 #37630] INFO -- : [859/885] 78983=test_gem_source I, [2024-05-23T07:38:29.270229 #37630] INFO -- : [860/885] 78985=test_gem_package_tar_writer I, [2024-05-23T07:38:29.286827 #37630] INFO -- : [861/885] 78979=test_helper_method I, [2024-05-23T07:38:29.297564 #37630] INFO -- : [862/885] 78979=test_array I, [2024-05-23T07:38:29.368356 #37630] INFO -- : [863/885] 78996=test_gem_commands_outdated_command I, [2024-05-23T07:38:29.379345 #37630] INFO -- : [864/885] 78985=test_provider I, [2024-05-23T07:38:29.403050 #37630] INFO -- : [865/885] 78996=test_abi I, [2024-05-23T07:38:29.555289 #37630] INFO -- : [866/885] 78996=test_gem_commands_rebuild_command I, [2024-05-23T07:38:29.563121 #37630] INFO -- : [867/885] 78983=test_yamldbm I, [2024-05-23T07:38:29.564466 #37630] INFO -- : [868/885] 78983=test_load I, [2024-05-23T07:38:29.570223 #37630] INFO -- : [869/885] 78983=test_rdoc_parser_simple I, [2024-05-23T07:38:29.598799 #37630] INFO -- : [870/885] 78996=test_gem_ext_builder I, [2024-05-23T07:38:29.603794 #37630] INFO -- : [871/885] 78983=test_https I, [2024-05-23T07:38:29.635347 #37630] INFO -- : [872/885] 78989=test_evaluation I, [2024-05-23T07:38:29.656634 #37630] INFO -- : [873/885] 78989=test_gem_source_installed I, [2024-05-23T07:38:29.660239 #37630] INFO -- : [874/885] 78989=test_x509ext I, [2024-05-23T07:38:29.668051 #37630] INFO -- : [875/885] 78985=test_erb I, [2024-05-23T07:38:29.669914 #37630] INFO -- : [876/885] 78989=test_yield_block I, [2024-05-23T07:38:29.673914 #37630] INFO -- : [877/885] 78989=test_len I, [2024-05-23T07:38:29.677239 #37630] INFO -- : [878/885] 78989=test_completion I, [2024-05-23T07:38:29.680954 #37630] INFO -- : [879/885] 78987=test_gem_commands_cert_command I, [2024-05-23T07:38:29.718800 #37630] INFO -- : [880/885] 78985=test_rational I, [2024-05-23T07:38:29.741809 #37630] INFO -- : [881/885] 78985=test_rational2 I, [2024-05-23T07:38:29.757092 #37630] INFO -- : [882/885] 78985=test_propertyputref I, [2024-05-23T07:38:29.762601 #37630] INFO -- : [883/885] 78985=attribute_write_test I, [2024-05-23T07:38:29.799819 #37630] INFO -- : [884/885] 78985=test_spell_checker I, [2024-05-23T07:38:29.807834 #37630] INFO -- : [885/885] 78985=test_assembler I, [2024-05-23T07:38:48.854340 #37630] INFO -- : Finished tests in 38.464533s, 686.0866 tests/s, 243131.2504 assertions/s. I, [2024-05-23T07:38:48.855059 #37630] INFO -- : 26390 tests, 9351930 assertions, 0 failures, 0 errors, 312 skips I, [2024-05-23T07:38:48.855086 #37630] INFO -- : I, [2024-05-23T07:38:48.855093 #37630] INFO -- : ruby -v: ruby 3.4.0dev (2024-05-23T04:16:48Z master ce20367a0e) [x86_64-linux] I, [2024-05-23T07:38:48.857192 #37630] INFO -- : $$$[end] "make yes-test-all TESTOPTS='--stderr-on-failure' TESTS='-j20'" exit with 0. I, [2024-05-23T07:38:48.857315 #37630] INFO -- : $$$[beg] make yes-test-rubyspec MSPECOPT='--error-output stderr --debug -j' TESTS='-j20' I, [2024-05-23T07:38:48.956076 #37630] INFO -- : BASERUBY = /usr/bin/ruby --disable=gems I, [2024-05-23T07:38:48.956114 #37630] INFO -- : CC = gcc I, [2024-05-23T07:38:48.956119 #37630] INFO -- : LD = ld I, [2024-05-23T07:38:48.956124 #37630] INFO -- : LDSHARED = gcc -shared I, [2024-05-23T07:38:48.956128 #37630] INFO -- : CFLAGS = -O3 -fno-fast-math -ggdb3 -Wall -Wextra -Wdeprecated-declarations -Wdiv-by-zero -Wduplicated-cond -Wimplicit-function-declaration -Wimplicit-int -Wpointer-arith -Wwrite-strings -Wold-style-definition -Wimplicit-fallthrough=0 -Wmissing-noreturn -Wno-cast-function-type -Wno-constant-logical-operand -Wno-long-long -Wno-missing-field-initializers -Wno-overlength-strings -Wno-packed-bitfield-compat -Wno-parentheses-equality -Wno-self-assign -Wno-tautological-compare -Wno-unused-parameter -Wno-unused-value -Wsuggest-attribute=format -Wsuggest-attribute=noreturn -Wunused-variable -Wmisleading-indentation -Wundef -fPIC I, [2024-05-23T07:38:48.956133 #37630] INFO -- : XCFLAGS = -U_FORTIFY_SOURCE -D_FORTIFY_SOURCE=2 -fstack-protector-strong -fno-strict-overflow -fvisibility=hidden -fexcess-precision=standard -DRUBY_EXPORT -I. -I.ext/include/x86_64-linux -I/tmp/ruby/src/trunk/include -I/tmp/ruby/src/trunk -I/tmp/ruby/src/trunk/prism -I/tmp/ruby/src/trunk/enc/unicode/15.0.0 I, [2024-05-23T07:38:48.956137 #37630] INFO -- : CPPFLAGS = I, [2024-05-23T07:38:48.956141 #37630] INFO -- : DLDFLAGS = -Wl,--compress-debug-sections=zlib -Wl,-soname,libruby.so.3.4 -fstack-protector-strong I, [2024-05-23T07:38:48.956145 #37630] INFO -- : SOLIBS = -lz -lrt -lrt -lgmp -ldl -lcrypt -lm -lpthread I, [2024-05-23T07:38:48.956149 #37630] INFO -- : LANG = en_US.UTF-8 I, [2024-05-23T07:38:48.956153 #37630] INFO -- : LC_ALL = I, [2024-05-23T07:38:48.956157 #37630] INFO -- : LC_CTYPE = I, [2024-05-23T07:38:48.956160 #37630] INFO -- : MFLAGS = I, [2024-05-23T07:38:48.956163 #37630] INFO -- : RUSTC = no I, [2024-05-23T07:38:48.956167 #37630] INFO -- : YJIT_RUSTC_ARGS = --crate-name=yjit --crate-type=staticlib --edition=2021 -g -C lto=thin -C opt-level=3 -C overflow-checks=on '--out-dir=/tmp/ruby/build/trunk/yjit/target/release/' /tmp/ruby/src/trunk/yjit/src/lib.rs I, [2024-05-23T07:38:48.956854 #37630] INFO -- : gcc (Ubuntu 11.4.0-1ubuntu1~22.04) 11.4.0 I, [2024-05-23T07:38:48.956874 #37630] INFO -- : Copyright (C) 2021 Free Software Foundation, Inc. I, [2024-05-23T07:38:48.956880 #37630] INFO -- : This is free software; see the source for copying conditions. There is NO I, [2024-05-23T07:38:48.956885 #37630] INFO -- : warranty; not even for MERCHANTABILITY or FITNESS FOR A PARTICULAR PURPOSE. I, [2024-05-23T07:38:48.956897 #37630] INFO -- : I, [2024-05-23T07:38:48.958513 #37630] INFO -- : generating enc.mk I, [2024-05-23T07:38:49.080056 #37630] INFO -- : generating encdb.h I, [2024-05-23T07:38:49.104085 #37630] INFO -- : encdb.h unchanged I, [2024-05-23T07:38:49.105298 #37630] INFO -- : making enc I, [2024-05-23T07:38:49.123572 #37630] INFO -- : make[1]: Entering directory '/tmp/ruby/build/trunk' I, [2024-05-23T07:38:49.123592 #37630] INFO -- : make[1]: Nothing to be done for 'enc'. I, [2024-05-23T07:38:49.123598 #37630] INFO -- : make[1]: Leaving directory '/tmp/ruby/build/trunk' I, [2024-05-23T07:38:49.124296 #37630] INFO -- : making srcs under enc I, [2024-05-23T07:38:49.154133 #37630] INFO -- : make[1]: Entering directory '/tmp/ruby/build/trunk' I, [2024-05-23T07:38:49.154154 #37630] INFO -- : make[1]: Nothing to be done for 'srcs'. I, [2024-05-23T07:38:49.154159 #37630] INFO -- : make[1]: Leaving directory '/tmp/ruby/build/trunk' I, [2024-05-23T07:38:49.155126 #37630] INFO -- : generating transdb.h I, [2024-05-23T07:38:49.250851 #37630] INFO -- : transdb.h unchanged I, [2024-05-23T07:38:49.252165 #37630] INFO -- : making trans I, [2024-05-23T07:38:49.285633 #37630] INFO -- : make[1]: Entering directory '/tmp/ruby/build/trunk' I, [2024-05-23T07:38:49.285670 #37630] INFO -- : make[1]: Nothing to be done for 'trans'. I, [2024-05-23T07:38:49.285677 #37630] INFO -- : make[1]: Leaving directory '/tmp/ruby/build/trunk' I, [2024-05-23T07:38:49.286413 #37630] INFO -- : making encs I, [2024-05-23T07:38:49.324276 #37630] INFO -- : make[1]: Entering directory '/tmp/ruby/build/trunk' I, [2024-05-23T07:38:49.324296 #37630] INFO -- : make[1]: Nothing to be done for 'encs'. I, [2024-05-23T07:38:49.324301 #37630] INFO -- : make[1]: Leaving directory '/tmp/ruby/build/trunk' I, [2024-05-23T07:38:49.326153 #37630] INFO -- : generating makefiles ext/configure-ext.mk I, [2024-05-23T07:38:49.352712 #37630] INFO -- : ext/configure-ext.mk updated I, [2024-05-23T07:38:49.355300 #37630] INFO -- : make[1]: Entering directory '/tmp/ruby/build/trunk' I, [2024-05-23T07:38:50.751969 #37630] INFO -- : make[1]: Leaving directory '/tmp/ruby/build/trunk' I, [2024-05-23T07:38:50.752770 #37630] INFO -- : generating makefile exts.mk I, [2024-05-23T07:38:50.793231 #37630] INFO -- : exts.mk unchanged I, [2024-05-23T07:38:50.797781 #37630] INFO -- : make[1]: Entering directory '/tmp/ruby/build/trunk' I, [2024-05-23T07:38:51.105769 #37630] INFO -- : make[2]: Entering directory '/tmp/ruby/build/trunk/ext/coverage' I, [2024-05-23T07:38:51.110459 #37630] INFO -- : make[2]: Leaving directory '/tmp/ruby/build/trunk/ext/coverage' I, [2024-05-23T07:38:51.116972 #37630] INFO -- : make[2]: Entering directory '/tmp/ruby/build/trunk/ext/date' I, [2024-05-23T07:38:51.122165 #37630] INFO -- : make[2]: Leaving directory '/tmp/ruby/build/trunk/ext/date' I, [2024-05-23T07:38:51.126120 #37630] INFO -- : make[2]: Entering directory '/tmp/ruby/build/trunk/ext/digest' I, [2024-05-23T07:38:51.135025 #37630] INFO -- : make[2]: Leaving directory '/tmp/ruby/build/trunk/ext/digest' I, [2024-05-23T07:38:51.158760 #37630] INFO -- : make[2]: Entering directory '/tmp/ruby/build/trunk/ext/digest/sha2' I, [2024-05-23T07:38:51.163929 #37630] INFO -- : make[2]: Leaving directory '/tmp/ruby/build/trunk/ext/digest/sha2' I, [2024-05-23T07:38:51.185773 #37630] INFO -- : make[2]: Entering directory '/tmp/ruby/build/trunk/ext/fiddle' I, [2024-05-23T07:38:51.196512 #37630] INFO -- : make[2]: Leaving directory '/tmp/ruby/build/trunk/ext/fiddle' I, [2024-05-23T07:38:51.201504 #37630] INFO -- : make[2]: Entering directory '/tmp/ruby/build/trunk/ext/io/console' I, [2024-05-23T07:38:51.205549 #37630] INFO -- : make[2]: Leaving directory '/tmp/ruby/build/trunk/ext/io/console' I, [2024-05-23T07:38:51.218113 #37630] INFO -- : make[2]: Entering directory '/tmp/ruby/build/trunk/ext/json' I, [2024-05-23T07:38:51.225968 #37630] INFO -- : make[2]: Leaving directory '/tmp/ruby/build/trunk/ext/json' I, [2024-05-23T07:38:51.237157 #37630] INFO -- : make[2]: Entering directory '/tmp/ruby/build/trunk/ext/monitor' I, [2024-05-23T07:38:51.240030 #37630] INFO -- : make[2]: Leaving directory '/tmp/ruby/build/trunk/ext/monitor' I, [2024-05-23T07:38:51.246634 #37630] INFO -- : make[2]: Entering directory '/tmp/ruby/build/trunk/ext/objspace' I, [2024-05-23T07:38:51.252792 #37630] INFO -- : make[2]: Leaving directory '/tmp/ruby/build/trunk/ext/objspace' I, [2024-05-23T07:38:51.266840 #37630] INFO -- : make[2]: Entering directory '/tmp/ruby/build/trunk/ext/openssl' I, [2024-05-23T07:38:51.280492 #37630] INFO -- : make[2]: Leaving directory '/tmp/ruby/build/trunk/ext/openssl' I, [2024-05-23T07:38:51.284291 #37630] INFO -- : make[2]: Entering directory '/tmp/ruby/build/trunk/ext/pathname' I, [2024-05-23T07:38:51.288185 #37630] INFO -- : make[2]: Leaving directory '/tmp/ruby/build/trunk/ext/pathname' I, [2024-05-23T07:38:51.295413 #37630] INFO -- : make[2]: Entering directory '/tmp/ruby/build/trunk/ext/psych' I, [2024-05-23T07:38:51.320147 #37630] INFO -- : make[2]: Leaving directory '/tmp/ruby/build/trunk/ext/psych' I, [2024-05-23T07:38:51.324566 #37630] INFO -- : make[2]: Entering directory '/tmp/ruby/build/trunk/ext/pty' I, [2024-05-23T07:38:51.328605 #37630] INFO -- : make[2]: Leaving directory '/tmp/ruby/build/trunk/ext/pty' I, [2024-05-23T07:38:51.343965 #37630] INFO -- : make[2]: Entering directory '/tmp/ruby/build/trunk/ext/ripper' I, [2024-05-23T07:38:51.352260 #37630] INFO -- : make[2]: Leaving directory '/tmp/ruby/build/trunk/ext/ripper' I, [2024-05-23T07:38:51.354758 #37630] INFO -- : make[2]: Entering directory '/tmp/ruby/build/trunk/ext/rubyvm' I, [2024-05-23T07:38:51.358046 #37630] INFO -- : make[2]: Leaving directory '/tmp/ruby/build/trunk/ext/rubyvm' I, [2024-05-23T07:38:51.369975 #37630] INFO -- : make[2]: Entering directory '/tmp/ruby/build/trunk/ext/socket' I, [2024-05-23T07:38:51.377556 #37630] INFO -- : make[2]: Leaving directory '/tmp/ruby/build/trunk/ext/socket' I, [2024-05-23T07:38:51.395545 #37630] INFO -- : make[2]: Entering directory '/tmp/ruby/build/trunk/.bundle/gems/bigdecimal-3.1.8/ext/bigdecimal' I, [2024-05-23T07:38:51.423270 #37630] INFO -- : make[2]: Leaving directory '/tmp/ruby/build/trunk/.bundle/gems/bigdecimal-3.1.8/ext/bigdecimal' I, [2024-05-23T07:38:51.425231 #37630] INFO -- : make[2]: Entering directory '/tmp/ruby/build/trunk/.bundle/gems/debug-1.9.2/ext/debug' I, [2024-05-23T07:38:51.448739 #37630] INFO -- : make[2]: Leaving directory '/tmp/ruby/build/trunk/.bundle/gems/debug-1.9.2/ext/debug' I, [2024-05-23T07:38:51.450702 #37630] INFO -- : make[2]: Entering directory '/tmp/ruby/build/trunk/.bundle/gems/nkf-0.2.0/ext/nkf' I, [2024-05-23T07:38:51.472820 #37630] INFO -- : make[2]: Leaving directory '/tmp/ruby/build/trunk/.bundle/gems/nkf-0.2.0/ext/nkf' I, [2024-05-23T07:38:51.474768 #37630] INFO -- : make[2]: Entering directory '/tmp/ruby/build/trunk/.bundle/gems/racc-1.7.3/ext/racc/cparse' I, [2024-05-23T07:38:51.496735 #37630] INFO -- : make[2]: Leaving directory '/tmp/ruby/build/trunk/.bundle/gems/racc-1.7.3/ext/racc/cparse' I, [2024-05-23T07:38:51.498684 #37630] INFO -- : make[2]: Entering directory '/tmp/ruby/build/trunk/.bundle/gems/racc-1.8.0/ext/racc/cparse' I, [2024-05-23T07:38:51.520759 #37630] INFO -- : make[2]: Leaving directory '/tmp/ruby/build/trunk/.bundle/gems/racc-1.8.0/ext/racc/cparse' I, [2024-05-23T07:38:51.523293 #37630] INFO -- : make[2]: Entering directory '/tmp/ruby/build/trunk/.bundle/gems/rbs-3.4.4/ext/rbs_extension' I, [2024-05-23T07:38:51.544497 #37630] INFO -- : make[2]: Leaving directory '/tmp/ruby/build/trunk/.bundle/gems/rbs-3.4.4/ext/rbs_extension' I, [2024-05-23T07:38:51.546400 #37630] INFO -- : make[2]: Entering directory '/tmp/ruby/build/trunk/.bundle/gems/syslog-0.1.2/ext/syslog' I, [2024-05-23T07:38:51.567645 #37630] INFO -- : make[2]: Leaving directory '/tmp/ruby/build/trunk/.bundle/gems/syslog-0.1.2/ext/syslog' I, [2024-05-23T07:38:51.590846 #37630] INFO -- : make[2]: Entering directory '/tmp/ruby/build/trunk' I, [2024-05-23T07:38:51.658452 #37630] INFO -- : make[2]: 'ruby' is up to date. I, [2024-05-23T07:38:51.658501 #37630] INFO -- : make[2]: Leaving directory '/tmp/ruby/build/trunk' I, [2024-05-23T07:38:51.659064 #37630] INFO -- : make[1]: Leaving directory '/tmp/ruby/build/trunk' I, [2024-05-23T07:38:51.662591 #37630] INFO -- : make[1]: Entering directory '/tmp/ruby/build/trunk' I, [2024-05-23T07:38:51.662615 #37630] INFO -- : make[1]: Nothing to be done for 'note'. I, [2024-05-23T07:38:51.662622 #37630] INFO -- : make[1]: Leaving directory '/tmp/ruby/build/trunk' E, [2024-05-23T07:38:51.723452 #37630] ERROR -- : $ /tmp/ruby/build/trunk/miniruby -I/tmp/ruby/src/trunk/lib /tmp/ruby/src/trunk/tool/runruby.rb --archdir=/tmp/ruby/build/trunk --extout=.ext -- /tmp/ruby/src/trunk/spec/mspec/bin/mspec-run -B /tmp/ruby/src/trunk/spec/default.mspec --error-output stderr --debug -fy -o /tmp/rubytest.6v2kvv/1-mspec-multi-0 E, [2024-05-23T07:38:51.723548 #37630] ERROR -- : $ /tmp/ruby/build/trunk/miniruby -I/tmp/ruby/src/trunk/lib /tmp/ruby/src/trunk/tool/runruby.rb --archdir=/tmp/ruby/build/trunk --extout=.ext -- /tmp/ruby/src/trunk/spec/mspec/bin/mspec-run -B /tmp/ruby/src/trunk/spec/default.mspec --error-output stderr --debug -fy -o /tmp/rubytest.6v2kvv/2-mspec-multi-1 E, [2024-05-23T07:38:51.724045 #37630] ERROR -- : $ /tmp/ruby/build/trunk/miniruby -I/tmp/ruby/src/trunk/lib /tmp/ruby/src/trunk/tool/runruby.rb --archdir=/tmp/ruby/build/trunk --extout=.ext -- /tmp/ruby/src/trunk/spec/mspec/bin/mspec-run -B /tmp/ruby/src/trunk/spec/default.mspec --error-output stderr --debug -fy -o /tmp/rubytest.6v2kvv/3-mspec-multi-2 E, [2024-05-23T07:38:51.724125 #37630] ERROR -- : $ /tmp/ruby/build/trunk/miniruby -I/tmp/ruby/src/trunk/lib /tmp/ruby/src/trunk/tool/runruby.rb --archdir=/tmp/ruby/build/trunk --extout=.ext -- /tmp/ruby/src/trunk/spec/mspec/bin/mspec-run -B /tmp/ruby/src/trunk/spec/default.mspec --error-output stderr --debug -fy -o /tmp/rubytest.6v2kvv/4-mspec-multi-3 E, [2024-05-23T07:38:51.724548 #37630] ERROR -- : $ /tmp/ruby/build/trunk/miniruby -I/tmp/ruby/src/trunk/lib /tmp/ruby/src/trunk/tool/runruby.rb --archdir=/tmp/ruby/build/trunk --extout=.ext -- /tmp/ruby/src/trunk/spec/mspec/bin/mspec-run -B /tmp/ruby/src/trunk/spec/default.mspec --error-output stderr --debug -fy -o /tmp/rubytest.6v2kvv/5-mspec-multi-4 E, [2024-05-23T07:38:51.724726 #37630] ERROR -- : $ /tmp/ruby/build/trunk/miniruby -I/tmp/ruby/src/trunk/lib /tmp/ruby/src/trunk/tool/runruby.rb --archdir=/tmp/ruby/build/trunk --extout=.ext -- /tmp/ruby/src/trunk/spec/mspec/bin/mspec-run -B /tmp/ruby/src/trunk/spec/default.mspec --error-output stderr --debug -fy -o /tmp/rubytest.6v2kvv/6-mspec-multi-5 E, [2024-05-23T07:38:51.724944 #37630] ERROR -- : $ /tmp/ruby/build/trunk/miniruby -I/tmp/ruby/src/trunk/lib /tmp/ruby/src/trunk/tool/runruby.rb --archdir=/tmp/ruby/build/trunk --extout=.ext -- /tmp/ruby/src/trunk/spec/mspec/bin/mspec-run -B /tmp/ruby/src/trunk/spec/default.mspec --error-output stderr --debug -fy -o /tmp/rubytest.6v2kvv/7-mspec-multi-6 E, [2024-05-23T07:38:51.725047 #37630] ERROR -- : $ /tmp/ruby/build/trunk/miniruby -I/tmp/ruby/src/trunk/lib /tmp/ruby/src/trunk/tool/runruby.rb --archdir=/tmp/ruby/build/trunk --extout=.ext -- /tmp/ruby/src/trunk/spec/mspec/bin/mspec-run -B /tmp/ruby/src/trunk/spec/default.mspec --error-output stderr --debug -fy -o /tmp/rubytest.6v2kvv/8-mspec-multi-7 E, [2024-05-23T07:38:51.725271 #37630] ERROR -- : $ /tmp/ruby/build/trunk/miniruby -I/tmp/ruby/src/trunk/lib /tmp/ruby/src/trunk/tool/runruby.rb --archdir=/tmp/ruby/build/trunk --extout=.ext -- /tmp/ruby/src/trunk/spec/mspec/bin/mspec-run -B /tmp/ruby/src/trunk/spec/default.mspec --error-output stderr --debug -fy -o /tmp/rubytest.6v2kvv/9-mspec-multi-8 E, [2024-05-23T07:38:51.725464 #37630] ERROR -- : $ /tmp/ruby/build/trunk/miniruby -I/tmp/ruby/src/trunk/lib /tmp/ruby/src/trunk/tool/runruby.rb --archdir=/tmp/ruby/build/trunk --extout=.ext -- /tmp/ruby/src/trunk/spec/mspec/bin/mspec-run -B /tmp/ruby/src/trunk/spec/default.mspec --error-output stderr --debug -fy -o /tmp/rubytest.6v2kvv/10-mspec-multi-9 E, [2024-05-23T07:38:51.725759 #37630] ERROR -- : $ /tmp/ruby/build/trunk/miniruby -I/tmp/ruby/src/trunk/lib /tmp/ruby/src/trunk/tool/runruby.rb --archdir=/tmp/ruby/build/trunk --extout=.ext -- /tmp/ruby/src/trunk/spec/mspec/bin/mspec-run -B /tmp/ruby/src/trunk/spec/default.mspec --error-output stderr --debug -fy -o /tmp/rubytest.6v2kvv/11-mspec-multi-10 E, [2024-05-23T07:38:51.725950 #37630] ERROR -- : $ /tmp/ruby/build/trunk/miniruby -I/tmp/ruby/src/trunk/lib /tmp/ruby/src/trunk/tool/runruby.rb --archdir=/tmp/ruby/build/trunk --extout=.ext -- /tmp/ruby/src/trunk/spec/mspec/bin/mspec-run -B /tmp/ruby/src/trunk/spec/default.mspec --error-output stderr --debug -fy -o /tmp/rubytest.6v2kvv/12-mspec-multi-11 E, [2024-05-23T07:38:51.726109 #37630] ERROR -- : $ /tmp/ruby/build/trunk/miniruby -I/tmp/ruby/src/trunk/lib /tmp/ruby/src/trunk/tool/runruby.rb --archdir=/tmp/ruby/build/trunk --extout=.ext -- /tmp/ruby/src/trunk/spec/mspec/bin/mspec-run -B /tmp/ruby/src/trunk/spec/default.mspec --error-output stderr --debug -fy -o /tmp/rubytest.6v2kvv/13-mspec-multi-12 E, [2024-05-23T07:38:51.726250 #37630] ERROR -- : $ /tmp/ruby/build/trunk/miniruby -I/tmp/ruby/src/trunk/lib /tmp/ruby/src/trunk/tool/runruby.rb --archdir=/tmp/ruby/build/trunk --extout=.ext -- /tmp/ruby/src/trunk/spec/mspec/bin/mspec-run -B /tmp/ruby/src/trunk/spec/default.mspec --error-output stderr --debug -fy -o /tmp/rubytest.6v2kvv/14-mspec-multi-13 E, [2024-05-23T07:38:51.726473 #37630] ERROR -- : $ /tmp/ruby/build/trunk/miniruby -I/tmp/ruby/src/trunk/lib /tmp/ruby/src/trunk/tool/runruby.rb --archdir=/tmp/ruby/build/trunk --extout=.ext -- /tmp/ruby/src/trunk/spec/mspec/bin/mspec-run -B /tmp/ruby/src/trunk/spec/default.mspec --error-output stderr --debug -fy -o /tmp/rubytest.6v2kvv/15-mspec-multi-14 E, [2024-05-23T07:38:51.726642 #37630] ERROR -- : $ /tmp/ruby/build/trunk/miniruby -I/tmp/ruby/src/trunk/lib /tmp/ruby/src/trunk/tool/runruby.rb --archdir=/tmp/ruby/build/trunk --extout=.ext -- /tmp/ruby/src/trunk/spec/mspec/bin/mspec-run -B /tmp/ruby/src/trunk/spec/default.mspec --error-output stderr --debug -fy -o /tmp/rubytest.6v2kvv/16-mspec-multi-15 E, [2024-05-23T07:38:51.726837 #37630] ERROR -- : $ /tmp/ruby/build/trunk/miniruby -I/tmp/ruby/src/trunk/lib /tmp/ruby/src/trunk/tool/runruby.rb --archdir=/tmp/ruby/build/trunk --extout=.ext -- /tmp/ruby/src/trunk/spec/mspec/bin/mspec-run -B /tmp/ruby/src/trunk/spec/default.mspec --error-output stderr --debug -fy -o /tmp/rubytest.6v2kvv/17-mspec-multi-16 E, [2024-05-23T07:38:51.727001 #37630] ERROR -- : $ /tmp/ruby/build/trunk/miniruby -I/tmp/ruby/src/trunk/lib /tmp/ruby/src/trunk/tool/runruby.rb --archdir=/tmp/ruby/build/trunk --extout=.ext -- /tmp/ruby/src/trunk/spec/mspec/bin/mspec-run -B /tmp/ruby/src/trunk/spec/default.mspec --error-output stderr --debug -fy -o /tmp/rubytest.6v2kvv/18-mspec-multi-17 E, [2024-05-23T07:38:51.729451 #37630] ERROR -- : $ /tmp/ruby/build/trunk/miniruby -I/tmp/ruby/src/trunk/lib /tmp/ruby/src/trunk/tool/runruby.rb --archdir=/tmp/ruby/build/trunk --extout=.ext -- /tmp/ruby/src/trunk/spec/mspec/bin/mspec-run -B /tmp/ruby/src/trunk/spec/default.mspec --error-output stderr --debug -fy -o /tmp/rubytest.6v2kvv/19-mspec-multi-18 E, [2024-05-23T07:38:51.729739 #37630] ERROR -- : $ /tmp/ruby/build/trunk/miniruby -I/tmp/ruby/src/trunk/lib /tmp/ruby/src/trunk/tool/runruby.rb --archdir=/tmp/ruby/build/trunk --extout=.ext -- /tmp/ruby/src/trunk/spec/mspec/bin/mspec-run -B /tmp/ruby/src/trunk/spec/default.mspec --error-output stderr --debug -fy -o /tmp/rubytest.6v2kvv/20-mspec-multi-19 I, [2024-05-23T07:38:51.895990 #37630] INFO -- : ruby 3.4.0dev (2024-05-23T04:16:48Z master ce20367a0e) [x86_64-linux] I, [2024-05-23T07:38:52.532242 #37630] INFO -- : 0 ......................................................................... I, [2024-05-23T07:38:52.864931 #37630] INFO -- : 73 ......................................................................... I, [2024-05-23T07:38:53.027148 #37630] INFO -- : 146 ......................................................................... I, [2024-05-23T07:38:53.093029 #37630] INFO -- : 219 ......................................................................... I, [2024-05-23T07:38:53.166666 #37630] INFO -- : 292 ......................................................................... I, [2024-05-23T07:38:53.207172 #37630] INFO -- : 365 ......................................................................... I, [2024-05-23T07:38:53.228710 #37630] INFO -- : 438 ......................................................................... I, [2024-05-23T07:38:53.247339 #37630] INFO -- : 511 ......................................................................... I, [2024-05-23T07:38:53.266280 #37630] INFO -- : 584 ......................................................................... I, [2024-05-23T07:38:53.330278 #37630] INFO -- : 657 ......................................................................... I, [2024-05-23T07:38:53.357925 #37630] INFO -- : 730 ......................................................................... I, [2024-05-23T07:38:53.377321 #37630] INFO -- : 803 ......................................................................... I, [2024-05-23T07:38:53.408799 #37630] INFO -- : 876 ......................................................................... I, [2024-05-23T07:38:53.455247 #37630] INFO -- : 949 ......................................................................... I, [2024-05-23T07:38:53.544322 #37630] INFO -- : 1022 ......................................................................... I, [2024-05-23T07:38:53.723850 #37630] INFO -- : 1095 ......................................................................... I, [2024-05-23T07:38:53.826269 #37630] INFO -- : 1168 ......................................................................... I, [2024-05-23T07:38:53.875202 #37630] INFO -- : 1241 ......................................................................... I, [2024-05-23T07:38:53.922130 #37630] INFO -- : 1314 ......................................................................... I, [2024-05-23T07:38:53.947741 #37630] INFO -- : 1387 ......................................................................... I, [2024-05-23T07:38:54.048871 #37630] INFO -- : 1460 ......................................................................... I, [2024-05-23T07:38:54.521866 #37630] INFO -- : 1533 ......................................................................... I, [2024-05-23T07:38:54.593482 #37630] INFO -- : 1606 ......................................................................... I, [2024-05-23T07:38:54.791754 #37630] INFO -- : 1679 ......................................................................... I, [2024-05-23T07:38:54.873970 #37630] INFO -- : 1752 ......................................................................... I, [2024-05-23T07:38:54.962992 #37630] INFO -- : 1825 ......................................................................... I, [2024-05-23T07:38:55.042041 #37630] INFO -- : 1898 ......................................................................... I, [2024-05-23T07:38:55.124974 #37630] INFO -- : 1971 ......................................................................... I, [2024-05-23T07:38:55.187083 #37630] INFO -- : 2044 ......................................................................... I, [2024-05-23T07:38:55.233923 #37630] INFO -- : 2117 ......................................................................... I, [2024-05-23T07:38:55.255233 #37630] INFO -- : 2190 ......................................................................... I, [2024-05-23T07:38:55.275023 #37630] INFO -- : 2263 ......................................................................... I, [2024-05-23T07:38:55.291447 #37630] INFO -- : 2336 ......................................................................... I, [2024-05-23T07:38:55.324592 #37630] INFO -- : 2409 ......................................................................... I, [2024-05-23T07:38:55.436783 #37630] INFO -- : 2482 ......................................................................... I, [2024-05-23T07:38:55.463146 #37630] INFO -- : 2555 ......................................................................... I, [2024-05-23T07:38:55.553329 #37630] INFO -- : 2628 ......................................................................... I, [2024-05-23T07:38:55.648669 #37630] INFO -- : 2701 ......................................................................... I, [2024-05-23T07:38:55.678003 #37630] INFO -- : 2774 ......................................................................... I, [2024-05-23T07:38:55.731497 #37630] INFO -- : 2847 ......................................................................... I, [2024-05-23T07:38:55.768714 #37630] INFO -- : 2920 ......................................................................... I, [2024-05-23T07:38:55.791480 #37630] INFO -- : 2993 ......................................................................... I, [2024-05-23T07:38:55.807533 #37630] INFO -- : 3066 ......................................................................... I, [2024-05-23T07:38:55.820777 #37630] INFO -- : 3139 ......................................................................... I, [2024-05-23T07:38:55.830358 #37630] INFO -- : 3212 ......................................................................... I, [2024-05-23T07:38:55.857134 #37630] INFO -- : 3285 ......................................................................... I, [2024-05-23T07:38:59.809874 #37630] INFO -- : 3358 ......................................................................... I, [2024-05-23T07:38:59.831193 #37630] INFO -- : I, [2024-05-23T07:38:59.831220 #37630] INFO -- : I, [2024-05-23T07:38:59.831226 #37630] INFO -- : Finished in 8.106965 seconds I, [2024-05-23T07:38:59.831230 #37630] INFO -- : I, [2024-05-23T07:38:59.831234 #37630] INFO -- : 3430 files, 32652 examples, 176750 expectations, 0 failures, 0 errors, 0 tagged I, [2024-05-23T07:38:59.833419 #37630] INFO -- : $$$[end] "make yes-test-rubyspec MSPECOPT='--error-output stderr --debug -j' TESTS='-j20'" exit with 0.