# Logfile created on 2024-05-22 19:21:20 +0000 by logger.rb/v1.4.3 I, [2024-05-22T19:21:20.435706 #4129944] INFO -- : #, @formatter=nil, @logdev=#, @binmode=false, @mon_data=#, @mon_data_owner_object_id=860>>> I, [2024-05-22T19:21:20.435830 #4129944] INFO -- : $$$[beg] make update-unicode -j20 I, [2024-05-22T19:21:20.497266 #4129944] INFO -- : Downloading Unicode emoji 15.0 files... I, [2024-05-22T19:21:20.497569 #4129944] INFO -- : Downloading Unicode emoji 15.0 files... I, [2024-05-22T19:21:20.498482 #4129944] INFO -- : Downloading Unicode emoji 15.0 files... I, [2024-05-22T19:21:20.542113 #4129944] INFO -- : made symlink emoji/15.0/emoji-sequences.txt to /tmp/ruby/src/trunk/.downloaded-cache/emoji/15.0/emoji-sequences.txt I, [2024-05-22T19:21:20.542151 #4129944] INFO -- : downloading emoji/15.0/emoji-test.txt ... downloading emoji/15.0/emoji-sequences.txt ... /tmp/ruby/src/trunk/enc/unicode/data/emoji/15.0/emoji-sequences.txt already exists E, [2024-05-22T19:21:21.011658 #4129944] ERROR -- : /tmp/ruby/src/trunk/tool/downloader.rb:302:in `rescue in download'/tmp/ruby/src/trunk/tool/downloader.rb:302:in `rescue in download': : failed to download emoji/15.0/emoji-test.txtfailed to download emoji/15.0/emoji-test.txt ( (RuntimeErrorRuntimeError)) E, [2024-05-22T19:21:21.011890 #4129944] ERROR -- : E, [2024-05-22T19:21:21.011918 #4129944] ERROR -- : OpenURI::HTTPError: 403 Forbidden: https://www.unicode.org/Public/emoji/15.0/emoji-test.txtOpenURI::HTTPError: 403 Forbidden: https://www.unicode.org/Public/emoji/15.0/emoji-test.txt E, [2024-05-22T19:21:21.011936 #4129944] ERROR -- : E, [2024-05-22T19:21:21.011954 #4129944] ERROR -- : from /tmp/ruby/src/trunk/tool/downloader.rb:201:in `download' E, [2024-05-22T19:21:21.011971 #4129944] ERROR -- : from /tmp/ruby/src/trunk/tool/downloader.rb:201:in `download' E, [2024-05-22T19:21:21.011987 #4129944] ERROR -- : from /tmp/ruby/src/trunk/tool/downloader.rb:136:in `download' E, [2024-05-22T19:21:21.012003 #4129944] ERROR -- : from /tmp/ruby/src/trunk/tool/downloader.rb:136:in `download' E, [2024-05-22T19:21:21.012019 #4129944] ERROR -- : from /tmp/ruby/src/trunk/tool/downloader.rb:482:in `block in
' E, [2024-05-22T19:21:21.012040 #4129944] ERROR -- : from /tmp/ruby/src/trunk/tool/downloader.rb:482:in `block in
' E, [2024-05-22T19:21:21.012058 #4129944] ERROR -- : from /tmp/ruby/src/trunk/tool/downloader.rb:465:in `each' E, [2024-05-22T19:21:21.012074 #4129944] ERROR -- : from /tmp/ruby/src/trunk/tool/downloader.rb:465:in `each' E, [2024-05-22T19:21:21.012090 #4129944] ERROR -- : from /tmp/ruby/src/trunk/tool/downloader.rb:465:in `
' E, [2024-05-22T19:21:21.012106 #4129944] ERROR -- : from /tmp/ruby/src/trunk/tool/downloader.rb:465:in `
' E, [2024-05-22T19:21:21.012122 #4129944] ERROR -- : /usr/lib/ruby/3.0.0/open-uri.rb:364:in `open_http'/usr/lib/ruby/3.0.0/open-uri.rb:364:in `open_http': : 403 Forbidden403 Forbidden ( (OpenURI::HTTPErrorOpenURI::HTTPError)) E, [2024-05-22T19:21:21.012161 #4129944] ERROR -- : E, [2024-05-22T19:21:21.012177 #4129944] ERROR -- : from /usr/lib/ruby/3.0.0/open-uri.rb:741:in `buffer_open' E, [2024-05-22T19:21:21.012198 #4129944] ERROR -- : from /usr/lib/ruby/3.0.0/open-uri.rb:741:in `buffer_open' E, [2024-05-22T19:21:21.012215 #4129944] ERROR -- : from /usr/lib/ruby/3.0.0/open-uri.rb:212:in `block in open_loop' E, [2024-05-22T19:21:21.012244 #4129944] ERROR -- : from /usr/lib/ruby/3.0.0/open-uri.rb:212:in `block in open_loop' E, [2024-05-22T19:21:21.012261 #4129944] ERROR -- : from /usr/lib/ruby/3.0.0/open-uri.rb:210:in `catch' E, [2024-05-22T19:21:21.012277 #4129944] ERROR -- : from /usr/lib/ruby/3.0.0/open-uri.rb:210:in `catch' E, [2024-05-22T19:21:21.012293 #4129944] ERROR -- : from /usr/lib/ruby/3.0.0/open-uri.rb:210:in `open_loop' E, [2024-05-22T19:21:21.012309 #4129944] ERROR -- : from /usr/lib/ruby/3.0.0/open-uri.rb:210:in `open_loop' E, [2024-05-22T19:21:21.012325 #4129944] ERROR -- : from /usr/lib/ruby/3.0.0/open-uri.rb:151:in `open_uri' E, [2024-05-22T19:21:21.012341 #4129944] ERROR -- : from /usr/lib/ruby/3.0.0/open-uri.rb:151:in `open_uri' E, [2024-05-22T19:21:21.012361 #4129944] ERROR -- : from /usr/lib/ruby/3.0.0/open-uri.rb:721:in `open' E, [2024-05-22T19:21:21.012377 #4129944] ERROR -- : from /usr/lib/ruby/3.0.0/open-uri.rb:721:in `open' E, [2024-05-22T19:21:21.012393 #4129944] ERROR -- : from /usr/lib/ruby/3.0.0/open-uri.rb:729:in `read' E, [2024-05-22T19:21:21.012410 #4129944] ERROR -- : from /usr/lib/ruby/3.0.0/open-uri.rb:729:in `read' E, [2024-05-22T19:21:21.012426 #4129944] ERROR -- : from /tmp/ruby/src/trunk/tool/downloader.rb:247:in `block in download' E, [2024-05-22T19:21:21.012446 #4129944] ERROR -- : from /tmp/ruby/src/trunk/tool/downloader.rb:247:in `block in download' E, [2024-05-22T19:21:21.012462 #4129944] ERROR -- : from /tmp/ruby/src/trunk/tool/downloader.rb:378:in `with_retry' E, [2024-05-22T19:21:21.012480 #4129944] ERROR -- : from /tmp/ruby/src/trunk/tool/downloader.rb:378:in `with_retry' E, [2024-05-22T19:21:21.012503 #4129944] ERROR -- : from /tmp/ruby/src/trunk/tool/downloader.rb:246:in `download' E, [2024-05-22T19:21:21.012519 #4129944] ERROR -- : from /tmp/ruby/src/trunk/tool/downloader.rb:136:in `download' E, [2024-05-22T19:21:21.012535 #4129944] ERROR -- : from /tmp/ruby/src/trunk/tool/downloader.rb:246:in `download' E, [2024-05-22T19:21:21.012550 #4129944] ERROR -- : from /tmp/ruby/src/trunk/tool/downloader.rb:482:in `block in
' E, [2024-05-22T19:21:21.012567 #4129944] ERROR -- : from /tmp/ruby/src/trunk/tool/downloader.rb:136:in `download' E, [2024-05-22T19:21:21.012582 #4129944] ERROR -- : from /tmp/ruby/src/trunk/tool/downloader.rb:465:in `each' E, [2024-05-22T19:21:21.012599 #4129944] ERROR -- : from /tmp/ruby/src/trunk/tool/downloader.rb:482:in `block in
' E, [2024-05-22T19:21:21.012613 #4129944] ERROR -- : from /tmp/ruby/src/trunk/tool/downloader.rb:465:in `
' E, [2024-05-22T19:21:21.012631 #4129944] ERROR -- : from /tmp/ruby/src/trunk/tool/downloader.rb:465:in `each' E, [2024-05-22T19:21:21.012645 #4129944] ERROR -- : from /tmp/ruby/src/trunk/tool/downloader.rb:465:in `
' E, [2024-05-22T19:21:21.017407 #4129944] ERROR -- : make: *** [uncommon.mk:1756: /tmp/ruby/src/trunk/enc/unicode/data/emoji/15.0/emoji-test.txt] Error 1 E, [2024-05-22T19:21:21.017475 #4129944] ERROR -- : make: *** Waiting for unfinished jobs.... E, [2024-05-22T19:21:21.017492 #4129944] ERROR -- : make: *** [uncommon.mk:1756: /tmp/ruby/src/trunk/enc/unicode/data/emoji/15.0/emoji-zwj-sequences.txt] Error 1 E, [2024-05-22T19:21:21.454510 #4129944] ERROR -- : /tmp/ruby/src/trunk/tool/downloader.rb:302:in `rescue in download': failed to download emoji/15.0/emoji-sequences.txt (RuntimeError) E, [2024-05-22T19:21:21.454629 #4129944] ERROR -- : EOFError: end of file reached: https://www.unicode.org/Public/emoji/15.0/emoji-sequences.txt E, [2024-05-22T19:21:21.454700 #4129944] ERROR -- : from /tmp/ruby/src/trunk/tool/downloader.rb:201:in `download' E, [2024-05-22T19:21:21.454714 #4129944] ERROR -- : from /tmp/ruby/src/trunk/tool/downloader.rb:136:in `download' E, [2024-05-22T19:21:21.454726 #4129944] ERROR -- : from /tmp/ruby/src/trunk/tool/downloader.rb:482:in `block in
' E, [2024-05-22T19:21:21.454739 #4129944] ERROR -- : from /tmp/ruby/src/trunk/tool/downloader.rb:465:in `each' E, [2024-05-22T19:21:21.454750 #4129944] ERROR -- : from /tmp/ruby/src/trunk/tool/downloader.rb:465:in `
' E, [2024-05-22T19:21:21.454762 #4129944] ERROR -- : /usr/lib/ruby/3.0.0/net/protocol.rb:227:in `rbuf_fill': end of file reached (EOFError) E, [2024-05-22T19:21:21.454774 #4129944] ERROR -- : from /usr/lib/ruby/3.0.0/net/protocol.rb:193:in `readuntil' E, [2024-05-22T19:21:21.454786 #4129944] ERROR -- : from /usr/lib/ruby/3.0.0/net/protocol.rb:203:in `readline' E, [2024-05-22T19:21:21.454801 #4129944] ERROR -- : from /usr/lib/ruby/3.0.0/net/http/response.rb:42:in `read_status_line' E, [2024-05-22T19:21:21.454813 #4129944] ERROR -- : from /usr/lib/ruby/3.0.0/net/http/response.rb:31:in `read_new' E, [2024-05-22T19:21:21.454825 #4129944] ERROR -- : from /usr/lib/ruby/3.0.0/net/http.rb:1557:in `block in transport_request' E, [2024-05-22T19:21:21.454837 #4129944] ERROR -- : from /usr/lib/ruby/3.0.0/net/http.rb:1548:in `catch' E, [2024-05-22T19:21:21.454849 #4129944] ERROR -- : from /usr/lib/ruby/3.0.0/net/http.rb:1548:in `transport_request' E, [2024-05-22T19:21:21.455079 #4129944] ERROR -- : from /usr/lib/ruby/3.0.0/net/http.rb:1521:in `request' E, [2024-05-22T19:21:21.455092 #4129944] ERROR -- : from /usr/lib/ruby/3.0.0/open-uri.rb:329:in `block in open_http' E, [2024-05-22T19:21:21.455102 #4129944] ERROR -- : from /usr/lib/ruby/3.0.0/net/http.rb:960:in `start' E, [2024-05-22T19:21:21.455113 #4129944] ERROR -- : from /usr/lib/ruby/3.0.0/open-uri.rb:323:in `open_http' E, [2024-05-22T19:21:21.455123 #4129944] ERROR -- : from /usr/lib/ruby/3.0.0/open-uri.rb:741:in `buffer_open' E, [2024-05-22T19:21:21.455134 #4129944] ERROR -- : from /usr/lib/ruby/3.0.0/open-uri.rb:212:in `block in open_loop' E, [2024-05-22T19:21:21.455144 #4129944] ERROR -- : from /usr/lib/ruby/3.0.0/open-uri.rb:210:in `catch' E, [2024-05-22T19:21:21.455159 #4129944] ERROR -- : from /usr/lib/ruby/3.0.0/open-uri.rb:210:in `open_loop' E, [2024-05-22T19:21:21.455170 #4129944] ERROR -- : from /usr/lib/ruby/3.0.0/open-uri.rb:151:in `open_uri' E, [2024-05-22T19:21:21.455180 #4129944] ERROR -- : from /usr/lib/ruby/3.0.0/open-uri.rb:721:in `open' E, [2024-05-22T19:21:21.455191 #4129944] ERROR -- : from /usr/lib/ruby/3.0.0/open-uri.rb:729:in `read' E, [2024-05-22T19:21:21.455202 #4129944] ERROR -- : from /tmp/ruby/src/trunk/tool/downloader.rb:247:in `block in download' E, [2024-05-22T19:21:21.455213 #4129944] ERROR -- : from /tmp/ruby/src/trunk/tool/downloader.rb:378:in `with_retry' E, [2024-05-22T19:21:21.455223 #4129944] ERROR -- : from /tmp/ruby/src/trunk/tool/downloader.rb:246:in `download' E, [2024-05-22T19:21:21.455234 #4129944] ERROR -- : from /tmp/ruby/src/trunk/tool/downloader.rb:136:in `download' E, [2024-05-22T19:21:21.455244 #4129944] ERROR -- : from /tmp/ruby/src/trunk/tool/downloader.rb:482:in `block in
' E, [2024-05-22T19:21:21.455258 #4129944] ERROR -- : from /tmp/ruby/src/trunk/tool/downloader.rb:465:in `each' E, [2024-05-22T19:21:21.455269 #4129944] ERROR -- : from /tmp/ruby/src/trunk/tool/downloader.rb:465:in `
' E, [2024-05-22T19:21:21.459167 #4129944] ERROR -- : make: *** [uncommon.mk:1756: /tmp/ruby/src/trunk/enc/unicode/data/emoji/15.0/emoji-sequences.txt] Error 1 E, [2024-05-22T19:21:21.459271 #4129944] ERROR -- : make: *** Deleting file '/tmp/ruby/src/trunk/enc/unicode/data/emoji/15.0/emoji-sequences.txt' I, [2024-05-22T19:21:21.459230 #4129944] INFO -- : downloading emoji/15.0/emoji-test.txt ... I, [2024-05-22T19:21:21.459710 #4129944] INFO -- : $$$[end] "make update-unicode -j20" exit with 512. I, [2024-05-22T19:21:21.459770 #4129944] INFO -- : $$$[beg] make update-download -j20 I, [2024-05-22T19:21:21.566581 #4129944] INFO -- : tool/config.guess already exists I, [2024-05-22T19:21:21.566629 #4129944] INFO -- : tool/config.sub already exists I, [2024-05-22T19:21:21.569056 #4129944] INFO -- : Update power_assert to 84e85124c5014a139af39161d484156cfe87a9ed I, [2024-05-22T19:21:21.569285 #4129944] INFO -- : Update rbs to ba7872795d5de04adb8ff500c0e6afdc81a041dd I, [2024-05-22T19:21:21.570065 #4129944] INFO -- : Update typeprof to b19a6416da3a05d57fadd6ffdadb382b6d236ca5 I, [2024-05-22T19:21:21.570521 #4129944] INFO -- : echo 84e85124c5014a139af39161d484156cfe87a9ed | /bin/sh /tmp/ruby/src/trunk/tool/ifchange /tmp/ruby/src/trunk/.bundle/.timestamp/power_assert.revision - I, [2024-05-22T19:21:21.570680 #4129944] INFO -- : echo ba7872795d5de04adb8ff500c0e6afdc81a041dd | /bin/sh /tmp/ruby/src/trunk/tool/ifchange /tmp/ruby/src/trunk/.bundle/.timestamp/rbs.revision - I, [2024-05-22T19:21:21.571106 #4129944] INFO -- : echo b19a6416da3a05d57fadd6ffdadb382b6d236ca5 | /bin/sh /tmp/ruby/src/trunk/tool/ifchange /tmp/ruby/src/trunk/.bundle/.timestamp/typeprof.revision - I, [2024-05-22T19:21:21.572627 #4129944] INFO -- : /tmp/ruby/src/trunk/.bundle/.timestamp/rbs.revision unchanged I, [2024-05-22T19:21:21.572656 #4129944] INFO -- : /tmp/ruby/src/trunk/.bundle/.timestamp/power_assert.revision unchanged I, [2024-05-22T19:21:21.573200 #4129944] INFO -- : /tmp/ruby/src/trunk/.bundle/.timestamp/typeprof.revision unchanged I, [2024-05-22T19:21:21.574075 #4129944] INFO -- : Building power_assert@84e85124c5014a139af39161d484156cfe87a9ed to /tmp/ruby/src/trunk/gems/power_assert-2.0.3.gem I, [2024-05-22T19:21:21.642876 #4129944] INFO -- : Successfully built RubyGem I, [2024-05-22T19:21:21.642926 #4129944] INFO -- : Name: power_assert I, [2024-05-22T19:21:21.642934 #4129944] INFO -- : Version: 2.0.4dev I, [2024-05-22T19:21:21.642941 #4129944] INFO -- : File: power_assert-2.0.4dev.gem I, [2024-05-22T19:21:21.688074 #4129944] INFO -- : $$$[end] "make update-download -j20" exit with 0. I, [2024-05-22T19:21:21.688110 #4129944] INFO -- : $$$[beg] make update-rubyspec -j20 I, [2024-05-22T19:21:21.751492 #4129944] INFO -- : make: Nothing to be done for 'update-rubyspec'. I, [2024-05-22T19:21:21.751907 #4129944] INFO -- : $$$[end] "make update-rubyspec -j20" exit with 0. I, [2024-05-22T19:21:21.751950 #4129944] INFO -- : $$$[beg] make update-src -j20 I, [2024-05-22T19:21:22.477197 #4129944] INFO -- : Already up to date. I, [2024-05-22T19:21:22.495537 #4129944] INFO -- : Latest commit hash = 5613d6e95b I, [2024-05-22T19:21:22.497539 #4129944] INFO -- : $$$[end] "make update-src -j20" exit with 0. I, [2024-05-22T19:21:22.497591 #4129944] INFO -- : $$$[beg] make after-update -j20 I, [2024-05-22T19:21:22.596914 #4129944] INFO -- : /tmp/ruby/src/trunk/revision.h updated I, [2024-05-22T19:21:22.598697 #4129944] INFO -- : generating x86_64-linux-fake.rb I, [2024-05-22T19:21:22.654224 #4129944] INFO -- : x86_64-linux-fake.rb updated I, [2024-05-22T19:21:22.655427 #4129944] INFO -- : generating enc.mk I, [2024-05-22T19:21:22.774805 #4129944] INFO -- : making srcs under enc I, [2024-05-22T19:21:22.804488 #4129944] INFO -- : make[1]: Entering directory '/tmp/ruby/build/trunk' I, [2024-05-22T19:21:22.804510 #4129944] INFO -- : make[1]: Nothing to be done for 'srcs'. I, [2024-05-22T19:21:22.804516 #4129944] INFO -- : make[1]: Leaving directory '/tmp/ruby/build/trunk' I, [2024-05-22T19:21:22.849048 #4129944] INFO -- : Update power_assert to 84e85124c5014a139af39161d484156cfe87a9ed I, [2024-05-22T19:21:22.849215 #4129944] INFO -- : Update rbs to ba7872795d5de04adb8ff500c0e6afdc81a041dd I, [2024-05-22T19:21:22.849674 #4129944] INFO -- : Update typeprof to b19a6416da3a05d57fadd6ffdadb382b6d236ca5 I, [2024-05-22T19:21:22.850207 #4129944] INFO -- : echo 84e85124c5014a139af39161d484156cfe87a9ed | /bin/sh /tmp/ruby/src/trunk/tool/ifchange /tmp/ruby/src/trunk/.bundle/.timestamp/power_assert.revision - I, [2024-05-22T19:21:22.850913 #4129944] INFO -- : echo ba7872795d5de04adb8ff500c0e6afdc81a041dd | /bin/sh /tmp/ruby/src/trunk/tool/ifchange /tmp/ruby/src/trunk/.bundle/.timestamp/rbs.revision - I, [2024-05-22T19:21:22.851073 #4129944] INFO -- : echo b19a6416da3a05d57fadd6ffdadb382b6d236ca5 | /bin/sh /tmp/ruby/src/trunk/tool/ifchange /tmp/ruby/src/trunk/.bundle/.timestamp/typeprof.revision - I, [2024-05-22T19:21:22.852003 #4129944] INFO -- : /tmp/ruby/src/trunk/.bundle/.timestamp/power_assert.revision unchanged I, [2024-05-22T19:21:22.852594 #4129944] INFO -- : /tmp/ruby/src/trunk/.bundle/.timestamp/rbs.revision unchanged I, [2024-05-22T19:21:22.853089 #4129944] INFO -- : Building power_assert@84e85124c5014a139af39161d484156cfe87a9ed to /tmp/ruby/src/trunk/gems/power_assert-2.0.3.gem I, [2024-05-22T19:21:22.853114 #4129944] INFO -- : /tmp/ruby/src/trunk/.bundle/.timestamp/typeprof.revision unchanged I, [2024-05-22T19:21:22.922118 #4129944] INFO -- : Successfully built RubyGem I, [2024-05-22T19:21:22.922159 #4129944] INFO -- : Name: power_assert I, [2024-05-22T19:21:22.922170 #4129944] INFO -- : Version: 2.0.4dev I, [2024-05-22T19:21:22.922174 #4129944] INFO -- : File: power_assert-2.0.4dev.gem I, [2024-05-22T19:21:22.924241 #4129944] INFO -- : Extracting bundle gem power_assert-2.0.3... I, [2024-05-22T19:21:22.984775 #4129944] INFO -- : Try with hash version of bundled gems instead of gems/power_assert-2.0.3.gem. We don't use this gem with release version of Ruby. I, [2024-05-22T19:21:22.989772 #4129944] INFO -- : Unpacked gems/power_assert-2.0.4dev.gem I, [2024-05-22T19:21:22.991647 #4129944] INFO -- : $$$[end] "make after-update -j20" exit with 0. I, [2024-05-22T19:21:22.991814 #4129944] INFO -- : $$$[beg] make miniruby -j20 I, [2024-05-22T19:21:23.049065 #4129944] INFO -- : BASERUBY = /usr/bin/ruby --disable=gems I, [2024-05-22T19:21:23.049106 #4129944] INFO -- : CC = gcc I, [2024-05-22T19:21:23.049115 #4129944] INFO -- : LD = ld I, [2024-05-22T19:21:23.049120 #4129944] INFO -- : LDSHARED = gcc -shared I, [2024-05-22T19:21:23.049125 #4129944] INFO -- : CFLAGS = -O3 -fno-fast-math -ggdb3 -Wall -Wextra -Wdeprecated-declarations -Wdiv-by-zero -Wduplicated-cond -Wimplicit-function-declaration -Wimplicit-int -Wpointer-arith -Wwrite-strings -Wold-style-definition -Wimplicit-fallthrough=0 -Wmissing-noreturn -Wno-cast-function-type -Wno-constant-logical-operand -Wno-long-long -Wno-missing-field-initializers -Wno-overlength-strings -Wno-packed-bitfield-compat -Wno-parentheses-equality -Wno-self-assign -Wno-tautological-compare -Wno-unused-parameter -Wno-unused-value -Wsuggest-attribute=format -Wsuggest-attribute=noreturn -Wunused-variable -Wmisleading-indentation -Wundef -fPIC I, [2024-05-22T19:21:23.049130 #4129944] INFO -- : XCFLAGS = -U_FORTIFY_SOURCE -D_FORTIFY_SOURCE=2 -fstack-protector-strong -fno-strict-overflow -fvisibility=hidden -fexcess-precision=standard -DRUBY_EXPORT -I. -I.ext/include/x86_64-linux -I/tmp/ruby/src/trunk/include -I/tmp/ruby/src/trunk -I/tmp/ruby/src/trunk/prism -I/tmp/ruby/src/trunk/enc/unicode/15.0.0 I, [2024-05-22T19:21:23.049134 #4129944] INFO -- : CPPFLAGS = I, [2024-05-22T19:21:23.049138 #4129944] INFO -- : DLDFLAGS = -Wl,--compress-debug-sections=zlib -Wl,-soname,libruby.so.3.4 -fstack-protector-strong I, [2024-05-22T19:21:23.049142 #4129944] INFO -- : SOLIBS = -lz -lrt -lrt -lgmp -ldl -lcrypt -lm -lpthread I, [2024-05-22T19:21:23.049146 #4129944] INFO -- : LANG = en_US.UTF-8 I, [2024-05-22T19:21:23.049152 #4129944] INFO -- : LC_ALL = I, [2024-05-22T19:21:23.049156 #4129944] INFO -- : LC_CTYPE = I, [2024-05-22T19:21:23.049159 #4129944] INFO -- : MFLAGS = -j20 --jobserver-auth=4,5 I, [2024-05-22T19:21:23.049163 #4129944] INFO -- : RUSTC = no I, [2024-05-22T19:21:23.049167 #4129944] INFO -- : YJIT_RUSTC_ARGS = --crate-name=yjit --crate-type=staticlib --edition=2021 -g -C lto=thin -C opt-level=3 -C overflow-checks=on '--out-dir=/tmp/ruby/build/trunk/yjit/target/release/' /tmp/ruby/src/trunk/yjit/src/lib.rs I, [2024-05-22T19:21:23.050630 #4129944] INFO -- : gcc (Ubuntu 11.4.0-1ubuntu1~22.04) 11.4.0 I, [2024-05-22T19:21:23.050659 #4129944] INFO -- : Copyright (C) 2021 Free Software Foundation, Inc. I, [2024-05-22T19:21:23.050665 #4129944] INFO -- : This is free software; see the source for copying conditions. There is NO I, [2024-05-22T19:21:23.050672 #4129944] INFO -- : warranty; not even for MERCHANTABILITY or FITNESS FOR A PARTICULAR PURPOSE. I, [2024-05-22T19:21:23.050677 #4129944] INFO -- : I, [2024-05-22T19:21:23.074820 #4129944] INFO -- : compiling /tmp/ruby/src/trunk/version.c I, [2024-05-22T19:21:23.179603 #4129944] INFO -- : linking miniruby I, [2024-05-22T19:21:23.709720 #4129944] INFO -- : $$$[end] "make miniruby -j20" exit with 0. I, [2024-05-22T19:21:23.709833 #4129944] INFO -- : $$$[beg] make ruby -j20 I, [2024-05-22T19:21:23.775268 #4129944] INFO -- : BASERUBY = /usr/bin/ruby --disable=gems I, [2024-05-22T19:21:23.775324 #4129944] INFO -- : CC = gcc I, [2024-05-22T19:21:23.775339 #4129944] INFO -- : LD = ld I, [2024-05-22T19:21:23.775349 #4129944] INFO -- : LDSHARED = gcc -shared I, [2024-05-22T19:21:23.775366 #4129944] INFO -- : CFLAGS = -O3 -fno-fast-math -ggdb3 -Wall -Wextra -Wdeprecated-declarations -Wdiv-by-zero -Wduplicated-cond -Wimplicit-function-declaration -Wimplicit-int -Wpointer-arith -Wwrite-strings -Wold-style-definition -Wimplicit-fallthrough=0 -Wmissing-noreturn -Wno-cast-function-type -Wno-constant-logical-operand -Wno-long-long -Wno-missing-field-initializers -Wno-overlength-strings -Wno-packed-bitfield-compat -Wno-parentheses-equality -Wno-self-assign -Wno-tautological-compare -Wno-unused-parameter -Wno-unused-value -Wsuggest-attribute=format -Wsuggest-attribute=noreturn -Wunused-variable -Wmisleading-indentation -Wundef -fPIC I, [2024-05-22T19:21:23.775375 #4129944] INFO -- : XCFLAGS = -U_FORTIFY_SOURCE -D_FORTIFY_SOURCE=2 -fstack-protector-strong -fno-strict-overflow -fvisibility=hidden -fexcess-precision=standard -DRUBY_EXPORT -I. -I.ext/include/x86_64-linux -I/tmp/ruby/src/trunk/include -I/tmp/ruby/src/trunk -I/tmp/ruby/src/trunk/prism -I/tmp/ruby/src/trunk/enc/unicode/15.0.0 I, [2024-05-22T19:21:23.775381 #4129944] INFO -- : CPPFLAGS = I, [2024-05-22T19:21:23.775388 #4129944] INFO -- : DLDFLAGS = -Wl,--compress-debug-sections=zlib -Wl,-soname,libruby.so.3.4 -fstack-protector-strong I, [2024-05-22T19:21:23.775395 #4129944] INFO -- : SOLIBS = -lz -lrt -lrt -lgmp -ldl -lcrypt -lm -lpthread I, [2024-05-22T19:21:23.775401 #4129944] INFO -- : LANG = en_US.UTF-8 I, [2024-05-22T19:21:23.775408 #4129944] INFO -- : LC_ALL = I, [2024-05-22T19:21:23.775414 #4129944] INFO -- : LC_CTYPE = I, [2024-05-22T19:21:23.775420 #4129944] INFO -- : MFLAGS = -j20 --jobserver-auth=4,5 I, [2024-05-22T19:21:23.775427 #4129944] INFO -- : RUSTC = no I, [2024-05-22T19:21:23.775434 #4129944] INFO -- : YJIT_RUSTC_ARGS = --crate-name=yjit --crate-type=staticlib --edition=2021 -g -C lto=thin -C opt-level=3 -C overflow-checks=on '--out-dir=/tmp/ruby/build/trunk/yjit/target/release/' /tmp/ruby/src/trunk/yjit/src/lib.rs I, [2024-05-22T19:21:23.777770 #4129944] INFO -- : gcc (Ubuntu 11.4.0-1ubuntu1~22.04) 11.4.0 I, [2024-05-22T19:21:23.777815 #4129944] INFO -- : Copyright (C) 2021 Free Software Foundation, Inc. I, [2024-05-22T19:21:23.777825 #4129944] INFO -- : This is free software; see the source for copying conditions. There is NO I, [2024-05-22T19:21:23.777832 #4129944] INFO -- : warranty; not even for MERCHANTABILITY or FITNESS FOR A PARTICULAR PURPOSE. I, [2024-05-22T19:21:23.777839 #4129944] INFO -- : I, [2024-05-22T19:21:23.891054 #4129944] INFO -- : builtin_binary.inc updated I, [2024-05-22T19:21:23.895412 #4129944] INFO -- : c5234a9416e4f20f175185e840b25b0f08674d14078ed7083f37e655458e3ca9 builtin_binary.inc I, [2024-05-22T19:21:23.896147 #4129944] INFO -- : compiling /tmp/ruby/src/trunk/builtin.c I, [2024-05-22T19:21:24.079323 #4129944] INFO -- : linking static-library libruby-static.a I, [2024-05-22T19:21:24.395428 #4129944] INFO -- : linking shared-library libruby.so.3.4.0 I, [2024-05-22T19:21:25.953276 #4129944] INFO -- : linking ruby I, [2024-05-22T19:21:25.977459 #4129944] INFO -- : $$$[end] "make ruby -j20" exit with 0. I, [2024-05-22T19:21:25.977588 #4129944] INFO -- : $$$[beg] make all -j20 I, [2024-05-22T19:21:26.036376 #4129944] INFO -- : BASERUBY = /usr/bin/ruby --disable=gems I, [2024-05-22T19:21:26.036413 #4129944] INFO -- : CC = gcc I, [2024-05-22T19:21:26.036419 #4129944] INFO -- : LD = ld I, [2024-05-22T19:21:26.036422 #4129944] INFO -- : LDSHARED = gcc -shared I, [2024-05-22T19:21:26.036426 #4129944] INFO -- : CFLAGS = -O3 -fno-fast-math -ggdb3 -Wall -Wextra -Wdeprecated-declarations -Wdiv-by-zero -Wduplicated-cond -Wimplicit-function-declaration -Wimplicit-int -Wpointer-arith -Wwrite-strings -Wold-style-definition -Wimplicit-fallthrough=0 -Wmissing-noreturn -Wno-cast-function-type -Wno-constant-logical-operand -Wno-long-long -Wno-missing-field-initializers -Wno-overlength-strings -Wno-packed-bitfield-compat -Wno-parentheses-equality -Wno-self-assign -Wno-tautological-compare -Wno-unused-parameter -Wno-unused-value -Wsuggest-attribute=format -Wsuggest-attribute=noreturn -Wunused-variable -Wmisleading-indentation -Wundef -fPIC I, [2024-05-22T19:21:26.036430 #4129944] INFO -- : XCFLAGS = -U_FORTIFY_SOURCE -D_FORTIFY_SOURCE=2 -fstack-protector-strong -fno-strict-overflow -fvisibility=hidden -fexcess-precision=standard -DRUBY_EXPORT -I. -I.ext/include/x86_64-linux -I/tmp/ruby/src/trunk/include -I/tmp/ruby/src/trunk -I/tmp/ruby/src/trunk/prism -I/tmp/ruby/src/trunk/enc/unicode/15.0.0 I, [2024-05-22T19:21:26.036434 #4129944] INFO -- : CPPFLAGS = I, [2024-05-22T19:21:26.036438 #4129944] INFO -- : DLDFLAGS = -Wl,--compress-debug-sections=zlib -Wl,-soname,libruby.so.3.4 -fstack-protector-strong I, [2024-05-22T19:21:26.036441 #4129944] INFO -- : SOLIBS = -lz -lrt -lrt -lgmp -ldl -lcrypt -lm -lpthread I, [2024-05-22T19:21:26.036445 #4129944] INFO -- : LANG = en_US.UTF-8 I, [2024-05-22T19:21:26.036448 #4129944] INFO -- : LC_ALL = I, [2024-05-22T19:21:26.036452 #4129944] INFO -- : LC_CTYPE = I, [2024-05-22T19:21:26.036455 #4129944] INFO -- : MFLAGS = -j20 --jobserver-auth=4,5 I, [2024-05-22T19:21:26.036459 #4129944] INFO -- : RUSTC = no I, [2024-05-22T19:21:26.036462 #4129944] INFO -- : YJIT_RUSTC_ARGS = --crate-name=yjit --crate-type=staticlib --edition=2021 -g -C lto=thin -C opt-level=3 -C overflow-checks=on '--out-dir=/tmp/ruby/build/trunk/yjit/target/release/' /tmp/ruby/src/trunk/yjit/src/lib.rs I, [2024-05-22T19:21:26.037915 #4129944] INFO -- : gcc (Ubuntu 11.4.0-1ubuntu1~22.04) 11.4.0 I, [2024-05-22T19:21:26.037935 #4129944] INFO -- : Copyright (C) 2021 Free Software Foundation, Inc. I, [2024-05-22T19:21:26.037943 #4129944] INFO -- : This is free software; see the source for copying conditions. There is NO I, [2024-05-22T19:21:26.037947 #4129944] INFO -- : warranty; not even for MERCHANTABILITY or FITNESS FOR A PARTICULAR PURPOSE. I, [2024-05-22T19:21:26.037951 #4129944] INFO -- : I, [2024-05-22T19:21:26.065308 #4129944] INFO -- : generating encdb.h I, [2024-05-22T19:21:26.066669 #4129944] INFO -- : generating enc.mk I, [2024-05-22T19:21:26.068243 #4129944] INFO -- : building spec/ruby/optional/capi/ext/array_spec.so I, [2024-05-22T19:21:26.068639 #4129944] INFO -- : building spec/ruby/optional/capi/ext/basic_object_spec.so I, [2024-05-22T19:21:26.068952 #4129944] INFO -- : building spec/ruby/optional/capi/ext/bignum_spec.so I, [2024-05-22T19:21:26.069542 #4129944] INFO -- : building spec/ruby/optional/capi/ext/binding_spec.so I, [2024-05-22T19:21:26.070179 #4129944] INFO -- : building spec/ruby/optional/capi/ext/boolean_spec.so I, [2024-05-22T19:21:26.070531 #4129944] INFO -- : building spec/ruby/optional/capi/ext/class_id_under_autoload_spec.so I, [2024-05-22T19:21:26.071068 #4129944] INFO -- : building spec/ruby/optional/capi/ext/class_spec.so I, [2024-05-22T19:21:26.071537 #4129944] INFO -- : building spec/ruby/optional/capi/ext/class_under_autoload_spec.so I, [2024-05-22T19:21:26.072193 #4129944] INFO -- : building spec/ruby/optional/capi/ext/complex_spec.so I, [2024-05-22T19:21:26.072526 #4129944] INFO -- : building spec/ruby/optional/capi/ext/constants_spec.so I, [2024-05-22T19:21:26.073209 #4129944] INFO -- : building spec/ruby/optional/capi/ext/data_spec.so I, [2024-05-22T19:21:26.073893 #4129944] INFO -- : building spec/ruby/optional/capi/ext/debug_spec.so I, [2024-05-22T19:21:26.074264 #4129944] INFO -- : building spec/ruby/optional/capi/ext/encoding_spec.so I, [2024-05-22T19:21:26.074877 #4129944] INFO -- : building spec/ruby/optional/capi/ext/enumerator_spec.so I, [2024-05-22T19:21:26.075522 #4129944] INFO -- : building spec/ruby/optional/capi/ext/exception_spec.so I, [2024-05-22T19:21:26.075828 #4129944] INFO -- : building spec/ruby/optional/capi/ext/fiber_spec.so I, [2024-05-22T19:21:26.076440 #4129944] INFO -- : building spec/ruby/optional/capi/ext/file_spec.so I, [2024-05-22T19:21:26.076676 #4129944] INFO -- : building spec/ruby/optional/capi/ext/fixnum_spec.so I, [2024-05-22T19:21:26.103025 #4129944] INFO -- : encdb.h unchanged I, [2024-05-22T19:21:26.105139 #4129944] INFO -- : building spec/ruby/optional/capi/ext/float_spec.so I, [2024-05-22T19:21:26.205220 #4129944] INFO -- : building spec/ruby/optional/capi/ext/gc_spec.so I, [2024-05-22T19:21:26.208307 #4129944] INFO -- : building spec/ruby/optional/capi/ext/globals_spec.so I, [2024-05-22T19:21:26.216375 #4129944] INFO -- : building spec/ruby/optional/capi/ext/hash_spec.so I, [2024-05-22T19:21:26.222807 #4129944] INFO -- : building spec/ruby/optional/capi/ext/integer_spec.so I, [2024-05-22T19:21:26.224974 #4129944] INFO -- : building spec/ruby/optional/capi/ext/io_spec.so I, [2024-05-22T19:21:26.226288 #4129944] INFO -- : building spec/ruby/optional/capi/ext/kernel_spec.so I, [2024-05-22T19:21:26.232237 #4129944] INFO -- : building spec/ruby/optional/capi/ext/language_spec.so I, [2024-05-22T19:21:26.240517 #4129944] INFO -- : building spec/ruby/optional/capi/ext/module_spec.so I, [2024-05-22T19:21:26.240826 #4129944] INFO -- : building spec/ruby/optional/capi/ext/marshal_spec.so I, [2024-05-22T19:21:26.243898 #4129944] INFO -- : building spec/ruby/optional/capi/ext/module_under_autoload_spec.so I, [2024-05-22T19:21:26.245541 #4129944] INFO -- : building spec/ruby/optional/capi/ext/mutex_spec.so I, [2024-05-22T19:21:26.250296 #4129944] INFO -- : building spec/ruby/optional/capi/ext/numeric_spec.so I, [2024-05-22T19:21:26.264852 #4129944] INFO -- : building spec/ruby/optional/capi/ext/object_spec.so I, [2024-05-22T19:21:26.272757 #4129944] INFO -- : building spec/ruby/optional/capi/ext/proc_spec.so I, [2024-05-22T19:21:26.274228 #4129944] INFO -- : building spec/ruby/optional/capi/ext/range_spec.so I, [2024-05-22T19:21:26.280061 #4129944] INFO -- : building spec/ruby/optional/capi/ext/rational_spec.so I, [2024-05-22T19:21:26.284609 #4129944] INFO -- : building spec/ruby/optional/capi/ext/rbasic_spec.so I, [2024-05-22T19:21:26.326274 #4129944] INFO -- : building spec/ruby/optional/capi/ext/regexp_spec.so I, [2024-05-22T19:21:26.372671 #4129944] INFO -- : building spec/ruby/optional/capi/ext/string_spec.so I, [2024-05-22T19:21:26.381401 #4129944] INFO -- : building spec/ruby/optional/capi/ext/struct_spec.so I, [2024-05-22T19:21:26.390610 #4129944] INFO -- : building spec/ruby/optional/capi/ext/st_spec.so I, [2024-05-22T19:21:26.394216 #4129944] INFO -- : building spec/ruby/optional/capi/ext/symbol_spec.so I, [2024-05-22T19:21:26.396773 #4129944] INFO -- : building spec/ruby/optional/capi/ext/thread_spec.so I, [2024-05-22T19:21:26.399774 #4129944] INFO -- : building spec/ruby/optional/capi/ext/time_spec.so I, [2024-05-22T19:21:26.413557 #4129944] INFO -- : building spec/ruby/optional/capi/ext/tracepoint_spec.so I, [2024-05-22T19:21:26.418406 #4129944] INFO -- : building spec/ruby/optional/capi/ext/typed_data_spec.so I, [2024-05-22T19:21:26.418763 #4129944] INFO -- : building spec/ruby/optional/capi/ext/util_spec.so I, [2024-05-22T19:21:26.423350 #4129944] INFO -- : making enc I, [2024-05-22T19:21:26.436410 #4129944] INFO -- : making srcs under enc I, [2024-05-22T19:21:26.453894 #4129944] INFO -- : make[1]: Entering directory '/tmp/ruby/build/trunk' I, [2024-05-22T19:21:26.453967 #4129944] INFO -- : make[1]: Nothing to be done for 'enc'. I, [2024-05-22T19:21:26.453977 #4129944] INFO -- : make[1]: Leaving directory '/tmp/ruby/build/trunk' I, [2024-05-22T19:21:26.483540 #4129944] INFO -- : make[1]: Entering directory '/tmp/ruby/build/trunk' I, [2024-05-22T19:21:26.483605 #4129944] INFO -- : make[1]: Nothing to be done for 'srcs'. I, [2024-05-22T19:21:26.483616 #4129944] INFO -- : make[1]: Leaving directory '/tmp/ruby/build/trunk' I, [2024-05-22T19:21:26.484446 #4129944] INFO -- : generating transdb.h I, [2024-05-22T19:21:26.585774 #4129944] INFO -- : transdb.h unchanged I, [2024-05-22T19:21:26.587235 #4129944] INFO -- : generating makefiles ext/configure-ext.mk I, [2024-05-22T19:21:26.587331 #4129944] INFO -- : making trans I, [2024-05-22T19:21:26.613590 #4129944] INFO -- : ext/configure-ext.mk updated I, [2024-05-22T19:21:26.616282 #4129944] INFO -- : make[1]: Entering directory '/tmp/ruby/build/trunk' I, [2024-05-22T19:21:26.621857 #4129944] INFO -- : make[1]: Entering directory '/tmp/ruby/build/trunk' I, [2024-05-22T19:21:26.621973 #4129944] INFO -- : make[1]: Nothing to be done for 'trans'. I, [2024-05-22T19:21:26.621987 #4129944] INFO -- : make[1]: Leaving directory '/tmp/ruby/build/trunk' I, [2024-05-22T19:21:26.622849 #4129944] INFO -- : making encs I, [2024-05-22T19:21:26.680710 #4129944] INFO -- : make[1]: Entering directory '/tmp/ruby/build/trunk' I, [2024-05-22T19:21:26.680781 #4129944] INFO -- : make[1]: Nothing to be done for 'encs'. I, [2024-05-22T19:21:26.680807 #4129944] INFO -- : make[1]: Leaving directory '/tmp/ruby/build/trunk' I, [2024-05-22T19:21:26.773629 #4129944] INFO -- : make[1]: Leaving directory '/tmp/ruby/build/trunk' I, [2024-05-22T19:21:26.774288 #4129944] INFO -- : generating makefile exts.mk I, [2024-05-22T19:21:26.813087 #4129944] INFO -- : exts.mk unchanged I, [2024-05-22T19:21:26.816682 #4129944] INFO -- : make[1]: Entering directory '/tmp/ruby/build/trunk' I, [2024-05-22T19:21:26.836064 #4129944] INFO -- : make[2]: Entering directory '/tmp/ruby/build/trunk/ext/digest' I, [2024-05-22T19:21:26.837835 #4129944] INFO -- : make[2]: Entering directory '/tmp/ruby/build/trunk/ext/json' I, [2024-05-22T19:21:26.837907 #4129944] INFO -- : make[2]: Entering directory '/tmp/ruby/build/trunk/ext/coverage' I, [2024-05-22T19:21:26.837946 #4129944] INFO -- : make[2]: Entering directory '/tmp/ruby/build/trunk/ext/date' I, [2024-05-22T19:21:26.838357 #4129944] INFO -- : make[2]: Entering directory '/tmp/ruby/build/trunk/ext/io/console' I, [2024-05-22T19:21:26.839648 #4129944] INFO -- : make[2]: Entering directory '/tmp/ruby/build/trunk/ext/monitor' I, [2024-05-22T19:21:26.840181 #4129944] INFO -- : make[2]: Entering directory '/tmp/ruby/build/trunk/ext/pathname' I, [2024-05-22T19:21:26.840746 #4129944] INFO -- : make[2]: Entering directory '/tmp/ruby/build/trunk/ext/pty' I, [2024-05-22T19:21:26.840892 #4129944] INFO -- : make[2]: Entering directory '/tmp/ruby/build/trunk/ext/fiddle' I, [2024-05-22T19:21:26.840925 #4129944] INFO -- : make[2]: Leaving directory '/tmp/ruby/build/trunk/ext/coverage' I, [2024-05-22T19:21:26.840941 #4129944] INFO -- : make[2]: Entering directory '/tmp/ruby/build/trunk/ext/objspace' I, [2024-05-22T19:21:26.841195 #4129944] INFO -- : make[2]: Leaving directory '/tmp/ruby/build/trunk/ext/digest' I, [2024-05-22T19:21:26.841825 #4129944] INFO -- : make[2]: Leaving directory '/tmp/ruby/build/trunk/ext/io/console' I, [2024-05-22T19:21:26.841851 #4129944] INFO -- : make[2]: Entering directory '/tmp/ruby/build/trunk/ext/rubyvm' I, [2024-05-22T19:21:26.842454 #4129944] INFO -- : make[2]: Entering directory '/tmp/ruby/build/trunk/ext/psych' I, [2024-05-22T19:21:26.842669 #4129944] INFO -- : make[2]: Leaving directory '/tmp/ruby/build/trunk/ext/date' I, [2024-05-22T19:21:26.842814 #4129944] INFO -- : make[2]: Leaving directory '/tmp/ruby/build/trunk/ext/monitor' I, [2024-05-22T19:21:26.843123 #4129944] INFO -- : make[2]: Leaving directory '/tmp/ruby/build/trunk/ext/json' I, [2024-05-22T19:21:26.843258 #4129944] INFO -- : make[2]: Leaving directory '/tmp/ruby/build/trunk/ext/rubyvm' I, [2024-05-22T19:21:26.843417 #4129944] INFO -- : make[2]: Leaving directory '/tmp/ruby/build/trunk/ext/pathname' I, [2024-05-22T19:21:26.843907 #4129944] INFO -- : make[2]: Leaving directory '/tmp/ruby/build/trunk/ext/pty' I, [2024-05-22T19:21:26.844604 #4129944] INFO -- : make[2]: Leaving directory '/tmp/ruby/build/trunk/ext/objspace' I, [2024-05-22T19:21:26.845371 #4129944] INFO -- : make[2]: Entering directory '/tmp/ruby/build/trunk/ext/ripper' I, [2024-05-22T19:21:26.845678 #4129944] INFO -- : make[2]: Entering directory '/tmp/ruby/build/trunk/.bundle/gems/bigdecimal-3.1.8/ext/bigdecimal' I, [2024-05-22T19:21:26.846565 #4129944] INFO -- : make[2]: Entering directory '/tmp/ruby/build/trunk/.bundle/gems/debug-1.9.2/ext/debug' I, [2024-05-22T19:21:26.846594 #4129944] INFO -- : make[2]: Entering directory '/tmp/ruby/build/trunk/.bundle/gems/nkf-0.2.0/ext/nkf' I, [2024-05-22T19:21:26.846839 #4129944] INFO -- : make[2]: Entering directory '/tmp/ruby/build/trunk/.bundle/gems/racc-1.7.3/ext/racc/cparse' I, [2024-05-22T19:21:26.846883 #4129944] INFO -- : make[2]: Entering directory '/tmp/ruby/build/trunk/.bundle/gems/racc-1.8.0/ext/racc/cparse' I, [2024-05-22T19:21:26.847345 #4129944] INFO -- : make[2]: Entering directory '/tmp/ruby/build/trunk/.bundle/gems/syslog-0.1.2/ext/syslog' I, [2024-05-22T19:21:26.847695 #4129944] INFO -- : make[2]: Entering directory '/tmp/ruby/build/trunk/.bundle/gems/rbs-3.4.4/ext/rbs_extension' I, [2024-05-22T19:21:26.847723 #4129944] INFO -- : make[2]: Leaving directory '/tmp/ruby/build/trunk/ext/fiddle' I, [2024-05-22T19:21:26.850801 #4129944] INFO -- : make[2]: Leaving directory '/tmp/ruby/build/trunk/ext/ripper' I, [2024-05-22T19:21:26.850864 #4129944] INFO -- : make[2]: Entering directory '/tmp/ruby/build/trunk/ext/digest/sha2' I, [2024-05-22T19:21:26.851565 #4129944] INFO -- : make[2]: Entering directory '/tmp/ruby/build/trunk/ext/socket' I, [2024-05-22T19:21:26.851831 #4129944] INFO -- : make[2]: Entering directory '/tmp/ruby/build/trunk/ext/openssl' I, [2024-05-22T19:21:26.854096 #4129944] INFO -- : make[2]: Leaving directory '/tmp/ruby/build/trunk/ext/digest/sha2' I, [2024-05-22T19:21:26.855034 #4129944] INFO -- : make[2]: Leaving directory '/tmp/ruby/build/trunk/ext/psych' I, [2024-05-22T19:21:26.857489 #4129944] INFO -- : make[2]: Leaving directory '/tmp/ruby/build/trunk/ext/socket' I, [2024-05-22T19:21:26.867989 #4129944] INFO -- : make[2]: Leaving directory '/tmp/ruby/build/trunk/ext/openssl' I, [2024-05-22T19:21:26.869106 #4129944] INFO -- : make[2]: Leaving directory '/tmp/ruby/build/trunk/.bundle/gems/debug-1.9.2/ext/debug' I, [2024-05-22T19:21:26.870096 #4129944] INFO -- : make[2]: Leaving directory '/tmp/ruby/build/trunk/.bundle/gems/rbs-3.4.4/ext/rbs_extension' I, [2024-05-22T19:21:26.872002 #4129944] INFO -- : make[2]: Leaving directory '/tmp/ruby/build/trunk/.bundle/gems/racc-1.8.0/ext/racc/cparse' I, [2024-05-22T19:21:26.873469 #4129944] INFO -- : make[2]: Leaving directory '/tmp/ruby/build/trunk/.bundle/gems/racc-1.7.3/ext/racc/cparse' I, [2024-05-22T19:21:26.875605 #4129944] INFO -- : make[2]: Leaving directory '/tmp/ruby/build/trunk/.bundle/gems/nkf-0.2.0/ext/nkf' I, [2024-05-22T19:21:26.877874 #4129944] INFO -- : make[2]: Leaving directory '/tmp/ruby/build/trunk/.bundle/gems/bigdecimal-3.1.8/ext/bigdecimal' I, [2024-05-22T19:21:26.883406 #4129944] INFO -- : make[2]: Leaving directory '/tmp/ruby/build/trunk/.bundle/gems/syslog-0.1.2/ext/syslog' I, [2024-05-22T19:21:26.907901 #4129944] INFO -- : make[2]: Entering directory '/tmp/ruby/build/trunk' I, [2024-05-22T19:21:26.975617 #4129944] INFO -- : linking ruby I, [2024-05-22T19:21:26.998942 #4129944] INFO -- : make[2]: Leaving directory '/tmp/ruby/build/trunk' I, [2024-05-22T19:21:26.999210 #4129944] INFO -- : make[1]: Leaving directory '/tmp/ruby/build/trunk' I, [2024-05-22T19:21:27.003484 #4129944] INFO -- : make[1]: Entering directory '/tmp/ruby/build/trunk' I, [2024-05-22T19:21:27.003548 #4129944] INFO -- : make[1]: Nothing to be done for 'note'. I, [2024-05-22T19:21:27.003563 #4129944] INFO -- : make[1]: Leaving directory '/tmp/ruby/build/trunk' I, [2024-05-22T19:21:27.004266 #4129944] INFO -- : $$$[end] "make all -j20" exit with 0. I, [2024-05-22T19:21:27.004463 #4129944] INFO -- : $$$[beg] make install -j20 I, [2024-05-22T19:21:27.075295 #4129944] INFO -- : Update power_assert to 84e85124c5014a139af39161d484156cfe87a9ed I, [2024-05-22T19:21:27.075630 #4129944] INFO -- : Update rbs to ba7872795d5de04adb8ff500c0e6afdc81a041dd I, [2024-05-22T19:21:27.075870 #4129944] INFO -- : Update typeprof to b19a6416da3a05d57fadd6ffdadb382b6d236ca5 I, [2024-05-22T19:21:27.078447 #4129944] INFO -- : BASERUBY = /usr/bin/ruby --disable=gems I, [2024-05-22T19:21:27.078492 #4129944] INFO -- : CC = gcc I, [2024-05-22T19:21:27.078507 #4129944] INFO -- : LD = ld I, [2024-05-22T19:21:27.078520 #4129944] INFO -- : LDSHARED = gcc -shared I, [2024-05-22T19:21:27.078531 #4129944] INFO -- : CFLAGS = -O3 -fno-fast-math -ggdb3 -Wall -Wextra -Wdeprecated-declarations -Wdiv-by-zero -Wduplicated-cond -Wimplicit-function-declaration -Wimplicit-int -Wpointer-arith -Wwrite-strings -Wold-style-definition -Wimplicit-fallthrough=0 -Wmissing-noreturn -Wno-cast-function-type -Wno-constant-logical-operand -Wno-long-long -Wno-missing-field-initializers -Wno-overlength-strings -Wno-packed-bitfield-compat -Wno-parentheses-equality -Wno-self-assign -Wno-tautological-compare -Wno-unused-parameter -Wno-unused-value -Wsuggest-attribute=format -Wsuggest-attribute=noreturn -Wunused-variable -Wmisleading-indentation -Wundef -fPIC I, [2024-05-22T19:21:27.078545 #4129944] INFO -- : XCFLAGS = -U_FORTIFY_SOURCE -D_FORTIFY_SOURCE=2 -fstack-protector-strong -fno-strict-overflow -fvisibility=hidden -fexcess-precision=standard -DRUBY_EXPORT -I. -I.ext/include/x86_64-linux -I/tmp/ruby/src/trunk/include -I/tmp/ruby/src/trunk -I/tmp/ruby/src/trunk/prism -I/tmp/ruby/src/trunk/enc/unicode/15.0.0 I, [2024-05-22T19:21:27.078556 #4129944] INFO -- : CPPFLAGS = I, [2024-05-22T19:21:27.078567 #4129944] INFO -- : DLDFLAGS = -Wl,--compress-debug-sections=zlib -Wl,-soname,libruby.so.3.4 -fstack-protector-strong I, [2024-05-22T19:21:27.078582 #4129944] INFO -- : SOLIBS = -lz -lrt -lrt -lgmp -ldl -lcrypt -lm -lpthread I, [2024-05-22T19:21:27.078592 #4129944] INFO -- : LANG = en_US.UTF-8 I, [2024-05-22T19:21:27.078603 #4129944] INFO -- : LC_ALL = I, [2024-05-22T19:21:27.078614 #4129944] INFO -- : LC_CTYPE = I, [2024-05-22T19:21:27.078624 #4129944] INFO -- : MFLAGS = -j20 --jobserver-auth=4,5 I, [2024-05-22T19:21:27.078635 #4129944] INFO -- : RUSTC = no I, [2024-05-22T19:21:27.078646 #4129944] INFO -- : YJIT_RUSTC_ARGS = --crate-name=yjit --crate-type=staticlib --edition=2021 -g -C lto=thin -C opt-level=3 -C overflow-checks=on '--out-dir=/tmp/ruby/build/trunk/yjit/target/release/' /tmp/ruby/src/trunk/yjit/src/lib.rs I, [2024-05-22T19:21:27.105265 #4129944] INFO -- : echo 84e85124c5014a139af39161d484156cfe87a9ed | /bin/sh /tmp/ruby/src/trunk/tool/ifchange /tmp/ruby/src/trunk/.bundle/.timestamp/power_assert.revision - I, [2024-05-22T19:21:27.105423 #4129944] INFO -- : echo ba7872795d5de04adb8ff500c0e6afdc81a041dd | /bin/sh /tmp/ruby/src/trunk/tool/ifchange /tmp/ruby/src/trunk/.bundle/.timestamp/rbs.revision - I, [2024-05-22T19:21:27.105624 #4129944] INFO -- : echo b19a6416da3a05d57fadd6ffdadb382b6d236ca5 | /bin/sh /tmp/ruby/src/trunk/tool/ifchange /tmp/ruby/src/trunk/.bundle/.timestamp/typeprof.revision - I, [2024-05-22T19:21:27.106433 #4129944] INFO -- : generating encdb.h I, [2024-05-22T19:21:27.106471 #4129944] INFO -- : gcc (Ubuntu 11.4.0-1ubuntu1~22.04) 11.4.0 I, [2024-05-22T19:21:27.106487 #4129944] INFO -- : Copyright (C) 2021 Free Software Foundation, Inc. I, [2024-05-22T19:21:27.106502 #4129944] INFO -- : This is free software; see the source for copying conditions. There is NO I, [2024-05-22T19:21:27.106515 #4129944] INFO -- : warranty; not even for MERCHANTABILITY or FITNESS FOR A PARTICULAR PURPOSE. I, [2024-05-22T19:21:27.106541 #4129944] INFO -- : I, [2024-05-22T19:21:27.107095 #4129944] INFO -- : /tmp/ruby/src/trunk/.bundle/.timestamp/power_assert.revision unchanged I, [2024-05-22T19:21:27.107148 #4129944] INFO -- : generating enc.mk I, [2024-05-22T19:21:27.107337 #4129944] INFO -- : /tmp/ruby/src/trunk/.bundle/.timestamp/rbs.revision unchanged I, [2024-05-22T19:21:27.107494 #4129944] INFO -- : /tmp/ruby/src/trunk/.bundle/.timestamp/typeprof.revision unchanged I, [2024-05-22T19:21:27.130588 #4129944] INFO -- : encdb.h unchanged I, [2024-05-22T19:21:27.131931 #4129944] INFO -- : Building power_assert@84e85124c5014a139af39161d484156cfe87a9ed to /tmp/ruby/src/trunk/gems/power_assert-2.0.3.gem I, [2024-05-22T19:21:27.201253 #4129944] INFO -- : Successfully built RubyGem I, [2024-05-22T19:21:27.201285 #4129944] INFO -- : Name: power_assert I, [2024-05-22T19:21:27.201291 #4129944] INFO -- : Version: 2.0.4dev I, [2024-05-22T19:21:27.201295 #4129944] INFO -- : File: power_assert-2.0.4dev.gem I, [2024-05-22T19:21:27.203398 #4129944] INFO -- : Extracting bundle gem power_assert-2.0.3... I, [2024-05-22T19:21:27.229627 #4129944] INFO -- : making srcs under enc I, [2024-05-22T19:21:27.229794 #4129944] INFO -- : making enc I, [2024-05-22T19:21:27.246571 #4129944] INFO -- : make[1]: Entering directory '/tmp/ruby/build/trunk' I, [2024-05-22T19:21:27.246616 #4129944] INFO -- : make[1]: Nothing to be done for 'enc'. I, [2024-05-22T19:21:27.246629 #4129944] INFO -- : make[1]: Leaving directory '/tmp/ruby/build/trunk' I, [2024-05-22T19:21:27.259177 #4129944] INFO -- : make[1]: Entering directory '/tmp/ruby/build/trunk' I, [2024-05-22T19:21:27.259232 #4129944] INFO -- : make[1]: Nothing to be done for 'srcs'. I, [2024-05-22T19:21:27.259245 #4129944] INFO -- : make[1]: Leaving directory '/tmp/ruby/build/trunk' I, [2024-05-22T19:21:27.259837 #4129944] INFO -- : generating transdb.h I, [2024-05-22T19:21:27.265170 #4129944] INFO -- : Try with hash version of bundled gems instead of gems/power_assert-2.0.3.gem. We don't use this gem with release version of Ruby. I, [2024-05-22T19:21:27.270144 #4129944] INFO -- : Unpacked gems/power_assert-2.0.4dev.gem I, [2024-05-22T19:21:27.355615 #4129944] INFO -- : transdb.h unchanged I, [2024-05-22T19:21:27.357156 #4129944] INFO -- : generating makefiles ext/configure-ext.mk I, [2024-05-22T19:21:27.357374 #4129944] INFO -- : making trans I, [2024-05-22T19:21:27.384423 #4129944] INFO -- : ext/configure-ext.mk unchanged I, [2024-05-22T19:21:27.386519 #4129944] INFO -- : make[1]: Entering directory '/tmp/ruby/build/trunk' I, [2024-05-22T19:21:27.390730 #4129944] INFO -- : make[1]: Entering directory '/tmp/ruby/build/trunk' I, [2024-05-22T19:21:27.390820 #4129944] INFO -- : make[1]: Nothing to be done for 'trans'. I, [2024-05-22T19:21:27.390831 #4129944] INFO -- : make[1]: Leaving directory '/tmp/ruby/build/trunk' I, [2024-05-22T19:21:27.391503 #4129944] INFO -- : making encs I, [2024-05-22T19:21:27.450986 #4129944] INFO -- : make[1]: Entering directory '/tmp/ruby/build/trunk' I, [2024-05-22T19:21:27.451077 #4129944] INFO -- : make[1]: Nothing to be done for 'encs'. I, [2024-05-22T19:21:27.451104 #4129944] INFO -- : make[1]: Leaving directory '/tmp/ruby/build/trunk' I, [2024-05-22T19:21:27.539337 #4129944] INFO -- : make[1]: Leaving directory '/tmp/ruby/build/trunk' I, [2024-05-22T19:21:27.539823 #4129944] INFO -- : generating makefile exts.mk I, [2024-05-22T19:21:27.577060 #4129944] INFO -- : exts.mk unchanged I, [2024-05-22T19:21:27.581948 #4129944] INFO -- : make[1]: Entering directory '/tmp/ruby/build/trunk' I, [2024-05-22T19:21:27.599936 #4129944] INFO -- : make[2]: Entering directory '/tmp/ruby/build/trunk/ext/digest' I, [2024-05-22T19:21:27.601579 #4129944] INFO -- : make[2]: Entering directory '/tmp/ruby/build/trunk/ext/json' I, [2024-05-22T19:21:27.601611 #4129944] INFO -- : make[2]: Entering directory '/tmp/ruby/build/trunk/ext/coverage' I, [2024-05-22T19:21:27.602244 #4129944] INFO -- : make[2]: Entering directory '/tmp/ruby/build/trunk/ext/io/console' I, [2024-05-22T19:21:27.602287 #4129944] INFO -- : make[2]: Entering directory '/tmp/ruby/build/trunk/ext/date' I, [2024-05-22T19:21:27.603622 #4129944] INFO -- : make[2]: Entering directory '/tmp/ruby/build/trunk/ext/monitor' I, [2024-05-22T19:21:27.604308 #4129944] INFO -- : make[2]: Entering directory '/tmp/ruby/build/trunk/ext/rubyvm' I, [2024-05-22T19:21:27.604342 #4129944] INFO -- : make[2]: Entering directory '/tmp/ruby/build/trunk/ext/pathname' I, [2024-05-22T19:21:27.604426 #4129944] INFO -- : make[2]: Entering directory '/tmp/ruby/build/trunk/ext/fiddle' I, [2024-05-22T19:21:27.604642 #4129944] INFO -- : make[2]: Entering directory '/tmp/ruby/build/trunk/ext/pty' I, [2024-05-22T19:21:27.604897 #4129944] INFO -- : make[2]: Leaving directory '/tmp/ruby/build/trunk/ext/coverage' I, [2024-05-22T19:21:27.604959 #4129944] INFO -- : make[2]: Leaving directory '/tmp/ruby/build/trunk/ext/digest' I, [2024-05-22T19:21:27.604995 #4129944] INFO -- : make[2]: Leaving directory '/tmp/ruby/build/trunk/ext/io/console' I, [2024-05-22T19:21:27.605949 #4129944] INFO -- : make[2]: Entering directory '/tmp/ruby/build/trunk/ext/objspace' I, [2024-05-22T19:21:27.606527 #4129944] INFO -- : make[2]: Entering directory '/tmp/ruby/build/trunk/ext/psych' I, [2024-05-22T19:21:27.606557 #4129944] INFO -- : make[2]: Leaving directory '/tmp/ruby/build/trunk/ext/date' I, [2024-05-22T19:21:27.606841 #4129944] INFO -- : make[2]: Leaving directory '/tmp/ruby/build/trunk/ext/json' I, [2024-05-22T19:21:27.606868 #4129944] INFO -- : make[2]: Leaving directory '/tmp/ruby/build/trunk/ext/monitor' I, [2024-05-22T19:21:27.606934 #4129944] INFO -- : make[2]: Leaving directory '/tmp/ruby/build/trunk/ext/rubyvm' I, [2024-05-22T19:21:27.607331 #4129944] INFO -- : make[2]: Leaving directory '/tmp/ruby/build/trunk/ext/pty' I, [2024-05-22T19:21:27.607510 #4129944] INFO -- : make[2]: Entering directory '/tmp/ruby/build/trunk/.bundle/gems/bigdecimal-3.1.8/ext/bigdecimal' I, [2024-05-22T19:21:27.607530 #4129944] INFO -- : make[2]: Entering directory '/tmp/ruby/build/trunk/.bundle/gems/debug-1.9.2/ext/debug' I, [2024-05-22T19:21:27.607544 #4129944] INFO -- : make[2]: Leaving directory '/tmp/ruby/build/trunk/ext/pathname' I, [2024-05-22T19:21:27.608364 #4129944] INFO -- : make[2]: Entering directory '/tmp/ruby/build/trunk/.bundle/gems/racc-1.7.3/ext/racc/cparse' I, [2024-05-22T19:21:27.608402 #4129944] INFO -- : make[2]: Entering directory '/tmp/ruby/build/trunk/.bundle/gems/nkf-0.2.0/ext/nkf' I, [2024-05-22T19:21:27.610257 #4129944] INFO -- : make[2]: Leaving directory '/tmp/ruby/build/trunk/ext/objspace' I, [2024-05-22T19:21:27.610716 #4129944] INFO -- : make[2]: Entering directory '/tmp/ruby/build/trunk/ext/ripper' I, [2024-05-22T19:21:27.611272 #4129944] INFO -- : make[2]: Entering directory '/tmp/ruby/build/trunk/.bundle/gems/racc-1.8.0/ext/racc/cparse' I, [2024-05-22T19:21:27.612245 #4129944] INFO -- : make[2]: Entering directory '/tmp/ruby/build/trunk/.bundle/gems/syslog-0.1.2/ext/syslog' I, [2024-05-22T19:21:27.612512 #4129944] INFO -- : make[2]: Entering directory '/tmp/ruby/build/trunk/.bundle/gems/rbs-3.4.4/ext/rbs_extension' I, [2024-05-22T19:21:27.613551 #4129944] INFO -- : make[2]: Leaving directory '/tmp/ruby/build/trunk/ext/fiddle' I, [2024-05-22T19:21:27.614891 #4129944] INFO -- : make[2]: Entering directory '/tmp/ruby/build/trunk/ext/openssl' I, [2024-05-22T19:21:27.615172 #4129944] INFO -- : make[2]: Entering directory '/tmp/ruby/build/trunk/ext/digest/sha2' I, [2024-05-22T19:21:27.615510 #4129944] INFO -- : make[2]: Entering directory '/tmp/ruby/build/trunk/ext/socket' I, [2024-05-22T19:21:27.616155 #4129944] INFO -- : make[2]: Leaving directory '/tmp/ruby/build/trunk/ext/ripper' I, [2024-05-22T19:21:27.618530 #4129944] INFO -- : make[2]: Leaving directory '/tmp/ruby/build/trunk/ext/digest/sha2' I, [2024-05-22T19:21:27.619970 #4129944] INFO -- : make[2]: Leaving directory '/tmp/ruby/build/trunk/ext/psych' I, [2024-05-22T19:21:27.624542 #4129944] INFO -- : make[2]: Leaving directory '/tmp/ruby/build/trunk/ext/socket' I, [2024-05-22T19:21:27.631340 #4129944] INFO -- : make[2]: Leaving directory '/tmp/ruby/build/trunk/.bundle/gems/debug-1.9.2/ext/debug' I, [2024-05-22T19:21:27.631466 #4129944] INFO -- : make[2]: Leaving directory '/tmp/ruby/build/trunk/ext/openssl' I, [2024-05-22T19:21:27.631638 #4129944] INFO -- : make[2]: Leaving directory '/tmp/ruby/build/trunk/.bundle/gems/nkf-0.2.0/ext/nkf' I, [2024-05-22T19:21:27.636382 #4129944] INFO -- : make[2]: Leaving directory '/tmp/ruby/build/trunk/.bundle/gems/racc-1.8.0/ext/racc/cparse' I, [2024-05-22T19:21:27.636644 #4129944] INFO -- : make[2]: Leaving directory '/tmp/ruby/build/trunk/.bundle/gems/rbs-3.4.4/ext/rbs_extension' I, [2024-05-22T19:21:27.637096 #4129944] INFO -- : make[2]: Leaving directory '/tmp/ruby/build/trunk/.bundle/gems/syslog-0.1.2/ext/syslog' I, [2024-05-22T19:21:27.642468 #4129944] INFO -- : make[2]: Leaving directory '/tmp/ruby/build/trunk/.bundle/gems/bigdecimal-3.1.8/ext/bigdecimal' I, [2024-05-22T19:21:27.644552 #4129944] INFO -- : make[2]: Leaving directory '/tmp/ruby/build/trunk/.bundle/gems/racc-1.7.3/ext/racc/cparse' I, [2024-05-22T19:21:27.668186 #4129944] INFO -- : make[2]: Entering directory '/tmp/ruby/build/trunk' I, [2024-05-22T19:21:27.736635 #4129944] INFO -- : make[2]: 'ruby' is up to date. I, [2024-05-22T19:21:27.736704 #4129944] INFO -- : make[2]: Leaving directory '/tmp/ruby/build/trunk' I, [2024-05-22T19:21:27.737007 #4129944] INFO -- : make[1]: Leaving directory '/tmp/ruby/build/trunk' I, [2024-05-22T19:21:27.740892 #4129944] INFO -- : make[1]: Entering directory '/tmp/ruby/build/trunk' I, [2024-05-22T19:21:27.740946 #4129944] INFO -- : make[1]: Nothing to be done for 'note'. I, [2024-05-22T19:21:27.740959 #4129944] INFO -- : make[1]: Leaving directory '/tmp/ruby/build/trunk' I, [2024-05-22T19:21:27.741390 #4129944] INFO -- : ./miniruby -I/tmp/ruby/src/trunk/lib -I. -I.ext/common /tmp/ruby/src/trunk/tool/runruby.rb --extout=.ext -- --disable-gems -r./x86_64-linux-fake /tmp/ruby/src/trunk/tool/rbinstall.rb --make="make" --dest-dir="" --extout=".ext" --ext-build-dir="./ext" --mflags="-j20 --jobserver-auth=4,5" --make-flags=" -j20 --jobserver-auth=4,5" --data-mode=0644 --prog-mode=0755 --installed-list .installed.list --mantype="doc" --gnumake --install=all --exclude=doc I, [2024-05-22T19:21:27.837720 #4129944] INFO -- : Installing to I, [2024-05-22T19:21:27.837802 #4129944] INFO -- : installing binary commands: /tmp/ruby/install/trunk/bin I, [2024-05-22T19:21:27.837817 #4129944] INFO -- : installing base libraries: /tmp/ruby/install/trunk/lib I, [2024-05-22T19:21:27.845018 #4129944] INFO -- : installing arch files: /tmp/ruby/install/trunk/lib/ruby/3.4.0+0/x86_64-linux I, [2024-05-22T19:21:27.845078 #4129944] INFO -- : installing pkgconfig data: /tmp/ruby/install/trunk/lib/pkgconfig I, [2024-05-22T19:21:27.845092 #4129944] INFO -- : installing extension objects: /tmp/ruby/install/trunk/lib/ruby/3.4.0+0/x86_64-linux I, [2024-05-22T19:21:27.854798 #4129944] INFO -- : installing extension objects: /tmp/ruby/install/trunk/lib/ruby/site_ruby/3.4.0+0/x86_64-linux I, [2024-05-22T19:21:27.854859 #4129944] INFO -- : installing extension objects: /tmp/ruby/install/trunk/lib/ruby/vendor_ruby/3.4.0+0/x86_64-linux I, [2024-05-22T19:21:27.854873 #4129944] INFO -- : installing extension headers: /tmp/ruby/install/trunk/include/ruby-3.4.0+0/x86_64-linux I, [2024-05-22T19:21:27.854966 #4129944] INFO -- : installing extension scripts: /tmp/ruby/install/trunk/lib/ruby/3.4.0+0 I, [2024-05-22T19:21:27.857736 #4129944] INFO -- : installing extension scripts: /tmp/ruby/install/trunk/lib/ruby/site_ruby/3.4.0+0 I, [2024-05-22T19:21:27.857795 #4129944] INFO -- : installing extension scripts: /tmp/ruby/install/trunk/lib/ruby/vendor_ruby/3.4.0+0 I, [2024-05-22T19:21:27.857809 #4129944] INFO -- : installing extension headers: /tmp/ruby/install/trunk/include/ruby-3.4.0+0/ruby I, [2024-05-22T19:21:27.857820 #4129944] INFO -- : installing command scripts: /tmp/ruby/install/trunk/bin I, [2024-05-22T19:21:27.857842 #4129944] INFO -- : installing library scripts: /tmp/ruby/install/trunk/lib/ruby/3.4.0+0 I, [2024-05-22T19:21:27.890699 #4129944] INFO -- : installing common headers: /tmp/ruby/install/trunk/include/ruby-3.4.0+0 I, [2024-05-22T19:21:27.897284 #4129944] INFO -- : installing manpages: /tmp/ruby/install/trunk/share/man/man1 I, [2024-05-22T19:21:27.897352 #4129944] INFO -- : installing default gems from lib: /tmp/ruby/install/trunk/lib/ruby/gems/3.4.0+0 I, [2024-05-22T19:21:27.920279 #4129944] INFO -- : benchmark 0.3.0 I, [2024-05-22T19:21:27.922205 #4129944] INFO -- : bundler 2.6.0.dev I, [2024-05-22T19:21:27.924349 #4129944] INFO -- : cgi 0.4.1 I, [2024-05-22T19:21:27.924893 #4129944] INFO -- : delegate 0.3.1 I, [2024-05-22T19:21:27.925351 #4129944] INFO -- : did_you_mean 1.6.3 I, [2024-05-22T19:21:27.925868 #4129944] INFO -- : english 0.8.0 I, [2024-05-22T19:21:27.926282 #4129944] INFO -- : erb 4.0.4 I, [2024-05-22T19:21:27.927430 #4129944] INFO -- : error_highlight 0.6.0 I, [2024-05-22T19:21:27.928203 #4129944] INFO -- : fileutils 1.7.2 I, [2024-05-22T19:21:27.928924 #4129944] INFO -- : find 0.2.0 I, [2024-05-22T19:21:27.929792 #4129944] INFO -- : forwardable 1.3.3 I, [2024-05-22T19:21:27.930856 #4129944] INFO -- : ipaddr 1.2.6 I, [2024-05-22T19:21:27.931440 #4129944] INFO -- : irb 1.13.1 I, [2024-05-22T19:21:27.932265 #4129944] INFO -- : logger 1.6.0 I, [2024-05-22T19:21:27.932736 #4129944] INFO -- : net-http 0.4.1 I, [2024-05-22T19:21:27.933237 #4129944] INFO -- : net-protocol 0.2.2 I, [2024-05-22T19:21:27.933718 #4129944] INFO -- : open-uri 0.4.1 I, [2024-05-22T19:21:27.934199 #4129944] INFO -- : open3 0.2.1 I, [2024-05-22T19:21:27.934675 #4129944] INFO -- : optparse 0.5.0 I, [2024-05-22T19:21:27.935100 #4129944] INFO -- : ostruct 0.6.0 I, [2024-05-22T19:21:27.935527 #4129944] INFO -- : pp 0.5.0 I, [2024-05-22T19:21:27.936122 #4129944] INFO -- : prettyprint 0.2.0 I, [2024-05-22T19:21:27.936570 #4129944] INFO -- : prism 0.29.0 I, [2024-05-22T19:21:27.937066 #4129944] INFO -- : pstore 0.1.3 I, [2024-05-22T19:21:27.937565 #4129944] INFO -- : rdoc 6.6.3.1 I, [2024-05-22T19:21:27.938513 #4129944] INFO -- : readline 0.0.4 I, [2024-05-22T19:21:27.939044 #4129944] INFO -- : reline 0.5.7 I, [2024-05-22T19:21:27.939561 #4129944] INFO -- : resolv 0.4.0 I, [2024-05-22T19:21:27.940096 #4129944] INFO -- : ruby2_keywords 0.0.5 I, [2024-05-22T19:21:27.940603 #4129944] INFO -- : securerandom 0.3.1 I, [2024-05-22T19:21:27.941609 #4129944] INFO -- : set 1.1.0 I, [2024-05-22T19:21:27.942359 #4129944] INFO -- : shellwords 0.2.0 I, [2024-05-22T19:21:27.942781 #4129944] INFO -- : singleton 0.2.0 I, [2024-05-22T19:21:27.943292 #4129944] INFO -- : syntax_suggest 2.0.0 I, [2024-05-22T19:21:27.943920 #4129944] INFO -- : tempfile 0.2.1 I, [2024-05-22T19:21:27.944470 #4129944] INFO -- : time 0.3.0 I, [2024-05-22T19:21:27.944947 #4129944] INFO -- : timeout 0.4.1 I, [2024-05-22T19:21:27.945400 #4129944] INFO -- : tmpdir 0.2.0 I, [2024-05-22T19:21:27.945889 #4129944] INFO -- : tsort 0.2.0 I, [2024-05-22T19:21:27.946350 #4129944] INFO -- : un 0.3.0 I, [2024-05-22T19:21:27.946810 #4129944] INFO -- : uri 0.13.0 I, [2024-05-22T19:21:27.947341 #4129944] INFO -- : weakref 0.1.3 I, [2024-05-22T19:21:27.947776 #4129944] INFO -- : yaml 0.3.0 I, [2024-05-22T19:21:27.948258 #4129944] INFO -- : installing default gems from ext: /tmp/ruby/install/trunk/lib/ruby/gems/3.4.0+0 I, [2024-05-22T19:21:27.954748 #4129944] INFO -- : date 3.3.4 I, [2024-05-22T19:21:27.955279 #4129944] INFO -- : digest 3.1.1 I, [2024-05-22T19:21:27.955761 #4129944] INFO -- : etc 1.4.3 I, [2024-05-22T19:21:27.956373 #4129944] INFO -- : fcntl 1.1.0 I, [2024-05-22T19:21:27.956844 #4129944] INFO -- : fiddle 1.1.3 I, [2024-05-22T19:21:27.957319 #4129944] INFO -- : io-console 0.7.2 I, [2024-05-22T19:21:27.957791 #4129944] INFO -- : io-nonblock 0.3.0 I, [2024-05-22T19:21:27.958194 #4129944] INFO -- : io-wait 0.3.1 I, [2024-05-22T19:21:27.958675 #4129944] INFO -- : json 2.7.2 I, [2024-05-22T19:21:27.959207 #4129944] INFO -- : openssl 3.2.0 I, [2024-05-22T19:21:27.959777 #4129944] INFO -- : pathname 0.3.0 I, [2024-05-22T19:21:27.960246 #4129944] INFO -- : psych 5.1.2 I, [2024-05-22T19:21:27.960810 #4129944] INFO -- : stringio 3.1.1 I, [2024-05-22T19:21:27.961307 #4129944] INFO -- : strscan 3.1.1 I, [2024-05-22T19:21:27.961759 #4129944] INFO -- : zlib 3.1.0 I, [2024-05-22T19:21:27.962067 #4129944] INFO -- : installing bundled gems: /tmp/ruby/install/trunk/lib/ruby/gems/3.4.0+0 I, [2024-05-22T19:21:27.962682 #4129944] INFO -- : minitest 5.23.1 I, [2024-05-22T19:21:27.971324 #4129944] INFO -- : rake 13.2.1 I, [2024-05-22T19:21:27.974727 #4129944] INFO -- : test-unit 3.6.2 I, [2024-05-22T19:21:27.979655 #4129944] INFO -- : rexml 3.2.8 I, [2024-05-22T19:21:27.983419 #4129944] INFO -- : rss 0.3.0 I, [2024-05-22T19:21:27.986141 #4129944] INFO -- : net-ftp 0.3.4 I, [2024-05-22T19:21:27.987779 #4129944] INFO -- : net-imap 0.4.11 I, [2024-05-22T19:21:27.991462 #4129944] INFO -- : net-pop 0.1.2 I, [2024-05-22T19:21:27.992485 #4129944] INFO -- : net-smtp 0.5.0 I, [2024-05-22T19:21:27.993637 #4129944] INFO -- : matrix 0.4.2 I, [2024-05-22T19:21:27.996903 #4129944] INFO -- : prime 0.1.2 I, [2024-05-22T19:21:28.001740 #4129944] INFO -- : rbs 3.4.4 I, [2024-05-22T19:21:28.024381 #4129944] INFO -- : typeprof 0.21.11 I, [2024-05-22T19:21:28.026706 #4129944] INFO -- : debug 1.9.2 I, [2024-05-22T19:21:28.029976 #4129944] INFO -- : racc 1.8.0 I, [2024-05-22T19:21:28.032917 #4129944] INFO -- : mutex_m 0.2.0 I, [2024-05-22T19:21:28.034259 #4129944] INFO -- : getoptlong 0.2.1 I, [2024-05-22T19:21:28.035635 #4129944] INFO -- : base64 0.2.0 I, [2024-05-22T19:21:28.036747 #4129944] INFO -- : bigdecimal 3.1.8 I, [2024-05-22T19:21:28.039257 #4129944] INFO -- : observer 0.1.2 I, [2024-05-22T19:21:28.040613 #4129944] INFO -- : abbrev 0.1.2 I, [2024-05-22T19:21:28.041861 #4129944] INFO -- : resolv-replace 0.1.1 I, [2024-05-22T19:21:28.043152 #4129944] INFO -- : rinda 0.2.0 I, [2024-05-22T19:21:28.044475 #4129944] INFO -- : drb 2.2.1 I, [2024-05-22T19:21:28.046071 #4129944] INFO -- : nkf 0.2.0 I, [2024-05-22T19:21:28.048733 #4129944] INFO -- : syslog 0.1.2 I, [2024-05-22T19:21:28.050906 #4129944] INFO -- : csv 3.3.0 I, [2024-05-22T19:21:28.053347 #4129944] INFO -- : installing bundled gem cache: /tmp/ruby/install/trunk/lib/ruby/gems/3.4.0+0/cache I, [2024-05-22T19:21:28.054775 #4129944] INFO -- : skipped bundled gems: I, [2024-05-22T19:21:28.054842 #4129944] INFO -- : power_assert-2.0.4dev.gem not found in bundled_gems I, [2024-05-22T19:21:28.057895 #4129944] INFO -- : $$$[end] "make install -j20" exit with 0. I, [2024-05-22T19:21:28.058035 #4129944] INFO -- : $$$[beg] make yes-btest TESTOPTS='-q -j20' I, [2024-05-22T19:21:33.520384 #4129944] INFO -- : PASS all 1936 tests E, [2024-05-22T19:21:33.525727 #4129944] ERROR -- : I, [2024-05-22T19:21:33.526123 #4129944] INFO -- : $$$[end] "make yes-btest TESTOPTS='-q -j20'" exit with 0. I, [2024-05-22T19:21:33.526214 #4129944] INFO -- : $$$[beg] make yes-test-basic TESTS='-j20' I, [2024-05-22T19:21:33.587933 #4129944] INFO -- : BASERUBY = /usr/bin/ruby --disable=gems I, [2024-05-22T19:21:33.587983 #4129944] INFO -- : CC = gcc I, [2024-05-22T19:21:33.588000 #4129944] INFO -- : LD = ld I, [2024-05-22T19:21:33.588015 #4129944] INFO -- : LDSHARED = gcc -shared I, [2024-05-22T19:21:33.588030 #4129944] INFO -- : CFLAGS = -O3 -fno-fast-math -ggdb3 -Wall -Wextra -Wdeprecated-declarations -Wdiv-by-zero -Wduplicated-cond -Wimplicit-function-declaration -Wimplicit-int -Wpointer-arith -Wwrite-strings -Wold-style-definition -Wimplicit-fallthrough=0 -Wmissing-noreturn -Wno-cast-function-type -Wno-constant-logical-operand -Wno-long-long -Wno-missing-field-initializers -Wno-overlength-strings -Wno-packed-bitfield-compat -Wno-parentheses-equality -Wno-self-assign -Wno-tautological-compare -Wno-unused-parameter -Wno-unused-value -Wsuggest-attribute=format -Wsuggest-attribute=noreturn -Wunused-variable -Wmisleading-indentation -Wundef -fPIC I, [2024-05-22T19:21:33.588046 #4129944] INFO -- : XCFLAGS = -U_FORTIFY_SOURCE -D_FORTIFY_SOURCE=2 -fstack-protector-strong -fno-strict-overflow -fvisibility=hidden -fexcess-precision=standard -DRUBY_EXPORT -I. -I.ext/include/x86_64-linux -I/tmp/ruby/src/trunk/include -I/tmp/ruby/src/trunk -I/tmp/ruby/src/trunk/prism -I/tmp/ruby/src/trunk/enc/unicode/15.0.0 I, [2024-05-22T19:21:33.588059 #4129944] INFO -- : CPPFLAGS = I, [2024-05-22T19:21:33.588073 #4129944] INFO -- : DLDFLAGS = -Wl,--compress-debug-sections=zlib -Wl,-soname,libruby.so.3.4 -fstack-protector-strong I, [2024-05-22T19:21:33.588092 #4129944] INFO -- : SOLIBS = -lz -lrt -lrt -lgmp -ldl -lcrypt -lm -lpthread I, [2024-05-22T19:21:33.588105 #4129944] INFO -- : LANG = en_US.UTF-8 I, [2024-05-22T19:21:33.588119 #4129944] INFO -- : LC_ALL = I, [2024-05-22T19:21:33.588133 #4129944] INFO -- : LC_CTYPE = I, [2024-05-22T19:21:33.588146 #4129944] INFO -- : MFLAGS = I, [2024-05-22T19:21:33.588172 #4129944] INFO -- : RUSTC = no I, [2024-05-22T19:21:33.588187 #4129944] INFO -- : YJIT_RUSTC_ARGS = --crate-name=yjit --crate-type=staticlib --edition=2021 -g -C lto=thin -C opt-level=3 -C overflow-checks=on '--out-dir=/tmp/ruby/build/trunk/yjit/target/release/' /tmp/ruby/src/trunk/yjit/src/lib.rs I, [2024-05-22T19:21:33.588790 #4129944] INFO -- : gcc (Ubuntu 11.4.0-1ubuntu1~22.04) 11.4.0 I, [2024-05-22T19:21:33.588846 #4129944] INFO -- : Copyright (C) 2021 Free Software Foundation, Inc. I, [2024-05-22T19:21:33.588864 #4129944] INFO -- : This is free software; see the source for copying conditions. There is NO I, [2024-05-22T19:21:33.588880 #4129944] INFO -- : warranty; not even for MERCHANTABILITY or FITNESS FOR A PARTICULAR PURPOSE. I, [2024-05-22T19:21:33.588894 #4129944] INFO -- : I, [2024-05-22T19:21:33.702073 #4129944] INFO -- : Checking leaked global symbols...none I, [2024-05-22T19:21:33.742242 #4129944] INFO -- : /tmp/ruby/src/trunk/basictest/test.rb:assignment ....................................................................................................................................................................................................................................................................................................................................................................................OK 372 I, [2024-05-22T19:21:33.742338 #4129944] INFO -- : /tmp/ruby/src/trunk/basictest/test.rb:condition ..OK 2 I, [2024-05-22T19:21:33.742355 #4129944] INFO -- : /tmp/ruby/src/trunk/basictest/test.rb:if/unless ...OK 3 I, [2024-05-22T19:21:33.742368 #4129944] INFO -- : /tmp/ruby/src/trunk/basictest/test.rb:case .....OK 5 I, [2024-05-22T19:21:33.742492 #4129944] INFO -- : /tmp/ruby/src/trunk/basictest/test.rb:while/until ........OK 8 I, [2024-05-22T19:21:33.742543 #4129944] INFO -- : /tmp/ruby/src/trunk/basictest/test.rb:exception ..........OK 10 I, [2024-05-22T19:21:33.742810 #4129944] INFO -- : /tmp/ruby/src/trunk/basictest/test.rb:array .......................................OK 39 I, [2024-05-22T19:21:33.742908 #4129944] INFO -- : /tmp/ruby/src/trunk/basictest/test.rb:hash ...........................OK 27 I, [2024-05-22T19:21:33.743610 #4129944] INFO -- : /tmp/ruby/src/trunk/basictest/test.rb:iterator ...........................................................................................................OK 107 I, [2024-05-22T19:21:33.743955 #4129944] INFO -- : /tmp/ruby/src/trunk/basictest/test.rb:float ................................................................................OK 80 I, [2024-05-22T19:21:33.745776 #4129944] INFO -- : /tmp/ruby/src/trunk/basictest/test.rb:bignum ...............................OK 31 I, [2024-05-22T19:21:33.746534 #4129944] INFO -- : /tmp/ruby/src/trunk/basictest/test.rb:string & char ..............................................................OK 62 I, [2024-05-22T19:21:33.746568 #4129944] INFO -- : /tmp/ruby/src/trunk/basictest/test.rb:assignment ..........OK 10 I, [2024-05-22T19:21:33.746595 #4129944] INFO -- : /tmp/ruby/src/trunk/basictest/test.rb:call ......OK 6 I, [2024-05-22T19:21:33.746648 #4129944] INFO -- : /tmp/ruby/src/trunk/basictest/test.rb:proc .........OK 9 I, [2024-05-22T19:21:33.847236 #4129944] INFO -- : /tmp/ruby/src/trunk/basictest/test.rb:signal ..OK 2 I, [2024-05-22T19:21:33.849931 #4129944] INFO -- : /tmp/ruby/src/trunk/basictest/test.rb:eval ...........................OK 27 I, [2024-05-22T19:21:33.970594 #4129944] INFO -- : /tmp/ruby/src/trunk/basictest/test.rb:system ........OK 8 I, [2024-05-22T19:21:33.970669 #4129944] INFO -- : /tmp/ruby/src/trunk/basictest/test.rb:const .....OK 5 I, [2024-05-22T19:21:33.970683 #4129944] INFO -- : /tmp/ruby/src/trunk/basictest/test.rb:clone .....OK 5 I, [2024-05-22T19:21:33.970701 #4129944] INFO -- : /tmp/ruby/src/trunk/basictest/test.rb:marshal ....OK 4 I, [2024-05-22T19:21:33.970803 #4129944] INFO -- : /tmp/ruby/src/trunk/basictest/test.rb:pack ....OK 4 I, [2024-05-22T19:21:33.970828 #4129944] INFO -- : /tmp/ruby/src/trunk/basictest/test.rb:math ..OK 2 I, [2024-05-22T19:21:33.970856 #4129944] INFO -- : /tmp/ruby/src/trunk/basictest/test.rb:struct ......OK 6 I, [2024-05-22T19:21:33.970972 #4129944] INFO -- : /tmp/ruby/src/trunk/basictest/test.rb:variable ............OK 12 I, [2024-05-22T19:21:33.970997 #4129944] INFO -- : /tmp/ruby/src/trunk/basictest/test.rb:trace ...OK 3 I, [2024-05-22T19:21:33.971013 #4129944] INFO -- : /tmp/ruby/src/trunk/basictest/test.rb:defined? ............OK 12 I, [2024-05-22T19:21:33.971043 #4129944] INFO -- : /tmp/ruby/src/trunk/basictest/test.rb:alias ......OK 6 I, [2024-05-22T19:21:33.971377 #4129944] INFO -- : /tmp/ruby/src/trunk/basictest/test.rb:path .......................OK 23 I, [2024-05-22T19:21:34.010020 #4129944] INFO -- : /tmp/ruby/src/trunk/basictest/test.rb:gc ....OK 4 I, [2024-05-22T19:21:34.012503 #4129944] INFO -- : I, [2024-05-22T19:21:34.012563 #4129944] INFO -- : test succeeded I, [2024-05-22T19:21:34.014145 #4129944] INFO -- : $$$[end] "make yes-test-basic TESTS='-j20'" exit with 0. I, [2024-05-22T19:21:34.014264 #4129944] INFO -- : $$$[beg] make yes-test-all TESTOPTS='--stderr-on-failure' TESTS='-j20' I, [2024-05-22T19:21:34.103751 #4129944] INFO -- : BASERUBY = /usr/bin/ruby --disable=gems I, [2024-05-22T19:21:34.103795 #4129944] INFO -- : CC = gcc I, [2024-05-22T19:21:34.103801 #4129944] INFO -- : LD = ld I, [2024-05-22T19:21:34.103806 #4129944] INFO -- : LDSHARED = gcc -shared I, [2024-05-22T19:21:34.103811 #4129944] INFO -- : CFLAGS = -O3 -fno-fast-math -ggdb3 -Wall -Wextra -Wdeprecated-declarations -Wdiv-by-zero -Wduplicated-cond -Wimplicit-function-declaration -Wimplicit-int -Wpointer-arith -Wwrite-strings -Wold-style-definition -Wimplicit-fallthrough=0 -Wmissing-noreturn -Wno-cast-function-type -Wno-constant-logical-operand -Wno-long-long -Wno-missing-field-initializers -Wno-overlength-strings -Wno-packed-bitfield-compat -Wno-parentheses-equality -Wno-self-assign -Wno-tautological-compare -Wno-unused-parameter -Wno-unused-value -Wsuggest-attribute=format -Wsuggest-attribute=noreturn -Wunused-variable -Wmisleading-indentation -Wundef -fPIC I, [2024-05-22T19:21:34.103815 #4129944] INFO -- : XCFLAGS = -U_FORTIFY_SOURCE -D_FORTIFY_SOURCE=2 -fstack-protector-strong -fno-strict-overflow -fvisibility=hidden -fexcess-precision=standard -DRUBY_EXPORT -I. -I.ext/include/x86_64-linux -I/tmp/ruby/src/trunk/include -I/tmp/ruby/src/trunk -I/tmp/ruby/src/trunk/prism -I/tmp/ruby/src/trunk/enc/unicode/15.0.0 I, [2024-05-22T19:21:34.103819 #4129944] INFO -- : CPPFLAGS = I, [2024-05-22T19:21:34.103823 #4129944] INFO -- : DLDFLAGS = -Wl,--compress-debug-sections=zlib -Wl,-soname,libruby.so.3.4 -fstack-protector-strong I, [2024-05-22T19:21:34.103827 #4129944] INFO -- : SOLIBS = -lz -lrt -lrt -lgmp -ldl -lcrypt -lm -lpthread I, [2024-05-22T19:21:34.103830 #4129944] INFO -- : LANG = en_US.UTF-8 I, [2024-05-22T19:21:34.103834 #4129944] INFO -- : LC_ALL = I, [2024-05-22T19:21:34.103838 #4129944] INFO -- : LC_CTYPE = I, [2024-05-22T19:21:34.103841 #4129944] INFO -- : MFLAGS = I, [2024-05-22T19:21:34.103844 #4129944] INFO -- : RUSTC = no I, [2024-05-22T19:21:34.103848 #4129944] INFO -- : YJIT_RUSTC_ARGS = --crate-name=yjit --crate-type=staticlib --edition=2021 -g -C lto=thin -C opt-level=3 -C overflow-checks=on '--out-dir=/tmp/ruby/build/trunk/yjit/target/release/' /tmp/ruby/src/trunk/yjit/src/lib.rs I, [2024-05-22T19:21:34.104318 #4129944] INFO -- : gcc (Ubuntu 11.4.0-1ubuntu1~22.04) 11.4.0 I, [2024-05-22T19:21:34.104338 #4129944] INFO -- : Copyright (C) 2021 Free Software Foundation, Inc. I, [2024-05-22T19:21:34.104348 #4129944] INFO -- : This is free software; see the source for copying conditions. There is NO I, [2024-05-22T19:21:34.104353 #4129944] INFO -- : warranty; not even for MERCHANTABILITY or FITNESS FOR A PARTICULAR PURPOSE. I, [2024-05-22T19:21:34.104358 #4129944] INFO -- : I, [2024-05-22T19:21:34.106143 #4129944] INFO -- : generating enc.mk I, [2024-05-22T19:21:34.223617 #4129944] INFO -- : generating encdb.h I, [2024-05-22T19:21:34.247176 #4129944] INFO -- : encdb.h unchanged I, [2024-05-22T19:21:34.248164 #4129944] INFO -- : making enc I, [2024-05-22T19:21:34.265431 #4129944] INFO -- : make[1]: Entering directory '/tmp/ruby/build/trunk' I, [2024-05-22T19:21:34.265452 #4129944] INFO -- : make[1]: Nothing to be done for 'enc'. I, [2024-05-22T19:21:34.265457 #4129944] INFO -- : make[1]: Leaving directory '/tmp/ruby/build/trunk' I, [2024-05-22T19:21:34.266182 #4129944] INFO -- : making srcs under enc I, [2024-05-22T19:21:34.297760 #4129944] INFO -- : make[1]: Entering directory '/tmp/ruby/build/trunk' I, [2024-05-22T19:21:34.297783 #4129944] INFO -- : make[1]: Nothing to be done for 'srcs'. I, [2024-05-22T19:21:34.297788 #4129944] INFO -- : make[1]: Leaving directory '/tmp/ruby/build/trunk' I, [2024-05-22T19:21:34.298735 #4129944] INFO -- : generating transdb.h I, [2024-05-22T19:21:34.395362 #4129944] INFO -- : transdb.h unchanged I, [2024-05-22T19:21:34.396720 #4129944] INFO -- : making trans I, [2024-05-22T19:21:34.431105 #4129944] INFO -- : make[1]: Entering directory '/tmp/ruby/build/trunk' I, [2024-05-22T19:21:34.431136 #4129944] INFO -- : make[1]: Nothing to be done for 'trans'. I, [2024-05-22T19:21:34.431144 #4129944] INFO -- : make[1]: Leaving directory '/tmp/ruby/build/trunk' I, [2024-05-22T19:21:34.431802 #4129944] INFO -- : making encs I, [2024-05-22T19:21:34.470149 #4129944] INFO -- : make[1]: Entering directory '/tmp/ruby/build/trunk' I, [2024-05-22T19:21:34.470173 #4129944] INFO -- : make[1]: Nothing to be done for 'encs'. I, [2024-05-22T19:21:34.470178 #4129944] INFO -- : make[1]: Leaving directory '/tmp/ruby/build/trunk' I, [2024-05-22T19:21:34.471943 #4129944] INFO -- : generating makefiles ext/configure-ext.mk I, [2024-05-22T19:21:34.498715 #4129944] INFO -- : ext/configure-ext.mk updated I, [2024-05-22T19:21:34.501180 #4129944] INFO -- : make[1]: Entering directory '/tmp/ruby/build/trunk' I, [2024-05-22T19:21:35.895645 #4129944] INFO -- : make[1]: Leaving directory '/tmp/ruby/build/trunk' I, [2024-05-22T19:21:35.896489 #4129944] INFO -- : generating makefile exts.mk I, [2024-05-22T19:21:35.933411 #4129944] INFO -- : exts.mk unchanged I, [2024-05-22T19:21:35.937991 #4129944] INFO -- : make[1]: Entering directory '/tmp/ruby/build/trunk' I, [2024-05-22T19:21:36.273383 #4129944] INFO -- : make[2]: Entering directory '/tmp/ruby/build/trunk/ext/coverage' I, [2024-05-22T19:21:36.276610 #4129944] INFO -- : make[2]: Leaving directory '/tmp/ruby/build/trunk/ext/coverage' I, [2024-05-22T19:21:36.282316 #4129944] INFO -- : make[2]: Entering directory '/tmp/ruby/build/trunk/ext/date' I, [2024-05-22T19:21:36.286686 #4129944] INFO -- : make[2]: Leaving directory '/tmp/ruby/build/trunk/ext/date' I, [2024-05-22T19:21:36.290570 #4129944] INFO -- : make[2]: Entering directory '/tmp/ruby/build/trunk/ext/digest' I, [2024-05-22T19:21:36.299450 #4129944] INFO -- : make[2]: Leaving directory '/tmp/ruby/build/trunk/ext/digest' I, [2024-05-22T19:21:36.324771 #4129944] INFO -- : make[2]: Entering directory '/tmp/ruby/build/trunk/ext/digest/sha2' I, [2024-05-22T19:21:36.329800 #4129944] INFO -- : make[2]: Leaving directory '/tmp/ruby/build/trunk/ext/digest/sha2' I, [2024-05-22T19:21:36.351178 #4129944] INFO -- : make[2]: Entering directory '/tmp/ruby/build/trunk/ext/fiddle' I, [2024-05-22T19:21:36.358184 #4129944] INFO -- : make[2]: Leaving directory '/tmp/ruby/build/trunk/ext/fiddle' I, [2024-05-22T19:21:36.361274 #4129944] INFO -- : make[2]: Entering directory '/tmp/ruby/build/trunk/ext/io/console' I, [2024-05-22T19:21:36.363840 #4129944] INFO -- : make[2]: Leaving directory '/tmp/ruby/build/trunk/ext/io/console' I, [2024-05-22T19:21:36.375612 #4129944] INFO -- : make[2]: Entering directory '/tmp/ruby/build/trunk/ext/json' I, [2024-05-22T19:21:36.386465 #4129944] INFO -- : make[2]: Leaving directory '/tmp/ruby/build/trunk/ext/json' I, [2024-05-22T19:21:36.402139 #4129944] INFO -- : make[2]: Entering directory '/tmp/ruby/build/trunk/ext/monitor' I, [2024-05-22T19:21:36.406201 #4129944] INFO -- : make[2]: Leaving directory '/tmp/ruby/build/trunk/ext/monitor' I, [2024-05-22T19:21:36.413419 #4129944] INFO -- : make[2]: Entering directory '/tmp/ruby/build/trunk/ext/objspace' I, [2024-05-22T19:21:36.419515 #4129944] INFO -- : make[2]: Leaving directory '/tmp/ruby/build/trunk/ext/objspace' I, [2024-05-22T19:21:36.439815 #4129944] INFO -- : make[2]: Entering directory '/tmp/ruby/build/trunk/ext/openssl' I, [2024-05-22T19:21:36.458028 #4129944] INFO -- : make[2]: Leaving directory '/tmp/ruby/build/trunk/ext/openssl' I, [2024-05-22T19:21:36.461767 #4129944] INFO -- : make[2]: Entering directory '/tmp/ruby/build/trunk/ext/pathname' I, [2024-05-22T19:21:36.465824 #4129944] INFO -- : make[2]: Leaving directory '/tmp/ruby/build/trunk/ext/pathname' I, [2024-05-22T19:21:36.473392 #4129944] INFO -- : make[2]: Entering directory '/tmp/ruby/build/trunk/ext/psych' I, [2024-05-22T19:21:36.493563 #4129944] INFO -- : make[2]: Leaving directory '/tmp/ruby/build/trunk/ext/psych' I, [2024-05-22T19:21:36.497973 #4129944] INFO -- : make[2]: Entering directory '/tmp/ruby/build/trunk/ext/pty' I, [2024-05-22T19:21:36.501294 #4129944] INFO -- : make[2]: Leaving directory '/tmp/ruby/build/trunk/ext/pty' I, [2024-05-22T19:21:36.516284 #4129944] INFO -- : make[2]: Entering directory '/tmp/ruby/build/trunk/ext/ripper' I, [2024-05-22T19:21:36.522388 #4129944] INFO -- : make[2]: Leaving directory '/tmp/ruby/build/trunk/ext/ripper' I, [2024-05-22T19:21:36.524261 #4129944] INFO -- : make[2]: Entering directory '/tmp/ruby/build/trunk/ext/rubyvm' I, [2024-05-22T19:21:36.527012 #4129944] INFO -- : make[2]: Leaving directory '/tmp/ruby/build/trunk/ext/rubyvm' I, [2024-05-22T19:21:36.536950 #4129944] INFO -- : make[2]: Entering directory '/tmp/ruby/build/trunk/ext/socket' I, [2024-05-22T19:21:36.543490 #4129944] INFO -- : make[2]: Leaving directory '/tmp/ruby/build/trunk/ext/socket' I, [2024-05-22T19:21:36.557118 #4129944] INFO -- : make[2]: Entering directory '/tmp/ruby/build/trunk/.bundle/gems/bigdecimal-3.1.8/ext/bigdecimal' I, [2024-05-22T19:21:36.584000 #4129944] INFO -- : make[2]: Leaving directory '/tmp/ruby/build/trunk/.bundle/gems/bigdecimal-3.1.8/ext/bigdecimal' I, [2024-05-22T19:21:36.586143 #4129944] INFO -- : make[2]: Entering directory '/tmp/ruby/build/trunk/.bundle/gems/debug-1.9.2/ext/debug' I, [2024-05-22T19:21:36.608220 #4129944] INFO -- : make[2]: Leaving directory '/tmp/ruby/build/trunk/.bundle/gems/debug-1.9.2/ext/debug' I, [2024-05-22T19:21:36.610161 #4129944] INFO -- : make[2]: Entering directory '/tmp/ruby/build/trunk/.bundle/gems/nkf-0.2.0/ext/nkf' I, [2024-05-22T19:21:36.631930 #4129944] INFO -- : make[2]: Leaving directory '/tmp/ruby/build/trunk/.bundle/gems/nkf-0.2.0/ext/nkf' I, [2024-05-22T19:21:36.633696 #4129944] INFO -- : make[2]: Entering directory '/tmp/ruby/build/trunk/.bundle/gems/racc-1.7.3/ext/racc/cparse' I, [2024-05-22T19:21:36.658815 #4129944] INFO -- : make[2]: Leaving directory '/tmp/ruby/build/trunk/.bundle/gems/racc-1.7.3/ext/racc/cparse' I, [2024-05-22T19:21:36.660801 #4129944] INFO -- : make[2]: Entering directory '/tmp/ruby/build/trunk/.bundle/gems/racc-1.8.0/ext/racc/cparse' I, [2024-05-22T19:21:36.682722 #4129944] INFO -- : make[2]: Leaving directory '/tmp/ruby/build/trunk/.bundle/gems/racc-1.8.0/ext/racc/cparse' I, [2024-05-22T19:21:36.685102 #4129944] INFO -- : make[2]: Entering directory '/tmp/ruby/build/trunk/.bundle/gems/rbs-3.4.4/ext/rbs_extension' I, [2024-05-22T19:21:36.707632 #4129944] INFO -- : make[2]: Leaving directory '/tmp/ruby/build/trunk/.bundle/gems/rbs-3.4.4/ext/rbs_extension' I, [2024-05-22T19:21:36.709582 #4129944] INFO -- : make[2]: Entering directory '/tmp/ruby/build/trunk/.bundle/gems/syslog-0.1.2/ext/syslog' I, [2024-05-22T19:21:36.730846 #4129944] INFO -- : make[2]: Leaving directory '/tmp/ruby/build/trunk/.bundle/gems/syslog-0.1.2/ext/syslog' I, [2024-05-22T19:21:36.757978 #4129944] INFO -- : make[2]: Entering directory '/tmp/ruby/build/trunk' I, [2024-05-22T19:21:36.823659 #4129944] INFO -- : make[2]: 'ruby' is up to date. I, [2024-05-22T19:21:36.823713 #4129944] INFO -- : make[2]: Leaving directory '/tmp/ruby/build/trunk' I, [2024-05-22T19:21:36.824120 #4129944] INFO -- : make[1]: Leaving directory '/tmp/ruby/build/trunk' I, [2024-05-22T19:21:36.827842 #4129944] INFO -- : make[1]: Entering directory '/tmp/ruby/build/trunk' I, [2024-05-22T19:21:36.827863 #4129944] INFO -- : make[1]: Nothing to be done for 'note'. I, [2024-05-22T19:21:36.827869 #4129944] INFO -- : make[1]: Leaving directory '/tmp/ruby/build/trunk' I, [2024-05-22T19:21:36.908353 #4129944] INFO -- : Run options: I, [2024-05-22T19:21:36.908412 #4129944] INFO -- : --seed=59209 I, [2024-05-22T19:21:36.908418 #4129944] INFO -- : "--ruby=./miniruby -I/tmp/ruby/src/trunk/lib -I. -I.ext/common /tmp/ruby/src/trunk/tool/runruby.rb --extout=.ext -- --disable-gems" I, [2024-05-22T19:21:36.908422 #4129944] INFO -- : --excludes-dir=/tmp/ruby/src/trunk/test/.excludes I, [2024-05-22T19:21:36.908425 #4129944] INFO -- : --name=!/memory_leak/ I, [2024-05-22T19:21:36.908433 #4129944] INFO -- : --stderr-on-failure I, [2024-05-22T19:21:36.908436 #4129944] INFO -- : -j20 I, [2024-05-22T19:21:36.908440 #4129944] INFO -- : I, [2024-05-22T19:21:36.908444 #4129944] INFO -- : # Running tests: I, [2024-05-22T19:21:36.908447 #4129944] INFO -- : I, [2024-05-22T19:21:37.056610 #4129944] INFO -- : [ 1/885] 4171291=test_ssl I, [2024-05-22T19:21:37.056724 #4129944] INFO -- : [ 2/885] 4171289=test_ractor I, [2024-05-22T19:21:37.056814 #4129944] INFO -- : [ 3/885] 4171288=test_thread I, [2024-05-22T19:21:37.057893 #4129944] INFO -- : [ 4/885] 4171290=json_ext_parser_test I, [2024-05-22T19:21:37.058188 #4129944] INFO -- : [ 5/885] 4171293=test_my_integer I, [2024-05-22T19:21:37.059332 #4129944] INFO -- : [ 6/885] 4171292=test_rendering I, [2024-05-22T19:21:37.059614 #4129944] INFO -- : [ 7/885] 4171302=test_debugger_integration I, [2024-05-22T19:21:37.060691 #4129944] INFO -- : [ 8/885] 4171304=test_unicode_normalize I, [2024-05-22T19:21:37.061453 #4129944] INFO -- : [ 9/885] 4171303=test_marshal I, [2024-05-22T19:21:37.061602 #4129944] INFO -- : [ 10/885] 4171306=test_nonblock I, [2024-05-22T19:21:37.063521 #4129944] INFO -- : [ 11/885] 4171307=test_weakref I, [2024-05-22T19:21:37.066165 #4129944] INFO -- : [ 12/885] 4171293=test_alias I, [2024-05-22T19:21:37.070062 #4129944] INFO -- : [ 13/885] 4171290=test_timeout I, [2024-05-22T19:21:37.085335 #4129944] INFO -- : [ 14/885] 4171302=test_singleton_function I, [2024-05-22T19:21:37.087257 #4129944] INFO -- : [ 15/885] 4171306=test_ancdata I, [2024-05-22T19:21:37.089591 #4129944] INFO -- : [ 16/885] 4171302=test_rb_str_dup I, [2024-05-22T19:21:37.091935 #4129944] INFO -- : [ 17/885] 4171294=test_reline_key I, [2024-05-22T19:21:37.096061 #4129944] INFO -- : [ 18/885] 4171306=test_cgi_core I, [2024-05-22T19:21:37.096207 #4129944] INFO -- : [ 19/885] 4171296=test_parser I, [2024-05-22T19:21:37.096268 #4129944] INFO -- : [ 20/885] 4171298=parse_stream_test I, [2024-05-22T19:21:37.096353 #4129944] INFO -- : [ 21/885] 4171299=test_registry I, [2024-05-22T19:21:37.096452 #4129944] INFO -- : [ 22/885] 4171300=test_dns I, [2024-05-22T19:21:37.096574 #4129944] INFO -- : [ 23/885] 4171301=test_gem_commands_open_command I, [2024-05-22T19:21:37.096638 #4129944] INFO -- : [ 24/885] 4171305=test_ractor I, [2024-05-22T19:21:37.097037 #4129944] INFO -- : [ 25/885] 4171302=test_gem_source_lock I, [2024-05-22T19:21:37.104549 #4129944] INFO -- : [ 26/885] 4171299=test_gem I, [2024-05-22T19:21:37.105733 #4129944] INFO -- : [ 27/885] 4171297=test_rdoc_attr I, [2024-05-22T19:21:37.112611 #4129944] INFO -- : [ 28/885] 4171295=test_env I, [2024-05-22T19:21:37.115186 #4129944] INFO -- : [ 29/885] 4171306=desugar_compiler_test I, [2024-05-22T19:21:37.127194 #4129944] INFO -- : [ 30/885] 4171292=test_integer I, [2024-05-22T19:21:37.132865 #4129944] INFO -- : [ 31/885] 4171305=test_dryrun I, [2024-05-22T19:21:37.142104 #4129944] INFO -- : [ 32/885] 4171296=test_gem_commands_setup_command I, [2024-05-22T19:21:37.162509 #4129944] INFO -- : [ 33/885] 4171305=test_cgi_modruby I, [2024-05-22T19:21:37.164161 #4129944] INFO -- : [ 34/885] 4171294=test_integer I, [2024-05-22T19:21:37.164220 #4129944] INFO -- : [ 35/885] 4171298=test_super I, [2024-05-22T19:21:37.171453 #4129944] INFO -- : [ 36/885] 4171305=test_rubyoptions I, [2024-05-22T19:21:37.190431 #4129944] INFO -- : [ 37/885] 4171307=test_https_proxy I, [2024-05-22T19:21:37.204722 #4129944] INFO -- : [ 38/885] 4171292=test_call I, [2024-05-22T19:21:37.217285 #4129944] INFO -- : [ 39/885] 4171306=test_rubygems I, [2024-05-22T19:21:37.223872 #4129944] INFO -- : [ 40/885] 4171293=test_nextafter I, [2024-05-22T19:21:37.231723 #4129944] INFO -- : [ 41/885] 4171297=test_capacity I, [2024-05-22T19:21:37.242253 #4129944] INFO -- : [ 42/885] 4171297=test_gem_request_set_lockfile_tokenizer I, [2024-05-22T19:21:37.279421 #4129944] INFO -- : [ 43/885] 4171293=test_stat I, [2024-05-22T19:21:37.282538 #4129944] INFO -- : [ 44/885] 4171293=test_have_func I, [2024-05-22T19:21:37.289990 #4129944] INFO -- : [ 45/885] 4171307=test_gem_resolver_git_specification I, [2024-05-22T19:21:37.325920 #4129944] INFO -- : [ 46/885] 4171292=test_object_references I, [2024-05-22T19:21:37.349591 #4129944] INFO -- : [ 47/885] 4171301=test_usrmarshal I, [2024-05-22T19:21:37.350992 #4129944] INFO -- : [ 48/885] 4171303=test_gem_resolver_requirement_list I, [2024-05-22T19:21:37.355405 #4129944] INFO -- : [ 49/885] 4171292=test_arith_seq_beg_len_step I, [2024-05-22T19:21:37.392511 #4129944] INFO -- : [ 50/885] 4171302=test_pkcs7 I, [2024-05-22T19:21:37.403686 #4129944] INFO -- : [ 51/885] 4171292=test_function_entry I, [2024-05-22T19:21:37.406615 #4129944] INFO -- : [ 52/885] 4171289=test_symbol I, [2024-05-22T19:21:37.411008 #4129944] INFO -- : [ 53/885] 4171292=test_coder I, [2024-05-22T19:21:37.421669 #4129944] INFO -- : [ 54/885] 4171292=test_nofree I, [2024-05-22T19:21:37.425795 #4129944] INFO -- : [ 55/885] 4171292=test_context I, [2024-05-22T19:21:37.466258 #4129944] INFO -- : [ 56/885] 4171297=test_gem_commands_pristine_command I, [2024-05-22T19:21:37.496795 #4129944] INFO -- : [ 57/885] 4171303=ruby_api_test I, [2024-05-22T19:21:37.504256 #4129944] INFO -- : [ 58/885] 4171298=test_find_executable I, [2024-05-22T19:21:37.528334 #4129944] INFO -- : [ 59/885] 4171298=test_enc_associate I, [2024-05-22T19:21:37.569380 #4129944] INFO -- : [ 60/885] 4171302=test_lazy_enumerator I, [2024-05-22T19:21:37.572393 #4129944] INFO -- : [ 61/885] 4171292=test_unix I, [2024-05-22T19:21:37.574313 #4129944] INFO -- : [ 62/885] 4171306=test_ractor_compatibility I, [2024-05-22T19:21:37.587912 #4129944] INFO -- : [ 63/885] 4171300=test_eval I, [2024-05-22T19:21:37.590678 #4129944] INFO -- : [ 64/885] 4171300=test_autoconf I, [2024-05-22T19:21:37.592423 #4129944] INFO -- : [ 65/885] 4171300=test_date_ractor I, [2024-05-22T19:21:37.607737 #4129944] INFO -- : [ 66/885] 4171301=test_gem_console_ui I, [2024-05-22T19:21:37.609067 #4129944] INFO -- : [ 67/885] 4171292=format_errors_test I, [2024-05-22T19:21:37.616895 #4129944] INFO -- : [ 68/885] 4171301=test_dir I, [2024-05-22T19:21:37.625858 #4129944] INFO -- : [ 69/885] 4171291=test_gem_commands_cleanup_command I, [2024-05-22T19:21:37.681093 #4129944] INFO -- : [ 70/885] 4171292=test_word I, [2024-05-22T19:21:37.683575 #4129944] INFO -- : [ 71/885] 4171292=test_cgi_multipart I, [2024-05-22T19:21:37.695991 #4129944] INFO -- : [ 72/885] 4171307=test_numeric I, [2024-05-22T19:21:37.702599 #4129944] INFO -- : [ 73/885] 4171303=test_member I, [2024-05-22T19:21:37.706565 #4129944] INFO -- : [ 74/885] 4171303=test_gem_source_fetch_problem I, [2024-05-22T19:21:37.718165 #4129944] INFO -- : [ 75/885] 4171303=json_generic_object_test I, [2024-05-22T19:21:37.723000 #4129944] INFO -- : [ 76/885] 4171307=test_http_request I, [2024-05-22T19:21:37.727498 #4129944] INFO -- : [ 77/885] 4171307=test_rdoc_generator_darkfish I, [2024-05-22T19:21:37.739449 #4129944] INFO -- : [ 78/885] 4171303=test_error_highlight I, [2024-05-22T19:21:37.864393 #4129944] INFO -- : [ 79/885] 4171300=test_resize I, [2024-05-22T19:21:37.867109 #4129944] INFO -- : [ 80/885] 4171300=test_rdoc_comment I, [2024-05-22T19:21:37.875406 #4129944] INFO -- : [ 81/885] 4171301=test_mailto I, [2024-05-22T19:21:37.889701 #4129944] INFO -- : [ 82/885] 4171292=test_coderange I, [2024-05-22T19:21:37.891933 #4129944] INFO -- : [ 83/885] 4171292=test_symbol I, [2024-05-22T19:21:37.892145 #4129944] INFO -- : [ 84/885] 4171301=location_test I, [2024-05-22T19:21:37.911219 #4129944] INFO -- : [ 85/885] 4171302=test_rdoc_extend I, [2024-05-22T19:21:37.912118 #4129944] INFO -- : [ 86/885] 4171292=test_merge_keys I, [2024-05-22T19:21:37.921592 #4129944] INFO -- : [ 87/885] 4171292=test_gem_resolver_api_specification I, [2024-05-22T19:21:37.924832 #4129944] INFO -- : [ 88/885] 4171290=test_ipaddr I, [2024-05-22T19:21:37.956385 #4129944] INFO -- : [ 89/885] 4171290=test_rdoc_markup_to_ansi I, [2024-05-22T19:21:37.963832 #4129944] INFO -- : [ 90/885] 4171306=test_mixed_unicode_escapes I, [2024-05-22T19:21:37.965832 #4129944] INFO -- : [ 91/885] 4171306=test_history I, [2024-05-22T19:21:37.979728 #4129944] INFO -- : [ 92/885] 4171296=test_win32ole_variant I, [2024-05-22T19:21:37.987342 #4129944] INFO -- : [ 93/885] 4171296=test_win32ole_variable I, [2024-05-22T19:21:37.989459 #4129944] INFO -- : [ 94/885] 4171296=test_io_wait_uncommon I, [2024-05-22T19:21:37.995017 #4129944] INFO -- : [ 95/885] 4171296=test_stringio I, [2024-05-22T19:21:38.008690 #4129944] INFO -- : [ 96/885] 4171301=test_arity I, [2024-05-22T19:21:38.012908 #4129944] INFO -- : [ 97/885] 4171301=test_gem_ci_detector I, [2024-05-22T19:21:38.024717 #4129944] INFO -- : [ 98/885] 4171301=test_rdoc_class_module I, [2024-05-22T19:21:38.033200 #4129944] INFO -- : [ 99/885] 4171306=test_bignum I, [2024-05-22T19:21:38.046644 #4129944] INFO -- : [100/885] 4171300=test_rdoc_generator_json_index I, [2024-05-22T19:21:38.082353 #4129944] INFO -- : [101/885] 4171296=test_win32ole_event I, [2024-05-22T19:21:38.085592 #4129944] INFO -- : [102/885] 4171296=test_time_tz I, [2024-05-22T19:21:38.102043 #4129944] INFO -- : [103/885] 4171290=test_trace I, [2024-05-22T19:21:38.105602 #4129944] INFO -- : [104/885] 4171290=ractor_test I, [2024-05-22T19:21:38.116736 #4129944] INFO -- : [105/885] 4171302=test_have_macro I, [2024-05-22T19:21:38.140849 #4129944] INFO -- : [106/885] 4171300=test_gem_package I, [2024-05-22T19:21:38.145683 #4129944] INFO -- : [107/885] 4171292=test_complex2 I, [2024-05-22T19:21:38.151918 #4129944] INFO -- : [108/885] 4171296=test_resolve_symbol I, [2024-05-22T19:21:38.165398 #4129944] INFO -- : [109/885] 4171292=test_threadgroup I, [2024-05-22T19:21:38.166609 #4129944] INFO -- : [110/885] 4171290=test_enum I, [2024-05-22T19:21:38.177562 #4129944] INFO -- : [111/885] 4171298=test_gem_specification I, [2024-05-22T19:21:38.195506 #4129944] INFO -- : [112/885] 4171303=test_sleep I, [2024-05-22T19:21:38.210732 #4129944] INFO -- : [113/885] 4171291=test_object I, [2024-05-22T19:21:38.232239 #4129944] INFO -- : [114/885] 4171296=test_ruby_lex I, [2024-05-22T19:21:38.336419 #4129944] INFO -- : [115/885] 4171307=test_date_arith I, [2024-05-22T19:21:38.348449 #4129944] INFO -- : [116/885] 4171307=test_gem_local_remote_options I, [2024-05-22T19:21:38.394860 #4129944] INFO -- : [117/885] 4171307=test_timeout I, [2024-05-22T19:21:38.397120 #4129944] INFO -- : [118/885] 4171296=test_normalize I, [2024-05-22T19:21:38.400357 #4129944] INFO -- : [119/885] 4171296=test_ossl I, [2024-05-22T19:21:38.405007 #4129944] INFO -- : [120/885] 4171307=test_change_word I, [2024-05-22T19:21:38.414428 #4129944] INFO -- : [121/885] 4171307=test_flip I, [2024-05-22T19:21:38.430083 #4129944] INFO -- : [122/885] 4171307=compiler_test I, [2024-05-22T19:21:38.477359 #4129944] INFO -- : [123/885] 4171307=test_signedness I, [2024-05-22T19:21:38.556653 #4129944] INFO -- : [124/885] 4171289=test_tsort I, [2024-05-22T19:21:38.561534 #4129944] INFO -- : [125/885] 4171291=test_rdoc_rd_block_parser I, [2024-05-22T19:21:38.562152 #4129944] INFO -- : [126/885] 4171289=test_big5 I, [2024-05-22T19:21:38.564794 #4129944] INFO -- : [127/885] 4171289=test_func I, [2024-05-22T19:21:38.616842 #4129944] INFO -- : [128/885] 4171302=test_pointer I, [2024-05-22T19:21:38.663520 #4129944] INFO -- : [129/885] 4171301=test_ractor I, [2024-05-22T19:21:38.696727 #4129944] INFO -- : [130/885] 4171291=test_type I, [2024-05-22T19:21:38.704474 #4129944] INFO -- : [131/885] 4171291=version_test I, [2024-05-22T19:21:38.723734 #4129944] INFO -- : [132/885] 4171301=test_object I, [2024-05-22T19:21:38.747329 #4129944] INFO -- : [133/885] 4171301=heredoc_dedent_test I, [2024-05-22T19:21:38.756990 #4129944] INFO -- : [134/885] 4171301=test_cgi_header I, [2024-05-22T19:21:38.772125 #4129944] INFO -- : [135/885] 4171301=test_arithmetic_sequence I, [2024-05-22T19:21:38.786049 #4129944] INFO -- : [136/885] 4171301=test_basicinstructions I, [2024-05-22T19:21:38.793147 #4129944] INFO -- : [137/885] 4171291=test_gem_gemcutter_utilities I, [2024-05-22T19:21:38.824374 #4129944] INFO -- : [138/885] 4171297=test_gem_command_manager I, [2024-05-22T19:21:38.848446 #4129944] INFO -- : [139/885] 4171293=test_key_actor_emacs I, [2024-05-22T19:21:38.859393 #4129944] INFO -- : [140/885] 4171301=test_logger I, [2024-05-22T19:21:38.861536 #4129944] INFO -- : [141/885] 4171289=test_file_exhaustive I, [2024-05-22T19:21:38.873292 #4129944] INFO -- : [142/885] 4171301=test_files_test I, [2024-05-22T19:21:38.924355 #4129944] INFO -- : [143/885] 4171300=test_gem_update_suggestion I, [2024-05-22T19:21:38.944290 #4129944] INFO -- : [144/885] 4171301=test_rdoc_parser_markdown I, [2024-05-22T19:21:38.955458 #4129944] INFO -- : [145/885] 4171301=test_not I, [2024-05-22T19:21:38.957854 #4129944] INFO -- : [146/885] 4171301=test_gem_resolver_lock_set I, [2024-05-22T19:21:38.964892 #4129944] INFO -- : [147/885] 4171297=test_import I, [2024-05-22T19:21:38.979201 #4129944] INFO -- : [148/885] 4171302=test_gem_platform I, [2024-05-22T19:21:38.981657 #4129944] INFO -- : [149/885] 4171301=test_placearg I, [2024-05-22T19:21:38.996332 #4129944] INFO -- : [150/885] 4171300=test_gem_package_task I, [2024-05-22T19:21:39.002177 #4129944] INFO -- : [151/885] 4171300=test_date_strptime I, [2024-05-22T19:21:39.007929 #4129944] INFO -- : [152/885] 4171290=test_rdoc_markup_hard_break I, [2024-05-22T19:21:39.011553 #4129944] INFO -- : [153/885] 4171290=test_gem_commands_push_command I, [2024-05-22T19:21:39.034141 #4129944] INFO -- : [154/885] 4171293=test_weakkeymap I, [2024-05-22T19:21:39.051882 #4129944] INFO -- : [155/885] 4171302=test_numhash I, [2024-05-22T19:21:39.057448 #4129944] INFO -- : [156/885] 4171302=test_pkey_rsa I, [2024-05-22T19:21:39.107906 #4129944] INFO -- : [157/885] 4171301=test_keyword I, [2024-05-22T19:21:39.122141 #4129944] INFO -- : [158/885] 4171291=test_class_name_check I, [2024-05-22T19:21:39.134963 #4129944] INFO -- : [159/885] 4171291=test_fd_setsize I, [2024-05-22T19:21:39.135025 #4129944] INFO -- : [160/885] 4171291=test_continuation I, [2024-05-22T19:21:39.140585 #4129944] INFO -- : [161/885] 4171291=test_win32ole_method I, [2024-05-22T19:21:39.144120 #4129944] INFO -- : [162/885] 4171291=test_delete I, [2024-05-22T19:21:39.147068 #4129944] INFO -- : [163/885] 4171291=test_update I, [2024-05-22T19:21:39.149620 #4129944] INFO -- : [164/885] 4171291=test_x509name I, [2024-05-22T19:21:39.151857 #4129944] INFO -- : [165/885] 4171293=test_fips I, [2024-05-22T19:21:39.159800 #4129944] INFO -- : [166/885] 4171300=test_x509store I, [2024-05-22T19:21:39.162312 #4129944] INFO -- : [167/885] 4171291=test_rdoc_code_object I, [2024-05-22T19:21:39.170064 #4129944] INFO -- : [168/885] 4171292=test_webauthn_listener I, [2024-05-22T19:21:39.221459 #4129944] INFO -- : [169/885] 4171292=test_helper I, [2024-05-22T19:21:39.224065 #4129944] INFO -- : [170/885] 4171292=test_random_formatter I, [2024-05-22T19:21:39.241318 #4129944] INFO -- : [171/885] 4171292=test_jaro_winkler I, [2024-05-22T19:21:39.249697 #4129944] INFO -- : [172/885] 4171292=test_lambda I, [2024-05-22T19:21:39.266739 #4129944] INFO -- : [173/885] 4171302=test_ast I, [2024-05-22T19:21:39.299924 #4129944] INFO -- : [174/885] 4171299=test_gem_request_set_gem_dependency_api I, [2024-05-22T19:21:39.315170 #4129944] INFO -- : [175/885] 4171292=test_gem_resolver_api_set I, [2024-05-22T19:21:39.378767 #4129944] INFO -- : [176/885] 4171292=test_gem_safe_marshal I, [2024-05-22T19:21:39.456461 #4129944] INFO -- : [177/885] 4171291=test_enumerable I, [2024-05-22T19:21:39.462512 #4129944] INFO -- : [178/885] 4171291=test_config I, [2024-05-22T19:21:39.473112 #4129944] INFO -- : [179/885] 4171299=test_gem_resolver_vendor_set I, [2024-05-22T19:21:39.478439 #4129944] INFO -- : [180/885] 4171293=json_generator_test I, [2024-05-22T19:21:39.490318 #4129944] INFO -- : [181/885] 4171299=test_eval I, [2024-05-22T19:21:39.547947 #4129944] INFO -- : [182/885] 4171293=test_transcode I, [2024-05-22T19:21:39.558386 #4129944] INFO -- : [183/885] 4171297=test_range I, [2024-05-22T19:21:39.570225 #4129944] INFO -- : [184/885] 4171300=test_project_sanity I, [2024-05-22T19:21:39.590155 #4129944] INFO -- : [185/885] 4171301=command_line_test I, [2024-05-22T19:21:39.594990 #4129944] INFO -- : [186/885] 4171301=test_dup I, [2024-05-22T19:21:39.616404 #4129944] INFO -- : [187/885] 4171300=test_pty I, [2024-05-22T19:21:39.690421 #4129944] INFO -- : [188/885] 4171299=test_constant I, [2024-05-22T19:21:39.702567 #4129944] INFO -- : [189/885] 4171304=test_erb_command I, [2024-05-22T19:21:39.734221 #4129944] INFO -- : [190/885] 4171304=test_helper I, [2024-05-22T19:21:39.740076 #4129944] INFO -- : [191/885] 4171304=test_encoding I, [2024-05-22T19:21:39.774358 #4129944] INFO -- : [192/885] 4171293=test_gem_uri_formatter I, [2024-05-22T19:21:39.780226 #4129944] INFO -- : [193/885] 4171301=test_ensured I, [2024-05-22T19:21:39.781537 #4129944] INFO -- : [194/885] 4171290=test_addr I, [2024-05-22T19:21:39.793643 #4129944] INFO -- : [195/885] 4171292=test_locale I, [2024-05-22T19:21:39.811171 #4129944] INFO -- : [196/885] 4171290=library_symbols_test I, [2024-05-22T19:21:39.822226 #4129944] INFO -- : [197/885] 4171292=test_ts I, [2024-05-22T19:21:39.836942 #4129944] INFO -- : [198/885] 4171301=test_rdoc_ri_paths I, [2024-05-22T19:21:39.860170 #4129944] INFO -- : [199/885] 4171295=test_tmpdir I, [2024-05-22T19:21:39.860926 #4129944] INFO -- : [200/885] 4171301=test_integer_comb I, [2024-05-22T19:21:39.898680 #4129944] INFO -- : [201/885] 4171290=test_rdoc_markup_document I, [2024-05-22T19:21:39.907079 #4129944] INFO -- : [202/885] 4171290=test_vm_dump I, [2024-05-22T19:21:39.908474 #4129944] INFO -- : [203/885] 4171290=errors_test I, [2024-05-22T19:21:39.927933 #4129944] INFO -- : [204/885] 4171294=test_regexp I, [2024-05-22T19:21:39.932960 #4129944] INFO -- : [205/885] 4171295=test_gem_commands_check_command I, [2024-05-22T19:21:39.972349 #4129944] INFO -- : [206/885] 4171293=static_inspect_test I, [2024-05-22T19:21:39.975317 #4129944] INFO -- : [207/885] 4171304=test_udp I, [2024-05-22T19:21:39.980687 #4129944] INFO -- : [208/885] 4171291=bom_test I, [2024-05-22T19:21:39.985378 #4129944] INFO -- : [209/885] 4171298=test_data_error I, [2024-05-22T19:21:39.990204 #4129944] INFO -- : [210/885] 4171291=unescape_test I, [2024-05-22T19:21:39.992216 #4129944] INFO -- : [211/885] 4171304=test_ostruct I, [2024-05-22T19:21:40.001971 #4129944] INFO -- : [212/885] 4171290=test_force_exit I, [2024-05-22T19:21:40.057196 #4129944] INFO -- : [213/885] 4171298=test_file I, [2024-05-22T19:21:40.061239 #4129944] INFO -- : [214/885] 4171293=test_exit I, [2024-05-22T19:21:40.081508 #4129944] INFO -- : [215/885] 4171300=test_recursion I, [2024-05-22T19:21:40.087757 #4129944] INFO -- : [216/885] 4171300=test_history I, [2024-05-22T19:21:40.093647 #4129944] INFO -- : [217/885] 4171297=test_date_marshal I, [2024-05-22T19:21:40.094392 #4129944] INFO -- : [218/885] 4171297=test_mkmf I, [2024-05-22T19:21:40.102399 #4129944] INFO -- : [219/885] 4171290=test_delegate I, [2024-05-22T19:21:40.106955 #4129944] INFO -- : [220/885] 4171295=test_popen_deadlock I, [2024-05-22T19:21:40.115325 #4129944] INFO -- : [221/885] 4171290=test_bundled_ca I, [2024-05-22T19:21:40.119448 #4129944] INFO -- : [222/885] 4171297=test_closure I, [2024-05-22T19:21:40.137085 #4129944] INFO -- : [223/885] 4171293=test_fiber I, [2024-05-22T19:21:40.168214 #4129944] INFO -- : [224/885] 4171304=test_multi_irb_commands I, [2024-05-22T19:21:40.185657 #4129944] INFO -- : [225/885] 4171304=test_open3 I, [2024-05-22T19:21:40.222991 #4129944] INFO -- : [226/885] 4171300=test_ractor I, [2024-05-22T19:21:40.263887 #4129944] INFO -- : [227/885] 4171300=test_gem_security I, [2024-05-22T19:21:40.280918 #4129944] INFO -- : [228/885] 4171292=test_rdoc_servlet I, [2024-05-22T19:21:40.295897 #4129944] INFO -- : [229/885] 4171297=test_digest I, [2024-05-22T19:21:40.298986 #4129944] INFO -- : [230/885] 4171297=test_rdoc_markup_to_bs I, [2024-05-22T19:21:40.324067 #4129944] INFO -- : [231/885] 4171297=test_help I, [2024-05-22T19:21:40.332406 #4129944] INFO -- : [232/885] 4171297=test_gem_commands_unpack_command I, [2024-05-22T19:21:40.622193 #4129944] INFO -- : [233/885] 4171292=test_files_lib I, [2024-05-22T19:21:40.641915 #4129944] INFO -- : [234/885] 4171295=test_beginendblock I, [2024-05-22T19:21:40.679678 #4129944] INFO -- : [235/885] 4171297=reflection_test I, [2024-05-22T19:21:40.744184 #4129944] INFO -- : [236/885] 4171297=test_gem_bundler_version_finder I, [2024-05-22T19:21:40.766093 #4129944] INFO -- : [237/885] 4171297=test_emoji_breaks I, [2024-05-22T19:21:40.772800 #4129944] INFO -- : [238/885] 4171297=test_within_pipe I, [2024-05-22T19:21:40.777672 #4129944] INFO -- : [239/885] 4171306=test_pinned I, [2024-05-22T19:21:40.805642 #4129944] INFO -- : [240/885] 4171306=test_webauthn_listener_response I, [2024-05-22T19:21:40.820411 #4129944] INFO -- : [241/885] 4171306=test_time I, [2024-05-22T19:21:40.881653 #4129944] INFO -- : [242/885] 4171297=test_to_ary_concat I, [2024-05-22T19:21:40.889328 #4129944] INFO -- : [243/885] 4171307=test_stream I, [2024-05-22T19:21:40.890092 #4129944] INFO -- : [244/885] 4171291=test_printf I, [2024-05-22T19:21:40.894875 #4129944] INFO -- : [245/885] 4171307=test_rdoc_markup_pre_process I, [2024-05-22T19:21:40.903370 #4129944] INFO -- : [246/885] 4171291=test_rdoc_markup_heading I, [2024-05-22T19:21:40.911936 #4129944] INFO -- : [247/885] 4171291=test_iseq I, [2024-05-22T19:21:40.942488 #4129944] INFO -- : [248/885] 4171306=test_exception_at_throwing I, [2024-05-22T19:21:40.976191 #4129944] INFO -- : [249/885] 4171307=test_scheduler I, [2024-05-22T19:21:40.987806 #4129944] INFO -- : [250/885] 4171306=test_pkey_dsa I, [2024-05-22T19:21:41.030677 #4129944] INFO -- : [251/885] 4171295=test_class I, [2024-05-22T19:21:41.057072 #4129944] INFO -- : [252/885] 4171295=test_ocsp I, [2024-05-22T19:21:41.117945 #4129944] INFO -- : [253/885] 4171307=test_interned_str I, [2024-05-22T19:21:41.118329 #4129944] INFO -- : [254/885] 4171307=test_case_comprehensive I, [2024-05-22T19:21:41.402908 #4129944] INFO -- : [255/885] 4171295=test_gem_commands_build_command I, [2024-05-22T19:21:41.500778 #4129944] INFO -- : [256/885] 4171306=test_cmethod I, [2024-05-22T19:21:41.504546 #4129944] INFO -- : [257/885] 4171306=test_tracer I, [2024-05-22T19:21:41.538983 #4129944] INFO -- : [258/885] 4171306=test_append I, [2024-05-22T19:21:41.542261 #4129944] INFO -- : [259/885] 4171291=test_option I, [2024-05-22T19:21:41.545217 #4129944] INFO -- : [260/885] 4171306=test_gem_commands_server_command I, [2024-05-22T19:21:41.550976 #4129944] INFO -- : [261/885] 4171306=test_variable_name_check I, [2024-05-22T19:21:41.607823 #4129944] INFO -- : [262/885] 4171306=test_io_m17n I, [2024-05-22T19:21:41.684775 #4129944] INFO -- : [263/885] 4171291=test_did_you_mean I, [2024-05-22T19:21:41.694459 #4129944] INFO -- : [264/885] 4171295=test_koi8 I, [2024-05-22T19:21:41.700040 #4129944] INFO -- : [265/885] 4171295=parameters_signature_test I, [2024-05-22T19:21:41.755993 #4129944] INFO -- : [266/885] 4171295=test_rdoc_parser_changelog I, [2024-05-22T19:21:41.785762 #4129944] INFO -- : [267/885] 4171299=test_enumerator I, [2024-05-22T19:21:41.791575 #4129944] INFO -- : [268/885] 4171291=test_unicode I, [2024-05-22T19:21:41.793958 #4129944] INFO -- : [269/885] 4171299=test_rdoc_generator_pot I, [2024-05-22T19:21:41.825435 #4129944] INFO -- : [270/885] 4171290=test_gem_gem_runner I, [2024-05-22T19:21:41.843521 #4129944] INFO -- : [271/885] 4171291=test_filter I, [2024-05-22T19:21:41.869476 #4129944] INFO -- : [272/885] 4171291=static_literals_test I, [2024-05-22T19:21:41.875838 #4129944] INFO -- : [273/885] 4171291=test_data I, [2024-05-22T19:21:41.876236 #4129944] INFO -- : [274/885] 4171291=test_rdoc_method_attr I, [2024-05-22T19:21:41.877295 #4129944] INFO -- : [275/885] 4171290=test_key_event_record I, [2024-05-22T19:21:41.881279 #4129944] INFO -- : [276/885] 4171290=test_gem_uri I, [2024-05-22T19:21:41.915304 #4129944] INFO -- : [277/885] 4171290=test_random I, [2024-05-22T19:21:41.926621 #4129944] INFO -- : [278/885] 4171290=test_notimplement I, [2024-05-22T19:21:41.934335 #4129944] INFO -- : [279/885] 4171290=test_gem_commands_update_command I, [2024-05-22T19:21:41.935537 #4129944] INFO -- : [280/885] 4171299=test_gem_resolver_vendor_specification I, [2024-05-22T19:21:41.966933 #4129944] INFO -- : [281/885] 4171299=test_thread_cv I, [2024-05-22T19:21:41.986532 #4129944] INFO -- : [282/885] 4171291=test_lexer I, [2024-05-22T19:21:41.992849 #4129944] INFO -- : [283/885] 4171291=test_ssl_session I, [2024-05-22T19:21:42.017516 #4129944] INFO -- : [284/885] 4171295=test_compile_prism I, [2024-05-22T19:21:42.131197 #4129944] INFO -- : [285/885] 4171297=test_terminfo I, [2024-05-22T19:21:42.132643 #4129944] INFO -- : [286/885] 4171297=test_date_compat I, [2024-05-22T19:21:42.140848 #4129944] INFO -- : [287/885] 4171297=test_rdoc_markup_to_html I, [2024-05-22T19:21:42.228229 #4129944] INFO -- : [288/885] 4171297=test_bug-14834 I, [2024-05-22T19:21:42.276179 #4129944] INFO -- : [289/885] 4171297=test_addrinfo I, [2024-05-22T19:21:42.298759 #4129944] INFO -- : [290/885] 4171297=test_http I, [2024-05-22T19:21:42.299679 #4129944] INFO -- : [291/885] 4171295=test_tree_spell_checker I, [2024-05-22T19:21:42.333899 #4129944] INFO -- : [292/885] 4171304=test_path I, [2024-05-22T19:21:42.342407 #4129944] INFO -- : [293/885] 4171295=test_case_mapping I, [2024-05-22T19:21:42.343022 #4129944] INFO -- : [294/885] 4171304=redundant_return_test I, [2024-05-22T19:21:42.350882 #4129944] INFO -- : [295/885] 4171295=test_bn I, [2024-05-22T19:21:42.361282 #4129944] INFO -- : [296/885] 4171295=test_win32ole_param_event I, [2024-05-22T19:21:42.366589 #4129944] INFO -- : [297/885] 4171295=test_install I, [2024-05-22T19:21:42.427396 #4129944] INFO -- : [298/885] 4171304=test_rdoc_markup_to_label I, [2024-05-22T19:21:42.582968 #4129944] INFO -- : [299/885] 4171295=test_sockopt I, [2024-05-22T19:21:42.586109 #4129944] INFO -- : [300/885] 4171295=test_encoding I, [2024-05-22T19:21:42.606518 #4129944] INFO -- : [301/885] 4171295=test_httpresponses I, [2024-05-22T19:21:42.620347 #4129944] INFO -- : [302/885] 4171299=test_set_len I, [2024-05-22T19:21:42.622057 #4129944] INFO -- : [303/885] 4171299=test_httpheader I, [2024-05-22T19:21:42.652578 #4129944] INFO -- : [304/885] 4171295=test_gem_resolver_local_specification I, [2024-05-22T19:21:42.670934 #4129944] INFO -- : [305/885] 4171304=test_rdoc_ri_driver I, [2024-05-22T19:21:42.679118 #4129944] INFO -- : [306/885] 4171299=test_color I, [2024-05-22T19:21:42.681568 #4129944] INFO -- : [307/885] 4171295=json_encoding_test I, [2024-05-22T19:21:42.705561 #4129944] INFO -- : [308/885] 4171295=test_key_stroke I, [2024-05-22T19:21:42.773219 #4129944] INFO -- : [309/885] 4171306=test_rbconfig I, [2024-05-22T19:21:42.774734 #4129944] INFO -- : [310/885] 4171295=test_human_typo I, [2024-05-22T19:21:42.778413 #4129944] INFO -- : [311/885] 4171306=test_primitive I, [2024-05-22T19:21:42.778927 #4129944] INFO -- : [312/885] 4171295=test_name_error_extension I, [2024-05-22T19:21:42.784383 #4129944] INFO -- : [313/885] 4171295=test_chilled I, [2024-05-22T19:21:42.785430 #4129944] INFO -- : [314/885] 4171306=test_rdoc_i18n_locale I, [2024-05-22T19:21:42.787642 #4129944] INFO -- : [315/885] 4171295=test_win32ole_param I, [2024-05-22T19:21:42.794050 #4129944] INFO -- : [316/885] 4171295=test_gem_commands_yank_command I, [2024-05-22T19:21:42.824276 #4129944] INFO -- : [317/885] 4171299=test_pair I, [2024-05-22T19:21:42.892002 #4129944] INFO -- : [318/885] 4171300=test_document I, [2024-05-22T19:21:42.894895 #4129944] INFO -- : [319/885] 4171306=test_rdoc_generator_pot_po_entry I, [2024-05-22T19:21:42.901197 #4129944] INFO -- : [320/885] 4171300=test_euc_jp I, [2024-05-22T19:21:42.905311 #4129944] INFO -- : [321/885] 4171306=test_acceptable I, [2024-05-22T19:21:42.906687 #4129944] INFO -- : [322/885] 4171300=test_len I, [2024-05-22T19:21:42.910007 #4129944] INFO -- : [323/885] 4171300=test_yield_block I, [2024-05-22T19:21:42.913522 #4129944] INFO -- : [324/885] 4171300=test_completion I, [2024-05-22T19:21:42.988911 #4129944] INFO -- : [325/885] 4171304=test_gem_commands_cert_command I, [2024-05-22T19:21:43.005930 #4129944] INFO -- : [326/885] 4171306=test_x509ext I, [2024-05-22T19:21:43.016740 #4129944] INFO -- : [327/885] 4171306=test_erb I, [2024-05-22T19:21:43.042426 #4129944] INFO -- : [328/885] 4171301=test_gem_source_installed I, [2024-05-22T19:21:43.061285 #4129944] INFO -- : [329/885] 4171306=test_assembler I, [2024-05-22T19:21:43.064749 #4129944] INFO -- : [330/885] 4171306=attribute_write_test I, [2024-05-22T19:21:43.066004 #4129944] INFO -- : [331/885] 4171306=test_propertyputref I, [2024-05-22T19:21:43.067729 #4129944] INFO -- : [332/885] 4171306=test_spell_checker I, [2024-05-22T19:21:43.070652 #4129944] INFO -- : [333/885] 4171301=test_rational I, [2024-05-22T19:21:43.073427 #4129944] INFO -- : [334/885] 4171291=test_rational2 I, [2024-05-22T19:21:43.076752 #4129944] INFO -- : [335/885] 4171306=test_gem_source I, [2024-05-22T19:21:43.086641 #4129944] INFO -- : [336/885] 4171301=test_scalar_scanner I, [2024-05-22T19:21:43.087970 #4129944] INFO -- : [337/885] 4171291=test_gem_commands_outdated_command I, [2024-05-22T19:21:43.099365 #4129944] INFO -- : [338/885] 4171301=test_gem_package_tar_writer I, [2024-05-22T19:21:43.105332 #4129944] INFO -- : [339/885] 4171292=test_helper_method I, [2024-05-22T19:21:43.119607 #4129944] INFO -- : [340/885] 4171291=test_array I, [2024-05-22T19:21:43.127247 #4129944] INFO -- : [341/885] 4171292=test_gem_dependency_list I, [2024-05-22T19:21:43.157424 #4129944] INFO -- : [342/885] 4171290=test_benchmark I, [2024-05-22T19:21:43.161750 #4129944] INFO -- : [343/885] 4171301=test_win32ole_method_event I, [2024-05-22T19:21:43.164617 #4129944] INFO -- : [344/885] 4171301=test_nesting_parser I, [2024-05-22T19:21:43.190655 #4129944] INFO -- : [345/885] 4171292=test_https I, [2024-05-22T19:21:43.199029 #4129944] INFO -- : [346/885] 4171303=test_gem_ext_builder I, [2024-05-22T19:21:43.223417 #4129944] INFO -- : [347/885] 4171289=test_evaluation I, [2024-05-22T19:21:43.231628 #4129944] INFO -- : [348/885] 4171289=test_abi I, [2024-05-22T19:21:43.252456 #4129944] INFO -- : [349/885] 4171295=test_provider I, [2024-05-22T19:21:43.269844 #4129944] INFO -- : [350/885] 4171301=test_rdoc_parser_simple I, [2024-05-22T19:21:43.280835 #4129944] INFO -- : [351/885] 4171301=test_gem_commands_rebuild_command I, [2024-05-22T19:21:43.324705 #4129944] INFO -- : [352/885] 4171301=test_yamldbm I, [2024-05-22T19:21:43.335088 #4129944] INFO -- : [353/885] 4171301=test_load I, [2024-05-22T19:21:43.338494 #4129944] INFO -- : [354/885] 4171301=test_whileuntil I, [2024-05-22T19:21:43.346277 #4129944] INFO -- : [355/885] 4171301=test_rdoc_generator_markup I, [2024-05-22T19:21:43.349772 #4129944] INFO -- : [356/885] 4171306=test_configuration I, [2024-05-22T19:21:43.351807 #4129944] INFO -- : [357/885] 4171301=test_rubyvm I, [2024-05-22T19:21:43.354955 #4129944] INFO -- : [358/885] 4171301=test_buffered_io I, [2024-05-22T19:21:43.395897 #4129944] INFO -- : [359/885] 4171300=test_monitor I, [2024-05-22T19:21:43.407128 #4129944] INFO -- : [360/885] 4171301=test_instrumentation_api I, [2024-05-22T19:21:43.408467 #4129944] INFO -- : [361/885] 4171289=integer_parse_test I, [2024-05-22T19:21:43.449788 #4129944] INFO -- : [362/885] 4171306=test_stringify_symbols I, [2024-05-22T19:21:43.459567 #4129944] INFO -- : [363/885] 4171306=test_boolean I, [2024-05-22T19:21:43.472486 #4129944] INFO -- : [364/885] 4171306=test_module I, [2024-05-22T19:21:43.476787 #4129944] INFO -- : [365/885] 4171289=test_gem_request_set I, [2024-05-22T19:21:43.552204 #4129944] INFO -- : [366/885] 4171292=constant_path_node_test I, [2024-05-22T19:21:43.573461 #4129944] INFO -- : [367/885] 4171292=test_gem_ext_cargo_builder I, [2024-05-22T19:21:43.573898 #4129944] INFO -- : [368/885] 4171295=test_ssl I, [2024-05-22T19:21:43.579030 #4129944] INFO -- : [369/885] 4171292=test_arith_seq_extract I, [2024-05-22T19:21:43.581785 #4129944] INFO -- : [370/885] 4171292=test_method_name_check I, [2024-05-22T19:21:43.592253 #4129944] INFO -- : [371/885] 4171292=test_parser I, [2024-05-22T19:21:43.605386 #4129944] INFO -- : [372/885] 4171292=test_serialize_subclasses I, [2024-05-22T19:21:43.612203 #4129944] INFO -- : [373/885] 4171292=test_insns_leaf I, [2024-05-22T19:21:43.614608 #4129944] INFO -- : [374/885] 4171292=test_color_printer I, [2024-05-22T19:21:43.617340 #4129944] INFO -- : [375/885] 4171292=test_deprecated I, [2024-05-22T19:21:43.618423 #4129944] INFO -- : [376/885] 4171292=test_engine I, [2024-05-22T19:21:43.621260 #4129944] INFO -- : [377/885] 4171292=test_win32ole_variant_m I, [2024-05-22T19:21:43.621592 #4129944] INFO -- : [378/885] 4171292=test_div I, [2024-05-22T19:21:43.623489 #4129944] INFO -- : [379/885] 4171300=test_allocation I, [2024-05-22T19:21:43.623947 #4129944] INFO -- : [380/885] 4171292=test_key_error I, [2024-05-22T19:21:43.628956 #4129944] INFO -- : [381/885] 4171292=test_x509req I, [2024-05-22T19:21:43.785830 #4129944] INFO -- : [382/885] 4171292=test_mutex I, [2024-05-22T19:21:43.885802 #4129944] INFO -- : [383/885] 4171289=test_rdoc_rd_inline I, [2024-05-22T19:21:44.048290 #4129944] INFO -- : [384/885] 4171289=test_files_test_1 I, [2024-05-22T19:21:44.067727 #4129944] INFO -- : [385/885] 4171303=test_set I, [2024-05-22T19:21:44.091617 #4129944] INFO -- : [386/885] 4171303=test_gem_path_support I, [2024-05-22T19:21:44.118611 #4129944] INFO -- : [387/885] 4171303=test_struct I, [2024-05-22T19:21:44.449341 #4129944] INFO -- : [388/885] 4171290=memsize_test I, [2024-05-22T19:21:44.450270 #4129944] INFO -- : [389/885] 4171290=json_parser_test I, [2024-05-22T19:21:44.464587 #4129944] INFO -- : [390/885] 4171303=test_nomethod_error I, [2024-05-22T19:21:44.470954 #4129944] INFO -- : [391/885] 4171303=test_config I, [2024-05-22T19:21:44.476844 #4129944] INFO -- : [392/885] 4171290=test_win32ole_variant_outarg I, [2024-05-22T19:21:44.479428 #4129944] INFO -- : [393/885] 4171290=test_gem_source_subpath_problem I, [2024-05-22T19:21:44.505495 #4129944] INFO -- : [394/885] 4171303=test_dln I, [2024-05-22T19:21:44.511232 #4129944] INFO -- : [395/885] 4171303=json_common_interface_test I, [2024-05-22T19:21:44.524986 #4129944] INFO -- : [396/885] 4171303=test_struct I, [2024-05-22T19:21:44.542485 #4129944] INFO -- : [397/885] 4171290=test_rdoc_markup_to_html_snippet I, [2024-05-22T19:21:44.544726 #4129944] INFO -- : [398/885] 4171303=magic_comment_test I, [2024-05-22T19:21:44.547572 #4129944] INFO -- : [399/885] 4171303=test_sexp I, [2024-05-22T19:21:44.555965 #4129944] INFO -- : [400/885] 4171303=test_rdoc_markup_include I, [2024-05-22T19:21:44.591298 #4129944] INFO -- : [401/885] 4171290=fuzzer_test I, [2024-05-22T19:21:44.598223 #4129944] INFO -- : [402/885] 4171290=test_variable I, [2024-05-22T19:21:44.642762 #4129944] INFO -- : [403/885] 4171303=test_pkg_config I, [2024-05-22T19:21:44.669382 #4129944] INFO -- : [404/885] 4171290=test_cparser I, [2024-05-22T19:21:44.672216 #4129944] INFO -- : [405/885] 4171303=test_debug I, [2024-05-22T19:21:44.675752 #4129944] INFO -- : [406/885] 4171303=pattern_test I, [2024-05-22T19:21:44.695486 #4129944] INFO -- : [407/885] 4171303=test_memory_view I, [2024-05-22T19:21:44.722741 #4129944] INFO -- : [408/885] 4171303=test_shellwords I, [2024-05-22T19:21:44.724629 #4129944] INFO -- : [409/885] 4171303=test_digest_extend I, [2024-05-22T19:21:44.741614 #4129944] INFO -- : [410/885] 4171303=test_string I, [2024-05-22T19:21:44.747653 #4129944] INFO -- : [411/885] 4171303=test_iterator I, [2024-05-22T19:21:44.810890 #4129944] INFO -- : [412/885] 4171303=test_omap I, [2024-05-22T19:21:44.817662 #4129944] INFO -- : [413/885] 4171303=test_gem_resolver_git_set I, [2024-05-22T19:21:44.910301 #4129944] INFO -- : [414/885] 4171292=test_storage I, [2024-05-22T19:21:44.921426 #4129944] INFO -- : [415/885] 4171292=test_new I, [2024-05-22T19:21:44.928487 #4129944] INFO -- : [416/885] 4171292=test_cipher I, [2024-05-22T19:21:44.977869 #4129944] INFO -- : [417/885] 4171292=test_gem_security_signer I, [2024-05-22T19:21:45.072589 #4129944] INFO -- : [418/885] 4171303=test_gem_commands_signout_command I, [2024-05-22T19:21:45.082344 #4129944] INFO -- : [419/885] 4171292=test_refinement I, [2024-05-22T19:21:45.086201 #4129944] INFO -- : [420/885] 4171303=test_regex_casefold I, [2024-05-22T19:21:45.137118 #4129944] INFO -- : [421/885] 4171304=test_gem_source_git I, [2024-05-22T19:21:45.170866 #4129944] INFO -- : [422/885] 4171290=test_dir_m17n I, [2024-05-22T19:21:45.313334 #4129944] INFO -- : [423/885] 4171306=test_gem_resolver_installer_set I, [2024-05-22T19:21:45.471658 #4129944] INFO -- : [424/885] 4171306=test_float I, [2024-05-22T19:21:45.629515 #4129944] INFO -- : [425/885] 4171304=test_cgi_cookie I, [2024-05-22T19:21:45.643586 #4129944] INFO -- : [426/885] 4171304=test_require I, [2024-05-22T19:21:45.671296 #4129944] INFO -- : [427/885] 4171303=test_process I, [2024-05-22T19:21:45.685986 #4129944] INFO -- : [428/885] 4171303=test_windows_1252 I, [2024-05-22T19:21:45.690781 #4129944] INFO -- : [429/885] 4171303=test_input_method I, [2024-05-22T19:21:45.736146 #4129944] INFO -- : [430/885] 4171305=test_cgi_session I, [2024-05-22T19:21:45.746477 #4129944] INFO -- : [431/885] 4171305=test_rdoc_rd I, [2024-05-22T19:21:45.782737 #4129944] INFO -- : [432/885] 4171303=test_metaclass I, [2024-05-22T19:21:45.788522 #4129944] INFO -- : [433/885] 4171303=test_rdoc_top_level I, [2024-05-22T19:21:45.798532 #4129944] INFO -- : [434/885] 4171288=test_signal I, [2024-05-22T19:21:45.837837 #4129944] INFO -- : [435/885] 4171305=test_fixnum I, [2024-05-22T19:21:45.846660 #4129944] INFO -- : [436/885] 4171305=test_x509crl I, [2024-05-22T19:21:45.859333 #4129944] INFO -- : [437/885] 4171300=test_pathname I, [2024-05-22T19:21:45.978108 #4129944] INFO -- : [438/885] 4171305=test_init I, [2024-05-22T19:21:45.998857 #4129944] INFO -- : [439/885] 4171293=test_complexrational I, [2024-05-22T19:21:46.005655 #4129944] INFO -- : [440/885] 4171293=test_gem_package_tar_reader I, [2024-05-22T19:21:46.011513 #4129944] INFO -- : [441/885] 4171303=regexp_test I, [2024-05-22T19:21:46.020477 #4129944] INFO -- : [442/885] 4171303=test_coverage I, [2024-05-22T19:21:46.038430 #4129944] INFO -- : [443/885] 4171293=test_rdoc_encoding I, [2024-05-22T19:21:46.071228 #4129944] INFO -- : [444/885] 4171300=test_file I, [2024-05-22T19:21:46.095267 #4129944] INFO -- : [445/885] 4171300=test_modify_expand I, [2024-05-22T19:21:46.096277 #4129944] INFO -- : [446/885] 4171300=test_rdoc_any_method I, [2024-05-22T19:21:46.139645 #4129944] INFO -- : [447/885] 4171298=test_gem_available_set I, [2024-05-22T19:21:46.148601 #4129944] INFO -- : [448/885] 4171299=test_rdoc_markdown I, [2024-05-22T19:21:46.162600 #4129944] INFO -- : [449/885] 4171293=test_formatter I, [2024-05-22T19:21:46.167385 #4129944] INFO -- : [450/885] 4171293=test_bash_completion I, [2024-05-22T19:21:46.170274 #4129944] INFO -- : [451/885] 4171293=test_rdoc_constant I, [2024-05-22T19:21:46.241545 #4129944] INFO -- : [452/885] 4171298=test_deprecate I, [2024-05-22T19:21:46.279608 #4129944] INFO -- : [453/885] 4171298=test_recorder I, [2024-05-22T19:21:46.287301 #4129944] INFO -- : [454/885] 4171298=test_gem_commands_owner_command I, [2024-05-22T19:21:46.290670 #4129944] INFO -- : [455/885] 4171305=test_gem_source_vendor I, [2024-05-22T19:21:46.292067 #4129944] INFO -- : [456/885] 4171293=test_digest I, [2024-05-22T19:21:46.317814 #4129944] INFO -- : [457/885] 4171299=test_marshalable I, [2024-05-22T19:21:46.322485 #4129944] INFO -- : [458/885] 4171299=test_require I, [2024-05-22T19:21:46.363398 #4129944] INFO -- : [459/885] 4171301=test_cgi_util I, [2024-05-22T19:21:46.399656 #4129944] INFO -- : [460/885] 4171305=test_gem_commands_contents_command I, [2024-05-22T19:21:46.444364 #4129944] INFO -- : [461/885] 4171300=test_gem_ext_cmake_builder I, [2024-05-22T19:21:46.455446 #4129944] INFO -- : [462/885] 4171300=test_wss I, [2024-05-22T19:21:46.462899 #4129944] INFO -- : [463/885] 4171300=test_fiddle I, [2024-05-22T19:21:46.474158 #4129944] INFO -- : [464/885] 4171290=test_find I, [2024-05-22T19:21:46.496598 #4129944] INFO -- : [465/885] 4171290=test_ractor I, [2024-05-22T19:21:46.507828 #4129944] INFO -- : [466/885] 4171300=json_fixtures_test I, [2024-05-22T19:21:46.509736 #4129944] INFO -- : [467/885] 4171305=test_shapes I, [2024-05-22T19:21:46.518680 #4129944] INFO -- : [468/885] 4171300=test_io_timeout I, [2024-05-22T19:21:46.521704 #4129944] INFO -- : [469/885] 4171305=test_rdoc_parser_c I, [2024-05-22T19:21:46.523515 #4129944] INFO -- : [470/885] 4171300=test_comparable I, [2024-05-22T19:21:46.531492 #4129944] INFO -- : [471/885] 4171300=test_enc_str_buf_cat I, [2024-05-22T19:21:46.536596 #4129944] INFO -- : [472/885] 4171300=test_class2name I, [2024-05-22T19:21:46.542887 #4129944] INFO -- : [473/885] 4171300=test_gbk I, [2024-05-22T19:21:46.549269 #4129944] INFO -- : [474/885] 4171300=test_profile_frames I, [2024-05-22T19:21:46.550589 #4129944] INFO -- : [475/885] 4171301=test_cstr I, [2024-05-22T19:21:46.588134 #4129944] INFO -- : [476/885] 4171290=test_pstore I, [2024-05-22T19:21:46.633841 #4129944] INFO -- : [477/885] 4171290=test_big2str I, [2024-05-22T19:21:46.639333 #4129944] INFO -- : [478/885] 4171290=test_handle I, [2024-05-22T19:21:46.643928 #4129944] INFO -- : [479/885] 4171289=test_wait I, [2024-05-22T19:21:46.700681 #4129944] INFO -- : [480/885] 4171303=test_forwardable I, [2024-05-22T19:21:46.715946 #4129944] INFO -- : [481/885] 4171289=test_yaml I, [2024-05-22T19:21:46.741419 #4129944] INFO -- : [482/885] 4171300=test_rdoc_markup_formatter I, [2024-05-22T19:21:46.746534 #4129944] INFO -- : [483/885] 4171303=test_thread_queue I, [2024-05-22T19:21:46.751424 #4129944] INFO -- : [484/885] 4171300=test_nowrite I, [2024-05-22T19:21:46.771636 #4129944] INFO -- : [485/885] 4171300=test_ansi_without_terminfo I, [2024-05-22T19:21:46.781196 #4129944] INFO -- : [486/885] 4171289=test_gem_commands_sources_command I, [2024-05-22T19:21:46.788642 #4129944] INFO -- : [487/885] 4171300=test_ractor I, [2024-05-22T19:21:46.803304 #4129944] INFO -- : [488/885] 4171300=test_euc_tw I, [2024-05-22T19:21:46.807655 #4129944] INFO -- : [489/885] 4171300=test_bmethod I, [2024-05-22T19:21:46.814929 #4129944] INFO -- : [490/885] 4171300=test_complex I, [2024-05-22T19:21:46.816904 #4129944] INFO -- : [491/885] 4171305=test_gem_commands_search_command I, [2024-05-22T19:21:46.820252 #4129944] INFO -- : [492/885] 4171306=test_method_cache I, [2024-05-22T19:21:46.820315 #4129944] INFO -- : [493/885] 4171306=test_gem_stub_specification I, [2024-05-22T19:21:46.826269 #4129944] INFO -- : [494/885] 4171305=test_frozen_error I, [2024-05-22T19:21:46.828713 #4129944] INFO -- : [495/885] 4171298=test_gem_ext_ext_conf_builder I, [2024-05-22T19:21:46.830306 #4129944] INFO -- : [496/885] 4171305=test_path_to_class I, [2024-05-22T19:21:46.836510 #4129944] INFO -- : [497/885] 4171305=test_gem_dependency I, [2024-05-22T19:21:46.914941 #4129944] INFO -- : [498/885] 4171305=test_gem_resolver_specification I, [2024-05-22T19:21:46.925562 #4129944] INFO -- : [499/885] 4171300=test_rdoc_markup_verbatim I, [2024-05-22T19:21:46.932330 #4129944] INFO -- : [500/885] 4171300=test_inlinecache I, [2024-05-22T19:21:46.936016 #4129944] INFO -- : [501/885] 4171289=test_gem_remote_fetcher I, [2024-05-22T19:21:46.947131 #4129944] INFO -- : [502/885] 4171305=test_parse I, [2024-05-22T19:21:46.950946 #4129944] INFO -- : [503/885] 4171306=test_mdns I, [2024-05-22T19:21:46.966390 #4129944] INFO -- : [504/885] 4171290=test_gem_resolver_installed_specification I, [2024-05-22T19:21:46.968369 #4129944] INFO -- : [505/885] 4171306=test_scanner_events I, [2024-05-22T19:21:46.977156 #4129944] INFO -- : [506/885] 4171290=test_stack I, [2024-05-22T19:21:46.988330 #4129944] INFO -- : [507/885] 4171300=test_gem_commands_list_command I, [2024-05-22T19:21:46.996493 #4129944] INFO -- : [508/885] 4171306=test_reqarg I, [2024-05-22T19:21:46.999807 #4129944] INFO -- : [509/885] 4171300=test_rdoc_include I, [2024-05-22T19:21:47.027353 #4129944] INFO -- : [510/885] 4171293=test_too_many_dummy_encodings I, [2024-05-22T19:21:47.043266 #4129944] INFO -- : [511/885] 4171300=test_cesu8 I, [2024-05-22T19:21:47.052036 #4129944] INFO -- : [512/885] 4171300=test_econv I, [2024-05-22T19:21:47.059486 #4129944] INFO -- : [513/885] 4171296=test_rdoc_options I, [2024-05-22T19:21:47.105404 #4129944] INFO -- : [514/885] 4171293=test_gem_version I, [2024-05-22T19:21:47.175137 #4129944] INFO -- : [515/885] 4171293=test_ldap I, [2024-05-22T19:21:47.188293 #4129944] INFO -- : [516/885] 4171293=test_gem_commands_signin_command I, [2024-05-22T19:21:47.280614 #4129944] INFO -- : [517/885] 4171293=test_resource I, [2024-05-22T19:21:47.300752 #4129944] INFO -- : [518/885] 4171293=test_emitter I, [2024-05-22T19:21:47.311339 #4129944] INFO -- : [519/885] 4171306=test_fileutils I, [2024-05-22T19:21:47.320566 #4129944] INFO -- : [520/885] 4171293=test_string_processing I, [2024-05-22T19:21:47.328138 #4129944] INFO -- : [521/885] 4171293=test_queue I, [2024-05-22T19:21:47.335891 #4129944] INFO -- : [522/885] 4171293=test_function I, [2024-05-22T19:21:47.404478 #4129944] INFO -- : [523/885] 4171305=test_noarg I, [2024-05-22T19:21:47.436132 #4129944] INFO -- : [524/885] 4171299=parse_comments_test I, [2024-05-22T19:21:47.471914 #4129944] INFO -- : [525/885] 4171301=test_tempfile I, [2024-05-22T19:21:47.480839 #4129944] INFO -- : [526/885] 4171299=test_tracepoint I, [2024-05-22T19:21:47.486261 #4129944] INFO -- : [527/885] 4171296=test_prettyprint I, [2024-05-22T19:21:47.508904 #4129944] INFO -- : [528/885] 4171296=test_rdoc_markup I, [2024-05-22T19:21:47.517183 #4129944] INFO -- : [529/885] 4171296=test_gem_commands_help_command I, [2024-05-22T19:21:47.561907 #4129944] INFO -- : [530/885] 4171293=test_duplicate I, [2024-05-22T19:21:47.564286 #4129944] INFO -- : [531/885] 4171293=test_basicsocket I, [2024-05-22T19:21:47.568505 #4129944] INFO -- : [532/885] 4171296=test_utf32 I, [2024-05-22T19:21:47.572560 #4129944] INFO -- : [533/885] 4171293=test_gem_resolver_index_specification I, [2024-05-22T19:21:47.578349 #4129944] INFO -- : [534/885] 4171296=test_internal_ivar I, [2024-05-22T19:21:47.581958 #4129944] INFO -- : [535/885] 4171296=test_rdoc_parser_rd I, [2024-05-22T19:21:47.586173 #4129944] INFO -- : [536/885] 4171305=test_date_strftime I, [2024-05-22T19:21:47.610080 #4129944] INFO -- : [537/885] 4171306=test_gem_installer I, [2024-05-22T19:21:47.612040 #4129944] INFO -- : [538/885] 4171296=test_yamlstore I, [2024-05-22T19:21:47.628527 #4129944] INFO -- : [539/885] 4171293=test_asn1 I, [2024-05-22T19:21:47.632121 #4129944] INFO -- : [540/885] 4171296=test_random I, [2024-05-22T19:21:47.634896 #4129944] INFO -- : [541/885] 4171296=test_load I, [2024-05-22T19:21:47.637929 #4129944] INFO -- : [542/885] 4171296=json_string_matching_test I, [2024-05-22T19:21:47.644858 #4129944] INFO -- : [543/885] 4171296=test_const I, [2024-05-22T19:21:47.645795 #4129944] INFO -- : [544/885] 4171293=test_rdoc_normal_class I, [2024-05-22T19:21:47.651762 #4129944] INFO -- : [545/885] 4171296=test_class I, [2024-05-22T19:21:47.703078 #4129944] INFO -- : [546/885] 4171301=test_irb I, [2024-05-22T19:21:47.704604 #4129944] INFO -- : [547/885] 4171293=test_gem_impossible_dependencies_error I, [2024-05-22T19:21:47.708905 #4129944] INFO -- : [548/885] 4171299=test_pack I, [2024-05-22T19:21:47.709952 #4129944] INFO -- : [549/885] 4171293=test_array_create I, [2024-05-22T19:21:47.712330 #4129944] INFO -- : [550/885] 4171293=test_to_ruby I, [2024-05-22T19:21:47.722642 #4129944] INFO -- : [551/885] 4171293=test_pattern_key_name_check I, [2024-05-22T19:21:47.730320 #4129944] INFO -- : [552/885] 4171293=test_rdoc_rubygems_hook I, [2024-05-22T19:21:47.812375 #4129944] INFO -- : [553/885] 4171293=test_method I, [2024-05-22T19:21:47.888599 #4129944] INFO -- : [554/885] 4171298=test_gem_commands_query_command I, [2024-05-22T19:21:47.888713 #4129944] INFO -- : [555/885] 4171292=test_euc_kr I, [2024-05-22T19:21:47.896345 #4129944] INFO -- : [556/885] 4171292=test_rdoc_context_section I, [2024-05-22T19:21:47.901134 #4129944] INFO -- : [557/885] 4171292=test_ftp I, [2024-05-22T19:21:47.904361 #4129944] INFO -- : [558/885] 4171299=test_gem_commands_exec_command I, [2024-05-22T19:21:47.905519 #4129944] INFO -- : [559/885] 4171292=test_io_wait I, [2024-05-22T19:21:47.917241 #4129944] INFO -- : [560/885] 4171290=test_kwargs I, [2024-05-22T19:21:47.919243 #4129944] INFO -- : [561/885] 4171290=warnings_test I, [2024-05-22T19:21:47.944741 #4129944] INFO -- : [562/885] 4171290=test_ellipsize I, [2024-05-22T19:21:47.961709 #4129944] INFO -- : [563/885] 4171305=test_date_attr I, [2024-05-22T19:21:47.962404 #4129944] INFO -- : [564/885] 4171305=test_console_attr I, [2024-05-22T19:21:47.968343 #4129944] INFO -- : [565/885] 4171305=test_summary I, [2024-05-22T19:21:47.983540 #4129944] INFO -- : [566/885] 4171290=test_type_completor I, [2024-05-22T19:21:47.983600 #4129944] INFO -- : [567/885] 4171290=test_gem_unsatisfiable_dependency_error I, [2024-05-22T19:21:47.983609 #4129944] INFO -- : [568/885] 4171288=test_win32ole_record I, [2024-05-22T19:21:47.987812 #4129944] INFO -- : [569/885] 4171288=test_cp949 I, [2024-05-22T19:21:47.990517 #4129944] INFO -- : [570/885] 4171288=test_condition I, [2024-05-22T19:21:47.991314 #4129944] INFO -- : [571/885] 4171288=test_foreach I, [2024-05-22T19:21:47.993344 #4129944] INFO -- : [572/885] 4171288=test_gem_source_specific_file I, [2024-05-22T19:21:47.995711 #4129944] INFO -- : [573/885] 4171290=test_gem_commands_uninstall_command I, [2024-05-22T19:21:47.996707 #4129944] INFO -- : [574/885] 4171300=test_io I, [2024-05-22T19:21:48.038912 #4129944] INFO -- : [575/885] 4171301=test_emoji I, [2024-05-22T19:21:48.039425 #4129944] INFO -- : [576/885] 4171305=test_win32ole_type_event I, [2024-05-22T19:21:48.047306 #4129944] INFO -- : [577/885] 4171305=test_sorted_set I, [2024-05-22T19:21:48.054411 #4129944] INFO -- : [578/885] 4171294=test_hash I, [2024-05-22T19:21:48.067676 #4129944] INFO -- : [579/885] 4171301=test_ubf_async_safe I, [2024-05-22T19:21:48.075861 #4129944] INFO -- : [580/885] 4171301=test_hash I, [2024-05-22T19:21:48.094055 #4129944] INFO -- : [581/885] 4171301=test_gem_resolver_dependency_request I, [2024-05-22T19:21:48.116208 #4129944] INFO -- : [582/885] 4171301=test_tree_builder I, [2024-05-22T19:21:48.119800 #4129944] INFO -- : [583/885] 4171301=test_external_new I, [2024-05-22T19:21:48.123168 #4129944] INFO -- : [584/885] 4171301=test_alias_and_anchor I, [2024-05-22T19:21:48.127889 #4129944] INFO -- : [585/885] 4171301=test_postponed_job I, [2024-05-22T19:21:48.194873 #4129944] INFO -- : [586/885] 4171304=test_raise_exception I, [2024-05-22T19:21:48.216250 #4129944] INFO -- : [587/885] 4171300=test_gem_request_set_lockfile I, [2024-05-22T19:21:48.218574 #4129944] INFO -- : [588/885] 4171305=test_win32ole_typelib I, [2024-05-22T19:21:48.218609 #4129944] INFO -- : [589/885] 4171305=test_protect I, [2024-05-22T19:21:48.221798 #4129944] INFO -- : [590/885] 4171305=test_argf I, [2024-05-22T19:21:48.234567 #4129944] INFO -- : [591/885] 4171292=test_framework I, [2024-05-22T19:21:48.254724 #4129944] INFO -- : [592/885] 4171292=test_ns_spki I, [2024-05-22T19:21:48.275400 #4129944] INFO -- : [593/885] 4171292=test_kill_ring I, [2024-05-22T19:21:48.284718 #4129944] INFO -- : [594/885] 4171292=test_weakmap I, [2024-05-22T19:21:48.332415 #4129944] INFO -- : [595/885] 4171288=test_workspace I, [2024-05-22T19:21:48.449722 #4129944] INFO -- : [596/885] 4171298=test_yjit I, [2024-05-22T19:21:48.455170 #4129944] INFO -- : [597/885] 4171298=test_ws I, [2024-05-22T19:21:48.477513 #4129944] INFO -- : [598/885] 4171298=test_m17n I, [2024-05-22T19:21:48.491087 #4129944] INFO -- : [599/885] 4171300=test_gem_commands_environment_command I, [2024-05-22T19:21:48.522301 #4129944] INFO -- : [600/885] 4171301=test_gem_security_trust_dir I, [2024-05-22T19:21:48.526139 #4129944] INFO -- : [601/885] 4171300=test_string_memory I, [2024-05-22T19:21:48.555109 #4129944] INFO -- : [602/885] 4171298=test_gem_requirement I, [2024-05-22T19:21:48.556374 #4129944] INFO -- : [603/885] 4171301=test_sprintf I, [2024-05-22T19:21:48.587031 #4129944] INFO -- : [604/885] 4171288=comments_test I, [2024-05-22T19:21:48.594761 #4129944] INFO -- : [605/885] 4171300=test_objspace I, [2024-05-22T19:21:48.673315 #4129944] INFO -- : [606/885] 4171288=ripper_test I, [2024-05-22T19:21:48.692955 #4129944] INFO -- : [607/885] 4171298=test_line_editor I, [2024-05-22T19:21:48.696459 #4129944] INFO -- : [608/885] 4171299=test_undef I, [2024-05-22T19:21:48.706168 #4129944] INFO -- : [609/885] 4171299=test_gem_commands_stale_command I, [2024-05-22T19:21:48.706676 #4129944] INFO -- : [610/885] 4171289=test_lock_native_thread I, [2024-05-22T19:21:48.709626 #4129944] INFO -- : [611/885] 4171299=test_c_struct_entry I, [2024-05-22T19:21:48.757791 #4129944] INFO -- : [612/885] 4171290=test_have_library I, [2024-05-22T19:21:48.763205 #4129944] INFO -- : [613/885] 4171298=test_remote_fetch_error I, [2024-05-22T19:21:48.779006 #4129944] INFO -- : [614/885] 4171298=test_show_source I, [2024-05-22T19:21:48.788422 #4129944] INFO -- : [615/885] 4171304=test_set I, [2024-05-22T19:21:48.789248 #4129944] INFO -- : [616/885] 4171291=test_rat I, [2024-05-22T19:21:48.795942 #4129944] INFO -- : [617/885] 4171291=test_rdoc_markup_raw I, [2024-05-22T19:21:48.798373 #4129944] INFO -- : [618/885] 4171291=test_webauthn_poller I, [2024-05-22T19:21:48.800049 #4129944] INFO -- : [619/885] 4171304=test_rdoc_markup_to_html_crossref I, [2024-05-22T19:21:48.845961 #4129944] INFO -- : [620/885] 4171298=test_typeddata I, [2024-05-22T19:21:48.847819 #4129944] INFO -- : [621/885] 4171301=test_gem_resolver_best_set I, [2024-05-22T19:21:48.894536 #4129944] INFO -- : [622/885] 4171301=encoding_test I, [2024-05-22T19:21:48.937741 #4129944] INFO -- : [623/885] 4171291=test_fstring I, [2024-05-22T19:21:48.965666 #4129944] INFO -- : [624/885] 4171301=test_array I, [2024-05-22T19:21:48.972448 #4129944] INFO -- : [625/885] 4171301=test_optparse I, [2024-05-22T19:21:48.972897 #4129944] INFO -- : [626/885] 4171301=test_convertible I, [2024-05-22T19:21:48.974709 #4129944] INFO -- : [627/885] 4171299=parser_test I, [2024-05-22T19:21:48.979610 #4129944] INFO -- : [628/885] 4171299=test_rdoc_alias I, [2024-05-22T19:21:48.985538 #4129944] INFO -- : [629/885] 4171289=test_yield I, [2024-05-22T19:21:48.997717 #4129944] INFO -- : [630/885] 4171299=test_stringscanner I, [2024-05-22T19:21:49.028349 #4129944] INFO -- : [631/885] 4171298=test_files_sample I, [2024-05-22T19:21:49.034073 #4129944] INFO -- : [632/885] 4171299=test_rdoc_markup_indented_paragraph I, [2024-05-22T19:21:49.038330 #4129944] INFO -- : [633/885] 4171299=test_io_buffer I, [2024-05-22T19:21:49.051603 #4129944] INFO -- : [634/885] 4171291=ruby_parser_test I, [2024-05-22T19:21:49.055856 #4129944] INFO -- : [635/885] 4171291=test_pack I, [2024-05-22T19:21:49.087243 #4129944] INFO -- : [636/885] 4171291=test_backtrace I, [2024-05-22T19:21:49.097112 #4129944] INFO -- : [637/885] 4171298=test_gem_resolver_conflict I, [2024-05-22T19:21:49.108575 #4129944] INFO -- : [638/885] 4171298=test_rdoc_task I, [2024-05-22T19:21:49.121781 #4129944] INFO -- : [639/885] 4171298=test_gem_commands_install_command I, [2024-05-22T19:21:49.154939 #4129944] INFO -- : [640/885] 4171299=test_clone I, [2024-05-22T19:21:49.198849 #4129944] INFO -- : [641/885] 4171288=test_readpartial I, [2024-05-22T19:21:49.210267 #4129944] INFO -- : [642/885] 4171304=locals_test I, [2024-05-22T19:21:49.353438 #4129944] INFO -- : [643/885] 4171299=test_rdoc_require I, [2024-05-22T19:21:49.372799 #4129944] INFO -- : [644/885] 4171299=test_libs I, [2024-05-22T19:21:49.382730 #4129944] INFO -- : [645/885] 4171299=test_gc I, [2024-05-22T19:21:49.386681 #4129944] INFO -- : [646/885] 4171299=test_gem_commands_fetch_command I, [2024-05-22T19:21:49.512379 #4129944] INFO -- : [647/885] 4171299=test_math I, [2024-05-22T19:21:49.519410 #4129944] INFO -- : [648/885] 4171304=test_sleep I, [2024-05-22T19:21:49.527931 #4129944] INFO -- : [649/885] 4171299=test_config I, [2024-05-22T19:21:49.550257 #4129944] INFO -- : [650/885] 4171299=test_yaml_tree I, [2024-05-22T19:21:49.568065 #4129944] INFO -- : [651/885] 4171299=test_case I, [2024-05-22T19:21:49.600947 #4129944] INFO -- : [652/885] 4171299=test_sizeof I, [2024-05-22T19:21:49.609631 #4129944] INFO -- : [653/885] 4171288=test_face I, [2024-05-22T19:21:49.627715 #4129944] INFO -- : [654/885] 4171288=test_rendering I, [2024-05-22T19:21:49.627780 #4129944] INFO -- : [655/885] 4171288=test_autoload I, [2024-05-22T19:21:49.961811 #4129944] INFO -- : [656/885] 4171290=test_utf16 I, [2024-05-22T19:21:49.979505 #4129944] INFO -- : [657/885] 4171290=test_io I, [2024-05-22T19:21:50.022562 #4129944] INFO -- : [658/885] 4171296=test_unicode_escape I, [2024-05-22T19:21:50.116538 #4129944] INFO -- : [659/885] 4171296=test_bigzero I, [2024-05-22T19:21:50.132970 #4129944] INFO -- : [660/885] 4171296=test_pkey_dh I, [2024-05-22T19:21:50.194370 #4129944] INFO -- : [661/885] 4171296=test_gem_package_tar_header I, [2024-05-22T19:21:50.233120 #4129944] INFO -- : [662/885] 4171296=test_iseq_load I, [2024-05-22T19:21:50.392449 #4129944] INFO -- : [663/885] 4171291=test_gem_util I, [2024-05-22T19:21:50.561910 #4129944] INFO -- : [664/885] 4171291=test_system I, [2024-05-22T19:21:50.602107 #4129944] INFO -- : [665/885] 4171298=test_pkcs12 I, [2024-05-22T19:21:50.807651 #4129944] INFO -- : [666/885] 4171296=test_yjit_exit_locations I, [2024-05-22T19:21:50.812334 #4129944] INFO -- : [667/885] 4171296=test_etc I, [2024-05-22T19:21:50.897003 #4129944] INFO -- : [668/885] 4171296=test_gem_config_file I, [2024-05-22T19:21:50.925417 #4129944] INFO -- : [669/885] 4171298=test_ripper I, [2024-05-22T19:21:51.012597 #4129944] INFO -- : [670/885] 4171294=test_protocol I, [2024-05-22T19:21:51.042349 #4129944] INFO -- : [671/885] 4171296=test_getopts I, [2024-05-22T19:21:51.048888 #4129944] INFO -- : [672/885] 4171296=test_gem_resolver_activation_request I, [2024-05-22T19:21:51.055460 #4129944] INFO -- : [673/885] 4171296=test_backtrace I, [2024-05-22T19:21:51.062597 #4129944] INFO -- : [674/885] 4171296=test_defined I, [2024-05-22T19:21:51.117755 #4129944] INFO -- : [675/885] 4171303=test_key_name_check I, [2024-05-22T19:21:51.123477 #4129944] INFO -- : [676/885] 4171296=test_io_buffer I, [2024-05-22T19:21:51.132267 #4129944] INFO -- : [677/885] 4171303=test_rdoc_i18n_text I, [2024-05-22T19:21:51.135348 #4129944] INFO -- : [678/885] 4171303=test_gem_uninstaller I, [2024-05-22T19:21:51.171928 #4129944] INFO -- : [679/885] 4171296=test_svcb_https I, [2024-05-22T19:21:51.176044 #4129944] INFO -- : [680/885] 4171296=test_buffering I, [2024-05-22T19:21:51.180057 #4129944] INFO -- : [681/885] 4171296=test_gb18030 I, [2024-05-22T19:21:51.186264 #4129944] INFO -- : [682/885] 4171296=test_time I, [2024-05-22T19:21:51.251876 #4129944] INFO -- : [683/885] 4171298=test_windows_1251 I, [2024-05-22T19:21:51.259390 #4129944] INFO -- : [684/885] 4171298=test_rdoc_rdoc I, [2024-05-22T19:21:51.316749 #4129944] INFO -- : [685/885] 4171298=test_rdoc_markup_attributes I, [2024-05-22T19:21:51.317830 #4129944] INFO -- : [686/885] 4171298=test_win32ole_type I, [2024-05-22T19:21:51.323621 #4129944] INFO -- : [687/885] 4171298=test_null I, [2024-05-22T19:21:51.324669 #4129944] INFO -- : [688/885] 4171298=test_mul I, [2024-05-22T19:21:51.333776 #4129944] INFO -- : [689/885] 4171289=test_rdoc_rd_inline_parser I, [2024-05-22T19:21:51.334254 #4129944] INFO -- : [690/885] 4171294=test_rdoc_markup_to_rdoc I, [2024-05-22T19:21:51.343197 #4129944] INFO -- : [691/885] 4171296=test_default_gems I, [2024-05-22T19:21:51.354265 #4129944] INFO -- : [692/885] 4171298=test_pipe I, [2024-05-22T19:21:51.373294 #4129944] INFO -- : [693/885] 4171289=test_thread I, [2024-05-22T19:21:51.401631 #4129944] INFO -- : [694/885] 4171289=test_trick I, [2024-05-22T19:21:51.413559 #4129944] INFO -- : [695/885] 4171296=test_pkey_ec I, [2024-05-22T19:21:51.470139 #4129944] INFO -- : [696/885] 4171291=test_date_parse I, [2024-05-22T19:21:51.474238 #4129944] INFO -- : [697/885] 4171294=test_rdoc_store I, [2024-05-22T19:21:51.496557 #4129944] INFO -- : [698/885] 4171298=test_gem_request_set_lockfile_parser I, [2024-05-22T19:21:51.499873 #4129944] INFO -- : [699/885] 4171296=test_depth_first I, [2024-05-22T19:21:51.503628 #4129944] INFO -- : [700/885] 4171296=test_x509attr I, [2024-05-22T19:21:51.505023 #4129944] INFO -- : [701/885] 4171296=test_raise I, [2024-05-22T19:21:51.510098 #4129944] INFO -- : [702/885] 4171296=test_pattern_matching I, [2024-05-22T19:21:51.533275 #4129944] INFO -- : [703/885] 4171296=test_rdoc_stats I, [2024-05-22T19:21:51.545804 #4129944] INFO -- : [704/885] 4171291=test_string I, [2024-05-22T19:21:51.555386 #4129944] INFO -- : [705/885] 4171291=test_qsort I, [2024-05-22T19:21:51.557868 #4129944] INFO -- : [706/885] 4171291=test_rdoc_parser I, [2024-05-22T19:21:51.563051 #4129944] INFO -- : [707/885] 4171296=test_gem_dependency_resolution_error I, [2024-05-22T19:21:51.568848 #4129944] INFO -- : [708/885] 4171291=json_addition_test I, [2024-05-22T19:21:51.570999 #4129944] INFO -- : [709/885] 4171296=test_custom_command I, [2024-05-22T19:21:51.573460 #4129944] INFO -- : [710/885] 4171304=test_string I, [2024-05-22T19:21:51.573926 #4129944] INFO -- : [711/885] 4171296=test_proc I, [2024-05-22T19:21:51.579353 #4129944] INFO -- : [712/885] 4171291=test_gc_compact I, [2024-05-22T19:21:51.581585 #4129944] INFO -- : [713/885] 4171295=test_gem_resolver_index_set I, [2024-05-22T19:21:51.610684 #4129944] INFO -- : [714/885] 4171298=test_gem_package_old I, [2024-05-22T19:21:51.613969 #4129944] INFO -- : [715/885] 4171295=test_cgi_tag_helper I, [2024-05-22T19:21:51.622500 #4129944] INFO -- : [716/885] 4171297=test_zlib I, [2024-05-22T19:21:51.630797 #4129944] INFO -- : [717/885] 4171295=test_egrep_cpp I, [2024-05-22T19:21:51.645058 #4129944] INFO -- : [718/885] 4171298=test_ole_methods I, [2024-05-22T19:21:51.651113 #4129944] INFO -- : [719/885] 4171298=test_erb_m17n I, [2024-05-22T19:21:51.655372 #4129944] INFO -- : [720/885] 4171298=test_optimization I, [2024-05-22T19:21:51.721667 #4129944] INFO -- : [721/885] 4171293=test_date_conv I, [2024-05-22T19:21:51.724994 #4129944] INFO -- : [722/885] 4171292=test_folderitem2_invokeverb I, [2024-05-22T19:21:51.728097 #4129944] INFO -- : [723/885] 4171293=test_require_path_check I, [2024-05-22T19:21:51.729191 #4129944] INFO -- : [724/885] 4171292=test_rdoc_markup_parser I, [2024-05-22T19:21:51.750950 #4129944] INFO -- : [725/885] 4171295=test_fnmatch I, [2024-05-22T19:21:51.766582 #4129944] INFO -- : [726/885] 4171292=test_files_test_2 I, [2024-05-22T19:21:51.768867 #4129944] INFO -- : [727/885] 4171292=test_gem_validator I, [2024-05-22T19:21:51.777921 #4129944] INFO -- : [728/885] 4171293=test_gem_source_list I, [2024-05-22T19:21:51.787134 #4129944] INFO -- : [729/885] 4171292=test_yaml_special_cases I, [2024-05-22T19:21:51.790862 #4129944] INFO -- : [730/885] 4171295=test_optarg I, [2024-05-22T19:21:51.796404 #4129944] INFO -- : [731/885] 4171292=test_config I, [2024-05-22T19:21:51.819191 #4129944] INFO -- : [732/885] 4171292=test_rdoc_token_stream I, [2024-05-22T19:21:51.819695 #4129944] INFO -- : [733/885] 4171293=test_address_resolve I, [2024-05-22T19:21:51.823195 #4129944] INFO -- : [734/885] 4171292=test_exception I, [2024-05-22T19:21:51.828083 #4129944] INFO -- : [735/885] 4171293=test_zsh_completion I, [2024-05-22T19:21:51.833466 #4129944] INFO -- : [736/885] 4171293=test_iter_break I, [2024-05-22T19:21:51.836303 #4129944] INFO -- : [737/885] 4171293=test_verbose I, [2024-05-22T19:21:51.836734 #4129944] INFO -- : [738/885] 4171292=test_nil I, [2024-05-22T19:21:51.856435 #4129944] INFO -- : [739/885] 4171292=test_num2int I, [2024-05-22T19:21:51.866236 #4129944] INFO -- : [740/885] 4171292=test_rdoc_single_class I, [2024-05-22T19:21:51.868631 #4129944] INFO -- : [741/885] 4171292=test_macro I, [2024-05-22T19:21:51.875233 #4129944] INFO -- : [742/885] 4171292=test_pp I, [2024-05-22T19:21:51.893445 #4129944] INFO -- : [743/885] 4171293=test_gem_ext_configure_builder I, [2024-05-22T19:21:51.905911 #4129944] INFO -- : [744/885] 4171292=test_frozen I, [2024-05-22T19:21:51.915629 #4129944] INFO -- : [745/885] 4171292=test_rdoc_tom_doc I, [2024-05-22T19:21:51.916356 #4129944] INFO -- : [746/885] 4171295=test_rdoc_markup_to_tt_only I, [2024-05-22T19:21:51.921144 #4129944] INFO -- : [747/885] 4171293=test_hmac I, [2024-05-22T19:21:51.925850 #4129944] INFO -- : [748/885] 4171293=test_gem_command I, [2024-05-22T19:21:51.932447 #4129944] INFO -- : [749/885] 4171292=test_bug-3571 I, [2024-05-22T19:21:51.949266 #4129944] INFO -- : [750/885] 4171292=test_key_actor_vi I, [2024-05-22T19:21:51.951041 #4129944] INFO -- : [751/885] 4171295=test_common I, [2024-05-22T19:21:51.966028 #4129944] INFO -- : [752/885] 4171294=test_gem_spec_fetcher I, [2024-05-22T19:21:51.995405 #4129944] INFO -- : [753/885] 4171293=test_numeric I, [2024-05-22T19:21:52.060828 #4129944] INFO -- : [754/885] 4171292=test_ifunless I, [2024-05-22T19:21:52.071258 #4129944] INFO -- : [755/885] 4171293=test_assignment I, [2024-05-22T19:21:52.082198 #4129944] INFO -- : [756/885] 4171292=test_gem_commands_lock_command I, [2024-05-22T19:21:52.096137 #4129944] INFO -- : [757/885] 4171292=test_psych I, [2024-05-22T19:21:52.114038 #4129944] INFO -- : [758/885] 4171292=test_enc_raise I, [2024-05-22T19:21:52.116766 #4129944] INFO -- : [759/885] 4171292=!Nothing_to_test I, [2024-05-22T19:21:52.119886 #4129944] INFO -- : [760/885] 4171292=test_rdoc_markup_paragraph I, [2024-05-22T19:21:52.120635 #4129944] INFO -- : [761/885] 4171292=test_command I, [2024-05-22T19:21:52.171513 #4129944] INFO -- : [762/885] 4171295=test_at_exit I, [2024-05-22T19:21:52.195910 #4129944] INFO -- : [763/885] 4171295=test_date I, [2024-05-22T19:21:52.202693 #4129944] INFO -- : [764/885] 4171295=test_gem_rdoc I, [2024-05-22T19:21:52.274341 #4129944] INFO -- : [765/885] 4171303=test_gem_ext_cargo_builder_unit I, [2024-05-22T19:21:52.278910 #4129944] INFO -- : [766/885] 4171305=test_object_create_start I, [2024-05-22T19:21:52.281463 #4129944] INFO -- : [767/885] 4171305=test_emitter I, [2024-05-22T19:21:52.285858 #4129944] INFO -- : [768/885] 4171294=test_gem_silent_ui I, [2024-05-22T19:21:52.287316 #4129944] INFO -- : [769/885] 4171305=test_files_ext I, [2024-05-22T19:21:52.292265 #4129944] INFO -- : [770/885] 4171303=test_bug-5832 I, [2024-05-22T19:21:52.295354 #4129944] INFO -- : [771/885] 4171303=test_kernel I, [2024-05-22T19:21:52.318888 #4129944] INFO -- : [772/885] 4171294=dispatcher_test I, [2024-05-22T19:21:52.331414 #4129944] INFO -- : [773/885] 4171295=test_eval_history I, [2024-05-22T19:21:52.357679 #4129944] INFO -- : [774/885] 4171306=test_gem_doctor I, [2024-05-22T19:21:52.389029 #4129944] INFO -- : [775/885] 4171296=test_kdf I, [2024-05-22T19:21:52.390803 #4129944] INFO -- : [776/885] 4171292=test_rdoc_context I, [2024-05-22T19:21:52.395390 #4129944] INFO -- : [777/885] 4171294=test_stream I, [2024-05-22T19:21:52.396762 #4129944] INFO -- : [778/885] 4171305=test_nil2vtempty I, [2024-05-22T19:21:52.397748 #4129944] INFO -- : [779/885] 4171306=test_open-uri I, [2024-05-22T19:21:52.397979 #4129944] INFO -- : [780/885] 4171305=test_httpresponse I, [2024-05-22T19:21:52.400456 #4129944] INFO -- : [781/885] 4171295=test_rdoc_parser_ruby I, [2024-05-22T19:21:52.418845 #4129944] INFO -- : [782/885] 4171294=test_gem_safe_yaml I, [2024-05-22T19:21:52.427658 #4129944] INFO -- : [783/885] 4171294=test_syntax I, [2024-05-22T19:21:52.428152 #4129944] INFO -- : [784/885] 4171299=test_date_new I, [2024-05-22T19:21:52.438215 #4129944] INFO -- : [785/885] 4171299=index_write_test I, [2024-05-22T19:21:52.439615 #4129944] INFO -- : [786/885] 4171299=test_data I, [2024-05-22T19:21:52.450682 #4129944] INFO -- : [787/885] 4171299=test_rdoc_markup_to_joined_paragraph I, [2024-05-22T19:21:52.453022 #4129944] INFO -- : [788/885] 4171299=test_date_time I, [2024-05-22T19:21:52.455020 #4129944] INFO -- : [789/885] 4171305=test_require I, [2024-05-22T19:21:52.460533 #4129944] INFO -- : [790/885] 4171305=test_iso_8859 I, [2024-05-22T19:21:52.463358 #4129944] INFO -- : [791/885] 4171299=test_tcp I, [2024-05-22T19:21:52.467948 #4129944] INFO -- : [792/885] 4171296=test_rdoc_text I, [2024-05-22T19:21:52.489369 #4129944] INFO -- : [793/885] 4171305=test_gem_commands_specification_command I, [2024-05-22T19:21:52.505107 #4129944] INFO -- : [794/885] 4171296=test_shift_jis I, [2024-05-22T19:21:52.510266 #4129944] INFO -- : [795/885] 4171296=test_gem_commands_which_command I, [2024-05-22T19:21:52.528920 #4129944] INFO -- : [796/885] 4171299=test_http I, [2024-05-22T19:21:52.538051 #4129944] INFO -- : [797/885] 4171299=test_enumerator I, [2024-05-22T19:21:52.540547 #4129944] INFO -- : [798/885] 4171296=test_inadvertent_creation I, [2024-05-22T19:21:52.636536 #4129944] INFO -- : [799/885] 4171305=test_flags I, [2024-05-22T19:21:52.672834 #4129944] INFO -- : [800/885] 4171296=test_name_error I, [2024-05-22T19:21:52.762035 #4129944] INFO -- : [801/885] 4171296=test_rdoc_markup_attribute_manager I, [2024-05-22T19:21:52.796764 #4129944] INFO -- : [802/885] 4171296=test_gem_commands_dependency_command I, [2024-05-22T19:21:52.842865 #4129944] INFO -- : [803/885] 4171303=test_safe_load I, [2024-05-22T19:21:52.851755 #4129944] INFO -- : [804/885] 4171303=test_gem_resolver_composed_set I, [2024-05-22T19:21:52.870228 #4129944] INFO -- : [805/885] 4171303=test_gem_resolver I, [2024-05-22T19:21:52.894213 #4129944] INFO -- : [806/885] 4171296=test_gem_security_policy I, [2024-05-22T19:21:52.976128 #4129944] INFO -- : [807/885] 4171295=test_gem_source_local I, [2024-05-22T19:21:52.984445 #4129944] INFO -- : [808/885] 4171306=test_process I, [2024-05-22T19:21:53.096556 #4129944] INFO -- : [809/885] 4171292=test_last_thread I, [2024-05-22T19:21:53.116369 #4129944] INFO -- : [810/885] 4171303=test_pack I, [2024-05-22T19:21:53.124165 #4129944] INFO -- : [811/885] 4171293=test_err_in_callback I, [2024-05-22T19:21:53.128038 #4129944] INFO -- : [812/885] 4171293=test_gem_resolver_lock_specification I, [2024-05-22T19:21:53.168528 #4129944] INFO -- : [813/885] 4171293=test_gc I, [2024-05-22T19:21:53.176649 #4129944] INFO -- : [814/885] 4171296=test_x509cert I, [2024-05-22T19:21:53.191730 #4129944] INFO -- : [815/885] 4171295=test_gem_ext_rake_builder I, [2024-05-22T19:21:53.316102 #4129944] INFO -- : [816/885] 4171303=test_arity I, [2024-05-22T19:21:53.329514 #4129944] INFO -- : [817/885] 4171303=test_logdevice I, [2024-05-22T19:21:53.443245 #4129944] INFO -- : [818/885] 4171296=test_io_console I, [2024-05-22T19:21:53.474980 #4129944] INFO -- : [819/885] 4171289=test_flush I, [2024-05-22T19:21:53.481761 #4129944] INFO -- : [820/885] 4171289=test_singleton I, [2024-05-22T19:21:53.483613 #4129944] INFO -- : [821/885] 4171289=test_switch_hitter I, [2024-05-22T19:21:53.500809 #4129944] INFO -- : [822/885] 4171289=test_securerandom I, [2024-05-22T19:21:53.540031 #4129944] INFO -- : [823/885] 4171289=test_rdoc_markdown_test I, [2024-05-22T19:21:53.679158 #4129944] INFO -- : [824/885] 4171305=test_c_union_entity I, [2024-05-22T19:21:53.763764 #4129944] INFO -- : [825/885] 4171305=test_rdoc_normal_module I, [2024-05-22T19:21:53.771900 #4129944] INFO -- : [826/885] 4171301=test_logperiod I, [2024-05-22T19:21:53.775874 #4129944] INFO -- : [827/885] 4171301=test_passing_block I, [2024-05-22T19:21:53.780946 #4129944] INFO -- : [828/885] 4171301=test_thread_fd_close I, [2024-05-22T19:21:53.784177 #4129944] INFO -- : [829/885] 4171301=test_uncorrectable_name_check I, [2024-05-22T19:21:53.789358 #4129944] INFO -- : [830/885] 4171301=newline_test I, [2024-05-22T19:21:53.802015 #4129944] INFO -- : [831/885] 4171305=test_hash_create I, [2024-05-22T19:21:53.802187 #4129944] INFO -- : [832/885] 4171305=test_stringchar I, [2024-05-22T19:21:53.864585 #4129944] INFO -- : [833/885] 4171305=test_gem_stream_ui I, [2024-05-22T19:21:53.884316 #4129944] INFO -- : [834/885] 4171295=test_extlibs I, [2024-05-22T19:21:53.885034 #4129944] INFO -- : [835/885] 4171301=test_rdoc_generator_ri I, [2024-05-22T19:21:53.891888 #4129944] INFO -- : [836/885] 4171301=test_severity I, [2024-05-22T19:21:53.894666 #4129944] INFO -- : [837/885] 4171301=test_ractor I, [2024-05-22T19:21:53.908372 #4129944] INFO -- : [838/885] 4171301=test_require_lib I, [2024-05-22T19:21:53.928566 #4129944] INFO -- : [839/885] 4171305=parse_test I, [2024-05-22T19:21:53.975360 #4129944] INFO -- : [840/885] 4171288=test_gem_install_update_options I, [2024-05-22T19:21:54.121069 #4129944] INFO -- : [841/885] 4171303=test_rdoc_markup_to_table_of_contents I, [2024-05-22T19:21:54.137591 #4129944] INFO -- : [842/885] 4171288=test_socket I, [2024-05-22T19:21:54.141781 #4129944] INFO -- : [843/885] 4171303=test_thread I, [2024-05-22T19:21:54.174718 #4129944] INFO -- : [844/885] 4171292=test_objectspace I, [2024-05-22T19:21:54.321705 #4129944] INFO -- : [845/885] 4171291=test_literal I, [2024-05-22T19:21:54.360217 #4129944] INFO -- : [846/885] 4171303=test_str2big I, [2024-05-22T19:21:54.366540 #4129944] INFO -- : [847/885] 4171303=test_c_struct_builder I, [2024-05-22T19:21:54.392231 #4129944] INFO -- : [848/885] 4171289=test_dot_dot I, [2024-05-22T19:21:54.404015 #4129944] INFO -- : [849/885] 4171289=test_cclass I, [2024-05-22T19:21:54.492679 #4129944] INFO -- : [850/885] 4171303=test_gem_request_connection_pools I, [2024-05-22T19:21:54.492851 #4129944] INFO -- : .Leaked thread: TestSocket#test_accept_loop: # I, [2024-05-22T19:21:54.525430 #4129944] INFO -- : [851/885] 4171289=test_gem_version_option I, [2024-05-22T19:21:54.558664 #4129944] INFO -- : .Finished thread: TestSocket#test_tcp_socket_one_hostname_resolution_succeeded_at_least: # I, [2024-05-22T19:21:54.593125 #4129944] INFO -- : [852/885] 4171289=test_grapheme_breaks I, [2024-05-22T19:21:54.635273 #4129944] INFO -- : [853/885] 4171289=test_pkey I, [2024-05-22T19:21:54.684231 #4129944] INFO -- : [854/885] 4171289=test_case I, [2024-05-22T19:21:54.684557 #4129944] INFO -- : [855/885] 4171289=test_reline I, [2024-05-22T19:21:54.842181 #4129944] INFO -- : [856/885] 4171297=test_parser_events I, [2024-05-22T19:21:54.937008 #4129944] INFO -- : [857/885] 4171297=test_rdoc_generator_pot_po I, [2024-05-22T19:21:54.939240 #4129944] INFO -- : [858/885] 4171297=test_ansi_with_terminfo I, [2024-05-22T19:21:54.942624 #4129944] INFO -- : [859/885] 4171297=test_json_tree I, [2024-05-22T19:21:54.951063 #4129944] INFO -- : [860/885] 4171297=test_rdoc_markup_to_markdown I, [2024-05-22T19:21:54.954690 #4129944] INFO -- : [861/885] 4171289=test_memory_view I, [2024-05-22T19:21:54.995073 #4129944] INFO -- : [862/885] 4171297=test_m17n_comb I, [2024-05-22T19:21:55.022780 #4129944] INFO -- : [863/885] 4171291=test_ractor I, [2024-05-22T19:21:55.082868 #4129944] INFO -- : [864/885] 4171292=test_gem_request I, [2024-05-22T19:21:55.103743 #4129944] INFO -- : [865/885] 4171291=test_method_cache I, [2024-05-22T19:21:55.108108 #4129944] INFO -- : [866/885] 4171289=test_sprintf_comb I, [2024-05-22T19:21:55.109365 #4129944] INFO -- : [867/885] 4171291=test_gem_ext_cargo_builder_link_flag_converter I, [2024-05-22T19:21:55.158493 #4129944] INFO -- : [868/885] 4171291=test_gem_commands_mirror I, [2024-05-22T19:21:55.166573 #4129944] INFO -- : [869/885] 4171291=test_enumerator_kw I, [2024-05-22T19:21:55.170584 #4129944] INFO -- : [870/885] 4171291=test_settracefunc I, [2024-05-22T19:21:55.226005 #4129944] INFO -- : [871/885] 4171292=test_gem_text I, [2024-05-22T19:21:55.257898 #4129944] INFO -- : [872/885] 4171289=test_win32ole I, [2024-05-22T19:21:55.262575 #4129944] INFO -- : [873/885] 4171289=test_generic I, [2024-05-22T19:21:55.273311 #4129944] INFO -- : [874/885] 4171292=test_scan_args I, [2024-05-22T19:21:55.277998 #4129944] INFO -- : [875/885] 4171289=test_case_options I, [2024-05-22T19:21:55.280396 #4129944] INFO -- : [876/885] 4171289=test_store I, [2024-05-22T19:21:55.284667 #4129944] INFO -- : [877/885] 4171292=test_rdoc_cross_reference I, [2024-05-22T19:21:55.378123 #4129944] INFO -- : [878/885] 4171289=test_scalar I, [2024-05-22T19:21:55.383071 #4129944] INFO -- : [879/885] 4171289=test_gem_dependency_installer I, [2024-05-22T19:21:55.396087 #4129944] INFO -- : [880/885] 4171288=test_gem_commands_info_command I, [2024-05-22T19:21:55.428523 #4129944] INFO -- : [881/885] 4171288=test_bug_reporter I, [2024-05-22T19:21:55.526399 #4129944] INFO -- : [882/885] 4171303=test_rand I, [2024-05-22T19:21:55.636678 #4129944] INFO -- : [883/885] 4171292=test_gem_name_tuple I, [2024-05-22T19:21:55.652309 #4129944] INFO -- : [884/885] 4171292=test_gem_package_tar_reader_entry I, [2024-05-22T19:21:55.744607 #4129944] INFO -- : [885/885] 4171295=test_exception I, [2024-05-22T19:22:09.041462 #4129944] INFO -- : Finished tests in 32.137920s, 820.4638 tests/s, 291088.7171 assertions/s. I, [2024-05-22T19:22:09.042107 #4129944] INFO -- : 26368 tests, 9354986 assertions, 0 failures, 0 errors, 306 skips I, [2024-05-22T19:22:09.042130 #4129944] INFO -- : I, [2024-05-22T19:22:09.042138 #4129944] INFO -- : ruby -v: ruby 3.4.0dev (2024-05-22T06:59:19Z master 5613d6e95b) [x86_64-linux] I, [2024-05-22T19:22:09.044388 #4129944] INFO -- : $$$[end] "make yes-test-all TESTOPTS='--stderr-on-failure' TESTS='-j20'" exit with 0. I, [2024-05-22T19:22:09.044538 #4129944] INFO -- : $$$[beg] make yes-test-rubyspec MSPECOPT='--error-output stderr --debug -j' TESTS='-j20' I, [2024-05-22T19:22:09.143362 #4129944] INFO -- : BASERUBY = /usr/bin/ruby --disable=gems I, [2024-05-22T19:22:09.143419 #4129944] INFO -- : CC = gcc I, [2024-05-22T19:22:09.143434 #4129944] INFO -- : LD = ld I, [2024-05-22T19:22:09.143447 #4129944] INFO -- : LDSHARED = gcc -shared I, [2024-05-22T19:22:09.143462 #4129944] INFO -- : CFLAGS = -O3 -fno-fast-math -ggdb3 -Wall -Wextra -Wdeprecated-declarations -Wdiv-by-zero -Wduplicated-cond -Wimplicit-function-declaration -Wimplicit-int -Wpointer-arith -Wwrite-strings -Wold-style-definition -Wimplicit-fallthrough=0 -Wmissing-noreturn -Wno-cast-function-type -Wno-constant-logical-operand -Wno-long-long -Wno-missing-field-initializers -Wno-overlength-strings -Wno-packed-bitfield-compat -Wno-parentheses-equality -Wno-self-assign -Wno-tautological-compare -Wno-unused-parameter -Wno-unused-value -Wsuggest-attribute=format -Wsuggest-attribute=noreturn -Wunused-variable -Wmisleading-indentation -Wundef -fPIC I, [2024-05-22T19:22:09.143476 #4129944] INFO -- : XCFLAGS = -U_FORTIFY_SOURCE -D_FORTIFY_SOURCE=2 -fstack-protector-strong -fno-strict-overflow -fvisibility=hidden -fexcess-precision=standard -DRUBY_EXPORT -I. -I.ext/include/x86_64-linux -I/tmp/ruby/src/trunk/include -I/tmp/ruby/src/trunk -I/tmp/ruby/src/trunk/prism -I/tmp/ruby/src/trunk/enc/unicode/15.0.0 I, [2024-05-22T19:22:09.143489 #4129944] INFO -- : CPPFLAGS = I, [2024-05-22T19:22:09.143501 #4129944] INFO -- : DLDFLAGS = -Wl,--compress-debug-sections=zlib -Wl,-soname,libruby.so.3.4 -fstack-protector-strong I, [2024-05-22T19:22:09.143513 #4129944] INFO -- : SOLIBS = -lz -lrt -lrt -lgmp -ldl -lcrypt -lm -lpthread I, [2024-05-22T19:22:09.143525 #4129944] INFO -- : LANG = en_US.UTF-8 I, [2024-05-22T19:22:09.143536 #4129944] INFO -- : LC_ALL = I, [2024-05-22T19:22:09.143548 #4129944] INFO -- : LC_CTYPE = I, [2024-05-22T19:22:09.143559 #4129944] INFO -- : MFLAGS = I, [2024-05-22T19:22:09.143583 #4129944] INFO -- : RUSTC = no I, [2024-05-22T19:22:09.143595 #4129944] INFO -- : YJIT_RUSTC_ARGS = --crate-name=yjit --crate-type=staticlib --edition=2021 -g -C lto=thin -C opt-level=3 -C overflow-checks=on '--out-dir=/tmp/ruby/build/trunk/yjit/target/release/' /tmp/ruby/src/trunk/yjit/src/lib.rs I, [2024-05-22T19:22:09.143959 #4129944] INFO -- : gcc (Ubuntu 11.4.0-1ubuntu1~22.04) 11.4.0 I, [2024-05-22T19:22:09.144013 #4129944] INFO -- : Copyright (C) 2021 Free Software Foundation, Inc. I, [2024-05-22T19:22:09.144029 #4129944] INFO -- : This is free software; see the source for copying conditions. There is NO I, [2024-05-22T19:22:09.144042 #4129944] INFO -- : warranty; not even for MERCHANTABILITY or FITNESS FOR A PARTICULAR PURPOSE. I, [2024-05-22T19:22:09.144054 #4129944] INFO -- : I, [2024-05-22T19:22:09.145745 #4129944] INFO -- : generating enc.mk I, [2024-05-22T19:22:09.264945 #4129944] INFO -- : generating encdb.h I, [2024-05-22T19:22:09.288569 #4129944] INFO -- : encdb.h unchanged I, [2024-05-22T19:22:09.289769 #4129944] INFO -- : making enc I, [2024-05-22T19:22:09.307031 #4129944] INFO -- : make[1]: Entering directory '/tmp/ruby/build/trunk' I, [2024-05-22T19:22:09.307081 #4129944] INFO -- : make[1]: Nothing to be done for 'enc'. I, [2024-05-22T19:22:09.307094 #4129944] INFO -- : make[1]: Leaving directory '/tmp/ruby/build/trunk' I, [2024-05-22T19:22:09.307779 #4129944] INFO -- : making srcs under enc I, [2024-05-22T19:22:09.337037 #4129944] INFO -- : make[1]: Entering directory '/tmp/ruby/build/trunk' I, [2024-05-22T19:22:09.337097 #4129944] INFO -- : make[1]: Nothing to be done for 'srcs'. I, [2024-05-22T19:22:09.337110 #4129944] INFO -- : make[1]: Leaving directory '/tmp/ruby/build/trunk' I, [2024-05-22T19:22:09.338002 #4129944] INFO -- : generating transdb.h I, [2024-05-22T19:22:09.434521 #4129944] INFO -- : transdb.h unchanged I, [2024-05-22T19:22:09.436117 #4129944] INFO -- : making trans I, [2024-05-22T19:22:09.470088 #4129944] INFO -- : make[1]: Entering directory '/tmp/ruby/build/trunk' I, [2024-05-22T19:22:09.470157 #4129944] INFO -- : make[1]: Nothing to be done for 'trans'. I, [2024-05-22T19:22:09.470170 #4129944] INFO -- : make[1]: Leaving directory '/tmp/ruby/build/trunk' I, [2024-05-22T19:22:09.470819 #4129944] INFO -- : making encs I, [2024-05-22T19:22:09.508220 #4129944] INFO -- : make[1]: Entering directory '/tmp/ruby/build/trunk' I, [2024-05-22T19:22:09.508283 #4129944] INFO -- : make[1]: Nothing to be done for 'encs'. I, [2024-05-22T19:22:09.508297 #4129944] INFO -- : make[1]: Leaving directory '/tmp/ruby/build/trunk' I, [2024-05-22T19:22:09.509984 #4129944] INFO -- : generating makefiles ext/configure-ext.mk I, [2024-05-22T19:22:09.536745 #4129944] INFO -- : ext/configure-ext.mk updated I, [2024-05-22T19:22:09.539176 #4129944] INFO -- : make[1]: Entering directory '/tmp/ruby/build/trunk' I, [2024-05-22T19:22:10.927546 #4129944] INFO -- : make[1]: Leaving directory '/tmp/ruby/build/trunk' I, [2024-05-22T19:22:10.928115 #4129944] INFO -- : generating makefile exts.mk I, [2024-05-22T19:22:10.964940 #4129944] INFO -- : exts.mk unchanged I, [2024-05-22T19:22:10.969469 #4129944] INFO -- : make[1]: Entering directory '/tmp/ruby/build/trunk' I, [2024-05-22T19:22:11.302759 #4129944] INFO -- : make[2]: Entering directory '/tmp/ruby/build/trunk/ext/coverage' I, [2024-05-22T19:22:11.307013 #4129944] INFO -- : make[2]: Leaving directory '/tmp/ruby/build/trunk/ext/coverage' I, [2024-05-22T19:22:11.313258 #4129944] INFO -- : make[2]: Entering directory '/tmp/ruby/build/trunk/ext/date' I, [2024-05-22T19:22:11.317371 #4129944] INFO -- : make[2]: Leaving directory '/tmp/ruby/build/trunk/ext/date' I, [2024-05-22T19:22:11.321358 #4129944] INFO -- : make[2]: Entering directory '/tmp/ruby/build/trunk/ext/digest' I, [2024-05-22T19:22:11.330819 #4129944] INFO -- : make[2]: Leaving directory '/tmp/ruby/build/trunk/ext/digest' I, [2024-05-22T19:22:11.357517 #4129944] INFO -- : make[2]: Entering directory '/tmp/ruby/build/trunk/ext/digest/sha2' I, [2024-05-22T19:22:11.362061 #4129944] INFO -- : make[2]: Leaving directory '/tmp/ruby/build/trunk/ext/digest/sha2' I, [2024-05-22T19:22:11.383965 #4129944] INFO -- : make[2]: Entering directory '/tmp/ruby/build/trunk/ext/fiddle' I, [2024-05-22T19:22:11.393640 #4129944] INFO -- : make[2]: Leaving directory '/tmp/ruby/build/trunk/ext/fiddle' I, [2024-05-22T19:22:11.398628 #4129944] INFO -- : make[2]: Entering directory '/tmp/ruby/build/trunk/ext/io/console' I, [2024-05-22T19:22:11.402840 #4129944] INFO -- : make[2]: Leaving directory '/tmp/ruby/build/trunk/ext/io/console' I, [2024-05-22T19:22:11.415571 #4129944] INFO -- : make[2]: Entering directory '/tmp/ruby/build/trunk/ext/json' I, [2024-05-22T19:22:11.425184 #4129944] INFO -- : make[2]: Leaving directory '/tmp/ruby/build/trunk/ext/json' I, [2024-05-22T19:22:11.440611 #4129944] INFO -- : make[2]: Entering directory '/tmp/ruby/build/trunk/ext/monitor' I, [2024-05-22T19:22:11.444631 #4129944] INFO -- : make[2]: Leaving directory '/tmp/ruby/build/trunk/ext/monitor' I, [2024-05-22T19:22:11.451859 #4129944] INFO -- : make[2]: Entering directory '/tmp/ruby/build/trunk/ext/objspace' I, [2024-05-22T19:22:11.458016 #4129944] INFO -- : make[2]: Leaving directory '/tmp/ruby/build/trunk/ext/objspace' I, [2024-05-22T19:22:11.478116 #4129944] INFO -- : make[2]: Entering directory '/tmp/ruby/build/trunk/ext/openssl' I, [2024-05-22T19:22:11.500370 #4129944] INFO -- : make[2]: Leaving directory '/tmp/ruby/build/trunk/ext/openssl' I, [2024-05-22T19:22:11.505464 #4129944] INFO -- : make[2]: Entering directory '/tmp/ruby/build/trunk/ext/pathname' I, [2024-05-22T19:22:11.509809 #4129944] INFO -- : make[2]: Leaving directory '/tmp/ruby/build/trunk/ext/pathname' I, [2024-05-22T19:22:11.517227 #4129944] INFO -- : make[2]: Entering directory '/tmp/ruby/build/trunk/ext/psych' I, [2024-05-22T19:22:11.542608 #4129944] INFO -- : make[2]: Leaving directory '/tmp/ruby/build/trunk/ext/psych' I, [2024-05-22T19:22:11.547516 #4129944] INFO -- : make[2]: Entering directory '/tmp/ruby/build/trunk/ext/pty' I, [2024-05-22T19:22:11.552091 #4129944] INFO -- : make[2]: Leaving directory '/tmp/ruby/build/trunk/ext/pty' I, [2024-05-22T19:22:11.568489 #4129944] INFO -- : make[2]: Entering directory '/tmp/ruby/build/trunk/ext/ripper' I, [2024-05-22T19:22:11.576668 #4129944] INFO -- : make[2]: Leaving directory '/tmp/ruby/build/trunk/ext/ripper' I, [2024-05-22T19:22:11.579174 #4129944] INFO -- : make[2]: Entering directory '/tmp/ruby/build/trunk/ext/rubyvm' I, [2024-05-22T19:22:11.582467 #4129944] INFO -- : make[2]: Leaving directory '/tmp/ruby/build/trunk/ext/rubyvm' I, [2024-05-22T19:22:11.595681 #4129944] INFO -- : make[2]: Entering directory '/tmp/ruby/build/trunk/ext/socket' I, [2024-05-22T19:22:11.605667 #4129944] INFO -- : make[2]: Leaving directory '/tmp/ruby/build/trunk/ext/socket' I, [2024-05-22T19:22:11.623818 #4129944] INFO -- : make[2]: Entering directory '/tmp/ruby/build/trunk/.bundle/gems/bigdecimal-3.1.8/ext/bigdecimal' I, [2024-05-22T19:22:11.648441 #4129944] INFO -- : make[2]: Leaving directory '/tmp/ruby/build/trunk/.bundle/gems/bigdecimal-3.1.8/ext/bigdecimal' I, [2024-05-22T19:22:11.650433 #4129944] INFO -- : make[2]: Entering directory '/tmp/ruby/build/trunk/.bundle/gems/debug-1.9.2/ext/debug' I, [2024-05-22T19:22:11.675012 #4129944] INFO -- : make[2]: Leaving directory '/tmp/ruby/build/trunk/.bundle/gems/debug-1.9.2/ext/debug' I, [2024-05-22T19:22:11.676967 #4129944] INFO -- : make[2]: Entering directory '/tmp/ruby/build/trunk/.bundle/gems/nkf-0.2.0/ext/nkf' I, [2024-05-22T19:22:11.699112 #4129944] INFO -- : make[2]: Leaving directory '/tmp/ruby/build/trunk/.bundle/gems/nkf-0.2.0/ext/nkf' I, [2024-05-22T19:22:11.701094 #4129944] INFO -- : make[2]: Entering directory '/tmp/ruby/build/trunk/.bundle/gems/racc-1.7.3/ext/racc/cparse' I, [2024-05-22T19:22:11.727197 #4129944] INFO -- : make[2]: Leaving directory '/tmp/ruby/build/trunk/.bundle/gems/racc-1.7.3/ext/racc/cparse' I, [2024-05-22T19:22:11.729207 #4129944] INFO -- : make[2]: Entering directory '/tmp/ruby/build/trunk/.bundle/gems/racc-1.8.0/ext/racc/cparse' I, [2024-05-22T19:22:11.751540 #4129944] INFO -- : make[2]: Leaving directory '/tmp/ruby/build/trunk/.bundle/gems/racc-1.8.0/ext/racc/cparse' I, [2024-05-22T19:22:11.753788 #4129944] INFO -- : make[2]: Entering directory '/tmp/ruby/build/trunk/.bundle/gems/rbs-3.4.4/ext/rbs_extension' I, [2024-05-22T19:22:11.780720 #4129944] INFO -- : make[2]: Leaving directory '/tmp/ruby/build/trunk/.bundle/gems/rbs-3.4.4/ext/rbs_extension' I, [2024-05-22T19:22:11.782691 #4129944] INFO -- : make[2]: Entering directory '/tmp/ruby/build/trunk/.bundle/gems/syslog-0.1.2/ext/syslog' I, [2024-05-22T19:22:11.804412 #4129944] INFO -- : make[2]: Leaving directory '/tmp/ruby/build/trunk/.bundle/gems/syslog-0.1.2/ext/syslog' I, [2024-05-22T19:22:11.827887 #4129944] INFO -- : make[2]: Entering directory '/tmp/ruby/build/trunk' I, [2024-05-22T19:22:11.890876 #4129944] INFO -- : make[2]: 'ruby' is up to date. I, [2024-05-22T19:22:11.890913 #4129944] INFO -- : make[2]: Leaving directory '/tmp/ruby/build/trunk' I, [2024-05-22T19:22:11.891177 #4129944] INFO -- : make[1]: Leaving directory '/tmp/ruby/build/trunk' I, [2024-05-22T19:22:11.894672 #4129944] INFO -- : make[1]: Entering directory '/tmp/ruby/build/trunk' I, [2024-05-22T19:22:11.894694 #4129944] INFO -- : make[1]: Nothing to be done for 'note'. I, [2024-05-22T19:22:11.894700 #4129944] INFO -- : make[1]: Leaving directory '/tmp/ruby/build/trunk' E, [2024-05-22T19:22:11.953446 #4129944] ERROR -- : $ /tmp/ruby/build/trunk/miniruby -I/tmp/ruby/src/trunk/lib /tmp/ruby/src/trunk/tool/runruby.rb --archdir=/tmp/ruby/build/trunk --extout=.ext -- /tmp/ruby/src/trunk/spec/mspec/bin/mspec-run -B /tmp/ruby/src/trunk/spec/default.mspec --error-output stderr --debug -fy -o /tmp/rubytest.eckob1/1-mspec-multi-0 E, [2024-05-22T19:22:11.953659 #4129944] ERROR -- : $ /tmp/ruby/build/trunk/miniruby -I/tmp/ruby/src/trunk/lib /tmp/ruby/src/trunk/tool/runruby.rb --archdir=/tmp/ruby/build/trunk --extout=.ext -- /tmp/ruby/src/trunk/spec/mspec/bin/mspec-run -B /tmp/ruby/src/trunk/spec/default.mspec --error-output stderr --debug -fy -o /tmp/rubytest.eckob1/2-mspec-multi-1 E, [2024-05-22T19:22:11.953925 #4129944] ERROR -- : $ /tmp/ruby/build/trunk/miniruby -I/tmp/ruby/src/trunk/lib /tmp/ruby/src/trunk/tool/runruby.rb --archdir=/tmp/ruby/build/trunk --extout=.ext -- /tmp/ruby/src/trunk/spec/mspec/bin/mspec-run -B /tmp/ruby/src/trunk/spec/default.mspec --error-output stderr --debug -fy -o /tmp/rubytest.eckob1/3-mspec-multi-2 E, [2024-05-22T19:22:11.954200 #4129944] ERROR -- : $ /tmp/ruby/build/trunk/miniruby -I/tmp/ruby/src/trunk/lib /tmp/ruby/src/trunk/tool/runruby.rb --archdir=/tmp/ruby/build/trunk --extout=.ext -- /tmp/ruby/src/trunk/spec/mspec/bin/mspec-run -B /tmp/ruby/src/trunk/spec/default.mspec --error-output stderr --debug -fy -o /tmp/rubytest.eckob1/4-mspec-multi-3 E, [2024-05-22T19:22:11.954477 #4129944] ERROR -- : $ /tmp/ruby/build/trunk/miniruby -I/tmp/ruby/src/trunk/lib /tmp/ruby/src/trunk/tool/runruby.rb --archdir=/tmp/ruby/build/trunk --extout=.ext -- /tmp/ruby/src/trunk/spec/mspec/bin/mspec-run -B /tmp/ruby/src/trunk/spec/default.mspec --error-output stderr --debug -fy -o /tmp/rubytest.eckob1/5-mspec-multi-4 E, [2024-05-22T19:22:11.954602 #4129944] ERROR -- : $ /tmp/ruby/build/trunk/miniruby -I/tmp/ruby/src/trunk/lib /tmp/ruby/src/trunk/tool/runruby.rb --archdir=/tmp/ruby/build/trunk --extout=.ext -- /tmp/ruby/src/trunk/spec/mspec/bin/mspec-run -B /tmp/ruby/src/trunk/spec/default.mspec --error-output stderr --debug -fy -o /tmp/rubytest.eckob1/6-mspec-multi-5 E, [2024-05-22T19:22:11.954842 #4129944] ERROR -- : $ /tmp/ruby/build/trunk/miniruby -I/tmp/ruby/src/trunk/lib /tmp/ruby/src/trunk/tool/runruby.rb --archdir=/tmp/ruby/build/trunk --extout=.ext -- /tmp/ruby/src/trunk/spec/mspec/bin/mspec-run -B /tmp/ruby/src/trunk/spec/default.mspec --error-output stderr --debug -fy -o /tmp/rubytest.eckob1/7-mspec-multi-6 E, [2024-05-22T19:22:11.954976 #4129944] ERROR -- : $ /tmp/ruby/build/trunk/miniruby -I/tmp/ruby/src/trunk/lib /tmp/ruby/src/trunk/tool/runruby.rb --archdir=/tmp/ruby/build/trunk --extout=.ext -- /tmp/ruby/src/trunk/spec/mspec/bin/mspec-run -B /tmp/ruby/src/trunk/spec/default.mspec --error-output stderr --debug -fy -o /tmp/rubytest.eckob1/8-mspec-multi-7 E, [2024-05-22T19:22:11.955174 #4129944] ERROR -- : $ /tmp/ruby/build/trunk/miniruby -I/tmp/ruby/src/trunk/lib /tmp/ruby/src/trunk/tool/runruby.rb --archdir=/tmp/ruby/build/trunk --extout=.ext -- /tmp/ruby/src/trunk/spec/mspec/bin/mspec-run -B /tmp/ruby/src/trunk/spec/default.mspec --error-output stderr --debug -fy -o /tmp/rubytest.eckob1/9-mspec-multi-8 E, [2024-05-22T19:22:11.955413 #4129944] ERROR -- : $ /tmp/ruby/build/trunk/miniruby -I/tmp/ruby/src/trunk/lib /tmp/ruby/src/trunk/tool/runruby.rb --archdir=/tmp/ruby/build/trunk --extout=.ext -- /tmp/ruby/src/trunk/spec/mspec/bin/mspec-run -B /tmp/ruby/src/trunk/spec/default.mspec --error-output stderr --debug -fy -o /tmp/rubytest.eckob1/10-mspec-multi-9 E, [2024-05-22T19:22:11.955842 #4129944] ERROR -- : $ /tmp/ruby/build/trunk/miniruby -I/tmp/ruby/src/trunk/lib /tmp/ruby/src/trunk/tool/runruby.rb --archdir=/tmp/ruby/build/trunk --extout=.ext -- /tmp/ruby/src/trunk/spec/mspec/bin/mspec-run -B /tmp/ruby/src/trunk/spec/default.mspec --error-output stderr --debug -fy -o /tmp/rubytest.eckob1/11-mspec-multi-10 E, [2024-05-22T19:22:11.955875 #4129944] ERROR -- : $ /tmp/ruby/build/trunk/miniruby -I/tmp/ruby/src/trunk/lib /tmp/ruby/src/trunk/tool/runruby.rb --archdir=/tmp/ruby/build/trunk --extout=.ext -- /tmp/ruby/src/trunk/spec/mspec/bin/mspec-run -B /tmp/ruby/src/trunk/spec/default.mspec --error-output stderr --debug -fy -o /tmp/rubytest.eckob1/12-mspec-multi-11 E, [2024-05-22T19:22:11.956046 #4129944] ERROR -- : $ /tmp/ruby/build/trunk/miniruby -I/tmp/ruby/src/trunk/lib /tmp/ruby/src/trunk/tool/runruby.rb --archdir=/tmp/ruby/build/trunk --extout=.ext -- /tmp/ruby/src/trunk/spec/mspec/bin/mspec-run -B /tmp/ruby/src/trunk/spec/default.mspec --error-output stderr --debug -fy -o /tmp/rubytest.eckob1/13-mspec-multi-12 E, [2024-05-22T19:22:11.956217 #4129944] ERROR -- : $ /tmp/ruby/build/trunk/miniruby -I/tmp/ruby/src/trunk/lib /tmp/ruby/src/trunk/tool/runruby.rb --archdir=/tmp/ruby/build/trunk --extout=.ext -- /tmp/ruby/src/trunk/spec/mspec/bin/mspec-run -B /tmp/ruby/src/trunk/spec/default.mspec --error-output stderr --debug -fy -o /tmp/rubytest.eckob1/14-mspec-multi-13 E, [2024-05-22T19:22:11.956401 #4129944] ERROR -- : $ /tmp/ruby/build/trunk/miniruby -I/tmp/ruby/src/trunk/lib /tmp/ruby/src/trunk/tool/runruby.rb --archdir=/tmp/ruby/build/trunk --extout=.ext -- /tmp/ruby/src/trunk/spec/mspec/bin/mspec-run -B /tmp/ruby/src/trunk/spec/default.mspec --error-output stderr --debug -fy -o /tmp/rubytest.eckob1/15-mspec-multi-14 E, [2024-05-22T19:22:11.956578 #4129944] ERROR -- : $ /tmp/ruby/build/trunk/miniruby -I/tmp/ruby/src/trunk/lib /tmp/ruby/src/trunk/tool/runruby.rb --archdir=/tmp/ruby/build/trunk --extout=.ext -- /tmp/ruby/src/trunk/spec/mspec/bin/mspec-run -B /tmp/ruby/src/trunk/spec/default.mspec --error-output stderr --debug -fy -o /tmp/rubytest.eckob1/16-mspec-multi-15 E, [2024-05-22T19:22:11.956772 #4129944] ERROR -- : $ /tmp/ruby/build/trunk/miniruby -I/tmp/ruby/src/trunk/lib /tmp/ruby/src/trunk/tool/runruby.rb --archdir=/tmp/ruby/build/trunk --extout=.ext -- /tmp/ruby/src/trunk/spec/mspec/bin/mspec-run -B /tmp/ruby/src/trunk/spec/default.mspec --error-output stderr --debug -fy -o /tmp/rubytest.eckob1/17-mspec-multi-16 E, [2024-05-22T19:22:11.956986 #4129944] ERROR -- : $ /tmp/ruby/build/trunk/miniruby -I/tmp/ruby/src/trunk/lib /tmp/ruby/src/trunk/tool/runruby.rb --archdir=/tmp/ruby/build/trunk --extout=.ext -- /tmp/ruby/src/trunk/spec/mspec/bin/mspec-run -B /tmp/ruby/src/trunk/spec/default.mspec --error-output stderr --debug -fy -o /tmp/rubytest.eckob1/18-mspec-multi-17 E, [2024-05-22T19:22:11.959181 #4129944] ERROR -- : $ /tmp/ruby/build/trunk/miniruby -I/tmp/ruby/src/trunk/lib /tmp/ruby/src/trunk/tool/runruby.rb --archdir=/tmp/ruby/build/trunk --extout=.ext -- /tmp/ruby/src/trunk/spec/mspec/bin/mspec-run -B /tmp/ruby/src/trunk/spec/default.mspec --error-output stderr --debug -fy -o /tmp/rubytest.eckob1/19-mspec-multi-18 E, [2024-05-22T19:22:11.959418 #4129944] ERROR -- : $ /tmp/ruby/build/trunk/miniruby -I/tmp/ruby/src/trunk/lib /tmp/ruby/src/trunk/tool/runruby.rb --archdir=/tmp/ruby/build/trunk --extout=.ext -- /tmp/ruby/src/trunk/spec/mspec/bin/mspec-run -B /tmp/ruby/src/trunk/spec/default.mspec --error-output stderr --debug -fy -o /tmp/rubytest.eckob1/20-mspec-multi-19 I, [2024-05-22T19:22:12.125445 #4129944] INFO -- : ruby 3.4.0dev (2024-05-22T06:59:19Z master 5613d6e95b) [x86_64-linux] I, [2024-05-22T19:22:12.698434 #4129944] INFO -- : 0 ......................................................................... I, [2024-05-22T19:22:13.143520 #4129944] INFO -- : 73 ......................................................................... I, [2024-05-22T19:22:13.280357 #4129944] INFO -- : 146 ......................................................................... I, [2024-05-22T19:22:13.331254 #4129944] INFO -- : 219 ......................................................................... I, [2024-05-22T19:22:13.395343 #4129944] INFO -- : 292 ......................................................................... I, [2024-05-22T19:22:13.439642 #4129944] INFO -- : 365 ......................................................................... I, [2024-05-22T19:22:13.460011 #4129944] INFO -- : 438 ......................................................................... I, [2024-05-22T19:22:13.478352 #4129944] INFO -- : 511 ......................................................................... I, [2024-05-22T19:22:13.495220 #4129944] INFO -- : 584 ......................................................................... I, [2024-05-22T19:22:13.545947 #4129944] INFO -- : 657 ......................................................................... I, [2024-05-22T19:22:13.571347 #4129944] INFO -- : 730 ......................................................................... I, [2024-05-22T19:22:13.596368 #4129944] INFO -- : 803 ......................................................................... I, [2024-05-22T19:22:13.622258 #4129944] INFO -- : 876 ......................................................................... I, [2024-05-22T19:22:13.666153 #4129944] INFO -- : 949 ......................................................................... I, [2024-05-22T19:22:13.762865 #4129944] INFO -- : 1022 ......................................................................... I, [2024-05-22T19:22:13.930334 #4129944] INFO -- : 1095 ......................................................................... I, [2024-05-22T19:22:14.040919 #4129944] INFO -- : 1168 ......................................................................... I, [2024-05-22T19:22:14.102169 #4129944] INFO -- : 1241 ......................................................................... I, [2024-05-22T19:22:14.160114 #4129944] INFO -- : 1314 ......................................................................... I, [2024-05-22T19:22:14.181344 #4129944] INFO -- : 1387 ......................................................................... I, [2024-05-22T19:22:14.284418 #4129944] INFO -- : 1460 ......................................................................... I, [2024-05-22T19:22:14.729073 #4129944] INFO -- : 1533 ......................................................................... I, [2024-05-22T19:22:14.808250 #4129944] INFO -- : 1606 ......................................................................... I, [2024-05-22T19:22:14.967702 #4129944] INFO -- : 1679 ......................................................................... I, [2024-05-22T19:22:15.081260 #4129944] INFO -- : 1752 ......................................................................... I, [2024-05-22T19:22:15.165877 #4129944] INFO -- : 1825 ......................................................................... I, [2024-05-22T19:22:15.254105 #4129944] INFO -- : 1898 ......................................................................... I, [2024-05-22T19:22:15.326383 #4129944] INFO -- : 1971 ......................................................................... I, [2024-05-22T19:22:15.393681 #4129944] INFO -- : 2044 ......................................................................... I, [2024-05-22T19:22:15.437737 #4129944] INFO -- : 2117 ......................................................................... I, [2024-05-22T19:22:15.451629 #4129944] INFO -- : 2190 ......................................................................... I, [2024-05-22T19:22:15.469280 #4129944] INFO -- : 2263 ......................................................................... I, [2024-05-22T19:22:15.483503 #4129944] INFO -- : 2336 ......................................................................... I, [2024-05-22T19:22:15.516275 #4129944] INFO -- : 2409 ......................................................................... I, [2024-05-22T19:22:15.619658 #4129944] INFO -- : 2482 ......................................................................... I, [2024-05-22T19:22:15.656045 #4129944] INFO -- : 2555 ......................................................................... I, [2024-05-22T19:22:15.772966 #4129944] INFO -- : 2628 ......................................................................... I, [2024-05-22T19:22:15.870274 #4129944] INFO -- : 2701 ......................................................................... I, [2024-05-22T19:22:15.906182 #4129944] INFO -- : 2774 ......................................................................... I, [2024-05-22T19:22:15.967249 #4129944] INFO -- : 2847 ......................................................................... I, [2024-05-22T19:22:16.004955 #4129944] INFO -- : 2920 ......................................................................... I, [2024-05-22T19:22:16.029413 #4129944] INFO -- : 2993 ......................................................................... I, [2024-05-22T19:22:16.049078 #4129944] INFO -- : 3066 ......................................................................... I, [2024-05-22T19:22:16.061221 #4129944] INFO -- : 3139 ......................................................................... I, [2024-05-22T19:22:16.070211 #4129944] INFO -- : 3212 ......................................................................... I, [2024-05-22T19:22:16.095599 #4129944] INFO -- : 3285 ......................................................................... I, [2024-05-22T19:22:20.049828 #4129944] INFO -- : 3358 ......................................................................... I, [2024-05-22T19:22:20.072343 #4129944] INFO -- : I, [2024-05-22T19:22:20.072375 #4129944] INFO -- : I, [2024-05-22T19:22:20.072381 #4129944] INFO -- : Finished in 8.118131 seconds I, [2024-05-22T19:22:20.072386 #4129944] INFO -- : I, [2024-05-22T19:22:20.072390 #4129944] INFO -- : 3430 files, 32652 examples, 193244 expectations, 0 failures, 0 errors, 0 tagged I, [2024-05-22T19:22:20.074687 #4129944] INFO -- : $$$[end] "make yes-test-rubyspec MSPECOPT='--error-output stderr --debug -j' TESTS='-j20'" exit with 0.