# Logfile created on 2024-05-22 11:23:28 +0000 by logger.rb/v1.4.3 I, [2024-05-22T11:23:28.498301 #4157262] INFO -- : #, @formatter=nil, @logdev=#, @binmode=false, @mon_data=#, @mon_data_owner_object_id=860>>> I, [2024-05-22T11:23:28.498423 #4157262] INFO -- : $$$[beg] make update-unicode -j20 I, [2024-05-22T11:23:28.558117 #4157262] INFO -- : Downloading Unicode emoji 15.0 files... I, [2024-05-22T11:23:28.558340 #4157262] INFO -- : Downloading Unicode emoji 15.0 files... I, [2024-05-22T11:23:28.559019 #4157262] INFO -- : Downloading Unicode emoji 15.0 files... I, [2024-05-22T11:23:28.600717 #4157262] INFO -- : made symlink emoji/15.0/emoji-sequences.txt to /tmp/ruby/src/trunk/.downloaded-cache/emoji/15.0/emoji-sequences.txt E, [2024-05-22T11:23:29.075959 #4157262] ERROR -- : /tmp/ruby/src/trunk/tool/downloader.rb:302:in `rescue in download': failed to download emoji/15.0/emoji-test.txt (RuntimeError) E, [2024-05-22T11:23:29.076102 #4157262] ERROR -- : OpenURI::HTTPError: 403 Forbidden: https://www.unicode.org/Public/emoji/15.0/emoji-test.txt E, [2024-05-22T11:23:29.076123 #4157262] ERROR -- : from /tmp/ruby/src/trunk/tool/downloader.rb:201:in `download' E, [2024-05-22T11:23:29.076138 #4157262] ERROR -- : from /tmp/ruby/src/trunk/tool/downloader.rb:136:in `download' E, [2024-05-22T11:23:29.076151 #4157262] ERROR -- : from /tmp/ruby/src/trunk/tool/downloader.rb:482:in `block in
' E, [2024-05-22T11:23:29.076164 #4157262] ERROR -- : from /tmp/ruby/src/trunk/tool/downloader.rb:465:in `each' E, [2024-05-22T11:23:29.076178 #4157262] ERROR -- : from /tmp/ruby/src/trunk/tool/downloader.rb:465:in `
' E, [2024-05-22T11:23:29.076191 #4157262] ERROR -- : /usr/lib/ruby/3.0.0/open-uri.rb:364:in `open_http': 403 Forbidden (OpenURI::HTTPError) E, [2024-05-22T11:23:29.076205 #4157262] ERROR -- : from /usr/lib/ruby/3.0.0/open-uri.rb:741:in `buffer_open' E, [2024-05-22T11:23:29.076222 #4157262] ERROR -- : from /usr/lib/ruby/3.0.0/open-uri.rb:212:in `block in open_loop' E, [2024-05-22T11:23:29.076235 #4157262] ERROR -- : from /usr/lib/ruby/3.0.0/open-uri.rb:210:in `catch' E, [2024-05-22T11:23:29.076248 #4157262] ERROR -- : from /usr/lib/ruby/3.0.0/open-uri.rb:210:in `open_loop' E, [2024-05-22T11:23:29.076261 #4157262] ERROR -- : from /usr/lib/ruby/3.0.0/open-uri.rb:151:in `open_uri' E, [2024-05-22T11:23:29.076274 #4157262] ERROR -- : from /usr/lib/ruby/3.0.0/open-uri.rb:721:in `open' E, [2024-05-22T11:23:29.076287 #4157262] ERROR -- : from /usr/lib/ruby/3.0.0/open-uri.rb:729:in `read' E, [2024-05-22T11:23:29.076300 #4157262] ERROR -- : from /tmp/ruby/src/trunk/tool/downloader.rb:247:in `block in download' E, [2024-05-22T11:23:29.076313 #4157262] ERROR -- : from /tmp/ruby/src/trunk/tool/downloader.rb:378:in `with_retry' E, [2024-05-22T11:23:29.076330 #4157262] ERROR -- : from /tmp/ruby/src/trunk/tool/downloader.rb:246:in `download' E, [2024-05-22T11:23:29.076363 #4157262] ERROR -- : from /tmp/ruby/src/trunk/tool/downloader.rb:136:in `download' E, [2024-05-22T11:23:29.076376 #4157262] ERROR -- : from /tmp/ruby/src/trunk/tool/downloader.rb:482:in `block in
' E, [2024-05-22T11:23:29.076390 #4157262] ERROR -- : from /tmp/ruby/src/trunk/tool/downloader.rb:465:in `each' E, [2024-05-22T11:23:29.076403 #4157262] ERROR -- : from /tmp/ruby/src/trunk/tool/downloader.rb:465:in `
' E, [2024-05-22T11:23:29.081085 #4157262] ERROR -- : make: *** [uncommon.mk:1756: /tmp/ruby/src/trunk/enc/unicode/data/emoji/15.0/emoji-test.txt] Error 1 E, [2024-05-22T11:23:29.081149 #4157262] ERROR -- : make: *** Waiting for unfinished jobs.... E, [2024-05-22T11:23:29.499473 #4157262] ERROR -- : /tmp/ruby/src/trunk/tool/downloader.rb:302:in `rescue in download': failed to download emoji/15.0/emoji-sequences.txt (RuntimeError) E, [2024-05-22T11:23:29.499610 #4157262] ERROR -- : EOFError: end of file reached: https://www.unicode.org/Public/emoji/15.0/emoji-sequences.txt E, [2024-05-22T11:23:29.499630 #4157262] ERROR -- : from /tmp/ruby/src/trunk/tool/downloader.rb:201:in `download' E, [2024-05-22T11:23:29.499643 #4157262] ERROR -- : from /tmp/ruby/src/trunk/tool/downloader.rb:136:in `download' E, [2024-05-22T11:23:29.499655 #4157262] ERROR -- : from /tmp/ruby/src/trunk/tool/downloader.rb:482:in `block in
' E, [2024-05-22T11:23:29.499667 #4157262] ERROR -- : from /tmp/ruby/src/trunk/tool/downloader.rb:465:in `each' E, [2024-05-22T11:23:29.499679 #4157262] ERROR -- : from /tmp/ruby/src/trunk/tool/downloader.rb:465:in `
' E, [2024-05-22T11:23:29.499723 #4157262] ERROR -- : /usr/lib/ruby/3.0.0/net/protocol.rb:227:in `rbuf_fill': end of file reached (EOFError) E, [2024-05-22T11:23:29.499736 #4157262] ERROR -- : from /usr/lib/ruby/3.0.0/net/protocol.rb:193:in `readuntil' E, [2024-05-22T11:23:29.499751 #4157262] ERROR -- : from /usr/lib/ruby/3.0.0/net/protocol.rb:203:in `readline' E, [2024-05-22T11:23:29.499764 #4157262] ERROR -- : from /usr/lib/ruby/3.0.0/net/http/response.rb:42:in `read_status_line' E, [2024-05-22T11:23:29.499778 #4157262] ERROR -- : from /usr/lib/ruby/3.0.0/net/http/response.rb:31:in `read_new' E, [2024-05-22T11:23:29.499790 #4157262] ERROR -- : from /usr/lib/ruby/3.0.0/net/http.rb:1557:in `block in transport_request' E, [2024-05-22T11:23:29.499802 #4157262] ERROR -- : from /usr/lib/ruby/3.0.0/net/http.rb:1548:in `catch' E, [2024-05-22T11:23:29.499815 #4157262] ERROR -- : from /usr/lib/ruby/3.0.0/net/http.rb:1548:in `transport_request' E, [2024-05-22T11:23:29.499826 #4157262] ERROR -- : from /usr/lib/ruby/3.0.0/net/http.rb:1521:in `request' E, [2024-05-22T11:23:29.499838 #4157262] ERROR -- : from /usr/lib/ruby/3.0.0/open-uri.rb:329:in `block in open_http' E, [2024-05-22T11:23:29.499856 #4157262] ERROR -- : from /usr/lib/ruby/3.0.0/net/http.rb:960:in `start' E, [2024-05-22T11:23:29.499867 #4157262] ERROR -- : from /usr/lib/ruby/3.0.0/open-uri.rb:323:in `open_http' E, [2024-05-22T11:23:29.499879 #4157262] ERROR -- : from /usr/lib/ruby/3.0.0/open-uri.rb:741:in `buffer_open' E, [2024-05-22T11:23:29.499891 #4157262] ERROR -- : from /usr/lib/ruby/3.0.0/open-uri.rb:212:in `block in open_loop' E, [2024-05-22T11:23:29.499902 #4157262] ERROR -- : from /usr/lib/ruby/3.0.0/open-uri.rb:210:in `catch' E, [2024-05-22T11:23:29.499914 #4157262] ERROR -- : from /usr/lib/ruby/3.0.0/open-uri.rb:210:in `open_loop' E, [2024-05-22T11:23:29.499932 #4157262] ERROR -- : from /usr/lib/ruby/3.0.0/open-uri.rb:151:in `open_uri' E, [2024-05-22T11:23:29.499944 #4157262] ERROR -- : from /usr/lib/ruby/3.0.0/open-uri.rb:721:in `open' E, [2024-05-22T11:23:29.499955 #4157262] ERROR -- : from /usr/lib/ruby/3.0.0/open-uri.rb:729:in `read' E, [2024-05-22T11:23:29.499970 #4157262] ERROR -- : from /tmp/ruby/src/trunk/tool/downloader.rb:247:in `block in download' E, [2024-05-22T11:23:29.499981 #4157262] ERROR -- : from /tmp/ruby/src/trunk/tool/downloader.rb:378:in `with_retry' E, [2024-05-22T11:23:29.499992 #4157262] ERROR -- : from /tmp/ruby/src/trunk/tool/downloader.rb:246:in `download' E, [2024-05-22T11:23:29.500020 #4157262] ERROR -- : from /tmp/ruby/src/trunk/tool/downloader.rb:136:in `download' E, [2024-05-22T11:23:29.500032 #4157262] ERROR -- : from /tmp/ruby/src/trunk/tool/downloader.rb:482:in `block in
' E, [2024-05-22T11:23:29.500044 #4157262] ERROR -- : from /tmp/ruby/src/trunk/tool/downloader.rb:465:in `each' E, [2024-05-22T11:23:29.500056 #4157262] ERROR -- : from /tmp/ruby/src/trunk/tool/downloader.rb:465:in `
' E, [2024-05-22T11:23:29.504078 #4157262] ERROR -- : make: *** [uncommon.mk:1756: /tmp/ruby/src/trunk/enc/unicode/data/emoji/15.0/emoji-zwj-sequences.txt] Error 1 E, [2024-05-22T11:23:29.521402 #4157262] ERROR -- : /tmp/ruby/src/trunk/tool/downloader.rb:302:in `rescue in download': failed to download emoji/15.0/emoji-sequences.txt (RuntimeError) E, [2024-05-22T11:23:29.521484 #4157262] ERROR -- : EOFError: end of file reached: https://www.unicode.org/Public/emoji/15.0/emoji-sequences.txt E, [2024-05-22T11:23:29.521506 #4157262] ERROR -- : from /tmp/ruby/src/trunk/tool/downloader.rb:201:in `download' E, [2024-05-22T11:23:29.521518 #4157262] ERROR -- : from /tmp/ruby/src/trunk/tool/downloader.rb:136:in `download' E, [2024-05-22T11:23:29.521529 #4157262] ERROR -- : from /tmp/ruby/src/trunk/tool/downloader.rb:482:in `block in
' E, [2024-05-22T11:23:29.521749 #4157262] ERROR -- : from /tmp/ruby/src/trunk/tool/downloader.rb:465:in `each' E, [2024-05-22T11:23:29.521767 #4157262] ERROR -- : from /tmp/ruby/src/trunk/tool/downloader.rb:465:in `
' E, [2024-05-22T11:23:29.521779 #4157262] ERROR -- : /usr/lib/ruby/3.0.0/net/protocol.rb:227:in `rbuf_fill': end of file reached (EOFError) E, [2024-05-22T11:23:29.521793 #4157262] ERROR -- : from /usr/lib/ruby/3.0.0/net/protocol.rb:193:in `readuntil' E, [2024-05-22T11:23:29.521805 #4157262] ERROR -- : from /usr/lib/ruby/3.0.0/net/protocol.rb:203:in `readline' E, [2024-05-22T11:23:29.521817 #4157262] ERROR -- : from /usr/lib/ruby/3.0.0/net/http/response.rb:42:in `read_status_line' E, [2024-05-22T11:23:29.521844 #4157262] ERROR -- : from /usr/lib/ruby/3.0.0/net/http/response.rb:31:in `read_new' E, [2024-05-22T11:23:29.521856 #4157262] ERROR -- : from /usr/lib/ruby/3.0.0/net/http.rb:1557:in `block in transport_request' E, [2024-05-22T11:23:29.521874 #4157262] ERROR -- : from /usr/lib/ruby/3.0.0/net/http.rb:1548:in `catch' E, [2024-05-22T11:23:29.521886 #4157262] ERROR -- : from /usr/lib/ruby/3.0.0/net/http.rb:1548:in `transport_request' E, [2024-05-22T11:23:29.521898 #4157262] ERROR -- : from /usr/lib/ruby/3.0.0/net/http.rb:1521:in `request' E, [2024-05-22T11:23:29.521909 #4157262] ERROR -- : from /usr/lib/ruby/3.0.0/open-uri.rb:329:in `block in open_http' E, [2024-05-22T11:23:29.521920 #4157262] ERROR -- : from /usr/lib/ruby/3.0.0/net/http.rb:960:in `start' E, [2024-05-22T11:23:29.521932 #4157262] ERROR -- : from /usr/lib/ruby/3.0.0/open-uri.rb:323:in `open_http' E, [2024-05-22T11:23:29.521943 #4157262] ERROR -- : from /usr/lib/ruby/3.0.0/open-uri.rb:741:in `buffer_open' E, [2024-05-22T11:23:29.521958 #4157262] ERROR -- : from /usr/lib/ruby/3.0.0/open-uri.rb:212:in `block in open_loop' E, [2024-05-22T11:23:29.521970 #4157262] ERROR -- : from /usr/lib/ruby/3.0.0/open-uri.rb:210:in `catch' E, [2024-05-22T11:23:29.521981 #4157262] ERROR -- : from /usr/lib/ruby/3.0.0/open-uri.rb:210:in `open_loop' E, [2024-05-22T11:23:29.521993 #4157262] ERROR -- : from /usr/lib/ruby/3.0.0/open-uri.rb:151:in `open_uri' E, [2024-05-22T11:23:29.522004 #4157262] ERROR -- : from /usr/lib/ruby/3.0.0/open-uri.rb:721:in `open' E, [2024-05-22T11:23:29.522015 #4157262] ERROR -- : from /usr/lib/ruby/3.0.0/open-uri.rb:729:in `read' E, [2024-05-22T11:23:29.522028 #4157262] ERROR -- : from /tmp/ruby/src/trunk/tool/downloader.rb:247:in `block in download' E, [2024-05-22T11:23:29.522041 #4157262] ERROR -- : from /tmp/ruby/src/trunk/tool/downloader.rb:378:in `with_retry' E, [2024-05-22T11:23:29.522054 #4157262] ERROR -- : from /tmp/ruby/src/trunk/tool/downloader.rb:246:in `download' E, [2024-05-22T11:23:29.522088 #4157262] ERROR -- : from /tmp/ruby/src/trunk/tool/downloader.rb:136:in `download' E, [2024-05-22T11:23:29.522101 #4157262] ERROR -- : from /tmp/ruby/src/trunk/tool/downloader.rb:482:in `block in
' E, [2024-05-22T11:23:29.522114 #4157262] ERROR -- : from /tmp/ruby/src/trunk/tool/downloader.rb:465:in `each' E, [2024-05-22T11:23:29.522127 #4157262] ERROR -- : from /tmp/ruby/src/trunk/tool/downloader.rb:465:in `
' E, [2024-05-22T11:23:29.527627 #4157262] ERROR -- : make: *** [uncommon.mk:1756: /tmp/ruby/src/trunk/enc/unicode/data/emoji/15.0/emoji-sequences.txt] Error 1 E, [2024-05-22T11:23:29.527870 #4157262] ERROR -- : make: *** Deleting file '/tmp/ruby/src/trunk/enc/unicode/data/emoji/15.0/emoji-sequences.txt' I, [2024-05-22T11:23:29.527726 #4157262] INFO -- : downloading emoji/15.0/emoji-sequences.txt ... downloading emoji/15.0/emoji-test.txt ... downloading emoji/15.0/emoji-sequences.txt ... I, [2024-05-22T11:23:29.528472 #4157262] INFO -- : $$$[end] "make update-unicode -j20" exit with 512. I, [2024-05-22T11:23:29.528560 #4157262] INFO -- : $$$[beg] make update-download -j20 I, [2024-05-22T11:23:29.643826 #4157262] INFO -- : tool/config.guess already exists I, [2024-05-22T11:23:29.643868 #4157262] INFO -- : tool/config.sub already exists I, [2024-05-22T11:23:29.646094 #4157262] INFO -- : Update power_assert to 84e85124c5014a139af39161d484156cfe87a9ed I, [2024-05-22T11:23:29.646266 #4157262] INFO -- : Update rbs to ba7872795d5de04adb8ff500c0e6afdc81a041dd I, [2024-05-22T11:23:29.646920 #4157262] INFO -- : Update typeprof to b19a6416da3a05d57fadd6ffdadb382b6d236ca5 I, [2024-05-22T11:23:29.647350 #4157262] INFO -- : echo 84e85124c5014a139af39161d484156cfe87a9ed | /bin/sh /tmp/ruby/src/trunk/tool/ifchange /tmp/ruby/src/trunk/.bundle/.timestamp/power_assert.revision - I, [2024-05-22T11:23:29.647414 #4157262] INFO -- : echo ba7872795d5de04adb8ff500c0e6afdc81a041dd | /bin/sh /tmp/ruby/src/trunk/tool/ifchange /tmp/ruby/src/trunk/.bundle/.timestamp/rbs.revision - I, [2024-05-22T11:23:29.647930 #4157262] INFO -- : echo b19a6416da3a05d57fadd6ffdadb382b6d236ca5 | /bin/sh /tmp/ruby/src/trunk/tool/ifchange /tmp/ruby/src/trunk/.bundle/.timestamp/typeprof.revision - I, [2024-05-22T11:23:29.649103 #4157262] INFO -- : /tmp/ruby/src/trunk/.bundle/.timestamp/power_assert.revision unchanged I, [2024-05-22T11:23:29.649267 #4157262] INFO -- : /tmp/ruby/src/trunk/.bundle/.timestamp/rbs.revision unchanged I, [2024-05-22T11:23:29.649726 #4157262] INFO -- : /tmp/ruby/src/trunk/.bundle/.timestamp/typeprof.revision unchanged I, [2024-05-22T11:23:29.649946 #4157262] INFO -- : Building power_assert@84e85124c5014a139af39161d484156cfe87a9ed to /tmp/ruby/src/trunk/gems/power_assert-2.0.3.gem I, [2024-05-22T11:23:29.719083 #4157262] INFO -- : Successfully built RubyGem I, [2024-05-22T11:23:29.719134 #4157262] INFO -- : Name: power_assert I, [2024-05-22T11:23:29.719141 #4157262] INFO -- : Version: 2.0.4dev I, [2024-05-22T11:23:29.719146 #4157262] INFO -- : File: power_assert-2.0.4dev.gem I, [2024-05-22T11:23:29.764143 #4157262] INFO -- : $$$[end] "make update-download -j20" exit with 0. I, [2024-05-22T11:23:29.764198 #4157262] INFO -- : $$$[beg] make update-rubyspec -j20 I, [2024-05-22T11:23:29.826099 #4157262] INFO -- : make: Nothing to be done for 'update-rubyspec'. I, [2024-05-22T11:23:29.826467 #4157262] INFO -- : $$$[end] "make update-rubyspec -j20" exit with 0. I, [2024-05-22T11:23:29.826497 #4157262] INFO -- : $$$[beg] make update-src -j20 I, [2024-05-22T11:23:30.531167 #4157262] INFO -- : Already up to date. I, [2024-05-22T11:23:30.548686 #4157262] INFO -- : Latest commit hash = 5613d6e95b I, [2024-05-22T11:23:30.550520 #4157262] INFO -- : $$$[end] "make update-src -j20" exit with 0. I, [2024-05-22T11:23:30.550566 #4157262] INFO -- : $$$[beg] make after-update -j20 I, [2024-05-22T11:23:30.651048 #4157262] INFO -- : /tmp/ruby/src/trunk/revision.h updated I, [2024-05-22T11:23:30.652355 #4157262] INFO -- : generating x86_64-linux-fake.rb I, [2024-05-22T11:23:30.704736 #4157262] INFO -- : x86_64-linux-fake.rb updated I, [2024-05-22T11:23:30.706077 #4157262] INFO -- : generating enc.mk I, [2024-05-22T11:23:30.822552 #4157262] INFO -- : making srcs under enc I, [2024-05-22T11:23:30.852593 #4157262] INFO -- : make[1]: Entering directory '/tmp/ruby/build/trunk' I, [2024-05-22T11:23:30.852616 #4157262] INFO -- : make[1]: Nothing to be done for 'srcs'. I, [2024-05-22T11:23:30.852621 #4157262] INFO -- : make[1]: Leaving directory '/tmp/ruby/build/trunk' I, [2024-05-22T11:23:30.901011 #4157262] INFO -- : Update power_assert to 84e85124c5014a139af39161d484156cfe87a9ed I, [2024-05-22T11:23:30.901421 #4157262] INFO -- : Update rbs to ba7872795d5de04adb8ff500c0e6afdc81a041dd I, [2024-05-22T11:23:30.901938 #4157262] INFO -- : Update typeprof to b19a6416da3a05d57fadd6ffdadb382b6d236ca5 I, [2024-05-22T11:23:30.902581 #4157262] INFO -- : echo 84e85124c5014a139af39161d484156cfe87a9ed | /bin/sh /tmp/ruby/src/trunk/tool/ifchange /tmp/ruby/src/trunk/.bundle/.timestamp/power_assert.revision - I, [2024-05-22T11:23:30.902703 #4157262] INFO -- : echo ba7872795d5de04adb8ff500c0e6afdc81a041dd | /bin/sh /tmp/ruby/src/trunk/tool/ifchange /tmp/ruby/src/trunk/.bundle/.timestamp/rbs.revision - I, [2024-05-22T11:23:30.903375 #4157262] INFO -- : echo b19a6416da3a05d57fadd6ffdadb382b6d236ca5 | /bin/sh /tmp/ruby/src/trunk/tool/ifchange /tmp/ruby/src/trunk/.bundle/.timestamp/typeprof.revision - I, [2024-05-22T11:23:30.904422 #4157262] INFO -- : /tmp/ruby/src/trunk/.bundle/.timestamp/power_assert.revision unchanged I, [2024-05-22T11:23:30.904989 #4157262] INFO -- : /tmp/ruby/src/trunk/.bundle/.timestamp/rbs.revision unchanged I, [2024-05-22T11:23:30.905492 #4157262] INFO -- : /tmp/ruby/src/trunk/.bundle/.timestamp/typeprof.revision unchanged I, [2024-05-22T11:23:30.905566 #4157262] INFO -- : Building power_assert@84e85124c5014a139af39161d484156cfe87a9ed to /tmp/ruby/src/trunk/gems/power_assert-2.0.3.gem I, [2024-05-22T11:23:30.974943 #4157262] INFO -- : Successfully built RubyGem I, [2024-05-22T11:23:30.974991 #4157262] INFO -- : Name: power_assert I, [2024-05-22T11:23:30.974999 #4157262] INFO -- : Version: 2.0.4dev I, [2024-05-22T11:23:30.975004 #4157262] INFO -- : File: power_assert-2.0.4dev.gem I, [2024-05-22T11:23:30.977105 #4157262] INFO -- : Extracting bundle gem power_assert-2.0.3... I, [2024-05-22T11:23:31.037854 #4157262] INFO -- : Try with hash version of bundled gems instead of gems/power_assert-2.0.3.gem. We don't use this gem with release version of Ruby. I, [2024-05-22T11:23:31.042806 #4157262] INFO -- : Unpacked gems/power_assert-2.0.4dev.gem I, [2024-05-22T11:23:31.044832 #4157262] INFO -- : $$$[end] "make after-update -j20" exit with 0. I, [2024-05-22T11:23:31.044950 #4157262] INFO -- : $$$[beg] make miniruby -j20 I, [2024-05-22T11:23:31.101942 #4157262] INFO -- : BASERUBY = /usr/bin/ruby --disable=gems I, [2024-05-22T11:23:31.101984 #4157262] INFO -- : CC = gcc I, [2024-05-22T11:23:31.101997 #4157262] INFO -- : LD = ld I, [2024-05-22T11:23:31.102007 #4157262] INFO -- : LDSHARED = gcc -shared I, [2024-05-22T11:23:31.102018 #4157262] INFO -- : CFLAGS = -O3 -fno-fast-math -ggdb3 -Wall -Wextra -Wdeprecated-declarations -Wdiv-by-zero -Wduplicated-cond -Wimplicit-function-declaration -Wimplicit-int -Wpointer-arith -Wwrite-strings -Wold-style-definition -Wimplicit-fallthrough=0 -Wmissing-noreturn -Wno-cast-function-type -Wno-constant-logical-operand -Wno-long-long -Wno-missing-field-initializers -Wno-overlength-strings -Wno-packed-bitfield-compat -Wno-parentheses-equality -Wno-self-assign -Wno-tautological-compare -Wno-unused-parameter -Wno-unused-value -Wsuggest-attribute=format -Wsuggest-attribute=noreturn -Wunused-variable -Wmisleading-indentation -Wundef -fPIC I, [2024-05-22T11:23:31.102029 #4157262] INFO -- : XCFLAGS = -U_FORTIFY_SOURCE -D_FORTIFY_SOURCE=2 -fstack-protector-strong -fno-strict-overflow -fvisibility=hidden -fexcess-precision=standard -DRUBY_EXPORT -I. -I.ext/include/x86_64-linux -I/tmp/ruby/src/trunk/include -I/tmp/ruby/src/trunk -I/tmp/ruby/src/trunk/prism -I/tmp/ruby/src/trunk/enc/unicode/15.0.0 I, [2024-05-22T11:23:31.102047 #4157262] INFO -- : CPPFLAGS = I, [2024-05-22T11:23:31.102057 #4157262] INFO -- : DLDFLAGS = -Wl,--compress-debug-sections=zlib -Wl,-soname,libruby.so.3.4 -fstack-protector-strong I, [2024-05-22T11:23:31.102068 #4157262] INFO -- : SOLIBS = -lz -lrt -lrt -lgmp -ldl -lcrypt -lm -lpthread I, [2024-05-22T11:23:31.102078 #4157262] INFO -- : LANG = en_US.UTF-8 I, [2024-05-22T11:23:31.102090 #4157262] INFO -- : LC_ALL = I, [2024-05-22T11:23:31.102100 #4157262] INFO -- : LC_CTYPE = I, [2024-05-22T11:23:31.102110 #4157262] INFO -- : MFLAGS = -j20 --jobserver-auth=4,5 I, [2024-05-22T11:23:31.102119 #4157262] INFO -- : RUSTC = no I, [2024-05-22T11:23:31.102129 #4157262] INFO -- : YJIT_RUSTC_ARGS = --crate-name=yjit --crate-type=staticlib --edition=2021 -g -C lto=thin -C opt-level=3 -C overflow-checks=on '--out-dir=/tmp/ruby/build/trunk/yjit/target/release/' /tmp/ruby/src/trunk/yjit/src/lib.rs I, [2024-05-22T11:23:31.103264 #4157262] INFO -- : gcc (Ubuntu 11.4.0-1ubuntu1~22.04) 11.4.0 I, [2024-05-22T11:23:31.103305 #4157262] INFO -- : Copyright (C) 2021 Free Software Foundation, Inc. I, [2024-05-22T11:23:31.103317 #4157262] INFO -- : This is free software; see the source for copying conditions. There is NO I, [2024-05-22T11:23:31.103333 #4157262] INFO -- : warranty; not even for MERCHANTABILITY or FITNESS FOR A PARTICULAR PURPOSE. I, [2024-05-22T11:23:31.103344 #4157262] INFO -- : I, [2024-05-22T11:23:31.123266 #4157262] INFO -- : compiling /tmp/ruby/src/trunk/version.c I, [2024-05-22T11:23:31.225428 #4157262] INFO -- : linking miniruby I, [2024-05-22T11:23:31.754155 #4157262] INFO -- : $$$[end] "make miniruby -j20" exit with 0. I, [2024-05-22T11:23:31.754272 #4157262] INFO -- : $$$[beg] make ruby -j20 I, [2024-05-22T11:23:31.811518 #4157262] INFO -- : BASERUBY = /usr/bin/ruby --disable=gems I, [2024-05-22T11:23:31.811546 #4157262] INFO -- : CC = gcc I, [2024-05-22T11:23:31.811553 #4157262] INFO -- : LD = ld I, [2024-05-22T11:23:31.811557 #4157262] INFO -- : LDSHARED = gcc -shared I, [2024-05-22T11:23:31.811561 #4157262] INFO -- : CFLAGS = -O3 -fno-fast-math -ggdb3 -Wall -Wextra -Wdeprecated-declarations -Wdiv-by-zero -Wduplicated-cond -Wimplicit-function-declaration -Wimplicit-int -Wpointer-arith -Wwrite-strings -Wold-style-definition -Wimplicit-fallthrough=0 -Wmissing-noreturn -Wno-cast-function-type -Wno-constant-logical-operand -Wno-long-long -Wno-missing-field-initializers -Wno-overlength-strings -Wno-packed-bitfield-compat -Wno-parentheses-equality -Wno-self-assign -Wno-tautological-compare -Wno-unused-parameter -Wno-unused-value -Wsuggest-attribute=format -Wsuggest-attribute=noreturn -Wunused-variable -Wmisleading-indentation -Wundef -fPIC I, [2024-05-22T11:23:31.811565 #4157262] INFO -- : XCFLAGS = -U_FORTIFY_SOURCE -D_FORTIFY_SOURCE=2 -fstack-protector-strong -fno-strict-overflow -fvisibility=hidden -fexcess-precision=standard -DRUBY_EXPORT -I. -I.ext/include/x86_64-linux -I/tmp/ruby/src/trunk/include -I/tmp/ruby/src/trunk -I/tmp/ruby/src/trunk/prism -I/tmp/ruby/src/trunk/enc/unicode/15.0.0 I, [2024-05-22T11:23:31.811569 #4157262] INFO -- : CPPFLAGS = I, [2024-05-22T11:23:31.811573 #4157262] INFO -- : DLDFLAGS = -Wl,--compress-debug-sections=zlib -Wl,-soname,libruby.so.3.4 -fstack-protector-strong I, [2024-05-22T11:23:31.811576 #4157262] INFO -- : SOLIBS = -lz -lrt -lrt -lgmp -ldl -lcrypt -lm -lpthread I, [2024-05-22T11:23:31.811580 #4157262] INFO -- : LANG = en_US.UTF-8 I, [2024-05-22T11:23:31.811583 #4157262] INFO -- : LC_ALL = I, [2024-05-22T11:23:31.811586 #4157262] INFO -- : LC_CTYPE = I, [2024-05-22T11:23:31.811590 #4157262] INFO -- : MFLAGS = -j20 --jobserver-auth=4,5 I, [2024-05-22T11:23:31.811594 #4157262] INFO -- : RUSTC = no I, [2024-05-22T11:23:31.811598 #4157262] INFO -- : YJIT_RUSTC_ARGS = --crate-name=yjit --crate-type=staticlib --edition=2021 -g -C lto=thin -C opt-level=3 -C overflow-checks=on '--out-dir=/tmp/ruby/build/trunk/yjit/target/release/' /tmp/ruby/src/trunk/yjit/src/lib.rs I, [2024-05-22T11:23:31.812873 #4157262] INFO -- : gcc (Ubuntu 11.4.0-1ubuntu1~22.04) 11.4.0 I, [2024-05-22T11:23:31.812894 #4157262] INFO -- : Copyright (C) 2021 Free Software Foundation, Inc. I, [2024-05-22T11:23:31.812899 #4157262] INFO -- : This is free software; see the source for copying conditions. There is NO I, [2024-05-22T11:23:31.812903 #4157262] INFO -- : warranty; not even for MERCHANTABILITY or FITNESS FOR A PARTICULAR PURPOSE. I, [2024-05-22T11:23:31.812907 #4157262] INFO -- : I, [2024-05-22T11:23:31.919443 #4157262] INFO -- : builtin_binary.inc updated I, [2024-05-22T11:23:31.923823 #4157262] INFO -- : c5234a9416e4f20f175185e840b25b0f08674d14078ed7083f37e655458e3ca9 builtin_binary.inc I, [2024-05-22T11:23:31.924557 #4157262] INFO -- : compiling /tmp/ruby/src/trunk/builtin.c I, [2024-05-22T11:23:32.110491 #4157262] INFO -- : linking static-library libruby-static.a I, [2024-05-22T11:23:32.424847 #4157262] INFO -- : linking shared-library libruby.so.3.4.0 I, [2024-05-22T11:23:33.979684 #4157262] INFO -- : linking ruby I, [2024-05-22T11:23:34.004114 #4157262] INFO -- : $$$[end] "make ruby -j20" exit with 0. I, [2024-05-22T11:23:34.004237 #4157262] INFO -- : $$$[beg] make all -j20 I, [2024-05-22T11:23:34.061957 #4157262] INFO -- : BASERUBY = /usr/bin/ruby --disable=gems I, [2024-05-22T11:23:34.062001 #4157262] INFO -- : CC = gcc I, [2024-05-22T11:23:34.062013 #4157262] INFO -- : LD = ld I, [2024-05-22T11:23:34.062024 #4157262] INFO -- : LDSHARED = gcc -shared I, [2024-05-22T11:23:34.062034 #4157262] INFO -- : CFLAGS = -O3 -fno-fast-math -ggdb3 -Wall -Wextra -Wdeprecated-declarations -Wdiv-by-zero -Wduplicated-cond -Wimplicit-function-declaration -Wimplicit-int -Wpointer-arith -Wwrite-strings -Wold-style-definition -Wimplicit-fallthrough=0 -Wmissing-noreturn -Wno-cast-function-type -Wno-constant-logical-operand -Wno-long-long -Wno-missing-field-initializers -Wno-overlength-strings -Wno-packed-bitfield-compat -Wno-parentheses-equality -Wno-self-assign -Wno-tautological-compare -Wno-unused-parameter -Wno-unused-value -Wsuggest-attribute=format -Wsuggest-attribute=noreturn -Wunused-variable -Wmisleading-indentation -Wundef -fPIC I, [2024-05-22T11:23:34.062045 #4157262] INFO -- : XCFLAGS = -U_FORTIFY_SOURCE -D_FORTIFY_SOURCE=2 -fstack-protector-strong -fno-strict-overflow -fvisibility=hidden -fexcess-precision=standard -DRUBY_EXPORT -I. -I.ext/include/x86_64-linux -I/tmp/ruby/src/trunk/include -I/tmp/ruby/src/trunk -I/tmp/ruby/src/trunk/prism -I/tmp/ruby/src/trunk/enc/unicode/15.0.0 I, [2024-05-22T11:23:34.062055 #4157262] INFO -- : CPPFLAGS = I, [2024-05-22T11:23:34.062065 #4157262] INFO -- : DLDFLAGS = -Wl,--compress-debug-sections=zlib -Wl,-soname,libruby.so.3.4 -fstack-protector-strong I, [2024-05-22T11:23:34.062075 #4157262] INFO -- : SOLIBS = -lz -lrt -lrt -lgmp -ldl -lcrypt -lm -lpthread I, [2024-05-22T11:23:34.062085 #4157262] INFO -- : LANG = en_US.UTF-8 I, [2024-05-22T11:23:34.062094 #4157262] INFO -- : LC_ALL = I, [2024-05-22T11:23:34.062104 #4157262] INFO -- : LC_CTYPE = I, [2024-05-22T11:23:34.062114 #4157262] INFO -- : MFLAGS = -j20 --jobserver-auth=4,5 I, [2024-05-22T11:23:34.062123 #4157262] INFO -- : RUSTC = no I, [2024-05-22T11:23:34.062134 #4157262] INFO -- : YJIT_RUSTC_ARGS = --crate-name=yjit --crate-type=staticlib --edition=2021 -g -C lto=thin -C opt-level=3 -C overflow-checks=on '--out-dir=/tmp/ruby/build/trunk/yjit/target/release/' /tmp/ruby/src/trunk/yjit/src/lib.rs I, [2024-05-22T11:23:34.063385 #4157262] INFO -- : gcc (Ubuntu 11.4.0-1ubuntu1~22.04) 11.4.0 I, [2024-05-22T11:23:34.063427 #4157262] INFO -- : Copyright (C) 2021 Free Software Foundation, Inc. I, [2024-05-22T11:23:34.063445 #4157262] INFO -- : This is free software; see the source for copying conditions. There is NO I, [2024-05-22T11:23:34.063457 #4157262] INFO -- : warranty; not even for MERCHANTABILITY or FITNESS FOR A PARTICULAR PURPOSE. I, [2024-05-22T11:23:34.063467 #4157262] INFO -- : I, [2024-05-22T11:23:34.089978 #4157262] INFO -- : generating encdb.h I, [2024-05-22T11:23:34.091317 #4157262] INFO -- : generating enc.mk I, [2024-05-22T11:23:34.093152 #4157262] INFO -- : building spec/ruby/optional/capi/ext/array_spec.so I, [2024-05-22T11:23:34.093407 #4157262] INFO -- : building spec/ruby/optional/capi/ext/basic_object_spec.so I, [2024-05-22T11:23:34.094025 #4157262] INFO -- : building spec/ruby/optional/capi/ext/bignum_spec.so I, [2024-05-22T11:23:34.094974 #4157262] INFO -- : building spec/ruby/optional/capi/ext/binding_spec.so I, [2024-05-22T11:23:34.095644 #4157262] INFO -- : building spec/ruby/optional/capi/ext/boolean_spec.so I, [2024-05-22T11:23:34.096076 #4157262] INFO -- : building spec/ruby/optional/capi/ext/class_id_under_autoload_spec.so I, [2024-05-22T11:23:34.096858 #4157262] INFO -- : building spec/ruby/optional/capi/ext/class_spec.so I, [2024-05-22T11:23:34.098119 #4157262] INFO -- : building spec/ruby/optional/capi/ext/class_under_autoload_spec.so I, [2024-05-22T11:23:34.098385 #4157262] INFO -- : building spec/ruby/optional/capi/ext/complex_spec.so I, [2024-05-22T11:23:34.099302 #4157262] INFO -- : building spec/ruby/optional/capi/ext/constants_spec.so I, [2024-05-22T11:23:34.099994 #4157262] INFO -- : building spec/ruby/optional/capi/ext/data_spec.so I, [2024-05-22T11:23:34.100720 #4157262] INFO -- : building spec/ruby/optional/capi/ext/debug_spec.so I, [2024-05-22T11:23:34.101165 #4157262] INFO -- : building spec/ruby/optional/capi/ext/encoding_spec.so I, [2024-05-22T11:23:34.101980 #4157262] INFO -- : building spec/ruby/optional/capi/ext/enumerator_spec.so I, [2024-05-22T11:23:34.102686 #4157262] INFO -- : building spec/ruby/optional/capi/ext/exception_spec.so I, [2024-05-22T11:23:34.102938 #4157262] INFO -- : building spec/ruby/optional/capi/ext/fiber_spec.so I, [2024-05-22T11:23:34.103520 #4157262] INFO -- : building spec/ruby/optional/capi/ext/file_spec.so I, [2024-05-22T11:23:34.103845 #4157262] INFO -- : building spec/ruby/optional/capi/ext/fixnum_spec.so I, [2024-05-22T11:23:34.119322 #4157262] INFO -- : encdb.h unchanged I, [2024-05-22T11:23:34.120942 #4157262] INFO -- : building spec/ruby/optional/capi/ext/float_spec.so I, [2024-05-22T11:23:34.233964 #4157262] INFO -- : building spec/ruby/optional/capi/ext/gc_spec.so I, [2024-05-22T11:23:34.235566 #4157262] INFO -- : building spec/ruby/optional/capi/ext/globals_spec.so I, [2024-05-22T11:23:34.243881 #4157262] INFO -- : building spec/ruby/optional/capi/ext/hash_spec.so I, [2024-05-22T11:23:34.245610 #4157262] INFO -- : building spec/ruby/optional/capi/ext/integer_spec.so I, [2024-05-22T11:23:34.246865 #4157262] INFO -- : building spec/ruby/optional/capi/ext/io_spec.so I, [2024-05-22T11:23:34.250874 #4157262] INFO -- : building spec/ruby/optional/capi/ext/kernel_spec.so I, [2024-05-22T11:23:34.255128 #4157262] INFO -- : building spec/ruby/optional/capi/ext/language_spec.so I, [2024-05-22T11:23:34.261247 #4157262] INFO -- : building spec/ruby/optional/capi/ext/marshal_spec.so I, [2024-05-22T11:23:34.266804 #4157262] INFO -- : building spec/ruby/optional/capi/ext/module_spec.so I, [2024-05-22T11:23:34.275025 #4157262] INFO -- : building spec/ruby/optional/capi/ext/module_under_autoload_spec.so I, [2024-05-22T11:23:34.279278 #4157262] INFO -- : building spec/ruby/optional/capi/ext/mutex_spec.so I, [2024-05-22T11:23:34.288018 #4157262] INFO -- : building spec/ruby/optional/capi/ext/numeric_spec.so I, [2024-05-22T11:23:34.291149 #4157262] INFO -- : building spec/ruby/optional/capi/ext/object_spec.so I, [2024-05-22T11:23:34.297603 #4157262] INFO -- : building spec/ruby/optional/capi/ext/proc_spec.so I, [2024-05-22T11:23:34.300962 #4157262] INFO -- : building spec/ruby/optional/capi/ext/range_spec.so I, [2024-05-22T11:23:34.315461 #4157262] INFO -- : building spec/ruby/optional/capi/ext/rational_spec.so I, [2024-05-22T11:23:34.349903 #4157262] INFO -- : building spec/ruby/optional/capi/ext/rbasic_spec.so I, [2024-05-22T11:23:34.358944 #4157262] INFO -- : building spec/ruby/optional/capi/ext/regexp_spec.so I, [2024-05-22T11:23:34.397235 #4157262] INFO -- : building spec/ruby/optional/capi/ext/string_spec.so I, [2024-05-22T11:23:34.404689 #4157262] INFO -- : building spec/ruby/optional/capi/ext/struct_spec.so I, [2024-05-22T11:23:34.405945 #4157262] INFO -- : building spec/ruby/optional/capi/ext/st_spec.so I, [2024-05-22T11:23:34.406546 #4157262] INFO -- : building spec/ruby/optional/capi/ext/symbol_spec.so I, [2024-05-22T11:23:34.406797 #4157262] INFO -- : building spec/ruby/optional/capi/ext/thread_spec.so I, [2024-05-22T11:23:34.412376 #4157262] INFO -- : building spec/ruby/optional/capi/ext/time_spec.so I, [2024-05-22T11:23:34.418753 #4157262] INFO -- : building spec/ruby/optional/capi/ext/tracepoint_spec.so I, [2024-05-22T11:23:34.444239 #4157262] INFO -- : building spec/ruby/optional/capi/ext/typed_data_spec.so I, [2024-05-22T11:23:34.449271 #4157262] INFO -- : building spec/ruby/optional/capi/ext/util_spec.so I, [2024-05-22T11:23:34.453079 #4157262] INFO -- : making enc I, [2024-05-22T11:23:34.475585 #4157262] INFO -- : making srcs under enc I, [2024-05-22T11:23:34.498721 #4157262] INFO -- : make[1]: Entering directory '/tmp/ruby/build/trunk' I, [2024-05-22T11:23:34.498781 #4157262] INFO -- : make[1]: Nothing to be done for 'enc'. I, [2024-05-22T11:23:34.498793 #4157262] INFO -- : make[1]: Leaving directory '/tmp/ruby/build/trunk' I, [2024-05-22T11:23:34.512725 #4157262] INFO -- : make[1]: Entering directory '/tmp/ruby/build/trunk' I, [2024-05-22T11:23:34.512788 #4157262] INFO -- : make[1]: Nothing to be done for 'srcs'. I, [2024-05-22T11:23:34.512798 #4157262] INFO -- : make[1]: Leaving directory '/tmp/ruby/build/trunk' I, [2024-05-22T11:23:34.513480 #4157262] INFO -- : generating transdb.h I, [2024-05-22T11:23:34.618667 #4157262] INFO -- : transdb.h unchanged I, [2024-05-22T11:23:34.619768 #4157262] INFO -- : generating makefiles ext/configure-ext.mk I, [2024-05-22T11:23:34.619969 #4157262] INFO -- : making trans I, [2024-05-22T11:23:34.646337 #4157262] INFO -- : ext/configure-ext.mk updated I, [2024-05-22T11:23:34.648491 #4157262] INFO -- : make[1]: Entering directory '/tmp/ruby/build/trunk' I, [2024-05-22T11:23:34.657755 #4157262] INFO -- : make[1]: Entering directory '/tmp/ruby/build/trunk' I, [2024-05-22T11:23:34.657817 #4157262] INFO -- : make[1]: Nothing to be done for 'trans'. I, [2024-05-22T11:23:34.657829 #4157262] INFO -- : make[1]: Leaving directory '/tmp/ruby/build/trunk' I, [2024-05-22T11:23:34.657836 #4157262] INFO -- : making encs I, [2024-05-22T11:23:34.715448 #4157262] INFO -- : make[1]: Entering directory '/tmp/ruby/build/trunk' I, [2024-05-22T11:23:34.715523 #4157262] INFO -- : make[1]: Nothing to be done for 'encs'. I, [2024-05-22T11:23:34.715546 #4157262] INFO -- : make[1]: Leaving directory '/tmp/ruby/build/trunk' I, [2024-05-22T11:23:34.805889 #4157262] INFO -- : make[1]: Leaving directory '/tmp/ruby/build/trunk' I, [2024-05-22T11:23:34.806459 #4157262] INFO -- : generating makefile exts.mk I, [2024-05-22T11:23:34.844809 #4157262] INFO -- : exts.mk unchanged I, [2024-05-22T11:23:34.849620 #4157262] INFO -- : make[1]: Entering directory '/tmp/ruby/build/trunk' I, [2024-05-22T11:23:34.869604 #4157262] INFO -- : make[2]: Entering directory '/tmp/ruby/build/trunk/ext/digest' I, [2024-05-22T11:23:34.870780 #4157262] INFO -- : make[2]: Entering directory '/tmp/ruby/build/trunk/ext/json' I, [2024-05-22T11:23:34.870882 #4157262] INFO -- : make[2]: Entering directory '/tmp/ruby/build/trunk/ext/coverage' I, [2024-05-22T11:23:34.872052 #4157262] INFO -- : make[2]: Entering directory '/tmp/ruby/build/trunk/ext/date' I, [2024-05-22T11:23:34.872246 #4157262] INFO -- : make[2]: Entering directory '/tmp/ruby/build/trunk/ext/io/console' I, [2024-05-22T11:23:34.873180 #4157262] INFO -- : make[2]: Entering directory '/tmp/ruby/build/trunk/ext/monitor' I, [2024-05-22T11:23:34.873411 #4157262] INFO -- : make[2]: Leaving directory '/tmp/ruby/build/trunk/ext/digest' I, [2024-05-22T11:23:34.873834 #4157262] INFO -- : make[2]: Entering directory '/tmp/ruby/build/trunk/ext/pathname' I, [2024-05-22T11:23:34.873954 #4157262] INFO -- : make[2]: Entering directory '/tmp/ruby/build/trunk/ext/fiddle' I, [2024-05-22T11:23:34.874228 #4157262] INFO -- : make[2]: Entering directory '/tmp/ruby/build/trunk/ext/rubyvm' I, [2024-05-22T11:23:34.874658 #4157262] INFO -- : make[2]: Leaving directory '/tmp/ruby/build/trunk/ext/coverage' I, [2024-05-22T11:23:34.874766 #4157262] INFO -- : make[2]: Entering directory '/tmp/ruby/build/trunk/ext/pty' I, [2024-05-22T11:23:34.875498 #4157262] INFO -- : make[2]: Entering directory '/tmp/ruby/build/trunk/ext/objspace' I, [2024-05-22T11:23:34.875589 #4157262] INFO -- : make[2]: Leaving directory '/tmp/ruby/build/trunk/ext/date' I, [2024-05-22T11:23:34.875661 #4157262] INFO -- : make[2]: Leaving directory '/tmp/ruby/build/trunk/ext/io/console' I, [2024-05-22T11:23:34.875722 #4157262] INFO -- : make[2]: Leaving directory '/tmp/ruby/build/trunk/ext/monitor' I, [2024-05-22T11:23:34.876404 #4157262] INFO -- : make[2]: Leaving directory '/tmp/ruby/build/trunk/ext/rubyvm' I, [2024-05-22T11:23:34.876558 #4157262] INFO -- : make[2]: Entering directory '/tmp/ruby/build/trunk/ext/psych' I, [2024-05-22T11:23:34.876885 #4157262] INFO -- : make[2]: Leaving directory '/tmp/ruby/build/trunk/ext/json' I, [2024-05-22T11:23:34.877315 #4157262] INFO -- : make[2]: Leaving directory '/tmp/ruby/build/trunk/ext/pathname' I, [2024-05-22T11:23:34.877488 #4157262] INFO -- : make[2]: Leaving directory '/tmp/ruby/build/trunk/ext/pty' I, [2024-05-22T11:23:34.878451 #4157262] INFO -- : make[2]: Entering directory '/tmp/ruby/build/trunk/.bundle/gems/bigdecimal-3.1.8/ext/bigdecimal' I, [2024-05-22T11:23:34.878477 #4157262] INFO -- : make[2]: Entering directory '/tmp/ruby/build/trunk/.bundle/gems/nkf-0.2.0/ext/nkf' I, [2024-05-22T11:23:34.878558 #4157262] INFO -- : make[2]: Entering directory '/tmp/ruby/build/trunk/.bundle/gems/debug-1.9.2/ext/debug' I, [2024-05-22T11:23:34.878664 #4157262] INFO -- : make[2]: Entering directory '/tmp/ruby/build/trunk/.bundle/gems/racc-1.7.3/ext/racc/cparse' I, [2024-05-22T11:23:34.878760 #4157262] INFO -- : make[2]: Entering directory '/tmp/ruby/build/trunk/.bundle/gems/racc-1.8.0/ext/racc/cparse' I, [2024-05-22T11:23:34.879458 #4157262] INFO -- : make[2]: Entering directory '/tmp/ruby/build/trunk/.bundle/gems/rbs-3.4.4/ext/rbs_extension' I, [2024-05-22T11:23:34.879489 #4157262] INFO -- : make[2]: Entering directory '/tmp/ruby/build/trunk/.bundle/gems/syslog-0.1.2/ext/syslog' I, [2024-05-22T11:23:34.879693 #4157262] INFO -- : make[2]: Leaving directory '/tmp/ruby/build/trunk/ext/objspace' I, [2024-05-22T11:23:34.879796 #4157262] INFO -- : make[2]: Leaving directory '/tmp/ruby/build/trunk/ext/fiddle' I, [2024-05-22T11:23:34.880440 #4157262] INFO -- : make[2]: Entering directory '/tmp/ruby/build/trunk/ext/ripper' I, [2024-05-22T11:23:34.884087 #4157262] INFO -- : make[2]: Entering directory '/tmp/ruby/build/trunk/ext/digest/sha2' I, [2024-05-22T11:23:34.884333 #4157262] INFO -- : make[2]: Leaving directory '/tmp/ruby/build/trunk/ext/ripper' I, [2024-05-22T11:23:34.885020 #4157262] INFO -- : make[2]: Entering directory '/tmp/ruby/build/trunk/ext/socket' I, [2024-05-22T11:23:34.886494 #4157262] INFO -- : make[2]: Leaving directory '/tmp/ruby/build/trunk/ext/digest/sha2' I, [2024-05-22T11:23:34.886720 #4157262] INFO -- : make[2]: Entering directory '/tmp/ruby/build/trunk/ext/openssl' I, [2024-05-22T11:23:34.889968 #4157262] INFO -- : make[2]: Leaving directory '/tmp/ruby/build/trunk/ext/psych' I, [2024-05-22T11:23:34.891075 #4157262] INFO -- : make[2]: Leaving directory '/tmp/ruby/build/trunk/ext/socket' I, [2024-05-22T11:23:34.897732 #4157262] INFO -- : make[2]: Leaving directory '/tmp/ruby/build/trunk/ext/openssl' I, [2024-05-22T11:23:34.901437 #4157262] INFO -- : make[2]: Leaving directory '/tmp/ruby/build/trunk/.bundle/gems/nkf-0.2.0/ext/nkf' I, [2024-05-22T11:23:34.901483 #4157262] INFO -- : make[2]: Leaving directory '/tmp/ruby/build/trunk/.bundle/gems/bigdecimal-3.1.8/ext/bigdecimal' I, [2024-05-22T11:23:34.902317 #4157262] INFO -- : make[2]: Leaving directory '/tmp/ruby/build/trunk/.bundle/gems/racc-1.8.0/ext/racc/cparse' I, [2024-05-22T11:23:34.905988 #4157262] INFO -- : make[2]: Leaving directory '/tmp/ruby/build/trunk/.bundle/gems/racc-1.7.3/ext/racc/cparse' I, [2024-05-22T11:23:34.910291 #4157262] INFO -- : make[2]: Leaving directory '/tmp/ruby/build/trunk/.bundle/gems/rbs-3.4.4/ext/rbs_extension' I, [2024-05-22T11:23:34.911566 #4157262] INFO -- : make[2]: Leaving directory '/tmp/ruby/build/trunk/.bundle/gems/syslog-0.1.2/ext/syslog' I, [2024-05-22T11:23:34.914620 #4157262] INFO -- : make[2]: Leaving directory '/tmp/ruby/build/trunk/.bundle/gems/debug-1.9.2/ext/debug' I, [2024-05-22T11:23:34.938723 #4157262] INFO -- : make[2]: Entering directory '/tmp/ruby/build/trunk' I, [2024-05-22T11:23:35.004682 #4157262] INFO -- : linking ruby I, [2024-05-22T11:23:35.026839 #4157262] INFO -- : make[2]: Leaving directory '/tmp/ruby/build/trunk' I, [2024-05-22T11:23:35.027306 #4157262] INFO -- : make[1]: Leaving directory '/tmp/ruby/build/trunk' I, [2024-05-22T11:23:35.030998 #4157262] INFO -- : make[1]: Entering directory '/tmp/ruby/build/trunk' I, [2024-05-22T11:23:35.031025 #4157262] INFO -- : make[1]: Nothing to be done for 'note'. I, [2024-05-22T11:23:35.031032 #4157262] INFO -- : make[1]: Leaving directory '/tmp/ruby/build/trunk' I, [2024-05-22T11:23:35.031709 #4157262] INFO -- : $$$[end] "make all -j20" exit with 0. I, [2024-05-22T11:23:35.031914 #4157262] INFO -- : $$$[beg] make install -j20 I, [2024-05-22T11:23:35.099955 #4157262] INFO -- : Update power_assert to 84e85124c5014a139af39161d484156cfe87a9ed I, [2024-05-22T11:23:35.100158 #4157262] INFO -- : Update rbs to ba7872795d5de04adb8ff500c0e6afdc81a041dd I, [2024-05-22T11:23:35.100315 #4157262] INFO -- : Update typeprof to b19a6416da3a05d57fadd6ffdadb382b6d236ca5 I, [2024-05-22T11:23:35.102368 #4157262] INFO -- : BASERUBY = /usr/bin/ruby --disable=gems I, [2024-05-22T11:23:35.102410 #4157262] INFO -- : CC = gcc I, [2024-05-22T11:23:35.102427 #4157262] INFO -- : LD = ld I, [2024-05-22T11:23:35.102441 #4157262] INFO -- : LDSHARED = gcc -shared I, [2024-05-22T11:23:35.102455 #4157262] INFO -- : CFLAGS = -O3 -fno-fast-math -ggdb3 -Wall -Wextra -Wdeprecated-declarations -Wdiv-by-zero -Wduplicated-cond -Wimplicit-function-declaration -Wimplicit-int -Wpointer-arith -Wwrite-strings -Wold-style-definition -Wimplicit-fallthrough=0 -Wmissing-noreturn -Wno-cast-function-type -Wno-constant-logical-operand -Wno-long-long -Wno-missing-field-initializers -Wno-overlength-strings -Wno-packed-bitfield-compat -Wno-parentheses-equality -Wno-self-assign -Wno-tautological-compare -Wno-unused-parameter -Wno-unused-value -Wsuggest-attribute=format -Wsuggest-attribute=noreturn -Wunused-variable -Wmisleading-indentation -Wundef -fPIC I, [2024-05-22T11:23:35.102470 #4157262] INFO -- : XCFLAGS = -U_FORTIFY_SOURCE -D_FORTIFY_SOURCE=2 -fstack-protector-strong -fno-strict-overflow -fvisibility=hidden -fexcess-precision=standard -DRUBY_EXPORT -I. -I.ext/include/x86_64-linux -I/tmp/ruby/src/trunk/include -I/tmp/ruby/src/trunk -I/tmp/ruby/src/trunk/prism -I/tmp/ruby/src/trunk/enc/unicode/15.0.0 I, [2024-05-22T11:23:35.102484 #4157262] INFO -- : CPPFLAGS = I, [2024-05-22T11:23:35.102499 #4157262] INFO -- : DLDFLAGS = -Wl,--compress-debug-sections=zlib -Wl,-soname,libruby.so.3.4 -fstack-protector-strong I, [2024-05-22T11:23:35.102514 #4157262] INFO -- : SOLIBS = -lz -lrt -lrt -lgmp -ldl -lcrypt -lm -lpthread I, [2024-05-22T11:23:35.102527 #4157262] INFO -- : LANG = en_US.UTF-8 I, [2024-05-22T11:23:35.102541 #4157262] INFO -- : LC_ALL = I, [2024-05-22T11:23:35.102554 #4157262] INFO -- : LC_CTYPE = I, [2024-05-22T11:23:35.102567 #4157262] INFO -- : MFLAGS = -j20 --jobserver-auth=4,5 I, [2024-05-22T11:23:35.102580 #4157262] INFO -- : RUSTC = no I, [2024-05-22T11:23:35.102600 #4157262] INFO -- : YJIT_RUSTC_ARGS = --crate-name=yjit --crate-type=staticlib --edition=2021 -g -C lto=thin -C opt-level=3 -C overflow-checks=on '--out-dir=/tmp/ruby/build/trunk/yjit/target/release/' /tmp/ruby/src/trunk/yjit/src/lib.rs I, [2024-05-22T11:23:35.129348 #4157262] INFO -- : echo 84e85124c5014a139af39161d484156cfe87a9ed | /bin/sh /tmp/ruby/src/trunk/tool/ifchange /tmp/ruby/src/trunk/.bundle/.timestamp/power_assert.revision - I, [2024-05-22T11:23:35.129537 #4157262] INFO -- : echo ba7872795d5de04adb8ff500c0e6afdc81a041dd | /bin/sh /tmp/ruby/src/trunk/tool/ifchange /tmp/ruby/src/trunk/.bundle/.timestamp/rbs.revision - I, [2024-05-22T11:23:35.129827 #4157262] INFO -- : echo b19a6416da3a05d57fadd6ffdadb382b6d236ca5 | /bin/sh /tmp/ruby/src/trunk/tool/ifchange /tmp/ruby/src/trunk/.bundle/.timestamp/typeprof.revision - I, [2024-05-22T11:23:35.130637 #4157262] INFO -- : gcc (Ubuntu 11.4.0-1ubuntu1~22.04) 11.4.0 I, [2024-05-22T11:23:35.130660 #4157262] INFO -- : Copyright (C) 2021 Free Software Foundation, Inc. I, [2024-05-22T11:23:35.130666 #4157262] INFO -- : This is free software; see the source for copying conditions. There is NO I, [2024-05-22T11:23:35.130674 #4157262] INFO -- : warranty; not even for MERCHANTABILITY or FITNESS FOR A PARTICULAR PURPOSE. I, [2024-05-22T11:23:35.130677 #4157262] INFO -- : I, [2024-05-22T11:23:35.130681 #4157262] INFO -- : generating encdb.h I, [2024-05-22T11:23:35.131327 #4157262] INFO -- : /tmp/ruby/src/trunk/.bundle/.timestamp/power_assert.revision unchanged I, [2024-05-22T11:23:35.131596 #4157262] INFO -- : generating enc.mk I, [2024-05-22T11:23:35.131618 #4157262] INFO -- : /tmp/ruby/src/trunk/.bundle/.timestamp/rbs.revision unchanged I, [2024-05-22T11:23:35.131666 #4157262] INFO -- : /tmp/ruby/src/trunk/.bundle/.timestamp/typeprof.revision unchanged I, [2024-05-22T11:23:35.155018 #4157262] INFO -- : encdb.h unchanged I, [2024-05-22T11:23:35.156101 #4157262] INFO -- : Building power_assert@84e85124c5014a139af39161d484156cfe87a9ed to /tmp/ruby/src/trunk/gems/power_assert-2.0.3.gem I, [2024-05-22T11:23:35.225161 #4157262] INFO -- : Successfully built RubyGem I, [2024-05-22T11:23:35.225231 #4157262] INFO -- : Name: power_assert I, [2024-05-22T11:23:35.225249 #4157262] INFO -- : Version: 2.0.4dev I, [2024-05-22T11:23:35.225265 #4157262] INFO -- : File: power_assert-2.0.4dev.gem I, [2024-05-22T11:23:35.227250 #4157262] INFO -- : Extracting bundle gem power_assert-2.0.3... I, [2024-05-22T11:23:35.256220 #4157262] INFO -- : making srcs under enc I, [2024-05-22T11:23:35.256268 #4157262] INFO -- : making enc I, [2024-05-22T11:23:35.273732 #4157262] INFO -- : make[1]: Entering directory '/tmp/ruby/build/trunk' I, [2024-05-22T11:23:35.273781 #4157262] INFO -- : make[1]: Nothing to be done for 'enc'. I, [2024-05-22T11:23:35.273794 #4157262] INFO -- : make[1]: Leaving directory '/tmp/ruby/build/trunk' I, [2024-05-22T11:23:35.286279 #4157262] INFO -- : make[1]: Entering directory '/tmp/ruby/build/trunk' I, [2024-05-22T11:23:35.286347 #4157262] INFO -- : make[1]: Nothing to be done for 'srcs'. I, [2024-05-22T11:23:35.286362 #4157262] INFO -- : make[1]: Leaving directory '/tmp/ruby/build/trunk' I, [2024-05-22T11:23:35.287137 #4157262] INFO -- : generating transdb.h I, [2024-05-22T11:23:35.288178 #4157262] INFO -- : Try with hash version of bundled gems instead of gems/power_assert-2.0.3.gem. We don't use this gem with release version of Ruby. I, [2024-05-22T11:23:35.293258 #4157262] INFO -- : Unpacked gems/power_assert-2.0.4dev.gem I, [2024-05-22T11:23:35.383763 #4157262] INFO -- : transdb.h unchanged I, [2024-05-22T11:23:35.385332 #4157262] INFO -- : generating makefiles ext/configure-ext.mk I, [2024-05-22T11:23:35.385638 #4157262] INFO -- : making trans I, [2024-05-22T11:23:35.412844 #4157262] INFO -- : ext/configure-ext.mk unchanged I, [2024-05-22T11:23:35.415149 #4157262] INFO -- : make[1]: Entering directory '/tmp/ruby/build/trunk' I, [2024-05-22T11:23:35.420154 #4157262] INFO -- : make[1]: Entering directory '/tmp/ruby/build/trunk' I, [2024-05-22T11:23:35.420240 #4157262] INFO -- : make[1]: Nothing to be done for 'trans'. I, [2024-05-22T11:23:35.420248 #4157262] INFO -- : make[1]: Leaving directory '/tmp/ruby/build/trunk' I, [2024-05-22T11:23:35.421037 #4157262] INFO -- : making encs I, [2024-05-22T11:23:35.479679 #4157262] INFO -- : make[1]: Entering directory '/tmp/ruby/build/trunk' I, [2024-05-22T11:23:35.479768 #4157262] INFO -- : make[1]: Nothing to be done for 'encs'. I, [2024-05-22T11:23:35.479793 #4157262] INFO -- : make[1]: Leaving directory '/tmp/ruby/build/trunk' I, [2024-05-22T11:23:35.567993 #4157262] INFO -- : make[1]: Leaving directory '/tmp/ruby/build/trunk' I, [2024-05-22T11:23:35.568768 #4157262] INFO -- : generating makefile exts.mk I, [2024-05-22T11:23:35.606478 #4157262] INFO -- : exts.mk unchanged I, [2024-05-22T11:23:35.611107 #4157262] INFO -- : make[1]: Entering directory '/tmp/ruby/build/trunk' I, [2024-05-22T11:23:35.631751 #4157262] INFO -- : make[2]: Entering directory '/tmp/ruby/build/trunk/ext/digest' I, [2024-05-22T11:23:35.632874 #4157262] INFO -- : make[2]: Entering directory '/tmp/ruby/build/trunk/ext/coverage' I, [2024-05-22T11:23:35.633326 #4157262] INFO -- : make[2]: Entering directory '/tmp/ruby/build/trunk/ext/json' I, [2024-05-22T11:23:35.634018 #4157262] INFO -- : make[2]: Entering directory '/tmp/ruby/build/trunk/ext/date' I, [2024-05-22T11:23:35.634449 #4157262] INFO -- : make[2]: Entering directory '/tmp/ruby/build/trunk/ext/io/console' I, [2024-05-22T11:23:35.635193 #4157262] INFO -- : make[2]: Entering directory '/tmp/ruby/build/trunk/ext/monitor' I, [2024-05-22T11:23:35.635341 #4157262] INFO -- : make[2]: Entering directory '/tmp/ruby/build/trunk/ext/rubyvm' I, [2024-05-22T11:23:35.635719 #4157262] INFO -- : make[2]: Entering directory '/tmp/ruby/build/trunk/ext/pty' I, [2024-05-22T11:23:35.635777 #4157262] INFO -- : make[2]: Entering directory '/tmp/ruby/build/trunk/ext/pathname' I, [2024-05-22T11:23:35.635898 #4157262] INFO -- : make[2]: Leaving directory '/tmp/ruby/build/trunk/ext/coverage' I, [2024-05-22T11:23:35.636167 #4157262] INFO -- : make[2]: Leaving directory '/tmp/ruby/build/trunk/ext/digest' I, [2024-05-22T11:23:35.636220 #4157262] INFO -- : make[2]: Entering directory '/tmp/ruby/build/trunk/ext/fiddle' I, [2024-05-22T11:23:35.636999 #4157262] INFO -- : make[2]: Entering directory '/tmp/ruby/build/trunk/ext/objspace' I, [2024-05-22T11:23:35.637376 #4157262] INFO -- : make[2]: Leaving directory '/tmp/ruby/build/trunk/ext/rubyvm' I, [2024-05-22T11:23:35.637736 #4157262] INFO -- : make[2]: Leaving directory '/tmp/ruby/build/trunk/ext/date' I, [2024-05-22T11:23:35.637824 #4157262] INFO -- : make[2]: Leaving directory '/tmp/ruby/build/trunk/ext/monitor' I, [2024-05-22T11:23:35.637844 #4157262] INFO -- : make[2]: Leaving directory '/tmp/ruby/build/trunk/ext/io/console' I, [2024-05-22T11:23:35.637957 #4157262] INFO -- : make[2]: Entering directory '/tmp/ruby/build/trunk/ext/psych' I, [2024-05-22T11:23:35.638299 #4157262] INFO -- : make[2]: Leaving directory '/tmp/ruby/build/trunk/ext/pathname' I, [2024-05-22T11:23:35.638447 #4157262] INFO -- : make[2]: Entering directory '/tmp/ruby/build/trunk/.bundle/gems/bigdecimal-3.1.8/ext/bigdecimal' I, [2024-05-22T11:23:35.638698 #4157262] INFO -- : make[2]: Leaving directory '/tmp/ruby/build/trunk/ext/pty' I, [2024-05-22T11:23:35.640725 #4157262] INFO -- : make[2]: Entering directory '/tmp/ruby/build/trunk/ext/ripper' I, [2024-05-22T11:23:35.641073 #4157262] INFO -- : make[2]: Leaving directory '/tmp/ruby/build/trunk/ext/objspace' I, [2024-05-22T11:23:35.641191 #4157262] INFO -- : make[2]: Leaving directory '/tmp/ruby/build/trunk/ext/json' I, [2024-05-22T11:23:35.643265 #4157262] INFO -- : make[2]: Entering directory '/tmp/ruby/build/trunk/.bundle/gems/debug-1.9.2/ext/debug' I, [2024-05-22T11:23:35.643353 #4157262] INFO -- : make[2]: Entering directory '/tmp/ruby/build/trunk/.bundle/gems/nkf-0.2.0/ext/nkf' I, [2024-05-22T11:23:35.643410 #4157262] INFO -- : make[2]: Leaving directory '/tmp/ruby/build/trunk/ext/fiddle' I, [2024-05-22T11:23:35.643451 #4157262] INFO -- : make[2]: Entering directory '/tmp/ruby/build/trunk/.bundle/gems/racc-1.7.3/ext/racc/cparse' I, [2024-05-22T11:23:35.643682 #4157262] INFO -- : make[2]: Entering directory '/tmp/ruby/build/trunk/.bundle/gems/racc-1.8.0/ext/racc/cparse' I, [2024-05-22T11:23:35.643842 #4157262] INFO -- : make[2]: Entering directory '/tmp/ruby/build/trunk/.bundle/gems/syslog-0.1.2/ext/syslog' I, [2024-05-22T11:23:35.644294 #4157262] INFO -- : make[2]: Entering directory '/tmp/ruby/build/trunk/.bundle/gems/rbs-3.4.4/ext/rbs_extension' I, [2024-05-22T11:23:35.646038 #4157262] INFO -- : make[2]: Leaving directory '/tmp/ruby/build/trunk/ext/ripper' I, [2024-05-22T11:23:35.646079 #4157262] INFO -- : make[2]: Entering directory '/tmp/ruby/build/trunk/ext/socket' I, [2024-05-22T11:23:35.647284 #4157262] INFO -- : make[2]: Entering directory '/tmp/ruby/build/trunk/ext/openssl' I, [2024-05-22T11:23:35.647391 #4157262] INFO -- : make[2]: Leaving directory '/tmp/ruby/build/trunk/ext/psych' I, [2024-05-22T11:23:35.648405 #4157262] INFO -- : make[2]: Entering directory '/tmp/ruby/build/trunk/ext/digest/sha2' I, [2024-05-22T11:23:35.651639 #4157262] INFO -- : make[2]: Leaving directory '/tmp/ruby/build/trunk/ext/digest/sha2' I, [2024-05-22T11:23:35.652992 #4157262] INFO -- : make[2]: Leaving directory '/tmp/ruby/build/trunk/ext/socket' I, [2024-05-22T11:23:35.658529 #4157262] INFO -- : make[2]: Leaving directory '/tmp/ruby/build/trunk/ext/openssl' I, [2024-05-22T11:23:35.665592 #4157262] INFO -- : make[2]: Leaving directory '/tmp/ruby/build/trunk/.bundle/gems/racc-1.7.3/ext/racc/cparse' I, [2024-05-22T11:23:35.666038 #4157262] INFO -- : make[2]: Leaving directory '/tmp/ruby/build/trunk/.bundle/gems/debug-1.9.2/ext/debug' I, [2024-05-22T11:23:35.667450 #4157262] INFO -- : make[2]: Leaving directory '/tmp/ruby/build/trunk/.bundle/gems/rbs-3.4.4/ext/rbs_extension' I, [2024-05-22T11:23:35.668631 #4157262] INFO -- : make[2]: Leaving directory '/tmp/ruby/build/trunk/.bundle/gems/racc-1.8.0/ext/racc/cparse' I, [2024-05-22T11:23:35.668987 #4157262] INFO -- : make[2]: Leaving directory '/tmp/ruby/build/trunk/.bundle/gems/bigdecimal-3.1.8/ext/bigdecimal' I, [2024-05-22T11:23:35.669585 #4157262] INFO -- : make[2]: Leaving directory '/tmp/ruby/build/trunk/.bundle/gems/nkf-0.2.0/ext/nkf' I, [2024-05-22T11:23:35.675872 #4157262] INFO -- : make[2]: Leaving directory '/tmp/ruby/build/trunk/.bundle/gems/syslog-0.1.2/ext/syslog' I, [2024-05-22T11:23:35.699775 #4157262] INFO -- : make[2]: Entering directory '/tmp/ruby/build/trunk' I, [2024-05-22T11:23:35.765235 #4157262] INFO -- : make[2]: 'ruby' is up to date. I, [2024-05-22T11:23:35.765271 #4157262] INFO -- : make[2]: Leaving directory '/tmp/ruby/build/trunk' I, [2024-05-22T11:23:35.765864 #4157262] INFO -- : make[1]: Leaving directory '/tmp/ruby/build/trunk' I, [2024-05-22T11:23:35.769722 #4157262] INFO -- : make[1]: Entering directory '/tmp/ruby/build/trunk' I, [2024-05-22T11:23:35.769748 #4157262] INFO -- : make[1]: Nothing to be done for 'note'. I, [2024-05-22T11:23:35.769756 #4157262] INFO -- : make[1]: Leaving directory '/tmp/ruby/build/trunk' I, [2024-05-22T11:23:35.769920 #4157262] INFO -- : ./miniruby -I/tmp/ruby/src/trunk/lib -I. -I.ext/common /tmp/ruby/src/trunk/tool/runruby.rb --extout=.ext -- --disable-gems -r./x86_64-linux-fake /tmp/ruby/src/trunk/tool/rbinstall.rb --make="make" --dest-dir="" --extout=".ext" --ext-build-dir="./ext" --mflags="-j20 --jobserver-auth=4,5" --make-flags=" -j20 --jobserver-auth=4,5" --data-mode=0644 --prog-mode=0755 --installed-list .installed.list --mantype="doc" --gnumake --install=all --exclude=doc I, [2024-05-22T11:23:35.867157 #4157262] INFO -- : Installing to I, [2024-05-22T11:23:35.867217 #4157262] INFO -- : installing binary commands: /tmp/ruby/install/trunk/bin I, [2024-05-22T11:23:35.867310 #4157262] INFO -- : installing base libraries: /tmp/ruby/install/trunk/lib I, [2024-05-22T11:23:35.874551 #4157262] INFO -- : installing arch files: /tmp/ruby/install/trunk/lib/ruby/3.4.0+0/x86_64-linux I, [2024-05-22T11:23:35.874575 #4157262] INFO -- : installing pkgconfig data: /tmp/ruby/install/trunk/lib/pkgconfig I, [2024-05-22T11:23:35.874581 #4157262] INFO -- : installing extension objects: /tmp/ruby/install/trunk/lib/ruby/3.4.0+0/x86_64-linux I, [2024-05-22T11:23:35.884471 #4157262] INFO -- : installing extension objects: /tmp/ruby/install/trunk/lib/ruby/site_ruby/3.4.0+0/x86_64-linux I, [2024-05-22T11:23:35.884497 #4157262] INFO -- : installing extension objects: /tmp/ruby/install/trunk/lib/ruby/vendor_ruby/3.4.0+0/x86_64-linux I, [2024-05-22T11:23:35.884503 #4157262] INFO -- : installing extension headers: /tmp/ruby/install/trunk/include/ruby-3.4.0+0/x86_64-linux I, [2024-05-22T11:23:35.884660 #4157262] INFO -- : installing extension scripts: /tmp/ruby/install/trunk/lib/ruby/3.4.0+0 I, [2024-05-22T11:23:35.887446 #4157262] INFO -- : installing extension scripts: /tmp/ruby/install/trunk/lib/ruby/site_ruby/3.4.0+0 I, [2024-05-22T11:23:35.887467 #4157262] INFO -- : installing extension scripts: /tmp/ruby/install/trunk/lib/ruby/vendor_ruby/3.4.0+0 I, [2024-05-22T11:23:35.887473 #4157262] INFO -- : installing extension headers: /tmp/ruby/install/trunk/include/ruby-3.4.0+0/ruby I, [2024-05-22T11:23:35.887483 #4157262] INFO -- : installing command scripts: /tmp/ruby/install/trunk/bin I, [2024-05-22T11:23:35.887488 #4157262] INFO -- : installing library scripts: /tmp/ruby/install/trunk/lib/ruby/3.4.0+0 I, [2024-05-22T11:23:35.920423 #4157262] INFO -- : installing common headers: /tmp/ruby/install/trunk/include/ruby-3.4.0+0 I, [2024-05-22T11:23:35.926952 #4157262] INFO -- : installing manpages: /tmp/ruby/install/trunk/share/man/man1 I, [2024-05-22T11:23:35.926982 #4157262] INFO -- : installing default gems from lib: /tmp/ruby/install/trunk/lib/ruby/gems/3.4.0+0 I, [2024-05-22T11:23:35.950111 #4157262] INFO -- : benchmark 0.3.0 I, [2024-05-22T11:23:35.952051 #4157262] INFO -- : bundler 2.6.0.dev I, [2024-05-22T11:23:35.954203 #4157262] INFO -- : cgi 0.4.1 I, [2024-05-22T11:23:35.954748 #4157262] INFO -- : delegate 0.3.1 I, [2024-05-22T11:23:35.955237 #4157262] INFO -- : did_you_mean 1.6.3 I, [2024-05-22T11:23:35.955708 #4157262] INFO -- : english 0.8.0 I, [2024-05-22T11:23:35.956197 #4157262] INFO -- : erb 4.0.4 I, [2024-05-22T11:23:35.957190 #4157262] INFO -- : error_highlight 0.6.0 I, [2024-05-22T11:23:35.958015 #4157262] INFO -- : fileutils 1.7.2 I, [2024-05-22T11:23:35.958716 #4157262] INFO -- : find 0.2.0 I, [2024-05-22T11:23:35.959548 #4157262] INFO -- : forwardable 1.3.3 I, [2024-05-22T11:23:35.960731 #4157262] INFO -- : ipaddr 1.2.6 I, [2024-05-22T11:23:35.961350 #4157262] INFO -- : irb 1.13.1 I, [2024-05-22T11:23:35.962113 #4157262] INFO -- : logger 1.6.0 I, [2024-05-22T11:23:35.962597 #4157262] INFO -- : net-http 0.4.1 I, [2024-05-22T11:23:35.963100 #4157262] INFO -- : net-protocol 0.2.2 I, [2024-05-22T11:23:35.963581 #4157262] INFO -- : open-uri 0.4.1 I, [2024-05-22T11:23:35.964070 #4157262] INFO -- : open3 0.2.1 I, [2024-05-22T11:23:35.964532 #4157262] INFO -- : optparse 0.5.0 I, [2024-05-22T11:23:35.964940 #4157262] INFO -- : ostruct 0.6.0 I, [2024-05-22T11:23:35.965358 #4157262] INFO -- : pp 0.5.0 I, [2024-05-22T11:23:35.965953 #4157262] INFO -- : prettyprint 0.2.0 I, [2024-05-22T11:23:35.966337 #4157262] INFO -- : prism 0.29.0 I, [2024-05-22T11:23:35.966980 #4157262] INFO -- : pstore 0.1.3 I, [2024-05-22T11:23:35.967400 #4157262] INFO -- : rdoc 6.6.3.1 I, [2024-05-22T11:23:35.968361 #4157262] INFO -- : readline 0.0.4 I, [2024-05-22T11:23:35.968902 #4157262] INFO -- : reline 0.5.7 I, [2024-05-22T11:23:35.969422 #4157262] INFO -- : resolv 0.4.0 I, [2024-05-22T11:23:35.969880 #4157262] INFO -- : ruby2_keywords 0.0.5 I, [2024-05-22T11:23:35.970386 #4157262] INFO -- : securerandom 0.3.1 I, [2024-05-22T11:23:35.971416 #4157262] INFO -- : set 1.1.0 I, [2024-05-22T11:23:35.972202 #4157262] INFO -- : shellwords 0.2.0 I, [2024-05-22T11:23:35.972688 #4157262] INFO -- : singleton 0.2.0 I, [2024-05-22T11:23:35.973057 #4157262] INFO -- : syntax_suggest 2.0.0 I, [2024-05-22T11:23:35.973745 #4157262] INFO -- : tempfile 0.2.1 I, [2024-05-22T11:23:35.974319 #4157262] INFO -- : time 0.3.0 I, [2024-05-22T11:23:35.974803 #4157262] INFO -- : timeout 0.4.1 I, [2024-05-22T11:23:35.975277 #4157262] INFO -- : tmpdir 0.2.0 I, [2024-05-22T11:23:35.975682 #4157262] INFO -- : tsort 0.2.0 I, [2024-05-22T11:23:35.976139 #4157262] INFO -- : un 0.3.0 I, [2024-05-22T11:23:35.976679 #4157262] INFO -- : uri 0.13.0 I, [2024-05-22T11:23:35.977209 #4157262] INFO -- : weakref 0.1.3 I, [2024-05-22T11:23:35.977663 #4157262] INFO -- : yaml 0.3.0 I, [2024-05-22T11:23:35.977919 #4157262] INFO -- : installing default gems from ext: /tmp/ruby/install/trunk/lib/ruby/gems/3.4.0+0 I, [2024-05-22T11:23:35.984628 #4157262] INFO -- : date 3.3.4 I, [2024-05-22T11:23:35.985164 #4157262] INFO -- : digest 3.1.1 I, [2024-05-22T11:23:35.985647 #4157262] INFO -- : etc 1.4.3 I, [2024-05-22T11:23:35.986146 #4157262] INFO -- : fcntl 1.1.0 I, [2024-05-22T11:23:35.986618 #4157262] INFO -- : fiddle 1.1.3 I, [2024-05-22T11:23:35.987116 #4157262] INFO -- : io-console 0.7.2 I, [2024-05-22T11:23:35.987589 #4157262] INFO -- : io-nonblock 0.3.0 I, [2024-05-22T11:23:35.988036 #4157262] INFO -- : io-wait 0.3.1 I, [2024-05-22T11:23:35.988544 #4157262] INFO -- : json 2.7.2 I, [2024-05-22T11:23:35.989168 #4157262] INFO -- : openssl 3.2.0 I, [2024-05-22T11:23:35.989670 #4157262] INFO -- : pathname 0.3.0 I, [2024-05-22T11:23:35.990134 #4157262] INFO -- : psych 5.1.2 I, [2024-05-22T11:23:35.990691 #4157262] INFO -- : stringio 3.1.1 I, [2024-05-22T11:23:35.991188 #4157262] INFO -- : strscan 3.1.1 I, [2024-05-22T11:23:35.991638 #4157262] INFO -- : zlib 3.1.0 I, [2024-05-22T11:23:35.991916 #4157262] INFO -- : installing bundled gems: /tmp/ruby/install/trunk/lib/ruby/gems/3.4.0+0 I, [2024-05-22T11:23:35.992491 #4157262] INFO -- : minitest 5.23.1 I, [2024-05-22T11:23:36.001311 #4157262] INFO -- : rake 13.2.1 I, [2024-05-22T11:23:36.004917 #4157262] INFO -- : test-unit 3.6.2 I, [2024-05-22T11:23:36.009719 #4157262] INFO -- : rexml 3.2.8 I, [2024-05-22T11:23:36.013593 #4157262] INFO -- : rss 0.3.0 I, [2024-05-22T11:23:36.016199 #4157262] INFO -- : net-ftp 0.3.4 I, [2024-05-22T11:23:36.017829 #4157262] INFO -- : net-imap 0.4.11 I, [2024-05-22T11:23:36.021647 #4157262] INFO -- : net-pop 0.1.2 I, [2024-05-22T11:23:36.022657 #4157262] INFO -- : net-smtp 0.5.0 I, [2024-05-22T11:23:36.023830 #4157262] INFO -- : matrix 0.4.2 I, [2024-05-22T11:23:36.027089 #4157262] INFO -- : prime 0.1.2 I, [2024-05-22T11:23:36.031756 #4157262] INFO -- : rbs 3.4.4 I, [2024-05-22T11:23:36.054538 #4157262] INFO -- : typeprof 0.21.11 I, [2024-05-22T11:23:36.056875 #4157262] INFO -- : debug 1.9.2 I, [2024-05-22T11:23:36.060209 #4157262] INFO -- : racc 1.8.0 I, [2024-05-22T11:23:36.063088 #4157262] INFO -- : mutex_m 0.2.0 I, [2024-05-22T11:23:36.064418 #4157262] INFO -- : getoptlong 0.2.1 I, [2024-05-22T11:23:36.065803 #4157262] INFO -- : base64 0.2.0 I, [2024-05-22T11:23:36.066904 #4157262] INFO -- : bigdecimal 3.1.8 I, [2024-05-22T11:23:36.069669 #4157262] INFO -- : observer 0.1.2 I, [2024-05-22T11:23:36.070836 #4157262] INFO -- : abbrev 0.1.2 I, [2024-05-22T11:23:36.072060 #4157262] INFO -- : resolv-replace 0.1.1 I, [2024-05-22T11:23:36.073378 #4157262] INFO -- : rinda 0.2.0 I, [2024-05-22T11:23:36.074716 #4157262] INFO -- : drb 2.2.1 I, [2024-05-22T11:23:36.076469 #4157262] INFO -- : nkf 0.2.0 I, [2024-05-22T11:23:36.078936 #4157262] INFO -- : syslog 0.1.2 I, [2024-05-22T11:23:36.081118 #4157262] INFO -- : csv 3.3.0 I, [2024-05-22T11:23:36.083430 #4157262] INFO -- : installing bundled gem cache: /tmp/ruby/install/trunk/lib/ruby/gems/3.4.0+0/cache I, [2024-05-22T11:23:36.085190 #4157262] INFO -- : skipped bundled gems: I, [2024-05-22T11:23:36.085212 #4157262] INFO -- : power_assert-2.0.4dev.gem not found in bundled_gems I, [2024-05-22T11:23:36.088238 #4157262] INFO -- : $$$[end] "make install -j20" exit with 0. I, [2024-05-22T11:23:36.088349 #4157262] INFO -- : $$$[beg] make yes-btest TESTOPTS='-q -j20' I, [2024-05-22T11:23:42.358592 #4157262] INFO -- : PASS all 1936 tests E, [2024-05-22T11:23:42.363835 #4157262] ERROR -- : I, [2024-05-22T11:23:42.364078 #4157262] INFO -- : $$$[end] "make yes-btest TESTOPTS='-q -j20'" exit with 0. I, [2024-05-22T11:23:42.364172 #4157262] INFO -- : $$$[beg] make yes-test-basic TESTS='-j20' I, [2024-05-22T11:23:42.424498 #4157262] INFO -- : BASERUBY = /usr/bin/ruby --disable=gems I, [2024-05-22T11:23:42.424528 #4157262] INFO -- : CC = gcc I, [2024-05-22T11:23:42.424534 #4157262] INFO -- : LD = ld I, [2024-05-22T11:23:42.424538 #4157262] INFO -- : LDSHARED = gcc -shared I, [2024-05-22T11:23:42.424542 #4157262] INFO -- : CFLAGS = -O3 -fno-fast-math -ggdb3 -Wall -Wextra -Wdeprecated-declarations -Wdiv-by-zero -Wduplicated-cond -Wimplicit-function-declaration -Wimplicit-int -Wpointer-arith -Wwrite-strings -Wold-style-definition -Wimplicit-fallthrough=0 -Wmissing-noreturn -Wno-cast-function-type -Wno-constant-logical-operand -Wno-long-long -Wno-missing-field-initializers -Wno-overlength-strings -Wno-packed-bitfield-compat -Wno-parentheses-equality -Wno-self-assign -Wno-tautological-compare -Wno-unused-parameter -Wno-unused-value -Wsuggest-attribute=format -Wsuggest-attribute=noreturn -Wunused-variable -Wmisleading-indentation -Wundef -fPIC I, [2024-05-22T11:23:42.424553 #4157262] INFO -- : XCFLAGS = -U_FORTIFY_SOURCE -D_FORTIFY_SOURCE=2 -fstack-protector-strong -fno-strict-overflow -fvisibility=hidden -fexcess-precision=standard -DRUBY_EXPORT -I. -I.ext/include/x86_64-linux -I/tmp/ruby/src/trunk/include -I/tmp/ruby/src/trunk -I/tmp/ruby/src/trunk/prism -I/tmp/ruby/src/trunk/enc/unicode/15.0.0 I, [2024-05-22T11:23:42.424557 #4157262] INFO -- : CPPFLAGS = I, [2024-05-22T11:23:42.424561 #4157262] INFO -- : DLDFLAGS = -Wl,--compress-debug-sections=zlib -Wl,-soname,libruby.so.3.4 -fstack-protector-strong I, [2024-05-22T11:23:42.424565 #4157262] INFO -- : SOLIBS = -lz -lrt -lrt -lgmp -ldl -lcrypt -lm -lpthread I, [2024-05-22T11:23:42.424568 #4157262] INFO -- : LANG = en_US.UTF-8 I, [2024-05-22T11:23:42.424572 #4157262] INFO -- : LC_ALL = I, [2024-05-22T11:23:42.424576 #4157262] INFO -- : LC_CTYPE = I, [2024-05-22T11:23:42.424579 #4157262] INFO -- : MFLAGS = I, [2024-05-22T11:23:42.424583 #4157262] INFO -- : RUSTC = no I, [2024-05-22T11:23:42.424587 #4157262] INFO -- : YJIT_RUSTC_ARGS = --crate-name=yjit --crate-type=staticlib --edition=2021 -g -C lto=thin -C opt-level=3 -C overflow-checks=on '--out-dir=/tmp/ruby/build/trunk/yjit/target/release/' /tmp/ruby/src/trunk/yjit/src/lib.rs I, [2024-05-22T11:23:42.425128 #4157262] INFO -- : gcc (Ubuntu 11.4.0-1ubuntu1~22.04) 11.4.0 I, [2024-05-22T11:23:42.425155 #4157262] INFO -- : Copyright (C) 2021 Free Software Foundation, Inc. I, [2024-05-22T11:23:42.425161 #4157262] INFO -- : This is free software; see the source for copying conditions. There is NO I, [2024-05-22T11:23:42.425165 #4157262] INFO -- : warranty; not even for MERCHANTABILITY or FITNESS FOR A PARTICULAR PURPOSE. I, [2024-05-22T11:23:42.425168 #4157262] INFO -- : I, [2024-05-22T11:23:42.530725 #4157262] INFO -- : Checking leaked global symbols...none I, [2024-05-22T11:23:42.571323 #4157262] INFO -- : /tmp/ruby/src/trunk/basictest/test.rb:assignment ....................................................................................................................................................................................................................................................................................................................................................................................OK 372 I, [2024-05-22T11:23:42.571379 #4157262] INFO -- : /tmp/ruby/src/trunk/basictest/test.rb:condition ..OK 2 I, [2024-05-22T11:23:42.572656 #4157262] INFO -- : /tmp/ruby/src/trunk/basictest/test.rb:if/unless ...OK 3 I, [2024-05-22T11:23:42.572662 #4157262] INFO -- : /tmp/ruby/src/trunk/basictest/test.rb:case .....OK 5 I, [2024-05-22T11:23:42.572666 #4157262] INFO -- : /tmp/ruby/src/trunk/basictest/test.rb:while/until ........OK 8 I, [2024-05-22T11:23:42.572675 #4157262] INFO -- : /tmp/ruby/src/trunk/basictest/test.rb:exception ..........OK 10 I, [2024-05-22T11:23:42.572679 #4157262] INFO -- : /tmp/ruby/src/trunk/basictest/test.rb:array .......................................OK 39 I, [2024-05-22T11:23:42.572684 #4157262] INFO -- : /tmp/ruby/src/trunk/basictest/test.rb:hash ...........................OK 27 I, [2024-05-22T11:23:42.572690 #4157262] INFO -- : /tmp/ruby/src/trunk/basictest/test.rb:iterator ...........................................................................................................OK 107 I, [2024-05-22T11:23:42.572964 #4157262] INFO -- : /tmp/ruby/src/trunk/basictest/test.rb:float ................................................................................OK 80 I, [2024-05-22T11:23:42.574863 #4157262] INFO -- : /tmp/ruby/src/trunk/basictest/test.rb:bignum ...............................OK 31 I, [2024-05-22T11:23:42.575635 #4157262] INFO -- : /tmp/ruby/src/trunk/basictest/test.rb:string & char ..............................................................OK 62 I, [2024-05-22T11:23:42.575667 #4157262] INFO -- : /tmp/ruby/src/trunk/basictest/test.rb:assignment ..........OK 10 I, [2024-05-22T11:23:42.575700 #4157262] INFO -- : /tmp/ruby/src/trunk/basictest/test.rb:call ......OK 6 I, [2024-05-22T11:23:42.575754 #4157262] INFO -- : /tmp/ruby/src/trunk/basictest/test.rb:proc .........OK 9 I, [2024-05-22T11:23:42.676431 #4157262] INFO -- : /tmp/ruby/src/trunk/basictest/test.rb:signal ..OK 2 I, [2024-05-22T11:23:42.679048 #4157262] INFO -- : /tmp/ruby/src/trunk/basictest/test.rb:eval ...........................OK 27 I, [2024-05-22T11:23:42.791343 #4157262] INFO -- : /tmp/ruby/src/trunk/basictest/test.rb:system ........OK 8 I, [2024-05-22T11:23:42.791399 #4157262] INFO -- : /tmp/ruby/src/trunk/basictest/test.rb:const .....OK 5 I, [2024-05-22T11:23:42.791406 #4157262] INFO -- : /tmp/ruby/src/trunk/basictest/test.rb:clone .....OK 5 I, [2024-05-22T11:23:42.791497 #4157262] INFO -- : /tmp/ruby/src/trunk/basictest/test.rb:marshal ....OK 4 I, [2024-05-22T11:23:42.791535 #4157262] INFO -- : /tmp/ruby/src/trunk/basictest/test.rb:pack ....OK 4 I, [2024-05-22T11:23:42.791548 #4157262] INFO -- : /tmp/ruby/src/trunk/basictest/test.rb:math ..OK 2 I, [2024-05-22T11:23:42.791644 #4157262] INFO -- : /tmp/ruby/src/trunk/basictest/test.rb:struct ......OK 6 I, [2024-05-22T11:23:42.791700 #4157262] INFO -- : /tmp/ruby/src/trunk/basictest/test.rb:variable ............OK 12 I, [2024-05-22T11:23:42.791717 #4157262] INFO -- : /tmp/ruby/src/trunk/basictest/test.rb:trace ...OK 3 I, [2024-05-22T11:23:42.791773 #4157262] INFO -- : /tmp/ruby/src/trunk/basictest/test.rb:defined? ............OK 12 I, [2024-05-22T11:23:42.791816 #4157262] INFO -- : /tmp/ruby/src/trunk/basictest/test.rb:alias ......OK 6 I, [2024-05-22T11:23:42.792163 #4157262] INFO -- : /tmp/ruby/src/trunk/basictest/test.rb:path .......................OK 23 I, [2024-05-22T11:23:42.826371 #4157262] INFO -- : /tmp/ruby/src/trunk/basictest/test.rb:gc ....OK 4 I, [2024-05-22T11:23:42.828848 #4157262] INFO -- : I, [2024-05-22T11:23:42.828871 #4157262] INFO -- : test succeeded I, [2024-05-22T11:23:42.830419 #4157262] INFO -- : $$$[end] "make yes-test-basic TESTS='-j20'" exit with 0. I, [2024-05-22T11:23:42.830504 #4157262] INFO -- : $$$[beg] make yes-test-all TESTOPTS='--stderr-on-failure' TESTS='-j20' I, [2024-05-22T11:23:42.926521 #4157262] INFO -- : BASERUBY = /usr/bin/ruby --disable=gems I, [2024-05-22T11:23:42.926559 #4157262] INFO -- : CC = gcc I, [2024-05-22T11:23:42.926564 #4157262] INFO -- : LD = ld I, [2024-05-22T11:23:42.926568 #4157262] INFO -- : LDSHARED = gcc -shared I, [2024-05-22T11:23:42.926573 #4157262] INFO -- : CFLAGS = -O3 -fno-fast-math -ggdb3 -Wall -Wextra -Wdeprecated-declarations -Wdiv-by-zero -Wduplicated-cond -Wimplicit-function-declaration -Wimplicit-int -Wpointer-arith -Wwrite-strings -Wold-style-definition -Wimplicit-fallthrough=0 -Wmissing-noreturn -Wno-cast-function-type -Wno-constant-logical-operand -Wno-long-long -Wno-missing-field-initializers -Wno-overlength-strings -Wno-packed-bitfield-compat -Wno-parentheses-equality -Wno-self-assign -Wno-tautological-compare -Wno-unused-parameter -Wno-unused-value -Wsuggest-attribute=format -Wsuggest-attribute=noreturn -Wunused-variable -Wmisleading-indentation -Wundef -fPIC I, [2024-05-22T11:23:42.926577 #4157262] INFO -- : XCFLAGS = -U_FORTIFY_SOURCE -D_FORTIFY_SOURCE=2 -fstack-protector-strong -fno-strict-overflow -fvisibility=hidden -fexcess-precision=standard -DRUBY_EXPORT -I. -I.ext/include/x86_64-linux -I/tmp/ruby/src/trunk/include -I/tmp/ruby/src/trunk -I/tmp/ruby/src/trunk/prism -I/tmp/ruby/src/trunk/enc/unicode/15.0.0 I, [2024-05-22T11:23:42.926581 #4157262] INFO -- : CPPFLAGS = I, [2024-05-22T11:23:42.926585 #4157262] INFO -- : DLDFLAGS = -Wl,--compress-debug-sections=zlib -Wl,-soname,libruby.so.3.4 -fstack-protector-strong I, [2024-05-22T11:23:42.926589 #4157262] INFO -- : SOLIBS = -lz -lrt -lrt -lgmp -ldl -lcrypt -lm -lpthread I, [2024-05-22T11:23:42.926593 #4157262] INFO -- : LANG = en_US.UTF-8 I, [2024-05-22T11:23:42.926596 #4157262] INFO -- : LC_ALL = I, [2024-05-22T11:23:42.926607 #4157262] INFO -- : LC_CTYPE = I, [2024-05-22T11:23:42.926611 #4157262] INFO -- : MFLAGS = I, [2024-05-22T11:23:42.926615 #4157262] INFO -- : RUSTC = no I, [2024-05-22T11:23:42.926619 #4157262] INFO -- : YJIT_RUSTC_ARGS = --crate-name=yjit --crate-type=staticlib --edition=2021 -g -C lto=thin -C opt-level=3 -C overflow-checks=on '--out-dir=/tmp/ruby/build/trunk/yjit/target/release/' /tmp/ruby/src/trunk/yjit/src/lib.rs I, [2024-05-22T11:23:42.927117 #4157262] INFO -- : gcc (Ubuntu 11.4.0-1ubuntu1~22.04) 11.4.0 I, [2024-05-22T11:23:42.927137 #4157262] INFO -- : Copyright (C) 2021 Free Software Foundation, Inc. I, [2024-05-22T11:23:42.927143 #4157262] INFO -- : This is free software; see the source for copying conditions. There is NO I, [2024-05-22T11:23:42.927147 #4157262] INFO -- : warranty; not even for MERCHANTABILITY or FITNESS FOR A PARTICULAR PURPOSE. I, [2024-05-22T11:23:42.927151 #4157262] INFO -- : I, [2024-05-22T11:23:42.928783 #4157262] INFO -- : generating enc.mk I, [2024-05-22T11:23:43.046200 #4157262] INFO -- : generating encdb.h I, [2024-05-22T11:23:43.069908 #4157262] INFO -- : encdb.h unchanged I, [2024-05-22T11:23:43.070987 #4157262] INFO -- : making enc I, [2024-05-22T11:23:43.088463 #4157262] INFO -- : make[1]: Entering directory '/tmp/ruby/build/trunk' I, [2024-05-22T11:23:43.088484 #4157262] INFO -- : make[1]: Nothing to be done for 'enc'. I, [2024-05-22T11:23:43.088490 #4157262] INFO -- : make[1]: Leaving directory '/tmp/ruby/build/trunk' I, [2024-05-22T11:23:43.089121 #4157262] INFO -- : making srcs under enc I, [2024-05-22T11:23:43.118740 #4157262] INFO -- : make[1]: Entering directory '/tmp/ruby/build/trunk' I, [2024-05-22T11:23:43.118761 #4157262] INFO -- : make[1]: Nothing to be done for 'srcs'. I, [2024-05-22T11:23:43.118766 #4157262] INFO -- : make[1]: Leaving directory '/tmp/ruby/build/trunk' I, [2024-05-22T11:23:43.119640 #4157262] INFO -- : generating transdb.h I, [2024-05-22T11:23:43.215258 #4157262] INFO -- : transdb.h unchanged I, [2024-05-22T11:23:43.216577 #4157262] INFO -- : making trans I, [2024-05-22T11:23:43.250318 #4157262] INFO -- : make[1]: Entering directory '/tmp/ruby/build/trunk' I, [2024-05-22T11:23:43.250351 #4157262] INFO -- : make[1]: Nothing to be done for 'trans'. I, [2024-05-22T11:23:43.250357 #4157262] INFO -- : make[1]: Leaving directory '/tmp/ruby/build/trunk' I, [2024-05-22T11:23:43.251044 #4157262] INFO -- : making encs I, [2024-05-22T11:23:43.287439 #4157262] INFO -- : make[1]: Entering directory '/tmp/ruby/build/trunk' I, [2024-05-22T11:23:43.287461 #4157262] INFO -- : make[1]: Nothing to be done for 'encs'. I, [2024-05-22T11:23:43.287468 #4157262] INFO -- : make[1]: Leaving directory '/tmp/ruby/build/trunk' I, [2024-05-22T11:23:43.289111 #4157262] INFO -- : generating makefiles ext/configure-ext.mk I, [2024-05-22T11:23:43.315762 #4157262] INFO -- : ext/configure-ext.mk updated I, [2024-05-22T11:23:43.318211 #4157262] INFO -- : make[1]: Entering directory '/tmp/ruby/build/trunk' I, [2024-05-22T11:23:44.709187 #4157262] INFO -- : make[1]: Leaving directory '/tmp/ruby/build/trunk' I, [2024-05-22T11:23:44.710003 #4157262] INFO -- : generating makefile exts.mk I, [2024-05-22T11:23:44.746694 #4157262] INFO -- : exts.mk unchanged I, [2024-05-22T11:23:44.751112 #4157262] INFO -- : make[1]: Entering directory '/tmp/ruby/build/trunk' I, [2024-05-22T11:23:45.054426 #4157262] INFO -- : make[2]: Entering directory '/tmp/ruby/build/trunk/ext/coverage' I, [2024-05-22T11:23:45.058834 #4157262] INFO -- : make[2]: Leaving directory '/tmp/ruby/build/trunk/ext/coverage' I, [2024-05-22T11:23:45.065524 #4157262] INFO -- : make[2]: Entering directory '/tmp/ruby/build/trunk/ext/date' I, [2024-05-22T11:23:45.069939 #4157262] INFO -- : make[2]: Leaving directory '/tmp/ruby/build/trunk/ext/date' I, [2024-05-22T11:23:45.073768 #4157262] INFO -- : make[2]: Entering directory '/tmp/ruby/build/trunk/ext/digest' I, [2024-05-22T11:23:45.082737 #4157262] INFO -- : make[2]: Leaving directory '/tmp/ruby/build/trunk/ext/digest' I, [2024-05-22T11:23:45.108050 #4157262] INFO -- : make[2]: Entering directory '/tmp/ruby/build/trunk/ext/digest/sha2' I, [2024-05-22T11:23:45.112884 #4157262] INFO -- : make[2]: Leaving directory '/tmp/ruby/build/trunk/ext/digest/sha2' I, [2024-05-22T11:23:45.134456 #4157262] INFO -- : make[2]: Entering directory '/tmp/ruby/build/trunk/ext/fiddle' I, [2024-05-22T11:23:45.145168 #4157262] INFO -- : make[2]: Leaving directory '/tmp/ruby/build/trunk/ext/fiddle' I, [2024-05-22T11:23:45.150328 #4157262] INFO -- : make[2]: Entering directory '/tmp/ruby/build/trunk/ext/io/console' I, [2024-05-22T11:23:45.154423 #4157262] INFO -- : make[2]: Leaving directory '/tmp/ruby/build/trunk/ext/io/console' I, [2024-05-22T11:23:45.167202 #4157262] INFO -- : make[2]: Entering directory '/tmp/ruby/build/trunk/ext/json' I, [2024-05-22T11:23:45.177792 #4157262] INFO -- : make[2]: Leaving directory '/tmp/ruby/build/trunk/ext/json' I, [2024-05-22T11:23:45.193055 #4157262] INFO -- : make[2]: Entering directory '/tmp/ruby/build/trunk/ext/monitor' I, [2024-05-22T11:23:45.197022 #4157262] INFO -- : make[2]: Leaving directory '/tmp/ruby/build/trunk/ext/monitor' I, [2024-05-22T11:23:45.204132 #4157262] INFO -- : make[2]: Entering directory '/tmp/ruby/build/trunk/ext/objspace' I, [2024-05-22T11:23:45.210250 #4157262] INFO -- : make[2]: Leaving directory '/tmp/ruby/build/trunk/ext/objspace' I, [2024-05-22T11:23:45.229092 #4157262] INFO -- : make[2]: Entering directory '/tmp/ruby/build/trunk/ext/openssl' I, [2024-05-22T11:23:45.245909 #4157262] INFO -- : make[2]: Leaving directory '/tmp/ruby/build/trunk/ext/openssl' I, [2024-05-22T11:23:45.248802 #4157262] INFO -- : make[2]: Entering directory '/tmp/ruby/build/trunk/ext/pathname' I, [2024-05-22T11:23:45.251468 #4157262] INFO -- : make[2]: Leaving directory '/tmp/ruby/build/trunk/ext/pathname' I, [2024-05-22T11:23:45.256258 #4157262] INFO -- : make[2]: Entering directory '/tmp/ruby/build/trunk/ext/psych' I, [2024-05-22T11:23:45.280838 #4157262] INFO -- : make[2]: Leaving directory '/tmp/ruby/build/trunk/ext/psych' I, [2024-05-22T11:23:45.285758 #4157262] INFO -- : make[2]: Entering directory '/tmp/ruby/build/trunk/ext/pty' I, [2024-05-22T11:23:45.289843 #4157262] INFO -- : make[2]: Leaving directory '/tmp/ruby/build/trunk/ext/pty' I, [2024-05-22T11:23:45.305957 #4157262] INFO -- : make[2]: Entering directory '/tmp/ruby/build/trunk/ext/ripper' I, [2024-05-22T11:23:45.313991 #4157262] INFO -- : make[2]: Leaving directory '/tmp/ruby/build/trunk/ext/ripper' I, [2024-05-22T11:23:45.316449 #4157262] INFO -- : make[2]: Entering directory '/tmp/ruby/build/trunk/ext/rubyvm' I, [2024-05-22T11:23:45.319751 #4157262] INFO -- : make[2]: Leaving directory '/tmp/ruby/build/trunk/ext/rubyvm' I, [2024-05-22T11:23:45.333406 #4157262] INFO -- : make[2]: Entering directory '/tmp/ruby/build/trunk/ext/socket' I, [2024-05-22T11:23:45.343328 #4157262] INFO -- : make[2]: Leaving directory '/tmp/ruby/build/trunk/ext/socket' I, [2024-05-22T11:23:45.360344 #4157262] INFO -- : make[2]: Entering directory '/tmp/ruby/build/trunk/.bundle/gems/bigdecimal-3.1.8/ext/bigdecimal' I, [2024-05-22T11:23:45.388071 #4157262] INFO -- : make[2]: Leaving directory '/tmp/ruby/build/trunk/.bundle/gems/bigdecimal-3.1.8/ext/bigdecimal' I, [2024-05-22T11:23:45.390053 #4157262] INFO -- : make[2]: Entering directory '/tmp/ruby/build/trunk/.bundle/gems/debug-1.9.2/ext/debug' I, [2024-05-22T11:23:45.412420 #4157262] INFO -- : make[2]: Leaving directory '/tmp/ruby/build/trunk/.bundle/gems/debug-1.9.2/ext/debug' I, [2024-05-22T11:23:45.414317 #4157262] INFO -- : make[2]: Entering directory '/tmp/ruby/build/trunk/.bundle/gems/nkf-0.2.0/ext/nkf' I, [2024-05-22T11:23:45.435817 #4157262] INFO -- : make[2]: Leaving directory '/tmp/ruby/build/trunk/.bundle/gems/nkf-0.2.0/ext/nkf' I, [2024-05-22T11:23:45.437841 #4157262] INFO -- : make[2]: Entering directory '/tmp/ruby/build/trunk/.bundle/gems/racc-1.7.3/ext/racc/cparse' I, [2024-05-22T11:23:45.462167 #4157262] INFO -- : make[2]: Leaving directory '/tmp/ruby/build/trunk/.bundle/gems/racc-1.7.3/ext/racc/cparse' I, [2024-05-22T11:23:45.464229 #4157262] INFO -- : make[2]: Entering directory '/tmp/ruby/build/trunk/.bundle/gems/racc-1.8.0/ext/racc/cparse' I, [2024-05-22T11:23:45.485748 #4157262] INFO -- : make[2]: Leaving directory '/tmp/ruby/build/trunk/.bundle/gems/racc-1.8.0/ext/racc/cparse' I, [2024-05-22T11:23:45.488106 #4157262] INFO -- : make[2]: Entering directory '/tmp/ruby/build/trunk/.bundle/gems/rbs-3.4.4/ext/rbs_extension' I, [2024-05-22T11:23:45.511501 #4157262] INFO -- : make[2]: Leaving directory '/tmp/ruby/build/trunk/.bundle/gems/rbs-3.4.4/ext/rbs_extension' I, [2024-05-22T11:23:45.513529 #4157262] INFO -- : make[2]: Entering directory '/tmp/ruby/build/trunk/.bundle/gems/syslog-0.1.2/ext/syslog' I, [2024-05-22T11:23:45.535697 #4157262] INFO -- : make[2]: Leaving directory '/tmp/ruby/build/trunk/.bundle/gems/syslog-0.1.2/ext/syslog' I, [2024-05-22T11:23:45.560464 #4157262] INFO -- : make[2]: Entering directory '/tmp/ruby/build/trunk' I, [2024-05-22T11:23:45.641319 #4157262] INFO -- : make[2]: 'ruby' is up to date. I, [2024-05-22T11:23:45.641358 #4157262] INFO -- : make[2]: Leaving directory '/tmp/ruby/build/trunk' I, [2024-05-22T11:23:45.641828 #4157262] INFO -- : make[1]: Leaving directory '/tmp/ruby/build/trunk' I, [2024-05-22T11:23:45.645803 #4157262] INFO -- : make[1]: Entering directory '/tmp/ruby/build/trunk' I, [2024-05-22T11:23:45.645826 #4157262] INFO -- : make[1]: Nothing to be done for 'note'. I, [2024-05-22T11:23:45.645832 #4157262] INFO -- : make[1]: Leaving directory '/tmp/ruby/build/trunk' I, [2024-05-22T11:23:45.722608 #4157262] INFO -- : Run options: I, [2024-05-22T11:23:45.722668 #4157262] INFO -- : --seed=40013 I, [2024-05-22T11:23:45.722673 #4157262] INFO -- : "--ruby=./miniruby -I/tmp/ruby/src/trunk/lib -I. -I.ext/common /tmp/ruby/src/trunk/tool/runruby.rb --extout=.ext -- --disable-gems" I, [2024-05-22T11:23:45.722679 #4157262] INFO -- : --excludes-dir=/tmp/ruby/src/trunk/test/.excludes I, [2024-05-22T11:23:45.722684 #4157262] INFO -- : --name=!/memory_leak/ I, [2024-05-22T11:23:45.722689 #4157262] INFO -- : --stderr-on-failure I, [2024-05-22T11:23:45.722692 #4157262] INFO -- : -j20 I, [2024-05-22T11:23:45.722696 #4157262] INFO -- : I, [2024-05-22T11:23:45.722699 #4157262] INFO -- : # Running tests: I, [2024-05-22T11:23:45.722703 #4157262] INFO -- : I, [2024-05-22T11:23:45.870808 #4157262] INFO -- : [ 1/885] 4741=test_grapheme_breaks I, [2024-05-22T11:23:45.870909 #4157262] INFO -- : [ 2/885] 4728=test_gem_version_option I, [2024-05-22T11:23:45.871701 #4157262] INFO -- : [ 3/885] 4727=test_gem_request_connection_pools I, [2024-05-22T11:23:45.871987 #4157262] INFO -- : [ 4/885] 4726=test_cclass I, [2024-05-22T11:23:45.872340 #4157262] INFO -- : [ 5/885] 4729=test_reline I, [2024-05-22T11:23:45.874911 #4157262] INFO -- : [ 6/885] 4730=test_parser_events I, [2024-05-22T11:23:45.876248 #4157262] INFO -- : [ 7/885] 4738=test_pkey I, [2024-05-22T11:23:45.876452 #4157262] INFO -- : [ 8/885] 4740=test_case I, [2024-05-22T11:23:45.876487 #4157262] INFO -- : [ 9/885] 4739=test_rdoc_markup_to_markdown I, [2024-05-22T11:23:45.876856 #4157262] INFO -- : [ 10/885] 4742=test_json_tree I, [2024-05-22T11:23:45.882184 #4157262] INFO -- : [ 11/885] 4743=test_ansi_with_terminfo I, [2024-05-22T11:23:45.885241 #4157262] INFO -- : [ 12/885] 4741=test_rdoc_generator_pot_po I, [2024-05-22T11:23:45.892381 #4157262] INFO -- : [ 13/885] 4740=test_ractor I, [2024-05-22T11:23:45.897722 #4157262] INFO -- : [ 14/885] 4725=test_m17n_comb I, [2024-05-22T11:23:45.900465 #4157262] INFO -- : [ 15/885] 4742=test_memory_view I, [2024-05-22T11:23:45.906834 #4157262] INFO -- : [ 16/885] 4731=test_rdoc_generator_ri I, [2024-05-22T11:23:45.906896 #4157262] INFO -- : [ 17/885] 4737=test_extlibs I, [2024-05-22T11:23:45.906904 #4157262] INFO -- : [ 18/885] 4733=test_gem_stream_ui I, [2024-05-22T11:23:45.906911 #4157262] INFO -- : [ 19/885] 4735=parse_test I, [2024-05-22T11:23:45.907214 #4157262] INFO -- : [ 20/885] 4734=test_gem_install_update_options I, [2024-05-22T11:23:45.909413 #4157262] INFO -- : [ 21/885] 4744=test_require_lib I, [2024-05-22T11:23:45.909549 #4157262] INFO -- : [ 22/885] 4736=test_severity I, [2024-05-22T11:23:45.911868 #4157262] INFO -- : [ 23/885] 4732=test_ractor I, [2024-05-22T11:23:45.921193 #4157262] INFO -- : [ 24/885] 4736=test_objectspace I, [2024-05-22T11:23:45.933956 #4157262] INFO -- : [ 25/885] 4743=test_socket I, [2024-05-22T11:23:45.935841 #4157262] INFO -- : [ 26/885] 4742=test_thread I, [2024-05-22T11:23:45.949163 #4157262] INFO -- : [ 27/885] 4732=test_rdoc_markup_to_table_of_contents I, [2024-05-22T11:23:45.960585 #4157262] INFO -- : [ 28/885] 4740=test_c_struct_builder I, [2024-05-22T11:23:45.962753 #4157262] INFO -- : [ 29/885] 4730=test_dot_dot I, [2024-05-22T11:23:45.964967 #4157262] INFO -- : [ 30/885] 4730=test_str2big I, [2024-05-22T11:23:45.968103 #4157262] INFO -- : [ 31/885] 4730=test_literal I, [2024-05-22T11:23:45.971290 #4157262] INFO -- : [ 32/885] 4738=test_store I, [2024-05-22T11:23:45.988609 #4157262] INFO -- : [ 33/885] 4741=test_case_options I, [2024-05-22T11:23:45.994736 #4157262] INFO -- : [ 34/885] 4741=test_gem_commands_info_command I, [2024-05-22T11:23:46.003551 #4157262] INFO -- : [ 35/885] 4740=test_gem_dependency_installer I, [2024-05-22T11:23:46.020997 #4157262] INFO -- : [ 36/885] 4726=test_scalar I, [2024-05-22T11:23:46.037674 #4157262] INFO -- : [ 37/885] 4739=test_rdoc_cross_reference I, [2024-05-22T11:23:46.040475 #4157262] INFO -- : [ 38/885] 4726=test_gem_name_tuple I, [2024-05-22T11:23:46.071106 #4157262] INFO -- : [ 39/885] 4731=test_gem_package_tar_reader_entry I, [2024-05-22T11:23:46.072326 #4157262] INFO -- : [ 40/885] 4728=test_rand I, [2024-05-22T11:23:46.085325 #4157262] INFO -- : [ 41/885] 4732=test_bug_reporter I, [2024-05-22T11:23:46.116072 #4157262] INFO -- : [ 42/885] 4738=test_exception I, [2024-05-22T11:23:46.160841 #4157262] INFO -- : [ 43/885] 4741=test_sprintf_comb I, [2024-05-22T11:23:46.163724 #4157262] INFO -- : [ 44/885] 4742=test_gem_request I, [2024-05-22T11:23:46.176247 #4157262] INFO -- : [ 45/885] 4733=test_method_cache I, [2024-05-22T11:23:46.181046 #4157262] INFO -- : [ 46/885] 4733=test_gem_ext_cargo_builder_link_flag_converter I, [2024-05-22T11:23:46.212011 #4157262] INFO -- : [ 47/885] 4729=test_gem_commands_mirror I, [2024-05-22T11:23:46.220986 #4157262] INFO -- : [ 48/885] 4733=test_gem_text I, [2024-05-22T11:23:46.249961 #4157262] INFO -- : [ 49/885] 4728=test_settracefunc I, [2024-05-22T11:23:46.253369 #4157262] INFO -- : [ 50/885] 4733=test_enumerator_kw I, [2024-05-22T11:23:46.255541 #4157262] INFO -- : [ 51/885] 4733=test_scan_args I, [2024-05-22T11:23:46.263433 #4157262] INFO -- : [ 52/885] 4733=test_win32ole I, [2024-05-22T11:23:46.268126 #4157262] INFO -- : [ 53/885] 4741=test_generic I, [2024-05-22T11:23:46.269726 #4157262] INFO -- : [ 54/885] 4733=test_gem_commands_specification_command I, [2024-05-22T11:23:46.270645 #4157262] INFO -- : [ 55/885] 4726=test_inadvertent_creation I, [2024-05-22T11:23:46.287491 #4157262] INFO -- : [ 56/885] 4734=test_flags I, [2024-05-22T11:23:46.306422 #4157262] INFO -- : [ 57/885] 4741=test_enumerator I, [2024-05-22T11:23:46.359590 #4157262] INFO -- : [ 58/885] 4729=test_http I, [2024-05-22T11:23:46.370555 #4157262] INFO -- : [ 59/885] 4729=test_shift_jis I, [2024-05-22T11:23:46.376130 #4157262] INFO -- : [ 60/885] 4729=test_gem_commands_which_command I, [2024-05-22T11:23:46.413345 #4157262] INFO -- : [ 61/885] 4726=test_rdoc_markup_attribute_manager I, [2024-05-22T11:23:46.439751 #4157262] INFO -- : [ 62/885] 4729=test_name_error I, [2024-05-22T11:23:46.443195 #4157262] INFO -- : [ 63/885] 4733=test_gem_resolver I, [2024-05-22T11:23:46.458838 #4157262] INFO -- : [ 64/885] 4731=test_gem_resolver_composed_set I, [2024-05-22T11:23:46.463584 #4157262] INFO -- : [ 65/885] 4732=test_safe_load I, [2024-05-22T11:23:46.471102 #4157262] INFO -- : [ 66/885] 4731=test_gem_commands_dependency_command I, [2024-05-22T11:23:46.488974 #4157262] INFO -- : [ 67/885] 4742=test_nil2vtempty I, [2024-05-22T11:23:46.492255 #4157262] INFO -- : [ 68/885] 4732=test_stream I, [2024-05-22T11:23:46.497428 #4157262] INFO -- : [ 69/885] 4742=test_rdoc_context I, [2024-05-22T11:23:46.502582 #4157262] INFO -- : [ 70/885] 4732=test_rdoc_parser_ruby I, [2024-05-22T11:23:46.511794 #4157262] INFO -- : [ 71/885] 4739=test_httpresponse I, [2024-05-22T11:23:46.553605 #4157262] INFO -- : [ 72/885] 4730=test_open-uri I, [2024-05-22T11:23:46.571969 #4157262] INFO -- : [ 73/885] 4729=test_date_time I, [2024-05-22T11:23:46.587417 #4157262] INFO -- : [ 74/885] 4731=test_rdoc_markup_to_joined_paragraph I, [2024-05-22T11:23:46.588203 #4157262] INFO -- : [ 75/885] 4731=test_require I, [2024-05-22T11:23:46.588982 #4157262] INFO -- : [ 76/885] 4729=test_data I, [2024-05-22T11:23:46.591402 #4157262] INFO -- : [ 77/885] 4731=test_date_new I, [2024-05-22T11:23:46.595858 #4157262] INFO -- : [ 78/885] 4729=index_write_test I, [2024-05-22T11:23:46.608169 #4157262] INFO -- : [ 79/885] 4731=test_syntax I, [2024-05-22T11:23:46.616631 #4157262] INFO -- : [ 80/885] 4739=test_gem_safe_yaml I, [2024-05-22T11:23:46.622508 #4157262] INFO -- : [ 81/885] 4726=test_rdoc_text I, [2024-05-22T11:23:46.667725 #4157262] INFO -- : [ 82/885] 4729=test_tcp I, [2024-05-22T11:23:46.673390 #4157262] INFO -- : [ 83/885] 4733=test_iso_8859 I, [2024-05-22T11:23:46.687685 #4157262] INFO -- : [ 84/885] 4726=test_switch_hitter I, [2024-05-22T11:23:46.709550 #4157262] INFO -- : [ 85/885] 4726=test_io_console I, [2024-05-22T11:23:46.710415 #4157262] INFO -- : [ 86/885] 4733=test_singleton I, [2024-05-22T11:23:46.722582 #4157262] INFO -- : [ 87/885] 4733=test_flush I, [2024-05-22T11:23:46.726591 #4157262] INFO -- : [ 88/885] 4733=test_logperiod I, [2024-05-22T11:23:46.738507 #4157262] INFO -- : [ 89/885] 4733=test_rdoc_normal_module I, [2024-05-22T11:23:46.745735 #4157262] INFO -- : [ 90/885] 4729=test_c_union_entity I, [2024-05-22T11:23:46.788526 #4157262] INFO -- : [ 91/885] 4729=test_rdoc_markdown_test I, [2024-05-22T11:23:46.810912 #4157262] INFO -- : [ 92/885] 4739=test_securerandom I, [2024-05-22T11:23:46.842368 #4157262] INFO -- : [ 93/885] 4739=test_thread_fd_close I, [2024-05-22T11:23:46.856436 #4157262] INFO -- : [ 94/885] 4739=test_passing_block I, [2024-05-22T11:23:46.860429 #4157262] INFO -- : [ 95/885] 4739=test_stringchar I, [2024-05-22T11:23:46.910307 #4157262] INFO -- : [ 96/885] 4736=test_hash_create I, [2024-05-22T11:23:46.912203 #4157262] INFO -- : [ 97/885] 4736=newline_test I, [2024-05-22T11:23:46.936479 #4157262] INFO -- : [ 98/885] 4732=test_uncorrectable_name_check I, [2024-05-22T11:23:46.937103 #4157262] INFO -- : [ 99/885] 4739=test_gem_source_local I, [2024-05-22T11:23:46.945332 #4157262] INFO -- : [100/885] 4732=test_gem_security_policy I, [2024-05-22T11:23:46.946711 #4157262] INFO -- : [101/885] 4733=test_pack I, [2024-05-22T11:23:47.045943 #4157262] INFO -- : [102/885] 4730=test_process I, [2024-05-22T11:23:47.047502 #4157262] INFO -- : [103/885] 4736=test_last_thread I, [2024-05-22T11:23:47.048139 #4157262] INFO -- : [104/885] 4727=test_x509cert I, [2024-05-22T11:23:47.077168 #4157262] INFO -- : [105/885] 4728=test_gc I, [2024-05-22T11:23:47.149983 #4157262] INFO -- : [106/885] 4739=test_gem_resolver_lock_specification I, [2024-05-22T11:23:47.179126 #4157262] INFO -- : [107/885] 4733=test_err_in_callback I, [2024-05-22T11:23:47.182926 #4157262] INFO -- : [108/885] 4733=test_logdevice I, [2024-05-22T11:23:47.183596 #4157262] INFO -- : [109/885] 4739=test_gem_ext_rake_builder I, [2024-05-22T11:23:47.295973 #4157262] INFO -- : [110/885] 4742=test_arity I, [2024-05-22T11:23:47.296134 #4157262] INFO -- : [111/885] 4727=test_rdoc_tom_doc I, [2024-05-22T11:23:47.296373 #4157262] INFO -- : [112/885] 4742=test_rdoc_markup_to_tt_only I, [2024-05-22T11:23:47.325240 #4157262] INFO -- : [113/885] 4742=test_hmac I, [2024-05-22T11:23:47.328080 #4157262] INFO -- : [114/885] 4734=test_gem_spec_fetcher I, [2024-05-22T11:23:47.330966 #4157262] INFO -- : [115/885] 4742=test_common I, [2024-05-22T11:23:47.403361 #4157262] INFO -- : [116/885] 4738=test_key_actor_vi I, [2024-05-22T11:23:47.441723 #4157262] INFO -- : [117/885] 4727=test_bug-3571 I, [2024-05-22T11:23:47.454604 #4157262] INFO -- : [118/885] 4734=test_gem_command I, [2024-05-22T11:23:47.456989 #4157262] INFO -- : [119/885] 4727=test_gem_commands_lock_command I, [2024-05-22T11:23:47.465679 #4157262] INFO -- : [120/885] 4743=test_assignment I, [2024-05-22T11:23:47.478438 #4157262] INFO -- : [121/885] 4727=test_ifunless I, [2024-05-22T11:23:47.480403 #4157262] INFO -- : [122/885] 4727=test_numeric I, [2024-05-22T11:23:47.484069 #4157262] INFO -- : [123/885] 4732=test_optarg I, [2024-05-22T11:23:47.529601 #4157262] INFO -- : [124/885] 4734=test_yaml_special_cases I, [2024-05-22T11:23:47.541226 #4157262] INFO -- : [125/885] 4734=test_gem_source_list I, [2024-05-22T11:23:47.553136 #4157262] INFO -- : [126/885] 4742=test_config I, [2024-05-22T11:23:47.565429 #4157262] INFO -- : [127/885] 4727=test_address_resolve I, [2024-05-22T11:23:47.576214 #4157262] INFO -- : [128/885] 4734=test_rdoc_token_stream I, [2024-05-22T11:23:47.592166 #4157262] INFO -- : [129/885] 4738=test_iter_break I, [2024-05-22T11:23:47.595517 #4157262] INFO -- : [130/885] 4738=test_exception I, [2024-05-22T11:23:47.609475 #4157262] INFO -- : [131/885] 4738=test_zsh_completion I, [2024-05-22T11:23:47.612549 #4157262] INFO -- : [132/885] 4738=test_pp I, [2024-05-22T11:23:47.618577 #4157262] INFO -- : [133/885] 4727=test_frozen I, [2024-05-22T11:23:47.622108 #4157262] INFO -- : [134/885] 4727=test_gem_ext_configure_builder I, [2024-05-22T11:23:47.622661 #4157262] INFO -- : [135/885] 4742=test_macro I, [2024-05-22T11:23:47.625762 #4157262] INFO -- : [136/885] 4742=test_rdoc_single_class I, [2024-05-22T11:23:47.629022 #4157262] INFO -- : [137/885] 4742=test_nil I, [2024-05-22T11:23:47.633073 #4157262] INFO -- : [138/885] 4742=test_num2int I, [2024-05-22T11:23:47.647189 #4157262] INFO -- : [139/885] 4742=test_verbose I, [2024-05-22T11:23:47.654350 #4157262] INFO -- : [140/885] 4738=test_gem_silent_ui I, [2024-05-22T11:23:47.654871 #4157262] INFO -- : [141/885] 4732=test_emitter I, [2024-05-22T11:23:47.665102 #4157262] INFO -- : [142/885] 4732=test_bug-5832 I, [2024-05-22T11:23:47.669044 #4157262] INFO -- : [143/885] 4732=test_files_ext I, [2024-05-22T11:23:47.681686 #4157262] INFO -- : [144/885] 4742=dispatcher_test I, [2024-05-22T11:23:47.691978 #4157262] INFO -- : [145/885] 4727=test_eval_history I, [2024-05-22T11:23:47.703142 #4157262] INFO -- : [146/885] 4734=test_kernel I, [2024-05-22T11:23:47.757806 #4157262] INFO -- : [147/885] 4742=test_kdf I, [2024-05-22T11:23:47.811936 #4157262] INFO -- : [148/885] 4737=test_gem_doctor I, [2024-05-22T11:23:47.812073 #4157262] INFO -- : [149/885] 4732=test_rdoc_markup_paragraph I, [2024-05-22T11:23:47.812176 #4157262] INFO -- : [150/885] 4727=!Nothing_to_test I, [2024-05-22T11:23:47.813665 #4157262] INFO -- : [151/885] 4727=test_psych I, [2024-05-22T11:23:47.815376 #4157262] INFO -- : [152/885] 4732=test_enc_raise I, [2024-05-22T11:23:47.821985 #4157262] INFO -- : [153/885] 4732=test_gem_rdoc I, [2024-05-22T11:23:47.828521 #4157262] INFO -- : [154/885] 4742=test_date I, [2024-05-22T11:23:47.837721 #4157262] INFO -- : [155/885] 4742=test_gem_ext_cargo_builder_unit I, [2024-05-22T11:23:47.851806 #4157262] INFO -- : [156/885] 4727=test_at_exit I, [2024-05-22T11:23:47.863866 #4157262] INFO -- : [157/885] 4738=test_command I, [2024-05-22T11:23:47.870862 #4157262] INFO -- : [158/885] 4727=test_object_create_start I, [2024-05-22T11:23:47.872248 #4157262] INFO -- : [159/885] 4739=test_rdoc_markup_attributes I, [2024-05-22T11:23:47.873906 #4157262] INFO -- : [160/885] 4727=test_default_gems I, [2024-05-22T11:23:47.873962 #4157262] INFO -- : [161/885] 4742=test_rdoc_markup_to_rdoc I, [2024-05-22T11:23:47.875952 #4157262] INFO -- : [162/885] 4739=test_rdoc_rd_inline_parser I, [2024-05-22T11:23:47.905059 #4157262] INFO -- : [163/885] 4739=test_mul I, [2024-05-22T11:23:47.910750 #4157262] INFO -- : [164/885] 4739=test_null I, [2024-05-22T11:23:47.917263 #4157262] INFO -- : [165/885] 4742=test_win32ole_type I, [2024-05-22T11:23:47.919300 #4157262] INFO -- : [166/885] 4739=test_pkey_ec I, [2024-05-22T11:23:47.920220 #4157262] INFO -- : [167/885] 4742=test_pipe I, [2024-05-22T11:23:47.934745 #4157262] INFO -- : [168/885] 4732=test_trick I, [2024-05-22T11:23:47.939799 #4157262] INFO -- : [169/885] 4727=test_thread I, [2024-05-22T11:23:47.942871 #4157262] INFO -- : [170/885] 4727=test_date_parse I, [2024-05-22T11:23:48.006520 #4157262] INFO -- : [171/885] 4739=test_rdoc_i18n_text I, [2024-05-22T11:23:48.007193 #4157262] INFO -- : [172/885] 4737=test_key_name_check I, [2024-05-22T11:23:48.012332 #4157262] INFO -- : [173/885] 4739=test_defined I, [2024-05-22T11:23:48.020641 #4157262] INFO -- : [174/885] 4737=test_backtrace I, [2024-05-22T11:23:48.021197 #4157262] INFO -- : [175/885] 4733=test_io_buffer I, [2024-05-22T11:23:48.023375 #4157262] INFO -- : [176/885] 4737=test_gb18030 I, [2024-05-22T11:23:48.026425 #4157262] INFO -- : [177/885] 4737=test_buffering I, [2024-05-22T11:23:48.033689 #4157262] INFO -- : [178/885] 4737=test_svcb_https I, [2024-05-22T11:23:48.054541 #4157262] INFO -- : [179/885] 4737=test_gem_uninstaller I, [2024-05-22T11:23:48.055589 #4157262] INFO -- : [180/885] 4733=test_rdoc_rdoc I, [2024-05-22T11:23:48.060816 #4157262] INFO -- : [181/885] 4727=test_windows_1251 I, [2024-05-22T11:23:48.061428 #4157262] INFO -- : [182/885] 4742=test_time I, [2024-05-22T11:23:48.067711 #4157262] INFO -- : [183/885] 4727=test_gem_package_old I, [2024-05-22T11:23:48.101635 #4157262] INFO -- : [184/885] 4727=test_gem_resolver_index_set I, [2024-05-22T11:23:48.107675 #4157262] INFO -- : [185/885] 4739=test_proc I, [2024-05-22T11:23:48.121918 #4157262] INFO -- : [186/885] 4736=test_string I, [2024-05-22T11:23:48.129319 #4157262] INFO -- : [187/885] 4727=test_gc_compact I, [2024-05-22T11:23:48.146026 #4157262] INFO -- : [188/885] 4733=test_optimization I, [2024-05-22T11:23:48.176217 #4157262] INFO -- : [189/885] 4742=test_date_conv I, [2024-05-22T11:23:48.182910 #4157262] INFO -- : [190/885] 4742=test_ole_methods I, [2024-05-22T11:23:48.185747 #4157262] INFO -- : [191/885] 4742=test_erb_m17n I, [2024-05-22T11:23:48.192944 #4157262] INFO -- : [192/885] 4742=test_egrep_cpp I, [2024-05-22T11:23:48.211058 #4157262] INFO -- : [193/885] 4740=test_zlib I, [2024-05-22T11:23:48.241071 #4157262] INFO -- : [194/885] 4734=test_cgi_tag_helper I, [2024-05-22T11:23:48.254009 #4157262] INFO -- : [195/885] 4729=test_files_test_2 I, [2024-05-22T11:23:48.254295 #4157262] INFO -- : [196/885] 4734=test_fnmatch I, [2024-05-22T11:23:48.295257 #4157262] INFO -- : [197/885] 4734=test_folderitem2_invokeverb I, [2024-05-22T11:23:48.299131 #4157262] INFO -- : [198/885] 4734=test_rdoc_markup_parser I, [2024-05-22T11:23:48.344485 #4157262] INFO -- : [199/885] 4734=test_require_path_check I, [2024-05-22T11:23:48.344546 #4157262] INFO -- : [200/885] 4738=test_gem_validator I, [2024-05-22T11:23:48.369335 #4157262] INFO -- : [201/885] 4742=test_raise I, [2024-05-22T11:23:48.372970 #4157262] INFO -- : [202/885] 4742=test_x509attr I, [2024-05-22T11:23:48.382098 #4157262] INFO -- : [203/885] 4742=test_depth_first I, [2024-05-22T11:23:48.385339 #4157262] INFO -- : [204/885] 4742=test_gem_request_set_lockfile_parser I, [2024-05-22T11:23:48.394585 #4157262] INFO -- : [205/885] 4738=test_rdoc_store I, [2024-05-22T11:23:48.410776 #4157262] INFO -- : [206/885] 4743=test_string I, [2024-05-22T11:23:48.421151 #4157262] INFO -- : [207/885] 4734=test_pattern_matching I, [2024-05-22T11:23:48.441972 #4157262] INFO -- : [208/885] 4734=test_rdoc_stats I, [2024-05-22T11:23:48.459916 #4157262] INFO -- : [209/885] 4743=test_rdoc_parser I, [2024-05-22T11:23:48.503158 #4157262] INFO -- : [210/885] 4742=test_qsort I, [2024-05-22T11:23:48.505954 #4157262] INFO -- : [211/885] 4734=test_gem_dependency_resolution_error I, [2024-05-22T11:23:48.510813 #4157262] INFO -- : [212/885] 4742=test_custom_command I, [2024-05-22T11:23:48.514333 #4157262] INFO -- : [213/885] 4734=json_addition_test I, [2024-05-22T11:23:48.550894 #4157262] INFO -- : [214/885] 4735=test_rdoc_markup_indented_paragraph I, [2024-05-22T11:23:48.565752 #4157262] INFO -- : [215/885] 4734=test_rdoc_task I, [2024-05-22T11:23:48.567810 #4157262] INFO -- : [216/885] 4734=test_gem_resolver_conflict I, [2024-05-22T11:23:48.578090 #4157262] INFO -- : [217/885] 4734=test_io_buffer I, [2024-05-22T11:23:48.603539 #4157262] INFO -- : [218/885] 4742=test_backtrace I, [2024-05-22T11:23:48.685645 #4157262] INFO -- : [219/885] 4743=test_pack I, [2024-05-22T11:23:48.687219 #4157262] INFO -- : [220/885] 4734=ruby_parser_test I, [2024-05-22T11:23:48.692410 #4157262] INFO -- : [221/885] 4725=test_readpartial I, [2024-05-22T11:23:48.697569 #4157262] INFO -- : [222/885] 4743=test_gem_commands_install_command I, [2024-05-22T11:23:48.737029 #4157262] INFO -- : [223/885] 4735=test_clone I, [2024-05-22T11:23:48.775711 #4157262] INFO -- : [224/885] 4734=test_rdoc_require I, [2024-05-22T11:23:48.793852 #4157262] INFO -- : [225/885] 4734=locals_test I, [2024-05-22T11:23:48.904112 #4157262] INFO -- : [226/885] 4739=test_typeddata I, [2024-05-22T11:23:48.929789 #4157262] INFO -- : [227/885] 4735=encoding_test I, [2024-05-22T11:23:48.967344 #4157262] INFO -- : [228/885] 4737=test_gem_resolver_best_set I, [2024-05-22T11:23:49.004636 #4157262] INFO -- : [229/885] 4735=test_rdoc_markup_to_html_crossref I, [2024-05-22T11:23:49.012171 #4157262] INFO -- : [230/885] 4737=test_webauthn_poller I, [2024-05-22T11:23:49.082446 #4157262] INFO -- : [231/885] 4738=test_rdoc_markup_raw I, [2024-05-22T11:23:49.086064 #4157262] INFO -- : [232/885] 4738=test_rat I, [2024-05-22T11:23:49.091934 #4157262] INFO -- : [233/885] 4738=test_array I, [2024-05-22T11:23:49.094863 #4157262] INFO -- : [234/885] 4725=test_optparse I, [2024-05-22T11:23:49.099603 #4157262] INFO -- : [235/885] 4738=test_fstring I, [2024-05-22T11:23:49.103598 #4157262] INFO -- : [236/885] 4734=test_yield I, [2024-05-22T11:23:49.146295 #4157262] INFO -- : [237/885] 4737=test_rdoc_alias I, [2024-05-22T11:23:49.157234 #4157262] INFO -- : [238/885] 4725=parser_test I, [2024-05-22T11:23:49.160835 #4157262] INFO -- : [239/885] 4739=test_convertible I, [2024-05-22T11:23:49.221880 #4157262] INFO -- : [240/885] 4738=test_files_sample I, [2024-05-22T11:23:49.236084 #4157262] INFO -- : [241/885] 4725=test_stringscanner I, [2024-05-22T11:23:49.276577 #4157262] INFO -- : [242/885] 4725=test_iseq_load I, [2024-05-22T11:23:49.283410 #4157262] INFO -- : [243/885] 4737=test_gem_util I, [2024-05-22T11:23:49.325806 #4157262] INFO -- : [244/885] 4738=test_gem_package_tar_header I, [2024-05-22T11:23:49.327376 #4157262] INFO -- : [245/885] 4744=test_bigzero I, [2024-05-22T11:23:49.330693 #4157262] INFO -- : [246/885] 4744=test_pkey_dh I, [2024-05-22T11:23:49.362430 #4157262] INFO -- : [247/885] 4738=test_pkcs12 I, [2024-05-22T11:23:49.376273 #4157262] INFO -- : [248/885] 4735=test_system I, [2024-05-22T11:23:49.427248 #4157262] INFO -- : [249/885] 4726=test_etc I, [2024-05-22T11:23:49.467093 #4157262] INFO -- : [250/885] 4737=test_yjit_exit_locations I, [2024-05-22T11:23:49.467156 #4157262] INFO -- : [251/885] 4737=test_gem_resolver_activation_request I, [2024-05-22T11:23:49.480050 #4157262] INFO -- : [252/885] 4737=test_protocol I, [2024-05-22T11:23:49.496739 #4157262] INFO -- : [253/885] 4726=test_getopts I, [2024-05-22T11:23:49.499025 #4157262] INFO -- : [254/885] 4744=test_ripper I, [2024-05-22T11:23:49.509870 #4157262] INFO -- : [255/885] 4726=test_gem_config_file I, [2024-05-22T11:23:49.658803 #4157262] INFO -- : [256/885] 4726=test_config I, [2024-05-22T11:23:49.704752 #4157262] INFO -- : [257/885] 4738=test_sleep I, [2024-05-22T11:23:49.729120 #4157262] INFO -- : [258/885] 4726=test_gc I, [2024-05-22T11:23:49.732771 #4157262] INFO -- : [259/885] 4726=test_gem_commands_fetch_command I, [2024-05-22T11:23:49.792444 #4157262] INFO -- : [260/885] 4737=test_math I, [2024-05-22T11:23:49.803162 #4157262] INFO -- : [261/885] 4737=test_libs I, [2024-05-22T11:23:49.830213 #4157262] INFO -- : [262/885] 4744=test_yaml_tree I, [2024-05-22T11:23:49.830959 #4157262] INFO -- : [263/885] 4737=test_rendering I, [2024-05-22T11:23:49.865356 #4157262] INFO -- : [264/885] 4726=test_face I, [2024-05-22T11:23:49.867885 #4157262] INFO -- : [265/885] 4744=test_case I, [2024-05-22T11:23:49.909058 #4157262] INFO -- : [266/885] 4744=test_sizeof I, [2024-05-22T11:23:49.919896 #4157262] INFO -- : [267/885] 4725=test_unicode_escape I, [2024-05-22T11:23:49.942474 #4157262] INFO -- : [268/885] 4737=test_io I, [2024-05-22T11:23:49.944775 #4157262] INFO -- : [269/885] 4742=test_autoload I, [2024-05-22T11:23:49.952343 #4157262] INFO -- : [270/885] 4732=test_utf16 I, [2024-05-22T11:23:49.960987 #4157262] INFO -- : [271/885] 4732=test_date_attr I, [2024-05-22T11:23:49.964198 #4157262] INFO -- : [272/885] 4726=test_ellipsize I, [2024-05-22T11:23:49.968729 #4157262] INFO -- : [273/885] 4732=warnings_test I, [2024-05-22T11:23:49.978629 #4157262] INFO -- : [274/885] 4726=test_kwargs I, [2024-05-22T11:23:49.987406 #4157262] INFO -- : [275/885] 4726=test_gem_commands_exec_command I, [2024-05-22T11:23:50.027628 #4157262] INFO -- : [276/885] 4725=test_io_wait I, [2024-05-22T11:23:50.047651 #4157262] INFO -- : [277/885] 4732=test_type_completor I, [2024-05-22T11:23:50.053944 #4157262] INFO -- : [278/885] 4732=test_summary I, [2024-05-22T11:23:50.106438 #4157262] INFO -- : [279/885] 4732=test_console_attr I, [2024-05-22T11:23:50.116859 #4157262] INFO -- : [280/885] 4732=test_gem_source_specific_file I, [2024-05-22T11:23:50.166308 #4157262] INFO -- : [281/885] 4743=test_foreach I, [2024-05-22T11:23:50.169130 #4157262] INFO -- : [282/885] 4743=test_condition I, [2024-05-22T11:23:50.172690 #4157262] INFO -- : [283/885] 4743=test_gem_commands_uninstall_command I, [2024-05-22T11:23:50.224261 #4157262] INFO -- : [284/885] 4732=test_cp949 I, [2024-05-22T11:23:50.232175 #4157262] INFO -- : [285/885] 4732=test_win32ole_record I, [2024-05-22T11:23:50.237381 #4157262] INFO -- : [286/885] 4732=test_gem_unsatisfiable_dependency_error I, [2024-05-22T11:23:50.254575 #4157262] INFO -- : [287/885] 4732=test_ubf_async_safe I, [2024-05-22T11:23:50.260285 #4157262] INFO -- : [288/885] 4732=test_hash I, [2024-05-22T11:23:50.364251 #4157262] INFO -- : [289/885] 4725=test_win32ole_type_event I, [2024-05-22T11:23:50.368084 #4157262] INFO -- : [290/885] 4725=test_emoji I, [2024-05-22T11:23:50.412447 #4157262] INFO -- : [291/885] 4725=test_sorted_set I, [2024-05-22T11:23:50.414421 #4157262] INFO -- : [292/885] 4735=test_io I, [2024-05-22T11:23:50.587176 #4157262] INFO -- : [293/885] 4725=test_pattern_key_name_check I, [2024-05-22T11:23:50.587360 #4157262] INFO -- : [294/885] 4725=test_to_ruby I, [2024-05-22T11:23:50.618837 #4157262] INFO -- : [295/885] 4725=test_array_create I, [2024-05-22T11:23:50.624551 #4157262] INFO -- : [296/885] 4725=test_pack I, [2024-05-22T11:23:50.627608 #4157262] INFO -- : [297/885] 4727=test_gem_impossible_dependencies_error I, [2024-05-22T11:23:50.636498 #4157262] INFO -- : [298/885] 4727=test_method I, [2024-05-22T11:23:50.639752 #4157262] INFO -- : [299/885] 4735=test_gem_commands_query_command I, [2024-05-22T11:23:50.766276 #4157262] INFO -- : [300/885] 4740=test_rdoc_rubygems_hook I, [2024-05-22T11:23:50.850965 #4157262] INFO -- : [301/885] 4725=test_rdoc_context_section I, [2024-05-22T11:23:50.921461 #4157262] INFO -- : [302/885] 4726=test_euc_kr I, [2024-05-22T11:23:50.937794 #4157262] INFO -- : [303/885] 4726=test_ftp I, [2024-05-22T11:23:50.940837 #4157262] INFO -- : [304/885] 4726=test_sprintf I, [2024-05-22T11:23:50.983277 #4157262] INFO -- : [305/885] 4743=test_gem_requirement I, [2024-05-22T11:23:50.994800 #4157262] INFO -- : [306/885] 4725=comments_test I, [2024-05-22T11:23:50.997803 #4157262] INFO -- : [307/885] 4725=test_string_memory I, [2024-05-22T11:23:51.035053 #4157262] INFO -- : [308/885] 4725=test_gem_security_trust_dir I, [2024-05-22T11:23:51.082532 #4157262] INFO -- : [309/885] 4740=test_undef I, [2024-05-22T11:23:51.089965 #4157262] INFO -- : [310/885] 4740=test_line_editor I, [2024-05-22T11:23:51.114241 #4157262] INFO -- : [311/885] 4743=ripper_test I, [2024-05-22T11:23:51.129090 #4157262] INFO -- : [312/885] 4726=test_objspace I, [2024-05-22T11:23:51.142643 #4157262] INFO -- : [313/885] 4740=test_remote_fetch_error I, [2024-05-22T11:23:51.152357 #4157262] INFO -- : [314/885] 4740=test_have_library I, [2024-05-22T11:23:51.241099 #4157262] INFO -- : [315/885] 4725=test_gem_commands_stale_command I, [2024-05-22T11:23:51.253352 #4157262] INFO -- : [316/885] 4725=test_c_struct_entry I, [2024-05-22T11:23:51.392877 #4157262] INFO -- : [317/885] 4734=test_lock_native_thread I, [2024-05-22T11:23:51.452871 #4157262] INFO -- : [318/885] 4725=test_set I, [2024-05-22T11:23:51.455907 #4157262] INFO -- : [319/885] 4725=test_show_source I, [2024-05-22T11:23:51.542468 #4157262] INFO -- : [320/885] 4725=test_win32ole_typelib I, [2024-05-22T11:23:51.547162 #4157262] INFO -- : [321/885] 4725=test_protect I, [2024-05-22T11:23:51.548096 #4157262] INFO -- : [322/885] 4735=test_raise_exception I, [2024-05-22T11:23:51.550423 #4157262] INFO -- : [323/885] 4725=test_gem_request_set_lockfile I, [2024-05-22T11:23:51.667651 #4157262] INFO -- : [324/885] 4734=test_external_new I, [2024-05-22T11:23:51.674292 #4157262] INFO -- : [325/885] 4734=test_postponed_job I, [2024-05-22T11:23:51.747715 #4157262] INFO -- : [326/885] 4738=test_alias_and_anchor I, [2024-05-22T11:23:51.752619 #4157262] INFO -- : [327/885] 4738=test_hash I, [2024-05-22T11:23:51.769159 #4157262] INFO -- : [328/885] 4743=test_tree_builder I, [2024-05-22T11:23:51.774360 #4157262] INFO -- : [329/885] 4738=test_gem_resolver_dependency_request I, [2024-05-22T11:23:51.783171 #4157262] INFO -- : [330/885] 4743=test_ns_spki I, [2024-05-22T11:23:51.796566 #4157262] INFO -- : [331/885] 4738=test_framework I, [2024-05-22T11:23:51.813732 #4157262] INFO -- : [332/885] 4743=test_kill_ring I, [2024-05-22T11:23:51.816793 #4157262] INFO -- : [333/885] 4743=test_argf I, [2024-05-22T11:23:51.823969 #4157262] INFO -- : [334/885] 4738=test_m17n I, [2024-05-22T11:23:51.909588 #4157262] INFO -- : [335/885] 4738=test_gem_commands_environment_command I, [2024-05-22T11:23:51.961276 #4157262] INFO -- : [336/885] 4738=test_ws I, [2024-05-22T11:23:51.977971 #4157262] INFO -- : [337/885] 4725=test_yjit I, [2024-05-22T11:23:51.981769 #4157262] INFO -- : [338/885] 4738=test_workspace I, [2024-05-22T11:23:51.992018 #4157262] INFO -- : [339/885] 4725=test_weakmap I, [2024-05-22T11:23:52.084547 #4157262] INFO -- : [340/885] 4734=test_rdoc_include I, [2024-05-22T11:23:52.120000 #4157262] INFO -- : [341/885] 4738=test_reqarg I, [2024-05-22T11:23:52.156070 #4157262] INFO -- : [342/885] 4734=test_gem_commands_list_command I, [2024-05-22T11:23:52.164438 #4157262] INFO -- : [343/885] 4734=test_stack I, [2024-05-22T11:23:52.262574 #4157262] INFO -- : [344/885] 4735=test_too_many_dummy_encodings I, [2024-05-22T11:23:52.322526 #4157262] INFO -- : [345/885] 4740=test_gem_version I, [2024-05-22T11:23:52.326508 #4157262] INFO -- : [346/885] 4729=test_rdoc_options I, [2024-05-22T11:23:52.340045 #4157262] INFO -- : [347/885] 4735=test_cesu8 I, [2024-05-22T11:23:52.344055 #4157262] INFO -- : [348/885] 4735=test_econv I, [2024-05-22T11:23:52.384704 #4157262] INFO -- : [349/885] 4740=test_string_processing I, [2024-05-22T11:23:52.388565 #4157262] INFO -- : [350/885] 4740=test_fileutils I, [2024-05-22T11:23:52.531917 #4157262] INFO -- : [351/885] 4738=test_resource I, [2024-05-22T11:23:52.554055 #4157262] INFO -- : [352/885] 4738=test_gem_commands_signin_command I, [2024-05-22T11:23:52.577452 #4157262] INFO -- : [353/885] 4729=test_emitter I, [2024-05-22T11:23:52.583213 #4157262] INFO -- : [354/885] 4729=test_ldap I, [2024-05-22T11:23:52.586990 #4157262] INFO -- : [355/885] 4729=test_gem_ext_ext_conf_builder I, [2024-05-22T11:23:52.638757 #4157262] INFO -- : [356/885] 4736=test_frozen_error I, [2024-05-22T11:23:52.641413 #4157262] INFO -- : [357/885] 4738=test_method_cache I, [2024-05-22T11:23:52.641969 #4157262] INFO -- : [358/885] 4736=test_gem_stub_specification I, [2024-05-22T11:23:52.643484 #4157262] INFO -- : [359/885] 4738=test_gem_commands_search_command I, [2024-05-22T11:23:52.659152 #4157262] INFO -- : [360/885] 4738=test_complex I, [2024-05-22T11:23:52.819876 #4157262] INFO -- : [361/885] 4738=test_rdoc_markup_verbatim I, [2024-05-22T11:23:52.827331 #4157262] INFO -- : [362/885] 4738=test_inlinecache I, [2024-05-22T11:23:52.893954 #4157262] INFO -- : [363/885] 4740=test_gem_dependency I, [2024-05-22T11:23:52.900602 #4157262] INFO -- : [364/885] 4738=test_gem_resolver_specification I, [2024-05-22T11:23:52.923281 #4157262] INFO -- : [365/885] 4738=test_path_to_class I, [2024-05-22T11:23:52.924975 #4157262] INFO -- : [366/885] 4738=test_mdns I, [2024-05-22T11:23:52.929151 #4157262] INFO -- : [367/885] 4738=test_parse I, [2024-05-22T11:23:53.001470 #4157262] INFO -- : [368/885] 4736=test_gem_remote_fetcher I, [2024-05-22T11:23:53.014333 #4157262] INFO -- : [369/885] 4740=test_scanner_events I, [2024-05-22T11:23:53.060703 #4157262] INFO -- : [370/885] 4740=test_gem_resolver_installed_specification I, [2024-05-22T11:23:53.078819 #4157262] INFO -- : [371/885] 4740=test_date_strftime I, [2024-05-22T11:23:53.104308 #4157262] INFO -- : [372/885] 4741=test_rdoc_parser_rd I, [2024-05-22T11:23:53.148716 #4157262] INFO -- : [373/885] 4734=test_yamlstore I, [2024-05-22T11:23:53.154988 #4157262] INFO -- : [374/885] 4734=test_gem_installer I, [2024-05-22T11:23:53.162071 #4157262] INFO -- : [375/885] 4731=test_const I, [2024-05-22T11:23:53.173351 #4157262] INFO -- : [376/885] 4731=test_class I, [2024-05-22T11:23:53.178101 #4157262] INFO -- : [377/885] 4741=test_rdoc_normal_class I, [2024-05-22T11:23:53.200642 #4157262] INFO -- : [378/885] 4744=test_load I, [2024-05-22T11:23:53.211739 #4157262] INFO -- : [379/885] 4744=json_string_matching_test I, [2024-05-22T11:23:53.225104 #4157262] INFO -- : [380/885] 4744=test_random I, [2024-05-22T11:23:53.229667 #4157262] INFO -- : [381/885] 4744=test_asn1 I, [2024-05-22T11:23:53.231699 #4157262] INFO -- : [382/885] 4741=test_irb I, [2024-05-22T11:23:53.256198 #4157262] INFO -- : [383/885] 4744=test_queue I, [2024-05-22T11:23:53.257749 #4157262] INFO -- : [384/885] 4744=test_function I, [2024-05-22T11:23:53.365109 #4157262] INFO -- : [385/885] 4728=test_tempfile I, [2024-05-22T11:23:53.388240 #4157262] INFO -- : [386/885] 4735=parse_comments_test I, [2024-05-22T11:23:53.392175 #4157262] INFO -- : [387/885] 4735=test_noarg I, [2024-05-22T11:23:53.483028 #4157262] INFO -- : [388/885] 4744=test_basicsocket I, [2024-05-22T11:23:53.501083 #4157262] INFO -- : [389/885] 4744=test_utf32 I, [2024-05-22T11:23:53.503838 #4157262] INFO -- : [390/885] 4738=test_duplicate I, [2024-05-22T11:23:53.515778 #4157262] INFO -- : [391/885] 4744=test_gem_commands_help_command I, [2024-05-22T11:23:53.551517 #4157262] INFO -- : [392/885] 4741=test_rdoc_markup I, [2024-05-22T11:23:53.558836 #4157262] INFO -- : [393/885] 4741=test_prettyprint I, [2024-05-22T11:23:53.565147 #4157262] INFO -- : [394/885] 4738=test_tracepoint I, [2024-05-22T11:23:53.577632 #4157262] INFO -- : [395/885] 4741=test_internal_ivar I, [2024-05-22T11:23:53.587346 #4157262] INFO -- : [396/885] 4741=test_gem_resolver_index_specification I, [2024-05-22T11:23:53.599536 #4157262] INFO -- : [397/885] 4735=test_marshalable I, [2024-05-22T11:23:53.612340 #4157262] INFO -- : [398/885] 4735=test_digest I, [2024-05-22T11:23:53.639763 #4157262] INFO -- : [399/885] 4741=test_gem_ext_cmake_builder I, [2024-05-22T11:23:53.653752 #4157262] INFO -- : [400/885] 4741=test_gem_commands_contents_command I, [2024-05-22T11:23:53.671986 #4157262] INFO -- : [401/885] 4728=test_cgi_util I, [2024-05-22T11:23:53.706400 #4157262] INFO -- : [402/885] 4744=test_require I, [2024-05-22T11:23:53.730226 #4157262] INFO -- : [403/885] 4741=test_fiddle I, [2024-05-22T11:23:53.781203 #4157262] INFO -- : [404/885] 4729=test_wss I, [2024-05-22T11:23:53.791224 #4157262] INFO -- : [405/885] 4729=test_ractor I, [2024-05-22T11:23:53.794072 #4157262] INFO -- : [406/885] 4741=test_find I, [2024-05-22T11:23:53.800317 #4157262] INFO -- : [407/885] 4740=test_rdoc_encoding I, [2024-05-22T11:23:53.803884 #4157262] INFO -- : [408/885] 4741=test_coverage I, [2024-05-22T11:23:53.823106 #4157262] INFO -- : [409/885] 4738=test_gem_package_tar_reader I, [2024-05-22T11:23:53.845608 #4157262] INFO -- : [410/885] 4740=regexp_test I, [2024-05-22T11:23:53.872984 #4157262] INFO -- : [411/885] 4738=test_complexrational I, [2024-05-22T11:23:53.881681 #4157262] INFO -- : [412/885] 4738=test_init I, [2024-05-22T11:23:53.887449 #4157262] INFO -- : [413/885] 4729=test_pathname I, [2024-05-22T11:23:53.898746 #4157262] INFO -- : [414/885] 4728=test_gem_available_set I, [2024-05-22T11:23:53.944077 #4157262] INFO -- : [415/885] 4740=test_rdoc_markdown I, [2024-05-22T11:23:54.004413 #4157262] INFO -- : [416/885] 4728=test_modify_expand I, [2024-05-22T11:23:54.009112 #4157262] INFO -- : [417/885] 4728=test_rdoc_any_method I, [2024-05-22T11:23:54.043042 #4157262] INFO -- : [418/885] 4727=test_file I, [2024-05-22T11:23:54.063921 #4157262] INFO -- : [419/885] 4732=test_rdoc_constant I, [2024-05-22T11:23:54.067933 #4157262] INFO -- : [420/885] 4727=test_deprecate I, [2024-05-22T11:23:54.085421 #4157262] INFO -- : [421/885] 4727=test_bash_completion I, [2024-05-22T11:23:54.095791 #4157262] INFO -- : [422/885] 4727=test_formatter I, [2024-05-22T11:23:54.102438 #4157262] INFO -- : [423/885] 4727=test_gem_commands_owner_command I, [2024-05-22T11:23:54.132356 #4157262] INFO -- : [424/885] 4729=test_gem_source_vendor I, [2024-05-22T11:23:54.144991 #4157262] INFO -- : [425/885] 4729=test_recorder I, [2024-05-22T11:23:54.147169 #4157262] INFO -- : [426/885] 4740=test_big2str I, [2024-05-22T11:23:54.148693 #4157262] INFO -- : [427/885] 4729=test_yaml I, [2024-05-22T11:23:54.149881 #4157262] INFO -- : [428/885] 4740=test_forwardable I, [2024-05-22T11:23:54.160327 #4157262] INFO -- : [429/885] 4732=test_handle I, [2024-05-22T11:23:54.164352 #4157262] INFO -- : [430/885] 4740=test_wait I, [2024-05-22T11:23:54.172137 #4157262] INFO -- : [431/885] 4739=test_nowrite I, [2024-05-22T11:23:54.192724 #4157262] INFO -- : [432/885] 4739=test_thread_queue I, [2024-05-22T11:23:54.213813 #4157262] INFO -- : [433/885] 4738=test_rdoc_markup_formatter I, [2024-05-22T11:23:54.214478 #4157262] INFO -- : [434/885] 4740=test_bmethod I, [2024-05-22T11:23:54.225718 #4157262] INFO -- : [435/885] 4738=test_euc_tw I, [2024-05-22T11:23:54.226545 #4157262] INFO -- : [436/885] 4740=test_ractor I, [2024-05-22T11:23:54.230139 #4157262] INFO -- : [437/885] 4738=test_gem_commands_sources_command I, [2024-05-22T11:23:54.246738 #4157262] INFO -- : [438/885] 4740=test_ansi_without_terminfo I, [2024-05-22T11:23:54.255839 #4157262] INFO -- : [439/885] 4740=test_io_timeout I, [2024-05-22T11:23:54.259816 #4157262] INFO -- : [440/885] 4740=json_fixtures_test I, [2024-05-22T11:23:54.271224 #4157262] INFO -- : [441/885] 4740=test_shapes I, [2024-05-22T11:23:54.275222 #4157262] INFO -- : [442/885] 4740=test_comparable I, [2024-05-22T11:23:54.277751 #4157262] INFO -- : [443/885] 4729=test_rdoc_parser_c I, [2024-05-22T11:23:54.281385 #4157262] INFO -- : [444/885] 4740=test_gbk I, [2024-05-22T11:23:54.286065 #4157262] INFO -- : [445/885] 4740=test_class2name I, [2024-05-22T11:23:54.293192 #4157262] INFO -- : [446/885] 4740=test_enc_str_buf_cat I, [2024-05-22T11:23:54.297651 #4157262] INFO -- : [447/885] 4740=test_cstr I, [2024-05-22T11:23:54.388689 #4157262] INFO -- : [448/885] 4738=test_pstore I, [2024-05-22T11:23:54.400918 #4157262] INFO -- : [449/885] 4732=test_profile_frames I, [2024-05-22T11:23:54.435716 #4157262] INFO -- : [450/885] 4738=test_config I, [2024-05-22T11:23:54.481015 #4157262] INFO -- : [451/885] 4738=memsize_test I, [2024-05-22T11:23:54.492221 #4157262] INFO -- : [452/885] 4735=test_nomethod_error I, [2024-05-22T11:23:54.499660 #4157262] INFO -- : [453/885] 4735=json_parser_test I, [2024-05-22T11:23:54.552698 #4157262] INFO -- : [454/885] 4735=json_common_interface_test I, [2024-05-22T11:23:54.553829 #4157262] INFO -- : [455/885] 4738=test_dln I, [2024-05-22T11:23:54.555168 #4157262] INFO -- : [456/885] 4738=test_gem_source_subpath_problem I, [2024-05-22T11:23:54.555419 #4157262] INFO -- : [457/885] 4732=test_win32ole_variant_outarg I, [2024-05-22T11:23:54.558754 #4157262] INFO -- : [458/885] 4735=test_variable I, [2024-05-22T11:23:54.561267 #4157262] INFO -- : [459/885] 4732=test_rdoc_markup_include I, [2024-05-22T11:23:54.564577 #4157262] INFO -- : [460/885] 4732=test_sexp I, [2024-05-22T11:23:54.583324 #4157262] INFO -- : [461/885] 4729=fuzzer_test I, [2024-05-22T11:23:54.584579 #4157262] INFO -- : [462/885] 4732=magic_comment_test I, [2024-05-22T11:23:54.588369 #4157262] INFO -- : [463/885] 4729=test_rdoc_markup_to_html_snippet I, [2024-05-22T11:23:54.591255 #4157262] INFO -- : [464/885] 4732=test_struct I, [2024-05-22T11:23:54.596455 #4157262] INFO -- : [465/885] 4732=test_cparser I, [2024-05-22T11:23:54.635966 #4157262] INFO -- : [466/885] 4735=test_pkg_config I, [2024-05-22T11:23:54.645420 #4157262] INFO -- : [467/885] 4741=test_deprecated I, [2024-05-22T11:23:54.652787 #4157262] INFO -- : [468/885] 4738=test_color_printer I, [2024-05-22T11:23:54.653437 #4157262] INFO -- : [469/885] 4741=test_serialize_subclasses I, [2024-05-22T11:23:54.653795 #4157262] INFO -- : [470/885] 4727=test_insns_leaf I, [2024-05-22T11:23:54.657188 #4157262] INFO -- : [471/885] 4741=test_key_error I, [2024-05-22T11:23:54.657604 #4157262] INFO -- : [472/885] 4738=test_allocation I, [2024-05-22T11:23:54.657639 #4157262] INFO -- : [473/885] 4729=test_div I, [2024-05-22T11:23:54.660433 #4157262] INFO -- : [474/885] 4727=test_win32ole_variant_m I, [2024-05-22T11:23:54.663748 #4157262] INFO -- : [475/885] 4741=test_engine I, [2024-05-22T11:23:54.664274 #4157262] INFO -- : [476/885] 4727=test_rdoc_rd_inline I, [2024-05-22T11:23:54.664798 #4157262] INFO -- : [477/885] 4729=test_mutex I, [2024-05-22T11:23:54.670370 #4157262] INFO -- : [478/885] 4727=test_x509req I, [2024-05-22T11:23:54.671866 #4157262] INFO -- : [479/885] 4741=test_gem_path_support I, [2024-05-22T11:23:54.680671 #4157262] INFO -- : [480/885] 4735=test_struct I, [2024-05-22T11:23:54.696218 #4157262] INFO -- : [481/885] 4741=test_set I, [2024-05-22T11:23:54.716940 #4157262] INFO -- : [482/885] 4741=test_files_test_1 I, [2024-05-22T11:23:54.780691 #4157262] INFO -- : [483/885] 4728=test_gem_resolver_installer_set I, [2024-05-22T11:23:54.852787 #4157262] INFO -- : [484/885] 4727=test_dir_m17n I, [2024-05-22T11:23:54.943776 #4157262] INFO -- : [485/885] 4725=test_gem_source_git I, [2024-05-22T11:23:54.973592 #4157262] INFO -- : [486/885] 4736=test_refinement I, [2024-05-22T11:23:55.029000 #4157262] INFO -- : [487/885] 4728=test_gem_commands_signout_command I, [2024-05-22T11:23:55.038690 #4157262] INFO -- : [488/885] 4744=test_regex_casefold I, [2024-05-22T11:23:55.043821 #4157262] INFO -- : [489/885] 4742=test_cgi_cookie I, [2024-05-22T11:23:55.049715 #4157262] INFO -- : [490/885] 4728=test_require I, [2024-05-22T11:23:55.053119 #4157262] INFO -- : [491/885] 4742=test_float I, [2024-05-22T11:23:55.082408 #4157262] INFO -- : [492/885] 4735=test_input_method I, [2024-05-22T11:23:55.120757 #4157262] INFO -- : [493/885] 4740=test_windows_1252 I, [2024-05-22T11:23:55.122422 #4157262] INFO -- : [494/885] 4732=test_process I, [2024-05-22T11:23:55.128629 #4157262] INFO -- : [495/885] 4740=test_x509crl I, [2024-05-22T11:23:55.148887 #4157262] INFO -- : [496/885] 4732=test_fixnum I, [2024-05-22T11:23:55.150099 #4157262] INFO -- : [497/885] 4731=test_signal I, [2024-05-22T11:23:55.161277 #4157262] INFO -- : [498/885] 4732=test_metaclass I, [2024-05-22T11:23:55.165549 #4157262] INFO -- : [499/885] 4732=test_rdoc_top_level I, [2024-05-22T11:23:55.180477 #4157262] INFO -- : [500/885] 4733=test_rdoc_rd I, [2024-05-22T11:23:55.185224 #4157262] INFO -- : [501/885] 4733=test_cgi_session I, [2024-05-22T11:23:55.197956 #4157262] INFO -- : [502/885] 4735=test_shellwords I, [2024-05-22T11:23:55.199774 #4157262] INFO -- : [503/885] 4735=test_memory_view I, [2024-05-22T11:23:55.210740 #4157262] INFO -- : [504/885] 4733=pattern_test I, [2024-05-22T11:23:55.219131 #4157262] INFO -- : [505/885] 4735=test_debug I, [2024-05-22T11:23:55.226341 #4157262] INFO -- : [506/885] 4735=test_omap I, [2024-05-22T11:23:55.232214 #4157262] INFO -- : [507/885] 4735=test_iterator I, [2024-05-22T11:23:55.285551 #4157262] INFO -- : [508/885] 4740=test_string I, [2024-05-22T11:23:55.287170 #4157262] INFO -- : [509/885] 4740=test_digest_extend I, [2024-05-22T11:23:55.296614 #4157262] INFO -- : [510/885] 4740=test_storage I, [2024-05-22T11:23:55.301911 #4157262] INFO -- : [511/885] 4740=test_gem_resolver_git_set I, [2024-05-22T11:23:55.321441 #4157262] INFO -- : [512/885] 4733=test_gem_security_signer I, [2024-05-22T11:23:55.347512 #4157262] INFO -- : [513/885] 4735=test_cipher I, [2024-05-22T11:23:55.392556 #4157262] INFO -- : [514/885] 4735=test_new I, [2024-05-22T11:23:55.392698 #4157262] INFO -- : [515/885] 4735=test_helper_method I, [2024-05-22T11:23:55.402581 #4157262] INFO -- : [516/885] 4735=test_gem_package_tar_writer I, [2024-05-22T11:23:55.422869 #4157262] INFO -- : [517/885] 4733=test_array I, [2024-05-22T11:23:55.479443 #4157262] INFO -- : [518/885] 4725=test_gem_commands_outdated_command I, [2024-05-22T11:23:55.486129 #4157262] INFO -- : [519/885] 4735=test_scalar_scanner I, [2024-05-22T11:23:55.496429 #4157262] INFO -- : [520/885] 4735=test_gem_source I, [2024-05-22T11:23:55.499261 #4157262] INFO -- : [521/885] 4732=test_nesting_parser I, [2024-05-22T11:23:55.527429 #4157262] INFO -- : [522/885] 4725=test_win32ole_method_event I, [2024-05-22T11:23:55.532605 #4157262] INFO -- : [523/885] 4725=test_benchmark I, [2024-05-22T11:23:55.606693 #4157262] INFO -- : [524/885] 4740=test_gem_dependency_list I, [2024-05-22T11:23:55.625025 #4157262] INFO -- : [525/885] 4732=test_evaluation I, [2024-05-22T11:23:55.633324 #4157262] INFO -- : [526/885] 4732=test_gem_ext_builder I, [2024-05-22T11:23:55.637132 #4157262] INFO -- : [527/885] 4744=test_https I, [2024-05-22T11:23:55.645171 #4157262] INFO -- : [528/885] 4740=test_yamldbm I, [2024-05-22T11:23:55.657438 #4157262] INFO -- : [529/885] 4740=test_gem_commands_rebuild_command I, [2024-05-22T11:23:55.667084 #4157262] INFO -- : [530/885] 4735=test_load I, [2024-05-22T11:23:55.671207 #4157262] INFO -- : [531/885] 4735=test_rdoc_parser_simple I, [2024-05-22T11:23:55.693252 #4157262] INFO -- : [532/885] 4735=test_provider I, [2024-05-22T11:23:55.709859 #4157262] INFO -- : [533/885] 4740=test_abi I, [2024-05-22T11:23:55.808662 #4157262] INFO -- : [534/885] 4729=test_completion I, [2024-05-22T11:23:55.930647 #4157262] INFO -- : [535/885] 4740=test_gem_commands_cert_command I, [2024-05-22T11:23:55.954660 #4157262] INFO -- : [536/885] 4735=test_yield_block I, [2024-05-22T11:23:55.956281 #4157262] INFO -- : [537/885] 4735=test_len I, [2024-05-22T11:23:55.961246 #4157262] INFO -- : [538/885] 4735=test_gem_source_installed I, [2024-05-22T11:23:55.979021 #4157262] INFO -- : [539/885] 4735=test_erb I, [2024-05-22T11:23:56.038280 #4157262] INFO -- : [540/885] 4735=test_x509ext I, [2024-05-22T11:23:56.045517 #4157262] INFO -- : [541/885] 4744=test_spell_checker I, [2024-05-22T11:23:56.050477 #4157262] INFO -- : [542/885] 4735=test_propertyputref I, [2024-05-22T11:23:56.052306 #4157262] INFO -- : [543/885] 4735=attribute_write_test I, [2024-05-22T11:23:56.055600 #4157262] INFO -- : [544/885] 4735=test_assembler I, [2024-05-22T11:23:56.058417 #4157262] INFO -- : [545/885] 4744=test_rational2 I, [2024-05-22T11:23:56.059614 #4157262] INFO -- : [546/885] 4735=test_rational I, [2024-05-22T11:23:56.077073 #4157262] INFO -- : [547/885] 4744=test_gem_request_set I, [2024-05-22T11:23:56.082603 #4157262] INFO -- : [548/885] 4735=test_module I, [2024-05-22T11:23:56.160701 #4157262] INFO -- : [549/885] 4727=test_ssl I, [2024-05-22T11:23:56.214458 #4157262] INFO -- : [550/885] 4729=test_gem_ext_cargo_builder I, [2024-05-22T11:23:56.235507 #4157262] INFO -- : [551/885] 4743=constant_path_node_test I, [2024-05-22T11:23:56.237682 #4157262] INFO -- : [552/885] 4729=test_parser I, [2024-05-22T11:23:56.239788 #4157262] INFO -- : [553/885] 4743=test_method_name_check I, [2024-05-22T11:23:56.261259 #4157262] INFO -- : [554/885] 4729=test_arith_seq_extract I, [2024-05-22T11:23:56.264261 #4157262] INFO -- : [555/885] 4743=test_rdoc_generator_markup I, [2024-05-22T11:23:56.279294 #4157262] INFO -- : [556/885] 4743=test_whileuntil I, [2024-05-22T11:23:56.288056 #4157262] INFO -- : [557/885] 4743=test_monitor I, [2024-05-22T11:23:56.396618 #4157262] INFO -- : [558/885] 4744=test_buffered_io I, [2024-05-22T11:23:56.398016 #4157262] INFO -- : [559/885] 4744=test_rubyvm I, [2024-05-22T11:23:56.401864 #4157262] INFO -- : [560/885] 4744=test_configuration I, [2024-05-22T11:23:56.466368 #4157262] INFO -- : [561/885] 4742=integer_parse_test I, [2024-05-22T11:23:56.471173 #4157262] INFO -- : [562/885] 4742=test_instrumentation_api I, [2024-05-22T11:23:56.477654 #4157262] INFO -- : [563/885] 4729=test_stringify_symbols I, [2024-05-22T11:23:56.486584 #4157262] INFO -- : [564/885] 4729=test_boolean I, [2024-05-22T11:23:56.490808 #4157262] INFO -- : [565/885] 4729=test_compile_prism I, [2024-05-22T11:23:56.492875 #4157262] INFO -- : [566/885] 4743=test_terminfo I, [2024-05-22T11:23:56.494052 #4157262] INFO -- : [567/885] 4743=test_bug-14834 I, [2024-05-22T11:23:56.498977 #4157262] INFO -- : [568/885] 4732=test_rdoc_markup_to_html I, [2024-05-22T11:23:56.511324 #4157262] INFO -- : [569/885] 4744=test_date_compat I, [2024-05-22T11:23:56.513083 #4157262] INFO -- : [570/885] 4744=test_tree_spell_checker I, [2024-05-22T11:23:56.540098 #4157262] INFO -- : [571/885] 4744=test_http I, [2024-05-22T11:23:56.576619 #4157262] INFO -- : [572/885] 4732=test_addrinfo I, [2024-05-22T11:23:56.578079 #4157262] INFO -- : [573/885] 4743=test_win32ole_param_event I, [2024-05-22T11:23:56.585750 #4157262] INFO -- : [574/885] 4743=test_bn I, [2024-05-22T11:23:56.601753 #4157262] INFO -- : [575/885] 4743=test_case_mapping I, [2024-05-22T11:23:56.610950 #4157262] INFO -- : [576/885] 4743=redundant_return_test I, [2024-05-22T11:23:56.620644 #4157262] INFO -- : [577/885] 4743=test_path I, [2024-05-22T11:23:56.626805 #4157262] INFO -- : [578/885] 4743=test_rdoc_generator_pot I, [2024-05-22T11:23:56.637357 #4157262] INFO -- : [579/885] 4743=test_unicode I, [2024-05-22T11:23:56.645656 #4157262] INFO -- : [580/885] 4743=parameters_signature_test I, [2024-05-22T11:23:56.647900 #4157262] INFO -- : [581/885] 4732=test_koi8 I, [2024-05-22T11:23:56.655801 #4157262] INFO -- : [582/885] 4743=test_enumerator I, [2024-05-22T11:23:56.660854 #4157262] INFO -- : [583/885] 4732=test_rdoc_parser_changelog I, [2024-05-22T11:23:56.663097 #4157262] INFO -- : [584/885] 4743=test_rdoc_method_attr I, [2024-05-22T11:23:56.721414 #4157262] INFO -- : [585/885] 4732=test_data I, [2024-05-22T11:23:56.728323 #4157262] INFO -- : [586/885] 4732=static_literals_test I, [2024-05-22T11:23:56.730434 #4157262] INFO -- : [587/885] 4732=test_gem_gem_runner I, [2024-05-22T11:23:56.766362 #4157262] INFO -- : [588/885] 4732=test_filter I, [2024-05-22T11:23:56.769345 #4157262] INFO -- : [589/885] 4743=test_gem_commands_update_command I, [2024-05-22T11:23:56.785312 #4157262] INFO -- : [590/885] 4732=test_gem_resolver_vendor_specification I, [2024-05-22T11:23:56.791181 #4157262] INFO -- : [591/885] 4725=test_random I, [2024-05-22T11:23:56.796355 #4157262] INFO -- : [592/885] 4725=test_notimplement I, [2024-05-22T11:23:56.798945 #4157262] INFO -- : [593/885] 4725=test_key_event_record I, [2024-05-22T11:23:56.803242 #4157262] INFO -- : [594/885] 4725=test_gem_uri I, [2024-05-22T11:23:56.806769 #4157262] INFO -- : [595/885] 4732=test_lexer I, [2024-05-22T11:23:56.815510 #4157262] INFO -- : [596/885] 4732=test_thread_cv I, [2024-05-22T11:23:56.818390 #4157262] INFO -- : [597/885] 4725=test_ssl_session I, [2024-05-22T11:23:56.826583 #4157262] INFO -- : [598/885] 4729=test_rbconfig I, [2024-05-22T11:23:56.829929 #4157262] INFO -- : [599/885] 4729=test_primitive I, [2024-05-22T11:23:56.848214 #4157262] INFO -- : [600/885] 4729=test_human_typo I, [2024-05-22T11:23:56.849484 #4157262] INFO -- : [601/885] 4729=test_rdoc_i18n_locale I, [2024-05-22T11:23:56.860842 #4157262] INFO -- : [602/885] 4729=test_name_error_extension I, [2024-05-22T11:23:56.865372 #4157262] INFO -- : [603/885] 4729=test_chilled I, [2024-05-22T11:23:56.868057 #4157262] INFO -- : [604/885] 4729=test_euc_jp I, [2024-05-22T11:23:56.873463 #4157262] INFO -- : [605/885] 4729=test_rdoc_generator_pot_po_entry I, [2024-05-22T11:23:56.876321 #4157262] INFO -- : [606/885] 4729=test_acceptable I, [2024-05-22T11:23:57.010634 #4157262] INFO -- : [607/885] 4729=test_document I, [2024-05-22T11:23:57.013233 #4157262] INFO -- : [608/885] 4729=test_win32ole_param I, [2024-05-22T11:23:57.016512 #4157262] INFO -- : [609/885] 4729=test_gem_commands_yank_command I, [2024-05-22T11:23:57.210966 #4157262] INFO -- : [610/885] 4738=test_pair I, [2024-05-22T11:23:57.269803 #4157262] INFO -- : [611/885] 4731=test_sockopt I, [2024-05-22T11:23:57.277744 #4157262] INFO -- : [612/885] 4731=test_rdoc_markup_to_label I, [2024-05-22T11:23:57.300370 #4157262] INFO -- : [613/885] 4731=test_install I, [2024-05-22T11:23:57.362956 #4157262] INFO -- : [614/885] 4734=test_rdoc_ri_driver I, [2024-05-22T11:23:57.399340 #4157262] INFO -- : [615/885] 4736=test_httpheader I, [2024-05-22T11:23:57.416819 #4157262] INFO -- : [616/885] 4740=test_gem_resolver_local_specification I, [2024-05-22T11:23:57.433149 #4157262] INFO -- : [617/885] 4740=test_httpresponses I, [2024-05-22T11:23:57.445253 #4157262] INFO -- : [618/885] 4731=test_encoding I, [2024-05-22T11:23:57.449992 #4157262] INFO -- : [619/885] 4736=test_set_len I, [2024-05-22T11:23:57.450748 #4157262] INFO -- : [620/885] 4728=test_key_stroke I, [2024-05-22T11:23:57.452477 #4157262] INFO -- : [621/885] 4732=test_color I, [2024-05-22T11:23:57.454256 #4157262] INFO -- : [622/885] 4736=json_encoding_test I, [2024-05-22T11:23:57.460827 #4157262] INFO -- : [623/885] 4731=test_beginendblock I, [2024-05-22T11:23:57.464189 #4157262] INFO -- : [624/885] 4736=test_gem_commands_unpack_command I, [2024-05-22T11:23:57.466184 #4157262] INFO -- : [625/885] 4740=test_files_lib I, [2024-05-22T11:23:57.492938 #4157262] INFO -- : [626/885] 4729=test_help I, [2024-05-22T11:23:57.508628 #4157262] INFO -- : [627/885] 4729=test_rdoc_markup_to_bs I, [2024-05-22T11:23:57.513042 #4157262] INFO -- : [628/885] 4728=test_within_pipe I, [2024-05-22T11:23:57.531091 #4157262] INFO -- : [629/885] 4732=test_gem_bundler_version_finder I, [2024-05-22T11:23:57.541626 #4157262] INFO -- : [630/885] 4729=test_emoji_breaks I, [2024-05-22T11:23:57.545947 #4157262] INFO -- : [631/885] 4728=reflection_test I, [2024-05-22T11:23:57.547443 #4157262] INFO -- : [632/885] 4729=test_pinned I, [2024-05-22T11:23:57.561970 #4157262] INFO -- : [633/885] 4732=test_rdoc_markup_pre_process I, [2024-05-22T11:23:57.602006 #4157262] INFO -- : [634/885] 4729=test_printf I, [2024-05-22T11:23:57.616502 #4157262] INFO -- : [635/885] 4729=test_stream I, [2024-05-22T11:23:57.624380 #4157262] INFO -- : [636/885] 4729=test_webauthn_listener_response I, [2024-05-22T11:23:57.635914 #4157262] INFO -- : [637/885] 4732=test_time I, [2024-05-22T11:23:57.641043 #4157262] INFO -- : [638/885] 4729=test_to_ary_concat I, [2024-05-22T11:23:57.653893 #4157262] INFO -- : [639/885] 4728=test_recursion I, [2024-05-22T11:23:57.659444 #4157262] INFO -- : [640/885] 4728=test_exit I, [2024-05-22T11:23:57.706093 #4157262] INFO -- : [641/885] 4734=test_popen_deadlock I, [2024-05-22T11:23:57.745252 #4157262] INFO -- : [642/885] 4736=test_delegate I, [2024-05-22T11:23:57.750839 #4157262] INFO -- : [643/885] 4743=test_date_marshal I, [2024-05-22T11:23:57.754236 #4157262] INFO -- : [644/885] 4736=test_mkmf I, [2024-05-22T11:23:57.756864 #4157262] INFO -- : [645/885] 4743=test_history I, [2024-05-22T11:23:57.767449 #4157262] INFO -- : [646/885] 4728=test_open3 I, [2024-05-22T11:23:57.776161 #4157262] INFO -- : [647/885] 4732=test_fiber I, [2024-05-22T11:23:57.788729 #4157262] INFO -- : [648/885] 4736=test_multi_irb_commands I, [2024-05-22T11:23:57.795616 #4157262] INFO -- : [649/885] 4736=test_closure I, [2024-05-22T11:23:57.804068 #4157262] INFO -- : [650/885] 4743=test_bundled_ca I, [2024-05-22T11:23:57.818205 #4157262] INFO -- : [651/885] 4741=test_digest I, [2024-05-22T11:23:57.826206 #4157262] INFO -- : [652/885] 4741=test_rdoc_servlet I, [2024-05-22T11:23:57.846230 #4157262] INFO -- : [653/885] 4725=test_gem_security I, [2024-05-22T11:23:57.850609 #4157262] INFO -- : [654/885] 4731=test_ractor I, [2024-05-22T11:23:57.887592 #4157262] INFO -- : [655/885] 4737=test_case_comprehensive I, [2024-05-22T11:23:57.913139 #4157262] INFO -- : [656/885] 4731=test_interned_str I, [2024-05-22T11:23:57.914732 #4157262] INFO -- : [657/885] 4731=test_gem_commands_build_command I, [2024-05-22T11:23:57.967418 #4157262] INFO -- : [658/885] 4741=test_option I, [2024-05-22T11:23:58.075317 #4157262] INFO -- : [659/885] 4736=test_append I, [2024-05-22T11:23:58.083896 #4157262] INFO -- : [660/885] 4736=test_tracer I, [2024-05-22T11:23:58.126499 #4157262] INFO -- : [661/885] 4741=test_cmethod I, [2024-05-22T11:23:58.132134 #4157262] INFO -- : [662/885] 4741=test_did_you_mean I, [2024-05-22T11:23:58.170756 #4157262] INFO -- : [663/885] 4731=test_variable_name_check I, [2024-05-22T11:23:58.183043 #4157262] INFO -- : [664/885] 4736=test_io_m17n I, [2024-05-22T11:23:58.251393 #4157262] INFO -- : [665/885] 4731=test_gem_commands_server_command I, [2024-05-22T11:23:58.257883 #4157262] INFO -- : [666/885] 4731=test_iseq I, [2024-05-22T11:23:58.288766 #4157262] INFO -- : [667/885] 4741=test_exception_at_throwing I, [2024-05-22T11:23:58.315914 #4157262] INFO -- : [668/885] 4734=test_rdoc_markup_heading I, [2024-05-22T11:23:58.325160 #4157262] INFO -- : [669/885] 4734=test_scheduler I, [2024-05-22T11:23:58.347862 #4157262] INFO -- : [670/885] 4741=test_class I, [2024-05-22T11:23:58.354950 #4157262] INFO -- : [671/885] 4741=test_ocsp I, [2024-05-22T11:23:58.462960 #4157262] INFO -- : [672/885] 4739=test_pkey_dsa I, [2024-05-22T11:23:58.473031 #4157262] INFO -- : [673/885] 4734=test_gem_safe_marshal I, [2024-05-22T11:23:58.549284 #4157262] INFO -- : [674/885] 4735=test_gem_resolver_api_set I, [2024-05-22T11:23:58.626639 #4157262] INFO -- : [675/885] 4735=test_gem_resolver_vendor_set I, [2024-05-22T11:23:58.655305 #4157262] INFO -- : [676/885] 4741=test_config I, [2024-05-22T11:23:58.680115 #4157262] INFO -- : [677/885] 4735=test_enumerable I, [2024-05-22T11:23:58.685029 #4157262] INFO -- : [678/885] 4735=test_eval I, [2024-05-22T11:23:58.838118 #4157262] INFO -- : [679/885] 4731=json_generator_test I, [2024-05-22T11:23:58.883223 #4157262] INFO -- : [680/885] 4743=test_transcode I, [2024-05-22T11:23:58.937315 #4157262] INFO -- : [681/885] 4731=test_x509name I, [2024-05-22T11:23:58.940854 #4157262] INFO -- : [682/885] 4735=test_fips I, [2024-05-22T11:23:58.946885 #4157262] INFO -- : [683/885] 4731=test_update I, [2024-05-22T11:23:58.953921 #4157262] INFO -- : [684/885] 4731=test_rdoc_code_object I, [2024-05-22T11:23:59.078006 #4157262] INFO -- : [685/885] 4743=test_x509store I, [2024-05-22T11:23:59.101113 #4157262] INFO -- : [686/885] 4734=test_webauthn_listener I, [2024-05-22T11:23:59.145080 #4157262] INFO -- : [687/885] 4734=test_gem_request_set_gem_dependency_api I, [2024-05-22T11:23:59.169596 #4157262] INFO -- : [688/885] 4735=test_ast I, [2024-05-22T11:23:59.212924 #4157262] INFO -- : [689/885] 4741=test_lambda I, [2024-05-22T11:23:59.234488 #4157262] INFO -- : [690/885] 4729=test_jaro_winkler I, [2024-05-22T11:23:59.238846 #4157262] INFO -- : [691/885] 4729=test_helper I, [2024-05-22T11:23:59.240804 #4157262] INFO -- : [692/885] 4729=test_random_formatter I, [2024-05-22T11:23:59.259599 #4157262] INFO -- : [693/885] 4729=test_vm_dump I, [2024-05-22T11:23:59.260756 #4157262] INFO -- : [694/885] 4729=test_rdoc_markup_document I, [2024-05-22T11:23:59.270675 #4157262] INFO -- : [695/885] 4741=test_integer_comb I, [2024-05-22T11:23:59.271222 #4157262] INFO -- : [696/885] 4729=test_tmpdir I, [2024-05-22T11:23:59.299106 #4157262] INFO -- : [697/885] 4743=test_gem_commands_check_command I, [2024-05-22T11:23:59.301456 #4157262] INFO -- : [698/885] 4731=test_regexp I, [2024-05-22T11:23:59.316684 #4157262] INFO -- : [699/885] 4743=errors_test I, [2024-05-22T11:23:59.326388 #4157262] INFO -- : [700/885] 4734=static_inspect_test I, [2024-05-22T11:23:59.328692 #4157262] INFO -- : [701/885] 4734=test_file I, [2024-05-22T11:23:59.356121 #4157262] INFO -- : [702/885] 4729=test_force_exit I, [2024-05-22T11:23:59.361639 #4157262] INFO -- : [703/885] 4729=unescape_test I, [2024-05-22T11:23:59.389141 #4157262] INFO -- : [704/885] 4743=test_ostruct I, [2024-05-22T11:23:59.456906 #4157262] INFO -- : [705/885] 4742=bom_test I, [2024-05-22T11:23:59.470988 #4157262] INFO -- : [706/885] 4742=test_data_error I, [2024-05-22T11:23:59.536124 #4157262] INFO -- : [707/885] 4743=test_udp I, [2024-05-22T11:23:59.539162 #4157262] INFO -- : [708/885] 4743=command_line_test I, [2024-05-22T11:23:59.541122 #4157262] INFO -- : [709/885] 4743=test_constant I, [2024-05-22T11:23:59.541858 #4157262] INFO -- : [710/885] 4736=test_pty I, [2024-05-22T11:23:59.544699 #4157262] INFO -- : [711/885] 4739=test_dup I, [2024-05-22T11:23:59.553321 #4157262] INFO -- : [712/885] 4742=test_project_sanity I, [2024-05-22T11:23:59.595110 #4157262] INFO -- : [713/885] 4742=test_range I, [2024-05-22T11:23:59.692224 #4157262] INFO -- : [714/885] 4739=test_gem_uri_formatter I, [2024-05-22T11:23:59.701738 #4157262] INFO -- : [715/885] 4739=test_encoding I, [2024-05-22T11:23:59.812079 #4157262] INFO -- : [716/885] 4733=test_helper I, [2024-05-22T11:23:59.820274 #4157262] INFO -- : [717/885] 4733=test_erb_command I, [2024-05-22T11:23:59.854484 #4157262] INFO -- : [718/885] 4733=test_ts I, [2024-05-22T11:23:59.883010 #4157262] INFO -- : [719/885] 4739=test_locale I, [2024-05-22T11:23:59.995283 #4157262] INFO -- : [720/885] 4736=test_addr I, [2024-05-22T11:24:00.006017 #4157262] INFO -- : [721/885] 4736=library_symbols_test I, [2024-05-22T11:24:00.010679 #4157262] INFO -- : [722/885] 4736=test_ensured I, [2024-05-22T11:24:00.048353 #4157262] INFO -- : [723/885] 4739=test_rdoc_ri_paths I, [2024-05-22T11:24:00.052737 #4157262] INFO -- : [724/885] 4736=version_test I, [2024-05-22T11:24:00.054702 #4157262] INFO -- : [725/885] 4736=heredoc_dedent_test I, [2024-05-22T11:24:00.065908 #4157262] INFO -- : [726/885] 4736=test_cgi_header I, [2024-05-22T11:24:00.070540 #4157262] INFO -- : [727/885] 4739=test_object I, [2024-05-22T11:24:00.072760 #4157262] INFO -- : [728/885] 4736=test_arithmetic_sequence I, [2024-05-22T11:24:00.076548 #4157262] INFO -- : [729/885] 4739=test_key_actor_emacs I, [2024-05-22T11:24:00.087065 #4157262] INFO -- : [730/885] 4736=test_gem_command_manager I, [2024-05-22T11:24:00.199267 #4157262] INFO -- : [731/885] 4742=test_gem_gemcutter_utilities I, [2024-05-22T11:24:00.215565 #4157262] INFO -- : [732/885] 4736=test_basicinstructions I, [2024-05-22T11:24:00.217237 #4157262] INFO -- : [733/885] 4728=test_gem_local_remote_options I, [2024-05-22T11:24:00.224616 #4157262] INFO -- : [734/885] 4739=test_ruby_lex I, [2024-05-22T11:24:00.262145 #4157262] INFO -- : [735/885] 4740=test_object I, [2024-05-22T11:24:00.264570 #4157262] INFO -- : [736/885] 4733=test_date_arith I, [2024-05-22T11:24:00.268880 #4157262] INFO -- : [737/885] 4733=test_sleep I, [2024-05-22T11:24:00.278260 #4157262] INFO -- : [738/885] 4728=compiler_test I, [2024-05-22T11:24:00.281153 #4157262] INFO -- : [739/885] 4728=test_flip I, [2024-05-22T11:24:00.290838 #4157262] INFO -- : [740/885] 4736=test_change_word I, [2024-05-22T11:24:00.299720 #4157262] INFO -- : [741/885] 4736=test_ossl I, [2024-05-22T11:24:00.301315 #4157262] INFO -- : [742/885] 4728=test_normalize I, [2024-05-22T11:24:00.303760 #4157262] INFO -- : [743/885] 4728=test_timeout I, [2024-05-22T11:24:00.312598 #4157262] INFO -- : [744/885] 4728=test_rdoc_rd_block_parser I, [2024-05-22T11:24:00.345467 #4157262] INFO -- : [745/885] 4728=test_tsort I, [2024-05-22T11:24:00.358331 #4157262] INFO -- : [746/885] 4728=test_signedness I, [2024-05-22T11:24:00.372160 #4157262] INFO -- : [747/885] 4739=test_type I, [2024-05-22T11:24:00.384321 #4157262] INFO -- : [748/885] 4739=test_ractor I, [2024-05-22T11:24:00.418458 #4157262] INFO -- : [749/885] 4729=test_pointer I, [2024-05-22T11:24:00.471605 #4157262] INFO -- : [750/885] 4739=test_func I, [2024-05-22T11:24:00.538211 #4157262] INFO -- : [751/885] 4742=test_big5 I, [2024-05-22T11:24:00.542062 #4157262] INFO -- : [752/885] 4742=test_rdoc_markup_hard_break I, [2024-05-22T11:24:00.543311 #4157262] INFO -- : [753/885] 4742=test_placearg I, [2024-05-22T11:24:00.604769 #4157262] INFO -- : [754/885] 4740=test_date_strptime I, [2024-05-22T11:24:00.697986 #4157262] INFO -- : [755/885] 4742=test_gem_package_task I, [2024-05-22T11:24:00.709689 #4157262] INFO -- : [756/885] 4742=test_gem_platform I, [2024-05-22T11:24:00.752977 #4157262] INFO -- : [757/885] 4738=test_pkey_rsa I, [2024-05-22T11:24:00.756501 #4157262] INFO -- : [758/885] 4740=test_numhash I, [2024-05-22T11:24:00.759458 #4157262] INFO -- : [759/885] 4740=test_weakkeymap I, [2024-05-22T11:24:00.791566 #4157262] INFO -- : [760/885] 4742=test_gem_commands_push_command I, [2024-05-22T11:24:00.844478 #4157262] INFO -- : [761/885] 4729=test_continuation I, [2024-05-22T11:24:00.850240 #4157262] INFO -- : [762/885] 4729=test_fd_setsize I, [2024-05-22T11:24:00.852688 #4157262] INFO -- : [763/885] 4729=test_class_name_check I, [2024-05-22T11:24:00.865899 #4157262] INFO -- : [764/885] 4729=test_keyword I, [2024-05-22T11:24:00.948787 #4157262] INFO -- : [765/885] 4738=test_delete I, [2024-05-22T11:24:00.948992 #4157262] INFO -- : [766/885] 4738=test_win32ole_method I, [2024-05-22T11:24:00.957346 #4157262] INFO -- : [767/885] 4738=test_logger I, [2024-05-22T11:24:00.968380 #4157262] INFO -- : [768/885] 4738=test_gem_update_suggestion I, [2024-05-22T11:24:01.003407 #4157262] INFO -- : [769/885] 4738=test_files_test I, [2024-05-22T11:24:01.016939 #4157262] INFO -- : [770/885] 4738=test_file_exhaustive I, [2024-05-22T11:24:01.124805 #4157262] INFO -- : [771/885] 4740=test_rdoc_parser_markdown I, [2024-05-22T11:24:01.130663 #4157262] INFO -- : [772/885] 4740=test_import I, [2024-05-22T11:24:01.343617 #4157262] INFO -- : [773/885] 4742=test_not I, [2024-05-22T11:24:01.348551 #4157262] INFO -- : [774/885] 4742=test_gem_resolver_lock_set I, [2024-05-22T11:24:01.384934 #4157262] INFO -- : [775/885] 4742=test_autoconf I, [2024-05-22T11:24:01.388225 #4157262] INFO -- : [776/885] 4742=test_eval I, [2024-05-22T11:24:01.391251 #4157262] INFO -- : [777/885] 4742=test_dir I, [2024-05-22T11:24:01.444278 #4157262] INFO -- : [778/885] 4729=format_errors_test I, [2024-05-22T11:24:01.448305 #4157262] INFO -- : [779/885] 4729=test_date_ractor I, [2024-05-22T11:24:01.655760 #4157262] INFO -- : [780/885] 4729=test_gem_console_ui I, [2024-05-22T11:24:01.665432 #4157262] INFO -- : [781/885] 4729=test_ractor_compatibility I, [2024-05-22T11:24:01.668307 #4157262] INFO -- : [782/885] 4739=test_member I, [2024-05-22T11:24:01.668491 #4157262] INFO -- : [783/885] 4739=test_numeric I, [2024-05-22T11:24:01.673285 #4157262] INFO -- : [784/885] 4739=test_word I, [2024-05-22T11:24:01.675007 #4157262] INFO -- : [785/885] 4742=test_gem_commands_cleanup_command I, [2024-05-22T11:24:01.675051 #4157262] INFO -- : [786/885] 4739=test_cgi_multipart I, [2024-05-22T11:24:01.783646 #4157262] INFO -- : [787/885] 4743=test_resize I, [2024-05-22T11:24:01.784518 #4157262] INFO -- : [788/885] 4743=test_error_highlight I, [2024-05-22T11:24:01.809235 #4157262] INFO -- : [789/885] 4739=test_rdoc_comment I, [2024-05-22T11:24:01.842419 #4157262] INFO -- : [790/885] 4739=test_rdoc_generator_darkfish I, [2024-05-22T11:24:01.941504 #4157262] INFO -- : [791/885] 4729=test_gem_source_fetch_problem I, [2024-05-22T11:24:01.956176 #4157262] INFO -- : [792/885] 4729=json_generic_object_test I, [2024-05-22T11:24:01.965655 #4157262] INFO -- : [793/885] 4729=test_http_request I, [2024-05-22T11:24:02.001954 #4157262] INFO -- : [794/885] 4729=test_symbol I, [2024-05-22T11:24:02.009236 #4157262] INFO -- : [795/885] 4729=location_test I, [2024-05-22T11:24:02.059870 #4157262] INFO -- : [796/885] 4729=test_coderange I, [2024-05-22T11:24:02.067728 #4157262] INFO -- : [797/885] 4729=test_mailto I, [2024-05-22T11:24:02.074327 #4157262] INFO -- : [798/885] 4729=test_pkcs7 I, [2024-05-22T11:24:02.082867 #4157262] INFO -- : [799/885] 4739=test_arith_seq_beg_len_step I, [2024-05-22T11:24:02.122105 #4157262] INFO -- : [800/885] 4739=test_gem_resolver_requirement_list I, [2024-05-22T11:24:02.125143 #4157262] INFO -- : [801/885] 4743=test_function_entry I, [2024-05-22T11:24:02.126169 #4157262] INFO -- : [802/885] 4743=test_find_executable I, [2024-05-22T11:24:02.127098 #4157262] INFO -- : [803/885] 4739=ruby_api_test I, [2024-05-22T11:24:02.128914 #4157262] INFO -- : [804/885] 4743=test_nofree I, [2024-05-22T11:24:02.135922 #4157262] INFO -- : [805/885] 4743=test_gem_commands_pristine_command I, [2024-05-22T11:24:02.261191 #4157262] INFO -- : [806/885] 4729=test_context I, [2024-05-22T11:24:02.270758 #4157262] INFO -- : [807/885] 4728=test_symbol I, [2024-05-22T11:24:02.280891 #4157262] INFO -- : [808/885] 4739=test_coder I, [2024-05-22T11:24:02.286338 #4157262] INFO -- : [809/885] 4742=test_unix I, [2024-05-22T11:24:02.290478 #4157262] INFO -- : [810/885] 4740=test_lazy_enumerator I, [2024-05-22T11:24:02.291293 #4157262] INFO -- : [811/885] 4739=test_enc_associate I, [2024-05-22T11:24:02.315655 #4157262] INFO -- : [812/885] 4742=test_gem_ci_detector I, [2024-05-22T11:24:02.336017 #4157262] INFO -- : [813/885] 4742=test_bignum I, [2024-05-22T11:24:02.355311 #4157262] INFO -- : [814/885] 4729=test_rdoc_class_module I, [2024-05-22T11:24:02.423327 #4157262] INFO -- : [815/885] 4741=test_io_wait_uncommon I, [2024-05-22T11:24:02.430322 #4157262] INFO -- : [816/885] 4741=test_arity I, [2024-05-22T11:24:02.434278 #4157262] INFO -- : [817/885] 4741=test_stringio I, [2024-05-22T11:24:02.544394 #4157262] INFO -- : [818/885] 4741=test_win32ole_variable I, [2024-05-22T11:24:02.550716 #4157262] INFO -- : [819/885] 4741=ractor_test I, [2024-05-22T11:24:02.584112 #4157262] INFO -- : [820/885] 4730=test_trace I, [2024-05-22T11:24:02.600176 #4157262] INFO -- : [821/885] 4730=test_time_tz I, [2024-05-22T11:24:02.630354 #4157262] INFO -- : [822/885] 4741=test_win32ole_event I, [2024-05-22T11:24:02.632524 #4157262] INFO -- : [823/885] 4741=test_rdoc_generator_json_index I, [2024-05-22T11:24:02.659347 #4157262] INFO -- : [824/885] 4741=test_resolve_symbol I, [2024-05-22T11:24:02.662834 #4157262] INFO -- : [825/885] 4730=test_complex2 I, [2024-05-22T11:24:02.670577 #4157262] INFO -- : [826/885] 4740=test_gem_package I, [2024-05-22T11:24:02.676200 #4157262] INFO -- : [827/885] 4730=test_have_macro I, [2024-05-22T11:24:02.688474 #4157262] INFO -- : [828/885] 4729=test_gem_specification I, [2024-05-22T11:24:02.709146 #4157262] INFO -- : [829/885] 4739=test_enum I, [2024-05-22T11:24:02.727842 #4157262] INFO -- : [830/885] 4741=test_threadgroup I, [2024-05-22T11:24:03.114269 #4157262] INFO -- : [831/885] 4730=test_rdoc_extend I, [2024-05-22T11:24:03.241262 #4157262] INFO -- : [832/885] 4730=test_merge_keys I, [2024-05-22T11:24:03.245598 #4157262] INFO -- : [833/885] 4743=test_gem_resolver_api_specification I, [2024-05-22T11:24:03.253647 #4157262] INFO -- : [834/885] 4730=test_win32ole_variant I, [2024-05-22T11:24:03.262157 #4157262] INFO -- : [835/885] 4730=test_rdoc_markup_to_ansi I, [2024-05-22T11:24:03.281676 #4157262] INFO -- : [836/885] 4730=test_history I, [2024-05-22T11:24:03.290784 #4157262] INFO -- : [837/885] 4743=test_mixed_unicode_escapes I, [2024-05-22T11:24:03.292648 #4157262] INFO -- : [838/885] 4743=test_ipaddr I, [2024-05-22T11:24:03.319421 #4157262] INFO -- : [839/885] 4743=test_cgi_core I, [2024-05-22T11:24:03.324944 #4157262] INFO -- : [840/885] 4730=test_parser I, [2024-05-22T11:24:03.336005 #4157262] INFO -- : [841/885] 4743=test_registry I, [2024-05-22T11:24:03.337578 #4157262] INFO -- : [842/885] 4730=parse_stream_test I, [2024-05-22T11:24:03.339254 #4157262] INFO -- : [843/885] 4743=test_gem I, [2024-05-22T11:24:03.374962 #4157262] INFO -- : [844/885] 4730=test_gem_source_lock I, [2024-05-22T11:24:03.376803 #4157262] INFO -- : [845/885] 4740=test_gem_commands_open_command I, [2024-05-22T11:24:03.488923 #4157262] INFO -- : [846/885] 4740=test_dns I, [2024-05-22T11:24:03.534040 #4157262] INFO -- : [847/885] 4730=test_ractor I, [2024-05-22T11:24:03.548264 #4157262] INFO -- : [848/885] 4730=test_ssl I, [2024-05-22T11:24:03.612416 #4157262] INFO -- : [849/885] 4739=test_debugger_integration I, [2024-05-22T11:24:03.617608 #4157262] INFO -- : [850/885] 4739=test_rendering I, [2024-05-22T11:24:03.634281 #4157262] INFO -- : [851/885] 4739=json_ext_parser_test I, [2024-05-22T11:24:03.659557 #4157262] INFO -- : [852/885] 4739=test_thread I, [2024-05-22T11:24:03.726404 #4157262] INFO -- : [853/885] 4732=test_my_integer I, [2024-05-22T11:24:03.729901 #4157262] INFO -- : [854/885] 4741=test_ractor I, [2024-05-22T11:24:03.730474 #4157262] INFO -- : [855/885] 4732=test_timeout I, [2024-05-22T11:24:03.954167 #4157262] INFO -- : [856/885] 4740=test_alias I, [2024-05-22T11:24:03.978562 #4157262] INFO -- : [857/885] 4730=test_weakref I, [2024-05-22T11:24:04.130736 #4157262] INFO -- : [858/885] 4740=test_nonblock I, [2024-05-22T11:24:04.146363 #4157262] INFO -- : [859/885] 4740=test_unicode_normalize I, [2024-05-22T11:24:04.147134 #4157262] INFO -- : [860/885] 4741=test_marshal I, [2024-05-22T11:24:04.176743 #4157262] INFO -- : [861/885] 4729=test_reline_key I, [2024-05-22T11:24:04.178880 #4157262] INFO -- : [862/885] 4730=test_rb_str_dup I, [2024-05-22T11:24:04.181009 #4157262] INFO -- : [863/885] 4729=test_ancdata I, [2024-05-22T11:24:04.182563 #4157262] INFO -- : [864/885] 4730=test_singleton_function I, [2024-05-22T11:24:04.183196 #4157262] INFO -- : [865/885] 4729=test_rubyoptions I, [2024-05-22T11:24:04.185025 #4157262] INFO -- : [866/885] 4730=test_super I, [2024-05-22T11:24:04.390177 #4157262] INFO -- : [867/885] 4728=test_integer I, [2024-05-22T11:24:04.424758 #4157262] INFO -- : [868/885] 4727=test_cgi_modruby I, [2024-05-22T11:24:04.437717 #4157262] INFO -- : [869/885] 4727=test_rubygems I, [2024-05-22T11:24:04.580543 #4157262] INFO -- : [870/885] 4727=test_https_proxy I, [2024-05-22T11:24:04.589769 #4157262] INFO -- : [871/885] 4727=test_call I, [2024-05-22T11:24:04.671431 #4157262] INFO -- : [872/885] 4727=test_have_func I, [2024-05-22T11:24:04.784447 #4157262] INFO -- : [873/885] 4732=test_stat I, [2024-05-22T11:24:04.785489 #4157262] INFO -- : [874/885] 4732=test_gem_request_set_lockfile_tokenizer I, [2024-05-22T11:24:04.819050 #4157262] INFO -- : [875/885] 4732=test_capacity I, [2024-05-22T11:24:04.822526 #4157262] INFO -- : [876/885] 4732=test_nextafter I, [2024-05-22T11:24:04.830480 #4157262] INFO -- : [877/885] 4741=test_usrmarshal I, [2024-05-22T11:24:04.883060 #4157262] INFO -- : [878/885] 4732=test_object_references I, [2024-05-22T11:24:04.886083 #4157262] INFO -- : [879/885] 4732=test_gem_resolver_git_specification I, [2024-05-22T11:24:04.967539 #4157262] INFO -- : [880/885] 4730=test_env I, [2024-05-22T11:24:05.058688 #4157262] INFO -- : [881/885] 4741=test_rdoc_attr I, [2024-05-22T11:24:05.067269 #4157262] INFO -- : [882/885] 4741=test_dryrun I, [2024-05-22T11:24:05.080322 #4157262] INFO -- : [883/885] 4741=desugar_compiler_test I, [2024-05-22T11:24:05.100203 #4157262] INFO -- : [884/885] 4732=test_integer I, [2024-05-22T11:24:05.157231 #4157262] INFO -- : [885/885] 4741=test_gem_commands_setup_command I, [2024-05-22T11:24:26.016468 #4157262] INFO -- : Finished tests in 40.298734s, 655.3804 tests/s, 232114.8835 assertions/s. I, [2024-05-22T11:24:26.017277 #4157262] INFO -- : 26411 tests, 9353936 assertions, 0 failures, 0 errors, 304 skips I, [2024-05-22T11:24:26.017303 #4157262] INFO -- : I, [2024-05-22T11:24:26.017310 #4157262] INFO -- : ruby -v: ruby 3.4.0dev (2024-05-22T06:59:19Z master 5613d6e95b) [x86_64-linux] I, [2024-05-22T11:24:26.019448 #4157262] INFO -- : $$$[end] "make yes-test-all TESTOPTS='--stderr-on-failure' TESTS='-j20'" exit with 0. I, [2024-05-22T11:24:26.019598 #4157262] INFO -- : $$$[beg] make yes-test-rubyspec MSPECOPT='--error-output stderr --debug -j' TESTS='-j20' I, [2024-05-22T11:24:26.108048 #4157262] INFO -- : BASERUBY = /usr/bin/ruby --disable=gems I, [2024-05-22T11:24:26.108099 #4157262] INFO -- : CC = gcc I, [2024-05-22T11:24:26.108105 #4157262] INFO -- : LD = ld I, [2024-05-22T11:24:26.108109 #4157262] INFO -- : LDSHARED = gcc -shared I, [2024-05-22T11:24:26.108113 #4157262] INFO -- : CFLAGS = -O3 -fno-fast-math -ggdb3 -Wall -Wextra -Wdeprecated-declarations -Wdiv-by-zero -Wduplicated-cond -Wimplicit-function-declaration -Wimplicit-int -Wpointer-arith -Wwrite-strings -Wold-style-definition -Wimplicit-fallthrough=0 -Wmissing-noreturn -Wno-cast-function-type -Wno-constant-logical-operand -Wno-long-long -Wno-missing-field-initializers -Wno-overlength-strings -Wno-packed-bitfield-compat -Wno-parentheses-equality -Wno-self-assign -Wno-tautological-compare -Wno-unused-parameter -Wno-unused-value -Wsuggest-attribute=format -Wsuggest-attribute=noreturn -Wunused-variable -Wmisleading-indentation -Wundef -fPIC I, [2024-05-22T11:24:26.108117 #4157262] INFO -- : XCFLAGS = -U_FORTIFY_SOURCE -D_FORTIFY_SOURCE=2 -fstack-protector-strong -fno-strict-overflow -fvisibility=hidden -fexcess-precision=standard -DRUBY_EXPORT -I. -I.ext/include/x86_64-linux -I/tmp/ruby/src/trunk/include -I/tmp/ruby/src/trunk -I/tmp/ruby/src/trunk/prism -I/tmp/ruby/src/trunk/enc/unicode/15.0.0 I, [2024-05-22T11:24:26.108121 #4157262] INFO -- : CPPFLAGS = I, [2024-05-22T11:24:26.108131 #4157262] INFO -- : DLDFLAGS = -Wl,--compress-debug-sections=zlib -Wl,-soname,libruby.so.3.4 -fstack-protector-strong I, [2024-05-22T11:24:26.108135 #4157262] INFO -- : SOLIBS = -lz -lrt -lrt -lgmp -ldl -lcrypt -lm -lpthread I, [2024-05-22T11:24:26.108139 #4157262] INFO -- : LANG = en_US.UTF-8 I, [2024-05-22T11:24:26.108143 #4157262] INFO -- : LC_ALL = I, [2024-05-22T11:24:26.108147 #4157262] INFO -- : LC_CTYPE = I, [2024-05-22T11:24:26.108150 #4157262] INFO -- : MFLAGS = I, [2024-05-22T11:24:26.108155 #4157262] INFO -- : RUSTC = no I, [2024-05-22T11:24:26.108159 #4157262] INFO -- : YJIT_RUSTC_ARGS = --crate-name=yjit --crate-type=staticlib --edition=2021 -g -C lto=thin -C opt-level=3 -C overflow-checks=on '--out-dir=/tmp/ruby/build/trunk/yjit/target/release/' /tmp/ruby/src/trunk/yjit/src/lib.rs I, [2024-05-22T11:24:26.108842 #4157262] INFO -- : gcc (Ubuntu 11.4.0-1ubuntu1~22.04) 11.4.0 I, [2024-05-22T11:24:26.108866 #4157262] INFO -- : Copyright (C) 2021 Free Software Foundation, Inc. I, [2024-05-22T11:24:26.108874 #4157262] INFO -- : This is free software; see the source for copying conditions. There is NO I, [2024-05-22T11:24:26.108879 #4157262] INFO -- : warranty; not even for MERCHANTABILITY or FITNESS FOR A PARTICULAR PURPOSE. I, [2024-05-22T11:24:26.108884 #4157262] INFO -- : I, [2024-05-22T11:24:26.110541 #4157262] INFO -- : generating enc.mk I, [2024-05-22T11:24:26.227825 #4157262] INFO -- : generating encdb.h I, [2024-05-22T11:24:26.251558 #4157262] INFO -- : encdb.h unchanged I, [2024-05-22T11:24:26.252659 #4157262] INFO -- : making enc I, [2024-05-22T11:24:26.270631 #4157262] INFO -- : make[1]: Entering directory '/tmp/ruby/build/trunk' I, [2024-05-22T11:24:26.270655 #4157262] INFO -- : make[1]: Nothing to be done for 'enc'. I, [2024-05-22T11:24:26.270664 #4157262] INFO -- : make[1]: Leaving directory '/tmp/ruby/build/trunk' I, [2024-05-22T11:24:26.271485 #4157262] INFO -- : making srcs under enc I, [2024-05-22T11:24:26.300506 #4157262] INFO -- : make[1]: Entering directory '/tmp/ruby/build/trunk' I, [2024-05-22T11:24:26.300531 #4157262] INFO -- : make[1]: Nothing to be done for 'srcs'. I, [2024-05-22T11:24:26.300540 #4157262] INFO -- : make[1]: Leaving directory '/tmp/ruby/build/trunk' I, [2024-05-22T11:24:26.301599 #4157262] INFO -- : generating transdb.h I, [2024-05-22T11:24:26.397812 #4157262] INFO -- : transdb.h unchanged I, [2024-05-22T11:24:26.399156 #4157262] INFO -- : making trans I, [2024-05-22T11:24:26.433691 #4157262] INFO -- : make[1]: Entering directory '/tmp/ruby/build/trunk' I, [2024-05-22T11:24:26.433712 #4157262] INFO -- : make[1]: Nothing to be done for 'trans'. I, [2024-05-22T11:24:26.433718 #4157262] INFO -- : make[1]: Leaving directory '/tmp/ruby/build/trunk' I, [2024-05-22T11:24:26.434377 #4157262] INFO -- : making encs I, [2024-05-22T11:24:26.472342 #4157262] INFO -- : make[1]: Entering directory '/tmp/ruby/build/trunk' I, [2024-05-22T11:24:26.472362 #4157262] INFO -- : make[1]: Nothing to be done for 'encs'. I, [2024-05-22T11:24:26.472368 #4157262] INFO -- : make[1]: Leaving directory '/tmp/ruby/build/trunk' I, [2024-05-22T11:24:26.474014 #4157262] INFO -- : generating makefiles ext/configure-ext.mk I, [2024-05-22T11:24:26.500927 #4157262] INFO -- : ext/configure-ext.mk updated I, [2024-05-22T11:24:26.503551 #4157262] INFO -- : make[1]: Entering directory '/tmp/ruby/build/trunk' I, [2024-05-22T11:24:27.895291 #4157262] INFO -- : make[1]: Leaving directory '/tmp/ruby/build/trunk' I, [2024-05-22T11:24:27.895814 #4157262] INFO -- : generating makefile exts.mk I, [2024-05-22T11:24:27.932587 #4157262] INFO -- : exts.mk unchanged I, [2024-05-22T11:24:27.937262 #4157262] INFO -- : make[1]: Entering directory '/tmp/ruby/build/trunk' I, [2024-05-22T11:24:28.260180 #4157262] INFO -- : make[2]: Entering directory '/tmp/ruby/build/trunk/ext/coverage' I, [2024-05-22T11:24:28.264894 #4157262] INFO -- : make[2]: Leaving directory '/tmp/ruby/build/trunk/ext/coverage' I, [2024-05-22T11:24:28.271358 #4157262] INFO -- : make[2]: Entering directory '/tmp/ruby/build/trunk/ext/date' I, [2024-05-22T11:24:28.276522 #4157262] INFO -- : make[2]: Leaving directory '/tmp/ruby/build/trunk/ext/date' I, [2024-05-22T11:24:28.280336 #4157262] INFO -- : make[2]: Entering directory '/tmp/ruby/build/trunk/ext/digest' I, [2024-05-22T11:24:28.289131 #4157262] INFO -- : make[2]: Leaving directory '/tmp/ruby/build/trunk/ext/digest' I, [2024-05-22T11:24:28.316130 #4157262] INFO -- : make[2]: Entering directory '/tmp/ruby/build/trunk/ext/digest/sha2' I, [2024-05-22T11:24:28.320999 #4157262] INFO -- : make[2]: Leaving directory '/tmp/ruby/build/trunk/ext/digest/sha2' I, [2024-05-22T11:24:28.342278 #4157262] INFO -- : make[2]: Entering directory '/tmp/ruby/build/trunk/ext/fiddle' I, [2024-05-22T11:24:28.352910 #4157262] INFO -- : make[2]: Leaving directory '/tmp/ruby/build/trunk/ext/fiddle' I, [2024-05-22T11:24:28.357740 #4157262] INFO -- : make[2]: Entering directory '/tmp/ruby/build/trunk/ext/io/console' I, [2024-05-22T11:24:28.361301 #4157262] INFO -- : make[2]: Leaving directory '/tmp/ruby/build/trunk/ext/io/console' I, [2024-05-22T11:24:28.374084 #4157262] INFO -- : make[2]: Entering directory '/tmp/ruby/build/trunk/ext/json' I, [2024-05-22T11:24:28.384729 #4157262] INFO -- : make[2]: Leaving directory '/tmp/ruby/build/trunk/ext/json' I, [2024-05-22T11:24:28.400040 #4157262] INFO -- : make[2]: Entering directory '/tmp/ruby/build/trunk/ext/monitor' I, [2024-05-22T11:24:28.404123 #4157262] INFO -- : make[2]: Leaving directory '/tmp/ruby/build/trunk/ext/monitor' I, [2024-05-22T11:24:28.411218 #4157262] INFO -- : make[2]: Entering directory '/tmp/ruby/build/trunk/ext/objspace' I, [2024-05-22T11:24:28.416819 #4157262] INFO -- : make[2]: Leaving directory '/tmp/ruby/build/trunk/ext/objspace' I, [2024-05-22T11:24:28.434013 #4157262] INFO -- : make[2]: Entering directory '/tmp/ruby/build/trunk/ext/openssl' I, [2024-05-22T11:24:28.449542 #4157262] INFO -- : make[2]: Leaving directory '/tmp/ruby/build/trunk/ext/openssl' I, [2024-05-22T11:24:28.453210 #4157262] INFO -- : make[2]: Entering directory '/tmp/ruby/build/trunk/ext/pathname' I, [2024-05-22T11:24:28.455838 #4157262] INFO -- : make[2]: Leaving directory '/tmp/ruby/build/trunk/ext/pathname' I, [2024-05-22T11:24:28.461275 #4157262] INFO -- : make[2]: Entering directory '/tmp/ruby/build/trunk/ext/psych' I, [2024-05-22T11:24:28.478346 #4157262] INFO -- : make[2]: Leaving directory '/tmp/ruby/build/trunk/ext/psych' I, [2024-05-22T11:24:28.481922 #4157262] INFO -- : make[2]: Entering directory '/tmp/ruby/build/trunk/ext/pty' I, [2024-05-22T11:24:28.485568 #4157262] INFO -- : make[2]: Leaving directory '/tmp/ruby/build/trunk/ext/pty' I, [2024-05-22T11:24:28.501301 #4157262] INFO -- : make[2]: Entering directory '/tmp/ruby/build/trunk/ext/ripper' I, [2024-05-22T11:24:28.507692 #4157262] INFO -- : make[2]: Leaving directory '/tmp/ruby/build/trunk/ext/ripper' I, [2024-05-22T11:24:28.509280 #4157262] INFO -- : make[2]: Entering directory '/tmp/ruby/build/trunk/ext/rubyvm' I, [2024-05-22T11:24:28.511699 #4157262] INFO -- : make[2]: Leaving directory '/tmp/ruby/build/trunk/ext/rubyvm' I, [2024-05-22T11:24:28.520592 #4157262] INFO -- : make[2]: Entering directory '/tmp/ruby/build/trunk/ext/socket' I, [2024-05-22T11:24:28.527094 #4157262] INFO -- : make[2]: Leaving directory '/tmp/ruby/build/trunk/ext/socket' I, [2024-05-22T11:24:28.541157 #4157262] INFO -- : make[2]: Entering directory '/tmp/ruby/build/trunk/.bundle/gems/bigdecimal-3.1.8/ext/bigdecimal' I, [2024-05-22T11:24:28.566124 #4157262] INFO -- : make[2]: Leaving directory '/tmp/ruby/build/trunk/.bundle/gems/bigdecimal-3.1.8/ext/bigdecimal' I, [2024-05-22T11:24:28.568246 #4157262] INFO -- : make[2]: Entering directory '/tmp/ruby/build/trunk/.bundle/gems/debug-1.9.2/ext/debug' I, [2024-05-22T11:24:28.590943 #4157262] INFO -- : make[2]: Leaving directory '/tmp/ruby/build/trunk/.bundle/gems/debug-1.9.2/ext/debug' I, [2024-05-22T11:24:28.592846 #4157262] INFO -- : make[2]: Entering directory '/tmp/ruby/build/trunk/.bundle/gems/nkf-0.2.0/ext/nkf' I, [2024-05-22T11:24:28.615025 #4157262] INFO -- : make[2]: Leaving directory '/tmp/ruby/build/trunk/.bundle/gems/nkf-0.2.0/ext/nkf' I, [2024-05-22T11:24:28.617061 #4157262] INFO -- : make[2]: Entering directory '/tmp/ruby/build/trunk/.bundle/gems/racc-1.7.3/ext/racc/cparse' I, [2024-05-22T11:24:28.638715 #4157262] INFO -- : make[2]: Leaving directory '/tmp/ruby/build/trunk/.bundle/gems/racc-1.7.3/ext/racc/cparse' I, [2024-05-22T11:24:28.640698 #4157262] INFO -- : make[2]: Entering directory '/tmp/ruby/build/trunk/.bundle/gems/racc-1.8.0/ext/racc/cparse' I, [2024-05-22T11:24:28.663315 #4157262] INFO -- : make[2]: Leaving directory '/tmp/ruby/build/trunk/.bundle/gems/racc-1.8.0/ext/racc/cparse' I, [2024-05-22T11:24:28.665625 #4157262] INFO -- : make[2]: Entering directory '/tmp/ruby/build/trunk/.bundle/gems/rbs-3.4.4/ext/rbs_extension' I, [2024-05-22T11:24:28.687913 #4157262] INFO -- : make[2]: Leaving directory '/tmp/ruby/build/trunk/.bundle/gems/rbs-3.4.4/ext/rbs_extension' I, [2024-05-22T11:24:28.689689 #4157262] INFO -- : make[2]: Entering directory '/tmp/ruby/build/trunk/.bundle/gems/syslog-0.1.2/ext/syslog' I, [2024-05-22T11:24:28.712992 #4157262] INFO -- : make[2]: Leaving directory '/tmp/ruby/build/trunk/.bundle/gems/syslog-0.1.2/ext/syslog' I, [2024-05-22T11:24:28.742508 #4157262] INFO -- : make[2]: Entering directory '/tmp/ruby/build/trunk' I, [2024-05-22T11:24:28.806357 #4157262] INFO -- : make[2]: 'ruby' is up to date. I, [2024-05-22T11:24:28.806399 #4157262] INFO -- : make[2]: Leaving directory '/tmp/ruby/build/trunk' I, [2024-05-22T11:24:28.806797 #4157262] INFO -- : make[1]: Leaving directory '/tmp/ruby/build/trunk' I, [2024-05-22T11:24:28.810587 #4157262] INFO -- : make[1]: Entering directory '/tmp/ruby/build/trunk' I, [2024-05-22T11:24:28.810611 #4157262] INFO -- : make[1]: Nothing to be done for 'note'. I, [2024-05-22T11:24:28.810617 #4157262] INFO -- : make[1]: Leaving directory '/tmp/ruby/build/trunk' E, [2024-05-22T11:24:28.868309 #4157262] ERROR -- : $ /tmp/ruby/build/trunk/miniruby -I/tmp/ruby/src/trunk/lib /tmp/ruby/src/trunk/tool/runruby.rb --archdir=/tmp/ruby/build/trunk --extout=.ext -- /tmp/ruby/src/trunk/spec/mspec/bin/mspec-run -B /tmp/ruby/src/trunk/spec/default.mspec --error-output stderr --debug -fy -o /tmp/rubytest.098kfo/1-mspec-multi-0 E, [2024-05-22T11:24:28.868539 #4157262] ERROR -- : $ /tmp/ruby/build/trunk/miniruby -I/tmp/ruby/src/trunk/lib /tmp/ruby/src/trunk/tool/runruby.rb --archdir=/tmp/ruby/build/trunk --extout=.ext -- /tmp/ruby/src/trunk/spec/mspec/bin/mspec-run -B /tmp/ruby/src/trunk/spec/default.mspec --error-output stderr --debug -fy -o /tmp/rubytest.098kfo/2-mspec-multi-1 E, [2024-05-22T11:24:28.868824 #4157262] ERROR -- : $ /tmp/ruby/build/trunk/miniruby -I/tmp/ruby/src/trunk/lib /tmp/ruby/src/trunk/tool/runruby.rb --archdir=/tmp/ruby/build/trunk --extout=.ext -- /tmp/ruby/src/trunk/spec/mspec/bin/mspec-run -B /tmp/ruby/src/trunk/spec/default.mspec --error-output stderr --debug -fy -o /tmp/rubytest.098kfo/3-mspec-multi-2 E, [2024-05-22T11:24:28.869094 #4157262] ERROR -- : $ /tmp/ruby/build/trunk/miniruby -I/tmp/ruby/src/trunk/lib /tmp/ruby/src/trunk/tool/runruby.rb --archdir=/tmp/ruby/build/trunk --extout=.ext -- /tmp/ruby/src/trunk/spec/mspec/bin/mspec-run -B /tmp/ruby/src/trunk/spec/default.mspec --error-output stderr --debug -fy -o /tmp/rubytest.098kfo/4-mspec-multi-3 E, [2024-05-22T11:24:28.869366 #4157262] ERROR -- : $ /tmp/ruby/build/trunk/miniruby -I/tmp/ruby/src/trunk/lib /tmp/ruby/src/trunk/tool/runruby.rb --archdir=/tmp/ruby/build/trunk --extout=.ext -- /tmp/ruby/src/trunk/spec/mspec/bin/mspec-run -B /tmp/ruby/src/trunk/spec/default.mspec --error-output stderr --debug -fy -o /tmp/rubytest.098kfo/5-mspec-multi-4 E, [2024-05-22T11:24:28.869489 #4157262] ERROR -- : $ /tmp/ruby/build/trunk/miniruby -I/tmp/ruby/src/trunk/lib /tmp/ruby/src/trunk/tool/runruby.rb --archdir=/tmp/ruby/build/trunk --extout=.ext -- /tmp/ruby/src/trunk/spec/mspec/bin/mspec-run -B /tmp/ruby/src/trunk/spec/default.mspec --error-output stderr --debug -fy -o /tmp/rubytest.098kfo/6-mspec-multi-5 E, [2024-05-22T11:24:28.869798 #4157262] ERROR -- : $ /tmp/ruby/build/trunk/miniruby -I/tmp/ruby/src/trunk/lib /tmp/ruby/src/trunk/tool/runruby.rb --archdir=/tmp/ruby/build/trunk --extout=.ext -- /tmp/ruby/src/trunk/spec/mspec/bin/mspec-run -B /tmp/ruby/src/trunk/spec/default.mspec --error-output stderr --debug -fy -o /tmp/rubytest.098kfo/7-mspec-multi-6 E, [2024-05-22T11:24:28.870029 #4157262] ERROR -- : $ /tmp/ruby/build/trunk/miniruby -I/tmp/ruby/src/trunk/lib /tmp/ruby/src/trunk/tool/runruby.rb --archdir=/tmp/ruby/build/trunk --extout=.ext -- /tmp/ruby/src/trunk/spec/mspec/bin/mspec-run -B /tmp/ruby/src/trunk/spec/default.mspec --error-output stderr --debug -fy -o /tmp/rubytest.098kfo/8-mspec-multi-7 E, [2024-05-22T11:24:28.870200 #4157262] ERROR -- : $ /tmp/ruby/build/trunk/miniruby -I/tmp/ruby/src/trunk/lib /tmp/ruby/src/trunk/tool/runruby.rb --archdir=/tmp/ruby/build/trunk --extout=.ext -- /tmp/ruby/src/trunk/spec/mspec/bin/mspec-run -B /tmp/ruby/src/trunk/spec/default.mspec --error-output stderr --debug -fy -o /tmp/rubytest.098kfo/9-mspec-multi-8 E, [2024-05-22T11:24:28.870367 #4157262] ERROR -- : $ /tmp/ruby/build/trunk/miniruby -I/tmp/ruby/src/trunk/lib /tmp/ruby/src/trunk/tool/runruby.rb --archdir=/tmp/ruby/build/trunk --extout=.ext -- /tmp/ruby/src/trunk/spec/mspec/bin/mspec-run -B /tmp/ruby/src/trunk/spec/default.mspec --error-output stderr --debug -fy -o /tmp/rubytest.098kfo/10-mspec-multi-9 E, [2024-05-22T11:24:28.870703 #4157262] ERROR -- : $ /tmp/ruby/build/trunk/miniruby -I/tmp/ruby/src/trunk/lib /tmp/ruby/src/trunk/tool/runruby.rb --archdir=/tmp/ruby/build/trunk --extout=.ext -- /tmp/ruby/src/trunk/spec/mspec/bin/mspec-run -B /tmp/ruby/src/trunk/spec/default.mspec --error-output stderr --debug -fy -o /tmp/rubytest.098kfo/11-mspec-multi-10 E, [2024-05-22T11:24:28.870893 #4157262] ERROR -- : $ /tmp/ruby/build/trunk/miniruby -I/tmp/ruby/src/trunk/lib /tmp/ruby/src/trunk/tool/runruby.rb --archdir=/tmp/ruby/build/trunk --extout=.ext -- /tmp/ruby/src/trunk/spec/mspec/bin/mspec-run -B /tmp/ruby/src/trunk/spec/default.mspec --error-output stderr --debug -fy -o /tmp/rubytest.098kfo/12-mspec-multi-11 E, [2024-05-22T11:24:28.871079 #4157262] ERROR -- : $ /tmp/ruby/build/trunk/miniruby -I/tmp/ruby/src/trunk/lib /tmp/ruby/src/trunk/tool/runruby.rb --archdir=/tmp/ruby/build/trunk --extout=.ext -- /tmp/ruby/src/trunk/spec/mspec/bin/mspec-run -B /tmp/ruby/src/trunk/spec/default.mspec --error-output stderr --debug -fy -o /tmp/rubytest.098kfo/13-mspec-multi-12 E, [2024-05-22T11:24:28.871329 #4157262] ERROR -- : $ /tmp/ruby/build/trunk/miniruby -I/tmp/ruby/src/trunk/lib /tmp/ruby/src/trunk/tool/runruby.rb --archdir=/tmp/ruby/build/trunk --extout=.ext -- /tmp/ruby/src/trunk/spec/mspec/bin/mspec-run -B /tmp/ruby/src/trunk/spec/default.mspec --error-output stderr --debug -fy -o /tmp/rubytest.098kfo/14-mspec-multi-13 E, [2024-05-22T11:24:28.871564 #4157262] ERROR -- : $ /tmp/ruby/build/trunk/miniruby -I/tmp/ruby/src/trunk/lib /tmp/ruby/src/trunk/tool/runruby.rb --archdir=/tmp/ruby/build/trunk --extout=.ext -- /tmp/ruby/src/trunk/spec/mspec/bin/mspec-run -B /tmp/ruby/src/trunk/spec/default.mspec --error-output stderr --debug -fy -o /tmp/rubytest.098kfo/15-mspec-multi-14 E, [2024-05-22T11:24:28.871767 #4157262] ERROR -- : $ /tmp/ruby/build/trunk/miniruby -I/tmp/ruby/src/trunk/lib /tmp/ruby/src/trunk/tool/runruby.rb --archdir=/tmp/ruby/build/trunk --extout=.ext -- /tmp/ruby/src/trunk/spec/mspec/bin/mspec-run -B /tmp/ruby/src/trunk/spec/default.mspec --error-output stderr --debug -fy -o /tmp/rubytest.098kfo/16-mspec-multi-15 E, [2024-05-22T11:24:28.871992 #4157262] ERROR -- : $ /tmp/ruby/build/trunk/miniruby -I/tmp/ruby/src/trunk/lib /tmp/ruby/src/trunk/tool/runruby.rb --archdir=/tmp/ruby/build/trunk --extout=.ext -- /tmp/ruby/src/trunk/spec/mspec/bin/mspec-run -B /tmp/ruby/src/trunk/spec/default.mspec --error-output stderr --debug -fy -o /tmp/rubytest.098kfo/17-mspec-multi-16 E, [2024-05-22T11:24:28.872188 #4157262] ERROR -- : $ /tmp/ruby/build/trunk/miniruby -I/tmp/ruby/src/trunk/lib /tmp/ruby/src/trunk/tool/runruby.rb --archdir=/tmp/ruby/build/trunk --extout=.ext -- /tmp/ruby/src/trunk/spec/mspec/bin/mspec-run -B /tmp/ruby/src/trunk/spec/default.mspec --error-output stderr --debug -fy -o /tmp/rubytest.098kfo/18-mspec-multi-17 E, [2024-05-22T11:24:28.874571 #4157262] ERROR -- : $ /tmp/ruby/build/trunk/miniruby -I/tmp/ruby/src/trunk/lib /tmp/ruby/src/trunk/tool/runruby.rb --archdir=/tmp/ruby/build/trunk --extout=.ext -- /tmp/ruby/src/trunk/spec/mspec/bin/mspec-run -B /tmp/ruby/src/trunk/spec/default.mspec --error-output stderr --debug -fy -o /tmp/rubytest.098kfo/19-mspec-multi-18 E, [2024-05-22T11:24:28.874862 #4157262] ERROR -- : $ /tmp/ruby/build/trunk/miniruby -I/tmp/ruby/src/trunk/lib /tmp/ruby/src/trunk/tool/runruby.rb --archdir=/tmp/ruby/build/trunk --extout=.ext -- /tmp/ruby/src/trunk/spec/mspec/bin/mspec-run -B /tmp/ruby/src/trunk/spec/default.mspec --error-output stderr --debug -fy -o /tmp/rubytest.098kfo/20-mspec-multi-19 I, [2024-05-22T11:24:29.038447 #4157262] INFO -- : ruby 3.4.0dev (2024-05-22T06:59:19Z master 5613d6e95b) [x86_64-linux] I, [2024-05-22T11:24:29.640930 #4157262] INFO -- : 0 ......................................................................... I, [2024-05-22T11:24:30.039124 #4157262] INFO -- : 73 ......................................................................... I, [2024-05-22T11:24:30.185879 #4157262] INFO -- : 146 ......................................................................... I, [2024-05-22T11:24:30.252760 #4157262] INFO -- : 219 ......................................................................... I, [2024-05-22T11:24:30.312612 #4157262] INFO -- : 292 ......................................................................... I, [2024-05-22T11:24:30.356794 #4157262] INFO -- : 365 ......................................................................... I, [2024-05-22T11:24:30.377848 #4157262] INFO -- : 438 ......................................................................... I, [2024-05-22T11:24:30.397445 #4157262] INFO -- : 511 ......................................................................... I, [2024-05-22T11:24:30.415893 #4157262] INFO -- : 584 ......................................................................... I, [2024-05-22T11:24:30.473568 #4157262] INFO -- : 657 ......................................................................... I, [2024-05-22T11:24:30.502356 #4157262] INFO -- : 730 ......................................................................... I, [2024-05-22T11:24:30.524126 #4157262] INFO -- : 803 ......................................................................... I, [2024-05-22T11:24:30.559320 #4157262] INFO -- : 876 ......................................................................... I, [2024-05-22T11:24:30.616962 #4157262] INFO -- : 949 ......................................................................... I, [2024-05-22T11:24:30.701297 #4157262] INFO -- : 1022 ......................................................................... I, [2024-05-22T11:24:30.876091 #4157262] INFO -- : 1095 ......................................................................... I, [2024-05-22T11:24:30.995197 #4157262] INFO -- : 1168 ......................................................................... I, [2024-05-22T11:24:31.053510 #4157262] INFO -- : 1241 ......................................................................... I, [2024-05-22T11:24:31.095077 #4157262] INFO -- : 1314 ......................................................................... I, [2024-05-22T11:24:31.122432 #4157262] INFO -- : 1387 ......................................................................... I, [2024-05-22T11:24:31.219034 #4157262] INFO -- : 1460 ......................................................................... I, [2024-05-22T11:24:31.676164 #4157262] INFO -- : 1533 ......................................................................... I, [2024-05-22T11:24:31.723505 #4157262] INFO -- : 1606 ......................................................................... I, [2024-05-22T11:24:31.877496 #4157262] INFO -- : 1679 ......................................................................... I, [2024-05-22T11:24:31.981931 #4157262] INFO -- : 1752 ......................................................................... I, [2024-05-22T11:24:32.057159 #4157262] INFO -- : 1825 ......................................................................... I, [2024-05-22T11:24:32.138894 #4157262] INFO -- : 1898 ......................................................................... I, [2024-05-22T11:24:32.227837 #4157262] INFO -- : 1971 ......................................................................... I, [2024-05-22T11:24:32.359321 #4157262] INFO -- : 2044 ......................................................................... I, [2024-05-22T11:24:32.392763 #4157262] INFO -- : 2117 ......................................................................... I, [2024-05-22T11:24:32.408990 #4157262] INFO -- : 2190 ......................................................................... I, [2024-05-22T11:24:32.428615 #4157262] INFO -- : 2263 ......................................................................... I, [2024-05-22T11:24:32.441981 #4157262] INFO -- : 2336 ......................................................................... I, [2024-05-22T11:24:32.478044 #4157262] INFO -- : 2409 ......................................................................... I, [2024-05-22T11:24:32.578729 #4157262] INFO -- : 2482 ......................................................................... I, [2024-05-22T11:24:32.603388 #4157262] INFO -- : 2555 ......................................................................... I, [2024-05-22T11:24:32.690114 #4157262] INFO -- : 2628 ......................................................................... I, [2024-05-22T11:24:32.797481 #4157262] INFO -- : 2701 ......................................................................... I, [2024-05-22T11:24:32.832305 #4157262] INFO -- : 2774 ......................................................................... I, [2024-05-22T11:24:32.892707 #4157262] INFO -- : 2847 ......................................................................... I, [2024-05-22T11:24:32.933181 #4157262] INFO -- : 2920 ......................................................................... I, [2024-05-22T11:24:32.959525 #4157262] INFO -- : 2993 ......................................................................... I, [2024-05-22T11:24:32.984869 #4157262] INFO -- : 3066 ......................................................................... I, [2024-05-22T11:24:32.995004 #4157262] INFO -- : 3139 ......................................................................... I, [2024-05-22T11:24:33.004091 #4157262] INFO -- : 3212 ......................................................................... I, [2024-05-22T11:24:33.028994 #4157262] INFO -- : 3285 ......................................................................... I, [2024-05-22T11:24:36.982361 #4157262] INFO -- : 3358 ......................................................................... I, [2024-05-22T11:24:37.005195 #4157262] INFO -- : I, [2024-05-22T11:24:37.005233 #4157262] INFO -- : I, [2024-05-22T11:24:37.005240 #4157262] INFO -- : Finished in 8.136126 seconds I, [2024-05-22T11:24:37.005244 #4157262] INFO -- : I, [2024-05-22T11:24:37.005249 #4157262] INFO -- : 3430 files, 32652 examples, 205045 expectations, 0 failures, 0 errors, 0 tagged I, [2024-05-22T11:24:37.007432 #4157262] INFO -- : $$$[end] "make yes-test-rubyspec MSPECOPT='--error-output stderr --debug -j' TESTS='-j20'" exit with 0.