# Logfile created on 2024-05-22 00:30:55 +0000 by logger.rb/v1.4.3 I, [2024-05-22T00:30:55.472988 #2792304] INFO -- : #, @formatter=nil, @logdev=#, @binmode=false, @mon_data=#, @mon_data_owner_object_id=860>>> I, [2024-05-22T00:30:55.473111 #2792304] INFO -- : $$$[beg] make update-unicode -j20 I, [2024-05-22T00:30:55.532224 #2792304] INFO -- : Downloading Unicode emoji 15.0 files... I, [2024-05-22T00:30:55.532354 #2792304] INFO -- : Downloading Unicode emoji 15.0 files... I, [2024-05-22T00:30:55.533036 #2792304] INFO -- : Downloading Unicode emoji 15.0 files... I, [2024-05-22T00:30:55.574551 #2792304] INFO -- : made symlink emoji/15.0/emoji-sequences.txt to /tmp/ruby/src/trunk/.downloaded-cache/emoji/15.0/emoji-sequences.txt I, [2024-05-22T00:30:55.575181 #2792304] INFO -- : downloading emoji/15.0/emoji-sequences.txt ... downloading emoji/15.0/emoji-test.txt ... /tmp/ruby/src/trunk/enc/unicode/data/emoji/15.0/emoji-sequences.txt already exists E, [2024-05-22T00:30:56.048245 #2792304] ERROR -- : /tmp/ruby/src/trunk/tool/downloader.rb:302:in `rescue in download': failed to download emoji/15.0/emoji-test.txt (RuntimeError) E, [2024-05-22T00:30:56.048382 #2792304] ERROR -- : OpenURI::HTTPError: 403 Forbidden: https://www.unicode.org/Public/emoji/15.0/emoji-test.txt E, [2024-05-22T00:30:56.048404 #2792304] ERROR -- : from /tmp/ruby/src/trunk/tool/downloader.rb:201:in `download' E, [2024-05-22T00:30:56.048417 #2792304] ERROR -- : from /tmp/ruby/src/trunk/tool/downloader.rb:136:in `download' E, [2024-05-22T00:30:56.048431 #2792304] ERROR -- : from /tmp/ruby/src/trunk/tool/downloader.rb:482:in `block in
' E, [2024-05-22T00:30:56.048443 #2792304] ERROR -- : from /tmp/ruby/src/trunk/tool/downloader.rb:465:in `each' E, [2024-05-22T00:30:56.048456 #2792304] ERROR -- : from /tmp/ruby/src/trunk/tool/downloader.rb:465:in `
' E, [2024-05-22T00:30:56.048468 #2792304] ERROR -- : /usr/lib/ruby/3.0.0/open-uri.rb:364:in `open_http': 403 Forbidden (OpenURI::HTTPError) E, [2024-05-22T00:30:56.048480 #2792304] ERROR -- : from /usr/lib/ruby/3.0.0/open-uri.rb:741:in `buffer_open' E, [2024-05-22T00:30:56.048495 #2792304] ERROR -- : from /usr/lib/ruby/3.0.0/open-uri.rb:212:in `block in open_loop' E, [2024-05-22T00:30:56.048508 #2792304] ERROR -- : from /usr/lib/ruby/3.0.0/open-uri.rb:210:in `catch' E, [2024-05-22T00:30:56.048520 #2792304] ERROR -- : from /usr/lib/ruby/3.0.0/open-uri.rb:210:in `open_loop' E, [2024-05-22T00:30:56.048532 #2792304] ERROR -- : from /usr/lib/ruby/3.0.0/open-uri.rb:151:in `open_uri' E, [2024-05-22T00:30:56.048543 #2792304] ERROR -- : from /usr/lib/ruby/3.0.0/open-uri.rb:721:in `open' E, [2024-05-22T00:30:56.048555 #2792304] ERROR -- : from /usr/lib/ruby/3.0.0/open-uri.rb:729:in `read' E, [2024-05-22T00:30:56.048567 #2792304] ERROR -- : from /tmp/ruby/src/trunk/tool/downloader.rb:247:in `block in download' E, [2024-05-22T00:30:56.048596 #2792304] ERROR -- : from /tmp/ruby/src/trunk/tool/downloader.rb:378:in `with_retry' E, [2024-05-22T00:30:56.048613 #2792304] ERROR -- : from /tmp/ruby/src/trunk/tool/downloader.rb:246:in `download' E, [2024-05-22T00:30:56.048625 #2792304] ERROR -- : from /tmp/ruby/src/trunk/tool/downloader.rb:136:in `download' E, [2024-05-22T00:30:56.048637 #2792304] ERROR -- : from /tmp/ruby/src/trunk/tool/downloader.rb:482:in `block in
' E, [2024-05-22T00:30:56.048649 #2792304] ERROR -- : from /tmp/ruby/src/trunk/tool/downloader.rb:465:in `each' E, [2024-05-22T00:30:56.048660 #2792304] ERROR -- : from /tmp/ruby/src/trunk/tool/downloader.rb:465:in `
' E, [2024-05-22T00:30:56.048701 #2792304] ERROR -- : /tmp/ruby/src/trunk/tool/downloader.rb:302:in `rescue in download': failed to download emoji/15.0/emoji-test.txt (RuntimeError) E, [2024-05-22T00:30:56.048715 #2792304] ERROR -- : OpenURI::HTTPError: 403 Forbidden: https://www.unicode.org/Public/emoji/15.0/emoji-test.txt E, [2024-05-22T00:30:56.048729 #2792304] ERROR -- : from /tmp/ruby/src/trunk/tool/downloader.rb:201:in `download' E, [2024-05-22T00:30:56.048744 #2792304] ERROR -- : from /tmp/ruby/src/trunk/tool/downloader.rb:136:in `download' E, [2024-05-22T00:30:56.048756 #2792304] ERROR -- : from /tmp/ruby/src/trunk/tool/downloader.rb:482:in `block in
' E, [2024-05-22T00:30:56.048775 #2792304] ERROR -- : from /tmp/ruby/src/trunk/tool/downloader.rb:465:in `each' E, [2024-05-22T00:30:56.048786 #2792304] ERROR -- : from /tmp/ruby/src/trunk/tool/downloader.rb:465:in `
' E, [2024-05-22T00:30:56.048799 #2792304] ERROR -- : /usr/lib/ruby/3.0.0/open-uri.rb:364:in `open_http': 403 Forbidden (OpenURI::HTTPError) E, [2024-05-22T00:30:56.048812 #2792304] ERROR -- : from /usr/lib/ruby/3.0.0/open-uri.rb:741:in `buffer_open' E, [2024-05-22T00:30:56.048822 #2792304] ERROR -- : from /usr/lib/ruby/3.0.0/open-uri.rb:212:in `block in open_loop' E, [2024-05-22T00:30:56.048834 #2792304] ERROR -- : from /usr/lib/ruby/3.0.0/open-uri.rb:210:in `catch' E, [2024-05-22T00:30:56.048848 #2792304] ERROR -- : from /usr/lib/ruby/3.0.0/open-uri.rb:210:in `open_loop' E, [2024-05-22T00:30:56.048858 #2792304] ERROR -- : from /usr/lib/ruby/3.0.0/open-uri.rb:151:in `open_uri' E, [2024-05-22T00:30:56.048869 #2792304] ERROR -- : from /usr/lib/ruby/3.0.0/open-uri.rb:721:in `open' E, [2024-05-22T00:30:56.048880 #2792304] ERROR -- : from /usr/lib/ruby/3.0.0/open-uri.rb:729:in `read' E, [2024-05-22T00:30:56.048890 #2792304] ERROR -- : from /tmp/ruby/src/trunk/tool/downloader.rb:247:in `block in download' E, [2024-05-22T00:30:56.048901 #2792304] ERROR -- : from /tmp/ruby/src/trunk/tool/downloader.rb:378:in `with_retry' E, [2024-05-22T00:30:56.048912 #2792304] ERROR -- : from /tmp/ruby/src/trunk/tool/downloader.rb:246:in `download' E, [2024-05-22T00:30:56.048923 #2792304] ERROR -- : from /tmp/ruby/src/trunk/tool/downloader.rb:136:in `download' E, [2024-05-22T00:30:56.048936 #2792304] ERROR -- : from /tmp/ruby/src/trunk/tool/downloader.rb:482:in `block in
' E, [2024-05-22T00:30:56.048947 #2792304] ERROR -- : from /tmp/ruby/src/trunk/tool/downloader.rb:465:in `each' E, [2024-05-22T00:30:56.048957 #2792304] ERROR -- : from /tmp/ruby/src/trunk/tool/downloader.rb:465:in `
' E, [2024-05-22T00:30:56.052516 #2792304] ERROR -- : make: *** [uncommon.mk:1756: /tmp/ruby/src/trunk/enc/unicode/data/emoji/15.0/emoji-zwj-sequences.txt] Error 1 E, [2024-05-22T00:30:56.052575 #2792304] ERROR -- : make: *** Waiting for unfinished jobs.... E, [2024-05-22T00:30:56.053245 #2792304] ERROR -- : make: *** [uncommon.mk:1756: /tmp/ruby/src/trunk/enc/unicode/data/emoji/15.0/emoji-sequences.txt] Error 1 E, [2024-05-22T00:30:56.053297 #2792304] ERROR -- : make: *** Deleting file '/tmp/ruby/src/trunk/enc/unicode/data/emoji/15.0/emoji-sequences.txt' E, [2024-05-22T00:30:56.475602 #2792304] ERROR -- : /tmp/ruby/src/trunk/tool/downloader.rb:302:in `rescue in download': failed to download emoji/15.0/emoji-sequences.txt (RuntimeError) E, [2024-05-22T00:30:56.475755 #2792304] ERROR -- : EOFError: end of file reached: https://www.unicode.org/Public/emoji/15.0/emoji-sequences.txt E, [2024-05-22T00:30:56.475775 #2792304] ERROR -- : from /tmp/ruby/src/trunk/tool/downloader.rb:201:in `download' E, [2024-05-22T00:30:56.475786 #2792304] ERROR -- : from /tmp/ruby/src/trunk/tool/downloader.rb:136:in `download' E, [2024-05-22T00:30:56.475798 #2792304] ERROR -- : from /tmp/ruby/src/trunk/tool/downloader.rb:482:in `block in
' E, [2024-05-22T00:30:56.475809 #2792304] ERROR -- : from /tmp/ruby/src/trunk/tool/downloader.rb:465:in `each' E, [2024-05-22T00:30:56.475821 #2792304] ERROR -- : from /tmp/ruby/src/trunk/tool/downloader.rb:465:in `
' E, [2024-05-22T00:30:56.475832 #2792304] ERROR -- : /usr/lib/ruby/3.0.0/net/protocol.rb:227:in `rbuf_fill': end of file reached (EOFError) E, [2024-05-22T00:30:56.475847 #2792304] ERROR -- : from /usr/lib/ruby/3.0.0/net/protocol.rb:193:in `readuntil' E, [2024-05-22T00:30:56.475858 #2792304] ERROR -- : from /usr/lib/ruby/3.0.0/net/protocol.rb:203:in `readline' E, [2024-05-22T00:30:56.475869 #2792304] ERROR -- : from /usr/lib/ruby/3.0.0/net/http/response.rb:42:in `read_status_line' E, [2024-05-22T00:30:56.475880 #2792304] ERROR -- : from /usr/lib/ruby/3.0.0/net/http/response.rb:31:in `read_new' E, [2024-05-22T00:30:56.475892 #2792304] ERROR -- : from /usr/lib/ruby/3.0.0/net/http.rb:1557:in `block in transport_request' E, [2024-05-22T00:30:56.476125 #2792304] ERROR -- : from /usr/lib/ruby/3.0.0/net/http.rb:1548:in `catch' E, [2024-05-22T00:30:56.476137 #2792304] ERROR -- : from /usr/lib/ruby/3.0.0/net/http.rb:1548:in `transport_request' E, [2024-05-22T00:30:56.476149 #2792304] ERROR -- : from /usr/lib/ruby/3.0.0/net/http.rb:1521:in `request' E, [2024-05-22T00:30:56.476159 #2792304] ERROR -- : from /usr/lib/ruby/3.0.0/open-uri.rb:329:in `block in open_http' E, [2024-05-22T00:30:56.476169 #2792304] ERROR -- : from /usr/lib/ruby/3.0.0/net/http.rb:960:in `start' E, [2024-05-22T00:30:56.476180 #2792304] ERROR -- : from /usr/lib/ruby/3.0.0/open-uri.rb:323:in `open_http' E, [2024-05-22T00:30:56.476191 #2792304] ERROR -- : from /usr/lib/ruby/3.0.0/open-uri.rb:741:in `buffer_open' E, [2024-05-22T00:30:56.476213 #2792304] ERROR -- : from /usr/lib/ruby/3.0.0/open-uri.rb:212:in `block in open_loop' E, [2024-05-22T00:30:56.476224 #2792304] ERROR -- : from /usr/lib/ruby/3.0.0/open-uri.rb:210:in `catch' E, [2024-05-22T00:30:56.476234 #2792304] ERROR -- : from /usr/lib/ruby/3.0.0/open-uri.rb:210:in `open_loop' E, [2024-05-22T00:30:56.476245 #2792304] ERROR -- : from /usr/lib/ruby/3.0.0/open-uri.rb:151:in `open_uri' E, [2024-05-22T00:30:56.476256 #2792304] ERROR -- : from /usr/lib/ruby/3.0.0/open-uri.rb:721:in `open' E, [2024-05-22T00:30:56.476266 #2792304] ERROR -- : from /usr/lib/ruby/3.0.0/open-uri.rb:729:in `read' E, [2024-05-22T00:30:56.476277 #2792304] ERROR -- : from /tmp/ruby/src/trunk/tool/downloader.rb:247:in `block in download' E, [2024-05-22T00:30:56.476287 #2792304] ERROR -- : from /tmp/ruby/src/trunk/tool/downloader.rb:378:in `with_retry' E, [2024-05-22T00:30:56.476298 #2792304] ERROR -- : from /tmp/ruby/src/trunk/tool/downloader.rb:246:in `download' E, [2024-05-22T00:30:56.476311 #2792304] ERROR -- : from /tmp/ruby/src/trunk/tool/downloader.rb:136:in `download' E, [2024-05-22T00:30:56.476322 #2792304] ERROR -- : from /tmp/ruby/src/trunk/tool/downloader.rb:482:in `block in
' E, [2024-05-22T00:30:56.476333 #2792304] ERROR -- : from /tmp/ruby/src/trunk/tool/downloader.rb:465:in `each' E, [2024-05-22T00:30:56.476343 #2792304] ERROR -- : from /tmp/ruby/src/trunk/tool/downloader.rb:465:in `
' E, [2024-05-22T00:30:56.479920 #2792304] ERROR -- : make: *** [uncommon.mk:1756: /tmp/ruby/src/trunk/enc/unicode/data/emoji/15.0/emoji-test.txt] Error 1 I, [2024-05-22T00:30:56.480042 #2792304] INFO -- : downloading emoji/15.0/emoji-test.txt ... I, [2024-05-22T00:30:56.480504 #2792304] INFO -- : $$$[end] "make update-unicode -j20" exit with 512. I, [2024-05-22T00:30:56.480577 #2792304] INFO -- : $$$[beg] make update-download -j20 I, [2024-05-22T00:30:56.595420 #2792304] INFO -- : tool/config.guess already exists I, [2024-05-22T00:30:56.595461 #2792304] INFO -- : tool/config.sub already exists I, [2024-05-22T00:30:56.597690 #2792304] INFO -- : Update power_assert to 84e85124c5014a139af39161d484156cfe87a9ed I, [2024-05-22T00:30:56.598019 #2792304] INFO -- : Update rbs to ba7872795d5de04adb8ff500c0e6afdc81a041dd I, [2024-05-22T00:30:56.598305 #2792304] INFO -- : Update typeprof to b19a6416da3a05d57fadd6ffdadb382b6d236ca5 I, [2024-05-22T00:30:56.598866 #2792304] INFO -- : echo 84e85124c5014a139af39161d484156cfe87a9ed | /bin/sh /tmp/ruby/src/trunk/tool/ifchange /tmp/ruby/src/trunk/.bundle/.timestamp/power_assert.revision - I, [2024-05-22T00:30:56.599441 #2792304] INFO -- : echo ba7872795d5de04adb8ff500c0e6afdc81a041dd | /bin/sh /tmp/ruby/src/trunk/tool/ifchange /tmp/ruby/src/trunk/.bundle/.timestamp/rbs.revision - I, [2024-05-22T00:30:56.599604 #2792304] INFO -- : echo b19a6416da3a05d57fadd6ffdadb382b6d236ca5 | /bin/sh /tmp/ruby/src/trunk/tool/ifchange /tmp/ruby/src/trunk/.bundle/.timestamp/typeprof.revision - I, [2024-05-22T00:30:56.600908 #2792304] INFO -- : /tmp/ruby/src/trunk/.bundle/.timestamp/power_assert.revision unchanged I, [2024-05-22T00:30:56.601364 #2792304] INFO -- : /tmp/ruby/src/trunk/.bundle/.timestamp/typeprof.revision unchanged I, [2024-05-22T00:30:56.601481 #2792304] INFO -- : /tmp/ruby/src/trunk/.bundle/.timestamp/rbs.revision unchanged I, [2024-05-22T00:30:56.601875 #2792304] INFO -- : Building power_assert@84e85124c5014a139af39161d484156cfe87a9ed to /tmp/ruby/src/trunk/gems/power_assert-2.0.3.gem I, [2024-05-22T00:30:56.671835 #2792304] INFO -- : Successfully built RubyGem I, [2024-05-22T00:30:56.671875 #2792304] INFO -- : Name: power_assert I, [2024-05-22T00:30:56.671880 #2792304] INFO -- : Version: 2.0.4dev I, [2024-05-22T00:30:56.671884 #2792304] INFO -- : File: power_assert-2.0.4dev.gem I, [2024-05-22T00:30:56.717044 #2792304] INFO -- : $$$[end] "make update-download -j20" exit with 0. I, [2024-05-22T00:30:56.717078 #2792304] INFO -- : $$$[beg] make update-rubyspec -j20 I, [2024-05-22T00:30:56.775259 #2792304] INFO -- : make: Nothing to be done for 'update-rubyspec'. I, [2024-05-22T00:30:56.775521 #2792304] INFO -- : $$$[end] "make update-rubyspec -j20" exit with 0. I, [2024-05-22T00:30:56.775550 #2792304] INFO -- : $$$[beg] make update-src -j20 I, [2024-05-22T00:30:57.433736 #2792304] INFO -- : Already up to date. I, [2024-05-22T00:30:57.451831 #2792304] INFO -- : Latest commit hash = b20adf90e3 I, [2024-05-22T00:30:57.453599 #2792304] INFO -- : $$$[end] "make update-src -j20" exit with 0. I, [2024-05-22T00:30:57.453652 #2792304] INFO -- : $$$[beg] make after-update -j20 I, [2024-05-22T00:30:57.548125 #2792304] INFO -- : /tmp/ruby/src/trunk/revision.h updated I, [2024-05-22T00:30:57.549474 #2792304] INFO -- : generating x86_64-linux-fake.rb I, [2024-05-22T00:30:57.600041 #2792304] INFO -- : x86_64-linux-fake.rb updated I, [2024-05-22T00:30:57.601539 #2792304] INFO -- : generating enc.mk I, [2024-05-22T00:30:57.722021 #2792304] INFO -- : making srcs under enc I, [2024-05-22T00:30:57.752155 #2792304] INFO -- : make[1]: Entering directory '/tmp/ruby/build/trunk' I, [2024-05-22T00:30:57.752178 #2792304] INFO -- : make[1]: Nothing to be done for 'srcs'. I, [2024-05-22T00:30:57.752183 #2792304] INFO -- : make[1]: Leaving directory '/tmp/ruby/build/trunk' I, [2024-05-22T00:30:57.796892 #2792304] INFO -- : Update power_assert to 84e85124c5014a139af39161d484156cfe87a9ed I, [2024-05-22T00:30:57.797049 #2792304] INFO -- : Update rbs to ba7872795d5de04adb8ff500c0e6afdc81a041dd I, [2024-05-22T00:30:57.797720 #2792304] INFO -- : Update typeprof to b19a6416da3a05d57fadd6ffdadb382b6d236ca5 I, [2024-05-22T00:30:57.798327 #2792304] INFO -- : echo 84e85124c5014a139af39161d484156cfe87a9ed | /bin/sh /tmp/ruby/src/trunk/tool/ifchange /tmp/ruby/src/trunk/.bundle/.timestamp/power_assert.revision - I, [2024-05-22T00:30:57.798504 #2792304] INFO -- : echo ba7872795d5de04adb8ff500c0e6afdc81a041dd | /bin/sh /tmp/ruby/src/trunk/tool/ifchange /tmp/ruby/src/trunk/.bundle/.timestamp/rbs.revision - I, [2024-05-22T00:30:57.799075 #2792304] INFO -- : echo b19a6416da3a05d57fadd6ffdadb382b6d236ca5 | /bin/sh /tmp/ruby/src/trunk/tool/ifchange /tmp/ruby/src/trunk/.bundle/.timestamp/typeprof.revision - I, [2024-05-22T00:30:57.800144 #2792304] INFO -- : /tmp/ruby/src/trunk/.bundle/.timestamp/power_assert.revision unchanged I, [2024-05-22T00:30:57.800169 #2792304] INFO -- : /tmp/ruby/src/trunk/.bundle/.timestamp/rbs.revision unchanged I, [2024-05-22T00:30:57.800845 #2792304] INFO -- : /tmp/ruby/src/trunk/.bundle/.timestamp/typeprof.revision unchanged I, [2024-05-22T00:30:57.801097 #2792304] INFO -- : Building power_assert@84e85124c5014a139af39161d484156cfe87a9ed to /tmp/ruby/src/trunk/gems/power_assert-2.0.3.gem I, [2024-05-22T00:30:57.869586 #2792304] INFO -- : Successfully built RubyGem I, [2024-05-22T00:30:57.869629 #2792304] INFO -- : Name: power_assert I, [2024-05-22T00:30:57.869635 #2792304] INFO -- : Version: 2.0.4dev I, [2024-05-22T00:30:57.869640 #2792304] INFO -- : File: power_assert-2.0.4dev.gem I, [2024-05-22T00:30:57.871670 #2792304] INFO -- : Extracting bundle gem power_assert-2.0.3... I, [2024-05-22T00:30:57.931552 #2792304] INFO -- : Try with hash version of bundled gems instead of gems/power_assert-2.0.3.gem. We don't use this gem with release version of Ruby. I, [2024-05-22T00:30:57.936487 #2792304] INFO -- : Unpacked gems/power_assert-2.0.4dev.gem I, [2024-05-22T00:30:57.938373 #2792304] INFO -- : $$$[end] "make after-update -j20" exit with 0. I, [2024-05-22T00:30:57.938502 #2792304] INFO -- : $$$[beg] make miniruby -j20 I, [2024-05-22T00:30:57.997825 #2792304] INFO -- : BASERUBY = /usr/bin/ruby --disable=gems I, [2024-05-22T00:30:57.997857 #2792304] INFO -- : CC = gcc I, [2024-05-22T00:30:57.997863 #2792304] INFO -- : LD = ld I, [2024-05-22T00:30:57.997867 #2792304] INFO -- : LDSHARED = gcc -shared I, [2024-05-22T00:30:57.997872 #2792304] INFO -- : CFLAGS = -O3 -fno-fast-math -ggdb3 -Wall -Wextra -Wdeprecated-declarations -Wdiv-by-zero -Wduplicated-cond -Wimplicit-function-declaration -Wimplicit-int -Wpointer-arith -Wwrite-strings -Wold-style-definition -Wimplicit-fallthrough=0 -Wmissing-noreturn -Wno-cast-function-type -Wno-constant-logical-operand -Wno-long-long -Wno-missing-field-initializers -Wno-overlength-strings -Wno-packed-bitfield-compat -Wno-parentheses-equality -Wno-self-assign -Wno-tautological-compare -Wno-unused-parameter -Wno-unused-value -Wsuggest-attribute=format -Wsuggest-attribute=noreturn -Wunused-variable -Wmisleading-indentation -Wundef -fPIC I, [2024-05-22T00:30:57.997877 #2792304] INFO -- : XCFLAGS = -U_FORTIFY_SOURCE -D_FORTIFY_SOURCE=2 -fstack-protector-strong -fno-strict-overflow -fvisibility=hidden -fexcess-precision=standard -DRUBY_EXPORT -I. -I.ext/include/x86_64-linux -I/tmp/ruby/src/trunk/include -I/tmp/ruby/src/trunk -I/tmp/ruby/src/trunk/prism -I/tmp/ruby/src/trunk/enc/unicode/15.0.0 I, [2024-05-22T00:30:57.997881 #2792304] INFO -- : CPPFLAGS = I, [2024-05-22T00:30:57.997885 #2792304] INFO -- : DLDFLAGS = -Wl,--compress-debug-sections=zlib -Wl,-soname,libruby.so.3.4 -fstack-protector-strong I, [2024-05-22T00:30:57.997889 #2792304] INFO -- : SOLIBS = -lz -lrt -lrt -lgmp -ldl -lcrypt -lm -lpthread I, [2024-05-22T00:30:57.997893 #2792304] INFO -- : LANG = en_US.UTF-8 I, [2024-05-22T00:30:57.997899 #2792304] INFO -- : LC_ALL = I, [2024-05-22T00:30:57.997903 #2792304] INFO -- : LC_CTYPE = I, [2024-05-22T00:30:57.997907 #2792304] INFO -- : MFLAGS = -j20 --jobserver-auth=4,5 I, [2024-05-22T00:30:57.997910 #2792304] INFO -- : RUSTC = no I, [2024-05-22T00:30:57.997914 #2792304] INFO -- : YJIT_RUSTC_ARGS = --crate-name=yjit --crate-type=staticlib --edition=2021 -g -C lto=thin -C opt-level=3 -C overflow-checks=on '--out-dir=/tmp/ruby/build/trunk/yjit/target/release/' /tmp/ruby/src/trunk/yjit/src/lib.rs I, [2024-05-22T00:30:57.999504 #2792304] INFO -- : gcc (Ubuntu 11.4.0-1ubuntu1~22.04) 11.4.0 I, [2024-05-22T00:30:57.999539 #2792304] INFO -- : Copyright (C) 2021 Free Software Foundation, Inc. I, [2024-05-22T00:30:57.999546 #2792304] INFO -- : This is free software; see the source for copying conditions. There is NO I, [2024-05-22T00:30:57.999554 #2792304] INFO -- : warranty; not even for MERCHANTABILITY or FITNESS FOR A PARTICULAR PURPOSE. I, [2024-05-22T00:30:57.999559 #2792304] INFO -- : I, [2024-05-22T00:30:58.022884 #2792304] INFO -- : compiling /tmp/ruby/src/trunk/version.c I, [2024-05-22T00:30:58.124327 #2792304] INFO -- : linking miniruby I, [2024-05-22T00:30:58.636883 #2792304] INFO -- : $$$[end] "make miniruby -j20" exit with 0. I, [2024-05-22T00:30:58.636991 #2792304] INFO -- : $$$[beg] make ruby -j20 I, [2024-05-22T00:30:58.695973 #2792304] INFO -- : BASERUBY = /usr/bin/ruby --disable=gems I, [2024-05-22T00:30:58.696007 #2792304] INFO -- : CC = gcc I, [2024-05-22T00:30:58.696014 #2792304] INFO -- : LD = ld I, [2024-05-22T00:30:58.696019 #2792304] INFO -- : LDSHARED = gcc -shared I, [2024-05-22T00:30:58.696025 #2792304] INFO -- : CFLAGS = -O3 -fno-fast-math -ggdb3 -Wall -Wextra -Wdeprecated-declarations -Wdiv-by-zero -Wduplicated-cond -Wimplicit-function-declaration -Wimplicit-int -Wpointer-arith -Wwrite-strings -Wold-style-definition -Wimplicit-fallthrough=0 -Wmissing-noreturn -Wno-cast-function-type -Wno-constant-logical-operand -Wno-long-long -Wno-missing-field-initializers -Wno-overlength-strings -Wno-packed-bitfield-compat -Wno-parentheses-equality -Wno-self-assign -Wno-tautological-compare -Wno-unused-parameter -Wno-unused-value -Wsuggest-attribute=format -Wsuggest-attribute=noreturn -Wunused-variable -Wmisleading-indentation -Wundef -fPIC I, [2024-05-22T00:30:58.696030 #2792304] INFO -- : XCFLAGS = -U_FORTIFY_SOURCE -D_FORTIFY_SOURCE=2 -fstack-protector-strong -fno-strict-overflow -fvisibility=hidden -fexcess-precision=standard -DRUBY_EXPORT -I. -I.ext/include/x86_64-linux -I/tmp/ruby/src/trunk/include -I/tmp/ruby/src/trunk -I/tmp/ruby/src/trunk/prism -I/tmp/ruby/src/trunk/enc/unicode/15.0.0 I, [2024-05-22T00:30:58.696035 #2792304] INFO -- : CPPFLAGS = I, [2024-05-22T00:30:58.696039 #2792304] INFO -- : DLDFLAGS = -Wl,--compress-debug-sections=zlib -Wl,-soname,libruby.so.3.4 -fstack-protector-strong I, [2024-05-22T00:30:58.696044 #2792304] INFO -- : SOLIBS = -lz -lrt -lrt -lgmp -ldl -lcrypt -lm -lpthread I, [2024-05-22T00:30:58.696048 #2792304] INFO -- : LANG = en_US.UTF-8 I, [2024-05-22T00:30:58.696052 #2792304] INFO -- : LC_ALL = I, [2024-05-22T00:30:58.696057 #2792304] INFO -- : LC_CTYPE = I, [2024-05-22T00:30:58.696061 #2792304] INFO -- : MFLAGS = -j20 --jobserver-auth=4,5 I, [2024-05-22T00:30:58.696066 #2792304] INFO -- : RUSTC = no I, [2024-05-22T00:30:58.696071 #2792304] INFO -- : YJIT_RUSTC_ARGS = --crate-name=yjit --crate-type=staticlib --edition=2021 -g -C lto=thin -C opt-level=3 -C overflow-checks=on '--out-dir=/tmp/ruby/build/trunk/yjit/target/release/' /tmp/ruby/src/trunk/yjit/src/lib.rs I, [2024-05-22T00:30:58.697715 #2792304] INFO -- : gcc (Ubuntu 11.4.0-1ubuntu1~22.04) 11.4.0 I, [2024-05-22T00:30:58.697745 #2792304] INFO -- : Copyright (C) 2021 Free Software Foundation, Inc. I, [2024-05-22T00:30:58.697753 #2792304] INFO -- : This is free software; see the source for copying conditions. There is NO I, [2024-05-22T00:30:58.697758 #2792304] INFO -- : warranty; not even for MERCHANTABILITY or FITNESS FOR A PARTICULAR PURPOSE. I, [2024-05-22T00:30:58.697763 #2792304] INFO -- : I, [2024-05-22T00:30:58.808455 #2792304] INFO -- : builtin_binary.inc updated I, [2024-05-22T00:30:58.813026 #2792304] INFO -- : c5234a9416e4f20f175185e840b25b0f08674d14078ed7083f37e655458e3ca9 builtin_binary.inc I, [2024-05-22T00:30:58.813813 #2792304] INFO -- : compiling /tmp/ruby/src/trunk/builtin.c I, [2024-05-22T00:30:58.996817 #2792304] INFO -- : linking static-library libruby-static.a I, [2024-05-22T00:30:59.309537 #2792304] INFO -- : linking shared-library libruby.so.3.4.0 I, [2024-05-22T00:31:00.868947 #2792304] INFO -- : linking ruby I, [2024-05-22T00:31:00.893061 #2792304] INFO -- : $$$[end] "make ruby -j20" exit with 0. I, [2024-05-22T00:31:00.893187 #2792304] INFO -- : $$$[beg] make all -j20 I, [2024-05-22T00:31:00.961123 #2792304] INFO -- : BASERUBY = /usr/bin/ruby --disable=gems I, [2024-05-22T00:31:00.961168 #2792304] INFO -- : CC = gcc I, [2024-05-22T00:31:00.961182 #2792304] INFO -- : LD = ld I, [2024-05-22T00:31:00.961194 #2792304] INFO -- : LDSHARED = gcc -shared I, [2024-05-22T00:31:00.961205 #2792304] INFO -- : CFLAGS = -O3 -fno-fast-math -ggdb3 -Wall -Wextra -Wdeprecated-declarations -Wdiv-by-zero -Wduplicated-cond -Wimplicit-function-declaration -Wimplicit-int -Wpointer-arith -Wwrite-strings -Wold-style-definition -Wimplicit-fallthrough=0 -Wmissing-noreturn -Wno-cast-function-type -Wno-constant-logical-operand -Wno-long-long -Wno-missing-field-initializers -Wno-overlength-strings -Wno-packed-bitfield-compat -Wno-parentheses-equality -Wno-self-assign -Wno-tautological-compare -Wno-unused-parameter -Wno-unused-value -Wsuggest-attribute=format -Wsuggest-attribute=noreturn -Wunused-variable -Wmisleading-indentation -Wundef -fPIC I, [2024-05-22T00:31:00.961217 #2792304] INFO -- : XCFLAGS = -U_FORTIFY_SOURCE -D_FORTIFY_SOURCE=2 -fstack-protector-strong -fno-strict-overflow -fvisibility=hidden -fexcess-precision=standard -DRUBY_EXPORT -I. -I.ext/include/x86_64-linux -I/tmp/ruby/src/trunk/include -I/tmp/ruby/src/trunk -I/tmp/ruby/src/trunk/prism -I/tmp/ruby/src/trunk/enc/unicode/15.0.0 I, [2024-05-22T00:31:00.961228 #2792304] INFO -- : CPPFLAGS = I, [2024-05-22T00:31:00.961238 #2792304] INFO -- : DLDFLAGS = -Wl,--compress-debug-sections=zlib -Wl,-soname,libruby.so.3.4 -fstack-protector-strong I, [2024-05-22T00:31:00.961249 #2792304] INFO -- : SOLIBS = -lz -lrt -lrt -lgmp -ldl -lcrypt -lm -lpthread I, [2024-05-22T00:31:00.961260 #2792304] INFO -- : LANG = en_US.UTF-8 I, [2024-05-22T00:31:00.961270 #2792304] INFO -- : LC_ALL = I, [2024-05-22T00:31:00.961280 #2792304] INFO -- : LC_CTYPE = I, [2024-05-22T00:31:00.961291 #2792304] INFO -- : MFLAGS = -j20 --jobserver-auth=4,5 I, [2024-05-22T00:31:00.961301 #2792304] INFO -- : RUSTC = no I, [2024-05-22T00:31:00.961312 #2792304] INFO -- : YJIT_RUSTC_ARGS = --crate-name=yjit --crate-type=staticlib --edition=2021 -g -C lto=thin -C opt-level=3 -C overflow-checks=on '--out-dir=/tmp/ruby/build/trunk/yjit/target/release/' /tmp/ruby/src/trunk/yjit/src/lib.rs I, [2024-05-22T00:31:00.962561 #2792304] INFO -- : gcc (Ubuntu 11.4.0-1ubuntu1~22.04) 11.4.0 I, [2024-05-22T00:31:00.962605 #2792304] INFO -- : Copyright (C) 2021 Free Software Foundation, Inc. I, [2024-05-22T00:31:00.962624 #2792304] INFO -- : This is free software; see the source for copying conditions. There is NO I, [2024-05-22T00:31:00.962636 #2792304] INFO -- : warranty; not even for MERCHANTABILITY or FITNESS FOR A PARTICULAR PURPOSE. I, [2024-05-22T00:31:00.962647 #2792304] INFO -- : I, [2024-05-22T00:31:00.991256 #2792304] INFO -- : generating encdb.h I, [2024-05-22T00:31:00.992571 #2792304] INFO -- : generating enc.mk I, [2024-05-22T00:31:00.994456 #2792304] INFO -- : building spec/ruby/optional/capi/ext/array_spec.so I, [2024-05-22T00:31:00.994701 #2792304] INFO -- : building spec/ruby/optional/capi/ext/basic_object_spec.so I, [2024-05-22T00:31:00.995322 #2792304] INFO -- : building spec/ruby/optional/capi/ext/bignum_spec.so I, [2024-05-22T00:31:00.995662 #2792304] INFO -- : building spec/ruby/optional/capi/ext/binding_spec.so I, [2024-05-22T00:31:00.995962 #2792304] INFO -- : building spec/ruby/optional/capi/ext/boolean_spec.so I, [2024-05-22T00:31:00.996657 #2792304] INFO -- : building spec/ruby/optional/capi/ext/class_id_under_autoload_spec.so I, [2024-05-22T00:31:00.997490 #2792304] INFO -- : building spec/ruby/optional/capi/ext/class_spec.so I, [2024-05-22T00:31:00.997768 #2792304] INFO -- : building spec/ruby/optional/capi/ext/class_under_autoload_spec.so I, [2024-05-22T00:31:00.998233 #2792304] INFO -- : building spec/ruby/optional/capi/ext/complex_spec.so I, [2024-05-22T00:31:00.998909 #2792304] INFO -- : building spec/ruby/optional/capi/ext/constants_spec.so I, [2024-05-22T00:31:00.999664 #2792304] INFO -- : building spec/ruby/optional/capi/ext/data_spec.so I, [2024-05-22T00:31:00.999998 #2792304] INFO -- : building spec/ruby/optional/capi/ext/debug_spec.so I, [2024-05-22T00:31:01.000710 #2792304] INFO -- : building spec/ruby/optional/capi/ext/encoding_spec.so I, [2024-05-22T00:31:01.001325 #2792304] INFO -- : building spec/ruby/optional/capi/ext/enumerator_spec.so I, [2024-05-22T00:31:01.001632 #2792304] INFO -- : building spec/ruby/optional/capi/ext/exception_spec.so I, [2024-05-22T00:31:01.002188 #2792304] INFO -- : building spec/ruby/optional/capi/ext/fiber_spec.so I, [2024-05-22T00:31:01.002468 #2792304] INFO -- : building spec/ruby/optional/capi/ext/file_spec.so I, [2024-05-22T00:31:01.003265 #2792304] INFO -- : building spec/ruby/optional/capi/ext/fixnum_spec.so I, [2024-05-22T00:31:01.029494 #2792304] INFO -- : encdb.h unchanged I, [2024-05-22T00:31:01.031594 #2792304] INFO -- : building spec/ruby/optional/capi/ext/float_spec.so I, [2024-05-22T00:31:01.124961 #2792304] INFO -- : building spec/ruby/optional/capi/ext/gc_spec.so I, [2024-05-22T00:31:01.130398 #2792304] INFO -- : building spec/ruby/optional/capi/ext/globals_spec.so I, [2024-05-22T00:31:01.135421 #2792304] INFO -- : building spec/ruby/optional/capi/ext/hash_spec.so I, [2024-05-22T00:31:01.145044 #2792304] INFO -- : building spec/ruby/optional/capi/ext/integer_spec.so I, [2024-05-22T00:31:01.145310 #2792304] INFO -- : building spec/ruby/optional/capi/ext/io_spec.so I, [2024-05-22T00:31:01.153726 #2792304] INFO -- : building spec/ruby/optional/capi/ext/kernel_spec.so I, [2024-05-22T00:31:01.154083 #2792304] INFO -- : building spec/ruby/optional/capi/ext/language_spec.so I, [2024-05-22T00:31:01.166255 #2792304] INFO -- : building spec/ruby/optional/capi/ext/marshal_spec.so I, [2024-05-22T00:31:01.175856 #2792304] INFO -- : building spec/ruby/optional/capi/ext/module_spec.so I, [2024-05-22T00:31:01.184093 #2792304] INFO -- : building spec/ruby/optional/capi/ext/module_under_autoload_spec.so I, [2024-05-22T00:31:01.187589 #2792304] INFO -- : building spec/ruby/optional/capi/ext/mutex_spec.so I, [2024-05-22T00:31:01.193268 #2792304] INFO -- : building spec/ruby/optional/capi/ext/numeric_spec.so I, [2024-05-22T00:31:01.194522 #2792304] INFO -- : building spec/ruby/optional/capi/ext/object_spec.so I, [2024-05-22T00:31:01.194965 #2792304] INFO -- : building spec/ruby/optional/capi/ext/proc_spec.so I, [2024-05-22T00:31:01.198057 #2792304] INFO -- : building spec/ruby/optional/capi/ext/range_spec.so I, [2024-05-22T00:31:01.222561 #2792304] INFO -- : building spec/ruby/optional/capi/ext/rational_spec.so I, [2024-05-22T00:31:01.233086 #2792304] INFO -- : building spec/ruby/optional/capi/ext/rbasic_spec.so I, [2024-05-22T00:31:01.234699 #2792304] INFO -- : building spec/ruby/optional/capi/ext/regexp_spec.so I, [2024-05-22T00:31:01.289506 #2792304] INFO -- : building spec/ruby/optional/capi/ext/string_spec.so I, [2024-05-22T00:31:01.303265 #2792304] INFO -- : building spec/ruby/optional/capi/ext/struct_spec.so I, [2024-05-22T00:31:01.305361 #2792304] INFO -- : building spec/ruby/optional/capi/ext/st_spec.so I, [2024-05-22T00:31:01.318681 #2792304] INFO -- : building spec/ruby/optional/capi/ext/symbol_spec.so I, [2024-05-22T00:31:01.319871 #2792304] INFO -- : building spec/ruby/optional/capi/ext/thread_spec.so I, [2024-05-22T00:31:01.321403 #2792304] INFO -- : building spec/ruby/optional/capi/ext/time_spec.so I, [2024-05-22T00:31:01.338526 #2792304] INFO -- : building spec/ruby/optional/capi/ext/tracepoint_spec.so I, [2024-05-22T00:31:01.344635 #2792304] INFO -- : building spec/ruby/optional/capi/ext/typed_data_spec.so I, [2024-05-22T00:31:01.345442 #2792304] INFO -- : building spec/ruby/optional/capi/ext/util_spec.so I, [2024-05-22T00:31:01.354327 #2792304] INFO -- : making enc I, [2024-05-22T00:31:01.358315 #2792304] INFO -- : making srcs under enc I, [2024-05-22T00:31:01.382911 #2792304] INFO -- : make[1]: Entering directory '/tmp/ruby/build/trunk' I, [2024-05-22T00:31:01.382986 #2792304] INFO -- : make[1]: Nothing to be done for 'enc'. I, [2024-05-22T00:31:01.382997 #2792304] INFO -- : make[1]: Leaving directory '/tmp/ruby/build/trunk' I, [2024-05-22T00:31:01.405409 #2792304] INFO -- : make[1]: Entering directory '/tmp/ruby/build/trunk' I, [2024-05-22T00:31:01.405476 #2792304] INFO -- : make[1]: Nothing to be done for 'srcs'. I, [2024-05-22T00:31:01.405488 #2792304] INFO -- : make[1]: Leaving directory '/tmp/ruby/build/trunk' I, [2024-05-22T00:31:01.406247 #2792304] INFO -- : generating transdb.h I, [2024-05-22T00:31:01.520491 #2792304] INFO -- : transdb.h unchanged I, [2024-05-22T00:31:01.521872 #2792304] INFO -- : generating makefiles ext/configure-ext.mk I, [2024-05-22T00:31:01.522536 #2792304] INFO -- : making trans I, [2024-05-22T00:31:01.548746 #2792304] INFO -- : ext/configure-ext.mk updated I, [2024-05-22T00:31:01.551175 #2792304] INFO -- : make[1]: Entering directory '/tmp/ruby/build/trunk' I, [2024-05-22T00:31:01.558414 #2792304] INFO -- : make[1]: Entering directory '/tmp/ruby/build/trunk' I, [2024-05-22T00:31:01.558499 #2792304] INFO -- : make[1]: Nothing to be done for 'trans'. I, [2024-05-22T00:31:01.558513 #2792304] INFO -- : make[1]: Leaving directory '/tmp/ruby/build/trunk' I, [2024-05-22T00:31:01.559330 #2792304] INFO -- : making encs I, [2024-05-22T00:31:01.618392 #2792304] INFO -- : make[1]: Entering directory '/tmp/ruby/build/trunk' I, [2024-05-22T00:31:01.618462 #2792304] INFO -- : make[1]: Nothing to be done for 'encs'. I, [2024-05-22T00:31:01.618490 #2792304] INFO -- : make[1]: Leaving directory '/tmp/ruby/build/trunk' I, [2024-05-22T00:31:01.709256 #2792304] INFO -- : make[1]: Leaving directory '/tmp/ruby/build/trunk' I, [2024-05-22T00:31:01.710538 #2792304] INFO -- : generating makefile exts.mk I, [2024-05-22T00:31:01.747716 #2792304] INFO -- : exts.mk unchanged I, [2024-05-22T00:31:01.753241 #2792304] INFO -- : make[1]: Entering directory '/tmp/ruby/build/trunk' I, [2024-05-22T00:31:01.771667 #2792304] INFO -- : make[2]: Entering directory '/tmp/ruby/build/trunk/ext/digest' I, [2024-05-22T00:31:01.773440 #2792304] INFO -- : make[2]: Entering directory '/tmp/ruby/build/trunk/ext/coverage' I, [2024-05-22T00:31:01.773552 #2792304] INFO -- : make[2]: Entering directory '/tmp/ruby/build/trunk/ext/json' I, [2024-05-22T00:31:01.774113 #2792304] INFO -- : make[2]: Entering directory '/tmp/ruby/build/trunk/ext/date' I, [2024-05-22T00:31:01.774280 #2792304] INFO -- : make[2]: Entering directory '/tmp/ruby/build/trunk/ext/io/console' I, [2024-05-22T00:31:01.775295 #2792304] INFO -- : make[2]: Entering directory '/tmp/ruby/build/trunk/ext/rubyvm' I, [2024-05-22T00:31:01.775500 #2792304] INFO -- : make[2]: Entering directory '/tmp/ruby/build/trunk/ext/monitor' I, [2024-05-22T00:31:01.776158 #2792304] INFO -- : make[2]: Entering directory '/tmp/ruby/build/trunk/ext/pathname' I, [2024-05-22T00:31:01.776686 #2792304] INFO -- : make[2]: Leaving directory '/tmp/ruby/build/trunk/ext/digest' I, [2024-05-22T00:31:01.776718 #2792304] INFO -- : make[2]: Entering directory '/tmp/ruby/build/trunk/ext/pty' I, [2024-05-22T00:31:01.776733 #2792304] INFO -- : make[2]: Entering directory '/tmp/ruby/build/trunk/ext/fiddle' I, [2024-05-22T00:31:01.777384 #2792304] INFO -- : make[2]: Leaving directory '/tmp/ruby/build/trunk/ext/coverage' I, [2024-05-22T00:31:01.777702 #2792304] INFO -- : make[2]: Leaving directory '/tmp/ruby/build/trunk/ext/io/console' I, [2024-05-22T00:31:01.777880 #2792304] INFO -- : make[2]: Entering directory '/tmp/ruby/build/trunk/ext/objspace' I, [2024-05-22T00:31:01.777891 #2792304] INFO -- : make[2]: Leaving directory '/tmp/ruby/build/trunk/ext/rubyvm' I, [2024-05-22T00:31:01.778420 #2792304] INFO -- : make[2]: Leaving directory '/tmp/ruby/build/trunk/ext/date' I, [2024-05-22T00:31:01.778444 #2792304] INFO -- : make[2]: Entering directory '/tmp/ruby/build/trunk/ext/psych' I, [2024-05-22T00:31:01.778608 #2792304] INFO -- : make[2]: Entering directory '/tmp/ruby/build/trunk/.bundle/gems/bigdecimal-3.1.8/ext/bigdecimal' I, [2024-05-22T00:31:01.779419 #2792304] INFO -- : make[2]: Leaving directory '/tmp/ruby/build/trunk/ext/pathname' I, [2024-05-22T00:31:01.779909 #2792304] INFO -- : make[2]: Leaving directory '/tmp/ruby/build/trunk/ext/pty' I, [2024-05-22T00:31:01.780254 #2792304] INFO -- : make[2]: Entering directory '/tmp/ruby/build/trunk/.bundle/gems/debug-1.9.2/ext/debug' I, [2024-05-22T00:31:01.780493 #2792304] INFO -- : make[2]: Entering directory '/tmp/ruby/build/trunk/.bundle/gems/nkf-0.2.0/ext/nkf' I, [2024-05-22T00:31:01.780525 #2792304] INFO -- : make[2]: Entering directory '/tmp/ruby/build/trunk/.bundle/gems/racc-1.7.3/ext/racc/cparse' I, [2024-05-22T00:31:01.780692 #2792304] INFO -- : make[2]: Entering directory '/tmp/ruby/build/trunk/.bundle/gems/racc-1.8.0/ext/racc/cparse' I, [2024-05-22T00:31:01.781071 #2792304] INFO -- : make[2]: Entering directory '/tmp/ruby/build/trunk/ext/ripper' I, [2024-05-22T00:31:01.781368 #2792304] INFO -- : make[2]: Entering directory '/tmp/ruby/build/trunk/.bundle/gems/rbs-3.4.4/ext/rbs_extension' I, [2024-05-22T00:31:01.781744 #2792304] INFO -- : make[2]: Entering directory '/tmp/ruby/build/trunk/.bundle/gems/syslog-0.1.2/ext/syslog' I, [2024-05-22T00:31:01.782092 #2792304] INFO -- : make[2]: Leaving directory '/tmp/ruby/build/trunk/ext/objspace' I, [2024-05-22T00:31:01.783117 #2792304] INFO -- : make[2]: Leaving directory '/tmp/ruby/build/trunk/ext/json' I, [2024-05-22T00:31:01.783257 #2792304] INFO -- : make[2]: Leaving directory '/tmp/ruby/build/trunk/ext/fiddle' I, [2024-05-22T00:31:01.784705 #2792304] INFO -- : make[2]: Entering directory '/tmp/ruby/build/trunk/ext/digest/sha2' I, [2024-05-22T00:31:01.785777 #2792304] INFO -- : make[2]: Entering directory '/tmp/ruby/build/trunk/ext/socket' I, [2024-05-22T00:31:01.786567 #2792304] INFO -- : make[2]: Leaving directory '/tmp/ruby/build/trunk/ext/monitor' I, [2024-05-22T00:31:01.788158 #2792304] INFO -- : make[2]: Leaving directory '/tmp/ruby/build/trunk/ext/digest/sha2' I, [2024-05-22T00:31:01.788471 #2792304] INFO -- : make[2]: Leaving directory '/tmp/ruby/build/trunk/ext/ripper' I, [2024-05-22T00:31:01.789846 #2792304] INFO -- : make[2]: Leaving directory '/tmp/ruby/build/trunk/ext/psych' I, [2024-05-22T00:31:01.790586 #2792304] INFO -- : make[2]: Entering directory '/tmp/ruby/build/trunk/ext/openssl' I, [2024-05-22T00:31:01.794264 #2792304] INFO -- : make[2]: Leaving directory '/tmp/ruby/build/trunk/ext/socket' I, [2024-05-22T00:31:01.801787 #2792304] INFO -- : make[2]: Leaving directory '/tmp/ruby/build/trunk/ext/openssl' I, [2024-05-22T00:31:01.803855 #2792304] INFO -- : make[2]: Leaving directory '/tmp/ruby/build/trunk/.bundle/gems/debug-1.9.2/ext/debug' I, [2024-05-22T00:31:01.804748 #2792304] INFO -- : make[2]: Leaving directory '/tmp/ruby/build/trunk/.bundle/gems/rbs-3.4.4/ext/rbs_extension' I, [2024-05-22T00:31:01.807170 #2792304] INFO -- : make[2]: Leaving directory '/tmp/ruby/build/trunk/.bundle/gems/racc-1.8.0/ext/racc/cparse' I, [2024-05-22T00:31:01.807324 #2792304] INFO -- : make[2]: Leaving directory '/tmp/ruby/build/trunk/.bundle/gems/syslog-0.1.2/ext/syslog' I, [2024-05-22T00:31:01.808680 #2792304] INFO -- : make[2]: Leaving directory '/tmp/ruby/build/trunk/.bundle/gems/racc-1.7.3/ext/racc/cparse' I, [2024-05-22T00:31:01.811098 #2792304] INFO -- : make[2]: Leaving directory '/tmp/ruby/build/trunk/.bundle/gems/bigdecimal-3.1.8/ext/bigdecimal' I, [2024-05-22T00:31:01.813705 #2792304] INFO -- : make[2]: Leaving directory '/tmp/ruby/build/trunk/.bundle/gems/nkf-0.2.0/ext/nkf' I, [2024-05-22T00:31:01.838942 #2792304] INFO -- : make[2]: Entering directory '/tmp/ruby/build/trunk' I, [2024-05-22T00:31:01.906640 #2792304] INFO -- : linking ruby I, [2024-05-22T00:31:01.929172 #2792304] INFO -- : make[2]: Leaving directory '/tmp/ruby/build/trunk' I, [2024-05-22T00:31:01.929736 #2792304] INFO -- : make[1]: Leaving directory '/tmp/ruby/build/trunk' I, [2024-05-22T00:31:01.933663 #2792304] INFO -- : make[1]: Entering directory '/tmp/ruby/build/trunk' I, [2024-05-22T00:31:01.933730 #2792304] INFO -- : make[1]: Nothing to be done for 'note'. I, [2024-05-22T00:31:01.933747 #2792304] INFO -- : make[1]: Leaving directory '/tmp/ruby/build/trunk' I, [2024-05-22T00:31:01.934434 #2792304] INFO -- : $$$[end] "make all -j20" exit with 0. I, [2024-05-22T00:31:01.934643 #2792304] INFO -- : $$$[beg] make install -j20 I, [2024-05-22T00:31:01.997232 #2792304] INFO -- : Update power_assert to 84e85124c5014a139af39161d484156cfe87a9ed I, [2024-05-22T00:31:01.997382 #2792304] INFO -- : Update rbs to ba7872795d5de04adb8ff500c0e6afdc81a041dd I, [2024-05-22T00:31:01.998172 #2792304] INFO -- : Update typeprof to b19a6416da3a05d57fadd6ffdadb382b6d236ca5 I, [2024-05-22T00:31:01.998936 #2792304] INFO -- : echo 84e85124c5014a139af39161d484156cfe87a9ed | /bin/sh /tmp/ruby/src/trunk/tool/ifchange /tmp/ruby/src/trunk/.bundle/.timestamp/power_assert.revision - I, [2024-05-22T00:31:01.999058 #2792304] INFO -- : echo ba7872795d5de04adb8ff500c0e6afdc81a041dd | /bin/sh /tmp/ruby/src/trunk/tool/ifchange /tmp/ruby/src/trunk/.bundle/.timestamp/rbs.revision - I, [2024-05-22T00:31:01.999682 #2792304] INFO -- : BASERUBY = /usr/bin/ruby --disable=gems I, [2024-05-22T00:31:01.999709 #2792304] INFO -- : CC = gcc I, [2024-05-22T00:31:01.999717 #2792304] INFO -- : LD = ld I, [2024-05-22T00:31:01.999724 #2792304] INFO -- : LDSHARED = gcc -shared I, [2024-05-22T00:31:01.999728 #2792304] INFO -- : CFLAGS = -O3 -fno-fast-math -ggdb3 -Wall -Wextra -Wdeprecated-declarations -Wdiv-by-zero -Wduplicated-cond -Wimplicit-function-declaration -Wimplicit-int -Wpointer-arith -Wwrite-strings -Wold-style-definition -Wimplicit-fallthrough=0 -Wmissing-noreturn -Wno-cast-function-type -Wno-constant-logical-operand -Wno-long-long -Wno-missing-field-initializers -Wno-overlength-strings -Wno-packed-bitfield-compat -Wno-parentheses-equality -Wno-self-assign -Wno-tautological-compare -Wno-unused-parameter -Wno-unused-value -Wsuggest-attribute=format -Wsuggest-attribute=noreturn -Wunused-variable -Wmisleading-indentation -Wundef -fPIC I, [2024-05-22T00:31:01.999733 #2792304] INFO -- : XCFLAGS = -U_FORTIFY_SOURCE -D_FORTIFY_SOURCE=2 -fstack-protector-strong -fno-strict-overflow -fvisibility=hidden -fexcess-precision=standard -DRUBY_EXPORT -I. -I.ext/include/x86_64-linux -I/tmp/ruby/src/trunk/include -I/tmp/ruby/src/trunk -I/tmp/ruby/src/trunk/prism -I/tmp/ruby/src/trunk/enc/unicode/15.0.0 I, [2024-05-22T00:31:01.999737 #2792304] INFO -- : CPPFLAGS = I, [2024-05-22T00:31:01.999740 #2792304] INFO -- : DLDFLAGS = -Wl,--compress-debug-sections=zlib -Wl,-soname,libruby.so.3.4 -fstack-protector-strong I, [2024-05-22T00:31:01.999744 #2792304] INFO -- : SOLIBS = -lz -lrt -lrt -lgmp -ldl -lcrypt -lm -lpthread I, [2024-05-22T00:31:01.999747 #2792304] INFO -- : LANG = en_US.UTF-8 I, [2024-05-22T00:31:01.999751 #2792304] INFO -- : LC_ALL = I, [2024-05-22T00:31:01.999756 #2792304] INFO -- : LC_CTYPE = I, [2024-05-22T00:31:01.999760 #2792304] INFO -- : MFLAGS = -j20 --jobserver-auth=4,5 I, [2024-05-22T00:31:01.999763 #2792304] INFO -- : RUSTC = no I, [2024-05-22T00:31:01.999768 #2792304] INFO -- : YJIT_RUSTC_ARGS = --crate-name=yjit --crate-type=staticlib --edition=2021 -g -C lto=thin -C opt-level=3 -C overflow-checks=on '--out-dir=/tmp/ruby/build/trunk/yjit/target/release/' /tmp/ruby/src/trunk/yjit/src/lib.rs I, [2024-05-22T00:31:02.000939 #2792304] INFO -- : /tmp/ruby/src/trunk/.bundle/.timestamp/power_assert.revision unchanged I, [2024-05-22T00:31:02.000999 #2792304] INFO -- : /tmp/ruby/src/trunk/.bundle/.timestamp/rbs.revision unchanged I, [2024-05-22T00:31:02.030300 #2792304] INFO -- : echo b19a6416da3a05d57fadd6ffdadb382b6d236ca5 | /bin/sh /tmp/ruby/src/trunk/tool/ifchange /tmp/ruby/src/trunk/.bundle/.timestamp/typeprof.revision - I, [2024-05-22T00:31:02.031005 #2792304] INFO -- : gcc (Ubuntu 11.4.0-1ubuntu1~22.04) 11.4.0 I, [2024-05-22T00:31:02.031026 #2792304] INFO -- : Copyright (C) 2021 Free Software Foundation, Inc. I, [2024-05-22T00:31:02.031032 #2792304] INFO -- : This is free software; see the source for copying conditions. There is NO I, [2024-05-22T00:31:02.031043 #2792304] INFO -- : warranty; not even for MERCHANTABILITY or FITNESS FOR A PARTICULAR PURPOSE. I, [2024-05-22T00:31:02.031046 #2792304] INFO -- : I, [2024-05-22T00:31:02.031052 #2792304] INFO -- : generating encdb.h I, [2024-05-22T00:31:02.031670 #2792304] INFO -- : generating enc.mk I, [2024-05-22T00:31:02.032285 #2792304] INFO -- : /tmp/ruby/src/trunk/.bundle/.timestamp/typeprof.revision unchanged I, [2024-05-22T00:31:02.055474 #2792304] INFO -- : encdb.h unchanged I, [2024-05-22T00:31:02.056714 #2792304] INFO -- : Building power_assert@84e85124c5014a139af39161d484156cfe87a9ed to /tmp/ruby/src/trunk/gems/power_assert-2.0.3.gem I, [2024-05-22T00:31:02.125669 #2792304] INFO -- : Successfully built RubyGem I, [2024-05-22T00:31:02.125706 #2792304] INFO -- : Name: power_assert I, [2024-05-22T00:31:02.125712 #2792304] INFO -- : Version: 2.0.4dev I, [2024-05-22T00:31:02.125716 #2792304] INFO -- : File: power_assert-2.0.4dev.gem I, [2024-05-22T00:31:02.127642 #2792304] INFO -- : Extracting bundle gem power_assert-2.0.3... I, [2024-05-22T00:31:02.153516 #2792304] INFO -- : making srcs under enc I, [2024-05-22T00:31:02.153646 #2792304] INFO -- : making enc I, [2024-05-22T00:31:02.170676 #2792304] INFO -- : make[1]: Entering directory '/tmp/ruby/build/trunk' I, [2024-05-22T00:31:02.170701 #2792304] INFO -- : make[1]: Nothing to be done for 'enc'. I, [2024-05-22T00:31:02.170708 #2792304] INFO -- : make[1]: Leaving directory '/tmp/ruby/build/trunk' I, [2024-05-22T00:31:02.184283 #2792304] INFO -- : make[1]: Entering directory '/tmp/ruby/build/trunk' I, [2024-05-22T00:31:02.184308 #2792304] INFO -- : make[1]: Nothing to be done for 'srcs'. I, [2024-05-22T00:31:02.184314 #2792304] INFO -- : make[1]: Leaving directory '/tmp/ruby/build/trunk' I, [2024-05-22T00:31:02.185086 #2792304] INFO -- : generating transdb.h I, [2024-05-22T00:31:02.189235 #2792304] INFO -- : Try with hash version of bundled gems instead of gems/power_assert-2.0.3.gem. We don't use this gem with release version of Ruby. I, [2024-05-22T00:31:02.194229 #2792304] INFO -- : Unpacked gems/power_assert-2.0.4dev.gem I, [2024-05-22T00:31:02.281869 #2792304] INFO -- : transdb.h unchanged I, [2024-05-22T00:31:02.283455 #2792304] INFO -- : generating makefiles ext/configure-ext.mk I, [2024-05-22T00:31:02.283629 #2792304] INFO -- : making trans I, [2024-05-22T00:31:02.310676 #2792304] INFO -- : ext/configure-ext.mk unchanged I, [2024-05-22T00:31:02.312896 #2792304] INFO -- : make[1]: Entering directory '/tmp/ruby/build/trunk' I, [2024-05-22T00:31:02.318133 #2792304] INFO -- : make[1]: Entering directory '/tmp/ruby/build/trunk' I, [2024-05-22T00:31:02.318226 #2792304] INFO -- : make[1]: Nothing to be done for 'trans'. I, [2024-05-22T00:31:02.318237 #2792304] INFO -- : make[1]: Leaving directory '/tmp/ruby/build/trunk' I, [2024-05-22T00:31:02.319137 #2792304] INFO -- : making encs I, [2024-05-22T00:31:02.376738 #2792304] INFO -- : make[1]: Entering directory '/tmp/ruby/build/trunk' I, [2024-05-22T00:31:02.376819 #2792304] INFO -- : make[1]: Nothing to be done for 'encs'. I, [2024-05-22T00:31:02.376844 #2792304] INFO -- : make[1]: Leaving directory '/tmp/ruby/build/trunk' I, [2024-05-22T00:31:02.466865 #2792304] INFO -- : make[1]: Leaving directory '/tmp/ruby/build/trunk' I, [2024-05-22T00:31:02.467491 #2792304] INFO -- : generating makefile exts.mk I, [2024-05-22T00:31:02.505292 #2792304] INFO -- : exts.mk unchanged I, [2024-05-22T00:31:02.510070 #2792304] INFO -- : make[1]: Entering directory '/tmp/ruby/build/trunk' I, [2024-05-22T00:31:02.528163 #2792304] INFO -- : make[2]: Entering directory '/tmp/ruby/build/trunk/ext/digest' I, [2024-05-22T00:31:02.529553 #2792304] INFO -- : make[2]: Entering directory '/tmp/ruby/build/trunk/ext/json' I, [2024-05-22T00:31:02.529619 #2792304] INFO -- : make[2]: Entering directory '/tmp/ruby/build/trunk/ext/coverage' I, [2024-05-22T00:31:02.530582 #2792304] INFO -- : make[2]: Entering directory '/tmp/ruby/build/trunk/ext/io/console' I, [2024-05-22T00:31:02.530626 #2792304] INFO -- : make[2]: Entering directory '/tmp/ruby/build/trunk/ext/date' I, [2024-05-22T00:31:02.531532 #2792304] INFO -- : make[2]: Entering directory '/tmp/ruby/build/trunk/ext/monitor' I, [2024-05-22T00:31:02.531986 #2792304] INFO -- : make[2]: Entering directory '/tmp/ruby/build/trunk/ext/rubyvm' I, [2024-05-22T00:31:02.532371 #2792304] INFO -- : make[2]: Leaving directory '/tmp/ruby/build/trunk/ext/digest' I, [2024-05-22T00:31:02.532438 #2792304] INFO -- : make[2]: Entering directory '/tmp/ruby/build/trunk/ext/pathname' I, [2024-05-22T00:31:02.532985 #2792304] INFO -- : make[2]: Entering directory '/tmp/ruby/build/trunk/ext/fiddle' I, [2024-05-22T00:31:02.533021 #2792304] INFO -- : make[2]: Leaving directory '/tmp/ruby/build/trunk/ext/io/console' I, [2024-05-22T00:31:02.533165 #2792304] INFO -- : make[2]: Entering directory '/tmp/ruby/build/trunk/ext/pty' I, [2024-05-22T00:31:02.533268 #2792304] INFO -- : make[2]: Leaving directory '/tmp/ruby/build/trunk/ext/coverage' I, [2024-05-22T00:31:02.534051 #2792304] INFO -- : make[2]: Leaving directory '/tmp/ruby/build/trunk/ext/rubyvm' I, [2024-05-22T00:31:02.534084 #2792304] INFO -- : make[2]: Leaving directory '/tmp/ruby/build/trunk/ext/monitor' I, [2024-05-22T00:31:02.534206 #2792304] INFO -- : make[2]: Entering directory '/tmp/ruby/build/trunk/ext/objspace' I, [2024-05-22T00:31:02.534449 #2792304] INFO -- : make[2]: Entering directory '/tmp/ruby/build/trunk/ext/psych' I, [2024-05-22T00:31:02.534813 #2792304] INFO -- : make[2]: Leaving directory '/tmp/ruby/build/trunk/ext/date' I, [2024-05-22T00:31:02.534968 #2792304] INFO -- : make[2]: Leaving directory '/tmp/ruby/build/trunk/ext/pathname' I, [2024-05-22T00:31:02.535534 #2792304] INFO -- : make[2]: Leaving directory '/tmp/ruby/build/trunk/ext/pty' I, [2024-05-22T00:31:02.535683 #2792304] INFO -- : make[2]: Entering directory '/tmp/ruby/build/trunk/.bundle/gems/bigdecimal-3.1.8/ext/bigdecimal' I, [2024-05-22T00:31:02.535704 #2792304] INFO -- : make[2]: Entering directory '/tmp/ruby/build/trunk/.bundle/gems/debug-1.9.2/ext/debug' I, [2024-05-22T00:31:02.536330 #2792304] INFO -- : make[2]: Entering directory '/tmp/ruby/build/trunk/.bundle/gems/nkf-0.2.0/ext/nkf' I, [2024-05-22T00:31:02.536431 #2792304] INFO -- : make[2]: Entering directory '/tmp/ruby/build/trunk/.bundle/gems/racc-1.7.3/ext/racc/cparse' I, [2024-05-22T00:31:02.537563 #2792304] INFO -- : make[2]: Leaving directory '/tmp/ruby/build/trunk/ext/objspace' I, [2024-05-22T00:31:02.538090 #2792304] INFO -- : make[2]: Entering directory '/tmp/ruby/build/trunk/ext/ripper' I, [2024-05-22T00:31:02.538764 #2792304] INFO -- : make[2]: Entering directory '/tmp/ruby/build/trunk/.bundle/gems/racc-1.8.0/ext/racc/cparse' I, [2024-05-22T00:31:02.538809 #2792304] INFO -- : make[2]: Leaving directory '/tmp/ruby/build/trunk/ext/json' I, [2024-05-22T00:31:02.539274 #2792304] INFO -- : make[2]: Entering directory '/tmp/ruby/build/trunk/.bundle/gems/syslog-0.1.2/ext/syslog' I, [2024-05-22T00:31:02.539402 #2792304] INFO -- : make[2]: Entering directory '/tmp/ruby/build/trunk/.bundle/gems/rbs-3.4.4/ext/rbs_extension' I, [2024-05-22T00:31:02.542568 #2792304] INFO -- : make[2]: Leaving directory '/tmp/ruby/build/trunk/ext/fiddle' I, [2024-05-22T00:31:02.543112 #2792304] INFO -- : make[2]: Entering directory '/tmp/ruby/build/trunk/ext/socket' I, [2024-05-22T00:31:02.543359 #2792304] INFO -- : make[2]: Leaving directory '/tmp/ruby/build/trunk/ext/ripper' I, [2024-05-22T00:31:02.544423 #2792304] INFO -- : make[2]: Entering directory '/tmp/ruby/build/trunk/ext/openssl' I, [2024-05-22T00:31:02.545513 #2792304] INFO -- : make[2]: Leaving directory '/tmp/ruby/build/trunk/ext/psych' I, [2024-05-22T00:31:02.547246 #2792304] INFO -- : make[2]: Entering directory '/tmp/ruby/build/trunk/ext/digest/sha2' I, [2024-05-22T00:31:02.549473 #2792304] INFO -- : make[2]: Leaving directory '/tmp/ruby/build/trunk/ext/digest/sha2' I, [2024-05-22T00:31:02.551712 #2792304] INFO -- : make[2]: Leaving directory '/tmp/ruby/build/trunk/ext/socket' I, [2024-05-22T00:31:02.558744 #2792304] INFO -- : make[2]: Leaving directory '/tmp/ruby/build/trunk/.bundle/gems/debug-1.9.2/ext/debug' I, [2024-05-22T00:31:02.558846 #2792304] INFO -- : make[2]: Leaving directory '/tmp/ruby/build/trunk/.bundle/gems/racc-1.7.3/ext/racc/cparse' I, [2024-05-22T00:31:02.561068 #2792304] INFO -- : make[2]: Leaving directory '/tmp/ruby/build/trunk/.bundle/gems/syslog-0.1.2/ext/syslog' I, [2024-05-22T00:31:02.561109 #2792304] INFO -- : make[2]: Leaving directory '/tmp/ruby/build/trunk/ext/openssl' I, [2024-05-22T00:31:02.563115 #2792304] INFO -- : make[2]: Leaving directory '/tmp/ruby/build/trunk/.bundle/gems/racc-1.8.0/ext/racc/cparse' I, [2024-05-22T00:31:02.563328 #2792304] INFO -- : make[2]: Leaving directory '/tmp/ruby/build/trunk/.bundle/gems/nkf-0.2.0/ext/nkf' I, [2024-05-22T00:31:02.568855 #2792304] INFO -- : make[2]: Leaving directory '/tmp/ruby/build/trunk/.bundle/gems/bigdecimal-3.1.8/ext/bigdecimal' I, [2024-05-22T00:31:02.571051 #2792304] INFO -- : make[2]: Leaving directory '/tmp/ruby/build/trunk/.bundle/gems/rbs-3.4.4/ext/rbs_extension' I, [2024-05-22T00:31:02.594705 #2792304] INFO -- : make[2]: Entering directory '/tmp/ruby/build/trunk' I, [2024-05-22T00:31:02.660398 #2792304] INFO -- : make[2]: 'ruby' is up to date. I, [2024-05-22T00:31:02.660440 #2792304] INFO -- : make[2]: Leaving directory '/tmp/ruby/build/trunk' I, [2024-05-22T00:31:02.660883 #2792304] INFO -- : make[1]: Leaving directory '/tmp/ruby/build/trunk' I, [2024-05-22T00:31:02.664975 #2792304] INFO -- : make[1]: Entering directory '/tmp/ruby/build/trunk' I, [2024-05-22T00:31:02.664996 #2792304] INFO -- : make[1]: Nothing to be done for 'note'. I, [2024-05-22T00:31:02.665002 #2792304] INFO -- : make[1]: Leaving directory '/tmp/ruby/build/trunk' I, [2024-05-22T00:31:02.665307 #2792304] INFO -- : ./miniruby -I/tmp/ruby/src/trunk/lib -I. -I.ext/common /tmp/ruby/src/trunk/tool/runruby.rb --extout=.ext -- --disable-gems -r./x86_64-linux-fake /tmp/ruby/src/trunk/tool/rbinstall.rb --make="make" --dest-dir="" --extout=".ext" --ext-build-dir="./ext" --mflags="-j20 --jobserver-auth=4,5" --make-flags=" -j20 --jobserver-auth=4,5" --data-mode=0644 --prog-mode=0755 --installed-list .installed.list --mantype="doc" --gnumake --install=all --exclude=doc I, [2024-05-22T00:31:02.763205 #2792304] INFO -- : Installing to I, [2024-05-22T00:31:02.763265 #2792304] INFO -- : installing binary commands: /tmp/ruby/install/trunk/bin I, [2024-05-22T00:31:02.763358 #2792304] INFO -- : installing base libraries: /tmp/ruby/install/trunk/lib I, [2024-05-22T00:31:02.770751 #2792304] INFO -- : installing arch files: /tmp/ruby/install/trunk/lib/ruby/3.4.0+0/x86_64-linux I, [2024-05-22T00:31:02.770781 #2792304] INFO -- : installing pkgconfig data: /tmp/ruby/install/trunk/lib/pkgconfig I, [2024-05-22T00:31:02.770787 #2792304] INFO -- : installing extension objects: /tmp/ruby/install/trunk/lib/ruby/3.4.0+0/x86_64-linux I, [2024-05-22T00:31:02.780414 #2792304] INFO -- : installing extension objects: /tmp/ruby/install/trunk/lib/ruby/site_ruby/3.4.0+0/x86_64-linux I, [2024-05-22T00:31:02.780437 #2792304] INFO -- : installing extension objects: /tmp/ruby/install/trunk/lib/ruby/vendor_ruby/3.4.0+0/x86_64-linux I, [2024-05-22T00:31:02.780444 #2792304] INFO -- : installing extension headers: /tmp/ruby/install/trunk/include/ruby-3.4.0+0/x86_64-linux I, [2024-05-22T00:31:02.780600 #2792304] INFO -- : installing extension scripts: /tmp/ruby/install/trunk/lib/ruby/3.4.0+0 I, [2024-05-22T00:31:02.783354 #2792304] INFO -- : installing extension scripts: /tmp/ruby/install/trunk/lib/ruby/site_ruby/3.4.0+0 I, [2024-05-22T00:31:02.783378 #2792304] INFO -- : installing extension scripts: /tmp/ruby/install/trunk/lib/ruby/vendor_ruby/3.4.0+0 I, [2024-05-22T00:31:02.783383 #2792304] INFO -- : installing extension headers: /tmp/ruby/install/trunk/include/ruby-3.4.0+0/ruby I, [2024-05-22T00:31:02.783387 #2792304] INFO -- : installing command scripts: /tmp/ruby/install/trunk/bin I, [2024-05-22T00:31:02.783397 #2792304] INFO -- : installing library scripts: /tmp/ruby/install/trunk/lib/ruby/3.4.0+0 I, [2024-05-22T00:31:02.816232 #2792304] INFO -- : installing common headers: /tmp/ruby/install/trunk/include/ruby-3.4.0+0 I, [2024-05-22T00:31:02.822560 #2792304] INFO -- : installing manpages: /tmp/ruby/install/trunk/share/man/man1 I, [2024-05-22T00:31:02.822586 #2792304] INFO -- : installing default gems from lib: /tmp/ruby/install/trunk/lib/ruby/gems/3.4.0+0 I, [2024-05-22T00:31:02.845618 #2792304] INFO -- : benchmark 0.3.0 I, [2024-05-22T00:31:02.847525 #2792304] INFO -- : bundler 2.6.0.dev I, [2024-05-22T00:31:02.849657 #2792304] INFO -- : cgi 0.4.1 I, [2024-05-22T00:31:02.850224 #2792304] INFO -- : delegate 0.3.1 I, [2024-05-22T00:31:02.850717 #2792304] INFO -- : did_you_mean 1.6.3 I, [2024-05-22T00:31:02.851185 #2792304] INFO -- : english 0.8.0 I, [2024-05-22T00:31:02.851636 #2792304] INFO -- : erb 4.0.4 I, [2024-05-22T00:31:02.852626 #2792304] INFO -- : error_highlight 0.6.0 I, [2024-05-22T00:31:02.853390 #2792304] INFO -- : fileutils 1.7.2 I, [2024-05-22T00:31:02.854134 #2792304] INFO -- : find 0.2.0 I, [2024-05-22T00:31:02.854970 #2792304] INFO -- : forwardable 1.3.3 I, [2024-05-22T00:31:02.855877 #2792304] INFO -- : ipaddr 1.2.6 I, [2024-05-22T00:31:02.856765 #2792304] INFO -- : irb 1.13.1 I, [2024-05-22T00:31:02.857560 #2792304] INFO -- : logger 1.6.0 I, [2024-05-22T00:31:02.858051 #2792304] INFO -- : net-http 0.4.1 I, [2024-05-22T00:31:02.858551 #2792304] INFO -- : net-protocol 0.2.2 I, [2024-05-22T00:31:02.859038 #2792304] INFO -- : open-uri 0.4.1 I, [2024-05-22T00:31:02.859532 #2792304] INFO -- : open3 0.2.1 I, [2024-05-22T00:31:02.860039 #2792304] INFO -- : optparse 0.5.0 I, [2024-05-22T00:31:02.860512 #2792304] INFO -- : ostruct 0.6.0 I, [2024-05-22T00:31:02.860866 #2792304] INFO -- : pp 0.5.0 I, [2024-05-22T00:31:02.861382 #2792304] INFO -- : prettyprint 0.2.0 I, [2024-05-22T00:31:02.861837 #2792304] INFO -- : prism 0.29.0 I, [2024-05-22T00:31:02.862323 #2792304] INFO -- : pstore 0.1.3 I, [2024-05-22T00:31:02.862889 #2792304] INFO -- : rdoc 6.6.3.1 I, [2024-05-22T00:31:02.863876 #2792304] INFO -- : readline 0.0.4 I, [2024-05-22T00:31:02.864377 #2792304] INFO -- : reline 0.5.7 I, [2024-05-22T00:31:02.864926 #2792304] INFO -- : resolv 0.4.0 I, [2024-05-22T00:31:02.865392 #2792304] INFO -- : ruby2_keywords 0.0.5 I, [2024-05-22T00:31:02.865899 #2792304] INFO -- : securerandom 0.3.1 I, [2024-05-22T00:31:02.866835 #2792304] INFO -- : set 1.1.0 I, [2024-05-22T00:31:02.867709 #2792304] INFO -- : shellwords 0.2.0 I, [2024-05-22T00:31:02.868190 #2792304] INFO -- : singleton 0.2.0 I, [2024-05-22T00:31:02.868641 #2792304] INFO -- : syntax_suggest 2.0.0 I, [2024-05-22T00:31:02.869252 #2792304] INFO -- : tempfile 0.2.1 I, [2024-05-22T00:31:02.869790 #2792304] INFO -- : time 0.3.0 I, [2024-05-22T00:31:02.870283 #2792304] INFO -- : timeout 0.4.1 I, [2024-05-22T00:31:02.870732 #2792304] INFO -- : tmpdir 0.2.0 I, [2024-05-22T00:31:02.871199 #2792304] INFO -- : tsort 0.2.0 I, [2024-05-22T00:31:02.871655 #2792304] INFO -- : un 0.3.0 I, [2024-05-22T00:31:02.872053 #2792304] INFO -- : uri 0.13.0 I, [2024-05-22T00:31:02.872556 #2792304] INFO -- : weakref 0.1.3 I, [2024-05-22T00:31:02.873004 #2792304] INFO -- : yaml 0.3.0 I, [2024-05-22T00:31:02.873471 #2792304] INFO -- : installing default gems from ext: /tmp/ruby/install/trunk/lib/ruby/gems/3.4.0+0 I, [2024-05-22T00:31:02.880013 #2792304] INFO -- : date 3.3.4 I, [2024-05-22T00:31:02.880545 #2792304] INFO -- : digest 3.1.1 I, [2024-05-22T00:31:02.881037 #2792304] INFO -- : etc 1.4.3 I, [2024-05-22T00:31:02.881553 #2792304] INFO -- : fcntl 1.1.0 I, [2024-05-22T00:31:02.882018 #2792304] INFO -- : fiddle 1.1.3 I, [2024-05-22T00:31:02.882515 #2792304] INFO -- : io-console 0.7.2 I, [2024-05-22T00:31:02.882922 #2792304] INFO -- : io-nonblock 0.3.0 I, [2024-05-22T00:31:02.883370 #2792304] INFO -- : io-wait 0.3.1 I, [2024-05-22T00:31:02.883911 #2792304] INFO -- : json 2.7.2 I, [2024-05-22T00:31:02.884495 #2792304] INFO -- : openssl 3.2.0 I, [2024-05-22T00:31:02.885078 #2792304] INFO -- : pathname 0.3.0 I, [2024-05-22T00:31:02.885548 #2792304] INFO -- : psych 5.1.2 I, [2024-05-22T00:31:02.886097 #2792304] INFO -- : stringio 3.1.1 I, [2024-05-22T00:31:02.886591 #2792304] INFO -- : strscan 3.1.1 I, [2024-05-22T00:31:02.887056 #2792304] INFO -- : zlib 3.1.0 I, [2024-05-22T00:31:02.887350 #2792304] INFO -- : installing bundled gems: /tmp/ruby/install/trunk/lib/ruby/gems/3.4.0+0 I, [2024-05-22T00:31:02.887928 #2792304] INFO -- : minitest 5.23.0 I, [2024-05-22T00:31:02.896390 #2792304] INFO -- : rake 13.2.1 I, [2024-05-22T00:31:02.899989 #2792304] INFO -- : test-unit 3.6.2 I, [2024-05-22T00:31:02.904784 #2792304] INFO -- : rexml 3.2.8 I, [2024-05-22T00:31:02.908673 #2792304] INFO -- : rss 0.3.0 I, [2024-05-22T00:31:02.911268 #2792304] INFO -- : net-ftp 0.3.4 I, [2024-05-22T00:31:02.912888 #2792304] INFO -- : net-imap 0.4.11 I, [2024-05-22T00:31:02.916681 #2792304] INFO -- : net-pop 0.1.2 I, [2024-05-22T00:31:02.917685 #2792304] INFO -- : net-smtp 0.5.0 I, [2024-05-22T00:31:02.918855 #2792304] INFO -- : matrix 0.4.2 I, [2024-05-22T00:31:02.922149 #2792304] INFO -- : prime 0.1.2 I, [2024-05-22T00:31:02.927028 #2792304] INFO -- : rbs 3.4.4 I, [2024-05-22T00:31:02.949400 #2792304] INFO -- : typeprof 0.21.11 I, [2024-05-22T00:31:02.951694 #2792304] INFO -- : debug 1.9.2 I, [2024-05-22T00:31:02.954774 #2792304] INFO -- : racc 1.8.0 I, [2024-05-22T00:31:02.957844 #2792304] INFO -- : mutex_m 0.2.0 I, [2024-05-22T00:31:02.959165 #2792304] INFO -- : getoptlong 0.2.1 I, [2024-05-22T00:31:02.960552 #2792304] INFO -- : base64 0.2.0 I, [2024-05-22T00:31:02.961638 #2792304] INFO -- : bigdecimal 3.1.8 I, [2024-05-22T00:31:02.963716 #2792304] INFO -- : observer 0.1.2 I, [2024-05-22T00:31:02.965512 #2792304] INFO -- : abbrev 0.1.2 I, [2024-05-22T00:31:02.966593 #2792304] INFO -- : resolv-replace 0.1.1 I, [2024-05-22T00:31:02.968045 #2792304] INFO -- : rinda 0.2.0 I, [2024-05-22T00:31:02.969422 #2792304] INFO -- : drb 2.2.1 I, [2024-05-22T00:31:02.971033 #2792304] INFO -- : nkf 0.2.0 I, [2024-05-22T00:31:02.973633 #2792304] INFO -- : syslog 0.1.2 I, [2024-05-22T00:31:02.975717 #2792304] INFO -- : csv 3.3.0 I, [2024-05-22T00:31:02.978072 #2792304] INFO -- : installing bundled gem cache: /tmp/ruby/install/trunk/lib/ruby/gems/3.4.0+0/cache I, [2024-05-22T00:31:02.979476 #2792304] INFO -- : skipped bundled gems: I, [2024-05-22T00:31:02.979497 #2792304] INFO -- : power_assert-2.0.4dev.gem not found in bundled_gems I, [2024-05-22T00:31:02.982948 #2792304] INFO -- : $$$[end] "make install -j20" exit with 0. I, [2024-05-22T00:31:02.983045 #2792304] INFO -- : $$$[beg] make yes-btest TESTOPTS='-q -j20' I, [2024-05-22T00:31:08.748138 #2792304] INFO -- : PASS all 1936 tests E, [2024-05-22T00:31:08.753769 #2792304] ERROR -- : I, [2024-05-22T00:31:08.754044 #2792304] INFO -- : $$$[end] "make yes-btest TESTOPTS='-q -j20'" exit with 0. I, [2024-05-22T00:31:08.754133 #2792304] INFO -- : $$$[beg] make yes-test-basic TESTS='-j20' I, [2024-05-22T00:31:08.814501 #2792304] INFO -- : BASERUBY = /usr/bin/ruby --disable=gems I, [2024-05-22T00:31:08.814534 #2792304] INFO -- : CC = gcc I, [2024-05-22T00:31:08.814542 #2792304] INFO -- : LD = ld I, [2024-05-22T00:31:08.814547 #2792304] INFO -- : LDSHARED = gcc -shared I, [2024-05-22T00:31:08.814552 #2792304] INFO -- : CFLAGS = -O3 -fno-fast-math -ggdb3 -Wall -Wextra -Wdeprecated-declarations -Wdiv-by-zero -Wduplicated-cond -Wimplicit-function-declaration -Wimplicit-int -Wpointer-arith -Wwrite-strings -Wold-style-definition -Wimplicit-fallthrough=0 -Wmissing-noreturn -Wno-cast-function-type -Wno-constant-logical-operand -Wno-long-long -Wno-missing-field-initializers -Wno-overlength-strings -Wno-packed-bitfield-compat -Wno-parentheses-equality -Wno-self-assign -Wno-tautological-compare -Wno-unused-parameter -Wno-unused-value -Wsuggest-attribute=format -Wsuggest-attribute=noreturn -Wunused-variable -Wmisleading-indentation -Wundef -fPIC I, [2024-05-22T00:31:08.814559 #2792304] INFO -- : XCFLAGS = -U_FORTIFY_SOURCE -D_FORTIFY_SOURCE=2 -fstack-protector-strong -fno-strict-overflow -fvisibility=hidden -fexcess-precision=standard -DRUBY_EXPORT -I. -I.ext/include/x86_64-linux -I/tmp/ruby/src/trunk/include -I/tmp/ruby/src/trunk -I/tmp/ruby/src/trunk/prism -I/tmp/ruby/src/trunk/enc/unicode/15.0.0 I, [2024-05-22T00:31:08.814564 #2792304] INFO -- : CPPFLAGS = I, [2024-05-22T00:31:08.814569 #2792304] INFO -- : DLDFLAGS = -Wl,--compress-debug-sections=zlib -Wl,-soname,libruby.so.3.4 -fstack-protector-strong I, [2024-05-22T00:31:08.814574 #2792304] INFO -- : SOLIBS = -lz -lrt -lrt -lgmp -ldl -lcrypt -lm -lpthread I, [2024-05-22T00:31:08.814578 #2792304] INFO -- : LANG = en_US.UTF-8 I, [2024-05-22T00:31:08.814583 #2792304] INFO -- : LC_ALL = I, [2024-05-22T00:31:08.814587 #2792304] INFO -- : LC_CTYPE = I, [2024-05-22T00:31:08.814591 #2792304] INFO -- : MFLAGS = I, [2024-05-22T00:31:08.814603 #2792304] INFO -- : RUSTC = no I, [2024-05-22T00:31:08.814608 #2792304] INFO -- : YJIT_RUSTC_ARGS = --crate-name=yjit --crate-type=staticlib --edition=2021 -g -C lto=thin -C opt-level=3 -C overflow-checks=on '--out-dir=/tmp/ruby/build/trunk/yjit/target/release/' /tmp/ruby/src/trunk/yjit/src/lib.rs I, [2024-05-22T00:31:08.815259 #2792304] INFO -- : gcc (Ubuntu 11.4.0-1ubuntu1~22.04) 11.4.0 I, [2024-05-22T00:31:08.815286 #2792304] INFO -- : Copyright (C) 2021 Free Software Foundation, Inc. I, [2024-05-22T00:31:08.815301 #2792304] INFO -- : This is free software; see the source for copying conditions. There is NO I, [2024-05-22T00:31:08.815307 #2792304] INFO -- : warranty; not even for MERCHANTABILITY or FITNESS FOR A PARTICULAR PURPOSE. I, [2024-05-22T00:31:08.815311 #2792304] INFO -- : I, [2024-05-22T00:31:08.927329 #2792304] INFO -- : Checking leaked global symbols...none I, [2024-05-22T00:31:08.971225 #2792304] INFO -- : /tmp/ruby/src/trunk/basictest/test.rb:assignment ....................................................................................................................................................................................................................................................................................................................................................................................OK 372 I, [2024-05-22T00:31:08.971288 #2792304] INFO -- : /tmp/ruby/src/trunk/basictest/test.rb:condition ..OK 2 I, [2024-05-22T00:31:08.971295 #2792304] INFO -- : /tmp/ruby/src/trunk/basictest/test.rb:if/unless ...OK 3 I, [2024-05-22T00:31:08.971300 #2792304] INFO -- : /tmp/ruby/src/trunk/basictest/test.rb:case .....OK 5 I, [2024-05-22T00:31:08.971532 #2792304] INFO -- : /tmp/ruby/src/trunk/basictest/test.rb:while/until ........OK 8 I, [2024-05-22T00:31:08.971593 #2792304] INFO -- : /tmp/ruby/src/trunk/basictest/test.rb:exception ..........OK 10 I, [2024-05-22T00:31:08.971899 #2792304] INFO -- : /tmp/ruby/src/trunk/basictest/test.rb:array .......................................OK 39 I, [2024-05-22T00:31:08.972010 #2792304] INFO -- : /tmp/ruby/src/trunk/basictest/test.rb:hash ...........................OK 27 I, [2024-05-22T00:31:08.972792 #2792304] INFO -- : /tmp/ruby/src/trunk/basictest/test.rb:iterator ...........................................................................................................OK 107 I, [2024-05-22T00:31:08.973092 #2792304] INFO -- : /tmp/ruby/src/trunk/basictest/test.rb:float ................................................................................OK 80 I, [2024-05-22T00:31:08.975127 #2792304] INFO -- : /tmp/ruby/src/trunk/basictest/test.rb:bignum ...............................OK 31 I, [2024-05-22T00:31:08.976039 #2792304] INFO -- : /tmp/ruby/src/trunk/basictest/test.rb:string & char ..............................................................OK 62 I, [2024-05-22T00:31:08.976080 #2792304] INFO -- : /tmp/ruby/src/trunk/basictest/test.rb:assignment ..........OK 10 I, [2024-05-22T00:31:08.976113 #2792304] INFO -- : /tmp/ruby/src/trunk/basictest/test.rb:call ......OK 6 I, [2024-05-22T00:31:08.976175 #2792304] INFO -- : /tmp/ruby/src/trunk/basictest/test.rb:proc .........OK 9 I, [2024-05-22T00:31:09.076825 #2792304] INFO -- : /tmp/ruby/src/trunk/basictest/test.rb:signal ..OK 2 I, [2024-05-22T00:31:09.079666 #2792304] INFO -- : /tmp/ruby/src/trunk/basictest/test.rb:eval ...........................OK 27 I, [2024-05-22T00:31:09.191248 #2792304] INFO -- : /tmp/ruby/src/trunk/basictest/test.rb:system ........OK 8 I, [2024-05-22T00:31:09.191322 #2792304] INFO -- : /tmp/ruby/src/trunk/basictest/test.rb:const .....OK 5 I, [2024-05-22T00:31:09.191329 #2792304] INFO -- : /tmp/ruby/src/trunk/basictest/test.rb:clone .....OK 5 I, [2024-05-22T00:31:09.191374 #2792304] INFO -- : /tmp/ruby/src/trunk/basictest/test.rb:marshal ....OK 4 I, [2024-05-22T00:31:09.191430 #2792304] INFO -- : /tmp/ruby/src/trunk/basictest/test.rb:pack ....OK 4 I, [2024-05-22T00:31:09.191444 #2792304] INFO -- : /tmp/ruby/src/trunk/basictest/test.rb:math ..OK 2 I, [2024-05-22T00:31:09.191498 #2792304] INFO -- : /tmp/ruby/src/trunk/basictest/test.rb:struct ......OK 6 I, [2024-05-22T00:31:09.191589 #2792304] INFO -- : /tmp/ruby/src/trunk/basictest/test.rb:variable ............OK 12 I, [2024-05-22T00:31:09.191611 #2792304] INFO -- : /tmp/ruby/src/trunk/basictest/test.rb:trace ...OK 3 I, [2024-05-22T00:31:09.191668 #2792304] INFO -- : /tmp/ruby/src/trunk/basictest/test.rb:defined? ............OK 12 I, [2024-05-22T00:31:09.191725 #2792304] INFO -- : /tmp/ruby/src/trunk/basictest/test.rb:alias ......OK 6 I, [2024-05-22T00:31:09.192092 #2792304] INFO -- : /tmp/ruby/src/trunk/basictest/test.rb:path .......................OK 23 I, [2024-05-22T00:31:09.225991 #2792304] INFO -- : /tmp/ruby/src/trunk/basictest/test.rb:gc ....OK 4 I, [2024-05-22T00:31:09.228479 #2792304] INFO -- : I, [2024-05-22T00:31:09.228506 #2792304] INFO -- : test succeeded I, [2024-05-22T00:31:09.230176 #2792304] INFO -- : $$$[end] "make yes-test-basic TESTS='-j20'" exit with 0. I, [2024-05-22T00:31:09.230266 #2792304] INFO -- : $$$[beg] make yes-test-all TESTOPTS='--stderr-on-failure' TESTS='-j20' I, [2024-05-22T00:31:09.315837 #2792304] INFO -- : BASERUBY = /usr/bin/ruby --disable=gems I, [2024-05-22T00:31:09.315873 #2792304] INFO -- : CC = gcc I, [2024-05-22T00:31:09.315878 #2792304] INFO -- : LD = ld I, [2024-05-22T00:31:09.315883 #2792304] INFO -- : LDSHARED = gcc -shared I, [2024-05-22T00:31:09.315887 #2792304] INFO -- : CFLAGS = -O3 -fno-fast-math -ggdb3 -Wall -Wextra -Wdeprecated-declarations -Wdiv-by-zero -Wduplicated-cond -Wimplicit-function-declaration -Wimplicit-int -Wpointer-arith -Wwrite-strings -Wold-style-definition -Wimplicit-fallthrough=0 -Wmissing-noreturn -Wno-cast-function-type -Wno-constant-logical-operand -Wno-long-long -Wno-missing-field-initializers -Wno-overlength-strings -Wno-packed-bitfield-compat -Wno-parentheses-equality -Wno-self-assign -Wno-tautological-compare -Wno-unused-parameter -Wno-unused-value -Wsuggest-attribute=format -Wsuggest-attribute=noreturn -Wunused-variable -Wmisleading-indentation -Wundef -fPIC I, [2024-05-22T00:31:09.315891 #2792304] INFO -- : XCFLAGS = -U_FORTIFY_SOURCE -D_FORTIFY_SOURCE=2 -fstack-protector-strong -fno-strict-overflow -fvisibility=hidden -fexcess-precision=standard -DRUBY_EXPORT -I. -I.ext/include/x86_64-linux -I/tmp/ruby/src/trunk/include -I/tmp/ruby/src/trunk -I/tmp/ruby/src/trunk/prism -I/tmp/ruby/src/trunk/enc/unicode/15.0.0 I, [2024-05-22T00:31:09.315895 #2792304] INFO -- : CPPFLAGS = I, [2024-05-22T00:31:09.315899 #2792304] INFO -- : DLDFLAGS = -Wl,--compress-debug-sections=zlib -Wl,-soname,libruby.so.3.4 -fstack-protector-strong I, [2024-05-22T00:31:09.315903 #2792304] INFO -- : SOLIBS = -lz -lrt -lrt -lgmp -ldl -lcrypt -lm -lpthread I, [2024-05-22T00:31:09.315907 #2792304] INFO -- : LANG = en_US.UTF-8 I, [2024-05-22T00:31:09.315911 #2792304] INFO -- : LC_ALL = I, [2024-05-22T00:31:09.315914 #2792304] INFO -- : LC_CTYPE = I, [2024-05-22T00:31:09.315918 #2792304] INFO -- : MFLAGS = I, [2024-05-22T00:31:09.315921 #2792304] INFO -- : RUSTC = no I, [2024-05-22T00:31:09.315925 #2792304] INFO -- : YJIT_RUSTC_ARGS = --crate-name=yjit --crate-type=staticlib --edition=2021 -g -C lto=thin -C opt-level=3 -C overflow-checks=on '--out-dir=/tmp/ruby/build/trunk/yjit/target/release/' /tmp/ruby/src/trunk/yjit/src/lib.rs I, [2024-05-22T00:31:09.316542 #2792304] INFO -- : gcc (Ubuntu 11.4.0-1ubuntu1~22.04) 11.4.0 I, [2024-05-22T00:31:09.316570 #2792304] INFO -- : Copyright (C) 2021 Free Software Foundation, Inc. I, [2024-05-22T00:31:09.316577 #2792304] INFO -- : This is free software; see the source for copying conditions. There is NO I, [2024-05-22T00:31:09.316582 #2792304] INFO -- : warranty; not even for MERCHANTABILITY or FITNESS FOR A PARTICULAR PURPOSE. I, [2024-05-22T00:31:09.316587 #2792304] INFO -- : I, [2024-05-22T00:31:09.318223 #2792304] INFO -- : generating enc.mk I, [2024-05-22T00:31:09.436768 #2792304] INFO -- : generating encdb.h I, [2024-05-22T00:31:09.460592 #2792304] INFO -- : encdb.h unchanged I, [2024-05-22T00:31:09.461704 #2792304] INFO -- : making enc I, [2024-05-22T00:31:09.481426 #2792304] INFO -- : make[1]: Entering directory '/tmp/ruby/build/trunk' I, [2024-05-22T00:31:09.481459 #2792304] INFO -- : make[1]: Nothing to be done for 'enc'. I, [2024-05-22T00:31:09.481468 #2792304] INFO -- : make[1]: Leaving directory '/tmp/ruby/build/trunk' I, [2024-05-22T00:31:09.482342 #2792304] INFO -- : making srcs under enc I, [2024-05-22T00:31:09.514975 #2792304] INFO -- : make[1]: Entering directory '/tmp/ruby/build/trunk' I, [2024-05-22T00:31:09.514995 #2792304] INFO -- : make[1]: Nothing to be done for 'srcs'. I, [2024-05-22T00:31:09.515001 #2792304] INFO -- : make[1]: Leaving directory '/tmp/ruby/build/trunk' I, [2024-05-22T00:31:09.515912 #2792304] INFO -- : generating transdb.h I, [2024-05-22T00:31:09.612300 #2792304] INFO -- : transdb.h unchanged I, [2024-05-22T00:31:09.613846 #2792304] INFO -- : making trans I, [2024-05-22T00:31:09.648174 #2792304] INFO -- : make[1]: Entering directory '/tmp/ruby/build/trunk' I, [2024-05-22T00:31:09.648196 #2792304] INFO -- : make[1]: Nothing to be done for 'trans'. I, [2024-05-22T00:31:09.648203 #2792304] INFO -- : make[1]: Leaving directory '/tmp/ruby/build/trunk' I, [2024-05-22T00:31:09.648957 #2792304] INFO -- : making encs I, [2024-05-22T00:31:09.686111 #2792304] INFO -- : make[1]: Entering directory '/tmp/ruby/build/trunk' I, [2024-05-22T00:31:09.686132 #2792304] INFO -- : make[1]: Nothing to be done for 'encs'. I, [2024-05-22T00:31:09.686137 #2792304] INFO -- : make[1]: Leaving directory '/tmp/ruby/build/trunk' I, [2024-05-22T00:31:09.687973 #2792304] INFO -- : generating makefiles ext/configure-ext.mk I, [2024-05-22T00:31:09.714966 #2792304] INFO -- : ext/configure-ext.mk updated I, [2024-05-22T00:31:09.717404 #2792304] INFO -- : make[1]: Entering directory '/tmp/ruby/build/trunk' I, [2024-05-22T00:31:11.113903 #2792304] INFO -- : make[1]: Leaving directory '/tmp/ruby/build/trunk' I, [2024-05-22T00:31:11.114569 #2792304] INFO -- : generating makefile exts.mk I, [2024-05-22T00:31:11.151417 #2792304] INFO -- : exts.mk unchanged I, [2024-05-22T00:31:11.155910 #2792304] INFO -- : make[1]: Entering directory '/tmp/ruby/build/trunk' I, [2024-05-22T00:31:11.497662 #2792304] INFO -- : make[2]: Entering directory '/tmp/ruby/build/trunk/ext/coverage' I, [2024-05-22T00:31:11.502364 #2792304] INFO -- : make[2]: Leaving directory '/tmp/ruby/build/trunk/ext/coverage' I, [2024-05-22T00:31:11.508864 #2792304] INFO -- : make[2]: Entering directory '/tmp/ruby/build/trunk/ext/date' I, [2024-05-22T00:31:11.513968 #2792304] INFO -- : make[2]: Leaving directory '/tmp/ruby/build/trunk/ext/date' I, [2024-05-22T00:31:11.517812 #2792304] INFO -- : make[2]: Entering directory '/tmp/ruby/build/trunk/ext/digest' I, [2024-05-22T00:31:11.526675 #2792304] INFO -- : make[2]: Leaving directory '/tmp/ruby/build/trunk/ext/digest' I, [2024-05-22T00:31:11.553624 #2792304] INFO -- : make[2]: Entering directory '/tmp/ruby/build/trunk/ext/digest/sha2' I, [2024-05-22T00:31:11.558538 #2792304] INFO -- : make[2]: Leaving directory '/tmp/ruby/build/trunk/ext/digest/sha2' I, [2024-05-22T00:31:11.580327 #2792304] INFO -- : make[2]: Entering directory '/tmp/ruby/build/trunk/ext/fiddle' I, [2024-05-22T00:31:11.590879 #2792304] INFO -- : make[2]: Leaving directory '/tmp/ruby/build/trunk/ext/fiddle' I, [2024-05-22T00:31:11.595825 #2792304] INFO -- : make[2]: Entering directory '/tmp/ruby/build/trunk/ext/io/console' I, [2024-05-22T00:31:11.599741 #2792304] INFO -- : make[2]: Leaving directory '/tmp/ruby/build/trunk/ext/io/console' I, [2024-05-22T00:31:11.611641 #2792304] INFO -- : make[2]: Entering directory '/tmp/ruby/build/trunk/ext/json' I, [2024-05-22T00:31:11.621723 #2792304] INFO -- : make[2]: Leaving directory '/tmp/ruby/build/trunk/ext/json' I, [2024-05-22T00:31:11.636947 #2792304] INFO -- : make[2]: Entering directory '/tmp/ruby/build/trunk/ext/monitor' I, [2024-05-22T00:31:11.640821 #2792304] INFO -- : make[2]: Leaving directory '/tmp/ruby/build/trunk/ext/monitor' I, [2024-05-22T00:31:11.647832 #2792304] INFO -- : make[2]: Entering directory '/tmp/ruby/build/trunk/ext/objspace' I, [2024-05-22T00:31:11.654228 #2792304] INFO -- : make[2]: Leaving directory '/tmp/ruby/build/trunk/ext/objspace' I, [2024-05-22T00:31:11.672419 #2792304] INFO -- : make[2]: Entering directory '/tmp/ruby/build/trunk/ext/openssl' I, [2024-05-22T00:31:11.686280 #2792304] INFO -- : make[2]: Leaving directory '/tmp/ruby/build/trunk/ext/openssl' I, [2024-05-22T00:31:11.690726 #2792304] INFO -- : make[2]: Entering directory '/tmp/ruby/build/trunk/ext/pathname' I, [2024-05-22T00:31:11.694788 #2792304] INFO -- : make[2]: Leaving directory '/tmp/ruby/build/trunk/ext/pathname' I, [2024-05-22T00:31:11.702352 #2792304] INFO -- : make[2]: Entering directory '/tmp/ruby/build/trunk/ext/psych' I, [2024-05-22T00:31:11.724510 #2792304] INFO -- : make[2]: Leaving directory '/tmp/ruby/build/trunk/ext/psych' I, [2024-05-22T00:31:11.729053 #2792304] INFO -- : make[2]: Entering directory '/tmp/ruby/build/trunk/ext/pty' I, [2024-05-22T00:31:11.733176 #2792304] INFO -- : make[2]: Leaving directory '/tmp/ruby/build/trunk/ext/pty' I, [2024-05-22T00:31:11.748118 #2792304] INFO -- : make[2]: Entering directory '/tmp/ruby/build/trunk/ext/ripper' I, [2024-05-22T00:31:11.755099 #2792304] INFO -- : make[2]: Leaving directory '/tmp/ruby/build/trunk/ext/ripper' I, [2024-05-22T00:31:11.757354 #2792304] INFO -- : make[2]: Entering directory '/tmp/ruby/build/trunk/ext/rubyvm' I, [2024-05-22T00:31:11.760586 #2792304] INFO -- : make[2]: Leaving directory '/tmp/ruby/build/trunk/ext/rubyvm' I, [2024-05-22T00:31:11.773963 #2792304] INFO -- : make[2]: Entering directory '/tmp/ruby/build/trunk/ext/socket' I, [2024-05-22T00:31:11.784406 #2792304] INFO -- : make[2]: Leaving directory '/tmp/ruby/build/trunk/ext/socket' I, [2024-05-22T00:31:11.799452 #2792304] INFO -- : make[2]: Entering directory '/tmp/ruby/build/trunk/.bundle/gems/bigdecimal-3.1.8/ext/bigdecimal' I, [2024-05-22T00:31:11.826597 #2792304] INFO -- : make[2]: Leaving directory '/tmp/ruby/build/trunk/.bundle/gems/bigdecimal-3.1.8/ext/bigdecimal' I, [2024-05-22T00:31:11.828407 #2792304] INFO -- : make[2]: Entering directory '/tmp/ruby/build/trunk/.bundle/gems/debug-1.9.2/ext/debug' I, [2024-05-22T00:31:11.851038 #2792304] INFO -- : make[2]: Leaving directory '/tmp/ruby/build/trunk/.bundle/gems/debug-1.9.2/ext/debug' I, [2024-05-22T00:31:11.853075 #2792304] INFO -- : make[2]: Entering directory '/tmp/ruby/build/trunk/.bundle/gems/nkf-0.2.0/ext/nkf' I, [2024-05-22T00:31:11.875187 #2792304] INFO -- : make[2]: Leaving directory '/tmp/ruby/build/trunk/.bundle/gems/nkf-0.2.0/ext/nkf' I, [2024-05-22T00:31:11.877210 #2792304] INFO -- : make[2]: Entering directory '/tmp/ruby/build/trunk/.bundle/gems/racc-1.7.3/ext/racc/cparse' I, [2024-05-22T00:31:11.898502 #2792304] INFO -- : make[2]: Leaving directory '/tmp/ruby/build/trunk/.bundle/gems/racc-1.7.3/ext/racc/cparse' I, [2024-05-22T00:31:11.900581 #2792304] INFO -- : make[2]: Entering directory '/tmp/ruby/build/trunk/.bundle/gems/racc-1.8.0/ext/racc/cparse' I, [2024-05-22T00:31:11.921979 #2792304] INFO -- : make[2]: Leaving directory '/tmp/ruby/build/trunk/.bundle/gems/racc-1.8.0/ext/racc/cparse' I, [2024-05-22T00:31:11.924349 #2792304] INFO -- : make[2]: Entering directory '/tmp/ruby/build/trunk/.bundle/gems/rbs-3.4.4/ext/rbs_extension' I, [2024-05-22T00:31:11.950246 #2792304] INFO -- : make[2]: Leaving directory '/tmp/ruby/build/trunk/.bundle/gems/rbs-3.4.4/ext/rbs_extension' I, [2024-05-22T00:31:11.952313 #2792304] INFO -- : make[2]: Entering directory '/tmp/ruby/build/trunk/.bundle/gems/syslog-0.1.2/ext/syslog' I, [2024-05-22T00:31:11.974221 #2792304] INFO -- : make[2]: Leaving directory '/tmp/ruby/build/trunk/.bundle/gems/syslog-0.1.2/ext/syslog' I, [2024-05-22T00:31:11.997625 #2792304] INFO -- : make[2]: Entering directory '/tmp/ruby/build/trunk' I, [2024-05-22T00:31:12.066558 #2792304] INFO -- : make[2]: 'ruby' is up to date. I, [2024-05-22T00:31:12.066603 #2792304] INFO -- : make[2]: Leaving directory '/tmp/ruby/build/trunk' I, [2024-05-22T00:31:12.067031 #2792304] INFO -- : make[1]: Leaving directory '/tmp/ruby/build/trunk' I, [2024-05-22T00:31:12.070786 #2792304] INFO -- : make[1]: Entering directory '/tmp/ruby/build/trunk' I, [2024-05-22T00:31:12.070810 #2792304] INFO -- : make[1]: Nothing to be done for 'note'. I, [2024-05-22T00:31:12.070817 #2792304] INFO -- : make[1]: Leaving directory '/tmp/ruby/build/trunk' I, [2024-05-22T00:31:12.148553 #2792304] INFO -- : Run options: I, [2024-05-22T00:31:12.148619 #2792304] INFO -- : --seed=22790 I, [2024-05-22T00:31:12.148625 #2792304] INFO -- : "--ruby=./miniruby -I/tmp/ruby/src/trunk/lib -I. -I.ext/common /tmp/ruby/src/trunk/tool/runruby.rb --extout=.ext -- --disable-gems" I, [2024-05-22T00:31:12.148629 #2792304] INFO -- : --excludes-dir=/tmp/ruby/src/trunk/test/.excludes I, [2024-05-22T00:31:12.148633 #2792304] INFO -- : --name=!/memory_leak/ I, [2024-05-22T00:31:12.148636 #2792304] INFO -- : --stderr-on-failure I, [2024-05-22T00:31:12.148649 #2792304] INFO -- : -j20 I, [2024-05-22T00:31:12.148653 #2792304] INFO -- : I, [2024-05-22T00:31:12.148656 #2792304] INFO -- : # Running tests: I, [2024-05-22T00:31:12.148660 #2792304] INFO -- : I, [2024-05-22T00:31:12.296758 #2792304] INFO -- : [ 1/885] 2833651=test_rdoc_i18n_text I, [2024-05-22T00:31:12.296852 #2792304] INFO -- : [ 2/885] 2833652=test_io_buffer I, [2024-05-22T00:31:12.297962 #2792304] INFO -- : [ 3/885] 2833650=test_key_name_check I, [2024-05-22T00:31:12.298410 #2792304] INFO -- : [ 4/885] 2833654=test_defined I, [2024-05-22T00:31:12.299240 #2792304] INFO -- : [ 5/885] 2833655=test_backtrace I, [2024-05-22T00:31:12.301247 #2792304] INFO -- : [ 6/885] 2833653=test_rdoc_rdoc I, [2024-05-22T00:31:12.301774 #2792304] INFO -- : [ 7/885] 2833666=test_windows_1251 I, [2024-05-22T00:31:12.302520 #2792304] INFO -- : [ 8/885] 2833655=test_time I, [2024-05-22T00:31:12.302552 #2792304] INFO -- : [ 9/885] 2833664=test_buffering I, [2024-05-22T00:31:12.302560 #2792304] INFO -- : [ 10/885] 2833669=test_svcb_https I, [2024-05-22T00:31:12.302567 #2792304] INFO -- : [ 11/885] 2833665=test_gb18030 I, [2024-05-22T00:31:12.302879 #2792304] INFO -- : [ 12/885] 2833668=test_gem_uninstaller I, [2024-05-22T00:31:12.303068 #2792304] INFO -- : [ 13/885] 2833667=test_rdoc_markup_to_rdoc I, [2024-05-22T00:31:12.307683 #2792304] INFO -- : [ 14/885] 2833666=test_rdoc_rd_inline_parser I, [2024-05-22T00:31:12.308135 #2792304] INFO -- : [ 15/885] 2833650=test_default_gems I, [2024-05-22T00:31:12.308455 #2792304] INFO -- : [ 16/885] 2833665=test_null I, [2024-05-22T00:31:12.322583 #2792304] INFO -- : [ 17/885] 2833652=test_win32ole_type I, [2024-05-22T00:31:12.326088 #2792304] INFO -- : [ 18/885] 2833652=test_mul I, [2024-05-22T00:31:12.335838 #2792304] INFO -- : [ 19/885] 2833665=test_rdoc_markup_attributes I, [2024-05-22T00:31:12.335898 #2792304] INFO -- : [ 20/885] 2833656=test_date_parse I, [2024-05-22T00:31:12.335908 #2792304] INFO -- : [ 21/885] 2833657=test_pkey_ec I, [2024-05-22T00:31:12.335915 #2792304] INFO -- : [ 22/885] 2833662=test_trick I, [2024-05-22T00:31:12.335921 #2792304] INFO -- : [ 23/885] 2833658=test_thread I, [2024-05-22T00:31:12.335927 #2792304] INFO -- : [ 24/885] 2833660=test_pipe I, [2024-05-22T00:31:12.335933 #2792304] INFO -- : [ 25/885] 2833663=test_string I, [2024-05-22T00:31:12.335939 #2792304] INFO -- : [ 26/885] 2833659=test_rdoc_stats I, [2024-05-22T00:31:12.335948 #2792304] INFO -- : [ 27/885] 2833661=test_pattern_matching I, [2024-05-22T00:31:12.336558 #2792304] INFO -- : [ 28/885] 2833658=test_depth_first I, [2024-05-22T00:31:12.336695 #2792304] INFO -- : [ 29/885] 2833652=test_gem_request_set_lockfile_parser I, [2024-05-22T00:31:12.339835 #2792304] INFO -- : [ 30/885] 2833669=test_raise I, [2024-05-22T00:31:12.343908 #2792304] INFO -- : [ 31/885] 2833669=test_x509attr I, [2024-05-22T00:31:12.358034 #2792304] INFO -- : [ 32/885] 2833664=test_rdoc_store I, [2024-05-22T00:31:12.370855 #2792304] INFO -- : [ 33/885] 2833654=test_custom_command I, [2024-05-22T00:31:12.371451 #2792304] INFO -- : [ 34/885] 2833650=json_addition_test I, [2024-05-22T00:31:12.377100 #2792304] INFO -- : [ 35/885] 2833658=test_gem_dependency_resolution_error I, [2024-05-22T00:31:12.382782 #2792304] INFO -- : [ 36/885] 2833661=test_rdoc_parser I, [2024-05-22T00:31:12.383195 #2792304] INFO -- : [ 37/885] 2833669=test_qsort I, [2024-05-22T00:31:12.384276 #2792304] INFO -- : [ 38/885] 2833669=test_ole_methods I, [2024-05-22T00:31:12.391347 #2792304] INFO -- : [ 39/885] 2833663=test_erb_m17n I, [2024-05-22T00:31:12.391610 #2792304] INFO -- : [ 40/885] 2833669=test_date_conv I, [2024-05-22T00:31:12.396037 #2792304] INFO -- : [ 41/885] 2833650=test_optimization I, [2024-05-22T00:31:12.401118 #2792304] INFO -- : [ 42/885] 2833669=test_zlib I, [2024-05-22T00:31:12.412870 #2792304] INFO -- : [ 43/885] 2833663=test_cgi_tag_helper I, [2024-05-22T00:31:12.420688 #2792304] INFO -- : [ 44/885] 2833651=test_egrep_cpp I, [2024-05-22T00:31:12.441465 #2792304] INFO -- : [ 45/885] 2833655=test_gem_resolver_index_set I, [2024-05-22T00:31:12.443293 #2792304] INFO -- : [ 46/885] 2833663=test_gem_package_old I, [2024-05-22T00:31:12.444502 #2792304] INFO -- : [ 47/885] 2833665=test_gc_compact I, [2024-05-22T00:31:12.447993 #2792304] INFO -- : [ 48/885] 2833666=test_proc I, [2024-05-22T00:31:12.472675 #2792304] INFO -- : [ 49/885] 2833667=test_string I, [2024-05-22T00:31:12.480599 #2792304] INFO -- : [ 50/885] 2833660=test_gem_validator I, [2024-05-22T00:31:12.480660 #2792304] INFO -- : [ 51/885] 2833657=test_fnmatch I, [2024-05-22T00:31:12.484817 #2792304] INFO -- : [ 52/885] 2833656=test_files_test_2 I, [2024-05-22T00:31:12.491194 #2792304] INFO -- : [ 53/885] 2833654=test_rdoc_markup_parser I, [2024-05-22T00:31:12.539588 #2792304] INFO -- : [ 54/885] 2833661=test_require_path_check I, [2024-05-22T00:31:12.553648 #2792304] INFO -- : [ 55/885] 2833657=test_folderitem2_invokeverb I, [2024-05-22T00:31:12.558954 #2792304] INFO -- : [ 56/885] 2833657=test_address_resolve I, [2024-05-22T00:31:12.576482 #2792304] INFO -- : [ 57/885] 2833651=test_rdoc_token_stream I, [2024-05-22T00:31:12.578675 #2792304] INFO -- : [ 58/885] 2833659=test_config I, [2024-05-22T00:31:12.587545 #2792304] INFO -- : [ 59/885] 2833651=test_optarg I, [2024-05-22T00:31:12.589785 #2792304] INFO -- : [ 60/885] 2833658=test_yaml_special_cases I, [2024-05-22T00:31:12.597128 #2792304] INFO -- : [ 61/885] 2833661=test_gem_source_list I, [2024-05-22T00:31:12.602213 #2792304] INFO -- : [ 62/885] 2833658=test_macro I, [2024-05-22T00:31:12.603332 #2792304] INFO -- : [ 63/885] 2833652=test_frozen I, [2024-05-22T00:31:12.605393 #2792304] INFO -- : [ 64/885] 2833653=test_gem_ext_configure_builder I, [2024-05-22T00:31:12.607943 #2792304] INFO -- : [ 65/885] 2833652=test_pp I, [2024-05-22T00:31:12.634439 #2792304] INFO -- : [ 66/885] 2833652=test_verbose I, [2024-05-22T00:31:12.654782 #2792304] INFO -- : [ 67/885] 2833652=test_rdoc_single_class I, [2024-05-22T00:31:12.675240 #2792304] INFO -- : [ 68/885] 2833658=test_num2int I, [2024-05-22T00:31:12.683052 #2792304] INFO -- : [ 69/885] 2833655=test_nil I, [2024-05-22T00:31:12.683765 #2792304] INFO -- : [ 70/885] 2833657=test_zsh_completion I, [2024-05-22T00:31:12.683949 #2792304] INFO -- : [ 71/885] 2833658=test_exception I, [2024-05-22T00:31:12.686321 #2792304] INFO -- : [ 72/885] 2833654=test_iter_break I, [2024-05-22T00:31:12.686509 #2792304] INFO -- : [ 73/885] 2833660=test_hmac I, [2024-05-22T00:31:12.688153 #2792304] INFO -- : [ 74/885] 2833657=test_rdoc_markup_to_tt_only I, [2024-05-22T00:31:12.689047 #2792304] INFO -- : [ 75/885] 2833654=test_rdoc_tom_doc I, [2024-05-22T00:31:12.693019 #2792304] INFO -- : [ 76/885] 2833660=test_assignment I, [2024-05-22T00:31:12.698922 #2792304] INFO -- : [ 77/885] 2833658=test_ifunless I, [2024-05-22T00:31:12.705927 #2792304] INFO -- : [ 78/885] 2833654=test_gem_commands_lock_command I, [2024-05-22T00:31:12.706753 #2792304] INFO -- : [ 79/885] 2833658=test_numeric I, [2024-05-22T00:31:12.709651 #2792304] INFO -- : [ 80/885] 2833663=test_common I, [2024-05-22T00:31:12.719090 #2792304] INFO -- : [ 81/885] 2833659=test_gem_spec_fetcher I, [2024-05-22T00:31:12.723991 #2792304] INFO -- : [ 82/885] 2833655=test_gem_command I, [2024-05-22T00:31:12.724335 #2792304] INFO -- : [ 83/885] 2833651=test_key_actor_vi I, [2024-05-22T00:31:12.774676 #2792304] INFO -- : [ 84/885] 2833652=test_bug-3571 I, [2024-05-22T00:31:12.785703 #2792304] INFO -- : [ 85/885] 2833658=test_rdoc_markup_paragraph I, [2024-05-22T00:31:12.796387 #2792304] INFO -- : [ 86/885] 2833652=test_enc_raise I, [2024-05-22T00:31:12.802398 #2792304] INFO -- : [ 87/885] 2833652=test_psych I, [2024-05-22T00:31:12.803536 #2792304] INFO -- : [ 88/885] 2833661=!Nothing_to_test I, [2024-05-22T00:31:12.803575 #2792304] INFO -- : [ 89/885] 2833661=test_object_create_start I, [2024-05-22T00:31:12.807872 #2792304] INFO -- : [ 90/885] 2833655=test_at_exit I, [2024-05-22T00:31:12.813162 #2792304] INFO -- : [ 91/885] 2833661=test_command I, [2024-05-22T00:31:12.837939 #2792304] INFO -- : [ 92/885] 2833655=test_gem_ext_cargo_builder_unit I, [2024-05-22T00:31:12.856239 #2792304] INFO -- : [ 93/885] 2833657=test_gem_rdoc I, [2024-05-22T00:31:12.857590 #2792304] INFO -- : [ 94/885] 2833655=test_date I, [2024-05-22T00:31:12.860961 #2792304] INFO -- : [ 95/885] 2833652=test_bug-5832 I, [2024-05-22T00:31:12.866194 #2792304] INFO -- : [ 96/885] 2833655=test_files_ext I, [2024-05-22T00:31:12.871134 #2792304] INFO -- : [ 97/885] 2833652=test_gem_silent_ui I, [2024-05-22T00:31:12.888443 #2792304] INFO -- : [ 98/885] 2833651=test_emitter I, [2024-05-22T00:31:12.905957 #2792304] INFO -- : [ 99/885] 2833651=test_kdf I, [2024-05-22T00:31:12.907656 #2792304] INFO -- : [100/885] 2833654=test_gem_doctor I, [2024-05-22T00:31:12.920885 #2792304] INFO -- : [101/885] 2833652=test_eval_history I, [2024-05-22T00:31:12.921345 #2792304] INFO -- : [102/885] 2833658=dispatcher_test I, [2024-05-22T00:31:12.952451 #2792304] INFO -- : [103/885] 2833654=test_kernel I, [2024-05-22T00:31:12.968050 #2792304] INFO -- : [104/885] 2833655=test_rdoc_parser_ruby I, [2024-05-22T00:31:12.968119 #2792304] INFO -- : [105/885] 2833653=test_httpresponse I, [2024-05-22T00:31:12.976431 #2792304] INFO -- : [106/885] 2833663=test_open-uri I, [2024-05-22T00:31:12.991701 #2792304] INFO -- : [107/885] 2833658=test_stream I, [2024-05-22T00:31:13.001743 #2792304] INFO -- : [108/885] 2833651=test_nil2vtempty I, [2024-05-22T00:31:13.004101 #2792304] INFO -- : [109/885] 2833658=test_rdoc_context I, [2024-05-22T00:31:13.005504 #2792304] INFO -- : [110/885] 2833651=test_rdoc_text I, [2024-05-22T00:31:13.073801 #2792304] INFO -- : [111/885] 2833651=test_iso_8859 I, [2024-05-22T00:31:13.074843 #2792304] INFO -- : [112/885] 2833652=test_tcp I, [2024-05-22T00:31:13.078209 #2792304] INFO -- : [113/885] 2833653=test_data I, [2024-05-22T00:31:13.085732 #2792304] INFO -- : [114/885] 2833653=test_date_new I, [2024-05-22T00:31:13.089101 #2792304] INFO -- : [115/885] 2833659=index_write_test I, [2024-05-22T00:31:13.094436 #2792304] INFO -- : [116/885] 2833653=test_require I, [2024-05-22T00:31:13.096991 #2792304] INFO -- : [117/885] 2833653=test_date_time I, [2024-05-22T00:31:13.098787 #2792304] INFO -- : [118/885] 2833651=test_rdoc_markup_to_joined_paragraph I, [2024-05-22T00:31:13.103117 #2792304] INFO -- : [119/885] 2833651=test_gem_safe_yaml I, [2024-05-22T00:31:13.104787 #2792304] INFO -- : [120/885] 2833664=test_syntax I, [2024-05-22T00:31:13.124628 #2792304] INFO -- : [121/885] 2833653=test_enumerator I, [2024-05-22T00:31:13.156221 #2792304] INFO -- : [122/885] 2833659=test_flags I, [2024-05-22T00:31:13.200968 #2792304] INFO -- : [123/885] 2833652=test_inadvertent_creation I, [2024-05-22T00:31:13.229480 #2792304] INFO -- : [124/885] 2833657=test_gem_commands_which_command I, [2024-05-22T00:31:13.243776 #2792304] INFO -- : [125/885] 2833661=test_shift_jis I, [2024-05-22T00:31:13.254780 #2792304] INFO -- : [126/885] 2833651=test_http I, [2024-05-22T00:31:13.254865 #2792304] INFO -- : [127/885] 2833661=test_gem_commands_specification_command I, [2024-05-22T00:31:13.269636 #2792304] INFO -- : [128/885] 2833657=test_gem_resolver_composed_set I, [2024-05-22T00:31:13.276241 #2792304] INFO -- : [129/885] 2833651=test_safe_load I, [2024-05-22T00:31:13.279870 #2792304] INFO -- : [130/885] 2833657=test_gem_resolver I, [2024-05-22T00:31:13.283188 #2792304] INFO -- : [131/885] 2833651=test_gem_commands_dependency_command I, [2024-05-22T00:31:13.297660 #2792304] INFO -- : [132/885] 2833666=test_rdoc_markup_attribute_manager I, [2024-05-22T00:31:13.323498 #2792304] INFO -- : [133/885] 2833666=test_name_error I, [2024-05-22T00:31:13.328815 #2792304] INFO -- : [134/885] 2833652=test_pack I, [2024-05-22T00:31:13.371780 #2792304] INFO -- : [135/885] 2833651=test_last_thread I, [2024-05-22T00:31:13.435668 #2792304] INFO -- : [136/885] 2833668=test_process I, [2024-05-22T00:31:13.439741 #2792304] INFO -- : [137/885] 2833666=test_gem_source_local I, [2024-05-22T00:31:13.441407 #2792304] INFO -- : [138/885] 2833661=test_gem_security_policy I, [2024-05-22T00:31:13.551048 #2792304] INFO -- : [139/885] 2833655=test_logdevice I, [2024-05-22T00:31:13.554829 #2792304] INFO -- : [140/885] 2833652=test_arity I, [2024-05-22T00:31:13.558221 #2792304] INFO -- : [141/885] 2833652=test_gem_ext_rake_builder I, [2024-05-22T00:31:13.563913 #2792304] INFO -- : [142/885] 2833657=test_gc I, [2024-05-22T00:31:13.567388 #2792304] INFO -- : [143/885] 2833663=test_x509cert I, [2024-05-22T00:31:13.600359 #2792304] INFO -- : [144/885] 2833654=test_err_in_callback I, [2024-05-22T00:31:13.605232 #2792304] INFO -- : [145/885] 2833654=test_gem_resolver_lock_specification I, [2024-05-22T00:31:13.634015 #2792304] INFO -- : [146/885] 2833654=test_c_union_entity I, [2024-05-22T00:31:13.673738 #2792304] INFO -- : [147/885] 2833654=test_rdoc_normal_module I, [2024-05-22T00:31:13.710225 #2792304] INFO -- : [148/885] 2833661=test_rdoc_markdown_test I, [2024-05-22T00:31:13.736261 #2792304] INFO -- : [149/885] 2833658=test_logperiod I, [2024-05-22T00:31:13.743872 #2792304] INFO -- : [150/885] 2833658=test_securerandom I, [2024-05-22T00:31:13.744721 #2792304] INFO -- : [151/885] 2833654=test_switch_hitter I, [2024-05-22T00:31:13.754495 #2792304] INFO -- : [152/885] 2833669=test_singleton I, [2024-05-22T00:31:13.756620 #2792304] INFO -- : [153/885] 2833660=test_flush I, [2024-05-22T00:31:13.758380 #2792304] INFO -- : [154/885] 2833654=test_io_console I, [2024-05-22T00:31:13.760106 #2792304] INFO -- : [155/885] 2833669=test_hash_create I, [2024-05-22T00:31:13.760800 #2792304] INFO -- : [156/885] 2833669=test_stringchar I, [2024-05-22T00:31:13.763440 #2792304] INFO -- : [157/885] 2833660=test_uncorrectable_name_check I, [2024-05-22T00:31:13.769375 #2792304] INFO -- : [158/885] 2833658=newline_test I, [2024-05-22T00:31:13.770776 #2792304] INFO -- : [159/885] 2833660=test_thread_fd_close I, [2024-05-22T00:31:13.772861 #2792304] INFO -- : [160/885] 2833660=test_passing_block I, [2024-05-22T00:31:13.777584 #2792304] INFO -- : [161/885] 2833660=test_require_lib I, [2024-05-22T00:31:13.835458 #2792304] INFO -- : [162/885] 2833669=test_gem_install_update_options I, [2024-05-22T00:31:13.844294 #2792304] INFO -- : [163/885] 2833658=parse_test I, [2024-05-22T00:31:13.853816 #2792304] INFO -- : [164/885] 2833666=test_ractor I, [2024-05-22T00:31:13.867517 #2792304] INFO -- : [165/885] 2833666=test_severity I, [2024-05-22T00:31:13.871817 #2792304] INFO -- : [166/885] 2833663=test_gem_stream_ui I, [2024-05-22T00:31:13.874564 #2792304] INFO -- : [167/885] 2833666=test_rdoc_generator_ri I, [2024-05-22T00:31:13.886345 #2792304] INFO -- : [168/885] 2833666=test_extlibs I, [2024-05-22T00:31:13.959120 #2792304] INFO -- : [169/885] 2833663=test_str2big I, [2024-05-22T00:31:13.962471 #2792304] INFO -- : [170/885] 2833663=test_dot_dot I, [2024-05-22T00:31:13.968171 #2792304] INFO -- : [171/885] 2833663=test_c_struct_builder I, [2024-05-22T00:31:14.039830 #2792304] INFO -- : [172/885] 2833663=test_literal I, [2024-05-22T00:31:14.185594 #2792304] INFO -- : [173/885] 2833669=test_thread I, [2024-05-22T00:31:14.246763 #2792304] INFO -- : [174/885] 2833659=test_socket I, [2024-05-22T00:31:14.320097 #2792304] INFO -- : [175/885] 2833652=test_objectspace I, [2024-05-22T00:31:14.363729 #2792304] INFO -- : [176/885] 2833655=test_rdoc_markup_to_table_of_contents I, [2024-05-22T00:31:14.380618 #2792304] INFO -- : [177/885] 2833655=test_parser_events I, [2024-05-22T00:31:14.396033 #2792304] INFO -- : [178/885] 2833662=test_reline I, [2024-05-22T00:31:14.399372 #2792304] INFO -- : [179/885] 2833669=test_case I, [2024-05-22T00:31:14.405066 #2792304] INFO -- : [180/885] 2833669=test_pkey I, [2024-05-22T00:31:14.437180 #2792304] INFO -- : [181/885] 2833651=test_gem_request_connection_pools I, [2024-05-22T00:31:14.440842 #2792304] INFO -- : [182/885] 2833655=test_grapheme_breaks I, [2024-05-22T00:31:14.455680 #2792304] INFO -- : [183/885] 2833669=test_gem_version_option I, [2024-05-22T00:31:14.465376 #2792304] INFO -- : [184/885] 2833655=test_cclass I, [2024-05-22T00:31:14.502146 #2792304] INFO -- : [185/885] 2833669=test_ractor I, [2024-05-22T00:31:14.581146 #2792304] INFO -- : [186/885] 2833655=test_m17n_comb I, [2024-05-22T00:31:14.587270 #2792304] INFO -- : [187/885] 2833669=test_memory_view I, [2024-05-22T00:31:14.623981 #2792304] INFO -- : [188/885] 2833663=test_rdoc_markup_to_markdown I, [2024-05-22T00:31:14.700279 #2792304] INFO -- : [189/885] 2833669=test_json_tree I, [2024-05-22T00:31:14.702142 #2792304] INFO -- : [190/885] 2833662=test_rdoc_generator_pot_po I, [2024-05-22T00:31:14.709297 #2792304] INFO -- : [191/885] 2833669=test_ansi_with_terminfo I, [2024-05-22T00:31:14.750149 #2792304] INFO -- : [192/885] 2833669=test_gem_ext_cargo_builder_link_flag_converter I, [2024-05-22T00:31:14.757381 #2792304] INFO -- : [193/885] 2833665=test_gem_commands_mirror I, [2024-05-22T00:31:14.785943 #2792304] INFO -- : [194/885] 2833663=test_sprintf_comb I, [2024-05-22T00:31:14.812078 #2792304] INFO -- : [195/885] 2833669=test_method_cache I, [2024-05-22T00:31:14.816294 #2792304] INFO -- : [196/885] 2833669=test_gem_request I, [2024-05-22T00:31:14.844928 #2792304] INFO -- : [197/885] 2833661=test_scan_args I, [2024-05-22T00:31:14.854720 #2792304] INFO -- : [198/885] 2833662=test_generic I, [2024-05-22T00:31:14.857206 #2792304] INFO -- : [199/885] 2833661=test_win32ole I, [2024-05-22T00:31:14.865328 #2792304] INFO -- : [200/885] 2833661=test_gem_text I, [2024-05-22T00:31:14.910910 #2792304] INFO -- : [201/885] 2833661=test_settracefunc I, [2024-05-22T00:31:14.928061 #2792304] INFO -- : [202/885] 2833663=test_enumerator_kw I, [2024-05-22T00:31:14.935931 #2792304] INFO -- : [203/885] 2833662=test_gem_dependency_installer I, [2024-05-22T00:31:14.939678 #2792304] INFO -- : [204/885] 2833663=test_scalar I, [2024-05-22T00:31:14.945161 #2792304] INFO -- : [205/885] 2833663=test_gem_commands_info_command I, [2024-05-22T00:31:14.958214 #2792304] INFO -- : [206/885] 2833665=test_rdoc_cross_reference I, [2024-05-22T00:31:14.968619 #2792304] INFO -- : [207/885] 2833663=test_store I, [2024-05-22T00:31:15.026251 #2792304] INFO -- : [208/885] 2833669=test_case_options I, [2024-05-22T00:31:15.029555 #2792304] INFO -- : [209/885] 2833669=test_exception I, [2024-05-22T00:31:15.131482 #2792304] INFO -- : [210/885] 2833663=test_rand I, [2024-05-22T00:31:15.234168 #2792304] INFO -- : [211/885] 2833652=test_gem_package_tar_reader_entry I, [2024-05-22T00:31:15.406377 #2792304] INFO -- : [212/885] 2833652=test_gem_name_tuple I, [2024-05-22T00:31:15.422364 #2792304] INFO -- : [213/885] 2833652=test_bug_reporter I, [2024-05-22T00:31:15.436543 #2792304] INFO -- : [214/885] 2833663=test_rdoc_any_method I, [2024-05-22T00:31:15.440938 #2792304] INFO -- : [215/885] 2833665=test_modify_expand I, [2024-05-22T00:31:15.446616 #2792304] INFO -- : [216/885] 2833665=test_rdoc_markdown I, [2024-05-22T00:31:15.489145 #2792304] INFO -- : [217/885] 2833651=test_gem_available_set I, [2024-05-22T00:31:15.517181 #2792304] INFO -- : [218/885] 2833659=test_file I, [2024-05-22T00:31:15.537299 #2792304] INFO -- : [219/885] 2833659=regexp_test I, [2024-05-22T00:31:15.555852 #2792304] INFO -- : [220/885] 2833659=test_gem_package_tar_reader I, [2024-05-22T00:31:15.598951 #2792304] INFO -- : [221/885] 2833659=test_rdoc_encoding I, [2024-05-22T00:31:15.623437 #2792304] INFO -- : [222/885] 2833659=test_coverage I, [2024-05-22T00:31:15.624372 #2792304] INFO -- : [223/885] 2833651=test_pathname I, [2024-05-22T00:31:15.781732 #2792304] INFO -- : [224/885] 2833665=test_complexrational I, [2024-05-22T00:31:15.789413 #2792304] INFO -- : [225/885] 2833665=test_init I, [2024-05-22T00:31:15.793531 #2792304] INFO -- : [226/885] 2833652=test_recorder I, [2024-05-22T00:31:15.795697 #2792304] INFO -- : [227/885] 2833652=test_gem_source_vendor I, [2024-05-22T00:31:15.803010 #2792304] INFO -- : [228/885] 2833652=test_gem_commands_owner_command I, [2024-05-22T00:31:15.832912 #2792304] INFO -- : [229/885] 2833651=test_deprecate I, [2024-05-22T00:31:15.865293 #2792304] INFO -- : [230/885] 2833666=test_rdoc_constant I, [2024-05-22T00:31:15.877258 #2792304] INFO -- : [231/885] 2833651=test_bash_completion I, [2024-05-22T00:31:15.882413 #2792304] INFO -- : [232/885] 2833663=test_formatter I, [2024-05-22T00:31:15.885709 #2792304] INFO -- : [233/885] 2833651=test_gem_commands_contents_command I, [2024-05-22T00:31:15.891227 #2792304] INFO -- : [234/885] 2833663=test_gem_ext_cmake_builder I, [2024-05-22T00:31:15.901439 #2792304] INFO -- : [235/885] 2833661=test_require I, [2024-05-22T00:31:15.910560 #2792304] INFO -- : [236/885] 2833663=test_cgi_util I, [2024-05-22T00:31:15.978156 #2792304] INFO -- : [237/885] 2833651=test_marshalable I, [2024-05-22T00:31:15.981176 #2792304] INFO -- : [238/885] 2833651=test_digest I, [2024-05-22T00:31:15.998434 #2792304] INFO -- : [239/885] 2833666=test_ractor I, [2024-05-22T00:31:16.050189 #2792304] INFO -- : [240/885] 2833656=test_find I, [2024-05-22T00:31:16.066567 #2792304] INFO -- : [241/885] 2833656=test_fiddle I, [2024-05-22T00:31:16.090954 #2792304] INFO -- : [242/885] 2833656=test_wss I, [2024-05-22T00:31:16.103341 #2792304] INFO -- : [243/885] 2833656=test_comparable I, [2024-05-22T00:31:16.110066 #2792304] INFO -- : [244/885] 2833656=test_rdoc_parser_c I, [2024-05-22T00:31:16.112377 #2792304] INFO -- : [245/885] 2833666=test_io_timeout I, [2024-05-22T00:31:16.122626 #2792304] INFO -- : [246/885] 2833666=test_shapes I, [2024-05-22T00:31:16.124889 #2792304] INFO -- : [247/885] 2833666=json_fixtures_test I, [2024-05-22T00:31:16.136117 #2792304] INFO -- : [248/885] 2833666=test_pstore I, [2024-05-22T00:31:16.149673 #2792304] INFO -- : [249/885] 2833663=test_cstr I, [2024-05-22T00:31:16.181043 #2792304] INFO -- : [250/885] 2833666=test_profile_frames I, [2024-05-22T00:31:16.182911 #2792304] INFO -- : [251/885] 2833665=test_class2name I, [2024-05-22T00:31:16.201926 #2792304] INFO -- : [252/885] 2833665=test_gbk I, [2024-05-22T00:31:16.205385 #2792304] INFO -- : [253/885] 2833665=test_enc_str_buf_cat I, [2024-05-22T00:31:16.208604 #2792304] INFO -- : [254/885] 2833665=test_forwardable I, [2024-05-22T00:31:16.225045 #2792304] INFO -- : [255/885] 2833665=test_yaml I, [2024-05-22T00:31:16.301732 #2792304] INFO -- : [256/885] 2833665=test_wait I, [2024-05-22T00:31:16.349690 #2792304] INFO -- : [257/885] 2833666=test_handle I, [2024-05-22T00:31:16.349880 #2792304] INFO -- : [258/885] 2833667=test_big2str I, [2024-05-22T00:31:16.350326 #2792304] INFO -- : [259/885] 2833652=test_ractor I, [2024-05-22T00:31:16.352603 #2792304] INFO -- : [260/885] 2833667=test_euc_tw I, [2024-05-22T00:31:16.355350 #2792304] INFO -- : [261/885] 2833665=test_bmethod I, [2024-05-22T00:31:16.355414 #2792304] INFO -- : [262/885] 2833667=test_gem_commands_sources_command I, [2024-05-22T00:31:16.360237 #2792304] INFO -- : [263/885] 2833665=test_ansi_without_terminfo I, [2024-05-22T00:31:16.367183 #2792304] INFO -- : [264/885] 2833652=test_thread_queue I, [2024-05-22T00:31:16.379910 #2792304] INFO -- : [265/885] 2833665=test_nowrite I, [2024-05-22T00:31:16.398330 #2792304] INFO -- : [266/885] 2833665=test_rdoc_markup_formatter I, [2024-05-22T00:31:16.406656 #2792304] INFO -- : [267/885] 2833665=test_inlinecache I, [2024-05-22T00:31:16.446383 #2792304] INFO -- : [268/885] 2833659=test_rdoc_markup_verbatim I, [2024-05-22T00:31:16.449380 #2792304] INFO -- : [269/885] 2833659=test_path_to_class I, [2024-05-22T00:31:16.451925 #2792304] INFO -- : [270/885] 2833659=test_gem_resolver_specification I, [2024-05-22T00:31:16.463146 #2792304] INFO -- : [271/885] 2833654=test_gem_dependency I, [2024-05-22T00:31:16.481983 #2792304] INFO -- : [272/885] 2833665=test_frozen_error I, [2024-05-22T00:31:16.485712 #2792304] INFO -- : [273/885] 2833665=test_method_cache I, [2024-05-22T00:31:16.490388 #2792304] INFO -- : [274/885] 2833665=test_gem_stub_specification I, [2024-05-22T00:31:16.502129 #2792304] INFO -- : [275/885] 2833656=test_gem_ext_ext_conf_builder I, [2024-05-22T00:31:16.514174 #2792304] INFO -- : [276/885] 2833659=test_complex I, [2024-05-22T00:31:16.554072 #2792304] INFO -- : [277/885] 2833666=test_gem_commands_search_command I, [2024-05-22T00:31:16.558545 #2792304] INFO -- : [278/885] 2833654=test_scanner_events I, [2024-05-22T00:31:16.561544 #2792304] INFO -- : [279/885] 2833666=test_gem_resolver_installed_specification I, [2024-05-22T00:31:16.573936 #2792304] INFO -- : [280/885] 2833666=test_parse I, [2024-05-22T00:31:16.588559 #2792304] INFO -- : [281/885] 2833654=test_mdns I, [2024-05-22T00:31:16.605772 #2792304] INFO -- : [282/885] 2833654=test_gem_remote_fetcher I, [2024-05-22T00:31:16.641168 #2792304] INFO -- : [283/885] 2833659=test_too_many_dummy_encodings I, [2024-05-22T00:31:16.661501 #2792304] INFO -- : [284/885] 2833665=test_rdoc_include I, [2024-05-22T00:31:16.672334 #2792304] INFO -- : [285/885] 2833667=test_reqarg I, [2024-05-22T00:31:16.693590 #2792304] INFO -- : [286/885] 2833665=test_gem_commands_list_command I, [2024-05-22T00:31:16.697747 #2792304] INFO -- : [287/885] 2833658=test_stack I, [2024-05-22T00:31:16.705705 #2792304] INFO -- : [288/885] 2833659=test_string_processing I, [2024-05-22T00:31:16.707171 #2792304] INFO -- : [289/885] 2833665=test_fileutils I, [2024-05-22T00:31:16.708089 #2792304] INFO -- : [290/885] 2833659=test_ldap I, [2024-05-22T00:31:16.717683 #2792304] INFO -- : [291/885] 2833659=test_emitter I, [2024-05-22T00:31:16.720128 #2792304] INFO -- : [292/885] 2833659=test_resource I, [2024-05-22T00:31:16.745378 #2792304] INFO -- : [293/885] 2833659=test_gem_commands_signin_command I, [2024-05-22T00:31:16.829817 #2792304] INFO -- : [294/885] 2833651=test_gem_version I, [2024-05-22T00:31:16.865400 #2792304] INFO -- : [295/885] 2833659=test_econv I, [2024-05-22T00:31:16.913609 #2792304] INFO -- : [296/885] 2833663=test_cesu8 I, [2024-05-22T00:31:16.914561 #2792304] INFO -- : [297/885] 2833651=test_rdoc_options I, [2024-05-22T00:31:16.919023 #2792304] INFO -- : [298/885] 2833663=test_tempfile I, [2024-05-22T00:31:16.962389 #2792304] INFO -- : [299/885] 2833669=parse_comments_test I, [2024-05-22T00:31:17.025228 #2792304] INFO -- : [300/885] 2833669=test_noarg I, [2024-05-22T00:31:17.055985 #2792304] INFO -- : [301/885] 2833661=test_function I, [2024-05-22T00:31:17.058134 #2792304] INFO -- : [302/885] 2833665=test_queue I, [2024-05-22T00:31:17.061865 #2792304] INFO -- : [303/885] 2833667=test_internal_ivar I, [2024-05-22T00:31:17.062651 #2792304] INFO -- : [304/885] 2833665=test_gem_resolver_index_specification I, [2024-05-22T00:31:17.066467 #2792304] INFO -- : [305/885] 2833667=test_duplicate I, [2024-05-22T00:31:17.070414 #2792304] INFO -- : [306/885] 2833667=test_utf32 I, [2024-05-22T00:31:17.077228 #2792304] INFO -- : [307/885] 2833667=test_basicsocket I, [2024-05-22T00:31:17.087619 #2792304] INFO -- : [308/885] 2833667=test_prettyprint I, [2024-05-22T00:31:17.103252 #2792304] INFO -- : [309/885] 2833667=test_tracepoint I, [2024-05-22T00:31:17.119876 #2792304] INFO -- : [310/885] 2833665=test_gem_commands_help_command I, [2024-05-22T00:31:17.131323 #2792304] INFO -- : [311/885] 2833666=test_rdoc_markup I, [2024-05-22T00:31:17.142061 #2792304] INFO -- : [312/885] 2833666=test_yamlstore I, [2024-05-22T00:31:17.152112 #2792304] INFO -- : [313/885] 2833666=test_gem_installer I, [2024-05-22T00:31:17.184967 #2792304] INFO -- : [314/885] 2833665=test_date_strftime I, [2024-05-22T00:31:17.195643 #2792304] INFO -- : [315/885] 2833651=test_rdoc_parser_rd I, [2024-05-22T00:31:17.196924 #2792304] INFO -- : [316/885] 2833669=test_irb I, [2024-05-22T00:31:17.205151 #2792304] INFO -- : [317/885] 2833651=json_string_matching_test I, [2024-05-22T00:31:17.211996 #2792304] INFO -- : [318/885] 2833663=test_load I, [2024-05-22T00:31:17.215057 #2792304] INFO -- : [319/885] 2833651=test_class I, [2024-05-22T00:31:17.218722 #2792304] INFO -- : [320/885] 2833663=test_rdoc_normal_class I, [2024-05-22T00:31:17.258865 #2792304] INFO -- : [321/885] 2833663=test_const I, [2024-05-22T00:31:17.262681 #2792304] INFO -- : [322/885] 2833663=test_asn1 I, [2024-05-22T00:31:17.281684 #2792304] INFO -- : [323/885] 2833663=test_random I, [2024-05-22T00:31:17.283251 #2792304] INFO -- : [324/885] 2833663=test_gem_commands_query_command I, [2024-05-22T00:31:17.309361 #2792304] INFO -- : [325/885] 2833660=test_method I, [2024-05-22T00:31:17.319891 #2792304] INFO -- : [326/885] 2833661=test_rdoc_rubygems_hook I, [2024-05-22T00:31:17.331208 #2792304] INFO -- : [327/885] 2833662=test_pattern_key_name_check I, [2024-05-22T00:31:17.332871 #2792304] INFO -- : [328/885] 2833667=test_to_ruby I, [2024-05-22T00:31:17.341343 #2792304] INFO -- : [329/885] 2833662=test_gem_impossible_dependencies_error I, [2024-05-22T00:31:17.344908 #2792304] INFO -- : [330/885] 2833662=test_array_create I, [2024-05-22T00:31:17.348583 #2792304] INFO -- : [331/885] 2833662=test_pack I, [2024-05-22T00:31:17.349912 #2792304] INFO -- : [332/885] 2833667=test_ftp I, [2024-05-22T00:31:17.371626 #2792304] INFO -- : [333/885] 2833667=test_rdoc_context_section I, [2024-05-22T00:31:17.384741 #2792304] INFO -- : [334/885] 2833667=test_euc_kr I, [2024-05-22T00:31:17.386136 #2792304] INFO -- : [335/885] 2833667=test_type_completor I, [2024-05-22T00:31:17.391836 #2792304] INFO -- : [336/885] 2833661=test_console_attr I, [2024-05-22T00:31:17.392270 #2792304] INFO -- : [337/885] 2833667=test_summary I, [2024-05-22T00:31:17.395868 #2792304] INFO -- : [338/885] 2833661=test_ellipsize I, [2024-05-22T00:31:17.406356 #2792304] INFO -- : [339/885] 2833661=test_date_attr I, [2024-05-22T00:31:17.410603 #2792304] INFO -- : [340/885] 2833661=test_io_wait I, [2024-05-22T00:31:17.414117 #2792304] INFO -- : [341/885] 2833655=test_gem_commands_exec_command I, [2024-05-22T00:31:17.439366 #2792304] INFO -- : [342/885] 2833669=warnings_test I, [2024-05-22T00:31:17.444242 #2792304] INFO -- : [343/885] 2833669=test_kwargs I, [2024-05-22T00:31:17.447080 #2792304] INFO -- : [344/885] 2833667=test_sorted_set I, [2024-05-22T00:31:17.449824 #2792304] INFO -- : [345/885] 2833669=test_win32ole_type_event I, [2024-05-22T00:31:17.455191 #2792304] INFO -- : [346/885] 2833669=test_emoji I, [2024-05-22T00:31:17.484187 #2792304] INFO -- : [347/885] 2833669=test_ubf_async_safe I, [2024-05-22T00:31:17.493843 #2792304] INFO -- : [348/885] 2833669=test_hash I, [2024-05-22T00:31:17.505073 #2792304] INFO -- : [349/885] 2833665=test_io I, [2024-05-22T00:31:17.506855 #2792304] INFO -- : [350/885] 2833658=test_cp949 I, [2024-05-22T00:31:17.512901 #2792304] INFO -- : [351/885] 2833658=test_gem_commands_uninstall_command I, [2024-05-22T00:31:17.567673 #2792304] INFO -- : [352/885] 2833662=test_gem_source_specific_file I, [2024-05-22T00:31:17.615182 #2792304] INFO -- : [353/885] 2833667=test_foreach I, [2024-05-22T00:31:17.616714 #2792304] INFO -- : [354/885] 2833667=test_condition I, [2024-05-22T00:31:17.621701 #2792304] INFO -- : [355/885] 2833667=test_gem_unsatisfiable_dependency_error I, [2024-05-22T00:31:17.628618 #2792304] INFO -- : [356/885] 2833667=test_win32ole_record I, [2024-05-22T00:31:17.631922 #2792304] INFO -- : [357/885] 2833667=test_gem_request_set_lockfile I, [2024-05-22T00:31:17.641898 #2792304] INFO -- : [358/885] 2833662=test_raise_exception I, [2024-05-22T00:31:17.742000 #2792304] INFO -- : [359/885] 2833661=test_protect I, [2024-05-22T00:31:17.746775 #2792304] INFO -- : [360/885] 2833661=test_win32ole_typelib I, [2024-05-22T00:31:17.752319 #2792304] INFO -- : [361/885] 2833661=test_tree_builder I, [2024-05-22T00:31:17.761152 #2792304] INFO -- : [362/885] 2833665=test_gem_resolver_dependency_request I, [2024-05-22T00:31:17.766688 #2792304] INFO -- : [363/885] 2833661=test_hash I, [2024-05-22T00:31:17.774235 #2792304] INFO -- : [364/885] 2833661=test_postponed_job I, [2024-05-22T00:31:17.792259 #2792304] INFO -- : [365/885] 2833665=test_alias_and_anchor I, [2024-05-22T00:31:17.798108 #2792304] INFO -- : [366/885] 2833665=test_external_new I, [2024-05-22T00:31:17.803292 #2792304] INFO -- : [367/885] 2833665=test_ws I, [2024-05-22T00:31:17.828719 #2792304] INFO -- : [368/885] 2833665=test_gem_commands_environment_command I, [2024-05-22T00:31:17.850677 #2792304] INFO -- : [369/885] 2833656=test_m17n I, [2024-05-22T00:31:17.869871 #2792304] INFO -- : [370/885] 2833665=test_workspace I, [2024-05-22T00:31:17.888472 #2792304] INFO -- : [371/885] 2833667=test_weakmap I, [2024-05-22T00:31:17.913913 #2792304] INFO -- : [372/885] 2833656=test_yjit I, [2024-05-22T00:31:17.919220 #2792304] INFO -- : [373/885] 2833656=test_kill_ring I, [2024-05-22T00:31:17.920770 #2792304] INFO -- : [374/885] 2833663=test_ns_spki I, [2024-05-22T00:31:17.932131 #2792304] INFO -- : [375/885] 2833659=test_framework I, [2024-05-22T00:31:17.942720 #2792304] INFO -- : [376/885] 2833659=test_argf I, [2024-05-22T00:31:17.947055 #2792304] INFO -- : [377/885] 2833663=test_line_editor I, [2024-05-22T00:31:17.981560 #2792304] INFO -- : [378/885] 2833656=test_objspace I, [2024-05-22T00:31:17.986023 #2792304] INFO -- : [379/885] 2833665=ripper_test I, [2024-05-22T00:31:18.006144 #2792304] INFO -- : [380/885] 2833663=test_undef I, [2024-05-22T00:31:18.014086 #2792304] INFO -- : [381/885] 2833663=test_string_memory I, [2024-05-22T00:31:18.098473 #2792304] INFO -- : [382/885] 2833663=comments_test I, [2024-05-22T00:31:18.180061 #2792304] INFO -- : [383/885] 2833661=test_sprintf I, [2024-05-22T00:31:18.193529 #2792304] INFO -- : [384/885] 2833663=test_gem_requirement I, [2024-05-22T00:31:18.287572 #2792304] INFO -- : [385/885] 2833658=test_gem_security_trust_dir I, [2024-05-22T00:31:18.310078 #2792304] INFO -- : [386/885] 2833662=test_show_source I, [2024-05-22T00:31:18.329252 #2792304] INFO -- : [387/885] 2833658=test_set I, [2024-05-22T00:31:18.335304 #2792304] INFO -- : [388/885] 2833658=test_lock_native_thread I, [2024-05-22T00:31:18.352855 #2792304] INFO -- : [389/885] 2833663=test_c_struct_entry I, [2024-05-22T00:31:18.369797 #2792304] INFO -- : [390/885] 2833662=test_gem_commands_stale_command I, [2024-05-22T00:31:18.383715 #2792304] INFO -- : [391/885] 2833662=test_remote_fetch_error I, [2024-05-22T00:31:18.396915 #2792304] INFO -- : [392/885] 2833661=test_have_library I, [2024-05-22T00:31:18.397367 #2792304] INFO -- : [393/885] 2833662=test_optparse I, [2024-05-22T00:31:18.411553 #2792304] INFO -- : [394/885] 2833655=test_array I, [2024-05-22T00:31:18.423393 #2792304] INFO -- : [395/885] 2833655=test_fstring I, [2024-05-22T00:31:18.486366 #2792304] INFO -- : [396/885] 2833662=test_rdoc_markup_to_html_crossref I, [2024-05-22T00:31:18.551043 #2792304] INFO -- : [397/885] 2833665=encoding_test I, [2024-05-22T00:31:18.580615 #2792304] INFO -- : [398/885] 2833655=test_gem_resolver_best_set I, [2024-05-22T00:31:18.619129 #2792304] INFO -- : [399/885] 2833658=test_typeddata I, [2024-05-22T00:31:18.632640 #2792304] INFO -- : [400/885] 2833654=test_rat I, [2024-05-22T00:31:18.641343 #2792304] INFO -- : [401/885] 2833654=test_webauthn_poller I, [2024-05-22T00:31:18.643001 #2792304] INFO -- : [402/885] 2833665=test_rdoc_markup_raw I, [2024-05-22T00:31:18.647271 #2792304] INFO -- : [403/885] 2833665=test_stringscanner I, [2024-05-22T00:31:18.647849 #2792304] INFO -- : [404/885] 2833655=test_files_sample I, [2024-05-22T00:31:18.649087 #2792304] INFO -- : [405/885] 2833663=test_rdoc_alias I, [2024-05-22T00:31:18.649365 #2792304] INFO -- : [406/885] 2833655=test_yield I, [2024-05-22T00:31:18.661672 #2792304] INFO -- : [407/885] 2833663=parser_test I, [2024-05-22T00:31:18.668176 #2792304] INFO -- : [408/885] 2833663=test_convertible I, [2024-05-22T00:31:18.701786 #2792304] INFO -- : [409/885] 2833650=test_gem_resolver_conflict I, [2024-05-22T00:31:18.708254 #2792304] INFO -- : [410/885] 2833665=test_rdoc_task I, [2024-05-22T00:31:18.709825 #2792304] INFO -- : [411/885] 2833665=test_backtrace I, [2024-05-22T00:31:18.809670 #2792304] INFO -- : [412/885] 2833662=test_pack I, [2024-05-22T00:31:18.823275 #2792304] INFO -- : [413/885] 2833654=ruby_parser_test I, [2024-05-22T00:31:18.829453 #2792304] INFO -- : [414/885] 2833662=test_io_buffer I, [2024-05-22T00:31:18.877050 #2792304] INFO -- : [415/885] 2833658=test_rdoc_markup_indented_paragraph I, [2024-05-22T00:31:18.878085 #2792304] INFO -- : [416/885] 2833658=test_rdoc_require I, [2024-05-22T00:31:18.882355 #2792304] INFO -- : [417/885] 2833650=locals_test I, [2024-05-22T00:31:18.890647 #2792304] INFO -- : [418/885] 2833654=test_readpartial I, [2024-05-22T00:31:18.893883 #2792304] INFO -- : [419/885] 2833658=test_gem_commands_install_command I, [2024-05-22T00:31:18.933974 #2792304] INFO -- : [420/885] 2833662=test_clone I, [2024-05-22T00:31:19.111661 #2792304] INFO -- : [421/885] 2833662=test_yaml_tree I, [2024-05-22T00:31:19.128202 #2792304] INFO -- : [422/885] 2833662=test_sleep I, [2024-05-22T00:31:19.232620 #2792304] INFO -- : [423/885] 2833650=test_config I, [2024-05-22T00:31:19.293883 #2792304] INFO -- : [424/885] 2833650=test_libs I, [2024-05-22T00:31:19.296422 #2792304] INFO -- : [425/885] 2833654=test_gem_commands_fetch_command I, [2024-05-22T00:31:19.318882 #2792304] INFO -- : [426/885] 2833650=test_math I, [2024-05-22T00:31:19.335451 #2792304] INFO -- : [427/885] 2833650=test_gc I, [2024-05-22T00:31:19.337685 #2792304] INFO -- : [428/885] 2833650=test_io I, [2024-05-22T00:31:19.419545 #2792304] INFO -- : [429/885] 2833654=test_unicode_escape I, [2024-05-22T00:31:19.431626 #2792304] INFO -- : [430/885] 2833653=test_utf16 I, [2024-05-22T00:31:19.437998 #2792304] INFO -- : [431/885] 2833653=test_autoload I, [2024-05-22T00:31:19.511847 #2792304] INFO -- : [432/885] 2833654=test_rendering I, [2024-05-22T00:31:19.523287 #2792304] INFO -- : [433/885] 2833654=test_sizeof I, [2024-05-22T00:31:19.539402 #2792304] INFO -- : [434/885] 2833664=test_case I, [2024-05-22T00:31:19.573003 #2792304] INFO -- : [435/885] 2833664=test_face I, [2024-05-22T00:31:19.621663 #2792304] INFO -- : [436/885] 2833664=test_system I, [2024-05-22T00:31:19.676074 #2792304] INFO -- : [437/885] 2833661=test_pkcs12 I, [2024-05-22T00:31:19.949617 #2792304] INFO -- : [438/885] 2833651=test_gem_package_tar_header I, [2024-05-22T00:31:19.982137 #2792304] INFO -- : [439/885] 2833661=test_gem_util I, [2024-05-22T00:31:20.000777 #2792304] INFO -- : [440/885] 2833651=test_iseq_load I, [2024-05-22T00:31:20.037960 #2792304] INFO -- : [441/885] 2833665=test_pkey_dh I, [2024-05-22T00:31:20.063917 #2792304] INFO -- : [442/885] 2833660=test_bigzero I, [2024-05-22T00:31:20.067711 #2792304] INFO -- : [443/885] 2833660=test_getopts I, [2024-05-22T00:31:20.070007 #2792304] INFO -- : [444/885] 2833660=test_protocol I, [2024-05-22T00:31:20.093434 #2792304] INFO -- : [445/885] 2833667=test_gem_resolver_activation_request I, [2024-05-22T00:31:20.100430 #2792304] INFO -- : [446/885] 2833667=test_gem_config_file I, [2024-05-22T00:31:20.122336 #2792304] INFO -- : [447/885] 2833665=test_ripper I, [2024-05-22T00:31:20.133513 #2792304] INFO -- : [448/885] 2833658=test_etc I, [2024-05-22T00:31:20.176315 #2792304] INFO -- : [449/885] 2833661=test_yjit_exit_locations I, [2024-05-22T00:31:20.177488 #2792304] INFO -- : [450/885] 2833661=test_delegate I, [2024-05-22T00:31:20.193999 #2792304] INFO -- : [451/885] 2833667=test_popen_deadlock I, [2024-05-22T00:31:20.203893 #2792304] INFO -- : [452/885] 2833661=test_history I, [2024-05-22T00:31:20.215354 #2792304] INFO -- : [453/885] 2833661=test_mkmf I, [2024-05-22T00:31:20.218973 #2792304] INFO -- : [454/885] 2833658=test_date_marshal I, [2024-05-22T00:31:20.223345 #2792304] INFO -- : [455/885] 2833658=test_recursion I, [2024-05-22T00:31:20.227039 #2792304] INFO -- : [456/885] 2833658=test_exit I, [2024-05-22T00:31:20.238257 #2792304] INFO -- : [457/885] 2833661=test_digest I, [2024-05-22T00:31:20.259099 #2792304] INFO -- : [458/885] 2833661=test_ractor I, [2024-05-22T00:31:20.300536 #2792304] INFO -- : [459/885] 2833661=test_rdoc_servlet I, [2024-05-22T00:31:20.312000 #2792304] INFO -- : [460/885] 2833658=test_gem_security I, [2024-05-22T00:31:20.381488 #2792304] INFO -- : [461/885] 2833660=test_multi_irb_commands I, [2024-05-22T00:31:20.389711 #2792304] INFO -- : [462/885] 2833660=test_fiber I, [2024-05-22T00:31:20.436859 #2792304] INFO -- : [463/885] 2833661=test_open3 I, [2024-05-22T00:31:20.468721 #2792304] INFO -- : [464/885] 2833665=test_bundled_ca I, [2024-05-22T00:31:20.511622 #2792304] INFO -- : [465/885] 2833664=test_closure I, [2024-05-22T00:31:20.638254 #2792304] INFO -- : [466/885] 2833652=test_emoji_breaks I, [2024-05-22T00:31:20.646502 #2792304] INFO -- : [467/885] 2833652=test_gem_bundler_version_finder I, [2024-05-22T00:31:20.667743 #2792304] INFO -- : [468/885] 2833652=test_within_pipe I, [2024-05-22T00:31:20.694667 #2792304] INFO -- : [469/885] 2833652=reflection_test I, [2024-05-22T00:31:20.699965 #2792304] INFO -- : [470/885] 2833664=test_files_lib I, [2024-05-22T00:31:20.727530 #2792304] INFO -- : [471/885] 2833657=test_gem_commands_unpack_command I, [2024-05-22T00:31:20.781407 #2792304] INFO -- : [472/885] 2833652=test_beginendblock I, [2024-05-22T00:31:20.832216 #2792304] INFO -- : [473/885] 2833667=test_help I, [2024-05-22T00:31:20.833840 #2792304] INFO -- : [474/885] 2833655=test_rdoc_markup_to_bs I, [2024-05-22T00:31:20.839509 #2792304] INFO -- : [475/885] 2833667=test_rdoc_markup_pre_process I, [2024-05-22T00:31:20.872218 #2792304] INFO -- : [476/885] 2833655=test_printf I, [2024-05-22T00:31:20.881697 #2792304] INFO -- : [477/885] 2833655=test_to_ary_concat I, [2024-05-22T00:31:20.892205 #2792304] INFO -- : [478/885] 2833667=test_time I, [2024-05-22T00:31:21.018754 #2792304] INFO -- : [479/885] 2833657=test_webauthn_listener_response I, [2024-05-22T00:31:21.036510 #2792304] INFO -- : [480/885] 2833657=test_stream I, [2024-05-22T00:31:21.077304 #2792304] INFO -- : [481/885] 2833657=test_pinned I, [2024-05-22T00:31:21.091307 #2792304] INFO -- : [482/885] 2833667=test_exception_at_throwing I, [2024-05-22T00:31:21.113602 #2792304] INFO -- : [483/885] 2833657=test_iseq I, [2024-05-22T00:31:21.149864 #2792304] INFO -- : [484/885] 2833667=test_rdoc_markup_heading I, [2024-05-22T00:31:21.161845 #2792304] INFO -- : [485/885] 2833667=test_ocsp I, [2024-05-22T00:31:21.192923 #2792304] INFO -- : [486/885] 2833662=test_class I, [2024-05-22T00:31:21.197236 #2792304] INFO -- : [487/885] 2833652=test_pkey_dsa I, [2024-05-22T00:31:21.203778 #2792304] INFO -- : [488/885] 2833662=test_scheduler I, [2024-05-22T00:31:21.346570 #2792304] INFO -- : [489/885] 2833662=test_gem_commands_build_command I, [2024-05-22T00:31:21.354276 #2792304] INFO -- : [490/885] 2833651=test_interned_str I, [2024-05-22T00:31:21.360447 #2792304] INFO -- : [491/885] 2833651=test_case_comprehensive I, [2024-05-22T00:31:21.419520 #2792304] INFO -- : [492/885] 2833667=test_io_m17n I, [2024-05-22T00:31:21.671253 #2792304] INFO -- : [493/885] 2833662=test_variable_name_check I, [2024-05-22T00:31:21.695706 #2792304] INFO -- : [494/885] 2833657=test_did_you_mean I, [2024-05-22T00:31:21.704663 #2792304] INFO -- : [495/885] 2833662=test_gem_commands_server_command I, [2024-05-22T00:31:21.706256 #2792304] INFO -- : [496/885] 2833662=test_append I, [2024-05-22T00:31:21.707246 #2792304] INFO -- : [497/885] 2833666=test_option I, [2024-05-22T00:31:21.713944 #2792304] INFO -- : [498/885] 2833662=test_cmethod I, [2024-05-22T00:31:21.718842 #2792304] INFO -- : [499/885] 2833662=test_tracer I, [2024-05-22T00:31:21.722808 #2792304] INFO -- : [500/885] 2833662=test_rdoc_method_attr I, [2024-05-22T00:31:21.788175 #2792304] INFO -- : [501/885] 2833669=test_filter I, [2024-05-22T00:31:21.813127 #2792304] INFO -- : [502/885] 2833655=test_gem_gem_runner I, [2024-05-22T00:31:21.824734 #2792304] INFO -- : [503/885] 2833669=test_data I, [2024-05-22T00:31:21.826865 #2792304] INFO -- : [504/885] 2833662=static_literals_test I, [2024-05-22T00:31:21.829479 #2792304] INFO -- : [505/885] 2833669=test_rdoc_generator_pot I, [2024-05-22T00:31:21.836620 #2792304] INFO -- : [506/885] 2833666=test_enumerator I, [2024-05-22T00:31:21.837716 #2792304] INFO -- : [507/885] 2833655=test_rdoc_parser_changelog I, [2024-05-22T00:31:21.844467 #2792304] INFO -- : [508/885] 2833657=parameters_signature_test I, [2024-05-22T00:31:21.847914 #2792304] INFO -- : [509/885] 2833666=test_koi8 I, [2024-05-22T00:31:21.853680 #2792304] INFO -- : [510/885] 2833666=test_unicode I, [2024-05-22T00:31:21.879404 #2792304] INFO -- : [511/885] 2833662=test_ssl_session I, [2024-05-22T00:31:21.891820 #2792304] INFO -- : [512/885] 2833655=test_lexer I, [2024-05-22T00:31:21.895009 #2792304] INFO -- : [513/885] 2833665=test_thread_cv I, [2024-05-22T00:31:21.901894 #2792304] INFO -- : [514/885] 2833655=test_gem_resolver_vendor_specification I, [2024-05-22T00:31:21.910566 #2792304] INFO -- : [515/885] 2833666=test_gem_commands_update_command I, [2024-05-22T00:31:21.919194 #2792304] INFO -- : [516/885] 2833655=test_gem_uri I, [2024-05-22T00:31:21.946315 #2792304] INFO -- : [517/885] 2833655=test_key_event_record I, [2024-05-22T00:31:21.971073 #2792304] INFO -- : [518/885] 2833655=test_notimplement I, [2024-05-22T00:31:21.974144 #2792304] INFO -- : [519/885] 2833655=test_random I, [2024-05-22T00:31:21.980813 #2792304] INFO -- : [520/885] 2833655=test_bug-14834 I, [2024-05-22T00:31:21.986746 #2792304] INFO -- : [521/885] 2833657=test_date_compat I, [2024-05-22T00:31:21.993284 #2792304] INFO -- : [522/885] 2833657=test_rdoc_markup_to_html I, [2024-05-22T00:31:22.027465 #2792304] INFO -- : [523/885] 2833669=test_terminfo I, [2024-05-22T00:31:22.029582 #2792304] INFO -- : [524/885] 2833669=test_compile_prism I, [2024-05-22T00:31:22.061247 #2792304] INFO -- : [525/885] 2833655=test_bn I, [2024-05-22T00:31:22.089841 #2792304] INFO -- : [526/885] 2833657=test_win32ole_param_event I, [2024-05-22T00:31:22.094382 #2792304] INFO -- : [527/885] 2833657=test_path I, [2024-05-22T00:31:22.099793 #2792304] INFO -- : [528/885] 2833659=redundant_return_test I, [2024-05-22T00:31:22.100355 #2792304] INFO -- : [529/885] 2833659=test_case_mapping I, [2024-05-22T00:31:22.106159 #2792304] INFO -- : [530/885] 2833655=test_tree_spell_checker I, [2024-05-22T00:31:22.107195 #2792304] INFO -- : [531/885] 2833657=test_http I, [2024-05-22T00:31:22.115210 #2792304] INFO -- : [532/885] 2833659=test_addrinfo I, [2024-05-22T00:31:22.137672 #2792304] INFO -- : [533/885] 2833655=test_httpheader I, [2024-05-22T00:31:22.144169 #2792304] INFO -- : [534/885] 2833659=test_gem_resolver_local_specification I, [2024-05-22T00:31:22.175272 #2792304] INFO -- : [535/885] 2833659=test_rdoc_ri_driver I, [2024-05-22T00:31:22.197107 #2792304] INFO -- : [536/885] 2833655=test_set_len I, [2024-05-22T00:31:22.201440 #2792304] INFO -- : [537/885] 2833655=test_httpresponses I, [2024-05-22T00:31:22.204578 #2792304] INFO -- : [538/885] 2833655=test_encoding I, [2024-05-22T00:31:22.223309 #2792304] INFO -- : [539/885] 2833655=test_sockopt I, [2024-05-22T00:31:22.225529 #2792304] INFO -- : [540/885] 2833655=test_install I, [2024-05-22T00:31:22.369722 #2792304] INFO -- : [541/885] 2833659=test_rdoc_markup_to_label I, [2024-05-22T00:31:22.385833 #2792304] INFO -- : [542/885] 2833669=test_key_stroke I, [2024-05-22T00:31:22.387367 #2792304] INFO -- : [543/885] 2833659=json_encoding_test I, [2024-05-22T00:31:22.415189 #2792304] INFO -- : [544/885] 2833659=test_color I, [2024-05-22T00:31:22.422754 #2792304] INFO -- : [545/885] 2833669=test_primitive I, [2024-05-22T00:31:22.424913 #2792304] INFO -- : [546/885] 2833655=test_human_typo I, [2024-05-22T00:31:22.428955 #2792304] INFO -- : [547/885] 2833669=test_rbconfig I, [2024-05-22T00:31:22.432167 #2792304] INFO -- : [548/885] 2833655=test_document I, [2024-05-22T00:31:22.433956 #2792304] INFO -- : [549/885] 2833669=test_acceptable I, [2024-05-22T00:31:22.436365 #2792304] INFO -- : [550/885] 2833655=test_rdoc_generator_pot_po_entry I, [2024-05-22T00:31:22.437868 #2792304] INFO -- : [551/885] 2833659=test_euc_jp I, [2024-05-22T00:31:22.441696 #2792304] INFO -- : [552/885] 2833659=test_pair I, [2024-05-22T00:31:22.444927 #2792304] INFO -- : [553/885] 2833655=test_win32ole_param I, [2024-05-22T00:31:22.448041 #2792304] INFO -- : [554/885] 2833655=test_gem_commands_yank_command I, [2024-05-22T00:31:22.514900 #2792304] INFO -- : [555/885] 2833669=test_chilled I, [2024-05-22T00:31:22.524199 #2792304] INFO -- : [556/885] 2833669=test_name_error_extension I, [2024-05-22T00:31:22.537002 #2792304] INFO -- : [557/885] 2833669=test_rdoc_i18n_locale I, [2024-05-22T00:31:22.546469 #2792304] INFO -- : [558/885] 2833669=test_erb I, [2024-05-22T00:31:22.553787 #2792304] INFO -- : [559/885] 2833665=test_x509ext I, [2024-05-22T00:31:22.560899 #2792304] INFO -- : [560/885] 2833654=test_gem_source_installed I, [2024-05-22T00:31:22.563365 #2792304] INFO -- : [561/885] 2833665=test_gem_commands_cert_command I, [2024-05-22T00:31:22.570454 #2792304] INFO -- : [562/885] 2833654=test_completion I, [2024-05-22T00:31:22.593540 #2792304] INFO -- : [563/885] 2833669=test_len I, [2024-05-22T00:31:22.597302 #2792304] INFO -- : [564/885] 2833669=test_yield_block I, [2024-05-22T00:31:22.598947 #2792304] INFO -- : [565/885] 2833669=test_rational2 I, [2024-05-22T00:31:22.609301 #2792304] INFO -- : [566/885] 2833669=test_rational I, [2024-05-22T00:31:22.631064 #2792304] INFO -- : [567/885] 2833669=test_assembler I, [2024-05-22T00:31:22.636871 #2792304] INFO -- : [568/885] 2833669=test_spell_checker I, [2024-05-22T00:31:22.644523 #2792304] INFO -- : [569/885] 2833669=test_propertyputref I, [2024-05-22T00:31:22.646103 #2792304] INFO -- : [570/885] 2833669=attribute_write_test I, [2024-05-22T00:31:22.651507 #2792304] INFO -- : [571/885] 2833669=test_win32ole_method_event I, [2024-05-22T00:31:22.652737 #2792304] INFO -- : [572/885] 2833669=test_nesting_parser I, [2024-05-22T00:31:22.667621 #2792304] INFO -- : [573/885] 2833669=test_gem_dependency_list I, [2024-05-22T00:31:22.738636 #2792304] INFO -- : [574/885] 2833669=test_benchmark I, [2024-05-22T00:31:22.793648 #2792304] INFO -- : [575/885] 2833667=test_gem_commands_outdated_command I, [2024-05-22T00:31:22.841534 #2792304] INFO -- : [576/885] 2833667=test_array I, [2024-05-22T00:31:22.843592 #2792304] INFO -- : [577/885] 2833661=test_helper_method I, [2024-05-22T00:31:22.843937 #2792304] INFO -- : [578/885] 2833662=test_gem_package_tar_writer I, [2024-05-22T00:31:22.875992 #2792304] INFO -- : [579/885] 2833661=test_gem_source I, [2024-05-22T00:31:22.932517 #2792304] INFO -- : [580/885] 2833655=test_scalar_scanner I, [2024-05-22T00:31:22.940525 #2792304] INFO -- : [581/885] 2833655=test_rdoc_parser_simple I, [2024-05-22T00:31:22.954218 #2792304] INFO -- : [582/885] 2833655=test_load I, [2024-05-22T00:31:22.955151 #2792304] INFO -- : [583/885] 2833655=test_yamldbm I, [2024-05-22T00:31:22.964337 #2792304] INFO -- : [584/885] 2833655=test_gem_commands_rebuild_command I, [2024-05-22T00:31:22.973551 #2792304] INFO -- : [585/885] 2833662=test_abi I, [2024-05-22T00:31:23.001455 #2792304] INFO -- : [586/885] 2833655=test_provider I, [2024-05-22T00:31:23.064550 #2792304] INFO -- : [587/885] 2833661=test_evaluation I, [2024-05-22T00:31:23.067975 #2792304] INFO -- : [588/885] 2833661=test_https I, [2024-05-22T00:31:23.076958 #2792304] INFO -- : [589/885] 2833666=test_gem_ext_builder I, [2024-05-22T00:31:23.132008 #2792304] INFO -- : [590/885] 2833662=test_monitor I, [2024-05-22T00:31:23.285378 #2792304] INFO -- : [591/885] 2833654=test_buffered_io I, [2024-05-22T00:31:23.288794 #2792304] INFO -- : [592/885] 2833654=test_configuration I, [2024-05-22T00:31:23.339351 #2792304] INFO -- : [593/885] 2833662=test_rubyvm I, [2024-05-22T00:31:23.348611 #2792304] INFO -- : [594/885] 2833662=test_rdoc_generator_markup I, [2024-05-22T00:31:23.354938 #2792304] INFO -- : [595/885] 2833662=test_whileuntil I, [2024-05-22T00:31:23.359110 #2792304] INFO -- : [596/885] 2833662=test_boolean I, [2024-05-22T00:31:23.365471 #2792304] INFO -- : [597/885] 2833662=test_stringify_symbols I, [2024-05-22T00:31:23.373453 #2792304] INFO -- : [598/885] 2833662=test_instrumentation_api I, [2024-05-22T00:31:23.377703 #2792304] INFO -- : [599/885] 2833661=integer_parse_test I, [2024-05-22T00:31:23.389324 #2792304] INFO -- : [600/885] 2833655=test_ssl I, [2024-05-22T00:31:23.400388 #2792304] INFO -- : [601/885] 2833654=test_gem_ext_cargo_builder I, [2024-05-22T00:31:23.401615 #2792304] INFO -- : [602/885] 2833664=constant_path_node_test I, [2024-05-22T00:31:23.402404 #2792304] INFO -- : [603/885] 2833663=test_gem_request_set I, [2024-05-22T00:31:23.421127 #2792304] INFO -- : [604/885] 2833654=test_module I, [2024-05-22T00:31:23.442319 #2792304] INFO -- : [605/885] 2833661=test_parser I, [2024-05-22T00:31:23.456643 #2792304] INFO -- : [606/885] 2833661=test_method_name_check I, [2024-05-22T00:31:23.461101 #2792304] INFO -- : [607/885] 2833664=test_arith_seq_extract I, [2024-05-22T00:31:23.487781 #2792304] INFO -- : [608/885] 2833661=test_key_error I, [2024-05-22T00:31:23.497331 #2792304] INFO -- : [609/885] 2833661=test_allocation I, [2024-05-22T00:31:23.642973 #2792304] INFO -- : [610/885] 2833664=test_div I, [2024-05-22T00:31:23.656444 #2792304] INFO -- : [611/885] 2833664=test_win32ole_variant_m I, [2024-05-22T00:31:23.657534 #2792304] INFO -- : [612/885] 2833664=test_engine I, [2024-05-22T00:31:23.659585 #2792304] INFO -- : [613/885] 2833664=test_color_printer I, [2024-05-22T00:31:23.672183 #2792304] INFO -- : [614/885] 2833664=test_deprecated I, [2024-05-22T00:31:23.676100 #2792304] INFO -- : [615/885] 2833653=test_insns_leaf I, [2024-05-22T00:31:23.680422 #2792304] INFO -- : [616/885] 2833653=test_serialize_subclasses I, [2024-05-22T00:31:23.681974 #2792304] INFO -- : [617/885] 2833653=test_set I, [2024-05-22T00:31:23.695991 #2792304] INFO -- : [618/885] 2833653=test_struct I, [2024-05-22T00:31:23.701548 #2792304] INFO -- : [619/885] 2833664=test_gem_path_support I, [2024-05-22T00:31:23.729909 #2792304] INFO -- : [620/885] 2833652=test_files_test_1 I, [2024-05-22T00:31:23.806231 #2792304] INFO -- : [621/885] 2833663=test_rdoc_rd_inline I, [2024-05-22T00:31:23.817862 #2792304] INFO -- : [622/885] 2833663=test_mutex I, [2024-05-22T00:31:23.936955 #2792304] INFO -- : [623/885] 2833664=test_x509req I, [2024-05-22T00:31:24.014246 #2792304] INFO -- : [624/885] 2833669=test_dln I, [2024-05-22T00:31:24.016785 #2792304] INFO -- : [625/885] 2833669=test_gem_source_subpath_problem I, [2024-05-22T00:31:24.090556 #2792304] INFO -- : [626/885] 2833669=json_common_interface_test I, [2024-05-22T00:31:24.101068 #2792304] INFO -- : [627/885] 2833669=test_win32ole_variant_outarg I, [2024-05-22T00:31:24.103213 #2792304] INFO -- : [628/885] 2833669=test_config I, [2024-05-22T00:31:24.124698 #2792304] INFO -- : [629/885] 2833664=test_nomethod_error I, [2024-05-22T00:31:24.129712 #2792304] INFO -- : [630/885] 2833664=json_parser_test I, [2024-05-22T00:31:24.132621 #2792304] INFO -- : [631/885] 2833669=memsize_test I, [2024-05-22T00:31:24.136179 #2792304] INFO -- : [632/885] 2833669=test_cparser I, [2024-05-22T00:31:24.195718 #2792304] INFO -- : [633/885] 2833664=test_pkg_config I, [2024-05-22T00:31:24.200901 #2792304] INFO -- : [634/885] 2833666=fuzzer_test I, [2024-05-22T00:31:24.233454 #2792304] INFO -- : [635/885] 2833653=test_sexp I, [2024-05-22T00:31:24.237581 #2792304] INFO -- : [636/885] 2833664=test_rdoc_markup_include I, [2024-05-22T00:31:24.240275 #2792304] INFO -- : [637/885] 2833664=test_variable I, [2024-05-22T00:31:24.248756 #2792304] INFO -- : [638/885] 2833653=test_struct I, [2024-05-22T00:31:24.252052 #2792304] INFO -- : [639/885] 2833653=magic_comment_test I, [2024-05-22T00:31:24.290083 #2792304] INFO -- : [640/885] 2833666=test_rdoc_markup_to_html_snippet I, [2024-05-22T00:31:24.310400 #2792304] INFO -- : [641/885] 2833653=test_iterator I, [2024-05-22T00:31:24.329111 #2792304] INFO -- : [642/885] 2833664=test_string I, [2024-05-22T00:31:24.333028 #2792304] INFO -- : [643/885] 2833664=test_omap I, [2024-05-22T00:31:24.338499 #2792304] INFO -- : [644/885] 2833664=test_digest_extend I, [2024-05-22T00:31:24.354183 #2792304] INFO -- : [645/885] 2833664=test_shellwords I, [2024-05-22T00:31:24.363639 #2792304] INFO -- : [646/885] 2833664=test_debug I, [2024-05-22T00:31:24.367931 #2792304] INFO -- : [647/885] 2833666=test_memory_view I, [2024-05-22T00:31:24.369471 #2792304] INFO -- : [648/885] 2833664=pattern_test I, [2024-05-22T00:31:24.388366 #2792304] INFO -- : [649/885] 2833653=test_cipher I, [2024-05-22T00:31:24.393830 #2792304] INFO -- : [650/885] 2833666=test_gem_security_signer I, [2024-05-22T00:31:24.398010 #2792304] INFO -- : [651/885] 2833664=test_new I, [2024-05-22T00:31:24.406451 #2792304] INFO -- : [652/885] 2833664=test_storage I, [2024-05-22T00:31:24.410848 #2792304] INFO -- : [653/885] 2833664=test_gem_resolver_git_set I, [2024-05-22T00:31:24.447089 #2792304] INFO -- : [654/885] 2833653=test_float I, [2024-05-22T00:31:24.482388 #2792304] INFO -- : [655/885] 2833666=test_require I, [2024-05-22T00:31:24.708201 #2792304] INFO -- : [656/885] 2833669=test_cgi_cookie I, [2024-05-22T00:31:24.708485 #2792304] INFO -- : [657/885] 2833664=test_dir_m17n I, [2024-05-22T00:31:24.716303 #2792304] INFO -- : [658/885] 2833669=test_gem_resolver_installer_set I, [2024-05-22T00:31:24.851842 #2792304] INFO -- : [659/885] 2833669=test_regex_casefold I, [2024-05-22T00:31:24.877576 #2792304] INFO -- : [660/885] 2833665=test_refinement I, [2024-05-22T00:31:24.949275 #2792304] INFO -- : [661/885] 2833663=test_gem_commands_signout_command I, [2024-05-22T00:31:24.958805 #2792304] INFO -- : [662/885] 2833663=test_gem_source_git I, [2024-05-22T00:31:25.124415 #2792304] INFO -- : [663/885] 2833669=test_fixnum I, [2024-05-22T00:31:25.129324 #2792304] INFO -- : [664/885] 2833669=test_signal I, [2024-05-22T00:31:25.445113 #2792304] INFO -- : [665/885] 2833663=test_x509crl I, [2024-05-22T00:31:25.555850 #2792304] INFO -- : [666/885] 2833654=test_rdoc_rd I, [2024-05-22T00:31:25.586395 #2792304] INFO -- : [667/885] 2833654=test_cgi_session I, [2024-05-22T00:31:25.590475 #2792304] INFO -- : [668/885] 2833663=test_rdoc_top_level I, [2024-05-22T00:31:25.596261 #2792304] INFO -- : [669/885] 2833654=test_metaclass I, [2024-05-22T00:31:25.601435 #2792304] INFO -- : [670/885] 2833654=test_input_method I, [2024-05-22T00:31:25.675353 #2792304] INFO -- : [671/885] 2833654=test_windows_1252 I, [2024-05-22T00:31:25.677428 #2792304] INFO -- : [672/885] 2833654=test_process I, [2024-05-22T00:31:25.706601 #2792304] INFO -- : [673/885] 2833654=test_my_integer I, [2024-05-22T00:31:25.712548 #2792304] INFO -- : [674/885] 2833654=json_ext_parser_test I, [2024-05-22T00:31:25.715161 #2792304] INFO -- : [675/885] 2833654=test_thread I, [2024-05-22T00:31:25.745235 #2792304] INFO -- : [676/885] 2833658=test_debugger_integration I, [2024-05-22T00:31:25.761283 #2792304] INFO -- : [677/885] 2833658=test_rendering I, [2024-05-22T00:31:25.768704 #2792304] INFO -- : [678/885] 2833658=test_ractor I, [2024-05-22T00:31:25.822094 #2792304] INFO -- : [679/885] 2833653=test_ssl I, [2024-05-22T00:31:25.876878 #2792304] INFO -- : [680/885] 2833659=test_rb_str_dup I, [2024-05-22T00:31:25.879039 #2792304] INFO -- : [681/885] 2833659=test_reline_key I, [2024-05-22T00:31:25.886814 #2792304] INFO -- : [682/885] 2833659=test_ancdata I, [2024-05-22T00:31:25.888227 #2792304] INFO -- : [683/885] 2833659=test_singleton_function I, [2024-05-22T00:31:25.896568 #2792304] INFO -- : [684/885] 2833659=test_alias I, [2024-05-22T00:31:25.912244 #2792304] INFO -- : [685/885] 2833663=test_timeout I, [2024-05-22T00:31:26.033644 #2792304] INFO -- : [686/885] 2833658=test_marshal I, [2024-05-22T00:31:26.042000 #2792304] INFO -- : [687/885] 2833664=test_unicode_normalize I, [2024-05-22T00:31:26.072647 #2792304] INFO -- : [688/885] 2833659=test_weakref I, [2024-05-22T00:31:26.268690 #2792304] INFO -- : [689/885] 2833661=test_nonblock I, [2024-05-22T00:31:26.272743 #2792304] INFO -- : [690/885] 2833659=test_parser I, [2024-05-22T00:31:26.284970 #2792304] INFO -- : [691/885] 2833653=test_cgi_core I, [2024-05-22T00:31:26.287825 #2792304] INFO -- : [692/885] 2833659=test_gem_source_lock I, [2024-05-22T00:31:26.292950 #2792304] INFO -- : [693/885] 2833661=test_gem I, [2024-05-22T00:31:26.301843 #2792304] INFO -- : [694/885] 2833653=test_ractor I, [2024-05-22T00:31:26.322563 #2792304] INFO -- : [695/885] 2833660=test_gem_commands_open_command I, [2024-05-22T00:31:26.327214 #2792304] INFO -- : [696/885] 2833662=test_dns I, [2024-05-22T00:31:26.331365 #2792304] INFO -- : [697/885] 2833659=parse_stream_test I, [2024-05-22T00:31:26.334804 #2792304] INFO -- : [698/885] 2833653=test_registry I, [2024-05-22T00:31:26.336210 #2792304] INFO -- : [699/885] 2833653=test_dryrun I, [2024-05-22T00:31:26.339738 #2792304] INFO -- : [700/885] 2833659=test_integer I, [2024-05-22T00:31:26.351126 #2792304] INFO -- : [701/885] 2833653=desugar_compiler_test I, [2024-05-22T00:31:26.375074 #2792304] INFO -- : [702/885] 2833653=test_env I, [2024-05-22T00:31:26.402922 #2792304] INFO -- : [703/885] 2833660=test_rdoc_attr I, [2024-05-22T00:31:26.403987 #2792304] INFO -- : [704/885] 2833659=test_gem_commands_setup_command I, [2024-05-22T00:31:26.558790 #2792304] INFO -- : [705/885] 2833650=test_call I, [2024-05-22T00:31:26.575907 #2792304] INFO -- : [706/885] 2833658=test_https_proxy I, [2024-05-22T00:31:26.578719 #2792304] INFO -- : [707/885] 2833660=test_rubygems I, [2024-05-22T00:31:26.612123 #2792304] INFO -- : [708/885] 2833658=test_super I, [2024-05-22T00:31:26.678782 #2792304] INFO -- : [709/885] 2833652=test_rubyoptions I, [2024-05-22T00:31:26.706541 #2792304] INFO -- : [710/885] 2833650=test_cgi_modruby I, [2024-05-22T00:31:26.721456 #2792304] INFO -- : [711/885] 2833650=test_integer I, [2024-05-22T00:31:26.757305 #2792304] INFO -- : [712/885] 2833660=test_object_references I, [2024-05-22T00:31:26.762464 #2792304] INFO -- : [713/885] 2833663=test_usrmarshal I, [2024-05-22T00:31:26.768018 #2792304] INFO -- : [714/885] 2833660=test_gem_resolver_git_specification I, [2024-05-22T00:31:26.786148 #2792304] INFO -- : [715/885] 2833662=test_stat I, [2024-05-22T00:31:26.791558 #2792304] INFO -- : [716/885] 2833662=test_gem_request_set_lockfile_tokenizer I, [2024-05-22T00:31:26.847104 #2792304] INFO -- : [717/885] 2833662=test_have_func I, [2024-05-22T00:31:26.996103 #2792304] INFO -- : [718/885] 2833663=test_nextafter I, [2024-05-22T00:31:27.005908 #2792304] INFO -- : [719/885] 2833660=test_capacity I, [2024-05-22T00:31:27.010846 #2792304] INFO -- : [720/885] 2833660=test_function_entry I, [2024-05-22T00:31:27.014067 #2792304] INFO -- : [721/885] 2833660=test_pkcs7 I, [2024-05-22T00:31:27.043122 #2792304] INFO -- : [722/885] 2833659=test_gem_resolver_requirement_list I, [2024-05-22T00:31:27.049901 #2792304] INFO -- : [723/885] 2833659=test_arith_seq_beg_len_step I, [2024-05-22T00:31:27.058624 #2792304] INFO -- : [724/885] 2833663=test_unix I, [2024-05-22T00:31:27.105963 #2792304] INFO -- : [725/885] 2833663=test_lazy_enumerator I, [2024-05-22T00:31:27.111713 #2792304] INFO -- : [726/885] 2833659=test_enc_associate I, [2024-05-22T00:31:27.223753 #2792304] INFO -- : [727/885] 2833669=ruby_api_test I, [2024-05-22T00:31:27.254488 #2792304] INFO -- : [728/885] 2833660=test_find_executable I, [2024-05-22T00:31:27.260772 #2792304] INFO -- : [729/885] 2833660=test_coder I, [2024-05-22T00:31:27.281600 #2792304] INFO -- : [730/885] 2833660=test_symbol I, [2024-05-22T00:31:27.323451 #2792304] INFO -- : [731/885] 2833669=test_gem_commands_pristine_command I, [2024-05-22T00:31:27.349773 #2792304] INFO -- : [732/885] 2833658=test_context I, [2024-05-22T00:31:27.364736 #2792304] INFO -- : [733/885] 2833667=test_nofree I, [2024-05-22T00:31:27.367520 #2792304] INFO -- : [734/885] 2833667=test_numeric I, [2024-05-22T00:31:27.373766 #2792304] INFO -- : [735/885] 2833667=test_member I, [2024-05-22T00:31:27.379291 #2792304] INFO -- : [736/885] 2833667=test_cgi_multipart I, [2024-05-22T00:31:27.447975 #2792304] INFO -- : [737/885] 2833665=test_word I, [2024-05-22T00:31:27.452268 #2792304] INFO -- : [738/885] 2833665=test_gem_commands_cleanup_command I, [2024-05-22T00:31:27.460385 #2792304] INFO -- : [739/885] 2833663=test_ractor_compatibility I, [2024-05-22T00:31:27.487812 #2792304] INFO -- : [740/885] 2833666=test_dir I, [2024-05-22T00:31:27.502512 #2792304] INFO -- : [741/885] 2833658=format_errors_test I, [2024-05-22T00:31:27.508802 #2792304] INFO -- : [742/885] 2833658=test_date_ractor I, [2024-05-22T00:31:27.549073 #2792304] INFO -- : [743/885] 2833656=test_gem_console_ui I, [2024-05-22T00:31:27.556946 #2792304] INFO -- : [744/885] 2833656=test_autoconf I, [2024-05-22T00:31:27.561207 #2792304] INFO -- : [745/885] 2833656=test_eval I, [2024-05-22T00:31:27.565602 #2792304] INFO -- : [746/885] 2833656=test_coderange I, [2024-05-22T00:31:27.570031 #2792304] INFO -- : [747/885] 2833656=location_test I, [2024-05-22T00:31:27.576471 #2792304] INFO -- : [748/885] 2833667=test_symbol I, [2024-05-22T00:31:27.581143 #2792304] INFO -- : [749/885] 2833667=test_mailto I, [2024-05-22T00:31:27.592679 #2792304] INFO -- : [750/885] 2833667=test_rdoc_generator_darkfish I, [2024-05-22T00:31:27.669199 #2792304] INFO -- : [751/885] 2833659=test_rdoc_comment I, [2024-05-22T00:31:27.704730 #2792304] INFO -- : [752/885] 2833656=test_resize I, [2024-05-22T00:31:27.708803 #2792304] INFO -- : [753/885] 2833656=test_error_highlight I, [2024-05-22T00:31:27.711615 #2792304] INFO -- : [754/885] 2833659=test_http_request I, [2024-05-22T00:31:27.752188 #2792304] INFO -- : [755/885] 2833659=test_gem_source_fetch_problem I, [2024-05-22T00:31:27.760162 #2792304] INFO -- : [756/885] 2833658=json_generic_object_test I, [2024-05-22T00:31:27.767146 #2792304] INFO -- : [757/885] 2833659=test_merge_keys I, [2024-05-22T00:31:27.768604 #2792304] INFO -- : [758/885] 2833658=test_rdoc_extend I, [2024-05-22T00:31:27.779714 #2792304] INFO -- : [759/885] 2833659=test_win32ole_variant I, [2024-05-22T00:31:27.781328 #2792304] INFO -- : [760/885] 2833666=test_ipaddr I, [2024-05-22T00:31:27.787284 #2792304] INFO -- : [761/885] 2833659=test_history I, [2024-05-22T00:31:27.796243 #2792304] INFO -- : [762/885] 2833658=test_mixed_unicode_escapes I, [2024-05-22T00:31:27.798710 #2792304] INFO -- : [763/885] 2833659=test_rdoc_markup_to_ansi I, [2024-05-22T00:31:27.801011 #2792304] INFO -- : [764/885] 2833658=test_gem_resolver_api_specification I, [2024-05-22T00:31:27.805298 #2792304] INFO -- : [765/885] 2833666=ractor_test I, [2024-05-22T00:31:27.820029 #2792304] INFO -- : [766/885] 2833665=test_trace I, [2024-05-22T00:31:27.833118 #2792304] INFO -- : [767/885] 2833658=test_rdoc_generator_json_index I, [2024-05-22T00:31:27.836851 #2792304] INFO -- : [768/885] 2833659=test_time_tz I, [2024-05-22T00:31:27.840682 #2792304] INFO -- : [769/885] 2833665=test_win32ole_event I, [2024-05-22T00:31:27.845995 #2792304] INFO -- : [770/885] 2833665=test_bignum I, [2024-05-22T00:31:27.867270 #2792304] INFO -- : [771/885] 2833658=test_rdoc_class_module I, [2024-05-22T00:31:27.878925 #2792304] INFO -- : [772/885] 2833663=test_gem_ci_detector I, [2024-05-22T00:31:27.881255 #2792304] INFO -- : [773/885] 2833667=test_win32ole_variable I, [2024-05-22T00:31:27.882977 #2792304] INFO -- : [774/885] 2833666=test_arity I, [2024-05-22T00:31:27.883949 #2792304] INFO -- : [775/885] 2833667=test_stringio I, [2024-05-22T00:31:27.884726 #2792304] INFO -- : [776/885] 2833659=test_io_wait_uncommon I, [2024-05-22T00:31:27.887943 #2792304] INFO -- : [777/885] 2833666=test_gem_specification I, [2024-05-22T00:31:27.893086 #2792304] INFO -- : [778/885] 2833659=test_enum I, [2024-05-22T00:31:27.909495 #2792304] INFO -- : [779/885] 2833663=test_threadgroup I, [2024-05-22T00:31:27.958791 #2792304] INFO -- : [780/885] 2833667=test_have_macro I, [2024-05-22T00:31:28.108450 #2792304] INFO -- : [781/885] 2833662=test_resolve_symbol I, [2024-05-22T00:31:28.190924 #2792304] INFO -- : [782/885] 2833662=test_complex2 I, [2024-05-22T00:31:28.191247 #2792304] INFO -- : [783/885] 2833661=test_gem_package I, [2024-05-22T00:31:28.201682 #2792304] INFO -- : [784/885] 2833662=test_change_word I, [2024-05-22T00:31:28.205609 #2792304] INFO -- : [785/885] 2833662=compiler_test I, [2024-05-22T00:31:28.211561 #2792304] INFO -- : [786/885] 2833662=test_flip I, [2024-05-22T00:31:28.231335 #2792304] INFO -- : [787/885] 2833662=test_timeout I, [2024-05-22T00:31:28.237448 #2792304] INFO -- : [788/885] 2833662=test_ossl I, [2024-05-22T00:31:28.246676 #2792304] INFO -- : [789/885] 2833658=test_normalize I, [2024-05-22T00:31:28.247896 #2792304] INFO -- : [790/885] 2833658=test_date_arith I, [2024-05-22T00:31:28.254468 #2792304] INFO -- : [791/885] 2833658=test_ruby_lex I, [2024-05-22T00:31:28.327201 #2792304] INFO -- : [792/885] 2833656=test_object I, [2024-05-22T00:31:28.378127 #2792304] INFO -- : [793/885] 2833658=test_gem_local_remote_options I, [2024-05-22T00:31:28.409509 #2792304] INFO -- : [794/885] 2833658=test_sleep I, [2024-05-22T00:31:28.505369 #2792304] INFO -- : [795/885] 2833669=test_ractor I, [2024-05-22T00:31:28.519443 #2792304] INFO -- : [796/885] 2833667=test_type I, [2024-05-22T00:31:28.527536 #2792304] INFO -- : [797/885] 2833667=test_pointer I, [2024-05-22T00:31:28.546653 #2792304] INFO -- : [798/885] 2833669=test_func I, [2024-05-22T00:31:28.685670 #2792304] INFO -- : [799/885] 2833664=test_big5 I, [2024-05-22T00:31:28.689792 #2792304] INFO -- : [800/885] 2833664=test_rdoc_rd_block_parser I, [2024-05-22T00:31:28.714087 #2792304] INFO -- : [801/885] 2833659=test_signedness I, [2024-05-22T00:31:28.719257 #2792304] INFO -- : [802/885] 2833664=test_tsort I, [2024-05-22T00:31:28.722833 #2792304] INFO -- : [803/885] 2833664=test_cgi_header I, [2024-05-22T00:31:28.726716 #2792304] INFO -- : [804/885] 2833656=heredoc_dedent_test I, [2024-05-22T00:31:28.732611 #2792304] INFO -- : [805/885] 2833664=test_object I, [2024-05-22T00:31:28.734032 #2792304] INFO -- : [806/885] 2833656=version_test I, [2024-05-22T00:31:28.736876 #2792304] INFO -- : [807/885] 2833656=test_key_actor_emacs I, [2024-05-22T00:31:28.746239 #2792304] INFO -- : [808/885] 2833664=test_gem_gemcutter_utilities I, [2024-05-22T00:31:28.820096 #2792304] INFO -- : [809/885] 2833650=test_basicinstructions I, [2024-05-22T00:31:28.875770 #2792304] INFO -- : [810/885] 2833650=test_gem_command_manager I, [2024-05-22T00:31:28.884149 #2792304] INFO -- : [811/885] 2833656=test_arithmetic_sequence I, [2024-05-22T00:31:28.899973 #2792304] INFO -- : [812/885] 2833656=test_file_exhaustive I, [2024-05-22T00:31:28.914513 #2792304] INFO -- : [813/885] 2833663=test_gem_update_suggestion I, [2024-05-22T00:31:28.916494 #2792304] INFO -- : [814/885] 2833661=test_files_test I, [2024-05-22T00:31:28.972299 #2792304] INFO -- : [815/885] 2833663=test_logger I, [2024-05-22T00:31:28.975443 #2792304] INFO -- : [816/885] 2833661=test_import I, [2024-05-22T00:31:28.984006 #2792304] INFO -- : [817/885] 2833663=test_gem_resolver_lock_set I, [2024-05-22T00:31:28.989453 #2792304] INFO -- : [818/885] 2833653=test_not I, [2024-05-22T00:31:28.994905 #2792304] INFO -- : [819/885] 2833663=test_rdoc_parser_markdown I, [2024-05-22T00:31:29.003243 #2792304] INFO -- : [820/885] 2833653=test_pkey_rsa I, [2024-05-22T00:31:29.005165 #2792304] INFO -- : [821/885] 2833663=test_weakkeymap I, [2024-05-22T00:31:29.017977 #2792304] INFO -- : [822/885] 2833660=test_gem_commands_push_command I, [2024-05-22T00:31:29.029179 #2792304] INFO -- : [823/885] 2833667=test_numhash I, [2024-05-22T00:31:29.033400 #2792304] INFO -- : [824/885] 2833667=test_date_strptime I, [2024-05-22T00:31:29.033765 #2792304] INFO -- : [825/885] 2833664=test_gem_package_task I, [2024-05-22T00:31:29.037933 #2792304] INFO -- : [826/885] 2833664=test_placearg I, [2024-05-22T00:31:29.044215 #2792304] INFO -- : [827/885] 2833650=test_rdoc_markup_hard_break I, [2024-05-22T00:31:29.137384 #2792304] INFO -- : [828/885] 2833650=test_gem_platform I, [2024-05-22T00:31:29.171459 #2792304] INFO -- : [829/885] 2833664=test_delete I, [2024-05-22T00:31:29.177649 #2792304] INFO -- : [830/885] 2833664=test_win32ole_method I, [2024-05-22T00:31:29.179945 #2792304] INFO -- : [831/885] 2833664=test_fd_setsize I, [2024-05-22T00:31:29.181392 #2792304] INFO -- : [832/885] 2833664=test_continuation I, [2024-05-22T00:31:29.188163 #2792304] INFO -- : [833/885] 2833667=test_class_name_check I, [2024-05-22T00:31:29.190491 #2792304] INFO -- : [834/885] 2833664=test_keyword I, [2024-05-22T00:31:29.202065 #2792304] INFO -- : [835/885] 2833653=test_rdoc_code_object I, [2024-05-22T00:31:29.207859 #2792304] INFO -- : [836/885] 2833650=test_x509store I, [2024-05-22T00:31:29.219017 #2792304] INFO -- : [837/885] 2833667=test_update I, [2024-05-22T00:31:29.223247 #2792304] INFO -- : [838/885] 2833667=test_fips I, [2024-05-22T00:31:29.276667 #2792304] INFO -- : [839/885] 2833663=test_x509name I, [2024-05-22T00:31:29.286752 #2792304] INFO -- : [840/885] 2833663=test_gem_request_set_gem_dependency_api I, [2024-05-22T00:31:29.468238 #2792304] INFO -- : [841/885] 2833653=test_ast I, [2024-05-22T00:31:29.495392 #2792304] INFO -- : [842/885] 2833667=test_lambda I, [2024-05-22T00:31:29.509701 #2792304] INFO -- : [843/885] 2833663=test_random_formatter I, [2024-05-22T00:31:29.514615 #2792304] INFO -- : [844/885] 2833650=test_helper I, [2024-05-22T00:31:29.515056 #2792304] INFO -- : [845/885] 2833650=test_jaro_winkler I, [2024-05-22T00:31:29.518592 #2792304] INFO -- : [846/885] 2833660=test_webauthn_listener I, [2024-05-22T00:31:29.521132 #2792304] INFO -- : [847/885] 2833650=test_config I, [2024-05-22T00:31:29.524493 #2792304] INFO -- : [848/885] 2833663=test_gem_resolver_vendor_set I, [2024-05-22T00:31:29.543007 #2792304] INFO -- : [849/885] 2833663=test_enumerable I, [2024-05-22T00:31:29.545644 #2792304] INFO -- : [850/885] 2833663=test_gem_safe_marshal I, [2024-05-22T00:31:29.560081 #2792304] INFO -- : [851/885] 2833667=test_gem_resolver_api_set I, [2024-05-22T00:31:29.572686 #2792304] INFO -- : [852/885] 2833660=test_transcode I, [2024-05-22T00:31:29.598169 #2792304] INFO -- : [853/885] 2833664=test_eval I, [2024-05-22T00:31:29.619530 #2792304] INFO -- : [854/885] 2833667=json_generator_test I, [2024-05-22T00:31:29.670838 #2792304] INFO -- : [855/885] 2833668=test_gem_uri_formatter I, [2024-05-22T00:31:29.693593 #2792304] INFO -- : [856/885] 2833668=test_helper I, [2024-05-22T00:31:29.704170 #2792304] INFO -- : [857/885] 2833668=test_erb_command I, [2024-05-22T00:31:29.711449 #2792304] INFO -- : [858/885] 2833667=test_encoding I, [2024-05-22T00:31:29.735074 #2792304] INFO -- : [859/885] 2833660=test_project_sanity I, [2024-05-22T00:31:29.736178 #2792304] INFO -- : [860/885] 2833668=test_range I, [2024-05-22T00:31:29.773955 #2792304] INFO -- : [861/885] 2833664=test_constant I, [2024-05-22T00:31:29.792378 #2792304] INFO -- : [862/885] 2833660=test_pty I, [2024-05-22T00:31:29.915583 #2792304] INFO -- : [863/885] 2833667=test_dup I, [2024-05-22T00:31:30.011402 #2792304] INFO -- : [864/885] 2833650=command_line_test I, [2024-05-22T00:31:30.020712 #2792304] INFO -- : [865/885] 2833650=test_rdoc_ri_paths I, [2024-05-22T00:31:30.027052 #2792304] INFO -- : [866/885] 2833666=test_ts I, [2024-05-22T00:31:30.038355 #2792304] INFO -- : [867/885] 2833650=test_ensured I, [2024-05-22T00:31:30.049654 #2792304] INFO -- : [868/885] 2833663=library_symbols_test I, [2024-05-22T00:31:30.052231 #2792304] INFO -- : [869/885] 2833663=test_locale I, [2024-05-22T00:31:30.081444 #2792304] INFO -- : [870/885] 2833667=test_addr I, [2024-05-22T00:31:30.081738 #2792304] INFO -- : [871/885] 2833650=errors_test I, [2024-05-22T00:31:30.096974 #2792304] INFO -- : [872/885] 2833667=test_gem_commands_check_command I, [2024-05-22T00:31:30.115987 #2792304] INFO -- : [873/885] 2833663=test_regexp I, [2024-05-22T00:31:30.132231 #2792304] INFO -- : [874/885] 2833667=test_vm_dump I, [2024-05-22T00:31:30.133020 #2792304] INFO -- : [875/885] 2833667=test_rdoc_markup_document I, [2024-05-22T00:31:30.142191 #2792304] INFO -- : [876/885] 2833667=test_integer_comb I, [2024-05-22T00:31:30.180220 #2792304] INFO -- : [877/885] 2833650=test_tmpdir I, [2024-05-22T00:31:30.262300 #2792304] INFO -- : [878/885] 2833650=test_data_error I, [2024-05-22T00:31:30.310516 #2792304] INFO -- : [879/885] 2833661=bom_test I, [2024-05-22T00:31:30.311043 #2792304] INFO -- : [880/885] 2833650=test_file I, [2024-05-22T00:31:30.312057 #2792304] INFO -- : [881/885] 2833668=test_force_exit I, [2024-05-22T00:31:30.319271 #2792304] INFO -- : [882/885] 2833661=unescape_test I, [2024-05-22T00:31:30.333709 #2792304] INFO -- : [883/885] 2833660=test_ostruct I, [2024-05-22T00:31:30.407039 #2792304] INFO -- : [884/885] 2833668=test_udp I, [2024-05-22T00:31:30.423633 #2792304] INFO -- : [885/885] 2833668=static_inspect_test I, [2024-05-22T00:31:54.112291 #2792304] INFO -- : Finished tests in 41.968673s, 629.0883 tests/s, 222863.3699 assertions/s. I, [2024-05-22T00:31:54.113133 #2792304] INFO -- : 26402 tests, 9353280 assertions, 0 failures, 0 errors, 306 skips I, [2024-05-22T00:31:54.113166 #2792304] INFO -- : I, [2024-05-22T00:31:54.113174 #2792304] INFO -- : ruby -v: ruby 3.4.0dev (2024-05-21T18:45:16Z master b20adf90e3) [x86_64-linux] I, [2024-05-22T00:31:54.115430 #2792304] INFO -- : $$$[end] "make yes-test-all TESTOPTS='--stderr-on-failure' TESTS='-j20'" exit with 0. I, [2024-05-22T00:31:54.115576 #2792304] INFO -- : $$$[beg] make yes-test-rubyspec MSPECOPT='--error-output stderr --debug -j' TESTS='-j20' I, [2024-05-22T00:31:54.203617 #2792304] INFO -- : BASERUBY = /usr/bin/ruby --disable=gems I, [2024-05-22T00:31:54.203657 #2792304] INFO -- : CC = gcc I, [2024-05-22T00:31:54.203663 #2792304] INFO -- : LD = ld I, [2024-05-22T00:31:54.203668 #2792304] INFO -- : LDSHARED = gcc -shared I, [2024-05-22T00:31:54.203673 #2792304] INFO -- : CFLAGS = -O3 -fno-fast-math -ggdb3 -Wall -Wextra -Wdeprecated-declarations -Wdiv-by-zero -Wduplicated-cond -Wimplicit-function-declaration -Wimplicit-int -Wpointer-arith -Wwrite-strings -Wold-style-definition -Wimplicit-fallthrough=0 -Wmissing-noreturn -Wno-cast-function-type -Wno-constant-logical-operand -Wno-long-long -Wno-missing-field-initializers -Wno-overlength-strings -Wno-packed-bitfield-compat -Wno-parentheses-equality -Wno-self-assign -Wno-tautological-compare -Wno-unused-parameter -Wno-unused-value -Wsuggest-attribute=format -Wsuggest-attribute=noreturn -Wunused-variable -Wmisleading-indentation -Wundef -fPIC I, [2024-05-22T00:31:54.203679 #2792304] INFO -- : XCFLAGS = -U_FORTIFY_SOURCE -D_FORTIFY_SOURCE=2 -fstack-protector-strong -fno-strict-overflow -fvisibility=hidden -fexcess-precision=standard -DRUBY_EXPORT -I. -I.ext/include/x86_64-linux -I/tmp/ruby/src/trunk/include -I/tmp/ruby/src/trunk -I/tmp/ruby/src/trunk/prism -I/tmp/ruby/src/trunk/enc/unicode/15.0.0 I, [2024-05-22T00:31:54.203684 #2792304] INFO -- : CPPFLAGS = I, [2024-05-22T00:31:54.203804 #2792304] INFO -- : DLDFLAGS = -Wl,--compress-debug-sections=zlib -Wl,-soname,libruby.so.3.4 -fstack-protector-strong I, [2024-05-22T00:31:54.203820 #2792304] INFO -- : SOLIBS = -lz -lrt -lrt -lgmp -ldl -lcrypt -lm -lpthread I, [2024-05-22T00:31:54.203825 #2792304] INFO -- : LANG = en_US.UTF-8 I, [2024-05-22T00:31:54.203829 #2792304] INFO -- : LC_ALL = I, [2024-05-22T00:31:54.203833 #2792304] INFO -- : LC_CTYPE = I, [2024-05-22T00:31:54.203836 #2792304] INFO -- : MFLAGS = I, [2024-05-22T00:31:54.203840 #2792304] INFO -- : RUSTC = no I, [2024-05-22T00:31:54.203844 #2792304] INFO -- : YJIT_RUSTC_ARGS = --crate-name=yjit --crate-type=staticlib --edition=2021 -g -C lto=thin -C opt-level=3 -C overflow-checks=on '--out-dir=/tmp/ruby/build/trunk/yjit/target/release/' /tmp/ruby/src/trunk/yjit/src/lib.rs I, [2024-05-22T00:31:54.204266 #2792304] INFO -- : gcc (Ubuntu 11.4.0-1ubuntu1~22.04) 11.4.0 I, [2024-05-22T00:31:54.204294 #2792304] INFO -- : Copyright (C) 2021 Free Software Foundation, Inc. I, [2024-05-22T00:31:54.204300 #2792304] INFO -- : This is free software; see the source for copying conditions. There is NO I, [2024-05-22T00:31:54.204304 #2792304] INFO -- : warranty; not even for MERCHANTABILITY or FITNESS FOR A PARTICULAR PURPOSE. I, [2024-05-22T00:31:54.204309 #2792304] INFO -- : I, [2024-05-22T00:31:54.205948 #2792304] INFO -- : generating enc.mk I, [2024-05-22T00:31:54.326233 #2792304] INFO -- : generating encdb.h I, [2024-05-22T00:31:54.350039 #2792304] INFO -- : encdb.h unchanged I, [2024-05-22T00:31:54.351094 #2792304] INFO -- : making enc I, [2024-05-22T00:31:54.368594 #2792304] INFO -- : make[1]: Entering directory '/tmp/ruby/build/trunk' I, [2024-05-22T00:31:54.368624 #2792304] INFO -- : make[1]: Nothing to be done for 'enc'. I, [2024-05-22T00:31:54.368633 #2792304] INFO -- : make[1]: Leaving directory '/tmp/ruby/build/trunk' I, [2024-05-22T00:31:54.369202 #2792304] INFO -- : making srcs under enc I, [2024-05-22T00:31:54.398454 #2792304] INFO -- : make[1]: Entering directory '/tmp/ruby/build/trunk' I, [2024-05-22T00:31:54.398474 #2792304] INFO -- : make[1]: Nothing to be done for 'srcs'. I, [2024-05-22T00:31:54.398480 #2792304] INFO -- : make[1]: Leaving directory '/tmp/ruby/build/trunk' I, [2024-05-22T00:31:54.399334 #2792304] INFO -- : generating transdb.h I, [2024-05-22T00:31:54.495174 #2792304] INFO -- : transdb.h unchanged I, [2024-05-22T00:31:54.496474 #2792304] INFO -- : making trans I, [2024-05-22T00:31:54.530531 #2792304] INFO -- : make[1]: Entering directory '/tmp/ruby/build/trunk' I, [2024-05-22T00:31:54.530552 #2792304] INFO -- : make[1]: Nothing to be done for 'trans'. I, [2024-05-22T00:31:54.530557 #2792304] INFO -- : make[1]: Leaving directory '/tmp/ruby/build/trunk' I, [2024-05-22T00:31:54.531210 #2792304] INFO -- : making encs I, [2024-05-22T00:31:54.568748 #2792304] INFO -- : make[1]: Entering directory '/tmp/ruby/build/trunk' I, [2024-05-22T00:31:54.568769 #2792304] INFO -- : make[1]: Nothing to be done for 'encs'. I, [2024-05-22T00:31:54.568775 #2792304] INFO -- : make[1]: Leaving directory '/tmp/ruby/build/trunk' I, [2024-05-22T00:31:54.570517 #2792304] INFO -- : generating makefiles ext/configure-ext.mk I, [2024-05-22T00:31:54.596788 #2792304] INFO -- : ext/configure-ext.mk updated I, [2024-05-22T00:31:54.599253 #2792304] INFO -- : make[1]: Entering directory '/tmp/ruby/build/trunk' I, [2024-05-22T00:31:55.995318 #2792304] INFO -- : make[1]: Leaving directory '/tmp/ruby/build/trunk' I, [2024-05-22T00:31:55.995949 #2792304] INFO -- : generating makefile exts.mk I, [2024-05-22T00:31:56.032532 #2792304] INFO -- : exts.mk unchanged I, [2024-05-22T00:31:56.037073 #2792304] INFO -- : make[1]: Entering directory '/tmp/ruby/build/trunk' I, [2024-05-22T00:31:56.335986 #2792304] INFO -- : make[2]: Entering directory '/tmp/ruby/build/trunk/ext/coverage' I, [2024-05-22T00:31:56.338957 #2792304] INFO -- : make[2]: Leaving directory '/tmp/ruby/build/trunk/ext/coverage' I, [2024-05-22T00:31:56.343811 #2792304] INFO -- : make[2]: Entering directory '/tmp/ruby/build/trunk/ext/date' I, [2024-05-22T00:31:56.348819 #2792304] INFO -- : make[2]: Leaving directory '/tmp/ruby/build/trunk/ext/date' I, [2024-05-22T00:31:56.352846 #2792304] INFO -- : make[2]: Entering directory '/tmp/ruby/build/trunk/ext/digest' I, [2024-05-22T00:31:56.361714 #2792304] INFO -- : make[2]: Leaving directory '/tmp/ruby/build/trunk/ext/digest' I, [2024-05-22T00:31:56.388267 #2792304] INFO -- : make[2]: Entering directory '/tmp/ruby/build/trunk/ext/digest/sha2' I, [2024-05-22T00:31:56.393023 #2792304] INFO -- : make[2]: Leaving directory '/tmp/ruby/build/trunk/ext/digest/sha2' I, [2024-05-22T00:31:56.414225 #2792304] INFO -- : make[2]: Entering directory '/tmp/ruby/build/trunk/ext/fiddle' I, [2024-05-22T00:31:56.423972 #2792304] INFO -- : make[2]: Leaving directory '/tmp/ruby/build/trunk/ext/fiddle' I, [2024-05-22T00:31:56.428893 #2792304] INFO -- : make[2]: Entering directory '/tmp/ruby/build/trunk/ext/io/console' I, [2024-05-22T00:31:56.433053 #2792304] INFO -- : make[2]: Leaving directory '/tmp/ruby/build/trunk/ext/io/console' I, [2024-05-22T00:31:56.446278 #2792304] INFO -- : make[2]: Entering directory '/tmp/ruby/build/trunk/ext/json' I, [2024-05-22T00:31:56.457068 #2792304] INFO -- : make[2]: Leaving directory '/tmp/ruby/build/trunk/ext/json' I, [2024-05-22T00:31:56.472620 #2792304] INFO -- : make[2]: Entering directory '/tmp/ruby/build/trunk/ext/monitor' I, [2024-05-22T00:31:56.476578 #2792304] INFO -- : make[2]: Leaving directory '/tmp/ruby/build/trunk/ext/monitor' I, [2024-05-22T00:31:56.483728 #2792304] INFO -- : make[2]: Entering directory '/tmp/ruby/build/trunk/ext/objspace' I, [2024-05-22T00:31:56.489845 #2792304] INFO -- : make[2]: Leaving directory '/tmp/ruby/build/trunk/ext/objspace' I, [2024-05-22T00:31:56.507478 #2792304] INFO -- : make[2]: Entering directory '/tmp/ruby/build/trunk/ext/openssl' I, [2024-05-22T00:31:56.522837 #2792304] INFO -- : make[2]: Leaving directory '/tmp/ruby/build/trunk/ext/openssl' I, [2024-05-22T00:31:56.526540 #2792304] INFO -- : make[2]: Entering directory '/tmp/ruby/build/trunk/ext/pathname' I, [2024-05-22T00:31:56.530921 #2792304] INFO -- : make[2]: Leaving directory '/tmp/ruby/build/trunk/ext/pathname' I, [2024-05-22T00:31:56.538232 #2792304] INFO -- : make[2]: Entering directory '/tmp/ruby/build/trunk/ext/psych' I, [2024-05-22T00:31:56.562054 #2792304] INFO -- : make[2]: Leaving directory '/tmp/ruby/build/trunk/ext/psych' I, [2024-05-22T00:31:56.565483 #2792304] INFO -- : make[2]: Entering directory '/tmp/ruby/build/trunk/ext/pty' I, [2024-05-22T00:31:56.569303 #2792304] INFO -- : make[2]: Leaving directory '/tmp/ruby/build/trunk/ext/pty' I, [2024-05-22T00:31:56.584300 #2792304] INFO -- : make[2]: Entering directory '/tmp/ruby/build/trunk/ext/ripper' I, [2024-05-22T00:31:56.592790 #2792304] INFO -- : make[2]: Leaving directory '/tmp/ruby/build/trunk/ext/ripper' I, [2024-05-22T00:31:56.595240 #2792304] INFO -- : make[2]: Entering directory '/tmp/ruby/build/trunk/ext/rubyvm' I, [2024-05-22T00:31:56.598560 #2792304] INFO -- : make[2]: Leaving directory '/tmp/ruby/build/trunk/ext/rubyvm' I, [2024-05-22T00:31:56.610464 #2792304] INFO -- : make[2]: Entering directory '/tmp/ruby/build/trunk/ext/socket' I, [2024-05-22T00:31:56.618071 #2792304] INFO -- : make[2]: Leaving directory '/tmp/ruby/build/trunk/ext/socket' I, [2024-05-22T00:31:56.636233 #2792304] INFO -- : make[2]: Entering directory '/tmp/ruby/build/trunk/.bundle/gems/bigdecimal-3.1.8/ext/bigdecimal' I, [2024-05-22T00:31:56.664039 #2792304] INFO -- : make[2]: Leaving directory '/tmp/ruby/build/trunk/.bundle/gems/bigdecimal-3.1.8/ext/bigdecimal' I, [2024-05-22T00:31:56.665996 #2792304] INFO -- : make[2]: Entering directory '/tmp/ruby/build/trunk/.bundle/gems/debug-1.9.2/ext/debug' I, [2024-05-22T00:31:56.688338 #2792304] INFO -- : make[2]: Leaving directory '/tmp/ruby/build/trunk/.bundle/gems/debug-1.9.2/ext/debug' I, [2024-05-22T00:31:56.690326 #2792304] INFO -- : make[2]: Entering directory '/tmp/ruby/build/trunk/.bundle/gems/nkf-0.2.0/ext/nkf' I, [2024-05-22T00:31:56.711562 #2792304] INFO -- : make[2]: Leaving directory '/tmp/ruby/build/trunk/.bundle/gems/nkf-0.2.0/ext/nkf' I, [2024-05-22T00:31:56.713591 #2792304] INFO -- : make[2]: Entering directory '/tmp/ruby/build/trunk/.bundle/gems/racc-1.7.3/ext/racc/cparse' I, [2024-05-22T00:31:56.734941 #2792304] INFO -- : make[2]: Leaving directory '/tmp/ruby/build/trunk/.bundle/gems/racc-1.7.3/ext/racc/cparse' I, [2024-05-22T00:31:56.737242 #2792304] INFO -- : make[2]: Entering directory '/tmp/ruby/build/trunk/.bundle/gems/racc-1.8.0/ext/racc/cparse' I, [2024-05-22T00:31:56.758614 #2792304] INFO -- : make[2]: Leaving directory '/tmp/ruby/build/trunk/.bundle/gems/racc-1.8.0/ext/racc/cparse' I, [2024-05-22T00:31:56.760918 #2792304] INFO -- : make[2]: Entering directory '/tmp/ruby/build/trunk/.bundle/gems/rbs-3.4.4/ext/rbs_extension' I, [2024-05-22T00:31:56.782377 #2792304] INFO -- : make[2]: Leaving directory '/tmp/ruby/build/trunk/.bundle/gems/rbs-3.4.4/ext/rbs_extension' I, [2024-05-22T00:31:56.784303 #2792304] INFO -- : make[2]: Entering directory '/tmp/ruby/build/trunk/.bundle/gems/syslog-0.1.2/ext/syslog' I, [2024-05-22T00:31:56.807354 #2792304] INFO -- : make[2]: Leaving directory '/tmp/ruby/build/trunk/.bundle/gems/syslog-0.1.2/ext/syslog' I, [2024-05-22T00:31:56.831476 #2792304] INFO -- : make[2]: Entering directory '/tmp/ruby/build/trunk' I, [2024-05-22T00:31:56.895099 #2792304] INFO -- : make[2]: 'ruby' is up to date. I, [2024-05-22T00:31:56.895142 #2792304] INFO -- : make[2]: Leaving directory '/tmp/ruby/build/trunk' I, [2024-05-22T00:31:56.895431 #2792304] INFO -- : make[1]: Leaving directory '/tmp/ruby/build/trunk' I, [2024-05-22T00:31:56.899177 #2792304] INFO -- : make[1]: Entering directory '/tmp/ruby/build/trunk' I, [2024-05-22T00:31:56.899199 #2792304] INFO -- : make[1]: Nothing to be done for 'note'. I, [2024-05-22T00:31:56.899205 #2792304] INFO -- : make[1]: Leaving directory '/tmp/ruby/build/trunk' E, [2024-05-22T00:31:56.954711 #2792304] ERROR -- : $ /tmp/ruby/build/trunk/miniruby -I/tmp/ruby/src/trunk/lib /tmp/ruby/src/trunk/tool/runruby.rb --archdir=/tmp/ruby/build/trunk --extout=.ext -- /tmp/ruby/src/trunk/spec/mspec/bin/mspec-run -B /tmp/ruby/src/trunk/spec/default.mspec --error-output stderr --debug -fy -o /tmp/rubytest.6uqesh/1-mspec-multi-0 E, [2024-05-22T00:31:56.954801 #2792304] ERROR -- : $ /tmp/ruby/build/trunk/miniruby -I/tmp/ruby/src/trunk/lib /tmp/ruby/src/trunk/tool/runruby.rb --archdir=/tmp/ruby/build/trunk --extout=.ext -- /tmp/ruby/src/trunk/spec/mspec/bin/mspec-run -B /tmp/ruby/src/trunk/spec/default.mspec --error-output stderr --debug -fy -o /tmp/rubytest.6uqesh/2-mspec-multi-1 E, [2024-05-22T00:31:56.955091 #2792304] ERROR -- : $ /tmp/ruby/build/trunk/miniruby -I/tmp/ruby/src/trunk/lib /tmp/ruby/src/trunk/tool/runruby.rb --archdir=/tmp/ruby/build/trunk --extout=.ext -- /tmp/ruby/src/trunk/spec/mspec/bin/mspec-run -B /tmp/ruby/src/trunk/spec/default.mspec --error-output stderr --debug -fy -o /tmp/rubytest.6uqesh/3-mspec-multi-2 E, [2024-05-22T00:31:56.955239 #2792304] ERROR -- : $ /tmp/ruby/build/trunk/miniruby -I/tmp/ruby/src/trunk/lib /tmp/ruby/src/trunk/tool/runruby.rb --archdir=/tmp/ruby/build/trunk --extout=.ext -- /tmp/ruby/src/trunk/spec/mspec/bin/mspec-run -B /tmp/ruby/src/trunk/spec/default.mspec --error-output stderr --debug -fy -o /tmp/rubytest.6uqesh/4-mspec-multi-3 E, [2024-05-22T00:31:56.955468 #2792304] ERROR -- : $ /tmp/ruby/build/trunk/miniruby -I/tmp/ruby/src/trunk/lib /tmp/ruby/src/trunk/tool/runruby.rb --archdir=/tmp/ruby/build/trunk --extout=.ext -- /tmp/ruby/src/trunk/spec/mspec/bin/mspec-run -B /tmp/ruby/src/trunk/spec/default.mspec --error-output stderr --debug -fy -o /tmp/rubytest.6uqesh/5-mspec-multi-4 E, [2024-05-22T00:31:56.955627 #2792304] ERROR -- : $ /tmp/ruby/build/trunk/miniruby -I/tmp/ruby/src/trunk/lib /tmp/ruby/src/trunk/tool/runruby.rb --archdir=/tmp/ruby/build/trunk --extout=.ext -- /tmp/ruby/src/trunk/spec/mspec/bin/mspec-run -B /tmp/ruby/src/trunk/spec/default.mspec --error-output stderr --debug -fy -o /tmp/rubytest.6uqesh/6-mspec-multi-5 E, [2024-05-22T00:31:56.955664 #2792304] ERROR -- : $ /tmp/ruby/build/trunk/miniruby -I/tmp/ruby/src/trunk/lib /tmp/ruby/src/trunk/tool/runruby.rb --archdir=/tmp/ruby/build/trunk --extout=.ext -- /tmp/ruby/src/trunk/spec/mspec/bin/mspec-run -B /tmp/ruby/src/trunk/spec/default.mspec --error-output stderr --debug -fy -o /tmp/rubytest.6uqesh/7-mspec-multi-6 E, [2024-05-22T00:31:56.956011 #2792304] ERROR -- : $ /tmp/ruby/build/trunk/miniruby -I/tmp/ruby/src/trunk/lib /tmp/ruby/src/trunk/tool/runruby.rb --archdir=/tmp/ruby/build/trunk --extout=.ext -- /tmp/ruby/src/trunk/spec/mspec/bin/mspec-run -B /tmp/ruby/src/trunk/spec/default.mspec --error-output stderr --debug -fy -o /tmp/rubytest.6uqesh/8-mspec-multi-7 E, [2024-05-22T00:31:56.956068 #2792304] ERROR -- : $ /tmp/ruby/build/trunk/miniruby -I/tmp/ruby/src/trunk/lib /tmp/ruby/src/trunk/tool/runruby.rb --archdir=/tmp/ruby/build/trunk --extout=.ext -- /tmp/ruby/src/trunk/spec/mspec/bin/mspec-run -B /tmp/ruby/src/trunk/spec/default.mspec --error-output stderr --debug -fy -o /tmp/rubytest.6uqesh/9-mspec-multi-8 E, [2024-05-22T00:31:56.956337 #2792304] ERROR -- : $ /tmp/ruby/build/trunk/miniruby -I/tmp/ruby/src/trunk/lib /tmp/ruby/src/trunk/tool/runruby.rb --archdir=/tmp/ruby/build/trunk --extout=.ext -- /tmp/ruby/src/trunk/spec/mspec/bin/mspec-run -B /tmp/ruby/src/trunk/spec/default.mspec --error-output stderr --debug -fy -o /tmp/rubytest.6uqesh/10-mspec-multi-9 E, [2024-05-22T00:31:56.956540 #2792304] ERROR -- : $ /tmp/ruby/build/trunk/miniruby -I/tmp/ruby/src/trunk/lib /tmp/ruby/src/trunk/tool/runruby.rb --archdir=/tmp/ruby/build/trunk --extout=.ext -- /tmp/ruby/src/trunk/spec/mspec/bin/mspec-run -B /tmp/ruby/src/trunk/spec/default.mspec --error-output stderr --debug -fy -o /tmp/rubytest.6uqesh/11-mspec-multi-10 E, [2024-05-22T00:31:56.956751 #2792304] ERROR -- : $ /tmp/ruby/build/trunk/miniruby -I/tmp/ruby/src/trunk/lib /tmp/ruby/src/trunk/tool/runruby.rb --archdir=/tmp/ruby/build/trunk --extout=.ext -- /tmp/ruby/src/trunk/spec/mspec/bin/mspec-run -B /tmp/ruby/src/trunk/spec/default.mspec --error-output stderr --debug -fy -o /tmp/rubytest.6uqesh/12-mspec-multi-11 E, [2024-05-22T00:31:56.956952 #2792304] ERROR -- : $ /tmp/ruby/build/trunk/miniruby -I/tmp/ruby/src/trunk/lib /tmp/ruby/src/trunk/tool/runruby.rb --archdir=/tmp/ruby/build/trunk --extout=.ext -- /tmp/ruby/src/trunk/spec/mspec/bin/mspec-run -B /tmp/ruby/src/trunk/spec/default.mspec --error-output stderr --debug -fy -o /tmp/rubytest.6uqesh/13-mspec-multi-12 E, [2024-05-22T00:31:56.957188 #2792304] ERROR -- : $ /tmp/ruby/build/trunk/miniruby -I/tmp/ruby/src/trunk/lib /tmp/ruby/src/trunk/tool/runruby.rb --archdir=/tmp/ruby/build/trunk --extout=.ext -- /tmp/ruby/src/trunk/spec/mspec/bin/mspec-run -B /tmp/ruby/src/trunk/spec/default.mspec --error-output stderr --debug -fy -o /tmp/rubytest.6uqesh/14-mspec-multi-13 E, [2024-05-22T00:31:56.957458 #2792304] ERROR -- : $ /tmp/ruby/build/trunk/miniruby -I/tmp/ruby/src/trunk/lib /tmp/ruby/src/trunk/tool/runruby.rb --archdir=/tmp/ruby/build/trunk --extout=.ext -- /tmp/ruby/src/trunk/spec/mspec/bin/mspec-run -B /tmp/ruby/src/trunk/spec/default.mspec --error-output stderr --debug -fy -o /tmp/rubytest.6uqesh/15-mspec-multi-14 E, [2024-05-22T00:31:56.957494 #2792304] ERROR -- : $ /tmp/ruby/build/trunk/miniruby -I/tmp/ruby/src/trunk/lib /tmp/ruby/src/trunk/tool/runruby.rb --archdir=/tmp/ruby/build/trunk --extout=.ext -- /tmp/ruby/src/trunk/spec/mspec/bin/mspec-run -B /tmp/ruby/src/trunk/spec/default.mspec --error-output stderr --debug -fy -o /tmp/rubytest.6uqesh/16-mspec-multi-15 E, [2024-05-22T00:31:56.957697 #2792304] ERROR -- : $ /tmp/ruby/build/trunk/miniruby -I/tmp/ruby/src/trunk/lib /tmp/ruby/src/trunk/tool/runruby.rb --archdir=/tmp/ruby/build/trunk --extout=.ext -- /tmp/ruby/src/trunk/spec/mspec/bin/mspec-run -B /tmp/ruby/src/trunk/spec/default.mspec --error-output stderr --debug -fy -o /tmp/rubytest.6uqesh/17-mspec-multi-16 E, [2024-05-22T00:31:56.957875 #2792304] ERROR -- : $ /tmp/ruby/build/trunk/miniruby -I/tmp/ruby/src/trunk/lib /tmp/ruby/src/trunk/tool/runruby.rb --archdir=/tmp/ruby/build/trunk --extout=.ext -- /tmp/ruby/src/trunk/spec/mspec/bin/mspec-run -B /tmp/ruby/src/trunk/spec/default.mspec --error-output stderr --debug -fy -o /tmp/rubytest.6uqesh/18-mspec-multi-17 E, [2024-05-22T00:31:56.960167 #2792304] ERROR -- : $ /tmp/ruby/build/trunk/miniruby -I/tmp/ruby/src/trunk/lib /tmp/ruby/src/trunk/tool/runruby.rb --archdir=/tmp/ruby/build/trunk --extout=.ext -- /tmp/ruby/src/trunk/spec/mspec/bin/mspec-run -B /tmp/ruby/src/trunk/spec/default.mspec --error-output stderr --debug -fy -o /tmp/rubytest.6uqesh/19-mspec-multi-18 E, [2024-05-22T00:31:56.960441 #2792304] ERROR -- : $ /tmp/ruby/build/trunk/miniruby -I/tmp/ruby/src/trunk/lib /tmp/ruby/src/trunk/tool/runruby.rb --archdir=/tmp/ruby/build/trunk --extout=.ext -- /tmp/ruby/src/trunk/spec/mspec/bin/mspec-run -B /tmp/ruby/src/trunk/spec/default.mspec --error-output stderr --debug -fy -o /tmp/rubytest.6uqesh/20-mspec-multi-19 I, [2024-05-22T00:31:57.138643 #2792304] INFO -- : ruby 3.4.0dev (2024-05-21T18:45:16Z master b20adf90e3) [x86_64-linux] I, [2024-05-22T00:31:57.751241 #2792304] INFO -- : 0 ......................................................................... I, [2024-05-22T00:31:58.135996 #2792304] INFO -- : 73 ......................................................................... I, [2024-05-22T00:31:58.287722 #2792304] INFO -- : 146 ......................................................................... I, [2024-05-22T00:31:58.330351 #2792304] INFO -- : 219 ......................................................................... I, [2024-05-22T00:31:58.398248 #2792304] INFO -- : 292 ......................................................................... I, [2024-05-22T00:31:58.444535 #2792304] INFO -- : 365 ......................................................................... I, [2024-05-22T00:31:58.467188 #2792304] INFO -- : 438 ......................................................................... I, [2024-05-22T00:31:58.488865 #2792304] INFO -- : 511 ......................................................................... I, [2024-05-22T00:31:58.506531 #2792304] INFO -- : 584 ......................................................................... I, [2024-05-22T00:31:58.570235 #2792304] INFO -- : 657 ......................................................................... I, [2024-05-22T00:31:58.598385 #2792304] INFO -- : 730 ......................................................................... I, [2024-05-22T00:31:58.623267 #2792304] INFO -- : 803 ......................................................................... I, [2024-05-22T00:31:58.656803 #2792304] INFO -- : 876 ......................................................................... I, [2024-05-22T00:31:58.695002 #2792304] INFO -- : 949 ......................................................................... I, [2024-05-22T00:31:58.777580 #2792304] INFO -- : 1022 ......................................................................... I, [2024-05-22T00:31:58.955409 #2792304] INFO -- : 1095 ......................................................................... I, [2024-05-22T00:31:59.071937 #2792304] INFO -- : 1168 ......................................................................... I, [2024-05-22T00:31:59.132317 #2792304] INFO -- : 1241 ......................................................................... I, [2024-05-22T00:31:59.181614 #2792304] INFO -- : 1314 ......................................................................... I, [2024-05-22T00:31:59.200185 #2792304] INFO -- : 1387 ......................................................................... I, [2024-05-22T00:31:59.314978 #2792304] INFO -- : 1460 ......................................................................... I, [2024-05-22T00:31:59.786220 #2792304] INFO -- : 1533 ......................................................................... I, [2024-05-22T00:31:59.830548 #2792304] INFO -- : 1606 ......................................................................... I, [2024-05-22T00:31:59.981615 #2792304] INFO -- : 1679 ......................................................................... I, [2024-05-22T00:32:00.108294 #2792304] INFO -- : 1752 ......................................................................... I, [2024-05-22T00:32:00.186350 #2792304] INFO -- : 1825 ......................................................................... I, [2024-05-22T00:32:00.261645 #2792304] INFO -- : 1898 ......................................................................... I, [2024-05-22T00:32:00.349479 #2792304] INFO -- : 1971 ......................................................................... I, [2024-05-22T00:32:00.418970 #2792304] INFO -- : 2044 ......................................................................... I, [2024-05-22T00:32:00.462696 #2792304] INFO -- : 2117 ......................................................................... I, [2024-05-22T00:32:00.477004 #2792304] INFO -- : 2190 ......................................................................... I, [2024-05-22T00:32:00.495854 #2792304] INFO -- : 2263 ......................................................................... I, [2024-05-22T00:32:00.512752 #2792304] INFO -- : 2336 ......................................................................... I, [2024-05-22T00:32:00.547088 #2792304] INFO -- : 2409 ......................................................................... I, [2024-05-22T00:32:00.645879 #2792304] INFO -- : 2482 ......................................................................... I, [2024-05-22T00:32:00.675839 #2792304] INFO -- : 2555 ......................................................................... I, [2024-05-22T00:32:00.802798 #2792304] INFO -- : 2628 ......................................................................... I, [2024-05-22T00:32:00.896149 #2792304] INFO -- : 2701 ......................................................................... I, [2024-05-22T00:32:00.921742 #2792304] INFO -- : 2774 ......................................................................... I, [2024-05-22T00:32:00.978675 #2792304] INFO -- : 2847 ......................................................................... I, [2024-05-22T00:32:01.008347 #2792304] INFO -- : 2920 ......................................................................... I, [2024-05-22T00:32:01.029989 #2792304] INFO -- : 2993 ......................................................................... I, [2024-05-22T00:32:01.054538 #2792304] INFO -- : 3066 ......................................................................... I, [2024-05-22T00:32:01.065727 #2792304] INFO -- : 3139 ......................................................................... I, [2024-05-22T00:32:01.072860 #2792304] INFO -- : 3212 ......................................................................... I, [2024-05-22T00:32:01.102776 #2792304] INFO -- : 3285 ......................................................................... I, [2024-05-22T00:32:05.053057 #2792304] INFO -- : 3358 ......................................................................... I, [2024-05-22T00:32:05.089495 #2792304] INFO -- : I, [2024-05-22T00:32:05.089533 #2792304] INFO -- : I, [2024-05-22T00:32:05.089540 #2792304] INFO -- : Finished in 8.132280 seconds I, [2024-05-22T00:32:05.089546 #2792304] INFO -- : I, [2024-05-22T00:32:05.089551 #2792304] INFO -- : 3430 files, 32652 examples, 168852 expectations, 0 failures, 0 errors, 0 tagged I, [2024-05-22T00:32:05.093303 #2792304] INFO -- : $$$[end] "make yes-test-rubyspec MSPECOPT='--error-output stderr --debug -j' TESTS='-j20'" exit with 0.