# Logfile created on 2024-05-21 19:19:32 +0000 by logger.rb/v1.4.3 I, [2024-05-21T19:19:32.779659 #1327066] INFO -- : #, @formatter=nil, @logdev=#, @binmode=false, @mon_data=#, @mon_data_owner_object_id=860>>> I, [2024-05-21T19:19:32.779811 #1327066] INFO -- : $$$[beg] make update-unicode -j20 I, [2024-05-21T19:19:32.840422 #1327066] INFO -- : Downloading Unicode emoji 15.0 files... I, [2024-05-21T19:19:32.840652 #1327066] INFO -- : Downloading Unicode emoji 15.0 files... I, [2024-05-21T19:19:32.841362 #1327066] INFO -- : Downloading Unicode emoji 15.0 files... I, [2024-05-21T19:19:32.882709 #1327066] INFO -- : made symlink emoji/15.0/emoji-sequences.txt to /tmp/ruby/src/trunk/.downloaded-cache/emoji/15.0/emoji-sequences.txt I, [2024-05-21T19:19:32.883765 #1327066] INFO -- : downloading emoji/15.0/emoji-sequences.txt ... downloading emoji/15.0/emoji-test.txt ... /tmp/ruby/src/trunk/enc/unicode/data/emoji/15.0/emoji-sequences.txt already exists E, [2024-05-21T19:19:33.345810 #1327066] ERROR -- : /tmp/ruby/src/trunk/tool/downloader.rb:302:in `rescue in download': failed to download emoji/15.0/emoji-test.txt (RuntimeError) E, [2024-05-21T19:19:33.345932 #1327066] ERROR -- : OpenURI::HTTPError: 403 Forbidden: https://www.unicode.org/Public/emoji/15.0/emoji-test.txt E, [2024-05-21T19:19:33.345953 #1327066] ERROR -- : from /tmp/ruby/src/trunk/tool/downloader.rb:201:in `download' E, [2024-05-21T19:19:33.345966 #1327066] ERROR -- : from /tmp/ruby/src/trunk/tool/downloader.rb:136:in `download' E, [2024-05-21T19:19:33.345979 #1327066] ERROR -- : from /tmp/ruby/src/trunk/tool/downloader.rb:482:in `block in
' E, [2024-05-21T19:19:33.345992 #1327066] ERROR -- : from /tmp/ruby/src/trunk/tool/downloader.rb:465:in `each' E, [2024-05-21T19:19:33.346005 #1327066] ERROR -- : from /tmp/ruby/src/trunk/tool/downloader.rb:465:in `
' E, [2024-05-21T19:19:33.346017 #1327066] ERROR -- : /usr/lib/ruby/3.0.0/open-uri.rb:364:in `open_http': 403 Forbidden (OpenURI::HTTPError) E, [2024-05-21T19:19:33.346029 #1327066] ERROR -- : from /usr/lib/ruby/3.0.0/open-uri.rb:741:in `buffer_open' E, [2024-05-21T19:19:33.346044 #1327066] ERROR -- : from /usr/lib/ruby/3.0.0/open-uri.rb:212:in `block in open_loop' E, [2024-05-21T19:19:33.346056 #1327066] ERROR -- : from /usr/lib/ruby/3.0.0/open-uri.rb:210:in `catch' E, [2024-05-21T19:19:33.346068 #1327066] ERROR -- : from /usr/lib/ruby/3.0.0/open-uri.rb:210:in `open_loop' E, [2024-05-21T19:19:33.346079 #1327066] ERROR -- : from /usr/lib/ruby/3.0.0/open-uri.rb:151:in `open_uri' E, [2024-05-21T19:19:33.346091 #1327066] ERROR -- : from /usr/lib/ruby/3.0.0/open-uri.rb:721:in `open' E, [2024-05-21T19:19:33.346102 #1327066] ERROR -- : from /usr/lib/ruby/3.0.0/open-uri.rb:729:in `read' E, [2024-05-21T19:19:33.346114 #1327066] ERROR -- : from /tmp/ruby/src/trunk/tool/downloader.rb:247:in `block in download' E, [2024-05-21T19:19:33.346143 #1327066] ERROR -- : from /tmp/ruby/src/trunk/tool/downloader.rb:378:in `with_retry' E, [2024-05-21T19:19:33.346159 #1327066] ERROR -- : from /tmp/ruby/src/trunk/tool/downloader.rb:246:in `download' E, [2024-05-21T19:19:33.346171 #1327066] ERROR -- : from /tmp/ruby/src/trunk/tool/downloader.rb:136:in `download' E, [2024-05-21T19:19:33.346183 #1327066] ERROR -- : from /tmp/ruby/src/trunk/tool/downloader.rb:482:in `block in
' E, [2024-05-21T19:19:33.346195 #1327066] ERROR -- : from /tmp/ruby/src/trunk/tool/downloader.rb:465:in `each' E, [2024-05-21T19:19:33.346206 #1327066] ERROR -- : from /tmp/ruby/src/trunk/tool/downloader.rb:465:in `
' E, [2024-05-21T19:19:33.346221 #1327066] ERROR -- : /tmp/ruby/src/trunk/tool/downloader.rb:302:in `rescue in download': failed to download emoji/15.0/emoji-test.txt (RuntimeError) E, [2024-05-21T19:19:33.346233 #1327066] ERROR -- : OpenURI::HTTPError: 403 Forbidden: https://www.unicode.org/Public/emoji/15.0/emoji-test.txt E, [2024-05-21T19:19:33.346245 #1327066] ERROR -- : from /tmp/ruby/src/trunk/tool/downloader.rb:201:in `download' E, [2024-05-21T19:19:33.346261 #1327066] ERROR -- : from /tmp/ruby/src/trunk/tool/downloader.rb:136:in `download' E, [2024-05-21T19:19:33.346272 #1327066] ERROR -- : from /tmp/ruby/src/trunk/tool/downloader.rb:482:in `block in
' E, [2024-05-21T19:19:33.346283 #1327066] ERROR -- : from /tmp/ruby/src/trunk/tool/downloader.rb:465:in `each' E, [2024-05-21T19:19:33.346293 #1327066] ERROR -- : from /tmp/ruby/src/trunk/tool/downloader.rb:465:in `
' E, [2024-05-21T19:19:33.346304 #1327066] ERROR -- : /usr/lib/ruby/3.0.0/open-uri.rb:364:in `open_http': 403 Forbidden (OpenURI::HTTPError) E, [2024-05-21T19:19:33.346314 #1327066] ERROR -- : from /usr/lib/ruby/3.0.0/open-uri.rb:741:in `buffer_open' E, [2024-05-21T19:19:33.346331 #1327066] ERROR -- : from /usr/lib/ruby/3.0.0/open-uri.rb:212:in `block in open_loop' E, [2024-05-21T19:19:33.346342 #1327066] ERROR -- : from /usr/lib/ruby/3.0.0/open-uri.rb:210:in `catch' E, [2024-05-21T19:19:33.346355 #1327066] ERROR -- : from /usr/lib/ruby/3.0.0/open-uri.rb:210:in `open_loop' E, [2024-05-21T19:19:33.346365 #1327066] ERROR -- : from /usr/lib/ruby/3.0.0/open-uri.rb:151:in `open_uri' E, [2024-05-21T19:19:33.346377 #1327066] ERROR -- : from /usr/lib/ruby/3.0.0/open-uri.rb:721:in `open' E, [2024-05-21T19:19:33.346387 #1327066] ERROR -- : from /usr/lib/ruby/3.0.0/open-uri.rb:729:in `read' E, [2024-05-21T19:19:33.346398 #1327066] ERROR -- : from /tmp/ruby/src/trunk/tool/downloader.rb:247:in `block in download' E, [2024-05-21T19:19:33.346408 #1327066] ERROR -- : from /tmp/ruby/src/trunk/tool/downloader.rb:378:in `with_retry' E, [2024-05-21T19:19:33.346419 #1327066] ERROR -- : from /tmp/ruby/src/trunk/tool/downloader.rb:246:in `download' E, [2024-05-21T19:19:33.346429 #1327066] ERROR -- : from /tmp/ruby/src/trunk/tool/downloader.rb:136:in `download' E, [2024-05-21T19:19:33.346442 #1327066] ERROR -- : from /tmp/ruby/src/trunk/tool/downloader.rb:482:in `block in
' E, [2024-05-21T19:19:33.346453 #1327066] ERROR -- : from /tmp/ruby/src/trunk/tool/downloader.rb:465:in `each' E, [2024-05-21T19:19:33.346464 #1327066] ERROR -- : from /tmp/ruby/src/trunk/tool/downloader.rb:465:in `
' E, [2024-05-21T19:19:33.350151 #1327066] ERROR -- : make: *** [uncommon.mk:1756: /tmp/ruby/src/trunk/enc/unicode/data/emoji/15.0/emoji-test.txt] Error 1 E, [2024-05-21T19:19:33.350223 #1327066] ERROR -- : make: *** Waiting for unfinished jobs.... E, [2024-05-21T19:19:33.350489 #1327066] ERROR -- : make: *** [uncommon.mk:1756: /tmp/ruby/src/trunk/enc/unicode/data/emoji/15.0/emoji-zwj-sequences.txt] Error 1 E, [2024-05-21T19:19:33.815464 #1327066] ERROR -- : /tmp/ruby/src/trunk/tool/downloader.rb:302:in `rescue in download': failed to download emoji/15.0/emoji-sequences.txt (RuntimeError) E, [2024-05-21T19:19:33.815609 #1327066] ERROR -- : EOFError: end of file reached: https://www.unicode.org/Public/emoji/15.0/emoji-sequences.txt E, [2024-05-21T19:19:33.815651 #1327066] ERROR -- : from /tmp/ruby/src/trunk/tool/downloader.rb:201:in `download' E, [2024-05-21T19:19:33.815668 #1327066] ERROR -- : from /tmp/ruby/src/trunk/tool/downloader.rb:136:in `download' E, [2024-05-21T19:19:33.815680 #1327066] ERROR -- : from /tmp/ruby/src/trunk/tool/downloader.rb:482:in `block in
' E, [2024-05-21T19:19:33.815755 #1327066] ERROR -- : from /tmp/ruby/src/trunk/tool/downloader.rb:465:in `each' E, [2024-05-21T19:19:33.815767 #1327066] ERROR -- : from /tmp/ruby/src/trunk/tool/downloader.rb:465:in `
' E, [2024-05-21T19:19:33.815779 #1327066] ERROR -- : /usr/lib/ruby/3.0.0/net/protocol.rb:227:in `rbuf_fill': end of file reached (EOFError) E, [2024-05-21T19:19:33.815791 #1327066] ERROR -- : from /usr/lib/ruby/3.0.0/net/protocol.rb:193:in `readuntil' E, [2024-05-21T19:19:33.815807 #1327066] ERROR -- : from /usr/lib/ruby/3.0.0/net/protocol.rb:203:in `readline' E, [2024-05-21T19:19:33.815820 #1327066] ERROR -- : from /usr/lib/ruby/3.0.0/net/http/response.rb:42:in `read_status_line' E, [2024-05-21T19:19:33.815832 #1327066] ERROR -- : from /usr/lib/ruby/3.0.0/net/http/response.rb:31:in `read_new' E, [2024-05-21T19:19:33.815844 #1327066] ERROR -- : from /usr/lib/ruby/3.0.0/net/http.rb:1557:in `block in transport_request' E, [2024-05-21T19:19:33.815855 #1327066] ERROR -- : from /usr/lib/ruby/3.0.0/net/http.rb:1548:in `catch' E, [2024-05-21T19:19:33.815867 #1327066] ERROR -- : from /usr/lib/ruby/3.0.0/net/http.rb:1548:in `transport_request' E, [2024-05-21T19:19:33.815878 #1327066] ERROR -- : from /usr/lib/ruby/3.0.0/net/http.rb:1521:in `request' E, [2024-05-21T19:19:33.816136 #1327066] ERROR -- : from /usr/lib/ruby/3.0.0/open-uri.rb:329:in `block in open_http' E, [2024-05-21T19:19:33.816150 #1327066] ERROR -- : from /usr/lib/ruby/3.0.0/net/http.rb:960:in `start' E, [2024-05-21T19:19:33.816162 #1327066] ERROR -- : from /usr/lib/ruby/3.0.0/open-uri.rb:323:in `open_http' E, [2024-05-21T19:19:33.816180 #1327066] ERROR -- : from /usr/lib/ruby/3.0.0/open-uri.rb:741:in `buffer_open' E, [2024-05-21T19:19:33.816192 #1327066] ERROR -- : from /usr/lib/ruby/3.0.0/open-uri.rb:212:in `block in open_loop' E, [2024-05-21T19:19:33.816209 #1327066] ERROR -- : from /usr/lib/ruby/3.0.0/open-uri.rb:210:in `catch' E, [2024-05-21T19:19:33.816221 #1327066] ERROR -- : from /usr/lib/ruby/3.0.0/open-uri.rb:210:in `open_loop' E, [2024-05-21T19:19:33.816233 #1327066] ERROR -- : from /usr/lib/ruby/3.0.0/open-uri.rb:151:in `open_uri' E, [2024-05-21T19:19:33.816244 #1327066] ERROR -- : from /usr/lib/ruby/3.0.0/open-uri.rb:721:in `open' E, [2024-05-21T19:19:33.816256 #1327066] ERROR -- : from /usr/lib/ruby/3.0.0/open-uri.rb:729:in `read' E, [2024-05-21T19:19:33.816267 #1327066] ERROR -- : from /tmp/ruby/src/trunk/tool/downloader.rb:247:in `block in download' E, [2024-05-21T19:19:33.816279 #1327066] ERROR -- : from /tmp/ruby/src/trunk/tool/downloader.rb:378:in `with_retry' E, [2024-05-21T19:19:33.816294 #1327066] ERROR -- : from /tmp/ruby/src/trunk/tool/downloader.rb:246:in `download' E, [2024-05-21T19:19:33.816305 #1327066] ERROR -- : from /tmp/ruby/src/trunk/tool/downloader.rb:136:in `download' E, [2024-05-21T19:19:33.816320 #1327066] ERROR -- : from /tmp/ruby/src/trunk/tool/downloader.rb:482:in `block in
' E, [2024-05-21T19:19:33.816332 #1327066] ERROR -- : from /tmp/ruby/src/trunk/tool/downloader.rb:465:in `each' E, [2024-05-21T19:19:33.816343 #1327066] ERROR -- : from /tmp/ruby/src/trunk/tool/downloader.rb:465:in `
' E, [2024-05-21T19:19:33.820295 #1327066] ERROR -- : make: *** [uncommon.mk:1756: /tmp/ruby/src/trunk/enc/unicode/data/emoji/15.0/emoji-sequences.txt] Error 1 E, [2024-05-21T19:19:33.820352 #1327066] ERROR -- : make: *** Deleting file '/tmp/ruby/src/trunk/enc/unicode/data/emoji/15.0/emoji-sequences.txt' I, [2024-05-21T19:19:33.820404 #1327066] INFO -- : downloading emoji/15.0/emoji-test.txt ... I, [2024-05-21T19:19:33.821102 #1327066] INFO -- : $$$[end] "make update-unicode -j20" exit with 512. I, [2024-05-21T19:19:33.821165 #1327066] INFO -- : $$$[beg] make update-download -j20 I, [2024-05-21T19:19:33.930112 #1327066] INFO -- : tool/config.guess already exists I, [2024-05-21T19:19:33.930163 #1327066] INFO -- : tool/config.sub already exists I, [2024-05-21T19:19:33.932552 #1327066] INFO -- : Update power_assert to 84e85124c5014a139af39161d484156cfe87a9ed I, [2024-05-21T19:19:33.932768 #1327066] INFO -- : Update rbs to ba7872795d5de04adb8ff500c0e6afdc81a041dd I, [2024-05-21T19:19:33.933470 #1327066] INFO -- : Update typeprof to b19a6416da3a05d57fadd6ffdadb382b6d236ca5 I, [2024-05-21T19:19:33.933815 #1327066] INFO -- : echo 84e85124c5014a139af39161d484156cfe87a9ed | /bin/sh /tmp/ruby/src/trunk/tool/ifchange /tmp/ruby/src/trunk/.bundle/.timestamp/power_assert.revision - I, [2024-05-21T19:19:33.934011 #1327066] INFO -- : echo ba7872795d5de04adb8ff500c0e6afdc81a041dd | /bin/sh /tmp/ruby/src/trunk/tool/ifchange /tmp/ruby/src/trunk/.bundle/.timestamp/rbs.revision - I, [2024-05-21T19:19:33.934962 #1327066] INFO -- : echo b19a6416da3a05d57fadd6ffdadb382b6d236ca5 | /bin/sh /tmp/ruby/src/trunk/tool/ifchange /tmp/ruby/src/trunk/.bundle/.timestamp/typeprof.revision - I, [2024-05-21T19:19:33.936046 #1327066] INFO -- : /tmp/ruby/src/trunk/.bundle/.timestamp/rbs.revision unchanged I, [2024-05-21T19:19:33.936142 #1327066] INFO -- : /tmp/ruby/src/trunk/.bundle/.timestamp/power_assert.revision unchanged I, [2024-05-21T19:19:33.937502 #1327066] INFO -- : /tmp/ruby/src/trunk/.bundle/.timestamp/typeprof.revision unchanged I, [2024-05-21T19:19:33.937594 #1327066] INFO -- : Building power_assert@84e85124c5014a139af39161d484156cfe87a9ed to /tmp/ruby/src/trunk/gems/power_assert-2.0.3.gem I, [2024-05-21T19:19:34.006575 #1327066] INFO -- : Successfully built RubyGem I, [2024-05-21T19:19:34.006614 #1327066] INFO -- : Name: power_assert I, [2024-05-21T19:19:34.006619 #1327066] INFO -- : Version: 2.0.4dev I, [2024-05-21T19:19:34.006623 #1327066] INFO -- : File: power_assert-2.0.4dev.gem I, [2024-05-21T19:19:34.054502 #1327066] INFO -- : $$$[end] "make update-download -j20" exit with 0. I, [2024-05-21T19:19:34.054548 #1327066] INFO -- : $$$[beg] make update-rubyspec -j20 I, [2024-05-21T19:19:34.112348 #1327066] INFO -- : make: Nothing to be done for 'update-rubyspec'. I, [2024-05-21T19:19:34.112765 #1327066] INFO -- : $$$[end] "make update-rubyspec -j20" exit with 0. I, [2024-05-21T19:19:34.112796 #1327066] INFO -- : $$$[beg] make update-src -j20 I, [2024-05-21T19:19:34.761016 #1327066] INFO -- : Already up to date. I, [2024-05-21T19:19:34.776422 #1327066] INFO -- : Latest commit hash = b20adf90e3 I, [2024-05-21T19:19:34.777780 #1327066] INFO -- : $$$[end] "make update-src -j20" exit with 0. I, [2024-05-21T19:19:34.777831 #1327066] INFO -- : $$$[beg] make after-update -j20 I, [2024-05-21T19:19:34.886337 #1327066] INFO -- : /tmp/ruby/src/trunk/revision.h updated I, [2024-05-21T19:19:34.887454 #1327066] INFO -- : generating x86_64-linux-fake.rb I, [2024-05-21T19:19:34.938895 #1327066] INFO -- : x86_64-linux-fake.rb updated I, [2024-05-21T19:19:34.940234 #1327066] INFO -- : generating enc.mk I, [2024-05-21T19:19:35.061733 #1327066] INFO -- : making srcs under enc I, [2024-05-21T19:19:35.091436 #1327066] INFO -- : make[1]: Entering directory '/tmp/ruby/build/trunk' I, [2024-05-21T19:19:35.091464 #1327066] INFO -- : make[1]: Nothing to be done for 'srcs'. I, [2024-05-21T19:19:35.091471 #1327066] INFO -- : make[1]: Leaving directory '/tmp/ruby/build/trunk' I, [2024-05-21T19:19:35.136097 #1327066] INFO -- : Update power_assert to 84e85124c5014a139af39161d484156cfe87a9ed I, [2024-05-21T19:19:35.136380 #1327066] INFO -- : Update rbs to ba7872795d5de04adb8ff500c0e6afdc81a041dd I, [2024-05-21T19:19:35.137099 #1327066] INFO -- : Update typeprof to b19a6416da3a05d57fadd6ffdadb382b6d236ca5 I, [2024-05-21T19:19:35.137584 #1327066] INFO -- : echo 84e85124c5014a139af39161d484156cfe87a9ed | /bin/sh /tmp/ruby/src/trunk/tool/ifchange /tmp/ruby/src/trunk/.bundle/.timestamp/power_assert.revision - I, [2024-05-21T19:19:35.137834 #1327066] INFO -- : echo ba7872795d5de04adb8ff500c0e6afdc81a041dd | /bin/sh /tmp/ruby/src/trunk/tool/ifchange /tmp/ruby/src/trunk/.bundle/.timestamp/rbs.revision - I, [2024-05-21T19:19:35.139069 #1327066] INFO -- : echo b19a6416da3a05d57fadd6ffdadb382b6d236ca5 | /bin/sh /tmp/ruby/src/trunk/tool/ifchange /tmp/ruby/src/trunk/.bundle/.timestamp/typeprof.revision - I, [2024-05-21T19:19:35.139514 #1327066] INFO -- : /tmp/ruby/src/trunk/.bundle/.timestamp/power_assert.revision unchanged I, [2024-05-21T19:19:35.139829 #1327066] INFO -- : /tmp/ruby/src/trunk/.bundle/.timestamp/rbs.revision unchanged I, [2024-05-21T19:19:35.140624 #1327066] INFO -- : Building power_assert@84e85124c5014a139af39161d484156cfe87a9ed to /tmp/ruby/src/trunk/gems/power_assert-2.0.3.gem I, [2024-05-21T19:19:35.140755 #1327066] INFO -- : /tmp/ruby/src/trunk/.bundle/.timestamp/typeprof.revision unchanged I, [2024-05-21T19:19:35.209583 #1327066] INFO -- : Successfully built RubyGem I, [2024-05-21T19:19:35.209632 #1327066] INFO -- : Name: power_assert I, [2024-05-21T19:19:35.209639 #1327066] INFO -- : Version: 2.0.4dev I, [2024-05-21T19:19:35.209644 #1327066] INFO -- : File: power_assert-2.0.4dev.gem I, [2024-05-21T19:19:35.211699 #1327066] INFO -- : Extracting bundle gem power_assert-2.0.3... I, [2024-05-21T19:19:35.272154 #1327066] INFO -- : Try with hash version of bundled gems instead of gems/power_assert-2.0.3.gem. We don't use this gem with release version of Ruby. I, [2024-05-21T19:19:35.277110 #1327066] INFO -- : Unpacked gems/power_assert-2.0.4dev.gem I, [2024-05-21T19:19:35.279198 #1327066] INFO -- : $$$[end] "make after-update -j20" exit with 0. I, [2024-05-21T19:19:35.279321 #1327066] INFO -- : $$$[beg] make miniruby -j20 I, [2024-05-21T19:19:35.344016 #1327066] INFO -- : BASERUBY = /usr/bin/ruby --disable=gems I, [2024-05-21T19:19:35.344069 #1327066] INFO -- : CC = gcc I, [2024-05-21T19:19:35.344083 #1327066] INFO -- : LD = ld I, [2024-05-21T19:19:35.344093 #1327066] INFO -- : LDSHARED = gcc -shared I, [2024-05-21T19:19:35.344104 #1327066] INFO -- : CFLAGS = -O3 -fno-fast-math -ggdb3 -Wall -Wextra -Wdeprecated-declarations -Wdiv-by-zero -Wduplicated-cond -Wimplicit-function-declaration -Wimplicit-int -Wpointer-arith -Wwrite-strings -Wold-style-definition -Wimplicit-fallthrough=0 -Wmissing-noreturn -Wno-cast-function-type -Wno-constant-logical-operand -Wno-long-long -Wno-missing-field-initializers -Wno-overlength-strings -Wno-packed-bitfield-compat -Wno-parentheses-equality -Wno-self-assign -Wno-tautological-compare -Wno-unused-parameter -Wno-unused-value -Wsuggest-attribute=format -Wsuggest-attribute=noreturn -Wunused-variable -Wmisleading-indentation -Wundef -fPIC I, [2024-05-21T19:19:35.344119 #1327066] INFO -- : XCFLAGS = -U_FORTIFY_SOURCE -D_FORTIFY_SOURCE=2 -fstack-protector-strong -fno-strict-overflow -fvisibility=hidden -fexcess-precision=standard -DRUBY_EXPORT -I. -I.ext/include/x86_64-linux -I/tmp/ruby/src/trunk/include -I/tmp/ruby/src/trunk -I/tmp/ruby/src/trunk/prism -I/tmp/ruby/src/trunk/enc/unicode/15.0.0 I, [2024-05-21T19:19:35.344126 #1327066] INFO -- : CPPFLAGS = I, [2024-05-21T19:19:35.344133 #1327066] INFO -- : DLDFLAGS = -Wl,--compress-debug-sections=zlib -Wl,-soname,libruby.so.3.4 -fstack-protector-strong I, [2024-05-21T19:19:35.344140 #1327066] INFO -- : SOLIBS = -lz -lrt -lrt -lgmp -ldl -lcrypt -lm -lpthread I, [2024-05-21T19:19:35.344146 #1327066] INFO -- : LANG = en_US.UTF-8 I, [2024-05-21T19:19:35.344153 #1327066] INFO -- : LC_ALL = I, [2024-05-21T19:19:35.344159 #1327066] INFO -- : LC_CTYPE = I, [2024-05-21T19:19:35.344165 #1327066] INFO -- : MFLAGS = -j20 --jobserver-auth=4,5 I, [2024-05-21T19:19:35.344179 #1327066] INFO -- : RUSTC = no I, [2024-05-21T19:19:35.344185 #1327066] INFO -- : YJIT_RUSTC_ARGS = --crate-name=yjit --crate-type=staticlib --edition=2021 -g -C lto=thin -C opt-level=3 -C overflow-checks=on '--out-dir=/tmp/ruby/build/trunk/yjit/target/release/' /tmp/ruby/src/trunk/yjit/src/lib.rs I, [2024-05-21T19:19:35.346279 #1327066] INFO -- : gcc (Ubuntu 11.4.0-1ubuntu1~22.04) 11.4.0 I, [2024-05-21T19:19:35.346327 #1327066] INFO -- : Copyright (C) 2021 Free Software Foundation, Inc. I, [2024-05-21T19:19:35.346338 #1327066] INFO -- : This is free software; see the source for copying conditions. There is NO I, [2024-05-21T19:19:35.346349 #1327066] INFO -- : warranty; not even for MERCHANTABILITY or FITNESS FOR A PARTICULAR PURPOSE. I, [2024-05-21T19:19:35.346356 #1327066] INFO -- : I, [2024-05-21T19:19:35.371544 #1327066] INFO -- : compiling /tmp/ruby/src/trunk/version.c I, [2024-05-21T19:19:35.473634 #1327066] INFO -- : linking miniruby I, [2024-05-21T19:19:36.002162 #1327066] INFO -- : $$$[end] "make miniruby -j20" exit with 0. I, [2024-05-21T19:19:36.002265 #1327066] INFO -- : $$$[beg] make ruby -j20 I, [2024-05-21T19:19:36.059725 #1327066] INFO -- : BASERUBY = /usr/bin/ruby --disable=gems I, [2024-05-21T19:19:36.059754 #1327066] INFO -- : CC = gcc I, [2024-05-21T19:19:36.059759 #1327066] INFO -- : LD = ld I, [2024-05-21T19:19:36.059763 #1327066] INFO -- : LDSHARED = gcc -shared I, [2024-05-21T19:19:36.059768 #1327066] INFO -- : CFLAGS = -O3 -fno-fast-math -ggdb3 -Wall -Wextra -Wdeprecated-declarations -Wdiv-by-zero -Wduplicated-cond -Wimplicit-function-declaration -Wimplicit-int -Wpointer-arith -Wwrite-strings -Wold-style-definition -Wimplicit-fallthrough=0 -Wmissing-noreturn -Wno-cast-function-type -Wno-constant-logical-operand -Wno-long-long -Wno-missing-field-initializers -Wno-overlength-strings -Wno-packed-bitfield-compat -Wno-parentheses-equality -Wno-self-assign -Wno-tautological-compare -Wno-unused-parameter -Wno-unused-value -Wsuggest-attribute=format -Wsuggest-attribute=noreturn -Wunused-variable -Wmisleading-indentation -Wundef -fPIC I, [2024-05-21T19:19:36.059772 #1327066] INFO -- : XCFLAGS = -U_FORTIFY_SOURCE -D_FORTIFY_SOURCE=2 -fstack-protector-strong -fno-strict-overflow -fvisibility=hidden -fexcess-precision=standard -DRUBY_EXPORT -I. -I.ext/include/x86_64-linux -I/tmp/ruby/src/trunk/include -I/tmp/ruby/src/trunk -I/tmp/ruby/src/trunk/prism -I/tmp/ruby/src/trunk/enc/unicode/15.0.0 I, [2024-05-21T19:19:36.059776 #1327066] INFO -- : CPPFLAGS = I, [2024-05-21T19:19:36.059779 #1327066] INFO -- : DLDFLAGS = -Wl,--compress-debug-sections=zlib -Wl,-soname,libruby.so.3.4 -fstack-protector-strong I, [2024-05-21T19:19:36.059783 #1327066] INFO -- : SOLIBS = -lz -lrt -lrt -lgmp -ldl -lcrypt -lm -lpthread I, [2024-05-21T19:19:36.059786 #1327066] INFO -- : LANG = en_US.UTF-8 I, [2024-05-21T19:19:36.059790 #1327066] INFO -- : LC_ALL = I, [2024-05-21T19:19:36.059794 #1327066] INFO -- : LC_CTYPE = I, [2024-05-21T19:19:36.059797 #1327066] INFO -- : MFLAGS = -j20 --jobserver-auth=4,5 I, [2024-05-21T19:19:36.059801 #1327066] INFO -- : RUSTC = no I, [2024-05-21T19:19:36.059804 #1327066] INFO -- : YJIT_RUSTC_ARGS = --crate-name=yjit --crate-type=staticlib --edition=2021 -g -C lto=thin -C opt-level=3 -C overflow-checks=on '--out-dir=/tmp/ruby/build/trunk/yjit/target/release/' /tmp/ruby/src/trunk/yjit/src/lib.rs I, [2024-05-21T19:19:36.061108 #1327066] INFO -- : gcc (Ubuntu 11.4.0-1ubuntu1~22.04) 11.4.0 I, [2024-05-21T19:19:36.061131 #1327066] INFO -- : Copyright (C) 2021 Free Software Foundation, Inc. I, [2024-05-21T19:19:36.061137 #1327066] INFO -- : This is free software; see the source for copying conditions. There is NO I, [2024-05-21T19:19:36.061141 #1327066] INFO -- : warranty; not even for MERCHANTABILITY or FITNESS FOR A PARTICULAR PURPOSE. I, [2024-05-21T19:19:36.061144 #1327066] INFO -- : I, [2024-05-21T19:19:36.167821 #1327066] INFO -- : builtin_binary.inc updated I, [2024-05-21T19:19:36.172398 #1327066] INFO -- : c5234a9416e4f20f175185e840b25b0f08674d14078ed7083f37e655458e3ca9 builtin_binary.inc I, [2024-05-21T19:19:36.173180 #1327066] INFO -- : compiling /tmp/ruby/src/trunk/builtin.c I, [2024-05-21T19:19:36.355536 #1327066] INFO -- : linking static-library libruby-static.a I, [2024-05-21T19:19:36.667282 #1327066] INFO -- : linking shared-library libruby.so.3.4.0 I, [2024-05-21T19:19:38.211168 #1327066] INFO -- : linking ruby I, [2024-05-21T19:19:38.236648 #1327066] INFO -- : $$$[end] "make ruby -j20" exit with 0. I, [2024-05-21T19:19:38.236760 #1327066] INFO -- : $$$[beg] make all -j20 I, [2024-05-21T19:19:38.302956 #1327066] INFO -- : BASERUBY = /usr/bin/ruby --disable=gems I, [2024-05-21T19:19:38.303001 #1327066] INFO -- : CC = gcc I, [2024-05-21T19:19:38.303015 #1327066] INFO -- : LD = ld I, [2024-05-21T19:19:38.303026 #1327066] INFO -- : LDSHARED = gcc -shared I, [2024-05-21T19:19:38.303037 #1327066] INFO -- : CFLAGS = -O3 -fno-fast-math -ggdb3 -Wall -Wextra -Wdeprecated-declarations -Wdiv-by-zero -Wduplicated-cond -Wimplicit-function-declaration -Wimplicit-int -Wpointer-arith -Wwrite-strings -Wold-style-definition -Wimplicit-fallthrough=0 -Wmissing-noreturn -Wno-cast-function-type -Wno-constant-logical-operand -Wno-long-long -Wno-missing-field-initializers -Wno-overlength-strings -Wno-packed-bitfield-compat -Wno-parentheses-equality -Wno-self-assign -Wno-tautological-compare -Wno-unused-parameter -Wno-unused-value -Wsuggest-attribute=format -Wsuggest-attribute=noreturn -Wunused-variable -Wmisleading-indentation -Wundef -fPIC I, [2024-05-21T19:19:38.303048 #1327066] INFO -- : XCFLAGS = -U_FORTIFY_SOURCE -D_FORTIFY_SOURCE=2 -fstack-protector-strong -fno-strict-overflow -fvisibility=hidden -fexcess-precision=standard -DRUBY_EXPORT -I. -I.ext/include/x86_64-linux -I/tmp/ruby/src/trunk/include -I/tmp/ruby/src/trunk -I/tmp/ruby/src/trunk/prism -I/tmp/ruby/src/trunk/enc/unicode/15.0.0 I, [2024-05-21T19:19:38.303059 #1327066] INFO -- : CPPFLAGS = I, [2024-05-21T19:19:38.303069 #1327066] INFO -- : DLDFLAGS = -Wl,--compress-debug-sections=zlib -Wl,-soname,libruby.so.3.4 -fstack-protector-strong I, [2024-05-21T19:19:38.303080 #1327066] INFO -- : SOLIBS = -lz -lrt -lrt -lgmp -ldl -lcrypt -lm -lpthread I, [2024-05-21T19:19:38.303090 #1327066] INFO -- : LANG = en_US.UTF-8 I, [2024-05-21T19:19:38.303100 #1327066] INFO -- : LC_ALL = I, [2024-05-21T19:19:38.303110 #1327066] INFO -- : LC_CTYPE = I, [2024-05-21T19:19:38.303120 #1327066] INFO -- : MFLAGS = -j20 --jobserver-auth=4,5 I, [2024-05-21T19:19:38.303130 #1327066] INFO -- : RUSTC = no I, [2024-05-21T19:19:38.303141 #1327066] INFO -- : YJIT_RUSTC_ARGS = --crate-name=yjit --crate-type=staticlib --edition=2021 -g -C lto=thin -C opt-level=3 -C overflow-checks=on '--out-dir=/tmp/ruby/build/trunk/yjit/target/release/' /tmp/ruby/src/trunk/yjit/src/lib.rs I, [2024-05-21T19:19:38.304396 #1327066] INFO -- : gcc (Ubuntu 11.4.0-1ubuntu1~22.04) 11.4.0 I, [2024-05-21T19:19:38.304442 #1327066] INFO -- : Copyright (C) 2021 Free Software Foundation, Inc. I, [2024-05-21T19:19:38.304463 #1327066] INFO -- : This is free software; see the source for copying conditions. There is NO I, [2024-05-21T19:19:38.304477 #1327066] INFO -- : warranty; not even for MERCHANTABILITY or FITNESS FOR A PARTICULAR PURPOSE. I, [2024-05-21T19:19:38.304490 #1327066] INFO -- : I, [2024-05-21T19:19:38.334106 #1327066] INFO -- : generating encdb.h I, [2024-05-21T19:19:38.335453 #1327066] INFO -- : generating enc.mk I, [2024-05-21T19:19:38.337274 #1327066] INFO -- : building spec/ruby/optional/capi/ext/array_spec.so I, [2024-05-21T19:19:38.337924 #1327066] INFO -- : building spec/ruby/optional/capi/ext/basic_object_spec.so I, [2024-05-21T19:19:38.338759 #1327066] INFO -- : building spec/ruby/optional/capi/ext/bignum_spec.so I, [2024-05-21T19:19:38.339451 #1327066] INFO -- : building spec/ruby/optional/capi/ext/binding_spec.so I, [2024-05-21T19:19:38.340143 #1327066] INFO -- : building spec/ruby/optional/capi/ext/boolean_spec.so I, [2024-05-21T19:19:38.341093 #1327066] INFO -- : building spec/ruby/optional/capi/ext/class_id_under_autoload_spec.so I, [2024-05-21T19:19:38.341933 #1327066] INFO -- : building spec/ruby/optional/capi/ext/class_spec.so I, [2024-05-21T19:19:38.342539 #1327066] INFO -- : building spec/ruby/optional/capi/ext/class_under_autoload_spec.so I, [2024-05-21T19:19:38.342970 #1327066] INFO -- : building spec/ruby/optional/capi/ext/complex_spec.so I, [2024-05-21T19:19:38.343815 #1327066] INFO -- : building spec/ruby/optional/capi/ext/constants_spec.so I, [2024-05-21T19:19:38.344793 #1327066] INFO -- : building spec/ruby/optional/capi/ext/data_spec.so I, [2024-05-21T19:19:38.345581 #1327066] INFO -- : building spec/ruby/optional/capi/ext/debug_spec.so I, [2024-05-21T19:19:38.346319 #1327066] INFO -- : building spec/ruby/optional/capi/ext/encoding_spec.so I, [2024-05-21T19:19:38.346906 #1327066] INFO -- : building spec/ruby/optional/capi/ext/enumerator_spec.so I, [2024-05-21T19:19:38.347203 #1327066] INFO -- : building spec/ruby/optional/capi/ext/exception_spec.so I, [2024-05-21T19:19:38.347873 #1327066] INFO -- : building spec/ruby/optional/capi/ext/fiber_spec.so I, [2024-05-21T19:19:38.348153 #1327066] INFO -- : building spec/ruby/optional/capi/ext/file_spec.so I, [2024-05-21T19:19:38.349117 #1327066] INFO -- : building spec/ruby/optional/capi/ext/fixnum_spec.so I, [2024-05-21T19:19:38.360205 #1327066] INFO -- : encdb.h unchanged I, [2024-05-21T19:19:38.380188 #1327066] INFO -- : building spec/ruby/optional/capi/ext/float_spec.so I, [2024-05-21T19:19:38.468051 #1327066] INFO -- : building spec/ruby/optional/capi/ext/gc_spec.so I, [2024-05-21T19:19:38.473516 #1327066] INFO -- : building spec/ruby/optional/capi/ext/globals_spec.so I, [2024-05-21T19:19:38.480266 #1327066] INFO -- : building spec/ruby/optional/capi/ext/hash_spec.so I, [2024-05-21T19:19:38.492960 #1327066] INFO -- : building spec/ruby/optional/capi/ext/integer_spec.so I, [2024-05-21T19:19:38.495454 #1327066] INFO -- : building spec/ruby/optional/capi/ext/io_spec.so I, [2024-05-21T19:19:38.504822 #1327066] INFO -- : building spec/ruby/optional/capi/ext/kernel_spec.so I, [2024-05-21T19:19:38.508133 #1327066] INFO -- : building spec/ruby/optional/capi/ext/language_spec.so I, [2024-05-21T19:19:38.513453 #1327066] INFO -- : building spec/ruby/optional/capi/ext/marshal_spec.so I, [2024-05-21T19:19:38.515371 #1327066] INFO -- : building spec/ruby/optional/capi/ext/module_spec.so I, [2024-05-21T19:19:38.531860 #1327066] INFO -- : building spec/ruby/optional/capi/ext/module_under_autoload_spec.so I, [2024-05-21T19:19:38.534464 #1327066] INFO -- : building spec/ruby/optional/capi/ext/mutex_spec.so I, [2024-05-21T19:19:38.539035 #1327066] INFO -- : building spec/ruby/optional/capi/ext/numeric_spec.so I, [2024-05-21T19:19:38.544167 #1327066] INFO -- : building spec/ruby/optional/capi/ext/object_spec.so I, [2024-05-21T19:19:38.551911 #1327066] INFO -- : building spec/ruby/optional/capi/ext/proc_spec.so I, [2024-05-21T19:19:38.568172 #1327066] INFO -- : building spec/ruby/optional/capi/ext/range_spec.so I, [2024-05-21T19:19:38.569267 #1327066] INFO -- : building spec/ruby/optional/capi/ext/rational_spec.so I, [2024-05-21T19:19:38.569683 #1327066] INFO -- : building spec/ruby/optional/capi/ext/rbasic_spec.so I, [2024-05-21T19:19:38.603562 #1327066] INFO -- : building spec/ruby/optional/capi/ext/regexp_spec.so I, [2024-05-21T19:19:38.615898 #1327066] INFO -- : building spec/ruby/optional/capi/ext/string_spec.so I, [2024-05-21T19:19:38.637235 #1327066] INFO -- : building spec/ruby/optional/capi/ext/struct_spec.so I, [2024-05-21T19:19:38.645297 #1327066] INFO -- : building spec/ruby/optional/capi/ext/st_spec.so I, [2024-05-21T19:19:38.651895 #1327066] INFO -- : building spec/ruby/optional/capi/ext/symbol_spec.so I, [2024-05-21T19:19:38.653823 #1327066] INFO -- : building spec/ruby/optional/capi/ext/thread_spec.so I, [2024-05-21T19:19:38.676211 #1327066] INFO -- : building spec/ruby/optional/capi/ext/time_spec.so I, [2024-05-21T19:19:38.682022 #1327066] INFO -- : building spec/ruby/optional/capi/ext/tracepoint_spec.so I, [2024-05-21T19:19:38.696198 #1327066] INFO -- : building spec/ruby/optional/capi/ext/typed_data_spec.so I, [2024-05-21T19:19:38.700401 #1327066] INFO -- : building spec/ruby/optional/capi/ext/util_spec.so I, [2024-05-21T19:19:38.715371 #1327066] INFO -- : making enc I, [2024-05-21T19:19:38.719141 #1327066] INFO -- : making srcs under enc I, [2024-05-21T19:19:38.744481 #1327066] INFO -- : make[1]: Entering directory '/tmp/ruby/build/trunk' I, [2024-05-21T19:19:38.744551 #1327066] INFO -- : make[1]: Nothing to be done for 'enc'. I, [2024-05-21T19:19:38.744562 #1327066] INFO -- : make[1]: Leaving directory '/tmp/ruby/build/trunk' I, [2024-05-21T19:19:38.766514 #1327066] INFO -- : make[1]: Entering directory '/tmp/ruby/build/trunk' I, [2024-05-21T19:19:38.766574 #1327066] INFO -- : make[1]: Nothing to be done for 'srcs'. I, [2024-05-21T19:19:38.766582 #1327066] INFO -- : make[1]: Leaving directory '/tmp/ruby/build/trunk' I, [2024-05-21T19:19:38.767318 #1327066] INFO -- : generating transdb.h I, [2024-05-21T19:19:38.865627 #1327066] INFO -- : transdb.h unchanged I, [2024-05-21T19:19:38.866804 #1327066] INFO -- : generating makefiles ext/configure-ext.mk I, [2024-05-21T19:19:38.866936 #1327066] INFO -- : making trans I, [2024-05-21T19:19:38.893290 #1327066] INFO -- : ext/configure-ext.mk updated I, [2024-05-21T19:19:38.896104 #1327066] INFO -- : make[1]: Entering directory '/tmp/ruby/build/trunk' I, [2024-05-21T19:19:38.900942 #1327066] INFO -- : make[1]: Entering directory '/tmp/ruby/build/trunk' I, [2024-05-21T19:19:38.901030 #1327066] INFO -- : make[1]: Nothing to be done for 'trans'. I, [2024-05-21T19:19:38.901039 #1327066] INFO -- : make[1]: Leaving directory '/tmp/ruby/build/trunk' I, [2024-05-21T19:19:38.979955 #1327066] INFO -- : making encs I, [2024-05-21T19:19:39.042054 #1327066] INFO -- : make[1]: Entering directory '/tmp/ruby/build/trunk' I, [2024-05-21T19:19:39.042115 #1327066] INFO -- : make[1]: Nothing to be done for 'encs'. I, [2024-05-21T19:19:39.042125 #1327066] INFO -- : make[1]: Leaving directory '/tmp/ruby/build/trunk' I, [2024-05-21T19:19:39.050268 #1327066] INFO -- : make[1]: Leaving directory '/tmp/ruby/build/trunk' I, [2024-05-21T19:19:39.050965 #1327066] INFO -- : generating makefile exts.mk I, [2024-05-21T19:19:39.088011 #1327066] INFO -- : exts.mk unchanged I, [2024-05-21T19:19:39.093121 #1327066] INFO -- : make[1]: Entering directory '/tmp/ruby/build/trunk' I, [2024-05-21T19:19:39.112708 #1327066] INFO -- : make[2]: Entering directory '/tmp/ruby/build/trunk/ext/digest' I, [2024-05-21T19:19:39.113641 #1327066] INFO -- : make[2]: Entering directory '/tmp/ruby/build/trunk/ext/json' I, [2024-05-21T19:19:39.114083 #1327066] INFO -- : make[2]: Entering directory '/tmp/ruby/build/trunk/ext/coverage' I, [2024-05-21T19:19:39.114289 #1327066] INFO -- : make[2]: Entering directory '/tmp/ruby/build/trunk/ext/io/console' I, [2024-05-21T19:19:39.115103 #1327066] INFO -- : make[2]: Entering directory '/tmp/ruby/build/trunk/ext/date' I, [2024-05-21T19:19:39.115497 #1327066] INFO -- : make[2]: Entering directory '/tmp/ruby/build/trunk/ext/monitor' I, [2024-05-21T19:19:39.115581 #1327066] INFO -- : make[2]: Entering directory '/tmp/ruby/build/trunk/ext/rubyvm' I, [2024-05-21T19:19:39.116568 #1327066] INFO -- : make[2]: Entering directory '/tmp/ruby/build/trunk/ext/pathname' I, [2024-05-21T19:19:39.116952 #1327066] INFO -- : make[2]: Entering directory '/tmp/ruby/build/trunk/ext/pty' I, [2024-05-21T19:19:39.117002 #1327066] INFO -- : make[2]: Entering directory '/tmp/ruby/build/trunk/ext/fiddle' I, [2024-05-21T19:19:39.117661 #1327066] INFO -- : make[2]: Leaving directory '/tmp/ruby/build/trunk/ext/digest' I, [2024-05-21T19:19:39.117689 #1327066] INFO -- : make[2]: Leaving directory '/tmp/ruby/build/trunk/ext/io/console' I, [2024-05-21T19:19:39.117954 #1327066] INFO -- : make[2]: Leaving directory '/tmp/ruby/build/trunk/ext/coverage' I, [2024-05-21T19:19:39.117984 #1327066] INFO -- : make[2]: Leaving directory '/tmp/ruby/build/trunk/ext/rubyvm' I, [2024-05-21T19:19:39.118479 #1327066] INFO -- : make[2]: Entering directory '/tmp/ruby/build/trunk/ext/psych' I, [2024-05-21T19:19:39.118592 #1327066] INFO -- : make[2]: Entering directory '/tmp/ruby/build/trunk/ext/objspace' I, [2024-05-21T19:19:39.118716 #1327066] INFO -- : make[2]: Leaving directory '/tmp/ruby/build/trunk/ext/monitor' I, [2024-05-21T19:19:39.118752 #1327066] INFO -- : make[2]: Leaving directory '/tmp/ruby/build/trunk/ext/date' I, [2024-05-21T19:19:39.119198 #1327066] INFO -- : make[2]: Leaving directory '/tmp/ruby/build/trunk/ext/pathname' I, [2024-05-21T19:19:39.119491 #1327066] INFO -- : make[2]: Leaving directory '/tmp/ruby/build/trunk/ext/pty' I, [2024-05-21T19:19:39.121219 #1327066] INFO -- : make[2]: Entering directory '/tmp/ruby/build/trunk/.bundle/gems/debug-1.9.2/ext/debug' I, [2024-05-21T19:19:39.121436 #1327066] INFO -- : make[2]: Leaving directory '/tmp/ruby/build/trunk/ext/json' I, [2024-05-21T19:19:39.121723 #1327066] INFO -- : make[2]: Entering directory '/tmp/ruby/build/trunk/ext/ripper' I, [2024-05-21T19:19:39.121879 #1327066] INFO -- : make[2]: Entering directory '/tmp/ruby/build/trunk/.bundle/gems/nkf-0.2.0/ext/nkf' I, [2024-05-21T19:19:39.121911 #1327066] INFO -- : make[2]: Entering directory '/tmp/ruby/build/trunk/.bundle/gems/bigdecimal-3.1.8/ext/bigdecimal' I, [2024-05-21T19:19:39.122007 #1327066] INFO -- : make[2]: Entering directory '/tmp/ruby/build/trunk/.bundle/gems/racc-1.7.3/ext/racc/cparse' I, [2024-05-21T19:19:39.122039 #1327066] INFO -- : make[2]: Entering directory '/tmp/ruby/build/trunk/.bundle/gems/racc-1.8.0/ext/racc/cparse' I, [2024-05-21T19:19:39.122225 #1327066] INFO -- : make[2]: Entering directory '/tmp/ruby/build/trunk/.bundle/gems/syslog-0.1.2/ext/syslog' I, [2024-05-21T19:19:39.122559 #1327066] INFO -- : make[2]: Entering directory '/tmp/ruby/build/trunk/.bundle/gems/rbs-3.4.4/ext/rbs_extension' I, [2024-05-21T19:19:39.122618 #1327066] INFO -- : make[2]: Leaving directory '/tmp/ruby/build/trunk/ext/objspace' I, [2024-05-21T19:19:39.124596 #1327066] INFO -- : make[2]: Leaving directory '/tmp/ruby/build/trunk/ext/fiddle' I, [2024-05-21T19:19:39.126421 #1327066] INFO -- : make[2]: Entering directory '/tmp/ruby/build/trunk/ext/socket' I, [2024-05-21T19:19:39.128149 #1327066] INFO -- : make[2]: Entering directory '/tmp/ruby/build/trunk/ext/openssl' I, [2024-05-21T19:19:39.128310 #1327066] INFO -- : make[2]: Entering directory '/tmp/ruby/build/trunk/ext/digest/sha2' I, [2024-05-21T19:19:39.128613 #1327066] INFO -- : make[2]: Leaving directory '/tmp/ruby/build/trunk/ext/ripper' I, [2024-05-21T19:19:39.129494 #1327066] INFO -- : make[2]: Leaving directory '/tmp/ruby/build/trunk/ext/psych' I, [2024-05-21T19:19:39.130585 #1327066] INFO -- : make[2]: Leaving directory '/tmp/ruby/build/trunk/ext/digest/sha2' I, [2024-05-21T19:19:39.132588 #1327066] INFO -- : make[2]: Leaving directory '/tmp/ruby/build/trunk/ext/socket' I, [2024-05-21T19:19:39.139389 #1327066] INFO -- : make[2]: Leaving directory '/tmp/ruby/build/trunk/ext/openssl' I, [2024-05-21T19:19:39.145406 #1327066] INFO -- : make[2]: Leaving directory '/tmp/ruby/build/trunk/.bundle/gems/debug-1.9.2/ext/debug' I, [2024-05-21T19:19:39.147631 #1327066] INFO -- : make[2]: Leaving directory '/tmp/ruby/build/trunk/.bundle/gems/rbs-3.4.4/ext/rbs_extension' I, [2024-05-21T19:19:39.151528 #1327066] INFO -- : make[2]: Leaving directory '/tmp/ruby/build/trunk/.bundle/gems/nkf-0.2.0/ext/nkf' I, [2024-05-21T19:19:39.153314 #1327066] INFO -- : make[2]: Leaving directory '/tmp/ruby/build/trunk/.bundle/gems/syslog-0.1.2/ext/syslog' I, [2024-05-21T19:19:39.156666 #1327066] INFO -- : make[2]: Leaving directory '/tmp/ruby/build/trunk/.bundle/gems/bigdecimal-3.1.8/ext/bigdecimal' I, [2024-05-21T19:19:39.156732 #1327066] INFO -- : make[2]: Leaving directory '/tmp/ruby/build/trunk/.bundle/gems/racc-1.8.0/ext/racc/cparse' I, [2024-05-21T19:19:39.160001 #1327066] INFO -- : make[2]: Leaving directory '/tmp/ruby/build/trunk/.bundle/gems/racc-1.7.3/ext/racc/cparse' I, [2024-05-21T19:19:39.183752 #1327066] INFO -- : make[2]: Entering directory '/tmp/ruby/build/trunk' I, [2024-05-21T19:19:39.254934 #1327066] INFO -- : linking ruby I, [2024-05-21T19:19:39.281902 #1327066] INFO -- : make[2]: Leaving directory '/tmp/ruby/build/trunk' I, [2024-05-21T19:19:39.282338 #1327066] INFO -- : make[1]: Leaving directory '/tmp/ruby/build/trunk' I, [2024-05-21T19:19:39.287709 #1327066] INFO -- : make[1]: Entering directory '/tmp/ruby/build/trunk' I, [2024-05-21T19:19:39.287760 #1327066] INFO -- : make[1]: Nothing to be done for 'note'. I, [2024-05-21T19:19:39.287771 #1327066] INFO -- : make[1]: Leaving directory '/tmp/ruby/build/trunk' I, [2024-05-21T19:19:39.289155 #1327066] INFO -- : $$$[end] "make all -j20" exit with 0. I, [2024-05-21T19:19:39.289408 #1327066] INFO -- : $$$[beg] make install -j20 I, [2024-05-21T19:19:39.358753 #1327066] INFO -- : Update power_assert to 84e85124c5014a139af39161d484156cfe87a9ed I, [2024-05-21T19:19:39.358962 #1327066] INFO -- : Update rbs to ba7872795d5de04adb8ff500c0e6afdc81a041dd I, [2024-05-21T19:19:39.359589 #1327066] INFO -- : Update typeprof to b19a6416da3a05d57fadd6ffdadb382b6d236ca5 I, [2024-05-21T19:19:39.360520 #1327066] INFO -- : echo 84e85124c5014a139af39161d484156cfe87a9ed | /bin/sh /tmp/ruby/src/trunk/tool/ifchange /tmp/ruby/src/trunk/.bundle/.timestamp/power_assert.revision - I, [2024-05-21T19:19:39.360780 #1327066] INFO -- : echo ba7872795d5de04adb8ff500c0e6afdc81a041dd | /bin/sh /tmp/ruby/src/trunk/tool/ifchange /tmp/ruby/src/trunk/.bundle/.timestamp/rbs.revision - I, [2024-05-21T19:19:39.361667 #1327066] INFO -- : BASERUBY = /usr/bin/ruby --disable=gems I, [2024-05-21T19:19:39.361693 #1327066] INFO -- : CC = gcc I, [2024-05-21T19:19:39.361700 #1327066] INFO -- : LD = ld I, [2024-05-21T19:19:39.361705 #1327066] INFO -- : LDSHARED = gcc -shared I, [2024-05-21T19:19:39.361710 #1327066] INFO -- : CFLAGS = -O3 -fno-fast-math -ggdb3 -Wall -Wextra -Wdeprecated-declarations -Wdiv-by-zero -Wduplicated-cond -Wimplicit-function-declaration -Wimplicit-int -Wpointer-arith -Wwrite-strings -Wold-style-definition -Wimplicit-fallthrough=0 -Wmissing-noreturn -Wno-cast-function-type -Wno-constant-logical-operand -Wno-long-long -Wno-missing-field-initializers -Wno-overlength-strings -Wno-packed-bitfield-compat -Wno-parentheses-equality -Wno-self-assign -Wno-tautological-compare -Wno-unused-parameter -Wno-unused-value -Wsuggest-attribute=format -Wsuggest-attribute=noreturn -Wunused-variable -Wmisleading-indentation -Wundef -fPIC I, [2024-05-21T19:19:39.361715 #1327066] INFO -- : XCFLAGS = -U_FORTIFY_SOURCE -D_FORTIFY_SOURCE=2 -fstack-protector-strong -fno-strict-overflow -fvisibility=hidden -fexcess-precision=standard -DRUBY_EXPORT -I. -I.ext/include/x86_64-linux -I/tmp/ruby/src/trunk/include -I/tmp/ruby/src/trunk -I/tmp/ruby/src/trunk/prism -I/tmp/ruby/src/trunk/enc/unicode/15.0.0 I, [2024-05-21T19:19:39.361720 #1327066] INFO -- : CPPFLAGS = I, [2024-05-21T19:19:39.361724 #1327066] INFO -- : DLDFLAGS = -Wl,--compress-debug-sections=zlib -Wl,-soname,libruby.so.3.4 -fstack-protector-strong I, [2024-05-21T19:19:39.361729 #1327066] INFO -- : SOLIBS = -lz -lrt -lrt -lgmp -ldl -lcrypt -lm -lpthread I, [2024-05-21T19:19:39.361733 #1327066] INFO -- : LANG = en_US.UTF-8 I, [2024-05-21T19:19:39.361737 #1327066] INFO -- : LC_ALL = I, [2024-05-21T19:19:39.361741 #1327066] INFO -- : LC_CTYPE = I, [2024-05-21T19:19:39.361746 #1327066] INFO -- : MFLAGS = -j20 --jobserver-auth=4,5 I, [2024-05-21T19:19:39.361749 #1327066] INFO -- : RUSTC = no I, [2024-05-21T19:19:39.361754 #1327066] INFO -- : YJIT_RUSTC_ARGS = --crate-name=yjit --crate-type=staticlib --edition=2021 -g -C lto=thin -C opt-level=3 -C overflow-checks=on '--out-dir=/tmp/ruby/build/trunk/yjit/target/release/' /tmp/ruby/src/trunk/yjit/src/lib.rs I, [2024-05-21T19:19:39.363124 #1327066] INFO -- : /tmp/ruby/src/trunk/.bundle/.timestamp/rbs.revision unchanged I, [2024-05-21T19:19:39.363151 #1327066] INFO -- : /tmp/ruby/src/trunk/.bundle/.timestamp/power_assert.revision unchanged I, [2024-05-21T19:19:39.391017 #1327066] INFO -- : echo b19a6416da3a05d57fadd6ffdadb382b6d236ca5 | /bin/sh /tmp/ruby/src/trunk/tool/ifchange /tmp/ruby/src/trunk/.bundle/.timestamp/typeprof.revision - I, [2024-05-21T19:19:39.391634 #1327066] INFO -- : generating encdb.h I, [2024-05-21T19:19:39.391698 #1327066] INFO -- : gcc (Ubuntu 11.4.0-1ubuntu1~22.04) 11.4.0 I, [2024-05-21T19:19:39.391707 #1327066] INFO -- : Copyright (C) 2021 Free Software Foundation, Inc. I, [2024-05-21T19:19:39.391720 #1327066] INFO -- : This is free software; see the source for copying conditions. There is NO I, [2024-05-21T19:19:39.391724 #1327066] INFO -- : warranty; not even for MERCHANTABILITY or FITNESS FOR A PARTICULAR PURPOSE. I, [2024-05-21T19:19:39.391729 #1327066] INFO -- : I, [2024-05-21T19:19:39.392471 #1327066] INFO -- : generating enc.mk I, [2024-05-21T19:19:39.393188 #1327066] INFO -- : /tmp/ruby/src/trunk/.bundle/.timestamp/typeprof.revision unchanged I, [2024-05-21T19:19:39.415828 #1327066] INFO -- : encdb.h unchanged I, [2024-05-21T19:19:39.417193 #1327066] INFO -- : Building power_assert@84e85124c5014a139af39161d484156cfe87a9ed to /tmp/ruby/src/trunk/gems/power_assert-2.0.3.gem I, [2024-05-21T19:19:39.486321 #1327066] INFO -- : Successfully built RubyGem I, [2024-05-21T19:19:39.486361 #1327066] INFO -- : Name: power_assert I, [2024-05-21T19:19:39.486368 #1327066] INFO -- : Version: 2.0.4dev I, [2024-05-21T19:19:39.486374 #1327066] INFO -- : File: power_assert-2.0.4dev.gem I, [2024-05-21T19:19:39.488254 #1327066] INFO -- : Extracting bundle gem power_assert-2.0.3... I, [2024-05-21T19:19:39.514186 #1327066] INFO -- : making srcs under enc I, [2024-05-21T19:19:39.514437 #1327066] INFO -- : making enc I, [2024-05-21T19:19:39.531777 #1327066] INFO -- : make[1]: Entering directory '/tmp/ruby/build/trunk' I, [2024-05-21T19:19:39.531800 #1327066] INFO -- : make[1]: Nothing to be done for 'enc'. I, [2024-05-21T19:19:39.531805 #1327066] INFO -- : make[1]: Leaving directory '/tmp/ruby/build/trunk' I, [2024-05-21T19:19:39.544939 #1327066] INFO -- : make[1]: Entering directory '/tmp/ruby/build/trunk' I, [2024-05-21T19:19:39.544964 #1327066] INFO -- : make[1]: Nothing to be done for 'srcs'. I, [2024-05-21T19:19:39.544971 #1327066] INFO -- : make[1]: Leaving directory '/tmp/ruby/build/trunk' I, [2024-05-21T19:19:39.545628 #1327066] INFO -- : generating transdb.h I, [2024-05-21T19:19:39.550096 #1327066] INFO -- : Try with hash version of bundled gems instead of gems/power_assert-2.0.3.gem. We don't use this gem with release version of Ruby. I, [2024-05-21T19:19:39.555077 #1327066] INFO -- : Unpacked gems/power_assert-2.0.4dev.gem I, [2024-05-21T19:19:39.642910 #1327066] INFO -- : transdb.h unchanged I, [2024-05-21T19:19:39.644571 #1327066] INFO -- : generating makefiles ext/configure-ext.mk I, [2024-05-21T19:19:39.644805 #1327066] INFO -- : making trans I, [2024-05-21T19:19:39.671807 #1327066] INFO -- : ext/configure-ext.mk unchanged I, [2024-05-21T19:19:39.674058 #1327066] INFO -- : make[1]: Entering directory '/tmp/ruby/build/trunk' I, [2024-05-21T19:19:39.680722 #1327066] INFO -- : make[1]: Entering directory '/tmp/ruby/build/trunk' I, [2024-05-21T19:19:39.680824 #1327066] INFO -- : make[1]: Nothing to be done for 'trans'. I, [2024-05-21T19:19:39.680854 #1327066] INFO -- : make[1]: Leaving directory '/tmp/ruby/build/trunk' I, [2024-05-21T19:19:39.681884 #1327066] INFO -- : making encs I, [2024-05-21T19:19:39.740155 #1327066] INFO -- : make[1]: Entering directory '/tmp/ruby/build/trunk' I, [2024-05-21T19:19:39.740229 #1327066] INFO -- : make[1]: Nothing to be done for 'encs'. I, [2024-05-21T19:19:39.740254 #1327066] INFO -- : make[1]: Leaving directory '/tmp/ruby/build/trunk' I, [2024-05-21T19:19:39.827888 #1327066] INFO -- : make[1]: Leaving directory '/tmp/ruby/build/trunk' I, [2024-05-21T19:19:39.828595 #1327066] INFO -- : generating makefile exts.mk I, [2024-05-21T19:19:39.865676 #1327066] INFO -- : exts.mk unchanged I, [2024-05-21T19:19:39.870359 #1327066] INFO -- : make[1]: Entering directory '/tmp/ruby/build/trunk' I, [2024-05-21T19:19:39.889367 #1327066] INFO -- : make[2]: Entering directory '/tmp/ruby/build/trunk/ext/digest' I, [2024-05-21T19:19:39.890240 #1327066] INFO -- : make[2]: Entering directory '/tmp/ruby/build/trunk/ext/json' I, [2024-05-21T19:19:39.890804 #1327066] INFO -- : make[2]: Entering directory '/tmp/ruby/build/trunk/ext/coverage' I, [2024-05-21T19:19:39.890840 #1327066] INFO -- : make[2]: Entering directory '/tmp/ruby/build/trunk/ext/io/console' I, [2024-05-21T19:19:39.891713 #1327066] INFO -- : make[2]: Entering directory '/tmp/ruby/build/trunk/ext/date' I, [2024-05-21T19:19:39.892436 #1327066] INFO -- : make[2]: Entering directory '/tmp/ruby/build/trunk/ext/monitor' I, [2024-05-21T19:19:39.893169 #1327066] INFO -- : make[2]: Leaving directory '/tmp/ruby/build/trunk/ext/io/console' I, [2024-05-21T19:19:39.893480 #1327066] INFO -- : make[2]: Entering directory '/tmp/ruby/build/trunk/ext/fiddle' I, [2024-05-21T19:19:39.893682 #1327066] INFO -- : make[2]: Entering directory '/tmp/ruby/build/trunk/ext/pathname' I, [2024-05-21T19:19:39.893963 #1327066] INFO -- : make[2]: Leaving directory '/tmp/ruby/build/trunk/ext/coverage' I, [2024-05-21T19:19:39.894189 #1327066] INFO -- : make[2]: Entering directory '/tmp/ruby/build/trunk/ext/rubyvm' I, [2024-05-21T19:19:39.894222 #1327066] INFO -- : make[2]: Leaving directory '/tmp/ruby/build/trunk/ext/digest' I, [2024-05-21T19:19:39.894574 #1327066] INFO -- : make[2]: Entering directory '/tmp/ruby/build/trunk/ext/pty' I, [2024-05-21T19:19:39.894994 #1327066] INFO -- : make[2]: Leaving directory '/tmp/ruby/build/trunk/ext/monitor' I, [2024-05-21T19:19:39.895101 #1327066] INFO -- : make[2]: Leaving directory '/tmp/ruby/build/trunk/ext/date' I, [2024-05-21T19:19:39.895304 #1327066] INFO -- : make[2]: Entering directory '/tmp/ruby/build/trunk/ext/objspace' I, [2024-05-21T19:19:39.895347 #1327066] INFO -- : make[2]: Leaving directory '/tmp/ruby/build/trunk/ext/json' I, [2024-05-21T19:19:39.896032 #1327066] INFO -- : make[2]: Entering directory '/tmp/ruby/build/trunk/.bundle/gems/bigdecimal-3.1.8/ext/bigdecimal' I, [2024-05-21T19:19:39.896130 #1327066] INFO -- : make[2]: Entering directory '/tmp/ruby/build/trunk/ext/psych' I, [2024-05-21T19:19:39.896155 #1327066] INFO -- : make[2]: Leaving directory '/tmp/ruby/build/trunk/ext/rubyvm' I, [2024-05-21T19:19:39.896286 #1327066] INFO -- : make[2]: Leaving directory '/tmp/ruby/build/trunk/ext/pathname' I, [2024-05-21T19:19:39.896850 #1327066] INFO -- : make[2]: Entering directory '/tmp/ruby/build/trunk/.bundle/gems/debug-1.9.2/ext/debug' I, [2024-05-21T19:19:39.897577 #1327066] INFO -- : make[2]: Entering directory '/tmp/ruby/build/trunk/.bundle/gems/racc-1.8.0/ext/racc/cparse' I, [2024-05-21T19:19:39.897623 #1327066] INFO -- : make[2]: Entering directory '/tmp/ruby/build/trunk/.bundle/gems/racc-1.7.3/ext/racc/cparse' I, [2024-05-21T19:19:39.897700 #1327066] INFO -- : make[2]: Leaving directory '/tmp/ruby/build/trunk/ext/pty' I, [2024-05-21T19:19:39.897745 #1327066] INFO -- : make[2]: Entering directory '/tmp/ruby/build/trunk/.bundle/gems/nkf-0.2.0/ext/nkf' I, [2024-05-21T19:19:39.899521 #1327066] INFO -- : make[2]: Entering directory '/tmp/ruby/build/trunk/ext/ripper' I, [2024-05-21T19:19:39.899572 #1327066] INFO -- : make[2]: Leaving directory '/tmp/ruby/build/trunk/ext/objspace' I, [2024-05-21T19:19:39.900062 #1327066] INFO -- : make[2]: Entering directory '/tmp/ruby/build/trunk/.bundle/gems/syslog-0.1.2/ext/syslog' I, [2024-05-21T19:19:39.900470 #1327066] INFO -- : make[2]: Entering directory '/tmp/ruby/build/trunk/.bundle/gems/rbs-3.4.4/ext/rbs_extension' I, [2024-05-21T19:19:39.901250 #1327066] INFO -- : make[2]: Leaving directory '/tmp/ruby/build/trunk/ext/fiddle' I, [2024-05-21T19:19:39.903789 #1327066] INFO -- : make[2]: Entering directory '/tmp/ruby/build/trunk/ext/digest/sha2' I, [2024-05-21T19:19:39.904866 #1327066] INFO -- : make[2]: Leaving directory '/tmp/ruby/build/trunk/ext/ripper' I, [2024-05-21T19:19:39.905221 #1327066] INFO -- : make[2]: Entering directory '/tmp/ruby/build/trunk/ext/socket' I, [2024-05-21T19:19:39.907017 #1327066] INFO -- : make[2]: Leaving directory '/tmp/ruby/build/trunk/ext/digest/sha2' I, [2024-05-21T19:19:39.907676 #1327066] INFO -- : make[2]: Entering directory '/tmp/ruby/build/trunk/ext/openssl' I, [2024-05-21T19:19:39.908872 #1327066] INFO -- : make[2]: Leaving directory '/tmp/ruby/build/trunk/ext/psych' I, [2024-05-21T19:19:39.911115 #1327066] INFO -- : make[2]: Leaving directory '/tmp/ruby/build/trunk/ext/socket' I, [2024-05-21T19:19:39.919584 #1327066] INFO -- : make[2]: Leaving directory '/tmp/ruby/build/trunk/.bundle/gems/bigdecimal-3.1.8/ext/bigdecimal' I, [2024-05-21T19:19:39.922160 #1327066] INFO -- : make[2]: Leaving directory '/tmp/ruby/build/trunk/.bundle/gems/nkf-0.2.0/ext/nkf' I, [2024-05-21T19:19:39.922208 #1327066] INFO -- : make[2]: Leaving directory '/tmp/ruby/build/trunk/.bundle/gems/racc-1.8.0/ext/racc/cparse' I, [2024-05-21T19:19:39.922427 #1327066] INFO -- : make[2]: Leaving directory '/tmp/ruby/build/trunk/ext/openssl' I, [2024-05-21T19:19:39.923171 #1327066] INFO -- : make[2]: Leaving directory '/tmp/ruby/build/trunk/.bundle/gems/syslog-0.1.2/ext/syslog' I, [2024-05-21T19:19:39.923451 #1327066] INFO -- : make[2]: Leaving directory '/tmp/ruby/build/trunk/.bundle/gems/rbs-3.4.4/ext/rbs_extension' I, [2024-05-21T19:19:39.928306 #1327066] INFO -- : make[2]: Leaving directory '/tmp/ruby/build/trunk/.bundle/gems/racc-1.7.3/ext/racc/cparse' I, [2024-05-21T19:19:39.929629 #1327066] INFO -- : make[2]: Leaving directory '/tmp/ruby/build/trunk/.bundle/gems/debug-1.9.2/ext/debug' I, [2024-05-21T19:19:39.953953 #1327066] INFO -- : make[2]: Entering directory '/tmp/ruby/build/trunk' I, [2024-05-21T19:19:40.021481 #1327066] INFO -- : make[2]: 'ruby' is up to date. I, [2024-05-21T19:19:40.021548 #1327066] INFO -- : make[2]: Leaving directory '/tmp/ruby/build/trunk' I, [2024-05-21T19:19:40.021943 #1327066] INFO -- : make[1]: Leaving directory '/tmp/ruby/build/trunk' I, [2024-05-21T19:19:40.025921 #1327066] INFO -- : make[1]: Entering directory '/tmp/ruby/build/trunk' I, [2024-05-21T19:19:40.025973 #1327066] INFO -- : make[1]: Nothing to be done for 'note'. I, [2024-05-21T19:19:40.025992 #1327066] INFO -- : make[1]: Leaving directory '/tmp/ruby/build/trunk' I, [2024-05-21T19:19:40.026133 #1327066] INFO -- : ./miniruby -I/tmp/ruby/src/trunk/lib -I. -I.ext/common /tmp/ruby/src/trunk/tool/runruby.rb --extout=.ext -- --disable-gems -r./x86_64-linux-fake /tmp/ruby/src/trunk/tool/rbinstall.rb --make="make" --dest-dir="" --extout=".ext" --ext-build-dir="./ext" --mflags="-j20 --jobserver-auth=4,5" --make-flags=" -j20 --jobserver-auth=4,5" --data-mode=0644 --prog-mode=0755 --installed-list .installed.list --mantype="doc" --gnumake --install=all --exclude=doc I, [2024-05-21T19:19:40.122513 #1327066] INFO -- : Installing to I, [2024-05-21T19:19:40.122592 #1327066] INFO -- : installing binary commands: /tmp/ruby/install/trunk/bin I, [2024-05-21T19:19:40.122607 #1327066] INFO -- : installing base libraries: /tmp/ruby/install/trunk/lib I, [2024-05-21T19:19:40.129547 #1327066] INFO -- : installing arch files: /tmp/ruby/install/trunk/lib/ruby/3.4.0+0/x86_64-linux I, [2024-05-21T19:19:40.129617 #1327066] INFO -- : installing pkgconfig data: /tmp/ruby/install/trunk/lib/pkgconfig I, [2024-05-21T19:19:40.129631 #1327066] INFO -- : installing extension objects: /tmp/ruby/install/trunk/lib/ruby/3.4.0+0/x86_64-linux I, [2024-05-21T19:19:40.139335 #1327066] INFO -- : installing extension objects: /tmp/ruby/install/trunk/lib/ruby/site_ruby/3.4.0+0/x86_64-linux I, [2024-05-21T19:19:40.139397 #1327066] INFO -- : installing extension objects: /tmp/ruby/install/trunk/lib/ruby/vendor_ruby/3.4.0+0/x86_64-linux I, [2024-05-21T19:19:40.139412 #1327066] INFO -- : installing extension headers: /tmp/ruby/install/trunk/include/ruby-3.4.0+0/x86_64-linux I, [2024-05-21T19:19:40.139500 #1327066] INFO -- : installing extension scripts: /tmp/ruby/install/trunk/lib/ruby/3.4.0+0 I, [2024-05-21T19:19:40.142295 #1327066] INFO -- : installing extension scripts: /tmp/ruby/install/trunk/lib/ruby/site_ruby/3.4.0+0 I, [2024-05-21T19:19:40.142354 #1327066] INFO -- : installing extension scripts: /tmp/ruby/install/trunk/lib/ruby/vendor_ruby/3.4.0+0 I, [2024-05-21T19:19:40.142368 #1327066] INFO -- : installing extension headers: /tmp/ruby/install/trunk/include/ruby-3.4.0+0/ruby I, [2024-05-21T19:19:40.142380 #1327066] INFO -- : installing command scripts: /tmp/ruby/install/trunk/bin I, [2024-05-21T19:19:40.142402 #1327066] INFO -- : installing library scripts: /tmp/ruby/install/trunk/lib/ruby/3.4.0+0 I, [2024-05-21T19:19:40.175271 #1327066] INFO -- : installing common headers: /tmp/ruby/install/trunk/include/ruby-3.4.0+0 I, [2024-05-21T19:19:40.181819 #1327066] INFO -- : installing manpages: /tmp/ruby/install/trunk/share/man/man1 I, [2024-05-21T19:19:40.181898 #1327066] INFO -- : installing default gems from lib: /tmp/ruby/install/trunk/lib/ruby/gems/3.4.0+0 I, [2024-05-21T19:19:40.204967 #1327066] INFO -- : benchmark 0.3.0 I, [2024-05-21T19:19:40.206882 #1327066] INFO -- : bundler 2.6.0.dev I, [2024-05-21T19:19:40.209033 #1327066] INFO -- : cgi 0.4.1 I, [2024-05-21T19:19:40.209590 #1327066] INFO -- : delegate 0.3.1 I, [2024-05-21T19:19:40.210045 #1327066] INFO -- : did_you_mean 1.6.3 I, [2024-05-21T19:19:40.210546 #1327066] INFO -- : english 0.8.0 I, [2024-05-21T19:19:40.210991 #1327066] INFO -- : erb 4.0.4 I, [2024-05-21T19:19:40.212047 #1327066] INFO -- : error_highlight 0.6.0 I, [2024-05-21T19:19:40.212738 #1327066] INFO -- : fileutils 1.7.2 I, [2024-05-21T19:19:40.213503 #1327066] INFO -- : find 0.2.0 I, [2024-05-21T19:19:40.214493 #1327066] INFO -- : forwardable 1.3.3 I, [2024-05-21T19:19:40.215528 #1327066] INFO -- : ipaddr 1.2.6 I, [2024-05-21T19:19:40.216138 #1327066] INFO -- : irb 1.13.1 I, [2024-05-21T19:19:40.216911 #1327066] INFO -- : logger 1.6.0 I, [2024-05-21T19:19:40.217383 #1327066] INFO -- : net-http 0.4.1 I, [2024-05-21T19:19:40.217894 #1327066] INFO -- : net-protocol 0.2.2 I, [2024-05-21T19:19:40.218380 #1327066] INFO -- : open-uri 0.4.1 I, [2024-05-21T19:19:40.218866 #1327066] INFO -- : open3 0.2.1 I, [2024-05-21T19:19:40.219321 #1327066] INFO -- : optparse 0.5.0 I, [2024-05-21T19:19:40.219736 #1327066] INFO -- : ostruct 0.6.0 I, [2024-05-21T19:19:40.220199 #1327066] INFO -- : pp 0.5.0 I, [2024-05-21T19:19:40.220764 #1327066] INFO -- : prettyprint 0.2.0 I, [2024-05-21T19:19:40.221156 #1327066] INFO -- : prism 0.29.0 I, [2024-05-21T19:19:40.221711 #1327066] INFO -- : pstore 0.1.3 I, [2024-05-21T19:19:40.222182 #1327066] INFO -- : rdoc 6.6.3.1 I, [2024-05-21T19:19:40.223151 #1327066] INFO -- : readline 0.0.4 I, [2024-05-21T19:19:40.223681 #1327066] INFO -- : reline 0.5.7 I, [2024-05-21T19:19:40.224244 #1327066] INFO -- : resolv 0.4.0 I, [2024-05-21T19:19:40.224667 #1327066] INFO -- : ruby2_keywords 0.0.5 I, [2024-05-21T19:19:40.225166 #1327066] INFO -- : securerandom 0.3.1 I, [2024-05-21T19:19:40.226230 #1327066] INFO -- : set 1.1.0 I, [2024-05-21T19:19:40.226976 #1327066] INFO -- : shellwords 0.2.0 I, [2024-05-21T19:19:40.227457 #1327066] INFO -- : singleton 0.2.0 I, [2024-05-21T19:19:40.227863 #1327066] INFO -- : syntax_suggest 2.0.0 I, [2024-05-21T19:19:40.228603 #1327066] INFO -- : tempfile 0.2.1 I, [2024-05-21T19:19:40.229043 #1327066] INFO -- : time 0.3.0 I, [2024-05-21T19:19:40.229581 #1327066] INFO -- : timeout 0.4.1 I, [2024-05-21T19:19:40.230057 #1327066] INFO -- : tmpdir 0.2.0 I, [2024-05-21T19:19:40.230540 #1327066] INFO -- : tsort 0.2.0 I, [2024-05-21T19:19:40.231001 #1327066] INFO -- : un 0.3.0 I, [2024-05-21T19:19:40.231462 #1327066] INFO -- : uri 0.13.0 I, [2024-05-21T19:19:40.231983 #1327066] INFO -- : weakref 0.1.3 I, [2024-05-21T19:19:40.232510 #1327066] INFO -- : yaml 0.3.0 I, [2024-05-21T19:19:40.232850 #1327066] INFO -- : installing default gems from ext: /tmp/ruby/install/trunk/lib/ruby/gems/3.4.0+0 I, [2024-05-21T19:19:40.239444 #1327066] INFO -- : date 3.3.4 I, [2024-05-21T19:19:40.240073 #1327066] INFO -- : digest 3.1.1 I, [2024-05-21T19:19:40.240577 #1327066] INFO -- : etc 1.4.3 I, [2024-05-21T19:19:40.241082 #1327066] INFO -- : fcntl 1.1.0 I, [2024-05-21T19:19:40.241551 #1327066] INFO -- : fiddle 1.1.3 I, [2024-05-21T19:19:40.242029 #1327066] INFO -- : io-console 0.7.2 I, [2024-05-21T19:19:40.242513 #1327066] INFO -- : io-nonblock 0.3.0 I, [2024-05-21T19:19:40.242961 #1327066] INFO -- : io-wait 0.3.1 I, [2024-05-21T19:19:40.243410 #1327066] INFO -- : json 2.7.2 I, [2024-05-21T19:19:40.243957 #1327066] INFO -- : openssl 3.2.0 I, [2024-05-21T19:19:40.244443 #1327066] INFO -- : pathname 0.3.0 I, [2024-05-21T19:19:40.244970 #1327066] INFO -- : psych 5.1.2 I, [2024-05-21T19:19:40.245525 #1327066] INFO -- : stringio 3.1.1 I, [2024-05-21T19:19:40.246034 #1327066] INFO -- : strscan 3.1.1 I, [2024-05-21T19:19:40.246501 #1327066] INFO -- : zlib 3.1.0 I, [2024-05-21T19:19:40.246853 #1327066] INFO -- : installing bundled gems: /tmp/ruby/install/trunk/lib/ruby/gems/3.4.0+0 I, [2024-05-21T19:19:40.247381 #1327066] INFO -- : minitest 5.23.0 I, [2024-05-21T19:19:40.255937 #1327066] INFO -- : rake 13.2.1 I, [2024-05-21T19:19:40.259407 #1327066] INFO -- : test-unit 3.6.2 I, [2024-05-21T19:19:40.264291 #1327066] INFO -- : rexml 3.2.8 I, [2024-05-21T19:19:40.268064 #1327066] INFO -- : rss 0.3.0 I, [2024-05-21T19:19:40.270673 #1327066] INFO -- : net-ftp 0.3.4 I, [2024-05-21T19:19:40.272354 #1327066] INFO -- : net-imap 0.4.11 I, [2024-05-21T19:19:40.276071 #1327066] INFO -- : net-pop 0.1.2 I, [2024-05-21T19:19:40.277092 #1327066] INFO -- : net-smtp 0.5.0 I, [2024-05-21T19:19:40.278224 #1327066] INFO -- : matrix 0.4.2 I, [2024-05-21T19:19:40.281725 #1327066] INFO -- : prime 0.1.2 I, [2024-05-21T19:19:40.286463 #1327066] INFO -- : rbs 3.4.4 I, [2024-05-21T19:19:40.308770 #1327066] INFO -- : typeprof 0.21.11 I, [2024-05-21T19:19:40.311102 #1327066] INFO -- : debug 1.9.2 I, [2024-05-21T19:19:40.314556 #1327066] INFO -- : racc 1.8.0 I, [2024-05-21T19:19:40.317425 #1327066] INFO -- : mutex_m 0.2.0 I, [2024-05-21T19:19:40.318747 #1327066] INFO -- : getoptlong 0.2.1 I, [2024-05-21T19:19:40.320340 #1327066] INFO -- : base64 0.2.0 I, [2024-05-21T19:19:40.321457 #1327066] INFO -- : bigdecimal 3.1.8 I, [2024-05-21T19:19:40.323547 #1327066] INFO -- : observer 0.1.2 I, [2024-05-21T19:19:40.325162 #1327066] INFO -- : abbrev 0.1.2 I, [2024-05-21T19:19:40.326250 #1327066] INFO -- : resolv-replace 0.1.1 I, [2024-05-21T19:19:40.327748 #1327066] INFO -- : rinda 0.2.0 I, [2024-05-21T19:19:40.329215 #1327066] INFO -- : drb 2.2.1 I, [2024-05-21T19:19:40.330783 #1327066] INFO -- : nkf 0.2.0 I, [2024-05-21T19:19:40.333244 #1327066] INFO -- : syslog 0.1.2 I, [2024-05-21T19:19:40.335411 #1327066] INFO -- : csv 3.3.0 I, [2024-05-21T19:19:40.337712 #1327066] INFO -- : installing bundled gem cache: /tmp/ruby/install/trunk/lib/ruby/gems/3.4.0+0/cache I, [2024-05-21T19:19:40.339334 #1327066] INFO -- : skipped bundled gems: I, [2024-05-21T19:19:40.339361 #1327066] INFO -- : power_assert-2.0.4dev.gem not found in bundled_gems I, [2024-05-21T19:19:40.342454 #1327066] INFO -- : $$$[end] "make install -j20" exit with 0. I, [2024-05-21T19:19:40.342570 #1327066] INFO -- : $$$[beg] make yes-btest TESTOPTS='-q -j20' I, [2024-05-21T19:19:45.621620 #1327066] INFO -- : PASS all 1936 tests E, [2024-05-21T19:19:45.627341 #1327066] ERROR -- : I, [2024-05-21T19:19:45.627538 #1327066] INFO -- : $$$[end] "make yes-btest TESTOPTS='-q -j20'" exit with 0. I, [2024-05-21T19:19:45.627626 #1327066] INFO -- : $$$[beg] make yes-test-basic TESTS='-j20' I, [2024-05-21T19:19:45.687617 #1327066] INFO -- : BASERUBY = /usr/bin/ruby --disable=gems I, [2024-05-21T19:19:45.687658 #1327066] INFO -- : CC = gcc I, [2024-05-21T19:19:45.687666 #1327066] INFO -- : LD = ld I, [2024-05-21T19:19:45.687672 #1327066] INFO -- : LDSHARED = gcc -shared I, [2024-05-21T19:19:45.687678 #1327066] INFO -- : CFLAGS = -O3 -fno-fast-math -ggdb3 -Wall -Wextra -Wdeprecated-declarations -Wdiv-by-zero -Wduplicated-cond -Wimplicit-function-declaration -Wimplicit-int -Wpointer-arith -Wwrite-strings -Wold-style-definition -Wimplicit-fallthrough=0 -Wmissing-noreturn -Wno-cast-function-type -Wno-constant-logical-operand -Wno-long-long -Wno-missing-field-initializers -Wno-overlength-strings -Wno-packed-bitfield-compat -Wno-parentheses-equality -Wno-self-assign -Wno-tautological-compare -Wno-unused-parameter -Wno-unused-value -Wsuggest-attribute=format -Wsuggest-attribute=noreturn -Wunused-variable -Wmisleading-indentation -Wundef -fPIC I, [2024-05-21T19:19:45.687704 #1327066] INFO -- : XCFLAGS = -U_FORTIFY_SOURCE -D_FORTIFY_SOURCE=2 -fstack-protector-strong -fno-strict-overflow -fvisibility=hidden -fexcess-precision=standard -DRUBY_EXPORT -I. -I.ext/include/x86_64-linux -I/tmp/ruby/src/trunk/include -I/tmp/ruby/src/trunk -I/tmp/ruby/src/trunk/prism -I/tmp/ruby/src/trunk/enc/unicode/15.0.0 I, [2024-05-21T19:19:45.687715 #1327066] INFO -- : CPPFLAGS = I, [2024-05-21T19:19:45.687721 #1327066] INFO -- : DLDFLAGS = -Wl,--compress-debug-sections=zlib -Wl,-soname,libruby.so.3.4 -fstack-protector-strong I, [2024-05-21T19:19:45.687727 #1327066] INFO -- : SOLIBS = -lz -lrt -lrt -lgmp -ldl -lcrypt -lm -lpthread I, [2024-05-21T19:19:45.687732 #1327066] INFO -- : LANG = en_US.UTF-8 I, [2024-05-21T19:19:45.687737 #1327066] INFO -- : LC_ALL = I, [2024-05-21T19:19:45.687743 #1327066] INFO -- : LC_CTYPE = I, [2024-05-21T19:19:45.687748 #1327066] INFO -- : MFLAGS = I, [2024-05-21T19:19:45.687761 #1327066] INFO -- : RUSTC = no I, [2024-05-21T19:19:45.687767 #1327066] INFO -- : YJIT_RUSTC_ARGS = --crate-name=yjit --crate-type=staticlib --edition=2021 -g -C lto=thin -C opt-level=3 -C overflow-checks=on '--out-dir=/tmp/ruby/build/trunk/yjit/target/release/' /tmp/ruby/src/trunk/yjit/src/lib.rs I, [2024-05-21T19:19:45.688558 #1327066] INFO -- : gcc (Ubuntu 11.4.0-1ubuntu1~22.04) 11.4.0 I, [2024-05-21T19:19:45.688591 #1327066] INFO -- : Copyright (C) 2021 Free Software Foundation, Inc. I, [2024-05-21T19:19:45.688600 #1327066] INFO -- : This is free software; see the source for copying conditions. There is NO I, [2024-05-21T19:19:45.688607 #1327066] INFO -- : warranty; not even for MERCHANTABILITY or FITNESS FOR A PARTICULAR PURPOSE. I, [2024-05-21T19:19:45.688613 #1327066] INFO -- : I, [2024-05-21T19:19:45.798361 #1327066] INFO -- : Checking leaked global symbols...none I, [2024-05-21T19:19:45.842202 #1327066] INFO -- : /tmp/ruby/src/trunk/basictest/test.rb:assignment ....................................................................................................................................................................................................................................................................................................................................................................................OK 372 I, [2024-05-21T19:19:45.842257 #1327066] INFO -- : /tmp/ruby/src/trunk/basictest/test.rb:condition ..OK 2 I, [2024-05-21T19:19:45.842264 #1327066] INFO -- : /tmp/ruby/src/trunk/basictest/test.rb:if/unless ...OK 3 I, [2024-05-21T19:19:45.842268 #1327066] INFO -- : /tmp/ruby/src/trunk/basictest/test.rb:case .....OK 5 I, [2024-05-21T19:19:45.842484 #1327066] INFO -- : /tmp/ruby/src/trunk/basictest/test.rb:while/until ........OK 8 I, [2024-05-21T19:19:45.842542 #1327066] INFO -- : /tmp/ruby/src/trunk/basictest/test.rb:exception ..........OK 10 I, [2024-05-21T19:19:45.842812 #1327066] INFO -- : /tmp/ruby/src/trunk/basictest/test.rb:array .......................................OK 39 I, [2024-05-21T19:19:45.842911 #1327066] INFO -- : /tmp/ruby/src/trunk/basictest/test.rb:hash ...........................OK 27 I, [2024-05-21T19:19:45.843634 #1327066] INFO -- : /tmp/ruby/src/trunk/basictest/test.rb:iterator ...........................................................................................................OK 107 I, [2024-05-21T19:19:45.843918 #1327066] INFO -- : /tmp/ruby/src/trunk/basictest/test.rb:float ................................................................................OK 80 I, [2024-05-21T19:19:45.845815 #1327066] INFO -- : /tmp/ruby/src/trunk/basictest/test.rb:bignum ...............................OK 31 I, [2024-05-21T19:19:45.846590 #1327066] INFO -- : /tmp/ruby/src/trunk/basictest/test.rb:string & char ..............................................................OK 62 I, [2024-05-21T19:19:45.846625 #1327066] INFO -- : /tmp/ruby/src/trunk/basictest/test.rb:assignment ..........OK 10 I, [2024-05-21T19:19:45.846651 #1327066] INFO -- : /tmp/ruby/src/trunk/basictest/test.rb:call ......OK 6 I, [2024-05-21T19:19:45.846703 #1327066] INFO -- : /tmp/ruby/src/trunk/basictest/test.rb:proc .........OK 9 I, [2024-05-21T19:19:45.947393 #1327066] INFO -- : /tmp/ruby/src/trunk/basictest/test.rb:signal ..OK 2 I, [2024-05-21T19:19:45.949978 #1327066] INFO -- : /tmp/ruby/src/trunk/basictest/test.rb:eval ...........................OK 27 I, [2024-05-21T19:19:46.066973 #1327066] INFO -- : /tmp/ruby/src/trunk/basictest/test.rb:system ........OK 8 I, [2024-05-21T19:19:46.067060 #1327066] INFO -- : /tmp/ruby/src/trunk/basictest/test.rb:const .....OK 5 I, [2024-05-21T19:19:46.067078 #1327066] INFO -- : /tmp/ruby/src/trunk/basictest/test.rb:clone .....OK 5 I, [2024-05-21T19:19:46.067093 #1327066] INFO -- : /tmp/ruby/src/trunk/basictest/test.rb:marshal ....OK 4 I, [2024-05-21T19:19:46.067214 #1327066] INFO -- : /tmp/ruby/src/trunk/basictest/test.rb:pack ....OK 4 I, [2024-05-21T19:19:46.067240 #1327066] INFO -- : /tmp/ruby/src/trunk/basictest/test.rb:math ..OK 2 I, [2024-05-21T19:19:46.067267 #1327066] INFO -- : /tmp/ruby/src/trunk/basictest/test.rb:struct ......OK 6 I, [2024-05-21T19:19:46.067359 #1327066] INFO -- : /tmp/ruby/src/trunk/basictest/test.rb:variable ............OK 12 I, [2024-05-21T19:19:46.067385 #1327066] INFO -- : /tmp/ruby/src/trunk/basictest/test.rb:trace ...OK 3 I, [2024-05-21T19:19:46.067401 #1327066] INFO -- : /tmp/ruby/src/trunk/basictest/test.rb:defined? ............OK 12 I, [2024-05-21T19:19:46.067424 #1327066] INFO -- : /tmp/ruby/src/trunk/basictest/test.rb:alias ......OK 6 I, [2024-05-21T19:19:46.067803 #1327066] INFO -- : /tmp/ruby/src/trunk/basictest/test.rb:path .......................OK 23 I, [2024-05-21T19:19:46.101094 #1327066] INFO -- : /tmp/ruby/src/trunk/basictest/test.rb:gc ....OK 4 I, [2024-05-21T19:19:46.103535 #1327066] INFO -- : I, [2024-05-21T19:19:46.103558 #1327066] INFO -- : test succeeded I, [2024-05-21T19:19:46.104941 #1327066] INFO -- : $$$[end] "make yes-test-basic TESTS='-j20'" exit with 0. I, [2024-05-21T19:19:46.105028 #1327066] INFO -- : $$$[beg] make yes-test-all TESTOPTS='--stderr-on-failure' TESTS='-j20' I, [2024-05-21T19:19:46.197060 #1327066] INFO -- : BASERUBY = /usr/bin/ruby --disable=gems I, [2024-05-21T19:19:46.197123 #1327066] INFO -- : CC = gcc I, [2024-05-21T19:19:46.197139 #1327066] INFO -- : LD = ld I, [2024-05-21T19:19:46.197154 #1327066] INFO -- : LDSHARED = gcc -shared I, [2024-05-21T19:19:46.197169 #1327066] INFO -- : CFLAGS = -O3 -fno-fast-math -ggdb3 -Wall -Wextra -Wdeprecated-declarations -Wdiv-by-zero -Wduplicated-cond -Wimplicit-function-declaration -Wimplicit-int -Wpointer-arith -Wwrite-strings -Wold-style-definition -Wimplicit-fallthrough=0 -Wmissing-noreturn -Wno-cast-function-type -Wno-constant-logical-operand -Wno-long-long -Wno-missing-field-initializers -Wno-overlength-strings -Wno-packed-bitfield-compat -Wno-parentheses-equality -Wno-self-assign -Wno-tautological-compare -Wno-unused-parameter -Wno-unused-value -Wsuggest-attribute=format -Wsuggest-attribute=noreturn -Wunused-variable -Wmisleading-indentation -Wundef -fPIC I, [2024-05-21T19:19:46.197183 #1327066] INFO -- : XCFLAGS = -U_FORTIFY_SOURCE -D_FORTIFY_SOURCE=2 -fstack-protector-strong -fno-strict-overflow -fvisibility=hidden -fexcess-precision=standard -DRUBY_EXPORT -I. -I.ext/include/x86_64-linux -I/tmp/ruby/src/trunk/include -I/tmp/ruby/src/trunk -I/tmp/ruby/src/trunk/prism -I/tmp/ruby/src/trunk/enc/unicode/15.0.0 I, [2024-05-21T19:19:46.197195 #1327066] INFO -- : CPPFLAGS = I, [2024-05-21T19:19:46.197206 #1327066] INFO -- : DLDFLAGS = -Wl,--compress-debug-sections=zlib -Wl,-soname,libruby.so.3.4 -fstack-protector-strong I, [2024-05-21T19:19:46.197218 #1327066] INFO -- : SOLIBS = -lz -lrt -lrt -lgmp -ldl -lcrypt -lm -lpthread I, [2024-05-21T19:19:46.197230 #1327066] INFO -- : LANG = en_US.UTF-8 I, [2024-05-21T19:19:46.197241 #1327066] INFO -- : LC_ALL = I, [2024-05-21T19:19:46.197252 #1327066] INFO -- : LC_CTYPE = I, [2024-05-21T19:19:46.197263 #1327066] INFO -- : MFLAGS = I, [2024-05-21T19:19:46.197275 #1327066] INFO -- : RUSTC = no I, [2024-05-21T19:19:46.197289 #1327066] INFO -- : YJIT_RUSTC_ARGS = --crate-name=yjit --crate-type=staticlib --edition=2021 -g -C lto=thin -C opt-level=3 -C overflow-checks=on '--out-dir=/tmp/ruby/build/trunk/yjit/target/release/' /tmp/ruby/src/trunk/yjit/src/lib.rs I, [2024-05-21T19:19:46.197821 #1327066] INFO -- : gcc (Ubuntu 11.4.0-1ubuntu1~22.04) 11.4.0 I, [2024-05-21T19:19:46.197884 #1327066] INFO -- : Copyright (C) 2021 Free Software Foundation, Inc. I, [2024-05-21T19:19:46.197900 #1327066] INFO -- : This is free software; see the source for copying conditions. There is NO I, [2024-05-21T19:19:46.197914 #1327066] INFO -- : warranty; not even for MERCHANTABILITY or FITNESS FOR A PARTICULAR PURPOSE. I, [2024-05-21T19:19:46.197928 #1327066] INFO -- : I, [2024-05-21T19:19:46.200106 #1327066] INFO -- : generating enc.mk I, [2024-05-21T19:19:46.319971 #1327066] INFO -- : generating encdb.h I, [2024-05-21T19:19:46.343746 #1327066] INFO -- : encdb.h unchanged I, [2024-05-21T19:19:46.344940 #1327066] INFO -- : making enc I, [2024-05-21T19:19:46.363955 #1327066] INFO -- : make[1]: Entering directory '/tmp/ruby/build/trunk' I, [2024-05-21T19:19:46.364041 #1327066] INFO -- : make[1]: Nothing to be done for 'enc'. I, [2024-05-21T19:19:46.364061 #1327066] INFO -- : make[1]: Leaving directory '/tmp/ruby/build/trunk' I, [2024-05-21T19:19:46.364686 #1327066] INFO -- : making srcs under enc I, [2024-05-21T19:19:46.400000 #1327066] INFO -- : make[1]: Entering directory '/tmp/ruby/build/trunk' I, [2024-05-21T19:19:46.400063 #1327066] INFO -- : make[1]: Nothing to be done for 'srcs'. I, [2024-05-21T19:19:46.400076 #1327066] INFO -- : make[1]: Leaving directory '/tmp/ruby/build/trunk' I, [2024-05-21T19:19:46.400817 #1327066] INFO -- : generating transdb.h I, [2024-05-21T19:19:46.497207 #1327066] INFO -- : transdb.h unchanged I, [2024-05-21T19:19:46.498574 #1327066] INFO -- : making trans I, [2024-05-21T19:19:46.532238 #1327066] INFO -- : make[1]: Entering directory '/tmp/ruby/build/trunk' I, [2024-05-21T19:19:46.532310 #1327066] INFO -- : make[1]: Nothing to be done for 'trans'. I, [2024-05-21T19:19:46.532324 #1327066] INFO -- : make[1]: Leaving directory '/tmp/ruby/build/trunk' I, [2024-05-21T19:19:46.532966 #1327066] INFO -- : making encs I, [2024-05-21T19:19:46.570463 #1327066] INFO -- : make[1]: Entering directory '/tmp/ruby/build/trunk' I, [2024-05-21T19:19:46.570533 #1327066] INFO -- : make[1]: Nothing to be done for 'encs'. I, [2024-05-21T19:19:46.570546 #1327066] INFO -- : make[1]: Leaving directory '/tmp/ruby/build/trunk' I, [2024-05-21T19:19:46.572203 #1327066] INFO -- : generating makefiles ext/configure-ext.mk I, [2024-05-21T19:19:46.598884 #1327066] INFO -- : ext/configure-ext.mk updated I, [2024-05-21T19:19:46.601310 #1327066] INFO -- : make[1]: Entering directory '/tmp/ruby/build/trunk' I, [2024-05-21T19:19:47.989933 #1327066] INFO -- : make[1]: Leaving directory '/tmp/ruby/build/trunk' I, [2024-05-21T19:19:47.990612 #1327066] INFO -- : generating makefile exts.mk I, [2024-05-21T19:19:48.027387 #1327066] INFO -- : exts.mk unchanged I, [2024-05-21T19:19:48.031741 #1327066] INFO -- : make[1]: Entering directory '/tmp/ruby/build/trunk' I, [2024-05-21T19:19:48.317785 #1327066] INFO -- : make[2]: Entering directory '/tmp/ruby/build/trunk/ext/coverage' I, [2024-05-21T19:19:48.322562 #1327066] INFO -- : make[2]: Leaving directory '/tmp/ruby/build/trunk/ext/coverage' I, [2024-05-21T19:19:48.329079 #1327066] INFO -- : make[2]: Entering directory '/tmp/ruby/build/trunk/ext/date' I, [2024-05-21T19:19:48.333355 #1327066] INFO -- : make[2]: Leaving directory '/tmp/ruby/build/trunk/ext/date' I, [2024-05-21T19:19:48.337311 #1327066] INFO -- : make[2]: Entering directory '/tmp/ruby/build/trunk/ext/digest' I, [2024-05-21T19:19:48.346524 #1327066] INFO -- : make[2]: Leaving directory '/tmp/ruby/build/trunk/ext/digest' I, [2024-05-21T19:19:48.372933 #1327066] INFO -- : make[2]: Entering directory '/tmp/ruby/build/trunk/ext/digest/sha2' I, [2024-05-21T19:19:48.377809 #1327066] INFO -- : make[2]: Leaving directory '/tmp/ruby/build/trunk/ext/digest/sha2' I, [2024-05-21T19:19:48.398853 #1327066] INFO -- : make[2]: Entering directory '/tmp/ruby/build/trunk/ext/fiddle' I, [2024-05-21T19:19:48.407489 #1327066] INFO -- : make[2]: Leaving directory '/tmp/ruby/build/trunk/ext/fiddle' I, [2024-05-21T19:19:48.412498 #1327066] INFO -- : make[2]: Entering directory '/tmp/ruby/build/trunk/ext/io/console' I, [2024-05-21T19:19:48.416629 #1327066] INFO -- : make[2]: Leaving directory '/tmp/ruby/build/trunk/ext/io/console' I, [2024-05-21T19:19:48.430041 #1327066] INFO -- : make[2]: Entering directory '/tmp/ruby/build/trunk/ext/json' I, [2024-05-21T19:19:48.440648 #1327066] INFO -- : make[2]: Leaving directory '/tmp/ruby/build/trunk/ext/json' I, [2024-05-21T19:19:48.455839 #1327066] INFO -- : make[2]: Entering directory '/tmp/ruby/build/trunk/ext/monitor' I, [2024-05-21T19:19:48.459946 #1327066] INFO -- : make[2]: Leaving directory '/tmp/ruby/build/trunk/ext/monitor' I, [2024-05-21T19:19:48.466709 #1327066] INFO -- : make[2]: Entering directory '/tmp/ruby/build/trunk/ext/objspace' I, [2024-05-21T19:19:48.472139 #1327066] INFO -- : make[2]: Leaving directory '/tmp/ruby/build/trunk/ext/objspace' I, [2024-05-21T19:19:48.488864 #1327066] INFO -- : make[2]: Entering directory '/tmp/ruby/build/trunk/ext/openssl' I, [2024-05-21T19:19:48.504026 #1327066] INFO -- : make[2]: Leaving directory '/tmp/ruby/build/trunk/ext/openssl' I, [2024-05-21T19:19:48.508282 #1327066] INFO -- : make[2]: Entering directory '/tmp/ruby/build/trunk/ext/pathname' I, [2024-05-21T19:19:48.512314 #1327066] INFO -- : make[2]: Leaving directory '/tmp/ruby/build/trunk/ext/pathname' I, [2024-05-21T19:19:48.519473 #1327066] INFO -- : make[2]: Entering directory '/tmp/ruby/build/trunk/ext/psych' I, [2024-05-21T19:19:48.540254 #1327066] INFO -- : make[2]: Leaving directory '/tmp/ruby/build/trunk/ext/psych' I, [2024-05-21T19:19:48.543483 #1327066] INFO -- : make[2]: Entering directory '/tmp/ruby/build/trunk/ext/pty' I, [2024-05-21T19:19:48.546592 #1327066] INFO -- : make[2]: Leaving directory '/tmp/ruby/build/trunk/ext/pty' I, [2024-05-21T19:19:48.561541 #1327066] INFO -- : make[2]: Entering directory '/tmp/ruby/build/trunk/ext/ripper' I, [2024-05-21T19:19:48.569643 #1327066] INFO -- : make[2]: Leaving directory '/tmp/ruby/build/trunk/ext/ripper' I, [2024-05-21T19:19:48.572328 #1327066] INFO -- : make[2]: Entering directory '/tmp/ruby/build/trunk/ext/rubyvm' I, [2024-05-21T19:19:48.575603 #1327066] INFO -- : make[2]: Leaving directory '/tmp/ruby/build/trunk/ext/rubyvm' I, [2024-05-21T19:19:48.586613 #1327066] INFO -- : make[2]: Entering directory '/tmp/ruby/build/trunk/ext/socket' I, [2024-05-21T19:19:48.593522 #1327066] INFO -- : make[2]: Leaving directory '/tmp/ruby/build/trunk/ext/socket' I, [2024-05-21T19:19:48.610358 #1327066] INFO -- : make[2]: Entering directory '/tmp/ruby/build/trunk/.bundle/gems/bigdecimal-3.1.8/ext/bigdecimal' I, [2024-05-21T19:19:48.635072 #1327066] INFO -- : make[2]: Leaving directory '/tmp/ruby/build/trunk/.bundle/gems/bigdecimal-3.1.8/ext/bigdecimal' I, [2024-05-21T19:19:48.636981 #1327066] INFO -- : make[2]: Entering directory '/tmp/ruby/build/trunk/.bundle/gems/debug-1.9.2/ext/debug' I, [2024-05-21T19:19:48.660130 #1327066] INFO -- : make[2]: Leaving directory '/tmp/ruby/build/trunk/.bundle/gems/debug-1.9.2/ext/debug' I, [2024-05-21T19:19:48.662859 #1327066] INFO -- : make[2]: Entering directory '/tmp/ruby/build/trunk/.bundle/gems/nkf-0.2.0/ext/nkf' I, [2024-05-21T19:19:48.689102 #1327066] INFO -- : make[2]: Leaving directory '/tmp/ruby/build/trunk/.bundle/gems/nkf-0.2.0/ext/nkf' I, [2024-05-21T19:19:48.691170 #1327066] INFO -- : make[2]: Entering directory '/tmp/ruby/build/trunk/.bundle/gems/racc-1.7.3/ext/racc/cparse' I, [2024-05-21T19:19:48.712846 #1327066] INFO -- : make[2]: Leaving directory '/tmp/ruby/build/trunk/.bundle/gems/racc-1.7.3/ext/racc/cparse' I, [2024-05-21T19:19:48.715036 #1327066] INFO -- : make[2]: Entering directory '/tmp/ruby/build/trunk/.bundle/gems/racc-1.8.0/ext/racc/cparse' I, [2024-05-21T19:19:48.737552 #1327066] INFO -- : make[2]: Leaving directory '/tmp/ruby/build/trunk/.bundle/gems/racc-1.8.0/ext/racc/cparse' I, [2024-05-21T19:19:48.740495 #1327066] INFO -- : make[2]: Entering directory '/tmp/ruby/build/trunk/.bundle/gems/rbs-3.4.4/ext/rbs_extension' I, [2024-05-21T19:19:48.768363 #1327066] INFO -- : make[2]: Leaving directory '/tmp/ruby/build/trunk/.bundle/gems/rbs-3.4.4/ext/rbs_extension' I, [2024-05-21T19:19:48.770370 #1327066] INFO -- : make[2]: Entering directory '/tmp/ruby/build/trunk/.bundle/gems/syslog-0.1.2/ext/syslog' I, [2024-05-21T19:19:48.793605 #1327066] INFO -- : make[2]: Leaving directory '/tmp/ruby/build/trunk/.bundle/gems/syslog-0.1.2/ext/syslog' I, [2024-05-21T19:19:48.822552 #1327066] INFO -- : make[2]: Entering directory '/tmp/ruby/build/trunk' I, [2024-05-21T19:19:48.894266 #1327066] INFO -- : make[2]: 'ruby' is up to date. I, [2024-05-21T19:19:48.894311 #1327066] INFO -- : make[2]: Leaving directory '/tmp/ruby/build/trunk' I, [2024-05-21T19:19:48.894753 #1327066] INFO -- : make[1]: Leaving directory '/tmp/ruby/build/trunk' I, [2024-05-21T19:19:48.898340 #1327066] INFO -- : make[1]: Entering directory '/tmp/ruby/build/trunk' I, [2024-05-21T19:19:48.898364 #1327066] INFO -- : make[1]: Nothing to be done for 'note'. I, [2024-05-21T19:19:48.898370 #1327066] INFO -- : make[1]: Leaving directory '/tmp/ruby/build/trunk' I, [2024-05-21T19:19:48.974202 #1327066] INFO -- : Run options: I, [2024-05-21T19:19:48.974262 #1327066] INFO -- : --seed=11450 I, [2024-05-21T19:19:48.974268 #1327066] INFO -- : "--ruby=./miniruby -I/tmp/ruby/src/trunk/lib -I. -I.ext/common /tmp/ruby/src/trunk/tool/runruby.rb --extout=.ext -- --disable-gems" I, [2024-05-21T19:19:48.974273 #1327066] INFO -- : --excludes-dir=/tmp/ruby/src/trunk/test/.excludes I, [2024-05-21T19:19:48.974276 #1327066] INFO -- : --name=!/memory_leak/ I, [2024-05-21T19:19:48.974280 #1327066] INFO -- : --stderr-on-failure I, [2024-05-21T19:19:48.974284 #1327066] INFO -- : -j20 I, [2024-05-21T19:19:48.974288 #1327066] INFO -- : I, [2024-05-21T19:19:48.974291 #1327066] INFO -- : # Running tests: I, [2024-05-21T19:19:48.974296 #1327066] INFO -- : I, [2024-05-21T19:19:49.122756 #1327066] INFO -- : [ 1/885] 1368429=test_pair I, [2024-05-21T19:19:49.122822 #1327066] INFO -- : [ 2/885] 1368418=test_gem_commands_yank_command I, [2024-05-21T19:19:49.122832 #1327066] INFO -- : [ 3/885] 1368416=test_win32ole_param I, [2024-05-21T19:19:49.123359 #1327066] INFO -- : [ 4/885] 1368420=test_acceptable I, [2024-05-21T19:19:49.123615 #1327066] INFO -- : [ 5/885] 1368415=test_euc_jp I, [2024-05-21T19:19:49.125616 #1327066] INFO -- : [ 6/885] 1368419=test_rdoc_generator_pot_po_entry I, [2024-05-21T19:19:49.126042 #1327066] INFO -- : [ 7/885] 1368416=test_document I, [2024-05-21T19:19:49.126066 #1327066] INFO -- : [ 8/885] 1368430=test_rdoc_i18n_locale I, [2024-05-21T19:19:49.126545 #1327066] INFO -- : [ 9/885] 1368431=test_chilled I, [2024-05-21T19:19:49.126819 #1327066] INFO -- : [ 10/885] 1368415=test_name_error_extension I, [2024-05-21T19:19:49.127216 #1327066] INFO -- : [ 11/885] 1368434=test_human_typo I, [2024-05-21T19:19:49.127396 #1327066] INFO -- : [ 12/885] 1368432=test_primitive I, [2024-05-21T19:19:49.129293 #1327066] INFO -- : [ 13/885] 1368433=test_rbconfig I, [2024-05-21T19:19:49.130507 #1327066] INFO -- : [ 14/885] 1368431=json_encoding_test I, [2024-05-21T19:19:49.133451 #1327066] INFO -- : [ 15/885] 1368433=test_color I, [2024-05-21T19:19:49.135275 #1327066] INFO -- : [ 16/885] 1368415=test_key_stroke I, [2024-05-21T19:19:49.135323 #1327066] INFO -- : [ 17/885] 1368434=test_set_len I, [2024-05-21T19:19:49.137247 #1327066] INFO -- : [ 18/885] 1368432=test_encoding I, [2024-05-21T19:19:49.141313 #1327066] INFO -- : [ 19/885] 1368434=test_httpresponses I, [2024-05-21T19:19:49.146540 #1327066] INFO -- : [ 20/885] 1368431=test_rdoc_ri_driver I, [2024-05-21T19:19:49.152949 #1327066] INFO -- : [ 21/885] 1368416=test_gem_resolver_local_specification I, [2024-05-21T19:19:49.156733 #1327066] INFO -- : [ 22/885] 1368428=test_httpheader I, [2024-05-21T19:19:49.156791 #1327066] INFO -- : [ 23/885] 1368423=test_rdoc_markup_to_label I, [2024-05-21T19:19:49.156915 #1327066] INFO -- : [ 24/885] 1368422=test_install I, [2024-05-21T19:19:49.157222 #1327066] INFO -- : [ 25/885] 1368424=test_sockopt I, [2024-05-21T19:19:49.158698 #1327066] INFO -- : [ 26/885] 1368425=redundant_return_test I, [2024-05-21T19:19:49.158794 #1327066] INFO -- : [ 27/885] 1368426=test_case_mapping I, [2024-05-21T19:19:49.163823 #1327066] INFO -- : [ 28/885] 1368427=test_path I, [2024-05-21T19:19:49.168056 #1327066] INFO -- : [ 29/885] 1368421=test_win32ole_param_event I, [2024-05-21T19:19:49.171287 #1327066] INFO -- : [ 30/885] 1368421=test_bn I, [2024-05-21T19:19:49.172059 #1327066] INFO -- : [ 31/885] 1368424=test_http I, [2024-05-21T19:19:49.172103 #1327066] INFO -- : [ 32/885] 1368432=test_addrinfo I, [2024-05-21T19:19:49.172566 #1327066] INFO -- : [ 33/885] 1368427=test_tree_spell_checker I, [2024-05-21T19:19:49.174991 #1327066] INFO -- : [ 34/885] 1368426=test_rdoc_markup_to_html I, [2024-05-21T19:19:49.187751 #1327066] INFO -- : [ 35/885] 1368417=test_date_compat I, [2024-05-21T19:19:49.187818 #1327066] INFO -- : [ 36/885] 1368417=test_bug-14834 I, [2024-05-21T19:19:49.199695 #1327066] INFO -- : [ 37/885] 1368434=test_terminfo I, [2024-05-21T19:19:49.204375 #1327066] INFO -- : [ 38/885] 1368415=test_compile_prism I, [2024-05-21T19:19:49.214318 #1327066] INFO -- : [ 39/885] 1368421=test_ssl_session I, [2024-05-21T19:19:49.217277 #1327066] INFO -- : [ 40/885] 1368428=test_thread_cv I, [2024-05-21T19:19:49.230281 #1327066] INFO -- : [ 41/885] 1368427=test_lexer I, [2024-05-21T19:19:49.248002 #1327066] INFO -- : [ 42/885] 1368427=test_notimplement I, [2024-05-21T19:19:49.255956 #1327066] INFO -- : [ 43/885] 1368427=test_random I, [2024-05-21T19:19:49.256026 #1327066] INFO -- : [ 44/885] 1368427=test_gem_uri I, [2024-05-21T19:19:49.260102 #1327066] INFO -- : [ 45/885] 1368432=test_key_event_record I, [2024-05-21T19:19:49.264943 #1327066] INFO -- : [ 46/885] 1368434=test_gem_resolver_vendor_specification I, [2024-05-21T19:19:49.269352 #1327066] INFO -- : [ 47/885] 1368420=test_gem_commands_update_command I, [2024-05-21T19:19:49.271916 #1327066] INFO -- : [ 48/885] 1368425=test_data I, [2024-05-21T19:19:49.273845 #1327066] INFO -- : [ 49/885] 1368425=static_literals_test I, [2024-05-21T19:19:49.276883 #1327066] INFO -- : [ 50/885] 1368419=test_filter I, [2024-05-21T19:19:49.277130 #1327066] INFO -- : [ 51/885] 1368425=test_gem_gem_runner I, [2024-05-21T19:19:49.284005 #1327066] INFO -- : [ 52/885] 1368433=test_rdoc_method_attr I, [2024-05-21T19:19:49.294809 #1327066] INFO -- : [ 53/885] 1368417=test_unicode I, [2024-05-21T19:19:49.297405 #1327066] INFO -- : [ 54/885] 1368432=test_enumerator I, [2024-05-21T19:19:49.300810 #1327066] INFO -- : [ 55/885] 1368432=test_rdoc_parser_changelog I, [2024-05-21T19:19:49.306334 #1327066] INFO -- : [ 56/885] 1368419=parameters_signature_test I, [2024-05-21T19:19:49.309314 #1327066] INFO -- : [ 57/885] 1368430=test_koi8 I, [2024-05-21T19:19:49.317445 #1327066] INFO -- : [ 58/885] 1368430=test_rdoc_generator_pot I, [2024-05-21T19:19:49.332212 #1327066] INFO -- : [ 59/885] 1368423=test_gem_commands_server_command I, [2024-05-21T19:19:49.338096 #1327066] INFO -- : [ 60/885] 1368416=test_did_you_mean I, [2024-05-21T19:19:49.339108 #1327066] INFO -- : [ 61/885] 1368417=test_io_m17n I, [2024-05-21T19:19:49.351982 #1327066] INFO -- : [ 62/885] 1368419=test_variable_name_check I, [2024-05-21T19:19:49.363196 #1327066] INFO -- : [ 63/885] 1368430=test_tracer I, [2024-05-21T19:19:49.383735 #1327066] INFO -- : [ 64/885] 1368419=test_cmethod I, [2024-05-21T19:19:49.386982 #1327066] INFO -- : [ 65/885] 1368419=test_option I, [2024-05-21T19:19:49.433859 #1327066] INFO -- : [ 66/885] 1368422=test_append I, [2024-05-21T19:19:49.437406 #1327066] INFO -- : [ 67/885] 1368422=test_gem_commands_build_command I, [2024-05-21T19:19:49.441527 #1327066] INFO -- : [ 68/885] 1368434=test_case_comprehensive I, [2024-05-21T19:19:49.456170 #1327066] INFO -- : [ 69/885] 1368426=test_interned_str I, [2024-05-21T19:19:49.457899 #1327066] INFO -- : [ 70/885] 1368426=test_pkey_dsa I, [2024-05-21T19:19:49.460050 #1327066] INFO -- : [ 71/885] 1368425=test_ocsp I, [2024-05-21T19:19:49.471552 #1327066] INFO -- : [ 72/885] 1368415=test_class I, [2024-05-21T19:19:49.479107 #1327066] INFO -- : [ 73/885] 1368416=test_scheduler I, [2024-05-21T19:19:49.482730 #1327066] INFO -- : [ 74/885] 1368430=test_rdoc_markup_heading I, [2024-05-21T19:19:49.489266 #1327066] INFO -- : [ 75/885] 1368427=test_exception_at_throwing I, [2024-05-21T19:19:49.491554 #1327066] INFO -- : [ 76/885] 1368432=test_iseq I, [2024-05-21T19:19:49.493136 #1327066] INFO -- : [ 77/885] 1368419=test_stream I, [2024-05-21T19:19:49.494346 #1327066] INFO -- : [ 78/885] 1368415=test_to_ary_concat I, [2024-05-21T19:19:49.497846 #1327066] INFO -- : [ 79/885] 1368430=test_webauthn_listener_response I, [2024-05-21T19:19:49.512015 #1327066] INFO -- : [ 80/885] 1368433=test_time I, [2024-05-21T19:19:49.515600 #1327066] INFO -- : [ 81/885] 1368419=test_rdoc_markup_pre_process I, [2024-05-21T19:19:49.541121 #1327066] INFO -- : [ 82/885] 1368423=test_printf I, [2024-05-21T19:19:49.560162 #1327066] INFO -- : [ 83/885] 1368431=test_pinned I, [2024-05-21T19:19:49.561081 #1327066] INFO -- : [ 84/885] 1368427=reflection_test I, [2024-05-21T19:19:49.568454 #1327066] INFO -- : [ 85/885] 1368431=test_within_pipe I, [2024-05-21T19:19:49.570513 #1327066] INFO -- : [ 86/885] 1368423=test_emoji_breaks I, [2024-05-21T19:19:49.572636 #1327066] INFO -- : [ 87/885] 1368423=test_gem_bundler_version_finder I, [2024-05-21T19:19:49.576348 #1327066] INFO -- : [ 88/885] 1368419=test_rdoc_markup_to_bs I, [2024-05-21T19:19:49.590351 #1327066] INFO -- : [ 89/885] 1368423=test_help I, [2024-05-21T19:19:49.597015 #1327066] INFO -- : [ 90/885] 1368423=test_beginendblock I, [2024-05-21T19:19:49.616734 #1327066] INFO -- : [ 91/885] 1368419=test_files_lib I, [2024-05-21T19:19:49.623928 #1327066] INFO -- : [ 92/885] 1368431=test_gem_commands_unpack_command I, [2024-05-21T19:19:49.625433 #1327066] INFO -- : [ 93/885] 1368427=test_gem_security I, [2024-05-21T19:19:49.634862 #1327066] INFO -- : [ 94/885] 1368416=test_rdoc_servlet I, [2024-05-21T19:19:49.677258 #1327066] INFO -- : [ 95/885] 1368433=test_ractor I, [2024-05-21T19:19:49.725162 #1327066] INFO -- : [ 96/885] 1368433=test_digest I, [2024-05-21T19:19:49.726078 #1327066] INFO -- : [ 97/885] 1368430=test_closure I, [2024-05-21T19:19:49.745485 #1327066] INFO -- : [ 98/885] 1368425=test_bundled_ca I, [2024-05-21T19:19:49.755614 #1327066] INFO -- : [ 99/885] 1368433=test_open3 I, [2024-05-21T19:19:49.761276 #1327066] INFO -- : [100/885] 1368418=test_multi_irb_commands I, [2024-05-21T19:19:49.769635 #1327066] INFO -- : [101/885] 1368418=test_fiber I, [2024-05-21T19:19:49.774711 #1327066] INFO -- : [102/885] 1368415=test_mkmf I, [2024-05-21T19:19:49.812378 #1327066] INFO -- : [103/885] 1368415=test_date_marshal I, [2024-05-21T19:19:49.819774 #1327066] INFO -- : [104/885] 1368415=test_history I, [2024-05-21T19:19:49.827439 #1327066] INFO -- : [105/885] 1368422=test_popen_deadlock I, [2024-05-21T19:19:49.857800 #1327066] INFO -- : [106/885] 1368428=test_delegate I, [2024-05-21T19:19:49.877678 #1327066] INFO -- : [107/885] 1368428=test_exit I, [2024-05-21T19:19:49.905836 #1327066] INFO -- : [108/885] 1368415=test_recursion I, [2024-05-21T19:19:49.906786 #1327066] INFO -- : [109/885] 1368415=test_rdoc_top_level I, [2024-05-21T19:19:49.934553 #1327066] INFO -- : [110/885] 1368416=test_metaclass I, [2024-05-21T19:19:49.938444 #1327066] INFO -- : [111/885] 1368416=test_cgi_session I, [2024-05-21T19:19:49.954847 #1327066] INFO -- : [112/885] 1368416=test_rdoc_rd I, [2024-05-21T19:19:49.972035 #1327066] INFO -- : [113/885] 1368416=test_x509crl I, [2024-05-21T19:19:49.996207 #1327066] INFO -- : [114/885] 1368431=test_signal I, [2024-05-21T19:19:50.016192 #1327066] INFO -- : [115/885] 1368423=test_fixnum I, [2024-05-21T19:19:50.031667 #1327066] INFO -- : [116/885] 1368430=test_process I, [2024-05-21T19:19:50.037137 #1327066] INFO -- : [117/885] 1368423=test_windows_1252 I, [2024-05-21T19:19:50.049488 #1327066] INFO -- : [118/885] 1368423=test_input_method I, [2024-05-21T19:19:50.061426 #1327066] INFO -- : [119/885] 1368430=test_require I, [2024-05-21T19:19:50.132463 #1327066] INFO -- : [120/885] 1368416=test_cgi_cookie I, [2024-05-21T19:19:50.144151 #1327066] INFO -- : [121/885] 1368416=test_float I, [2024-05-21T19:19:50.151982 #1327066] INFO -- : [122/885] 1368428=test_gem_source_git I, [2024-05-21T19:19:50.153472 #1327066] INFO -- : [123/885] 1368432=test_regex_casefold I, [2024-05-21T19:19:50.156644 #1327066] INFO -- : [124/885] 1368423=test_refinement I, [2024-05-21T19:19:50.191856 #1327066] INFO -- : [125/885] 1368421=test_gem_commands_signout_command I, [2024-05-21T19:19:50.240298 #1327066] INFO -- : [126/885] 1368415=test_gem_resolver_installer_set I, [2024-05-21T19:19:50.381605 #1327066] INFO -- : [127/885] 1368421=test_dir_m17n I, [2024-05-21T19:19:50.458024 #1327066] INFO -- : [128/885] 1368422=test_new I, [2024-05-21T19:19:50.458373 #1327066] INFO -- : [129/885] 1368422=test_gem_security_signer I, [2024-05-21T19:19:50.549892 #1327066] INFO -- : [130/885] 1368417=test_cipher I, [2024-05-21T19:19:50.561652 #1327066] INFO -- : [131/885] 1368422=test_gem_resolver_git_set I, [2024-05-21T19:19:50.572821 #1327066] INFO -- : [132/885] 1368426=test_storage I, [2024-05-21T19:19:50.576034 #1327066] INFO -- : [133/885] 1368426=test_digest_extend I, [2024-05-21T19:19:50.582291 #1327066] INFO -- : [134/885] 1368415=test_omap I, [2024-05-21T19:19:50.585560 #1327066] INFO -- : [135/885] 1368426=test_string I, [2024-05-21T19:19:50.586067 #1327066] INFO -- : [136/885] 1368426=test_iterator I, [2024-05-21T19:19:50.590057 #1327066] INFO -- : [137/885] 1368415=pattern_test I, [2024-05-21T19:19:50.625096 #1327066] INFO -- : [138/885] 1368417=test_memory_view I, [2024-05-21T19:19:50.628628 #1327066] INFO -- : [139/885] 1368428=test_debug I, [2024-05-21T19:19:50.631172 #1327066] INFO -- : [140/885] 1368428=test_shellwords I, [2024-05-21T19:19:50.632814 #1327066] INFO -- : [141/885] 1368428=test_pkg_config I, [2024-05-21T19:19:50.661857 #1327066] INFO -- : [142/885] 1368426=test_cparser I, [2024-05-21T19:19:50.665046 #1327066] INFO -- : [143/885] 1368417=test_rdoc_markup_to_html_snippet I, [2024-05-21T19:19:50.668123 #1327066] INFO -- : [144/885] 1368428=magic_comment_test I, [2024-05-21T19:19:50.707027 #1327066] INFO -- : [145/885] 1368415=test_struct I, [2024-05-21T19:19:50.711673 #1327066] INFO -- : [146/885] 1368415=test_variable I, [2024-05-21T19:19:50.718501 #1327066] INFO -- : [147/885] 1368432=fuzzer_test I, [2024-05-21T19:19:50.752146 #1327066] INFO -- : [148/885] 1368428=test_rdoc_markup_include I, [2024-05-21T19:19:50.801032 #1327066] INFO -- : [149/885] 1368420=test_sexp I, [2024-05-21T19:19:50.808332 #1327066] INFO -- : [150/885] 1368432=test_win32ole_variant_outarg I, [2024-05-21T19:19:50.809137 #1327066] INFO -- : [151/885] 1368432=json_common_interface_test I, [2024-05-21T19:19:50.821400 #1327066] INFO -- : [152/885] 1368420=test_gem_source_subpath_problem I, [2024-05-21T19:19:50.824742 #1327066] INFO -- : [153/885] 1368415=test_dln I, [2024-05-21T19:19:50.826818 #1327066] INFO -- : [154/885] 1368415=json_parser_test I, [2024-05-21T19:19:50.830830 #1327066] INFO -- : [155/885] 1368432=test_nomethod_error I, [2024-05-21T19:19:50.832924 #1327066] INFO -- : [156/885] 1368432=memsize_test I, [2024-05-21T19:19:50.836572 #1327066] INFO -- : [157/885] 1368432=test_config I, [2024-05-21T19:19:50.872942 #1327066] INFO -- : [158/885] 1368428=test_files_test_1 I, [2024-05-21T19:19:50.873541 #1327066] INFO -- : [159/885] 1368415=test_struct I, [2024-05-21T19:19:50.894487 #1327066] INFO -- : [160/885] 1368432=test_gem_path_support I, [2024-05-21T19:19:50.916716 #1327066] INFO -- : [161/885] 1368422=test_set I, [2024-05-21T19:19:50.926343 #1327066] INFO -- : [162/885] 1368420=test_x509req I, [2024-05-21T19:19:50.948581 #1327066] INFO -- : [163/885] 1368422=test_mutex I, [2024-05-21T19:19:50.949571 #1327066] INFO -- : [164/885] 1368417=test_rdoc_rd_inline I, [2024-05-21T19:19:50.958952 #1327066] INFO -- : [165/885] 1368417=test_win32ole_variant_m I, [2024-05-21T19:19:50.959115 #1327066] INFO -- : [166/885] 1368417=test_engine I, [2024-05-21T19:19:50.960508 #1327066] INFO -- : [167/885] 1368417=test_allocation I, [2024-05-21T19:19:50.979421 #1327066] INFO -- : [168/885] 1368426=test_div I, [2024-05-21T19:19:50.980254 #1327066] INFO -- : [169/885] 1368426=test_key_error I, [2024-05-21T19:19:50.984701 #1327066] INFO -- : [170/885] 1368426=test_insns_leaf I, [2024-05-21T19:19:50.991141 #1327066] INFO -- : [171/885] 1368426=test_serialize_subclasses I, [2024-05-21T19:19:51.014260 #1327066] INFO -- : [172/885] 1368426=test_deprecated I, [2024-05-21T19:19:51.021098 #1327066] INFO -- : [173/885] 1368426=test_color_printer I, [2024-05-21T19:19:51.086091 #1327066] INFO -- : [174/885] 1368420=test_arith_seq_extract I, [2024-05-21T19:19:51.092196 #1327066] INFO -- : [175/885] 1368426=test_method_name_check I, [2024-05-21T19:19:51.100595 #1327066] INFO -- : [176/885] 1368432=test_parser I, [2024-05-21T19:19:51.131959 #1327066] INFO -- : [177/885] 1368426=constant_path_node_test I, [2024-05-21T19:19:51.140094 #1327066] INFO -- : [178/885] 1368432=test_gem_ext_cargo_builder I, [2024-05-21T19:19:51.170481 #1327066] INFO -- : [179/885] 1368432=test_ssl I, [2024-05-21T19:19:51.213064 #1327066] INFO -- : [180/885] 1368426=test_module I, [2024-05-21T19:19:51.225363 #1327066] INFO -- : [181/885] 1368420=test_gem_request_set I, [2024-05-21T19:19:51.367916 #1327066] INFO -- : [182/885] 1368425=test_boolean I, [2024-05-21T19:19:51.396909 #1327066] INFO -- : [183/885] 1368425=test_stringify_symbols I, [2024-05-21T19:19:51.405513 #1327066] INFO -- : [184/885] 1368425=integer_parse_test I, [2024-05-21T19:19:51.415148 #1327066] INFO -- : [185/885] 1368425=test_instrumentation_api I, [2024-05-21T19:19:51.423827 #1327066] INFO -- : [186/885] 1368415=test_rubyvm I, [2024-05-21T19:19:51.427254 #1327066] INFO -- : [187/885] 1368415=test_configuration I, [2024-05-21T19:19:51.492184 #1327066] INFO -- : [188/885] 1368415=test_buffered_io I, [2024-05-21T19:19:51.520164 #1327066] INFO -- : [189/885] 1368416=test_monitor I, [2024-05-21T19:19:51.580102 #1327066] INFO -- : [190/885] 1368415=test_whileuntil I, [2024-05-21T19:19:51.582921 #1327066] INFO -- : [191/885] 1368415=test_rdoc_generator_markup I, [2024-05-21T19:19:51.587716 #1327066] INFO -- : [192/885] 1368415=test_provider I, [2024-05-21T19:19:51.592101 #1327066] INFO -- : [193/885] 1368420=test_abi I, [2024-05-21T19:19:51.643867 #1327066] INFO -- : [194/885] 1368421=test_load I, [2024-05-21T19:19:51.651448 #1327066] INFO -- : [195/885] 1368421=test_gem_commands_rebuild_command I, [2024-05-21T19:19:51.723109 #1327066] INFO -- : [196/885] 1368421=test_yamldbm I, [2024-05-21T19:19:51.729498 #1327066] INFO -- : [197/885] 1368416=test_rdoc_parser_simple I, [2024-05-21T19:19:51.734162 #1327066] INFO -- : [198/885] 1368421=test_gem_ext_builder I, [2024-05-21T19:19:51.741556 #1327066] INFO -- : [199/885] 1368416=test_https I, [2024-05-21T19:19:51.748346 #1327066] INFO -- : [200/885] 1368420=test_evaluation I, [2024-05-21T19:19:51.754952 #1327066] INFO -- : [201/885] 1368420=test_benchmark I, [2024-05-21T19:19:51.899368 #1327066] INFO -- : [202/885] 1368415=test_gem_dependency_list I, [2024-05-21T19:19:51.951177 #1327066] INFO -- : [203/885] 1368415=test_nesting_parser I, [2024-05-21T19:19:51.970679 #1327066] INFO -- : [204/885] 1368415=test_win32ole_method_event I, [2024-05-21T19:19:51.973747 #1327066] INFO -- : [205/885] 1368415=test_scalar_scanner I, [2024-05-21T19:19:51.975851 #1327066] INFO -- : [206/885] 1368433=test_gem_source I, [2024-05-21T19:19:51.982855 #1327066] INFO -- : [207/885] 1368415=test_array I, [2024-05-21T19:19:52.039724 #1327066] INFO -- : [208/885] 1368431=test_gem_package_tar_writer I, [2024-05-21T19:19:52.078777 #1327066] INFO -- : [209/885] 1368422=test_helper_method I, [2024-05-21T19:19:52.087701 #1327066] INFO -- : [210/885] 1368416=test_gem_commands_outdated_command I, [2024-05-21T19:19:52.144854 #1327066] INFO -- : [211/885] 1368431=test_rational I, [2024-05-21T19:19:52.145463 #1327066] INFO -- : [212/885] 1368416=test_rational2 I, [2024-05-21T19:19:52.153348 #1327066] INFO -- : [213/885] 1368416=test_spell_checker I, [2024-05-21T19:19:52.162918 #1327066] INFO -- : [214/885] 1368431=attribute_write_test I, [2024-05-21T19:19:52.166833 #1327066] INFO -- : [215/885] 1368416=test_propertyputref I, [2024-05-21T19:19:52.169294 #1327066] INFO -- : [216/885] 1368416=test_assembler I, [2024-05-21T19:19:52.174051 #1327066] INFO -- : [217/885] 1368416=test_gem_source_installed I, [2024-05-21T19:19:52.183084 #1327066] INFO -- : [218/885] 1368416=test_x509ext I, [2024-05-21T19:19:52.188144 #1327066] INFO -- : [219/885] 1368416=test_erb I, [2024-05-21T19:19:52.218310 #1327066] INFO -- : [220/885] 1368422=test_yield_block I, [2024-05-21T19:19:52.219114 #1327066] INFO -- : [221/885] 1368416=test_len I, [2024-05-21T19:19:52.221216 #1327066] INFO -- : [222/885] 1368422=test_gem_commands_cert_command I, [2024-05-21T19:19:52.225150 #1327066] INFO -- : [223/885] 1368416=test_completion I, [2024-05-21T19:19:52.246687 #1327066] INFO -- : [224/885] 1368431=test_threadgroup I, [2024-05-21T19:19:52.495045 #1327066] INFO -- : [225/885] 1368433=test_enum I, [2024-05-21T19:19:52.519083 #1327066] INFO -- : [226/885] 1368429=test_gem_specification I, [2024-05-21T19:19:52.666975 #1327066] INFO -- : [227/885] 1368416=test_gem_package I, [2024-05-21T19:19:52.669938 #1327066] INFO -- : [228/885] 1368419=test_complex2 I, [2024-05-21T19:19:52.680759 #1327066] INFO -- : [229/885] 1368419=test_resolve_symbol I, [2024-05-21T19:19:52.754255 #1327066] INFO -- : [230/885] 1368419=test_have_macro I, [2024-05-21T19:19:52.757193 #1327066] INFO -- : [231/885] 1368421=test_time_tz I, [2024-05-21T19:19:52.824170 #1327066] INFO -- : [232/885] 1368421=test_win32ole_event I, [2024-05-21T19:19:52.828669 #1327066] INFO -- : [233/885] 1368421=test_rdoc_generator_json_index I, [2024-05-21T19:19:52.975574 #1327066] INFO -- : [234/885] 1368421=test_trace I, [2024-05-21T19:19:52.984824 #1327066] INFO -- : [235/885] 1368421=ractor_test I, [2024-05-21T19:19:52.997789 #1327066] INFO -- : [236/885] 1368420=test_stringio I, [2024-05-21T19:19:53.023911 #1327066] INFO -- : [237/885] 1368430=test_arity I, [2024-05-21T19:19:53.028079 #1327066] INFO -- : [238/885] 1368430=test_io_wait_uncommon I, [2024-05-21T19:19:53.032713 #1327066] INFO -- : [239/885] 1368430=test_win32ole_variable I, [2024-05-21T19:19:53.034515 #1327066] INFO -- : [240/885] 1368421=test_rdoc_class_module I, [2024-05-21T19:19:53.034568 #1327066] INFO -- : [241/885] 1368430=test_bignum I, [2024-05-21T19:19:53.119151 #1327066] INFO -- : [242/885] 1368426=test_gem_ci_detector I, [2024-05-21T19:19:53.142937 #1327066] INFO -- : [243/885] 1368428=test_mixed_unicode_escapes I, [2024-05-21T19:19:53.144763 #1327066] INFO -- : [244/885] 1368428=test_history I, [2024-05-21T19:19:53.146834 #1327066] INFO -- : [245/885] 1368420=test_rdoc_markup_to_ansi I, [2024-05-21T19:19:53.184209 #1327066] INFO -- : [246/885] 1368427=test_ipaddr I, [2024-05-21T19:19:53.191451 #1327066] INFO -- : [247/885] 1368428=test_win32ole_variant I, [2024-05-21T19:19:53.194831 #1327066] INFO -- : [248/885] 1368428=test_gem_resolver_api_specification I, [2024-05-21T19:19:53.196128 #1327066] INFO -- : [249/885] 1368420=test_merge_keys I, [2024-05-21T19:19:53.200459 #1327066] INFO -- : [250/885] 1368427=test_rdoc_extend I, [2024-05-21T19:19:53.203939 #1327066] INFO -- : [251/885] 1368420=test_mailto I, [2024-05-21T19:19:53.224210 #1327066] INFO -- : [252/885] 1368420=location_test I, [2024-05-21T19:19:53.244585 #1327066] INFO -- : [253/885] 1368428=test_symbol I, [2024-05-21T19:19:53.250834 #1327066] INFO -- : [254/885] 1368431=test_coderange I, [2024-05-21T19:19:53.253349 #1327066] INFO -- : [255/885] 1368428=test_http_request I, [2024-05-21T19:19:53.253884 #1327066] INFO -- : [256/885] 1368431=json_generic_object_test I, [2024-05-21T19:19:53.255777 #1327066] INFO -- : [257/885] 1368428=test_gem_source_fetch_problem I, [2024-05-21T19:19:53.259574 #1327066] INFO -- : [258/885] 1368431=test_rdoc_comment I, [2024-05-21T19:19:53.262277 #1327066] INFO -- : [259/885] 1368428=test_error_highlight I, [2024-05-21T19:19:53.281223 #1327066] INFO -- : [260/885] 1368433=test_resize I, [2024-05-21T19:19:53.283521 #1327066] INFO -- : [261/885] 1368419=test_rdoc_generator_darkfish I, [2024-05-21T19:19:53.286252 #1327066] INFO -- : [262/885] 1368433=test_cgi_multipart I, [2024-05-21T19:19:53.299174 #1327066] INFO -- : [263/885] 1368416=test_gem_commands_cleanup_command I, [2024-05-21T19:19:53.309923 #1327066] INFO -- : [264/885] 1368426=test_word I, [2024-05-21T19:19:53.314835 #1327066] INFO -- : [265/885] 1368426=test_member I, [2024-05-21T19:19:53.318680 #1327066] INFO -- : [266/885] 1368426=test_numeric I, [2024-05-21T19:19:53.324595 #1327066] INFO -- : [267/885] 1368426=test_gem_console_ui I, [2024-05-21T19:19:53.327831 #1327066] INFO -- : [268/885] 1368431=test_date_ractor I, [2024-05-21T19:19:53.331349 #1327066] INFO -- : [269/885] 1368420=test_dir I, [2024-05-21T19:19:53.334414 #1327066] INFO -- : [270/885] 1368426=format_errors_test I, [2024-05-21T19:19:53.335594 #1327066] INFO -- : [271/885] 1368426=test_autoconf I, [2024-05-21T19:19:53.341570 #1327066] INFO -- : [272/885] 1368426=test_eval I, [2024-05-21T19:19:53.345308 #1327066] INFO -- : [273/885] 1368426=test_ractor_compatibility I, [2024-05-21T19:19:53.360946 #1327066] INFO -- : [274/885] 1368427=test_enc_associate I, [2024-05-21T19:19:53.397264 #1327066] INFO -- : [275/885] 1368421=test_lazy_enumerator I, [2024-05-21T19:19:53.405006 #1327066] INFO -- : [276/885] 1368423=test_unix I, [2024-05-21T19:19:53.436165 #1327066] INFO -- : [277/885] 1368423=test_gem_commands_pristine_command I, [2024-05-21T19:19:53.447155 #1327066] INFO -- : [278/885] 1368433=test_context I, [2024-05-21T19:19:53.526333 #1327066] INFO -- : [279/885] 1368431=test_nofree I, [2024-05-21T19:19:53.528337 #1327066] INFO -- : [280/885] 1368431=test_coder I, [2024-05-21T19:19:53.543015 #1327066] INFO -- : [281/885] 1368431=test_symbol I, [2024-05-21T19:19:53.571758 #1327066] INFO -- : [282/885] 1368420=test_find_executable I, [2024-05-21T19:19:53.593051 #1327066] INFO -- : [283/885] 1368420=ruby_api_test I, [2024-05-21T19:19:53.596069 #1327066] INFO -- : [284/885] 1368428=test_function_entry I, [2024-05-21T19:19:53.598161 #1327066] INFO -- : [285/885] 1368428=test_arith_seq_beg_len_step I, [2024-05-21T19:19:53.613333 #1327066] INFO -- : [286/885] 1368433=test_gem_resolver_requirement_list I, [2024-05-21T19:19:53.617281 #1327066] INFO -- : [287/885] 1368433=test_pkcs7 I, [2024-05-21T19:19:53.638124 #1327066] INFO -- : [288/885] 1368428=test_gem_resolver_git_specification I, [2024-05-21T19:19:53.638346 #1327066] INFO -- : [289/885] 1368421=test_usrmarshal I, [2024-05-21T19:19:53.692466 #1327066] INFO -- : [290/885] 1368417=test_object_references I, [2024-05-21T19:19:53.702462 #1327066] INFO -- : [291/885] 1368426=test_capacity I, [2024-05-21T19:19:53.709444 #1327066] INFO -- : [292/885] 1368426=test_nextafter I, [2024-05-21T19:19:53.734511 #1327066] INFO -- : [293/885] 1368417=test_have_func I, [2024-05-21T19:19:53.736002 #1327066] INFO -- : [294/885] 1368420=test_gem_request_set_lockfile_tokenizer I, [2024-05-21T19:19:53.743484 #1327066] INFO -- : [295/885] 1368419=test_stat I, [2024-05-21T19:19:53.747905 #1327066] INFO -- : [296/885] 1368419=test_rubygems I, [2024-05-21T19:19:53.750840 #1327066] INFO -- : [297/885] 1368426=test_call I, [2024-05-21T19:19:53.778089 #1327066] INFO -- : [298/885] 1368420=test_https_proxy I, [2024-05-21T19:19:53.797520 #1327066] INFO -- : [299/885] 1368422=test_integer I, [2024-05-21T19:19:53.798526 #1327066] INFO -- : [300/885] 1368428=test_cgi_modruby I, [2024-05-21T19:19:53.809774 #1327066] INFO -- : [301/885] 1368428=test_rubyoptions I, [2024-05-21T19:19:53.814273 #1327066] INFO -- : [302/885] 1368420=test_super I, [2024-05-21T19:19:53.844273 #1327066] INFO -- : [303/885] 1368433=test_gem_commands_setup_command I, [2024-05-21T19:19:53.853317 #1327066] INFO -- : [304/885] 1368421=test_integer I, [2024-05-21T19:19:53.867736 #1327066] INFO -- : [305/885] 1368426=desugar_compiler_test I, [2024-05-21T19:19:53.874147 #1327066] INFO -- : [306/885] 1368426=test_dryrun I, [2024-05-21T19:19:53.894049 #1327066] INFO -- : [307/885] 1368426=test_rdoc_attr I, [2024-05-21T19:19:53.894828 #1327066] INFO -- : [308/885] 1368416=test_env I, [2024-05-21T19:19:53.899130 #1327066] INFO -- : [309/885] 1368427=test_ractor I, [2024-05-21T19:19:53.904174 #1327066] INFO -- : [310/885] 1368426=test_dns I, [2024-05-21T19:19:53.924511 #1327066] INFO -- : [311/885] 1368427=test_gem_commands_open_command I, [2024-05-21T19:19:53.929880 #1327066] INFO -- : [312/885] 1368421=test_gem I, [2024-05-21T19:19:54.019153 #1327066] INFO -- : [313/885] 1368427=test_gem_source_lock I, [2024-05-21T19:19:54.070096 #1327066] INFO -- : [314/885] 1368427=test_registry I, [2024-05-21T19:19:54.070892 #1327066] INFO -- : [315/885] 1368427=parse_stream_test I, [2024-05-21T19:19:54.079431 #1327066] INFO -- : [316/885] 1368427=test_parser I, [2024-05-21T19:19:54.085055 #1327066] INFO -- : [317/885] 1368427=test_cgi_core I, [2024-05-21T19:19:54.096764 #1327066] INFO -- : [318/885] 1368427=test_singleton_function I, [2024-05-21T19:19:54.098761 #1327066] INFO -- : [319/885] 1368427=test_ancdata I, [2024-05-21T19:19:54.102417 #1327066] INFO -- : [320/885] 1368427=test_reline_key I, [2024-05-21T19:19:54.119847 #1327066] INFO -- : [321/885] 1368419=test_rb_str_dup I, [2024-05-21T19:19:54.120348 #1327066] INFO -- : [322/885] 1368419=test_weakref I, [2024-05-21T19:19:54.148360 #1327066] INFO -- : [323/885] 1368427=test_nonblock I, [2024-05-21T19:19:54.156833 #1327066] INFO -- : [324/885] 1368427=test_marshal I, [2024-05-21T19:19:54.295515 #1327066] INFO -- : [325/885] 1368419=test_unicode_normalize I, [2024-05-21T19:19:54.362104 #1327066] INFO -- : [326/885] 1368426=test_timeout I, [2024-05-21T19:19:54.375887 #1327066] INFO -- : [327/885] 1368425=test_alias I, [2024-05-21T19:19:54.465875 #1327066] INFO -- : [328/885] 1368429=test_ractor I, [2024-05-21T19:19:54.477765 #1327066] INFO -- : [329/885] 1368425=test_rendering I, [2024-05-21T19:19:54.513711 #1327066] INFO -- : [330/885] 1368427=test_debugger_integration I, [2024-05-21T19:19:54.522796 #1327066] INFO -- : [331/885] 1368427=test_my_integer I, [2024-05-21T19:19:54.526546 #1327066] INFO -- : [332/885] 1368427=test_thread I, [2024-05-21T19:19:54.526914 #1327066] INFO -- : [333/885] 1368433=json_ext_parser_test I, [2024-05-21T19:19:54.540145 #1327066] INFO -- : [334/885] 1368433=test_ssl I, [2024-05-21T19:19:54.553852 #1327066] INFO -- : [335/885] 1368425=test_udp I, [2024-05-21T19:19:54.570558 #1327066] INFO -- : [336/885] 1368425=test_force_exit I, [2024-05-21T19:19:54.581374 #1327066] INFO -- : [337/885] 1368420=test_file I, [2024-05-21T19:19:54.634343 #1327066] INFO -- : [338/885] 1368425=test_ostruct I, [2024-05-21T19:19:54.709495 #1327066] INFO -- : [339/885] 1368423=unescape_test I, [2024-05-21T19:19:54.822319 #1327066] INFO -- : [340/885] 1368425=test_data_error I, [2024-05-21T19:19:54.852579 #1327066] INFO -- : [341/885] 1368425=bom_test I, [2024-05-21T19:19:54.856881 #1327066] INFO -- : [342/885] 1368425=static_inspect_test I, [2024-05-21T19:19:54.860702 #1327066] INFO -- : [343/885] 1368425=test_regexp I, [2024-05-21T19:19:54.905697 #1327066] INFO -- : [344/885] 1368429=test_gem_commands_check_command I, [2024-05-21T19:19:54.923107 #1327066] INFO -- : [345/885] 1368429=errors_test I, [2024-05-21T19:19:55.029250 #1327066] INFO -- : [346/885] 1368433=test_tmpdir I, [2024-05-21T19:19:55.087387 #1327066] INFO -- : [347/885] 1368433=test_rdoc_markup_document I, [2024-05-21T19:19:55.091944 #1327066] INFO -- : [348/885] 1368429=test_integer_comb I, [2024-05-21T19:19:55.102533 #1327066] INFO -- : [349/885] 1368433=test_vm_dump I, [2024-05-21T19:19:55.105286 #1327066] INFO -- : [350/885] 1368433=test_rdoc_ri_paths I, [2024-05-21T19:19:55.135444 #1327066] INFO -- : [351/885] 1368433=library_symbols_test I, [2024-05-21T19:19:55.178165 #1327066] INFO -- : [352/885] 1368433=test_addr I, [2024-05-21T19:19:55.189569 #1327066] INFO -- : [353/885] 1368433=test_locale I, [2024-05-21T19:19:55.204011 #1327066] INFO -- : [354/885] 1368433=test_ensured I, [2024-05-21T19:19:55.252868 #1327066] INFO -- : [355/885] 1368426=test_ts I, [2024-05-21T19:19:55.269248 #1327066] INFO -- : [356/885] 1368431=test_encoding I, [2024-05-21T19:19:55.269464 #1327066] INFO -- : [357/885] 1368417=test_erb_command I, [2024-05-21T19:19:55.269763 #1327066] INFO -- : [358/885] 1368433=test_helper I, [2024-05-21T19:19:55.269968 #1327066] INFO -- : [359/885] 1368433=test_gem_uri_formatter I, [2024-05-21T19:19:55.286535 #1327066] INFO -- : [360/885] 1368433=test_pty I, [2024-05-21T19:19:55.318171 #1327066] INFO -- : [361/885] 1368417=test_dup I, [2024-05-21T19:19:55.490105 #1327066] INFO -- : [362/885] 1368431=test_constant I, [2024-05-21T19:19:55.523582 #1327066] INFO -- : [363/885] 1368417=command_line_test I, [2024-05-21T19:19:55.605884 #1327066] INFO -- : [364/885] 1368417=test_project_sanity I, [2024-05-21T19:19:55.626801 #1327066] INFO -- : [365/885] 1368418=test_range I, [2024-05-21T19:19:55.692736 #1327066] INFO -- : [366/885] 1368426=test_transcode I, [2024-05-21T19:19:55.763457 #1327066] INFO -- : [367/885] 1368433=json_generator_test I, [2024-05-21T19:19:55.809254 #1327066] INFO -- : [368/885] 1368422=test_eval I, [2024-05-21T19:19:55.817935 #1327066] INFO -- : [369/885] 1368421=test_enumerable I, [2024-05-21T19:19:55.823648 #1327066] INFO -- : [370/885] 1368421=test_gem_resolver_vendor_set I, [2024-05-21T19:19:55.829728 #1327066] INFO -- : [371/885] 1368433=test_config I, [2024-05-21T19:19:55.830125 #1327066] INFO -- : [372/885] 1368417=test_gem_resolver_api_set I, [2024-05-21T19:19:55.831731 #1327066] INFO -- : [373/885] 1368421=test_gem_safe_marshal I, [2024-05-21T19:19:55.903184 #1327066] INFO -- : [374/885] 1368426=test_jaro_winkler I, [2024-05-21T19:19:55.906554 #1327066] INFO -- : [375/885] 1368417=test_random_formatter I, [2024-05-21T19:19:55.906661 #1327066] INFO -- : [376/885] 1368426=test_helper I, [2024-05-21T19:19:55.908864 #1327066] INFO -- : [377/885] 1368426=test_lambda I, [2024-05-21T19:19:55.929976 #1327066] INFO -- : [378/885] 1368417=test_ast I, [2024-05-21T19:19:55.932994 #1327066] INFO -- : [379/885] 1368430=test_gem_request_set_gem_dependency_api I, [2024-05-21T19:19:55.985124 #1327066] INFO -- : [380/885] 1368426=test_webauthn_listener I, [2024-05-21T19:19:55.991957 #1327066] INFO -- : [381/885] 1368422=test_x509store I, [2024-05-21T19:19:56.068031 #1327066] INFO -- : [382/885] 1368426=test_rdoc_code_object I, [2024-05-21T19:19:56.159890 #1327066] INFO -- : [383/885] 1368430=test_fips I, [2024-05-21T19:19:56.248646 #1327066] INFO -- : [384/885] 1368415=test_x509name I, [2024-05-21T19:19:56.256956 #1327066] INFO -- : [385/885] 1368415=test_update I, [2024-05-21T19:19:56.259050 #1327066] INFO -- : [386/885] 1368422=test_win32ole_method I, [2024-05-21T19:19:56.261128 #1327066] INFO -- : [387/885] 1368415=test_delete I, [2024-05-21T19:19:56.262511 #1327066] INFO -- : [388/885] 1368422=test_keyword I, [2024-05-21T19:19:56.268191 #1327066] INFO -- : [389/885] 1368415=test_class_name_check I, [2024-05-21T19:19:56.271587 #1327066] INFO -- : [390/885] 1368421=test_continuation I, [2024-05-21T19:19:56.273436 #1327066] INFO -- : [391/885] 1368421=test_fd_setsize I, [2024-05-21T19:19:56.276255 #1327066] INFO -- : [392/885] 1368421=test_numhash I, [2024-05-21T19:19:56.279546 #1327066] INFO -- : [393/885] 1368421=test_weakkeymap I, [2024-05-21T19:19:56.292212 #1327066] INFO -- : [394/885] 1368415=test_gem_commands_push_command I, [2024-05-21T19:19:56.356989 #1327066] INFO -- : [395/885] 1368433=test_pkey_rsa I, [2024-05-21T19:19:56.359535 #1327066] INFO -- : [396/885] 1368418=test_gem_platform I, [2024-05-21T19:19:56.413480 #1327066] INFO -- : [397/885] 1368418=test_rdoc_markup_hard_break I, [2024-05-21T19:19:56.415653 #1327066] INFO -- : [398/885] 1368430=test_date_strptime I, [2024-05-21T19:19:56.453304 #1327066] INFO -- : [399/885] 1368426=test_gem_package_task I, [2024-05-21T19:19:56.464446 #1327066] INFO -- : [400/885] 1368426=test_placearg I, [2024-05-21T19:19:56.504772 #1327066] INFO -- : [401/885] 1368430=test_gem_resolver_lock_set I, [2024-05-21T19:19:56.512170 #1327066] INFO -- : [402/885] 1368421=test_not I, [2024-05-21T19:19:56.514187 #1327066] INFO -- : [403/885] 1368421=test_import I, [2024-05-21T19:19:56.556145 #1327066] INFO -- : [404/885] 1368430=test_rdoc_parser_markdown I, [2024-05-21T19:19:56.561794 #1327066] INFO -- : [405/885] 1368418=test_files_test I, [2024-05-21T19:19:56.568715 #1327066] INFO -- : [406/885] 1368430=test_gem_update_suggestion I, [2024-05-21T19:19:56.584758 #1327066] INFO -- : [407/885] 1368426=test_file_exhaustive I, [2024-05-21T19:19:56.589769 #1327066] INFO -- : [408/885] 1368416=test_logger I, [2024-05-21T19:19:56.618101 #1327066] INFO -- : [409/885] 1368416=test_gem_command_manager I, [2024-05-21T19:19:56.633367 #1327066] INFO -- : [410/885] 1368433=test_gem_gemcutter_utilities I, [2024-05-21T19:19:56.640154 #1327066] INFO -- : [411/885] 1368430=test_basicinstructions I, [2024-05-21T19:19:56.682571 #1327066] INFO -- : [412/885] 1368418=test_key_actor_emacs I, [2024-05-21T19:19:56.712399 #1327066] INFO -- : [413/885] 1368430=test_arithmetic_sequence I, [2024-05-21T19:19:56.727081 #1327066] INFO -- : [414/885] 1368430=test_object I, [2024-05-21T19:19:56.730759 #1327066] INFO -- : [415/885] 1368430=test_cgi_header I, [2024-05-21T19:19:56.743956 #1327066] INFO -- : [416/885] 1368430=heredoc_dedent_test I, [2024-05-21T19:19:56.765868 #1327066] INFO -- : [417/885] 1368416=version_test I, [2024-05-21T19:19:56.782114 #1327066] INFO -- : [418/885] 1368415=test_big5 I, [2024-05-21T19:19:56.786535 #1327066] INFO -- : [419/885] 1368415=test_func I, [2024-05-21T19:19:56.797611 #1327066] INFO -- : [420/885] 1368423=test_pointer I, [2024-05-21T19:19:56.814261 #1327066] INFO -- : [421/885] 1368430=test_type I, [2024-05-21T19:19:56.826424 #1327066] INFO -- : [422/885] 1368430=test_ractor I, [2024-05-21T19:19:56.836911 #1327066] INFO -- : [423/885] 1368418=test_tsort I, [2024-05-21T19:19:56.839851 #1327066] INFO -- : [424/885] 1368418=test_signedness I, [2024-05-21T19:19:56.865753 #1327066] INFO -- : [425/885] 1368416=test_rdoc_rd_block_parser I, [2024-05-21T19:19:56.872589 #1327066] INFO -- : [426/885] 1368422=test_normalize I, [2024-05-21T19:19:56.875225 #1327066] INFO -- : [427/885] 1368422=test_ossl I, [2024-05-21T19:19:56.885082 #1327066] INFO -- : [428/885] 1368430=test_timeout I, [2024-05-21T19:19:56.887843 #1327066] INFO -- : [429/885] 1368416=compiler_test I, [2024-05-21T19:19:56.889441 #1327066] INFO -- : [430/885] 1368430=test_flip I, [2024-05-21T19:19:56.892296 #1327066] INFO -- : [431/885] 1368416=test_change_word I, [2024-05-21T19:19:56.894109 #1327066] INFO -- : [432/885] 1368416=test_sleep I, [2024-05-21T19:19:56.924643 #1327066] INFO -- : [433/885] 1368430=test_gem_local_remote_options I, [2024-05-21T19:19:56.951330 #1327066] INFO -- : [434/885] 1368430=test_date_arith I, [2024-05-21T19:19:56.958872 #1327066] INFO -- : [435/885] 1368430=test_object I, [2024-05-21T19:19:56.987706 #1327066] INFO -- : [436/885] 1368433=test_ruby_lex I, [2024-05-21T19:19:57.106656 #1327066] INFO -- : [437/885] 1368433=test_kdf I, [2024-05-21T19:19:57.175930 #1327066] INFO -- : [438/885] 1368433=test_gem_doctor I, [2024-05-21T19:19:57.195931 #1327066] INFO -- : [439/885] 1368421=test_kernel I, [2024-05-21T19:19:57.218246 #1327066] INFO -- : [440/885] 1368433=test_eval_history I, [2024-05-21T19:19:57.226851 #1327066] INFO -- : [441/885] 1368433=dispatcher_test I, [2024-05-21T19:19:57.247859 #1327066] INFO -- : [442/885] 1368433=test_bug-5832 I, [2024-05-21T19:19:57.259276 #1327066] INFO -- : [443/885] 1368433=test_files_ext I, [2024-05-21T19:19:57.281098 #1327066] INFO -- : [444/885] 1368430=test_emitter I, [2024-05-21T19:19:57.290529 #1327066] INFO -- : [445/885] 1368430=test_gem_silent_ui I, [2024-05-21T19:19:57.305916 #1327066] INFO -- : [446/885] 1368423=test_object_create_start I, [2024-05-21T19:19:57.309289 #1327066] INFO -- : [447/885] 1368423=test_gem_ext_cargo_builder_unit I, [2024-05-21T19:19:57.315599 #1327066] INFO -- : [448/885] 1368430=test_date I, [2024-05-21T19:19:57.318663 #1327066] INFO -- : [449/885] 1368430=test_gem_rdoc I, [2024-05-21T19:19:57.329393 #1327066] INFO -- : [450/885] 1368423=test_command I, [2024-05-21T19:19:57.382505 #1327066] INFO -- : [451/885] 1368433=test_at_exit I, [2024-05-21T19:19:57.400446 #1327066] INFO -- : [452/885] 1368433=!Nothing_to_test I, [2024-05-21T19:19:57.402206 #1327066] INFO -- : [453/885] 1368433=test_enc_raise I, [2024-05-21T19:19:57.410225 #1327066] INFO -- : [454/885] 1368433=test_psych I, [2024-05-21T19:19:57.430921 #1327066] INFO -- : [455/885] 1368433=test_rdoc_markup_paragraph I, [2024-05-21T19:19:57.436613 #1327066] INFO -- : [456/885] 1368433=test_numeric I, [2024-05-21T19:19:57.442716 #1327066] INFO -- : [457/885] 1368430=test_gem_commands_lock_command I, [2024-05-21T19:19:57.453537 #1327066] INFO -- : [458/885] 1368430=test_ifunless I, [2024-05-21T19:19:57.456398 #1327066] INFO -- : [459/885] 1368430=test_assignment I, [2024-05-21T19:19:57.497546 #1327066] INFO -- : [460/885] 1368433=test_key_actor_vi I, [2024-05-21T19:19:57.545290 #1327066] INFO -- : [461/885] 1368429=test_bug-3571 I, [2024-05-21T19:19:57.566239 #1327066] INFO -- : [462/885] 1368429=test_gem_command I, [2024-05-21T19:19:57.589656 #1327066] INFO -- : [463/885] 1368423=test_gem_spec_fetcher I, [2024-05-21T19:19:57.598450 #1327066] INFO -- : [464/885] 1368433=test_common I, [2024-05-21T19:19:57.667595 #1327066] INFO -- : [465/885] 1368429=test_hmac I, [2024-05-21T19:19:57.673576 #1327066] INFO -- : [466/885] 1368429=test_rdoc_markup_to_tt_only I, [2024-05-21T19:19:57.706614 #1327066] INFO -- : [467/885] 1368423=test_rdoc_tom_doc I, [2024-05-21T19:19:57.720354 #1327066] INFO -- : [468/885] 1368423=test_nil I, [2024-05-21T19:19:57.725032 #1327066] INFO -- : [469/885] 1368433=test_num2int I, [2024-05-21T19:19:57.726192 #1327066] INFO -- : [470/885] 1368423=test_rdoc_single_class I, [2024-05-21T19:19:57.729936 #1327066] INFO -- : [471/885] 1368423=test_verbose I, [2024-05-21T19:19:57.733432 #1327066] INFO -- : [472/885] 1368433=test_gem_ext_configure_builder I, [2024-05-21T19:19:57.750217 #1327066] INFO -- : [473/885] 1368423=test_frozen I, [2024-05-21T19:19:57.751528 #1327066] INFO -- : [474/885] 1368431=test_pp I, [2024-05-21T19:19:57.755596 #1327066] INFO -- : [475/885] 1368423=test_macro I, [2024-05-21T19:19:57.756597 #1327066] INFO -- : [476/885] 1368433=test_iter_break I, [2024-05-21T19:19:57.759874 #1327066] INFO -- : [477/885] 1368423=test_zsh_completion I, [2024-05-21T19:19:57.760336 #1327066] INFO -- : [478/885] 1368423=test_exception I, [2024-05-21T19:19:57.761456 #1327066] INFO -- : [479/885] 1368433=test_rdoc_token_stream I, [2024-05-21T19:19:57.768406 #1327066] INFO -- : [480/885] 1368423=test_address_resolve I, [2024-05-21T19:19:57.774354 #1327066] INFO -- : [481/885] 1368433=test_config I, [2024-05-21T19:19:57.779890 #1327066] INFO -- : [482/885] 1368423=test_gem_source_list I, [2024-05-21T19:19:57.785322 #1327066] INFO -- : [483/885] 1368421=test_yaml_special_cases I, [2024-05-21T19:19:57.785416 #1327066] INFO -- : [484/885] 1368431=test_optarg I, [2024-05-21T19:19:57.790463 #1327066] INFO -- : [485/885] 1368433=test_gem_validator I, [2024-05-21T19:19:57.793954 #1327066] INFO -- : [486/885] 1368421=test_require_path_check I, [2024-05-21T19:19:57.809268 #1327066] INFO -- : [487/885] 1368433=test_rdoc_markup_parser I, [2024-05-21T19:19:57.851377 #1327066] INFO -- : [488/885] 1368433=test_folderitem2_invokeverb I, [2024-05-21T19:19:57.854400 #1327066] INFO -- : [489/885] 1368433=test_files_test_2 I, [2024-05-21T19:19:57.855402 #1327066] INFO -- : [490/885] 1368433=test_fnmatch I, [2024-05-21T19:19:57.858632 #1327066] INFO -- : [491/885] 1368429=test_egrep_cpp I, [2024-05-21T19:19:57.859308 #1327066] INFO -- : [492/885] 1368423=test_cgi_tag_helper I, [2024-05-21T19:19:57.879998 #1327066] INFO -- : [493/885] 1368423=test_zlib I, [2024-05-21T19:19:57.886844 #1327066] INFO -- : [494/885] 1368433=test_date_conv I, [2024-05-21T19:19:57.892518 #1327066] INFO -- : [495/885] 1368433=test_optimization I, [2024-05-21T19:19:57.893973 #1327066] INFO -- : [496/885] 1368431=test_erb_m17n I, [2024-05-21T19:19:57.902054 #1327066] INFO -- : [497/885] 1368431=test_ole_methods I, [2024-05-21T19:19:57.908458 #1327066] INFO -- : [498/885] 1368431=test_gc_compact I, [2024-05-21T19:19:57.912236 #1327066] INFO -- : [499/885] 1368421=test_proc I, [2024-05-21T19:19:57.995662 #1327066] INFO -- : [500/885] 1368429=test_string I, [2024-05-21T19:19:58.082783 #1327066] INFO -- : [501/885] 1368419=test_gem_package_old I, [2024-05-21T19:19:58.119144 #1327066] INFO -- : [502/885] 1368419=test_gem_resolver_index_set I, [2024-05-21T19:19:58.144388 #1327066] INFO -- : [503/885] 1368419=json_addition_test I, [2024-05-21T19:19:58.156615 #1327066] INFO -- : [504/885] 1368419=test_custom_command I, [2024-05-21T19:19:58.244694 #1327066] INFO -- : [505/885] 1368419=test_gem_dependency_resolution_error I, [2024-05-21T19:19:58.254977 #1327066] INFO -- : [506/885] 1368419=test_rdoc_parser I, [2024-05-21T19:19:58.282846 #1327066] INFO -- : [507/885] 1368419=test_qsort I, [2024-05-21T19:19:58.284365 #1327066] INFO -- : [508/885] 1368419=test_rdoc_stats I, [2024-05-21T19:19:58.330804 #1327066] INFO -- : [509/885] 1368419=test_pattern_matching I, [2024-05-21T19:19:58.347947 #1327066] INFO -- : [510/885] 1368419=test_string I, [2024-05-21T19:19:58.372811 #1327066] INFO -- : [511/885] 1368419=test_rdoc_store I, [2024-05-21T19:19:58.380918 #1327066] INFO -- : [512/885] 1368430=test_raise I, [2024-05-21T19:19:58.385149 #1327066] INFO -- : [513/885] 1368430=test_x509attr I, [2024-05-21T19:19:58.388841 #1327066] INFO -- : [514/885] 1368430=test_gem_request_set_lockfile_parser I, [2024-05-21T19:19:58.494441 #1327066] INFO -- : [515/885] 1368430=test_depth_first I, [2024-05-21T19:19:58.497063 #1327066] INFO -- : [516/885] 1368430=test_date_parse I, [2024-05-21T19:19:58.594070 #1327066] INFO -- : [517/885] 1368424=test_trick I, [2024-05-21T19:19:58.608849 #1327066] INFO -- : [518/885] 1368430=test_thread I, [2024-05-21T19:19:58.611027 #1327066] INFO -- : [519/885] 1368430=test_pipe I, [2024-05-21T19:19:58.744711 #1327066] INFO -- : [520/885] 1368421=test_pkey_ec I, [2024-05-21T19:19:58.750035 #1327066] INFO -- : [521/885] 1368430=test_mul I, [2024-05-21T19:19:58.762457 #1327066] INFO -- : [522/885] 1368430=test_win32ole_type I, [2024-05-21T19:19:58.764773 #1327066] INFO -- : [523/885] 1368430=test_null I, [2024-05-21T19:19:58.768363 #1327066] INFO -- : [524/885] 1368430=test_default_gems I, [2024-05-21T19:19:58.823412 #1327066] INFO -- : [525/885] 1368421=test_rdoc_rd_inline_parser I, [2024-05-21T19:19:58.824467 #1327066] INFO -- : [526/885] 1368430=test_rdoc_markup_to_rdoc I, [2024-05-21T19:19:58.843563 #1327066] INFO -- : [527/885] 1368421=test_rdoc_markup_attributes I, [2024-05-21T19:19:58.850121 #1327066] INFO -- : [528/885] 1368421=test_windows_1251 I, [2024-05-21T19:19:58.854020 #1327066] INFO -- : [529/885] 1368421=test_time I, [2024-05-21T19:19:58.857806 #1327066] INFO -- : [530/885] 1368430=test_rdoc_rdoc I, [2024-05-21T19:19:58.935611 #1327066] INFO -- : [531/885] 1368430=test_gem_uninstaller I, [2024-05-21T19:19:58.982108 #1327066] INFO -- : [532/885] 1368421=test_gb18030 I, [2024-05-21T19:19:58.991939 #1327066] INFO -- : [533/885] 1368421=test_svcb_https I, [2024-05-21T19:19:59.001248 #1327066] INFO -- : [534/885] 1368421=test_buffering I, [2024-05-21T19:19:59.008779 #1327066] INFO -- : [535/885] 1368421=test_io_buffer I, [2024-05-21T19:19:59.041611 #1327066] INFO -- : [536/885] 1368432=test_defined I, [2024-05-21T19:19:59.047694 #1327066] INFO -- : [537/885] 1368421=test_backtrace I, [2024-05-21T19:19:59.053195 #1327066] INFO -- : [538/885] 1368421=test_key_name_check I, [2024-05-21T19:19:59.064008 #1327066] INFO -- : [539/885] 1368421=test_rdoc_i18n_text I, [2024-05-21T19:19:59.077249 #1327066] INFO -- : [540/885] 1368421=test_exception I, [2024-05-21T19:19:59.126068 #1327066] INFO -- : [541/885] 1368432=test_bug_reporter I, [2024-05-21T19:19:59.126218 #1327066] INFO -- : [542/885] 1368419=test_gem_package_tar_reader_entry I, [2024-05-21T19:19:59.142011 #1327066] INFO -- : [543/885] 1368415=test_gem_name_tuple I, [2024-05-21T19:19:59.153337 #1327066] INFO -- : [544/885] 1368415=test_rand I, [2024-05-21T19:19:59.227999 #1327066] INFO -- : [545/885] 1368418=test_rdoc_cross_reference I, [2024-05-21T19:19:59.377280 #1327066] INFO -- : [546/885] 1368419=test_gem_commands_info_command I, [2024-05-21T19:19:59.403225 #1327066] INFO -- : [547/885] 1368419=test_gem_dependency_installer I, [2024-05-21T19:19:59.472078 #1327066] INFO -- : [548/885] 1368415=test_scalar I, [2024-05-21T19:19:59.476259 #1327066] INFO -- : [549/885] 1368415=test_case_options I, [2024-05-21T19:19:59.480162 #1327066] INFO -- : [550/885] 1368432=test_store I, [2024-05-21T19:19:59.484807 #1327066] INFO -- : [551/885] 1368415=test_win32ole I, [2024-05-21T19:19:59.490378 #1327066] INFO -- : [552/885] 1368415=test_generic I, [2024-05-21T19:19:59.517525 #1327066] INFO -- : [553/885] 1368415=test_scan_args I, [2024-05-21T19:19:59.551050 #1327066] INFO -- : [554/885] 1368415=test_enumerator_kw I, [2024-05-21T19:19:59.553642 #1327066] INFO -- : [555/885] 1368415=test_settracefunc I, [2024-05-21T19:19:59.654024 #1327066] INFO -- : [556/885] 1368432=test_gem_text I, [2024-05-21T19:19:59.692229 #1327066] INFO -- : [557/885] 1368432=test_gem_commands_mirror I, [2024-05-21T19:19:59.698234 #1327066] INFO -- : [558/885] 1368432=test_gem_ext_cargo_builder_link_flag_converter I, [2024-05-21T19:19:59.753278 #1327066] INFO -- : [559/885] 1368432=test_method_cache I, [2024-05-21T19:19:59.760381 #1327066] INFO -- : [560/885] 1368432=test_gem_request I, [2024-05-21T19:19:59.777176 #1327066] INFO -- : [561/885] 1368418=test_sprintf_comb I, [2024-05-21T19:19:59.908271 #1327066] INFO -- : [562/885] 1368418=test_memory_view I, [2024-05-21T19:19:59.911650 #1327066] INFO -- : [563/885] 1368432=test_m17n_comb I, [2024-05-21T19:19:59.938739 #1327066] INFO -- : [564/885] 1368430=test_ractor I, [2024-05-21T19:20:00.018634 #1327066] INFO -- : [565/885] 1368430=test_ansi_with_terminfo I, [2024-05-21T19:20:00.020137 #1327066] INFO -- : [566/885] 1368430=test_rdoc_generator_pot_po I, [2024-05-21T19:20:00.023414 #1327066] INFO -- : [567/885] 1368418=test_rdoc_markup_to_markdown I, [2024-05-21T19:20:00.026503 #1327066] INFO -- : [568/885] 1368430=test_json_tree I, [2024-05-21T19:20:00.029384 #1327066] INFO -- : [569/885] 1368430=test_case I, [2024-05-21T19:20:00.029784 #1327066] INFO -- : [570/885] 1368430=test_pkey I, [2024-05-21T19:20:00.055016 #1327066] INFO -- : [571/885] 1368418=test_parser_events I, [2024-05-21T19:20:00.079494 #1327066] INFO -- : [572/885] 1368430=test_reline I, [2024-05-21T19:20:00.122180 #1327066] INFO -- : [573/885] 1368418=test_cclass I, [2024-05-21T19:20:00.253532 #1327066] INFO -- : [574/885] 1368418=test_grapheme_breaks I, [2024-05-21T19:20:00.285909 #1327066] INFO -- : [575/885] 1368418=test_gem_version_option I, [2024-05-21T19:20:00.324536 #1327066] INFO -- : [576/885] 1368418=test_gem_request_connection_pools I, [2024-05-21T19:20:00.333431 #1327066] INFO -- : [577/885] 1368431=test_literal I, [2024-05-21T19:20:00.383576 #1327066] INFO -- : [578/885] 1368430=test_dot_dot I, [2024-05-21T19:20:00.386927 #1327066] INFO -- : [579/885] 1368430=test_c_struct_builder I, [2024-05-21T19:20:00.532736 #1327066] INFO -- : [580/885] 1368430=test_str2big I, [2024-05-21T19:20:00.533965 #1327066] INFO -- : [581/885] 1368430=test_rdoc_markup_to_table_of_contents I, [2024-05-21T19:20:00.558416 #1327066] INFO -- : [582/885] 1368430=test_objectspace I, [2024-05-21T19:20:00.636990 #1327066] INFO -- : [583/885] 1368420=test_thread I, [2024-05-21T19:20:00.640309 #1327066] INFO -- : [584/885] 1368424=test_socket I, [2024-05-21T19:20:00.657890 #1327066] INFO -- : [585/885] 1368415=test_ractor I, [2024-05-21T19:20:00.665499 #1327066] INFO -- : [586/885] 1368415=test_severity I, [2024-05-21T19:20:00.673416 #1327066] INFO -- : [587/885] 1368415=test_gem_install_update_options I, [2024-05-21T19:20:00.761079 #1327066] INFO -- : [588/885] 1368431=parse_test I, [2024-05-21T19:20:00.764571 #1327066] INFO -- : [589/885] 1368415=test_require_lib I, [2024-05-21T19:20:00.857044 #1327066] INFO -- : [590/885] 1368420=test_rdoc_generator_ri I, [2024-05-21T19:20:00.871707 #1327066] INFO -- : [591/885] 1368420=test_extlibs I, [2024-05-21T19:20:00.889878 #1327066] INFO -- : [592/885] 1368421=test_gem_stream_ui I, [2024-05-21T19:20:00.937028 #1327066] INFO -- : [593/885] 1368421=newline_test I, [2024-05-21T19:20:01.036390 #1327066] INFO -- : [594/885] 1368421=test_uncorrectable_name_check I, [2024-05-21T19:20:01.038187 #1327066] INFO -- : [595/885] 1368421=test_stringchar I, [2024-05-21T19:20:01.089931 #1327066] INFO -- : [596/885] 1368421=test_hash_create I, [2024-05-21T19:20:01.090583 #1327066] INFO -- : [597/885] 1368421=test_passing_block I, [2024-05-21T19:20:01.095426 #1327066] INFO -- : [598/885] 1368421=test_thread_fd_close I, [2024-05-21T19:20:01.101771 #1327066] INFO -- : [599/885] 1368421=test_securerandom I, [2024-05-21T19:20:01.136215 #1327066] INFO -- : [600/885] 1368421=test_logperiod I, [2024-05-21T19:20:01.146604 #1327066] INFO -- : [601/885] 1368421=test_rdoc_markdown_test I, [2024-05-21T19:20:01.362592 #1327066] INFO -- : [602/885] 1368418=test_rdoc_normal_module I, [2024-05-21T19:20:01.403428 #1327066] INFO -- : [603/885] 1368423=test_c_union_entity I, [2024-05-21T19:20:01.411457 #1327066] INFO -- : [604/885] 1368430=test_singleton I, [2024-05-21T19:20:01.411930 #1327066] INFO -- : [605/885] 1368418=test_flush I, [2024-05-21T19:20:01.416735 #1327066] INFO -- : [606/885] 1368430=test_io_console I, [2024-05-21T19:20:01.416963 #1327066] INFO -- : [607/885] 1368418=test_switch_hitter I, [2024-05-21T19:20:01.430660 #1327066] INFO -- : [608/885] 1368418=test_arity I, [2024-05-21T19:20:01.435608 #1327066] INFO -- : [609/885] 1368418=test_gem_ext_rake_builder I, [2024-05-21T19:20:01.459013 #1327066] INFO -- : [610/885] 1368423=test_logdevice I, [2024-05-21T19:20:01.593733 #1327066] INFO -- : [611/885] 1368419=test_gem_resolver_lock_specification I, [2024-05-21T19:20:01.620410 #1327066] INFO -- : [612/885] 1368419=test_err_in_callback I, [2024-05-21T19:20:01.625928 #1327066] INFO -- : [613/885] 1368419=test_x509cert I, [2024-05-21T19:20:01.809832 #1327066] INFO -- : [614/885] 1368424=test_gc I, [2024-05-21T19:20:01.910073 #1327066] INFO -- : [615/885] 1368416=test_last_thread I, [2024-05-21T19:20:01.939521 #1327066] INFO -- : [616/885] 1368419=test_process I, [2024-05-21T19:20:02.018935 #1327066] INFO -- : [617/885] 1368418=test_pack I, [2024-05-21T19:20:02.186736 #1327066] INFO -- : [618/885] 1368418=test_gem_security_policy I, [2024-05-21T19:20:02.236466 #1327066] INFO -- : [619/885] 1368423=test_gem_source_local I, [2024-05-21T19:20:02.392795 #1327066] INFO -- : [620/885] 1368418=test_gem_commands_dependency_command I, [2024-05-21T19:20:02.448623 #1327066] INFO -- : [621/885] 1368420=test_gem_resolver I, [2024-05-21T19:20:02.457642 #1327066] INFO -- : [622/885] 1368423=test_gem_resolver_composed_set I, [2024-05-21T19:20:02.466135 #1327066] INFO -- : [623/885] 1368418=test_safe_load I, [2024-05-21T19:20:02.469966 #1327066] INFO -- : [624/885] 1368423=test_name_error I, [2024-05-21T19:20:02.477607 #1327066] INFO -- : [625/885] 1368418=test_rdoc_markup_attribute_manager I, [2024-05-21T19:20:02.501506 #1327066] INFO -- : [626/885] 1368418=test_http I, [2024-05-21T19:20:02.521252 #1327066] INFO -- : [627/885] 1368418=test_gem_commands_which_command I, [2024-05-21T19:20:02.546160 #1327066] INFO -- : [628/885] 1368426=test_shift_jis I, [2024-05-21T19:20:02.547297 #1327066] INFO -- : [629/885] 1368418=test_flags I, [2024-05-21T19:20:02.549415 #1327066] INFO -- : [630/885] 1368426=test_inadvertent_creation I, [2024-05-21T19:20:02.580831 #1327066] INFO -- : [631/885] 1368423=test_enumerator I, [2024-05-21T19:20:02.644643 #1327066] INFO -- : [632/885] 1368426=test_gem_commands_specification_command I, [2024-05-21T19:20:02.664601 #1327066] INFO -- : [633/885] 1368420=test_tcp I, [2024-05-21T19:20:02.696320 #1327066] INFO -- : [634/885] 1368421=test_iso_8859 I, [2024-05-21T19:20:02.701810 #1327066] INFO -- : [635/885] 1368420=test_rdoc_text I, [2024-05-21T19:20:02.732876 #1327066] INFO -- : [636/885] 1368421=test_syntax I, [2024-05-21T19:20:02.742480 #1327066] INFO -- : [637/885] 1368420=test_gem_safe_yaml I, [2024-05-21T19:20:02.752630 #1327066] INFO -- : [638/885] 1368420=test_require I, [2024-05-21T19:20:02.758391 #1327066] INFO -- : [639/885] 1368420=test_rdoc_markup_to_joined_paragraph I, [2024-05-21T19:20:02.759449 #1327066] INFO -- : [640/885] 1368420=test_date_time I, [2024-05-21T19:20:02.768507 #1327066] INFO -- : [641/885] 1368420=index_write_test I, [2024-05-21T19:20:02.768643 #1327066] INFO -- : [642/885] 1368426=test_date_new I, [2024-05-21T19:20:02.772066 #1327066] INFO -- : [643/885] 1368420=test_data I, [2024-05-21T19:20:02.776057 #1327066] INFO -- : [644/885] 1368426=test_open-uri I, [2024-05-21T19:20:02.779249 #1327066] INFO -- : [645/885] 1368420=test_httpresponse I, [2024-05-21T19:20:02.799311 #1327066] INFO -- : [646/885] 1368420=test_rdoc_parser_ruby I, [2024-05-21T19:20:02.811949 #1327066] INFO -- : [647/885] 1368432=test_rdoc_context I, [2024-05-21T19:20:02.968175 #1327066] INFO -- : [648/885] 1368416=test_nil2vtempty I, [2024-05-21T19:20:02.971164 #1327066] INFO -- : [649/885] 1368416=test_stream I, [2024-05-21T19:20:02.977834 #1327066] INFO -- : [650/885] 1368416=test_irb I, [2024-05-21T19:20:03.063044 #1327066] INFO -- : [651/885] 1368428=test_random I, [2024-05-21T19:20:03.073853 #1327066] INFO -- : [652/885] 1368428=test_asn1 I, [2024-05-21T19:20:03.096993 #1327066] INFO -- : [653/885] 1368428=test_class I, [2024-05-21T19:20:03.163315 #1327066] INFO -- : [654/885] 1368426=test_rdoc_normal_class I, [2024-05-21T19:20:03.212338 #1327066] INFO -- : [655/885] 1368416=test_const I, [2024-05-21T19:20:03.216490 #1327066] INFO -- : [656/885] 1368416=json_string_matching_test I, [2024-05-21T19:20:03.218350 #1327066] INFO -- : [657/885] 1368426=test_load I, [2024-05-21T19:20:03.222083 #1327066] INFO -- : [658/885] 1368416=test_gem_installer I, [2024-05-21T19:20:03.227665 #1327066] INFO -- : [659/885] 1368426=test_yamlstore I, [2024-05-21T19:20:03.237183 #1327066] INFO -- : [660/885] 1368426=test_rdoc_parser_rd I, [2024-05-21T19:20:03.260120 #1327066] INFO -- : [661/885] 1368426=test_date_strftime I, [2024-05-21T19:20:03.348825 #1327066] INFO -- : [662/885] 1368420=test_gem_resolver_index_specification I, [2024-05-21T19:20:03.388284 #1327066] INFO -- : [663/885] 1368427=test_internal_ivar I, [2024-05-21T19:20:03.390005 #1327066] INFO -- : [664/885] 1368420=test_rdoc_markup I, [2024-05-21T19:20:03.390458 #1327066] INFO -- : [665/885] 1368427=test_gem_commands_help_command I, [2024-05-21T19:20:03.401695 #1327066] INFO -- : [666/885] 1368420=test_tracepoint I, [2024-05-21T19:20:03.490473 #1327066] INFO -- : [667/885] 1368427=test_prettyprint I, [2024-05-21T19:20:03.515041 #1327066] INFO -- : [668/885] 1368418=test_utf32 I, [2024-05-21T19:20:03.521441 #1327066] INFO -- : [669/885] 1368418=test_basicsocket I, [2024-05-21T19:20:03.535944 #1327066] INFO -- : [670/885] 1368427=test_duplicate I, [2024-05-21T19:20:03.543455 #1327066] INFO -- : [671/885] 1368418=parse_comments_test I, [2024-05-21T19:20:03.560701 #1327066] INFO -- : [672/885] 1368427=test_noarg I, [2024-05-21T19:20:03.584835 #1327066] INFO -- : [673/885] 1368431=test_tempfile I, [2024-05-21T19:20:03.612301 #1327066] INFO -- : [674/885] 1368426=test_function I, [2024-05-21T19:20:03.631972 #1327066] INFO -- : [675/885] 1368418=test_queue I, [2024-05-21T19:20:03.643306 #1327066] INFO -- : [676/885] 1368418=test_emitter I, [2024-05-21T19:20:03.643623 #1327066] INFO -- : [677/885] 1368420=test_resource I, [2024-05-21T19:20:03.647660 #1327066] INFO -- : [678/885] 1368418=test_gem_commands_signin_command I, [2024-05-21T19:20:03.653982 #1327066] INFO -- : [679/885] 1368420=test_ldap I, [2024-05-21T19:20:03.657045 #1327066] INFO -- : [680/885] 1368420=test_fileutils I, [2024-05-21T19:20:03.724539 #1327066] INFO -- : [681/885] 1368432=test_string_processing I, [2024-05-21T19:20:03.733163 #1327066] INFO -- : [682/885] 1368427=test_rdoc_options I, [2024-05-21T19:20:03.734906 #1327066] INFO -- : [683/885] 1368432=test_econv I, [2024-05-21T19:20:03.738722 #1327066] INFO -- : [684/885] 1368418=test_cesu8 I, [2024-05-21T19:20:03.742838 #1327066] INFO -- : [685/885] 1368418=test_gem_version I, [2024-05-21T19:20:03.812443 #1327066] INFO -- : [686/885] 1368418=test_too_many_dummy_encodings I, [2024-05-21T19:20:03.839491 #1327066] INFO -- : [687/885] 1368431=test_stack I, [2024-05-21T19:20:03.872891 #1327066] INFO -- : [688/885] 1368418=test_gem_commands_list_command I, [2024-05-21T19:20:03.889483 #1327066] INFO -- : [689/885] 1368426=test_reqarg I, [2024-05-21T19:20:03.889669 #1327066] INFO -- : [690/885] 1368418=test_rdoc_include I, [2024-05-21T19:20:03.929381 #1327066] INFO -- : [691/885] 1368418=test_gem_resolver_installed_specification I, [2024-05-21T19:20:03.963514 #1327066] INFO -- : [692/885] 1368418=test_scanner_events I, [2024-05-21T19:20:03.976369 #1327066] INFO -- : [693/885] 1368427=test_gem_remote_fetcher I, [2024-05-21T19:20:03.991981 #1327066] INFO -- : [694/885] 1368418=test_mdns I, [2024-05-21T19:20:04.008320 #1327066] INFO -- : [695/885] 1368418=test_parse I, [2024-05-21T19:20:04.024660 #1327066] INFO -- : [696/885] 1368430=test_gem_resolver_specification I, [2024-05-21T19:20:04.058289 #1327066] INFO -- : [697/885] 1368430=test_gem_dependency I, [2024-05-21T19:20:04.098193 #1327066] INFO -- : [698/885] 1368420=test_path_to_class I, [2024-05-21T19:20:04.102029 #1327066] INFO -- : [699/885] 1368420=test_inlinecache I, [2024-05-21T19:20:04.162258 #1327066] INFO -- : [700/885] 1368415=test_rdoc_markup_verbatim I, [2024-05-21T19:20:04.166194 #1327066] INFO -- : [701/885] 1368430=test_gem_commands_search_command I, [2024-05-21T19:20:04.176793 #1327066] INFO -- : [702/885] 1368430=test_complex I, [2024-05-21T19:20:04.185967 #1327066] INFO -- : [703/885] 1368420=test_gem_ext_ext_conf_builder I, [2024-05-21T19:20:04.187111 #1327066] INFO -- : [704/885] 1368415=test_gem_stub_specification I, [2024-05-21T19:20:04.244323 #1327066] INFO -- : [705/885] 1368426=test_method_cache I, [2024-05-21T19:20:04.248824 #1327066] INFO -- : [706/885] 1368426=test_frozen_error I, [2024-05-21T19:20:04.250638 #1327066] INFO -- : [707/885] 1368426=test_ansi_without_terminfo I, [2024-05-21T19:20:04.264668 #1327066] INFO -- : [708/885] 1368426=test_gem_commands_sources_command I, [2024-05-21T19:20:04.295392 #1327066] INFO -- : [709/885] 1368430=test_bmethod I, [2024-05-21T19:20:04.298939 #1327066] INFO -- : [710/885] 1368430=test_euc_tw I, [2024-05-21T19:20:04.304610 #1327066] INFO -- : [711/885] 1368430=test_ractor I, [2024-05-21T19:20:04.320348 #1327066] INFO -- : [712/885] 1368430=test_rdoc_markup_formatter I, [2024-05-21T19:20:04.327866 #1327066] INFO -- : [713/885] 1368430=test_nowrite I, [2024-05-21T19:20:04.357215 #1327066] INFO -- : [714/885] 1368430=test_thread_queue I, [2024-05-21T19:20:04.378145 #1327066] INFO -- : [715/885] 1368415=test_wait I, [2024-05-21T19:20:04.412088 #1327066] INFO -- : [716/885] 1368426=test_handle I, [2024-05-21T19:20:04.456107 #1327066] INFO -- : [717/885] 1368415=test_yaml I, [2024-05-21T19:20:04.539285 #1327066] INFO -- : [718/885] 1368415=test_forwardable I, [2024-05-21T19:20:04.559731 #1327066] INFO -- : [719/885] 1368415=test_big2str I, [2024-05-21T19:20:04.564375 #1327066] INFO -- : [720/885] 1368415=test_profile_frames I, [2024-05-21T19:20:04.673577 #1327066] INFO -- : [721/885] 1368418=test_pstore I, [2024-05-21T19:20:04.722126 #1327066] INFO -- : [722/885] 1368418=test_cstr I, [2024-05-21T19:20:04.738317 #1327066] INFO -- : [723/885] 1368415=test_enc_str_buf_cat I, [2024-05-21T19:20:04.739089 #1327066] INFO -- : [724/885] 1368415=test_gbk I, [2024-05-21T19:20:04.747813 #1327066] INFO -- : [725/885] 1368415=test_class2name I, [2024-05-21T19:20:04.761689 #1327066] INFO -- : [726/885] 1368415=test_rdoc_parser_c I, [2024-05-21T19:20:04.765567 #1327066] INFO -- : [727/885] 1368426=test_comparable I, [2024-05-21T19:20:04.773163 #1327066] INFO -- : [728/885] 1368426=test_shapes I, [2024-05-21T19:20:04.781540 #1327066] INFO -- : [729/885] 1368426=json_fixtures_test I, [2024-05-21T19:20:04.788321 #1327066] INFO -- : [730/885] 1368426=test_io_timeout I, [2024-05-21T19:20:04.793879 #1327066] INFO -- : [731/885] 1368426=test_find I, [2024-05-21T19:20:04.808621 #1327066] INFO -- : [732/885] 1368426=test_ractor I, [2024-05-21T19:20:04.849107 #1327066] INFO -- : [733/885] 1368432=test_wss I, [2024-05-21T19:20:04.855356 #1327066] INFO -- : [734/885] 1368432=test_fiddle I, [2024-05-21T19:20:04.886250 #1327066] INFO -- : [735/885] 1368425=test_cgi_util I, [2024-05-21T19:20:04.947020 #1327066] INFO -- : [736/885] 1368426=test_require I, [2024-05-21T19:20:04.954312 #1327066] INFO -- : [737/885] 1368432=test_gem_ext_cmake_builder I, [2024-05-21T19:20:04.974365 #1327066] INFO -- : [738/885] 1368432=test_gem_commands_contents_command I, [2024-05-21T19:20:04.983597 #1327066] INFO -- : [739/885] 1368415=test_digest I, [2024-05-21T19:20:05.019429 #1327066] INFO -- : [740/885] 1368431=test_marshalable I, [2024-05-21T19:20:05.023811 #1327066] INFO -- : [741/885] 1368431=test_gem_source_vendor I, [2024-05-21T19:20:05.030761 #1327066] INFO -- : [742/885] 1368431=test_gem_commands_owner_command I, [2024-05-21T19:20:05.072643 #1327066] INFO -- : [743/885] 1368432=test_recorder I, [2024-05-21T19:20:05.078682 #1327066] INFO -- : [744/885] 1368432=test_formatter I, [2024-05-21T19:20:05.086544 #1327066] INFO -- : [745/885] 1368432=test_bash_completion I, [2024-05-21T19:20:05.093108 #1327066] INFO -- : [746/885] 1368432=test_deprecate I, [2024-05-21T19:20:05.111227 #1327066] INFO -- : [747/885] 1368425=test_rdoc_constant I, [2024-05-21T19:20:05.122497 #1327066] INFO -- : [748/885] 1368432=test_file I, [2024-05-21T19:20:05.128762 #1327066] INFO -- : [749/885] 1368432=test_rdoc_markdown I, [2024-05-21T19:20:05.340992 #1327066] INFO -- : [750/885] 1368425=test_gem_available_set I, [2024-05-21T19:20:05.432645 #1327066] INFO -- : [751/885] 1368432=test_rdoc_any_method I, [2024-05-21T19:20:05.441326 #1327066] INFO -- : [752/885] 1368425=test_modify_expand I, [2024-05-21T19:20:05.444722 #1327066] INFO -- : [753/885] 1368425=test_init I, [2024-05-21T19:20:05.460895 #1327066] INFO -- : [754/885] 1368433=test_complexrational I, [2024-05-21T19:20:05.467076 #1327066] INFO -- : [755/885] 1368433=test_pathname I, [2024-05-21T19:20:05.529784 #1327066] INFO -- : [756/885] 1368422=test_coverage I, [2024-05-21T19:20:05.557350 #1327066] INFO -- : [757/885] 1368420=test_rdoc_encoding I, [2024-05-21T19:20:05.589359 #1327066] INFO -- : [758/885] 1368420=regexp_test I, [2024-05-21T19:20:05.597468 #1327066] INFO -- : [759/885] 1368420=test_gem_package_tar_reader I, [2024-05-21T19:20:05.629607 #1327066] INFO -- : [760/885] 1368431=test_ripper I, [2024-05-21T19:20:05.637146 #1327066] INFO -- : [761/885] 1368420=test_gem_config_file I, [2024-05-21T19:20:05.666534 #1327066] INFO -- : [762/885] 1368418=test_gem_resolver_activation_request I, [2024-05-21T19:20:05.680212 #1327066] INFO -- : [763/885] 1368418=test_getopts I, [2024-05-21T19:20:05.686278 #1327066] INFO -- : [764/885] 1368418=test_protocol I, [2024-05-21T19:20:05.706900 #1327066] INFO -- : [765/885] 1368433=test_yjit_exit_locations I, [2024-05-21T19:20:05.708472 #1327066] INFO -- : [766/885] 1368433=test_etc I, [2024-05-21T19:20:05.734184 #1327066] INFO -- : [767/885] 1368420=test_pkcs12 I, [2024-05-21T19:20:05.787475 #1327066] INFO -- : [768/885] 1368432=test_system I, [2024-05-21T19:20:05.799118 #1327066] INFO -- : [769/885] 1368433=test_pkey_dh I, [2024-05-21T19:20:05.832752 #1327066] INFO -- : [770/885] 1368415=test_bigzero I, [2024-05-21T19:20:05.836290 #1327066] INFO -- : [771/885] 1368425=test_gem_util I, [2024-05-21T19:20:05.838522 #1327066] INFO -- : [772/885] 1368415=test_iseq_load I, [2024-05-21T19:20:05.866598 #1327066] INFO -- : [773/885] 1368428=test_gem_package_tar_header I, [2024-05-21T19:20:05.917859 #1327066] INFO -- : [774/885] 1368428=test_utf16 I, [2024-05-21T19:20:05.923238 #1327066] INFO -- : [775/885] 1368433=test_autoload I, [2024-05-21T19:20:05.932135 #1327066] INFO -- : [776/885] 1368428=test_unicode_escape I, [2024-05-21T19:20:05.982725 #1327066] INFO -- : [777/885] 1368428=test_io I, [2024-05-21T19:20:05.995154 #1327066] INFO -- : [778/885] 1368418=test_face I, [2024-05-21T19:20:06.014154 #1327066] INFO -- : [779/885] 1368418=test_sizeof I, [2024-05-21T19:20:06.017241 #1327066] INFO -- : [780/885] 1368431=test_case I, [2024-05-21T19:20:06.026363 #1327066] INFO -- : [781/885] 1368425=test_rendering I, [2024-05-21T19:20:06.035019 #1327066] INFO -- : [782/885] 1368425=test_yaml_tree I, [2024-05-21T19:20:06.051360 #1327066] INFO -- : [783/885] 1368431=test_math I, [2024-05-21T19:20:06.058785 #1327066] INFO -- : [784/885] 1368425=test_gem_commands_fetch_command I, [2024-05-21T19:20:06.064333 #1327066] INFO -- : [785/885] 1368431=test_gc I, [2024-05-21T19:20:06.068967 #1327066] INFO -- : [786/885] 1368431=test_libs I, [2024-05-21T19:20:06.080569 #1327066] INFO -- : [787/885] 1368431=test_config I, [2024-05-21T19:20:06.110977 #1327066] INFO -- : [788/885] 1368427=test_sleep I, [2024-05-21T19:20:06.111824 #1327066] INFO -- : [789/885] 1368431=locals_test I, [2024-05-21T19:20:06.120056 #1327066] INFO -- : [790/885] 1368420=test_rdoc_require I, [2024-05-21T19:20:06.129055 #1327066] INFO -- : [791/885] 1368420=test_clone I, [2024-05-21T19:20:06.204814 #1327066] INFO -- : [792/885] 1368425=test_gem_commands_install_command I, [2024-05-21T19:20:06.209824 #1327066] INFO -- : [793/885] 1368426=test_readpartial I, [2024-05-21T19:20:06.320927 #1327066] INFO -- : [794/885] 1368420=ruby_parser_test I, [2024-05-21T19:20:06.324616 #1327066] INFO -- : [795/885] 1368420=test_backtrace I, [2024-05-21T19:20:06.348436 #1327066] INFO -- : [796/885] 1368422=test_pack I, [2024-05-21T19:20:06.363488 #1327066] INFO -- : [797/885] 1368422=test_io_buffer I, [2024-05-21T19:20:06.466037 #1327066] INFO -- : [798/885] 1368431=test_rdoc_task I, [2024-05-21T19:20:06.466405 #1327066] INFO -- : [799/885] 1368431=test_gem_resolver_conflict I, [2024-05-21T19:20:06.471939 #1327066] INFO -- : [800/885] 1368422=test_rdoc_markup_indented_paragraph I, [2024-05-21T19:20:06.480741 #1327066] INFO -- : [801/885] 1368431=test_files_sample I, [2024-05-21T19:20:06.551434 #1327066] INFO -- : [802/885] 1368431=test_stringscanner I, [2024-05-21T19:20:06.571844 #1327066] INFO -- : [803/885] 1368431=test_convertible I, [2024-05-21T19:20:06.592967 #1327066] INFO -- : [804/885] 1368422=parser_test I, [2024-05-21T19:20:06.616653 #1327066] INFO -- : [805/885] 1368426=test_yield I, [2024-05-21T19:20:06.639412 #1327066] INFO -- : [806/885] 1368422=test_rdoc_alias I, [2024-05-21T19:20:06.687781 #1327066] INFO -- : [807/885] 1368422=test_fstring I, [2024-05-21T19:20:06.788644 #1327066] INFO -- : [808/885] 1368434=test_optparse I, [2024-05-21T19:20:06.824250 #1327066] INFO -- : [809/885] 1368434=test_array I, [2024-05-21T19:20:06.827807 #1327066] INFO -- : [810/885] 1368422=test_rdoc_markup_raw I, [2024-05-21T19:20:06.838991 #1327066] INFO -- : [811/885] 1368422=test_webauthn_poller I, [2024-05-21T19:20:06.844550 #1327066] INFO -- : [812/885] 1368434=test_rat I, [2024-05-21T19:20:06.851462 #1327066] INFO -- : [813/885] 1368434=test_gem_resolver_best_set I, [2024-05-21T19:20:06.888720 #1327066] INFO -- : [814/885] 1368432=encoding_test I, [2024-05-21T19:20:06.910556 #1327066] INFO -- : [815/885] 1368434=test_typeddata I, [2024-05-21T19:20:06.954011 #1327066] INFO -- : [816/885] 1368432=test_rdoc_markup_to_html_crossref I, [2024-05-21T19:20:06.970334 #1327066] INFO -- : [817/885] 1368422=test_set I, [2024-05-21T19:20:06.990579 #1327066] INFO -- : [818/885] 1368422=test_show_source I, [2024-05-21T19:20:06.992940 #1327066] INFO -- : [819/885] 1368422=test_remote_fetch_error I, [2024-05-21T19:20:07.005027 #1327066] INFO -- : [820/885] 1368422=test_have_library I, [2024-05-21T19:20:07.103978 #1327066] INFO -- : [821/885] 1368415=test_lock_native_thread I, [2024-05-21T19:20:07.168242 #1327066] INFO -- : [822/885] 1368434=test_c_struct_entry I, [2024-05-21T19:20:07.209825 #1327066] INFO -- : [823/885] 1368432=test_gem_commands_stale_command I, [2024-05-21T19:20:07.215502 #1327066] INFO -- : [824/885] 1368432=test_undef I, [2024-05-21T19:20:07.218760 #1327066] INFO -- : [825/885] 1368432=ripper_test I, [2024-05-21T19:20:07.325727 #1327066] INFO -- : [826/885] 1368425=test_objspace I, [2024-05-21T19:20:07.393549 #1327066] INFO -- : [827/885] 1368415=test_line_editor I, [2024-05-21T19:20:07.399045 #1327066] INFO -- : [828/885] 1368415=test_gem_security_trust_dir I, [2024-05-21T19:20:07.439806 #1327066] INFO -- : [829/885] 1368434=comments_test I, [2024-05-21T19:20:07.446478 #1327066] INFO -- : [830/885] 1368415=test_gem_requirement I, [2024-05-21T19:20:07.548635 #1327066] INFO -- : [831/885] 1368434=test_sprintf I, [2024-05-21T19:20:07.575090 #1327066] INFO -- : [832/885] 1368415=test_string_memory I, [2024-05-21T19:20:07.664202 #1327066] INFO -- : [833/885] 1368415=test_yjit I, [2024-05-21T19:20:07.668079 #1327066] INFO -- : [834/885] 1368415=test_workspace I, [2024-05-21T19:20:07.668166 #1327066] INFO -- : [835/885] 1368416=test_weakmap I, [2024-05-21T19:20:07.693145 #1327066] INFO -- : [836/885] 1368420=test_gem_commands_environment_command I, [2024-05-21T19:20:07.720272 #1327066] INFO -- : [837/885] 1368432=test_m17n I, [2024-05-21T19:20:07.740611 #1327066] INFO -- : [838/885] 1368420=test_ws I, [2024-05-21T19:20:07.743590 #1327066] INFO -- : [839/885] 1368420=test_argf I, [2024-05-21T19:20:07.776571 #1327066] INFO -- : [840/885] 1368424=test_kill_ring I, [2024-05-21T19:20:07.815288 #1327066] INFO -- : [841/885] 1368432=test_framework I, [2024-05-21T19:20:07.826698 #1327066] INFO -- : [842/885] 1368432=test_ns_spki I, [2024-05-21T19:20:07.829932 #1327066] INFO -- : [843/885] 1368415=test_postponed_job I, [2024-05-21T19:20:07.836795 #1327066] INFO -- : [844/885] 1368434=test_alias_and_anchor I, [2024-05-21T19:20:07.838557 #1327066] INFO -- : [845/885] 1368432=test_external_new I, [2024-05-21T19:20:07.844038 #1327066] INFO -- : [846/885] 1368432=test_gem_resolver_dependency_request I, [2024-05-21T19:20:07.844106 #1327066] INFO -- : [847/885] 1368434=test_tree_builder I, [2024-05-21T19:20:07.848032 #1327066] INFO -- : [848/885] 1368424=test_hash I, [2024-05-21T19:20:07.853337 #1327066] INFO -- : [849/885] 1368434=test_protect I, [2024-05-21T19:20:07.856084 #1327066] INFO -- : [850/885] 1368434=test_win32ole_typelib I, [2024-05-21T19:20:07.858745 #1327066] INFO -- : [851/885] 1368434=test_gem_request_set_lockfile I, [2024-05-21T19:20:07.882946 #1327066] INFO -- : [852/885] 1368432=test_raise_exception I, [2024-05-21T19:20:07.900535 #1327066] INFO -- : [853/885] 1368424=test_io I, [2024-05-21T19:20:07.969891 #1327066] INFO -- : [854/885] 1368429=test_hash I, [2024-05-21T19:20:08.137624 #1327066] INFO -- : [855/885] 1368424=test_ubf_async_safe I, [2024-05-21T19:20:08.159753 #1327066] INFO -- : [856/885] 1368424=test_sorted_set I, [2024-05-21T19:20:08.170762 #1327066] INFO -- : [857/885] 1368427=test_emoji I, [2024-05-21T19:20:08.209047 #1327066] INFO -- : [858/885] 1368427=test_win32ole_type_event I, [2024-05-21T19:20:08.210335 #1327066] INFO -- : [859/885] 1368427=test_win32ole_record I, [2024-05-21T19:20:08.216728 #1327066] INFO -- : [860/885] 1368427=test_gem_unsatisfiable_dependency_error I, [2024-05-21T19:20:08.220518 #1327066] INFO -- : [861/885] 1368427=test_gem_commands_uninstall_command I, [2024-05-21T19:20:08.223392 #1327066] INFO -- : [862/885] 1368434=test_condition I, [2024-05-21T19:20:08.225029 #1327066] INFO -- : [863/885] 1368422=test_gem_source_specific_file I, [2024-05-21T19:20:08.229513 #1327066] INFO -- : [864/885] 1368434=test_foreach I, [2024-05-21T19:20:08.238229 #1327066] INFO -- : [865/885] 1368434=test_cp949 I, [2024-05-21T19:20:08.239996 #1327066] INFO -- : [866/885] 1368434=test_summary I, [2024-05-21T19:20:08.280018 #1327066] INFO -- : [867/885] 1368415=test_console_attr I, [2024-05-21T19:20:08.284234 #1327066] INFO -- : [868/885] 1368415=test_type_completor I, [2024-05-21T19:20:08.287421 #1327066] INFO -- : [869/885] 1368415=warnings_test I, [2024-05-21T19:20:08.296186 #1327066] INFO -- : [870/885] 1368422=test_kwargs I, [2024-05-21T19:20:08.297378 #1327066] INFO -- : [871/885] 1368415=test_io_wait I, [2024-05-21T19:20:08.301853 #1327066] INFO -- : [872/885] 1368422=test_gem_commands_exec_command I, [2024-05-21T19:20:08.319740 #1327066] INFO -- : [873/885] 1368434=test_date_attr I, [2024-05-21T19:20:08.320885 #1327066] INFO -- : [874/885] 1368434=test_ellipsize I, [2024-05-21T19:20:08.332469 #1327066] INFO -- : [875/885] 1368434=test_ftp I, [2024-05-21T19:20:08.336289 #1327066] INFO -- : [876/885] 1368434=test_euc_kr I, [2024-05-21T19:20:08.346773 #1327066] INFO -- : [877/885] 1368434=test_rdoc_context_section I, [2024-05-21T19:20:08.409338 #1327066] INFO -- : [878/885] 1368424=test_rdoc_rubygems_hook I, [2024-05-21T19:20:08.491023 #1327066] INFO -- : [879/885] 1368434=test_gem_commands_query_command I, [2024-05-21T19:20:08.630954 #1327066] INFO -- : [880/885] 1368415=test_method I, [2024-05-21T19:20:08.664184 #1327066] INFO -- : [881/885] 1368424=test_pack I, [2024-05-21T19:20:08.667963 #1327066] INFO -- : [882/885] 1368432=test_array_create I, [2024-05-21T19:20:08.668283 #1327066] INFO -- : [883/885] 1368432=test_gem_impossible_dependencies_error I, [2024-05-21T19:20:08.682505 #1327066] INFO -- : [884/885] 1368432=test_pattern_key_name_check I, [2024-05-21T19:20:08.687269 #1327066] INFO -- : [885/885] 1368432=test_to_ruby I, [2024-05-21T19:20:25.326360 #1327066] INFO -- : Finished tests in 36.356969s, 725.5830 tests/s, 257264.7070 assertions/s. I, [2024-05-21T19:20:25.327203 #1327066] INFO -- : 26380 tests, 9353365 assertions, 0 failures, 0 errors, 306 skips I, [2024-05-21T19:20:25.327274 #1327066] INFO -- : I, [2024-05-21T19:20:25.327294 #1327066] INFO -- : ruby -v: ruby 3.4.0dev (2024-05-21T18:45:16Z master b20adf90e3) [x86_64-linux] I, [2024-05-21T19:20:25.329752 #1327066] INFO -- : $$$[end] "make yes-test-all TESTOPTS='--stderr-on-failure' TESTS='-j20'" exit with 0. I, [2024-05-21T19:20:25.329932 #1327066] INFO -- : $$$[beg] make yes-test-rubyspec MSPECOPT='--error-output stderr --debug -j' TESTS='-j20' I, [2024-05-21T19:20:25.418847 #1327066] INFO -- : BASERUBY = /usr/bin/ruby --disable=gems I, [2024-05-21T19:20:25.418883 #1327066] INFO -- : CC = gcc I, [2024-05-21T19:20:25.418889 #1327066] INFO -- : LD = ld I, [2024-05-21T19:20:25.418893 #1327066] INFO -- : LDSHARED = gcc -shared I, [2024-05-21T19:20:25.418898 #1327066] INFO -- : CFLAGS = -O3 -fno-fast-math -ggdb3 -Wall -Wextra -Wdeprecated-declarations -Wdiv-by-zero -Wduplicated-cond -Wimplicit-function-declaration -Wimplicit-int -Wpointer-arith -Wwrite-strings -Wold-style-definition -Wimplicit-fallthrough=0 -Wmissing-noreturn -Wno-cast-function-type -Wno-constant-logical-operand -Wno-long-long -Wno-missing-field-initializers -Wno-overlength-strings -Wno-packed-bitfield-compat -Wno-parentheses-equality -Wno-self-assign -Wno-tautological-compare -Wno-unused-parameter -Wno-unused-value -Wsuggest-attribute=format -Wsuggest-attribute=noreturn -Wunused-variable -Wmisleading-indentation -Wundef -fPIC I, [2024-05-21T19:20:25.418903 #1327066] INFO -- : XCFLAGS = -U_FORTIFY_SOURCE -D_FORTIFY_SOURCE=2 -fstack-protector-strong -fno-strict-overflow -fvisibility=hidden -fexcess-precision=standard -DRUBY_EXPORT -I. -I.ext/include/x86_64-linux -I/tmp/ruby/src/trunk/include -I/tmp/ruby/src/trunk -I/tmp/ruby/src/trunk/prism -I/tmp/ruby/src/trunk/enc/unicode/15.0.0 I, [2024-05-21T19:20:25.418907 #1327066] INFO -- : CPPFLAGS = I, [2024-05-21T19:20:25.418911 #1327066] INFO -- : DLDFLAGS = -Wl,--compress-debug-sections=zlib -Wl,-soname,libruby.so.3.4 -fstack-protector-strong I, [2024-05-21T19:20:25.418920 #1327066] INFO -- : SOLIBS = -lz -lrt -lrt -lgmp -ldl -lcrypt -lm -lpthread I, [2024-05-21T19:20:25.418924 #1327066] INFO -- : LANG = en_US.UTF-8 I, [2024-05-21T19:20:25.418927 #1327066] INFO -- : LC_ALL = I, [2024-05-21T19:20:25.418931 #1327066] INFO -- : LC_CTYPE = I, [2024-05-21T19:20:25.418935 #1327066] INFO -- : MFLAGS = I, [2024-05-21T19:20:25.418940 #1327066] INFO -- : RUSTC = no I, [2024-05-21T19:20:25.418945 #1327066] INFO -- : YJIT_RUSTC_ARGS = --crate-name=yjit --crate-type=staticlib --edition=2021 -g -C lto=thin -C opt-level=3 -C overflow-checks=on '--out-dir=/tmp/ruby/build/trunk/yjit/target/release/' /tmp/ruby/src/trunk/yjit/src/lib.rs I, [2024-05-21T19:20:25.419555 #1327066] INFO -- : gcc (Ubuntu 11.4.0-1ubuntu1~22.04) 11.4.0 I, [2024-05-21T19:20:25.419590 #1327066] INFO -- : Copyright (C) 2021 Free Software Foundation, Inc. I, [2024-05-21T19:20:25.419596 #1327066] INFO -- : This is free software; see the source for copying conditions. There is NO I, [2024-05-21T19:20:25.419602 #1327066] INFO -- : warranty; not even for MERCHANTABILITY or FITNESS FOR A PARTICULAR PURPOSE. I, [2024-05-21T19:20:25.419606 #1327066] INFO -- : I, [2024-05-21T19:20:25.421307 #1327066] INFO -- : generating enc.mk I, [2024-05-21T19:20:25.538577 #1327066] INFO -- : generating encdb.h I, [2024-05-21T19:20:25.562162 #1327066] INFO -- : encdb.h unchanged I, [2024-05-21T19:20:25.563174 #1327066] INFO -- : making enc I, [2024-05-21T19:20:25.580911 #1327066] INFO -- : make[1]: Entering directory '/tmp/ruby/build/trunk' I, [2024-05-21T19:20:25.580938 #1327066] INFO -- : make[1]: Nothing to be done for 'enc'. I, [2024-05-21T19:20:25.580945 #1327066] INFO -- : make[1]: Leaving directory '/tmp/ruby/build/trunk' I, [2024-05-21T19:20:25.581564 #1327066] INFO -- : making srcs under enc I, [2024-05-21T19:20:25.611803 #1327066] INFO -- : make[1]: Entering directory '/tmp/ruby/build/trunk' I, [2024-05-21T19:20:25.611824 #1327066] INFO -- : make[1]: Nothing to be done for 'srcs'. I, [2024-05-21T19:20:25.611830 #1327066] INFO -- : make[1]: Leaving directory '/tmp/ruby/build/trunk' I, [2024-05-21T19:20:25.612700 #1327066] INFO -- : generating transdb.h I, [2024-05-21T19:20:25.709867 #1327066] INFO -- : transdb.h unchanged I, [2024-05-21T19:20:25.711143 #1327066] INFO -- : making trans I, [2024-05-21T19:20:25.744916 #1327066] INFO -- : make[1]: Entering directory '/tmp/ruby/build/trunk' I, [2024-05-21T19:20:25.744938 #1327066] INFO -- : make[1]: Nothing to be done for 'trans'. I, [2024-05-21T19:20:25.744943 #1327066] INFO -- : make[1]: Leaving directory '/tmp/ruby/build/trunk' I, [2024-05-21T19:20:25.745568 #1327066] INFO -- : making encs I, [2024-05-21T19:20:25.783259 #1327066] INFO -- : make[1]: Entering directory '/tmp/ruby/build/trunk' I, [2024-05-21T19:20:25.783280 #1327066] INFO -- : make[1]: Nothing to be done for 'encs'. I, [2024-05-21T19:20:25.783286 #1327066] INFO -- : make[1]: Leaving directory '/tmp/ruby/build/trunk' I, [2024-05-21T19:20:25.784953 #1327066] INFO -- : generating makefiles ext/configure-ext.mk I, [2024-05-21T19:20:25.811603 #1327066] INFO -- : ext/configure-ext.mk updated I, [2024-05-21T19:20:25.814018 #1327066] INFO -- : make[1]: Entering directory '/tmp/ruby/build/trunk' I, [2024-05-21T19:20:27.212227 #1327066] INFO -- : make[1]: Leaving directory '/tmp/ruby/build/trunk' I, [2024-05-21T19:20:27.212839 #1327066] INFO -- : generating makefile exts.mk I, [2024-05-21T19:20:27.249631 #1327066] INFO -- : exts.mk unchanged I, [2024-05-21T19:20:27.254255 #1327066] INFO -- : make[1]: Entering directory '/tmp/ruby/build/trunk' I, [2024-05-21T19:20:27.565162 #1327066] INFO -- : make[2]: Entering directory '/tmp/ruby/build/trunk/ext/coverage' I, [2024-05-21T19:20:27.569867 #1327066] INFO -- : make[2]: Leaving directory '/tmp/ruby/build/trunk/ext/coverage' I, [2024-05-21T19:20:27.576297 #1327066] INFO -- : make[2]: Entering directory '/tmp/ruby/build/trunk/ext/date' I, [2024-05-21T19:20:27.581463 #1327066] INFO -- : make[2]: Leaving directory '/tmp/ruby/build/trunk/ext/date' I, [2024-05-21T19:20:27.585272 #1327066] INFO -- : make[2]: Entering directory '/tmp/ruby/build/trunk/ext/digest' I, [2024-05-21T19:20:27.594245 #1327066] INFO -- : make[2]: Leaving directory '/tmp/ruby/build/trunk/ext/digest' I, [2024-05-21T19:20:27.620750 #1327066] INFO -- : make[2]: Entering directory '/tmp/ruby/build/trunk/ext/digest/sha2' I, [2024-05-21T19:20:27.625595 #1327066] INFO -- : make[2]: Leaving directory '/tmp/ruby/build/trunk/ext/digest/sha2' I, [2024-05-21T19:20:27.647239 #1327066] INFO -- : make[2]: Entering directory '/tmp/ruby/build/trunk/ext/fiddle' I, [2024-05-21T19:20:27.658176 #1327066] INFO -- : make[2]: Leaving directory '/tmp/ruby/build/trunk/ext/fiddle' I, [2024-05-21T19:20:27.663132 #1327066] INFO -- : make[2]: Entering directory '/tmp/ruby/build/trunk/ext/io/console' I, [2024-05-21T19:20:27.667414 #1327066] INFO -- : make[2]: Leaving directory '/tmp/ruby/build/trunk/ext/io/console' I, [2024-05-21T19:20:27.680652 #1327066] INFO -- : make[2]: Entering directory '/tmp/ruby/build/trunk/ext/json' I, [2024-05-21T19:20:27.691253 #1327066] INFO -- : make[2]: Leaving directory '/tmp/ruby/build/trunk/ext/json' I, [2024-05-21T19:20:27.706833 #1327066] INFO -- : make[2]: Entering directory '/tmp/ruby/build/trunk/ext/monitor' I, [2024-05-21T19:20:27.710862 #1327066] INFO -- : make[2]: Leaving directory '/tmp/ruby/build/trunk/ext/monitor' I, [2024-05-21T19:20:27.718431 #1327066] INFO -- : make[2]: Entering directory '/tmp/ruby/build/trunk/ext/objspace' I, [2024-05-21T19:20:27.724702 #1327066] INFO -- : make[2]: Leaving directory '/tmp/ruby/build/trunk/ext/objspace' I, [2024-05-21T19:20:27.744912 #1327066] INFO -- : make[2]: Entering directory '/tmp/ruby/build/trunk/ext/openssl' I, [2024-05-21T19:20:27.762603 #1327066] INFO -- : make[2]: Leaving directory '/tmp/ruby/build/trunk/ext/openssl' I, [2024-05-21T19:20:27.765633 #1327066] INFO -- : make[2]: Entering directory '/tmp/ruby/build/trunk/ext/pathname' I, [2024-05-21T19:20:27.768600 #1327066] INFO -- : make[2]: Leaving directory '/tmp/ruby/build/trunk/ext/pathname' I, [2024-05-21T19:20:27.773223 #1327066] INFO -- : make[2]: Entering directory '/tmp/ruby/build/trunk/ext/psych' I, [2024-05-21T19:20:27.794508 #1327066] INFO -- : make[2]: Leaving directory '/tmp/ruby/build/trunk/ext/psych' I, [2024-05-21T19:20:27.797650 #1327066] INFO -- : make[2]: Entering directory '/tmp/ruby/build/trunk/ext/pty' I, [2024-05-21T19:20:27.800216 #1327066] INFO -- : make[2]: Leaving directory '/tmp/ruby/build/trunk/ext/pty' I, [2024-05-21T19:20:27.814546 #1327066] INFO -- : make[2]: Entering directory '/tmp/ruby/build/trunk/ext/ripper' I, [2024-05-21T19:20:27.822867 #1327066] INFO -- : make[2]: Leaving directory '/tmp/ruby/build/trunk/ext/ripper' I, [2024-05-21T19:20:27.825429 #1327066] INFO -- : make[2]: Entering directory '/tmp/ruby/build/trunk/ext/rubyvm' I, [2024-05-21T19:20:27.828604 #1327066] INFO -- : make[2]: Leaving directory '/tmp/ruby/build/trunk/ext/rubyvm' I, [2024-05-21T19:20:27.842407 #1327066] INFO -- : make[2]: Entering directory '/tmp/ruby/build/trunk/ext/socket' I, [2024-05-21T19:20:27.853766 #1327066] INFO -- : make[2]: Leaving directory '/tmp/ruby/build/trunk/ext/socket' I, [2024-05-21T19:20:27.872079 #1327066] INFO -- : make[2]: Entering directory '/tmp/ruby/build/trunk/.bundle/gems/bigdecimal-3.1.8/ext/bigdecimal' I, [2024-05-21T19:20:27.898557 #1327066] INFO -- : make[2]: Leaving directory '/tmp/ruby/build/trunk/.bundle/gems/bigdecimal-3.1.8/ext/bigdecimal' I, [2024-05-21T19:20:27.900720 #1327066] INFO -- : make[2]: Entering directory '/tmp/ruby/build/trunk/.bundle/gems/debug-1.9.2/ext/debug' I, [2024-05-21T19:20:27.923023 #1327066] INFO -- : make[2]: Leaving directory '/tmp/ruby/build/trunk/.bundle/gems/debug-1.9.2/ext/debug' I, [2024-05-21T19:20:27.924988 #1327066] INFO -- : make[2]: Entering directory '/tmp/ruby/build/trunk/.bundle/gems/nkf-0.2.0/ext/nkf' I, [2024-05-21T19:20:27.946572 #1327066] INFO -- : make[2]: Leaving directory '/tmp/ruby/build/trunk/.bundle/gems/nkf-0.2.0/ext/nkf' I, [2024-05-21T19:20:27.948534 #1327066] INFO -- : make[2]: Entering directory '/tmp/ruby/build/trunk/.bundle/gems/racc-1.7.3/ext/racc/cparse' I, [2024-05-21T19:20:27.970305 #1327066] INFO -- : make[2]: Leaving directory '/tmp/ruby/build/trunk/.bundle/gems/racc-1.7.3/ext/racc/cparse' I, [2024-05-21T19:20:27.972264 #1327066] INFO -- : make[2]: Entering directory '/tmp/ruby/build/trunk/.bundle/gems/racc-1.8.0/ext/racc/cparse' I, [2024-05-21T19:20:27.994944 #1327066] INFO -- : make[2]: Leaving directory '/tmp/ruby/build/trunk/.bundle/gems/racc-1.8.0/ext/racc/cparse' I, [2024-05-21T19:20:27.997221 #1327066] INFO -- : make[2]: Entering directory '/tmp/ruby/build/trunk/.bundle/gems/rbs-3.4.4/ext/rbs_extension' I, [2024-05-21T19:20:28.020935 #1327066] INFO -- : make[2]: Leaving directory '/tmp/ruby/build/trunk/.bundle/gems/rbs-3.4.4/ext/rbs_extension' I, [2024-05-21T19:20:28.022869 #1327066] INFO -- : make[2]: Entering directory '/tmp/ruby/build/trunk/.bundle/gems/syslog-0.1.2/ext/syslog' I, [2024-05-21T19:20:28.044256 #1327066] INFO -- : make[2]: Leaving directory '/tmp/ruby/build/trunk/.bundle/gems/syslog-0.1.2/ext/syslog' I, [2024-05-21T19:20:28.067561 #1327066] INFO -- : make[2]: Entering directory '/tmp/ruby/build/trunk' I, [2024-05-21T19:20:28.135725 #1327066] INFO -- : make[2]: 'ruby' is up to date. I, [2024-05-21T19:20:28.135762 #1327066] INFO -- : make[2]: Leaving directory '/tmp/ruby/build/trunk' I, [2024-05-21T19:20:28.135989 #1327066] INFO -- : make[1]: Leaving directory '/tmp/ruby/build/trunk' I, [2024-05-21T19:20:28.139677 #1327066] INFO -- : make[1]: Entering directory '/tmp/ruby/build/trunk' I, [2024-05-21T19:20:28.139706 #1327066] INFO -- : make[1]: Nothing to be done for 'note'. I, [2024-05-21T19:20:28.139713 #1327066] INFO -- : make[1]: Leaving directory '/tmp/ruby/build/trunk' E, [2024-05-21T19:20:28.197121 #1327066] ERROR -- : $ /tmp/ruby/build/trunk/miniruby -I/tmp/ruby/src/trunk/lib /tmp/ruby/src/trunk/tool/runruby.rb --archdir=/tmp/ruby/build/trunk --extout=.ext -- /tmp/ruby/src/trunk/spec/mspec/bin/mspec-run -B /tmp/ruby/src/trunk/spec/default.mspec --error-output stderr --debug -fy -o /tmp/rubytest.357er4/1-mspec-multi-0 E, [2024-05-21T19:20:28.197321 #1327066] ERROR -- : $ /tmp/ruby/build/trunk/miniruby -I/tmp/ruby/src/trunk/lib /tmp/ruby/src/trunk/tool/runruby.rb --archdir=/tmp/ruby/build/trunk --extout=.ext -- /tmp/ruby/src/trunk/spec/mspec/bin/mspec-run -B /tmp/ruby/src/trunk/spec/default.mspec --error-output stderr --debug -fy -o /tmp/rubytest.357er4/2-mspec-multi-1 E, [2024-05-21T19:20:28.197659 #1327066] ERROR -- : $ /tmp/ruby/build/trunk/miniruby -I/tmp/ruby/src/trunk/lib /tmp/ruby/src/trunk/tool/runruby.rb --archdir=/tmp/ruby/build/trunk --extout=.ext -- /tmp/ruby/src/trunk/spec/mspec/bin/mspec-run -B /tmp/ruby/src/trunk/spec/default.mspec --error-output stderr --debug -fy -o /tmp/rubytest.357er4/3-mspec-multi-2 E, [2024-05-21T19:20:28.197931 #1327066] ERROR -- : $ /tmp/ruby/build/trunk/miniruby -I/tmp/ruby/src/trunk/lib /tmp/ruby/src/trunk/tool/runruby.rb --archdir=/tmp/ruby/build/trunk --extout=.ext -- /tmp/ruby/src/trunk/spec/mspec/bin/mspec-run -B /tmp/ruby/src/trunk/spec/default.mspec --error-output stderr --debug -fy -o /tmp/rubytest.357er4/4-mspec-multi-3 E, [2024-05-21T19:20:28.198226 #1327066] ERROR -- : $ /tmp/ruby/build/trunk/miniruby -I/tmp/ruby/src/trunk/lib /tmp/ruby/src/trunk/tool/runruby.rb --archdir=/tmp/ruby/build/trunk --extout=.ext -- /tmp/ruby/src/trunk/spec/mspec/bin/mspec-run -B /tmp/ruby/src/trunk/spec/default.mspec --error-output stderr --debug -fy -o /tmp/rubytest.357er4/5-mspec-multi-4 E, [2024-05-21T19:20:28.198448 #1327066] ERROR -- : $ /tmp/ruby/build/trunk/miniruby -I/tmp/ruby/src/trunk/lib /tmp/ruby/src/trunk/tool/runruby.rb --archdir=/tmp/ruby/build/trunk --extout=.ext -- /tmp/ruby/src/trunk/spec/mspec/bin/mspec-run -B /tmp/ruby/src/trunk/spec/default.mspec --error-output stderr --debug -fy -o /tmp/rubytest.357er4/6-mspec-multi-5 E, [2024-05-21T19:20:28.198585 #1327066] ERROR -- : $ /tmp/ruby/build/trunk/miniruby -I/tmp/ruby/src/trunk/lib /tmp/ruby/src/trunk/tool/runruby.rb --archdir=/tmp/ruby/build/trunk --extout=.ext -- /tmp/ruby/src/trunk/spec/mspec/bin/mspec-run -B /tmp/ruby/src/trunk/spec/default.mspec --error-output stderr --debug -fy -o /tmp/rubytest.357er4/7-mspec-multi-6 E, [2024-05-21T19:20:28.198867 #1327066] ERROR -- : $ /tmp/ruby/build/trunk/miniruby -I/tmp/ruby/src/trunk/lib /tmp/ruby/src/trunk/tool/runruby.rb --archdir=/tmp/ruby/build/trunk --extout=.ext -- /tmp/ruby/src/trunk/spec/mspec/bin/mspec-run -B /tmp/ruby/src/trunk/spec/default.mspec --error-output stderr --debug -fy -o /tmp/rubytest.357er4/8-mspec-multi-7 E, [2024-05-21T19:20:28.199077 #1327066] ERROR -- : $ /tmp/ruby/build/trunk/miniruby -I/tmp/ruby/src/trunk/lib /tmp/ruby/src/trunk/tool/runruby.rb --archdir=/tmp/ruby/build/trunk --extout=.ext -- /tmp/ruby/src/trunk/spec/mspec/bin/mspec-run -B /tmp/ruby/src/trunk/spec/default.mspec --error-output stderr --debug -fy -o /tmp/rubytest.357er4/9-mspec-multi-8 E, [2024-05-21T19:20:28.199238 #1327066] ERROR -- : $ /tmp/ruby/build/trunk/miniruby -I/tmp/ruby/src/trunk/lib /tmp/ruby/src/trunk/tool/runruby.rb --archdir=/tmp/ruby/build/trunk --extout=.ext -- /tmp/ruby/src/trunk/spec/mspec/bin/mspec-run -B /tmp/ruby/src/trunk/spec/default.mspec --error-output stderr --debug -fy -o /tmp/rubytest.357er4/10-mspec-multi-9 E, [2024-05-21T19:20:28.199505 #1327066] ERROR -- : $ /tmp/ruby/build/trunk/miniruby -I/tmp/ruby/src/trunk/lib /tmp/ruby/src/trunk/tool/runruby.rb --archdir=/tmp/ruby/build/trunk --extout=.ext -- /tmp/ruby/src/trunk/spec/mspec/bin/mspec-run -B /tmp/ruby/src/trunk/spec/default.mspec --error-output stderr --debug -fy -o /tmp/rubytest.357er4/11-mspec-multi-10 E, [2024-05-21T19:20:28.199895 #1327066] ERROR -- : $ /tmp/ruby/build/trunk/miniruby -I/tmp/ruby/src/trunk/lib /tmp/ruby/src/trunk/tool/runruby.rb --archdir=/tmp/ruby/build/trunk --extout=.ext -- /tmp/ruby/src/trunk/spec/mspec/bin/mspec-run -B /tmp/ruby/src/trunk/spec/default.mspec --error-output stderr --debug -fy -o /tmp/rubytest.357er4/12-mspec-multi-11 E, [2024-05-21T19:20:28.200199 #1327066] ERROR -- : $ /tmp/ruby/build/trunk/miniruby -I/tmp/ruby/src/trunk/lib /tmp/ruby/src/trunk/tool/runruby.rb --archdir=/tmp/ruby/build/trunk --extout=.ext -- /tmp/ruby/src/trunk/spec/mspec/bin/mspec-run -B /tmp/ruby/src/trunk/spec/default.mspec --error-output stderr --debug -fy -o /tmp/rubytest.357er4/13-mspec-multi-12 E, [2024-05-21T19:20:28.200390 #1327066] ERROR -- : $ /tmp/ruby/build/trunk/miniruby -I/tmp/ruby/src/trunk/lib /tmp/ruby/src/trunk/tool/runruby.rb --archdir=/tmp/ruby/build/trunk --extout=.ext -- /tmp/ruby/src/trunk/spec/mspec/bin/mspec-run -B /tmp/ruby/src/trunk/spec/default.mspec --error-output stderr --debug -fy -o /tmp/rubytest.357er4/14-mspec-multi-13 E, [2024-05-21T19:20:28.200592 #1327066] ERROR -- : $ /tmp/ruby/build/trunk/miniruby -I/tmp/ruby/src/trunk/lib /tmp/ruby/src/trunk/tool/runruby.rb --archdir=/tmp/ruby/build/trunk --extout=.ext -- /tmp/ruby/src/trunk/spec/mspec/bin/mspec-run -B /tmp/ruby/src/trunk/spec/default.mspec --error-output stderr --debug -fy -o /tmp/rubytest.357er4/15-mspec-multi-14 E, [2024-05-21T19:20:28.200780 #1327066] ERROR -- : $ /tmp/ruby/build/trunk/miniruby -I/tmp/ruby/src/trunk/lib /tmp/ruby/src/trunk/tool/runruby.rb --archdir=/tmp/ruby/build/trunk --extout=.ext -- /tmp/ruby/src/trunk/spec/mspec/bin/mspec-run -B /tmp/ruby/src/trunk/spec/default.mspec --error-output stderr --debug -fy -o /tmp/rubytest.357er4/16-mspec-multi-15 E, [2024-05-21T19:20:28.200970 #1327066] ERROR -- : $ /tmp/ruby/build/trunk/miniruby -I/tmp/ruby/src/trunk/lib /tmp/ruby/src/trunk/tool/runruby.rb --archdir=/tmp/ruby/build/trunk --extout=.ext -- /tmp/ruby/src/trunk/spec/mspec/bin/mspec-run -B /tmp/ruby/src/trunk/spec/default.mspec --error-output stderr --debug -fy -o /tmp/rubytest.357er4/17-mspec-multi-16 E, [2024-05-21T19:20:28.201171 #1327066] ERROR -- : $ /tmp/ruby/build/trunk/miniruby -I/tmp/ruby/src/trunk/lib /tmp/ruby/src/trunk/tool/runruby.rb --archdir=/tmp/ruby/build/trunk --extout=.ext -- /tmp/ruby/src/trunk/spec/mspec/bin/mspec-run -B /tmp/ruby/src/trunk/spec/default.mspec --error-output stderr --debug -fy -o /tmp/rubytest.357er4/18-mspec-multi-17 E, [2024-05-21T19:20:28.204035 #1327066] ERROR -- : $ /tmp/ruby/build/trunk/miniruby -I/tmp/ruby/src/trunk/lib /tmp/ruby/src/trunk/tool/runruby.rb --archdir=/tmp/ruby/build/trunk --extout=.ext -- /tmp/ruby/src/trunk/spec/mspec/bin/mspec-run -B /tmp/ruby/src/trunk/spec/default.mspec --error-output stderr --debug -fy -o /tmp/rubytest.357er4/19-mspec-multi-18 E, [2024-05-21T19:20:28.204389 #1327066] ERROR -- : $ /tmp/ruby/build/trunk/miniruby -I/tmp/ruby/src/trunk/lib /tmp/ruby/src/trunk/tool/runruby.rb --archdir=/tmp/ruby/build/trunk --extout=.ext -- /tmp/ruby/src/trunk/spec/mspec/bin/mspec-run -B /tmp/ruby/src/trunk/spec/default.mspec --error-output stderr --debug -fy -o /tmp/rubytest.357er4/20-mspec-multi-19 I, [2024-05-21T19:20:28.369785 #1327066] INFO -- : ruby 3.4.0dev (2024-05-21T18:45:16Z master b20adf90e3) [x86_64-linux] I, [2024-05-21T19:20:29.018197 #1327066] INFO -- : 0 ......................................................................... I, [2024-05-21T19:20:29.368027 #1327066] INFO -- : 73 ......................................................................... I, [2024-05-21T19:20:29.505573 #1327066] INFO -- : 146 ......................................................................... I, [2024-05-21T19:20:29.549545 #1327066] INFO -- : 219 ......................................................................... I, [2024-05-21T19:20:29.618422 #1327066] INFO -- : 292 ......................................................................... I, [2024-05-21T19:20:29.659743 #1327066] INFO -- : 365 ......................................................................... I, [2024-05-21T19:20:29.680334 #1327066] INFO -- : 438 ......................................................................... I, [2024-05-21T19:20:29.701345 #1327066] INFO -- : 511 ......................................................................... I, [2024-05-21T19:20:29.720060 #1327066] INFO -- : 584 ......................................................................... I, [2024-05-21T19:20:29.785998 #1327066] INFO -- : 657 ......................................................................... I, [2024-05-21T19:20:29.816069 #1327066] INFO -- : 730 ......................................................................... I, [2024-05-21T19:20:29.833140 #1327066] INFO -- : 803 ......................................................................... I, [2024-05-21T19:20:29.868756 #1327066] INFO -- : 876 ......................................................................... I, [2024-05-21T19:20:29.925234 #1327066] INFO -- : 949 ......................................................................... I, [2024-05-21T19:20:30.008874 #1327066] INFO -- : 1022 ......................................................................... I, [2024-05-21T19:20:30.179864 #1327066] INFO -- : 1095 ......................................................................... I, [2024-05-21T19:20:30.296892 #1327066] INFO -- : 1168 ......................................................................... I, [2024-05-21T19:20:30.356686 #1327066] INFO -- : 1241 ......................................................................... I, [2024-05-21T19:20:30.415130 #1327066] INFO -- : 1314 ......................................................................... I, [2024-05-21T19:20:30.436913 #1327066] INFO -- : 1387 ......................................................................... I, [2024-05-21T19:20:30.520566 #1327066] INFO -- : 1460 ......................................................................... I, [2024-05-21T19:20:31.022695 #1327066] INFO -- : 1533 ......................................................................... I, [2024-05-21T19:20:31.083045 #1327066] INFO -- : 1606 ......................................................................... I, [2024-05-21T19:20:31.199825 #1327066] INFO -- : 1679 ......................................................................... I, [2024-05-21T19:20:31.309018 #1327066] INFO -- : 1752 ......................................................................... I, [2024-05-21T19:20:31.388233 #1327066] INFO -- : 1825 ......................................................................... I, [2024-05-21T19:20:31.472516 #1327066] INFO -- : 1898 ......................................................................... I, [2024-05-21T19:20:31.561220 #1327066] INFO -- : 1971 ......................................................................... I, [2024-05-21T19:20:31.679762 #1327066] INFO -- : 2044 ......................................................................... I, [2024-05-21T19:20:31.720409 #1327066] INFO -- : 2117 ......................................................................... I, [2024-05-21T19:20:31.734258 #1327066] INFO -- : 2190 ......................................................................... I, [2024-05-21T19:20:31.754020 #1327066] INFO -- : 2263 ......................................................................... I, [2024-05-21T19:20:31.768302 #1327066] INFO -- : 2336 ......................................................................... I, [2024-05-21T19:20:31.805095 #1327066] INFO -- : 2409 ......................................................................... I, [2024-05-21T19:20:31.917720 #1327066] INFO -- : 2482 ......................................................................... I, [2024-05-21T19:20:31.944463 #1327066] INFO -- : 2555 ......................................................................... I, [2024-05-21T19:20:32.032197 #1327066] INFO -- : 2628 ......................................................................... I, [2024-05-21T19:20:32.140415 #1327066] INFO -- : 2701 ......................................................................... I, [2024-05-21T19:20:32.169394 #1327066] INFO -- : 2774 ......................................................................... I, [2024-05-21T19:20:32.224080 #1327066] INFO -- : 2847 ......................................................................... I, [2024-05-21T19:20:32.255897 #1327066] INFO -- : 2920 ......................................................................... I, [2024-05-21T19:20:32.282000 #1327066] INFO -- : 2993 ......................................................................... I, [2024-05-21T19:20:32.302571 #1327066] INFO -- : 3066 ......................................................................... I, [2024-05-21T19:20:32.319663 #1327066] INFO -- : 3139 ......................................................................... I, [2024-05-21T19:20:32.329337 #1327066] INFO -- : 3212 ......................................................................... I, [2024-05-21T19:20:32.360725 #1327066] INFO -- : 3285 ......................................................................... I, [2024-05-21T19:20:36.303847 #1327066] INFO -- : 3358 ......................................................................... I, [2024-05-21T19:20:36.330351 #1327066] INFO -- : I, [2024-05-21T19:20:36.330388 #1327066] INFO -- : I, [2024-05-21T19:20:36.330395 #1327066] INFO -- : Finished in 8.132511 seconds I, [2024-05-21T19:20:36.330400 #1327066] INFO -- : I, [2024-05-21T19:20:36.330405 #1327066] INFO -- : 3430 files, 32652 examples, 172516 expectations, 0 failures, 0 errors, 0 tagged I, [2024-05-21T19:20:36.332550 #1327066] INFO -- : $$$[end] "make yes-test-rubyspec MSPECOPT='--error-output stderr --debug -j' TESTS='-j20'" exit with 0.