# Logfile created on 2024-05-20 06:44:39 +0000 by logger.rb/v1.4.3 I, [2024-05-20T06:44:39.622272 #610251] INFO -- : #, @formatter=nil, @logdev=#, @binmode=false, @mon_data=#, @mon_data_owner_object_id=860>>> I, [2024-05-20T06:44:39.622399 #610251] INFO -- : $$$[beg] make update-unicode -j20 I, [2024-05-20T06:44:39.682091 #610251] INFO -- : Downloading Unicode emoji 15.0 files... I, [2024-05-20T06:44:39.682282 #610251] INFO -- : Downloading Unicode emoji 15.0 files... I, [2024-05-20T06:44:39.683050 #610251] INFO -- : Downloading Unicode emoji 15.0 files... I, [2024-05-20T06:44:39.725091 #610251] INFO -- : made symlink emoji/15.0/emoji-sequences.txt to /tmp/ruby/src/trunk/.downloaded-cache/emoji/15.0/emoji-sequences.txt I, [2024-05-20T06:44:39.725246 #610251] INFO -- : downloading emoji/15.0/emoji-test.txt ... /tmp/ruby/src/trunk/enc/unicode/data/emoji/15.0/emoji-sequences.txt already exists I, [2024-05-20T06:44:39.725272 #610251] INFO -- : /tmp/ruby/src/trunk/enc/unicode/data/emoji/15.0/emoji-sequences.txt already exists E, [2024-05-20T06:44:40.167378 #610251] ERROR -- : /tmp/ruby/src/trunk/tool/downloader.rb:302:in `rescue in download': failed to download emoji/15.0/emoji-test.txt (RuntimeError) E, [2024-05-20T06:44:40.167490 #610251] ERROR -- : OpenURI::HTTPError: 403 Forbidden: https://www.unicode.org/Public/emoji/15.0/emoji-test.txt E, [2024-05-20T06:44:40.167507 #610251] ERROR -- : from /tmp/ruby/src/trunk/tool/downloader.rb:201:in `download' E, [2024-05-20T06:44:40.167520 #610251] ERROR -- : from /tmp/ruby/src/trunk/tool/downloader.rb:136:in `download' E, [2024-05-20T06:44:40.167530 #610251] ERROR -- : from /tmp/ruby/src/trunk/tool/downloader.rb:482:in `block in
' E, [2024-05-20T06:44:40.167540 #610251] ERROR -- : from /tmp/ruby/src/trunk/tool/downloader.rb:465:in `each' E, [2024-05-20T06:44:40.167551 #610251] ERROR -- : from /tmp/ruby/src/trunk/tool/downloader.rb:465:in `
' E, [2024-05-20T06:44:40.167561 #610251] ERROR -- : /usr/lib/ruby/3.0.0/open-uri.rb:364:in `open_http': 403 Forbidden (OpenURI::HTTPError) E, [2024-05-20T06:44:40.167571 #610251] ERROR -- : from /usr/lib/ruby/3.0.0/open-uri.rb:741:in `buffer_open' E, [2024-05-20T06:44:40.167584 #610251] ERROR -- : from /usr/lib/ruby/3.0.0/open-uri.rb:212:in `block in open_loop' E, [2024-05-20T06:44:40.167594 #610251] ERROR -- : from /usr/lib/ruby/3.0.0/open-uri.rb:210:in `catch' E, [2024-05-20T06:44:40.167604 #610251] ERROR -- : from /usr/lib/ruby/3.0.0/open-uri.rb:210:in `open_loop' E, [2024-05-20T06:44:40.167614 #610251] ERROR -- : from /usr/lib/ruby/3.0.0/open-uri.rb:151:in `open_uri' E, [2024-05-20T06:44:40.167624 #610251] ERROR -- : from /usr/lib/ruby/3.0.0/open-uri.rb:721:in `open' E, [2024-05-20T06:44:40.167634 #610251] ERROR -- : from /usr/lib/ruby/3.0.0/open-uri.rb:729:in `read' E, [2024-05-20T06:44:40.167644 #610251] ERROR -- : from /tmp/ruby/src/trunk/tool/downloader.rb:247:in `block in download' E, [2024-05-20T06:44:40.167669 #610251] ERROR -- : from /tmp/ruby/src/trunk/tool/downloader.rb:378:in `with_retry' E, [2024-05-20T06:44:40.167680 #610251] ERROR -- : from /tmp/ruby/src/trunk/tool/downloader.rb:246:in `download' E, [2024-05-20T06:44:40.167712 #610251] ERROR -- : from /tmp/ruby/src/trunk/tool/downloader.rb:136:in `download' E, [2024-05-20T06:44:40.167722 #610251] ERROR -- : from /tmp/ruby/src/trunk/tool/downloader.rb:482:in `block in
' E, [2024-05-20T06:44:40.167732 #610251] ERROR -- : from /tmp/ruby/src/trunk/tool/downloader.rb:465:in `each' E, [2024-05-20T06:44:40.167743 #610251] ERROR -- : from /tmp/ruby/src/trunk/tool/downloader.rb:465:in `
' E, [2024-05-20T06:44:40.171366 #610251] ERROR -- : make: *** [uncommon.mk:1765: /tmp/ruby/src/trunk/enc/unicode/data/emoji/15.0/emoji-zwj-sequences.txt] Error 1 E, [2024-05-20T06:44:40.171419 #610251] ERROR -- : make: *** Waiting for unfinished jobs.... E, [2024-05-20T06:44:40.173069 #610251] ERROR -- : /tmp/ruby/src/trunk/tool/downloader.rb:302:in `rescue in download': failed to download emoji/15.0/emoji-test.txt (RuntimeError) E, [2024-05-20T06:44:40.173132 #610251] ERROR -- : OpenURI::HTTPError: 403 Forbidden: https://www.unicode.org/Public/emoji/15.0/emoji-test.txt E, [2024-05-20T06:44:40.173146 #610251] ERROR -- : from /tmp/ruby/src/trunk/tool/downloader.rb:201:in `download' E, [2024-05-20T06:44:40.173155 #610251] ERROR -- : from /tmp/ruby/src/trunk/tool/downloader.rb:136:in `download' E, [2024-05-20T06:44:40.173163 #610251] ERROR -- : from /tmp/ruby/src/trunk/tool/downloader.rb:482:in `block in
' E, [2024-05-20T06:44:40.173171 #610251] ERROR -- : from /tmp/ruby/src/trunk/tool/downloader.rb:465:in `each' E, [2024-05-20T06:44:40.173179 #610251] ERROR -- : from /tmp/ruby/src/trunk/tool/downloader.rb:465:in `
' E, [2024-05-20T06:44:40.173187 #610251] ERROR -- : /usr/lib/ruby/3.0.0/open-uri.rb:364:in `open_http': 403 Forbidden (OpenURI::HTTPError) E, [2024-05-20T06:44:40.173196 #610251] ERROR -- : from /usr/lib/ruby/3.0.0/open-uri.rb:741:in `buffer_open' E, [2024-05-20T06:44:40.173206 #610251] ERROR -- : from /usr/lib/ruby/3.0.0/open-uri.rb:212:in `block in open_loop' E, [2024-05-20T06:44:40.173215 #610251] ERROR -- : from /usr/lib/ruby/3.0.0/open-uri.rb:210:in `catch' E, [2024-05-20T06:44:40.173222 #610251] ERROR -- : from /usr/lib/ruby/3.0.0/open-uri.rb:210:in `open_loop' E, [2024-05-20T06:44:40.173238 #610251] ERROR -- : from /usr/lib/ruby/3.0.0/open-uri.rb:151:in `open_uri' E, [2024-05-20T06:44:40.173249 #610251] ERROR -- : from /usr/lib/ruby/3.0.0/open-uri.rb:721:in `open' E, [2024-05-20T06:44:40.173257 #610251] ERROR -- : from /usr/lib/ruby/3.0.0/open-uri.rb:729:in `read' E, [2024-05-20T06:44:40.173266 #610251] ERROR -- : from /tmp/ruby/src/trunk/tool/downloader.rb:247:in `block in download' E, [2024-05-20T06:44:40.173274 #610251] ERROR -- : from /tmp/ruby/src/trunk/tool/downloader.rb:378:in `with_retry' E, [2024-05-20T06:44:40.173283 #610251] ERROR -- : from /tmp/ruby/src/trunk/tool/downloader.rb:246:in `download' E, [2024-05-20T06:44:40.173292 #610251] ERROR -- : from /tmp/ruby/src/trunk/tool/downloader.rb:136:in `download' E, [2024-05-20T06:44:40.173300 #610251] ERROR -- : from /tmp/ruby/src/trunk/tool/downloader.rb:482:in `block in
' E, [2024-05-20T06:44:40.173308 #610251] ERROR -- : from /tmp/ruby/src/trunk/tool/downloader.rb:465:in `each' E, [2024-05-20T06:44:40.173316 #610251] ERROR -- : from /tmp/ruby/src/trunk/tool/downloader.rb:465:in `
' E, [2024-05-20T06:44:40.176490 #610251] ERROR -- : make: *** [uncommon.mk:1765: /tmp/ruby/src/trunk/enc/unicode/data/emoji/15.0/emoji-sequences.txt] Error 1 E, [2024-05-20T06:44:40.176540 #610251] ERROR -- : make: *** Deleting file '/tmp/ruby/src/trunk/enc/unicode/data/emoji/15.0/emoji-sequences.txt' E, [2024-05-20T06:44:40.207968 #610251] ERROR -- : /tmp/ruby/src/trunk/tool/downloader.rb:302:in `rescue in download': failed to download emoji/15.0/emoji-test.txt (RuntimeError) E, [2024-05-20T06:44:40.208092 #610251] ERROR -- : OpenURI::HTTPError: 403 Forbidden: https://www.unicode.org/Public/emoji/15.0/emoji-test.txt E, [2024-05-20T06:44:40.208123 #610251] ERROR -- : from /tmp/ruby/src/trunk/tool/downloader.rb:201:in `download' E, [2024-05-20T06:44:40.208144 #610251] ERROR -- : from /tmp/ruby/src/trunk/tool/downloader.rb:136:in `download' E, [2024-05-20T06:44:40.208157 #610251] ERROR -- : from /tmp/ruby/src/trunk/tool/downloader.rb:482:in `block in
' E, [2024-05-20T06:44:40.208171 #610251] ERROR -- : from /tmp/ruby/src/trunk/tool/downloader.rb:465:in `each' E, [2024-05-20T06:44:40.208185 #610251] ERROR -- : from /tmp/ruby/src/trunk/tool/downloader.rb:465:in `
' E, [2024-05-20T06:44:40.208198 #610251] ERROR -- : /usr/lib/ruby/3.0.0/open-uri.rb:364:in `open_http': 403 Forbidden (OpenURI::HTTPError) E, [2024-05-20T06:44:40.208216 #610251] ERROR -- : from /usr/lib/ruby/3.0.0/open-uri.rb:741:in `buffer_open' E, [2024-05-20T06:44:40.208229 #610251] ERROR -- : from /usr/lib/ruby/3.0.0/open-uri.rb:212:in `block in open_loop' E, [2024-05-20T06:44:40.208241 #610251] ERROR -- : from /usr/lib/ruby/3.0.0/open-uri.rb:210:in `catch' E, [2024-05-20T06:44:40.208254 #610251] ERROR -- : from /usr/lib/ruby/3.0.0/open-uri.rb:210:in `open_loop' E, [2024-05-20T06:44:40.208267 #610251] ERROR -- : from /usr/lib/ruby/3.0.0/open-uri.rb:151:in `open_uri' E, [2024-05-20T06:44:40.208521 #610251] ERROR -- : from /usr/lib/ruby/3.0.0/open-uri.rb:721:in `open' E, [2024-05-20T06:44:40.208534 #610251] ERROR -- : from /usr/lib/ruby/3.0.0/open-uri.rb:729:in `read' E, [2024-05-20T06:44:40.208554 #610251] ERROR -- : from /tmp/ruby/src/trunk/tool/downloader.rb:247:in `block in download' E, [2024-05-20T06:44:40.208580 #610251] ERROR -- : from /tmp/ruby/src/trunk/tool/downloader.rb:378:in `with_retry' E, [2024-05-20T06:44:40.208592 #610251] ERROR -- : from /tmp/ruby/src/trunk/tool/downloader.rb:246:in `download' E, [2024-05-20T06:44:40.208604 #610251] ERROR -- : from /tmp/ruby/src/trunk/tool/downloader.rb:136:in `download' E, [2024-05-20T06:44:40.208616 #610251] ERROR -- : from /tmp/ruby/src/trunk/tool/downloader.rb:482:in `block in
' E, [2024-05-20T06:44:40.208636 #610251] ERROR -- : from /tmp/ruby/src/trunk/tool/downloader.rb:465:in `each' E, [2024-05-20T06:44:40.208648 #610251] ERROR -- : from /tmp/ruby/src/trunk/tool/downloader.rb:465:in `
' E, [2024-05-20T06:44:40.212658 #610251] ERROR -- : make: *** [uncommon.mk:1765: /tmp/ruby/src/trunk/enc/unicode/data/emoji/15.0/emoji-test.txt] Error 1 I, [2024-05-20T06:44:40.212746 #610251] INFO -- : downloading emoji/15.0/emoji-test.txt ... downloading emoji/15.0/emoji-test.txt ... I, [2024-05-20T06:44:40.213247 #610251] INFO -- : $$$[end] "make update-unicode -j20" exit with 512. I, [2024-05-20T06:44:40.213317 #610251] INFO -- : $$$[beg] make update-download -j20 I, [2024-05-20T06:44:40.323967 #610251] INFO -- : tool/config.guess already exists I, [2024-05-20T06:44:40.324010 #610251] INFO -- : tool/config.sub already exists I, [2024-05-20T06:44:40.326165 #610251] INFO -- : Update power_assert to 84e85124c5014a139af39161d484156cfe87a9ed I, [2024-05-20T06:44:40.326318 #610251] INFO -- : Update rbs to ba7872795d5de04adb8ff500c0e6afdc81a041dd I, [2024-05-20T06:44:40.326970 #610251] INFO -- : Update typeprof to b19a6416da3a05d57fadd6ffdadb382b6d236ca5 I, [2024-05-20T06:44:40.327457 #610251] INFO -- : echo 84e85124c5014a139af39161d484156cfe87a9ed | /bin/sh /tmp/ruby/src/trunk/tool/ifchange /tmp/ruby/src/trunk/.bundle/.timestamp/power_assert.revision - I, [2024-05-20T06:44:40.327667 #610251] INFO -- : echo ba7872795d5de04adb8ff500c0e6afdc81a041dd | /bin/sh /tmp/ruby/src/trunk/tool/ifchange /tmp/ruby/src/trunk/.bundle/.timestamp/rbs.revision - I, [2024-05-20T06:44:40.328292 #610251] INFO -- : echo b19a6416da3a05d57fadd6ffdadb382b6d236ca5 | /bin/sh /tmp/ruby/src/trunk/tool/ifchange /tmp/ruby/src/trunk/.bundle/.timestamp/typeprof.revision - I, [2024-05-20T06:44:40.329610 #610251] INFO -- : /tmp/ruby/src/trunk/.bundle/.timestamp/power_assert.revision unchanged I, [2024-05-20T06:44:40.329657 #610251] INFO -- : /tmp/ruby/src/trunk/.bundle/.timestamp/rbs.revision unchanged I, [2024-05-20T06:44:40.330412 #610251] INFO -- : /tmp/ruby/src/trunk/.bundle/.timestamp/typeprof.revision unchanged I, [2024-05-20T06:44:40.330628 #610251] INFO -- : Building power_assert@84e85124c5014a139af39161d484156cfe87a9ed to /tmp/ruby/src/trunk/gems/power_assert-2.0.3.gem I, [2024-05-20T06:44:40.400252 #610251] INFO -- : Successfully built RubyGem I, [2024-05-20T06:44:40.400308 #610251] INFO -- : Name: power_assert I, [2024-05-20T06:44:40.400321 #610251] INFO -- : Version: 2.0.4dev I, [2024-05-20T06:44:40.400332 #610251] INFO -- : File: power_assert-2.0.4dev.gem I, [2024-05-20T06:44:40.446199 #610251] INFO -- : $$$[end] "make update-download -j20" exit with 0. I, [2024-05-20T06:44:40.446245 #610251] INFO -- : $$$[beg] make update-rubyspec -j20 I, [2024-05-20T06:44:40.503113 #610251] INFO -- : make: Nothing to be done for 'update-rubyspec'. I, [2024-05-20T06:44:40.503396 #610251] INFO -- : $$$[end] "make update-rubyspec -j20" exit with 0. I, [2024-05-20T06:44:40.503421 #610251] INFO -- : $$$[beg] make update-src -j20 I, [2024-05-20T06:44:41.222614 #610251] INFO -- : Already up to date. I, [2024-05-20T06:44:41.240978 #610251] INFO -- : Latest commit hash = 0b38403328 I, [2024-05-20T06:44:41.242693 #610251] INFO -- : $$$[end] "make update-src -j20" exit with 0. I, [2024-05-20T06:44:41.242769 #610251] INFO -- : $$$[beg] make after-update -j20 I, [2024-05-20T06:44:41.318172 #610251] INFO -- : generating /tmp/ruby/src/trunk/ext/ripper/eventids2table.c I, [2024-05-20T06:44:41.322526 #610251] INFO -- : make[1]: Entering directory '/tmp/ruby/src/trunk/ext/ripper' I, [2024-05-20T06:44:41.322550 #610251] INFO -- : make[1]: Nothing to be done for 'src'. I, [2024-05-20T06:44:41.322555 #610251] INFO -- : make[1]: Leaving directory '/tmp/ruby/src/trunk/ext/ripper' I, [2024-05-20T06:44:41.340479 #610251] INFO -- : /tmp/ruby/src/trunk/revision.h updated I, [2024-05-20T06:44:41.342087 #610251] INFO -- : generating x86_64-linux-fake.rb I, [2024-05-20T06:44:41.393260 #610251] INFO -- : x86_64-linux-fake.rb updated I, [2024-05-20T06:44:41.394661 #610251] INFO -- : generating enc.mk I, [2024-05-20T06:44:41.511822 #610251] INFO -- : making srcs under enc I, [2024-05-20T06:44:41.541870 #610251] INFO -- : make[1]: Entering directory '/tmp/ruby/build/trunk' I, [2024-05-20T06:44:41.541896 #610251] INFO -- : make[1]: Nothing to be done for 'srcs'. I, [2024-05-20T06:44:41.541901 #610251] INFO -- : make[1]: Leaving directory '/tmp/ruby/build/trunk' I, [2024-05-20T06:44:41.586735 #610251] INFO -- : Update power_assert to 84e85124c5014a139af39161d484156cfe87a9ed I, [2024-05-20T06:44:41.586897 #610251] INFO -- : Update rbs to ba7872795d5de04adb8ff500c0e6afdc81a041dd I, [2024-05-20T06:44:41.587452 #610251] INFO -- : Update typeprof to b19a6416da3a05d57fadd6ffdadb382b6d236ca5 I, [2024-05-20T06:44:41.588194 #610251] INFO -- : echo 84e85124c5014a139af39161d484156cfe87a9ed | /bin/sh /tmp/ruby/src/trunk/tool/ifchange /tmp/ruby/src/trunk/.bundle/.timestamp/power_assert.revision - I, [2024-05-20T06:44:41.588453 #610251] INFO -- : echo ba7872795d5de04adb8ff500c0e6afdc81a041dd | /bin/sh /tmp/ruby/src/trunk/tool/ifchange /tmp/ruby/src/trunk/.bundle/.timestamp/rbs.revision - I, [2024-05-20T06:44:41.589910 #610251] INFO -- : echo b19a6416da3a05d57fadd6ffdadb382b6d236ca5 | /bin/sh /tmp/ruby/src/trunk/tool/ifchange /tmp/ruby/src/trunk/.bundle/.timestamp/typeprof.revision - I, [2024-05-20T06:44:41.590463 #610251] INFO -- : /tmp/ruby/src/trunk/.bundle/.timestamp/power_assert.revision unchanged I, [2024-05-20T06:44:41.590533 #610251] INFO -- : /tmp/ruby/src/trunk/.bundle/.timestamp/rbs.revision unchanged I, [2024-05-20T06:44:41.591537 #610251] INFO -- : Building power_assert@84e85124c5014a139af39161d484156cfe87a9ed to /tmp/ruby/src/trunk/gems/power_assert-2.0.3.gem I, [2024-05-20T06:44:41.591584 #610251] INFO -- : /tmp/ruby/src/trunk/.bundle/.timestamp/typeprof.revision unchanged I, [2024-05-20T06:44:41.660401 #610251] INFO -- : Successfully built RubyGem I, [2024-05-20T06:44:41.660458 #610251] INFO -- : Name: power_assert I, [2024-05-20T06:44:41.660470 #610251] INFO -- : Version: 2.0.4dev I, [2024-05-20T06:44:41.660481 #610251] INFO -- : File: power_assert-2.0.4dev.gem I, [2024-05-20T06:44:41.662809 #610251] INFO -- : Extracting bundle gem power_assert-2.0.3... I, [2024-05-20T06:44:41.723166 #610251] INFO -- : Try with hash version of bundled gems instead of gems/power_assert-2.0.3.gem. We don't use this gem with release version of Ruby. I, [2024-05-20T06:44:41.728075 #610251] INFO -- : Unpacked gems/power_assert-2.0.4dev.gem I, [2024-05-20T06:44:41.730379 #610251] INFO -- : $$$[end] "make after-update -j20" exit with 0. I, [2024-05-20T06:44:41.730534 #610251] INFO -- : $$$[beg] make miniruby -j20 I, [2024-05-20T06:44:41.788695 #610251] INFO -- : BASERUBY = /usr/bin/ruby --disable=gems I, [2024-05-20T06:44:41.788735 #610251] INFO -- : CC = gcc I, [2024-05-20T06:44:41.788747 #610251] INFO -- : LD = ld I, [2024-05-20T06:44:41.788758 #610251] INFO -- : LDSHARED = gcc -shared I, [2024-05-20T06:44:41.788769 #610251] INFO -- : CFLAGS = -O3 -fno-fast-math -ggdb3 -Wall -Wextra -Wdeprecated-declarations -Wdiv-by-zero -Wduplicated-cond -Wimplicit-function-declaration -Wimplicit-int -Wpointer-arith -Wwrite-strings -Wold-style-definition -Wimplicit-fallthrough=0 -Wmissing-noreturn -Wno-cast-function-type -Wno-constant-logical-operand -Wno-long-long -Wno-missing-field-initializers -Wno-overlength-strings -Wno-packed-bitfield-compat -Wno-parentheses-equality -Wno-self-assign -Wno-tautological-compare -Wno-unused-parameter -Wno-unused-value -Wsuggest-attribute=format -Wsuggest-attribute=noreturn -Wunused-variable -Wmisleading-indentation -Wundef -fPIC I, [2024-05-20T06:44:41.788780 #610251] INFO -- : XCFLAGS = -U_FORTIFY_SOURCE -D_FORTIFY_SOURCE=2 -fstack-protector-strong -fno-strict-overflow -fvisibility=hidden -fexcess-precision=standard -DRUBY_EXPORT -I. -I.ext/include/x86_64-linux -I/tmp/ruby/src/trunk/include -I/tmp/ruby/src/trunk -I/tmp/ruby/src/trunk/prism -I/tmp/ruby/src/trunk/enc/unicode/15.0.0 I, [2024-05-20T06:44:41.788790 #610251] INFO -- : CPPFLAGS = I, [2024-05-20T06:44:41.788801 #610251] INFO -- : DLDFLAGS = -Wl,--compress-debug-sections=zlib -Wl,-soname,libruby.so.3.4 -fstack-protector-strong I, [2024-05-20T06:44:41.788811 #610251] INFO -- : SOLIBS = -lz -lrt -lrt -lgmp -ldl -lcrypt -lm -lpthread I, [2024-05-20T06:44:41.788821 #610251] INFO -- : LANG = en_US.UTF-8 I, [2024-05-20T06:44:41.788833 #610251] INFO -- : LC_ALL = I, [2024-05-20T06:44:41.788844 #610251] INFO -- : LC_CTYPE = I, [2024-05-20T06:44:41.788853 #610251] INFO -- : MFLAGS = -j20 --jobserver-auth=4,5 I, [2024-05-20T06:44:41.788863 #610251] INFO -- : RUSTC = no I, [2024-05-20T06:44:41.788873 #610251] INFO -- : YJIT_RUSTC_ARGS = --crate-name=yjit --crate-type=staticlib --edition=2021 -g -C lto=thin -C opt-level=3 -C overflow-checks=on '--out-dir=/tmp/ruby/build/trunk/yjit/target/release/' /tmp/ruby/src/trunk/yjit/src/lib.rs I, [2024-05-20T06:44:41.790096 #610251] INFO -- : gcc (Ubuntu 11.4.0-1ubuntu1~22.04) 11.4.0 I, [2024-05-20T06:44:41.790134 #610251] INFO -- : Copyright (C) 2021 Free Software Foundation, Inc. I, [2024-05-20T06:44:41.790146 #610251] INFO -- : This is free software; see the source for copying conditions. There is NO I, [2024-05-20T06:44:41.790162 #610251] INFO -- : warranty; not even for MERCHANTABILITY or FITNESS FOR A PARTICULAR PURPOSE. I, [2024-05-20T06:44:41.790173 #610251] INFO -- : I, [2024-05-20T06:44:41.812174 #610251] INFO -- : compiling /tmp/ruby/src/trunk/version.c I, [2024-05-20T06:44:41.914779 #610251] INFO -- : linking miniruby I, [2024-05-20T06:44:42.442984 #610251] INFO -- : $$$[end] "make miniruby -j20" exit with 0. I, [2024-05-20T06:44:42.443151 #610251] INFO -- : $$$[beg] make ruby -j20 I, [2024-05-20T06:44:42.503224 #610251] INFO -- : BASERUBY = /usr/bin/ruby --disable=gems I, [2024-05-20T06:44:42.503276 #610251] INFO -- : CC = gcc I, [2024-05-20T06:44:42.503298 #610251] INFO -- : LD = ld I, [2024-05-20T06:44:42.503311 #610251] INFO -- : LDSHARED = gcc -shared I, [2024-05-20T06:44:42.503325 #610251] INFO -- : CFLAGS = -O3 -fno-fast-math -ggdb3 -Wall -Wextra -Wdeprecated-declarations -Wdiv-by-zero -Wduplicated-cond -Wimplicit-function-declaration -Wimplicit-int -Wpointer-arith -Wwrite-strings -Wold-style-definition -Wimplicit-fallthrough=0 -Wmissing-noreturn -Wno-cast-function-type -Wno-constant-logical-operand -Wno-long-long -Wno-missing-field-initializers -Wno-overlength-strings -Wno-packed-bitfield-compat -Wno-parentheses-equality -Wno-self-assign -Wno-tautological-compare -Wno-unused-parameter -Wno-unused-value -Wsuggest-attribute=format -Wsuggest-attribute=noreturn -Wunused-variable -Wmisleading-indentation -Wundef -fPIC I, [2024-05-20T06:44:42.503337 #610251] INFO -- : XCFLAGS = -U_FORTIFY_SOURCE -D_FORTIFY_SOURCE=2 -fstack-protector-strong -fno-strict-overflow -fvisibility=hidden -fexcess-precision=standard -DRUBY_EXPORT -I. -I.ext/include/x86_64-linux -I/tmp/ruby/src/trunk/include -I/tmp/ruby/src/trunk -I/tmp/ruby/src/trunk/prism -I/tmp/ruby/src/trunk/enc/unicode/15.0.0 I, [2024-05-20T06:44:42.503349 #610251] INFO -- : CPPFLAGS = I, [2024-05-20T06:44:42.503361 #610251] INFO -- : DLDFLAGS = -Wl,--compress-debug-sections=zlib -Wl,-soname,libruby.so.3.4 -fstack-protector-strong I, [2024-05-20T06:44:42.503374 #610251] INFO -- : SOLIBS = -lz -lrt -lrt -lgmp -ldl -lcrypt -lm -lpthread I, [2024-05-20T06:44:42.503385 #610251] INFO -- : LANG = en_US.UTF-8 I, [2024-05-20T06:44:42.503396 #610251] INFO -- : LC_ALL = I, [2024-05-20T06:44:42.503407 #610251] INFO -- : LC_CTYPE = I, [2024-05-20T06:44:42.503418 #610251] INFO -- : MFLAGS = -j20 --jobserver-auth=4,5 I, [2024-05-20T06:44:42.503429 #610251] INFO -- : RUSTC = no I, [2024-05-20T06:44:42.503440 #610251] INFO -- : YJIT_RUSTC_ARGS = --crate-name=yjit --crate-type=staticlib --edition=2021 -g -C lto=thin -C opt-level=3 -C overflow-checks=on '--out-dir=/tmp/ruby/build/trunk/yjit/target/release/' /tmp/ruby/src/trunk/yjit/src/lib.rs I, [2024-05-20T06:44:42.505708 #610251] INFO -- : gcc (Ubuntu 11.4.0-1ubuntu1~22.04) 11.4.0 I, [2024-05-20T06:44:42.505769 #610251] INFO -- : Copyright (C) 2021 Free Software Foundation, Inc. I, [2024-05-20T06:44:42.505786 #610251] INFO -- : This is free software; see the source for copying conditions. There is NO I, [2024-05-20T06:44:42.505801 #610251] INFO -- : warranty; not even for MERCHANTABILITY or FITNESS FOR A PARTICULAR PURPOSE. I, [2024-05-20T06:44:42.505815 #610251] INFO -- : I, [2024-05-20T06:44:42.630704 #610251] INFO -- : builtin_binary.inc updated I, [2024-05-20T06:44:42.635385 #610251] INFO -- : c5234a9416e4f20f175185e840b25b0f08674d14078ed7083f37e655458e3ca9 builtin_binary.inc I, [2024-05-20T06:44:42.636164 #610251] INFO -- : compiling /tmp/ruby/src/trunk/builtin.c I, [2024-05-20T06:44:42.818766 #610251] INFO -- : linking static-library libruby-static.a I, [2024-05-20T06:44:43.130234 #610251] INFO -- : linking shared-library libruby.so.3.4.0 I, [2024-05-20T06:44:44.686386 #610251] INFO -- : linking ruby I, [2024-05-20T06:44:44.708757 #610251] INFO -- : $$$[end] "make ruby -j20" exit with 0. I, [2024-05-20T06:44:44.708952 #610251] INFO -- : $$$[beg] make all -j20 I, [2024-05-20T06:44:44.766562 #610251] INFO -- : BASERUBY = /usr/bin/ruby --disable=gems I, [2024-05-20T06:44:44.766599 #610251] INFO -- : CC = gcc I, [2024-05-20T06:44:44.766604 #610251] INFO -- : LD = ld I, [2024-05-20T06:44:44.766608 #610251] INFO -- : LDSHARED = gcc -shared I, [2024-05-20T06:44:44.766612 #610251] INFO -- : CFLAGS = -O3 -fno-fast-math -ggdb3 -Wall -Wextra -Wdeprecated-declarations -Wdiv-by-zero -Wduplicated-cond -Wimplicit-function-declaration -Wimplicit-int -Wpointer-arith -Wwrite-strings -Wold-style-definition -Wimplicit-fallthrough=0 -Wmissing-noreturn -Wno-cast-function-type -Wno-constant-logical-operand -Wno-long-long -Wno-missing-field-initializers -Wno-overlength-strings -Wno-packed-bitfield-compat -Wno-parentheses-equality -Wno-self-assign -Wno-tautological-compare -Wno-unused-parameter -Wno-unused-value -Wsuggest-attribute=format -Wsuggest-attribute=noreturn -Wunused-variable -Wmisleading-indentation -Wundef -fPIC I, [2024-05-20T06:44:44.766622 #610251] INFO -- : XCFLAGS = -U_FORTIFY_SOURCE -D_FORTIFY_SOURCE=2 -fstack-protector-strong -fno-strict-overflow -fvisibility=hidden -fexcess-precision=standard -DRUBY_EXPORT -I. -I.ext/include/x86_64-linux -I/tmp/ruby/src/trunk/include -I/tmp/ruby/src/trunk -I/tmp/ruby/src/trunk/prism -I/tmp/ruby/src/trunk/enc/unicode/15.0.0 I, [2024-05-20T06:44:44.766626 #610251] INFO -- : CPPFLAGS = I, [2024-05-20T06:44:44.766629 #610251] INFO -- : DLDFLAGS = -Wl,--compress-debug-sections=zlib -Wl,-soname,libruby.so.3.4 -fstack-protector-strong I, [2024-05-20T06:44:44.766633 #610251] INFO -- : SOLIBS = -lz -lrt -lrt -lgmp -ldl -lcrypt -lm -lpthread I, [2024-05-20T06:44:44.766636 #610251] INFO -- : LANG = en_US.UTF-8 I, [2024-05-20T06:44:44.766640 #610251] INFO -- : LC_ALL = I, [2024-05-20T06:44:44.766643 #610251] INFO -- : LC_CTYPE = I, [2024-05-20T06:44:44.766647 #610251] INFO -- : MFLAGS = -j20 --jobserver-auth=4,5 I, [2024-05-20T06:44:44.766651 #610251] INFO -- : RUSTC = no I, [2024-05-20T06:44:44.766654 #610251] INFO -- : YJIT_RUSTC_ARGS = --crate-name=yjit --crate-type=staticlib --edition=2021 -g -C lto=thin -C opt-level=3 -C overflow-checks=on '--out-dir=/tmp/ruby/build/trunk/yjit/target/release/' /tmp/ruby/src/trunk/yjit/src/lib.rs I, [2024-05-20T06:44:44.768670 #610251] INFO -- : gcc (Ubuntu 11.4.0-1ubuntu1~22.04) 11.4.0 I, [2024-05-20T06:44:44.768694 #610251] INFO -- : Copyright (C) 2021 Free Software Foundation, Inc. I, [2024-05-20T06:44:44.768703 #610251] INFO -- : This is free software; see the source for copying conditions. There is NO I, [2024-05-20T06:44:44.768708 #610251] INFO -- : warranty; not even for MERCHANTABILITY or FITNESS FOR A PARTICULAR PURPOSE. I, [2024-05-20T06:44:44.768717 #610251] INFO -- : I, [2024-05-20T06:44:44.799836 #610251] INFO -- : generating encdb.h I, [2024-05-20T06:44:44.801171 #610251] INFO -- : generating enc.mk I, [2024-05-20T06:44:44.803115 #610251] INFO -- : building spec/ruby/optional/capi/ext/array_spec.so I, [2024-05-20T06:44:44.803676 #610251] INFO -- : building spec/ruby/optional/capi/ext/basic_object_spec.so I, [2024-05-20T06:44:44.803956 #610251] INFO -- : building spec/ruby/optional/capi/ext/bignum_spec.so I, [2024-05-20T06:44:44.804702 #610251] INFO -- : building spec/ruby/optional/capi/ext/binding_spec.so I, [2024-05-20T06:44:44.805298 #610251] INFO -- : building spec/ruby/optional/capi/ext/boolean_spec.so I, [2024-05-20T06:44:44.805635 #610251] INFO -- : building spec/ruby/optional/capi/ext/class_id_under_autoload_spec.so I, [2024-05-20T06:44:44.806286 #610251] INFO -- : building spec/ruby/optional/capi/ext/class_spec.so I, [2024-05-20T06:44:44.806467 #610251] INFO -- : building spec/ruby/optional/capi/ext/class_under_autoload_spec.so I, [2024-05-20T06:44:44.807825 #610251] INFO -- : building spec/ruby/optional/capi/ext/complex_spec.so I, [2024-05-20T06:44:44.808443 #610251] INFO -- : building spec/ruby/optional/capi/ext/constants_spec.so I, [2024-05-20T06:44:44.808868 #610251] INFO -- : building spec/ruby/optional/capi/ext/data_spec.so I, [2024-05-20T06:44:44.809879 #610251] INFO -- : building spec/ruby/optional/capi/ext/debug_spec.so I, [2024-05-20T06:44:44.810700 #610251] INFO -- : building spec/ruby/optional/capi/ext/encoding_spec.so I, [2024-05-20T06:44:44.811004 #610251] INFO -- : building spec/ruby/optional/capi/ext/enumerator_spec.so I, [2024-05-20T06:44:44.811593 #610251] INFO -- : building spec/ruby/optional/capi/ext/exception_spec.so I, [2024-05-20T06:44:44.811858 #610251] INFO -- : building spec/ruby/optional/capi/ext/fiber_spec.so I, [2024-05-20T06:44:44.812486 #610251] INFO -- : building spec/ruby/optional/capi/ext/file_spec.so I, [2024-05-20T06:44:44.828176 #610251] INFO -- : building spec/ruby/optional/capi/ext/fixnum_spec.so I, [2024-05-20T06:44:44.835958 #610251] INFO -- : encdb.h unchanged I, [2024-05-20T06:44:44.838078 #610251] INFO -- : building spec/ruby/optional/capi/ext/float_spec.so I, [2024-05-20T06:44:44.943133 #610251] INFO -- : building spec/ruby/optional/capi/ext/gc_spec.so I, [2024-05-20T06:44:44.948225 #610251] INFO -- : building spec/ruby/optional/capi/ext/globals_spec.so I, [2024-05-20T06:44:44.958966 #610251] INFO -- : building spec/ruby/optional/capi/ext/hash_spec.so I, [2024-05-20T06:44:44.959770 #610251] INFO -- : building spec/ruby/optional/capi/ext/integer_spec.so I, [2024-05-20T06:44:44.962545 #610251] INFO -- : building spec/ruby/optional/capi/ext/io_spec.so I, [2024-05-20T06:44:44.964258 #610251] INFO -- : building spec/ruby/optional/capi/ext/kernel_spec.so I, [2024-05-20T06:44:44.965426 #610251] INFO -- : building spec/ruby/optional/capi/ext/language_spec.so I, [2024-05-20T06:44:44.973635 #610251] INFO -- : building spec/ruby/optional/capi/ext/marshal_spec.so I, [2024-05-20T06:44:44.978164 #610251] INFO -- : building spec/ruby/optional/capi/ext/module_under_autoload_spec.so I, [2024-05-20T06:44:44.978346 #610251] INFO -- : building spec/ruby/optional/capi/ext/module_spec.so I, [2024-05-20T06:44:44.986105 #610251] INFO -- : building spec/ruby/optional/capi/ext/mutex_spec.so I, [2024-05-20T06:44:44.987271 #610251] INFO -- : building spec/ruby/optional/capi/ext/numeric_spec.so I, [2024-05-20T06:44:44.987596 #610251] INFO -- : building spec/ruby/optional/capi/ext/object_spec.so I, [2024-05-20T06:44:44.998788 #610251] INFO -- : building spec/ruby/optional/capi/ext/proc_spec.so I, [2024-05-20T06:44:45.005462 #610251] INFO -- : building spec/ruby/optional/capi/ext/range_spec.so I, [2024-05-20T06:44:45.024177 #610251] INFO -- : building spec/ruby/optional/capi/ext/rational_spec.so I, [2024-05-20T06:44:45.042374 #610251] INFO -- : building spec/ruby/optional/capi/ext/rbasic_spec.so I, [2024-05-20T06:44:45.073025 #610251] INFO -- : building spec/ruby/optional/capi/ext/regexp_spec.so I, [2024-05-20T06:44:45.104890 #610251] INFO -- : building spec/ruby/optional/capi/ext/string_spec.so I, [2024-05-20T06:44:45.114458 #610251] INFO -- : building spec/ruby/optional/capi/ext/struct_spec.so I, [2024-05-20T06:44:45.115626 #610251] INFO -- : building spec/ruby/optional/capi/ext/st_spec.so I, [2024-05-20T06:44:45.115970 #610251] INFO -- : building spec/ruby/optional/capi/ext/symbol_spec.so I, [2024-05-20T06:44:45.118507 #610251] INFO -- : building spec/ruby/optional/capi/ext/thread_spec.so I, [2024-05-20T06:44:45.120657 #610251] INFO -- : building spec/ruby/optional/capi/ext/time_spec.so I, [2024-05-20T06:44:45.128232 #610251] INFO -- : building spec/ruby/optional/capi/ext/tracepoint_spec.so I, [2024-05-20T06:44:45.149748 #610251] INFO -- : building spec/ruby/optional/capi/ext/typed_data_spec.so I, [2024-05-20T06:44:45.159155 #610251] INFO -- : building spec/ruby/optional/capi/ext/util_spec.so I, [2024-05-20T06:44:45.175876 #610251] INFO -- : making enc I, [2024-05-20T06:44:45.187661 #610251] INFO -- : making srcs under enc I, [2024-05-20T06:44:45.203371 #610251] INFO -- : make[1]: Entering directory '/tmp/ruby/build/trunk' I, [2024-05-20T06:44:45.203429 #610251] INFO -- : make[1]: Nothing to be done for 'enc'. I, [2024-05-20T06:44:45.203437 #610251] INFO -- : make[1]: Leaving directory '/tmp/ruby/build/trunk' I, [2024-05-20T06:44:45.236370 #610251] INFO -- : make[1]: Entering directory '/tmp/ruby/build/trunk' I, [2024-05-20T06:44:45.236428 #610251] INFO -- : make[1]: Nothing to be done for 'srcs'. I, [2024-05-20T06:44:45.236437 #610251] INFO -- : make[1]: Leaving directory '/tmp/ruby/build/trunk' I, [2024-05-20T06:44:45.237018 #610251] INFO -- : generating transdb.h I, [2024-05-20T06:44:45.334007 #610251] INFO -- : transdb.h unchanged I, [2024-05-20T06:44:45.335553 #610251] INFO -- : generating makefiles ext/configure-ext.mk I, [2024-05-20T06:44:45.335692 #610251] INFO -- : making trans I, [2024-05-20T06:44:45.362293 #610251] INFO -- : ext/configure-ext.mk updated I, [2024-05-20T06:44:45.364665 #610251] INFO -- : make[1]: Entering directory '/tmp/ruby/build/trunk' I, [2024-05-20T06:44:45.370782 #610251] INFO -- : make[1]: Entering directory '/tmp/ruby/build/trunk' I, [2024-05-20T06:44:45.370888 #610251] INFO -- : make[1]: Nothing to be done for 'trans'. I, [2024-05-20T06:44:45.370899 #610251] INFO -- : make[1]: Leaving directory '/tmp/ruby/build/trunk' I, [2024-05-20T06:44:45.371735 #610251] INFO -- : making encs I, [2024-05-20T06:44:45.429973 #610251] INFO -- : make[1]: Entering directory '/tmp/ruby/build/trunk' I, [2024-05-20T06:44:45.430043 #610251] INFO -- : make[1]: Nothing to be done for 'encs'. I, [2024-05-20T06:44:45.430068 #610251] INFO -- : make[1]: Leaving directory '/tmp/ruby/build/trunk' I, [2024-05-20T06:44:45.518493 #610251] INFO -- : make[1]: Leaving directory '/tmp/ruby/build/trunk' I, [2024-05-20T06:44:45.519387 #610251] INFO -- : generating makefile exts.mk I, [2024-05-20T06:44:45.556748 #610251] INFO -- : exts.mk unchanged I, [2024-05-20T06:44:45.561631 #610251] INFO -- : make[1]: Entering directory '/tmp/ruby/build/trunk' I, [2024-05-20T06:44:45.580016 #610251] INFO -- : make[2]: Entering directory '/tmp/ruby/build/trunk/ext/digest' I, [2024-05-20T06:44:45.581340 #610251] INFO -- : make[2]: Entering directory '/tmp/ruby/build/trunk/ext/json' I, [2024-05-20T06:44:45.581697 #610251] INFO -- : make[2]: Entering directory '/tmp/ruby/build/trunk/ext/coverage' I, [2024-05-20T06:44:45.582410 #610251] INFO -- : make[2]: Entering directory '/tmp/ruby/build/trunk/ext/date' I, [2024-05-20T06:44:45.583526 #610251] INFO -- : make[2]: Entering directory '/tmp/ruby/build/trunk/ext/io/console' I, [2024-05-20T06:44:45.583551 #610251] INFO -- : make[2]: Entering directory '/tmp/ruby/build/trunk/ext/monitor' I, [2024-05-20T06:44:45.583564 #610251] INFO -- : make[2]: Entering directory '/tmp/ruby/build/trunk/ext/rubyvm' I, [2024-05-20T06:44:45.583991 #610251] INFO -- : make[2]: Entering directory '/tmp/ruby/build/trunk/ext/pathname' I, [2024-05-20T06:44:45.584385 #610251] INFO -- : make[2]: Entering directory '/tmp/ruby/build/trunk/ext/fiddle' I, [2024-05-20T06:44:45.584484 #610251] INFO -- : make[2]: Entering directory '/tmp/ruby/build/trunk/ext/pty' I, [2024-05-20T06:44:45.584798 #610251] INFO -- : make[2]: Leaving directory '/tmp/ruby/build/trunk/ext/coverage' I, [2024-05-20T06:44:45.585289 #610251] INFO -- : make[2]: Entering directory '/tmp/ruby/build/trunk/ext/objspace' I, [2024-05-20T06:44:45.585576 #610251] INFO -- : make[2]: Leaving directory '/tmp/ruby/build/trunk/ext/digest' I, [2024-05-20T06:44:45.585607 #610251] INFO -- : make[2]: Leaving directory '/tmp/ruby/build/trunk/ext/rubyvm' I, [2024-05-20T06:44:45.585895 #610251] INFO -- : make[2]: Leaving directory '/tmp/ruby/build/trunk/ext/io/console' I, [2024-05-20T06:44:45.585928 #610251] INFO -- : make[2]: Leaving directory '/tmp/ruby/build/trunk/ext/monitor' I, [2024-05-20T06:44:45.586397 #610251] INFO -- : make[2]: Leaving directory '/tmp/ruby/build/trunk/ext/pathname' I, [2024-05-20T06:44:45.586438 #610251] INFO -- : make[2]: Entering directory '/tmp/ruby/build/trunk/ext/psych' I, [2024-05-20T06:44:45.586912 #610251] INFO -- : make[2]: Leaving directory '/tmp/ruby/build/trunk/ext/date' I, [2024-05-20T06:44:45.586927 #610251] INFO -- : make[2]: Leaving directory '/tmp/ruby/build/trunk/ext/json' I, [2024-05-20T06:44:45.587316 #610251] INFO -- : make[2]: Leaving directory '/tmp/ruby/build/trunk/ext/pty' I, [2024-05-20T06:44:45.588197 #610251] INFO -- : make[2]: Entering directory '/tmp/ruby/build/trunk/.bundle/gems/bigdecimal-3.1.8/ext/bigdecimal' I, [2024-05-20T06:44:45.588376 #610251] INFO -- : make[2]: Leaving directory '/tmp/ruby/build/trunk/ext/objspace' I, [2024-05-20T06:44:45.589161 #610251] INFO -- : make[2]: Entering directory '/tmp/ruby/build/trunk/ext/ripper' I, [2024-05-20T06:44:45.589502 #610251] INFO -- : make[2]: Entering directory '/tmp/ruby/build/trunk/.bundle/gems/debug-1.9.2/ext/debug' I, [2024-05-20T06:44:45.590298 #610251] INFO -- : make[2]: Entering directory '/tmp/ruby/build/trunk/.bundle/gems/nkf-0.2.0/ext/nkf' I, [2024-05-20T06:44:45.590340 #610251] INFO -- : make[2]: Entering directory '/tmp/ruby/build/trunk/.bundle/gems/syslog-0.1.2/ext/syslog' I, [2024-05-20T06:44:45.590441 #610251] INFO -- : make[2]: Entering directory '/tmp/ruby/build/trunk/.bundle/gems/racc-1.7.3/ext/racc/cparse' I, [2024-05-20T06:44:45.590768 #610251] INFO -- : make[2]: Entering directory '/tmp/ruby/build/trunk/.bundle/gems/rbs-3.4.4/ext/rbs_extension' I, [2024-05-20T06:44:45.591100 #610251] INFO -- : make[2]: Leaving directory '/tmp/ruby/build/trunk/ext/fiddle' I, [2024-05-20T06:44:45.593790 #610251] INFO -- : make[2]: Entering directory '/tmp/ruby/build/trunk/ext/digest/sha2' I, [2024-05-20T06:44:45.594203 #610251] INFO -- : make[2]: Leaving directory '/tmp/ruby/build/trunk/ext/ripper' I, [2024-05-20T06:44:45.595892 #610251] INFO -- : make[2]: Entering directory '/tmp/ruby/build/trunk/ext/socket' I, [2024-05-20T06:44:45.596170 #610251] INFO -- : make[2]: Leaving directory '/tmp/ruby/build/trunk/ext/digest/sha2' I, [2024-05-20T06:44:45.597441 #610251] INFO -- : make[2]: Leaving directory '/tmp/ruby/build/trunk/ext/psych' I, [2024-05-20T06:44:45.597460 #610251] INFO -- : make[2]: Entering directory '/tmp/ruby/build/trunk/ext/openssl' I, [2024-05-20T06:44:45.601931 #610251] INFO -- : make[2]: Leaving directory '/tmp/ruby/build/trunk/ext/socket' I, [2024-05-20T06:44:45.612908 #610251] INFO -- : make[2]: Leaving directory '/tmp/ruby/build/trunk/ext/openssl' I, [2024-05-20T06:44:45.613929 #610251] INFO -- : make[2]: Leaving directory '/tmp/ruby/build/trunk/.bundle/gems/syslog-0.1.2/ext/syslog' I, [2024-05-20T06:44:45.614235 #610251] INFO -- : make[2]: Leaving directory '/tmp/ruby/build/trunk/.bundle/gems/debug-1.9.2/ext/debug' I, [2024-05-20T06:44:45.615712 #610251] INFO -- : make[2]: Leaving directory '/tmp/ruby/build/trunk/.bundle/gems/nkf-0.2.0/ext/nkf' I, [2024-05-20T06:44:45.615739 #610251] INFO -- : make[2]: Leaving directory '/tmp/ruby/build/trunk/.bundle/gems/racc-1.7.3/ext/racc/cparse' I, [2024-05-20T06:44:45.618186 #610251] INFO -- : make[2]: Leaving directory '/tmp/ruby/build/trunk/.bundle/gems/bigdecimal-3.1.8/ext/bigdecimal' I, [2024-05-20T06:44:45.622293 #610251] INFO -- : make[2]: Leaving directory '/tmp/ruby/build/trunk/.bundle/gems/rbs-3.4.4/ext/rbs_extension' I, [2024-05-20T06:44:45.645883 #610251] INFO -- : make[2]: Entering directory '/tmp/ruby/build/trunk' I, [2024-05-20T06:44:45.713889 #610251] INFO -- : linking ruby I, [2024-05-20T06:44:45.736646 #610251] INFO -- : make[2]: Leaving directory '/tmp/ruby/build/trunk' I, [2024-05-20T06:44:45.737209 #610251] INFO -- : make[1]: Leaving directory '/tmp/ruby/build/trunk' I, [2024-05-20T06:44:45.741170 #610251] INFO -- : make[1]: Entering directory '/tmp/ruby/build/trunk' I, [2024-05-20T06:44:45.741192 #610251] INFO -- : make[1]: Nothing to be done for 'note'. I, [2024-05-20T06:44:45.741198 #610251] INFO -- : make[1]: Leaving directory '/tmp/ruby/build/trunk' I, [2024-05-20T06:44:45.741711 #610251] INFO -- : $$$[end] "make all -j20" exit with 0. I, [2024-05-20T06:44:45.741941 #610251] INFO -- : $$$[beg] make install -j20 I, [2024-05-20T06:44:45.816658 #610251] INFO -- : Update power_assert to 84e85124c5014a139af39161d484156cfe87a9ed I, [2024-05-20T06:44:45.816889 #610251] INFO -- : Update rbs to ba7872795d5de04adb8ff500c0e6afdc81a041dd I, [2024-05-20T06:44:45.817787 #610251] INFO -- : Update typeprof to b19a6416da3a05d57fadd6ffdadb382b6d236ca5 I, [2024-05-20T06:44:45.818715 #610251] INFO -- : echo 84e85124c5014a139af39161d484156cfe87a9ed | /bin/sh /tmp/ruby/src/trunk/tool/ifchange /tmp/ruby/src/trunk/.bundle/.timestamp/power_assert.revision - I, [2024-05-20T06:44:45.818785 #610251] INFO -- : echo ba7872795d5de04adb8ff500c0e6afdc81a041dd | /bin/sh /tmp/ruby/src/trunk/tool/ifchange /tmp/ruby/src/trunk/.bundle/.timestamp/rbs.revision - I, [2024-05-20T06:44:45.819753 #610251] INFO -- : BASERUBY = /usr/bin/ruby --disable=gems I, [2024-05-20T06:44:45.819821 #610251] INFO -- : CC = gcc I, [2024-05-20T06:44:45.819839 #610251] INFO -- : LD = ld I, [2024-05-20T06:44:45.819873 #610251] INFO -- : LDSHARED = gcc -shared I, [2024-05-20T06:44:45.819900 #610251] INFO -- : CFLAGS = -O3 -fno-fast-math -ggdb3 -Wall -Wextra -Wdeprecated-declarations -Wdiv-by-zero -Wduplicated-cond -Wimplicit-function-declaration -Wimplicit-int -Wpointer-arith -Wwrite-strings -Wold-style-definition -Wimplicit-fallthrough=0 -Wmissing-noreturn -Wno-cast-function-type -Wno-constant-logical-operand -Wno-long-long -Wno-missing-field-initializers -Wno-overlength-strings -Wno-packed-bitfield-compat -Wno-parentheses-equality -Wno-self-assign -Wno-tautological-compare -Wno-unused-parameter -Wno-unused-value -Wsuggest-attribute=format -Wsuggest-attribute=noreturn -Wunused-variable -Wmisleading-indentation -Wundef -fPIC I, [2024-05-20T06:44:45.819917 #610251] INFO -- : XCFLAGS = -U_FORTIFY_SOURCE -D_FORTIFY_SOURCE=2 -fstack-protector-strong -fno-strict-overflow -fvisibility=hidden -fexcess-precision=standard -DRUBY_EXPORT -I. -I.ext/include/x86_64-linux -I/tmp/ruby/src/trunk/include -I/tmp/ruby/src/trunk -I/tmp/ruby/src/trunk/prism -I/tmp/ruby/src/trunk/enc/unicode/15.0.0 I, [2024-05-20T06:44:45.819934 #610251] INFO -- : CPPFLAGS = I, [2024-05-20T06:44:45.819954 #610251] INFO -- : DLDFLAGS = -Wl,--compress-debug-sections=zlib -Wl,-soname,libruby.so.3.4 -fstack-protector-strong I, [2024-05-20T06:44:45.819970 #610251] INFO -- : SOLIBS = -lz -lrt -lrt -lgmp -ldl -lcrypt -lm -lpthread I, [2024-05-20T06:44:45.819985 #610251] INFO -- : LANG = en_US.UTF-8 I, [2024-05-20T06:44:45.820000 #610251] INFO -- : LC_ALL = I, [2024-05-20T06:44:45.820014 #610251] INFO -- : LC_CTYPE = I, [2024-05-20T06:44:45.820029 #610251] INFO -- : MFLAGS = -j20 --jobserver-auth=4,5 I, [2024-05-20T06:44:45.820043 #610251] INFO -- : RUSTC = no I, [2024-05-20T06:44:45.820059 #610251] INFO -- : YJIT_RUSTC_ARGS = --crate-name=yjit --crate-type=staticlib --edition=2021 -g -C lto=thin -C opt-level=3 -C overflow-checks=on '--out-dir=/tmp/ruby/build/trunk/yjit/target/release/' /tmp/ruby/src/trunk/yjit/src/lib.rs I, [2024-05-20T06:44:45.821968 #610251] INFO -- : /tmp/ruby/src/trunk/.bundle/.timestamp/power_assert.revision unchanged I, [2024-05-20T06:44:45.822173 #610251] INFO -- : /tmp/ruby/src/trunk/.bundle/.timestamp/rbs.revision unchanged I, [2024-05-20T06:44:45.851325 #610251] INFO -- : echo b19a6416da3a05d57fadd6ffdadb382b6d236ca5 | /bin/sh /tmp/ruby/src/trunk/tool/ifchange /tmp/ruby/src/trunk/.bundle/.timestamp/typeprof.revision - I, [2024-05-20T06:44:45.852022 #610251] INFO -- : generating encdb.h I, [2024-05-20T06:44:45.852074 #610251] INFO -- : gcc (Ubuntu 11.4.0-1ubuntu1~22.04) 11.4.0 I, [2024-05-20T06:44:45.852087 #610251] INFO -- : Copyright (C) 2021 Free Software Foundation, Inc. I, [2024-05-20T06:44:45.852098 #610251] INFO -- : This is free software; see the source for copying conditions. There is NO I, [2024-05-20T06:44:45.852110 #610251] INFO -- : warranty; not even for MERCHANTABILITY or FITNESS FOR A PARTICULAR PURPOSE. I, [2024-05-20T06:44:45.852127 #610251] INFO -- : I, [2024-05-20T06:44:45.853071 #610251] INFO -- : generating enc.mk I, [2024-05-20T06:44:45.853555 #610251] INFO -- : /tmp/ruby/src/trunk/.bundle/.timestamp/typeprof.revision unchanged I, [2024-05-20T06:44:45.876313 #610251] INFO -- : encdb.h unchanged I, [2024-05-20T06:44:45.877640 #610251] INFO -- : Building power_assert@84e85124c5014a139af39161d484156cfe87a9ed to /tmp/ruby/src/trunk/gems/power_assert-2.0.3.gem I, [2024-05-20T06:44:45.946527 #610251] INFO -- : Successfully built RubyGem I, [2024-05-20T06:44:45.946579 #610251] INFO -- : Name: power_assert I, [2024-05-20T06:44:45.946592 #610251] INFO -- : Version: 2.0.4dev I, [2024-05-20T06:44:45.946603 #610251] INFO -- : File: power_assert-2.0.4dev.gem I, [2024-05-20T06:44:45.948441 #610251] INFO -- : Extracting bundle gem power_assert-2.0.3... I, [2024-05-20T06:44:45.974936 #610251] INFO -- : making srcs under enc I, [2024-05-20T06:44:45.975153 #610251] INFO -- : making enc I, [2024-05-20T06:44:45.992086 #610251] INFO -- : make[1]: Entering directory '/tmp/ruby/build/trunk' I, [2024-05-20T06:44:45.992143 #610251] INFO -- : make[1]: Nothing to be done for 'enc'. I, [2024-05-20T06:44:45.992156 #610251] INFO -- : make[1]: Leaving directory '/tmp/ruby/build/trunk' I, [2024-05-20T06:44:46.004751 #610251] INFO -- : make[1]: Entering directory '/tmp/ruby/build/trunk' I, [2024-05-20T06:44:46.004807 #610251] INFO -- : make[1]: Nothing to be done for 'srcs'. I, [2024-05-20T06:44:46.004820 #610251] INFO -- : make[1]: Leaving directory '/tmp/ruby/build/trunk' I, [2024-05-20T06:44:46.005439 #610251] INFO -- : generating transdb.h I, [2024-05-20T06:44:46.009386 #610251] INFO -- : Try with hash version of bundled gems instead of gems/power_assert-2.0.3.gem. We don't use this gem with release version of Ruby. I, [2024-05-20T06:44:46.014415 #610251] INFO -- : Unpacked gems/power_assert-2.0.4dev.gem I, [2024-05-20T06:44:46.103088 #610251] INFO -- : transdb.h unchanged I, [2024-05-20T06:44:46.104633 #610251] INFO -- : generating makefiles ext/configure-ext.mk I, [2024-05-20T06:44:46.104703 #610251] INFO -- : making trans I, [2024-05-20T06:44:46.132021 #610251] INFO -- : ext/configure-ext.mk unchanged I, [2024-05-20T06:44:46.134162 #610251] INFO -- : make[1]: Entering directory '/tmp/ruby/build/trunk' I, [2024-05-20T06:44:46.138905 #610251] INFO -- : make[1]: Entering directory '/tmp/ruby/build/trunk' I, [2024-05-20T06:44:46.139002 #610251] INFO -- : make[1]: Nothing to be done for 'trans'. I, [2024-05-20T06:44:46.139012 #610251] INFO -- : make[1]: Leaving directory '/tmp/ruby/build/trunk' I, [2024-05-20T06:44:46.216786 #610251] INFO -- : making encs I, [2024-05-20T06:44:46.277635 #610251] INFO -- : make[1]: Entering directory '/tmp/ruby/build/trunk' I, [2024-05-20T06:44:46.277692 #610251] INFO -- : make[1]: Nothing to be done for 'encs'. I, [2024-05-20T06:44:46.277701 #610251] INFO -- : make[1]: Leaving directory '/tmp/ruby/build/trunk' I, [2024-05-20T06:44:46.281314 #610251] INFO -- : make[1]: Leaving directory '/tmp/ruby/build/trunk' I, [2024-05-20T06:44:46.282236 #610251] INFO -- : generating makefile exts.mk I, [2024-05-20T06:44:46.319560 #610251] INFO -- : exts.mk unchanged I, [2024-05-20T06:44:46.324458 #610251] INFO -- : make[1]: Entering directory '/tmp/ruby/build/trunk' I, [2024-05-20T06:44:46.342824 #610251] INFO -- : make[2]: Entering directory '/tmp/ruby/build/trunk/ext/digest' I, [2024-05-20T06:44:46.344516 #610251] INFO -- : make[2]: Entering directory '/tmp/ruby/build/trunk/ext/date' I, [2024-05-20T06:44:46.344579 #610251] INFO -- : make[2]: Entering directory '/tmp/ruby/build/trunk/ext/json' I, [2024-05-20T06:44:46.344942 #610251] INFO -- : make[2]: Entering directory '/tmp/ruby/build/trunk/ext/coverage' I, [2024-05-20T06:44:46.345150 #610251] INFO -- : make[2]: Entering directory '/tmp/ruby/build/trunk/ext/io/console' I, [2024-05-20T06:44:46.346313 #610251] INFO -- : make[2]: Entering directory '/tmp/ruby/build/trunk/ext/monitor' I, [2024-05-20T06:44:46.346708 #610251] INFO -- : make[2]: Leaving directory '/tmp/ruby/build/trunk/ext/digest' I, [2024-05-20T06:44:46.346859 #610251] INFO -- : make[2]: Entering directory '/tmp/ruby/build/trunk/ext/fiddle' I, [2024-05-20T06:44:46.347451 #610251] INFO -- : make[2]: Entering directory '/tmp/ruby/build/trunk/ext/rubyvm' I, [2024-05-20T06:44:46.347780 #610251] INFO -- : make[2]: Leaving directory '/tmp/ruby/build/trunk/ext/coverage' I, [2024-05-20T06:44:46.347842 #610251] INFO -- : make[2]: Leaving directory '/tmp/ruby/build/trunk/ext/io/console' I, [2024-05-20T06:44:46.348131 #610251] INFO -- : make[2]: Leaving directory '/tmp/ruby/build/trunk/ext/date' I, [2024-05-20T06:44:46.348524 #610251] INFO -- : make[2]: Entering directory '/tmp/ruby/build/trunk/ext/pathname' I, [2024-05-20T06:44:46.348535 #610251] INFO -- : make[2]: Leaving directory '/tmp/ruby/build/trunk/ext/monitor' I, [2024-05-20T06:44:46.348772 #610251] INFO -- : make[2]: Entering directory '/tmp/ruby/build/trunk/ext/objspace' I, [2024-05-20T06:44:46.348982 #610251] INFO -- : make[2]: Leaving directory '/tmp/ruby/build/trunk/ext/rubyvm' I, [2024-05-20T06:44:46.349032 #610251] INFO -- : make[2]: Entering directory '/tmp/ruby/build/trunk/ext/pty' I, [2024-05-20T06:44:46.351014 #610251] INFO -- : make[2]: Entering directory '/tmp/ruby/build/trunk/ext/psych' I, [2024-05-20T06:44:46.351218 #610251] INFO -- : make[2]: Leaving directory '/tmp/ruby/build/trunk/ext/pathname' I, [2024-05-20T06:44:46.351313 #610251] INFO -- : make[2]: Entering directory '/tmp/ruby/build/trunk/.bundle/gems/bigdecimal-3.1.8/ext/bigdecimal' I, [2024-05-20T06:44:46.351415 #610251] INFO -- : make[2]: Entering directory '/tmp/ruby/build/trunk/.bundle/gems/debug-1.9.2/ext/debug' I, [2024-05-20T06:44:46.351596 #610251] INFO -- : make[2]: Entering directory '/tmp/ruby/build/trunk/.bundle/gems/nkf-0.2.0/ext/nkf' I, [2024-05-20T06:44:46.351732 #610251] INFO -- : make[2]: Leaving directory '/tmp/ruby/build/trunk/ext/pty' I, [2024-05-20T06:44:46.351763 #610251] INFO -- : make[2]: Entering directory '/tmp/ruby/build/trunk/.bundle/gems/racc-1.7.3/ext/racc/cparse' I, [2024-05-20T06:44:46.351863 #610251] INFO -- : make[2]: Entering directory '/tmp/ruby/build/trunk/ext/ripper' I, [2024-05-20T06:44:46.352329 #610251] INFO -- : make[2]: Entering directory '/tmp/ruby/build/trunk/.bundle/gems/syslog-0.1.2/ext/syslog' I, [2024-05-20T06:44:46.352597 #610251] INFO -- : make[2]: Entering directory '/tmp/ruby/build/trunk/.bundle/gems/rbs-3.4.4/ext/rbs_extension' I, [2024-05-20T06:44:46.353054 #610251] INFO -- : make[2]: Leaving directory '/tmp/ruby/build/trunk/ext/objspace' I, [2024-05-20T06:44:46.353769 #610251] INFO -- : make[2]: Leaving directory '/tmp/ruby/build/trunk/ext/fiddle' I, [2024-05-20T06:44:46.354203 #610251] INFO -- : make[2]: Leaving directory '/tmp/ruby/build/trunk/ext/json' I, [2024-05-20T06:44:46.357015 #610251] INFO -- : make[2]: Entering directory '/tmp/ruby/build/trunk/ext/socket' I, [2024-05-20T06:44:46.357182 #610251] INFO -- : make[2]: Entering directory '/tmp/ruby/build/trunk/ext/openssl' I, [2024-05-20T06:44:46.358757 #610251] INFO -- : make[2]: Entering directory '/tmp/ruby/build/trunk/ext/digest/sha2' I, [2024-05-20T06:44:46.358832 #610251] INFO -- : make[2]: Leaving directory '/tmp/ruby/build/trunk/ext/ripper' I, [2024-05-20T06:44:46.361937 #610251] INFO -- : make[2]: Leaving directory '/tmp/ruby/build/trunk/ext/digest/sha2' I, [2024-05-20T06:44:46.363876 #610251] INFO -- : make[2]: Leaving directory '/tmp/ruby/build/trunk/ext/psych' I, [2024-05-20T06:44:46.365993 #610251] INFO -- : make[2]: Leaving directory '/tmp/ruby/build/trunk/ext/socket' I, [2024-05-20T06:44:46.372398 #610251] INFO -- : make[2]: Leaving directory '/tmp/ruby/build/trunk/ext/openssl' I, [2024-05-20T06:44:46.375912 #610251] INFO -- : make[2]: Leaving directory '/tmp/ruby/build/trunk/.bundle/gems/syslog-0.1.2/ext/syslog' I, [2024-05-20T06:44:46.376494 #610251] INFO -- : make[2]: Leaving directory '/tmp/ruby/build/trunk/.bundle/gems/bigdecimal-3.1.8/ext/bigdecimal' I, [2024-05-20T06:44:46.377523 #610251] INFO -- : make[2]: Leaving directory '/tmp/ruby/build/trunk/.bundle/gems/debug-1.9.2/ext/debug' I, [2024-05-20T06:44:46.386873 #610251] INFO -- : make[2]: Leaving directory '/tmp/ruby/build/trunk/.bundle/gems/rbs-3.4.4/ext/rbs_extension' I, [2024-05-20T06:44:46.387484 #610251] INFO -- : make[2]: Leaving directory '/tmp/ruby/build/trunk/.bundle/gems/racc-1.7.3/ext/racc/cparse' I, [2024-05-20T06:44:46.387971 #610251] INFO -- : make[2]: Leaving directory '/tmp/ruby/build/trunk/.bundle/gems/nkf-0.2.0/ext/nkf' I, [2024-05-20T06:44:46.413207 #610251] INFO -- : make[2]: Entering directory '/tmp/ruby/build/trunk' I, [2024-05-20T06:44:46.485902 #610251] INFO -- : make[2]: 'ruby' is up to date. I, [2024-05-20T06:44:46.485957 #610251] INFO -- : make[2]: Leaving directory '/tmp/ruby/build/trunk' I, [2024-05-20T06:44:46.486454 #610251] INFO -- : make[1]: Leaving directory '/tmp/ruby/build/trunk' I, [2024-05-20T06:44:46.490065 #610251] INFO -- : make[1]: Entering directory '/tmp/ruby/build/trunk' I, [2024-05-20T06:44:46.490115 #610251] INFO -- : make[1]: Nothing to be done for 'note'. I, [2024-05-20T06:44:46.490146 #610251] INFO -- : make[1]: Leaving directory '/tmp/ruby/build/trunk' I, [2024-05-20T06:44:46.490399 #610251] INFO -- : ./miniruby -I/tmp/ruby/src/trunk/lib -I. -I.ext/common /tmp/ruby/src/trunk/tool/runruby.rb --extout=.ext -- --disable-gems -r./x86_64-linux-fake /tmp/ruby/src/trunk/tool/rbinstall.rb --make="make" --dest-dir="" --extout=".ext" --ext-build-dir="./ext" --mflags="-j20 --jobserver-auth=4,5" --make-flags=" -j20 --jobserver-auth=4,5" --data-mode=0644 --prog-mode=0755 --installed-list .installed.list --mantype="doc" --gnumake --install=all --exclude=doc I, [2024-05-20T06:44:46.586905 #610251] INFO -- : Installing to I, [2024-05-20T06:44:46.586984 #610251] INFO -- : installing binary commands: /tmp/ruby/install/trunk/bin I, [2024-05-20T06:44:46.586999 #610251] INFO -- : installing base libraries: /tmp/ruby/install/trunk/lib I, [2024-05-20T06:44:46.594249 #610251] INFO -- : installing arch files: /tmp/ruby/install/trunk/lib/ruby/3.4.0+0/x86_64-linux I, [2024-05-20T06:44:46.594308 #610251] INFO -- : installing pkgconfig data: /tmp/ruby/install/trunk/lib/pkgconfig I, [2024-05-20T06:44:46.594333 #610251] INFO -- : installing extension objects: /tmp/ruby/install/trunk/lib/ruby/3.4.0+0/x86_64-linux I, [2024-05-20T06:44:46.604009 #610251] INFO -- : installing extension objects: /tmp/ruby/install/trunk/lib/ruby/site_ruby/3.4.0+0/x86_64-linux I, [2024-05-20T06:44:46.604068 #610251] INFO -- : installing extension objects: /tmp/ruby/install/trunk/lib/ruby/vendor_ruby/3.4.0+0/x86_64-linux I, [2024-05-20T06:44:46.604082 #610251] INFO -- : installing extension headers: /tmp/ruby/install/trunk/include/ruby-3.4.0+0/x86_64-linux I, [2024-05-20T06:44:46.604111 #610251] INFO -- : installing extension scripts: /tmp/ruby/install/trunk/lib/ruby/3.4.0+0 I, [2024-05-20T06:44:46.606916 #610251] INFO -- : installing extension scripts: /tmp/ruby/install/trunk/lib/ruby/site_ruby/3.4.0+0 I, [2024-05-20T06:44:46.606985 #610251] INFO -- : installing extension scripts: /tmp/ruby/install/trunk/lib/ruby/vendor_ruby/3.4.0+0 I, [2024-05-20T06:44:46.607001 #610251] INFO -- : installing extension headers: /tmp/ruby/install/trunk/include/ruby-3.4.0+0/ruby I, [2024-05-20T06:44:46.607012 #610251] INFO -- : installing command scripts: /tmp/ruby/install/trunk/bin I, [2024-05-20T06:44:46.607025 #610251] INFO -- : installing library scripts: /tmp/ruby/install/trunk/lib/ruby/3.4.0+0 I, [2024-05-20T06:44:46.639378 #610251] INFO -- : installing common headers: /tmp/ruby/install/trunk/include/ruby-3.4.0+0 I, [2024-05-20T06:44:46.645923 #610251] INFO -- : installing manpages: /tmp/ruby/install/trunk/share/man/man1 I, [2024-05-20T06:44:46.645993 #610251] INFO -- : installing default gems from lib: /tmp/ruby/install/trunk/lib/ruby/gems/3.4.0+0 I, [2024-05-20T06:44:46.668468 #610251] INFO -- : benchmark 0.3.0 I, [2024-05-20T06:44:46.670345 #610251] INFO -- : bundler 2.6.0.dev I, [2024-05-20T06:44:46.672467 #610251] INFO -- : cgi 0.4.1 I, [2024-05-20T06:44:46.673010 #610251] INFO -- : delegate 0.3.1 I, [2024-05-20T06:44:46.673462 #610251] INFO -- : did_you_mean 1.6.3 I, [2024-05-20T06:44:46.673960 #610251] INFO -- : english 0.8.0 I, [2024-05-20T06:44:46.674395 #610251] INFO -- : erb 4.0.4 I, [2024-05-20T06:44:46.675429 #610251] INFO -- : error_highlight 0.6.0 I, [2024-05-20T06:44:46.676291 #610251] INFO -- : fileutils 1.7.2 I, [2024-05-20T06:44:46.677168 #610251] INFO -- : find 0.2.0 I, [2024-05-20T06:44:46.677793 #610251] INFO -- : forwardable 1.3.3 I, [2024-05-20T06:44:46.678883 #610251] INFO -- : ipaddr 1.2.6 I, [2024-05-20T06:44:46.679491 #610251] INFO -- : irb 1.13.1 I, [2024-05-20T06:44:46.680296 #610251] INFO -- : logger 1.6.0 I, [2024-05-20T06:44:46.680779 #610251] INFO -- : net-http 0.4.1 I, [2024-05-20T06:44:46.681279 #610251] INFO -- : net-protocol 0.2.2 I, [2024-05-20T06:44:46.681749 #610251] INFO -- : open-uri 0.4.1 I, [2024-05-20T06:44:46.682260 #610251] INFO -- : open3 0.2.1 I, [2024-05-20T06:44:46.682729 #610251] INFO -- : optparse 0.5.0 I, [2024-05-20T06:44:46.683194 #610251] INFO -- : ostruct 0.6.0 I, [2024-05-20T06:44:46.683631 #610251] INFO -- : pp 0.5.0 I, [2024-05-20T06:44:46.684119 #610251] INFO -- : prettyprint 0.2.0 I, [2024-05-20T06:44:46.684570 #610251] INFO -- : prism 0.29.0 I, [2024-05-20T06:44:46.685072 #610251] INFO -- : pstore 0.1.3 I, [2024-05-20T06:44:46.685617 #610251] INFO -- : rdoc 6.6.3.1 I, [2024-05-20T06:44:46.686576 #610251] INFO -- : readline 0.0.4 I, [2024-05-20T06:44:46.687047 #610251] INFO -- : reline 0.5.7 I, [2024-05-20T06:44:46.687635 #610251] INFO -- : resolv 0.4.0 I, [2024-05-20T06:44:46.688105 #610251] INFO -- : ruby2_keywords 0.0.5 I, [2024-05-20T06:44:46.688596 #610251] INFO -- : securerandom 0.3.1 I, [2024-05-20T06:44:46.689592 #610251] INFO -- : set 1.1.0 I, [2024-05-20T06:44:46.690318 #610251] INFO -- : shellwords 0.2.0 I, [2024-05-20T06:44:46.690807 #610251] INFO -- : singleton 0.2.0 I, [2024-05-20T06:44:46.691243 #610251] INFO -- : syntax_suggest 2.0.0 I, [2024-05-20T06:44:46.691936 #610251] INFO -- : tempfile 0.2.1 I, [2024-05-20T06:44:46.692483 #610251] INFO -- : time 0.3.0 I, [2024-05-20T06:44:46.692967 #610251] INFO -- : timeout 0.4.1 I, [2024-05-20T06:44:46.693432 #610251] INFO -- : tmpdir 0.2.0 I, [2024-05-20T06:44:46.693892 #610251] INFO -- : tsort 0.2.0 I, [2024-05-20T06:44:46.694294 #610251] INFO -- : un 0.3.0 I, [2024-05-20T06:44:46.694731 #610251] INFO -- : uri 0.13.0 I, [2024-05-20T06:44:46.695312 #610251] INFO -- : weakref 0.1.3 I, [2024-05-20T06:44:46.695700 #610251] INFO -- : yaml 0.3.0 I, [2024-05-20T06:44:46.696089 #610251] INFO -- : installing default gems from ext: /tmp/ruby/install/trunk/lib/ruby/gems/3.4.0+0 I, [2024-05-20T06:44:46.702711 #610251] INFO -- : date 3.3.4 I, [2024-05-20T06:44:46.703235 #610251] INFO -- : digest 3.1.1 I, [2024-05-20T06:44:46.703754 #610251] INFO -- : etc 1.4.3 I, [2024-05-20T06:44:46.704237 #610251] INFO -- : fcntl 1.1.0 I, [2024-05-20T06:44:46.704709 #610251] INFO -- : fiddle 1.1.3 I, [2024-05-20T06:44:46.705183 #610251] INFO -- : io-console 0.7.2 I, [2024-05-20T06:44:46.705656 #610251] INFO -- : io-nonblock 0.3.0 I, [2024-05-20T06:44:46.706045 #610251] INFO -- : io-wait 0.3.1 I, [2024-05-20T06:44:46.706525 #610251] INFO -- : json 2.7.2 I, [2024-05-20T06:44:46.707065 #610251] INFO -- : openssl 3.2.0 I, [2024-05-20T06:44:46.707620 #610251] INFO -- : pathname 0.3.0 I, [2024-05-20T06:44:46.708171 #610251] INFO -- : psych 5.1.2 I, [2024-05-20T06:44:46.708734 #610251] INFO -- : stringio 3.1.1 I, [2024-05-20T06:44:46.709224 #610251] INFO -- : strscan 3.1.1 I, [2024-05-20T06:44:46.709638 #610251] INFO -- : zlib 3.1.0 I, [2024-05-20T06:44:46.710075 #610251] INFO -- : installing bundled gems: /tmp/ruby/install/trunk/lib/ruby/gems/3.4.0+0 I, [2024-05-20T06:44:46.710631 #610251] INFO -- : minitest 5.23.0 I, [2024-05-20T06:44:46.719059 #610251] INFO -- : rake 13.2.1 I, [2024-05-20T06:44:46.722473 #610251] INFO -- : test-unit 3.6.2 I, [2024-05-20T06:44:46.727404 #610251] INFO -- : rexml 3.2.6 I, [2024-05-20T06:44:46.731154 #610251] INFO -- : rss 0.3.0 I, [2024-05-20T06:44:46.733840 #610251] INFO -- : net-ftp 0.3.4 I, [2024-05-20T06:44:46.735452 #610251] INFO -- : net-imap 0.4.11 I, [2024-05-20T06:44:46.739175 #610251] INFO -- : net-pop 0.1.2 I, [2024-05-20T06:44:46.740340 #610251] INFO -- : net-smtp 0.5.0 I, [2024-05-20T06:44:46.741496 #610251] INFO -- : matrix 0.4.2 I, [2024-05-20T06:44:46.744769 #610251] INFO -- : prime 0.1.2 I, [2024-05-20T06:44:46.749621 #610251] INFO -- : rbs 3.4.4 I, [2024-05-20T06:44:46.771681 #610251] INFO -- : typeprof 0.21.11 I, [2024-05-20T06:44:46.774412 #610251] INFO -- : debug 1.9.2 I, [2024-05-20T06:44:46.777484 #610251] INFO -- : racc 1.7.3 I, [2024-05-20T06:44:46.780217 #610251] INFO -- : mutex_m 0.2.0 I, [2024-05-20T06:44:46.781540 #610251] INFO -- : getoptlong 0.2.1 I, [2024-05-20T06:44:46.782939 #610251] INFO -- : base64 0.2.0 I, [2024-05-20T06:44:46.783996 #610251] INFO -- : bigdecimal 3.1.8 I, [2024-05-20T06:44:46.786132 #610251] INFO -- : observer 0.1.2 I, [2024-05-20T06:44:46.787736 #610251] INFO -- : abbrev 0.1.2 I, [2024-05-20T06:44:46.789035 #610251] INFO -- : resolv-replace 0.1.1 I, [2024-05-20T06:44:46.790480 #610251] INFO -- : rinda 0.2.0 I, [2024-05-20T06:44:46.791762 #610251] INFO -- : drb 2.2.1 I, [2024-05-20T06:44:46.793415 #610251] INFO -- : nkf 0.2.0 I, [2024-05-20T06:44:46.795897 #610251] INFO -- : syslog 0.1.2 I, [2024-05-20T06:44:46.797591 #610251] INFO -- : csv 3.3.0 I, [2024-05-20T06:44:46.800347 #610251] INFO -- : installing bundled gem cache: /tmp/ruby/install/trunk/lib/ruby/gems/3.4.0+0/cache I, [2024-05-20T06:44:46.801737 #610251] INFO -- : skipped bundled gems: I, [2024-05-20T06:44:46.801759 #610251] INFO -- : power_assert-2.0.4dev.gem not found in bundled_gems I, [2024-05-20T06:44:46.805434 #610251] INFO -- : $$$[end] "make install -j20" exit with 0. I, [2024-05-20T06:44:46.805590 #610251] INFO -- : $$$[beg] make yes-btest TESTOPTS='-q -j20' I, [2024-05-20T06:44:52.533841 #610251] INFO -- : PASS all 1936 tests E, [2024-05-20T06:44:52.539261 #610251] ERROR -- : I, [2024-05-20T06:44:52.539457 #610251] INFO -- : $$$[end] "make yes-btest TESTOPTS='-q -j20'" exit with 0. I, [2024-05-20T06:44:52.539591 #610251] INFO -- : $$$[beg] make yes-test-basic TESTS='-j20' I, [2024-05-20T06:44:52.600428 #610251] INFO -- : BASERUBY = /usr/bin/ruby --disable=gems I, [2024-05-20T06:44:52.600483 #610251] INFO -- : CC = gcc I, [2024-05-20T06:44:52.600499 #610251] INFO -- : LD = ld I, [2024-05-20T06:44:52.600518 #610251] INFO -- : LDSHARED = gcc -shared I, [2024-05-20T06:44:52.600532 #610251] INFO -- : CFLAGS = -O3 -fno-fast-math -ggdb3 -Wall -Wextra -Wdeprecated-declarations -Wdiv-by-zero -Wduplicated-cond -Wimplicit-function-declaration -Wimplicit-int -Wpointer-arith -Wwrite-strings -Wold-style-definition -Wimplicit-fallthrough=0 -Wmissing-noreturn -Wno-cast-function-type -Wno-constant-logical-operand -Wno-long-long -Wno-missing-field-initializers -Wno-overlength-strings -Wno-packed-bitfield-compat -Wno-parentheses-equality -Wno-self-assign -Wno-tautological-compare -Wno-unused-parameter -Wno-unused-value -Wsuggest-attribute=format -Wsuggest-attribute=noreturn -Wunused-variable -Wmisleading-indentation -Wundef -fPIC I, [2024-05-20T06:44:52.600546 #610251] INFO -- : XCFLAGS = -U_FORTIFY_SOURCE -D_FORTIFY_SOURCE=2 -fstack-protector-strong -fno-strict-overflow -fvisibility=hidden -fexcess-precision=standard -DRUBY_EXPORT -I. -I.ext/include/x86_64-linux -I/tmp/ruby/src/trunk/include -I/tmp/ruby/src/trunk -I/tmp/ruby/src/trunk/prism -I/tmp/ruby/src/trunk/enc/unicode/15.0.0 I, [2024-05-20T06:44:52.600561 #610251] INFO -- : CPPFLAGS = I, [2024-05-20T06:44:52.600574 #610251] INFO -- : DLDFLAGS = -Wl,--compress-debug-sections=zlib -Wl,-soname,libruby.so.3.4 -fstack-protector-strong I, [2024-05-20T06:44:52.600587 #610251] INFO -- : SOLIBS = -lz -lrt -lrt -lgmp -ldl -lcrypt -lm -lpthread I, [2024-05-20T06:44:52.600600 #610251] INFO -- : LANG = en_US.UTF-8 I, [2024-05-20T06:44:52.600612 #610251] INFO -- : LC_ALL = I, [2024-05-20T06:44:52.600625 #610251] INFO -- : LC_CTYPE = I, [2024-05-20T06:44:52.600637 #610251] INFO -- : MFLAGS = I, [2024-05-20T06:44:52.600649 #610251] INFO -- : RUSTC = no I, [2024-05-20T06:44:52.600663 #610251] INFO -- : YJIT_RUSTC_ARGS = --crate-name=yjit --crate-type=staticlib --edition=2021 -g -C lto=thin -C opt-level=3 -C overflow-checks=on '--out-dir=/tmp/ruby/build/trunk/yjit/target/release/' /tmp/ruby/src/trunk/yjit/src/lib.rs I, [2024-05-20T06:44:52.601136 #610251] INFO -- : gcc (Ubuntu 11.4.0-1ubuntu1~22.04) 11.4.0 I, [2024-05-20T06:44:52.601182 #610251] INFO -- : Copyright (C) 2021 Free Software Foundation, Inc. I, [2024-05-20T06:44:52.601198 #610251] INFO -- : This is free software; see the source for copying conditions. There is NO I, [2024-05-20T06:44:52.601212 #610251] INFO -- : warranty; not even for MERCHANTABILITY or FITNESS FOR A PARTICULAR PURPOSE. I, [2024-05-20T06:44:52.601229 #610251] INFO -- : I, [2024-05-20T06:44:52.712767 #610251] INFO -- : Checking leaked global symbols...none I, [2024-05-20T06:44:52.753295 #610251] INFO -- : /tmp/ruby/src/trunk/basictest/test.rb:assignment ....................................................................................................................................................................................................................................................................................................................................................................................OK 372 I, [2024-05-20T06:44:52.753379 #610251] INFO -- : /tmp/ruby/src/trunk/basictest/test.rb:condition ..OK 2 I, [2024-05-20T06:44:52.753395 #610251] INFO -- : /tmp/ruby/src/trunk/basictest/test.rb:if/unless ...OK 3 I, [2024-05-20T06:44:52.753407 #610251] INFO -- : /tmp/ruby/src/trunk/basictest/test.rb:case .....OK 5 I, [2024-05-20T06:44:52.753569 #610251] INFO -- : /tmp/ruby/src/trunk/basictest/test.rb:while/until ........OK 8 I, [2024-05-20T06:44:52.753618 #610251] INFO -- : /tmp/ruby/src/trunk/basictest/test.rb:exception ..........OK 10 I, [2024-05-20T06:44:52.753883 #610251] INFO -- : /tmp/ruby/src/trunk/basictest/test.rb:array .......................................OK 39 I, [2024-05-20T06:44:52.753986 #610251] INFO -- : /tmp/ruby/src/trunk/basictest/test.rb:hash ...........................OK 27 I, [2024-05-20T06:44:52.754704 #610251] INFO -- : /tmp/ruby/src/trunk/basictest/test.rb:iterator ...........................................................................................................OK 107 I, [2024-05-20T06:44:52.754983 #610251] INFO -- : /tmp/ruby/src/trunk/basictest/test.rb:float ................................................................................OK 80 I, [2024-05-20T06:44:52.756883 #610251] INFO -- : /tmp/ruby/src/trunk/basictest/test.rb:bignum ...............................OK 31 I, [2024-05-20T06:44:52.757673 #610251] INFO -- : /tmp/ruby/src/trunk/basictest/test.rb:string & char ..............................................................OK 62 I, [2024-05-20T06:44:52.757699 #610251] INFO -- : /tmp/ruby/src/trunk/basictest/test.rb:assignment ..........OK 10 I, [2024-05-20T06:44:52.757716 #610251] INFO -- : /tmp/ruby/src/trunk/basictest/test.rb:call ......OK 6 I, [2024-05-20T06:44:52.757763 #610251] INFO -- : /tmp/ruby/src/trunk/basictest/test.rb:proc .........OK 9 I, [2024-05-20T06:44:52.858510 #610251] INFO -- : /tmp/ruby/src/trunk/basictest/test.rb:signal ..OK 2 I, [2024-05-20T06:44:52.861416 #610251] INFO -- : /tmp/ruby/src/trunk/basictest/test.rb:eval ...........................OK 27 I, [2024-05-20T06:44:52.975427 #610251] INFO -- : /tmp/ruby/src/trunk/basictest/test.rb:system ........OK 8 I, [2024-05-20T06:44:52.975507 #610251] INFO -- : /tmp/ruby/src/trunk/basictest/test.rb:const .....OK 5 I, [2024-05-20T06:44:52.975522 #610251] INFO -- : /tmp/ruby/src/trunk/basictest/test.rb:clone .....OK 5 I, [2024-05-20T06:44:52.975644 #610251] INFO -- : /tmp/ruby/src/trunk/basictest/test.rb:marshal ....OK 4 I, [2024-05-20T06:44:52.975667 #610251] INFO -- : /tmp/ruby/src/trunk/basictest/test.rb:pack ....OK 4 I, [2024-05-20T06:44:52.975699 #610251] INFO -- : /tmp/ruby/src/trunk/basictest/test.rb:math ..OK 2 I, [2024-05-20T06:44:52.975714 #610251] INFO -- : /tmp/ruby/src/trunk/basictest/test.rb:struct ......OK 6 I, [2024-05-20T06:44:52.975838 #610251] INFO -- : /tmp/ruby/src/trunk/basictest/test.rb:variable ............OK 12 I, [2024-05-20T06:44:52.975862 #610251] INFO -- : /tmp/ruby/src/trunk/basictest/test.rb:trace ...OK 3 I, [2024-05-20T06:44:52.975876 #610251] INFO -- : /tmp/ruby/src/trunk/basictest/test.rb:defined? ............OK 12 I, [2024-05-20T06:44:52.975905 #610251] INFO -- : /tmp/ruby/src/trunk/basictest/test.rb:alias ......OK 6 I, [2024-05-20T06:44:52.976276 #610251] INFO -- : /tmp/ruby/src/trunk/basictest/test.rb:path .......................OK 23 I, [2024-05-20T06:44:53.010252 #610251] INFO -- : /tmp/ruby/src/trunk/basictest/test.rb:gc ....OK 4 I, [2024-05-20T06:44:53.012711 #610251] INFO -- : I, [2024-05-20T06:44:53.012774 #610251] INFO -- : test succeeded I, [2024-05-20T06:44:53.014341 #610251] INFO -- : $$$[end] "make yes-test-basic TESTS='-j20'" exit with 0. I, [2024-05-20T06:44:53.014500 #610251] INFO -- : $$$[beg] make yes-test-all TESTOPTS='--stderr-on-failure' TESTS='-j20' I, [2024-05-20T06:44:53.105249 #610251] INFO -- : BASERUBY = /usr/bin/ruby --disable=gems I, [2024-05-20T06:44:53.105295 #610251] INFO -- : CC = gcc I, [2024-05-20T06:44:53.105300 #610251] INFO -- : LD = ld I, [2024-05-20T06:44:53.105304 #610251] INFO -- : LDSHARED = gcc -shared I, [2024-05-20T06:44:53.105311 #610251] INFO -- : CFLAGS = -O3 -fno-fast-math -ggdb3 -Wall -Wextra -Wdeprecated-declarations -Wdiv-by-zero -Wduplicated-cond -Wimplicit-function-declaration -Wimplicit-int -Wpointer-arith -Wwrite-strings -Wold-style-definition -Wimplicit-fallthrough=0 -Wmissing-noreturn -Wno-cast-function-type -Wno-constant-logical-operand -Wno-long-long -Wno-missing-field-initializers -Wno-overlength-strings -Wno-packed-bitfield-compat -Wno-parentheses-equality -Wno-self-assign -Wno-tautological-compare -Wno-unused-parameter -Wno-unused-value -Wsuggest-attribute=format -Wsuggest-attribute=noreturn -Wunused-variable -Wmisleading-indentation -Wundef -fPIC I, [2024-05-20T06:44:53.105323 #610251] INFO -- : XCFLAGS = -U_FORTIFY_SOURCE -D_FORTIFY_SOURCE=2 -fstack-protector-strong -fno-strict-overflow -fvisibility=hidden -fexcess-precision=standard -DRUBY_EXPORT -I. -I.ext/include/x86_64-linux -I/tmp/ruby/src/trunk/include -I/tmp/ruby/src/trunk -I/tmp/ruby/src/trunk/prism -I/tmp/ruby/src/trunk/enc/unicode/15.0.0 I, [2024-05-20T06:44:53.105327 #610251] INFO -- : CPPFLAGS = I, [2024-05-20T06:44:53.105331 #610251] INFO -- : DLDFLAGS = -Wl,--compress-debug-sections=zlib -Wl,-soname,libruby.so.3.4 -fstack-protector-strong I, [2024-05-20T06:44:53.105341 #610251] INFO -- : SOLIBS = -lz -lrt -lrt -lgmp -ldl -lcrypt -lm -lpthread I, [2024-05-20T06:44:53.105346 #610251] INFO -- : LANG = en_US.UTF-8 I, [2024-05-20T06:44:53.105350 #610251] INFO -- : LC_ALL = I, [2024-05-20T06:44:53.105353 #610251] INFO -- : LC_CTYPE = I, [2024-05-20T06:44:53.105357 #610251] INFO -- : MFLAGS = I, [2024-05-20T06:44:53.105361 #610251] INFO -- : RUSTC = no I, [2024-05-20T06:44:53.105364 #610251] INFO -- : YJIT_RUSTC_ARGS = --crate-name=yjit --crate-type=staticlib --edition=2021 -g -C lto=thin -C opt-level=3 -C overflow-checks=on '--out-dir=/tmp/ruby/build/trunk/yjit/target/release/' /tmp/ruby/src/trunk/yjit/src/lib.rs I, [2024-05-20T06:44:53.105924 #610251] INFO -- : gcc (Ubuntu 11.4.0-1ubuntu1~22.04) 11.4.0 I, [2024-05-20T06:44:53.105948 #610251] INFO -- : Copyright (C) 2021 Free Software Foundation, Inc. I, [2024-05-20T06:44:53.105954 #610251] INFO -- : This is free software; see the source for copying conditions. There is NO I, [2024-05-20T06:44:53.105959 #610251] INFO -- : warranty; not even for MERCHANTABILITY or FITNESS FOR A PARTICULAR PURPOSE. I, [2024-05-20T06:44:53.105963 #610251] INFO -- : I, [2024-05-20T06:44:53.107619 #610251] INFO -- : generating enc.mk I, [2024-05-20T06:44:53.225678 #610251] INFO -- : generating encdb.h I, [2024-05-20T06:44:53.249558 #610251] INFO -- : encdb.h unchanged I, [2024-05-20T06:44:53.250659 #610251] INFO -- : making enc I, [2024-05-20T06:44:53.267959 #610251] INFO -- : make[1]: Entering directory '/tmp/ruby/build/trunk' I, [2024-05-20T06:44:53.267980 #610251] INFO -- : make[1]: Nothing to be done for 'enc'. I, [2024-05-20T06:44:53.267990 #610251] INFO -- : make[1]: Leaving directory '/tmp/ruby/build/trunk' I, [2024-05-20T06:44:53.268643 #610251] INFO -- : making srcs under enc I, [2024-05-20T06:44:53.299901 #610251] INFO -- : make[1]: Entering directory '/tmp/ruby/build/trunk' I, [2024-05-20T06:44:53.299932 #610251] INFO -- : make[1]: Nothing to be done for 'srcs'. I, [2024-05-20T06:44:53.299940 #610251] INFO -- : make[1]: Leaving directory '/tmp/ruby/build/trunk' I, [2024-05-20T06:44:53.300788 #610251] INFO -- : generating transdb.h I, [2024-05-20T06:44:53.398675 #610251] INFO -- : transdb.h unchanged I, [2024-05-20T06:44:53.400119 #610251] INFO -- : making trans I, [2024-05-20T06:44:53.433645 #610251] INFO -- : make[1]: Entering directory '/tmp/ruby/build/trunk' I, [2024-05-20T06:44:53.433666 #610251] INFO -- : make[1]: Nothing to be done for 'trans'. I, [2024-05-20T06:44:53.433676 #610251] INFO -- : make[1]: Leaving directory '/tmp/ruby/build/trunk' I, [2024-05-20T06:44:53.434395 #610251] INFO -- : making encs I, [2024-05-20T06:44:53.472576 #610251] INFO -- : make[1]: Entering directory '/tmp/ruby/build/trunk' I, [2024-05-20T06:44:53.472597 #610251] INFO -- : make[1]: Nothing to be done for 'encs'. I, [2024-05-20T06:44:53.472602 #610251] INFO -- : make[1]: Leaving directory '/tmp/ruby/build/trunk' I, [2024-05-20T06:44:53.474535 #610251] INFO -- : generating makefiles ext/configure-ext.mk I, [2024-05-20T06:44:53.500692 #610251] INFO -- : ext/configure-ext.mk updated I, [2024-05-20T06:44:53.503220 #610251] INFO -- : make[1]: Entering directory '/tmp/ruby/build/trunk' I, [2024-05-20T06:44:54.855404 #610251] INFO -- : make[1]: Leaving directory '/tmp/ruby/build/trunk' I, [2024-05-20T06:44:54.856035 #610251] INFO -- : generating makefile exts.mk I, [2024-05-20T06:44:54.893655 #610251] INFO -- : exts.mk unchanged I, [2024-05-20T06:44:54.897906 #610251] INFO -- : make[1]: Entering directory '/tmp/ruby/build/trunk' I, [2024-05-20T06:44:55.218449 #610251] INFO -- : make[2]: Entering directory '/tmp/ruby/build/trunk/ext/coverage' I, [2024-05-20T06:44:55.222506 #610251] INFO -- : make[2]: Leaving directory '/tmp/ruby/build/trunk/ext/coverage' I, [2024-05-20T06:44:55.228841 #610251] INFO -- : make[2]: Entering directory '/tmp/ruby/build/trunk/ext/date' I, [2024-05-20T06:44:55.234072 #610251] INFO -- : make[2]: Leaving directory '/tmp/ruby/build/trunk/ext/date' I, [2024-05-20T06:44:55.237933 #610251] INFO -- : make[2]: Entering directory '/tmp/ruby/build/trunk/ext/digest' I, [2024-05-20T06:44:55.246776 #610251] INFO -- : make[2]: Leaving directory '/tmp/ruby/build/trunk/ext/digest' I, [2024-05-20T06:44:55.272853 #610251] INFO -- : make[2]: Entering directory '/tmp/ruby/build/trunk/ext/digest/sha2' I, [2024-05-20T06:44:55.277695 #610251] INFO -- : make[2]: Leaving directory '/tmp/ruby/build/trunk/ext/digest/sha2' I, [2024-05-20T06:44:55.299509 #610251] INFO -- : make[2]: Entering directory '/tmp/ruby/build/trunk/ext/fiddle' I, [2024-05-20T06:44:55.310247 #610251] INFO -- : make[2]: Leaving directory '/tmp/ruby/build/trunk/ext/fiddle' I, [2024-05-20T06:44:55.315320 #610251] INFO -- : make[2]: Entering directory '/tmp/ruby/build/trunk/ext/io/console' I, [2024-05-20T06:44:55.319454 #610251] INFO -- : make[2]: Leaving directory '/tmp/ruby/build/trunk/ext/io/console' I, [2024-05-20T06:44:55.332139 #610251] INFO -- : make[2]: Entering directory '/tmp/ruby/build/trunk/ext/json' I, [2024-05-20T06:44:55.342841 #610251] INFO -- : make[2]: Leaving directory '/tmp/ruby/build/trunk/ext/json' I, [2024-05-20T06:44:55.358419 #610251] INFO -- : make[2]: Entering directory '/tmp/ruby/build/trunk/ext/monitor' I, [2024-05-20T06:44:55.362442 #610251] INFO -- : make[2]: Leaving directory '/tmp/ruby/build/trunk/ext/monitor' I, [2024-05-20T06:44:55.369417 #610251] INFO -- : make[2]: Entering directory '/tmp/ruby/build/trunk/ext/objspace' I, [2024-05-20T06:44:55.375497 #610251] INFO -- : make[2]: Leaving directory '/tmp/ruby/build/trunk/ext/objspace' I, [2024-05-20T06:44:55.391165 #610251] INFO -- : make[2]: Entering directory '/tmp/ruby/build/trunk/ext/openssl' I, [2024-05-20T06:44:55.405617 #610251] INFO -- : make[2]: Leaving directory '/tmp/ruby/build/trunk/ext/openssl' I, [2024-05-20T06:44:55.409232 #610251] INFO -- : make[2]: Entering directory '/tmp/ruby/build/trunk/ext/pathname' I, [2024-05-20T06:44:55.411831 #610251] INFO -- : make[2]: Leaving directory '/tmp/ruby/build/trunk/ext/pathname' I, [2024-05-20T06:44:55.416134 #610251] INFO -- : make[2]: Entering directory '/tmp/ruby/build/trunk/ext/psych' I, [2024-05-20T06:44:55.433719 #610251] INFO -- : make[2]: Leaving directory '/tmp/ruby/build/trunk/ext/psych' I, [2024-05-20T06:44:55.437059 #610251] INFO -- : make[2]: Entering directory '/tmp/ruby/build/trunk/ext/pty' I, [2024-05-20T06:44:55.439614 #610251] INFO -- : make[2]: Leaving directory '/tmp/ruby/build/trunk/ext/pty' I, [2024-05-20T06:44:55.449072 #610251] INFO -- : make[2]: Entering directory '/tmp/ruby/build/trunk/ext/ripper' I, [2024-05-20T06:44:55.456221 #610251] INFO -- : make[2]: Leaving directory '/tmp/ruby/build/trunk/ext/ripper' I, [2024-05-20T06:44:55.458689 #610251] INFO -- : make[2]: Entering directory '/tmp/ruby/build/trunk/ext/rubyvm' I, [2024-05-20T06:44:55.461999 #610251] INFO -- : make[2]: Leaving directory '/tmp/ruby/build/trunk/ext/rubyvm' I, [2024-05-20T06:44:55.474546 #610251] INFO -- : make[2]: Entering directory '/tmp/ruby/build/trunk/ext/socket' I, [2024-05-20T06:44:55.482718 #610251] INFO -- : make[2]: Leaving directory '/tmp/ruby/build/trunk/ext/socket' I, [2024-05-20T06:44:55.501357 #610251] INFO -- : make[2]: Entering directory '/tmp/ruby/build/trunk/.bundle/gems/bigdecimal-3.1.8/ext/bigdecimal' I, [2024-05-20T06:44:55.528970 #610251] INFO -- : make[2]: Leaving directory '/tmp/ruby/build/trunk/.bundle/gems/bigdecimal-3.1.8/ext/bigdecimal' I, [2024-05-20T06:44:55.530921 #610251] INFO -- : make[2]: Entering directory '/tmp/ruby/build/trunk/.bundle/gems/debug-1.9.2/ext/debug' I, [2024-05-20T06:44:55.552677 #610251] INFO -- : make[2]: Leaving directory '/tmp/ruby/build/trunk/.bundle/gems/debug-1.9.2/ext/debug' I, [2024-05-20T06:44:55.554688 #610251] INFO -- : make[2]: Entering directory '/tmp/ruby/build/trunk/.bundle/gems/nkf-0.2.0/ext/nkf' I, [2024-05-20T06:44:55.579304 #610251] INFO -- : make[2]: Leaving directory '/tmp/ruby/build/trunk/.bundle/gems/nkf-0.2.0/ext/nkf' I, [2024-05-20T06:44:55.581255 #610251] INFO -- : make[2]: Entering directory '/tmp/ruby/build/trunk/.bundle/gems/racc-1.7.3/ext/racc/cparse' I, [2024-05-20T06:44:55.604460 #610251] INFO -- : make[2]: Leaving directory '/tmp/ruby/build/trunk/.bundle/gems/racc-1.7.3/ext/racc/cparse' I, [2024-05-20T06:44:55.606738 #610251] INFO -- : make[2]: Entering directory '/tmp/ruby/build/trunk/.bundle/gems/rbs-3.4.4/ext/rbs_extension' I, [2024-05-20T06:44:55.631244 #610251] INFO -- : make[2]: Leaving directory '/tmp/ruby/build/trunk/.bundle/gems/rbs-3.4.4/ext/rbs_extension' I, [2024-05-20T06:44:55.634269 #610251] INFO -- : make[2]: Entering directory '/tmp/ruby/build/trunk/.bundle/gems/syslog-0.1.2/ext/syslog' I, [2024-05-20T06:44:55.658289 #610251] INFO -- : make[2]: Leaving directory '/tmp/ruby/build/trunk/.bundle/gems/syslog-0.1.2/ext/syslog' I, [2024-05-20T06:44:55.681758 #610251] INFO -- : make[2]: Entering directory '/tmp/ruby/build/trunk' I, [2024-05-20T06:44:55.748722 #610251] INFO -- : make[2]: 'ruby' is up to date. I, [2024-05-20T06:44:55.748760 #610251] INFO -- : make[2]: Leaving directory '/tmp/ruby/build/trunk' I, [2024-05-20T06:44:55.749094 #610251] INFO -- : make[1]: Leaving directory '/tmp/ruby/build/trunk' I, [2024-05-20T06:44:55.753000 #610251] INFO -- : make[1]: Entering directory '/tmp/ruby/build/trunk' I, [2024-05-20T06:44:55.753022 #610251] INFO -- : make[1]: Nothing to be done for 'note'. I, [2024-05-20T06:44:55.753028 #610251] INFO -- : make[1]: Leaving directory '/tmp/ruby/build/trunk' I, [2024-05-20T06:44:55.828183 #610251] INFO -- : Run options: I, [2024-05-20T06:44:55.828246 #610251] INFO -- : --seed=32485 I, [2024-05-20T06:44:55.828254 #610251] INFO -- : "--ruby=./miniruby -I/tmp/ruby/src/trunk/lib -I. -I.ext/common /tmp/ruby/src/trunk/tool/runruby.rb --extout=.ext -- --disable-gems" I, [2024-05-20T06:44:55.828267 #610251] INFO -- : --excludes-dir=/tmp/ruby/src/trunk/test/.excludes I, [2024-05-20T06:44:55.828271 #610251] INFO -- : --name=!/memory_leak/ I, [2024-05-20T06:44:55.828276 #610251] INFO -- : --stderr-on-failure I, [2024-05-20T06:44:55.828280 #610251] INFO -- : -j20 I, [2024-05-20T06:44:55.828284 #610251] INFO -- : I, [2024-05-20T06:44:55.828288 #610251] INFO -- : # Running tests: I, [2024-05-20T06:44:55.828292 #610251] INFO -- : I, [2024-05-20T06:44:55.955540 #610251] INFO -- : [ 1/885] 651584=test_primitive I, [2024-05-20T06:44:55.967061 #610251] INFO -- : [ 2/885] 651584=test_human_typo I, [2024-05-20T06:44:55.969680 #610251] INFO -- : [ 3/885] 651584=test_rbconfig I, [2024-05-20T06:44:55.974018 #610251] INFO -- : [ 4/885] 651584=test_document I, [2024-05-20T06:44:55.976059 #610251] INFO -- : [ 5/885] 651589=test_acceptable I, [2024-05-20T06:44:55.976142 #610251] INFO -- : [ 6/885] 651586=test_euc_jp I, [2024-05-20T06:44:55.976230 #610251] INFO -- : [ 7/885] 651585=test_rdoc_generator_pot_po_entry I, [2024-05-20T06:44:55.976325 #610251] INFO -- : [ 8/885] 651588=test_pair I, [2024-05-20T06:44:55.978594 #610251] INFO -- : [ 9/885] 651587=test_win32ole_param I, [2024-05-20T06:44:55.978835 #610251] INFO -- : [ 10/885] 651601=test_gem_commands_yank_command I, [2024-05-20T06:44:55.978992 #610251] INFO -- : [ 11/885] 651599=test_chilled I, [2024-05-20T06:44:55.979478 #610251] INFO -- : [ 12/885] 651602=test_name_error_extension I, [2024-05-20T06:44:55.979504 #610251] INFO -- : [ 13/885] 651600=test_rdoc_i18n_locale I, [2024-05-20T06:44:55.980721 #610251] INFO -- : [ 14/885] 651586=test_httpheader I, [2024-05-20T06:44:55.982363 #610251] INFO -- : [ 15/885] 651587=test_gem_resolver_local_specification I, [2024-05-20T06:44:55.984683 #610251] INFO -- : [ 16/885] 651599=test_rdoc_ri_driver I, [2024-05-20T06:44:55.985722 #610251] INFO -- : [ 17/885] 651584=test_set_len I, [2024-05-20T06:44:55.988225 #610251] INFO -- : [ 18/885] 651602=test_httpresponses I, [2024-05-20T06:44:55.991002 #610251] INFO -- : [ 19/885] 651584=test_encoding I, [2024-05-20T06:44:55.993802 #610251] INFO -- : [ 20/885] 651591=test_sockopt I, [2024-05-20T06:44:56.004620 #610251] INFO -- : [ 21/885] 651584=test_install I, [2024-05-20T06:44:56.009371 #610251] INFO -- : [ 22/885] 651591=test_rdoc_markup_to_label I, [2024-05-20T06:44:56.009445 #610251] INFO -- : [ 23/885] 651590=test_key_stroke I, [2024-05-20T06:44:56.009544 #610251] INFO -- : [ 24/885] 651593=json_encoding_test I, [2024-05-20T06:44:56.009801 #610251] INFO -- : [ 25/885] 651594=test_color I, [2024-05-20T06:44:56.010090 #610251] INFO -- : [ 26/885] 651597=test_bug-14834 I, [2024-05-20T06:44:56.010551 #610251] INFO -- : [ 27/885] 651595=test_date_compat I, [2024-05-20T06:44:56.012951 #610251] INFO -- : [ 28/885] 651596=test_rdoc_markup_to_html I, [2024-05-20T06:44:56.014108 #610251] INFO -- : [ 29/885] 651622=test_terminfo I, [2024-05-20T06:44:56.017256 #610251] INFO -- : [ 30/885] 651595=test_compile_prism I, [2024-05-20T06:44:56.024591 #610251] INFO -- : [ 31/885] 651598=test_bn I, [2024-05-20T06:44:56.026923 #610251] INFO -- : [ 32/885] 651593=test_win32ole_param_event I, [2024-05-20T06:44:56.027761 #610251] INFO -- : [ 33/885] 651592=test_path I, [2024-05-20T06:44:56.031926 #610251] INFO -- : [ 34/885] 651593=redundant_return_test I, [2024-05-20T06:44:56.042131 #610251] INFO -- : [ 35/885] 651592=test_case_mapping I, [2024-05-20T06:44:56.052545 #610251] INFO -- : [ 36/885] 651592=test_tree_spell_checker I, [2024-05-20T06:44:56.056254 #610251] INFO -- : [ 37/885] 651586=test_http I, [2024-05-20T06:44:56.063970 #610251] INFO -- : [ 38/885] 651602=test_addrinfo I, [2024-05-20T06:44:56.080109 #610251] INFO -- : [ 39/885] 651598=test_rdoc_method_attr I, [2024-05-20T06:44:56.083465 #610251] INFO -- : [ 40/885] 651622=test_filter I, [2024-05-20T06:44:56.085691 #610251] INFO -- : [ 41/885] 651590=test_gem_gem_runner I, [2024-05-20T06:44:56.092720 #610251] INFO -- : [ 42/885] 651597=test_data I, [2024-05-20T06:44:56.094699 #610251] INFO -- : [ 43/885] 651597=static_literals_test I, [2024-05-20T06:44:56.099352 #610251] INFO -- : [ 44/885] 651593=test_rdoc_generator_pot I, [2024-05-20T06:44:56.101064 #610251] INFO -- : [ 45/885] 651589=test_enumerator I, [2024-05-20T06:44:56.103599 #610251] INFO -- : [ 46/885] 651592=test_rdoc_parser_changelog I, [2024-05-20T06:44:56.107268 #610251] INFO -- : [ 47/885] 651585=parameters_signature_test I, [2024-05-20T06:44:56.113745 #610251] INFO -- : [ 48/885] 651589=test_koi8 I, [2024-05-20T06:44:56.122352 #610251] INFO -- : [ 49/885] 651589=test_unicode I, [2024-05-20T06:44:56.125681 #610251] INFO -- : [ 50/885] 651600=test_ssl_session I, [2024-05-20T06:44:56.126012 #610251] INFO -- : [ 51/885] 651622=test_lexer I, [2024-05-20T06:44:56.142854 #610251] INFO -- : [ 52/885] 651622=test_thread_cv I, [2024-05-20T06:44:56.147260 #610251] INFO -- : [ 53/885] 651594=test_gem_resolver_vendor_specification I, [2024-05-20T06:44:56.154509 #610251] INFO -- : [ 54/885] 651602=test_gem_commands_update_command I, [2024-05-20T06:44:56.176264 #610251] INFO -- : [ 55/885] 651589=test_gem_uri I, [2024-05-20T06:44:56.177882 #610251] INFO -- : [ 56/885] 651597=test_key_event_record I, [2024-05-20T06:44:56.187019 #610251] INFO -- : [ 57/885] 651585=test_notimplement I, [2024-05-20T06:44:56.189714 #610251] INFO -- : [ 58/885] 651585=test_random I, [2024-05-20T06:44:56.196324 #610251] INFO -- : [ 59/885] 651585=test_gem_commands_build_command I, [2024-05-20T06:44:56.200286 #610251] INFO -- : [ 60/885] 651591=test_interned_str I, [2024-05-20T06:44:56.203208 #610251] INFO -- : [ 61/885] 651591=test_case_comprehensive I, [2024-05-20T06:44:56.217043 #610251] INFO -- : [ 62/885] 651584=test_io_m17n I, [2024-05-20T06:44:56.222924 #610251] INFO -- : [ 63/885] 651587=test_variable_name_check I, [2024-05-20T06:44:56.243516 #610251] INFO -- : [ 64/885] 651597=test_did_you_mean I, [2024-05-20T06:44:56.256058 #610251] INFO -- : [ 65/885] 651595=test_gem_commands_server_command I, [2024-05-20T06:44:56.257881 #610251] INFO -- : [ 66/885] 651587=test_append I, [2024-05-20T06:44:56.261092 #610251] INFO -- : [ 67/885] 651587=test_option I, [2024-05-20T06:44:56.266332 #610251] INFO -- : [ 68/885] 651596=test_cmethod I, [2024-05-20T06:44:56.269550 #610251] INFO -- : [ 69/885] 651596=test_tracer I, [2024-05-20T06:44:56.286996 #610251] INFO -- : [ 70/885] 651593=test_exception_at_throwing I, [2024-05-20T06:44:56.317999 #610251] INFO -- : [ 71/885] 651592=test_iseq I, [2024-05-20T06:44:56.336731 #610251] INFO -- : [ 72/885] 651593=test_rdoc_markup_heading I, [2024-05-20T06:44:56.340921 #610251] INFO -- : [ 73/885] 651594=test_ocsp I, [2024-05-20T06:44:56.350590 #610251] INFO -- : [ 74/885] 651590=test_class I, [2024-05-20T06:44:56.351101 #610251] INFO -- : [ 75/885] 651593=test_pkey_dsa I, [2024-05-20T06:44:56.351381 #610251] INFO -- : [ 76/885] 651587=test_scheduler I, [2024-05-20T06:44:56.356632 #610251] INFO -- : [ 77/885] 651596=test_emoji_breaks I, [2024-05-20T06:44:56.356989 #610251] INFO -- : [ 78/885] 651589=test_gem_bundler_version_finder I, [2024-05-20T06:44:56.358918 #610251] INFO -- : [ 79/885] 651596=test_within_pipe I, [2024-05-20T06:44:56.369628 #610251] INFO -- : [ 80/885] 651597=reflection_test I, [2024-05-20T06:44:56.374804 #610251] INFO -- : [ 81/885] 651597=test_files_lib I, [2024-05-20T06:44:56.376889 #610251] INFO -- : [ 82/885] 651590=test_gem_commands_unpack_command I, [2024-05-20T06:44:56.381707 #610251] INFO -- : [ 83/885] 651589=test_beginendblock I, [2024-05-20T06:44:56.384280 #610251] INFO -- : [ 84/885] 651596=test_help I, [2024-05-20T06:44:56.388409 #610251] INFO -- : [ 85/885] 651595=test_rdoc_markup_to_bs I, [2024-05-20T06:44:56.388608 #610251] INFO -- : [ 86/885] 651596=test_rdoc_markup_pre_process I, [2024-05-20T06:44:56.414121 #610251] INFO -- : [ 87/885] 651599=test_printf I, [2024-05-20T06:44:56.422393 #610251] INFO -- : [ 88/885] 651599=test_to_ary_concat I, [2024-05-20T06:44:56.424772 #610251] INFO -- : [ 89/885] 651598=test_time I, [2024-05-20T06:44:56.436943 #610251] INFO -- : [ 90/885] 651596=test_webauthn_listener_response I, [2024-05-20T06:44:56.498159 #610251] INFO -- : [ 91/885] 651587=test_stream I, [2024-05-20T06:44:56.510257 #610251] INFO -- : [ 92/885] 651587=test_pinned I, [2024-05-20T06:44:56.539145 #610251] INFO -- : [ 93/885] 651587=test_delegate I, [2024-05-20T06:44:56.546602 #610251] INFO -- : [ 94/885] 651587=test_popen_deadlock I, [2024-05-20T06:44:56.567164 #610251] INFO -- : [ 95/885] 651598=test_history I, [2024-05-20T06:44:56.588465 #610251] INFO -- : [ 96/885] 651595=test_mkmf I, [2024-05-20T06:44:56.609828 #610251] INFO -- : [ 97/885] 651596=test_date_marshal I, [2024-05-20T06:44:56.613042 #610251] INFO -- : [ 98/885] 651596=test_recursion I, [2024-05-20T06:44:56.615768 #610251] INFO -- : [ 99/885] 651596=test_exit I, [2024-05-20T06:44:56.630386 #610251] INFO -- : [100/885] 651595=test_digest I, [2024-05-20T06:44:56.642192 #610251] INFO -- : [101/885] 651595=test_ractor I, [2024-05-20T06:44:56.657109 #610251] INFO -- : [102/885] 651601=test_rdoc_servlet I, [2024-05-20T06:44:56.662703 #610251] INFO -- : [103/885] 651598=test_gem_security I, [2024-05-20T06:44:56.674959 #610251] INFO -- : [104/885] 651594=test_multi_irb_commands I, [2024-05-20T06:44:56.677540 #610251] INFO -- : [105/885] 651594=test_fiber I, [2024-05-20T06:44:56.677602 #610251] INFO -- : [106/885] 651596=test_open3 I, [2024-05-20T06:44:56.683430 #610251] INFO -- : [107/885] 651590=test_closure I, [2024-05-20T06:44:56.698359 #610251] INFO -- : [108/885] 651595=test_bundled_ca I, [2024-05-20T06:44:56.751274 #610251] INFO -- : [109/885] 651585=test_float I, [2024-05-20T06:44:56.769778 #610251] INFO -- : [110/885] 651622=test_require I, [2024-05-20T06:44:56.770684 #610251] INFO -- : [111/885] 651589=test_cgi_cookie I, [2024-05-20T06:44:56.774537 #610251] INFO -- : [112/885] 651599=test_dir_m17n I, [2024-05-20T06:44:56.793404 #610251] INFO -- : [113/885] 651589=test_gem_resolver_installer_set I, [2024-05-20T06:44:56.928784 #610251] INFO -- : [114/885] 651592=test_regex_casefold I, [2024-05-20T06:44:56.943132 #610251] INFO -- : [115/885] 651590=test_refinement I, [2024-05-20T06:44:56.956798 #610251] INFO -- : [116/885] 651601=test_gem_commands_signout_command I, [2024-05-20T06:44:56.966312 #610251] INFO -- : [117/885] 651601=test_gem_source_git I, [2024-05-20T06:44:57.032363 #610251] INFO -- : [118/885] 651589=test_fixnum I, [2024-05-20T06:44:57.045226 #610251] INFO -- : [119/885] 651589=test_signal I, [2024-05-20T06:44:57.150024 #610251] INFO -- : [120/885] 651593=test_x509crl I, [2024-05-20T06:44:57.178310 #610251] INFO -- : [121/885] 651600=test_rdoc_rd I, [2024-05-20T06:44:57.181764 #610251] INFO -- : [122/885] 651587=test_cgi_session I, [2024-05-20T06:44:57.200149 #610251] INFO -- : [123/885] 651600=test_rdoc_top_level I, [2024-05-20T06:44:57.203673 #610251] INFO -- : [124/885] 651587=test_metaclass I, [2024-05-20T06:44:57.210017 #610251] INFO -- : [125/885] 651587=test_input_method I, [2024-05-20T06:44:57.280068 #610251] INFO -- : [126/885] 651593=test_windows_1252 I, [2024-05-20T06:44:57.283573 #610251] INFO -- : [127/885] 651593=test_process I, [2024-05-20T06:44:57.298459 #610251] INFO -- : [128/885] 651593=test_iterator I, [2024-05-20T06:44:57.353572 #610251] INFO -- : [129/885] 651593=test_string I, [2024-05-20T06:44:57.359128 #610251] INFO -- : [130/885] 651593=test_omap I, [2024-05-20T06:44:57.384020 #610251] INFO -- : [131/885] 651592=test_digest_extend I, [2024-05-20T06:44:57.386974 #610251] INFO -- : [132/885] 651593=test_shellwords I, [2024-05-20T06:44:57.391648 #610251] INFO -- : [133/885] 651592=test_debug I, [2024-05-20T06:44:57.395644 #610251] INFO -- : [134/885] 651593=pattern_test I, [2024-05-20T06:44:57.399764 #610251] INFO -- : [135/885] 651592=test_memory_view I, [2024-05-20T06:44:57.431562 #610251] INFO -- : [136/885] 651593=test_cipher I, [2024-05-20T06:44:57.436869 #610251] INFO -- : [137/885] 651592=test_gem_security_signer I, [2024-05-20T06:44:57.457385 #610251] INFO -- : [138/885] 651600=test_new I, [2024-05-20T06:44:57.460159 #610251] INFO -- : [139/885] 651600=test_gem_resolver_git_set I, [2024-05-20T06:44:57.495928 #610251] INFO -- : [140/885] 651593=test_storage I, [2024-05-20T06:44:57.503882 #610251] INFO -- : [141/885] 651593=test_gem_source_subpath_problem I, [2024-05-20T06:44:57.505572 #610251] INFO -- : [142/885] 651587=test_dln I, [2024-05-20T06:44:57.509162 #610251] INFO -- : [143/885] 651587=json_common_interface_test I, [2024-05-20T06:44:57.527180 #610251] INFO -- : [144/885] 651587=test_win32ole_variant_outarg I, [2024-05-20T06:44:57.529474 #610251] INFO -- : [145/885] 651584=test_config I, [2024-05-20T06:44:57.536748 #610251] INFO -- : [146/885] 651587=json_parser_test I, [2024-05-20T06:44:57.538514 #610251] INFO -- : [147/885] 651601=test_nomethod_error I, [2024-05-20T06:44:57.544058 #610251] INFO -- : [148/885] 651601=memsize_test I, [2024-05-20T06:44:57.567993 #610251] INFO -- : [149/885] 651584=test_cparser I, [2024-05-20T06:44:57.576442 #610251] INFO -- : [150/885] 651587=test_pkg_config I, [2024-05-20T06:44:57.612841 #610251] INFO -- : [151/885] 651587=fuzzer_test I, [2024-05-20T06:44:57.619812 #610251] INFO -- : [152/885] 651601=test_rdoc_markup_include I, [2024-05-20T06:44:57.623063 #610251] INFO -- : [153/885] 651601=test_sexp I, [2024-05-20T06:44:57.632881 #610251] INFO -- : [154/885] 651595=test_variable I, [2024-05-20T06:44:57.637256 #610251] INFO -- : [155/885] 651601=test_struct I, [2024-05-20T06:44:57.658839 #610251] INFO -- : [156/885] 651592=magic_comment_test I, [2024-05-20T06:44:57.673593 #610251] INFO -- : [157/885] 651601=test_rdoc_markup_to_html_snippet I, [2024-05-20T06:44:57.713707 #610251] INFO -- : [158/885] 651592=test_key_error I, [2024-05-20T06:44:57.714809 #610251] INFO -- : [159/885] 651592=test_allocation I, [2024-05-20T06:44:57.719865 #610251] INFO -- : [160/885] 651593=test_div I, [2024-05-20T06:44:57.720871 #610251] INFO -- : [161/885] 651587=test_win32ole_variant_m I, [2024-05-20T06:44:57.721720 #610251] INFO -- : [162/885] 651587=test_engine I, [2024-05-20T06:44:57.723361 #610251] INFO -- : [163/885] 651593=test_deprecated I, [2024-05-20T06:44:57.727826 #610251] INFO -- : [164/885] 651587=test_color_printer I, [2024-05-20T06:44:57.728603 #610251] INFO -- : [165/885] 651593=test_insns_leaf I, [2024-05-20T06:44:57.732428 #610251] INFO -- : [166/885] 651587=test_serialize_subclasses I, [2024-05-20T06:44:57.733194 #610251] INFO -- : [167/885] 651601=test_set I, [2024-05-20T06:44:57.733886 #610251] INFO -- : [168/885] 651584=test_struct I, [2024-05-20T06:44:57.737007 #610251] INFO -- : [169/885] 651587=test_gem_path_support I, [2024-05-20T06:44:57.749723 #610251] INFO -- : [170/885] 651595=test_files_test_1 I, [2024-05-20T06:44:57.753248 #610251] INFO -- : [171/885] 651593=test_rdoc_rd_inline I, [2024-05-20T06:44:57.758259 #610251] INFO -- : [172/885] 651587=test_mutex I, [2024-05-20T06:44:57.761184 #610251] INFO -- : [173/885] 651593=test_x509req I, [2024-05-20T06:44:57.770491 #610251] INFO -- : [174/885] 651601=test_ssl I, [2024-05-20T06:44:57.793550 #610251] INFO -- : [175/885] 651602=test_gem_ext_cargo_builder I, [2024-05-20T06:44:57.815290 #610251] INFO -- : [176/885] 651602=constant_path_node_test I, [2024-05-20T06:44:57.850710 #610251] INFO -- : [177/885] 651600=test_gem_request_set I, [2024-05-20T06:44:57.912243 #610251] INFO -- : [178/885] 651602=test_module I, [2024-05-20T06:44:57.947067 #610251] INFO -- : [179/885] 651593=test_parser I, [2024-05-20T06:44:57.990819 #610251] INFO -- : [180/885] 651593=test_method_name_check I, [2024-05-20T06:44:58.031775 #610251] INFO -- : [181/885] 651593=test_arith_seq_extract I, [2024-05-20T06:44:58.041114 #610251] INFO -- : [182/885] 651599=test_monitor I, [2024-05-20T06:44:58.089128 #610251] INFO -- : [183/885] 651584=test_buffered_io I, [2024-05-20T06:44:58.145181 #610251] INFO -- : [184/885] 651585=test_configuration I, [2024-05-20T06:44:58.219378 #610251] INFO -- : [185/885] 651593=test_rubyvm I, [2024-05-20T06:44:58.223405 #610251] INFO -- : [186/885] 651593=test_rdoc_generator_markup I, [2024-05-20T06:44:58.226716 #610251] INFO -- : [187/885] 651593=test_whileuntil I, [2024-05-20T06:44:58.229087 #610251] INFO -- : [188/885] 651584=test_boolean I, [2024-05-20T06:44:58.230872 #610251] INFO -- : [189/885] 651593=test_stringify_symbols I, [2024-05-20T06:44:58.234647 #610251] INFO -- : [190/885] 651584=integer_parse_test I, [2024-05-20T06:44:58.242142 #610251] INFO -- : [191/885] 651593=test_instrumentation_api I, [2024-05-20T06:44:58.276929 #610251] INFO -- : [192/885] 651585=test_win32ole_method_event I, [2024-05-20T06:44:58.277169 #610251] INFO -- : [193/885] 651585=test_nesting_parser I, [2024-05-20T06:44:58.286056 #610251] INFO -- : [194/885] 651599=test_gem_dependency_list I, [2024-05-20T06:44:58.286631 #610251] INFO -- : [195/885] 651584=test_benchmark I, [2024-05-20T06:44:58.309790 #610251] INFO -- : [196/885] 651600=test_gem_commands_outdated_command I, [2024-05-20T06:44:58.329444 #610251] INFO -- : [197/885] 651600=test_array I, [2024-05-20T06:44:58.408295 #610251] INFO -- : [198/885] 651585=test_helper_method I, [2024-05-20T06:44:58.415697 #610251] INFO -- : [199/885] 651585=test_gem_package_tar_writer I, [2024-05-20T06:44:58.514856 #610251] INFO -- : [200/885] 651585=test_gem_source I, [2024-05-20T06:44:58.562312 #610251] INFO -- : [201/885] 651599=test_scalar_scanner I, [2024-05-20T06:44:58.584662 #610251] INFO -- : [202/885] 651599=test_rdoc_parser_simple I, [2024-05-20T06:44:58.597629 #610251] INFO -- : [203/885] 651599=test_load I, [2024-05-20T06:44:58.601368 #610251] INFO -- : [204/885] 651599=test_yamldbm I, [2024-05-20T06:44:58.610371 #610251] INFO -- : [205/885] 651599=test_gem_commands_rebuild_command I, [2024-05-20T06:44:58.665664 #610251] INFO -- : [206/885] 651585=test_abi I, [2024-05-20T06:44:58.667189 #610251] INFO -- : [207/885] 651599=test_provider I, [2024-05-20T06:44:58.804328 #610251] INFO -- : [208/885] 651596=test_evaluation I, [2024-05-20T06:44:58.815033 #610251] INFO -- : [209/885] 651596=test_https I, [2024-05-20T06:44:58.833977 #610251] INFO -- : [210/885] 651585=test_gem_ext_builder I, [2024-05-20T06:44:58.882910 #610251] INFO -- : [211/885] 651587=test_erb I, [2024-05-20T06:44:58.940650 #610251] INFO -- : [212/885] 651587=test_x509ext I, [2024-05-20T06:44:58.948882 #610251] INFO -- : [213/885] 651587=test_gem_source_installed I, [2024-05-20T06:44:58.954073 #610251] INFO -- : [214/885] 651599=test_gem_commands_cert_command I, [2024-05-20T06:44:58.962396 #610251] INFO -- : [215/885] 651587=test_completion I, [2024-05-20T06:44:59.135312 #610251] INFO -- : [216/885] 651589=test_len I, [2024-05-20T06:44:59.142463 #610251] INFO -- : [217/885] 651589=test_yield_block I, [2024-05-20T06:44:59.143436 #610251] INFO -- : [218/885] 651589=test_rational2 I, [2024-05-20T06:44:59.169735 #610251] INFO -- : [219/885] 651589=test_rational I, [2024-05-20T06:44:59.189232 #610251] INFO -- : [220/885] 651589=test_assembler I, [2024-05-20T06:44:59.195456 #610251] INFO -- : [221/885] 651589=test_spell_checker I, [2024-05-20T06:44:59.201761 #610251] INFO -- : [222/885] 651596=attribute_write_test I, [2024-05-20T06:44:59.206413 #610251] INFO -- : [223/885] 651589=test_propertyputref I, [2024-05-20T06:44:59.216077 #610251] INFO -- : [224/885] 651589=ractor_test I, [2024-05-20T06:44:59.274363 #610251] INFO -- : [225/885] 651596=test_trace I, [2024-05-20T06:44:59.286411 #610251] INFO -- : [226/885] 651589=test_rdoc_generator_json_index I, [2024-05-20T06:44:59.287387 #610251] INFO -- : [227/885] 651596=test_time_tz I, [2024-05-20T06:44:59.351384 #610251] INFO -- : [228/885] 651596=test_win32ole_event I, [2024-05-20T06:44:59.356105 #610251] INFO -- : [229/885] 651596=test_bignum I, [2024-05-20T06:44:59.448754 #610251] INFO -- : [230/885] 651589=test_rdoc_class_module I, [2024-05-20T06:44:59.476450 #610251] INFO -- : [231/885] 651622=test_gem_ci_detector I, [2024-05-20T06:44:59.503258 #610251] INFO -- : [232/885] 651584=test_win32ole_variable I, [2024-05-20T06:44:59.503589 #610251] INFO -- : [233/885] 651584=test_arity I, [2024-05-20T06:44:59.507594 #610251] INFO -- : [234/885] 651584=test_stringio I, [2024-05-20T06:44:59.511733 #610251] INFO -- : [235/885] 651597=test_io_wait_uncommon I, [2024-05-20T06:44:59.512899 #610251] INFO -- : [236/885] 651597=test_gem_specification I, [2024-05-20T06:44:59.540462 #610251] INFO -- : [237/885] 651588=test_enum I, [2024-05-20T06:44:59.572011 #610251] INFO -- : [238/885] 651584=test_threadgroup I, [2024-05-20T06:44:59.599884 #610251] INFO -- : [239/885] 651587=test_have_macro I, [2024-05-20T06:44:59.644259 #610251] INFO -- : [240/885] 651622=test_complex2 I, [2024-05-20T06:44:59.656194 #610251] INFO -- : [241/885] 651622=test_resolve_symbol I, [2024-05-20T06:44:59.730491 #610251] INFO -- : [242/885] 651622=test_gem_package I, [2024-05-20T06:44:59.766430 #610251] INFO -- : [243/885] 651592=test_merge_keys I, [2024-05-20T06:44:59.775659 #610251] INFO -- : [244/885] 651592=test_rdoc_extend I, [2024-05-20T06:44:59.785956 #610251] INFO -- : [245/885] 651585=test_win32ole_variant I, [2024-05-20T06:44:59.796419 #610251] INFO -- : [246/885] 651592=test_ipaddr I, [2024-05-20T06:44:59.805132 #610251] INFO -- : [247/885] 651589=test_history I, [2024-05-20T06:44:59.805761 #610251] INFO -- : [248/885] 651585=test_mixed_unicode_escapes I, [2024-05-20T06:44:59.809923 #610251] INFO -- : [249/885] 651589=test_rdoc_markup_to_ansi I, [2024-05-20T06:44:59.810206 #610251] INFO -- : [250/885] 651585=test_gem_resolver_api_specification I, [2024-05-20T06:44:59.814494 #610251] INFO -- : [251/885] 651592=test_numeric I, [2024-05-20T06:44:59.819537 #610251] INFO -- : [252/885] 651592=test_member I, [2024-05-20T06:44:59.823850 #610251] INFO -- : [253/885] 651592=test_cgi_multipart I, [2024-05-20T06:44:59.832069 #610251] INFO -- : [254/885] 651589=test_word I, [2024-05-20T06:44:59.832496 #610251] INFO -- : [255/885] 651589=test_gem_commands_cleanup_command I, [2024-05-20T06:44:59.852669 #610251] INFO -- : [256/885] 651585=test_ractor_compatibility I, [2024-05-20T06:44:59.958217 #610251] INFO -- : [257/885] 651592=test_dir I, [2024-05-20T06:45:00.053732 #610251] INFO -- : [258/885] 651587=format_errors_test I, [2024-05-20T06:45:00.056457 #610251] INFO -- : [259/885] 651587=test_date_ractor I, [2024-05-20T06:45:00.075174 #610251] INFO -- : [260/885] 651602=test_gem_console_ui I, [2024-05-20T06:45:00.079414 #610251] INFO -- : [261/885] 651602=test_autoconf I, [2024-05-20T06:45:00.082521 #610251] INFO -- : [262/885] 651602=test_eval I, [2024-05-20T06:45:00.091036 #610251] INFO -- : [263/885] 651602=test_coderange I, [2024-05-20T06:45:00.095352 #610251] INFO -- : [264/885] 651602=location_test I, [2024-05-20T06:45:00.143094 #610251] INFO -- : [265/885] 651602=test_symbol I, [2024-05-20T06:45:00.147720 #610251] INFO -- : [266/885] 651589=test_mailto I, [2024-05-20T06:45:00.151421 #610251] INFO -- : [267/885] 651602=test_rdoc_generator_darkfish I, [2024-05-20T06:45:00.164978 #610251] INFO -- : [268/885] 651589=test_rdoc_comment I, [2024-05-20T06:45:00.195083 #610251] INFO -- : [269/885] 651592=test_resize I, [2024-05-20T06:45:00.196241 #610251] INFO -- : [270/885] 651599=test_error_highlight I, [2024-05-20T06:45:00.199901 #610251] INFO -- : [271/885] 651589=test_http_request I, [2024-05-20T06:45:00.205738 #610251] INFO -- : [272/885] 651592=test_gem_source_fetch_problem I, [2024-05-20T06:45:00.210718 #610251] INFO -- : [273/885] 651592=json_generic_object_test I, [2024-05-20T06:45:00.217122 #610251] INFO -- : [274/885] 651590=test_function_entry I, [2024-05-20T06:45:00.219910 #610251] INFO -- : [275/885] 651592=test_pkcs7 I, [2024-05-20T06:45:00.222511 #610251] INFO -- : [276/885] 651590=test_gem_resolver_requirement_list I, [2024-05-20T06:45:00.225552 #610251] INFO -- : [277/885] 651590=test_arith_seq_beg_len_step I, [2024-05-20T06:45:00.236596 #610251] INFO -- : [278/885] 651585=test_unix I, [2024-05-20T06:45:00.237978 #610251] INFO -- : [279/885] 651595=test_enc_associate I, [2024-05-20T06:45:00.242269 #610251] INFO -- : [280/885] 651589=test_lazy_enumerator I, [2024-05-20T06:45:00.271347 #610251] INFO -- : [281/885] 651587=ruby_api_test I, [2024-05-20T06:45:00.272037 #610251] INFO -- : [282/885] 651585=test_find_executable I, [2024-05-20T06:45:00.276741 #610251] INFO -- : [283/885] 651585=test_coder I, [2024-05-20T06:45:00.293256 #610251] INFO -- : [284/885] 651585=test_symbol I, [2024-05-20T06:45:00.295968 #610251] INFO -- : [285/885] 651590=test_gem_commands_pristine_command I, [2024-05-20T06:45:00.355278 #610251] INFO -- : [286/885] 651592=test_context I, [2024-05-20T06:45:00.406607 #610251] INFO -- : [287/885] 651622=test_nofree I, [2024-05-20T06:45:00.408927 #610251] INFO -- : [288/885] 651622=test_call I, [2024-05-20T06:45:00.409400 #610251] INFO -- : [289/885] 651587=test_https_proxy I, [2024-05-20T06:45:00.443722 #610251] INFO -- : [290/885] 651588=test_rubygems I, [2024-05-20T06:45:00.485476 #610251] INFO -- : [291/885] 651587=test_super I, [2024-05-20T06:45:00.503119 #610251] INFO -- : [292/885] 651592=test_rubyoptions I, [2024-05-20T06:45:00.523636 #610251] INFO -- : [293/885] 651602=test_cgi_modruby I, [2024-05-20T06:45:00.534345 #610251] INFO -- : [294/885] 651602=test_integer I, [2024-05-20T06:45:00.543355 #610251] INFO -- : [295/885] 651622=test_object_references I, [2024-05-20T06:45:00.553024 #610251] INFO -- : [296/885] 651622=test_usrmarshal I, [2024-05-20T06:45:00.564184 #610251] INFO -- : [297/885] 651589=test_gem_resolver_git_specification I, [2024-05-20T06:45:00.573341 #610251] INFO -- : [298/885] 651584=test_stat I, [2024-05-20T06:45:00.576595 #610251] INFO -- : [299/885] 651584=test_gem_request_set_lockfile_tokenizer I, [2024-05-20T06:45:00.585455 #610251] INFO -- : [300/885] 651599=test_have_func I, [2024-05-20T06:45:00.592025 #610251] INFO -- : [301/885] 651595=test_nextafter I, [2024-05-20T06:45:00.653703 #610251] INFO -- : [302/885] 651595=test_capacity I, [2024-05-20T06:45:00.654121 #610251] INFO -- : [303/885] 651595=test_dryrun I, [2024-05-20T06:45:00.667520 #610251] INFO -- : [304/885] 651595=test_integer I, [2024-05-20T06:45:00.708575 #610251] INFO -- : [305/885] 651595=desugar_compiler_test I, [2024-05-20T06:45:00.756788 #610251] INFO -- : [306/885] 651588=test_env I, [2024-05-20T06:45:00.764677 #610251] INFO -- : [307/885] 651595=test_rdoc_attr I, [2024-05-20T06:45:00.768683 #610251] INFO -- : [308/885] 651589=test_gem_commands_setup_command I, [2024-05-20T06:45:00.775077 #610251] INFO -- : [309/885] 651595=test_parser I, [2024-05-20T06:45:00.791475 #610251] INFO -- : [310/885] 651622=test_cgi_core I, [2024-05-20T06:45:00.799077 #610251] INFO -- : [311/885] 651595=test_gem_source_lock I, [2024-05-20T06:45:00.812838 #610251] INFO -- : [312/885] 651622=test_gem I, [2024-05-20T06:45:00.825140 #610251] INFO -- : [313/885] 651584=test_ractor I, [2024-05-20T06:45:00.835448 #610251] INFO -- : [314/885] 651595=test_gem_commands_open_command I, [2024-05-20T06:45:00.842440 #610251] INFO -- : [315/885] 651584=test_dns I, [2024-05-20T06:45:00.898597 #610251] INFO -- : [316/885] 651595=parse_stream_test I, [2024-05-20T06:45:00.901767 #610251] INFO -- : [317/885] 651595=test_registry I, [2024-05-20T06:45:00.905111 #610251] INFO -- : [318/885] 651595=test_my_integer I, [2024-05-20T06:45:00.907895 #610251] INFO -- : [319/885] 651595=test_thread I, [2024-05-20T06:45:01.131231 #610251] INFO -- : [320/885] 651587=json_ext_parser_test I, [2024-05-20T06:45:01.135682 #610251] INFO -- : [321/885] 651587=test_debugger_integration I, [2024-05-20T06:45:01.153598 #610251] INFO -- : [322/885] 651587=test_rendering I, [2024-05-20T06:45:01.154621 #610251] INFO -- : [323/885] 651587=test_ractor I, [2024-05-20T06:45:01.180157 #610251] INFO -- : [324/885] 651589=test_ssl I, [2024-05-20T06:45:01.198995 #610251] INFO -- : [325/885] 651593=test_rb_str_dup I, [2024-05-20T06:45:01.211206 #610251] INFO -- : [326/885] 651593=test_reline_key I, [2024-05-20T06:45:01.267180 #610251] INFO -- : [327/885] 651593=test_singleton_function I, [2024-05-20T06:45:01.268305 #610251] INFO -- : [328/885] 651593=test_ancdata I, [2024-05-20T06:45:01.273975 #610251] INFO -- : [329/885] 651593=test_alias I, [2024-05-20T06:45:01.293517 #610251] INFO -- : [330/885] 651584=test_timeout I, [2024-05-20T06:45:01.385732 #610251] INFO -- : [331/885] 651593=test_marshal I, [2024-05-20T06:45:01.447520 #610251] INFO -- : [332/885] 651587=test_unicode_normalize I, [2024-05-20T06:45:01.480869 #610251] INFO -- : [333/885] 651597=test_weakref I, [2024-05-20T06:45:01.526225 #610251] INFO -- : [334/885] 651590=test_nonblock I, [2024-05-20T06:45:01.547960 #610251] INFO -- : [335/885] 651590=errors_test I, [2024-05-20T06:45:01.577960 #610251] INFO -- : [336/885] 651597=test_gem_commands_check_command I, [2024-05-20T06:45:01.595258 #610251] INFO -- : [337/885] 651597=test_regexp I, [2024-05-20T06:45:01.614021 #610251] INFO -- : [338/885] 651589=test_vm_dump I, [2024-05-20T06:45:01.615915 #610251] INFO -- : [339/885] 651589=test_rdoc_markup_document I, [2024-05-20T06:45:01.635509 #610251] INFO -- : [340/885] 651589=test_integer_comb I, [2024-05-20T06:45:01.687101 #610251] INFO -- : [341/885] 651590=test_tmpdir I, [2024-05-20T06:45:01.747756 #610251] INFO -- : [342/885] 651590=test_data_error I, [2024-05-20T06:45:01.796917 #610251] INFO -- : [343/885] 651590=bom_test I, [2024-05-20T06:45:01.803068 #610251] INFO -- : [344/885] 651593=test_force_exit I, [2024-05-20T06:45:01.815808 #610251] INFO -- : [345/885] 651590=test_file I, [2024-05-20T06:45:01.860447 #610251] INFO -- : [346/885] 651593=unescape_test I, [2024-05-20T06:45:01.885266 #610251] INFO -- : [347/885] 651598=test_ostruct I, [2024-05-20T06:45:02.094562 #610251] INFO -- : [348/885] 651598=test_udp I, [2024-05-20T06:45:02.096742 #610251] INFO -- : [349/885] 651598=static_inspect_test I, [2024-05-20T06:45:02.115954 #610251] INFO -- : [350/885] 651600=test_gem_uri_formatter I, [2024-05-20T06:45:02.123360 #610251] INFO -- : [351/885] 651599=test_erb_command I, [2024-05-20T06:45:02.135980 #610251] INFO -- : [352/885] 651600=test_helper I, [2024-05-20T06:45:02.138522 #610251] INFO -- : [353/885] 651585=test_encoding I, [2024-05-20T06:45:02.143963 #610251] INFO -- : [354/885] 651600=test_project_sanity I, [2024-05-20T06:45:02.167845 #610251] INFO -- : [355/885] 651599=test_range I, [2024-05-20T06:45:02.169874 #610251] INFO -- : [356/885] 651598=test_constant I, [2024-05-20T06:45:02.205822 #610251] INFO -- : [357/885] 651600=test_pty I, [2024-05-20T06:45:02.238730 #610251] INFO -- : [358/885] 651584=test_dup I, [2024-05-20T06:45:02.256929 #610251] INFO -- : [359/885] 651596=command_line_test I, [2024-05-20T06:45:02.260189 #610251] INFO -- : [360/885] 651596=test_rdoc_ri_paths I, [2024-05-20T06:45:02.275857 #610251] INFO -- : [361/885] 651596=test_ts I, [2024-05-20T06:45:02.377149 #610251] INFO -- : [362/885] 651585=test_ensured I, [2024-05-20T06:45:02.444420 #610251] INFO -- : [363/885] 651584=library_symbols_test I, [2024-05-20T06:45:02.446466 #610251] INFO -- : [364/885] 651585=test_locale I, [2024-05-20T06:45:02.450104 #610251] INFO -- : [365/885] 651584=test_addr I, [2024-05-20T06:45:02.457320 #610251] INFO -- : [366/885] 651584=test_config I, [2024-05-20T06:45:02.489769 #610251] INFO -- : [367/885] 651585=test_gem_resolver_vendor_set I, [2024-05-20T06:45:02.508527 #610251] INFO -- : [368/885] 651585=test_enumerable I, [2024-05-20T06:45:02.517737 #610251] INFO -- : [369/885] 651585=test_gem_safe_marshal I, [2024-05-20T06:45:02.574575 #610251] INFO -- : [370/885] 651594=test_gem_resolver_api_set I, [2024-05-20T06:45:02.624219 #610251] INFO -- : [371/885] 651594=test_transcode I, [2024-05-20T06:45:02.723418 #610251] INFO -- : [372/885] 651600=test_eval I, [2024-05-20T06:45:02.748989 #610251] INFO -- : [373/885] 651596=json_generator_test I, [2024-05-20T06:45:02.765044 #610251] INFO -- : [374/885] 651622=test_rdoc_code_object I, [2024-05-20T06:45:02.809496 #610251] INFO -- : [375/885] 651594=test_x509store I, [2024-05-20T06:45:02.883439 #610251] INFO -- : [376/885] 651596=test_update I, [2024-05-20T06:45:02.891116 #610251] INFO -- : [377/885] 651599=test_fips I, [2024-05-20T06:45:02.894522 #610251] INFO -- : [378/885] 651596=test_x509name I, [2024-05-20T06:45:02.904857 #610251] INFO -- : [379/885] 651596=test_ast I, [2024-05-20T06:45:02.908927 #610251] INFO -- : [380/885] 651584=test_gem_request_set_gem_dependency_api I, [2024-05-20T06:45:02.939214 #610251] INFO -- : [381/885] 651593=test_lambda I, [2024-05-20T06:45:02.995260 #610251] INFO -- : [382/885] 651593=test_random_formatter I, [2024-05-20T06:45:03.016997 #610251] INFO -- : [383/885] 651600=test_helper I, [2024-05-20T06:45:03.018167 #610251] INFO -- : [384/885] 651593=test_jaro_winkler I, [2024-05-20T06:45:03.018683 #610251] INFO -- : [385/885] 651585=test_webauthn_listener I, [2024-05-20T06:45:03.022874 #610251] INFO -- : [386/885] 651593=test_pkey_rsa I, [2024-05-20T06:45:03.063393 #610251] INFO -- : [387/885] 651594=test_weakkeymap I, [2024-05-20T06:45:03.069037 #610251] INFO -- : [388/885] 651585=test_gem_commands_push_command I, [2024-05-20T06:45:03.098598 #610251] INFO -- : [389/885] 651600=test_numhash I, [2024-05-20T06:45:03.100584 #610251] INFO -- : [390/885] 651600=test_date_strptime I, [2024-05-20T06:45:03.121191 #610251] INFO -- : [391/885] 651584=test_gem_package_task I, [2024-05-20T06:45:03.121647 #610251] INFO -- : [392/885] 651584=test_placearg I, [2024-05-20T06:45:03.196046 #610251] INFO -- : [393/885] 651599=test_rdoc_markup_hard_break I, [2024-05-20T06:45:03.202994 #610251] INFO -- : [394/885] 651599=test_gem_platform I, [2024-05-20T06:45:03.210131 #610251] INFO -- : [395/885] 651600=test_delete I, [2024-05-20T06:45:03.212995 #610251] INFO -- : [396/885] 651600=test_win32ole_method I, [2024-05-20T06:45:03.216467 #610251] INFO -- : [397/885] 651600=test_fd_setsize I, [2024-05-20T06:45:03.218216 #610251] INFO -- : [398/885] 651600=test_continuation I, [2024-05-20T06:45:03.222737 #610251] INFO -- : [399/885] 651600=test_class_name_check I, [2024-05-20T06:45:03.227515 #610251] INFO -- : [400/885] 651594=test_keyword I, [2024-05-20T06:45:03.239985 #610251] INFO -- : [401/885] 651600=test_file_exhaustive I, [2024-05-20T06:45:03.252502 #610251] INFO -- : [402/885] 651584=test_gem_update_suggestion I, [2024-05-20T06:45:03.259270 #610251] INFO -- : [403/885] 651622=test_files_test I, [2024-05-20T06:45:03.293726 #610251] INFO -- : [404/885] 651599=test_logger I, [2024-05-20T06:45:03.304249 #610251] INFO -- : [405/885] 651593=test_import I, [2024-05-20T06:45:03.306518 #610251] INFO -- : [406/885] 651599=test_gem_resolver_lock_set I, [2024-05-20T06:45:03.310498 #610251] INFO -- : [407/885] 651584=test_not I, [2024-05-20T06:45:03.316702 #610251] INFO -- : [408/885] 651584=test_rdoc_parser_markdown I, [2024-05-20T06:45:03.335530 #610251] INFO -- : [409/885] 651599=test_cgi_header I, [2024-05-20T06:45:03.339794 #610251] INFO -- : [410/885] 651599=heredoc_dedent_test I, [2024-05-20T06:45:03.352329 #610251] INFO -- : [411/885] 651622=test_object I, [2024-05-20T06:45:03.355515 #610251] INFO -- : [412/885] 651622=version_test I, [2024-05-20T06:45:03.411582 #610251] INFO -- : [413/885] 651622=test_key_actor_emacs I, [2024-05-20T06:45:03.417061 #610251] INFO -- : [414/885] 651599=test_gem_gemcutter_utilities I, [2024-05-20T06:45:03.521835 #610251] INFO -- : [415/885] 651584=test_basicinstructions I, [2024-05-20T06:45:03.539994 #610251] INFO -- : [416/885] 651622=test_gem_command_manager I, [2024-05-20T06:45:03.555915 #610251] INFO -- : [417/885] 651588=test_arithmetic_sequence I, [2024-05-20T06:45:03.561584 #610251] INFO -- : [418/885] 651585=test_change_word I, [2024-05-20T06:45:03.566386 #610251] INFO -- : [419/885] 651585=compiler_test I, [2024-05-20T06:45:03.570908 #610251] INFO -- : [420/885] 651588=test_flip I, [2024-05-20T06:45:03.572975 #610251] INFO -- : [421/885] 651585=test_timeout I, [2024-05-20T06:45:03.577891 #610251] INFO -- : [422/885] 651585=test_normalize I, [2024-05-20T06:45:03.578450 #610251] INFO -- : [423/885] 651585=test_ossl I, [2024-05-20T06:45:03.596747 #610251] INFO -- : [424/885] 651588=test_date_arith I, [2024-05-20T06:45:03.602305 #610251] INFO -- : [425/885] 651588=test_ruby_lex I, [2024-05-20T06:45:03.604987 #610251] INFO -- : [426/885] 651584=test_object I, [2024-05-20T06:45:03.613046 #610251] INFO -- : [427/885] 651602=test_gem_local_remote_options I, [2024-05-20T06:45:03.649947 #610251] INFO -- : [428/885] 651602=test_sleep I, [2024-05-20T06:45:03.672171 #610251] INFO -- : [429/885] 651622=test_ractor I, [2024-05-20T06:45:03.746635 #610251] INFO -- : [430/885] 651622=test_type I, [2024-05-20T06:45:03.749295 #610251] INFO -- : [431/885] 651589=test_pointer I, [2024-05-20T06:45:03.756947 #610251] INFO -- : [432/885] 651622=test_big5 I, [2024-05-20T06:45:03.758218 #610251] INFO -- : [433/885] 651622=test_func I, [2024-05-20T06:45:03.778189 #610251] INFO -- : [434/885] 651599=test_rdoc_rd_block_parser I, [2024-05-20T06:45:03.802243 #610251] INFO -- : [435/885] 651594=test_signedness I, [2024-05-20T06:45:03.827576 #610251] INFO -- : [436/885] 651599=test_tsort I, [2024-05-20T06:45:03.834804 #610251] INFO -- : [437/885] 651599=test_bug-5832 I, [2024-05-20T06:45:03.840712 #610251] INFO -- : [438/885] 651599=test_files_ext I, [2024-05-20T06:45:03.905800 #610251] INFO -- : [439/885] 651588=test_gem_silent_ui I, [2024-05-20T06:45:03.934217 #610251] INFO -- : [440/885] 651588=test_emitter I, [2024-05-20T06:45:03.956029 #610251] INFO -- : [441/885] 651588=test_kdf I, [2024-05-20T06:45:03.964168 #610251] INFO -- : [442/885] 651599=test_gem_doctor I, [2024-05-20T06:45:04.007340 #610251] INFO -- : [443/885] 651599=test_eval_history I, [2024-05-20T06:45:04.037467 #610251] INFO -- : [444/885] 651588=dispatcher_test I, [2024-05-20T06:45:04.044455 #610251] INFO -- : [445/885] 651584=test_kernel I, [2024-05-20T06:45:04.145824 #610251] INFO -- : [446/885] 651588=test_rdoc_markup_paragraph I, [2024-05-20T06:45:04.161231 #610251] INFO -- : [447/885] 651589=test_enc_raise I, [2024-05-20T06:45:04.168989 #610251] INFO -- : [448/885] 651599=test_psych I, [2024-05-20T06:45:04.170592 #610251] INFO -- : [449/885] 651589=!Nothing_to_test I, [2024-05-20T06:45:04.171672 #610251] INFO -- : [450/885] 651589=test_object_create_start I, [2024-05-20T06:45:04.177463 #610251] INFO -- : [451/885] 651589=test_at_exit I, [2024-05-20T06:45:04.192929 #610251] INFO -- : [452/885] 651589=test_command I, [2024-05-20T06:45:04.201984 #610251] INFO -- : [453/885] 651599=test_gem_ext_cargo_builder_unit I, [2024-05-20T06:45:04.221369 #610251] INFO -- : [454/885] 651599=test_gem_rdoc I, [2024-05-20T06:45:04.294070 #610251] INFO -- : [455/885] 651588=test_date I, [2024-05-20T06:45:04.305132 #610251] INFO -- : [456/885] 651588=test_hmac I, [2024-05-20T06:45:04.313967 #610251] INFO -- : [457/885] 651588=test_rdoc_markup_to_tt_only I, [2024-05-20T06:45:04.324017 #610251] INFO -- : [458/885] 651599=test_rdoc_tom_doc I, [2024-05-20T06:45:04.337347 #610251] INFO -- : [459/885] 651599=test_assignment I, [2024-05-20T06:45:04.344213 #610251] INFO -- : [460/885] 651593=test_ifunless I, [2024-05-20T06:45:04.347535 #610251] INFO -- : [461/885] 651593=test_gem_commands_lock_command I, [2024-05-20T06:45:04.351526 #610251] INFO -- : [462/885] 651588=test_numeric I, [2024-05-20T06:45:04.370226 #610251] INFO -- : [463/885] 651587=test_common I, [2024-05-20T06:45:04.372499 #610251] INFO -- : [464/885] 651593=test_gem_spec_fetcher I, [2024-05-20T06:45:04.448792 #610251] INFO -- : [465/885] 651588=test_gem_command I, [2024-05-20T06:45:04.478186 #610251] INFO -- : [466/885] 651589=test_key_actor_vi I, [2024-05-20T06:45:04.515332 #610251] INFO -- : [467/885] 651588=test_bug-3571 I, [2024-05-20T06:45:04.530277 #610251] INFO -- : [468/885] 651588=test_address_resolve I, [2024-05-20T06:45:04.544506 #610251] INFO -- : [469/885] 651588=test_rdoc_token_stream I, [2024-05-20T06:45:04.545533 #610251] INFO -- : [470/885] 651587=test_config I, [2024-05-20T06:45:04.548676 #610251] INFO -- : [471/885] 651593=test_yaml_special_cases I, [2024-05-20T06:45:04.551225 #610251] INFO -- : [472/885] 651588=test_optarg I, [2024-05-20T06:45:04.556877 #610251] INFO -- : [473/885] 651593=test_gem_source_list I, [2024-05-20T06:45:04.558155 #610251] INFO -- : [474/885] 651598=test_macro I, [2024-05-20T06:45:04.564302 #610251] INFO -- : [475/885] 651598=test_frozen I, [2024-05-20T06:45:04.566052 #610251] INFO -- : [476/885] 651598=test_gem_ext_configure_builder I, [2024-05-20T06:45:04.582390 #610251] INFO -- : [477/885] 651587=test_pp I, [2024-05-20T06:45:04.594236 #610251] INFO -- : [478/885] 651598=test_verbose I, [2024-05-20T06:45:04.602699 #610251] INFO -- : [479/885] 651589=test_num2int I, [2024-05-20T06:45:04.611181 #610251] INFO -- : [480/885] 651593=test_nil I, [2024-05-20T06:45:04.614293 #610251] INFO -- : [481/885] 651593=test_rdoc_single_class I, [2024-05-20T06:45:04.615624 #610251] INFO -- : [482/885] 651589=test_zsh_completion I, [2024-05-20T06:45:04.617756 #610251] INFO -- : [483/885] 651593=test_exception I, [2024-05-20T06:45:04.620480 #610251] INFO -- : [484/885] 651589=test_iter_break I, [2024-05-20T06:45:04.624346 #610251] INFO -- : [485/885] 651589=test_ole_methods I, [2024-05-20T06:45:04.624463 #610251] INFO -- : [486/885] 651593=test_erb_m17n I, [2024-05-20T06:45:04.626826 #610251] INFO -- : [487/885] 651589=test_date_conv I, [2024-05-20T06:45:04.630820 #610251] INFO -- : [488/885] 651593=test_optimization I, [2024-05-20T06:45:04.632889 #610251] INFO -- : [489/885] 651589=test_zlib I, [2024-05-20T06:45:04.637479 #610251] INFO -- : [490/885] 651587=test_cgi_tag_helper I, [2024-05-20T06:45:04.640837 #610251] INFO -- : [491/885] 651598=test_egrep_cpp I, [2024-05-20T06:45:04.668635 #610251] INFO -- : [492/885] 651587=test_gem_resolver_index_set I, [2024-05-20T06:45:04.675868 #610251] INFO -- : [493/885] 651584=test_gem_package_old I, [2024-05-20T06:45:04.698096 #610251] INFO -- : [494/885] 651588=test_gc_compact I, [2024-05-20T06:45:04.700014 #610251] INFO -- : [495/885] 651587=test_proc I, [2024-05-20T06:45:04.713688 #610251] INFO -- : [496/885] 651584=test_string I, [2024-05-20T06:45:04.777392 #610251] INFO -- : [497/885] 651598=test_gem_validator I, [2024-05-20T06:45:04.802030 #610251] INFO -- : [498/885] 651598=test_fnmatch I, [2024-05-20T06:45:04.843579 #610251] INFO -- : [499/885] 651598=test_files_test_2 I, [2024-05-20T06:45:05.018854 #610251] INFO -- : [500/885] 651622=test_rdoc_markup_parser I, [2024-05-20T06:45:05.065797 #610251] INFO -- : [501/885] 651622=test_require_path_check I, [2024-05-20T06:45:05.114947 #610251] INFO -- : [502/885] 651622=test_folderitem2_invokeverb I, [2024-05-20T06:45:05.117393 #610251] INFO -- : [503/885] 651622=test_string I, [2024-05-20T06:45:05.136802 #610251] INFO -- : [504/885] 651622=test_rdoc_stats I, [2024-05-20T06:45:05.170326 #610251] INFO -- : [505/885] 651622=test_pattern_matching I, [2024-05-20T06:45:05.205641 #610251] INFO -- : [506/885] 651622=test_depth_first I, [2024-05-20T06:45:05.214883 #610251] INFO -- : [507/885] 651622=test_gem_request_set_lockfile_parser I, [2024-05-20T06:45:05.297714 #610251] INFO -- : [508/885] 651622=test_raise I, [2024-05-20T06:45:05.299422 #610251] INFO -- : [509/885] 651622=test_x509attr I, [2024-05-20T06:45:05.311975 #610251] INFO -- : [510/885] 651622=test_rdoc_store I, [2024-05-20T06:45:05.376131 #610251] INFO -- : [511/885] 651586=test_custom_command I, [2024-05-20T06:45:05.506079 #610251] INFO -- : [512/885] 651586=json_addition_test I, [2024-05-20T06:45:05.525588 #610251] INFO -- : [513/885] 651586=test_gem_dependency_resolution_error I, [2024-05-20T06:45:05.603749 #610251] INFO -- : [514/885] 651587=test_rdoc_parser I, [2024-05-20T06:45:05.673016 #610251] INFO -- : [515/885] 651587=test_qsort I, [2024-05-20T06:45:05.678485 #610251] INFO -- : [516/885] 651587=test_rdoc_markup_to_rdoc I, [2024-05-20T06:45:05.699682 #610251] INFO -- : [517/885] 651586=test_rdoc_rd_inline_parser I, [2024-05-20T06:45:05.780418 #610251] INFO -- : [518/885] 651587=test_default_gems I, [2024-05-20T06:45:05.825002 #610251] INFO -- : [519/885] 651586=test_null I, [2024-05-20T06:45:05.835789 #610251] INFO -- : [520/885] 651587=test_win32ole_type I, [2024-05-20T06:45:05.845213 #610251] INFO -- : [521/885] 651587=test_mul I, [2024-05-20T06:45:05.848680 #610251] INFO -- : [522/885] 651587=test_rdoc_markup_attributes I, [2024-05-20T06:45:05.850565 #610251] INFO -- : [523/885] 651586=test_date_parse I, [2024-05-20T06:45:05.853672 #610251] INFO -- : [524/885] 651587=test_pkey_ec I, [2024-05-20T06:45:05.919899 #610251] INFO -- : [525/885] 651587=test_trick I, [2024-05-20T06:45:05.924204 #610251] INFO -- : [526/885] 651622=test_thread I, [2024-05-20T06:45:05.928480 #610251] INFO -- : [527/885] 651622=test_pipe I, [2024-05-20T06:45:05.945256 #610251] INFO -- : [528/885] 651586=test_rdoc_i18n_text I, [2024-05-20T06:45:05.949866 #610251] INFO -- : [529/885] 651586=test_io_buffer I, [2024-05-20T06:45:05.982078 #610251] INFO -- : [530/885] 651586=test_key_name_check I, [2024-05-20T06:45:05.991145 #610251] INFO -- : [531/885] 651586=test_defined I, [2024-05-20T06:45:06.041018 #610251] INFO -- : [532/885] 651586=test_backtrace I, [2024-05-20T06:45:06.054174 #610251] INFO -- : [533/885] 651586=test_rdoc_rdoc I, [2024-05-20T06:45:06.078546 #610251] INFO -- : [534/885] 651622=test_windows_1251 I, [2024-05-20T06:45:06.089633 #610251] INFO -- : [535/885] 651622=test_time I, [2024-05-20T06:45:06.154547 #610251] INFO -- : [536/885] 651599=test_buffering I, [2024-05-20T06:45:06.156257 #610251] INFO -- : [537/885] 651599=test_svcb_https I, [2024-05-20T06:45:06.177898 #610251] INFO -- : [538/885] 651599=test_gb18030 I, [2024-05-20T06:45:06.181674 #610251] INFO -- : [539/885] 651599=test_gem_uninstaller I, [2024-05-20T06:45:06.189284 #610251] INFO -- : [540/885] 651586=test_gem_dependency_installer I, [2024-05-20T06:45:06.212487 #610251] INFO -- : [541/885] 651622=test_scalar I, [2024-05-20T06:45:06.219233 #610251] INFO -- : [542/885] 651622=test_gem_commands_info_command I, [2024-05-20T06:45:06.239838 #610251] INFO -- : [543/885] 651622=test_rdoc_cross_reference I, [2024-05-20T06:45:06.278782 #610251] INFO -- : [544/885] 651601=test_store I, [2024-05-20T06:45:06.320861 #610251] INFO -- : [545/885] 651594=test_case_options I, [2024-05-20T06:45:06.327917 #610251] INFO -- : [546/885] 651594=test_exception I, [2024-05-20T06:45:06.485445 #610251] INFO -- : [547/885] 651601=test_rand I, [2024-05-20T06:45:06.734709 #610251] INFO -- : [548/885] 651622=test_gem_package_tar_reader_entry I, [2024-05-20T06:45:06.752569 #610251] INFO -- : [549/885] 651601=test_gem_name_tuple I, [2024-05-20T06:45:06.768902 #610251] INFO -- : [550/885] 651601=test_bug_reporter I, [2024-05-20T06:45:06.906237 #610251] INFO -- : [551/885] 651622=test_gem_ext_cargo_builder_link_flag_converter I, [2024-05-20T06:45:06.933608 #610251] INFO -- : [552/885] 651622=test_gem_commands_mirror I, [2024-05-20T06:45:06.940691 #610251] INFO -- : [553/885] 651622=test_sprintf_comb I, [2024-05-20T06:45:07.034249 #610251] INFO -- : [554/885] 651622=test_method_cache I, [2024-05-20T06:45:07.040324 #610251] INFO -- : [555/885] 651622=test_gem_request I, [2024-05-20T06:45:07.152974 #610251] INFO -- : [556/885] 651622=test_scan_args I, [2024-05-20T06:45:07.158351 #610251] INFO -- : [557/885] 651622=test_win32ole I, [2024-05-20T06:45:07.164841 #610251] INFO -- : [558/885] 651622=test_generic I, [2024-05-20T06:45:07.186044 #610251] INFO -- : [559/885] 651622=test_gem_text I, [2024-05-20T06:45:07.191301 #610251] INFO -- : [560/885] 651601=test_settracefunc I, [2024-05-20T06:45:07.217137 #610251] INFO -- : [561/885] 651622=test_enumerator_kw I, [2024-05-20T06:45:07.218157 #610251] INFO -- : [562/885] 651622=test_parser_events I, [2024-05-20T06:45:07.254074 #610251] INFO -- : [563/885] 651622=test_reline I, [2024-05-20T06:45:07.381645 #610251] INFO -- : [564/885] 651588=test_case I, [2024-05-20T06:45:07.391827 #610251] INFO -- : [565/885] 651588=test_pkey I, [2024-05-20T06:45:07.400592 #610251] INFO -- : [566/885] 651599=test_gem_request_connection_pools I, [2024-05-20T06:45:07.420393 #610251] INFO -- : [567/885] 651588=test_grapheme_breaks I, [2024-05-20T06:45:07.445945 #610251] INFO -- : [568/885] 651588=test_gem_version_option I, [2024-05-20T06:45:07.474308 #610251] INFO -- : [569/885] 651588=test_cclass I, [2024-05-20T06:45:07.546660 #610251] INFO -- : [570/885] 651588=test_ractor I, [2024-05-20T06:45:07.597908 #610251] INFO -- : [571/885] 651622=test_memory_view I, [2024-05-20T06:45:07.633072 #610251] INFO -- : [572/885] 651588=test_m17n_comb I, [2024-05-20T06:45:07.798687 #610251] INFO -- : [573/885] 651598=test_rdoc_markup_to_markdown I, [2024-05-20T06:45:07.836575 #610251] INFO -- : [574/885] 651598=test_json_tree I, [2024-05-20T06:45:07.837771 #610251] INFO -- : [575/885] 651622=test_rdoc_generator_pot_po I, [2024-05-20T06:45:07.839671 #610251] INFO -- : [576/885] 651598=test_ansi_with_terminfo I, [2024-05-20T06:45:07.843205 #610251] INFO -- : [577/885] 651622=test_require_lib I, [2024-05-20T06:45:07.852732 #610251] INFO -- : [578/885] 651598=test_gem_install_update_options I, [2024-05-20T06:45:07.866392 #610251] INFO -- : [579/885] 651594=parse_test I, [2024-05-20T06:45:07.867736 #610251] INFO -- : [580/885] 651590=test_ractor I, [2024-05-20T06:45:07.885129 #610251] INFO -- : [581/885] 651590=test_severity I, [2024-05-20T06:45:07.892567 #610251] INFO -- : [582/885] 651590=test_gem_stream_ui I, [2024-05-20T06:45:07.961546 #610251] INFO -- : [583/885] 651598=test_rdoc_generator_ri I, [2024-05-20T06:45:07.967083 #610251] INFO -- : [584/885] 651598=test_extlibs I, [2024-05-20T06:45:07.981329 #610251] INFO -- : [585/885] 651590=test_str2big I, [2024-05-20T06:45:07.989101 #610251] INFO -- : [586/885] 651590=test_dot_dot I, [2024-05-20T06:45:07.995041 #610251] INFO -- : [587/885] 651590=test_c_struct_builder I, [2024-05-20T06:45:08.109925 #610251] INFO -- : [588/885] 651590=test_literal I, [2024-05-20T06:45:08.158134 #610251] INFO -- : [589/885] 651601=test_thread I, [2024-05-20T06:45:08.207549 #610251] INFO -- : [590/885] 651586=test_socket I, [2024-05-20T06:45:08.377456 #610251] INFO -- : [591/885] 651601=test_objectspace I, [2024-05-20T06:45:08.440408 #610251] INFO -- : [592/885] 651599=test_rdoc_markup_to_table_of_contents I, [2024-05-20T06:45:08.475018 #610251] INFO -- : [593/885] 651599=test_rdoc_markdown_test I, [2024-05-20T06:45:08.548086 #610251] INFO -- : [594/885] 651587=test_rdoc_normal_module I, [2024-05-20T06:45:08.609831 #610251] INFO -- : [595/885] 651587=test_c_union_entity I, [2024-05-20T06:45:08.616171 #610251] INFO -- : [596/885] 651589=test_logperiod I, [2024-05-20T06:45:08.622970 #610251] INFO -- : [597/885] 651589=test_securerandom I, [2024-05-20T06:45:08.651960 #610251] INFO -- : [598/885] 651602=test_switch_hitter I, [2024-05-20T06:45:08.653478 #610251] INFO -- : [599/885] 651589=test_singleton I, [2024-05-20T06:45:08.663080 #610251] INFO -- : [600/885] 651589=test_flush I, [2024-05-20T06:45:08.664208 #610251] INFO -- : [601/885] 651589=test_io_console I, [2024-05-20T06:45:08.670029 #610251] INFO -- : [602/885] 651602=test_hash_create I, [2024-05-20T06:45:08.670516 #610251] INFO -- : [603/885] 651602=test_stringchar I, [2024-05-20T06:45:08.694173 #610251] INFO -- : [604/885] 651587=test_uncorrectable_name_check I, [2024-05-20T06:45:08.698268 #610251] INFO -- : [605/885] 651587=newline_test I, [2024-05-20T06:45:08.727797 #610251] INFO -- : [606/885] 651602=test_thread_fd_close I, [2024-05-20T06:45:08.733394 #610251] INFO -- : [607/885] 651602=test_passing_block I, [2024-05-20T06:45:08.737927 #610251] INFO -- : [608/885] 651602=test_pack I, [2024-05-20T06:45:08.762631 #610251] INFO -- : [609/885] 651587=test_last_thread I, [2024-05-20T06:45:08.810005 #610251] INFO -- : [610/885] 651590=test_process I, [2024-05-20T06:45:08.930473 #610251] INFO -- : [611/885] 651602=test_gem_source_local I, [2024-05-20T06:45:09.099176 #610251] INFO -- : [612/885] 651602=test_gem_security_policy I, [2024-05-20T06:45:09.175486 #610251] INFO -- : [613/885] 651599=test_logdevice I, [2024-05-20T06:45:09.228288 #610251] INFO -- : [614/885] 651601=test_arity I, [2024-05-20T06:45:09.232615 #610251] INFO -- : [615/885] 651601=test_gem_ext_rake_builder I, [2024-05-20T06:45:09.300287 #610251] INFO -- : [616/885] 651602=test_gc I, [2024-05-20T06:45:09.350563 #610251] INFO -- : [617/885] 651600=test_x509cert I, [2024-05-20T06:45:09.421957 #610251] INFO -- : [618/885] 651586=test_err_in_callback I, [2024-05-20T06:45:09.426666 #610251] INFO -- : [619/885] 651586=test_gem_resolver_lock_specification I, [2024-05-20T06:45:09.453588 #610251] INFO -- : [620/885] 651586=test_enumerator I, [2024-05-20T06:45:09.595091 #610251] INFO -- : [621/885] 651592=test_flags I, [2024-05-20T06:45:09.620752 #610251] INFO -- : [622/885] 651600=test_inadvertent_creation I, [2024-05-20T06:45:09.743540 #610251] INFO -- : [623/885] 651600=test_gem_commands_which_command I, [2024-05-20T06:45:09.757126 #610251] INFO -- : [624/885] 651598=test_shift_jis I, [2024-05-20T06:45:09.758377 #610251] INFO -- : [625/885] 651598=test_http I, [2024-05-20T06:45:09.772777 #610251] INFO -- : [626/885] 651600=test_gem_commands_specification_command I, [2024-05-20T06:45:09.774152 #610251] INFO -- : [627/885] 651598=test_gem_resolver_composed_set I, [2024-05-20T06:45:09.791781 #610251] INFO -- : [628/885] 651598=test_safe_load I, [2024-05-20T06:45:09.812309 #610251] INFO -- : [629/885] 651598=test_gem_resolver I, [2024-05-20T06:45:09.814028 #610251] INFO -- : [630/885] 651587=test_gem_commands_dependency_command I, [2024-05-20T06:45:09.878541 #610251] INFO -- : [631/885] 651587=test_rdoc_markup_attribute_manager I, [2024-05-20T06:45:09.908588 #610251] INFO -- : [632/885] 651600=test_name_error I, [2024-05-20T06:45:09.910738 #610251] INFO -- : [633/885] 651587=test_rdoc_parser_ruby I, [2024-05-20T06:45:09.954911 #610251] INFO -- : [634/885] 651601=test_open-uri I, [2024-05-20T06:45:09.960135 #610251] INFO -- : [635/885] 651595=test_httpresponse I, [2024-05-20T06:45:09.983908 #610251] INFO -- : [636/885] 651599=test_stream I, [2024-05-20T06:45:09.989909 #610251] INFO -- : [637/885] 651599=test_nil2vtempty I, [2024-05-20T06:45:09.993520 #610251] INFO -- : [638/885] 651599=test_rdoc_context I, [2024-05-20T06:45:10.022126 #610251] INFO -- : [639/885] 651598=test_rdoc_text I, [2024-05-20T06:45:10.032979 #610251] INFO -- : [640/885] 651600=test_iso_8859 I, [2024-05-20T06:45:10.051161 #610251] INFO -- : [641/885] 651598=test_tcp I, [2024-05-20T06:45:10.071197 #610251] INFO -- : [642/885] 651600=test_data I, [2024-05-20T06:45:10.084266 #610251] INFO -- : [643/885] 651595=test_date_new I, [2024-05-20T06:45:10.086541 #610251] INFO -- : [644/885] 651600=index_write_test I, [2024-05-20T06:45:10.089198 #610251] INFO -- : [645/885] 651600=test_require I, [2024-05-20T06:45:10.092530 #610251] INFO -- : [646/885] 651595=test_date_time I, [2024-05-20T06:45:10.092594 #610251] INFO -- : [647/885] 651600=test_rdoc_markup_to_joined_paragraph I, [2024-05-20T06:45:10.097515 #610251] INFO -- : [648/885] 651600=test_gem_safe_yaml I, [2024-05-20T06:45:10.103555 #610251] INFO -- : [649/885] 651595=test_syntax I, [2024-05-20T06:45:10.108107 #610251] INFO -- : [650/885] 651600=test_yamlstore I, [2024-05-20T06:45:10.114102 #610251] INFO -- : [651/885] 651594=test_gem_installer I, [2024-05-20T06:45:10.119745 #610251] INFO -- : [652/885] 651600=test_rdoc_parser_rd I, [2024-05-20T06:45:10.128291 #610251] INFO -- : [653/885] 651600=test_date_strftime I, [2024-05-20T06:45:10.147197 #610251] INFO -- : [654/885] 651598=test_irb I, [2024-05-20T06:45:10.188852 #610251] INFO -- : [655/885] 651585=json_string_matching_test I, [2024-05-20T06:45:10.198403 #610251] INFO -- : [656/885] 651585=test_load I, [2024-05-20T06:45:10.207934 #610251] INFO -- : [657/885] 651585=test_class I, [2024-05-20T06:45:10.332739 #610251] INFO -- : [658/885] 651588=test_rdoc_normal_class I, [2024-05-20T06:45:10.382945 #610251] INFO -- : [659/885] 651598=test_const I, [2024-05-20T06:45:10.386144 #610251] INFO -- : [660/885] 651601=test_asn1 I, [2024-05-20T06:45:10.391337 #610251] INFO -- : [661/885] 651598=test_random I, [2024-05-20T06:45:10.395269 #610251] INFO -- : [662/885] 651598=test_tempfile I, [2024-05-20T06:45:10.419241 #610251] INFO -- : [663/885] 651601=parse_comments_test I, [2024-05-20T06:45:10.420096 #610251] INFO -- : [664/885] 651601=test_noarg I, [2024-05-20T06:45:10.463831 #610251] INFO -- : [665/885] 651588=test_function I, [2024-05-20T06:45:10.608178 #610251] INFO -- : [666/885] 651601=test_queue I, [2024-05-20T06:45:10.610414 #610251] INFO -- : [667/885] 651601=test_internal_ivar I, [2024-05-20T06:45:10.616048 #610251] INFO -- : [668/885] 651601=test_gem_resolver_index_specification I, [2024-05-20T06:45:10.656288 #610251] INFO -- : [669/885] 651592=test_duplicate I, [2024-05-20T06:45:10.660554 #610251] INFO -- : [670/885] 651592=test_utf32 I, [2024-05-20T06:45:10.660924 #610251] INFO -- : [671/885] 651601=test_basicsocket I, [2024-05-20T06:45:10.663421 #610251] INFO -- : [672/885] 651598=test_tracepoint I, [2024-05-20T06:45:10.666976 #610251] INFO -- : [673/885] 651592=test_prettyprint I, [2024-05-20T06:45:10.685142 #610251] INFO -- : [674/885] 651601=test_gem_commands_help_command I, [2024-05-20T06:45:10.697686 #610251] INFO -- : [675/885] 651588=test_rdoc_markup I, [2024-05-20T06:45:10.700268 #610251] INFO -- : [676/885] 651592=test_too_many_dummy_encodings I, [2024-05-20T06:45:10.709186 #610251] INFO -- : [677/885] 651588=test_reqarg I, [2024-05-20T06:45:10.729254 #610251] INFO -- : [678/885] 651599=test_rdoc_include I, [2024-05-20T06:45:10.752886 #610251] INFO -- : [679/885] 651599=test_stack I, [2024-05-20T06:45:10.763001 #610251] INFO -- : [680/885] 651601=test_gem_commands_list_command I, [2024-05-20T06:45:10.776997 #610251] INFO -- : [681/885] 651592=test_string_processing I, [2024-05-20T06:45:10.785285 #610251] INFO -- : [682/885] 651601=test_fileutils I, [2024-05-20T06:45:10.799165 #610251] INFO -- : [683/885] 651592=test_ldap I, [2024-05-20T06:45:10.816894 #610251] INFO -- : [684/885] 651592=test_emitter I, [2024-05-20T06:45:10.821968 #610251] INFO -- : [685/885] 651592=test_resource I, [2024-05-20T06:45:10.858031 #610251] INFO -- : [686/885] 651600=test_gem_commands_signin_command I, [2024-05-20T06:45:10.890157 #610251] INFO -- : [687/885] 651592=test_gem_version I, [2024-05-20T06:45:10.958816 #610251] INFO -- : [688/885] 651598=test_econv I, [2024-05-20T06:45:10.969754 #610251] INFO -- : [689/885] 651600=test_cesu8 I, [2024-05-20T06:45:10.971452 #610251] INFO -- : [690/885] 651592=test_rdoc_options I, [2024-05-20T06:45:10.973116 #610251] INFO -- : [691/885] 651587=test_inlinecache I, [2024-05-20T06:45:10.983100 #610251] INFO -- : [692/885] 651600=test_rdoc_markup_verbatim I, [2024-05-20T06:45:10.989388 #610251] INFO -- : [693/885] 651600=test_path_to_class I, [2024-05-20T06:45:10.992994 #610251] INFO -- : [694/885] 651600=test_gem_resolver_specification I, [2024-05-20T06:45:11.017550 #610251] INFO -- : [695/885] 651600=test_gem_dependency I, [2024-05-20T06:45:11.025828 #610251] INFO -- : [696/885] 651588=test_method_cache I, [2024-05-20T06:45:11.027618 #610251] INFO -- : [697/885] 651588=test_gem_stub_specification I, [2024-05-20T06:45:11.030346 #610251] INFO -- : [698/885] 651587=test_frozen_error I, [2024-05-20T06:45:11.035267 #610251] INFO -- : [699/885] 651587=test_gem_ext_ext_conf_builder I, [2024-05-20T06:45:11.176187 #610251] INFO -- : [700/885] 651588=test_complex I, [2024-05-20T06:45:11.179468 #610251] INFO -- : [701/885] 651600=test_gem_commands_search_command I, [2024-05-20T06:45:11.189739 #610251] INFO -- : [702/885] 651600=test_scanner_events I, [2024-05-20T06:45:11.224124 #610251] INFO -- : [703/885] 651600=test_gem_resolver_installed_specification I, [2024-05-20T06:45:11.230450 #610251] INFO -- : [704/885] 651592=test_parse I, [2024-05-20T06:45:11.233827 #610251] INFO -- : [705/885] 651601=test_mdns I, [2024-05-20T06:45:11.236106 #610251] INFO -- : [706/885] 651601=test_gem_remote_fetcher I, [2024-05-20T06:45:11.240186 #610251] INFO -- : [707/885] 651600=test_forwardable I, [2024-05-20T06:45:11.253332 #610251] INFO -- : [708/885] 651600=test_yaml I, [2024-05-20T06:45:11.298808 #610251] INFO -- : [709/885] 651588=test_wait I, [2024-05-20T06:45:11.325080 #610251] INFO -- : [710/885] 651600=test_handle I, [2024-05-20T06:45:11.347147 #610251] INFO -- : [711/885] 651589=test_big2str I, [2024-05-20T06:45:11.360186 #610251] INFO -- : [712/885] 651589=test_euc_tw I, [2024-05-20T06:45:11.374229 #610251] INFO -- : [713/885] 651589=test_ractor I, [2024-05-20T06:45:11.381884 #610251] INFO -- : [714/885] 651588=test_bmethod I, [2024-05-20T06:45:11.387539 #610251] INFO -- : [715/885] 651589=test_gem_commands_sources_command I, [2024-05-20T06:45:11.388964 #610251] INFO -- : [716/885] 651593=test_ansi_without_terminfo I, [2024-05-20T06:45:11.396744 #610251] INFO -- : [717/885] 651588=test_thread_queue I, [2024-05-20T06:45:11.407116 #610251] INFO -- : [718/885] 651593=test_nowrite I, [2024-05-20T06:45:11.434347 #610251] INFO -- : [719/885] 651593=test_rdoc_markup_formatter I, [2024-05-20T06:45:11.452887 #610251] INFO -- : [720/885] 651593=test_comparable I, [2024-05-20T06:45:11.469337 #610251] INFO -- : [721/885] 651622=test_rdoc_parser_c I, [2024-05-20T06:45:11.471756 #610251] INFO -- : [722/885] 651593=test_io_timeout I, [2024-05-20T06:45:11.477813 #610251] INFO -- : [723/885] 651593=test_shapes I, [2024-05-20T06:45:11.480441 #610251] INFO -- : [724/885] 651593=json_fixtures_test I, [2024-05-20T06:45:11.486760 #610251] INFO -- : [725/885] 651593=test_pstore I, [2024-05-20T06:45:11.515589 #610251] INFO -- : [726/885] 651593=test_cstr I, [2024-05-20T06:45:11.531747 #610251] INFO -- : [727/885] 651597=test_profile_frames I, [2024-05-20T06:45:11.576123 #610251] INFO -- : [728/885] 651589=test_class2name I, [2024-05-20T06:45:11.586745 #610251] INFO -- : [729/885] 651589=test_gbk I, [2024-05-20T06:45:11.591763 #610251] INFO -- : [730/885] 651589=test_enc_str_buf_cat I, [2024-05-20T06:45:11.594495 #610251] INFO -- : [731/885] 651589=test_gem_commands_contents_command I, [2024-05-20T06:45:11.641789 #610251] INFO -- : [732/885] 651600=test_gem_ext_cmake_builder I, [2024-05-20T06:45:11.657508 #610251] INFO -- : [733/885] 651600=test_require I, [2024-05-20T06:45:11.681680 #610251] INFO -- : [734/885] 651589=test_cgi_util I, [2024-05-20T06:45:11.714040 #610251] INFO -- : [735/885] 651597=test_marshalable I, [2024-05-20T06:45:11.720790 #610251] INFO -- : [736/885] 651599=test_digest I, [2024-05-20T06:45:11.721735 #610251] INFO -- : [737/885] 651597=test_ractor I, [2024-05-20T06:45:11.738368 #610251] INFO -- : [738/885] 651622=test_find I, [2024-05-20T06:45:11.752035 #610251] INFO -- : [739/885] 651622=test_fiddle I, [2024-05-20T06:45:11.842144 #610251] INFO -- : [740/885] 651597=test_wss I, [2024-05-20T06:45:11.851447 #610251] INFO -- : [741/885] 651622=test_rdoc_any_method I, [2024-05-20T06:45:11.854434 #610251] INFO -- : [742/885] 651597=test_modify_expand I, [2024-05-20T06:45:11.856043 #610251] INFO -- : [743/885] 651597=test_rdoc_markdown I, [2024-05-20T06:45:11.865922 #610251] INFO -- : [744/885] 651592=test_gem_available_set I, [2024-05-20T06:45:11.931489 #610251] INFO -- : [745/885] 651589=test_file I, [2024-05-20T06:45:11.935072 #610251] INFO -- : [746/885] 651589=regexp_test I, [2024-05-20T06:45:11.970171 #610251] INFO -- : [747/885] 651592=test_gem_package_tar_reader I, [2024-05-20T06:45:11.997314 #610251] INFO -- : [748/885] 651592=test_rdoc_encoding I, [2024-05-20T06:45:12.000142 #610251] INFO -- : [749/885] 651589=test_coverage I, [2024-05-20T06:45:12.026546 #610251] INFO -- : [750/885] 651592=test_pathname I, [2024-05-20T06:45:12.045912 #610251] INFO -- : [751/885] 651598=test_complexrational I, [2024-05-20T06:45:12.060007 #610251] INFO -- : [752/885] 651598=test_init I, [2024-05-20T06:45:12.108708 #610251] INFO -- : [753/885] 651593=test_recorder I, [2024-05-20T06:45:12.115827 #610251] INFO -- : [754/885] 651593=test_gem_source_vendor I, [2024-05-20T06:45:12.123962 #610251] INFO -- : [755/885] 651593=test_gem_commands_owner_command I, [2024-05-20T06:45:12.194659 #610251] INFO -- : [756/885] 651622=test_deprecate I, [2024-05-20T06:45:12.220892 #610251] INFO -- : [757/885] 651592=test_rdoc_constant I, [2024-05-20T06:45:12.222680 #610251] INFO -- : [758/885] 651622=test_formatter I, [2024-05-20T06:45:12.228612 #610251] INFO -- : [759/885] 651622=test_bash_completion I, [2024-05-20T06:45:12.235793 #610251] INFO -- : [760/885] 651622=test_system I, [2024-05-20T06:45:12.302500 #610251] INFO -- : [761/885] 651587=test_pkcs12 I, [2024-05-20T06:45:12.327200 #610251] INFO -- : [762/885] 651597=test_gem_package_tar_header I, [2024-05-20T06:45:12.343067 #610251] INFO -- : [763/885] 651592=test_gem_util I, [2024-05-20T06:45:12.377821 #610251] INFO -- : [764/885] 651597=test_iseq_load I, [2024-05-20T06:45:12.417251 #610251] INFO -- : [765/885] 651598=test_pkey_dh I, [2024-05-20T06:45:12.492527 #610251] INFO -- : [766/885] 651598=test_bigzero I, [2024-05-20T06:45:12.498297 #610251] INFO -- : [767/885] 651598=test_getopts I, [2024-05-20T06:45:12.503766 #610251] INFO -- : [768/885] 651598=test_protocol I, [2024-05-20T06:45:12.540586 #610251] INFO -- : [769/885] 651592=test_gem_resolver_activation_request I, [2024-05-20T06:45:12.554722 #610251] INFO -- : [770/885] 651592=test_gem_config_file I, [2024-05-20T06:45:12.560819 #610251] INFO -- : [771/885] 651599=test_ripper I, [2024-05-20T06:45:12.675295 #610251] INFO -- : [772/885] 651593=test_etc I, [2024-05-20T06:45:12.681642 #610251] INFO -- : [773/885] 651592=test_yjit_exit_locations I, [2024-05-20T06:45:12.682310 #610251] INFO -- : [774/885] 651592=test_yaml_tree I, [2024-05-20T06:45:12.700479 #610251] INFO -- : [775/885] 651585=test_sleep I, [2024-05-20T06:45:12.706120 #610251] INFO -- : [776/885] 651592=test_config I, [2024-05-20T06:45:12.750933 #610251] INFO -- : [777/885] 651592=test_libs I, [2024-05-20T06:45:12.756609 #610251] INFO -- : [778/885] 651593=test_gem_commands_fetch_command I, [2024-05-20T06:45:12.761487 #610251] INFO -- : [779/885] 651592=test_math I, [2024-05-20T06:45:12.771597 #610251] INFO -- : [780/885] 651592=test_gc I, [2024-05-20T06:45:12.776054 #610251] INFO -- : [781/885] 651592=test_io I, [2024-05-20T06:45:12.814340 #610251] INFO -- : [782/885] 651598=test_unicode_escape I, [2024-05-20T06:45:12.818937 #610251] INFO -- : [783/885] 651589=test_utf16 I, [2024-05-20T06:45:12.831738 #610251] INFO -- : [784/885] 651589=test_autoload I, [2024-05-20T06:45:12.870340 #610251] INFO -- : [785/885] 651587=test_rendering I, [2024-05-20T06:45:12.873155 #610251] INFO -- : [786/885] 651587=test_sizeof I, [2024-05-20T06:45:12.881975 #610251] INFO -- : [787/885] 651598=test_case I, [2024-05-20T06:45:12.894448 #610251] INFO -- : [788/885] 651599=test_face I, [2024-05-20T06:45:12.914607 #610251] INFO -- : [789/885] 651598=test_gem_resolver_conflict I, [2024-05-20T06:45:12.918415 #610251] INFO -- : [790/885] 651593=test_rdoc_task I, [2024-05-20T06:45:12.925133 #610251] INFO -- : [791/885] 651593=test_backtrace I, [2024-05-20T06:45:12.927931 #610251] INFO -- : [792/885] 651598=test_pack I, [2024-05-20T06:45:12.941228 #610251] INFO -- : [793/885] 651599=ruby_parser_test I, [2024-05-20T06:45:12.942389 #610251] INFO -- : [794/885] 651600=test_io_buffer I, [2024-05-20T06:45:12.942571 #610251] INFO -- : [795/885] 651599=test_rdoc_markup_indented_paragraph I, [2024-05-20T06:45:12.950209 #610251] INFO -- : [796/885] 651599=test_rdoc_require I, [2024-05-20T06:45:12.953623 #610251] INFO -- : [797/885] 651598=locals_test I, [2024-05-20T06:45:12.964483 #610251] INFO -- : [798/885] 651599=test_readpartial I, [2024-05-20T06:45:13.057224 #610251] INFO -- : [799/885] 651600=test_gem_commands_install_command I, [2024-05-20T06:45:13.170240 #610251] INFO -- : [800/885] 651601=test_clone I, [2024-05-20T06:45:13.212792 #610251] INFO -- : [801/885] 651622=test_optparse I, [2024-05-20T06:45:13.233762 #610251] INFO -- : [802/885] 651598=test_array I, [2024-05-20T06:45:13.241794 #610251] INFO -- : [803/885] 651598=test_fstring I, [2024-05-20T06:45:13.286733 #610251] INFO -- : [804/885] 651622=test_rdoc_markup_to_html_crossref I, [2024-05-20T06:45:13.336542 #610251] INFO -- : [805/885] 651598=encoding_test I, [2024-05-20T06:45:13.358648 #610251] INFO -- : [806/885] 651601=test_gem_resolver_best_set I, [2024-05-20T06:45:13.371798 #610251] INFO -- : [807/885] 651599=test_typeddata I, [2024-05-20T06:45:13.382428 #610251] INFO -- : [808/885] 651598=test_rat I, [2024-05-20T06:45:13.388012 #610251] INFO -- : [809/885] 651598=test_rdoc_markup_raw I, [2024-05-20T06:45:13.393399 #610251] INFO -- : [810/885] 651598=test_webauthn_poller I, [2024-05-20T06:45:13.424975 #610251] INFO -- : [811/885] 651601=test_stringscanner I, [2024-05-20T06:45:13.467497 #610251] INFO -- : [812/885] 651601=test_files_sample I, [2024-05-20T06:45:13.510936 #610251] INFO -- : [813/885] 651622=test_rdoc_alias I, [2024-05-20T06:45:13.523538 #610251] INFO -- : [814/885] 651622=test_yield I, [2024-05-20T06:45:13.539801 #610251] INFO -- : [815/885] 651598=parser_test I, [2024-05-20T06:45:13.541251 #610251] INFO -- : [816/885] 651598=test_convertible I, [2024-05-20T06:45:13.542986 #610251] INFO -- : [817/885] 651599=test_line_editor I, [2024-05-20T06:45:13.551276 #610251] INFO -- : [818/885] 651599=ripper_test I, [2024-05-20T06:45:13.579908 #610251] INFO -- : [819/885] 651601=test_objspace I, [2024-05-20T06:45:13.845822 #610251] INFO -- : [820/885] 651597=test_undef I, [2024-05-20T06:45:13.848413 #610251] INFO -- : [821/885] 651597=test_string_memory I, [2024-05-20T06:45:13.936938 #610251] INFO -- : [822/885] 651597=comments_test I, [2024-05-20T06:45:13.943649 #610251] INFO -- : [823/885] 651597=test_sprintf I, [2024-05-20T06:45:13.964180 #610251] INFO -- : [824/885] 651599=test_gem_requirement I, [2024-05-20T06:45:14.078981 #610251] INFO -- : [825/885] 651599=test_gem_security_trust_dir I, [2024-05-20T06:45:14.108679 #610251] INFO -- : [826/885] 651597=test_show_source I, [2024-05-20T06:45:14.114014 #610251] INFO -- : [827/885] 651599=test_set I, [2024-05-20T06:45:14.121585 #610251] INFO -- : [828/885] 651599=test_c_struct_entry I, [2024-05-20T06:45:14.159539 #610251] INFO -- : [829/885] 651597=test_lock_native_thread I, [2024-05-20T06:45:14.288095 #610251] INFO -- : [830/885] 651593=test_gem_commands_stale_command I, [2024-05-20T06:45:14.303082 #610251] INFO -- : [831/885] 651593=test_remote_fetch_error I, [2024-05-20T06:45:14.318808 #610251] INFO -- : [832/885] 651593=test_have_library I, [2024-05-20T06:45:14.391212 #610251] INFO -- : [833/885] 651600=test_gem_request_set_lockfile I, [2024-05-20T06:45:14.434167 #610251] INFO -- : [834/885] 651597=test_raise_exception I, [2024-05-20T06:45:14.454043 #610251] INFO -- : [835/885] 651599=test_protect I, [2024-05-20T06:45:14.460838 #610251] INFO -- : [836/885] 651599=test_win32ole_typelib I, [2024-05-20T06:45:14.464685 #610251] INFO -- : [837/885] 651599=test_tree_builder I, [2024-05-20T06:45:14.468828 #610251] INFO -- : [838/885] 651599=test_gem_resolver_dependency_request I, [2024-05-20T06:45:14.495613 #610251] INFO -- : [839/885] 651599=test_hash I, [2024-05-20T06:45:14.510585 #610251] INFO -- : [840/885] 651599=test_postponed_job I, [2024-05-20T06:45:14.671186 #610251] INFO -- : [841/885] 651600=test_alias_and_anchor I, [2024-05-20T06:45:14.675976 #610251] INFO -- : [842/885] 651600=test_external_new I, [2024-05-20T06:45:14.683751 #610251] INFO -- : [843/885] 651600=test_ws I, [2024-05-20T06:45:14.694125 #610251] INFO -- : [844/885] 651600=test_gem_commands_environment_command I, [2024-05-20T06:45:14.733035 #610251] INFO -- : [845/885] 651600=test_m17n I, [2024-05-20T06:45:14.740522 #610251] INFO -- : [846/885] 651594=test_workspace I, [2024-05-20T06:45:14.748805 #610251] INFO -- : [847/885] 651585=test_weakmap I, [2024-05-20T06:45:14.787618 #610251] INFO -- : [848/885] 651600=test_yjit I, [2024-05-20T06:45:14.798049 #610251] INFO -- : [849/885] 651600=test_kill_ring I, [2024-05-20T06:45:14.852251 #610251] INFO -- : [850/885] 651600=test_ns_spki I, [2024-05-20T06:45:14.886165 #610251] INFO -- : [851/885] 651600=test_framework I, [2024-05-20T06:45:14.890144 #610251] INFO -- : [852/885] 651591=test_argf I, [2024-05-20T06:45:14.894342 #610251] INFO -- : [853/885] 651600=test_type_completor I, [2024-05-20T06:45:14.895571 #610251] INFO -- : [854/885] 651600=test_console_attr I, [2024-05-20T06:45:14.904395 #610251] INFO -- : [855/885] 651600=test_summary I, [2024-05-20T06:45:14.911268 #610251] INFO -- : [856/885] 651599=test_ellipsize I, [2024-05-20T06:45:14.929710 #610251] INFO -- : [857/885] 651599=test_date_attr I, [2024-05-20T06:45:14.931566 #610251] INFO -- : [858/885] 651599=test_io_wait I, [2024-05-20T06:45:14.942288 #610251] INFO -- : [859/885] 651594=test_gem_commands_exec_command I, [2024-05-20T06:45:15.043517 #610251] INFO -- : [860/885] 651597=warnings_test I, [2024-05-20T06:45:15.047468 #610251] INFO -- : [861/885] 651600=test_kwargs I, [2024-05-20T06:45:15.048550 #610251] INFO -- : [862/885] 651600=test_sorted_set I, [2024-05-20T06:45:15.056185 #610251] INFO -- : [863/885] 651597=test_win32ole_type_event I, [2024-05-20T06:45:15.062959 #610251] INFO -- : [864/885] 651597=test_emoji I, [2024-05-20T06:45:15.087113 #610251] INFO -- : [865/885] 651597=test_ubf_async_safe I, [2024-05-20T06:45:15.093531 #610251] INFO -- : [866/885] 651597=test_hash I, [2024-05-20T06:45:15.269381 #610251] INFO -- : [867/885] 651599=test_io I, [2024-05-20T06:45:15.311393 #610251] INFO -- : [868/885] 651600=test_cp949 I, [2024-05-20T06:45:15.325636 #610251] INFO -- : [869/885] 651600=test_gem_commands_uninstall_command I, [2024-05-20T06:45:15.496467 #610251] INFO -- : [870/885] 651599=test_gem_source_specific_file I, [2024-05-20T06:45:15.534957 #610251] INFO -- : [871/885] 651593=test_foreach I, [2024-05-20T06:45:15.537031 #610251] INFO -- : [872/885] 651593=test_condition I, [2024-05-20T06:45:15.544035 #610251] INFO -- : [873/885] 651593=test_gem_unsatisfiable_dependency_error I, [2024-05-20T06:45:15.553226 #610251] INFO -- : [874/885] 651593=test_win32ole_record I, [2024-05-20T06:45:15.555832 #610251] INFO -- : [875/885] 651593=test_gem_commands_query_command I, [2024-05-20T06:45:15.593895 #610251] INFO -- : [876/885] 651599=test_method I, [2024-05-20T06:45:15.616261 #610251] INFO -- : [877/885] 651622=test_rdoc_rubygems_hook I, [2024-05-20T06:45:15.692041 #610251] INFO -- : [878/885] 651622=test_pattern_key_name_check I, [2024-05-20T06:45:15.701191 #610251] INFO -- : [879/885] 651622=test_to_ruby I, [2024-05-20T06:45:15.713729 #610251] INFO -- : [880/885] 651622=test_gem_impossible_dependencies_error I, [2024-05-20T06:45:15.715989 #610251] INFO -- : [881/885] 651588=test_array_create I, [2024-05-20T06:45:15.716436 #610251] INFO -- : [882/885] 651622=test_pack I, [2024-05-20T06:45:15.719561 #610251] INFO -- : [883/885] 651588=test_ftp I, [2024-05-20T06:45:15.749520 #610251] INFO -- : [884/885] 651588=test_rdoc_context_section I, [2024-05-20T06:45:15.758696 #610251] INFO -- : [885/885] 651588=test_euc_kr I, [2024-05-20T06:45:32.735974 #610251] INFO -- : Finished tests in 36.912726s, 715.2276 tests/s, 253400.7121 assertions/s. I, [2024-05-20T06:45:32.736575 #610251] INFO -- : 26401 tests, 9353711 assertions, 0 failures, 0 errors, 306 skips I, [2024-05-20T06:45:32.736596 #610251] INFO -- : I, [2024-05-20T06:45:32.736602 #610251] INFO -- : ruby -v: ruby 3.4.0dev (2024-05-20T05:59:59Z master 0b38403328) [x86_64-linux] I, [2024-05-20T06:45:32.738637 #610251] INFO -- : $$$[end] "make yes-test-all TESTOPTS='--stderr-on-failure' TESTS='-j20'" exit with 0. I, [2024-05-20T06:45:32.738804 #610251] INFO -- : $$$[beg] make yes-test-rubyspec MSPECOPT='--error-output stderr --debug -j' TESTS='-j20' I, [2024-05-20T06:45:32.831452 #610251] INFO -- : BASERUBY = /usr/bin/ruby --disable=gems I, [2024-05-20T06:45:32.831492 #610251] INFO -- : CC = gcc I, [2024-05-20T06:45:32.831497 #610251] INFO -- : LD = ld I, [2024-05-20T06:45:32.831502 #610251] INFO -- : LDSHARED = gcc -shared I, [2024-05-20T06:45:32.831506 #610251] INFO -- : CFLAGS = -O3 -fno-fast-math -ggdb3 -Wall -Wextra -Wdeprecated-declarations -Wdiv-by-zero -Wduplicated-cond -Wimplicit-function-declaration -Wimplicit-int -Wpointer-arith -Wwrite-strings -Wold-style-definition -Wimplicit-fallthrough=0 -Wmissing-noreturn -Wno-cast-function-type -Wno-constant-logical-operand -Wno-long-long -Wno-missing-field-initializers -Wno-overlength-strings -Wno-packed-bitfield-compat -Wno-parentheses-equality -Wno-self-assign -Wno-tautological-compare -Wno-unused-parameter -Wno-unused-value -Wsuggest-attribute=format -Wsuggest-attribute=noreturn -Wunused-variable -Wmisleading-indentation -Wundef -fPIC I, [2024-05-20T06:45:32.831514 #610251] INFO -- : XCFLAGS = -U_FORTIFY_SOURCE -D_FORTIFY_SOURCE=2 -fstack-protector-strong -fno-strict-overflow -fvisibility=hidden -fexcess-precision=standard -DRUBY_EXPORT -I. -I.ext/include/x86_64-linux -I/tmp/ruby/src/trunk/include -I/tmp/ruby/src/trunk -I/tmp/ruby/src/trunk/prism -I/tmp/ruby/src/trunk/enc/unicode/15.0.0 I, [2024-05-20T06:45:32.831518 #610251] INFO -- : CPPFLAGS = I, [2024-05-20T06:45:32.831521 #610251] INFO -- : DLDFLAGS = -Wl,--compress-debug-sections=zlib -Wl,-soname,libruby.so.3.4 -fstack-protector-strong I, [2024-05-20T06:45:32.831525 #610251] INFO -- : SOLIBS = -lz -lrt -lrt -lgmp -ldl -lcrypt -lm -lpthread I, [2024-05-20T06:45:32.831528 #610251] INFO -- : LANG = en_US.UTF-8 I, [2024-05-20T06:45:32.831532 #610251] INFO -- : LC_ALL = I, [2024-05-20T06:45:32.831535 #610251] INFO -- : LC_CTYPE = I, [2024-05-20T06:45:32.831539 #610251] INFO -- : MFLAGS = I, [2024-05-20T06:45:32.831542 #610251] INFO -- : RUSTC = no I, [2024-05-20T06:45:32.831546 #610251] INFO -- : YJIT_RUSTC_ARGS = --crate-name=yjit --crate-type=staticlib --edition=2021 -g -C lto=thin -C opt-level=3 -C overflow-checks=on '--out-dir=/tmp/ruby/build/trunk/yjit/target/release/' /tmp/ruby/src/trunk/yjit/src/lib.rs I, [2024-05-20T06:45:32.831971 #610251] INFO -- : gcc (Ubuntu 11.4.0-1ubuntu1~22.04) 11.4.0 I, [2024-05-20T06:45:32.832000 #610251] INFO -- : Copyright (C) 2021 Free Software Foundation, Inc. I, [2024-05-20T06:45:32.832006 #610251] INFO -- : This is free software; see the source for copying conditions. There is NO I, [2024-05-20T06:45:32.832010 #610251] INFO -- : warranty; not even for MERCHANTABILITY or FITNESS FOR A PARTICULAR PURPOSE. I, [2024-05-20T06:45:32.832015 #610251] INFO -- : I, [2024-05-20T06:45:32.833754 #610251] INFO -- : generating enc.mk I, [2024-05-20T06:45:32.950816 #610251] INFO -- : generating encdb.h I, [2024-05-20T06:45:32.974623 #610251] INFO -- : encdb.h unchanged I, [2024-05-20T06:45:32.975667 #610251] INFO -- : making enc I, [2024-05-20T06:45:32.993620 #610251] INFO -- : make[1]: Entering directory '/tmp/ruby/build/trunk' I, [2024-05-20T06:45:32.993641 #610251] INFO -- : make[1]: Nothing to be done for 'enc'. I, [2024-05-20T06:45:32.993646 #610251] INFO -- : make[1]: Leaving directory '/tmp/ruby/build/trunk' I, [2024-05-20T06:45:32.994369 #610251] INFO -- : making srcs under enc I, [2024-05-20T06:45:33.025730 #610251] INFO -- : make[1]: Entering directory '/tmp/ruby/build/trunk' I, [2024-05-20T06:45:33.025751 #610251] INFO -- : make[1]: Nothing to be done for 'srcs'. I, [2024-05-20T06:45:33.025757 #610251] INFO -- : make[1]: Leaving directory '/tmp/ruby/build/trunk' I, [2024-05-20T06:45:33.026842 #610251] INFO -- : generating transdb.h I, [2024-05-20T06:45:33.127814 #610251] INFO -- : transdb.h unchanged I, [2024-05-20T06:45:33.129213 #610251] INFO -- : making trans I, [2024-05-20T06:45:33.163201 #610251] INFO -- : make[1]: Entering directory '/tmp/ruby/build/trunk' I, [2024-05-20T06:45:33.163222 #610251] INFO -- : make[1]: Nothing to be done for 'trans'. I, [2024-05-20T06:45:33.163228 #610251] INFO -- : make[1]: Leaving directory '/tmp/ruby/build/trunk' I, [2024-05-20T06:45:33.164127 #610251] INFO -- : making encs I, [2024-05-20T06:45:33.201267 #610251] INFO -- : make[1]: Entering directory '/tmp/ruby/build/trunk' I, [2024-05-20T06:45:33.201291 #610251] INFO -- : make[1]: Nothing to be done for 'encs'. I, [2024-05-20T06:45:33.201296 #610251] INFO -- : make[1]: Leaving directory '/tmp/ruby/build/trunk' I, [2024-05-20T06:45:33.203108 #610251] INFO -- : generating makefiles ext/configure-ext.mk I, [2024-05-20T06:45:33.230202 #610251] INFO -- : ext/configure-ext.mk updated I, [2024-05-20T06:45:33.232711 #610251] INFO -- : make[1]: Entering directory '/tmp/ruby/build/trunk' I, [2024-05-20T06:45:34.586781 #610251] INFO -- : make[1]: Leaving directory '/tmp/ruby/build/trunk' I, [2024-05-20T06:45:34.587529 #610251] INFO -- : generating makefile exts.mk I, [2024-05-20T06:45:34.623822 #610251] INFO -- : exts.mk unchanged I, [2024-05-20T06:45:34.627956 #610251] INFO -- : make[1]: Entering directory '/tmp/ruby/build/trunk' I, [2024-05-20T06:45:34.940337 #610251] INFO -- : make[2]: Entering directory '/tmp/ruby/build/trunk/ext/coverage' I, [2024-05-20T06:45:34.945001 #610251] INFO -- : make[2]: Leaving directory '/tmp/ruby/build/trunk/ext/coverage' I, [2024-05-20T06:45:34.951928 #610251] INFO -- : make[2]: Entering directory '/tmp/ruby/build/trunk/ext/date' I, [2024-05-20T06:45:34.956774 #610251] INFO -- : make[2]: Leaving directory '/tmp/ruby/build/trunk/ext/date' I, [2024-05-20T06:45:34.960683 #610251] INFO -- : make[2]: Entering directory '/tmp/ruby/build/trunk/ext/digest' I, [2024-05-20T06:45:34.969404 #610251] INFO -- : make[2]: Leaving directory '/tmp/ruby/build/trunk/ext/digest' I, [2024-05-20T06:45:34.995350 #610251] INFO -- : make[2]: Entering directory '/tmp/ruby/build/trunk/ext/digest/sha2' I, [2024-05-20T06:45:34.999824 #610251] INFO -- : make[2]: Leaving directory '/tmp/ruby/build/trunk/ext/digest/sha2' I, [2024-05-20T06:45:35.021023 #610251] INFO -- : make[2]: Entering directory '/tmp/ruby/build/trunk/ext/fiddle' I, [2024-05-20T06:45:35.031767 #610251] INFO -- : make[2]: Leaving directory '/tmp/ruby/build/trunk/ext/fiddle' I, [2024-05-20T06:45:35.036620 #610251] INFO -- : make[2]: Entering directory '/tmp/ruby/build/trunk/ext/io/console' I, [2024-05-20T06:45:35.040746 #610251] INFO -- : make[2]: Leaving directory '/tmp/ruby/build/trunk/ext/io/console' I, [2024-05-20T06:45:35.053598 #610251] INFO -- : make[2]: Entering directory '/tmp/ruby/build/trunk/ext/json' I, [2024-05-20T06:45:35.063999 #610251] INFO -- : make[2]: Leaving directory '/tmp/ruby/build/trunk/ext/json' I, [2024-05-20T06:45:35.079059 #610251] INFO -- : make[2]: Entering directory '/tmp/ruby/build/trunk/ext/monitor' I, [2024-05-20T06:45:35.083017 #610251] INFO -- : make[2]: Leaving directory '/tmp/ruby/build/trunk/ext/monitor' I, [2024-05-20T06:45:35.090091 #610251] INFO -- : make[2]: Entering directory '/tmp/ruby/build/trunk/ext/objspace' I, [2024-05-20T06:45:35.095429 #610251] INFO -- : make[2]: Leaving directory '/tmp/ruby/build/trunk/ext/objspace' I, [2024-05-20T06:45:35.112716 #610251] INFO -- : make[2]: Entering directory '/tmp/ruby/build/trunk/ext/openssl' I, [2024-05-20T06:45:35.128824 #610251] INFO -- : make[2]: Leaving directory '/tmp/ruby/build/trunk/ext/openssl' I, [2024-05-20T06:45:35.133197 #610251] INFO -- : make[2]: Entering directory '/tmp/ruby/build/trunk/ext/pathname' I, [2024-05-20T06:45:35.137252 #610251] INFO -- : make[2]: Leaving directory '/tmp/ruby/build/trunk/ext/pathname' I, [2024-05-20T06:45:35.144348 #610251] INFO -- : make[2]: Entering directory '/tmp/ruby/build/trunk/ext/psych' I, [2024-05-20T06:45:35.166242 #610251] INFO -- : make[2]: Leaving directory '/tmp/ruby/build/trunk/ext/psych' I, [2024-05-20T06:45:35.169781 #610251] INFO -- : make[2]: Entering directory '/tmp/ruby/build/trunk/ext/pty' I, [2024-05-20T06:45:35.173492 #610251] INFO -- : make[2]: Leaving directory '/tmp/ruby/build/trunk/ext/pty' I, [2024-05-20T06:45:35.187807 #610251] INFO -- : make[2]: Entering directory '/tmp/ruby/build/trunk/ext/ripper' I, [2024-05-20T06:45:35.196222 #610251] INFO -- : make[2]: Leaving directory '/tmp/ruby/build/trunk/ext/ripper' I, [2024-05-20T06:45:35.198705 #610251] INFO -- : make[2]: Entering directory '/tmp/ruby/build/trunk/ext/rubyvm' I, [2024-05-20T06:45:35.202001 #610251] INFO -- : make[2]: Leaving directory '/tmp/ruby/build/trunk/ext/rubyvm' I, [2024-05-20T06:45:35.213759 #610251] INFO -- : make[2]: Entering directory '/tmp/ruby/build/trunk/ext/socket' I, [2024-05-20T06:45:35.221369 #610251] INFO -- : make[2]: Leaving directory '/tmp/ruby/build/trunk/ext/socket' I, [2024-05-20T06:45:35.239655 #610251] INFO -- : make[2]: Entering directory '/tmp/ruby/build/trunk/.bundle/gems/bigdecimal-3.1.8/ext/bigdecimal' I, [2024-05-20T06:45:35.265102 #610251] INFO -- : make[2]: Leaving directory '/tmp/ruby/build/trunk/.bundle/gems/bigdecimal-3.1.8/ext/bigdecimal' I, [2024-05-20T06:45:35.267152 #610251] INFO -- : make[2]: Entering directory '/tmp/ruby/build/trunk/.bundle/gems/debug-1.9.2/ext/debug' I, [2024-05-20T06:45:35.288678 #610251] INFO -- : make[2]: Leaving directory '/tmp/ruby/build/trunk/.bundle/gems/debug-1.9.2/ext/debug' I, [2024-05-20T06:45:35.290569 #610251] INFO -- : make[2]: Entering directory '/tmp/ruby/build/trunk/.bundle/gems/nkf-0.2.0/ext/nkf' I, [2024-05-20T06:45:35.312517 #610251] INFO -- : make[2]: Leaving directory '/tmp/ruby/build/trunk/.bundle/gems/nkf-0.2.0/ext/nkf' I, [2024-05-20T06:45:35.314854 #610251] INFO -- : make[2]: Entering directory '/tmp/ruby/build/trunk/.bundle/gems/racc-1.7.3/ext/racc/cparse' I, [2024-05-20T06:45:35.336039 #610251] INFO -- : make[2]: Leaving directory '/tmp/ruby/build/trunk/.bundle/gems/racc-1.7.3/ext/racc/cparse' I, [2024-05-20T06:45:35.338334 #610251] INFO -- : make[2]: Entering directory '/tmp/ruby/build/trunk/.bundle/gems/rbs-3.4.4/ext/rbs_extension' I, [2024-05-20T06:45:35.359331 #610251] INFO -- : make[2]: Leaving directory '/tmp/ruby/build/trunk/.bundle/gems/rbs-3.4.4/ext/rbs_extension' I, [2024-05-20T06:45:35.361238 #610251] INFO -- : make[2]: Entering directory '/tmp/ruby/build/trunk/.bundle/gems/syslog-0.1.2/ext/syslog' I, [2024-05-20T06:45:35.382594 #610251] INFO -- : make[2]: Leaving directory '/tmp/ruby/build/trunk/.bundle/gems/syslog-0.1.2/ext/syslog' I, [2024-05-20T06:45:35.405819 #610251] INFO -- : make[2]: Entering directory '/tmp/ruby/build/trunk' I, [2024-05-20T06:45:35.471482 #610251] INFO -- : make[2]: 'ruby' is up to date. I, [2024-05-20T06:45:35.471526 #610251] INFO -- : make[2]: Leaving directory '/tmp/ruby/build/trunk' I, [2024-05-20T06:45:35.471878 #610251] INFO -- : make[1]: Leaving directory '/tmp/ruby/build/trunk' I, [2024-05-20T06:45:35.475389 #610251] INFO -- : make[1]: Entering directory '/tmp/ruby/build/trunk' I, [2024-05-20T06:45:35.475411 #610251] INFO -- : make[1]: Nothing to be done for 'note'. I, [2024-05-20T06:45:35.475418 #610251] INFO -- : make[1]: Leaving directory '/tmp/ruby/build/trunk' E, [2024-05-20T06:45:35.530837 #610251] ERROR -- : $ /tmp/ruby/build/trunk/miniruby -I/tmp/ruby/src/trunk/lib /tmp/ruby/src/trunk/tool/runruby.rb --archdir=/tmp/ruby/build/trunk --extout=.ext -- /tmp/ruby/src/trunk/spec/mspec/bin/mspec-run -B /tmp/ruby/src/trunk/spec/default.mspec --error-output stderr --debug -fy -o /tmp/rubytest.8hegf2/1-mspec-multi-0 E, [2024-05-20T06:45:35.531077 #610251] ERROR -- : $ /tmp/ruby/build/trunk/miniruby -I/tmp/ruby/src/trunk/lib /tmp/ruby/src/trunk/tool/runruby.rb --archdir=/tmp/ruby/build/trunk --extout=.ext -- /tmp/ruby/src/trunk/spec/mspec/bin/mspec-run -B /tmp/ruby/src/trunk/spec/default.mspec --error-output stderr --debug -fy -o /tmp/rubytest.8hegf2/2-mspec-multi-1 E, [2024-05-20T06:45:35.531286 #610251] ERROR -- : $ /tmp/ruby/build/trunk/miniruby -I/tmp/ruby/src/trunk/lib /tmp/ruby/src/trunk/tool/runruby.rb --archdir=/tmp/ruby/build/trunk --extout=.ext -- /tmp/ruby/src/trunk/spec/mspec/bin/mspec-run -B /tmp/ruby/src/trunk/spec/default.mspec --error-output stderr --debug -fy -o /tmp/rubytest.8hegf2/3-mspec-multi-2 E, [2024-05-20T06:45:35.531474 #610251] ERROR -- : $ /tmp/ruby/build/trunk/miniruby -I/tmp/ruby/src/trunk/lib /tmp/ruby/src/trunk/tool/runruby.rb --archdir=/tmp/ruby/build/trunk --extout=.ext -- /tmp/ruby/src/trunk/spec/mspec/bin/mspec-run -B /tmp/ruby/src/trunk/spec/default.mspec --error-output stderr --debug -fy -o /tmp/rubytest.8hegf2/4-mspec-multi-3 E, [2024-05-20T06:45:35.531660 #610251] ERROR -- : $ /tmp/ruby/build/trunk/miniruby -I/tmp/ruby/src/trunk/lib /tmp/ruby/src/trunk/tool/runruby.rb --archdir=/tmp/ruby/build/trunk --extout=.ext -- /tmp/ruby/src/trunk/spec/mspec/bin/mspec-run -B /tmp/ruby/src/trunk/spec/default.mspec --error-output stderr --debug -fy -o /tmp/rubytest.8hegf2/5-mspec-multi-4 E, [2024-05-20T06:45:35.531950 #610251] ERROR -- : $ /tmp/ruby/build/trunk/miniruby -I/tmp/ruby/src/trunk/lib /tmp/ruby/src/trunk/tool/runruby.rb --archdir=/tmp/ruby/build/trunk --extout=.ext -- /tmp/ruby/src/trunk/spec/mspec/bin/mspec-run -B /tmp/ruby/src/trunk/spec/default.mspec --error-output stderr --debug -fy -o /tmp/rubytest.8hegf2/6-mspec-multi-5 E, [2024-05-20T06:45:35.531987 #610251] ERROR -- : $ /tmp/ruby/build/trunk/miniruby -I/tmp/ruby/src/trunk/lib /tmp/ruby/src/trunk/tool/runruby.rb --archdir=/tmp/ruby/build/trunk --extout=.ext -- /tmp/ruby/src/trunk/spec/mspec/bin/mspec-run -B /tmp/ruby/src/trunk/spec/default.mspec --error-output stderr --debug -fy -o /tmp/rubytest.8hegf2/7-mspec-multi-6 E, [2024-05-20T06:45:35.532188 #610251] ERROR -- : $ /tmp/ruby/build/trunk/miniruby -I/tmp/ruby/src/trunk/lib /tmp/ruby/src/trunk/tool/runruby.rb --archdir=/tmp/ruby/build/trunk --extout=.ext -- /tmp/ruby/src/trunk/spec/mspec/bin/mspec-run -B /tmp/ruby/src/trunk/spec/default.mspec --error-output stderr --debug -fy -o /tmp/rubytest.8hegf2/8-mspec-multi-7 E, [2024-05-20T06:45:35.532401 #610251] ERROR -- : $ /tmp/ruby/build/trunk/miniruby -I/tmp/ruby/src/trunk/lib /tmp/ruby/src/trunk/tool/runruby.rb --archdir=/tmp/ruby/build/trunk --extout=.ext -- /tmp/ruby/src/trunk/spec/mspec/bin/mspec-run -B /tmp/ruby/src/trunk/spec/default.mspec --error-output stderr --debug -fy -o /tmp/rubytest.8hegf2/9-mspec-multi-8 E, [2024-05-20T06:45:35.532617 #610251] ERROR -- : $ /tmp/ruby/build/trunk/miniruby -I/tmp/ruby/src/trunk/lib /tmp/ruby/src/trunk/tool/runruby.rb --archdir=/tmp/ruby/build/trunk --extout=.ext -- /tmp/ruby/src/trunk/spec/mspec/bin/mspec-run -B /tmp/ruby/src/trunk/spec/default.mspec --error-output stderr --debug -fy -o /tmp/rubytest.8hegf2/10-mspec-multi-9 E, [2024-05-20T06:45:35.532936 #610251] ERROR -- : $ /tmp/ruby/build/trunk/miniruby -I/tmp/ruby/src/trunk/lib /tmp/ruby/src/trunk/tool/runruby.rb --archdir=/tmp/ruby/build/trunk --extout=.ext -- /tmp/ruby/src/trunk/spec/mspec/bin/mspec-run -B /tmp/ruby/src/trunk/spec/default.mspec --error-output stderr --debug -fy -o /tmp/rubytest.8hegf2/11-mspec-multi-10 E, [2024-05-20T06:45:35.533106 #610251] ERROR -- : $ /tmp/ruby/build/trunk/miniruby -I/tmp/ruby/src/trunk/lib /tmp/ruby/src/trunk/tool/runruby.rb --archdir=/tmp/ruby/build/trunk --extout=.ext -- /tmp/ruby/src/trunk/spec/mspec/bin/mspec-run -B /tmp/ruby/src/trunk/spec/default.mspec --error-output stderr --debug -fy -o /tmp/rubytest.8hegf2/12-mspec-multi-11 E, [2024-05-20T06:45:35.533290 #610251] ERROR -- : $ /tmp/ruby/build/trunk/miniruby -I/tmp/ruby/src/trunk/lib /tmp/ruby/src/trunk/tool/runruby.rb --archdir=/tmp/ruby/build/trunk --extout=.ext -- /tmp/ruby/src/trunk/spec/mspec/bin/mspec-run -B /tmp/ruby/src/trunk/spec/default.mspec --error-output stderr --debug -fy -o /tmp/rubytest.8hegf2/13-mspec-multi-12 E, [2024-05-20T06:45:35.533474 #610251] ERROR -- : $ /tmp/ruby/build/trunk/miniruby -I/tmp/ruby/src/trunk/lib /tmp/ruby/src/trunk/tool/runruby.rb --archdir=/tmp/ruby/build/trunk --extout=.ext -- /tmp/ruby/src/trunk/spec/mspec/bin/mspec-run -B /tmp/ruby/src/trunk/spec/default.mspec --error-output stderr --debug -fy -o /tmp/rubytest.8hegf2/14-mspec-multi-13 E, [2024-05-20T06:45:35.533577 #610251] ERROR -- : $ /tmp/ruby/build/trunk/miniruby -I/tmp/ruby/src/trunk/lib /tmp/ruby/src/trunk/tool/runruby.rb --archdir=/tmp/ruby/build/trunk --extout=.ext -- /tmp/ruby/src/trunk/spec/mspec/bin/mspec-run -B /tmp/ruby/src/trunk/spec/default.mspec --error-output stderr --debug -fy -o /tmp/rubytest.8hegf2/15-mspec-multi-14 E, [2024-05-20T06:45:35.533753 #610251] ERROR -- : $ /tmp/ruby/build/trunk/miniruby -I/tmp/ruby/src/trunk/lib /tmp/ruby/src/trunk/tool/runruby.rb --archdir=/tmp/ruby/build/trunk --extout=.ext -- /tmp/ruby/src/trunk/spec/mspec/bin/mspec-run -B /tmp/ruby/src/trunk/spec/default.mspec --error-output stderr --debug -fy -o /tmp/rubytest.8hegf2/16-mspec-multi-15 E, [2024-05-20T06:45:35.533940 #610251] ERROR -- : $ /tmp/ruby/build/trunk/miniruby -I/tmp/ruby/src/trunk/lib /tmp/ruby/src/trunk/tool/runruby.rb --archdir=/tmp/ruby/build/trunk --extout=.ext -- /tmp/ruby/src/trunk/spec/mspec/bin/mspec-run -B /tmp/ruby/src/trunk/spec/default.mspec --error-output stderr --debug -fy -o /tmp/rubytest.8hegf2/17-mspec-multi-16 E, [2024-05-20T06:45:35.534125 #610251] ERROR -- : $ /tmp/ruby/build/trunk/miniruby -I/tmp/ruby/src/trunk/lib /tmp/ruby/src/trunk/tool/runruby.rb --archdir=/tmp/ruby/build/trunk --extout=.ext -- /tmp/ruby/src/trunk/spec/mspec/bin/mspec-run -B /tmp/ruby/src/trunk/spec/default.mspec --error-output stderr --debug -fy -o /tmp/rubytest.8hegf2/18-mspec-multi-17 E, [2024-05-20T06:45:35.536326 #610251] ERROR -- : $ /tmp/ruby/build/trunk/miniruby -I/tmp/ruby/src/trunk/lib /tmp/ruby/src/trunk/tool/runruby.rb --archdir=/tmp/ruby/build/trunk --extout=.ext -- /tmp/ruby/src/trunk/spec/mspec/bin/mspec-run -B /tmp/ruby/src/trunk/spec/default.mspec --error-output stderr --debug -fy -o /tmp/rubytest.8hegf2/19-mspec-multi-18 E, [2024-05-20T06:45:35.536624 #610251] ERROR -- : $ /tmp/ruby/build/trunk/miniruby -I/tmp/ruby/src/trunk/lib /tmp/ruby/src/trunk/tool/runruby.rb --archdir=/tmp/ruby/build/trunk --extout=.ext -- /tmp/ruby/src/trunk/spec/mspec/bin/mspec-run -B /tmp/ruby/src/trunk/spec/default.mspec --error-output stderr --debug -fy -o /tmp/rubytest.8hegf2/20-mspec-multi-19 I, [2024-05-20T06:45:35.702220 #610251] INFO -- : ruby 3.4.0dev (2024-05-20T05:59:59Z master 0b38403328) [x86_64-linux] I, [2024-05-20T06:45:36.331565 #610251] INFO -- : 0 ......................................................................... I, [2024-05-20T06:45:36.722236 #610251] INFO -- : 73 ......................................................................... I, [2024-05-20T06:45:36.873813 #610251] INFO -- : 146 ......................................................................... I, [2024-05-20T06:45:36.918505 #610251] INFO -- : 219 ......................................................................... I, [2024-05-20T06:45:36.965151 #610251] INFO -- : 292 ......................................................................... I, [2024-05-20T06:45:37.008592 #610251] INFO -- : 365 ......................................................................... I, [2024-05-20T06:45:37.032154 #610251] INFO -- : 438 ......................................................................... I, [2024-05-20T06:45:37.052294 #610251] INFO -- : 511 ......................................................................... I, [2024-05-20T06:45:37.072317 #610251] INFO -- : 584 ......................................................................... I, [2024-05-20T06:45:37.123139 #610251] INFO -- : 657 ......................................................................... I, [2024-05-20T06:45:37.158249 #610251] INFO -- : 730 ......................................................................... I, [2024-05-20T06:45:37.182475 #610251] INFO -- : 803 ......................................................................... I, [2024-05-20T06:45:37.214841 #610251] INFO -- : 876 ......................................................................... I, [2024-05-20T06:45:37.257732 #610251] INFO -- : 949 ......................................................................... I, [2024-05-20T06:45:37.352245 #610251] INFO -- : 1022 ......................................................................... I, [2024-05-20T06:45:37.528658 #610251] INFO -- : 1095 ......................................................................... I, [2024-05-20T06:45:37.656409 #610251] INFO -- : 1168 ......................................................................... I, [2024-05-20T06:45:37.707394 #610251] INFO -- : 1241 ......................................................................... I, [2024-05-20T06:45:37.754770 #610251] INFO -- : 1314 ......................................................................... I, [2024-05-20T06:45:37.773669 #610251] INFO -- : 1387 ......................................................................... I, [2024-05-20T06:45:37.871881 #610251] INFO -- : 1460 ......................................................................... I, [2024-05-20T06:45:38.357197 #610251] INFO -- : 1533 ......................................................................... I, [2024-05-20T06:45:38.416934 #610251] INFO -- : 1606 ......................................................................... I, [2024-05-20T06:45:38.536896 #610251] INFO -- : 1679 ......................................................................... I, [2024-05-20T06:45:38.654463 #610251] INFO -- : 1752 ......................................................................... I, [2024-05-20T06:45:38.721371 #610251] INFO -- : 1825 ......................................................................... I, [2024-05-20T06:45:38.842729 #610251] INFO -- : 1898 ......................................................................... I, [2024-05-20T06:45:38.911227 #610251] INFO -- : 1971 ......................................................................... I, [2024-05-20T06:45:38.973200 #610251] INFO -- : 2044 ......................................................................... I, [2024-05-20T06:45:39.027774 #610251] INFO -- : 2117 ......................................................................... I, [2024-05-20T06:45:39.042165 #610251] INFO -- : 2190 ......................................................................... I, [2024-05-20T06:45:39.061479 #610251] INFO -- : 2263 ......................................................................... I, [2024-05-20T06:45:39.075000 #610251] INFO -- : 2336 ......................................................................... I, [2024-05-20T06:45:39.110544 #610251] INFO -- : 2409 ......................................................................... I, [2024-05-20T06:45:39.211943 #610251] INFO -- : 2482 ......................................................................... I, [2024-05-20T06:45:39.239077 #610251] INFO -- : 2555 ......................................................................... I, [2024-05-20T06:45:39.333077 #610251] INFO -- : 2628 ......................................................................... I, [2024-05-20T06:45:39.441643 #610251] INFO -- : 2701 ......................................................................... I, [2024-05-20T06:45:39.471110 #610251] INFO -- : 2774 ......................................................................... I, [2024-05-20T06:45:39.532419 #610251] INFO -- : 2847 ......................................................................... I, [2024-05-20T06:45:39.569519 #610251] INFO -- : 2920 ......................................................................... I, [2024-05-20T06:45:39.597835 #610251] INFO -- : 2993 ......................................................................... I, [2024-05-20T06:45:39.622174 #610251] INFO -- : 3066 ......................................................................... I, [2024-05-20T06:45:39.636561 #610251] INFO -- : 3139 ......................................................................... I, [2024-05-20T06:45:39.645767 #610251] INFO -- : 3212 ......................................................................... I, [2024-05-20T06:45:39.677303 #610251] INFO -- : 3285 ......................................................................... I, [2024-05-20T06:45:43.622757 #610251] INFO -- : 3358 ......................................................................... I, [2024-05-20T06:45:43.647311 #610251] INFO -- : I, [2024-05-20T06:45:43.647344 #610251] INFO -- : I, [2024-05-20T06:45:43.647350 #610251] INFO -- : Finished in 8.115690 seconds I, [2024-05-20T06:45:43.647354 #610251] INFO -- : I, [2024-05-20T06:45:43.647359 #610251] INFO -- : 3430 files, 32652 examples, 184597 expectations, 0 failures, 0 errors, 0 tagged I, [2024-05-20T06:45:43.649542 #610251] INFO -- : $$$[end] "make yes-test-rubyspec MSPECOPT='--error-output stderr --debug -j' TESTS='-j20'" exit with 0.