# Logfile created on 2024-05-19 00:41:20 +0000 by logger.rb/v1.4.3 I, [2024-05-19T00:41:20.495945 #1999693] INFO -- : #, @formatter=nil, @logdev=#, @binmode=false, @mon_data=#, @mon_data_owner_object_id=860>>> I, [2024-05-19T00:41:20.496068 #1999693] INFO -- : $$$[beg] make update-unicode -j20 I, [2024-05-19T00:41:20.556865 #1999693] INFO -- : Downloading Unicode emoji 15.0 files... I, [2024-05-19T00:41:20.557165 #1999693] INFO -- : Downloading Unicode emoji 15.0 files... I, [2024-05-19T00:41:20.557734 #1999693] INFO -- : Downloading Unicode emoji 15.0 files... I, [2024-05-19T00:41:20.598543 #1999693] INFO -- : made symlink emoji/15.0/emoji-sequences.txt to /tmp/ruby/src/trunk/.downloaded-cache/emoji/15.0/emoji-sequences.txt I, [2024-05-19T00:41:20.599574 #1999693] INFO -- : downloading emoji/15.0/emoji-sequences.txt ... downloading emoji/15.0/emoji-test.txt ... /tmp/ruby/src/trunk/enc/unicode/data/emoji/15.0/emoji-sequences.txt already exists E, [2024-05-19T00:41:21.039618 #1999693] ERROR -- : /tmp/ruby/src/trunk/tool/downloader.rb:302:in `rescue in download': failed to download emoji/15.0/emoji-test.txt (RuntimeError) E, [2024-05-19T00:41:21.039829 #1999693] ERROR -- : OpenURI::HTTPError: 403 Forbidden: https://www.unicode.org/Public/emoji/15.0/emoji-test.txt E, [2024-05-19T00:41:21.039858 #1999693] ERROR -- : from /tmp/ruby/src/trunk/tool/downloader.rb:201:in `download' E, [2024-05-19T00:41:21.039876 #1999693] ERROR -- : from /tmp/ruby/src/trunk/tool/downloader.rb:136:in `download' E, [2024-05-19T00:41:21.039895 #1999693] ERROR -- : from /tmp/ruby/src/trunk/tool/downloader.rb:482:in `block in
' E, [2024-05-19T00:41:21.039911 #1999693] ERROR -- : from /tmp/ruby/src/trunk/tool/downloader.rb:465:in `each' E, [2024-05-19T00:41:21.039928 #1999693] ERROR -- : from /tmp/ruby/src/trunk/tool/downloader.rb:465:in `
' E, [2024-05-19T00:41:21.039944 #1999693] ERROR -- : /usr/lib/ruby/3.0.0/open-uri.rb:364:in `open_http': 403 Forbidden (OpenURI::HTTPError) E, [2024-05-19T00:41:21.039960 #1999693] ERROR -- : from /usr/lib/ruby/3.0.0/open-uri.rb:741:in `buffer_open' E, [2024-05-19T00:41:21.039981 #1999693] ERROR -- : from /usr/lib/ruby/3.0.0/open-uri.rb:212:in `block in open_loop' E, [2024-05-19T00:41:21.039997 #1999693] ERROR -- : from /usr/lib/ruby/3.0.0/open-uri.rb:210:in `catch' E, [2024-05-19T00:41:21.040013 #1999693] ERROR -- : from /usr/lib/ruby/3.0.0/open-uri.rb:210:in `open_loop' E, [2024-05-19T00:41:21.040029 #1999693] ERROR -- : from /usr/lib/ruby/3.0.0/open-uri.rb:151:in `open_uri' E, [2024-05-19T00:41:21.040045 #1999693] ERROR -- : from /usr/lib/ruby/3.0.0/open-uri.rb:721:in `open' E, [2024-05-19T00:41:21.040060 #1999693] ERROR -- : from /usr/lib/ruby/3.0.0/open-uri.rb:729:in `read' E, [2024-05-19T00:41:21.040076 #1999693] ERROR -- : from /tmp/ruby/src/trunk/tool/downloader.rb:247:in `block in download' E, [2024-05-19T00:41:21.040123 #1999693] ERROR -- : from /tmp/ruby/src/trunk/tool/downloader.rb:378:in `with_retry' E, [2024-05-19T00:41:21.040140 #1999693] ERROR -- : from /tmp/ruby/src/trunk/tool/downloader.rb:246:in `download' E, [2024-05-19T00:41:21.040161 #1999693] ERROR -- : from /tmp/ruby/src/trunk/tool/downloader.rb:136:in `download' E, [2024-05-19T00:41:21.040177 #1999693] ERROR -- : from /tmp/ruby/src/trunk/tool/downloader.rb:482:in `block in
' E, [2024-05-19T00:41:21.040193 #1999693] ERROR -- : from /tmp/ruby/src/trunk/tool/downloader.rb:465:in `each' E, [2024-05-19T00:41:21.040210 #1999693] ERROR -- : from /tmp/ruby/src/trunk/tool/downloader.rb:465:in `
' E, [2024-05-19T00:41:21.040231 #1999693] ERROR -- : /tmp/ruby/src/trunk/tool/downloader.rb:302:in `rescue in download': failed to download emoji/15.0/emoji-test.txt (RuntimeError) E, [2024-05-19T00:41:21.040249 #1999693] ERROR -- : OpenURI::HTTPError: 403 Forbidden: https://www.unicode.org/Public/emoji/15.0/emoji-test.txt E, [2024-05-19T00:41:21.040265 #1999693] ERROR -- : from /tmp/ruby/src/trunk/tool/downloader.rb:201:in `download' E, [2024-05-19T00:41:21.040285 #1999693] ERROR -- : from /tmp/ruby/src/trunk/tool/downloader.rb:136:in `download' E, [2024-05-19T00:41:21.040302 #1999693] ERROR -- : from /tmp/ruby/src/trunk/tool/downloader.rb:482:in `block in
' E, [2024-05-19T00:41:21.040318 #1999693] ERROR -- : from /tmp/ruby/src/trunk/tool/downloader.rb:465:in `each' E, [2024-05-19T00:41:21.040335 #1999693] ERROR -- : from /tmp/ruby/src/trunk/tool/downloader.rb:465:in `
' E, [2024-05-19T00:41:21.040349 #1999693] ERROR -- : /usr/lib/ruby/3.0.0/open-uri.rb:364:in `open_http': 403 Forbidden (OpenURI::HTTPError) E, [2024-05-19T00:41:21.040363 #1999693] ERROR -- : from /usr/lib/ruby/3.0.0/open-uri.rb:741:in `buffer_open' E, [2024-05-19T00:41:21.040379 #1999693] ERROR -- : from /usr/lib/ruby/3.0.0/open-uri.rb:212:in `block in open_loop' E, [2024-05-19T00:41:21.040393 #1999693] ERROR -- : from /usr/lib/ruby/3.0.0/open-uri.rb:210:in `catch' E, [2024-05-19T00:41:21.040411 #1999693] ERROR -- : from /usr/lib/ruby/3.0.0/open-uri.rb:210:in `open_loop' E, [2024-05-19T00:41:21.040426 #1999693] ERROR -- : from /usr/lib/ruby/3.0.0/open-uri.rb:151:in `open_uri' E, [2024-05-19T00:41:21.040440 #1999693] ERROR -- : from /usr/lib/ruby/3.0.0/open-uri.rb:721:in `open' E, [2024-05-19T00:41:21.040454 #1999693] ERROR -- : from /usr/lib/ruby/3.0.0/open-uri.rb:729:in `read' E, [2024-05-19T00:41:21.040468 #1999693] ERROR -- : from /tmp/ruby/src/trunk/tool/downloader.rb:247:in `block in download' E, [2024-05-19T00:41:21.040483 #1999693] ERROR -- : from /tmp/ruby/src/trunk/tool/downloader.rb:378:in `with_retry' E, [2024-05-19T00:41:21.040497 #1999693] ERROR -- : from /tmp/ruby/src/trunk/tool/downloader.rb:246:in `download' E, [2024-05-19T00:41:21.040512 #1999693] ERROR -- : from /tmp/ruby/src/trunk/tool/downloader.rb:136:in `download' E, [2024-05-19T00:41:21.040526 #1999693] ERROR -- : from /tmp/ruby/src/trunk/tool/downloader.rb:482:in `block in
' E, [2024-05-19T00:41:21.040544 #1999693] ERROR -- : from /tmp/ruby/src/trunk/tool/downloader.rb:465:in `each' E, [2024-05-19T00:41:21.040559 #1999693] ERROR -- : from /tmp/ruby/src/trunk/tool/downloader.rb:465:in `
' E, [2024-05-19T00:41:21.043837 #1999693] ERROR -- : make: *** [uncommon.mk:1765: /tmp/ruby/src/trunk/enc/unicode/data/emoji/15.0/emoji-test.txt] Error 1 E, [2024-05-19T00:41:21.043917 #1999693] ERROR -- : make: *** Waiting for unfinished jobs.... E, [2024-05-19T00:41:21.043936 #1999693] ERROR -- : make: *** [uncommon.mk:1765: /tmp/ruby/src/trunk/enc/unicode/data/emoji/15.0/emoji-zwj-sequences.txt] Error 1 E, [2024-05-19T00:41:21.521631 #1999693] ERROR -- : /tmp/ruby/src/trunk/tool/downloader.rb:302:in `rescue in download': failed to download emoji/15.0/emoji-sequences.txt (RuntimeError) E, [2024-05-19T00:41:21.521730 #1999693] ERROR -- : EOFError: end of file reached: https://www.unicode.org/Public/emoji/15.0/emoji-sequences.txt E, [2024-05-19T00:41:21.521762 #1999693] ERROR -- : from /tmp/ruby/src/trunk/tool/downloader.rb:201:in `download' E, [2024-05-19T00:41:21.521773 #1999693] ERROR -- : from /tmp/ruby/src/trunk/tool/downloader.rb:136:in `download' E, [2024-05-19T00:41:21.521788 #1999693] ERROR -- : from /tmp/ruby/src/trunk/tool/downloader.rb:482:in `block in
' E, [2024-05-19T00:41:21.521800 #1999693] ERROR -- : from /tmp/ruby/src/trunk/tool/downloader.rb:465:in `each' E, [2024-05-19T00:41:21.521810 #1999693] ERROR -- : from /tmp/ruby/src/trunk/tool/downloader.rb:465:in `
' E, [2024-05-19T00:41:21.521820 #1999693] ERROR -- : /usr/lib/ruby/3.0.0/net/protocol.rb:227:in `rbuf_fill': end of file reached (EOFError) E, [2024-05-19T00:41:21.521831 #1999693] ERROR -- : from /usr/lib/ruby/3.0.0/net/protocol.rb:193:in `readuntil' E, [2024-05-19T00:41:21.521844 #1999693] ERROR -- : from /usr/lib/ruby/3.0.0/net/protocol.rb:203:in `readline' E, [2024-05-19T00:41:21.521854 #1999693] ERROR -- : from /usr/lib/ruby/3.0.0/net/http/response.rb:42:in `read_status_line' E, [2024-05-19T00:41:21.521864 #1999693] ERROR -- : from /usr/lib/ruby/3.0.0/net/http/response.rb:31:in `read_new' E, [2024-05-19T00:41:21.521874 #1999693] ERROR -- : from /usr/lib/ruby/3.0.0/net/http.rb:1557:in `block in transport_request' E, [2024-05-19T00:41:21.521884 #1999693] ERROR -- : from /usr/lib/ruby/3.0.0/net/http.rb:1548:in `catch' E, [2024-05-19T00:41:21.522098 #1999693] ERROR -- : from /usr/lib/ruby/3.0.0/net/http.rb:1548:in `transport_request' E, [2024-05-19T00:41:21.522108 #1999693] ERROR -- : from /usr/lib/ruby/3.0.0/net/http.rb:1521:in `request' E, [2024-05-19T00:41:21.522118 #1999693] ERROR -- : from /usr/lib/ruby/3.0.0/open-uri.rb:329:in `block in open_http' E, [2024-05-19T00:41:21.522128 #1999693] ERROR -- : from /usr/lib/ruby/3.0.0/net/http.rb:960:in `start' E, [2024-05-19T00:41:21.522138 #1999693] ERROR -- : from /usr/lib/ruby/3.0.0/open-uri.rb:323:in `open_http' E, [2024-05-19T00:41:21.522148 #1999693] ERROR -- : from /usr/lib/ruby/3.0.0/open-uri.rb:741:in `buffer_open' E, [2024-05-19T00:41:21.522158 #1999693] ERROR -- : from /usr/lib/ruby/3.0.0/open-uri.rb:212:in `block in open_loop' E, [2024-05-19T00:41:21.522170 #1999693] ERROR -- : from /usr/lib/ruby/3.0.0/open-uri.rb:210:in `catch' E, [2024-05-19T00:41:21.522180 #1999693] ERROR -- : from /usr/lib/ruby/3.0.0/open-uri.rb:210:in `open_loop' E, [2024-05-19T00:41:21.522190 #1999693] ERROR -- : from /usr/lib/ruby/3.0.0/open-uri.rb:151:in `open_uri' E, [2024-05-19T00:41:21.522200 #1999693] ERROR -- : from /usr/lib/ruby/3.0.0/open-uri.rb:721:in `open' E, [2024-05-19T00:41:21.522216 #1999693] ERROR -- : from /usr/lib/ruby/3.0.0/open-uri.rb:729:in `read' E, [2024-05-19T00:41:21.522226 #1999693] ERROR -- : from /tmp/ruby/src/trunk/tool/downloader.rb:247:in `block in download' E, [2024-05-19T00:41:21.522235 #1999693] ERROR -- : from /tmp/ruby/src/trunk/tool/downloader.rb:378:in `with_retry' E, [2024-05-19T00:41:21.522245 #1999693] ERROR -- : from /tmp/ruby/src/trunk/tool/downloader.rb:246:in `download' E, [2024-05-19T00:41:21.522255 #1999693] ERROR -- : from /tmp/ruby/src/trunk/tool/downloader.rb:136:in `download' E, [2024-05-19T00:41:21.522267 #1999693] ERROR -- : from /tmp/ruby/src/trunk/tool/downloader.rb:482:in `block in
' E, [2024-05-19T00:41:21.522277 #1999693] ERROR -- : from /tmp/ruby/src/trunk/tool/downloader.rb:465:in `each' E, [2024-05-19T00:41:21.522287 #1999693] ERROR -- : from /tmp/ruby/src/trunk/tool/downloader.rb:465:in `
' E, [2024-05-19T00:41:21.525808 #1999693] ERROR -- : make: *** [uncommon.mk:1765: /tmp/ruby/src/trunk/enc/unicode/data/emoji/15.0/emoji-sequences.txt] Error 1 E, [2024-05-19T00:41:21.525858 #1999693] ERROR -- : make: *** Deleting file '/tmp/ruby/src/trunk/enc/unicode/data/emoji/15.0/emoji-sequences.txt' I, [2024-05-19T00:41:21.525921 #1999693] INFO -- : downloading emoji/15.0/emoji-test.txt ... I, [2024-05-19T00:41:21.526547 #1999693] INFO -- : $$$[end] "make update-unicode -j20" exit with 512. I, [2024-05-19T00:41:21.526603 #1999693] INFO -- : $$$[beg] make update-download -j20 I, [2024-05-19T00:41:21.633702 #1999693] INFO -- : tool/config.guess already exists I, [2024-05-19T00:41:21.633745 #1999693] INFO -- : tool/config.sub already exists I, [2024-05-19T00:41:21.635646 #1999693] INFO -- : Update power_assert to 84e85124c5014a139af39161d484156cfe87a9ed I, [2024-05-19T00:41:21.635938 #1999693] INFO -- : Update rbs to ba7872795d5de04adb8ff500c0e6afdc81a041dd I, [2024-05-19T00:41:21.635963 #1999693] INFO -- : Update typeprof to b19a6416da3a05d57fadd6ffdadb382b6d236ca5 I, [2024-05-19T00:41:21.637164 #1999693] INFO -- : echo 84e85124c5014a139af39161d484156cfe87a9ed | /bin/sh /tmp/ruby/src/trunk/tool/ifchange /tmp/ruby/src/trunk/.bundle/.timestamp/power_assert.revision - I, [2024-05-19T00:41:21.637321 #1999693] INFO -- : echo ba7872795d5de04adb8ff500c0e6afdc81a041dd | /bin/sh /tmp/ruby/src/trunk/tool/ifchange /tmp/ruby/src/trunk/.bundle/.timestamp/rbs.revision - I, [2024-05-19T00:41:21.637541 #1999693] INFO -- : echo b19a6416da3a05d57fadd6ffdadb382b6d236ca5 | /bin/sh /tmp/ruby/src/trunk/tool/ifchange /tmp/ruby/src/trunk/.bundle/.timestamp/typeprof.revision - I, [2024-05-19T00:41:21.639154 #1999693] INFO -- : /tmp/ruby/src/trunk/.bundle/.timestamp/power_assert.revision unchanged I, [2024-05-19T00:41:21.639317 #1999693] INFO -- : /tmp/ruby/src/trunk/.bundle/.timestamp/typeprof.revision unchanged I, [2024-05-19T00:41:21.639392 #1999693] INFO -- : /tmp/ruby/src/trunk/.bundle/.timestamp/rbs.revision unchanged I, [2024-05-19T00:41:21.694183 #1999693] INFO -- : Building power_assert@84e85124c5014a139af39161d484156cfe87a9ed to /tmp/ruby/src/trunk/gems/power_assert-2.0.3.gem I, [2024-05-19T00:41:21.762509 #1999693] INFO -- : Successfully built RubyGem I, [2024-05-19T00:41:21.762541 #1999693] INFO -- : Name: power_assert I, [2024-05-19T00:41:21.762547 #1999693] INFO -- : Version: 2.0.4dev I, [2024-05-19T00:41:21.762551 #1999693] INFO -- : File: power_assert-2.0.4dev.gem I, [2024-05-19T00:41:21.807007 #1999693] INFO -- : $$$[end] "make update-download -j20" exit with 0. I, [2024-05-19T00:41:21.807051 #1999693] INFO -- : $$$[beg] make update-rubyspec -j20 I, [2024-05-19T00:41:21.872690 #1999693] INFO -- : make: Nothing to be done for 'update-rubyspec'. I, [2024-05-19T00:41:21.873110 #1999693] INFO -- : $$$[end] "make update-rubyspec -j20" exit with 0. I, [2024-05-19T00:41:21.873151 #1999693] INFO -- : $$$[beg] make update-src -j20 I, [2024-05-19T00:41:22.619025 #1999693] INFO -- : Already up to date. I, [2024-05-19T00:41:22.634240 #1999693] INFO -- : Latest commit hash = dbbaf871de I, [2024-05-19T00:41:22.635325 #1999693] INFO -- : $$$[end] "make update-src -j20" exit with 0. I, [2024-05-19T00:41:22.635398 #1999693] INFO -- : $$$[beg] make after-update -j20 I, [2024-05-19T00:41:22.709126 #1999693] INFO -- : generating /tmp/ruby/src/trunk/ext/ripper/eventids2table.c I, [2024-05-19T00:41:22.713435 #1999693] INFO -- : make[1]: Entering directory '/tmp/ruby/src/trunk/ext/ripper' I, [2024-05-19T00:41:22.713458 #1999693] INFO -- : make[1]: Nothing to be done for 'src'. I, [2024-05-19T00:41:22.713465 #1999693] INFO -- : make[1]: Leaving directory '/tmp/ruby/src/trunk/ext/ripper' I, [2024-05-19T00:41:22.730042 #1999693] INFO -- : /tmp/ruby/src/trunk/revision.h updated I, [2024-05-19T00:41:22.731261 #1999693] INFO -- : generating x86_64-linux-fake.rb I, [2024-05-19T00:41:22.781680 #1999693] INFO -- : x86_64-linux-fake.rb updated I, [2024-05-19T00:41:22.782950 #1999693] INFO -- : generating enc.mk I, [2024-05-19T00:41:22.900667 #1999693] INFO -- : making srcs under enc I, [2024-05-19T00:41:22.930416 #1999693] INFO -- : make[1]: Entering directory '/tmp/ruby/build/trunk' I, [2024-05-19T00:41:22.930444 #1999693] INFO -- : make[1]: Nothing to be done for 'srcs'. I, [2024-05-19T00:41:22.930451 #1999693] INFO -- : make[1]: Leaving directory '/tmp/ruby/build/trunk' I, [2024-05-19T00:41:22.975048 #1999693] INFO -- : Update power_assert to 84e85124c5014a139af39161d484156cfe87a9ed I, [2024-05-19T00:41:22.975301 #1999693] INFO -- : Update rbs to ba7872795d5de04adb8ff500c0e6afdc81a041dd I, [2024-05-19T00:41:22.975774 #1999693] INFO -- : Update typeprof to b19a6416da3a05d57fadd6ffdadb382b6d236ca5 I, [2024-05-19T00:41:22.976209 #1999693] INFO -- : echo 84e85124c5014a139af39161d484156cfe87a9ed | /bin/sh /tmp/ruby/src/trunk/tool/ifchange /tmp/ruby/src/trunk/.bundle/.timestamp/power_assert.revision - I, [2024-05-19T00:41:22.977107 #1999693] INFO -- : echo ba7872795d5de04adb8ff500c0e6afdc81a041dd | /bin/sh /tmp/ruby/src/trunk/tool/ifchange /tmp/ruby/src/trunk/.bundle/.timestamp/rbs.revision - I, [2024-05-19T00:41:22.977451 #1999693] INFO -- : echo b19a6416da3a05d57fadd6ffdadb382b6d236ca5 | /bin/sh /tmp/ruby/src/trunk/tool/ifchange /tmp/ruby/src/trunk/.bundle/.timestamp/typeprof.revision - I, [2024-05-19T00:41:22.978090 #1999693] INFO -- : /tmp/ruby/src/trunk/.bundle/.timestamp/power_assert.revision unchanged I, [2024-05-19T00:41:22.978801 #1999693] INFO -- : /tmp/ruby/src/trunk/.bundle/.timestamp/rbs.revision unchanged I, [2024-05-19T00:41:22.979096 #1999693] INFO -- : /tmp/ruby/src/trunk/.bundle/.timestamp/typeprof.revision unchanged I, [2024-05-19T00:41:22.979268 #1999693] INFO -- : Building power_assert@84e85124c5014a139af39161d484156cfe87a9ed to /tmp/ruby/src/trunk/gems/power_assert-2.0.3.gem I, [2024-05-19T00:41:23.048548 #1999693] INFO -- : Successfully built RubyGem I, [2024-05-19T00:41:23.048589 #1999693] INFO -- : Name: power_assert I, [2024-05-19T00:41:23.048594 #1999693] INFO -- : Version: 2.0.4dev I, [2024-05-19T00:41:23.048599 #1999693] INFO -- : File: power_assert-2.0.4dev.gem I, [2024-05-19T00:41:23.050867 #1999693] INFO -- : Extracting bundle gem power_assert-2.0.3... I, [2024-05-19T00:41:23.112212 #1999693] INFO -- : Try with hash version of bundled gems instead of gems/power_assert-2.0.3.gem. We don't use this gem with release version of Ruby. I, [2024-05-19T00:41:23.117184 #1999693] INFO -- : Unpacked gems/power_assert-2.0.4dev.gem I, [2024-05-19T00:41:23.119076 #1999693] INFO -- : $$$[end] "make after-update -j20" exit with 0. I, [2024-05-19T00:41:23.119228 #1999693] INFO -- : $$$[beg] make miniruby -j20 I, [2024-05-19T00:41:23.177653 #1999693] INFO -- : BASERUBY = /usr/bin/ruby --disable=gems I, [2024-05-19T00:41:23.177694 #1999693] INFO -- : CC = gcc I, [2024-05-19T00:41:23.177707 #1999693] INFO -- : LD = ld I, [2024-05-19T00:41:23.177718 #1999693] INFO -- : LDSHARED = gcc -shared I, [2024-05-19T00:41:23.177729 #1999693] INFO -- : CFLAGS = -O3 -fno-fast-math -ggdb3 -Wall -Wextra -Wdeprecated-declarations -Wdiv-by-zero -Wduplicated-cond -Wimplicit-function-declaration -Wimplicit-int -Wpointer-arith -Wwrite-strings -Wold-style-definition -Wimplicit-fallthrough=0 -Wmissing-noreturn -Wno-cast-function-type -Wno-constant-logical-operand -Wno-long-long -Wno-missing-field-initializers -Wno-overlength-strings -Wno-packed-bitfield-compat -Wno-parentheses-equality -Wno-self-assign -Wno-tautological-compare -Wno-unused-parameter -Wno-unused-value -Wsuggest-attribute=format -Wsuggest-attribute=noreturn -Wunused-variable -Wmisleading-indentation -Wundef -fPIC I, [2024-05-19T00:41:23.177742 #1999693] INFO -- : XCFLAGS = -U_FORTIFY_SOURCE -D_FORTIFY_SOURCE=2 -fstack-protector-strong -fno-strict-overflow -fvisibility=hidden -fexcess-precision=standard -DRUBY_EXPORT -I. -I.ext/include/x86_64-linux -I/tmp/ruby/src/trunk/include -I/tmp/ruby/src/trunk -I/tmp/ruby/src/trunk/prism -I/tmp/ruby/src/trunk/enc/unicode/15.0.0 I, [2024-05-19T00:41:23.177752 #1999693] INFO -- : CPPFLAGS = I, [2024-05-19T00:41:23.177763 #1999693] INFO -- : DLDFLAGS = -Wl,--compress-debug-sections=zlib -Wl,-soname,libruby.so.3.4 -fstack-protector-strong I, [2024-05-19T00:41:23.177774 #1999693] INFO -- : SOLIBS = -lz -lrt -lrt -lgmp -ldl -lcrypt -lm -lpthread I, [2024-05-19T00:41:23.177788 #1999693] INFO -- : LANG = en_US.UTF-8 I, [2024-05-19T00:41:23.177800 #1999693] INFO -- : LC_ALL = I, [2024-05-19T00:41:23.177810 #1999693] INFO -- : LC_CTYPE = I, [2024-05-19T00:41:23.177820 #1999693] INFO -- : MFLAGS = -j20 --jobserver-auth=4,5 I, [2024-05-19T00:41:23.177838 #1999693] INFO -- : RUSTC = no I, [2024-05-19T00:41:23.177849 #1999693] INFO -- : YJIT_RUSTC_ARGS = --crate-name=yjit --crate-type=staticlib --edition=2021 -g -C lto=thin -C opt-level=3 -C overflow-checks=on '--out-dir=/tmp/ruby/build/trunk/yjit/target/release/' /tmp/ruby/src/trunk/yjit/src/lib.rs I, [2024-05-19T00:41:23.179061 #1999693] INFO -- : gcc (Ubuntu 11.4.0-1ubuntu1~22.04) 11.4.0 I, [2024-05-19T00:41:23.179100 #1999693] INFO -- : Copyright (C) 2021 Free Software Foundation, Inc. I, [2024-05-19T00:41:23.179113 #1999693] INFO -- : This is free software; see the source for copying conditions. There is NO I, [2024-05-19T00:41:23.179130 #1999693] INFO -- : warranty; not even for MERCHANTABILITY or FITNESS FOR A PARTICULAR PURPOSE. I, [2024-05-19T00:41:23.179141 #1999693] INFO -- : I, [2024-05-19T00:41:23.199814 #1999693] INFO -- : compiling /tmp/ruby/src/trunk/version.c I, [2024-05-19T00:41:23.302773 #1999693] INFO -- : linking miniruby I, [2024-05-19T00:41:23.837383 #1999693] INFO -- : $$$[end] "make miniruby -j20" exit with 0. I, [2024-05-19T00:41:23.837503 #1999693] INFO -- : $$$[beg] make ruby -j20 I, [2024-05-19T00:41:23.894598 #1999693] INFO -- : BASERUBY = /usr/bin/ruby --disable=gems I, [2024-05-19T00:41:23.894623 #1999693] INFO -- : CC = gcc I, [2024-05-19T00:41:23.894629 #1999693] INFO -- : LD = ld I, [2024-05-19T00:41:23.894634 #1999693] INFO -- : LDSHARED = gcc -shared I, [2024-05-19T00:41:23.894642 #1999693] INFO -- : CFLAGS = -O3 -fno-fast-math -ggdb3 -Wall -Wextra -Wdeprecated-declarations -Wdiv-by-zero -Wduplicated-cond -Wimplicit-function-declaration -Wimplicit-int -Wpointer-arith -Wwrite-strings -Wold-style-definition -Wimplicit-fallthrough=0 -Wmissing-noreturn -Wno-cast-function-type -Wno-constant-logical-operand -Wno-long-long -Wno-missing-field-initializers -Wno-overlength-strings -Wno-packed-bitfield-compat -Wno-parentheses-equality -Wno-self-assign -Wno-tautological-compare -Wno-unused-parameter -Wno-unused-value -Wsuggest-attribute=format -Wsuggest-attribute=noreturn -Wunused-variable -Wmisleading-indentation -Wundef -fPIC I, [2024-05-19T00:41:23.894647 #1999693] INFO -- : XCFLAGS = -U_FORTIFY_SOURCE -D_FORTIFY_SOURCE=2 -fstack-protector-strong -fno-strict-overflow -fvisibility=hidden -fexcess-precision=standard -DRUBY_EXPORT -I. -I.ext/include/x86_64-linux -I/tmp/ruby/src/trunk/include -I/tmp/ruby/src/trunk -I/tmp/ruby/src/trunk/prism -I/tmp/ruby/src/trunk/enc/unicode/15.0.0 I, [2024-05-19T00:41:23.894651 #1999693] INFO -- : CPPFLAGS = I, [2024-05-19T00:41:23.894655 #1999693] INFO -- : DLDFLAGS = -Wl,--compress-debug-sections=zlib -Wl,-soname,libruby.so.3.4 -fstack-protector-strong I, [2024-05-19T00:41:23.894659 #1999693] INFO -- : SOLIBS = -lz -lrt -lrt -lgmp -ldl -lcrypt -lm -lpthread I, [2024-05-19T00:41:23.894662 #1999693] INFO -- : LANG = en_US.UTF-8 I, [2024-05-19T00:41:23.894666 #1999693] INFO -- : LC_ALL = I, [2024-05-19T00:41:23.894669 #1999693] INFO -- : LC_CTYPE = I, [2024-05-19T00:41:23.894673 #1999693] INFO -- : MFLAGS = -j20 --jobserver-auth=4,5 I, [2024-05-19T00:41:23.894677 #1999693] INFO -- : RUSTC = no I, [2024-05-19T00:41:23.894681 #1999693] INFO -- : YJIT_RUSTC_ARGS = --crate-name=yjit --crate-type=staticlib --edition=2021 -g -C lto=thin -C opt-level=3 -C overflow-checks=on '--out-dir=/tmp/ruby/build/trunk/yjit/target/release/' /tmp/ruby/src/trunk/yjit/src/lib.rs I, [2024-05-19T00:41:23.896031 #1999693] INFO -- : gcc (Ubuntu 11.4.0-1ubuntu1~22.04) 11.4.0 I, [2024-05-19T00:41:23.896056 #1999693] INFO -- : Copyright (C) 2021 Free Software Foundation, Inc. I, [2024-05-19T00:41:23.896062 #1999693] INFO -- : This is free software; see the source for copying conditions. There is NO I, [2024-05-19T00:41:23.896067 #1999693] INFO -- : warranty; not even for MERCHANTABILITY or FITNESS FOR A PARTICULAR PURPOSE. I, [2024-05-19T00:41:23.896075 #1999693] INFO -- : I, [2024-05-19T00:41:24.004949 #1999693] INFO -- : builtin_binary.inc updated I, [2024-05-19T00:41:24.009646 #1999693] INFO -- : c5234a9416e4f20f175185e840b25b0f08674d14078ed7083f37e655458e3ca9 builtin_binary.inc I, [2024-05-19T00:41:24.010433 #1999693] INFO -- : compiling /tmp/ruby/src/trunk/builtin.c I, [2024-05-19T00:41:24.193803 #1999693] INFO -- : linking static-library libruby-static.a I, [2024-05-19T00:41:24.506516 #1999693] INFO -- : linking shared-library libruby.so.3.4.0 I, [2024-05-19T00:41:26.055278 #1999693] INFO -- : linking ruby I, [2024-05-19T00:41:26.080766 #1999693] INFO -- : $$$[end] "make ruby -j20" exit with 0. I, [2024-05-19T00:41:26.080875 #1999693] INFO -- : $$$[beg] make all -j20 I, [2024-05-19T00:41:26.143337 #1999693] INFO -- : BASERUBY = /usr/bin/ruby --disable=gems I, [2024-05-19T00:41:26.143382 #1999693] INFO -- : CC = gcc I, [2024-05-19T00:41:26.143396 #1999693] INFO -- : LD = ld I, [2024-05-19T00:41:26.143408 #1999693] INFO -- : LDSHARED = gcc -shared I, [2024-05-19T00:41:26.143419 #1999693] INFO -- : CFLAGS = -O3 -fno-fast-math -ggdb3 -Wall -Wextra -Wdeprecated-declarations -Wdiv-by-zero -Wduplicated-cond -Wimplicit-function-declaration -Wimplicit-int -Wpointer-arith -Wwrite-strings -Wold-style-definition -Wimplicit-fallthrough=0 -Wmissing-noreturn -Wno-cast-function-type -Wno-constant-logical-operand -Wno-long-long -Wno-missing-field-initializers -Wno-overlength-strings -Wno-packed-bitfield-compat -Wno-parentheses-equality -Wno-self-assign -Wno-tautological-compare -Wno-unused-parameter -Wno-unused-value -Wsuggest-attribute=format -Wsuggest-attribute=noreturn -Wunused-variable -Wmisleading-indentation -Wundef -fPIC I, [2024-05-19T00:41:26.143431 #1999693] INFO -- : XCFLAGS = -U_FORTIFY_SOURCE -D_FORTIFY_SOURCE=2 -fstack-protector-strong -fno-strict-overflow -fvisibility=hidden -fexcess-precision=standard -DRUBY_EXPORT -I. -I.ext/include/x86_64-linux -I/tmp/ruby/src/trunk/include -I/tmp/ruby/src/trunk -I/tmp/ruby/src/trunk/prism -I/tmp/ruby/src/trunk/enc/unicode/15.0.0 I, [2024-05-19T00:41:26.143442 #1999693] INFO -- : CPPFLAGS = I, [2024-05-19T00:41:26.143453 #1999693] INFO -- : DLDFLAGS = -Wl,--compress-debug-sections=zlib -Wl,-soname,libruby.so.3.4 -fstack-protector-strong I, [2024-05-19T00:41:26.143464 #1999693] INFO -- : SOLIBS = -lz -lrt -lrt -lgmp -ldl -lcrypt -lm -lpthread I, [2024-05-19T00:41:26.143474 #1999693] INFO -- : LANG = en_US.UTF-8 I, [2024-05-19T00:41:26.143485 #1999693] INFO -- : LC_ALL = I, [2024-05-19T00:41:26.143495 #1999693] INFO -- : LC_CTYPE = I, [2024-05-19T00:41:26.143506 #1999693] INFO -- : MFLAGS = -j20 --jobserver-auth=4,5 I, [2024-05-19T00:41:26.143517 #1999693] INFO -- : RUSTC = no I, [2024-05-19T00:41:26.143528 #1999693] INFO -- : YJIT_RUSTC_ARGS = --crate-name=yjit --crate-type=staticlib --edition=2021 -g -C lto=thin -C opt-level=3 -C overflow-checks=on '--out-dir=/tmp/ruby/build/trunk/yjit/target/release/' /tmp/ruby/src/trunk/yjit/src/lib.rs I, [2024-05-19T00:41:26.144739 #1999693] INFO -- : gcc (Ubuntu 11.4.0-1ubuntu1~22.04) 11.4.0 I, [2024-05-19T00:41:26.144782 #1999693] INFO -- : Copyright (C) 2021 Free Software Foundation, Inc. I, [2024-05-19T00:41:26.144801 #1999693] INFO -- : This is free software; see the source for copying conditions. There is NO I, [2024-05-19T00:41:26.144813 #1999693] INFO -- : warranty; not even for MERCHANTABILITY or FITNESS FOR A PARTICULAR PURPOSE. I, [2024-05-19T00:41:26.144823 #1999693] INFO -- : I, [2024-05-19T00:41:26.172238 #1999693] INFO -- : generating enc.mk I, [2024-05-19T00:41:26.174056 #1999693] INFO -- : building spec/ruby/optional/capi/ext/array_spec.so I, [2024-05-19T00:41:26.174238 #1999693] INFO -- : building spec/ruby/optional/capi/ext/basic_object_spec.so I, [2024-05-19T00:41:26.174838 #1999693] INFO -- : building spec/ruby/optional/capi/ext/bignum_spec.so I, [2024-05-19T00:41:26.175447 #1999693] INFO -- : building spec/ruby/optional/capi/ext/binding_spec.so I, [2024-05-19T00:41:26.175576 #1999693] INFO -- : building spec/ruby/optional/capi/ext/boolean_spec.so I, [2024-05-19T00:41:26.176308 #1999693] INFO -- : building spec/ruby/optional/capi/ext/class_id_under_autoload_spec.so I, [2024-05-19T00:41:26.177406 #1999693] INFO -- : building spec/ruby/optional/capi/ext/class_spec.so I, [2024-05-19T00:41:26.178298 #1999693] INFO -- : building spec/ruby/optional/capi/ext/class_under_autoload_spec.so I, [2024-05-19T00:41:26.178567 #1999693] INFO -- : building spec/ruby/optional/capi/ext/complex_spec.so I, [2024-05-19T00:41:26.179243 #1999693] INFO -- : building spec/ruby/optional/capi/ext/constants_spec.so I, [2024-05-19T00:41:26.179980 #1999693] INFO -- : building spec/ruby/optional/capi/ext/data_spec.so I, [2024-05-19T00:41:26.180396 #1999693] INFO -- : building spec/ruby/optional/capi/ext/debug_spec.so I, [2024-05-19T00:41:26.181260 #1999693] INFO -- : building spec/ruby/optional/capi/ext/encoding_spec.so I, [2024-05-19T00:41:26.182181 #1999693] INFO -- : building spec/ruby/optional/capi/ext/enumerator_spec.so I, [2024-05-19T00:41:26.182878 #1999693] INFO -- : building spec/ruby/optional/capi/ext/exception_spec.so I, [2024-05-19T00:41:26.183213 #1999693] INFO -- : building spec/ruby/optional/capi/ext/fiber_spec.so I, [2024-05-19T00:41:26.183850 #1999693] INFO -- : building spec/ruby/optional/capi/ext/file_spec.so I, [2024-05-19T00:41:26.184528 #1999693] INFO -- : building spec/ruby/optional/capi/ext/fixnum_spec.so I, [2024-05-19T00:41:26.200187 #1999693] INFO -- : building spec/ruby/optional/capi/ext/float_spec.so I, [2024-05-19T00:41:26.302373 #1999693] INFO -- : building spec/ruby/optional/capi/ext/gc_spec.so I, [2024-05-19T00:41:26.308888 #1999693] INFO -- : building spec/ruby/optional/capi/ext/globals_spec.so I, [2024-05-19T00:41:26.313690 #1999693] INFO -- : building spec/ruby/optional/capi/ext/hash_spec.so I, [2024-05-19T00:41:26.317314 #1999693] INFO -- : building spec/ruby/optional/capi/ext/integer_spec.so I, [2024-05-19T00:41:26.322094 #1999693] INFO -- : building spec/ruby/optional/capi/ext/io_spec.so I, [2024-05-19T00:41:26.340443 #1999693] INFO -- : building spec/ruby/optional/capi/ext/kernel_spec.so I, [2024-05-19T00:41:26.342347 #1999693] INFO -- : building spec/ruby/optional/capi/ext/language_spec.so I, [2024-05-19T00:41:26.345051 #1999693] INFO -- : building spec/ruby/optional/capi/ext/marshal_spec.so I, [2024-05-19T00:41:26.355454 #1999693] INFO -- : building spec/ruby/optional/capi/ext/module_spec.so I, [2024-05-19T00:41:26.358386 #1999693] INFO -- : building spec/ruby/optional/capi/ext/module_under_autoload_spec.so I, [2024-05-19T00:41:26.359906 #1999693] INFO -- : building spec/ruby/optional/capi/ext/mutex_spec.so I, [2024-05-19T00:41:26.373616 #1999693] INFO -- : building spec/ruby/optional/capi/ext/numeric_spec.so I, [2024-05-19T00:41:26.374051 #1999693] INFO -- : building spec/ruby/optional/capi/ext/object_spec.so I, [2024-05-19T00:41:26.375124 #1999693] INFO -- : building spec/ruby/optional/capi/ext/proc_spec.so I, [2024-05-19T00:41:26.379282 #1999693] INFO -- : building spec/ruby/optional/capi/ext/range_spec.so I, [2024-05-19T00:41:26.389984 #1999693] INFO -- : building spec/ruby/optional/capi/ext/rational_spec.so I, [2024-05-19T00:41:26.419139 #1999693] INFO -- : building spec/ruby/optional/capi/ext/rbasic_spec.so I, [2024-05-19T00:41:26.426174 #1999693] INFO -- : building spec/ruby/optional/capi/ext/regexp_spec.so I, [2024-05-19T00:41:26.459218 #1999693] INFO -- : building spec/ruby/optional/capi/ext/string_spec.so I, [2024-05-19T00:41:26.481769 #1999693] INFO -- : building spec/ruby/optional/capi/ext/struct_spec.so I, [2024-05-19T00:41:26.488802 #1999693] INFO -- : building spec/ruby/optional/capi/ext/st_spec.so I, [2024-05-19T00:41:26.493782 #1999693] INFO -- : building spec/ruby/optional/capi/ext/symbol_spec.so I, [2024-05-19T00:41:26.494286 #1999693] INFO -- : building spec/ruby/optional/capi/ext/thread_spec.so I, [2024-05-19T00:41:26.496604 #1999693] INFO -- : building spec/ruby/optional/capi/ext/time_spec.so I, [2024-05-19T00:41:26.505595 #1999693] INFO -- : building spec/ruby/optional/capi/ext/tracepoint_spec.so I, [2024-05-19T00:41:26.509006 #1999693] INFO -- : building spec/ruby/optional/capi/ext/typed_data_spec.so I, [2024-05-19T00:41:26.522867 #1999693] INFO -- : building spec/ruby/optional/capi/ext/util_spec.so I, [2024-05-19T00:41:26.528715 #1999693] INFO -- : making enc I, [2024-05-19T00:41:26.534943 #1999693] INFO -- : making srcs under enc I, [2024-05-19T00:41:26.556724 #1999693] INFO -- : make[1]: Entering directory '/tmp/ruby/build/trunk' I, [2024-05-19T00:41:26.556790 #1999693] INFO -- : make[1]: Nothing to be done for 'enc'. I, [2024-05-19T00:41:26.556804 #1999693] INFO -- : make[1]: Leaving directory '/tmp/ruby/build/trunk' I, [2024-05-19T00:41:26.583152 #1999693] INFO -- : make[1]: Entering directory '/tmp/ruby/build/trunk' I, [2024-05-19T00:41:26.583213 #1999693] INFO -- : make[1]: Nothing to be done for 'srcs'. I, [2024-05-19T00:41:26.583224 #1999693] INFO -- : make[1]: Leaving directory '/tmp/ruby/build/trunk' I, [2024-05-19T00:41:26.583971 #1999693] INFO -- : generating transdb.h I, [2024-05-19T00:41:26.691264 #1999693] INFO -- : transdb.h unchanged I, [2024-05-19T00:41:26.692405 #1999693] INFO -- : generating makefiles ext/configure-ext.mk I, [2024-05-19T00:41:26.692583 #1999693] INFO -- : making trans I, [2024-05-19T00:41:26.719147 #1999693] INFO -- : ext/configure-ext.mk updated I, [2024-05-19T00:41:26.721515 #1999693] INFO -- : make[1]: Entering directory '/tmp/ruby/build/trunk' I, [2024-05-19T00:41:26.726700 #1999693] INFO -- : make[1]: Entering directory '/tmp/ruby/build/trunk' I, [2024-05-19T00:41:26.726801 #1999693] INFO -- : make[1]: Nothing to be done for 'trans'. I, [2024-05-19T00:41:26.726812 #1999693] INFO -- : make[1]: Leaving directory '/tmp/ruby/build/trunk' I, [2024-05-19T00:41:26.727727 #1999693] INFO -- : making encs I, [2024-05-19T00:41:26.786575 #1999693] INFO -- : make[1]: Entering directory '/tmp/ruby/build/trunk' I, [2024-05-19T00:41:26.786649 #1999693] INFO -- : make[1]: Nothing to be done for 'encs'. I, [2024-05-19T00:41:26.787654 #1999693] INFO -- : make[1]: Leaving directory '/tmp/ruby/build/trunk' I, [2024-05-19T00:41:26.877735 #1999693] INFO -- : make[1]: Leaving directory '/tmp/ruby/build/trunk' I, [2024-05-19T00:41:26.878546 #1999693] INFO -- : generating makefile exts.mk I, [2024-05-19T00:41:26.915215 #1999693] INFO -- : exts.mk unchanged I, [2024-05-19T00:41:26.919606 #1999693] INFO -- : make[1]: Entering directory '/tmp/ruby/build/trunk' I, [2024-05-19T00:41:26.962006 #1999693] INFO -- : make[2]: Entering directory '/tmp/ruby/build/trunk/ext/digest' I, [2024-05-19T00:41:26.964110 #1999693] INFO -- : make[2]: Entering directory '/tmp/ruby/build/trunk/ext/coverage' I, [2024-05-19T00:41:26.964941 #1999693] INFO -- : make[2]: Entering directory '/tmp/ruby/build/trunk/ext/json' I, [2024-05-19T00:41:26.965066 #1999693] INFO -- : make[2]: Entering directory '/tmp/ruby/build/trunk/ext/io/console' I, [2024-05-19T00:41:26.965827 #1999693] INFO -- : make[2]: Entering directory '/tmp/ruby/build/trunk/ext/date' I, [2024-05-19T00:41:26.966665 #1999693] INFO -- : make[2]: Entering directory '/tmp/ruby/build/trunk/ext/rubyvm' I, [2024-05-19T00:41:26.968282 #1999693] INFO -- : make[2]: Entering directory '/tmp/ruby/build/trunk/ext/monitor' I, [2024-05-19T00:41:26.968620 #1999693] INFO -- : make[2]: Entering directory '/tmp/ruby/build/trunk/ext/pathname' I, [2024-05-19T00:41:26.969185 #1999693] INFO -- : make[2]: Entering directory '/tmp/ruby/build/trunk/ext/pty' I, [2024-05-19T00:41:26.969668 #1999693] INFO -- : make[2]: Entering directory '/tmp/ruby/build/trunk/ext/fiddle' I, [2024-05-19T00:41:26.970234 #1999693] INFO -- : make[2]: Leaving directory '/tmp/ruby/build/trunk/ext/coverage' I, [2024-05-19T00:41:26.970268 #1999693] INFO -- : make[2]: Leaving directory '/tmp/ruby/build/trunk/ext/io/console' I, [2024-05-19T00:41:26.970280 #1999693] INFO -- : make[2]: Leaving directory '/tmp/ruby/build/trunk/ext/rubyvm' I, [2024-05-19T00:41:26.971600 #1999693] INFO -- : make[2]: Entering directory '/tmp/ruby/build/trunk/ext/objspace' I, [2024-05-19T00:41:26.971767 #1999693] INFO -- : make[2]: Entering directory '/tmp/ruby/build/trunk/ext/psych' I, [2024-05-19T00:41:26.972281 #1999693] INFO -- : make[2]: Leaving directory '/tmp/ruby/build/trunk/ext/monitor' I, [2024-05-19T00:41:26.972312 #1999693] INFO -- : make[2]: Leaving directory '/tmp/ruby/build/trunk/ext/date' I, [2024-05-19T00:41:26.972396 #1999693] INFO -- : make[2]: Leaving directory '/tmp/ruby/build/trunk/ext/pathname' I, [2024-05-19T00:41:26.972704 #1999693] INFO -- : make[2]: Entering directory '/tmp/ruby/build/trunk/.bundle/gems/bigdecimal-3.1.8/ext/bigdecimal' I, [2024-05-19T00:41:26.973418 #1999693] INFO -- : make[2]: Entering directory '/tmp/ruby/build/trunk/.bundle/gems/debug-1.9.2/ext/debug' I, [2024-05-19T00:41:26.973461 #1999693] INFO -- : make[2]: Entering directory '/tmp/ruby/build/trunk/.bundle/gems/nkf-0.2.0/ext/nkf' I, [2024-05-19T00:41:26.973509 #1999693] INFO -- : make[2]: Leaving directory '/tmp/ruby/build/trunk/ext/pty' I, [2024-05-19T00:41:26.973721 #1999693] INFO -- : make[2]: Entering directory '/tmp/ruby/build/trunk/.bundle/gems/racc-1.7.3/ext/racc/cparse' I, [2024-05-19T00:41:26.974698 #1999693] INFO -- : make[2]: Entering directory '/tmp/ruby/build/trunk/ext/ripper' I, [2024-05-19T00:41:26.975217 #1999693] INFO -- : make[2]: Entering directory '/tmp/ruby/build/trunk/.bundle/gems/rbs-3.4.4/ext/rbs_extension' I, [2024-05-19T00:41:26.977220 #1999693] INFO -- : make[2]: Entering directory '/tmp/ruby/build/trunk/.bundle/gems/syslog-0.1.2/ext/syslog' I, [2024-05-19T00:41:26.977363 #1999693] INFO -- : make[2]: Leaving directory '/tmp/ruby/build/trunk/ext/digest' I, [2024-05-19T00:41:26.977914 #1999693] INFO -- : make[2]: Leaving directory '/tmp/ruby/build/trunk/ext/fiddle' I, [2024-05-19T00:41:26.978059 #1999693] INFO -- : make[2]: Leaving directory '/tmp/ruby/build/trunk/ext/objspace' I, [2024-05-19T00:41:26.978357 #1999693] INFO -- : make[2]: Leaving directory '/tmp/ruby/build/trunk/ext/json' I, [2024-05-19T00:41:26.980045 #1999693] INFO -- : make[2]: Leaving directory '/tmp/ruby/build/trunk/ext/ripper' I, [2024-05-19T00:41:26.980497 #1999693] INFO -- : make[2]: Entering directory '/tmp/ruby/build/trunk/ext/socket' I, [2024-05-19T00:41:26.982550 #1999693] INFO -- : make[2]: Entering directory '/tmp/ruby/build/trunk/ext/digest/sha2' I, [2024-05-19T00:41:26.982677 #1999693] INFO -- : make[2]: Entering directory '/tmp/ruby/build/trunk/ext/openssl' I, [2024-05-19T00:41:26.985758 #1999693] INFO -- : make[2]: Leaving directory '/tmp/ruby/build/trunk/ext/digest/sha2' I, [2024-05-19T00:41:26.986477 #1999693] INFO -- : make[2]: Leaving directory '/tmp/ruby/build/trunk/ext/socket' I, [2024-05-19T00:41:26.987168 #1999693] INFO -- : make[2]: Leaving directory '/tmp/ruby/build/trunk/ext/psych' I, [2024-05-19T00:41:26.993836 #1999693] INFO -- : make[2]: Leaving directory '/tmp/ruby/build/trunk/ext/openssl' I, [2024-05-19T00:41:26.997724 #1999693] INFO -- : make[2]: Leaving directory '/tmp/ruby/build/trunk/.bundle/gems/nkf-0.2.0/ext/nkf' I, [2024-05-19T00:41:26.998473 #1999693] INFO -- : make[2]: Leaving directory '/tmp/ruby/build/trunk/.bundle/gems/debug-1.9.2/ext/debug' I, [2024-05-19T00:41:26.998976 #1999693] INFO -- : make[2]: Leaving directory '/tmp/ruby/build/trunk/.bundle/gems/racc-1.7.3/ext/racc/cparse' I, [2024-05-19T00:41:27.001309 #1999693] INFO -- : make[2]: Leaving directory '/tmp/ruby/build/trunk/.bundle/gems/rbs-3.4.4/ext/rbs_extension' I, [2024-05-19T00:41:27.003026 #1999693] INFO -- : make[2]: Leaving directory '/tmp/ruby/build/trunk/.bundle/gems/bigdecimal-3.1.8/ext/bigdecimal' I, [2024-05-19T00:41:27.007703 #1999693] INFO -- : make[2]: Leaving directory '/tmp/ruby/build/trunk/.bundle/gems/syslog-0.1.2/ext/syslog' I, [2024-05-19T00:41:27.031618 #1999693] INFO -- : make[2]: Entering directory '/tmp/ruby/build/trunk' I, [2024-05-19T00:41:27.102666 #1999693] INFO -- : linking ruby I, [2024-05-19T00:41:27.125777 #1999693] INFO -- : make[2]: Leaving directory '/tmp/ruby/build/trunk' I, [2024-05-19T00:41:27.126291 #1999693] INFO -- : make[1]: Leaving directory '/tmp/ruby/build/trunk' I, [2024-05-19T00:41:27.129750 #1999693] INFO -- : make[1]: Entering directory '/tmp/ruby/build/trunk' I, [2024-05-19T00:41:27.129779 #1999693] INFO -- : make[1]: Nothing to be done for 'note'. I, [2024-05-19T00:41:27.129785 #1999693] INFO -- : make[1]: Leaving directory '/tmp/ruby/build/trunk' I, [2024-05-19T00:41:27.130316 #1999693] INFO -- : $$$[end] "make all -j20" exit with 0. I, [2024-05-19T00:41:27.130504 #1999693] INFO -- : $$$[beg] make install -j20 I, [2024-05-19T00:41:27.206609 #1999693] INFO -- : Update power_assert to 84e85124c5014a139af39161d484156cfe87a9ed I, [2024-05-19T00:41:27.206850 #1999693] INFO -- : Update rbs to ba7872795d5de04adb8ff500c0e6afdc81a041dd I, [2024-05-19T00:41:27.207309 #1999693] INFO -- : Update typeprof to b19a6416da3a05d57fadd6ffdadb382b6d236ca5 I, [2024-05-19T00:41:27.208369 #1999693] INFO -- : echo 84e85124c5014a139af39161d484156cfe87a9ed | /bin/sh /tmp/ruby/src/trunk/tool/ifchange /tmp/ruby/src/trunk/.bundle/.timestamp/power_assert.revision - I, [2024-05-19T00:41:27.209405 #1999693] INFO -- : BASERUBY = /usr/bin/ruby --disable=gems I, [2024-05-19T00:41:27.209461 #1999693] INFO -- : CC = gcc I, [2024-05-19T00:41:27.209478 #1999693] INFO -- : LD = ld I, [2024-05-19T00:41:27.209492 #1999693] INFO -- : LDSHARED = gcc -shared I, [2024-05-19T00:41:27.209510 #1999693] INFO -- : CFLAGS = -O3 -fno-fast-math -ggdb3 -Wall -Wextra -Wdeprecated-declarations -Wdiv-by-zero -Wduplicated-cond -Wimplicit-function-declaration -Wimplicit-int -Wpointer-arith -Wwrite-strings -Wold-style-definition -Wimplicit-fallthrough=0 -Wmissing-noreturn -Wno-cast-function-type -Wno-constant-logical-operand -Wno-long-long -Wno-missing-field-initializers -Wno-overlength-strings -Wno-packed-bitfield-compat -Wno-parentheses-equality -Wno-self-assign -Wno-tautological-compare -Wno-unused-parameter -Wno-unused-value -Wsuggest-attribute=format -Wsuggest-attribute=noreturn -Wunused-variable -Wmisleading-indentation -Wundef -fPIC I, [2024-05-19T00:41:27.209524 #1999693] INFO -- : XCFLAGS = -U_FORTIFY_SOURCE -D_FORTIFY_SOURCE=2 -fstack-protector-strong -fno-strict-overflow -fvisibility=hidden -fexcess-precision=standard -DRUBY_EXPORT -I. -I.ext/include/x86_64-linux -I/tmp/ruby/src/trunk/include -I/tmp/ruby/src/trunk -I/tmp/ruby/src/trunk/prism -I/tmp/ruby/src/trunk/enc/unicode/15.0.0 I, [2024-05-19T00:41:27.209539 #1999693] INFO -- : CPPFLAGS = I, [2024-05-19T00:41:27.209552 #1999693] INFO -- : DLDFLAGS = -Wl,--compress-debug-sections=zlib -Wl,-soname,libruby.so.3.4 -fstack-protector-strong I, [2024-05-19T00:41:27.209569 #1999693] INFO -- : SOLIBS = -lz -lrt -lrt -lgmp -ldl -lcrypt -lm -lpthread I, [2024-05-19T00:41:27.209582 #1999693] INFO -- : LANG = en_US.UTF-8 I, [2024-05-19T00:41:27.209594 #1999693] INFO -- : LC_ALL = I, [2024-05-19T00:41:27.209606 #1999693] INFO -- : LC_CTYPE = I, [2024-05-19T00:41:27.209619 #1999693] INFO -- : MFLAGS = -j20 --jobserver-auth=4,5 I, [2024-05-19T00:41:27.209632 #1999693] INFO -- : RUSTC = no I, [2024-05-19T00:41:27.209645 #1999693] INFO -- : YJIT_RUSTC_ARGS = --crate-name=yjit --crate-type=staticlib --edition=2021 -g -C lto=thin -C opt-level=3 -C overflow-checks=on '--out-dir=/tmp/ruby/build/trunk/yjit/target/release/' /tmp/ruby/src/trunk/yjit/src/lib.rs I, [2024-05-19T00:41:27.211070 #1999693] INFO -- : /tmp/ruby/src/trunk/.bundle/.timestamp/power_assert.revision unchanged I, [2024-05-19T00:41:27.240681 #1999693] INFO -- : echo ba7872795d5de04adb8ff500c0e6afdc81a041dd | /bin/sh /tmp/ruby/src/trunk/tool/ifchange /tmp/ruby/src/trunk/.bundle/.timestamp/rbs.revision - I, [2024-05-19T00:41:27.240815 #1999693] INFO -- : echo b19a6416da3a05d57fadd6ffdadb382b6d236ca5 | /bin/sh /tmp/ruby/src/trunk/tool/ifchange /tmp/ruby/src/trunk/.bundle/.timestamp/typeprof.revision - I, [2024-05-19T00:41:27.241625 #1999693] INFO -- : gcc (Ubuntu 11.4.0-1ubuntu1~22.04) 11.4.0 I, [2024-05-19T00:41:27.241674 #1999693] INFO -- : Copyright (C) 2021 Free Software Foundation, Inc. I, [2024-05-19T00:41:27.241687 #1999693] INFO -- : This is free software; see the source for copying conditions. There is NO I, [2024-05-19T00:41:27.241700 #1999693] INFO -- : warranty; not even for MERCHANTABILITY or FITNESS FOR A PARTICULAR PURPOSE. I, [2024-05-19T00:41:27.241721 #1999693] INFO -- : I, [2024-05-19T00:41:27.241735 #1999693] INFO -- : generating enc.mk I, [2024-05-19T00:41:27.242640 #1999693] INFO -- : /tmp/ruby/src/trunk/.bundle/.timestamp/rbs.revision unchanged I, [2024-05-19T00:41:27.242859 #1999693] INFO -- : /tmp/ruby/src/trunk/.bundle/.timestamp/typeprof.revision unchanged I, [2024-05-19T00:41:27.366471 #1999693] INFO -- : Building power_assert@84e85124c5014a139af39161d484156cfe87a9ed to /tmp/ruby/src/trunk/gems/power_assert-2.0.3.gem I, [2024-05-19T00:41:27.367147 #1999693] INFO -- : making srcs under enc I, [2024-05-19T00:41:27.367383 #1999693] INFO -- : making enc I, [2024-05-19T00:41:27.384469 #1999693] INFO -- : make[1]: Entering directory '/tmp/ruby/build/trunk' I, [2024-05-19T00:41:27.384534 #1999693] INFO -- : make[1]: Nothing to be done for 'enc'. I, [2024-05-19T00:41:27.384548 #1999693] INFO -- : make[1]: Leaving directory '/tmp/ruby/build/trunk' I, [2024-05-19T00:41:27.397423 #1999693] INFO -- : make[1]: Entering directory '/tmp/ruby/build/trunk' I, [2024-05-19T00:41:27.397483 #1999693] INFO -- : make[1]: Nothing to be done for 'srcs'. I, [2024-05-19T00:41:27.397496 #1999693] INFO -- : make[1]: Leaving directory '/tmp/ruby/build/trunk' I, [2024-05-19T00:41:27.398203 #1999693] INFO -- : generating transdb.h I, [2024-05-19T00:41:27.435715 #1999693] INFO -- : Successfully built RubyGem I, [2024-05-19T00:41:27.435776 #1999693] INFO -- : Name: power_assert I, [2024-05-19T00:41:27.435789 #1999693] INFO -- : Version: 2.0.4dev I, [2024-05-19T00:41:27.435801 #1999693] INFO -- : File: power_assert-2.0.4dev.gem I, [2024-05-19T00:41:27.438109 #1999693] INFO -- : Extracting bundle gem power_assert-2.0.3... I, [2024-05-19T00:41:27.495093 #1999693] INFO -- : transdb.h unchanged I, [2024-05-19T00:41:27.496616 #1999693] INFO -- : generating makefiles ext/configure-ext.mk I, [2024-05-19T00:41:27.497021 #1999693] INFO -- : making trans I, [2024-05-19T00:41:27.500596 #1999693] INFO -- : Try with hash version of bundled gems instead of gems/power_assert-2.0.3.gem. We don't use this gem with release version of Ruby. I, [2024-05-19T00:41:27.505587 #1999693] INFO -- : Unpacked gems/power_assert-2.0.4dev.gem I, [2024-05-19T00:41:27.524068 #1999693] INFO -- : ext/configure-ext.mk unchanged I, [2024-05-19T00:41:27.526655 #1999693] INFO -- : make[1]: Entering directory '/tmp/ruby/build/trunk' I, [2024-05-19T00:41:27.531029 #1999693] INFO -- : make[1]: Entering directory '/tmp/ruby/build/trunk' I, [2024-05-19T00:41:27.531126 #1999693] INFO -- : make[1]: Nothing to be done for 'trans'. I, [2024-05-19T00:41:27.531138 #1999693] INFO -- : make[1]: Leaving directory '/tmp/ruby/build/trunk' I, [2024-05-19T00:41:27.594379 #1999693] INFO -- : making encs I, [2024-05-19T00:41:27.637991 #1999693] INFO -- : make[1]: Entering directory '/tmp/ruby/build/trunk' I, [2024-05-19T00:41:27.638048 #1999693] INFO -- : make[1]: Nothing to be done for 'encs'. I, [2024-05-19T00:41:27.638062 #1999693] INFO -- : make[1]: Leaving directory '/tmp/ruby/build/trunk' I, [2024-05-19T00:41:27.679460 #1999693] INFO -- : make[1]: Leaving directory '/tmp/ruby/build/trunk' I, [2024-05-19T00:41:27.679948 #1999693] INFO -- : generating makefile exts.mk I, [2024-05-19T00:41:27.716665 #1999693] INFO -- : exts.mk unchanged I, [2024-05-19T00:41:27.721805 #1999693] INFO -- : make[1]: Entering directory '/tmp/ruby/build/trunk' I, [2024-05-19T00:41:27.740291 #1999693] INFO -- : make[2]: Entering directory '/tmp/ruby/build/trunk/ext/digest' I, [2024-05-19T00:41:27.741707 #1999693] INFO -- : make[2]: Entering directory '/tmp/ruby/build/trunk/ext/coverage' I, [2024-05-19T00:41:27.741971 #1999693] INFO -- : make[2]: Entering directory '/tmp/ruby/build/trunk/ext/json' I, [2024-05-19T00:41:27.742417 #1999693] INFO -- : make[2]: Entering directory '/tmp/ruby/build/trunk/ext/date' I, [2024-05-19T00:41:27.742714 #1999693] INFO -- : make[2]: Entering directory '/tmp/ruby/build/trunk/ext/io/console' I, [2024-05-19T00:41:27.743843 #1999693] INFO -- : make[2]: Entering directory '/tmp/ruby/build/trunk/ext/rubyvm' I, [2024-05-19T00:41:27.744001 #1999693] INFO -- : make[2]: Entering directory '/tmp/ruby/build/trunk/ext/monitor' I, [2024-05-19T00:41:27.744176 #1999693] INFO -- : make[2]: Leaving directory '/tmp/ruby/build/trunk/ext/digest' I, [2024-05-19T00:41:27.744878 #1999693] INFO -- : make[2]: Entering directory '/tmp/ruby/build/trunk/ext/fiddle' I, [2024-05-19T00:41:27.744967 #1999693] INFO -- : make[2]: Entering directory '/tmp/ruby/build/trunk/ext/pathname' I, [2024-05-19T00:41:27.745332 #1999693] INFO -- : make[2]: Entering directory '/tmp/ruby/build/trunk/ext/pty' I, [2024-05-19T00:41:27.745462 #1999693] INFO -- : make[2]: Leaving directory '/tmp/ruby/build/trunk/ext/coverage' I, [2024-05-19T00:41:27.745955 #1999693] INFO -- : make[2]: Leaving directory '/tmp/ruby/build/trunk/ext/rubyvm' I, [2024-05-19T00:41:27.746122 #1999693] INFO -- : make[2]: Leaving directory '/tmp/ruby/build/trunk/ext/io/console' I, [2024-05-19T00:41:27.746580 #1999693] INFO -- : make[2]: Leaving directory '/tmp/ruby/build/trunk/ext/date' I, [2024-05-19T00:41:27.746701 #1999693] INFO -- : make[2]: Entering directory '/tmp/ruby/build/trunk/ext/objspace' I, [2024-05-19T00:41:27.747095 #1999693] INFO -- : make[2]: Entering directory '/tmp/ruby/build/trunk/.bundle/gems/bigdecimal-3.1.8/ext/bigdecimal' I, [2024-05-19T00:41:27.747204 #1999693] INFO -- : make[2]: Leaving directory '/tmp/ruby/build/trunk/ext/monitor' I, [2024-05-19T00:41:27.747275 #1999693] INFO -- : make[2]: Entering directory '/tmp/ruby/build/trunk/ext/psych' I, [2024-05-19T00:41:27.747949 #1999693] INFO -- : make[2]: Entering directory '/tmp/ruby/build/trunk/.bundle/gems/debug-1.9.2/ext/debug' I, [2024-05-19T00:41:27.748132 #1999693] INFO -- : make[2]: Entering directory '/tmp/ruby/build/trunk/.bundle/gems/nkf-0.2.0/ext/nkf' I, [2024-05-19T00:41:27.748273 #1999693] INFO -- : make[2]: Leaving directory '/tmp/ruby/build/trunk/ext/pathname' I, [2024-05-19T00:41:27.748574 #1999693] INFO -- : make[2]: Leaving directory '/tmp/ruby/build/trunk/ext/pty' I, [2024-05-19T00:41:27.749718 #1999693] INFO -- : make[2]: Entering directory '/tmp/ruby/build/trunk/.bundle/gems/racc-1.7.3/ext/racc/cparse' I, [2024-05-19T00:41:27.749943 #1999693] INFO -- : make[2]: Entering directory '/tmp/ruby/build/trunk/.bundle/gems/syslog-0.1.2/ext/syslog' I, [2024-05-19T00:41:27.750224 #1999693] INFO -- : make[2]: Entering directory '/tmp/ruby/build/trunk/ext/ripper' I, [2024-05-19T00:41:27.750395 #1999693] INFO -- : make[2]: Leaving directory '/tmp/ruby/build/trunk/ext/json' I, [2024-05-19T00:41:27.750566 #1999693] INFO -- : make[2]: Entering directory '/tmp/ruby/build/trunk/.bundle/gems/rbs-3.4.4/ext/rbs_extension' I, [2024-05-19T00:41:27.750937 #1999693] INFO -- : make[2]: Leaving directory '/tmp/ruby/build/trunk/ext/objspace' I, [2024-05-19T00:41:27.752355 #1999693] INFO -- : make[2]: Leaving directory '/tmp/ruby/build/trunk/ext/fiddle' I, [2024-05-19T00:41:27.754045 #1999693] INFO -- : make[2]: Entering directory '/tmp/ruby/build/trunk/ext/socket' I, [2024-05-19T00:41:27.755637 #1999693] INFO -- : make[2]: Leaving directory '/tmp/ruby/build/trunk/ext/ripper' I, [2024-05-19T00:41:27.756176 #1999693] INFO -- : make[2]: Entering directory '/tmp/ruby/build/trunk/ext/openssl' I, [2024-05-19T00:41:27.756371 #1999693] INFO -- : make[2]: Leaving directory '/tmp/ruby/build/trunk/ext/psych' I, [2024-05-19T00:41:27.756581 #1999693] INFO -- : make[2]: Entering directory '/tmp/ruby/build/trunk/ext/digest/sha2' I, [2024-05-19T00:41:27.758860 #1999693] INFO -- : make[2]: Leaving directory '/tmp/ruby/build/trunk/ext/digest/sha2' I, [2024-05-19T00:41:27.761802 #1999693] INFO -- : make[2]: Leaving directory '/tmp/ruby/build/trunk/ext/socket' I, [2024-05-19T00:41:27.770804 #1999693] INFO -- : make[2]: Leaving directory '/tmp/ruby/build/trunk/.bundle/gems/bigdecimal-3.1.8/ext/bigdecimal' I, [2024-05-19T00:41:27.771782 #1999693] INFO -- : make[2]: Leaving directory '/tmp/ruby/build/trunk/ext/openssl' I, [2024-05-19T00:41:27.773763 #1999693] INFO -- : make[2]: Leaving directory '/tmp/ruby/build/trunk/.bundle/gems/nkf-0.2.0/ext/nkf' I, [2024-05-19T00:41:27.774513 #1999693] INFO -- : make[2]: Leaving directory '/tmp/ruby/build/trunk/.bundle/gems/racc-1.7.3/ext/racc/cparse' I, [2024-05-19T00:41:27.782011 #1999693] INFO -- : make[2]: Leaving directory '/tmp/ruby/build/trunk/.bundle/gems/syslog-0.1.2/ext/syslog' I, [2024-05-19T00:41:27.782044 #1999693] INFO -- : make[2]: Leaving directory '/tmp/ruby/build/trunk/.bundle/gems/debug-1.9.2/ext/debug' I, [2024-05-19T00:41:27.782604 #1999693] INFO -- : make[2]: Leaving directory '/tmp/ruby/build/trunk/.bundle/gems/rbs-3.4.4/ext/rbs_extension' I, [2024-05-19T00:41:27.808085 #1999693] INFO -- : make[2]: Entering directory '/tmp/ruby/build/trunk' I, [2024-05-19T00:41:27.877553 #1999693] INFO -- : make[2]: 'ruby' is up to date. I, [2024-05-19T00:41:27.877588 #1999693] INFO -- : make[2]: Leaving directory '/tmp/ruby/build/trunk' I, [2024-05-19T00:41:27.877855 #1999693] INFO -- : make[1]: Leaving directory '/tmp/ruby/build/trunk' I, [2024-05-19T00:41:27.881351 #1999693] INFO -- : make[1]: Entering directory '/tmp/ruby/build/trunk' I, [2024-05-19T00:41:27.881376 #1999693] INFO -- : make[1]: Nothing to be done for 'note'. I, [2024-05-19T00:41:27.881382 #1999693] INFO -- : make[1]: Leaving directory '/tmp/ruby/build/trunk' I, [2024-05-19T00:41:27.881671 #1999693] INFO -- : ./miniruby -I/tmp/ruby/src/trunk/lib -I. -I.ext/common /tmp/ruby/src/trunk/tool/runruby.rb --extout=.ext -- --disable-gems -r./x86_64-linux-fake /tmp/ruby/src/trunk/tool/rbinstall.rb --make="make" --dest-dir="" --extout=".ext" --ext-build-dir="./ext" --mflags="-j20 --jobserver-auth=4,5" --make-flags=" -j20 --jobserver-auth=4,5" --data-mode=0644 --prog-mode=0755 --installed-list .installed.list --mantype="doc" --gnumake --install=all --exclude=doc I, [2024-05-19T00:41:27.977971 #1999693] INFO -- : Installing to I, [2024-05-19T00:41:27.978018 #1999693] INFO -- : installing binary commands: /tmp/ruby/install/trunk/bin I, [2024-05-19T00:41:27.978026 #1999693] INFO -- : installing base libraries: /tmp/ruby/install/trunk/lib I, [2024-05-19T00:41:27.985125 #1999693] INFO -- : installing arch files: /tmp/ruby/install/trunk/lib/ruby/3.4.0+0/x86_64-linux I, [2024-05-19T00:41:27.985156 #1999693] INFO -- : installing pkgconfig data: /tmp/ruby/install/trunk/lib/pkgconfig I, [2024-05-19T00:41:27.985167 #1999693] INFO -- : installing extension objects: /tmp/ruby/install/trunk/lib/ruby/3.4.0+0/x86_64-linux I, [2024-05-19T00:41:27.994610 #1999693] INFO -- : installing extension objects: /tmp/ruby/install/trunk/lib/ruby/site_ruby/3.4.0+0/x86_64-linux I, [2024-05-19T00:41:27.994633 #1999693] INFO -- : installing extension objects: /tmp/ruby/install/trunk/lib/ruby/vendor_ruby/3.4.0+0/x86_64-linux I, [2024-05-19T00:41:27.994640 #1999693] INFO -- : installing extension headers: /tmp/ruby/install/trunk/include/ruby-3.4.0+0/x86_64-linux I, [2024-05-19T00:41:27.994792 #1999693] INFO -- : installing extension scripts: /tmp/ruby/install/trunk/lib/ruby/3.4.0+0 I, [2024-05-19T00:41:27.997500 #1999693] INFO -- : installing extension scripts: /tmp/ruby/install/trunk/lib/ruby/site_ruby/3.4.0+0 I, [2024-05-19T00:41:27.997525 #1999693] INFO -- : installing extension scripts: /tmp/ruby/install/trunk/lib/ruby/vendor_ruby/3.4.0+0 I, [2024-05-19T00:41:27.997532 #1999693] INFO -- : installing extension headers: /tmp/ruby/install/trunk/include/ruby-3.4.0+0/ruby I, [2024-05-19T00:41:27.997536 #1999693] INFO -- : installing command scripts: /tmp/ruby/install/trunk/bin I, [2024-05-19T00:41:27.997540 #1999693] INFO -- : installing library scripts: /tmp/ruby/install/trunk/lib/ruby/3.4.0+0 I, [2024-05-19T00:41:28.030164 #1999693] INFO -- : installing common headers: /tmp/ruby/install/trunk/include/ruby-3.4.0+0 I, [2024-05-19T00:41:28.036749 #1999693] INFO -- : installing manpages: /tmp/ruby/install/trunk/share/man/man1 I, [2024-05-19T00:41:28.036781 #1999693] INFO -- : installing default gems from lib: /tmp/ruby/install/trunk/lib/ruby/gems/3.4.0+0 I, [2024-05-19T00:41:28.059544 #1999693] INFO -- : benchmark 0.3.0 I, [2024-05-19T00:41:28.061463 #1999693] INFO -- : bundler 2.6.0.dev I, [2024-05-19T00:41:28.063585 #1999693] INFO -- : cgi 0.4.1 I, [2024-05-19T00:41:28.064183 #1999693] INFO -- : delegate 0.3.1 I, [2024-05-19T00:41:28.064675 #1999693] INFO -- : did_you_mean 1.6.3 I, [2024-05-19T00:41:28.065163 #1999693] INFO -- : english 0.8.0 I, [2024-05-19T00:41:28.065629 #1999693] INFO -- : erb 4.0.4 I, [2024-05-19T00:41:28.066635 #1999693] INFO -- : error_highlight 0.6.0 I, [2024-05-19T00:41:28.067503 #1999693] INFO -- : fileutils 1.7.2 I, [2024-05-19T00:41:28.068375 #1999693] INFO -- : find 0.2.0 I, [2024-05-19T00:41:28.069080 #1999693] INFO -- : forwardable 1.3.3 I, [2024-05-19T00:41:28.070192 #1999693] INFO -- : ipaddr 1.2.6 I, [2024-05-19T00:41:28.070773 #1999693] INFO -- : irb 1.13.1 I, [2024-05-19T00:41:28.071560 #1999693] INFO -- : logger 1.6.0 I, [2024-05-19T00:41:28.072078 #1999693] INFO -- : net-http 0.4.1 I, [2024-05-19T00:41:28.072572 #1999693] INFO -- : net-protocol 0.2.2 I, [2024-05-19T00:41:28.073068 #1999693] INFO -- : open-uri 0.4.1 I, [2024-05-19T00:41:28.073568 #1999693] INFO -- : open3 0.2.1 I, [2024-05-19T00:41:28.073965 #1999693] INFO -- : optparse 0.5.0 I, [2024-05-19T00:41:28.074517 #1999693] INFO -- : ostruct 0.6.0 I, [2024-05-19T00:41:28.074873 #1999693] INFO -- : pp 0.5.0 I, [2024-05-19T00:41:28.075372 #1999693] INFO -- : prettyprint 0.2.0 I, [2024-05-19T00:41:28.075924 #1999693] INFO -- : prism 0.29.0 I, [2024-05-19T00:41:28.076425 #1999693] INFO -- : pstore 0.1.3 I, [2024-05-19T00:41:28.076890 #1999693] INFO -- : rdoc 6.6.3.1 I, [2024-05-19T00:41:28.077854 #1999693] INFO -- : readline 0.0.4 I, [2024-05-19T00:41:28.078374 #1999693] INFO -- : reline 0.5.7 I, [2024-05-19T00:41:28.078917 #1999693] INFO -- : resolv 0.4.0 I, [2024-05-19T00:41:28.079397 #1999693] INFO -- : ruby2_keywords 0.0.5 I, [2024-05-19T00:41:28.079893 #1999693] INFO -- : securerandom 0.3.1 I, [2024-05-19T00:41:28.080971 #1999693] INFO -- : set 1.1.0 I, [2024-05-19T00:41:28.081707 #1999693] INFO -- : shellwords 0.2.0 I, [2024-05-19T00:41:28.082181 #1999693] INFO -- : singleton 0.2.0 I, [2024-05-19T00:41:28.082644 #1999693] INFO -- : syntax_suggest 2.0.0 I, [2024-05-19T00:41:28.083343 #1999693] INFO -- : tempfile 0.2.1 I, [2024-05-19T00:41:28.083784 #1999693] INFO -- : time 0.3.0 I, [2024-05-19T00:41:28.084292 #1999693] INFO -- : timeout 0.4.1 I, [2024-05-19T00:41:28.084760 #1999693] INFO -- : tmpdir 0.2.0 I, [2024-05-19T00:41:28.085252 #1999693] INFO -- : tsort 0.2.0 I, [2024-05-19T00:41:28.085719 #1999693] INFO -- : un 0.3.0 I, [2024-05-19T00:41:28.086166 #1999693] INFO -- : uri 0.13.0 I, [2024-05-19T00:41:28.086699 #1999693] INFO -- : weakref 0.1.3 I, [2024-05-19T00:41:28.087171 #1999693] INFO -- : yaml 0.3.0 I, [2024-05-19T00:41:28.087482 #1999693] INFO -- : installing default gems from ext: /tmp/ruby/install/trunk/lib/ruby/gems/3.4.0+0 I, [2024-05-19T00:41:28.094069 #1999693] INFO -- : date 3.3.4 I, [2024-05-19T00:41:28.094605 #1999693] INFO -- : digest 3.1.1 I, [2024-05-19T00:41:28.095108 #1999693] INFO -- : etc 1.4.3 I, [2024-05-19T00:41:28.095622 #1999693] INFO -- : fcntl 1.1.0 I, [2024-05-19T00:41:28.096178 #1999693] INFO -- : fiddle 1.1.3 I, [2024-05-19T00:41:28.096659 #1999693] INFO -- : io-console 0.7.2 I, [2024-05-19T00:41:28.097076 #1999693] INFO -- : io-nonblock 0.3.0 I, [2024-05-19T00:41:28.097608 #1999693] INFO -- : io-wait 0.3.1 I, [2024-05-19T00:41:28.098112 #1999693] INFO -- : json 2.7.2 I, [2024-05-19T00:41:28.098584 #1999693] INFO -- : openssl 3.2.0 I, [2024-05-19T00:41:28.099165 #1999693] INFO -- : pathname 0.3.0 I, [2024-05-19T00:41:28.099638 #1999693] INFO -- : psych 5.1.2 I, [2024-05-19T00:41:28.100194 #1999693] INFO -- : stringio 3.1.1 I, [2024-05-19T00:41:28.100680 #1999693] INFO -- : strscan 3.1.1 I, [2024-05-19T00:41:28.101126 #1999693] INFO -- : zlib 3.1.0 I, [2024-05-19T00:41:28.101539 #1999693] INFO -- : installing bundled gems: /tmp/ruby/install/trunk/lib/ruby/gems/3.4.0+0 I, [2024-05-19T00:41:28.102082 #1999693] INFO -- : minitest 5.23.0 I, [2024-05-19T00:41:28.110498 #1999693] INFO -- : rake 13.2.1 I, [2024-05-19T00:41:28.114098 #1999693] INFO -- : test-unit 3.6.2 I, [2024-05-19T00:41:28.118946 #1999693] INFO -- : rexml 3.2.6 I, [2024-05-19T00:41:28.122754 #1999693] INFO -- : rss 0.3.0 I, [2024-05-19T00:41:28.125403 #1999693] INFO -- : net-ftp 0.3.4 I, [2024-05-19T00:41:28.127006 #1999693] INFO -- : net-imap 0.4.11 I, [2024-05-19T00:41:28.130777 #1999693] INFO -- : net-pop 0.1.2 I, [2024-05-19T00:41:28.131816 #1999693] INFO -- : net-smtp 0.5.0 I, [2024-05-19T00:41:28.132974 #1999693] INFO -- : matrix 0.4.2 I, [2024-05-19T00:41:28.136248 #1999693] INFO -- : prime 0.1.2 I, [2024-05-19T00:41:28.140962 #1999693] INFO -- : rbs 3.4.4 I, [2024-05-19T00:41:28.163563 #1999693] INFO -- : typeprof 0.21.11 I, [2024-05-19T00:41:28.165883 #1999693] INFO -- : debug 1.9.2 I, [2024-05-19T00:41:28.169242 #1999693] INFO -- : racc 1.7.3 I, [2024-05-19T00:41:28.171980 #1999693] INFO -- : mutex_m 0.2.0 I, [2024-05-19T00:41:28.173305 #1999693] INFO -- : getoptlong 0.2.1 I, [2024-05-19T00:41:28.174695 #1999693] INFO -- : base64 0.2.0 I, [2024-05-19T00:41:28.175929 #1999693] INFO -- : bigdecimal 3.1.8 I, [2024-05-19T00:41:28.178065 #1999693] INFO -- : observer 0.1.2 I, [2024-05-19T00:41:28.179694 #1999693] INFO -- : abbrev 0.1.2 I, [2024-05-19T00:41:28.180793 #1999693] INFO -- : resolv-replace 0.1.1 I, [2024-05-19T00:41:28.182258 #1999693] INFO -- : rinda 0.2.0 I, [2024-05-19T00:41:28.183583 #1999693] INFO -- : drb 2.2.1 I, [2024-05-19T00:41:28.185321 #1999693] INFO -- : nkf 0.2.0 I, [2024-05-19T00:41:28.187785 #1999693] INFO -- : syslog 0.1.2 I, [2024-05-19T00:41:28.189461 #1999693] INFO -- : csv 3.3.0 I, [2024-05-19T00:41:28.192232 #1999693] INFO -- : installing bundled gem cache: /tmp/ruby/install/trunk/lib/ruby/gems/3.4.0+0/cache I, [2024-05-19T00:41:28.193645 #1999693] INFO -- : skipped bundled gems: I, [2024-05-19T00:41:28.193666 #1999693] INFO -- : power_assert-2.0.4dev.gem not found in bundled_gems I, [2024-05-19T00:41:28.196807 #1999693] INFO -- : $$$[end] "make install -j20" exit with 0. I, [2024-05-19T00:41:28.196915 #1999693] INFO -- : $$$[beg] make yes-btest TESTOPTS='-q -j20' I, [2024-05-19T00:41:33.278986 #1999693] INFO -- : PASS all 1936 tests E, [2024-05-19T00:41:33.284134 #1999693] ERROR -- : I, [2024-05-19T00:41:33.284544 #1999693] INFO -- : $$$[end] "make yes-btest TESTOPTS='-q -j20'" exit with 0. I, [2024-05-19T00:41:33.284638 #1999693] INFO -- : $$$[beg] make yes-test-basic TESTS='-j20' I, [2024-05-19T00:41:33.346262 #1999693] INFO -- : BASERUBY = /usr/bin/ruby --disable=gems I, [2024-05-19T00:41:33.346307 #1999693] INFO -- : CC = gcc I, [2024-05-19T00:41:33.346321 #1999693] INFO -- : LD = ld I, [2024-05-19T00:41:33.346333 #1999693] INFO -- : LDSHARED = gcc -shared I, [2024-05-19T00:41:33.346346 #1999693] INFO -- : CFLAGS = -O3 -fno-fast-math -ggdb3 -Wall -Wextra -Wdeprecated-declarations -Wdiv-by-zero -Wduplicated-cond -Wimplicit-function-declaration -Wimplicit-int -Wpointer-arith -Wwrite-strings -Wold-style-definition -Wimplicit-fallthrough=0 -Wmissing-noreturn -Wno-cast-function-type -Wno-constant-logical-operand -Wno-long-long -Wno-missing-field-initializers -Wno-overlength-strings -Wno-packed-bitfield-compat -Wno-parentheses-equality -Wno-self-assign -Wno-tautological-compare -Wno-unused-parameter -Wno-unused-value -Wsuggest-attribute=format -Wsuggest-attribute=noreturn -Wunused-variable -Wmisleading-indentation -Wundef -fPIC I, [2024-05-19T00:41:33.346358 #1999693] INFO -- : XCFLAGS = -U_FORTIFY_SOURCE -D_FORTIFY_SOURCE=2 -fstack-protector-strong -fno-strict-overflow -fvisibility=hidden -fexcess-precision=standard -DRUBY_EXPORT -I. -I.ext/include/x86_64-linux -I/tmp/ruby/src/trunk/include -I/tmp/ruby/src/trunk -I/tmp/ruby/src/trunk/prism -I/tmp/ruby/src/trunk/enc/unicode/15.0.0 I, [2024-05-19T00:41:33.346370 #1999693] INFO -- : CPPFLAGS = I, [2024-05-19T00:41:33.346382 #1999693] INFO -- : DLDFLAGS = -Wl,--compress-debug-sections=zlib -Wl,-soname,libruby.so.3.4 -fstack-protector-strong I, [2024-05-19T00:41:33.346393 #1999693] INFO -- : SOLIBS = -lz -lrt -lrt -lgmp -ldl -lcrypt -lm -lpthread I, [2024-05-19T00:41:33.346404 #1999693] INFO -- : LANG = en_US.UTF-8 I, [2024-05-19T00:41:33.346415 #1999693] INFO -- : LC_ALL = I, [2024-05-19T00:41:33.346426 #1999693] INFO -- : LC_CTYPE = I, [2024-05-19T00:41:33.346436 #1999693] INFO -- : MFLAGS = I, [2024-05-19T00:41:33.346446 #1999693] INFO -- : RUSTC = no I, [2024-05-19T00:41:33.346456 #1999693] INFO -- : YJIT_RUSTC_ARGS = --crate-name=yjit --crate-type=staticlib --edition=2021 -g -C lto=thin -C opt-level=3 -C overflow-checks=on '--out-dir=/tmp/ruby/build/trunk/yjit/target/release/' /tmp/ruby/src/trunk/yjit/src/lib.rs I, [2024-05-19T00:41:33.346816 #1999693] INFO -- : gcc (Ubuntu 11.4.0-1ubuntu1~22.04) 11.4.0 I, [2024-05-19T00:41:33.346870 #1999693] INFO -- : Copyright (C) 2021 Free Software Foundation, Inc. I, [2024-05-19T00:41:33.346893 #1999693] INFO -- : This is free software; see the source for copying conditions. There is NO I, [2024-05-19T00:41:33.346906 #1999693] INFO -- : warranty; not even for MERCHANTABILITY or FITNESS FOR A PARTICULAR PURPOSE. I, [2024-05-19T00:41:33.346918 #1999693] INFO -- : I, [2024-05-19T00:41:33.456178 #1999693] INFO -- : Checking leaked global symbols...none I, [2024-05-19T00:41:33.496565 #1999693] INFO -- : /tmp/ruby/src/trunk/basictest/test.rb:assignment ....................................................................................................................................................................................................................................................................................................................................................................................OK 372 I, [2024-05-19T00:41:33.496643 #1999693] INFO -- : /tmp/ruby/src/trunk/basictest/test.rb:condition ..OK 2 I, [2024-05-19T00:41:33.496657 #1999693] INFO -- : /tmp/ruby/src/trunk/basictest/test.rb:if/unless ...OK 3 I, [2024-05-19T00:41:33.496668 #1999693] INFO -- : /tmp/ruby/src/trunk/basictest/test.rb:case .....OK 5 I, [2024-05-19T00:41:33.496816 #1999693] INFO -- : /tmp/ruby/src/trunk/basictest/test.rb:while/until ........OK 8 I, [2024-05-19T00:41:33.496870 #1999693] INFO -- : /tmp/ruby/src/trunk/basictest/test.rb:exception ..........OK 10 I, [2024-05-19T00:41:33.497130 #1999693] INFO -- : /tmp/ruby/src/trunk/basictest/test.rb:array .......................................OK 39 I, [2024-05-19T00:41:33.497226 #1999693] INFO -- : /tmp/ruby/src/trunk/basictest/test.rb:hash ...........................OK 27 I, [2024-05-19T00:41:33.497932 #1999693] INFO -- : /tmp/ruby/src/trunk/basictest/test.rb:iterator ...........................................................................................................OK 107 I, [2024-05-19T00:41:33.498203 #1999693] INFO -- : /tmp/ruby/src/trunk/basictest/test.rb:float ................................................................................OK 80 I, [2024-05-19T00:41:33.499197 #1999693] INFO -- : /tmp/ruby/src/trunk/basictest/test.rb:bignum ...............................OK 31 I, [2024-05-19T00:41:33.499985 #1999693] INFO -- : /tmp/ruby/src/trunk/basictest/test.rb:string & char ..............................................................OK 62 I, [2024-05-19T00:41:33.500026 #1999693] INFO -- : /tmp/ruby/src/trunk/basictest/test.rb:assignment ..........OK 10 I, [2024-05-19T00:41:33.500042 #1999693] INFO -- : /tmp/ruby/src/trunk/basictest/test.rb:call ......OK 6 I, [2024-05-19T00:41:33.500089 #1999693] INFO -- : /tmp/ruby/src/trunk/basictest/test.rb:proc .........OK 9 I, [2024-05-19T00:41:33.600664 #1999693] INFO -- : /tmp/ruby/src/trunk/basictest/test.rb:signal ..OK 2 I, [2024-05-19T00:41:33.602082 #1999693] INFO -- : /tmp/ruby/src/trunk/basictest/test.rb:eval ...........................OK 27 I, [2024-05-19T00:41:33.719298 #1999693] INFO -- : /tmp/ruby/src/trunk/basictest/test.rb:system ........OK 8 I, [2024-05-19T00:41:33.719397 #1999693] INFO -- : /tmp/ruby/src/trunk/basictest/test.rb:const .....OK 5 I, [2024-05-19T00:41:33.719412 #1999693] INFO -- : /tmp/ruby/src/trunk/basictest/test.rb:clone .....OK 5 I, [2024-05-19T00:41:33.719436 #1999693] INFO -- : /tmp/ruby/src/trunk/basictest/test.rb:marshal ....OK 4 I, [2024-05-19T00:41:33.719520 #1999693] INFO -- : /tmp/ruby/src/trunk/basictest/test.rb:pack ....OK 4 I, [2024-05-19T00:41:33.719554 #1999693] INFO -- : /tmp/ruby/src/trunk/basictest/test.rb:math ..OK 2 I, [2024-05-19T00:41:33.719570 #1999693] INFO -- : /tmp/ruby/src/trunk/basictest/test.rb:struct ......OK 6 I, [2024-05-19T00:41:33.719655 #1999693] INFO -- : /tmp/ruby/src/trunk/basictest/test.rb:variable ............OK 12 I, [2024-05-19T00:41:33.719680 #1999693] INFO -- : /tmp/ruby/src/trunk/basictest/test.rb:trace ...OK 3 I, [2024-05-19T00:41:33.719748 #1999693] INFO -- : /tmp/ruby/src/trunk/basictest/test.rb:defined? ............OK 12 I, [2024-05-19T00:41:33.719795 #1999693] INFO -- : /tmp/ruby/src/trunk/basictest/test.rb:alias ......OK 6 I, [2024-05-19T00:41:33.720141 #1999693] INFO -- : /tmp/ruby/src/trunk/basictest/test.rb:path .......................OK 23 I, [2024-05-19T00:41:33.755174 #1999693] INFO -- : /tmp/ruby/src/trunk/basictest/test.rb:gc ....OK 4 I, [2024-05-19T00:41:33.757527 #1999693] INFO -- : I, [2024-05-19T00:41:33.757604 #1999693] INFO -- : test succeeded I, [2024-05-19T00:41:33.759088 #1999693] INFO -- : $$$[end] "make yes-test-basic TESTS='-j20'" exit with 0. I, [2024-05-19T00:41:33.759215 #1999693] INFO -- : $$$[beg] make yes-test-all TESTOPTS='--stderr-on-failure' TESTS='-j20' I, [2024-05-19T00:41:33.854407 #1999693] INFO -- : BASERUBY = /usr/bin/ruby --disable=gems I, [2024-05-19T00:41:33.854443 #1999693] INFO -- : CC = gcc I, [2024-05-19T00:41:33.854449 #1999693] INFO -- : LD = ld I, [2024-05-19T00:41:33.854453 #1999693] INFO -- : LDSHARED = gcc -shared I, [2024-05-19T00:41:33.854457 #1999693] INFO -- : CFLAGS = -O3 -fno-fast-math -ggdb3 -Wall -Wextra -Wdeprecated-declarations -Wdiv-by-zero -Wduplicated-cond -Wimplicit-function-declaration -Wimplicit-int -Wpointer-arith -Wwrite-strings -Wold-style-definition -Wimplicit-fallthrough=0 -Wmissing-noreturn -Wno-cast-function-type -Wno-constant-logical-operand -Wno-long-long -Wno-missing-field-initializers -Wno-overlength-strings -Wno-packed-bitfield-compat -Wno-parentheses-equality -Wno-self-assign -Wno-tautological-compare -Wno-unused-parameter -Wno-unused-value -Wsuggest-attribute=format -Wsuggest-attribute=noreturn -Wunused-variable -Wmisleading-indentation -Wundef -fPIC I, [2024-05-19T00:41:33.854461 #1999693] INFO -- : XCFLAGS = -U_FORTIFY_SOURCE -D_FORTIFY_SOURCE=2 -fstack-protector-strong -fno-strict-overflow -fvisibility=hidden -fexcess-precision=standard -DRUBY_EXPORT -I. -I.ext/include/x86_64-linux -I/tmp/ruby/src/trunk/include -I/tmp/ruby/src/trunk -I/tmp/ruby/src/trunk/prism -I/tmp/ruby/src/trunk/enc/unicode/15.0.0 I, [2024-05-19T00:41:33.854465 #1999693] INFO -- : CPPFLAGS = I, [2024-05-19T00:41:33.854469 #1999693] INFO -- : DLDFLAGS = -Wl,--compress-debug-sections=zlib -Wl,-soname,libruby.so.3.4 -fstack-protector-strong I, [2024-05-19T00:41:33.854473 #1999693] INFO -- : SOLIBS = -lz -lrt -lrt -lgmp -ldl -lcrypt -lm -lpthread I, [2024-05-19T00:41:33.854476 #1999693] INFO -- : LANG = en_US.UTF-8 I, [2024-05-19T00:41:33.854480 #1999693] INFO -- : LC_ALL = I, [2024-05-19T00:41:33.854483 #1999693] INFO -- : LC_CTYPE = I, [2024-05-19T00:41:33.854487 #1999693] INFO -- : MFLAGS = I, [2024-05-19T00:41:33.854490 #1999693] INFO -- : RUSTC = no I, [2024-05-19T00:41:33.854494 #1999693] INFO -- : YJIT_RUSTC_ARGS = --crate-name=yjit --crate-type=staticlib --edition=2021 -g -C lto=thin -C opt-level=3 -C overflow-checks=on '--out-dir=/tmp/ruby/build/trunk/yjit/target/release/' /tmp/ruby/src/trunk/yjit/src/lib.rs I, [2024-05-19T00:41:33.855185 #1999693] INFO -- : gcc (Ubuntu 11.4.0-1ubuntu1~22.04) 11.4.0 I, [2024-05-19T00:41:33.855205 #1999693] INFO -- : Copyright (C) 2021 Free Software Foundation, Inc. I, [2024-05-19T00:41:33.855210 #1999693] INFO -- : This is free software; see the source for copying conditions. There is NO I, [2024-05-19T00:41:33.855215 #1999693] INFO -- : warranty; not even for MERCHANTABILITY or FITNESS FOR A PARTICULAR PURPOSE. I, [2024-05-19T00:41:33.855218 #1999693] INFO -- : I, [2024-05-19T00:41:33.857085 #1999693] INFO -- : generating enc.mk I, [2024-05-19T00:41:33.974819 #1999693] INFO -- : making enc I, [2024-05-19T00:41:33.991885 #1999693] INFO -- : make[1]: Entering directory '/tmp/ruby/build/trunk' I, [2024-05-19T00:41:33.991934 #1999693] INFO -- : make[1]: Nothing to be done for 'enc'. I, [2024-05-19T00:41:33.991947 #1999693] INFO -- : make[1]: Leaving directory '/tmp/ruby/build/trunk' I, [2024-05-19T00:41:33.992456 #1999693] INFO -- : making srcs under enc I, [2024-05-19T00:41:34.022357 #1999693] INFO -- : make[1]: Entering directory '/tmp/ruby/build/trunk' I, [2024-05-19T00:41:34.022409 #1999693] INFO -- : make[1]: Nothing to be done for 'srcs'. I, [2024-05-19T00:41:34.022422 #1999693] INFO -- : make[1]: Leaving directory '/tmp/ruby/build/trunk' I, [2024-05-19T00:41:34.023261 #1999693] INFO -- : generating transdb.h I, [2024-05-19T00:41:34.119276 #1999693] INFO -- : transdb.h unchanged I, [2024-05-19T00:41:34.120422 #1999693] INFO -- : making trans I, [2024-05-19T00:41:34.154588 #1999693] INFO -- : make[1]: Entering directory '/tmp/ruby/build/trunk' I, [2024-05-19T00:41:34.154642 #1999693] INFO -- : make[1]: Nothing to be done for 'trans'. I, [2024-05-19T00:41:34.154655 #1999693] INFO -- : make[1]: Leaving directory '/tmp/ruby/build/trunk' I, [2024-05-19T00:41:34.155297 #1999693] INFO -- : making encs I, [2024-05-19T00:41:34.192669 #1999693] INFO -- : make[1]: Entering directory '/tmp/ruby/build/trunk' I, [2024-05-19T00:41:34.192728 #1999693] INFO -- : make[1]: Nothing to be done for 'encs'. I, [2024-05-19T00:41:34.192741 #1999693] INFO -- : make[1]: Leaving directory '/tmp/ruby/build/trunk' I, [2024-05-19T00:41:34.194514 #1999693] INFO -- : generating makefiles ext/configure-ext.mk I, [2024-05-19T00:41:34.221068 #1999693] INFO -- : ext/configure-ext.mk updated I, [2024-05-19T00:41:34.223469 #1999693] INFO -- : make[1]: Entering directory '/tmp/ruby/build/trunk' I, [2024-05-19T00:41:35.570756 #1999693] INFO -- : make[1]: Leaving directory '/tmp/ruby/build/trunk' I, [2024-05-19T00:41:35.571498 #1999693] INFO -- : generating makefile exts.mk I, [2024-05-19T00:41:35.607162 #1999693] INFO -- : exts.mk unchanged I, [2024-05-19T00:41:35.611617 #1999693] INFO -- : make[1]: Entering directory '/tmp/ruby/build/trunk' I, [2024-05-19T00:41:35.916114 #1999693] INFO -- : make[2]: Entering directory '/tmp/ruby/build/trunk/ext/coverage' I, [2024-05-19T00:41:35.920748 #1999693] INFO -- : make[2]: Leaving directory '/tmp/ruby/build/trunk/ext/coverage' I, [2024-05-19T00:41:35.927212 #1999693] INFO -- : make[2]: Entering directory '/tmp/ruby/build/trunk/ext/date' I, [2024-05-19T00:41:35.932223 #1999693] INFO -- : make[2]: Leaving directory '/tmp/ruby/build/trunk/ext/date' I, [2024-05-19T00:41:35.936039 #1999693] INFO -- : make[2]: Entering directory '/tmp/ruby/build/trunk/ext/digest' I, [2024-05-19T00:41:35.944769 #1999693] INFO -- : make[2]: Leaving directory '/tmp/ruby/build/trunk/ext/digest' I, [2024-05-19T00:41:35.970997 #1999693] INFO -- : make[2]: Entering directory '/tmp/ruby/build/trunk/ext/digest/sha2' I, [2024-05-19T00:41:35.975797 #1999693] INFO -- : make[2]: Leaving directory '/tmp/ruby/build/trunk/ext/digest/sha2' I, [2024-05-19T00:41:35.997079 #1999693] INFO -- : make[2]: Entering directory '/tmp/ruby/build/trunk/ext/fiddle' I, [2024-05-19T00:41:36.007730 #1999693] INFO -- : make[2]: Leaving directory '/tmp/ruby/build/trunk/ext/fiddle' I, [2024-05-19T00:41:36.012645 #1999693] INFO -- : make[2]: Entering directory '/tmp/ruby/build/trunk/ext/io/console' I, [2024-05-19T00:41:36.016717 #1999693] INFO -- : make[2]: Leaving directory '/tmp/ruby/build/trunk/ext/io/console' I, [2024-05-19T00:41:36.029464 #1999693] INFO -- : make[2]: Entering directory '/tmp/ruby/build/trunk/ext/json' I, [2024-05-19T00:41:36.039977 #1999693] INFO -- : make[2]: Leaving directory '/tmp/ruby/build/trunk/ext/json' I, [2024-05-19T00:41:36.055724 #1999693] INFO -- : make[2]: Entering directory '/tmp/ruby/build/trunk/ext/monitor' I, [2024-05-19T00:41:36.059798 #1999693] INFO -- : make[2]: Leaving directory '/tmp/ruby/build/trunk/ext/monitor' I, [2024-05-19T00:41:36.067119 #1999693] INFO -- : make[2]: Entering directory '/tmp/ruby/build/trunk/ext/objspace' I, [2024-05-19T00:41:36.073328 #1999693] INFO -- : make[2]: Leaving directory '/tmp/ruby/build/trunk/ext/objspace' I, [2024-05-19T00:41:36.093770 #1999693] INFO -- : make[2]: Entering directory '/tmp/ruby/build/trunk/ext/openssl' I, [2024-05-19T00:41:36.113658 #1999693] INFO -- : make[2]: Leaving directory '/tmp/ruby/build/trunk/ext/openssl' I, [2024-05-19T00:41:36.117078 #1999693] INFO -- : make[2]: Entering directory '/tmp/ruby/build/trunk/ext/pathname' I, [2024-05-19T00:41:36.120450 #1999693] INFO -- : make[2]: Leaving directory '/tmp/ruby/build/trunk/ext/pathname' I, [2024-05-19T00:41:36.126575 #1999693] INFO -- : make[2]: Entering directory '/tmp/ruby/build/trunk/ext/psych' I, [2024-05-19T00:41:36.144060 #1999693] INFO -- : make[2]: Leaving directory '/tmp/ruby/build/trunk/ext/psych' I, [2024-05-19T00:41:36.148045 #1999693] INFO -- : make[2]: Entering directory '/tmp/ruby/build/trunk/ext/pty' I, [2024-05-19T00:41:36.150841 #1999693] INFO -- : make[2]: Leaving directory '/tmp/ruby/build/trunk/ext/pty' I, [2024-05-19T00:41:36.164065 #1999693] INFO -- : make[2]: Entering directory '/tmp/ruby/build/trunk/ext/ripper' I, [2024-05-19T00:41:36.169495 #1999693] INFO -- : make[2]: Leaving directory '/tmp/ruby/build/trunk/ext/ripper' I, [2024-05-19T00:41:36.171274 #1999693] INFO -- : make[2]: Entering directory '/tmp/ruby/build/trunk/ext/rubyvm' I, [2024-05-19T00:41:36.173910 #1999693] INFO -- : make[2]: Leaving directory '/tmp/ruby/build/trunk/ext/rubyvm' I, [2024-05-19T00:41:36.183513 #1999693] INFO -- : make[2]: Entering directory '/tmp/ruby/build/trunk/ext/socket' I, [2024-05-19T00:41:36.189999 #1999693] INFO -- : make[2]: Leaving directory '/tmp/ruby/build/trunk/ext/socket' I, [2024-05-19T00:41:36.205084 #1999693] INFO -- : make[2]: Entering directory '/tmp/ruby/build/trunk/.bundle/gems/bigdecimal-3.1.8/ext/bigdecimal' I, [2024-05-19T00:41:36.230175 #1999693] INFO -- : make[2]: Leaving directory '/tmp/ruby/build/trunk/.bundle/gems/bigdecimal-3.1.8/ext/bigdecimal' I, [2024-05-19T00:41:36.232056 #1999693] INFO -- : make[2]: Entering directory '/tmp/ruby/build/trunk/.bundle/gems/debug-1.9.2/ext/debug' I, [2024-05-19T00:41:36.254196 #1999693] INFO -- : make[2]: Leaving directory '/tmp/ruby/build/trunk/.bundle/gems/debug-1.9.2/ext/debug' I, [2024-05-19T00:41:36.256039 #1999693] INFO -- : make[2]: Entering directory '/tmp/ruby/build/trunk/.bundle/gems/nkf-0.2.0/ext/nkf' I, [2024-05-19T00:41:36.277664 #1999693] INFO -- : make[2]: Leaving directory '/tmp/ruby/build/trunk/.bundle/gems/nkf-0.2.0/ext/nkf' I, [2024-05-19T00:41:36.279593 #1999693] INFO -- : make[2]: Entering directory '/tmp/ruby/build/trunk/.bundle/gems/racc-1.7.3/ext/racc/cparse' I, [2024-05-19T00:41:36.302480 #1999693] INFO -- : make[2]: Leaving directory '/tmp/ruby/build/trunk/.bundle/gems/racc-1.7.3/ext/racc/cparse' I, [2024-05-19T00:41:36.304746 #1999693] INFO -- : make[2]: Entering directory '/tmp/ruby/build/trunk/.bundle/gems/rbs-3.4.4/ext/rbs_extension' I, [2024-05-19T00:41:36.329058 #1999693] INFO -- : make[2]: Leaving directory '/tmp/ruby/build/trunk/.bundle/gems/rbs-3.4.4/ext/rbs_extension' I, [2024-05-19T00:41:36.332015 #1999693] INFO -- : make[2]: Entering directory '/tmp/ruby/build/trunk/.bundle/gems/syslog-0.1.2/ext/syslog' I, [2024-05-19T00:41:36.359608 #1999693] INFO -- : make[2]: Leaving directory '/tmp/ruby/build/trunk/.bundle/gems/syslog-0.1.2/ext/syslog' I, [2024-05-19T00:41:36.384333 #1999693] INFO -- : make[2]: Entering directory '/tmp/ruby/build/trunk' I, [2024-05-19T00:41:36.450654 #1999693] INFO -- : make[2]: 'ruby' is up to date. I, [2024-05-19T00:41:36.450699 #1999693] INFO -- : make[2]: Leaving directory '/tmp/ruby/build/trunk' I, [2024-05-19T00:41:36.451071 #1999693] INFO -- : make[1]: Leaving directory '/tmp/ruby/build/trunk' I, [2024-05-19T00:41:36.454539 #1999693] INFO -- : make[1]: Entering directory '/tmp/ruby/build/trunk' I, [2024-05-19T00:41:36.454569 #1999693] INFO -- : make[1]: Nothing to be done for 'note'. I, [2024-05-19T00:41:36.454575 #1999693] INFO -- : make[1]: Leaving directory '/tmp/ruby/build/trunk' I, [2024-05-19T00:41:36.530966 #1999693] INFO -- : Run options: I, [2024-05-19T00:41:36.531008 #1999693] INFO -- : --seed=22158 I, [2024-05-19T00:41:36.531015 #1999693] INFO -- : "--ruby=./miniruby -I/tmp/ruby/src/trunk/lib -I. -I.ext/common /tmp/ruby/src/trunk/tool/runruby.rb --extout=.ext -- --disable-gems" I, [2024-05-19T00:41:36.531019 #1999693] INFO -- : --excludes-dir=/tmp/ruby/src/trunk/test/.excludes I, [2024-05-19T00:41:36.531030 #1999693] INFO -- : --name=!/memory_leak/ I, [2024-05-19T00:41:36.531035 #1999693] INFO -- : --stderr-on-failure I, [2024-05-19T00:41:36.531039 #1999693] INFO -- : -j20 I, [2024-05-19T00:41:36.531043 #1999693] INFO -- : I, [2024-05-19T00:41:36.531050 #1999693] INFO -- : # Running tests: I, [2024-05-19T00:41:36.531059 #1999693] INFO -- : I, [2024-05-19T00:41:36.679251 #1999693] INFO -- : [ 1/885] 2041026=test_bash_completion I, [2024-05-19T00:41:36.679324 #1999693] INFO -- : [ 2/885] 2041022=test_formatter I, [2024-05-19T00:41:36.679604 #1999693] INFO -- : [ 3/885] 2041023=test_deprecate I, [2024-05-19T00:41:36.679636 #1999693] INFO -- : [ 4/885] 2041024=test_rdoc_constant I, [2024-05-19T00:41:36.679646 #1999693] INFO -- : [ 5/885] 2041025=test_recorder I, [2024-05-19T00:41:36.681289 #1999693] INFO -- : [ 6/885] 2041027=test_gem_source_vendor I, [2024-05-19T00:41:36.683875 #1999693] INFO -- : [ 7/885] 2041040=test_gem_commands_owner_command I, [2024-05-19T00:41:36.683935 #1999693] INFO -- : [ 8/885] 2041035=test_pathname I, [2024-05-19T00:41:36.683964 #1999693] INFO -- : [ 9/885] 2041036=test_complexrational I, [2024-05-19T00:41:36.684030 #1999693] INFO -- : [ 10/885] 2041037=test_init I, [2024-05-19T00:41:36.685368 #1999693] INFO -- : [ 11/885] 2041038=regexp_test I, [2024-05-19T00:41:36.687137 #1999693] INFO -- : [ 12/885] 2041022=test_gem_package_tar_reader I, [2024-05-19T00:41:36.690316 #1999693] INFO -- : [ 13/885] 2041026=test_rdoc_encoding I, [2024-05-19T00:41:36.692136 #1999693] INFO -- : [ 14/885] 2041036=test_coverage I, [2024-05-19T00:41:36.702475 #1999693] INFO -- : [ 15/885] 2041034=test_file I, [2024-05-19T00:41:36.706682 #1999693] INFO -- : [ 16/885] 2041025=test_rdoc_any_method I, [2024-05-19T00:41:36.707858 #1999693] INFO -- : [ 17/885] 2041041=test_modify_expand I, [2024-05-19T00:41:36.711581 #1999693] INFO -- : [ 18/885] 2041041=test_rdoc_markdown I, [2024-05-19T00:41:36.713169 #1999693] INFO -- : [ 19/885] 2041039=test_gem_available_set I, [2024-05-19T00:41:36.713655 #1999693] INFO -- : [ 20/885] 2041030=test_wss I, [2024-05-19T00:41:36.713705 #1999693] INFO -- : [ 21/885] 2041031=test_fiddle I, [2024-05-19T00:41:36.714166 #1999693] INFO -- : [ 22/885] 2041029=test_find I, [2024-05-19T00:41:36.714300 #1999693] INFO -- : [ 23/885] 2041034=test_ractor I, [2024-05-19T00:41:36.714455 #1999693] INFO -- : [ 24/885] 2041028=test_digest I, [2024-05-19T00:41:36.714558 #1999693] INFO -- : [ 25/885] 2041032=test_marshalable I, [2024-05-19T00:41:36.714584 #1999693] INFO -- : [ 26/885] 2041033=test_require I, [2024-05-19T00:41:36.733341 #1999693] INFO -- : [ 27/885] 2041029=test_cgi_util I, [2024-05-19T00:41:36.745441 #1999693] INFO -- : [ 28/885] 2041030=test_gem_commands_contents_command I, [2024-05-19T00:41:36.747064 #1999693] INFO -- : [ 29/885] 2041031=test_gem_ext_cmake_builder I, [2024-05-19T00:41:36.747654 #1999693] INFO -- : [ 30/885] 2041032=test_enc_str_buf_cat I, [2024-05-19T00:41:36.752587 #1999693] INFO -- : [ 31/885] 2041032=test_class2name I, [2024-05-19T00:41:36.762347 #1999693] INFO -- : [ 32/885] 2041032=test_gbk I, [2024-05-19T00:41:36.765466 #1999693] INFO -- : [ 33/885] 2041038=test_profile_frames I, [2024-05-19T00:41:36.766723 #1999693] INFO -- : [ 34/885] 2041032=test_pstore I, [2024-05-19T00:41:36.808553 #1999693] INFO -- : [ 35/885] 2041032=test_cstr I, [2024-05-19T00:41:36.813304 #1999693] INFO -- : [ 36/885] 2041034=test_shapes I, [2024-05-19T00:41:36.825514 #1999693] INFO -- : [ 37/885] 2041034=json_fixtures_test I, [2024-05-19T00:41:36.831979 #1999693] INFO -- : [ 38/885] 2041034=test_io_timeout I, [2024-05-19T00:41:36.836805 #1999693] INFO -- : [ 39/885] 2041034=test_rdoc_parser_c I, [2024-05-19T00:41:36.837169 #1999693] INFO -- : [ 40/885] 2041027=test_comparable I, [2024-05-19T00:41:36.840732 #1999693] INFO -- : [ 41/885] 2041027=test_rdoc_markup_formatter I, [2024-05-19T00:41:36.862342 #1999693] INFO -- : [ 42/885] 2041035=test_thread_queue I, [2024-05-19T00:41:36.868094 #1999693] INFO -- : [ 43/885] 2041023=test_nowrite I, [2024-05-19T00:41:36.871459 #1999693] INFO -- : [ 44/885] 2041026=test_gem_commands_sources_command I, [2024-05-19T00:41:36.878668 #1999693] INFO -- : [ 45/885] 2041022=test_ansi_without_terminfo I, [2024-05-19T00:41:36.886862 #1999693] INFO -- : [ 46/885] 2041023=test_ractor I, [2024-05-19T00:41:36.901624 #1999693] INFO -- : [ 47/885] 2041023=test_euc_tw I, [2024-05-19T00:41:36.915334 #1999693] INFO -- : [ 48/885] 2041023=test_bmethod I, [2024-05-19T00:41:36.919793 #1999693] INFO -- : [ 49/885] 2041023=test_big2str I, [2024-05-19T00:41:36.921129 #1999693] INFO -- : [ 50/885] 2041023=test_wait I, [2024-05-19T00:41:36.931895 #1999693] INFO -- : [ 51/885] 2041038=test_handle I, [2024-05-19T00:41:36.932054 #1999693] INFO -- : [ 52/885] 2041032=test_forwardable I, [2024-05-19T00:41:36.933540 #1999693] INFO -- : [ 53/885] 2041022=test_yaml I, [2024-05-19T00:41:36.948661 #1999693] INFO -- : [ 54/885] 2041024=test_gem_remote_fetcher I, [2024-05-19T00:41:36.949596 #1999693] INFO -- : [ 55/885] 2041032=test_parse I, [2024-05-19T00:41:36.960070 #1999693] INFO -- : [ 56/885] 2041031=test_mdns I, [2024-05-19T00:41:36.967217 #1999693] INFO -- : [ 57/885] 2041029=test_gem_resolver_installed_specification I, [2024-05-19T00:41:36.977888 #1999693] INFO -- : [ 58/885] 2041031=test_scanner_events I, [2024-05-19T00:41:36.995332 #1999693] INFO -- : [ 59/885] 2041023=test_complex I, [2024-05-19T00:41:37.000700 #1999693] INFO -- : [ 60/885] 2041022=test_gem_commands_search_command I, [2024-05-19T00:41:37.005259 #1999693] INFO -- : [ 61/885] 2041039=test_frozen_error I, [2024-05-19T00:41:37.005766 #1999693] INFO -- : [ 62/885] 2041022=test_method_cache I, [2024-05-19T00:41:37.007534 #1999693] INFO -- : [ 63/885] 2041022=test_gem_stub_specification I, [2024-05-19T00:41:37.007748 #1999693] INFO -- : [ 64/885] 2041038=test_gem_ext_ext_conf_builder I, [2024-05-19T00:41:37.008338 #1999693] INFO -- : [ 65/885] 2041039=test_path_to_class I, [2024-05-19T00:41:37.011072 #1999693] INFO -- : [ 66/885] 2041039=test_gem_resolver_specification I, [2024-05-19T00:41:37.013839 #1999693] INFO -- : [ 67/885] 2041027=test_gem_dependency I, [2024-05-19T00:41:37.017692 #1999693] INFO -- : [ 68/885] 2041031=test_inlinecache I, [2024-05-19T00:41:37.023045 #1999693] INFO -- : [ 69/885] 2041030=test_rdoc_markup_verbatim I, [2024-05-19T00:41:37.028090 #1999693] INFO -- : [ 70/885] 2041039=test_econv I, [2024-05-19T00:41:37.072994 #1999693] INFO -- : [ 71/885] 2041031=test_cesu8 I, [2024-05-19T00:41:37.075612 #1999693] INFO -- : [ 72/885] 2041031=test_rdoc_options I, [2024-05-19T00:41:37.108092 #1999693] INFO -- : [ 73/885] 2041023=test_gem_version I, [2024-05-19T00:41:37.115128 #1999693] INFO -- : [ 74/885] 2041034=test_ldap I, [2024-05-19T00:41:37.120007 #1999693] INFO -- : [ 75/885] 2041034=test_emitter I, [2024-05-19T00:41:37.125616 #1999693] INFO -- : [ 76/885] 2041030=test_gem_commands_signin_command I, [2024-05-19T00:41:37.136016 #1999693] INFO -- : [ 77/885] 2041037=test_resource I, [2024-05-19T00:41:37.139768 #1999693] INFO -- : [ 78/885] 2041034=test_string_processing I, [2024-05-19T00:41:37.154103 #1999693] INFO -- : [ 79/885] 2041027=test_fileutils I, [2024-05-19T00:41:37.156738 #1999693] INFO -- : [ 80/885] 2041022=test_rdoc_include I, [2024-05-19T00:41:37.164267 #1999693] INFO -- : [ 81/885] 2041041=test_reqarg I, [2024-05-19T00:41:37.168890 #1999693] INFO -- : [ 82/885] 2041037=test_gem_commands_list_command I, [2024-05-19T00:41:37.188119 #1999693] INFO -- : [ 83/885] 2041029=test_stack I, [2024-05-19T00:41:37.188598 #1999693] INFO -- : [ 84/885] 2041030=test_too_many_dummy_encodings I, [2024-05-19T00:41:37.195332 #1999693] INFO -- : [ 85/885] 2041023=test_prettyprint I, [2024-05-19T00:41:37.198464 #1999693] INFO -- : [ 86/885] 2041034=test_tracepoint I, [2024-05-19T00:41:37.214971 #1999693] INFO -- : [ 87/885] 2041023=test_gem_commands_help_command I, [2024-05-19T00:41:37.246655 #1999693] INFO -- : [ 88/885] 2041030=test_rdoc_markup I, [2024-05-19T00:41:37.256073 #1999693] INFO -- : [ 89/885] 2041030=test_duplicate I, [2024-05-19T00:41:37.257384 #1999693] INFO -- : [ 90/885] 2041025=test_utf32 I, [2024-05-19T00:41:37.260830 #1999693] INFO -- : [ 91/885] 2041025=test_basicsocket I, [2024-05-19T00:41:37.264874 #1999693] INFO -- : [ 92/885] 2041030=test_gem_resolver_index_specification I, [2024-05-19T00:41:37.277784 #1999693] INFO -- : [ 93/885] 2041025=test_internal_ivar I, [2024-05-19T00:41:37.283069 #1999693] INFO -- : [ 94/885] 2041025=test_function I, [2024-05-19T00:41:37.302958 #1999693] INFO -- : [ 95/885] 2041023=test_queue I, [2024-05-19T00:41:37.310624 #1999693] INFO -- : [ 96/885] 2041023=test_noarg I, [2024-05-19T00:41:37.320013 #1999693] INFO -- : [ 97/885] 2041030=parse_comments_test I, [2024-05-19T00:41:37.325542 #1999693] INFO -- : [ 98/885] 2041026=test_tempfile I, [2024-05-19T00:41:37.382514 #1999693] INFO -- : [ 99/885] 2041030=test_asn1 I, [2024-05-19T00:41:37.393123 #1999693] INFO -- : [100/885] 2041037=test_random I, [2024-05-19T00:41:37.396754 #1999693] INFO -- : [101/885] 2041030=json_string_matching_test I, [2024-05-19T00:41:37.398614 #1999693] INFO -- : [102/885] 2041022=test_load I, [2024-05-19T00:41:37.401173 #1999693] INFO -- : [103/885] 2041037=test_rdoc_normal_class I, [2024-05-19T00:41:37.403213 #1999693] INFO -- : [104/885] 2041034=test_class I, [2024-05-19T00:41:37.403930 #1999693] INFO -- : [105/885] 2041040=test_const I, [2024-05-19T00:41:37.406501 #1999693] INFO -- : [106/885] 2041022=test_irb I, [2024-05-19T00:41:37.408719 #1999693] INFO -- : [107/885] 2041040=test_date_strftime I, [2024-05-19T00:41:37.409906 #1999693] INFO -- : [108/885] 2041032=test_rdoc_parser_rd I, [2024-05-19T00:41:37.412197 #1999693] INFO -- : [109/885] 2041030=test_gem_installer I, [2024-05-19T00:41:37.481060 #1999693] INFO -- : [110/885] 2041027=test_yamlstore I, [2024-05-19T00:41:37.486864 #1999693] INFO -- : [111/885] 2041023=test_rdoc_context_section I, [2024-05-19T00:41:37.501262 #1999693] INFO -- : [112/885] 2041025=test_euc_kr I, [2024-05-19T00:41:37.505217 #1999693] INFO -- : [113/885] 2041025=test_ftp I, [2024-05-19T00:41:37.508619 #1999693] INFO -- : [114/885] 2041027=test_gem_impossible_dependencies_error I, [2024-05-19T00:41:37.523763 #1999693] INFO -- : [115/885] 2041025=test_array_create I, [2024-05-19T00:41:37.525947 #1999693] INFO -- : [116/885] 2041027=test_pack I, [2024-05-19T00:41:37.526373 #1999693] INFO -- : [117/885] 2041025=test_to_ruby I, [2024-05-19T00:41:37.538084 #1999693] INFO -- : [118/885] 2041041=test_pattern_key_name_check I, [2024-05-19T00:41:37.538392 #1999693] INFO -- : [119/885] 2041025=test_rdoc_rubygems_hook I, [2024-05-19T00:41:37.541411 #1999693] INFO -- : [120/885] 2041036=test_gem_commands_query_command I, [2024-05-19T00:41:37.545707 #1999693] INFO -- : [121/885] 2041041=test_method I, [2024-05-19T00:41:37.567644 #1999693] INFO -- : [122/885] 2041031=test_gem_unsatisfiable_dependency_error I, [2024-05-19T00:41:37.570236 #1999693] INFO -- : [123/885] 2041032=test_win32ole_record I, [2024-05-19T00:41:37.572945 #1999693] INFO -- : [124/885] 2041032=test_cp949 I, [2024-05-19T00:41:37.574998 #1999693] INFO -- : [125/885] 2041031=test_gem_commands_uninstall_command I, [2024-05-19T00:41:37.575635 #1999693] INFO -- : [126/885] 2041032=test_foreach I, [2024-05-19T00:41:37.577579 #1999693] INFO -- : [127/885] 2041028=test_gem_source_specific_file I, [2024-05-19T00:41:37.579092 #1999693] INFO -- : [128/885] 2041032=test_condition I, [2024-05-19T00:41:37.579708 #1999693] INFO -- : [129/885] 2041032=test_io I, [2024-05-19T00:41:37.589193 #1999693] INFO -- : [130/885] 2041022=test_sorted_set I, [2024-05-19T00:41:37.610657 #1999693] INFO -- : [131/885] 2041026=test_win32ole_type_event I, [2024-05-19T00:41:37.615265 #1999693] INFO -- : [132/885] 2041026=test_emoji I, [2024-05-19T00:41:37.621978 #1999693] INFO -- : [133/885] 2041025=test_ubf_async_safe I, [2024-05-19T00:41:37.626865 #1999693] INFO -- : [134/885] 2041025=test_hash I, [2024-05-19T00:41:37.643520 #1999693] INFO -- : [135/885] 2041026=test_io_wait I, [2024-05-19T00:41:37.661085 #1999693] INFO -- : [136/885] 2041023=test_gem_commands_exec_command I, [2024-05-19T00:41:37.677466 #1999693] INFO -- : [137/885] 2041037=test_kwargs I, [2024-05-19T00:41:37.681214 #1999693] INFO -- : [138/885] 2041037=warnings_test I, [2024-05-19T00:41:37.712742 #1999693] INFO -- : [139/885] 2041027=test_ellipsize I, [2024-05-19T00:41:37.724627 #1999693] INFO -- : [140/885] 2041027=test_date_attr I, [2024-05-19T00:41:37.726327 #1999693] INFO -- : [141/885] 2041027=test_console_attr I, [2024-05-19T00:41:37.729351 #1999693] INFO -- : [142/885] 2041027=test_summary I, [2024-05-19T00:41:37.778220 #1999693] INFO -- : [143/885] 2041037=test_type_completor I, [2024-05-19T00:41:37.785009 #1999693] INFO -- : [144/885] 2041037=test_argf I, [2024-05-19T00:41:37.786978 #1999693] INFO -- : [145/885] 2041022=test_kill_ring I, [2024-05-19T00:41:37.794488 #1999693] INFO -- : [146/885] 2041022=test_ns_spki I, [2024-05-19T00:41:37.818189 #1999693] INFO -- : [147/885] 2041028=test_framework I, [2024-05-19T00:41:37.819240 #1999693] INFO -- : [148/885] 2041022=test_weakmap I, [2024-05-19T00:41:37.827252 #1999693] INFO -- : [149/885] 2041032=test_workspace I, [2024-05-19T00:41:37.835109 #1999693] INFO -- : [150/885] 2041028=test_yjit I, [2024-05-19T00:41:37.836140 #1999693] INFO -- : [151/885] 2041028=test_ws I, [2024-05-19T00:41:37.836393 #1999693] INFO -- : [152/885] 2041027=test_gem_commands_environment_command I, [2024-05-19T00:41:37.856723 #1999693] INFO -- : [153/885] 2041028=test_m17n I, [2024-05-19T00:41:37.885364 #1999693] INFO -- : [154/885] 2041027=test_tree_builder I, [2024-05-19T00:41:37.890092 #1999693] INFO -- : [155/885] 2041027=test_gem_resolver_dependency_request I, [2024-05-19T00:41:37.911660 #1999693] INFO -- : [156/885] 2041027=test_hash I, [2024-05-19T00:41:37.911874 #1999693] INFO -- : [157/885] 2041028=test_alias_and_anchor I, [2024-05-19T00:41:37.918180 #1999693] INFO -- : [158/885] 2041028=test_postponed_job I, [2024-05-19T00:41:37.923866 #1999693] INFO -- : [159/885] 2041027=test_external_new I, [2024-05-19T00:41:37.931638 #1999693] INFO -- : [160/885] 2041027=test_gem_request_set_lockfile I, [2024-05-19T00:41:37.971413 #1999693] INFO -- : [161/885] 2041026=test_raise_exception I, [2024-05-19T00:41:37.998789 #1999693] INFO -- : [162/885] 2041039=test_protect I, [2024-05-19T00:41:38.001534 #1999693] INFO -- : [163/885] 2041039=test_win32ole_typelib I, [2024-05-19T00:41:38.004729 #1999693] INFO -- : [164/885] 2041039=test_c_struct_entry I, [2024-05-19T00:41:38.082677 #1999693] INFO -- : [165/885] 2041029=test_lock_native_thread I, [2024-05-19T00:41:38.096860 #1999693] INFO -- : [166/885] 2041040=test_gem_commands_stale_command I, [2024-05-19T00:41:38.120653 #1999693] INFO -- : [167/885] 2041040=test_have_library I, [2024-05-19T00:41:38.132190 #1999693] INFO -- : [168/885] 2041039=test_remote_fetch_error I, [2024-05-19T00:41:38.132393 #1999693] INFO -- : [169/885] 2041032=test_show_source I, [2024-05-19T00:41:38.145093 #1999693] INFO -- : [170/885] 2041039=test_set I, [2024-05-19T00:41:38.148438 #1999693] INFO -- : [171/885] 2041032=test_gem_security_trust_dir I, [2024-05-19T00:41:38.149886 #1999693] INFO -- : [172/885] 2041033=test_string_memory I, [2024-05-19T00:41:38.152728 #1999693] INFO -- : [173/885] 2041039=comments_test I, [2024-05-19T00:41:38.184139 #1999693] INFO -- : [174/885] 2041033=test_sprintf I, [2024-05-19T00:41:38.184506 #1999693] INFO -- : [175/885] 2041036=test_gem_requirement I, [2024-05-19T00:41:38.199485 #1999693] INFO -- : [176/885] 2041031=test_line_editor I, [2024-05-19T00:41:38.232347 #1999693] INFO -- : [177/885] 2041039=test_objspace I, [2024-05-19T00:41:38.254025 #1999693] INFO -- : [178/885] 2041031=ripper_test I, [2024-05-19T00:41:38.281297 #1999693] INFO -- : [179/885] 2041036=test_undef I, [2024-05-19T00:41:38.285895 #1999693] INFO -- : [180/885] 2041036=parser_test I, [2024-05-19T00:41:38.293927 #1999693] INFO -- : [181/885] 2041028=test_convertible I, [2024-05-19T00:41:38.312413 #1999693] INFO -- : [182/885] 2041027=test_rdoc_alias I, [2024-05-19T00:41:38.340243 #1999693] INFO -- : [183/885] 2041032=test_yield I, [2024-05-19T00:41:38.345732 #1999693] INFO -- : [184/885] 2041036=test_stringscanner I, [2024-05-19T00:41:38.358043 #1999693] INFO -- : [185/885] 2041029=test_files_sample I, [2024-05-19T00:41:38.367721 #1999693] INFO -- : [186/885] 2041038=test_rat I, [2024-05-19T00:41:38.380482 #1999693] INFO -- : [187/885] 2041038=test_webauthn_poller I, [2024-05-19T00:41:38.383620 #1999693] INFO -- : [188/885] 2041036=test_rdoc_markup_raw I, [2024-05-19T00:41:38.398160 #1999693] INFO -- : [189/885] 2041027=test_rdoc_markup_to_html_crossref I, [2024-05-19T00:41:38.407460 #1999693] INFO -- : [190/885] 2041033=encoding_test I, [2024-05-19T00:41:38.424532 #1999693] INFO -- : [191/885] 2041029=test_gem_resolver_best_set I, [2024-05-19T00:41:38.493996 #1999693] INFO -- : [192/885] 2041029=test_typeddata I, [2024-05-19T00:41:38.518295 #1999693] INFO -- : [193/885] 2041038=test_fstring I, [2024-05-19T00:41:38.520411 #1999693] INFO -- : [194/885] 2041036=test_optparse I, [2024-05-19T00:41:38.555484 #1999693] INFO -- : [195/885] 2041033=test_array I, [2024-05-19T00:41:38.566896 #1999693] INFO -- : [196/885] 2041033=test_gem_commands_install_command I, [2024-05-19T00:41:38.585907 #1999693] INFO -- : [197/885] 2041036=test_clone I, [2024-05-19T00:41:38.618717 #1999693] INFO -- : [198/885] 2041023=test_readpartial I, [2024-05-19T00:41:38.675843 #1999693] INFO -- : [199/885] 2041038=locals_test I, [2024-05-19T00:41:38.682215 #1999693] INFO -- : [200/885] 2041026=test_rdoc_require I, [2024-05-19T00:41:38.723571 #1999693] INFO -- : [201/885] 2041029=test_rdoc_markup_indented_paragraph I, [2024-05-19T00:41:38.735106 #1999693] INFO -- : [202/885] 2041026=test_pack I, [2024-05-19T00:41:38.754842 #1999693] INFO -- : [203/885] 2041026=test_backtrace I, [2024-05-19T00:41:38.766002 #1999693] INFO -- : [204/885] 2041027=ruby_parser_test I, [2024-05-19T00:41:38.787559 #1999693] INFO -- : [205/885] 2041036=test_io_buffer I, [2024-05-19T00:41:38.852921 #1999693] INFO -- : [206/885] 2041027=test_gem_resolver_conflict I, [2024-05-19T00:41:38.859178 #1999693] INFO -- : [207/885] 2041031=test_rdoc_task I, [2024-05-19T00:41:38.861878 #1999693] INFO -- : [208/885] 2041031=test_sizeof I, [2024-05-19T00:41:38.864282 #1999693] INFO -- : [209/885] 2041029=test_case I, [2024-05-19T00:41:38.866804 #1999693] INFO -- : [210/885] 2041027=test_face I, [2024-05-19T00:41:38.894211 #1999693] INFO -- : [211/885] 2041029=test_rendering I, [2024-05-19T00:41:38.896296 #1999693] INFO -- : [212/885] 2041036=test_utf16 I, [2024-05-19T00:41:38.914674 #1999693] INFO -- : [213/885] 2041036=test_autoload I, [2024-05-19T00:41:38.973241 #1999693] INFO -- : [214/885] 2041027=test_io I, [2024-05-19T00:41:38.987613 #1999693] INFO -- : [215/885] 2041038=test_unicode_escape I, [2024-05-19T00:41:38.997149 #1999693] INFO -- : [216/885] 2041029=test_libs I, [2024-05-19T00:41:39.016618 #1999693] INFO -- : [217/885] 2041024=test_gem_commands_fetch_command I, [2024-05-19T00:41:39.022410 #1999693] INFO -- : [218/885] 2041029=test_math I, [2024-05-19T00:41:39.026973 #1999693] INFO -- : [219/885] 2041023=test_gc I, [2024-05-19T00:41:39.030193 #1999693] INFO -- : [220/885] 2041023=test_sleep I, [2024-05-19T00:41:39.042119 #1999693] INFO -- : [221/885] 2041029=test_config I, [2024-05-19T00:41:39.071796 #1999693] INFO -- : [222/885] 2041038=test_yaml_tree I, [2024-05-19T00:41:39.080110 #1999693] INFO -- : [223/885] 2041029=test_yjit_exit_locations I, [2024-05-19T00:41:39.085009 #1999693] INFO -- : [224/885] 2041029=test_etc I, [2024-05-19T00:41:39.120452 #1999693] INFO -- : [225/885] 2041038=test_gem_config_file I, [2024-05-19T00:41:39.124273 #1999693] INFO -- : [226/885] 2041024=test_ripper I, [2024-05-19T00:41:39.136183 #1999693] INFO -- : [227/885] 2041029=test_getopts I, [2024-05-19T00:41:39.144004 #1999693] INFO -- : [228/885] 2041029=test_protocol I, [2024-05-19T00:41:39.211683 #1999693] INFO -- : [229/885] 2041034=test_gem_resolver_activation_request I, [2024-05-19T00:41:39.266012 #1999693] INFO -- : [230/885] 2041038=test_pkey_dh I, [2024-05-19T00:41:39.291210 #1999693] INFO -- : [231/885] 2041040=test_bigzero I, [2024-05-19T00:41:39.296327 #1999693] INFO -- : [232/885] 2041040=test_gem_package_tar_header I, [2024-05-19T00:41:39.322535 #1999693] INFO -- : [233/885] 2041038=test_gem_util I, [2024-05-19T00:41:39.340612 #1999693] INFO -- : [234/885] 2041040=test_iseq_load I, [2024-05-19T00:41:39.357722 #1999693] INFO -- : [235/885] 2041034=test_system I, [2024-05-19T00:41:39.453321 #1999693] INFO -- : [236/885] 2041024=test_pkcs12 I, [2024-05-19T00:41:39.462382 #1999693] INFO -- : [237/885] 2041029=test_gem_uninstaller I, [2024-05-19T00:41:39.486380 #1999693] INFO -- : [238/885] 2041038=test_buffering I, [2024-05-19T00:41:39.495944 #1999693] INFO -- : [239/885] 2041038=test_svcb_https I, [2024-05-19T00:41:39.511320 #1999693] INFO -- : [240/885] 2041038=test_gb18030 I, [2024-05-19T00:41:39.516001 #1999693] INFO -- : [241/885] 2041038=test_time I, [2024-05-19T00:41:39.611303 #1999693] INFO -- : [242/885] 2041038=test_windows_1251 I, [2024-05-19T00:41:39.614313 #1999693] INFO -- : [243/885] 2041038=test_rdoc_rdoc I, [2024-05-19T00:41:39.829129 #1999693] INFO -- : [244/885] 2041041=test_io_buffer I, [2024-05-19T00:41:39.855558 #1999693] INFO -- : [245/885] 2041041=test_key_name_check I, [2024-05-19T00:41:39.857430 #1999693] INFO -- : [246/885] 2041041=test_backtrace I, [2024-05-19T00:41:39.859973 #1999693] INFO -- : [247/885] 2041041=test_defined I, [2024-05-19T00:41:39.902450 #1999693] INFO -- : [248/885] 2041033=test_rdoc_i18n_text I, [2024-05-19T00:41:39.911876 #1999693] INFO -- : [249/885] 2041038=test_thread I, [2024-05-19T00:41:39.914114 #1999693] INFO -- : [250/885] 2041038=test_trick I, [2024-05-19T00:41:39.920920 #1999693] INFO -- : [251/885] 2041033=test_pipe I, [2024-05-19T00:41:39.944276 #1999693] INFO -- : [252/885] 2041041=test_pkey_ec I, [2024-05-19T00:41:40.016237 #1999693] INFO -- : [253/885] 2041026=test_date_parse I, [2024-05-19T00:41:40.035760 #1999693] INFO -- : [254/885] 2041024=test_rdoc_markup_attributes I, [2024-05-19T00:41:40.037426 #1999693] INFO -- : [255/885] 2041033=test_null I, [2024-05-19T00:41:40.038394 #1999693] INFO -- : [256/885] 2041024=test_win32ole_type I, [2024-05-19T00:41:40.041516 #1999693] INFO -- : [257/885] 2041033=test_mul I, [2024-05-19T00:41:40.043196 #1999693] INFO -- : [258/885] 2041024=test_rdoc_markup_to_rdoc I, [2024-05-19T00:41:40.050318 #1999693] INFO -- : [259/885] 2041033=test_rdoc_rd_inline_parser I, [2024-05-19T00:41:40.059187 #1999693] INFO -- : [260/885] 2041041=test_default_gems I, [2024-05-19T00:41:40.076651 #1999693] INFO -- : [261/885] 2041024=test_gem_dependency_resolution_error I, [2024-05-19T00:41:40.081912 #1999693] INFO -- : [262/885] 2041024=test_qsort I, [2024-05-19T00:41:40.084505 #1999693] INFO -- : [263/885] 2041033=test_rdoc_parser I, [2024-05-19T00:41:40.089460 #1999693] INFO -- : [264/885] 2041024=test_custom_command I, [2024-05-19T00:41:40.110564 #1999693] INFO -- : [265/885] 2041033=json_addition_test I, [2024-05-19T00:41:40.131276 #1999693] INFO -- : [266/885] 2041033=test_rdoc_store I, [2024-05-19T00:41:40.134263 #1999693] INFO -- : [267/885] 2041026=test_depth_first I, [2024-05-19T00:41:40.141626 #1999693] INFO -- : [268/885] 2041041=test_gem_request_set_lockfile_parser I, [2024-05-19T00:41:40.143997 #1999693] INFO -- : [269/885] 2041026=test_x509attr I, [2024-05-19T00:41:40.154410 #1999693] INFO -- : [270/885] 2041026=test_raise I, [2024-05-19T00:41:40.162376 #1999693] INFO -- : [271/885] 2041026=test_rdoc_stats I, [2024-05-19T00:41:40.181516 #1999693] INFO -- : [272/885] 2041026=test_pattern_matching I, [2024-05-19T00:41:40.191051 #1999693] INFO -- : [273/885] 2041024=test_string I, [2024-05-19T00:41:40.198195 #1999693] INFO -- : [274/885] 2041026=test_rdoc_markup_parser I, [2024-05-19T00:41:40.203935 #1999693] INFO -- : [275/885] 2041024=test_require_path_check I, [2024-05-19T00:41:40.222175 #1999693] INFO -- : [276/885] 2041034=test_folderitem2_invokeverb I, [2024-05-19T00:41:40.225340 #1999693] INFO -- : [277/885] 2041034=test_fnmatch I, [2024-05-19T00:41:40.238898 #1999693] INFO -- : [278/885] 2041026=test_files_test_2 I, [2024-05-19T00:41:40.278400 #1999693] INFO -- : [279/885] 2041029=test_gem_validator I, [2024-05-19T00:41:40.285239 #1999693] INFO -- : [280/885] 2041034=test_gc_compact I, [2024-05-19T00:41:40.289546 #1999693] INFO -- : [281/885] 2041024=test_string I, [2024-05-19T00:41:40.296880 #1999693] INFO -- : [282/885] 2041029=test_proc I, [2024-05-19T00:41:40.447714 #1999693] INFO -- : [283/885] 2041041=test_gem_resolver_index_set I, [2024-05-19T00:41:40.476755 #1999693] INFO -- : [284/885] 2041041=test_gem_package_old I, [2024-05-19T00:41:40.536735 #1999693] INFO -- : [285/885] 2041041=test_zlib I, [2024-05-19T00:41:40.842729 #1999693] INFO -- : [286/885] 2041033=test_cgi_tag_helper I, [2024-05-19T00:41:40.867816 #1999693] INFO -- : [287/885] 2041033=test_egrep_cpp I, [2024-05-19T00:41:40.902704 #1999693] INFO -- : [288/885] 2041040=test_ole_methods I, [2024-05-19T00:41:40.911677 #1999693] INFO -- : [289/885] 2041040=test_erb_m17n I, [2024-05-19T00:41:40.914398 #1999693] INFO -- : [290/885] 2041025=test_date_conv I, [2024-05-19T00:41:40.914922 #1999693] INFO -- : [291/885] 2041040=test_optimization I, [2024-05-19T00:41:40.926130 #1999693] INFO -- : [292/885] 2041025=test_zsh_completion I, [2024-05-19T00:41:40.929312 #1999693] INFO -- : [293/885] 2041025=test_exception I, [2024-05-19T00:41:40.947102 #1999693] INFO -- : [294/885] 2041025=test_iter_break I, [2024-05-19T00:41:40.952958 #1999693] INFO -- : [295/885] 2041025=test_verbose I, [2024-05-19T00:41:40.968483 #1999693] INFO -- : [296/885] 2041025=test_rdoc_single_class I, [2024-05-19T00:41:40.976068 #1999693] INFO -- : [297/885] 2041025=test_num2int I, [2024-05-19T00:41:40.982218 #1999693] INFO -- : [298/885] 2041025=test_nil I, [2024-05-19T00:41:40.985009 #1999693] INFO -- : [299/885] 2041025=test_macro I, [2024-05-19T00:41:40.995636 #1999693] INFO -- : [300/885] 2041033=test_frozen I, [2024-05-19T00:41:41.007956 #1999693] INFO -- : [301/885] 2041033=test_gem_ext_configure_builder I, [2024-05-19T00:41:41.033194 #1999693] INFO -- : [302/885] 2041033=test_pp I, [2024-05-19T00:41:41.038174 #1999693] INFO -- : [303/885] 2041025=test_config I, [2024-05-19T00:41:41.052943 #1999693] INFO -- : [304/885] 2041022=test_optarg I, [2024-05-19T00:41:41.064197 #1999693] INFO -- : [305/885] 2041033=test_yaml_special_cases I, [2024-05-19T00:41:41.066231 #1999693] INFO -- : [306/885] 2041035=test_gem_source_list I, [2024-05-19T00:41:41.071161 #1999693] INFO -- : [307/885] 2041033=test_rdoc_token_stream I, [2024-05-19T00:41:41.075076 #1999693] INFO -- : [308/885] 2041023=test_address_resolve I, [2024-05-19T00:41:41.077685 #1999693] INFO -- : [309/885] 2041033=test_gem_command I, [2024-05-19T00:41:41.091940 #1999693] INFO -- : [310/885] 2041025=test_bug-3571 I, [2024-05-19T00:41:41.092477 #1999693] INFO -- : [311/885] 2041025=test_key_actor_vi I, [2024-05-19T00:41:41.151314 #1999693] INFO -- : [312/885] 2041023=test_common I, [2024-05-19T00:41:41.159421 #1999693] INFO -- : [313/885] 2041029=test_gem_spec_fetcher I, [2024-05-19T00:41:41.175425 #1999693] INFO -- : [314/885] 2041033=test_numeric I, [2024-05-19T00:41:41.186404 #1999693] INFO -- : [315/885] 2041022=test_assignment I, [2024-05-19T00:41:41.209661 #1999693] INFO -- : [316/885] 2041025=test_ifunless I, [2024-05-19T00:41:41.212817 #1999693] INFO -- : [317/885] 2041025=test_gem_commands_lock_command I, [2024-05-19T00:41:41.265794 #1999693] INFO -- : [318/885] 2041033=test_rdoc_tom_doc I, [2024-05-19T00:41:41.276254 #1999693] INFO -- : [319/885] 2041035=test_hmac I, [2024-05-19T00:41:41.288346 #1999693] INFO -- : [320/885] 2041033=test_rdoc_markup_to_tt_only I, [2024-05-19T00:41:41.293251 #1999693] INFO -- : [321/885] 2041035=test_at_exit I, [2024-05-19T00:41:41.298743 #1999693] INFO -- : [322/885] 2041029=test_command I, [2024-05-19T00:41:41.311820 #1999693] INFO -- : [323/885] 2041035=test_gem_ext_cargo_builder_unit I, [2024-05-19T00:41:41.319464 #1999693] INFO -- : [324/885] 2041033=test_gem_rdoc I, [2024-05-19T00:41:41.334731 #1999693] INFO -- : [325/885] 2041035=test_date I, [2024-05-19T00:41:41.341601 #1999693] INFO -- : [326/885] 2041035=test_object_create_start I, [2024-05-19T00:41:41.348226 #1999693] INFO -- : [327/885] 2041035=test_enc_raise I, [2024-05-19T00:41:41.352755 #1999693] INFO -- : [328/885] 2041035=test_psych I, [2024-05-19T00:41:41.353871 #1999693] INFO -- : [329/885] 2041023=!Nothing_to_test I, [2024-05-19T00:41:41.357142 #1999693] INFO -- : [330/885] 2041023=test_rdoc_markup_paragraph I, [2024-05-19T00:41:41.359451 #1999693] INFO -- : [331/885] 2041023=test_kernel I, [2024-05-19T00:41:41.388837 #1999693] INFO -- : [332/885] 2041035=test_eval_history I, [2024-05-19T00:41:41.406108 #1999693] INFO -- : [333/885] 2041025=dispatcher_test I, [2024-05-19T00:41:41.427858 #1999693] INFO -- : [334/885] 2041033=test_gem_doctor I, [2024-05-19T00:41:41.467301 #1999693] INFO -- : [335/885] 2041033=test_kdf I, [2024-05-19T00:41:41.488399 #1999693] INFO -- : [336/885] 2041025=test_emitter I, [2024-05-19T00:41:41.493714 #1999693] INFO -- : [337/885] 2041025=test_gem_silent_ui I, [2024-05-19T00:41:41.499427 #1999693] INFO -- : [338/885] 2041035=test_files_ext I, [2024-05-19T00:41:41.539333 #1999693] INFO -- : [339/885] 2041025=test_bug-5832 I, [2024-05-19T00:41:41.543910 #1999693] INFO -- : [340/885] 2041033=test_gem_safe_yaml I, [2024-05-19T00:41:41.547828 #1999693] INFO -- : [341/885] 2041025=test_syntax I, [2024-05-19T00:41:41.555238 #1999693] INFO -- : [342/885] 2041033=test_data I, [2024-05-19T00:41:41.558636 #1999693] INFO -- : [343/885] 2041033=test_date_new I, [2024-05-19T00:41:41.570734 #1999693] INFO -- : [344/885] 2041033=index_write_test I, [2024-05-19T00:41:41.578600 #1999693] INFO -- : [345/885] 2041033=test_require I, [2024-05-19T00:41:41.580083 #1999693] INFO -- : [346/885] 2041033=test_date_time I, [2024-05-19T00:41:41.591878 #1999693] INFO -- : [347/885] 2041033=test_rdoc_markup_to_joined_paragraph I, [2024-05-19T00:41:41.597626 #1999693] INFO -- : [348/885] 2041033=test_iso_8859 I, [2024-05-19T00:41:41.608535 #1999693] INFO -- : [349/885] 2041029=test_tcp I, [2024-05-19T00:41:41.616779 #1999693] INFO -- : [350/885] 2041035=test_rdoc_text I, [2024-05-19T00:41:41.624017 #1999693] INFO -- : [351/885] 2041033=test_rdoc_context I, [2024-05-19T00:41:41.687342 #1999693] INFO -- : [352/885] 2041037=test_stream I, [2024-05-19T00:41:41.694761 #1999693] INFO -- : [353/885] 2041032=test_nil2vtempty I, [2024-05-19T00:41:41.695513 #1999693] INFO -- : [354/885] 2041032=test_rdoc_parser_ruby I, [2024-05-19T00:41:41.724067 #1999693] INFO -- : [355/885] 2041037=test_httpresponse I, [2024-05-19T00:41:41.787294 #1999693] INFO -- : [356/885] 2041029=test_open-uri I, [2024-05-19T00:41:41.810026 #1999693] INFO -- : [357/885] 2041035=test_rdoc_markup_attribute_manager I, [2024-05-19T00:41:41.823549 #1999693] INFO -- : [358/885] 2041037=test_name_error I, [2024-05-19T00:41:41.839519 #1999693] INFO -- : [359/885] 2041035=test_gem_commands_dependency_command I, [2024-05-19T00:41:41.873691 #1999693] INFO -- : [360/885] 2041031=test_safe_load I, [2024-05-19T00:41:41.882726 #1999693] INFO -- : [361/885] 2041031=test_gem_resolver_composed_set I, [2024-05-19T00:41:41.894057 #1999693] INFO -- : [362/885] 2041031=test_gem_resolver I, [2024-05-19T00:41:41.924832 #1999693] INFO -- : [363/885] 2041035=test_gem_commands_specification_command I, [2024-05-19T00:41:41.926853 #1999693] INFO -- : [364/885] 2041023=test_gem_commands_which_command I, [2024-05-19T00:41:41.934222 #1999693] INFO -- : [365/885] 2041037=test_shift_jis I, [2024-05-19T00:41:41.936510 #1999693] INFO -- : [366/885] 2041037=test_http I, [2024-05-19T00:41:41.946164 #1999693] INFO -- : [367/885] 2041037=test_enumerator I, [2024-05-19T00:41:41.956018 #1999693] INFO -- : [368/885] 2041023=test_flags I, [2024-05-19T00:41:42.042913 #1999693] INFO -- : [369/885] 2041035=test_inadvertent_creation I, [2024-05-19T00:41:42.119059 #1999693] INFO -- : [370/885] 2041030=test_err_in_callback I, [2024-05-19T00:41:42.120993 #1999693] INFO -- : [371/885] 2041030=test_gem_resolver_lock_specification I, [2024-05-19T00:41:42.128890 #1999693] INFO -- : [372/885] 2041031=test_gc I, [2024-05-19T00:41:42.148676 #1999693] INFO -- : [373/885] 2041035=test_x509cert I, [2024-05-19T00:41:42.151434 #1999693] INFO -- : [374/885] 2041030=test_arity I, [2024-05-19T00:41:42.157885 #1999693] INFO -- : [375/885] 2041030=test_gem_ext_rake_builder I, [2024-05-19T00:41:42.257919 #1999693] INFO -- : [376/885] 2041032=test_logdevice I, [2024-05-19T00:41:42.292823 #1999693] INFO -- : [377/885] 2041033=test_gem_source_local I, [2024-05-19T00:41:42.436034 #1999693] INFO -- : [378/885] 2041029=test_gem_security_policy I, [2024-05-19T00:41:42.453958 #1999693] INFO -- : [379/885] 2041035=test_last_thread I, [2024-05-19T00:41:42.499981 #1999693] INFO -- : [380/885] 2041033=test_process I, [2024-05-19T00:41:42.726375 #1999693] INFO -- : [381/885] 2041034=test_pack I, [2024-05-19T00:41:42.731668 #1999693] INFO -- : [382/885] 2041038=test_passing_block I, [2024-05-19T00:41:42.732969 #1999693] INFO -- : [383/885] 2041038=test_thread_fd_close I, [2024-05-19T00:41:42.741008 #1999693] INFO -- : [384/885] 2041038=test_uncorrectable_name_check I, [2024-05-19T00:41:42.756118 #1999693] INFO -- : [385/885] 2041038=newline_test I, [2024-05-19T00:41:42.805072 #1999693] INFO -- : [386/885] 2041029=test_hash_create I, [2024-05-19T00:41:42.806634 #1999693] INFO -- : [387/885] 2041029=test_stringchar I, [2024-05-19T00:41:42.822576 #1999693] INFO -- : [388/885] 2041022=test_flush I, [2024-05-19T00:41:42.827305 #1999693] INFO -- : [389/885] 2041022=test_singleton I, [2024-05-19T00:41:42.832478 #1999693] INFO -- : [390/885] 2041022=test_io_console I, [2024-05-19T00:41:42.841327 #1999693] INFO -- : [391/885] 2041038=test_switch_hitter I, [2024-05-19T00:41:42.858064 #1999693] INFO -- : [392/885] 2041038=test_securerandom I, [2024-05-19T00:41:42.894573 #1999693] INFO -- : [393/885] 2041038=test_c_union_entity I, [2024-05-19T00:41:42.921463 #1999693] INFO -- : [394/885] 2041030=test_rdoc_normal_module I, [2024-05-19T00:41:42.933885 #1999693] INFO -- : [395/885] 2041029=test_rdoc_markdown_test I, [2024-05-19T00:41:42.941885 #1999693] INFO -- : [396/885] 2041034=test_logperiod I, [2024-05-19T00:41:42.958240 #1999693] INFO -- : [397/885] 2041034=test_rdoc_markup_to_table_of_contents I, [2024-05-19T00:41:42.963139 #1999693] INFO -- : [398/885] 2041038=test_thread I, [2024-05-19T00:41:42.979957 #1999693] INFO -- : [399/885] 2041034=test_socket I, [2024-05-19T00:41:43.001919 #1999693] INFO -- : [400/885] 2041023=test_objectspace I, [2024-05-19T00:41:43.028337 #1999693] INFO -- : [401/885] 2041030=test_literal I, [2024-05-19T00:41:43.092449 #1999693] INFO -- : [402/885] 2041041=test_str2big I, [2024-05-19T00:41:43.096397 #1999693] INFO -- : [403/885] 2041041=test_dot_dot I, [2024-05-19T00:41:43.097846 #1999693] INFO -- : [404/885] 2041041=test_c_struct_builder I, [2024-05-19T00:41:43.101782 #1999693] INFO -- : [405/885] 2041032=test_gem_stream_ui I, [2024-05-19T00:41:43.148239 #1999693] INFO -- : [406/885] 2041028=test_extlibs I, [2024-05-19T00:41:43.174564 #1999693] INFO -- : [407/885] 2041032=test_rdoc_generator_ri I, [2024-05-19T00:41:43.175399 #1999693] INFO -- : [408/885] 2041041=test_ractor I, [2024-05-19T00:41:43.179796 #1999693] INFO -- : [409/885] 2041032=test_severity I, [2024-05-19T00:41:43.181430 #1999693] INFO -- : [410/885] 2041032=test_require_lib I, [2024-05-19T00:41:43.182666 #1999693] INFO -- : [411/885] 2041038=test_gem_install_update_options I, [2024-05-19T00:41:43.187988 #1999693] INFO -- : [412/885] 2041041=parse_test I, [2024-05-19T00:41:43.285158 #1999693] INFO -- : [413/885] 2041038=test_rdoc_generator_pot_po I, [2024-05-19T00:41:43.285605 #1999693] INFO -- : [414/885] 2041038=test_ansi_with_terminfo I, [2024-05-19T00:41:43.347648 #1999693] INFO -- : [415/885] 2041038=test_json_tree I, [2024-05-19T00:41:43.354547 #1999693] INFO -- : [416/885] 2041038=test_rdoc_markup_to_markdown I, [2024-05-19T00:41:43.404713 #1999693] INFO -- : [417/885] 2041038=test_m17n_comb I, [2024-05-19T00:41:43.510560 #1999693] INFO -- : [418/885] 2041026=test_memory_view I, [2024-05-19T00:41:43.519950 #1999693] INFO -- : [419/885] 2041035=test_ractor I, [2024-05-19T00:41:43.582053 #1999693] INFO -- : [420/885] 2041035=test_cclass I, [2024-05-19T00:41:43.622205 #1999693] INFO -- : [421/885] 2041026=test_gem_request_connection_pools I, [2024-05-19T00:41:43.717078 #1999693] INFO -- : [422/885] 2041035=test_gem_version_option I, [2024-05-19T00:41:43.761872 #1999693] INFO -- : [423/885] 2041035=test_grapheme_breaks I, [2024-05-19T00:41:43.762391 #1999693] INFO -- : [424/885] 2041030=test_case I, [2024-05-19T00:41:43.768003 #1999693] INFO -- : [425/885] 2041030=test_pkey I, [2024-05-19T00:41:43.795646 #1999693] INFO -- : [426/885] 2041029=test_parser_events I, [2024-05-19T00:41:43.809683 #1999693] INFO -- : [427/885] 2041030=test_reline I, [2024-05-19T00:41:43.811995 #1999693] INFO -- : [428/885] 2041035=test_enumerator_kw I, [2024-05-19T00:41:43.819824 #1999693] INFO -- : [429/885] 2041035=test_gem_text I, [2024-05-19T00:41:43.839449 #1999693] INFO -- : [430/885] 2041029=test_settracefunc I, [2024-05-19T00:41:43.846381 #1999693] INFO -- : [431/885] 2041036=test_win32ole I, [2024-05-19T00:41:43.853074 #1999693] INFO -- : [432/885] 2041036=test_generic I, [2024-05-19T00:41:43.873168 #1999693] INFO -- : [433/885] 2041035=test_scan_args I, [2024-05-19T00:41:43.886365 #1999693] INFO -- : [434/885] 2041035=test_method_cache I, [2024-05-19T00:41:43.889802 #1999693] INFO -- : [435/885] 2041035=test_gem_request I, [2024-05-19T00:41:43.904337 #1999693] INFO -- : [436/885] 2041036=test_sprintf_comb I, [2024-05-19T00:41:43.959951 #1999693] INFO -- : [437/885] 2041023=test_gem_ext_cargo_builder_link_flag_converter I, [2024-05-19T00:41:44.005829 #1999693] INFO -- : [438/885] 2041023=test_gem_commands_mirror I, [2024-05-19T00:41:44.012197 #1999693] INFO -- : [439/885] 2041023=test_bug_reporter I, [2024-05-19T00:41:44.059723 #1999693] INFO -- : [440/885] 2041036=test_rand I, [2024-05-19T00:41:44.093506 #1999693] INFO -- : [441/885] 2041035=test_gem_package_tar_reader_entry I, [2024-05-19T00:41:44.220216 #1999693] INFO -- : [442/885] 2041030=test_gem_name_tuple I, [2024-05-19T00:41:44.240558 #1999693] INFO -- : [443/885] 2041030=test_exception I, [2024-05-19T00:41:44.269940 #1999693] INFO -- : [444/885] 2041035=test_case_options I, [2024-05-19T00:41:44.272224 #1999693] INFO -- : [445/885] 2041034=test_store I, [2024-05-19T00:41:44.273257 #1999693] INFO -- : [446/885] 2041035=test_rdoc_cross_reference I, [2024-05-19T00:41:44.300238 #1999693] INFO -- : [447/885] 2041036=test_scalar I, [2024-05-19T00:41:44.308976 #1999693] INFO -- : [448/885] 2041036=test_gem_dependency_installer I, [2024-05-19T00:41:44.441071 #1999693] INFO -- : [449/885] 2041023=test_gem_commands_info_command I, [2024-05-19T00:41:44.455683 #1999693] INFO -- : [450/885] 2041034=test_marshal I, [2024-05-19T00:41:44.464633 #1999693] INFO -- : [451/885] 2041023=test_unicode_normalize I, [2024-05-19T00:41:44.654173 #1999693] INFO -- : [452/885] 2041026=test_nonblock I, [2024-05-19T00:41:44.666607 #1999693] INFO -- : [453/885] 2041026=test_weakref I, [2024-05-19T00:41:44.807942 #1999693] INFO -- : [454/885] 2041026=test_alias I, [2024-05-19T00:41:44.823987 #1999693] INFO -- : [455/885] 2041035=test_timeout I, [2024-05-19T00:41:44.884688 #1999693] INFO -- : [456/885] 2041029=test_ancdata I, [2024-05-19T00:41:44.890392 #1999693] INFO -- : [457/885] 2041029=test_singleton_function I, [2024-05-19T00:41:44.894037 #1999693] INFO -- : [458/885] 2041029=test_rb_str_dup I, [2024-05-19T00:41:44.895541 #1999693] INFO -- : [459/885] 2041029=test_reline_key I, [2024-05-19T00:41:44.902390 #1999693] INFO -- : [460/885] 2041029=test_ssl I, [2024-05-19T00:41:44.999343 #1999693] INFO -- : [461/885] 2041026=test_ractor I, [2024-05-19T00:41:45.099380 #1999693] INFO -- : [462/885] 2041034=test_my_integer I, [2024-05-19T00:41:45.103737 #1999693] INFO -- : [463/885] 2041034=json_ext_parser_test I, [2024-05-19T00:41:45.116265 #1999693] INFO -- : [464/885] 2041034=test_thread I, [2024-05-19T00:41:45.172331 #1999693] INFO -- : [465/885] 2041028=test_debugger_integration I, [2024-05-19T00:41:45.186182 #1999693] INFO -- : [466/885] 2041028=test_rendering I, [2024-05-19T00:41:45.277421 #1999693] INFO -- : [467/885] 2041028=parse_stream_test I, [2024-05-19T00:41:45.317809 #1999693] INFO -- : [468/885] 2041029=test_registry I, [2024-05-19T00:41:45.317885 #1999693] INFO -- : [469/885] 2041029=test_ractor I, [2024-05-19T00:41:45.343098 #1999693] INFO -- : [470/885] 2041029=test_gem_commands_open_command I, [2024-05-19T00:41:45.353213 #1999693] INFO -- : [471/885] 2041028=test_dns I, [2024-05-19T00:41:45.360237 #1999693] INFO -- : [472/885] 2041026=test_gem_source_lock I, [2024-05-19T00:41:45.366308 #1999693] INFO -- : [473/885] 2041038=test_gem I, [2024-05-19T00:41:45.402179 #1999693] INFO -- : [474/885] 2041026=test_cgi_core I, [2024-05-19T00:41:45.409793 #1999693] INFO -- : [475/885] 2041026=test_parser I, [2024-05-19T00:41:45.427685 #1999693] INFO -- : [476/885] 2041026=test_gem_commands_setup_command I, [2024-05-19T00:41:45.462273 #1999693] INFO -- : [477/885] 2041029=test_rdoc_attr I, [2024-05-19T00:41:45.475562 #1999693] INFO -- : [478/885] 2041029=test_env I, [2024-05-19T00:41:45.558346 #1999693] INFO -- : [479/885] 2041022=test_integer I, [2024-05-19T00:41:45.632671 #1999693] INFO -- : [480/885] 2041022=desugar_compiler_test I, [2024-05-19T00:41:45.656466 #1999693] INFO -- : [481/885] 2041035=test_dryrun I, [2024-05-19T00:41:45.674780 #1999693] INFO -- : [482/885] 2041035=test_nextafter I, [2024-05-19T00:41:45.736875 #1999693] INFO -- : [483/885] 2041035=test_capacity I, [2024-05-19T00:41:45.741260 #1999693] INFO -- : [484/885] 2041035=test_stat I, [2024-05-19T00:41:45.745655 #1999693] INFO -- : [485/885] 2041035=test_gem_request_set_lockfile_tokenizer I, [2024-05-19T00:41:45.758256 #1999693] INFO -- : [486/885] 2041022=test_have_func I, [2024-05-19T00:41:45.783394 #1999693] INFO -- : [487/885] 2041035=test_gem_resolver_git_specification I, [2024-05-19T00:41:45.852861 #1999693] INFO -- : [488/885] 2041028=test_object_references I, [2024-05-19T00:41:45.861038 #1999693] INFO -- : [489/885] 2041028=test_usrmarshal I, [2024-05-19T00:41:45.915577 #1999693] INFO -- : [490/885] 2041041=test_cgi_modruby I, [2024-05-19T00:41:45.922873 #1999693] INFO -- : [491/885] 2041041=test_integer I, [2024-05-19T00:41:45.948109 #1999693] INFO -- : [492/885] 2041026=test_super I, [2024-05-19T00:41:46.076330 #1999693] INFO -- : [493/885] 2041028=test_rubyoptions I, [2024-05-19T00:41:46.082566 #1999693] INFO -- : [494/885] 2041035=test_call I, [2024-05-19T00:41:46.234205 #1999693] INFO -- : [495/885] 2041035=test_https_proxy I, [2024-05-19T00:41:46.296136 #1999693] INFO -- : [496/885] 2041035=test_rubygems I, [2024-05-19T00:41:46.450445 #1999693] INFO -- : [497/885] 2041030=test_coder I, [2024-05-19T00:41:46.470474 #1999693] INFO -- : [498/885] 2041030=test_symbol I, [2024-05-19T00:41:46.491276 #1999693] INFO -- : [499/885] 2041035=test_context I, [2024-05-19T00:41:46.493545 #1999693] INFO -- : [500/885] 2041026=test_gem_commands_pristine_command I, [2024-05-19T00:41:46.511980 #1999693] INFO -- : [501/885] 2041036=test_nofree I, [2024-05-19T00:41:46.515175 #1999693] INFO -- : [502/885] 2041036=ruby_api_test I, [2024-05-19T00:41:46.593701 #1999693] INFO -- : [503/885] 2041035=test_find_executable I, [2024-05-19T00:41:46.611589 #1999693] INFO -- : [504/885] 2041039=test_lazy_enumerator I, [2024-05-19T00:41:46.614598 #1999693] INFO -- : [505/885] 2041035=test_enc_associate I, [2024-05-19T00:41:46.634639 #1999693] INFO -- : [506/885] 2041036=test_unix I, [2024-05-19T00:41:46.636806 #1999693] INFO -- : [507/885] 2041027=test_gem_resolver_requirement_list I, [2024-05-19T00:41:46.657602 #1999693] INFO -- : [508/885] 2041027=test_arith_seq_beg_len_step I, [2024-05-19T00:41:46.666677 #1999693] INFO -- : [509/885] 2041032=test_pkcs7 I, [2024-05-19T00:41:46.685851 #1999693] INFO -- : [510/885] 2041036=test_function_entry I, [2024-05-19T00:41:46.693214 #1999693] INFO -- : [511/885] 2041036=test_http_request I, [2024-05-19T00:41:46.709784 #1999693] INFO -- : [512/885] 2041036=test_gem_source_fetch_problem I, [2024-05-19T00:41:46.715458 #1999693] INFO -- : [513/885] 2041027=json_generic_object_test I, [2024-05-19T00:41:46.723933 #1999693] INFO -- : [514/885] 2041036=test_rdoc_generator_darkfish I, [2024-05-19T00:41:46.754876 #1999693] INFO -- : [515/885] 2041027=test_rdoc_comment I, [2024-05-19T00:41:46.786082 #1999693] INFO -- : [516/885] 2041027=test_resize I, [2024-05-19T00:41:46.791251 #1999693] INFO -- : [517/885] 2041027=test_error_highlight I, [2024-05-19T00:41:46.843006 #1999693] INFO -- : [518/885] 2041032=test_mailto I, [2024-05-19T00:41:46.855252 #1999693] INFO -- : [519/885] 2041032=test_coderange I, [2024-05-19T00:41:46.859406 #1999693] INFO -- : [520/885] 2041032=location_test I, [2024-05-19T00:41:46.954221 #1999693] INFO -- : [521/885] 2041032=test_symbol I, [2024-05-19T00:41:46.958607 #1999693] INFO -- : [522/885] 2041032=test_ractor_compatibility I, [2024-05-19T00:41:46.994370 #1999693] INFO -- : [523/885] 2041036=format_errors_test I, [2024-05-19T00:41:46.998223 #1999693] INFO -- : [524/885] 2041036=test_dir I, [2024-05-19T00:41:47.051671 #1999693] INFO -- : [525/885] 2041039=test_date_ractor I, [2024-05-19T00:41:47.149825 #1999693] INFO -- : [526/885] 2041035=test_gem_console_ui I, [2024-05-19T00:41:47.160926 #1999693] INFO -- : [527/885] 2041035=test_eval I, [2024-05-19T00:41:47.165772 #1999693] INFO -- : [528/885] 2041035=test_autoconf I, [2024-05-19T00:41:47.169976 #1999693] INFO -- : [529/885] 2041035=test_cgi_multipart I, [2024-05-19T00:41:47.180002 #1999693] INFO -- : [530/885] 2041027=test_word I, [2024-05-19T00:41:47.184645 #1999693] INFO -- : [531/885] 2041027=test_gem_commands_cleanup_command I, [2024-05-19T00:41:47.251232 #1999693] INFO -- : [532/885] 2041036=test_numeric I, [2024-05-19T00:41:47.256385 #1999693] INFO -- : [533/885] 2041036=test_member I, [2024-05-19T00:41:47.262314 #1999693] INFO -- : [534/885] 2041036=test_gem_resolver_api_specification I, [2024-05-19T00:41:47.284161 #1999693] INFO -- : [535/885] 2041039=test_ipaddr I, [2024-05-19T00:41:47.311441 #1999693] INFO -- : [536/885] 2041039=test_history I, [2024-05-19T00:41:47.314533 #1999693] INFO -- : [537/885] 2041036=test_mixed_unicode_escapes I, [2024-05-19T00:41:47.321449 #1999693] INFO -- : [538/885] 2041036=test_rdoc_markup_to_ansi I, [2024-05-19T00:41:47.327049 #1999693] INFO -- : [539/885] 2041035=test_win32ole_variant I, [2024-05-19T00:41:47.333477 #1999693] INFO -- : [540/885] 2041035=test_rdoc_extend I, [2024-05-19T00:41:47.352171 #1999693] INFO -- : [541/885] 2041036=test_merge_keys I, [2024-05-19T00:41:47.352644 #1999693] INFO -- : [542/885] 2041038=test_have_macro I, [2024-05-19T00:41:47.362628 #1999693] INFO -- : [543/885] 2041036=test_resolve_symbol I, [2024-05-19T00:41:47.380101 #1999693] INFO -- : [544/885] 2041035=test_complex2 I, [2024-05-19T00:41:47.389655 #1999693] INFO -- : [545/885] 2041035=test_gem_package I, [2024-05-19T00:41:47.395236 #1999693] INFO -- : [546/885] 2041032=test_threadgroup I, [2024-05-19T00:41:47.396359 #1999693] INFO -- : [547/885] 2041023=test_gem_specification I, [2024-05-19T00:41:47.407302 #1999693] INFO -- : [548/885] 2041039=test_enum I, [2024-05-19T00:41:47.417654 #1999693] INFO -- : [549/885] 2041040=test_win32ole_variable I, [2024-05-19T00:41:47.419969 #1999693] INFO -- : [550/885] 2041040=test_arity I, [2024-05-19T00:41:47.425470 #1999693] INFO -- : [551/885] 2041040=test_stringio I, [2024-05-19T00:41:47.428782 #1999693] INFO -- : [552/885] 2041036=test_io_wait_uncommon I, [2024-05-19T00:41:47.434167 #1999693] INFO -- : [553/885] 2041036=test_bignum I, [2024-05-19T00:41:47.532565 #1999693] INFO -- : [554/885] 2041022=test_rdoc_class_module I, [2024-05-19T00:41:47.538877 #1999693] INFO -- : [555/885] 2041036=test_gem_ci_detector I, [2024-05-19T00:41:47.552912 #1999693] INFO -- : [556/885] 2041036=test_rdoc_generator_json_index I, [2024-05-19T00:41:47.582981 #1999693] INFO -- : [557/885] 2041036=test_win32ole_event I, [2024-05-19T00:41:47.590611 #1999693] INFO -- : [558/885] 2041036=test_time_tz I, [2024-05-19T00:41:47.608182 #1999693] INFO -- : [559/885] 2041040=ractor_test I, [2024-05-19T00:41:47.654990 #1999693] INFO -- : [560/885] 2041027=test_trace I, [2024-05-19T00:41:47.664375 #1999693] INFO -- : [561/885] 2041036=test_signedness I, [2024-05-19T00:41:47.675238 #1999693] INFO -- : [562/885] 2041027=test_tsort I, [2024-05-19T00:41:47.678402 #1999693] INFO -- : [563/885] 2041027=test_rdoc_rd_block_parser I, [2024-05-19T00:41:47.682818 #1999693] INFO -- : [564/885] 2041040=test_pointer I, [2024-05-19T00:41:47.698867 #1999693] INFO -- : [565/885] 2041027=test_func I, [2024-05-19T00:41:47.805289 #1999693] INFO -- : [566/885] 2041026=test_big5 I, [2024-05-19T00:41:47.808868 #1999693] INFO -- : [567/885] 2041026=test_ractor I, [2024-05-19T00:41:47.863833 #1999693] INFO -- : [568/885] 2041026=test_type I, [2024-05-19T00:41:47.868641 #1999693] INFO -- : [569/885] 2041026=test_sleep I, [2024-05-19T00:41:47.873884 #1999693] INFO -- : [570/885] 2041038=test_date_arith I, [2024-05-19T00:41:47.878315 #1999693] INFO -- : [571/885] 2041038=test_ruby_lex I, [2024-05-19T00:41:47.983068 #1999693] INFO -- : [572/885] 2041035=test_object I, [2024-05-19T00:41:47.992051 #1999693] INFO -- : [573/885] 2041040=test_gem_local_remote_options I, [2024-05-19T00:41:48.000293 #1999693] INFO -- : [574/885] 2041038=test_timeout I, [2024-05-19T00:41:48.007706 #1999693] INFO -- : [575/885] 2041038=test_ossl I, [2024-05-19T00:41:48.009557 #1999693] INFO -- : [576/885] 2041022=test_normalize I, [2024-05-19T00:41:48.013137 #1999693] INFO -- : [577/885] 2041022=test_change_word I, [2024-05-19T00:41:48.016070 #1999693] INFO -- : [578/885] 2041022=test_flip I, [2024-05-19T00:41:48.021276 #1999693] INFO -- : [579/885] 2041040=compiler_test I, [2024-05-19T00:41:48.029756 #1999693] INFO -- : [580/885] 2041022=test_arithmetic_sequence I, [2024-05-19T00:41:48.036191 #1999693] INFO -- : [581/885] 2041022=test_basicinstructions I, [2024-05-19T00:41:48.093298 #1999693] INFO -- : [582/885] 2041022=test_gem_gemcutter_utilities I, [2024-05-19T00:41:48.096937 #1999693] INFO -- : [583/885] 2041040=test_gem_command_manager I, [2024-05-19T00:41:48.218708 #1999693] INFO -- : [584/885] 2041040=test_key_actor_emacs I, [2024-05-19T00:41:48.326153 #1999693] INFO -- : [585/885] 2041035=version_test I, [2024-05-19T00:41:48.360018 #1999693] INFO -- : [586/885] 2041025=test_object I, [2024-05-19T00:41:48.365191 #1999693] INFO -- : [587/885] 2041025=test_cgi_header I, [2024-05-19T00:41:48.374791 #1999693] INFO -- : [588/885] 2041025=heredoc_dedent_test I, [2024-05-19T00:41:48.380891 #1999693] INFO -- : [589/885] 2041025=test_rdoc_parser_markdown I, [2024-05-19T00:41:48.387627 #1999693] INFO -- : [590/885] 2041025=test_gem_resolver_lock_set I, [2024-05-19T00:41:48.392330 #1999693] INFO -- : [591/885] 2041035=test_not I, [2024-05-19T00:41:48.394992 #1999693] INFO -- : [592/885] 2041035=test_import I, [2024-05-19T00:41:48.400291 #1999693] INFO -- : [593/885] 2041040=test_logger I, [2024-05-19T00:41:48.403926 #1999693] INFO -- : [594/885] 2041032=test_file_exhaustive I, [2024-05-19T00:41:48.410621 #1999693] INFO -- : [595/885] 2041025=test_gem_update_suggestion I, [2024-05-19T00:41:48.414110 #1999693] INFO -- : [596/885] 2041022=test_files_test I, [2024-05-19T00:41:48.415240 #1999693] INFO -- : [597/885] 2041040=test_class_name_check I, [2024-05-19T00:41:48.432612 #1999693] INFO -- : [598/885] 2041039=test_keyword I, [2024-05-19T00:41:48.461989 #1999693] INFO -- : [599/885] 2041025=test_fd_setsize I, [2024-05-19T00:41:48.463665 #1999693] INFO -- : [600/885] 2041025=test_continuation I, [2024-05-19T00:41:48.466589 #1999693] INFO -- : [601/885] 2041025=test_win32ole_method I, [2024-05-19T00:41:48.467628 #1999693] INFO -- : [602/885] 2041040=test_delete I, [2024-05-19T00:41:48.469608 #1999693] INFO -- : [603/885] 2041025=test_gem_platform I, [2024-05-19T00:41:48.474944 #1999693] INFO -- : [604/885] 2041040=test_gem_package_task I, [2024-05-19T00:41:48.480730 #1999693] INFO -- : [605/885] 2041040=test_date_strptime I, [2024-05-19T00:41:48.489963 #1999693] INFO -- : [606/885] 2041022=test_placearg I, [2024-05-19T00:41:48.541797 #1999693] INFO -- : [607/885] 2041025=test_rdoc_markup_hard_break I, [2024-05-19T00:41:48.545635 #1999693] INFO -- : [608/885] 2041025=test_gem_commands_push_command I, [2024-05-19T00:41:48.568058 #1999693] INFO -- : [609/885] 2041022=test_weakkeymap I, [2024-05-19T00:41:48.578503 #1999693] INFO -- : [610/885] 2041029=test_numhash I, [2024-05-19T00:41:48.585456 #1999693] INFO -- : [611/885] 2041040=test_pkey_rsa I, [2024-05-19T00:41:48.607712 #1999693] INFO -- : [612/885] 2041029=test_webauthn_listener I, [2024-05-19T00:41:48.630829 #1999693] INFO -- : [613/885] 2041041=test_random_formatter I, [2024-05-19T00:41:48.647433 #1999693] INFO -- : [614/885] 2041041=test_helper I, [2024-05-19T00:41:48.649178 #1999693] INFO -- : [615/885] 2041041=test_jaro_winkler I, [2024-05-19T00:41:48.651639 #1999693] INFO -- : [616/885] 2041041=test_gem_request_set_gem_dependency_api I, [2024-05-19T00:41:48.669724 #1999693] INFO -- : [617/885] 2041029=test_ast I, [2024-05-19T00:41:48.803942 #1999693] INFO -- : [618/885] 2041022=test_lambda I, [2024-05-19T00:41:48.837999 #1999693] INFO -- : [619/885] 2041041=test_update I, [2024-05-19T00:41:48.842093 #1999693] INFO -- : [620/885] 2041041=test_fips I, [2024-05-19T00:41:48.845069 #1999693] INFO -- : [621/885] 2041040=test_x509name I, [2024-05-19T00:41:48.852344 #1999693] INFO -- : [622/885] 2041040=test_x509store I, [2024-05-19T00:41:48.868583 #1999693] INFO -- : [623/885] 2041022=test_rdoc_code_object I, [2024-05-19T00:41:48.985532 #1999693] INFO -- : [624/885] 2041025=json_generator_test I, [2024-05-19T00:41:49.027078 #1999693] INFO -- : [625/885] 2041039=test_eval I, [2024-05-19T00:41:49.102927 #1999693] INFO -- : [626/885] 2041025=test_transcode I, [2024-05-19T00:41:49.117038 #1999693] INFO -- : [627/885] 2041023=test_gem_resolver_api_set I, [2024-05-19T00:41:49.131577 #1999693] INFO -- : [628/885] 2041040=test_gem_safe_marshal I, [2024-05-19T00:41:49.139999 #1999693] INFO -- : [629/885] 2041027=test_enumerable I, [2024-05-19T00:41:49.141012 #1999693] INFO -- : [630/885] 2041041=test_config I, [2024-05-19T00:41:49.146047 #1999693] INFO -- : [631/885] 2041027=test_gem_resolver_vendor_set I, [2024-05-19T00:41:49.146685 #1999693] INFO -- : [632/885] 2041023=test_ensured I, [2024-05-19T00:41:49.161577 #1999693] INFO -- : [633/885] 2041027=library_symbols_test I, [2024-05-19T00:41:49.166405 #1999693] INFO -- : [634/885] 2041027=test_locale I, [2024-05-19T00:41:49.186337 #1999693] INFO -- : [635/885] 2041022=test_addr I, [2024-05-19T00:41:49.191237 #1999693] INFO -- : [636/885] 2041023=test_ts I, [2024-05-19T00:41:49.207875 #1999693] INFO -- : [637/885] 2041022=test_rdoc_ri_paths I, [2024-05-19T00:41:49.239942 #1999693] INFO -- : [638/885] 2041022=test_range I, [2024-05-19T00:41:49.241873 #1999693] INFO -- : [639/885] 2041027=test_project_sanity I, [2024-05-19T00:41:49.248463 #1999693] INFO -- : [640/885] 2041039=test_constant I, [2024-05-19T00:41:49.293458 #1999693] INFO -- : [641/885] 2041025=test_dup I, [2024-05-19T00:41:49.307312 #1999693] INFO -- : [642/885] 2041027=test_pty I, [2024-05-19T00:41:49.333003 #1999693] INFO -- : [643/885] 2041030=command_line_test I, [2024-05-19T00:41:49.334460 #1999693] INFO -- : [644/885] 2041030=test_helper I, [2024-05-19T00:41:49.336294 #1999693] INFO -- : [645/885] 2041030=test_erb_command I, [2024-05-19T00:41:49.372905 #1999693] INFO -- : [646/885] 2041030=test_encoding I, [2024-05-19T00:41:49.486388 #1999693] INFO -- : [647/885] 2041025=test_gem_uri_formatter I, [2024-05-19T00:41:49.490342 #1999693] INFO -- : [648/885] 2041035=static_inspect_test I, [2024-05-19T00:41:49.493782 #1999693] INFO -- : [649/885] 2041035=test_udp I, [2024-05-19T00:41:49.498896 #1999693] INFO -- : [650/885] 2041035=test_data_error I, [2024-05-19T00:41:49.504030 #1999693] INFO -- : [651/885] 2041025=bom_test I, [2024-05-19T00:41:49.514638 #1999693] INFO -- : [652/885] 2041025=unescape_test I, [2024-05-19T00:41:49.520170 #1999693] INFO -- : [653/885] 2041030=test_ostruct I, [2024-05-19T00:41:49.582204 #1999693] INFO -- : [654/885] 2041041=test_file I, [2024-05-19T00:41:49.587586 #1999693] INFO -- : [655/885] 2041035=test_force_exit I, [2024-05-19T00:41:49.590133 #1999693] INFO -- : [656/885] 2041035=test_integer_comb I, [2024-05-19T00:41:49.612456 #1999693] INFO -- : [657/885] 2041040=test_rdoc_markup_document I, [2024-05-19T00:41:49.684832 #1999693] INFO -- : [658/885] 2041030=test_tmpdir I, [2024-05-19T00:41:49.686071 #1999693] INFO -- : [659/885] 2041023=test_vm_dump I, [2024-05-19T00:41:49.690672 #1999693] INFO -- : [660/885] 2041023=errors_test I, [2024-05-19T00:41:49.711401 #1999693] INFO -- : [661/885] 2041040=test_gem_commands_check_command I, [2024-05-19T00:41:49.735068 #1999693] INFO -- : [662/885] 2041040=test_regexp I, [2024-05-19T00:41:49.783255 #1999693] INFO -- : [663/885] 2041030=test_bundled_ca I, [2024-05-19T00:41:49.856453 #1999693] INFO -- : [664/885] 2041023=test_closure I, [2024-05-19T00:41:49.859246 #1999693] INFO -- : [665/885] 2041027=test_multi_irb_commands I, [2024-05-19T00:41:49.861558 #1999693] INFO -- : [666/885] 2041027=test_fiber I, [2024-05-19T00:41:49.986366 #1999693] INFO -- : [667/885] 2041031=test_open3 I, [2024-05-19T00:41:49.993652 #1999693] INFO -- : [668/885] 2041022=test_ractor I, [2024-05-19T00:41:50.035199 #1999693] INFO -- : [669/885] 2041036=test_rdoc_servlet I, [2024-05-19T00:41:50.075902 #1999693] INFO -- : [670/885] 2041022=test_gem_security I, [2024-05-19T00:41:50.172263 #1999693] INFO -- : [671/885] 2041036=test_digest I, [2024-05-19T00:41:50.190619 #1999693] INFO -- : [672/885] 2041036=test_exit I, [2024-05-19T00:41:50.289436 #1999693] INFO -- : [673/885] 2041036=test_recursion I, [2024-05-19T00:41:50.291893 #1999693] INFO -- : [674/885] 2041036=test_history I, [2024-05-19T00:41:50.434439 #1999693] INFO -- : [675/885] 2041036=test_mkmf I, [2024-05-19T00:41:50.446684 #1999693] INFO -- : [676/885] 2041023=test_date_marshal I, [2024-05-19T00:41:50.448871 #1999693] INFO -- : [677/885] 2041036=test_delegate I, [2024-05-19T00:41:50.453157 #1999693] INFO -- : [678/885] 2041023=test_popen_deadlock I, [2024-05-19T00:41:50.460522 #1999693] INFO -- : [679/885] 2041036=test_pinned I, [2024-05-19T00:41:50.482765 #1999693] INFO -- : [680/885] 2041025=test_to_ary_concat I, [2024-05-19T00:41:50.505825 #1999693] INFO -- : [681/885] 2041036=test_time I, [2024-05-19T00:41:50.704550 #1999693] INFO -- : [682/885] 2041036=test_webauthn_listener_response I, [2024-05-19T00:41:50.717920 #1999693] INFO -- : [683/885] 2041036=test_stream I, [2024-05-19T00:41:50.723031 #1999693] INFO -- : [684/885] 2041036=test_printf I, [2024-05-19T00:41:50.742375 #1999693] INFO -- : [685/885] 2041036=test_rdoc_markup_pre_process I, [2024-05-19T00:41:50.832760 #1999693] INFO -- : [686/885] 2041036=test_help I, [2024-05-19T00:41:50.835375 #1999693] INFO -- : [687/885] 2041036=test_rdoc_markup_to_bs I, [2024-05-19T00:41:50.870557 #1999693] INFO -- : [688/885] 2041036=test_files_lib I, [2024-05-19T00:41:51.089412 #1999693] INFO -- : [689/885] 2041023=test_gem_commands_unpack_command I, [2024-05-19T00:41:51.319784 #1999693] INFO -- : [690/885] 2041023=test_beginendblock I, [2024-05-19T00:41:51.393493 #1999693] INFO -- : [691/885] 2041025=reflection_test I, [2024-05-19T00:41:51.393718 #1999693] INFO -- : [692/885] 2041025=test_emoji_breaks I, [2024-05-19T00:41:51.401050 #1999693] INFO -- : [693/885] 2041025=test_gem_bundler_version_finder I, [2024-05-19T00:41:51.427643 #1999693] INFO -- : [694/885] 2041025=test_within_pipe I, [2024-05-19T00:41:51.455884 #1999693] INFO -- : [695/885] 2041025=test_scheduler I, [2024-05-19T00:41:51.508509 #1999693] INFO -- : [696/885] 2041030=test_pkey_dsa I, [2024-05-19T00:41:51.540031 #1999693] INFO -- : [697/885] 2041039=test_ocsp I, [2024-05-19T00:41:51.542592 #1999693] INFO -- : [698/885] 2041035=test_class I, [2024-05-19T00:41:51.546369 #1999693] INFO -- : [699/885] 2041035=test_rdoc_markup_heading I, [2024-05-19T00:41:51.553599 #1999693] INFO -- : [700/885] 2041035=test_exception_at_throwing I, [2024-05-19T00:41:51.598049 #1999693] INFO -- : [701/885] 2041035=test_iseq I, [2024-05-19T00:41:51.618196 #1999693] INFO -- : [702/885] 2041025=test_cmethod I, [2024-05-19T00:41:51.620659 #1999693] INFO -- : [703/885] 2041025=test_tracer I, [2024-05-19T00:41:51.629537 #1999693] INFO -- : [704/885] 2041023=test_append I, [2024-05-19T00:41:51.643007 #1999693] INFO -- : [705/885] 2041023=test_option I, [2024-05-19T00:41:51.677502 #1999693] INFO -- : [706/885] 2041025=test_gem_commands_server_command I, [2024-05-19T00:41:51.682414 #1999693] INFO -- : [707/885] 2041025=test_io_m17n I, [2024-05-19T00:41:51.781594 #1999693] INFO -- : [708/885] 2041023=test_variable_name_check I, [2024-05-19T00:41:51.823642 #1999693] INFO -- : [709/885] 2041023=test_did_you_mean I, [2024-05-19T00:41:51.854121 #1999693] INFO -- : [710/885] 2041039=test_interned_str I, [2024-05-19T00:41:51.872443 #1999693] INFO -- : [711/885] 2041039=test_case_comprehensive I, [2024-05-19T00:41:51.892260 #1999693] INFO -- : [712/885] 2041024=test_gem_commands_build_command I, [2024-05-19T00:41:51.906408 #1999693] INFO -- : [713/885] 2041023=test_gem_uri I, [2024-05-19T00:41:51.941016 #1999693] INFO -- : [714/885] 2041023=test_key_event_record I, [2024-05-19T00:41:51.961625 #1999693] INFO -- : [715/885] 2041030=test_notimplement I, [2024-05-19T00:41:51.963398 #1999693] INFO -- : [716/885] 2041030=test_random I, [2024-05-19T00:41:51.968893 #1999693] INFO -- : [717/885] 2041030=test_gem_resolver_vendor_specification I, [2024-05-19T00:41:51.981605 #1999693] INFO -- : [718/885] 2041023=test_gem_commands_update_command I, [2024-05-19T00:41:51.984403 #1999693] INFO -- : [719/885] 2041030=test_ssl_session I, [2024-05-19T00:41:52.076229 #1999693] INFO -- : [720/885] 2041024=test_lexer I, [2024-05-19T00:41:52.082625 #1999693] INFO -- : [721/885] 2041024=test_thread_cv I, [2024-05-19T00:41:52.158664 #1999693] INFO -- : [722/885] 2041035=test_rdoc_parser_changelog I, [2024-05-19T00:41:52.263935 #1999693] INFO -- : [723/885] 2041037=test_enumerator I, [2024-05-19T00:41:52.268832 #1999693] INFO -- : [724/885] 2041037=test_koi8 I, [2024-05-19T00:41:52.273885 #1999693] INFO -- : [725/885] 2041035=parameters_signature_test I, [2024-05-19T00:41:52.276074 #1999693] INFO -- : [726/885] 2041031=test_unicode I, [2024-05-19T00:41:52.276151 #1999693] INFO -- : [727/885] 2041037=test_rdoc_generator_pot I, [2024-05-19T00:41:52.279798 #1999693] INFO -- : [728/885] 2041037=test_filter I, [2024-05-19T00:41:52.283536 #1999693] INFO -- : [729/885] 2041035=test_gem_gem_runner I, [2024-05-19T00:41:52.289538 #1999693] INFO -- : [730/885] 2041031=static_literals_test I, [2024-05-19T00:41:52.294214 #1999693] INFO -- : [731/885] 2041031=test_data I, [2024-05-19T00:41:52.295845 #1999693] INFO -- : [732/885] 2041037=test_rdoc_method_attr I, [2024-05-19T00:41:52.301699 #1999693] INFO -- : [733/885] 2041031=test_addrinfo I, [2024-05-19T00:41:52.323813 #1999693] INFO -- : [734/885] 2041031=test_http I, [2024-05-19T00:41:52.334222 #1999693] INFO -- : [735/885] 2041035=test_tree_spell_checker I, [2024-05-19T00:41:52.368175 #1999693] INFO -- : [736/885] 2041035=test_path I, [2024-05-19T00:41:52.373428 #1999693] INFO -- : [737/885] 2041035=redundant_return_test I, [2024-05-19T00:41:52.375721 #1999693] INFO -- : [738/885] 2041035=test_case_mapping I, [2024-05-19T00:41:52.387495 #1999693] INFO -- : [739/885] 2041035=test_bn I, [2024-05-19T00:41:52.392259 #1999693] INFO -- : [740/885] 2041037=test_win32ole_param_event I, [2024-05-19T00:41:52.394831 #1999693] INFO -- : [741/885] 2041037=test_terminfo I, [2024-05-19T00:41:52.400189 #1999693] INFO -- : [742/885] 2041037=test_compile_prism I, [2024-05-19T00:41:52.403512 #1999693] INFO -- : [743/885] 2041035=test_date_compat I, [2024-05-19T00:41:52.410428 #1999693] INFO -- : [744/885] 2041035=test_rdoc_markup_to_html I, [2024-05-19T00:41:52.483859 #1999693] INFO -- : [745/885] 2041035=test_bug-14834 I, [2024-05-19T00:41:52.556840 #1999693] INFO -- : [746/885] 2041035=json_encoding_test I, [2024-05-19T00:41:52.567655 #1999693] INFO -- : [747/885] 2041035=test_color I, [2024-05-19T00:41:52.638876 #1999693] INFO -- : [748/885] 2041035=test_key_stroke I, [2024-05-19T00:41:52.653677 #1999693] INFO -- : [749/885] 2041035=test_install I, [2024-05-19T00:41:52.714503 #1999693] INFO -- : [750/885] 2041024=test_rdoc_markup_to_label I, [2024-05-19T00:41:52.723218 #1999693] INFO -- : [751/885] 2041037=test_sockopt I, [2024-05-19T00:41:52.728474 #1999693] INFO -- : [752/885] 2041037=test_set_len I, [2024-05-19T00:41:52.733753 #1999693] INFO -- : [753/885] 2041037=test_httpresponses I, [2024-05-19T00:41:52.737522 #1999693] INFO -- : [754/885] 2041037=test_encoding I, [2024-05-19T00:41:52.750458 #1999693] INFO -- : [755/885] 2041037=test_httpheader I, [2024-05-19T00:41:52.753200 #1999693] INFO -- : [756/885] 2041024=test_gem_resolver_local_specification I, [2024-05-19T00:41:52.767304 #1999693] INFO -- : [757/885] 2041037=test_rdoc_ri_driver I, [2024-05-19T00:41:52.792110 #1999693] INFO -- : [758/885] 2041024=test_chilled I, [2024-05-19T00:41:52.795062 #1999693] INFO -- : [759/885] 2041024=test_name_error_extension I, [2024-05-19T00:41:52.800062 #1999693] INFO -- : [760/885] 2041024=test_rdoc_i18n_locale I, [2024-05-19T00:41:52.803041 #1999693] INFO -- : [761/885] 2041035=test_pair I, [2024-05-19T00:41:52.807062 #1999693] INFO -- : [762/885] 2041024=test_win32ole_param I, [2024-05-19T00:41:52.808573 #1999693] INFO -- : [763/885] 2041024=test_gem_commands_yank_command I, [2024-05-19T00:41:52.872835 #1999693] INFO -- : [764/885] 2041026=test_document I, [2024-05-19T00:41:52.876969 #1999693] INFO -- : [765/885] 2041026=test_acceptable I, [2024-05-19T00:41:52.974648 #1999693] INFO -- : [766/885] 2041030=test_rdoc_generator_pot_po_entry I, [2024-05-19T00:41:52.983051 #1999693] INFO -- : [767/885] 2041030=test_euc_jp I, [2024-05-19T00:41:52.984841 #1999693] INFO -- : [768/885] 2041026=test_rbconfig I, [2024-05-19T00:41:52.986291 #1999693] INFO -- : [769/885] 2041030=test_human_typo I, [2024-05-19T00:41:52.988715 #1999693] INFO -- : [770/885] 2041026=test_primitive I, [2024-05-19T00:41:52.993976 #1999693] INFO -- : [771/885] 2041030=test_assembler I, [2024-05-19T00:41:52.994936 #1999693] INFO -- : [772/885] 2041037=test_propertyputref I, [2024-05-19T00:41:52.995395 #1999693] INFO -- : [773/885] 2041030=attribute_write_test I, [2024-05-19T00:41:52.996328 #1999693] INFO -- : [774/885] 2041037=test_spell_checker I, [2024-05-19T00:41:52.996626 #1999693] INFO -- : [775/885] 2041026=test_rational I, [2024-05-19T00:41:52.999527 #1999693] INFO -- : [776/885] 2041030=test_rational2 I, [2024-05-19T00:41:53.003495 #1999693] INFO -- : [777/885] 2041037=test_len I, [2024-05-19T00:41:53.004185 #1999693] INFO -- : [778/885] 2041037=test_yield_block I, [2024-05-19T00:41:53.008913 #1999693] INFO -- : [779/885] 2041037=test_gem_commands_cert_command I, [2024-05-19T00:41:53.019132 #1999693] INFO -- : [780/885] 2041026=test_completion I, [2024-05-19T00:41:53.031814 #1999693] INFO -- : [781/885] 2041030=test_erb I, [2024-05-19T00:41:53.063548 #1999693] INFO -- : [782/885] 2041030=test_x509ext I, [2024-05-19T00:41:53.070075 #1999693] INFO -- : [783/885] 2041030=test_gem_source_installed I, [2024-05-19T00:41:53.073651 #1999693] INFO -- : [784/885] 2041025=test_https I, [2024-05-19T00:41:53.079340 #1999693] INFO -- : [785/885] 2041030=test_gem_ext_builder I, [2024-05-19T00:41:53.217998 #1999693] INFO -- : [786/885] 2041023=test_evaluation I, [2024-05-19T00:41:53.224858 #1999693] INFO -- : [787/885] 2041023=test_abi I, [2024-05-19T00:41:53.290684 #1999693] INFO -- : [788/885] 2041024=test_provider I, [2024-05-19T00:41:53.431402 #1999693] INFO -- : [789/885] 2041023=test_rdoc_parser_simple I, [2024-05-19T00:41:53.441649 #1999693] INFO -- : [790/885] 2041025=test_load I, [2024-05-19T00:41:53.446186 #1999693] INFO -- : [791/885] 2041025=test_yamldbm I, [2024-05-19T00:41:53.465897 #1999693] INFO -- : [792/885] 2041025=test_gem_commands_rebuild_command I, [2024-05-19T00:41:53.475250 #1999693] INFO -- : [793/885] 2041023=test_gem_source I, [2024-05-19T00:41:53.513500 #1999693] INFO -- : [794/885] 2041025=test_scalar_scanner I, [2024-05-19T00:41:53.514472 #1999693] INFO -- : [795/885] 2041025=test_gem_commands_outdated_command I, [2024-05-19T00:41:53.559589 #1999693] INFO -- : [796/885] 2041025=test_array I, [2024-05-19T00:41:53.605403 #1999693] INFO -- : [797/885] 2041026=test_helper_method I, [2024-05-19T00:41:53.616286 #1999693] INFO -- : [798/885] 2041026=test_gem_package_tar_writer I, [2024-05-19T00:41:53.625070 #1999693] INFO -- : [799/885] 2041024=test_gem_dependency_list I, [2024-05-19T00:41:53.672930 #1999693] INFO -- : [800/885] 2041024=test_benchmark I, [2024-05-19T00:41:53.726315 #1999693] INFO -- : [801/885] 2041026=test_win32ole_method_event I, [2024-05-19T00:41:53.728743 #1999693] INFO -- : [802/885] 2041026=test_nesting_parser I, [2024-05-19T00:41:53.740201 #1999693] INFO -- : [803/885] 2041023=test_stringify_symbols I, [2024-05-19T00:41:53.746129 #1999693] INFO -- : [804/885] 2041026=test_instrumentation_api I, [2024-05-19T00:41:53.754068 #1999693] INFO -- : [805/885] 2041023=integer_parse_test I, [2024-05-19T00:41:53.756963 #1999693] INFO -- : [806/885] 2041023=test_boolean I, [2024-05-19T00:41:53.768088 #1999693] INFO -- : [807/885] 2041023=test_whileuntil I, [2024-05-19T00:41:53.774564 #1999693] INFO -- : [808/885] 2041023=test_rdoc_generator_markup I, [2024-05-19T00:41:53.788258 #1999693] INFO -- : [809/885] 2041023=test_configuration I, [2024-05-19T00:41:53.859394 #1999693] INFO -- : [810/885] 2041023=test_rubyvm I, [2024-05-19T00:41:53.863098 #1999693] INFO -- : [811/885] 2041023=test_monitor I, [2024-05-19T00:41:54.000052 #1999693] INFO -- : [812/885] 2041034=test_buffered_io I, [2024-05-19T00:41:54.053613 #1999693] INFO -- : [813/885] 2041030=test_method_name_check I, [2024-05-19T00:41:54.067031 #1999693] INFO -- : [814/885] 2041030=test_arith_seq_extract I, [2024-05-19T00:41:54.074701 #1999693] INFO -- : [815/885] 2041023=test_parser I, [2024-05-19T00:41:54.086035 #1999693] INFO -- : [816/885] 2041034=test_module I, [2024-05-19T00:41:54.107714 #1999693] INFO -- : [817/885] 2041023=test_gem_request_set I, [2024-05-19T00:41:54.138675 #1999693] INFO -- : [818/885] 2041032=constant_path_node_test I, [2024-05-19T00:41:54.146857 #1999693] INFO -- : [819/885] 2041032=test_ssl I, [2024-05-19T00:41:54.188811 #1999693] INFO -- : [820/885] 2041030=test_gem_ext_cargo_builder I, [2024-05-19T00:41:54.210163 #1999693] INFO -- : [821/885] 2041030=test_mutex I, [2024-05-19T00:41:54.289852 #1999693] INFO -- : [822/885] 2041037=test_x509req I, [2024-05-19T00:41:54.347467 #1999693] INFO -- : [823/885] 2041036=test_rdoc_rd_inline I, [2024-05-19T00:41:54.350848 #1999693] INFO -- : [824/885] 2041036=test_files_test_1 I, [2024-05-19T00:41:54.358238 #1999693] INFO -- : [825/885] 2041036=test_set I, [2024-05-19T00:41:54.373889 #1999693] INFO -- : [826/885] 2041036=test_struct I, [2024-05-19T00:41:54.446288 #1999693] INFO -- : [827/885] 2041023=test_gem_path_support I, [2024-05-19T00:41:54.466501 #1999693] INFO -- : [828/885] 2041023=test_insns_leaf I, [2024-05-19T00:41:54.473070 #1999693] INFO -- : [829/885] 2041023=test_serialize_subclasses I, [2024-05-19T00:41:54.473830 #1999693] INFO -- : [830/885] 2041023=test_color_printer I, [2024-05-19T00:41:54.480485 #1999693] INFO -- : [831/885] 2041037=test_deprecated I, [2024-05-19T00:41:54.485926 #1999693] INFO -- : [832/885] 2041037=test_div I, [2024-05-19T00:41:54.486435 #1999693] INFO -- : [833/885] 2041037=test_allocation I, [2024-05-19T00:41:54.487556 #1999693] INFO -- : [834/885] 2041023=test_engine I, [2024-05-19T00:41:54.491184 #1999693] INFO -- : [835/885] 2041023=test_win32ole_variant_m I, [2024-05-19T00:41:54.496218 #1999693] INFO -- : [836/885] 2041023=test_key_error I, [2024-05-19T00:41:54.502237 #1999693] INFO -- : [837/885] 2041023=test_struct I, [2024-05-19T00:41:54.508158 #1999693] INFO -- : [838/885] 2041023=magic_comment_test I, [2024-05-19T00:41:54.509989 #1999693] INFO -- : [839/885] 2041023=test_rdoc_markup_to_html_snippet I, [2024-05-19T00:41:54.558086 #1999693] INFO -- : [840/885] 2041023=fuzzer_test I, [2024-05-19T00:41:54.575738 #1999693] INFO -- : [841/885] 2041023=test_sexp I, [2024-05-19T00:41:54.588384 #1999693] INFO -- : [842/885] 2041023=test_rdoc_markup_include I, [2024-05-19T00:41:54.589934 #1999693] INFO -- : [843/885] 2041023=test_variable I, [2024-05-19T00:41:54.698676 #1999693] INFO -- : [844/885] 2041023=test_pkg_config I, [2024-05-19T00:41:54.712711 #1999693] INFO -- : [845/885] 2041036=test_cparser I, [2024-05-19T00:41:54.717939 #1999693] INFO -- : [846/885] 2041023=test_nomethod_error I, [2024-05-19T00:41:54.727482 #1999693] INFO -- : [847/885] 2041023=json_parser_test I, [2024-05-19T00:41:54.776775 #1999693] INFO -- : [848/885] 2041023=memsize_test I, [2024-05-19T00:41:54.784684 #1999693] INFO -- : [849/885] 2041023=test_config I, [2024-05-19T00:41:54.884714 #1999693] INFO -- : [850/885] 2041023=test_win32ole_variant_outarg I, [2024-05-19T00:41:54.887639 #1999693] INFO -- : [851/885] 2041023=test_dln I, [2024-05-19T00:41:54.890329 #1999693] INFO -- : [852/885] 2041023=test_gem_source_subpath_problem I, [2024-05-19T00:41:54.955188 #1999693] INFO -- : [853/885] 2041024=json_common_interface_test I, [2024-05-19T00:41:54.966612 #1999693] INFO -- : [854/885] 2041024=test_storage I, [2024-05-19T00:41:54.968843 #1999693] INFO -- : [855/885] 2041024=test_gem_resolver_git_set I, [2024-05-19T00:41:54.973405 #1999693] INFO -- : [856/885] 2041023=test_new I, [2024-05-19T00:41:54.984832 #1999693] INFO -- : [857/885] 2041023=test_cipher I, [2024-05-19T00:41:55.030999 #1999693] INFO -- : [858/885] 2041023=test_gem_security_signer I, [2024-05-19T00:41:55.078992 #1999693] INFO -- : [859/885] 2041028=test_debug I, [2024-05-19T00:41:55.085126 #1999693] INFO -- : [860/885] 2041028=test_memory_view I, [2024-05-19T00:41:55.108893 #1999693] INFO -- : [861/885] 2041028=pattern_test I, [2024-05-19T00:41:55.126420 #1999693] INFO -- : [862/885] 2041028=test_shellwords I, [2024-05-19T00:41:55.131817 #1999693] INFO -- : [863/885] 2041028=test_digest_extend I, [2024-05-19T00:41:55.140895 #1999693] INFO -- : [864/885] 2041028=test_iterator I, [2024-05-19T00:41:55.145961 #1999693] INFO -- : [865/885] 2041023=test_string I, [2024-05-19T00:41:55.146976 #1999693] INFO -- : [866/885] 2041023=test_omap I, [2024-05-19T00:41:55.163057 #1999693] INFO -- : [867/885] 2041023=test_process I, [2024-05-19T00:41:55.193896 #1999693] INFO -- : [868/885] 2041023=test_input_method I, [2024-05-19T00:41:55.228623 #1999693] INFO -- : [869/885] 2041028=test_windows_1252 I, [2024-05-19T00:41:55.229144 #1999693] INFO -- : [870/885] 2041028=test_rdoc_rd I, [2024-05-19T00:41:55.247987 #1999693] INFO -- : [871/885] 2041024=test_cgi_session I, [2024-05-19T00:41:55.254802 #1999693] INFO -- : [872/885] 2041024=test_rdoc_top_level I, [2024-05-19T00:41:55.307768 #1999693] INFO -- : [873/885] 2041023=test_metaclass I, [2024-05-19T00:41:55.323744 #1999693] INFO -- : [874/885] 2041023=test_fixnum I, [2024-05-19T00:41:55.333029 #1999693] INFO -- : [875/885] 2041030=test_signal I, [2024-05-19T00:41:55.341506 #1999693] INFO -- : [876/885] 2041023=test_x509crl I, [2024-05-19T00:41:55.366420 #1999693] INFO -- : [877/885] 2041036=test_regex_casefold I, [2024-05-19T00:41:55.376637 #1999693] INFO -- : [878/885] 2041028=test_gem_commands_signout_command I, [2024-05-19T00:41:55.391969 #1999693] INFO -- : [879/885] 2041028=test_refinement I, [2024-05-19T00:41:55.434495 #1999693] INFO -- : [880/885] 2041024=test_gem_source_git I, [2024-05-19T00:41:55.511772 #1999693] INFO -- : [881/885] 2041023=test_dir_m17n I, [2024-05-19T00:41:55.655528 #1999693] INFO -- : [882/885] 2041041=test_gem_resolver_installer_set I, [2024-05-19T00:41:55.690314 #1999693] INFO -- : [883/885] 2041036=test_float I, [2024-05-19T00:41:55.844154 #1999693] INFO -- : [884/885] 2041027=test_require I, [2024-05-19T00:41:55.917750 #1999693] INFO -- : [885/885] 2041041=test_cgi_cookie I, [2024-05-19T00:42:15.305031 #1999693] INFO -- : Finished tests in 38.778898s, 680.2411 tests/s, 241194.8099 assertions/s. I, [2024-05-19T00:42:15.305707 #1999693] INFO -- : 26379 tests, 9353269 assertions, 0 failures, 0 errors, 312 skips I, [2024-05-19T00:42:15.305731 #1999693] INFO -- : I, [2024-05-19T00:42:15.305738 #1999693] INFO -- : ruby -v: ruby 3.4.0dev (2024-05-18T15:29:00Z master dbbaf871de) [x86_64-linux] I, [2024-05-19T00:42:15.307876 #1999693] INFO -- : $$$[end] "make yes-test-all TESTOPTS='--stderr-on-failure' TESTS='-j20'" exit with 0. I, [2024-05-19T00:42:15.308006 #1999693] INFO -- : $$$[beg] make yes-test-rubyspec MSPECOPT='--error-output stderr --debug -j' TESTS='-j20' I, [2024-05-19T00:42:15.398751 #1999693] INFO -- : BASERUBY = /usr/bin/ruby --disable=gems I, [2024-05-19T00:42:15.398789 #1999693] INFO -- : CC = gcc I, [2024-05-19T00:42:15.398795 #1999693] INFO -- : LD = ld I, [2024-05-19T00:42:15.398799 #1999693] INFO -- : LDSHARED = gcc -shared I, [2024-05-19T00:42:15.398804 #1999693] INFO -- : CFLAGS = -O3 -fno-fast-math -ggdb3 -Wall -Wextra -Wdeprecated-declarations -Wdiv-by-zero -Wduplicated-cond -Wimplicit-function-declaration -Wimplicit-int -Wpointer-arith -Wwrite-strings -Wold-style-definition -Wimplicit-fallthrough=0 -Wmissing-noreturn -Wno-cast-function-type -Wno-constant-logical-operand -Wno-long-long -Wno-missing-field-initializers -Wno-overlength-strings -Wno-packed-bitfield-compat -Wno-parentheses-equality -Wno-self-assign -Wno-tautological-compare -Wno-unused-parameter -Wno-unused-value -Wsuggest-attribute=format -Wsuggest-attribute=noreturn -Wunused-variable -Wmisleading-indentation -Wundef -fPIC I, [2024-05-19T00:42:15.398808 #1999693] INFO -- : XCFLAGS = -U_FORTIFY_SOURCE -D_FORTIFY_SOURCE=2 -fstack-protector-strong -fno-strict-overflow -fvisibility=hidden -fexcess-precision=standard -DRUBY_EXPORT -I. -I.ext/include/x86_64-linux -I/tmp/ruby/src/trunk/include -I/tmp/ruby/src/trunk -I/tmp/ruby/src/trunk/prism -I/tmp/ruby/src/trunk/enc/unicode/15.0.0 I, [2024-05-19T00:42:15.398813 #1999693] INFO -- : CPPFLAGS = I, [2024-05-19T00:42:15.398816 #1999693] INFO -- : DLDFLAGS = -Wl,--compress-debug-sections=zlib -Wl,-soname,libruby.so.3.4 -fstack-protector-strong I, [2024-05-19T00:42:15.398820 #1999693] INFO -- : SOLIBS = -lz -lrt -lrt -lgmp -ldl -lcrypt -lm -lpthread I, [2024-05-19T00:42:15.398824 #1999693] INFO -- : LANG = en_US.UTF-8 I, [2024-05-19T00:42:15.398828 #1999693] INFO -- : LC_ALL = I, [2024-05-19T00:42:15.398831 #1999693] INFO -- : LC_CTYPE = I, [2024-05-19T00:42:15.398834 #1999693] INFO -- : MFLAGS = I, [2024-05-19T00:42:15.398838 #1999693] INFO -- : RUSTC = no I, [2024-05-19T00:42:15.398842 #1999693] INFO -- : YJIT_RUSTC_ARGS = --crate-name=yjit --crate-type=staticlib --edition=2021 -g -C lto=thin -C opt-level=3 -C overflow-checks=on '--out-dir=/tmp/ruby/build/trunk/yjit/target/release/' /tmp/ruby/src/trunk/yjit/src/lib.rs I, [2024-05-19T00:42:15.399377 #1999693] INFO -- : gcc (Ubuntu 11.4.0-1ubuntu1~22.04) 11.4.0 I, [2024-05-19T00:42:15.399397 #1999693] INFO -- : Copyright (C) 2021 Free Software Foundation, Inc. I, [2024-05-19T00:42:15.399403 #1999693] INFO -- : This is free software; see the source for copying conditions. There is NO I, [2024-05-19T00:42:15.399407 #1999693] INFO -- : warranty; not even for MERCHANTABILITY or FITNESS FOR A PARTICULAR PURPOSE. I, [2024-05-19T00:42:15.399411 #1999693] INFO -- : I, [2024-05-19T00:42:15.401075 #1999693] INFO -- : generating enc.mk I, [2024-05-19T00:42:15.519113 #1999693] INFO -- : making enc I, [2024-05-19T00:42:15.536090 #1999693] INFO -- : make[1]: Entering directory '/tmp/ruby/build/trunk' I, [2024-05-19T00:42:15.536129 #1999693] INFO -- : make[1]: Nothing to be done for 'enc'. I, [2024-05-19T00:42:15.536134 #1999693] INFO -- : make[1]: Leaving directory '/tmp/ruby/build/trunk' I, [2024-05-19T00:42:15.536905 #1999693] INFO -- : making srcs under enc I, [2024-05-19T00:42:15.566485 #1999693] INFO -- : make[1]: Entering directory '/tmp/ruby/build/trunk' I, [2024-05-19T00:42:15.566508 #1999693] INFO -- : make[1]: Nothing to be done for 'srcs'. I, [2024-05-19T00:42:15.566513 #1999693] INFO -- : make[1]: Leaving directory '/tmp/ruby/build/trunk' I, [2024-05-19T00:42:15.567429 #1999693] INFO -- : generating transdb.h I, [2024-05-19T00:42:15.663144 #1999693] INFO -- : transdb.h unchanged I, [2024-05-19T00:42:15.664452 #1999693] INFO -- : making trans I, [2024-05-19T00:42:15.698600 #1999693] INFO -- : make[1]: Entering directory '/tmp/ruby/build/trunk' I, [2024-05-19T00:42:15.698624 #1999693] INFO -- : make[1]: Nothing to be done for 'trans'. I, [2024-05-19T00:42:15.698631 #1999693] INFO -- : make[1]: Leaving directory '/tmp/ruby/build/trunk' I, [2024-05-19T00:42:15.699398 #1999693] INFO -- : making encs I, [2024-05-19T00:42:15.736522 #1999693] INFO -- : make[1]: Entering directory '/tmp/ruby/build/trunk' I, [2024-05-19T00:42:15.736548 #1999693] INFO -- : make[1]: Nothing to be done for 'encs'. I, [2024-05-19T00:42:15.736556 #1999693] INFO -- : make[1]: Leaving directory '/tmp/ruby/build/trunk' I, [2024-05-19T00:42:15.738387 #1999693] INFO -- : generating makefiles ext/configure-ext.mk I, [2024-05-19T00:42:15.764797 #1999693] INFO -- : ext/configure-ext.mk updated I, [2024-05-19T00:42:15.767138 #1999693] INFO -- : make[1]: Entering directory '/tmp/ruby/build/trunk' I, [2024-05-19T00:42:17.108699 #1999693] INFO -- : make[1]: Leaving directory '/tmp/ruby/build/trunk' I, [2024-05-19T00:42:17.109519 #1999693] INFO -- : generating makefile exts.mk I, [2024-05-19T00:42:17.146697 #1999693] INFO -- : exts.mk unchanged I, [2024-05-19T00:42:17.151333 #1999693] INFO -- : make[1]: Entering directory '/tmp/ruby/build/trunk' I, [2024-05-19T00:42:17.497567 #1999693] INFO -- : make[2]: Entering directory '/tmp/ruby/build/trunk/ext/coverage' I, [2024-05-19T00:42:17.502270 #1999693] INFO -- : make[2]: Leaving directory '/tmp/ruby/build/trunk/ext/coverage' I, [2024-05-19T00:42:17.508683 #1999693] INFO -- : make[2]: Entering directory '/tmp/ruby/build/trunk/ext/date' I, [2024-05-19T00:42:17.513762 #1999693] INFO -- : make[2]: Leaving directory '/tmp/ruby/build/trunk/ext/date' I, [2024-05-19T00:42:17.517552 #1999693] INFO -- : make[2]: Entering directory '/tmp/ruby/build/trunk/ext/digest' I, [2024-05-19T00:42:17.526487 #1999693] INFO -- : make[2]: Leaving directory '/tmp/ruby/build/trunk/ext/digest' I, [2024-05-19T00:42:17.552666 #1999693] INFO -- : make[2]: Entering directory '/tmp/ruby/build/trunk/ext/digest/sha2' I, [2024-05-19T00:42:17.557541 #1999693] INFO -- : make[2]: Leaving directory '/tmp/ruby/build/trunk/ext/digest/sha2' I, [2024-05-19T00:42:17.579121 #1999693] INFO -- : make[2]: Entering directory '/tmp/ruby/build/trunk/ext/fiddle' I, [2024-05-19T00:42:17.589843 #1999693] INFO -- : make[2]: Leaving directory '/tmp/ruby/build/trunk/ext/fiddle' I, [2024-05-19T00:42:17.594808 #1999693] INFO -- : make[2]: Entering directory '/tmp/ruby/build/trunk/ext/io/console' I, [2024-05-19T00:42:17.598628 #1999693] INFO -- : make[2]: Leaving directory '/tmp/ruby/build/trunk/ext/io/console' I, [2024-05-19T00:42:17.611380 #1999693] INFO -- : make[2]: Entering directory '/tmp/ruby/build/trunk/ext/json' I, [2024-05-19T00:42:17.620757 #1999693] INFO -- : make[2]: Leaving directory '/tmp/ruby/build/trunk/ext/json' I, [2024-05-19T00:42:17.634179 #1999693] INFO -- : make[2]: Entering directory '/tmp/ruby/build/trunk/ext/monitor' I, [2024-05-19T00:42:17.638181 #1999693] INFO -- : make[2]: Leaving directory '/tmp/ruby/build/trunk/ext/monitor' I, [2024-05-19T00:42:17.646024 #1999693] INFO -- : make[2]: Entering directory '/tmp/ruby/build/trunk/ext/objspace' I, [2024-05-19T00:42:17.652303 #1999693] INFO -- : make[2]: Leaving directory '/tmp/ruby/build/trunk/ext/objspace' I, [2024-05-19T00:42:17.669884 #1999693] INFO -- : make[2]: Entering directory '/tmp/ruby/build/trunk/ext/openssl' I, [2024-05-19T00:42:17.686133 #1999693] INFO -- : make[2]: Leaving directory '/tmp/ruby/build/trunk/ext/openssl' I, [2024-05-19T00:42:17.689698 #1999693] INFO -- : make[2]: Entering directory '/tmp/ruby/build/trunk/ext/pathname' I, [2024-05-19T00:42:17.692643 #1999693] INFO -- : make[2]: Leaving directory '/tmp/ruby/build/trunk/ext/pathname' I, [2024-05-19T00:42:17.699309 #1999693] INFO -- : make[2]: Entering directory '/tmp/ruby/build/trunk/ext/psych' I, [2024-05-19T00:42:17.720003 #1999693] INFO -- : make[2]: Leaving directory '/tmp/ruby/build/trunk/ext/psych' I, [2024-05-19T00:42:17.724733 #1999693] INFO -- : make[2]: Entering directory '/tmp/ruby/build/trunk/ext/pty' I, [2024-05-19T00:42:17.728699 #1999693] INFO -- : make[2]: Leaving directory '/tmp/ruby/build/trunk/ext/pty' I, [2024-05-19T00:42:17.744686 #1999693] INFO -- : make[2]: Entering directory '/tmp/ruby/build/trunk/ext/ripper' I, [2024-05-19T00:42:17.753230 #1999693] INFO -- : make[2]: Leaving directory '/tmp/ruby/build/trunk/ext/ripper' I, [2024-05-19T00:42:17.755705 #1999693] INFO -- : make[2]: Entering directory '/tmp/ruby/build/trunk/ext/rubyvm' I, [2024-05-19T00:42:17.759037 #1999693] INFO -- : make[2]: Leaving directory '/tmp/ruby/build/trunk/ext/rubyvm' I, [2024-05-19T00:42:17.772603 #1999693] INFO -- : make[2]: Entering directory '/tmp/ruby/build/trunk/ext/socket' I, [2024-05-19T00:42:17.782875 #1999693] INFO -- : make[2]: Leaving directory '/tmp/ruby/build/trunk/ext/socket' I, [2024-05-19T00:42:17.801276 #1999693] INFO -- : make[2]: Entering directory '/tmp/ruby/build/trunk/.bundle/gems/bigdecimal-3.1.8/ext/bigdecimal' I, [2024-05-19T00:42:17.828646 #1999693] INFO -- : make[2]: Leaving directory '/tmp/ruby/build/trunk/.bundle/gems/bigdecimal-3.1.8/ext/bigdecimal' I, [2024-05-19T00:42:17.830599 #1999693] INFO -- : make[2]: Entering directory '/tmp/ruby/build/trunk/.bundle/gems/debug-1.9.2/ext/debug' I, [2024-05-19T00:42:17.852644 #1999693] INFO -- : make[2]: Leaving directory '/tmp/ruby/build/trunk/.bundle/gems/debug-1.9.2/ext/debug' I, [2024-05-19T00:42:17.854497 #1999693] INFO -- : make[2]: Entering directory '/tmp/ruby/build/trunk/.bundle/gems/nkf-0.2.0/ext/nkf' I, [2024-05-19T00:42:17.880180 #1999693] INFO -- : make[2]: Leaving directory '/tmp/ruby/build/trunk/.bundle/gems/nkf-0.2.0/ext/nkf' I, [2024-05-19T00:42:17.882600 #1999693] INFO -- : make[2]: Entering directory '/tmp/ruby/build/trunk/.bundle/gems/racc-1.7.3/ext/racc/cparse' I, [2024-05-19T00:42:17.906329 #1999693] INFO -- : make[2]: Leaving directory '/tmp/ruby/build/trunk/.bundle/gems/racc-1.7.3/ext/racc/cparse' I, [2024-05-19T00:42:17.908732 #1999693] INFO -- : make[2]: Entering directory '/tmp/ruby/build/trunk/.bundle/gems/rbs-3.4.4/ext/rbs_extension' I, [2024-05-19T00:42:17.938529 #1999693] INFO -- : make[2]: Leaving directory '/tmp/ruby/build/trunk/.bundle/gems/rbs-3.4.4/ext/rbs_extension' I, [2024-05-19T00:42:17.940779 #1999693] INFO -- : make[2]: Entering directory '/tmp/ruby/build/trunk/.bundle/gems/syslog-0.1.2/ext/syslog' I, [2024-05-19T00:42:17.963313 #1999693] INFO -- : make[2]: Leaving directory '/tmp/ruby/build/trunk/.bundle/gems/syslog-0.1.2/ext/syslog' I, [2024-05-19T00:42:17.993166 #1999693] INFO -- : make[2]: Entering directory '/tmp/ruby/build/trunk' I, [2024-05-19T00:42:18.059890 #1999693] INFO -- : make[2]: 'ruby' is up to date. I, [2024-05-19T00:42:18.059929 #1999693] INFO -- : make[2]: Leaving directory '/tmp/ruby/build/trunk' I, [2024-05-19T00:42:18.060188 #1999693] INFO -- : make[1]: Leaving directory '/tmp/ruby/build/trunk' I, [2024-05-19T00:42:18.063780 #1999693] INFO -- : make[1]: Entering directory '/tmp/ruby/build/trunk' I, [2024-05-19T00:42:18.063801 #1999693] INFO -- : make[1]: Nothing to be done for 'note'. I, [2024-05-19T00:42:18.063806 #1999693] INFO -- : make[1]: Leaving directory '/tmp/ruby/build/trunk' E, [2024-05-19T00:42:18.119311 #1999693] ERROR -- : $ /tmp/ruby/build/trunk/miniruby -I/tmp/ruby/src/trunk/lib /tmp/ruby/src/trunk/tool/runruby.rb --archdir=/tmp/ruby/build/trunk --extout=.ext -- /tmp/ruby/src/trunk/spec/mspec/bin/mspec-run -B /tmp/ruby/src/trunk/spec/default.mspec --error-output stderr --debug -fy -o /tmp/rubytest.5uglk4/1-mspec-multi-0 E, [2024-05-19T00:42:18.119488 #1999693] ERROR -- : $ /tmp/ruby/build/trunk/miniruby -I/tmp/ruby/src/trunk/lib /tmp/ruby/src/trunk/tool/runruby.rb --archdir=/tmp/ruby/build/trunk --extout=.ext -- /tmp/ruby/src/trunk/spec/mspec/bin/mspec-run -B /tmp/ruby/src/trunk/spec/default.mspec --error-output stderr --debug -fy -o /tmp/rubytest.5uglk4/2-mspec-multi-1 E, [2024-05-19T00:42:18.119685 #1999693] ERROR -- : $ /tmp/ruby/build/trunk/miniruby -I/tmp/ruby/src/trunk/lib /tmp/ruby/src/trunk/tool/runruby.rb --archdir=/tmp/ruby/build/trunk --extout=.ext -- /tmp/ruby/src/trunk/spec/mspec/bin/mspec-run -B /tmp/ruby/src/trunk/spec/default.mspec --error-output stderr --debug -fy -o /tmp/rubytest.5uglk4/3-mspec-multi-2 E, [2024-05-19T00:42:18.120055 #1999693] ERROR -- : $ /tmp/ruby/build/trunk/miniruby -I/tmp/ruby/src/trunk/lib /tmp/ruby/src/trunk/tool/runruby.rb --archdir=/tmp/ruby/build/trunk --extout=.ext -- /tmp/ruby/src/trunk/spec/mspec/bin/mspec-run -B /tmp/ruby/src/trunk/spec/default.mspec --error-output stderr --debug -fy -o /tmp/rubytest.5uglk4/4-mspec-multi-3 E, [2024-05-19T00:42:18.120234 #1999693] ERROR -- : $ /tmp/ruby/build/trunk/miniruby -I/tmp/ruby/src/trunk/lib /tmp/ruby/src/trunk/tool/runruby.rb --archdir=/tmp/ruby/build/trunk --extout=.ext -- /tmp/ruby/src/trunk/spec/mspec/bin/mspec-run -B /tmp/ruby/src/trunk/spec/default.mspec --error-output stderr --debug -fy -o /tmp/rubytest.5uglk4/5-mspec-multi-4 E, [2024-05-19T00:42:18.120518 #1999693] ERROR -- : $ /tmp/ruby/build/trunk/miniruby -I/tmp/ruby/src/trunk/lib /tmp/ruby/src/trunk/tool/runruby.rb --archdir=/tmp/ruby/build/trunk --extout=.ext -- /tmp/ruby/src/trunk/spec/mspec/bin/mspec-run -B /tmp/ruby/src/trunk/spec/default.mspec --error-output stderr --debug -fy -o /tmp/rubytest.5uglk4/6-mspec-multi-5 E, [2024-05-19T00:42:18.120641 #1999693] ERROR -- : $ /tmp/ruby/build/trunk/miniruby -I/tmp/ruby/src/trunk/lib /tmp/ruby/src/trunk/tool/runruby.rb --archdir=/tmp/ruby/build/trunk --extout=.ext -- /tmp/ruby/src/trunk/spec/mspec/bin/mspec-run -B /tmp/ruby/src/trunk/spec/default.mspec --error-output stderr --debug -fy -o /tmp/rubytest.5uglk4/7-mspec-multi-6 E, [2024-05-19T00:42:18.120906 #1999693] ERROR -- : $ /tmp/ruby/build/trunk/miniruby -I/tmp/ruby/src/trunk/lib /tmp/ruby/src/trunk/tool/runruby.rb --archdir=/tmp/ruby/build/trunk --extout=.ext -- /tmp/ruby/src/trunk/spec/mspec/bin/mspec-run -B /tmp/ruby/src/trunk/spec/default.mspec --error-output stderr --debug -fy -o /tmp/rubytest.5uglk4/8-mspec-multi-7 E, [2024-05-19T00:42:18.121098 #1999693] ERROR -- : $ /tmp/ruby/build/trunk/miniruby -I/tmp/ruby/src/trunk/lib /tmp/ruby/src/trunk/tool/runruby.rb --archdir=/tmp/ruby/build/trunk --extout=.ext -- /tmp/ruby/src/trunk/spec/mspec/bin/mspec-run -B /tmp/ruby/src/trunk/spec/default.mspec --error-output stderr --debug -fy -o /tmp/rubytest.5uglk4/9-mspec-multi-8 E, [2024-05-19T00:42:18.121304 #1999693] ERROR -- : $ /tmp/ruby/build/trunk/miniruby -I/tmp/ruby/src/trunk/lib /tmp/ruby/src/trunk/tool/runruby.rb --archdir=/tmp/ruby/build/trunk --extout=.ext -- /tmp/ruby/src/trunk/spec/mspec/bin/mspec-run -B /tmp/ruby/src/trunk/spec/default.mspec --error-output stderr --debug -fy -o /tmp/rubytest.5uglk4/10-mspec-multi-9 E, [2024-05-19T00:42:18.121509 #1999693] ERROR -- : $ /tmp/ruby/build/trunk/miniruby -I/tmp/ruby/src/trunk/lib /tmp/ruby/src/trunk/tool/runruby.rb --archdir=/tmp/ruby/build/trunk --extout=.ext -- /tmp/ruby/src/trunk/spec/mspec/bin/mspec-run -B /tmp/ruby/src/trunk/spec/default.mspec --error-output stderr --debug -fy -o /tmp/rubytest.5uglk4/11-mspec-multi-10 E, [2024-05-19T00:42:18.121837 #1999693] ERROR -- : $ /tmp/ruby/build/trunk/miniruby -I/tmp/ruby/src/trunk/lib /tmp/ruby/src/trunk/tool/runruby.rb --archdir=/tmp/ruby/build/trunk --extout=.ext -- /tmp/ruby/src/trunk/spec/mspec/bin/mspec-run -B /tmp/ruby/src/trunk/spec/default.mspec --error-output stderr --debug -fy -o /tmp/rubytest.5uglk4/12-mspec-multi-11 E, [2024-05-19T00:42:18.122033 #1999693] ERROR -- : $ /tmp/ruby/build/trunk/miniruby -I/tmp/ruby/src/trunk/lib /tmp/ruby/src/trunk/tool/runruby.rb --archdir=/tmp/ruby/build/trunk --extout=.ext -- /tmp/ruby/src/trunk/spec/mspec/bin/mspec-run -B /tmp/ruby/src/trunk/spec/default.mspec --error-output stderr --debug -fy -o /tmp/rubytest.5uglk4/13-mspec-multi-12 E, [2024-05-19T00:42:18.122236 #1999693] ERROR -- : $ /tmp/ruby/build/trunk/miniruby -I/tmp/ruby/src/trunk/lib /tmp/ruby/src/trunk/tool/runruby.rb --archdir=/tmp/ruby/build/trunk --extout=.ext -- /tmp/ruby/src/trunk/spec/mspec/bin/mspec-run -B /tmp/ruby/src/trunk/spec/default.mspec --error-output stderr --debug -fy -o /tmp/rubytest.5uglk4/14-mspec-multi-13 E, [2024-05-19T00:42:18.122393 #1999693] ERROR -- : $ /tmp/ruby/build/trunk/miniruby -I/tmp/ruby/src/trunk/lib /tmp/ruby/src/trunk/tool/runruby.rb --archdir=/tmp/ruby/build/trunk --extout=.ext -- /tmp/ruby/src/trunk/spec/mspec/bin/mspec-run -B /tmp/ruby/src/trunk/spec/default.mspec --error-output stderr --debug -fy -o /tmp/rubytest.5uglk4/15-mspec-multi-14 E, [2024-05-19T00:42:18.122609 #1999693] ERROR -- : $ /tmp/ruby/build/trunk/miniruby -I/tmp/ruby/src/trunk/lib /tmp/ruby/src/trunk/tool/runruby.rb --archdir=/tmp/ruby/build/trunk --extout=.ext -- /tmp/ruby/src/trunk/spec/mspec/bin/mspec-run -B /tmp/ruby/src/trunk/spec/default.mspec --error-output stderr --debug -fy -o /tmp/rubytest.5uglk4/16-mspec-multi-15 E, [2024-05-19T00:42:18.122787 #1999693] ERROR -- : $ /tmp/ruby/build/trunk/miniruby -I/tmp/ruby/src/trunk/lib /tmp/ruby/src/trunk/tool/runruby.rb --archdir=/tmp/ruby/build/trunk --extout=.ext -- /tmp/ruby/src/trunk/spec/mspec/bin/mspec-run -B /tmp/ruby/src/trunk/spec/default.mspec --error-output stderr --debug -fy -o /tmp/rubytest.5uglk4/17-mspec-multi-16 E, [2024-05-19T00:42:18.122973 #1999693] ERROR -- : $ /tmp/ruby/build/trunk/miniruby -I/tmp/ruby/src/trunk/lib /tmp/ruby/src/trunk/tool/runruby.rb --archdir=/tmp/ruby/build/trunk --extout=.ext -- /tmp/ruby/src/trunk/spec/mspec/bin/mspec-run -B /tmp/ruby/src/trunk/spec/default.mspec --error-output stderr --debug -fy -o /tmp/rubytest.5uglk4/18-mspec-multi-17 E, [2024-05-19T00:42:18.125405 #1999693] ERROR -- : $ /tmp/ruby/build/trunk/miniruby -I/tmp/ruby/src/trunk/lib /tmp/ruby/src/trunk/tool/runruby.rb --archdir=/tmp/ruby/build/trunk --extout=.ext -- /tmp/ruby/src/trunk/spec/mspec/bin/mspec-run -B /tmp/ruby/src/trunk/spec/default.mspec --error-output stderr --debug -fy -o /tmp/rubytest.5uglk4/19-mspec-multi-18 E, [2024-05-19T00:42:18.125755 #1999693] ERROR -- : $ /tmp/ruby/build/trunk/miniruby -I/tmp/ruby/src/trunk/lib /tmp/ruby/src/trunk/tool/runruby.rb --archdir=/tmp/ruby/build/trunk --extout=.ext -- /tmp/ruby/src/trunk/spec/mspec/bin/mspec-run -B /tmp/ruby/src/trunk/spec/default.mspec --error-output stderr --debug -fy -o /tmp/rubytest.5uglk4/20-mspec-multi-19 I, [2024-05-19T00:42:18.290192 #1999693] INFO -- : ruby 3.4.0dev (2024-05-18T15:29:00Z master dbbaf871de) [x86_64-linux] I, [2024-05-19T00:42:18.897232 #1999693] INFO -- : 0 ......................................................................... I, [2024-05-19T00:42:19.284905 #1999693] INFO -- : 73 ......................................................................... I, [2024-05-19T00:42:19.442007 #1999693] INFO -- : 146 ......................................................................... I, [2024-05-19T00:42:19.491055 #1999693] INFO -- : 219 ......................................................................... I, [2024-05-19T00:42:19.539811 #1999693] INFO -- : 292 ......................................................................... I, [2024-05-19T00:42:19.582523 #1999693] INFO -- : 365 ......................................................................... I, [2024-05-19T00:42:19.604149 #1999693] INFO -- : 438 ......................................................................... I, [2024-05-19T00:42:19.622973 #1999693] INFO -- : 511 ......................................................................... I, [2024-05-19T00:42:19.640098 #1999693] INFO -- : 584 ......................................................................... I, [2024-05-19T00:42:19.694965 #1999693] INFO -- : 657 ......................................................................... I, [2024-05-19T00:42:19.721081 #1999693] INFO -- : 730 ......................................................................... I, [2024-05-19T00:42:19.747138 #1999693] INFO -- : 803 ......................................................................... I, [2024-05-19T00:42:19.780467 #1999693] INFO -- : 876 ......................................................................... I, [2024-05-19T00:42:19.836590 #1999693] INFO -- : 949 ......................................................................... I, [2024-05-19T00:42:19.928436 #1999693] INFO -- : 1022 ......................................................................... I, [2024-05-19T00:42:20.103407 #1999693] INFO -- : 1095 ......................................................................... I, [2024-05-19T00:42:20.206637 #1999693] INFO -- : 1168 ......................................................................... I, [2024-05-19T00:42:20.264601 #1999693] INFO -- : 1241 ......................................................................... I, [2024-05-19T00:42:20.313478 #1999693] INFO -- : 1314 ......................................................................... I, [2024-05-19T00:42:20.331882 #1999693] INFO -- : 1387 ......................................................................... I, [2024-05-19T00:42:20.425000 #1999693] INFO -- : 1460 ......................................................................... I, [2024-05-19T00:42:20.902415 #1999693] INFO -- : 1533 ......................................................................... I, [2024-05-19T00:42:20.967110 #1999693] INFO -- : 1606 ......................................................................... I, [2024-05-19T00:42:21.102762 #1999693] INFO -- : 1679 ......................................................................... I, [2024-05-19T00:42:21.204535 #1999693] INFO -- : 1752 ......................................................................... I, [2024-05-19T00:42:21.288352 #1999693] INFO -- : 1825 ......................................................................... I, [2024-05-19T00:42:21.358075 #1999693] INFO -- : 1898 ......................................................................... I, [2024-05-19T00:42:21.463429 #1999693] INFO -- : 1971 ......................................................................... I, [2024-05-19T00:42:21.518148 #1999693] INFO -- : 2044 ......................................................................... I, [2024-05-19T00:42:21.562795 #1999693] INFO -- : 2117 ......................................................................... I, [2024-05-19T00:42:21.580926 #1999693] INFO -- : 2190 ......................................................................... I, [2024-05-19T00:42:21.603059 #1999693] INFO -- : 2263 ......................................................................... I, [2024-05-19T00:42:21.617469 #1999693] INFO -- : 2336 ......................................................................... I, [2024-05-19T00:42:21.652853 #1999693] INFO -- : 2409 ......................................................................... I, [2024-05-19T00:42:21.749191 #1999693] INFO -- : 2482 ......................................................................... I, [2024-05-19T00:42:21.774163 #1999693] INFO -- : 2555 ......................................................................... I, [2024-05-19T00:42:21.901246 #1999693] INFO -- : 2628 ......................................................................... I, [2024-05-19T00:42:21.992780 #1999693] INFO -- : 2701 ......................................................................... I, [2024-05-19T00:42:22.025712 #1999693] INFO -- : 2774 ......................................................................... I, [2024-05-19T00:42:22.078497 #1999693] INFO -- : 2847 ......................................................................... I, [2024-05-19T00:42:22.108746 #1999693] INFO -- : 2920 ......................................................................... I, [2024-05-19T00:42:22.129354 #1999693] INFO -- : 2993 ......................................................................... I, [2024-05-19T00:42:22.150470 #1999693] INFO -- : 3066 ......................................................................... I, [2024-05-19T00:42:22.162873 #1999693] INFO -- : 3139 ......................................................................... I, [2024-05-19T00:42:22.170152 #1999693] INFO -- : 3212 ......................................................................... I, [2024-05-19T00:42:22.197563 #1999693] INFO -- : 3285 ......................................................................... I, [2024-05-19T00:42:26.175622 #1999693] INFO -- : 3358 ........................................................................ I, [2024-05-19T00:42:26.175698 #1999693] INFO -- : I, [2024-05-19T00:42:26.175705 #1999693] INFO -- : Finished in 8.055479 seconds I, [2024-05-19T00:42:26.175710 #1999693] INFO -- : I, [2024-05-19T00:42:26.175716 #1999693] INFO -- : 3429 files, 32611 examples, 185253 expectations, 0 failures, 0 errors, 0 tagged I, [2024-05-19T00:42:26.177967 #1999693] INFO -- : $$$[end] "make yes-test-rubyspec MSPECOPT='--error-output stderr --debug -j' TESTS='-j20'" exit with 0.