# Logfile created on 2024-05-19 00:18:41 +0000 by logger.rb/v1.4.3 I, [2024-05-19T00:18:41.013401 #3660991] INFO -- : #, @formatter=nil, @logdev=#, @binmode=false, @mon_data=#, @mon_data_owner_object_id=860>>> I, [2024-05-19T00:18:41.013529 #3660991] INFO -- : $$$[beg] make update-unicode -j20 I, [2024-05-19T00:18:41.074984 #3660991] INFO -- : Downloading Unicode emoji 15.0 files... I, [2024-05-19T00:18:41.075114 #3660991] INFO -- : Downloading Unicode emoji 15.0 files... I, [2024-05-19T00:18:41.075532 #3660991] INFO -- : Downloading Unicode emoji 15.0 files... I, [2024-05-19T00:18:41.116983 #3660991] INFO -- : made symlink emoji/15.0/emoji-sequences.txt to /tmp/ruby/src/trunk/.downloaded-cache/emoji/15.0/emoji-sequences.txt I, [2024-05-19T00:18:41.117019 #3660991] INFO -- : downloading emoji/15.0/emoji-sequences.txt ... downloading emoji/15.0/emoji-test.txt ... /tmp/ruby/src/trunk/enc/unicode/data/emoji/15.0/emoji-sequences.txt already exists E, [2024-05-19T00:18:41.614302 #3660991] ERROR -- : /tmp/ruby/src/trunk/tool/downloader.rb:302:in `rescue in download': failed to download emoji/15.0/emoji-test.txt (RuntimeError) E, [2024-05-19T00:18:41.614430 #3660991] ERROR -- : OpenURI::HTTPError: 403 Forbidden: https://www.unicode.org/Public/emoji/15.0/emoji-test.txt E, [2024-05-19T00:18:41.614449 #3660991] ERROR -- : from /tmp/ruby/src/trunk/tool/downloader.rb:201:in `download' E, [2024-05-19T00:18:41.614461 #3660991] ERROR -- : from /tmp/ruby/src/trunk/tool/downloader.rb:136:in `download' E, [2024-05-19T00:18:41.614472 #3660991] ERROR -- : from /tmp/ruby/src/trunk/tool/downloader.rb:482:in `block in
' E, [2024-05-19T00:18:41.614484 #3660991] ERROR -- : from /tmp/ruby/src/trunk/tool/downloader.rb:465:in `each' E, [2024-05-19T00:18:41.614495 #3660991] ERROR -- : from /tmp/ruby/src/trunk/tool/downloader.rb:465:in `
' E, [2024-05-19T00:18:41.614506 #3660991] ERROR -- : /usr/lib/ruby/3.0.0/open-uri.rb:364:in `open_http': 403 Forbidden (OpenURI::HTTPError) E, [2024-05-19T00:18:41.614517 #3660991] ERROR -- : from /usr/lib/ruby/3.0.0/open-uri.rb:741:in `buffer_open' E, [2024-05-19T00:18:41.614530 #3660991] ERROR -- : from /usr/lib/ruby/3.0.0/open-uri.rb:212:in `block in open_loop' E, [2024-05-19T00:18:41.614541 #3660991] ERROR -- : from /usr/lib/ruby/3.0.0/open-uri.rb:210:in `catch' E, [2024-05-19T00:18:41.614551 #3660991] ERROR -- : from /usr/lib/ruby/3.0.0/open-uri.rb:210:in `open_loop' E, [2024-05-19T00:18:41.614562 #3660991] ERROR -- : from /usr/lib/ruby/3.0.0/open-uri.rb:151:in `open_uri' E, [2024-05-19T00:18:41.614573 #3660991] ERROR -- : from /usr/lib/ruby/3.0.0/open-uri.rb:721:in `open' E, [2024-05-19T00:18:41.614583 #3660991] ERROR -- : from /usr/lib/ruby/3.0.0/open-uri.rb:729:in `read' E, [2024-05-19T00:18:41.614594 #3660991] ERROR -- : from /tmp/ruby/src/trunk/tool/downloader.rb:247:in `block in download' E, [2024-05-19T00:18:41.614622 #3660991] ERROR -- : from /tmp/ruby/src/trunk/tool/downloader.rb:378:in `with_retry' E, [2024-05-19T00:18:41.614633 #3660991] ERROR -- : from /tmp/ruby/src/trunk/tool/downloader.rb:246:in `download' E, [2024-05-19T00:18:41.614648 #3660991] ERROR -- : from /tmp/ruby/src/trunk/tool/downloader.rb:136:in `download' E, [2024-05-19T00:18:41.614659 #3660991] ERROR -- : from /tmp/ruby/src/trunk/tool/downloader.rb:482:in `block in
' E, [2024-05-19T00:18:41.614670 #3660991] ERROR -- : from /tmp/ruby/src/trunk/tool/downloader.rb:465:in `each' E, [2024-05-19T00:18:41.614680 #3660991] ERROR -- : from /tmp/ruby/src/trunk/tool/downloader.rb:465:in `
' E, [2024-05-19T00:18:41.614691 #3660991] ERROR -- : /tmp/ruby/src/trunk/tool/downloader.rb:302:in `rescue in download': failed to download emoji/15.0/emoji-test.txt (RuntimeError) E, [2024-05-19T00:18:41.614703 #3660991] ERROR -- : OpenURI::HTTPError: 403 Forbidden: https://www.unicode.org/Public/emoji/15.0/emoji-test.txt E, [2024-05-19T00:18:41.614716 #3660991] ERROR -- : from /tmp/ruby/src/trunk/tool/downloader.rb:201:in `download' E, [2024-05-19T00:18:41.614729 #3660991] ERROR -- : from /tmp/ruby/src/trunk/tool/downloader.rb:136:in `download' E, [2024-05-19T00:18:41.614741 #3660991] ERROR -- : from /tmp/ruby/src/trunk/tool/downloader.rb:482:in `block in
' E, [2024-05-19T00:18:41.614751 #3660991] ERROR -- : from /tmp/ruby/src/trunk/tool/downloader.rb:465:in `each' E, [2024-05-19T00:18:41.614762 #3660991] ERROR -- : from /tmp/ruby/src/trunk/tool/downloader.rb:465:in `
' E, [2024-05-19T00:18:41.614772 #3660991] ERROR -- : /usr/lib/ruby/3.0.0/open-uri.rb:364:in `open_http': 403 Forbidden (OpenURI::HTTPError) E, [2024-05-19T00:18:41.614783 #3660991] ERROR -- : from /usr/lib/ruby/3.0.0/open-uri.rb:741:in `buffer_open' E, [2024-05-19T00:18:41.614794 #3660991] ERROR -- : from /usr/lib/ruby/3.0.0/open-uri.rb:212:in `block in open_loop' E, [2024-05-19T00:18:41.614805 #3660991] ERROR -- : from /usr/lib/ruby/3.0.0/open-uri.rb:210:in `catch' E, [2024-05-19T00:18:41.614819 #3660991] ERROR -- : from /usr/lib/ruby/3.0.0/open-uri.rb:210:in `open_loop' E, [2024-05-19T00:18:41.614829 #3660991] ERROR -- : from /usr/lib/ruby/3.0.0/open-uri.rb:151:in `open_uri' E, [2024-05-19T00:18:41.614840 #3660991] ERROR -- : from /usr/lib/ruby/3.0.0/open-uri.rb:721:in `open' E, [2024-05-19T00:18:41.614850 #3660991] ERROR -- : from /usr/lib/ruby/3.0.0/open-uri.rb:729:in `read' E, [2024-05-19T00:18:41.614860 #3660991] ERROR -- : from /tmp/ruby/src/trunk/tool/downloader.rb:247:in `block in download' E, [2024-05-19T00:18:41.614869 #3660991] ERROR -- : from /tmp/ruby/src/trunk/tool/downloader.rb:378:in `with_retry' E, [2024-05-19T00:18:41.614879 #3660991] ERROR -- : from /tmp/ruby/src/trunk/tool/downloader.rb:246:in `download' E, [2024-05-19T00:18:41.614889 #3660991] ERROR -- : from /tmp/ruby/src/trunk/tool/downloader.rb:136:in `download' E, [2024-05-19T00:18:41.614898 #3660991] ERROR -- : from /tmp/ruby/src/trunk/tool/downloader.rb:482:in `block in
' E, [2024-05-19T00:18:41.614911 #3660991] ERROR -- : from /tmp/ruby/src/trunk/tool/downloader.rb:465:in `each' E, [2024-05-19T00:18:41.614921 #3660991] ERROR -- : from /tmp/ruby/src/trunk/tool/downloader.rb:465:in `
' E, [2024-05-19T00:18:41.618541 #3660991] ERROR -- : make: *** [uncommon.mk:1765: /tmp/ruby/src/trunk/enc/unicode/data/emoji/15.0/emoji-zwj-sequences.txt] Error 1 E, [2024-05-19T00:18:41.618600 #3660991] ERROR -- : make: *** Waiting for unfinished jobs.... E, [2024-05-19T00:18:41.619680 #3660991] ERROR -- : make: *** [uncommon.mk:1765: /tmp/ruby/src/trunk/enc/unicode/data/emoji/15.0/emoji-sequences.txt] Error 1 E, [2024-05-19T00:18:41.619752 #3660991] ERROR -- : make: *** Deleting file '/tmp/ruby/src/trunk/enc/unicode/data/emoji/15.0/emoji-sequences.txt' E, [2024-05-19T00:18:42.093257 #3660991] ERROR -- : /tmp/ruby/src/trunk/tool/downloader.rb:302:in `rescue in download': failed to download emoji/15.0/emoji-sequences.txt (RuntimeError) E, [2024-05-19T00:18:42.093304 #3660991] ERROR -- : EOFError: end of file reached: https://www.unicode.org/Public/emoji/15.0/emoji-sequences.txt E, [2024-05-19T00:18:42.093310 #3660991] ERROR -- : from /tmp/ruby/src/trunk/tool/downloader.rb:201:in `download' E, [2024-05-19T00:18:42.093314 #3660991] ERROR -- : from /tmp/ruby/src/trunk/tool/downloader.rb:136:in `download' E, [2024-05-19T00:18:42.093317 #3660991] ERROR -- : from /tmp/ruby/src/trunk/tool/downloader.rb:482:in `block in
' E, [2024-05-19T00:18:42.093321 #3660991] ERROR -- : from /tmp/ruby/src/trunk/tool/downloader.rb:465:in `each' E, [2024-05-19T00:18:42.093325 #3660991] ERROR -- : from /tmp/ruby/src/trunk/tool/downloader.rb:465:in `
' E, [2024-05-19T00:18:42.093329 #3660991] ERROR -- : /usr/lib/ruby/3.0.0/net/protocol.rb:227:in `rbuf_fill': end of file reached (EOFError) E, [2024-05-19T00:18:42.093334 #3660991] ERROR -- : from /usr/lib/ruby/3.0.0/net/protocol.rb:193:in `readuntil' E, [2024-05-19T00:18:42.093337 #3660991] ERROR -- : from /usr/lib/ruby/3.0.0/net/protocol.rb:203:in `readline' E, [2024-05-19T00:18:42.093341 #3660991] ERROR -- : from /usr/lib/ruby/3.0.0/net/http/response.rb:42:in `read_status_line' E, [2024-05-19T00:18:42.093344 #3660991] ERROR -- : from /usr/lib/ruby/3.0.0/net/http/response.rb:31:in `read_new' E, [2024-05-19T00:18:42.093348 #3660991] ERROR -- : from /usr/lib/ruby/3.0.0/net/http.rb:1557:in `block in transport_request' E, [2024-05-19T00:18:42.093351 #3660991] ERROR -- : from /usr/lib/ruby/3.0.0/net/http.rb:1548:in `catch' E, [2024-05-19T00:18:42.093428 #3660991] ERROR -- : from /usr/lib/ruby/3.0.0/net/http.rb:1548:in `transport_request' E, [2024-05-19T00:18:42.093432 #3660991] ERROR -- : from /usr/lib/ruby/3.0.0/net/http.rb:1521:in `request' E, [2024-05-19T00:18:42.093435 #3660991] ERROR -- : from /usr/lib/ruby/3.0.0/open-uri.rb:329:in `block in open_http' E, [2024-05-19T00:18:42.093439 #3660991] ERROR -- : from /usr/lib/ruby/3.0.0/net/http.rb:960:in `start' E, [2024-05-19T00:18:42.093442 #3660991] ERROR -- : from /usr/lib/ruby/3.0.0/open-uri.rb:323:in `open_http' E, [2024-05-19T00:18:42.093446 #3660991] ERROR -- : from /usr/lib/ruby/3.0.0/open-uri.rb:741:in `buffer_open' E, [2024-05-19T00:18:42.093451 #3660991] ERROR -- : from /usr/lib/ruby/3.0.0/open-uri.rb:212:in `block in open_loop' E, [2024-05-19T00:18:42.093454 #3660991] ERROR -- : from /usr/lib/ruby/3.0.0/open-uri.rb:210:in `catch' E, [2024-05-19T00:18:42.093458 #3660991] ERROR -- : from /usr/lib/ruby/3.0.0/open-uri.rb:210:in `open_loop' E, [2024-05-19T00:18:42.093461 #3660991] ERROR -- : from /usr/lib/ruby/3.0.0/open-uri.rb:151:in `open_uri' E, [2024-05-19T00:18:42.093465 #3660991] ERROR -- : from /usr/lib/ruby/3.0.0/open-uri.rb:721:in `open' E, [2024-05-19T00:18:42.093468 #3660991] ERROR -- : from /usr/lib/ruby/3.0.0/open-uri.rb:729:in `read' E, [2024-05-19T00:18:42.093472 #3660991] ERROR -- : from /tmp/ruby/src/trunk/tool/downloader.rb:247:in `block in download' E, [2024-05-19T00:18:42.093475 #3660991] ERROR -- : from /tmp/ruby/src/trunk/tool/downloader.rb:378:in `with_retry' E, [2024-05-19T00:18:42.093479 #3660991] ERROR -- : from /tmp/ruby/src/trunk/tool/downloader.rb:246:in `download' E, [2024-05-19T00:18:42.093483 #3660991] ERROR -- : from /tmp/ruby/src/trunk/tool/downloader.rb:136:in `download' E, [2024-05-19T00:18:42.093486 #3660991] ERROR -- : from /tmp/ruby/src/trunk/tool/downloader.rb:482:in `block in
' E, [2024-05-19T00:18:42.093490 #3660991] ERROR -- : from /tmp/ruby/src/trunk/tool/downloader.rb:465:in `each' E, [2024-05-19T00:18:42.093494 #3660991] ERROR -- : from /tmp/ruby/src/trunk/tool/downloader.rb:465:in `
' I, [2024-05-19T00:18:42.095368 #3660991] INFO -- : downloading emoji/15.0/emoji-test.txt ... E, [2024-05-19T00:18:42.095425 #3660991] ERROR -- : make: *** [uncommon.mk:1765: /tmp/ruby/src/trunk/enc/unicode/data/emoji/15.0/emoji-test.txt] Error 1 I, [2024-05-19T00:18:42.095828 #3660991] INFO -- : $$$[end] "make update-unicode -j20" exit with 512. I, [2024-05-19T00:18:42.095878 #3660991] INFO -- : $$$[beg] make update-download -j20 I, [2024-05-19T00:18:42.198038 #3660991] INFO -- : tool/config.guess already exists I, [2024-05-19T00:18:42.198088 #3660991] INFO -- : tool/config.sub already exists I, [2024-05-19T00:18:42.200336 #3660991] INFO -- : Update power_assert to 84e85124c5014a139af39161d484156cfe87a9ed I, [2024-05-19T00:18:42.200623 #3660991] INFO -- : Update rbs to ba7872795d5de04adb8ff500c0e6afdc81a041dd I, [2024-05-19T00:18:42.201315 #3660991] INFO -- : Update typeprof to b19a6416da3a05d57fadd6ffdadb382b6d236ca5 I, [2024-05-19T00:18:42.201584 #3660991] INFO -- : echo 84e85124c5014a139af39161d484156cfe87a9ed | /bin/sh /tmp/ruby/src/trunk/tool/ifchange /tmp/ruby/src/trunk/.bundle/.timestamp/power_assert.revision - I, [2024-05-19T00:18:42.201905 #3660991] INFO -- : echo ba7872795d5de04adb8ff500c0e6afdc81a041dd | /bin/sh /tmp/ruby/src/trunk/tool/ifchange /tmp/ruby/src/trunk/.bundle/.timestamp/rbs.revision - I, [2024-05-19T00:18:42.202461 #3660991] INFO -- : echo b19a6416da3a05d57fadd6ffdadb382b6d236ca5 | /bin/sh /tmp/ruby/src/trunk/tool/ifchange /tmp/ruby/src/trunk/.bundle/.timestamp/typeprof.revision - I, [2024-05-19T00:18:42.203556 #3660991] INFO -- : /tmp/ruby/src/trunk/.bundle/.timestamp/power_assert.revision unchanged I, [2024-05-19T00:18:42.203665 #3660991] INFO -- : /tmp/ruby/src/trunk/.bundle/.timestamp/rbs.revision unchanged I, [2024-05-19T00:18:42.204462 #3660991] INFO -- : /tmp/ruby/src/trunk/.bundle/.timestamp/typeprof.revision unchanged I, [2024-05-19T00:18:42.204869 #3660991] INFO -- : Building power_assert@84e85124c5014a139af39161d484156cfe87a9ed to /tmp/ruby/src/trunk/gems/power_assert-2.0.3.gem I, [2024-05-19T00:18:42.274227 #3660991] INFO -- : Successfully built RubyGem I, [2024-05-19T00:18:42.274271 #3660991] INFO -- : Name: power_assert I, [2024-05-19T00:18:42.274277 #3660991] INFO -- : Version: 2.0.4dev I, [2024-05-19T00:18:42.274282 #3660991] INFO -- : File: power_assert-2.0.4dev.gem I, [2024-05-19T00:18:42.320647 #3660991] INFO -- : $$$[end] "make update-download -j20" exit with 0. I, [2024-05-19T00:18:42.320690 #3660991] INFO -- : $$$[beg] make update-rubyspec -j20 I, [2024-05-19T00:18:42.378746 #3660991] INFO -- : make: Nothing to be done for 'update-rubyspec'. I, [2024-05-19T00:18:42.379058 #3660991] INFO -- : $$$[end] "make update-rubyspec -j20" exit with 0. I, [2024-05-19T00:18:42.379085 #3660991] INFO -- : $$$[beg] make update-src -j20 I, [2024-05-19T00:18:42.922851 #3660991] INFO -- : Already up to date. I, [2024-05-19T00:18:42.940976 #3660991] INFO -- : Latest commit hash = dbbaf871de I, [2024-05-19T00:18:42.942617 #3660991] INFO -- : $$$[end] "make update-src -j20" exit with 0. I, [2024-05-19T00:18:42.942668 #3660991] INFO -- : $$$[beg] make after-update -j20 I, [2024-05-19T00:18:43.023611 #3660991] INFO -- : generating /tmp/ruby/src/trunk/ext/ripper/eventids2table.c I, [2024-05-19T00:18:43.027747 #3660991] INFO -- : make[1]: Entering directory '/tmp/ruby/src/trunk/ext/ripper' I, [2024-05-19T00:18:43.027769 #3660991] INFO -- : make[1]: Nothing to be done for 'src'. I, [2024-05-19T00:18:43.027774 #3660991] INFO -- : make[1]: Leaving directory '/tmp/ruby/src/trunk/ext/ripper' I, [2024-05-19T00:18:43.047486 #3660991] INFO -- : /tmp/ruby/src/trunk/revision.h updated I, [2024-05-19T00:18:43.049579 #3660991] INFO -- : generating x86_64-linux-fake.rb I, [2024-05-19T00:18:43.105297 #3660991] INFO -- : x86_64-linux-fake.rb updated I, [2024-05-19T00:18:43.106640 #3660991] INFO -- : generating enc.mk I, [2024-05-19T00:18:43.223336 #3660991] INFO -- : making srcs under enc I, [2024-05-19T00:18:43.252932 #3660991] INFO -- : make[1]: Entering directory '/tmp/ruby/build/trunk' I, [2024-05-19T00:18:43.252954 #3660991] INFO -- : make[1]: Nothing to be done for 'srcs'. I, [2024-05-19T00:18:43.252959 #3660991] INFO -- : make[1]: Leaving directory '/tmp/ruby/build/trunk' I, [2024-05-19T00:18:43.297827 #3660991] INFO -- : Update power_assert to 84e85124c5014a139af39161d484156cfe87a9ed I, [2024-05-19T00:18:43.298079 #3660991] INFO -- : Update rbs to ba7872795d5de04adb8ff500c0e6afdc81a041dd I, [2024-05-19T00:18:43.298745 #3660991] INFO -- : Update typeprof to b19a6416da3a05d57fadd6ffdadb382b6d236ca5 I, [2024-05-19T00:18:43.299280 #3660991] INFO -- : echo 84e85124c5014a139af39161d484156cfe87a9ed | /bin/sh /tmp/ruby/src/trunk/tool/ifchange /tmp/ruby/src/trunk/.bundle/.timestamp/power_assert.revision - I, [2024-05-19T00:18:43.299331 #3660991] INFO -- : echo ba7872795d5de04adb8ff500c0e6afdc81a041dd | /bin/sh /tmp/ruby/src/trunk/tool/ifchange /tmp/ruby/src/trunk/.bundle/.timestamp/rbs.revision - I, [2024-05-19T00:18:43.300476 #3660991] INFO -- : echo b19a6416da3a05d57fadd6ffdadb382b6d236ca5 | /bin/sh /tmp/ruby/src/trunk/tool/ifchange /tmp/ruby/src/trunk/.bundle/.timestamp/typeprof.revision - I, [2024-05-19T00:18:43.301304 #3660991] INFO -- : /tmp/ruby/src/trunk/.bundle/.timestamp/power_assert.revision unchanged I, [2024-05-19T00:18:43.301341 #3660991] INFO -- : /tmp/ruby/src/trunk/.bundle/.timestamp/rbs.revision unchanged I, [2024-05-19T00:18:43.302364 #3660991] INFO -- : /tmp/ruby/src/trunk/.bundle/.timestamp/typeprof.revision unchanged I, [2024-05-19T00:18:43.302514 #3660991] INFO -- : Building power_assert@84e85124c5014a139af39161d484156cfe87a9ed to /tmp/ruby/src/trunk/gems/power_assert-2.0.3.gem I, [2024-05-19T00:18:43.370925 #3660991] INFO -- : Successfully built RubyGem I, [2024-05-19T00:18:43.370968 #3660991] INFO -- : Name: power_assert I, [2024-05-19T00:18:43.370974 #3660991] INFO -- : Version: 2.0.4dev I, [2024-05-19T00:18:43.370978 #3660991] INFO -- : File: power_assert-2.0.4dev.gem I, [2024-05-19T00:18:43.373111 #3660991] INFO -- : Extracting bundle gem power_assert-2.0.3... I, [2024-05-19T00:18:43.433879 #3660991] INFO -- : Try with hash version of bundled gems instead of gems/power_assert-2.0.3.gem. We don't use this gem with release version of Ruby. I, [2024-05-19T00:18:43.438848 #3660991] INFO -- : Unpacked gems/power_assert-2.0.4dev.gem I, [2024-05-19T00:18:43.440637 #3660991] INFO -- : $$$[end] "make after-update -j20" exit with 0. I, [2024-05-19T00:18:43.440768 #3660991] INFO -- : $$$[beg] make miniruby -j20 I, [2024-05-19T00:18:43.500478 #3660991] INFO -- : BASERUBY = /usr/bin/ruby --disable=gems I, [2024-05-19T00:18:43.500511 #3660991] INFO -- : CC = gcc I, [2024-05-19T00:18:43.500516 #3660991] INFO -- : LD = ld I, [2024-05-19T00:18:43.500520 #3660991] INFO -- : LDSHARED = gcc -shared I, [2024-05-19T00:18:43.500524 #3660991] INFO -- : CFLAGS = -O3 -fno-fast-math -ggdb3 -Wall -Wextra -Wdeprecated-declarations -Wdiv-by-zero -Wduplicated-cond -Wimplicit-function-declaration -Wimplicit-int -Wpointer-arith -Wwrite-strings -Wold-style-definition -Wimplicit-fallthrough=0 -Wmissing-noreturn -Wno-cast-function-type -Wno-constant-logical-operand -Wno-long-long -Wno-missing-field-initializers -Wno-overlength-strings -Wno-packed-bitfield-compat -Wno-parentheses-equality -Wno-self-assign -Wno-tautological-compare -Wno-unused-parameter -Wno-unused-value -Wsuggest-attribute=format -Wsuggest-attribute=noreturn -Wunused-variable -Wmisleading-indentation -Wundef -fPIC I, [2024-05-19T00:18:43.500528 #3660991] INFO -- : XCFLAGS = -U_FORTIFY_SOURCE -D_FORTIFY_SOURCE=2 -fstack-protector-strong -fno-strict-overflow -fvisibility=hidden -fexcess-precision=standard -DRUBY_EXPORT -I. -I.ext/include/x86_64-linux -I/tmp/ruby/src/trunk/include -I/tmp/ruby/src/trunk -I/tmp/ruby/src/trunk/prism -I/tmp/ruby/src/trunk/enc/unicode/15.0.0 I, [2024-05-19T00:18:43.500532 #3660991] INFO -- : CPPFLAGS = I, [2024-05-19T00:18:43.500535 #3660991] INFO -- : DLDFLAGS = -Wl,--compress-debug-sections=zlib -Wl,-soname,libruby.so.3.4 -fstack-protector-strong I, [2024-05-19T00:18:43.500539 #3660991] INFO -- : SOLIBS = -lz -lrt -lrt -lgmp -ldl -lcrypt -lm -lpthread I, [2024-05-19T00:18:43.500542 #3660991] INFO -- : LANG = en_US.UTF-8 I, [2024-05-19T00:18:43.500547 #3660991] INFO -- : LC_ALL = I, [2024-05-19T00:18:43.500550 #3660991] INFO -- : LC_CTYPE = I, [2024-05-19T00:18:43.500554 #3660991] INFO -- : MFLAGS = -j20 --jobserver-auth=4,5 I, [2024-05-19T00:18:43.500563 #3660991] INFO -- : RUSTC = no I, [2024-05-19T00:18:43.500567 #3660991] INFO -- : YJIT_RUSTC_ARGS = --crate-name=yjit --crate-type=staticlib --edition=2021 -g -C lto=thin -C opt-level=3 -C overflow-checks=on '--out-dir=/tmp/ruby/build/trunk/yjit/target/release/' /tmp/ruby/src/trunk/yjit/src/lib.rs I, [2024-05-19T00:18:43.501909 #3660991] INFO -- : gcc (Ubuntu 11.4.0-1ubuntu1~22.04) 11.4.0 I, [2024-05-19T00:18:43.501929 #3660991] INFO -- : Copyright (C) 2021 Free Software Foundation, Inc. I, [2024-05-19T00:18:43.501934 #3660991] INFO -- : This is free software; see the source for copying conditions. There is NO I, [2024-05-19T00:18:43.501941 #3660991] INFO -- : warranty; not even for MERCHANTABILITY or FITNESS FOR A PARTICULAR PURPOSE. I, [2024-05-19T00:18:43.501945 #3660991] INFO -- : I, [2024-05-19T00:18:43.524422 #3660991] INFO -- : compiling /tmp/ruby/src/trunk/version.c I, [2024-05-19T00:18:43.626449 #3660991] INFO -- : linking miniruby I, [2024-05-19T00:18:44.155530 #3660991] INFO -- : $$$[end] "make miniruby -j20" exit with 0. I, [2024-05-19T00:18:44.155635 #3660991] INFO -- : $$$[beg] make ruby -j20 I, [2024-05-19T00:18:44.213024 #3660991] INFO -- : BASERUBY = /usr/bin/ruby --disable=gems I, [2024-05-19T00:18:44.213058 #3660991] INFO -- : CC = gcc I, [2024-05-19T00:18:44.213065 #3660991] INFO -- : LD = ld I, [2024-05-19T00:18:44.213069 #3660991] INFO -- : LDSHARED = gcc -shared I, [2024-05-19T00:18:44.213077 #3660991] INFO -- : CFLAGS = -O3 -fno-fast-math -ggdb3 -Wall -Wextra -Wdeprecated-declarations -Wdiv-by-zero -Wduplicated-cond -Wimplicit-function-declaration -Wimplicit-int -Wpointer-arith -Wwrite-strings -Wold-style-definition -Wimplicit-fallthrough=0 -Wmissing-noreturn -Wno-cast-function-type -Wno-constant-logical-operand -Wno-long-long -Wno-missing-field-initializers -Wno-overlength-strings -Wno-packed-bitfield-compat -Wno-parentheses-equality -Wno-self-assign -Wno-tautological-compare -Wno-unused-parameter -Wno-unused-value -Wsuggest-attribute=format -Wsuggest-attribute=noreturn -Wunused-variable -Wmisleading-indentation -Wundef -fPIC I, [2024-05-19T00:18:44.213083 #3660991] INFO -- : XCFLAGS = -U_FORTIFY_SOURCE -D_FORTIFY_SOURCE=2 -fstack-protector-strong -fno-strict-overflow -fvisibility=hidden -fexcess-precision=standard -DRUBY_EXPORT -I. -I.ext/include/x86_64-linux -I/tmp/ruby/src/trunk/include -I/tmp/ruby/src/trunk -I/tmp/ruby/src/trunk/prism -I/tmp/ruby/src/trunk/enc/unicode/15.0.0 I, [2024-05-19T00:18:44.213087 #3660991] INFO -- : CPPFLAGS = I, [2024-05-19T00:18:44.213092 #3660991] INFO -- : DLDFLAGS = -Wl,--compress-debug-sections=zlib -Wl,-soname,libruby.so.3.4 -fstack-protector-strong I, [2024-05-19T00:18:44.213096 #3660991] INFO -- : SOLIBS = -lz -lrt -lrt -lgmp -ldl -lcrypt -lm -lpthread I, [2024-05-19T00:18:44.213100 #3660991] INFO -- : LANG = en_US.UTF-8 I, [2024-05-19T00:18:44.213104 #3660991] INFO -- : LC_ALL = I, [2024-05-19T00:18:44.213108 #3660991] INFO -- : LC_CTYPE = I, [2024-05-19T00:18:44.213112 #3660991] INFO -- : MFLAGS = -j20 --jobserver-auth=4,5 I, [2024-05-19T00:18:44.213117 #3660991] INFO -- : RUSTC = no I, [2024-05-19T00:18:44.213121 #3660991] INFO -- : YJIT_RUSTC_ARGS = --crate-name=yjit --crate-type=staticlib --edition=2021 -g -C lto=thin -C opt-level=3 -C overflow-checks=on '--out-dir=/tmp/ruby/build/trunk/yjit/target/release/' /tmp/ruby/src/trunk/yjit/src/lib.rs I, [2024-05-19T00:18:44.214608 #3660991] INFO -- : gcc (Ubuntu 11.4.0-1ubuntu1~22.04) 11.4.0 I, [2024-05-19T00:18:44.214633 #3660991] INFO -- : Copyright (C) 2021 Free Software Foundation, Inc. I, [2024-05-19T00:18:44.214640 #3660991] INFO -- : This is free software; see the source for copying conditions. There is NO I, [2024-05-19T00:18:44.214644 #3660991] INFO -- : warranty; not even for MERCHANTABILITY or FITNESS FOR A PARTICULAR PURPOSE. I, [2024-05-19T00:18:44.214652 #3660991] INFO -- : I, [2024-05-19T00:18:44.325152 #3660991] INFO -- : builtin_binary.inc updated I, [2024-05-19T00:18:44.329868 #3660991] INFO -- : c5234a9416e4f20f175185e840b25b0f08674d14078ed7083f37e655458e3ca9 builtin_binary.inc I, [2024-05-19T00:18:44.330785 #3660991] INFO -- : compiling /tmp/ruby/src/trunk/builtin.c I, [2024-05-19T00:18:44.513578 #3660991] INFO -- : linking static-library libruby-static.a I, [2024-05-19T00:18:44.825796 #3660991] INFO -- : linking shared-library libruby.so.3.4.0 I, [2024-05-19T00:18:46.413105 #3660991] INFO -- : linking ruby I, [2024-05-19T00:18:46.435714 #3660991] INFO -- : $$$[end] "make ruby -j20" exit with 0. I, [2024-05-19T00:18:46.435868 #3660991] INFO -- : $$$[beg] make all -j20 I, [2024-05-19T00:18:46.492979 #3660991] INFO -- : BASERUBY = /usr/bin/ruby --disable=gems I, [2024-05-19T00:18:46.493025 #3660991] INFO -- : CC = gcc I, [2024-05-19T00:18:46.493038 #3660991] INFO -- : LD = ld I, [2024-05-19T00:18:46.493049 #3660991] INFO -- : LDSHARED = gcc -shared I, [2024-05-19T00:18:46.493059 #3660991] INFO -- : CFLAGS = -O3 -fno-fast-math -ggdb3 -Wall -Wextra -Wdeprecated-declarations -Wdiv-by-zero -Wduplicated-cond -Wimplicit-function-declaration -Wimplicit-int -Wpointer-arith -Wwrite-strings -Wold-style-definition -Wimplicit-fallthrough=0 -Wmissing-noreturn -Wno-cast-function-type -Wno-constant-logical-operand -Wno-long-long -Wno-missing-field-initializers -Wno-overlength-strings -Wno-packed-bitfield-compat -Wno-parentheses-equality -Wno-self-assign -Wno-tautological-compare -Wno-unused-parameter -Wno-unused-value -Wsuggest-attribute=format -Wsuggest-attribute=noreturn -Wunused-variable -Wmisleading-indentation -Wundef -fPIC I, [2024-05-19T00:18:46.493070 #3660991] INFO -- : XCFLAGS = -U_FORTIFY_SOURCE -D_FORTIFY_SOURCE=2 -fstack-protector-strong -fno-strict-overflow -fvisibility=hidden -fexcess-precision=standard -DRUBY_EXPORT -I. -I.ext/include/x86_64-linux -I/tmp/ruby/src/trunk/include -I/tmp/ruby/src/trunk -I/tmp/ruby/src/trunk/prism -I/tmp/ruby/src/trunk/enc/unicode/15.0.0 I, [2024-05-19T00:18:46.493081 #3660991] INFO -- : CPPFLAGS = I, [2024-05-19T00:18:46.493091 #3660991] INFO -- : DLDFLAGS = -Wl,--compress-debug-sections=zlib -Wl,-soname,libruby.so.3.4 -fstack-protector-strong I, [2024-05-19T00:18:46.493101 #3660991] INFO -- : SOLIBS = -lz -lrt -lrt -lgmp -ldl -lcrypt -lm -lpthread I, [2024-05-19T00:18:46.493111 #3660991] INFO -- : LANG = en_US.UTF-8 I, [2024-05-19T00:18:46.493121 #3660991] INFO -- : LC_ALL = I, [2024-05-19T00:18:46.493131 #3660991] INFO -- : LC_CTYPE = I, [2024-05-19T00:18:46.493141 #3660991] INFO -- : MFLAGS = -j20 --jobserver-auth=4,5 I, [2024-05-19T00:18:46.493151 #3660991] INFO -- : RUSTC = no I, [2024-05-19T00:18:46.493161 #3660991] INFO -- : YJIT_RUSTC_ARGS = --crate-name=yjit --crate-type=staticlib --edition=2021 -g -C lto=thin -C opt-level=3 -C overflow-checks=on '--out-dir=/tmp/ruby/build/trunk/yjit/target/release/' /tmp/ruby/src/trunk/yjit/src/lib.rs I, [2024-05-19T00:18:46.494416 #3660991] INFO -- : gcc (Ubuntu 11.4.0-1ubuntu1~22.04) 11.4.0 I, [2024-05-19T00:18:46.494458 #3660991] INFO -- : Copyright (C) 2021 Free Software Foundation, Inc. I, [2024-05-19T00:18:46.494476 #3660991] INFO -- : This is free software; see the source for copying conditions. There is NO I, [2024-05-19T00:18:46.494488 #3660991] INFO -- : warranty; not even for MERCHANTABILITY or FITNESS FOR A PARTICULAR PURPOSE. I, [2024-05-19T00:18:46.494498 #3660991] INFO -- : I, [2024-05-19T00:18:46.524042 #3660991] INFO -- : generating enc.mk I, [2024-05-19T00:18:46.525937 #3660991] INFO -- : building spec/ruby/optional/capi/ext/array_spec.so I, [2024-05-19T00:18:46.526260 #3660991] INFO -- : building spec/ruby/optional/capi/ext/basic_object_spec.so I, [2024-05-19T00:18:46.527002 #3660991] INFO -- : building spec/ruby/optional/capi/ext/bignum_spec.so I, [2024-05-19T00:18:46.527656 #3660991] INFO -- : building spec/ruby/optional/capi/ext/binding_spec.so I, [2024-05-19T00:18:46.527902 #3660991] INFO -- : building spec/ruby/optional/capi/ext/boolean_spec.so I, [2024-05-19T00:18:46.528447 #3660991] INFO -- : building spec/ruby/optional/capi/ext/class_id_under_autoload_spec.so I, [2024-05-19T00:18:46.529127 #3660991] INFO -- : building spec/ruby/optional/capi/ext/class_spec.so I, [2024-05-19T00:18:46.529712 #3660991] INFO -- : building spec/ruby/optional/capi/ext/class_under_autoload_spec.so I, [2024-05-19T00:18:46.530267 #3660991] INFO -- : building spec/ruby/optional/capi/ext/complex_spec.so I, [2024-05-19T00:18:46.530974 #3660991] INFO -- : building spec/ruby/optional/capi/ext/constants_spec.so I, [2024-05-19T00:18:46.531241 #3660991] INFO -- : building spec/ruby/optional/capi/ext/data_spec.so I, [2024-05-19T00:18:46.531812 #3660991] INFO -- : building spec/ruby/optional/capi/ext/debug_spec.so I, [2024-05-19T00:18:46.532152 #3660991] INFO -- : building spec/ruby/optional/capi/ext/encoding_spec.so I, [2024-05-19T00:18:46.532791 #3660991] INFO -- : building spec/ruby/optional/capi/ext/enumerator_spec.so I, [2024-05-19T00:18:46.533085 #3660991] INFO -- : building spec/ruby/optional/capi/ext/exception_spec.so I, [2024-05-19T00:18:46.533730 #3660991] INFO -- : building spec/ruby/optional/capi/ext/fiber_spec.so I, [2024-05-19T00:18:46.533988 #3660991] INFO -- : building spec/ruby/optional/capi/ext/file_spec.so I, [2024-05-19T00:18:46.534702 #3660991] INFO -- : building spec/ruby/optional/capi/ext/fixnum_spec.so I, [2024-05-19T00:18:46.535023 #3660991] INFO -- : building spec/ruby/optional/capi/ext/float_spec.so I, [2024-05-19T00:18:46.665397 #3660991] INFO -- : building spec/ruby/optional/capi/ext/gc_spec.so I, [2024-05-19T00:18:46.673846 #3660991] INFO -- : building spec/ruby/optional/capi/ext/globals_spec.so I, [2024-05-19T00:18:46.681624 #3660991] INFO -- : building spec/ruby/optional/capi/ext/hash_spec.so I, [2024-05-19T00:18:46.681917 #3660991] INFO -- : building spec/ruby/optional/capi/ext/integer_spec.so I, [2024-05-19T00:18:46.684197 #3660991] INFO -- : building spec/ruby/optional/capi/ext/io_spec.so I, [2024-05-19T00:18:46.698302 #3660991] INFO -- : building spec/ruby/optional/capi/ext/kernel_spec.so I, [2024-05-19T00:18:46.701008 #3660991] INFO -- : building spec/ruby/optional/capi/ext/language_spec.so I, [2024-05-19T00:18:46.703529 #3660991] INFO -- : building spec/ruby/optional/capi/ext/marshal_spec.so I, [2024-05-19T00:18:46.704831 #3660991] INFO -- : building spec/ruby/optional/capi/ext/module_under_autoload_spec.so I, [2024-05-19T00:18:46.704962 #3660991] INFO -- : building spec/ruby/optional/capi/ext/module_spec.so I, [2024-05-19T00:18:46.705979 #3660991] INFO -- : building spec/ruby/optional/capi/ext/mutex_spec.so I, [2024-05-19T00:18:46.706392 #3660991] INFO -- : building spec/ruby/optional/capi/ext/numeric_spec.so I, [2024-05-19T00:18:46.713221 #3660991] INFO -- : building spec/ruby/optional/capi/ext/object_spec.so I, [2024-05-19T00:18:46.714434 #3660991] INFO -- : building spec/ruby/optional/capi/ext/proc_spec.so I, [2024-05-19T00:18:46.721821 #3660991] INFO -- : building spec/ruby/optional/capi/ext/range_spec.so I, [2024-05-19T00:18:46.728670 #3660991] INFO -- : building spec/ruby/optional/capi/ext/rational_spec.so I, [2024-05-19T00:18:46.745948 #3660991] INFO -- : building spec/ruby/optional/capi/ext/rbasic_spec.so I, [2024-05-19T00:18:46.798232 #3660991] INFO -- : building spec/ruby/optional/capi/ext/regexp_spec.so I, [2024-05-19T00:18:46.830421 #3660991] INFO -- : building spec/ruby/optional/capi/ext/string_spec.so I, [2024-05-19T00:18:46.835140 #3660991] INFO -- : building spec/ruby/optional/capi/ext/struct_spec.so I, [2024-05-19T00:18:46.838687 #3660991] INFO -- : building spec/ruby/optional/capi/ext/st_spec.so I, [2024-05-19T00:18:46.840505 #3660991] INFO -- : building spec/ruby/optional/capi/ext/symbol_spec.so I, [2024-05-19T00:18:46.855626 #3660991] INFO -- : building spec/ruby/optional/capi/ext/thread_spec.so I, [2024-05-19T00:18:46.867684 #3660991] INFO -- : building spec/ruby/optional/capi/ext/time_spec.so I, [2024-05-19T00:18:46.872931 #3660991] INFO -- : building spec/ruby/optional/capi/ext/tracepoint_spec.so I, [2024-05-19T00:18:46.876614 #3660991] INFO -- : building spec/ruby/optional/capi/ext/typed_data_spec.so I, [2024-05-19T00:18:46.887636 #3660991] INFO -- : building spec/ruby/optional/capi/ext/util_spec.so I, [2024-05-19T00:18:46.889379 #3660991] INFO -- : making enc I, [2024-05-19T00:18:46.893289 #3660991] INFO -- : making srcs under enc I, [2024-05-19T00:18:46.917977 #3660991] INFO -- : make[1]: Entering directory '/tmp/ruby/build/trunk' I, [2024-05-19T00:18:46.918038 #3660991] INFO -- : make[1]: Nothing to be done for 'enc'. I, [2024-05-19T00:18:46.918047 #3660991] INFO -- : make[1]: Leaving directory '/tmp/ruby/build/trunk' I, [2024-05-19T00:18:46.923295 #3660991] INFO -- : make[1]: Entering directory '/tmp/ruby/build/trunk' I, [2024-05-19T00:18:46.923360 #3660991] INFO -- : make[1]: Nothing to be done for 'srcs'. I, [2024-05-19T00:18:46.923372 #3660991] INFO -- : make[1]: Leaving directory '/tmp/ruby/build/trunk' I, [2024-05-19T00:18:46.923926 #3660991] INFO -- : generating transdb.h I, [2024-05-19T00:18:47.020960 #3660991] INFO -- : transdb.h unchanged I, [2024-05-19T00:18:47.022108 #3660991] INFO -- : generating makefiles ext/configure-ext.mk I, [2024-05-19T00:18:47.022311 #3660991] INFO -- : making trans I, [2024-05-19T00:18:47.048685 #3660991] INFO -- : ext/configure-ext.mk updated I, [2024-05-19T00:18:47.051224 #3660991] INFO -- : make[1]: Entering directory '/tmp/ruby/build/trunk' I, [2024-05-19T00:18:47.056566 #3660991] INFO -- : make[1]: Entering directory '/tmp/ruby/build/trunk' I, [2024-05-19T00:18:47.056673 #3660991] INFO -- : make[1]: Nothing to be done for 'trans'. I, [2024-05-19T00:18:47.056685 #3660991] INFO -- : make[1]: Leaving directory '/tmp/ruby/build/trunk' I, [2024-05-19T00:18:47.057776 #3660991] INFO -- : making encs I, [2024-05-19T00:18:47.115835 #3660991] INFO -- : make[1]: Entering directory '/tmp/ruby/build/trunk' I, [2024-05-19T00:18:47.115908 #3660991] INFO -- : make[1]: Nothing to be done for 'encs'. I, [2024-05-19T00:18:47.115936 #3660991] INFO -- : make[1]: Leaving directory '/tmp/ruby/build/trunk' I, [2024-05-19T00:18:47.207499 #3660991] INFO -- : make[1]: Leaving directory '/tmp/ruby/build/trunk' I, [2024-05-19T00:18:47.208342 #3660991] INFO -- : generating makefile exts.mk I, [2024-05-19T00:18:47.245002 #3660991] INFO -- : exts.mk unchanged I, [2024-05-19T00:18:47.249753 #3660991] INFO -- : make[1]: Entering directory '/tmp/ruby/build/trunk' I, [2024-05-19T00:18:47.267773 #3660991] INFO -- : make[2]: Entering directory '/tmp/ruby/build/trunk/ext/digest' I, [2024-05-19T00:18:47.269421 #3660991] INFO -- : make[2]: Entering directory '/tmp/ruby/build/trunk/ext/coverage' I, [2024-05-19T00:18:47.269730 #3660991] INFO -- : make[2]: Entering directory '/tmp/ruby/build/trunk/ext/json' I, [2024-05-19T00:18:47.270250 #3660991] INFO -- : make[2]: Entering directory '/tmp/ruby/build/trunk/ext/io/console' I, [2024-05-19T00:18:47.270333 #3660991] INFO -- : make[2]: Entering directory '/tmp/ruby/build/trunk/ext/date' I, [2024-05-19T00:18:47.271640 #3660991] INFO -- : make[2]: Entering directory '/tmp/ruby/build/trunk/ext/monitor' I, [2024-05-19T00:18:47.271660 #3660991] INFO -- : make[2]: Leaving directory '/tmp/ruby/build/trunk/ext/digest' I, [2024-05-19T00:18:47.272169 #3660991] INFO -- : make[2]: Entering directory '/tmp/ruby/build/trunk/ext/pathname' I, [2024-05-19T00:18:47.272638 #3660991] INFO -- : make[2]: Entering directory '/tmp/ruby/build/trunk/ext/fiddle' I, [2024-05-19T00:18:47.272668 #3660991] INFO -- : make[2]: Leaving directory '/tmp/ruby/build/trunk/ext/coverage' I, [2024-05-19T00:18:47.273015 #3660991] INFO -- : make[2]: Leaving directory '/tmp/ruby/build/trunk/ext/io/console' I, [2024-05-19T00:18:47.273355 #3660991] INFO -- : make[2]: Entering directory '/tmp/ruby/build/trunk/ext/pty' I, [2024-05-19T00:18:47.273401 #3660991] INFO -- : make[2]: Entering directory '/tmp/ruby/build/trunk/ext/objspace' I, [2024-05-19T00:18:47.273586 #3660991] INFO -- : make[2]: Leaving directory '/tmp/ruby/build/trunk/ext/date' I, [2024-05-19T00:18:47.273751 #3660991] INFO -- : make[2]: Leaving directory '/tmp/ruby/build/trunk/ext/monitor' I, [2024-05-19T00:18:47.273779 #3660991] INFO -- : make[2]: Entering directory '/tmp/ruby/build/trunk/ext/psych' I, [2024-05-19T00:18:47.274953 #3660991] INFO -- : make[2]: Entering directory '/tmp/ruby/build/trunk/ext/rubyvm' I, [2024-05-19T00:18:47.275274 #3660991] INFO -- : make[2]: Leaving directory '/tmp/ruby/build/trunk/ext/json' I, [2024-05-19T00:18:47.275332 #3660991] INFO -- : make[2]: Leaving directory '/tmp/ruby/build/trunk/ext/pathname' I, [2024-05-19T00:18:47.275972 #3660991] INFO -- : make[2]: Leaving directory '/tmp/ruby/build/trunk/ext/pty' I, [2024-05-19T00:18:47.276250 #3660991] INFO -- : make[2]: Entering directory '/tmp/ruby/build/trunk/.bundle/gems/bigdecimal-3.1.8/ext/bigdecimal' I, [2024-05-19T00:18:47.276348 #3660991] INFO -- : make[2]: Entering directory '/tmp/ruby/build/trunk/.bundle/gems/debug-1.9.2/ext/debug' I, [2024-05-19T00:18:47.276952 #3660991] INFO -- : make[2]: Leaving directory '/tmp/ruby/build/trunk/ext/rubyvm' I, [2024-05-19T00:18:47.277057 #3660991] INFO -- : make[2]: Leaving directory '/tmp/ruby/build/trunk/ext/objspace' I, [2024-05-19T00:18:47.277179 #3660991] INFO -- : make[2]: Entering directory '/tmp/ruby/build/trunk/.bundle/gems/nkf-0.2.0/ext/nkf' I, [2024-05-19T00:18:47.277260 #3660991] INFO -- : make[2]: Entering directory '/tmp/ruby/build/trunk/.bundle/gems/racc-1.7.3/ext/racc/cparse' I, [2024-05-19T00:18:47.277922 #3660991] INFO -- : make[2]: Entering directory '/tmp/ruby/build/trunk/.bundle/gems/syslog-0.1.2/ext/syslog' I, [2024-05-19T00:18:47.277954 #3660991] INFO -- : make[2]: Entering directory '/tmp/ruby/build/trunk/ext/ripper' I, [2024-05-19T00:18:47.277968 #3660991] INFO -- : make[2]: Entering directory '/tmp/ruby/build/trunk/.bundle/gems/rbs-3.4.4/ext/rbs_extension' I, [2024-05-19T00:18:47.278839 #3660991] INFO -- : make[2]: Leaving directory '/tmp/ruby/build/trunk/ext/fiddle' I, [2024-05-19T00:18:47.281148 #3660991] INFO -- : make[2]: Entering directory '/tmp/ruby/build/trunk/ext/digest/sha2' I, [2024-05-19T00:18:47.283285 #3660991] INFO -- : make[2]: Leaving directory '/tmp/ruby/build/trunk/ext/digest/sha2' I, [2024-05-19T00:18:47.285124 #3660991] INFO -- : make[2]: Entering directory '/tmp/ruby/build/trunk/ext/socket' I, [2024-05-19T00:18:47.285299 #3660991] INFO -- : make[2]: Leaving directory '/tmp/ruby/build/trunk/ext/ripper' I, [2024-05-19T00:18:47.286240 #3660991] INFO -- : make[2]: Entering directory '/tmp/ruby/build/trunk/ext/openssl' I, [2024-05-19T00:18:47.286549 #3660991] INFO -- : make[2]: Leaving directory '/tmp/ruby/build/trunk/ext/psych' I, [2024-05-19T00:18:47.291024 #3660991] INFO -- : make[2]: Leaving directory '/tmp/ruby/build/trunk/ext/socket' I, [2024-05-19T00:18:47.300160 #3660991] INFO -- : make[2]: Leaving directory '/tmp/ruby/build/trunk/.bundle/gems/nkf-0.2.0/ext/nkf' I, [2024-05-19T00:18:47.300197 #3660991] INFO -- : make[2]: Leaving directory '/tmp/ruby/build/trunk/.bundle/gems/racc-1.7.3/ext/racc/cparse' I, [2024-05-19T00:18:47.300344 #3660991] INFO -- : make[2]: Leaving directory '/tmp/ruby/build/trunk/.bundle/gems/debug-1.9.2/ext/debug' I, [2024-05-19T00:18:47.300674 #3660991] INFO -- : make[2]: Leaving directory '/tmp/ruby/build/trunk/.bundle/gems/rbs-3.4.4/ext/rbs_extension' I, [2024-05-19T00:18:47.301910 #3660991] INFO -- : make[2]: Leaving directory '/tmp/ruby/build/trunk/.bundle/gems/syslog-0.1.2/ext/syslog' I, [2024-05-19T00:18:47.302365 #3660991] INFO -- : make[2]: Leaving directory '/tmp/ruby/build/trunk/ext/openssl' I, [2024-05-19T00:18:47.307636 #3660991] INFO -- : make[2]: Leaving directory '/tmp/ruby/build/trunk/.bundle/gems/bigdecimal-3.1.8/ext/bigdecimal' I, [2024-05-19T00:18:47.331896 #3660991] INFO -- : make[2]: Entering directory '/tmp/ruby/build/trunk' I, [2024-05-19T00:18:47.407345 #3660991] INFO -- : linking ruby I, [2024-05-19T00:18:47.429610 #3660991] INFO -- : make[2]: Leaving directory '/tmp/ruby/build/trunk' I, [2024-05-19T00:18:47.430068 #3660991] INFO -- : make[1]: Leaving directory '/tmp/ruby/build/trunk' I, [2024-05-19T00:18:47.433758 #3660991] INFO -- : make[1]: Entering directory '/tmp/ruby/build/trunk' I, [2024-05-19T00:18:47.433820 #3660991] INFO -- : make[1]: Nothing to be done for 'note'. I, [2024-05-19T00:18:47.433834 #3660991] INFO -- : make[1]: Leaving directory '/tmp/ruby/build/trunk' I, [2024-05-19T00:18:47.434387 #3660991] INFO -- : $$$[end] "make all -j20" exit with 0. I, [2024-05-19T00:18:47.434572 #3660991] INFO -- : $$$[beg] make install -j20 I, [2024-05-19T00:18:47.501743 #3660991] INFO -- : Update power_assert to 84e85124c5014a139af39161d484156cfe87a9ed I, [2024-05-19T00:18:47.502122 #3660991] INFO -- : Update rbs to ba7872795d5de04adb8ff500c0e6afdc81a041dd I, [2024-05-19T00:18:47.502912 #3660991] INFO -- : Update typeprof to b19a6416da3a05d57fadd6ffdadb382b6d236ca5 I, [2024-05-19T00:18:47.503810 #3660991] INFO -- : echo 84e85124c5014a139af39161d484156cfe87a9ed | /bin/sh /tmp/ruby/src/trunk/tool/ifchange /tmp/ruby/src/trunk/.bundle/.timestamp/power_assert.revision - I, [2024-05-19T00:18:47.504022 #3660991] INFO -- : echo ba7872795d5de04adb8ff500c0e6afdc81a041dd | /bin/sh /tmp/ruby/src/trunk/tool/ifchange /tmp/ruby/src/trunk/.bundle/.timestamp/rbs.revision - I, [2024-05-19T00:18:47.504932 #3660991] INFO -- : BASERUBY = /usr/bin/ruby --disable=gems I, [2024-05-19T00:18:47.504966 #3660991] INFO -- : CC = gcc I, [2024-05-19T00:18:47.504983 #3660991] INFO -- : LD = ld I, [2024-05-19T00:18:47.504992 #3660991] INFO -- : LDSHARED = gcc -shared I, [2024-05-19T00:18:47.505001 #3660991] INFO -- : CFLAGS = -O3 -fno-fast-math -ggdb3 -Wall -Wextra -Wdeprecated-declarations -Wdiv-by-zero -Wduplicated-cond -Wimplicit-function-declaration -Wimplicit-int -Wpointer-arith -Wwrite-strings -Wold-style-definition -Wimplicit-fallthrough=0 -Wmissing-noreturn -Wno-cast-function-type -Wno-constant-logical-operand -Wno-long-long -Wno-missing-field-initializers -Wno-overlength-strings -Wno-packed-bitfield-compat -Wno-parentheses-equality -Wno-self-assign -Wno-tautological-compare -Wno-unused-parameter -Wno-unused-value -Wsuggest-attribute=format -Wsuggest-attribute=noreturn -Wunused-variable -Wmisleading-indentation -Wundef -fPIC I, [2024-05-19T00:18:47.505012 #3660991] INFO -- : XCFLAGS = -U_FORTIFY_SOURCE -D_FORTIFY_SOURCE=2 -fstack-protector-strong -fno-strict-overflow -fvisibility=hidden -fexcess-precision=standard -DRUBY_EXPORT -I. -I.ext/include/x86_64-linux -I/tmp/ruby/src/trunk/include -I/tmp/ruby/src/trunk -I/tmp/ruby/src/trunk/prism -I/tmp/ruby/src/trunk/enc/unicode/15.0.0 I, [2024-05-19T00:18:47.505021 #3660991] INFO -- : CPPFLAGS = I, [2024-05-19T00:18:47.505029 #3660991] INFO -- : DLDFLAGS = -Wl,--compress-debug-sections=zlib -Wl,-soname,libruby.so.3.4 -fstack-protector-strong I, [2024-05-19T00:18:47.505039 #3660991] INFO -- : SOLIBS = -lz -lrt -lrt -lgmp -ldl -lcrypt -lm -lpthread I, [2024-05-19T00:18:47.505047 #3660991] INFO -- : LANG = en_US.UTF-8 I, [2024-05-19T00:18:47.505055 #3660991] INFO -- : LC_ALL = I, [2024-05-19T00:18:47.505063 #3660991] INFO -- : LC_CTYPE = I, [2024-05-19T00:18:47.505071 #3660991] INFO -- : MFLAGS = -j20 --jobserver-auth=4,5 I, [2024-05-19T00:18:47.505079 #3660991] INFO -- : RUSTC = no I, [2024-05-19T00:18:47.505088 #3660991] INFO -- : YJIT_RUSTC_ARGS = --crate-name=yjit --crate-type=staticlib --edition=2021 -g -C lto=thin -C opt-level=3 -C overflow-checks=on '--out-dir=/tmp/ruby/build/trunk/yjit/target/release/' /tmp/ruby/src/trunk/yjit/src/lib.rs I, [2024-05-19T00:18:47.506557 #3660991] INFO -- : /tmp/ruby/src/trunk/.bundle/.timestamp/power_assert.revision unchanged I, [2024-05-19T00:18:47.506658 #3660991] INFO -- : /tmp/ruby/src/trunk/.bundle/.timestamp/rbs.revision unchanged I, [2024-05-19T00:18:47.540287 #3660991] INFO -- : echo b19a6416da3a05d57fadd6ffdadb382b6d236ca5 | /bin/sh /tmp/ruby/src/trunk/tool/ifchange /tmp/ruby/src/trunk/.bundle/.timestamp/typeprof.revision - I, [2024-05-19T00:18:47.540979 #3660991] INFO -- : gcc (Ubuntu 11.4.0-1ubuntu1~22.04) 11.4.0 I, [2024-05-19T00:18:47.541000 #3660991] INFO -- : Copyright (C) 2021 Free Software Foundation, Inc. I, [2024-05-19T00:18:47.541005 #3660991] INFO -- : This is free software; see the source for copying conditions. There is NO I, [2024-05-19T00:18:47.541017 #3660991] INFO -- : warranty; not even for MERCHANTABILITY or FITNESS FOR A PARTICULAR PURPOSE. I, [2024-05-19T00:18:47.541021 #3660991] INFO -- : I, [2024-05-19T00:18:47.541026 #3660991] INFO -- : generating enc.mk I, [2024-05-19T00:18:47.542300 #3660991] INFO -- : /tmp/ruby/src/trunk/.bundle/.timestamp/typeprof.revision unchanged I, [2024-05-19T00:18:47.662637 #3660991] INFO -- : Building power_assert@84e85124c5014a139af39161d484156cfe87a9ed to /tmp/ruby/src/trunk/gems/power_assert-2.0.3.gem I, [2024-05-19T00:18:47.663442 #3660991] INFO -- : making srcs under enc I, [2024-05-19T00:18:47.663754 #3660991] INFO -- : making enc I, [2024-05-19T00:18:47.681005 #3660991] INFO -- : make[1]: Entering directory '/tmp/ruby/build/trunk' I, [2024-05-19T00:18:47.681045 #3660991] INFO -- : make[1]: Nothing to be done for 'enc'. I, [2024-05-19T00:18:47.681059 #3660991] INFO -- : make[1]: Leaving directory '/tmp/ruby/build/trunk' I, [2024-05-19T00:18:47.693231 #3660991] INFO -- : make[1]: Entering directory '/tmp/ruby/build/trunk' I, [2024-05-19T00:18:47.693271 #3660991] INFO -- : make[1]: Nothing to be done for 'srcs'. I, [2024-05-19T00:18:47.693285 #3660991] INFO -- : make[1]: Leaving directory '/tmp/ruby/build/trunk' I, [2024-05-19T00:18:47.693918 #3660991] INFO -- : generating transdb.h I, [2024-05-19T00:18:47.732114 #3660991] INFO -- : Successfully built RubyGem I, [2024-05-19T00:18:47.732175 #3660991] INFO -- : Name: power_assert I, [2024-05-19T00:18:47.732190 #3660991] INFO -- : Version: 2.0.4dev I, [2024-05-19T00:18:47.732203 #3660991] INFO -- : File: power_assert-2.0.4dev.gem I, [2024-05-19T00:18:47.734476 #3660991] INFO -- : Extracting bundle gem power_assert-2.0.3... I, [2024-05-19T00:18:47.790762 #3660991] INFO -- : transdb.h unchanged I, [2024-05-19T00:18:47.792338 #3660991] INFO -- : generating makefiles ext/configure-ext.mk I, [2024-05-19T00:18:47.792499 #3660991] INFO -- : making trans I, [2024-05-19T00:18:47.795568 #3660991] INFO -- : Try with hash version of bundled gems instead of gems/power_assert-2.0.3.gem. We don't use this gem with release version of Ruby. I, [2024-05-19T00:18:47.800619 #3660991] INFO -- : Unpacked gems/power_assert-2.0.4dev.gem I, [2024-05-19T00:18:47.819286 #3660991] INFO -- : ext/configure-ext.mk unchanged I, [2024-05-19T00:18:47.821756 #3660991] INFO -- : make[1]: Entering directory '/tmp/ruby/build/trunk' I, [2024-05-19T00:18:47.827129 #3660991] INFO -- : make[1]: Entering directory '/tmp/ruby/build/trunk' I, [2024-05-19T00:18:47.827229 #3660991] INFO -- : make[1]: Nothing to be done for 'trans'. I, [2024-05-19T00:18:47.827241 #3660991] INFO -- : make[1]: Leaving directory '/tmp/ruby/build/trunk' I, [2024-05-19T00:18:47.828267 #3660991] INFO -- : making encs I, [2024-05-19T00:18:47.885764 #3660991] INFO -- : make[1]: Entering directory '/tmp/ruby/build/trunk' I, [2024-05-19T00:18:47.885837 #3660991] INFO -- : make[1]: Nothing to be done for 'encs'. I, [2024-05-19T00:18:47.885864 #3660991] INFO -- : make[1]: Leaving directory '/tmp/ruby/build/trunk' I, [2024-05-19T00:18:47.969889 #3660991] INFO -- : make[1]: Leaving directory '/tmp/ruby/build/trunk' I, [2024-05-19T00:18:47.970569 #3660991] INFO -- : generating makefile exts.mk I, [2024-05-19T00:18:48.007009 #3660991] INFO -- : exts.mk unchanged I, [2024-05-19T00:18:48.011611 #3660991] INFO -- : make[1]: Entering directory '/tmp/ruby/build/trunk' I, [2024-05-19T00:18:48.034864 #3660991] INFO -- : make[2]: Entering directory '/tmp/ruby/build/trunk/ext/digest' I, [2024-05-19T00:18:48.036804 #3660991] INFO -- : make[2]: Entering directory '/tmp/ruby/build/trunk/ext/json' I, [2024-05-19T00:18:48.037109 #3660991] INFO -- : make[2]: Entering directory '/tmp/ruby/build/trunk/ext/coverage' I, [2024-05-19T00:18:48.037931 #3660991] INFO -- : make[2]: Entering directory '/tmp/ruby/build/trunk/ext/io/console' I, [2024-05-19T00:18:48.037958 #3660991] INFO -- : make[2]: Entering directory '/tmp/ruby/build/trunk/ext/date' I, [2024-05-19T00:18:48.038999 #3660991] INFO -- : make[2]: Entering directory '/tmp/ruby/build/trunk/ext/monitor' I, [2024-05-19T00:18:48.039236 #3660991] INFO -- : make[2]: Entering directory '/tmp/ruby/build/trunk/ext/pathname' I, [2024-05-19T00:18:48.039669 #3660991] INFO -- : make[2]: Entering directory '/tmp/ruby/build/trunk/ext/pty' I, [2024-05-19T00:18:48.039835 #3660991] INFO -- : make[2]: Entering directory '/tmp/ruby/build/trunk/ext/fiddle' I, [2024-05-19T00:18:48.039925 #3660991] INFO -- : make[2]: Entering directory '/tmp/ruby/build/trunk/ext/rubyvm' I, [2024-05-19T00:18:48.040192 #3660991] INFO -- : make[2]: Leaving directory '/tmp/ruby/build/trunk/ext/coverage' I, [2024-05-19T00:18:48.040633 #3660991] INFO -- : make[2]: Entering directory '/tmp/ruby/build/trunk/ext/objspace' I, [2024-05-19T00:18:48.040858 #3660991] INFO -- : make[2]: Leaving directory '/tmp/ruby/build/trunk/ext/io/console' I, [2024-05-19T00:18:48.040883 #3660991] INFO -- : make[2]: Leaving directory '/tmp/ruby/build/trunk/ext/digest' I, [2024-05-19T00:18:48.041535 #3660991] INFO -- : make[2]: Leaving directory '/tmp/ruby/build/trunk/ext/date' I, [2024-05-19T00:18:48.041658 #3660991] INFO -- : make[2]: Leaving directory '/tmp/ruby/build/trunk/ext/monitor' I, [2024-05-19T00:18:48.041736 #3660991] INFO -- : make[2]: Entering directory '/tmp/ruby/build/trunk/ext/psych' I, [2024-05-19T00:18:48.041873 #3660991] INFO -- : make[2]: Leaving directory '/tmp/ruby/build/trunk/ext/pathname' I, [2024-05-19T00:18:48.042037 #3660991] INFO -- : make[2]: Leaving directory '/tmp/ruby/build/trunk/ext/rubyvm' I, [2024-05-19T00:18:48.042389 #3660991] INFO -- : make[2]: Leaving directory '/tmp/ruby/build/trunk/ext/json' I, [2024-05-19T00:18:48.042593 #3660991] INFO -- : make[2]: Leaving directory '/tmp/ruby/build/trunk/ext/pty' I, [2024-05-19T00:18:48.043818 #3660991] INFO -- : make[2]: Entering directory '/tmp/ruby/build/trunk/.bundle/gems/bigdecimal-3.1.8/ext/bigdecimal' I, [2024-05-19T00:18:48.044039 #3660991] INFO -- : make[2]: Leaving directory '/tmp/ruby/build/trunk/ext/objspace' I, [2024-05-19T00:18:48.044065 #3660991] INFO -- : make[2]: Entering directory '/tmp/ruby/build/trunk/ext/ripper' I, [2024-05-19T00:18:48.044645 #3660991] INFO -- : make[2]: Entering directory '/tmp/ruby/build/trunk/.bundle/gems/debug-1.9.2/ext/debug' I, [2024-05-19T00:18:48.044671 #3660991] INFO -- : make[2]: Entering directory '/tmp/ruby/build/trunk/.bundle/gems/nkf-0.2.0/ext/nkf' I, [2024-05-19T00:18:48.044933 #3660991] INFO -- : make[2]: Entering directory '/tmp/ruby/build/trunk/.bundle/gems/racc-1.7.3/ext/racc/cparse' I, [2024-05-19T00:18:48.044963 #3660991] INFO -- : make[2]: Entering directory '/tmp/ruby/build/trunk/.bundle/gems/syslog-0.1.2/ext/syslog' I, [2024-05-19T00:18:48.045577 #3660991] INFO -- : make[2]: Entering directory '/tmp/ruby/build/trunk/.bundle/gems/rbs-3.4.4/ext/rbs_extension' I, [2024-05-19T00:18:48.045893 #3660991] INFO -- : make[2]: Leaving directory '/tmp/ruby/build/trunk/ext/fiddle' I, [2024-05-19T00:18:48.049206 #3660991] INFO -- : make[2]: Leaving directory '/tmp/ruby/build/trunk/ext/ripper' I, [2024-05-19T00:18:48.049699 #3660991] INFO -- : make[2]: Entering directory '/tmp/ruby/build/trunk/ext/digest/sha2' I, [2024-05-19T00:18:48.051484 #3660991] INFO -- : make[2]: Entering directory '/tmp/ruby/build/trunk/ext/socket' I, [2024-05-19T00:18:48.051509 #3660991] INFO -- : make[2]: Entering directory '/tmp/ruby/build/trunk/ext/openssl' I, [2024-05-19T00:18:48.052051 #3660991] INFO -- : make[2]: Leaving directory '/tmp/ruby/build/trunk/ext/digest/sha2' I, [2024-05-19T00:18:48.054441 #3660991] INFO -- : make[2]: Leaving directory '/tmp/ruby/build/trunk/ext/psych' I, [2024-05-19T00:18:48.059932 #3660991] INFO -- : make[2]: Leaving directory '/tmp/ruby/build/trunk/ext/socket' I, [2024-05-19T00:18:48.062632 #3660991] INFO -- : make[2]: Leaving directory '/tmp/ruby/build/trunk/ext/openssl' I, [2024-05-19T00:18:48.066275 #3660991] INFO -- : make[2]: Leaving directory '/tmp/ruby/build/trunk/.bundle/gems/bigdecimal-3.1.8/ext/bigdecimal' I, [2024-05-19T00:18:48.068138 #3660991] INFO -- : make[2]: Leaving directory '/tmp/ruby/build/trunk/.bundle/gems/debug-1.9.2/ext/debug' I, [2024-05-19T00:18:48.068327 #3660991] INFO -- : make[2]: Leaving directory '/tmp/ruby/build/trunk/.bundle/gems/syslog-0.1.2/ext/syslog' I, [2024-05-19T00:18:48.070180 #3660991] INFO -- : make[2]: Leaving directory '/tmp/ruby/build/trunk/.bundle/gems/racc-1.7.3/ext/racc/cparse' I, [2024-05-19T00:18:48.070329 #3660991] INFO -- : make[2]: Leaving directory '/tmp/ruby/build/trunk/.bundle/gems/rbs-3.4.4/ext/rbs_extension' I, [2024-05-19T00:18:48.076300 #3660991] INFO -- : make[2]: Leaving directory '/tmp/ruby/build/trunk/.bundle/gems/nkf-0.2.0/ext/nkf' I, [2024-05-19T00:18:48.100224 #3660991] INFO -- : make[2]: Entering directory '/tmp/ruby/build/trunk' I, [2024-05-19T00:18:48.170725 #3660991] INFO -- : make[2]: 'ruby' is up to date. I, [2024-05-19T00:18:48.170761 #3660991] INFO -- : make[2]: Leaving directory '/tmp/ruby/build/trunk' I, [2024-05-19T00:18:48.170970 #3660991] INFO -- : make[1]: Leaving directory '/tmp/ruby/build/trunk' I, [2024-05-19T00:18:48.174527 #3660991] INFO -- : make[1]: Entering directory '/tmp/ruby/build/trunk' I, [2024-05-19T00:18:48.174551 #3660991] INFO -- : make[1]: Nothing to be done for 'note'. I, [2024-05-19T00:18:48.174558 #3660991] INFO -- : make[1]: Leaving directory '/tmp/ruby/build/trunk' I, [2024-05-19T00:18:48.174902 #3660991] INFO -- : ./miniruby -I/tmp/ruby/src/trunk/lib -I. -I.ext/common /tmp/ruby/src/trunk/tool/runruby.rb --extout=.ext -- --disable-gems -r./x86_64-linux-fake /tmp/ruby/src/trunk/tool/rbinstall.rb --make="make" --dest-dir="" --extout=".ext" --ext-build-dir="./ext" --mflags="-j20 --jobserver-auth=4,5" --make-flags=" -j20 --jobserver-auth=4,5" --data-mode=0644 --prog-mode=0755 --installed-list .installed.list --mantype="doc" --gnumake --install=all --exclude=doc I, [2024-05-19T00:18:48.272343 #3660991] INFO -- : Installing to I, [2024-05-19T00:18:48.272390 #3660991] INFO -- : installing binary commands: /tmp/ruby/install/trunk/bin I, [2024-05-19T00:18:48.272479 #3660991] INFO -- : installing base libraries: /tmp/ruby/install/trunk/lib I, [2024-05-19T00:18:48.279714 #3660991] INFO -- : installing arch files: /tmp/ruby/install/trunk/lib/ruby/3.4.0+0/x86_64-linux I, [2024-05-19T00:18:48.279739 #3660991] INFO -- : installing pkgconfig data: /tmp/ruby/install/trunk/lib/pkgconfig I, [2024-05-19T00:18:48.279745 #3660991] INFO -- : installing extension objects: /tmp/ruby/install/trunk/lib/ruby/3.4.0+0/x86_64-linux I, [2024-05-19T00:18:48.289112 #3660991] INFO -- : installing extension objects: /tmp/ruby/install/trunk/lib/ruby/site_ruby/3.4.0+0/x86_64-linux I, [2024-05-19T00:18:48.289135 #3660991] INFO -- : installing extension objects: /tmp/ruby/install/trunk/lib/ruby/vendor_ruby/3.4.0+0/x86_64-linux I, [2024-05-19T00:18:48.289142 #3660991] INFO -- : installing extension headers: /tmp/ruby/install/trunk/include/ruby-3.4.0+0/x86_64-linux I, [2024-05-19T00:18:48.289297 #3660991] INFO -- : installing extension scripts: /tmp/ruby/install/trunk/lib/ruby/3.4.0+0 I, [2024-05-19T00:18:48.292011 #3660991] INFO -- : installing extension scripts: /tmp/ruby/install/trunk/lib/ruby/site_ruby/3.4.0+0 I, [2024-05-19T00:18:48.292032 #3660991] INFO -- : installing extension scripts: /tmp/ruby/install/trunk/lib/ruby/vendor_ruby/3.4.0+0 I, [2024-05-19T00:18:48.292047 #3660991] INFO -- : installing extension headers: /tmp/ruby/install/trunk/include/ruby-3.4.0+0/ruby I, [2024-05-19T00:18:48.292051 #3660991] INFO -- : installing command scripts: /tmp/ruby/install/trunk/bin I, [2024-05-19T00:18:48.292056 #3660991] INFO -- : installing library scripts: /tmp/ruby/install/trunk/lib/ruby/3.4.0+0 I, [2024-05-19T00:18:48.324748 #3660991] INFO -- : installing common headers: /tmp/ruby/install/trunk/include/ruby-3.4.0+0 I, [2024-05-19T00:18:48.331365 #3660991] INFO -- : installing manpages: /tmp/ruby/install/trunk/share/man/man1 I, [2024-05-19T00:18:48.331398 #3660991] INFO -- : installing default gems from lib: /tmp/ruby/install/trunk/lib/ruby/gems/3.4.0+0 I, [2024-05-19T00:18:48.353970 #3660991] INFO -- : benchmark 0.3.0 I, [2024-05-19T00:18:48.355887 #3660991] INFO -- : bundler 2.6.0.dev I, [2024-05-19T00:18:48.357992 #3660991] INFO -- : cgi 0.4.1 I, [2024-05-19T00:18:48.358550 #3660991] INFO -- : delegate 0.3.1 I, [2024-05-19T00:18:48.359023 #3660991] INFO -- : did_you_mean 1.6.3 I, [2024-05-19T00:18:48.359498 #3660991] INFO -- : english 0.8.0 I, [2024-05-19T00:18:48.360003 #3660991] INFO -- : erb 4.0.4 I, [2024-05-19T00:18:48.361010 #3660991] INFO -- : error_highlight 0.6.0 I, [2024-05-19T00:18:48.361791 #3660991] INFO -- : fileutils 1.7.2 I, [2024-05-19T00:18:48.362549 #3660991] INFO -- : find 0.2.0 I, [2024-05-19T00:18:48.363387 #3660991] INFO -- : forwardable 1.3.3 I, [2024-05-19T00:18:48.364251 #3660991] INFO -- : ipaddr 1.2.6 I, [2024-05-19T00:18:48.365144 #3660991] INFO -- : irb 1.13.1 I, [2024-05-19T00:18:48.365927 #3660991] INFO -- : logger 1.6.0 I, [2024-05-19T00:18:48.366416 #3660991] INFO -- : net-http 0.4.1 I, [2024-05-19T00:18:48.366911 #3660991] INFO -- : net-protocol 0.2.2 I, [2024-05-19T00:18:48.367392 #3660991] INFO -- : open-uri 0.4.1 I, [2024-05-19T00:18:48.367933 #3660991] INFO -- : open3 0.2.1 I, [2024-05-19T00:18:48.368404 #3660991] INFO -- : optparse 0.5.0 I, [2024-05-19T00:18:48.368887 #3660991] INFO -- : ostruct 0.6.0 I, [2024-05-19T00:18:48.369263 #3660991] INFO -- : pp 0.5.0 I, [2024-05-19T00:18:48.369755 #3660991] INFO -- : prettyprint 0.2.0 I, [2024-05-19T00:18:48.370207 #3660991] INFO -- : prism 0.29.0 I, [2024-05-19T00:18:48.370804 #3660991] INFO -- : pstore 0.1.3 I, [2024-05-19T00:18:48.371273 #3660991] INFO -- : rdoc 6.6.3.1 I, [2024-05-19T00:18:48.372250 #3660991] INFO -- : readline 0.0.4 I, [2024-05-19T00:18:48.372754 #3660991] INFO -- : reline 0.5.7 I, [2024-05-19T00:18:48.373289 #3660991] INFO -- : resolv 0.4.0 I, [2024-05-19T00:18:48.373755 #3660991] INFO -- : ruby2_keywords 0.0.5 I, [2024-05-19T00:18:48.374268 #3660991] INFO -- : securerandom 0.3.1 I, [2024-05-19T00:18:48.375130 #3660991] INFO -- : set 1.1.0 I, [2024-05-19T00:18:48.376004 #3660991] INFO -- : shellwords 0.2.0 I, [2024-05-19T00:18:48.376555 #3660991] INFO -- : singleton 0.2.0 I, [2024-05-19T00:18:48.377003 #3660991] INFO -- : syntax_suggest 2.0.0 I, [2024-05-19T00:18:48.377707 #3660991] INFO -- : tempfile 0.2.1 I, [2024-05-19T00:18:48.378179 #3660991] INFO -- : time 0.3.0 I, [2024-05-19T00:18:48.378669 #3660991] INFO -- : timeout 0.4.1 I, [2024-05-19T00:18:48.379134 #3660991] INFO -- : tmpdir 0.2.0 I, [2024-05-19T00:18:48.379618 #3660991] INFO -- : tsort 0.2.0 I, [2024-05-19T00:18:48.380087 #3660991] INFO -- : un 0.3.0 I, [2024-05-19T00:18:48.380543 #3660991] INFO -- : uri 0.13.0 I, [2024-05-19T00:18:48.381056 #3660991] INFO -- : weakref 0.1.3 I, [2024-05-19T00:18:48.381461 #3660991] INFO -- : yaml 0.3.0 I, [2024-05-19T00:18:48.381899 #3660991] INFO -- : installing default gems from ext: /tmp/ruby/install/trunk/lib/ruby/gems/3.4.0+0 I, [2024-05-19T00:18:48.388443 #3660991] INFO -- : date 3.3.4 I, [2024-05-19T00:18:48.388983 #3660991] INFO -- : digest 3.1.1 I, [2024-05-19T00:18:48.389460 #3660991] INFO -- : etc 1.4.3 I, [2024-05-19T00:18:48.389898 #3660991] INFO -- : fcntl 1.1.0 I, [2024-05-19T00:18:48.390448 #3660991] INFO -- : fiddle 1.1.3 I, [2024-05-19T00:18:48.390923 #3660991] INFO -- : io-console 0.7.2 I, [2024-05-19T00:18:48.391391 #3660991] INFO -- : io-nonblock 0.3.0 I, [2024-05-19T00:18:48.391885 #3660991] INFO -- : io-wait 0.3.1 I, [2024-05-19T00:18:48.392440 #3660991] INFO -- : json 2.7.2 I, [2024-05-19T00:18:48.392995 #3660991] INFO -- : openssl 3.2.0 I, [2024-05-19T00:18:48.393495 #3660991] INFO -- : pathname 0.3.0 I, [2024-05-19T00:18:48.393962 #3660991] INFO -- : psych 5.1.2 I, [2024-05-19T00:18:48.394525 #3660991] INFO -- : stringio 3.1.1 I, [2024-05-19T00:18:48.395011 #3660991] INFO -- : strscan 3.1.1 I, [2024-05-19T00:18:48.395457 #3660991] INFO -- : zlib 3.1.0 I, [2024-05-19T00:18:48.395746 #3660991] INFO -- : installing bundled gems: /tmp/ruby/install/trunk/lib/ruby/gems/3.4.0+0 I, [2024-05-19T00:18:48.396393 #3660991] INFO -- : minitest 5.23.0 I, [2024-05-19T00:18:48.404809 #3660991] INFO -- : rake 13.2.1 I, [2024-05-19T00:18:48.408306 #3660991] INFO -- : test-unit 3.6.2 I, [2024-05-19T00:18:48.413034 #3660991] INFO -- : rexml 3.2.6 I, [2024-05-19T00:18:48.416902 #3660991] INFO -- : rss 0.3.0 I, [2024-05-19T00:18:48.419502 #3660991] INFO -- : net-ftp 0.3.4 I, [2024-05-19T00:18:48.421105 #3660991] INFO -- : net-imap 0.4.11 I, [2024-05-19T00:18:48.424919 #3660991] INFO -- : net-pop 0.1.2 I, [2024-05-19T00:18:48.425918 #3660991] INFO -- : net-smtp 0.5.0 I, [2024-05-19T00:18:48.427080 #3660991] INFO -- : matrix 0.4.2 I, [2024-05-19T00:18:48.430335 #3660991] INFO -- : prime 0.1.2 I, [2024-05-19T00:18:48.435206 #3660991] INFO -- : rbs 3.4.4 I, [2024-05-19T00:18:48.457620 #3660991] INFO -- : typeprof 0.21.11 I, [2024-05-19T00:18:48.459931 #3660991] INFO -- : debug 1.9.2 I, [2024-05-19T00:18:48.463007 #3660991] INFO -- : racc 1.7.3 I, [2024-05-19T00:18:48.465961 #3660991] INFO -- : mutex_m 0.2.0 I, [2024-05-19T00:18:48.467279 #3660991] INFO -- : getoptlong 0.2.1 I, [2024-05-19T00:18:48.468679 #3660991] INFO -- : base64 0.2.0 I, [2024-05-19T00:18:48.469771 #3660991] INFO -- : bigdecimal 3.1.8 I, [2024-05-19T00:18:48.471956 #3660991] INFO -- : observer 0.1.2 I, [2024-05-19T00:18:48.473625 #3660991] INFO -- : abbrev 0.1.2 I, [2024-05-19T00:18:48.474742 #3660991] INFO -- : resolv-replace 0.1.1 I, [2024-05-19T00:18:48.476207 #3660991] INFO -- : rinda 0.2.0 I, [2024-05-19T00:18:48.477508 #3660991] INFO -- : drb 2.2.1 I, [2024-05-19T00:18:48.479123 #3660991] INFO -- : nkf 0.2.0 I, [2024-05-19T00:18:48.481704 #3660991] INFO -- : syslog 0.1.2 I, [2024-05-19T00:18:48.483387 #3660991] INFO -- : csv 3.3.0 I, [2024-05-19T00:18:48.486139 #3660991] INFO -- : installing bundled gem cache: /tmp/ruby/install/trunk/lib/ruby/gems/3.4.0+0/cache I, [2024-05-19T00:18:48.487558 #3660991] INFO -- : skipped bundled gems: I, [2024-05-19T00:18:48.487578 #3660991] INFO -- : power_assert-2.0.4dev.gem not found in bundled_gems I, [2024-05-19T00:18:48.490806 #3660991] INFO -- : $$$[end] "make install -j20" exit with 0. I, [2024-05-19T00:18:48.490905 #3660991] INFO -- : $$$[beg] make yes-btest TESTOPTS='-q -j20' I, [2024-05-19T00:18:54.239636 #3660991] INFO -- : PASS all 1936 tests E, [2024-05-19T00:18:54.249854 #3660991] ERROR -- : I, [2024-05-19T00:18:54.250142 #3660991] INFO -- : $$$[end] "make yes-btest TESTOPTS='-q -j20'" exit with 0. I, [2024-05-19T00:18:54.250226 #3660991] INFO -- : $$$[beg] make yes-test-basic TESTS='-j20' I, [2024-05-19T00:18:54.317304 #3660991] INFO -- : BASERUBY = /usr/bin/ruby --disable=gems I, [2024-05-19T00:18:54.317338 #3660991] INFO -- : CC = gcc I, [2024-05-19T00:18:54.317347 #3660991] INFO -- : LD = ld I, [2024-05-19T00:18:54.317351 #3660991] INFO -- : LDSHARED = gcc -shared I, [2024-05-19T00:18:54.317356 #3660991] INFO -- : CFLAGS = -O3 -fno-fast-math -ggdb3 -Wall -Wextra -Wdeprecated-declarations -Wdiv-by-zero -Wduplicated-cond -Wimplicit-function-declaration -Wimplicit-int -Wpointer-arith -Wwrite-strings -Wold-style-definition -Wimplicit-fallthrough=0 -Wmissing-noreturn -Wno-cast-function-type -Wno-constant-logical-operand -Wno-long-long -Wno-missing-field-initializers -Wno-overlength-strings -Wno-packed-bitfield-compat -Wno-parentheses-equality -Wno-self-assign -Wno-tautological-compare -Wno-unused-parameter -Wno-unused-value -Wsuggest-attribute=format -Wsuggest-attribute=noreturn -Wunused-variable -Wmisleading-indentation -Wundef -fPIC I, [2024-05-19T00:18:54.317361 #3660991] INFO -- : XCFLAGS = -U_FORTIFY_SOURCE -D_FORTIFY_SOURCE=2 -fstack-protector-strong -fno-strict-overflow -fvisibility=hidden -fexcess-precision=standard -DRUBY_EXPORT -I. -I.ext/include/x86_64-linux -I/tmp/ruby/src/trunk/include -I/tmp/ruby/src/trunk -I/tmp/ruby/src/trunk/prism -I/tmp/ruby/src/trunk/enc/unicode/15.0.0 I, [2024-05-19T00:18:54.317366 #3660991] INFO -- : CPPFLAGS = I, [2024-05-19T00:18:54.317370 #3660991] INFO -- : DLDFLAGS = -Wl,--compress-debug-sections=zlib -Wl,-soname,libruby.so.3.4 -fstack-protector-strong I, [2024-05-19T00:18:54.317375 #3660991] INFO -- : SOLIBS = -lz -lrt -lrt -lgmp -ldl -lcrypt -lm -lpthread I, [2024-05-19T00:18:54.317379 #3660991] INFO -- : LANG = en_US.UTF-8 I, [2024-05-19T00:18:54.317383 #3660991] INFO -- : LC_ALL = I, [2024-05-19T00:18:54.317387 #3660991] INFO -- : LC_CTYPE = I, [2024-05-19T00:18:54.317392 #3660991] INFO -- : MFLAGS = I, [2024-05-19T00:18:54.317395 #3660991] INFO -- : RUSTC = no I, [2024-05-19T00:18:54.317400 #3660991] INFO -- : YJIT_RUSTC_ARGS = --crate-name=yjit --crate-type=staticlib --edition=2021 -g -C lto=thin -C opt-level=3 -C overflow-checks=on '--out-dir=/tmp/ruby/build/trunk/yjit/target/release/' /tmp/ruby/src/trunk/yjit/src/lib.rs I, [2024-05-19T00:18:54.318180 #3660991] INFO -- : gcc (Ubuntu 11.4.0-1ubuntu1~22.04) 11.4.0 I, [2024-05-19T00:18:54.318216 #3660991] INFO -- : Copyright (C) 2021 Free Software Foundation, Inc. I, [2024-05-19T00:18:54.318224 #3660991] INFO -- : This is free software; see the source for copying conditions. There is NO I, [2024-05-19T00:18:54.318235 #3660991] INFO -- : warranty; not even for MERCHANTABILITY or FITNESS FOR A PARTICULAR PURPOSE. I, [2024-05-19T00:18:54.318241 #3660991] INFO -- : I, [2024-05-19T00:18:54.428996 #3660991] INFO -- : Checking leaked global symbols...none I, [2024-05-19T00:18:54.469254 #3660991] INFO -- : /tmp/ruby/src/trunk/basictest/test.rb:assignment ....................................................................................................................................................................................................................................................................................................................................................................................OK 372 I, [2024-05-19T00:18:54.469308 #3660991] INFO -- : /tmp/ruby/src/trunk/basictest/test.rb:condition ..OK 2 I, [2024-05-19T00:18:54.469314 #3660991] INFO -- : /tmp/ruby/src/trunk/basictest/test.rb:if/unless ...OK 3 I, [2024-05-19T00:18:54.469319 #3660991] INFO -- : /tmp/ruby/src/trunk/basictest/test.rb:case .....OK 5 I, [2024-05-19T00:18:54.469534 #3660991] INFO -- : /tmp/ruby/src/trunk/basictest/test.rb:while/until ........OK 8 I, [2024-05-19T00:18:54.469587 #3660991] INFO -- : /tmp/ruby/src/trunk/basictest/test.rb:exception ..........OK 10 I, [2024-05-19T00:18:54.469855 #3660991] INFO -- : /tmp/ruby/src/trunk/basictest/test.rb:array .......................................OK 39 I, [2024-05-19T00:18:54.469956 #3660991] INFO -- : /tmp/ruby/src/trunk/basictest/test.rb:hash ...........................OK 27 I, [2024-05-19T00:18:54.470670 #3660991] INFO -- : /tmp/ruby/src/trunk/basictest/test.rb:iterator ...........................................................................................................OK 107 I, [2024-05-19T00:18:54.470942 #3660991] INFO -- : /tmp/ruby/src/trunk/basictest/test.rb:float ................................................................................OK 80 I, [2024-05-19T00:18:54.471935 #3660991] INFO -- : /tmp/ruby/src/trunk/basictest/test.rb:bignum ...............................OK 31 I, [2024-05-19T00:18:54.472708 #3660991] INFO -- : /tmp/ruby/src/trunk/basictest/test.rb:string & char ..............................................................OK 62 I, [2024-05-19T00:18:54.472740 #3660991] INFO -- : /tmp/ruby/src/trunk/basictest/test.rb:assignment ..........OK 10 I, [2024-05-19T00:18:54.472768 #3660991] INFO -- : /tmp/ruby/src/trunk/basictest/test.rb:call ......OK 6 I, [2024-05-19T00:18:54.472821 #3660991] INFO -- : /tmp/ruby/src/trunk/basictest/test.rb:proc .........OK 9 I, [2024-05-19T00:18:54.573422 #3660991] INFO -- : /tmp/ruby/src/trunk/basictest/test.rb:signal ..OK 2 I, [2024-05-19T00:18:54.576096 #3660991] INFO -- : /tmp/ruby/src/trunk/basictest/test.rb:eval ...........................OK 27 I, [2024-05-19T00:18:54.712742 #3660991] INFO -- : /tmp/ruby/src/trunk/basictest/test.rb:system ........OK 8 I, [2024-05-19T00:18:54.712824 #3660991] INFO -- : /tmp/ruby/src/trunk/basictest/test.rb:const .....OK 5 I, [2024-05-19T00:18:54.712972 #3660991] INFO -- : /tmp/ruby/src/trunk/basictest/test.rb:clone .....OK 5 I, [2024-05-19T00:18:54.713137 #3660991] INFO -- : /tmp/ruby/src/trunk/basictest/test.rb:marshal ....OK 4 I, [2024-05-19T00:18:54.713175 #3660991] INFO -- : /tmp/ruby/src/trunk/basictest/test.rb:pack ....OK 4 I, [2024-05-19T00:18:54.713186 #3660991] INFO -- : /tmp/ruby/src/trunk/basictest/test.rb:math ..OK 2 I, [2024-05-19T00:18:54.713256 #3660991] INFO -- : /tmp/ruby/src/trunk/basictest/test.rb:struct ......OK 6 I, [2024-05-19T00:18:54.713388 #3660991] INFO -- : /tmp/ruby/src/trunk/basictest/test.rb:variable ............OK 12 I, [2024-05-19T00:18:54.713424 #3660991] INFO -- : /tmp/ruby/src/trunk/basictest/test.rb:trace ...OK 3 I, [2024-05-19T00:18:54.713517 #3660991] INFO -- : /tmp/ruby/src/trunk/basictest/test.rb:defined? ............OK 12 I, [2024-05-19T00:18:54.713579 #3660991] INFO -- : /tmp/ruby/src/trunk/basictest/test.rb:alias ......OK 6 I, [2024-05-19T00:18:54.714081 #3660991] INFO -- : /tmp/ruby/src/trunk/basictest/test.rb:path .......................OK 23 I, [2024-05-19T00:18:54.749480 #3660991] INFO -- : /tmp/ruby/src/trunk/basictest/test.rb:gc ....OK 4 I, [2024-05-19T00:18:54.751832 #3660991] INFO -- : I, [2024-05-19T00:18:54.751854 #3660991] INFO -- : test succeeded I, [2024-05-19T00:18:54.753199 #3660991] INFO -- : $$$[end] "make yes-test-basic TESTS='-j20'" exit with 0. I, [2024-05-19T00:18:54.753283 #3660991] INFO -- : $$$[beg] make yes-test-all TESTOPTS='--stderr-on-failure' TESTS='-j20' I, [2024-05-19T00:18:54.843357 #3660991] INFO -- : BASERUBY = /usr/bin/ruby --disable=gems I, [2024-05-19T00:18:54.843397 #3660991] INFO -- : CC = gcc I, [2024-05-19T00:18:54.843403 #3660991] INFO -- : LD = ld I, [2024-05-19T00:18:54.843408 #3660991] INFO -- : LDSHARED = gcc -shared I, [2024-05-19T00:18:54.843413 #3660991] INFO -- : CFLAGS = -O3 -fno-fast-math -ggdb3 -Wall -Wextra -Wdeprecated-declarations -Wdiv-by-zero -Wduplicated-cond -Wimplicit-function-declaration -Wimplicit-int -Wpointer-arith -Wwrite-strings -Wold-style-definition -Wimplicit-fallthrough=0 -Wmissing-noreturn -Wno-cast-function-type -Wno-constant-logical-operand -Wno-long-long -Wno-missing-field-initializers -Wno-overlength-strings -Wno-packed-bitfield-compat -Wno-parentheses-equality -Wno-self-assign -Wno-tautological-compare -Wno-unused-parameter -Wno-unused-value -Wsuggest-attribute=format -Wsuggest-attribute=noreturn -Wunused-variable -Wmisleading-indentation -Wundef -fPIC I, [2024-05-19T00:18:54.843418 #3660991] INFO -- : XCFLAGS = -U_FORTIFY_SOURCE -D_FORTIFY_SOURCE=2 -fstack-protector-strong -fno-strict-overflow -fvisibility=hidden -fexcess-precision=standard -DRUBY_EXPORT -I. -I.ext/include/x86_64-linux -I/tmp/ruby/src/trunk/include -I/tmp/ruby/src/trunk -I/tmp/ruby/src/trunk/prism -I/tmp/ruby/src/trunk/enc/unicode/15.0.0 I, [2024-05-19T00:18:54.843422 #3660991] INFO -- : CPPFLAGS = I, [2024-05-19T00:18:54.843426 #3660991] INFO -- : DLDFLAGS = -Wl,--compress-debug-sections=zlib -Wl,-soname,libruby.so.3.4 -fstack-protector-strong I, [2024-05-19T00:18:54.843431 #3660991] INFO -- : SOLIBS = -lz -lrt -lrt -lgmp -ldl -lcrypt -lm -lpthread I, [2024-05-19T00:18:54.843435 #3660991] INFO -- : LANG = en_US.UTF-8 I, [2024-05-19T00:18:54.843439 #3660991] INFO -- : LC_ALL = I, [2024-05-19T00:18:54.843442 #3660991] INFO -- : LC_CTYPE = I, [2024-05-19T00:18:54.843446 #3660991] INFO -- : MFLAGS = I, [2024-05-19T00:18:54.843450 #3660991] INFO -- : RUSTC = no I, [2024-05-19T00:18:54.843454 #3660991] INFO -- : YJIT_RUSTC_ARGS = --crate-name=yjit --crate-type=staticlib --edition=2021 -g -C lto=thin -C opt-level=3 -C overflow-checks=on '--out-dir=/tmp/ruby/build/trunk/yjit/target/release/' /tmp/ruby/src/trunk/yjit/src/lib.rs I, [2024-05-19T00:18:54.843973 #3660991] INFO -- : gcc (Ubuntu 11.4.0-1ubuntu1~22.04) 11.4.0 I, [2024-05-19T00:18:54.843997 #3660991] INFO -- : Copyright (C) 2021 Free Software Foundation, Inc. I, [2024-05-19T00:18:54.844004 #3660991] INFO -- : This is free software; see the source for copying conditions. There is NO I, [2024-05-19T00:18:54.844009 #3660991] INFO -- : warranty; not even for MERCHANTABILITY or FITNESS FOR A PARTICULAR PURPOSE. I, [2024-05-19T00:18:54.844014 #3660991] INFO -- : I, [2024-05-19T00:18:54.845969 #3660991] INFO -- : generating enc.mk I, [2024-05-19T00:18:54.963563 #3660991] INFO -- : making enc I, [2024-05-19T00:18:54.980861 #3660991] INFO -- : make[1]: Entering directory '/tmp/ruby/build/trunk' I, [2024-05-19T00:18:54.980889 #3660991] INFO -- : make[1]: Nothing to be done for 'enc'. I, [2024-05-19T00:18:54.980895 #3660991] INFO -- : make[1]: Leaving directory '/tmp/ruby/build/trunk' I, [2024-05-19T00:18:54.981727 #3660991] INFO -- : making srcs under enc I, [2024-05-19T00:18:55.012422 #3660991] INFO -- : make[1]: Entering directory '/tmp/ruby/build/trunk' I, [2024-05-19T00:18:55.012452 #3660991] INFO -- : make[1]: Nothing to be done for 'srcs'. I, [2024-05-19T00:18:55.012458 #3660991] INFO -- : make[1]: Leaving directory '/tmp/ruby/build/trunk' I, [2024-05-19T00:18:55.013402 #3660991] INFO -- : generating transdb.h I, [2024-05-19T00:18:55.109267 #3660991] INFO -- : transdb.h unchanged I, [2024-05-19T00:18:55.110558 #3660991] INFO -- : making trans I, [2024-05-19T00:18:55.144343 #3660991] INFO -- : make[1]: Entering directory '/tmp/ruby/build/trunk' I, [2024-05-19T00:18:55.144364 #3660991] INFO -- : make[1]: Nothing to be done for 'trans'. I, [2024-05-19T00:18:55.144370 #3660991] INFO -- : make[1]: Leaving directory '/tmp/ruby/build/trunk' I, [2024-05-19T00:18:55.145121 #3660991] INFO -- : making encs I, [2024-05-19T00:18:55.181663 #3660991] INFO -- : make[1]: Entering directory '/tmp/ruby/build/trunk' I, [2024-05-19T00:18:55.181683 #3660991] INFO -- : make[1]: Nothing to be done for 'encs'. I, [2024-05-19T00:18:55.181689 #3660991] INFO -- : make[1]: Leaving directory '/tmp/ruby/build/trunk' I, [2024-05-19T00:18:55.183578 #3660991] INFO -- : generating makefiles ext/configure-ext.mk I, [2024-05-19T00:18:55.210328 #3660991] INFO -- : ext/configure-ext.mk updated I, [2024-05-19T00:18:55.212749 #3660991] INFO -- : make[1]: Entering directory '/tmp/ruby/build/trunk' I, [2024-05-19T00:18:56.557250 #3660991] INFO -- : make[1]: Leaving directory '/tmp/ruby/build/trunk' I, [2024-05-19T00:18:56.557948 #3660991] INFO -- : generating makefile exts.mk I, [2024-05-19T00:18:56.594538 #3660991] INFO -- : exts.mk unchanged I, [2024-05-19T00:18:56.599133 #3660991] INFO -- : make[1]: Entering directory '/tmp/ruby/build/trunk' I, [2024-05-19T00:18:56.913443 #3660991] INFO -- : make[2]: Entering directory '/tmp/ruby/build/trunk/ext/coverage' I, [2024-05-19T00:18:56.918164 #3660991] INFO -- : make[2]: Leaving directory '/tmp/ruby/build/trunk/ext/coverage' I, [2024-05-19T00:18:56.924546 #3660991] INFO -- : make[2]: Entering directory '/tmp/ruby/build/trunk/ext/date' I, [2024-05-19T00:18:56.929890 #3660991] INFO -- : make[2]: Leaving directory '/tmp/ruby/build/trunk/ext/date' I, [2024-05-19T00:18:56.933770 #3660991] INFO -- : make[2]: Entering directory '/tmp/ruby/build/trunk/ext/digest' I, [2024-05-19T00:18:56.942581 #3660991] INFO -- : make[2]: Leaving directory '/tmp/ruby/build/trunk/ext/digest' I, [2024-05-19T00:18:56.968490 #3660991] INFO -- : make[2]: Entering directory '/tmp/ruby/build/trunk/ext/digest/sha2' I, [2024-05-19T00:18:56.972378 #3660991] INFO -- : make[2]: Leaving directory '/tmp/ruby/build/trunk/ext/digest/sha2' I, [2024-05-19T00:18:56.991428 #3660991] INFO -- : make[2]: Entering directory '/tmp/ruby/build/trunk/ext/fiddle' I, [2024-05-19T00:18:56.999438 #3660991] INFO -- : make[2]: Leaving directory '/tmp/ruby/build/trunk/ext/fiddle' I, [2024-05-19T00:18:57.003714 #3660991] INFO -- : make[2]: Entering directory '/tmp/ruby/build/trunk/ext/io/console' I, [2024-05-19T00:18:57.007927 #3660991] INFO -- : make[2]: Leaving directory '/tmp/ruby/build/trunk/ext/io/console' I, [2024-05-19T00:18:57.020513 #3660991] INFO -- : make[2]: Entering directory '/tmp/ruby/build/trunk/ext/json' I, [2024-05-19T00:18:57.031047 #3660991] INFO -- : make[2]: Leaving directory '/tmp/ruby/build/trunk/ext/json' I, [2024-05-19T00:18:57.046603 #3660991] INFO -- : make[2]: Entering directory '/tmp/ruby/build/trunk/ext/monitor' I, [2024-05-19T00:18:57.050606 #3660991] INFO -- : make[2]: Leaving directory '/tmp/ruby/build/trunk/ext/monitor' I, [2024-05-19T00:18:57.057831 #3660991] INFO -- : make[2]: Entering directory '/tmp/ruby/build/trunk/ext/objspace' I, [2024-05-19T00:18:57.063984 #3660991] INFO -- : make[2]: Leaving directory '/tmp/ruby/build/trunk/ext/objspace' I, [2024-05-19T00:18:57.081696 #3660991] INFO -- : make[2]: Entering directory '/tmp/ruby/build/trunk/ext/openssl' I, [2024-05-19T00:18:57.097906 #3660991] INFO -- : make[2]: Leaving directory '/tmp/ruby/build/trunk/ext/openssl' I, [2024-05-19T00:18:57.101937 #3660991] INFO -- : make[2]: Entering directory '/tmp/ruby/build/trunk/ext/pathname' I, [2024-05-19T00:18:57.105992 #3660991] INFO -- : make[2]: Leaving directory '/tmp/ruby/build/trunk/ext/pathname' I, [2024-05-19T00:18:57.112969 #3660991] INFO -- : make[2]: Entering directory '/tmp/ruby/build/trunk/ext/psych' I, [2024-05-19T00:18:57.136274 #3660991] INFO -- : make[2]: Leaving directory '/tmp/ruby/build/trunk/ext/psych' I, [2024-05-19T00:18:57.140354 #3660991] INFO -- : make[2]: Entering directory '/tmp/ruby/build/trunk/ext/pty' I, [2024-05-19T00:18:57.144474 #3660991] INFO -- : make[2]: Leaving directory '/tmp/ruby/build/trunk/ext/pty' I, [2024-05-19T00:18:57.160664 #3660991] INFO -- : make[2]: Entering directory '/tmp/ruby/build/trunk/ext/ripper' I, [2024-05-19T00:18:57.168922 #3660991] INFO -- : make[2]: Leaving directory '/tmp/ruby/build/trunk/ext/ripper' I, [2024-05-19T00:18:57.171443 #3660991] INFO -- : make[2]: Entering directory '/tmp/ruby/build/trunk/ext/rubyvm' I, [2024-05-19T00:18:57.174697 #3660991] INFO -- : make[2]: Leaving directory '/tmp/ruby/build/trunk/ext/rubyvm' I, [2024-05-19T00:18:57.188482 #3660991] INFO -- : make[2]: Entering directory '/tmp/ruby/build/trunk/ext/socket' I, [2024-05-19T00:18:57.199424 #3660991] INFO -- : make[2]: Leaving directory '/tmp/ruby/build/trunk/ext/socket' I, [2024-05-19T00:18:57.218098 #3660991] INFO -- : make[2]: Entering directory '/tmp/ruby/build/trunk/.bundle/gems/bigdecimal-3.1.8/ext/bigdecimal' I, [2024-05-19T00:18:57.244652 #3660991] INFO -- : make[2]: Leaving directory '/tmp/ruby/build/trunk/.bundle/gems/bigdecimal-3.1.8/ext/bigdecimal' I, [2024-05-19T00:18:57.246646 #3660991] INFO -- : make[2]: Entering directory '/tmp/ruby/build/trunk/.bundle/gems/debug-1.9.2/ext/debug' I, [2024-05-19T00:18:57.268444 #3660991] INFO -- : make[2]: Leaving directory '/tmp/ruby/build/trunk/.bundle/gems/debug-1.9.2/ext/debug' I, [2024-05-19T00:18:57.270866 #3660991] INFO -- : make[2]: Entering directory '/tmp/ruby/build/trunk/.bundle/gems/nkf-0.2.0/ext/nkf' I, [2024-05-19T00:18:57.293027 #3660991] INFO -- : make[2]: Leaving directory '/tmp/ruby/build/trunk/.bundle/gems/nkf-0.2.0/ext/nkf' I, [2024-05-19T00:18:57.295340 #3660991] INFO -- : make[2]: Entering directory '/tmp/ruby/build/trunk/.bundle/gems/racc-1.7.3/ext/racc/cparse' I, [2024-05-19T00:18:57.318049 #3660991] INFO -- : make[2]: Leaving directory '/tmp/ruby/build/trunk/.bundle/gems/racc-1.7.3/ext/racc/cparse' I, [2024-05-19T00:18:57.320379 #3660991] INFO -- : make[2]: Entering directory '/tmp/ruby/build/trunk/.bundle/gems/rbs-3.4.4/ext/rbs_extension' I, [2024-05-19T00:18:57.342291 #3660991] INFO -- : make[2]: Leaving directory '/tmp/ruby/build/trunk/.bundle/gems/rbs-3.4.4/ext/rbs_extension' I, [2024-05-19T00:18:57.344261 #3660991] INFO -- : make[2]: Entering directory '/tmp/ruby/build/trunk/.bundle/gems/syslog-0.1.2/ext/syslog' I, [2024-05-19T00:18:57.367324 #3660991] INFO -- : make[2]: Leaving directory '/tmp/ruby/build/trunk/.bundle/gems/syslog-0.1.2/ext/syslog' I, [2024-05-19T00:18:57.391533 #3660991] INFO -- : make[2]: Entering directory '/tmp/ruby/build/trunk' I, [2024-05-19T00:18:57.456636 #3660991] INFO -- : make[2]: 'ruby' is up to date. I, [2024-05-19T00:18:57.456673 #3660991] INFO -- : make[2]: Leaving directory '/tmp/ruby/build/trunk' I, [2024-05-19T00:18:57.457208 #3660991] INFO -- : make[1]: Leaving directory '/tmp/ruby/build/trunk' I, [2024-05-19T00:18:57.460941 #3660991] INFO -- : make[1]: Entering directory '/tmp/ruby/build/trunk' I, [2024-05-19T00:18:57.460962 #3660991] INFO -- : make[1]: Nothing to be done for 'note'. I, [2024-05-19T00:18:57.460968 #3660991] INFO -- : make[1]: Leaving directory '/tmp/ruby/build/trunk' I, [2024-05-19T00:18:57.543757 #3660991] INFO -- : Run options: I, [2024-05-19T00:18:57.543820 #3660991] INFO -- : --seed=32602 I, [2024-05-19T00:18:57.543829 #3660991] INFO -- : "--ruby=./miniruby -I/tmp/ruby/src/trunk/lib -I. -I.ext/common /tmp/ruby/src/trunk/tool/runruby.rb --extout=.ext -- --disable-gems" I, [2024-05-19T00:18:57.543834 #3660991] INFO -- : --excludes-dir=/tmp/ruby/src/trunk/test/.excludes I, [2024-05-19T00:18:57.543846 #3660991] INFO -- : --name=!/memory_leak/ I, [2024-05-19T00:18:57.543850 #3660991] INFO -- : --stderr-on-failure I, [2024-05-19T00:18:57.543854 #3660991] INFO -- : -j20 I, [2024-05-19T00:18:57.543858 #3660991] INFO -- : I, [2024-05-19T00:18:57.543861 #3660991] INFO -- : # Running tests: I, [2024-05-19T00:18:57.543865 #3660991] INFO -- : I, [2024-05-19T00:18:57.691606 #3660991] INFO -- : [ 1/885] 3702326=test_function I, [2024-05-19T00:18:57.691680 #3660991] INFO -- : [ 2/885] 3702328=test_queue I, [2024-05-19T00:18:57.692019 #3660991] INFO -- : [ 3/885] 3702329=test_tempfile I, [2024-05-19T00:18:57.692052 #3660991] INFO -- : [ 4/885] 3702327=test_noarg I, [2024-05-19T00:18:57.692061 #3660991] INFO -- : [ 5/885] 3702331=parse_comments_test I, [2024-05-19T00:18:57.695172 #3660991] INFO -- : [ 6/885] 3702330=test_duplicate I, [2024-05-19T00:18:57.695626 #3660991] INFO -- : [ 7/885] 3702340=test_utf32 I, [2024-05-19T00:18:57.695948 #3660991] INFO -- : [ 8/885] 3702343=test_basicsocket I, [2024-05-19T00:18:57.695970 #3660991] INFO -- : [ 9/885] 3702341=test_prettyprint I, [2024-05-19T00:18:57.696088 #3660991] INFO -- : [ 10/885] 3702330=test_tracepoint I, [2024-05-19T00:18:57.696187 #3660991] INFO -- : [ 11/885] 3702345=test_rdoc_markup I, [2024-05-19T00:18:57.696271 #3660991] INFO -- : [ 12/885] 3702342=test_gem_commands_help_command I, [2024-05-19T00:18:57.697167 #3660991] INFO -- : [ 13/885] 3702344=test_internal_ivar I, [2024-05-19T00:18:57.703872 #3660991] INFO -- : [ 14/885] 3702340=test_gem_resolver_index_specification I, [2024-05-19T00:18:57.705739 #3660991] INFO -- : [ 15/885] 3702328=test_date_strftime I, [2024-05-19T00:18:57.707396 #3660991] INFO -- : [ 16/885] 3702344=test_rdoc_parser_rd I, [2024-05-19T00:18:57.710850 #3660991] INFO -- : [ 17/885] 3702343=test_yamlstore I, [2024-05-19T00:18:57.722355 #3660991] INFO -- : [ 18/885] 3702334=test_gem_installer I, [2024-05-19T00:18:57.725504 #3660991] INFO -- : [ 19/885] 3702339=json_string_matching_test I, [2024-05-19T00:18:57.725729 #3660991] INFO -- : [ 20/885] 3702333=test_load I, [2024-05-19T00:18:57.725851 #3660991] INFO -- : [ 21/885] 3702332=test_rdoc_normal_class I, [2024-05-19T00:18:57.725974 #3660991] INFO -- : [ 22/885] 3702335=test_class I, [2024-05-19T00:18:57.726363 #3660991] INFO -- : [ 23/885] 3702336=test_const I, [2024-05-19T00:18:57.726513 #3660991] INFO -- : [ 24/885] 3702337=test_asn1 I, [2024-05-19T00:18:57.728853 #3660991] INFO -- : [ 25/885] 3702338=test_random I, [2024-05-19T00:18:57.730387 #3660991] INFO -- : [ 26/885] 3702341=test_irb I, [2024-05-19T00:18:57.733991 #3660991] INFO -- : [ 27/885] 3702339=test_frozen_error I, [2024-05-19T00:18:57.736618 #3660991] INFO -- : [ 28/885] 3702333=test_method_cache I, [2024-05-19T00:18:57.738481 #3660991] INFO -- : [ 29/885] 3702339=test_gem_stub_specification I, [2024-05-19T00:18:57.739157 #3660991] INFO -- : [ 30/885] 3702333=test_gem_ext_ext_conf_builder I, [2024-05-19T00:18:57.740320 #3660991] INFO -- : [ 31/885] 3702336=test_complex I, [2024-05-19T00:18:57.754801 #3660991] INFO -- : [ 32/885] 3702343=test_gem_commands_search_command I, [2024-05-19T00:18:57.757288 #3660991] INFO -- : [ 33/885] 3702331=test_inlinecache I, [2024-05-19T00:18:57.771757 #3660991] INFO -- : [ 34/885] 3702338=test_rdoc_markup_verbatim I, [2024-05-19T00:18:57.788983 #3660991] INFO -- : [ 35/885] 3702337=test_path_to_class I, [2024-05-19T00:18:57.790810 #3660991] INFO -- : [ 36/885] 3702337=test_gem_resolver_specification I, [2024-05-19T00:18:57.815926 #3660991] INFO -- : [ 37/885] 3702331=test_gem_dependency I, [2024-05-19T00:18:57.829422 #3660991] INFO -- : [ 38/885] 3702345=test_parse I, [2024-05-19T00:18:57.894983 #3660991] INFO -- : [ 39/885] 3702336=test_mdns I, [2024-05-19T00:18:57.902365 #3660991] INFO -- : [ 40/885] 3702338=test_gem_remote_fetcher I, [2024-05-19T00:18:57.909323 #3660991] INFO -- : [ 41/885] 3702326=test_scanner_events I, [2024-05-19T00:18:57.912551 #3660991] INFO -- : [ 42/885] 3702343=test_gem_resolver_installed_specification I, [2024-05-19T00:18:57.912635 #3660991] INFO -- : [ 43/885] 3702327=test_gem_commands_list_command I, [2024-05-19T00:18:57.918514 #3660991] INFO -- : [ 44/885] 3702344=test_stack I, [2024-05-19T00:18:57.918749 #3660991] INFO -- : [ 45/885] 3702340=test_rdoc_include I, [2024-05-19T00:18:57.921867 #3660991] INFO -- : [ 46/885] 3702336=test_reqarg I, [2024-05-19T00:18:57.942667 #3660991] INFO -- : [ 47/885] 3702343=test_too_many_dummy_encodings I, [2024-05-19T00:18:57.942739 #3660991] INFO -- : [ 48/885] 3702342=test_gem_version I, [2024-05-19T00:18:57.942757 #3660991] INFO -- : [ 49/885] 3702329=test_econv I, [2024-05-19T00:18:57.943115 #3660991] INFO -- : [ 50/885] 3702330=test_cesu8 I, [2024-05-19T00:18:57.946792 #3660991] INFO -- : [ 51/885] 3702326=test_rdoc_options I, [2024-05-19T00:18:57.946852 #3660991] INFO -- : [ 52/885] 3702330=test_fileutils I, [2024-05-19T00:18:57.973905 #3660991] INFO -- : [ 53/885] 3702332=test_string_processing I, [2024-05-19T00:18:58.007612 #3660991] INFO -- : [ 54/885] 3702342=test_ldap I, [2024-05-19T00:18:58.011097 #3660991] INFO -- : [ 55/885] 3702343=test_emitter I, [2024-05-19T00:18:58.017018 #3660991] INFO -- : [ 56/885] 3702343=test_gem_commands_signin_command I, [2024-05-19T00:18:58.025328 #3660991] INFO -- : [ 57/885] 3702337=test_resource I, [2024-05-19T00:18:58.026640 #3660991] INFO -- : [ 58/885] 3702342=test_io_timeout I, [2024-05-19T00:18:58.029876 #3660991] INFO -- : [ 59/885] 3702342=test_shapes I, [2024-05-19T00:18:58.039869 #3660991] INFO -- : [ 60/885] 3702342=json_fixtures_test I, [2024-05-19T00:18:58.041713 #3660991] INFO -- : [ 61/885] 3702332=test_comparable I, [2024-05-19T00:18:58.049291 #3660991] INFO -- : [ 62/885] 3702342=test_rdoc_parser_c I, [2024-05-19T00:18:58.049857 #3660991] INFO -- : [ 63/885] 3702337=test_class2name I, [2024-05-19T00:18:58.054181 #3660991] INFO -- : [ 64/885] 3702337=test_gbk I, [2024-05-19T00:18:58.059666 #3660991] INFO -- : [ 65/885] 3702332=test_enc_str_buf_cat I, [2024-05-19T00:18:58.063359 #3660991] INFO -- : [ 66/885] 3702337=test_pstore I, [2024-05-19T00:18:58.067863 #3660991] INFO -- : [ 67/885] 3702332=test_cstr I, [2024-05-19T00:18:58.068756 #3660991] INFO -- : [ 68/885] 3702327=test_profile_frames I, [2024-05-19T00:18:58.088897 #3660991] INFO -- : [ 69/885] 3702328=test_big2str I, [2024-05-19T00:18:58.100990 #3660991] INFO -- : [ 70/885] 3702328=test_forwardable I, [2024-05-19T00:18:58.103607 #3660991] INFO -- : [ 71/885] 3702337=test_yaml I, [2024-05-19T00:18:58.115993 #3660991] INFO -- : [ 72/885] 3702343=test_wait I, [2024-05-19T00:18:58.127385 #3660991] INFO -- : [ 73/885] 3702328=test_handle I, [2024-05-19T00:18:58.134725 #3660991] INFO -- : [ 74/885] 3702331=test_thread_queue I, [2024-05-19T00:18:58.150982 #3660991] INFO -- : [ 75/885] 3702339=test_nowrite I, [2024-05-19T00:18:58.155257 #3660991] INFO -- : [ 76/885] 3702341=test_rdoc_markup_formatter I, [2024-05-19T00:18:58.166195 #3660991] INFO -- : [ 77/885] 3702339=test_euc_tw I, [2024-05-19T00:18:58.169375 #3660991] INFO -- : [ 78/885] 3702339=test_ractor I, [2024-05-19T00:18:58.180972 #3660991] INFO -- : [ 79/885] 3702337=test_bmethod I, [2024-05-19T00:18:58.186024 #3660991] INFO -- : [ 80/885] 3702337=test_ansi_without_terminfo I, [2024-05-19T00:18:58.195816 #3660991] INFO -- : [ 81/885] 3702343=test_gem_commands_sources_command I, [2024-05-19T00:18:58.196282 #3660991] INFO -- : [ 82/885] 3702339=regexp_test I, [2024-05-19T00:18:58.196311 #3660991] INFO -- : [ 83/885] 3702340=test_gem_package_tar_reader I, [2024-05-19T00:18:58.196531 #3660991] INFO -- : [ 84/885] 3702328=test_coverage I, [2024-05-19T00:18:58.224577 #3660991] INFO -- : [ 85/885] 3702340=test_rdoc_encoding I, [2024-05-19T00:18:58.233975 #3660991] INFO -- : [ 86/885] 3702327=test_pathname I, [2024-05-19T00:18:58.241991 #3660991] INFO -- : [ 87/885] 3702340=test_init I, [2024-05-19T00:18:58.247646 #3660991] INFO -- : [ 88/885] 3702337=test_complexrational I, [2024-05-19T00:18:58.248246 #3660991] INFO -- : [ 89/885] 3702337=test_rdoc_any_method I, [2024-05-19T00:18:58.279963 #3660991] INFO -- : [ 90/885] 3702339=test_modify_expand I, [2024-05-19T00:18:58.282178 #3660991] INFO -- : [ 91/885] 3702339=test_rdoc_markdown I, [2024-05-19T00:18:58.293339 #3660991] INFO -- : [ 92/885] 3702341=test_gem_available_set I, [2024-05-19T00:18:58.341240 #3660991] INFO -- : [ 93/885] 3702336=test_file I, [2024-05-19T00:18:58.345728 #3660991] INFO -- : [ 94/885] 3702326=test_deprecate I, [2024-05-19T00:18:58.346900 #3660991] INFO -- : [ 95/885] 3702343=test_rdoc_constant I, [2024-05-19T00:18:58.358505 #3660991] INFO -- : [ 96/885] 3702336=test_bash_completion I, [2024-05-19T00:18:58.363638 #3660991] INFO -- : [ 97/885] 3702336=test_formatter I, [2024-05-19T00:18:58.369199 #3660991] INFO -- : [ 98/885] 3702336=test_recorder I, [2024-05-19T00:18:58.397675 #3660991] INFO -- : [ 99/885] 3702332=test_gem_source_vendor I, [2024-05-19T00:18:58.399449 #3660991] INFO -- : [100/885] 3702336=test_gem_commands_owner_command I, [2024-05-19T00:18:58.453413 #3660991] INFO -- : [101/885] 3702330=test_marshalable I, [2024-05-19T00:18:58.465960 #3660991] INFO -- : [102/885] 3702345=test_digest I, [2024-05-19T00:18:58.466066 #3660991] INFO -- : [103/885] 3702342=test_gem_commands_contents_command I, [2024-05-19T00:18:58.469323 #3660991] INFO -- : [104/885] 3702330=test_gem_ext_cmake_builder I, [2024-05-19T00:18:58.481198 #3660991] INFO -- : [105/885] 3702327=test_require I, [2024-05-19T00:18:58.525400 #3660991] INFO -- : [106/885] 3702326=test_cgi_util I, [2024-05-19T00:18:58.562341 #3660991] INFO -- : [107/885] 3702342=test_fiddle I, [2024-05-19T00:18:58.596379 #3660991] INFO -- : [108/885] 3702341=test_wss I, [2024-05-19T00:18:58.609410 #3660991] INFO -- : [109/885] 3702340=test_ractor I, [2024-05-19T00:18:58.609732 #3660991] INFO -- : [110/885] 3702343=test_find I, [2024-05-19T00:18:58.612562 #3660991] INFO -- : [111/885] 3702341=test_sleep I, [2024-05-19T00:18:58.613386 #3660991] INFO -- : [112/885] 3702330=test_config I, [2024-05-19T00:18:58.613725 #3660991] INFO -- : [113/885] 3702332=test_libs I, [2024-05-19T00:18:58.623816 #3660991] INFO -- : [114/885] 3702343=test_gem_commands_fetch_command I, [2024-05-19T00:18:58.632410 #3660991] INFO -- : [115/885] 3702342=test_math I, [2024-05-19T00:18:58.645126 #3660991] INFO -- : [116/885] 3702332=test_gc I, [2024-05-19T00:18:58.645799 #3660991] INFO -- : [117/885] 3702342=test_yaml_tree I, [2024-05-19T00:18:58.648619 #3660991] INFO -- : [118/885] 3702332=test_rendering I, [2024-05-19T00:18:58.652352 #3660991] INFO -- : [119/885] 3702330=test_sizeof I, [2024-05-19T00:18:58.677568 #3660991] INFO -- : [120/885] 3702342=test_case I, [2024-05-19T00:18:58.687856 #3660991] INFO -- : [121/885] 3702326=test_face I, [2024-05-19T00:18:58.701117 #3660991] INFO -- : [122/885] 3702340=test_io I, [2024-05-19T00:18:58.706119 #3660991] INFO -- : [123/885] 3702342=test_unicode_escape I, [2024-05-19T00:18:58.706362 #3660991] INFO -- : [124/885] 3702343=test_utf16 I, [2024-05-19T00:18:58.710572 #3660991] INFO -- : [125/885] 3702332=test_autoload I, [2024-05-19T00:18:58.714556 #3660991] INFO -- : [126/885] 3702343=test_gem_package_tar_header I, [2024-05-19T00:18:58.737162 #3660991] INFO -- : [127/885] 3702339=test_gem_util I, [2024-05-19T00:18:58.743573 #3660991] INFO -- : [128/885] 3702343=test_iseq_load I, [2024-05-19T00:18:58.750403 #3660991] INFO -- : [129/885] 3702326=test_pkey_dh I, [2024-05-19T00:18:58.770800 #3660991] INFO -- : [130/885] 3702337=test_bigzero I, [2024-05-19T00:18:58.771562 #3660991] INFO -- : [131/885] 3702344=test_system I, [2024-05-19T00:18:58.780769 #3660991] INFO -- : [132/885] 3702337=test_pkcs12 I, [2024-05-19T00:18:58.794119 #3660991] INFO -- : [133/885] 3702342=test_etc I, [2024-05-19T00:18:58.834474 #3660991] INFO -- : [134/885] 3702326=test_yjit_exit_locations I, [2024-05-19T00:18:58.840094 #3660991] INFO -- : [135/885] 3702326=test_getopts I, [2024-05-19T00:18:58.845126 #3660991] INFO -- : [136/885] 3702326=test_protocol I, [2024-05-19T00:18:58.854539 #3660991] INFO -- : [137/885] 3702339=test_gem_resolver_activation_request I, [2024-05-19T00:18:58.863090 #3660991] INFO -- : [138/885] 3702339=test_gem_config_file I, [2024-05-19T00:18:58.881491 #3660991] INFO -- : [139/885] 3702342=test_ripper I, [2024-05-19T00:18:58.892168 #3660991] INFO -- : [140/885] 3702329=test_rdoc_markup_to_html_crossref I, [2024-05-19T00:18:59.007241 #3660991] INFO -- : [141/885] 3702339=test_gem_resolver_best_set I, [2024-05-19T00:18:59.079417 #3660991] INFO -- : [142/885] 3702339=encoding_test I, [2024-05-19T00:18:59.079895 #3660991] INFO -- : [143/885] 3702333=test_typeddata I, [2024-05-19T00:18:59.082167 #3660991] INFO -- : [144/885] 3702337=test_rat I, [2024-05-19T00:18:59.082708 #3660991] INFO -- : [145/885] 3702328=test_webauthn_poller I, [2024-05-19T00:18:59.087252 #3660991] INFO -- : [146/885] 3702337=test_rdoc_markup_raw I, [2024-05-19T00:18:59.088300 #3660991] INFO -- : [147/885] 3702337=test_optparse I, [2024-05-19T00:18:59.118719 #3660991] INFO -- : [148/885] 3702342=test_array I, [2024-05-19T00:18:59.124017 #3660991] INFO -- : [149/885] 3702342=test_fstring I, [2024-05-19T00:18:59.127782 #3660991] INFO -- : [150/885] 3702337=test_rdoc_alias I, [2024-05-19T00:18:59.135975 #3660991] INFO -- : [151/885] 3702337=test_yield I, [2024-05-19T00:18:59.153374 #3660991] INFO -- : [152/885] 3702326=test_convertible I, [2024-05-19T00:18:59.158081 #3660991] INFO -- : [153/885] 3702336=parser_test I, [2024-05-19T00:18:59.182142 #3660991] INFO -- : [154/885] 3702339=test_stringscanner I, [2024-05-19T00:18:59.225297 #3660991] INFO -- : [155/885] 3702329=test_files_sample I, [2024-05-19T00:18:59.229052 #3660991] INFO -- : [156/885] 3702342=test_rdoc_markup_indented_paragraph I, [2024-05-19T00:18:59.231623 #3660991] INFO -- : [157/885] 3702339=test_gem_resolver_conflict I, [2024-05-19T00:18:59.233286 #3660991] INFO -- : [158/885] 3702336=test_rdoc_task I, [2024-05-19T00:18:59.236465 #3660991] INFO -- : [159/885] 3702342=ruby_parser_test I, [2024-05-19T00:18:59.240240 #3660991] INFO -- : [160/885] 3702345=test_pack I, [2024-05-19T00:18:59.248431 #3660991] INFO -- : [161/885] 3702339=test_backtrace I, [2024-05-19T00:18:59.259436 #3660991] INFO -- : [162/885] 3702345=test_io_buffer I, [2024-05-19T00:18:59.260814 #3660991] INFO -- : [163/885] 3702336=test_readpartial I, [2024-05-19T00:18:59.287350 #3660991] INFO -- : [164/885] 3702342=test_gem_commands_install_command I, [2024-05-19T00:18:59.290708 #3660991] INFO -- : [165/885] 3702329=test_clone I, [2024-05-19T00:18:59.344380 #3660991] INFO -- : [166/885] 3702333=test_rdoc_require I, [2024-05-19T00:18:59.376443 #3660991] INFO -- : [167/885] 3702345=locals_test I, [2024-05-19T00:18:59.412504 #3660991] INFO -- : [168/885] 3702329=test_gem_request_set_lockfile I, [2024-05-19T00:18:59.422218 #3660991] INFO -- : [169/885] 3702328=test_raise_exception I, [2024-05-19T00:18:59.496941 #3660991] INFO -- : [170/885] 3702333=test_protect I, [2024-05-19T00:18:59.498174 #3660991] INFO -- : [171/885] 3702333=test_win32ole_typelib I, [2024-05-19T00:18:59.501652 #3660991] INFO -- : [172/885] 3702333=test_gem_resolver_dependency_request I, [2024-05-19T00:18:59.522922 #3660991] INFO -- : [173/885] 3702333=test_tree_builder I, [2024-05-19T00:18:59.543636 #3660991] INFO -- : [174/885] 3702333=test_hash I, [2024-05-19T00:18:59.561234 #3660991] INFO -- : [175/885] 3702333=test_alias_and_anchor I, [2024-05-19T00:18:59.564731 #3660991] INFO -- : [176/885] 3702333=test_postponed_job I, [2024-05-19T00:18:59.600884 #3660991] INFO -- : [177/885] 3702327=test_external_new I, [2024-05-19T00:18:59.608416 #3660991] INFO -- : [178/885] 3702327=test_kill_ring I, [2024-05-19T00:18:59.656128 #3660991] INFO -- : [179/885] 3702327=test_framework I, [2024-05-19T00:18:59.665207 #3660991] INFO -- : [180/885] 3702336=test_ns_spki I, [2024-05-19T00:18:59.674716 #3660991] INFO -- : [181/885] 3702327=test_argf I, [2024-05-19T00:18:59.688110 #3660991] INFO -- : [182/885] 3702336=test_ws I, [2024-05-19T00:18:59.691827 #3660991] INFO -- : [183/885] 3702336=test_gem_commands_environment_command I, [2024-05-19T00:18:59.741348 #3660991] INFO -- : [184/885] 3702336=test_m17n I, [2024-05-19T00:18:59.766369 #3660991] INFO -- : [185/885] 3702335=test_weakmap I, [2024-05-19T00:18:59.777757 #3660991] INFO -- : [186/885] 3702345=test_workspace I, [2024-05-19T00:18:59.784132 #3660991] INFO -- : [187/885] 3702344=test_yjit I, [2024-05-19T00:18:59.795439 #3660991] INFO -- : [188/885] 3702344=test_string_memory I, [2024-05-19T00:18:59.806763 #3660991] INFO -- : [189/885] 3702338=comments_test I, [2024-05-19T00:18:59.820295 #3660991] INFO -- : [190/885] 3702336=test_gem_requirement I, [2024-05-19T00:18:59.823301 #3660991] INFO -- : [191/885] 3702344=test_sprintf I, [2024-05-19T00:18:59.868123 #3660991] INFO -- : [192/885] 3702329=test_gem_security_trust_dir I, [2024-05-19T00:18:59.909584 #3660991] INFO -- : [193/885] 3702336=ripper_test I, [2024-05-19T00:18:59.910449 #3660991] INFO -- : [194/885] 3702329=test_objspace I, [2024-05-19T00:18:59.914264 #3660991] INFO -- : [195/885] 3702338=test_line_editor I, [2024-05-19T00:18:59.943499 #3660991] INFO -- : [196/885] 3702333=test_undef I, [2024-05-19T00:18:59.949735 #3660991] INFO -- : [197/885] 3702333=test_c_struct_entry I, [2024-05-19T00:18:59.953378 #3660991] INFO -- : [198/885] 3702343=test_lock_native_thread I, [2024-05-19T00:18:59.963975 #3660991] INFO -- : [199/885] 3702344=test_gem_commands_stale_command I, [2024-05-19T00:18:59.971308 #3660991] INFO -- : [200/885] 3702345=test_have_library I, [2024-05-19T00:18:59.986819 #3660991] INFO -- : [201/885] 3702338=test_remote_fetch_error I, [2024-05-19T00:18:59.998781 #3660991] INFO -- : [202/885] 3702338=test_show_source I, [2024-05-19T00:19:00.077234 #3660991] INFO -- : [203/885] 3702338=test_set I, [2024-05-19T00:19:00.085717 #3660991] INFO -- : [204/885] 3702338=test_to_ruby I, [2024-05-19T00:19:00.104071 #3660991] INFO -- : [205/885] 3702338=test_pattern_key_name_check I, [2024-05-19T00:19:00.104905 #3660991] INFO -- : [206/885] 3702333=test_gem_impossible_dependencies_error I, [2024-05-19T00:19:00.108658 #3660991] INFO -- : [207/885] 3702333=test_pack I, [2024-05-19T00:19:00.113830 #3660991] INFO -- : [208/885] 3702328=test_array_create I, [2024-05-19T00:19:00.116800 #3660991] INFO -- : [209/885] 3702328=test_gem_commands_query_command I, [2024-05-19T00:19:00.127090 #3660991] INFO -- : [210/885] 3702344=test_method I, [2024-05-19T00:19:00.136567 #3660991] INFO -- : [211/885] 3702338=test_rdoc_rubygems_hook I, [2024-05-19T00:19:00.237407 #3660991] INFO -- : [212/885] 3702343=test_euc_kr I, [2024-05-19T00:19:00.241862 #3660991] INFO -- : [213/885] 3702343=test_rdoc_context_section I, [2024-05-19T00:19:00.248029 #3660991] INFO -- : [214/885] 3702343=test_ftp I, [2024-05-19T00:19:00.255531 #3660991] INFO -- : [215/885] 3702338=test_ellipsize I, [2024-05-19T00:19:00.261731 #3660991] INFO -- : [216/885] 3702333=test_date_attr I, [2024-05-19T00:19:00.265197 #3660991] INFO -- : [217/885] 3702343=test_io_wait I, [2024-05-19T00:19:00.265866 #3660991] INFO -- : [218/885] 3702333=test_gem_commands_exec_command I, [2024-05-19T00:19:00.268632 #3660991] INFO -- : [219/885] 3702338=test_kwargs I, [2024-05-19T00:19:00.271029 #3660991] INFO -- : [220/885] 3702336=warnings_test I, [2024-05-19T00:19:00.273091 #3660991] INFO -- : [221/885] 3702338=test_type_completor I, [2024-05-19T00:19:00.273792 #3660991] INFO -- : [222/885] 3702338=test_console_attr I, [2024-05-19T00:19:00.273919 #3660991] INFO -- : [223/885] 3702338=test_summary I, [2024-05-19T00:19:00.280741 #3660991] INFO -- : [224/885] 3702336=test_cp949 I, [2024-05-19T00:19:00.282481 #3660991] INFO -- : [225/885] 3702336=test_gem_commands_uninstall_command I, [2024-05-19T00:19:00.411246 #3660991] INFO -- : [226/885] 3702338=test_condition I, [2024-05-19T00:19:00.411851 #3660991] INFO -- : [227/885] 3702338=test_foreach I, [2024-05-19T00:19:00.416630 #3660991] INFO -- : [228/885] 3702338=test_gem_source_specific_file I, [2024-05-19T00:19:00.442718 #3660991] INFO -- : [229/885] 3702342=test_gem_unsatisfiable_dependency_error I, [2024-05-19T00:19:00.449186 #3660991] INFO -- : [230/885] 3702342=test_win32ole_record I, [2024-05-19T00:19:00.451804 #3660991] INFO -- : [231/885] 3702342=test_sorted_set I, [2024-05-19T00:19:00.479215 #3660991] INFO -- : [232/885] 3702338=test_emoji I, [2024-05-19T00:19:00.499933 #3660991] INFO -- : [233/885] 3702338=test_win32ole_type_event I, [2024-05-19T00:19:00.501062 #3660991] INFO -- : [234/885] 3702338=test_hash I, [2024-05-19T00:19:00.556648 #3660991] INFO -- : [235/885] 3702339=test_ubf_async_safe I, [2024-05-19T00:19:00.564266 #3660991] INFO -- : [236/885] 3702339=test_io I, [2024-05-19T00:19:00.596162 #3660991] INFO -- : [237/885] 3702343=test_rdoc_markup_paragraph I, [2024-05-19T00:19:00.601875 #3660991] INFO -- : [238/885] 3702343=test_enc_raise I, [2024-05-19T00:19:00.607086 #3660991] INFO -- : [239/885] 3702343=test_psych I, [2024-05-19T00:19:00.624405 #3660991] INFO -- : [240/885] 3702343=!Nothing_to_test I, [2024-05-19T00:19:00.625090 #3660991] INFO -- : [241/885] 3702343=test_command I, [2024-05-19T00:19:00.657766 #3660991] INFO -- : [242/885] 3702341=test_at_exit I, [2024-05-19T00:19:00.673296 #3660991] INFO -- : [243/885] 3702335=test_gem_ext_cargo_builder_unit I, [2024-05-19T00:19:00.678892 #3660991] INFO -- : [244/885] 3702341=test_date I, [2024-05-19T00:19:00.687183 #3660991] INFO -- : [245/885] 3702341=test_gem_rdoc I, [2024-05-19T00:19:00.719737 #3660991] INFO -- : [246/885] 3702342=test_object_create_start I, [2024-05-19T00:19:00.719866 #3660991] INFO -- : [247/885] 3702342=test_gem_silent_ui I, [2024-05-19T00:19:00.753792 #3660991] INFO -- : [248/885] 3702342=test_emitter I, [2024-05-19T00:19:00.758653 #3660991] INFO -- : [249/885] 3702342=test_files_ext I, [2024-05-19T00:19:00.763831 #3660991] INFO -- : [250/885] 3702328=test_bug-5832 I, [2024-05-19T00:19:00.773225 #3660991] INFO -- : [251/885] 3702328=test_eval_history I, [2024-05-19T00:19:00.796554 #3660991] INFO -- : [252/885] 3702339=dispatcher_test I, [2024-05-19T00:19:00.814733 #3660991] INFO -- : [253/885] 3702341=test_kernel I, [2024-05-19T00:19:00.827277 #3660991] INFO -- : [254/885] 3702335=test_gem_doctor I, [2024-05-19T00:19:00.827808 #3660991] INFO -- : [255/885] 3702339=test_kdf I, [2024-05-19T00:19:00.829386 #3660991] INFO -- : [256/885] 3702337=test_config I, [2024-05-19T00:19:00.856677 #3660991] INFO -- : [257/885] 3702335=test_gem_source_list I, [2024-05-19T00:19:00.857230 #3660991] INFO -- : [258/885] 3702337=test_optarg I, [2024-05-19T00:19:00.863067 #3660991] INFO -- : [259/885] 3702342=test_yaml_special_cases I, [2024-05-19T00:19:00.865083 #3660991] INFO -- : [260/885] 3702336=test_address_resolve I, [2024-05-19T00:19:00.868129 #3660991] INFO -- : [261/885] 3702328=test_rdoc_token_stream I, [2024-05-19T00:19:00.869366 #3660991] INFO -- : [262/885] 3702342=test_zsh_completion I, [2024-05-19T00:19:00.871495 #3660991] INFO -- : [263/885] 3702342=test_exception I, [2024-05-19T00:19:00.875216 #3660991] INFO -- : [264/885] 3702336=test_iter_break I, [2024-05-19T00:19:00.878354 #3660991] INFO -- : [265/885] 3702342=test_macro I, [2024-05-19T00:19:00.882795 #3660991] INFO -- : [266/885] 3702336=test_gem_ext_configure_builder I, [2024-05-19T00:19:00.896890 #3660991] INFO -- : [267/885] 3702335=test_frozen I, [2024-05-19T00:19:00.898184 #3660991] INFO -- : [268/885] 3702335=test_pp I, [2024-05-19T00:19:00.904146 #3660991] INFO -- : [269/885] 3702339=test_verbose I, [2024-05-19T00:19:00.923415 #3660991] INFO -- : [270/885] 3702337=test_rdoc_single_class I, [2024-05-19T00:19:00.928899 #3660991] INFO -- : [271/885] 3702337=test_num2int I, [2024-05-19T00:19:00.930316 #3660991] INFO -- : [272/885] 3702342=test_nil I, [2024-05-19T00:19:00.932558 #3660991] INFO -- : [273/885] 3702339=test_rdoc_tom_doc I, [2024-05-19T00:19:00.932790 #3660991] INFO -- : [274/885] 3702335=test_hmac I, [2024-05-19T00:19:00.934166 #3660991] INFO -- : [275/885] 3702342=test_rdoc_markup_to_tt_only I, [2024-05-19T00:19:00.937794 #3660991] INFO -- : [276/885] 3702337=test_common I, [2024-05-19T00:19:00.942204 #3660991] INFO -- : [277/885] 3702335=test_gem_spec_fetcher I, [2024-05-19T00:19:00.949200 #3660991] INFO -- : [278/885] 3702336=test_gem_command I, [2024-05-19T00:19:00.960678 #3660991] INFO -- : [279/885] 3702342=test_bug-3571 I, [2024-05-19T00:19:00.969046 #3660991] INFO -- : [280/885] 3702339=test_key_actor_vi I, [2024-05-19T00:19:00.974366 #3660991] INFO -- : [281/885] 3702343=test_ifunless I, [2024-05-19T00:19:00.976548 #3660991] INFO -- : [282/885] 3702343=test_assignment I, [2024-05-19T00:19:00.989477 #3660991] INFO -- : [283/885] 3702328=test_gem_commands_lock_command I, [2024-05-19T00:19:00.993912 #3660991] INFO -- : [284/885] 3702342=test_numeric I, [2024-05-19T00:19:01.009828 #3660991] INFO -- : [285/885] 3702328=test_gem_request_set_lockfile_parser I, [2024-05-19T00:19:01.044040 #3660991] INFO -- : [286/885] 3702336=test_depth_first I, [2024-05-19T00:19:01.048688 #3660991] INFO -- : [287/885] 3702336=test_x509attr I, [2024-05-19T00:19:01.052979 #3660991] INFO -- : [288/885] 3702336=test_raise I, [2024-05-19T00:19:01.056394 #3660991] INFO -- : [289/885] 3702336=test_rdoc_store I, [2024-05-19T00:19:01.071917 #3660991] INFO -- : [290/885] 3702342=test_string I, [2024-05-19T00:19:01.085414 #3660991] INFO -- : [291/885] 3702342=test_rdoc_stats I, [2024-05-19T00:19:01.108515 #3660991] INFO -- : [292/885] 3702328=test_pattern_matching I, [2024-05-19T00:19:01.112372 #3660991] INFO -- : [293/885] 3702342=test_gem_dependency_resolution_error I, [2024-05-19T00:19:01.119835 #3660991] INFO -- : [294/885] 3702337=test_qsort I, [2024-05-19T00:19:01.121310 #3660991] INFO -- : [295/885] 3702342=test_rdoc_parser I, [2024-05-19T00:19:01.123440 #3660991] INFO -- : [296/885] 3702337=json_addition_test I, [2024-05-19T00:19:01.128951 #3660991] INFO -- : [297/885] 3702335=test_custom_command I, [2024-05-19T00:19:01.133453 #3660991] INFO -- : [298/885] 3702345=test_gem_resolver_index_set I, [2024-05-19T00:19:01.135313 #3660991] INFO -- : [299/885] 3702328=test_gem_package_old I, [2024-05-19T00:19:01.139166 #3660991] INFO -- : [300/885] 3702342=test_gc_compact I, [2024-05-19T00:19:01.147829 #3660991] INFO -- : [301/885] 3702337=test_string I, [2024-05-19T00:19:01.163394 #3660991] INFO -- : [302/885] 3702339=test_proc I, [2024-05-19T00:19:01.179907 #3660991] INFO -- : [303/885] 3702328=test_ole_methods I, [2024-05-19T00:19:01.183669 #3660991] INFO -- : [304/885] 3702328=test_erb_m17n I, [2024-05-19T00:19:01.196712 #3660991] INFO -- : [305/885] 3702328=test_date_conv I, [2024-05-19T00:19:01.201406 #3660991] INFO -- : [306/885] 3702328=test_optimization I, [2024-05-19T00:19:01.259946 #3660991] INFO -- : [307/885] 3702335=test_cgi_tag_helper I, [2024-05-19T00:19:01.289172 #3660991] INFO -- : [308/885] 3702335=test_zlib I, [2024-05-19T00:19:01.324399 #3660991] INFO -- : [309/885] 3702345=test_egrep_cpp I, [2024-05-19T00:19:01.325502 #3660991] INFO -- : [310/885] 3702341=test_fnmatch I, [2024-05-19T00:19:01.363102 #3660991] INFO -- : [311/885] 3702341=test_files_test_2 I, [2024-05-19T00:19:01.363651 #3660991] INFO -- : [312/885] 3702333=test_require_path_check I, [2024-05-19T00:19:01.447076 #3660991] INFO -- : [313/885] 3702345=test_rdoc_markup_parser I, [2024-05-19T00:19:01.450024 #3660991] INFO -- : [314/885] 3702333=test_folderitem2_invokeverb I, [2024-05-19T00:19:01.451882 #3660991] INFO -- : [315/885] 3702333=test_gem_validator I, [2024-05-19T00:19:01.469567 #3660991] INFO -- : [316/885] 3702333=test_rdoc_i18n_text I, [2024-05-19T00:19:01.471718 #3660991] INFO -- : [317/885] 3702333=test_io_buffer I, [2024-05-19T00:19:01.483959 #3660991] INFO -- : [318/885] 3702345=test_backtrace I, [2024-05-19T00:19:01.487876 #3660991] INFO -- : [319/885] 3702345=test_defined I, [2024-05-19T00:19:01.509575 #3660991] INFO -- : [320/885] 3702333=test_key_name_check I, [2024-05-19T00:19:01.515636 #3660991] INFO -- : [321/885] 3702333=test_svcb_https I, [2024-05-19T00:19:01.531910 #3660991] INFO -- : [322/885] 3702333=test_buffering I, [2024-05-19T00:19:01.538544 #3660991] INFO -- : [323/885] 3702333=test_gb18030 I, [2024-05-19T00:19:01.543499 #3660991] INFO -- : [324/885] 3702333=test_gem_uninstaller I, [2024-05-19T00:19:01.560181 #3660991] INFO -- : [325/885] 3702345=test_rdoc_rdoc I, [2024-05-19T00:19:01.582478 #3660991] INFO -- : [326/885] 3702330=test_time I, [2024-05-19T00:19:01.714618 #3660991] INFO -- : [327/885] 3702330=test_windows_1251 I, [2024-05-19T00:19:01.716322 #3660991] INFO -- : [328/885] 3702345=test_rdoc_markup_attributes I, [2024-05-19T00:19:01.718903 #3660991] INFO -- : [329/885] 3702330=test_rdoc_rd_inline_parser I, [2024-05-19T00:19:01.721281 #3660991] INFO -- : [330/885] 3702345=test_rdoc_markup_to_rdoc I, [2024-05-19T00:19:01.754776 #3660991] INFO -- : [331/885] 3702345=test_default_gems I, [2024-05-19T00:19:01.757978 #3660991] INFO -- : [332/885] 3702336=test_win32ole_type I, [2024-05-19T00:19:01.760836 #3660991] INFO -- : [333/885] 3702336=test_null I, [2024-05-19T00:19:01.764506 #3660991] INFO -- : [334/885] 3702336=test_mul I, [2024-05-19T00:19:01.769975 #3660991] INFO -- : [335/885] 3702336=test_pkey_ec I, [2024-05-19T00:19:01.811350 #3660991] INFO -- : [336/885] 3702345=test_thread I, [2024-05-19T00:19:01.822420 #3660991] INFO -- : [337/885] 3702345=test_trick I, [2024-05-19T00:19:01.852720 #3660991] INFO -- : [338/885] 3702336=test_pipe I, [2024-05-19T00:19:01.951908 #3660991] INFO -- : [339/885] 3702330=test_date_parse I, [2024-05-19T00:19:01.974293 #3660991] INFO -- : [340/885] 3702336=test_sprintf_comb I, [2024-05-19T00:19:02.046548 #3660991] INFO -- : [341/885] 3702339=test_method_cache I, [2024-05-19T00:19:02.053158 #3660991] INFO -- : [342/885] 3702339=test_gem_request I, [2024-05-19T00:19:02.091885 #3660991] INFO -- : [343/885] 3702336=test_gem_ext_cargo_builder_link_flag_converter I, [2024-05-19T00:19:02.094879 #3660991] INFO -- : [344/885] 3702330=test_gem_commands_mirror I, [2024-05-19T00:19:02.098312 #3660991] INFO -- : [345/885] 3702330=test_settracefunc I, [2024-05-19T00:19:02.131850 #3660991] INFO -- : [346/885] 3702336=test_gem_text I, [2024-05-19T00:19:02.163635 #3660991] INFO -- : [347/885] 3702336=test_enumerator_kw I, [2024-05-19T00:19:02.169146 #3660991] INFO -- : [348/885] 3702336=test_scan_args I, [2024-05-19T00:19:02.175239 #3660991] INFO -- : [349/885] 3702336=test_generic I, [2024-05-19T00:19:02.193512 #3660991] INFO -- : [350/885] 3702336=test_win32ole I, [2024-05-19T00:19:02.199461 #3660991] INFO -- : [351/885] 3702336=test_store I, [2024-05-19T00:19:02.211814 #3660991] INFO -- : [352/885] 3702339=test_case_options I, [2024-05-19T00:19:02.223139 #3660991] INFO -- : [353/885] 3702339=test_scalar I, [2024-05-19T00:19:02.234555 #3660991] INFO -- : [354/885] 3702339=test_gem_dependency_installer I, [2024-05-19T00:19:02.325355 #3660991] INFO -- : [355/885] 3702334=test_gem_commands_info_command I, [2024-05-19T00:19:02.338727 #3660991] INFO -- : [356/885] 3702336=test_rdoc_cross_reference I, [2024-05-19T00:19:02.349882 #3660991] INFO -- : [357/885] 3702334=test_rand I, [2024-05-19T00:19:02.406714 #3660991] INFO -- : [358/885] 3702331=test_gem_package_tar_reader_entry I, [2024-05-19T00:19:02.497784 #3660991] INFO -- : [359/885] 3702333=test_gem_name_tuple I, [2024-05-19T00:19:02.511832 #3660991] INFO -- : [360/885] 3702333=test_bug_reporter I, [2024-05-19T00:19:02.594633 #3660991] INFO -- : [361/885] 3702331=test_exception I, [2024-05-19T00:19:02.630905 #3660991] INFO -- : [362/885] 3702334=test_gem_stream_ui I, [2024-05-19T00:19:02.695077 #3660991] INFO -- : [363/885] 3702343=test_extlibs I, [2024-05-19T00:19:02.710092 #3660991] INFO -- : [364/885] 3702334=test_rdoc_generator_ri I, [2024-05-19T00:19:02.792481 #3660991] INFO -- : [365/885] 3702336=test_require_lib I, [2024-05-19T00:19:02.845093 #3660991] INFO -- : [366/885] 3702334=test_gem_install_update_options I, [2024-05-19T00:19:02.924924 #3660991] INFO -- : [367/885] 3702333=parse_test I, [2024-05-19T00:19:02.967424 #3660991] INFO -- : [368/885] 3702334=test_ractor I, [2024-05-19T00:19:02.976063 #3660991] INFO -- : [369/885] 3702334=test_severity I, [2024-05-19T00:19:02.981642 #3660991] INFO -- : [370/885] 3702334=test_thread I, [2024-05-19T00:19:03.047929 #3660991] INFO -- : [371/885] 3702330=test_socket I, [2024-05-19T00:19:03.194629 #3660991] INFO -- : [372/885] 3702334=test_objectspace I, [2024-05-19T00:19:03.353683 #3660991] INFO -- : [373/885] 3702344=test_rdoc_markup_to_table_of_contents I, [2024-05-19T00:19:03.381903 #3660991] INFO -- : [374/885] 3702344=test_str2big I, [2024-05-19T00:19:03.385713 #3660991] INFO -- : [375/885] 3702344=test_dot_dot I, [2024-05-19T00:19:03.390091 #3660991] INFO -- : [376/885] 3702344=test_c_struct_builder I, [2024-05-19T00:19:03.507087 #3660991] INFO -- : [377/885] 3702344=test_literal I, [2024-05-19T00:19:03.529760 #3660991] INFO -- : [378/885] 3702332=test_gem_request_connection_pools I, [2024-05-19T00:19:03.702619 #3660991] INFO -- : [379/885] 3702342=test_gem_version_option I, [2024-05-19T00:19:03.734104 #3660991] INFO -- : [380/885] 3702342=test_grapheme_breaks I, [2024-05-19T00:19:03.757235 #3660991] INFO -- : [381/885] 3702342=test_cclass I, [2024-05-19T00:19:03.763338 #3660991] INFO -- : [382/885] 3702327=test_parser_events I, [2024-05-19T00:19:03.806687 #3660991] INFO -- : [383/885] 3702338=test_reline I, [2024-05-19T00:19:03.830488 #3660991] INFO -- : [384/885] 3702327=test_case I, [2024-05-19T00:19:03.843096 #3660991] INFO -- : [385/885] 3702327=test_pkey I, [2024-05-19T00:19:03.889876 #3660991] INFO -- : [386/885] 3702342=test_json_tree I, [2024-05-19T00:19:03.891369 #3660991] INFO -- : [387/885] 3702327=test_rdoc_markup_to_markdown I, [2024-05-19T00:19:03.891860 #3660991] INFO -- : [388/885] 3702345=test_rdoc_generator_pot_po I, [2024-05-19T00:19:03.895462 #3660991] INFO -- : [389/885] 3702345=test_ansi_with_terminfo I, [2024-05-19T00:19:03.895734 #3660991] INFO -- : [390/885] 3702342=test_ractor I, [2024-05-19T00:19:03.904402 #3660991] INFO -- : [391/885] 3702345=test_m17n_comb I, [2024-05-19T00:19:03.927100 #3660991] INFO -- : [392/885] 3702326=test_memory_view I, [2024-05-19T00:19:03.944470 #3660991] INFO -- : [393/885] 3702344=test_gem_security_policy I, [2024-05-19T00:19:03.951038 #3660991] INFO -- : [394/885] 3702342=test_gem_source_local I, [2024-05-19T00:19:04.043798 #3660991] INFO -- : [395/885] 3702326=test_pack I, [2024-05-19T00:19:04.053574 #3660991] INFO -- : [396/885] 3702334=test_last_thread I, [2024-05-19T00:19:04.070759 #3660991] INFO -- : [397/885] 3702327=test_process I, [2024-05-19T00:19:04.122784 #3660991] INFO -- : [398/885] 3702338=test_gc I, [2024-05-19T00:19:04.143778 #3660991] INFO -- : [399/885] 3702342=test_x509cert I, [2024-05-19T00:19:04.230942 #3660991] INFO -- : [400/885] 3702326=test_err_in_callback I, [2024-05-19T00:19:04.234342 #3660991] INFO -- : [401/885] 3702326=test_gem_resolver_lock_specification I, [2024-05-19T00:19:04.234815 #3660991] INFO -- : [402/885] 3702344=test_logdevice I, [2024-05-19T00:19:04.278909 #3660991] INFO -- : [403/885] 3702326=test_arity I, [2024-05-19T00:19:04.283945 #3660991] INFO -- : [404/885] 3702326=test_gem_ext_rake_builder I, [2024-05-19T00:19:04.322236 #3660991] INFO -- : [405/885] 3702331=test_switch_hitter I, [2024-05-19T00:19:04.338470 #3660991] INFO -- : [406/885] 3702331=test_singleton I, [2024-05-19T00:19:04.343256 #3660991] INFO -- : [407/885] 3702335=test_flush I, [2024-05-19T00:19:04.344388 #3660991] INFO -- : [408/885] 3702331=test_io_console I, [2024-05-19T00:19:04.349089 #3660991] INFO -- : [409/885] 3702335=test_rdoc_normal_module I, [2024-05-19T00:19:04.386206 #3660991] INFO -- : [410/885] 3702342=test_c_union_entity I, [2024-05-19T00:19:04.446884 #3660991] INFO -- : [411/885] 3702342=test_rdoc_markdown_test I, [2024-05-19T00:19:04.456295 #3660991] INFO -- : [412/885] 3702343=test_logperiod I, [2024-05-19T00:19:04.477131 #3660991] INFO -- : [413/885] 3702343=test_securerandom I, [2024-05-19T00:19:04.491441 #3660991] INFO -- : [414/885] 3702343=test_thread_fd_close I, [2024-05-19T00:19:04.497531 #3660991] INFO -- : [415/885] 3702343=test_passing_block I, [2024-05-19T00:19:04.503611 #3660991] INFO -- : [416/885] 3702343=test_hash_create I, [2024-05-19T00:19:04.506422 #3660991] INFO -- : [417/885] 3702343=test_stringchar I, [2024-05-19T00:19:04.520075 #3660991] INFO -- : [418/885] 3702330=test_uncorrectable_name_check I, [2024-05-19T00:19:04.527084 #3660991] INFO -- : [419/885] 3702330=newline_test I, [2024-05-19T00:19:04.543147 #3660991] INFO -- : [420/885] 3702341=test_stream I, [2024-05-19T00:19:04.551699 #3660991] INFO -- : [421/885] 3702341=test_nil2vtempty I, [2024-05-19T00:19:04.555371 #3660991] INFO -- : [422/885] 3702341=test_rdoc_context I, [2024-05-19T00:19:04.586367 #3660991] INFO -- : [423/885] 3702339=test_httpresponse I, [2024-05-19T00:19:04.588855 #3660991] INFO -- : [424/885] 3702332=test_open-uri I, [2024-05-19T00:19:04.606442 #3660991] INFO -- : [425/885] 3702343=test_rdoc_parser_ruby I, [2024-05-19T00:19:04.612769 #3660991] INFO -- : [426/885] 3702335=test_date_new I, [2024-05-19T00:19:04.622561 #3660991] INFO -- : [427/885] 3702335=index_write_test I, [2024-05-19T00:19:04.634922 #3660991] INFO -- : [428/885] 3702339=test_data I, [2024-05-19T00:19:04.641898 #3660991] INFO -- : [429/885] 3702339=test_require I, [2024-05-19T00:19:04.645606 #3660991] INFO -- : [430/885] 3702339=test_rdoc_markup_to_joined_paragraph I, [2024-05-19T00:19:04.650057 #3660991] INFO -- : [431/885] 3702339=test_date_time I, [2024-05-19T00:19:04.659938 #3660991] INFO -- : [432/885] 3702339=test_gem_safe_yaml I, [2024-05-19T00:19:04.680924 #3660991] INFO -- : [433/885] 3702339=test_syntax I, [2024-05-19T00:19:04.688997 #3660991] INFO -- : [434/885] 3702335=test_rdoc_text I, [2024-05-19T00:19:04.728652 #3660991] INFO -- : [435/885] 3702330=test_iso_8859 I, [2024-05-19T00:19:04.762906 #3660991] INFO -- : [436/885] 3702330=test_tcp I, [2024-05-19T00:19:04.780186 #3660991] INFO -- : [437/885] 3702335=test_gem_commands_specification_command I, [2024-05-19T00:19:04.812902 #3660991] INFO -- : [438/885] 3702330=test_enumerator I, [2024-05-19T00:19:04.901261 #3660991] INFO -- : [439/885] 3702335=test_flags I, [2024-05-19T00:19:04.957894 #3660991] INFO -- : [440/885] 3702344=test_inadvertent_creation I, [2024-05-19T00:19:05.021045 #3660991] INFO -- : [441/885] 3702326=test_gem_commands_which_command I, [2024-05-19T00:19:05.064181 #3660991] INFO -- : [442/885] 3702326=test_shift_jis I, [2024-05-19T00:19:05.066349 #3660991] INFO -- : [443/885] 3702326=test_http I, [2024-05-19T00:19:05.079361 #3660991] INFO -- : [444/885] 3702344=test_name_error I, [2024-05-19T00:19:05.095587 #3660991] INFO -- : [445/885] 3702326=test_rdoc_markup_attribute_manager I, [2024-05-19T00:19:05.098905 #3660991] INFO -- : [446/885] 3702334=test_safe_load I, [2024-05-19T00:19:05.106488 #3660991] INFO -- : [447/885] 3702334=test_gem_resolver_composed_set I, [2024-05-19T00:19:05.125559 #3660991] INFO -- : [448/885] 3702332=test_gem_resolver I, [2024-05-19T00:19:05.126361 #3660991] INFO -- : [449/885] 3702334=test_gem_commands_dependency_command I, [2024-05-19T00:19:05.132477 #3660991] INFO -- : [450/885] 3702326=test_rdoc_extend I, [2024-05-19T00:19:05.172730 #3660991] INFO -- : [451/885] 3702344=test_merge_keys I, [2024-05-19T00:19:05.183400 #3660991] INFO -- : [452/885] 3702344=test_gem_resolver_api_specification I, [2024-05-19T00:19:05.199461 #3660991] INFO -- : [453/885] 3702326=test_win32ole_variant I, [2024-05-19T00:19:05.208379 #3660991] INFO -- : [454/885] 3702326=test_ipaddr I, [2024-05-19T00:19:05.215716 #3660991] INFO -- : [455/885] 3702343=test_mixed_unicode_escapes I, [2024-05-19T00:19:05.220094 #3660991] INFO -- : [456/885] 3702343=test_history I, [2024-05-19T00:19:05.226803 #3660991] INFO -- : [457/885] 3702334=test_rdoc_markup_to_ansi I, [2024-05-19T00:19:05.228630 #3660991] INFO -- : [458/885] 3702343=test_rdoc_class_module I, [2024-05-19T00:19:05.237344 #3660991] INFO -- : [459/885] 3702326=test_bignum I, [2024-05-19T00:19:05.243118 #3660991] INFO -- : [460/885] 3702344=test_gem_ci_detector I, [2024-05-19T00:19:05.255175 #3660991] INFO -- : [461/885] 3702344=test_win32ole_variable I, [2024-05-19T00:19:05.263424 #3660991] INFO -- : [462/885] 3702344=test_stringio I, [2024-05-19T00:19:05.272167 #3660991] INFO -- : [463/885] 3702334=test_arity I, [2024-05-19T00:19:05.276026 #3660991] INFO -- : [464/885] 3702334=test_io_wait_uncommon I, [2024-05-19T00:19:05.286396 #3660991] INFO -- : [465/885] 3702334=test_trace I, [2024-05-19T00:19:05.300705 #3660991] INFO -- : [466/885] 3702334=ractor_test I, [2024-05-19T00:19:05.313597 #3660991] INFO -- : [467/885] 3702341=test_rdoc_generator_json_index I, [2024-05-19T00:19:05.341448 #3660991] INFO -- : [468/885] 3702341=test_win32ole_event I, [2024-05-19T00:19:05.351474 #3660991] INFO -- : [469/885] 3702341=test_time_tz I, [2024-05-19T00:19:05.357788 #3660991] INFO -- : [470/885] 3702326=test_have_macro I, [2024-05-19T00:19:05.382416 #3660991] INFO -- : [471/885] 3702344=test_gem_package I, [2024-05-19T00:19:05.389657 #3660991] INFO -- : [472/885] 3702341=test_resolve_symbol I, [2024-05-19T00:19:05.411167 #3660991] INFO -- : [473/885] 3702334=test_complex2 I, [2024-05-19T00:19:05.411773 #3660991] INFO -- : [474/885] 3702332=test_enum I, [2024-05-19T00:19:05.413081 #3660991] INFO -- : [475/885] 3702333=test_gem_specification I, [2024-05-19T00:19:05.418963 #3660991] INFO -- : [476/885] 3702334=test_threadgroup I, [2024-05-19T00:19:05.456125 #3660991] INFO -- : [477/885] 3702341=test_pkcs7 I, [2024-05-19T00:19:05.640277 #3660991] INFO -- : [478/885] 3702341=test_gem_resolver_requirement_list I, [2024-05-19T00:19:05.642518 #3660991] INFO -- : [479/885] 3702342=test_arith_seq_beg_len_step I, [2024-05-19T00:19:05.644870 #3660991] INFO -- : [480/885] 3702341=test_function_entry I, [2024-05-19T00:19:05.647967 #3660991] INFO -- : [481/885] 3702341=ruby_api_test I, [2024-05-19T00:19:05.720711 #3660991] INFO -- : [482/885] 3702342=test_find_executable I, [2024-05-19T00:19:05.749477 #3660991] INFO -- : [483/885] 3702342=test_coder I, [2024-05-19T00:19:05.763599 #3660991] INFO -- : [484/885] 3702326=test_symbol I, [2024-05-19T00:19:05.764117 #3660991] INFO -- : [485/885] 3702343=test_context I, [2024-05-19T00:19:05.764737 #3660991] INFO -- : [486/885] 3702342=test_gem_commands_pristine_command I, [2024-05-19T00:19:05.844928 #3660991] INFO -- : [487/885] 3702341=test_nofree I, [2024-05-19T00:19:05.846860 #3660991] INFO -- : [488/885] 3702341=test_unix I, [2024-05-19T00:19:05.879939 #3660991] INFO -- : [489/885] 3702343=test_lazy_enumerator I, [2024-05-19T00:19:05.880964 #3660991] INFO -- : [490/885] 3702341=test_enc_associate I, [2024-05-19T00:19:05.901532 #3660991] INFO -- : [491/885] 3702340=test_ractor_compatibility I, [2024-05-19T00:19:05.920379 #3660991] INFO -- : [492/885] 3702344=test_date_ractor I, [2024-05-19T00:19:05.943144 #3660991] INFO -- : [493/885] 3702335=test_gem_console_ui I, [2024-05-19T00:19:05.946834 #3660991] INFO -- : [494/885] 3702335=format_errors_test I, [2024-05-19T00:19:05.954125 #3660991] INFO -- : [495/885] 3702335=test_dir I, [2024-05-19T00:19:05.993866 #3660991] INFO -- : [496/885] 3702345=test_eval I, [2024-05-19T00:19:05.999765 #3660991] INFO -- : [497/885] 3702345=test_autoconf I, [2024-05-19T00:19:06.002333 #3660991] INFO -- : [498/885] 3702345=test_numeric I, [2024-05-19T00:19:06.018250 #3660991] INFO -- : [499/885] 3702345=test_member I, [2024-05-19T00:19:06.019237 #3660991] INFO -- : [500/885] 3702345=test_cgi_multipart I, [2024-05-19T00:19:06.090726 #3660991] INFO -- : [501/885] 3702344=test_gem_commands_cleanup_command I, [2024-05-19T00:19:06.171872 #3660991] INFO -- : [502/885] 3702345=test_word I, [2024-05-19T00:19:06.173126 #3660991] INFO -- : [503/885] 3702345=test_rdoc_generator_darkfish I, [2024-05-19T00:19:06.217084 #3660991] INFO -- : [504/885] 3702335=test_rdoc_comment I, [2024-05-19T00:19:06.257281 #3660991] INFO -- : [505/885] 3702335=test_error_highlight I, [2024-05-19T00:19:06.265177 #3660991] INFO -- : [506/885] 3702343=test_resize I, [2024-05-19T00:19:06.269029 #3660991] INFO -- : [507/885] 3702343=test_http_request I, [2024-05-19T00:19:06.303694 #3660991] INFO -- : [508/885] 3702343=test_gem_source_fetch_problem I, [2024-05-19T00:19:06.308557 #3660991] INFO -- : [509/885] 3702343=json_generic_object_test I, [2024-05-19T00:19:06.317039 #3660991] INFO -- : [510/885] 3702343=test_coderange I, [2024-05-19T00:19:06.319855 #3660991] INFO -- : [511/885] 3702343=location_test I, [2024-05-19T00:19:06.347463 #3660991] INFO -- : [512/885] 3702340=test_symbol I, [2024-05-19T00:19:06.367233 #3660991] INFO -- : [513/885] 3702340=test_mailto I, [2024-05-19T00:19:06.384699 #3660991] INFO -- : [514/885] 3702340=test_env I, [2024-05-19T00:19:06.387505 #3660991] INFO -- : [515/885] 3702332=test_rdoc_attr I, [2024-05-19T00:19:06.395437 #3660991] INFO -- : [516/885] 3702332=test_dryrun I, [2024-05-19T00:19:06.414047 #3660991] INFO -- : [517/885] 3702336=test_integer I, [2024-05-19T00:19:06.414658 #3660991] INFO -- : [518/885] 3702332=desugar_compiler_test I, [2024-05-19T00:19:06.419836 #3660991] INFO -- : [519/885] 3702334=test_gem_commands_setup_command I, [2024-05-19T00:19:06.432977 #3660991] INFO -- : [520/885] 3702343=test_super I, [2024-05-19T00:19:06.477377 #3660991] INFO -- : [521/885] 3702336=test_rubyoptions I, [2024-05-19T00:19:06.488037 #3660991] INFO -- : [522/885] 3702332=test_cgi_modruby I, [2024-05-19T00:19:06.494704 #3660991] INFO -- : [523/885] 3702341=test_integer I, [2024-05-19T00:19:06.498944 #3660991] INFO -- : [524/885] 3702344=test_call I, [2024-05-19T00:19:06.502439 #3660991] INFO -- : [525/885] 3702332=test_https_proxy I, [2024-05-19T00:19:06.521743 #3660991] INFO -- : [526/885] 3702332=test_rubygems I, [2024-05-19T00:19:06.545837 #3660991] INFO -- : [527/885] 3702345=test_gem_request_set_lockfile_tokenizer I, [2024-05-19T00:19:06.599923 #3660991] INFO -- : [528/885] 3702344=test_stat I, [2024-05-19T00:19:06.604694 #3660991] INFO -- : [529/885] 3702344=test_have_func I, [2024-05-19T00:19:06.613042 #3660991] INFO -- : [530/885] 3702345=test_nextafter I, [2024-05-19T00:19:06.682504 #3660991] INFO -- : [531/885] 3702345=test_capacity I, [2024-05-19T00:19:06.688889 #3660991] INFO -- : [532/885] 3702345=test_object_references I, [2024-05-19T00:19:06.703494 #3660991] INFO -- : [533/885] 3702345=test_usrmarshal I, [2024-05-19T00:19:06.759383 #3660991] INFO -- : [534/885] 3702335=test_gem_resolver_git_specification I, [2024-05-19T00:19:06.774805 #3660991] INFO -- : [535/885] 3702332=test_ssl I, [2024-05-19T00:19:06.937003 #3660991] INFO -- : [536/885] 3702345=test_my_integer I, [2024-05-19T00:19:06.942216 #3660991] INFO -- : [537/885] 3702345=json_ext_parser_test I, [2024-05-19T00:19:06.945912 #3660991] INFO -- : [538/885] 3702345=test_thread I, [2024-05-19T00:19:06.947206 #3660991] INFO -- : [539/885] 3702334=test_rendering I, [2024-05-19T00:19:06.979395 #3660991] INFO -- : [540/885] 3702335=test_debugger_integration I, [2024-05-19T00:19:06.997386 #3660991] INFO -- : [541/885] 3702334=test_ractor I, [2024-05-19T00:19:07.007040 #3660991] INFO -- : [542/885] 3702335=test_alias I, [2024-05-19T00:19:07.072355 #3660991] INFO -- : [543/885] 3702331=test_timeout I, [2024-05-19T00:19:07.149381 #3660991] INFO -- : [544/885] 3702342=test_marshal I, [2024-05-19T00:19:07.163229 #3660991] INFO -- : [545/885] 3702335=test_unicode_normalize I, [2024-05-19T00:19:07.260749 #3660991] INFO -- : [546/885] 3702332=test_nonblock I, [2024-05-19T00:19:07.266167 #3660991] INFO -- : [547/885] 3702332=test_weakref I, [2024-05-19T00:19:07.270002 #3660991] INFO -- : [548/885] 3702333=test_rb_str_dup I, [2024-05-19T00:19:07.272487 #3660991] INFO -- : [549/885] 3702343=test_reline_key I, [2024-05-19T00:19:07.276083 #3660991] INFO -- : [550/885] 3702333=test_ancdata I, [2024-05-19T00:19:07.278283 #3660991] INFO -- : [551/885] 3702333=test_singleton_function I, [2024-05-19T00:19:07.280352 #3660991] INFO -- : [552/885] 3702333=test_cgi_core I, [2024-05-19T00:19:07.290599 #3660991] INFO -- : [553/885] 3702343=test_parser I, [2024-05-19T00:19:07.296443 #3660991] INFO -- : [554/885] 3702333=parse_stream_test I, [2024-05-19T00:19:07.300984 #3660991] INFO -- : [555/885] 3702333=test_registry I, [2024-05-19T00:19:07.302458 #3660991] INFO -- : [556/885] 3702333=test_gem_source_lock I, [2024-05-19T00:19:07.309526 #3660991] INFO -- : [557/885] 3702343=test_gem I, [2024-05-19T00:19:07.350957 #3660991] INFO -- : [558/885] 3702333=test_ractor I, [2024-05-19T00:19:07.364526 #3660991] INFO -- : [559/885] 3702333=test_dns I, [2024-05-19T00:19:07.384543 #3660991] INFO -- : [560/885] 3702334=test_gem_commands_open_command I, [2024-05-19T00:19:07.415248 #3660991] INFO -- : [561/885] 3702332=test_range I, [2024-05-19T00:19:07.509827 #3660991] INFO -- : [562/885] 3702334=test_project_sanity I, [2024-05-19T00:19:07.554075 #3660991] INFO -- : [563/885] 3702334=test_dup I, [2024-05-19T00:19:07.727586 #3660991] INFO -- : [564/885] 3702334=test_pty I, [2024-05-19T00:19:07.824595 #3660991] INFO -- : [565/885] 3702342=test_constant I, [2024-05-19T00:19:07.854947 #3660991] INFO -- : [566/885] 3702333=command_line_test I, [2024-05-19T00:19:07.870852 #3660991] INFO -- : [567/885] 3702333=test_gem_uri_formatter I, [2024-05-19T00:19:07.885704 #3660991] INFO -- : [568/885] 3702333=test_helper I, [2024-05-19T00:19:07.892637 #3660991] INFO -- : [569/885] 3702333=test_erb_command I, [2024-05-19T00:19:07.896581 #3660991] INFO -- : [570/885] 3702331=test_encoding I, [2024-05-19T00:19:07.900321 #3660991] INFO -- : [571/885] 3702328=test_ts I, [2024-05-19T00:19:07.950110 #3660991] INFO -- : [572/885] 3702333=test_ensured I, [2024-05-19T00:19:08.012696 #3660991] INFO -- : [573/885] 3702333=library_symbols_test I, [2024-05-19T00:19:08.018328 #3660991] INFO -- : [574/885] 3702333=test_addr I, [2024-05-19T00:19:08.031081 #3660991] INFO -- : [575/885] 3702333=test_locale I, [2024-05-19T00:19:08.041613 #3660991] INFO -- : [576/885] 3702344=test_rdoc_ri_paths I, [2024-05-19T00:19:08.062332 #3660991] INFO -- : [577/885] 3702344=test_vm_dump I, [2024-05-19T00:19:08.064493 #3660991] INFO -- : [578/885] 3702344=test_tmpdir I, [2024-05-19T00:19:08.102277 #3660991] INFO -- : [579/885] 3702331=test_integer_comb I, [2024-05-19T00:19:08.144350 #3660991] INFO -- : [580/885] 3702333=test_rdoc_markup_document I, [2024-05-19T00:19:08.144691 #3660991] INFO -- : [581/885] 3702332=errors_test I, [2024-05-19T00:19:08.149044 #3660991] INFO -- : [582/885] 3702344=test_regexp I, [2024-05-19T00:19:08.160067 #3660991] INFO -- : [583/885] 3702333=test_gem_commands_check_command I, [2024-05-19T00:19:08.178240 #3660991] INFO -- : [584/885] 3702333=static_inspect_test I, [2024-05-19T00:19:08.185474 #3660991] INFO -- : [585/885] 3702333=test_data_error I, [2024-05-19T00:19:08.224319 #3660991] INFO -- : [586/885] 3702334=bom_test I, [2024-05-19T00:19:08.252804 #3660991] INFO -- : [587/885] 3702333=unescape_test I, [2024-05-19T00:19:08.265275 #3660991] INFO -- : [588/885] 3702332=test_ostruct I, [2024-05-19T00:19:08.305230 #3660991] INFO -- : [589/885] 3702334=test_file I, [2024-05-19T00:19:08.386073 #3660991] INFO -- : [590/885] 3702326=test_force_exit I, [2024-05-19T00:19:08.406320 #3660991] INFO -- : [591/885] 3702328=test_udp I, [2024-05-19T00:19:08.410413 #3660991] INFO -- : [592/885] 3702328=test_update I, [2024-05-19T00:19:08.417478 #3660991] INFO -- : [593/885] 3702328=test_fips I, [2024-05-19T00:19:08.427959 #3660991] INFO -- : [594/885] 3702332=test_x509name I, [2024-05-19T00:19:08.432977 #3660991] INFO -- : [595/885] 3702326=test_rdoc_code_object I, [2024-05-19T00:19:08.446333 #3660991] INFO -- : [596/885] 3702332=test_x509store I, [2024-05-19T00:19:08.716024 #3660991] INFO -- : [597/885] 3702328=test_webauthn_listener I, [2024-05-19T00:19:08.730307 #3660991] INFO -- : [598/885] 3702326=test_lambda I, [2024-05-19T00:19:08.770496 #3660991] INFO -- : [599/885] 3702328=test_gem_request_set_gem_dependency_api I, [2024-05-19T00:19:08.798837 #3660991] INFO -- : [600/885] 3702326=test_ast I, [2024-05-19T00:19:08.858234 #3660991] INFO -- : [601/885] 3702332=test_random_formatter I, [2024-05-19T00:19:08.876256 #3660991] INFO -- : [602/885] 3702332=test_helper I, [2024-05-19T00:19:08.877869 #3660991] INFO -- : [603/885] 3702332=test_jaro_winkler I, [2024-05-19T00:19:08.889422 #3660991] INFO -- : [604/885] 3702332=test_gem_safe_marshal I, [2024-05-19T00:19:08.956154 #3660991] INFO -- : [605/885] 3702328=test_gem_resolver_api_set I, [2024-05-19T00:19:09.004515 #3660991] INFO -- : [606/885] 3702328=test_config I, [2024-05-19T00:19:09.180119 #3660991] INFO -- : [607/885] 3702333=test_gem_resolver_vendor_set I, [2024-05-19T00:19:09.200651 #3660991] INFO -- : [608/885] 3702333=test_enumerable I, [2024-05-19T00:19:09.206284 #3660991] INFO -- : [609/885] 3702333=test_eval I, [2024-05-19T00:19:09.324150 #3660991] INFO -- : [610/885] 3702340=json_generator_test I, [2024-05-19T00:19:09.367256 #3660991] INFO -- : [611/885] 3702343=test_transcode I, [2024-05-19T00:19:09.403483 #3660991] INFO -- : [612/885] 3702332=test_logger I, [2024-05-19T00:19:09.415424 #3660991] INFO -- : [613/885] 3702332=test_file_exhaustive I, [2024-05-19T00:19:09.418280 #3660991] INFO -- : [614/885] 3702333=test_files_test I, [2024-05-19T00:19:09.426165 #3660991] INFO -- : [615/885] 3702340=test_gem_update_suggestion I, [2024-05-19T00:19:09.442874 #3660991] INFO -- : [616/885] 3702341=test_rdoc_parser_markdown I, [2024-05-19T00:19:09.456410 #3660991] INFO -- : [617/885] 3702328=test_import I, [2024-05-19T00:19:09.457297 #3660991] INFO -- : [618/885] 3702341=test_gem_resolver_lock_set I, [2024-05-19T00:19:09.467855 #3660991] INFO -- : [619/885] 3702340=test_not I, [2024-05-19T00:19:09.473774 #3660991] INFO -- : [620/885] 3702340=test_gem_package_task I, [2024-05-19T00:19:09.476746 #3660991] INFO -- : [621/885] 3702340=test_date_strptime I, [2024-05-19T00:19:09.477969 #3660991] INFO -- : [622/885] 3702341=test_placearg I, [2024-05-19T00:19:09.505971 #3660991] INFO -- : [623/885] 3702333=test_rdoc_markup_hard_break I, [2024-05-19T00:19:09.509907 #3660991] INFO -- : [624/885] 3702333=test_gem_platform I, [2024-05-19T00:19:09.546652 #3660991] INFO -- : [625/885] 3702340=test_pkey_rsa I, [2024-05-19T00:19:09.590938 #3660991] INFO -- : [626/885] 3702333=test_gem_commands_push_command I, [2024-05-19T00:19:09.596296 #3660991] INFO -- : [627/885] 3702343=test_weakkeymap I, [2024-05-19T00:19:09.612368 #3660991] INFO -- : [628/885] 3702341=test_numhash I, [2024-05-19T00:19:09.617902 #3660991] INFO -- : [629/885] 3702341=test_fd_setsize I, [2024-05-19T00:19:09.621633 #3660991] INFO -- : [630/885] 3702341=test_continuation I, [2024-05-19T00:19:09.627390 #3660991] INFO -- : [631/885] 3702341=test_keyword I, [2024-05-19T00:19:09.847842 #3660991] INFO -- : [632/885] 3702343=test_class_name_check I, [2024-05-19T00:19:09.856828 #3660991] INFO -- : [633/885] 3702340=test_delete I, [2024-05-19T00:19:09.857992 #3660991] INFO -- : [634/885] 3702343=test_win32ole_method I, [2024-05-19T00:19:09.862674 #3660991] INFO -- : [635/885] 3702343=test_date_arith I, [2024-05-19T00:19:09.871826 #3660991] INFO -- : [636/885] 3702343=test_object I, [2024-05-19T00:19:09.875885 #3660991] INFO -- : [637/885] 3702340=test_ruby_lex I, [2024-05-19T00:19:09.989214 #3660991] INFO -- : [638/885] 3702340=test_gem_local_remote_options I, [2024-05-19T00:19:10.030080 #3660991] INFO -- : [639/885] 3702340=test_sleep I, [2024-05-19T00:19:10.082841 #3660991] INFO -- : [640/885] 3702333=test_change_word I, [2024-05-19T00:19:10.101780 #3660991] INFO -- : [641/885] 3702333=test_flip I, [2024-05-19T00:19:10.126700 #3660991] INFO -- : [642/885] 3702333=compiler_test I, [2024-05-19T00:19:10.134632 #3660991] INFO -- : [643/885] 3702333=test_timeout I, [2024-05-19T00:19:10.141023 #3660991] INFO -- : [644/885] 3702331=test_ossl I, [2024-05-19T00:19:10.142078 #3660991] INFO -- : [645/885] 3702333=test_normalize I, [2024-05-19T00:19:10.146393 #3660991] INFO -- : [646/885] 3702333=test_rdoc_rd_block_parser I, [2024-05-19T00:19:10.154558 #3660991] INFO -- : [647/885] 3702341=test_signedness I, [2024-05-19T00:19:10.198947 #3660991] INFO -- : [648/885] 3702333=test_tsort I, [2024-05-19T00:19:10.217182 #3660991] INFO -- : [649/885] 3702333=test_ractor I, [2024-05-19T00:19:10.254080 #3660991] INFO -- : [650/885] 3702333=test_type I, [2024-05-19T00:19:10.257209 #3660991] INFO -- : [651/885] 3702333=test_func I, [2024-05-19T00:19:10.273215 #3660991] INFO -- : [652/885] 3702343=test_big5 I, [2024-05-19T00:19:10.278967 #3660991] INFO -- : [653/885] 3702343=test_pointer I, [2024-05-19T00:19:10.340272 #3660991] INFO -- : [654/885] 3702342=version_test I, [2024-05-19T00:19:10.345673 #3660991] INFO -- : [655/885] 3702342=test_cgi_header I, [2024-05-19T00:19:10.352916 #3660991] INFO -- : [656/885] 3702342=heredoc_dedent_test I, [2024-05-19T00:19:10.356009 #3660991] INFO -- : [657/885] 3702342=test_object I, [2024-05-19T00:19:10.361155 #3660991] INFO -- : [658/885] 3702342=test_arithmetic_sequence I, [2024-05-19T00:19:10.367169 #3660991] INFO -- : [659/885] 3702342=test_key_actor_emacs I, [2024-05-19T00:19:10.445965 #3660991] INFO -- : [660/885] 3702328=test_basicinstructions I, [2024-05-19T00:19:10.453461 #3660991] INFO -- : [661/885] 3702342=test_gem_gemcutter_utilities I, [2024-05-19T00:19:10.518154 #3660991] INFO -- : [662/885] 3702328=test_gem_command_manager I, [2024-05-19T00:19:10.598238 #3660991] INFO -- : [663/885] 3702328=test_sockopt I, [2024-05-19T00:19:10.604296 #3660991] INFO -- : [664/885] 3702328=test_install I, [2024-05-19T00:19:10.751653 #3660991] INFO -- : [665/885] 3702328=test_rdoc_markup_to_label I, [2024-05-19T00:19:10.760523 #3660991] INFO -- : [666/885] 3702342=test_httpheader I, [2024-05-19T00:19:10.782585 #3660991] INFO -- : [667/885] 3702328=test_gem_resolver_local_specification I, [2024-05-19T00:19:10.809804 #3660991] INFO -- : [668/885] 3702328=test_rdoc_ri_driver I, [2024-05-19T00:19:10.820273 #3660991] INFO -- : [669/885] 3702342=test_set_len I, [2024-05-19T00:19:10.821644 #3660991] INFO -- : [670/885] 3702342=test_encoding I, [2024-05-19T00:19:10.840845 #3660991] INFO -- : [671/885] 3702342=test_httpresponses I, [2024-05-19T00:19:10.841754 #3660991] INFO -- : [672/885] 3702342=test_key_stroke I, [2024-05-19T00:19:10.850974 #3660991] INFO -- : [673/885] 3702342=json_encoding_test I, [2024-05-19T00:19:10.854084 #3660991] INFO -- : [674/885] 3702342=test_color I, [2024-05-19T00:19:10.921629 #3660991] INFO -- : [675/885] 3702342=test_rbconfig I, [2024-05-19T00:19:10.928111 #3660991] INFO -- : [676/885] 3702342=test_primitive I, [2024-05-19T00:19:10.936535 #3660991] INFO -- : [677/885] 3702342=test_human_typo I, [2024-05-19T00:19:10.939712 #3660991] INFO -- : [678/885] 3702343=test_chilled I, [2024-05-19T00:19:10.942440 #3660991] INFO -- : [679/885] 3702343=test_name_error_extension I, [2024-05-19T00:19:10.944662 #3660991] INFO -- : [680/885] 3702342=test_rdoc_i18n_locale I, [2024-05-19T00:19:10.946064 #3660991] INFO -- : [681/885] 3702343=test_document I, [2024-05-19T00:19:10.951498 #3660991] INFO -- : [682/885] 3702343=test_acceptable I, [2024-05-19T00:19:10.953423 #3660991] INFO -- : [683/885] 3702342=test_euc_jp I, [2024-05-19T00:19:10.955325 #3660991] INFO -- : [684/885] 3702342=test_rdoc_generator_pot_po_entry I, [2024-05-19T00:19:10.961307 #3660991] INFO -- : [685/885] 3702342=test_pair I, [2024-05-19T00:19:11.071096 #3660991] INFO -- : [686/885] 3702343=test_win32ole_param I, [2024-05-19T00:19:11.074079 #3660991] INFO -- : [687/885] 3702343=test_gem_commands_yank_command I, [2024-05-19T00:19:11.126616 #3660991] INFO -- : [688/885] 3702328=test_rdoc_generator_pot I, [2024-05-19T00:19:11.133334 #3660991] INFO -- : [689/885] 3702328=test_rdoc_parser_changelog I, [2024-05-19T00:19:11.183499 #3660991] INFO -- : [690/885] 3702328=test_enumerator I, [2024-05-19T00:19:11.184970 #3660991] INFO -- : [691/885] 3702328=test_koi8 I, [2024-05-19T00:19:11.189325 #3660991] INFO -- : [692/885] 3702328=parameters_signature_test I, [2024-05-19T00:19:11.296432 #3660991] INFO -- : [693/885] 3702328=test_unicode I, [2024-05-19T00:19:11.310408 #3660991] INFO -- : [694/885] 3702328=test_rdoc_method_attr I, [2024-05-19T00:19:11.339971 #3660991] INFO -- : [695/885] 3702338=test_filter I, [2024-05-19T00:19:11.390844 #3660991] INFO -- : [696/885] 3702338=test_gem_gem_runner I, [2024-05-19T00:19:11.421562 #3660991] INFO -- : [697/885] 3702328=static_literals_test I, [2024-05-19T00:19:11.426913 #3660991] INFO -- : [698/885] 3702328=test_data I, [2024-05-19T00:19:11.435174 #3660991] INFO -- : [699/885] 3702328=test_gem_resolver_vendor_specification I, [2024-05-19T00:19:11.439638 #3660991] INFO -- : [700/885] 3702338=test_gem_commands_update_command I, [2024-05-19T00:19:11.461729 #3660991] INFO -- : [701/885] 3702328=test_gem_uri I, [2024-05-19T00:19:11.484840 #3660991] INFO -- : [702/885] 3702328=test_key_event_record I, [2024-05-19T00:19:11.485192 #3660991] INFO -- : [703/885] 3702328=test_notimplement I, [2024-05-19T00:19:11.493614 #3660991] INFO -- : [704/885] 3702328=test_random I, [2024-05-19T00:19:11.506684 #3660991] INFO -- : [705/885] 3702328=test_ssl_session I, [2024-05-19T00:19:11.557648 #3660991] INFO -- : [706/885] 3702343=test_thread_cv I, [2024-05-19T00:19:11.729852 #3660991] INFO -- : [707/885] 3702337=test_lexer I, [2024-05-19T00:19:11.742100 #3660991] INFO -- : [708/885] 3702337=test_terminfo I, [2024-05-19T00:19:11.743536 #3660991] INFO -- : [709/885] 3702337=test_compile_prism I, [2024-05-19T00:19:12.084067 #3660991] INFO -- : [710/885] 3702337=test_bug-14834 I, [2024-05-19T00:19:12.147673 #3660991] INFO -- : [711/885] 3702337=test_date_compat I, [2024-05-19T00:19:12.153311 #3660991] INFO -- : [712/885] 3702337=test_rdoc_markup_to_html I, [2024-05-19T00:19:12.192396 #3660991] INFO -- : [713/885] 3702343=test_tree_spell_checker I, [2024-05-19T00:19:12.238591 #3660991] INFO -- : [714/885] 3702343=test_addrinfo I, [2024-05-19T00:19:12.246025 #3660991] INFO -- : [715/885] 3702337=test_http I, [2024-05-19T00:19:12.277498 #3660991] INFO -- : [716/885] 3702343=test_bn I, [2024-05-19T00:19:12.301323 #3660991] INFO -- : [717/885] 3702343=test_win32ole_param_event I, [2024-05-19T00:19:12.307606 #3660991] INFO -- : [718/885] 3702343=test_path I, [2024-05-19T00:19:12.314427 #3660991] INFO -- : [719/885] 3702343=redundant_return_test I, [2024-05-19T00:19:12.316484 #3660991] INFO -- : [720/885] 3702343=test_case_mapping I, [2024-05-19T00:19:12.317306 #3660991] INFO -- : [721/885] 3702341=test_exception_at_throwing I, [2024-05-19T00:19:12.323185 #3660991] INFO -- : [722/885] 3702343=test_iseq I, [2024-05-19T00:19:12.351377 #3660991] INFO -- : [723/885] 3702330=test_rdoc_markup_heading I, [2024-05-19T00:19:12.361791 #3660991] INFO -- : [724/885] 3702330=test_scheduler I, [2024-05-19T00:19:12.410538 #3660991] INFO -- : [725/885] 3702341=test_ocsp I, [2024-05-19T00:19:12.424806 #3660991] INFO -- : [726/885] 3702328=test_class I, [2024-05-19T00:19:12.438145 #3660991] INFO -- : [727/885] 3702328=test_pkey_dsa I, [2024-05-19T00:19:12.459138 #3660991] INFO -- : [728/885] 3702339=test_interned_str I, [2024-05-19T00:19:12.465152 #3660991] INFO -- : [729/885] 3702339=test_case_comprehensive I, [2024-05-19T00:19:12.503836 #3660991] INFO -- : [730/885] 3702330=test_gem_commands_build_command I, [2024-05-19T00:19:12.552053 #3660991] INFO -- : [731/885] 3702338=test_append I, [2024-05-19T00:19:12.563340 #3660991] INFO -- : [732/885] 3702338=test_option I, [2024-05-19T00:19:12.597777 #3660991] INFO -- : [733/885] 3702335=test_cmethod I, [2024-05-19T00:19:12.599822 #3660991] INFO -- : [734/885] 3702335=test_tracer I, [2024-05-19T00:19:12.606071 #3660991] INFO -- : [735/885] 3702335=test_io_m17n I, [2024-05-19T00:19:12.669497 #3660991] INFO -- : [736/885] 3702341=test_variable_name_check I, [2024-05-19T00:19:12.677895 #3660991] INFO -- : [737/885] 3702338=test_did_you_mean I, [2024-05-19T00:19:12.698238 #3660991] INFO -- : [738/885] 3702341=test_gem_commands_server_command I, [2024-05-19T00:19:12.704716 #3660991] INFO -- : [739/885] 3702341=test_recursion I, [2024-05-19T00:19:12.712629 #3660991] INFO -- : [740/885] 3702341=test_exit I, [2024-05-19T00:19:12.721121 #3660991] INFO -- : [741/885] 3702330=test_delegate I, [2024-05-19T00:19:12.751195 #3660991] INFO -- : [742/885] 3702330=test_popen_deadlock I, [2024-05-19T00:19:12.758560 #3660991] INFO -- : [743/885] 3702338=test_history I, [2024-05-19T00:19:12.762853 #3660991] INFO -- : [744/885] 3702341=test_mkmf I, [2024-05-19T00:19:12.783851 #3660991] INFO -- : [745/885] 3702341=test_date_marshal I, [2024-05-19T00:19:12.792635 #3660991] INFO -- : [746/885] 3702341=test_multi_irb_commands I, [2024-05-19T00:19:12.792699 #3660991] INFO -- : [747/885] 3702341=test_fiber I, [2024-05-19T00:19:12.797715 #3660991] INFO -- : [748/885] 3702338=test_open3 I, [2024-05-19T00:19:13.015148 #3660991] INFO -- : [749/885] 3702343=test_closure I, [2024-05-19T00:19:13.024366 #3660991] INFO -- : [750/885] 3702333=test_bundled_ca I, [2024-05-19T00:19:13.348095 #3660991] INFO -- : [751/885] 3702330=test_digest I, [2024-05-19T00:19:13.363099 #3660991] INFO -- : [752/885] 3702330=test_ractor I, [2024-05-19T00:19:13.430018 #3660991] INFO -- : [753/885] 3702330=test_gem_security I, [2024-05-19T00:19:13.604725 #3660991] INFO -- : [754/885] 3702343=test_rdoc_servlet I, [2024-05-19T00:19:13.672300 #3660991] INFO -- : [755/885] 3702328=test_files_lib I, [2024-05-19T00:19:13.740745 #3660991] INFO -- : [756/885] 3702343=test_gem_commands_unpack_command I, [2024-05-19T00:19:13.898129 #3660991] INFO -- : [757/885] 3702335=test_beginendblock I, [2024-05-19T00:19:13.982216 #3660991] INFO -- : [758/885] 3702343=test_rdoc_markup_to_bs I, [2024-05-19T00:19:14.008228 #3660991] INFO -- : [759/885] 3702343=test_help I, [2024-05-19T00:19:14.012229 #3660991] INFO -- : [760/885] 3702343=test_emoji_breaks I, [2024-05-19T00:19:14.017819 #3660991] INFO -- : [761/885] 3702343=test_gem_bundler_version_finder I, [2024-05-19T00:19:14.040861 #3660991] INFO -- : [762/885] 3702343=test_within_pipe I, [2024-05-19T00:19:14.059341 #3660991] INFO -- : [763/885] 3702343=reflection_test I, [2024-05-19T00:19:14.063206 #3660991] INFO -- : [764/885] 3702329=test_pinned I, [2024-05-19T00:19:14.067949 #3660991] INFO -- : [765/885] 3702343=test_printf I, [2024-05-19T00:19:14.078695 #3660991] INFO -- : [766/885] 3702343=test_rdoc_markup_pre_process I, [2024-05-19T00:19:14.099840 #3660991] INFO -- : [767/885] 3702329=test_to_ary_concat I, [2024-05-19T00:19:14.158574 #3660991] INFO -- : [768/885] 3702343=test_time I, [2024-05-19T00:19:14.227289 #3660991] INFO -- : [769/885] 3702335=test_webauthn_listener_response I, [2024-05-19T00:19:14.273978 #3660991] INFO -- : [770/885] 3702335=test_stream I, [2024-05-19T00:19:14.288208 #3660991] INFO -- : [771/885] 3702335=test_shellwords I, [2024-05-19T00:19:14.302642 #3660991] INFO -- : [772/885] 3702335=test_debug I, [2024-05-19T00:19:14.308939 #3660991] INFO -- : [773/885] 3702335=test_memory_view I, [2024-05-19T00:19:14.311285 #3660991] INFO -- : [774/885] 3702342=pattern_test I, [2024-05-19T00:19:14.335307 #3660991] INFO -- : [775/885] 3702342=test_string I, [2024-05-19T00:19:14.336871 #3660991] INFO -- : [776/885] 3702342=test_iterator I, [2024-05-19T00:19:14.338444 #3660991] INFO -- : [777/885] 3702335=test_omap I, [2024-05-19T00:19:14.344869 #3660991] INFO -- : [778/885] 3702335=test_digest_extend I, [2024-05-19T00:19:14.356085 #3660991] INFO -- : [779/885] 3702333=test_storage I, [2024-05-19T00:19:14.364705 #3660991] INFO -- : [780/885] 3702333=test_gem_resolver_git_set I, [2024-05-19T00:19:14.368980 #3660991] INFO -- : [781/885] 3702343=test_cipher I, [2024-05-19T00:19:14.385705 #3660991] INFO -- : [782/885] 3702335=test_gem_security_signer I, [2024-05-19T00:19:14.395585 #3660991] INFO -- : [783/885] 3702334=test_new I, [2024-05-19T00:19:14.398754 #3660991] INFO -- : [784/885] 3702334=test_dir_m17n I, [2024-05-19T00:19:14.408737 #3660991] INFO -- : [785/885] 3702343=test_gem_resolver_installer_set I, [2024-05-19T00:19:14.439786 #3660991] INFO -- : [786/885] 3702342=test_regex_casefold I, [2024-05-19T00:19:14.495421 #3660991] INFO -- : [787/885] 3702335=test_gem_commands_signout_command I, [2024-05-19T00:19:14.514039 #3660991] INFO -- : [788/885] 3702335=test_refinement I, [2024-05-19T00:19:14.581892 #3660991] INFO -- : [789/885] 3702343=test_gem_source_git I, [2024-05-19T00:19:14.698766 #3660991] INFO -- : [790/885] 3702333=test_float I, [2024-05-19T00:19:14.822530 #3660991] INFO -- : [791/885] 3702329=test_require I, [2024-05-19T00:19:15.039311 #3660991] INFO -- : [792/885] 3702340=test_cgi_cookie I, [2024-05-19T00:19:15.040559 #3660991] INFO -- : [793/885] 3702342=test_windows_1252 I, [2024-05-19T00:19:15.048436 #3660991] INFO -- : [794/885] 3702340=test_input_method I, [2024-05-19T00:19:15.053252 #3660991] INFO -- : [795/885] 3702342=test_process I, [2024-05-19T00:19:15.078283 #3660991] INFO -- : [796/885] 3702342=test_signal I, [2024-05-19T00:19:15.083661 #3660991] INFO -- : [797/885] 3702343=test_fixnum I, [2024-05-19T00:19:15.087738 #3660991] INFO -- : [798/885] 3702340=test_x509crl I, [2024-05-19T00:19:15.105279 #3660991] INFO -- : [799/885] 3702343=test_cgi_session I, [2024-05-19T00:19:15.118355 #3660991] INFO -- : [800/885] 3702343=test_rdoc_rd I, [2024-05-19T00:19:15.119456 #3660991] INFO -- : [801/885] 3702343=test_rdoc_top_level I, [2024-05-19T00:19:15.273942 #3660991] INFO -- : [802/885] 3702340=test_metaclass I, [2024-05-19T00:19:15.277539 #3660991] INFO -- : [803/885] 3702338=test_deprecated I, [2024-05-19T00:19:15.281757 #3660991] INFO -- : [804/885] 3702340=test_color_printer I, [2024-05-19T00:19:15.288644 #3660991] INFO -- : [805/885] 3702338=test_insns_leaf I, [2024-05-19T00:19:15.295070 #3660991] INFO -- : [806/885] 3702340=test_serialize_subclasses I, [2024-05-19T00:19:15.297777 #3660991] INFO -- : [807/885] 3702338=test_key_error I, [2024-05-19T00:19:15.300017 #3660991] INFO -- : [808/885] 3702340=test_engine I, [2024-05-19T00:19:15.302225 #3660991] INFO -- : [809/885] 3702340=test_win32ole_variant_m I, [2024-05-19T00:19:15.303119 #3660991] INFO -- : [810/885] 3702340=test_div I, [2024-05-19T00:19:15.304001 #3660991] INFO -- : [811/885] 3702338=test_allocation I, [2024-05-19T00:19:15.307704 #3660991] INFO -- : [812/885] 3702340=test_rdoc_rd_inline I, [2024-05-19T00:19:15.315417 #3660991] INFO -- : [813/885] 3702340=test_x509req I, [2024-05-19T00:19:15.455463 #3660991] INFO -- : [814/885] 3702343=test_mutex I, [2024-05-19T00:19:15.503186 #3660991] INFO -- : [815/885] 3702340=test_set I, [2024-05-19T00:19:15.534627 #3660991] INFO -- : [816/885] 3702340=test_struct I, [2024-05-19T00:19:15.695602 #3660991] INFO -- : [817/885] 3702336=test_gem_path_support I, [2024-05-19T00:19:15.747372 #3660991] INFO -- : [818/885] 3702336=test_files_test_1 I, [2024-05-19T00:19:15.821363 #3660991] INFO -- : [819/885] 3702332=test_config I, [2024-05-19T00:19:15.862411 #3660991] INFO -- : [820/885] 3702332=test_nomethod_error I, [2024-05-19T00:19:15.867001 #3660991] INFO -- : [821/885] 3702332=json_parser_test I, [2024-05-19T00:19:15.891149 #3660991] INFO -- : [822/885] 3702334=memsize_test I, [2024-05-19T00:19:15.892543 #3660991] INFO -- : [823/885] 3702334=test_dln I, [2024-05-19T00:19:15.898381 #3660991] INFO -- : [824/885] 3702334=test_gem_source_subpath_problem I, [2024-05-19T00:19:15.921287 #3660991] INFO -- : [825/885] 3702332=json_common_interface_test I, [2024-05-19T00:19:15.932710 #3660991] INFO -- : [826/885] 3702332=test_win32ole_variant_outarg I, [2024-05-19T00:19:15.942318 #3660991] INFO -- : [827/885] 3702332=fuzzer_test I, [2024-05-19T00:19:15.951135 #3660991] INFO -- : [828/885] 3702332=test_rdoc_markup_include I, [2024-05-19T00:19:15.957601 #3660991] INFO -- : [829/885] 3702332=test_sexp I, [2024-05-19T00:19:15.973508 #3660991] INFO -- : [830/885] 3702332=test_variable I, [2024-05-19T00:19:15.990370 #3660991] INFO -- : [831/885] 3702345=test_struct I, [2024-05-19T00:19:16.018237 #3660991] INFO -- : [832/885] 3702345=test_rdoc_markup_to_html_snippet I, [2024-05-19T00:19:16.039593 #3660991] INFO -- : [833/885] 3702334=magic_comment_test I, [2024-05-19T00:19:16.045458 #3660991] INFO -- : [834/885] 3702334=test_cparser I, [2024-05-19T00:19:16.074037 #3660991] INFO -- : [835/885] 3702345=test_pkg_config I, [2024-05-19T00:19:16.083238 #3660991] INFO -- : [836/885] 3702332=test_rdoc_generator_markup I, [2024-05-19T00:19:16.085461 #3660991] INFO -- : [837/885] 3702345=test_whileuntil I, [2024-05-19T00:19:16.092859 #3660991] INFO -- : [838/885] 3702345=test_buffered_io I, [2024-05-19T00:19:16.094328 #3660991] INFO -- : [839/885] 3702332=test_monitor I, [2024-05-19T00:19:16.203141 #3660991] INFO -- : [840/885] 3702345=test_configuration I, [2024-05-19T00:19:16.250157 #3660991] INFO -- : [841/885] 3702333=test_rubyvm I, [2024-05-19T00:19:16.253599 #3660991] INFO -- : [842/885] 3702333=test_stringify_symbols I, [2024-05-19T00:19:16.259277 #3660991] INFO -- : [843/885] 3702333=integer_parse_test I, [2024-05-19T00:19:16.263102 #3660991] INFO -- : [844/885] 3702333=test_instrumentation_api I, [2024-05-19T00:19:16.269410 #3660991] INFO -- : [845/885] 3702340=test_boolean I, [2024-05-19T00:19:16.271984 #3660991] INFO -- : [846/885] 3702340=test_gem_request_set I, [2024-05-19T00:19:16.302400 #3660991] INFO -- : [847/885] 3702345=test_module I, [2024-05-19T00:19:16.309937 #3660991] INFO -- : [848/885] 3702332=test_gem_ext_cargo_builder I, [2024-05-19T00:19:16.326497 #3660991] INFO -- : [849/885] 3702332=test_ssl I, [2024-05-19T00:19:16.479274 #3660991] INFO -- : [850/885] 3702331=constant_path_node_test I, [2024-05-19T00:19:16.482423 #3660991] INFO -- : [851/885] 3702331=test_parser I, [2024-05-19T00:19:16.512274 #3660991] INFO -- : [852/885] 3702331=test_arith_seq_extract I, [2024-05-19T00:19:16.588589 #3660991] INFO -- : [853/885] 3702343=test_method_name_check I, [2024-05-19T00:19:16.607756 #3660991] INFO -- : [854/885] 3702343=test_gem_commands_cert_command I, [2024-05-19T00:19:16.609195 #3660991] INFO -- : [855/885] 3702340=test_completion I, [2024-05-19T00:19:16.632052 #3660991] INFO -- : [856/885] 3702331=test_len I, [2024-05-19T00:19:16.635396 #3660991] INFO -- : [857/885] 3702331=test_yield_block I, [2024-05-19T00:19:16.639188 #3660991] INFO -- : [858/885] 3702331=test_x509ext I, [2024-05-19T00:19:16.644913 #3660991] INFO -- : [859/885] 3702331=test_erb I, [2024-05-19T00:19:16.692533 #3660991] INFO -- : [860/885] 3702331=test_gem_source_installed I, [2024-05-19T00:19:16.729464 #3660991] INFO -- : [861/885] 3702331=test_assembler I, [2024-05-19T00:19:16.729652 #3660991] INFO -- : [862/885] 3702331=test_propertyputref I, [2024-05-19T00:19:16.736957 #3660991] INFO -- : [863/885] 3702331=attribute_write_test I, [2024-05-19T00:19:16.749023 #3660991] INFO -- : [864/885] 3702331=test_spell_checker I, [2024-05-19T00:19:16.754333 #3660991] INFO -- : [865/885] 3702331=test_rational2 I, [2024-05-19T00:19:16.766282 #3660991] INFO -- : [866/885] 3702331=test_rational I, [2024-05-19T00:19:16.776628 #3660991] INFO -- : [867/885] 3702334=test_gem_commands_outdated_command I, [2024-05-19T00:19:16.798759 #3660991] INFO -- : [868/885] 3702331=test_array I, [2024-05-19T00:19:16.829660 #3660991] INFO -- : [869/885] 3702334=test_gem_package_tar_writer I, [2024-05-19T00:19:16.926504 #3660991] INFO -- : [870/885] 3702334=test_helper_method I, [2024-05-19T00:19:17.001607 #3660991] INFO -- : [871/885] 3702334=test_gem_source I, [2024-05-19T00:19:17.095534 #3660991] INFO -- : [872/885] 3702340=test_scalar_scanner I, [2024-05-19T00:19:17.107210 #3660991] INFO -- : [873/885] 3702340=test_win32ole_method_event I, [2024-05-19T00:19:17.111518 #3660991] INFO -- : [874/885] 3702340=test_nesting_parser I, [2024-05-19T00:19:17.131855 #3660991] INFO -- : [875/885] 3702340=test_gem_dependency_list I, [2024-05-19T00:19:17.181722 #3660991] INFO -- : [876/885] 3702340=test_benchmark I, [2024-05-19T00:19:17.184354 #3660991] INFO -- : [877/885] 3702342=test_evaluation I, [2024-05-19T00:19:17.193623 #3660991] INFO -- : [878/885] 3702342=test_https I, [2024-05-19T00:19:17.229233 #3660991] INFO -- : [879/885] 3702334=test_gem_ext_builder I, [2024-05-19T00:19:17.331197 #3660991] INFO -- : [880/885] 3702329=test_rdoc_parser_simple I, [2024-05-19T00:19:17.332064 #3660991] INFO -- : [881/885] 3702328=test_load I, [2024-05-19T00:19:17.333795 #3660991] INFO -- : [882/885] 3702328=test_gem_commands_rebuild_command I, [2024-05-19T00:19:17.339433 #3660991] INFO -- : [883/885] 3702329=test_yamldbm I, [2024-05-19T00:19:17.351156 #3660991] INFO -- : [884/885] 3702329=test_abi I, [2024-05-19T00:19:17.403351 #3660991] INFO -- : [885/885] 3702328=test_provider I, [2024-05-19T00:19:34.506075 #3660991] INFO -- : Finished tests in 36.967318s, 714.1714 tests/s, 253033.3961 assertions/s. I, [2024-05-19T00:19:34.506891 #3660991] INFO -- : 26401 tests, 9353966 assertions, 0 failures, 0 errors, 304 skips I, [2024-05-19T00:19:34.506923 #3660991] INFO -- : I, [2024-05-19T00:19:34.506932 #3660991] INFO -- : ruby -v: ruby 3.4.0dev (2024-05-18T15:29:00Z master dbbaf871de) [x86_64-linux] I, [2024-05-19T00:19:34.509312 #3660991] INFO -- : $$$[end] "make yes-test-all TESTOPTS='--stderr-on-failure' TESTS='-j20'" exit with 0. I, [2024-05-19T00:19:34.509465 #3660991] INFO -- : $$$[beg] make yes-test-rubyspec MSPECOPT='--error-output stderr --debug -j' TESTS='-j20' I, [2024-05-19T00:19:34.608335 #3660991] INFO -- : BASERUBY = /usr/bin/ruby --disable=gems I, [2024-05-19T00:19:34.608396 #3660991] INFO -- : CC = gcc I, [2024-05-19T00:19:34.608411 #3660991] INFO -- : LD = ld I, [2024-05-19T00:19:34.608429 #3660991] INFO -- : LDSHARED = gcc -shared I, [2024-05-19T00:19:34.608442 #3660991] INFO -- : CFLAGS = -O3 -fno-fast-math -ggdb3 -Wall -Wextra -Wdeprecated-declarations -Wdiv-by-zero -Wduplicated-cond -Wimplicit-function-declaration -Wimplicit-int -Wpointer-arith -Wwrite-strings -Wold-style-definition -Wimplicit-fallthrough=0 -Wmissing-noreturn -Wno-cast-function-type -Wno-constant-logical-operand -Wno-long-long -Wno-missing-field-initializers -Wno-overlength-strings -Wno-packed-bitfield-compat -Wno-parentheses-equality -Wno-self-assign -Wno-tautological-compare -Wno-unused-parameter -Wno-unused-value -Wsuggest-attribute=format -Wsuggest-attribute=noreturn -Wunused-variable -Wmisleading-indentation -Wundef -fPIC I, [2024-05-19T00:19:34.608456 #3660991] INFO -- : XCFLAGS = -U_FORTIFY_SOURCE -D_FORTIFY_SOURCE=2 -fstack-protector-strong -fno-strict-overflow -fvisibility=hidden -fexcess-precision=standard -DRUBY_EXPORT -I. -I.ext/include/x86_64-linux -I/tmp/ruby/src/trunk/include -I/tmp/ruby/src/trunk -I/tmp/ruby/src/trunk/prism -I/tmp/ruby/src/trunk/enc/unicode/15.0.0 I, [2024-05-19T00:19:34.608469 #3660991] INFO -- : CPPFLAGS = I, [2024-05-19T00:19:34.608481 #3660991] INFO -- : DLDFLAGS = -Wl,--compress-debug-sections=zlib -Wl,-soname,libruby.so.3.4 -fstack-protector-strong I, [2024-05-19T00:19:34.608493 #3660991] INFO -- : SOLIBS = -lz -lrt -lrt -lgmp -ldl -lcrypt -lm -lpthread I, [2024-05-19T00:19:34.608505 #3660991] INFO -- : LANG = en_US.UTF-8 I, [2024-05-19T00:19:34.608517 #3660991] INFO -- : LC_ALL = I, [2024-05-19T00:19:34.608528 #3660991] INFO -- : LC_CTYPE = I, [2024-05-19T00:19:34.608539 #3660991] INFO -- : MFLAGS = I, [2024-05-19T00:19:34.608551 #3660991] INFO -- : RUSTC = no I, [2024-05-19T00:19:34.608563 #3660991] INFO -- : YJIT_RUSTC_ARGS = --crate-name=yjit --crate-type=staticlib --edition=2021 -g -C lto=thin -C opt-level=3 -C overflow-checks=on '--out-dir=/tmp/ruby/build/trunk/yjit/target/release/' /tmp/ruby/src/trunk/yjit/src/lib.rs I, [2024-05-19T00:19:34.608999 #3660991] INFO -- : gcc (Ubuntu 11.4.0-1ubuntu1~22.04) 11.4.0 I, [2024-05-19T00:19:34.609053 #3660991] INFO -- : Copyright (C) 2021 Free Software Foundation, Inc. I, [2024-05-19T00:19:34.609067 #3660991] INFO -- : This is free software; see the source for copying conditions. There is NO I, [2024-05-19T00:19:34.609081 #3660991] INFO -- : warranty; not even for MERCHANTABILITY or FITNESS FOR A PARTICULAR PURPOSE. I, [2024-05-19T00:19:34.609093 #3660991] INFO -- : I, [2024-05-19T00:19:34.610821 #3660991] INFO -- : generating enc.mk I, [2024-05-19T00:19:34.727889 #3660991] INFO -- : making enc I, [2024-05-19T00:19:34.745026 #3660991] INFO -- : make[1]: Entering directory '/tmp/ruby/build/trunk' I, [2024-05-19T00:19:34.745087 #3660991] INFO -- : make[1]: Nothing to be done for 'enc'. I, [2024-05-19T00:19:34.745102 #3660991] INFO -- : make[1]: Leaving directory '/tmp/ruby/build/trunk' I, [2024-05-19T00:19:34.745852 #3660991] INFO -- : making srcs under enc I, [2024-05-19T00:19:34.778313 #3660991] INFO -- : make[1]: Entering directory '/tmp/ruby/build/trunk' I, [2024-05-19T00:19:34.778380 #3660991] INFO -- : make[1]: Nothing to be done for 'srcs'. I, [2024-05-19T00:19:34.778393 #3660991] INFO -- : make[1]: Leaving directory '/tmp/ruby/build/trunk' I, [2024-05-19T00:19:34.779279 #3660991] INFO -- : generating transdb.h I, [2024-05-19T00:19:34.875686 #3660991] INFO -- : transdb.h unchanged I, [2024-05-19T00:19:34.876981 #3660991] INFO -- : making trans I, [2024-05-19T00:19:34.911326 #3660991] INFO -- : make[1]: Entering directory '/tmp/ruby/build/trunk' I, [2024-05-19T00:19:34.911389 #3660991] INFO -- : make[1]: Nothing to be done for 'trans'. I, [2024-05-19T00:19:34.911404 #3660991] INFO -- : make[1]: Leaving directory '/tmp/ruby/build/trunk' I, [2024-05-19T00:19:34.911977 #3660991] INFO -- : making encs I, [2024-05-19T00:19:34.949805 #3660991] INFO -- : make[1]: Entering directory '/tmp/ruby/build/trunk' I, [2024-05-19T00:19:34.949880 #3660991] INFO -- : make[1]: Nothing to be done for 'encs'. I, [2024-05-19T00:19:34.949894 #3660991] INFO -- : make[1]: Leaving directory '/tmp/ruby/build/trunk' I, [2024-05-19T00:19:34.951901 #3660991] INFO -- : generating makefiles ext/configure-ext.mk I, [2024-05-19T00:19:34.984202 #3660991] INFO -- : ext/configure-ext.mk updated I, [2024-05-19T00:19:34.986630 #3660991] INFO -- : make[1]: Entering directory '/tmp/ruby/build/trunk' I, [2024-05-19T00:19:36.339719 #3660991] INFO -- : make[1]: Leaving directory '/tmp/ruby/build/trunk' I, [2024-05-19T00:19:36.340374 #3660991] INFO -- : generating makefile exts.mk I, [2024-05-19T00:19:36.377581 #3660991] INFO -- : exts.mk unchanged I, [2024-05-19T00:19:36.381977 #3660991] INFO -- : make[1]: Entering directory '/tmp/ruby/build/trunk' I, [2024-05-19T00:19:36.695674 #3660991] INFO -- : make[2]: Entering directory '/tmp/ruby/build/trunk/ext/coverage' I, [2024-05-19T00:19:36.699778 #3660991] INFO -- : make[2]: Leaving directory '/tmp/ruby/build/trunk/ext/coverage' I, [2024-05-19T00:19:36.706147 #3660991] INFO -- : make[2]: Entering directory '/tmp/ruby/build/trunk/ext/date' I, [2024-05-19T00:19:36.711249 #3660991] INFO -- : make[2]: Leaving directory '/tmp/ruby/build/trunk/ext/date' I, [2024-05-19T00:19:36.715073 #3660991] INFO -- : make[2]: Entering directory '/tmp/ruby/build/trunk/ext/digest' I, [2024-05-19T00:19:36.723921 #3660991] INFO -- : make[2]: Leaving directory '/tmp/ruby/build/trunk/ext/digest' I, [2024-05-19T00:19:36.750071 #3660991] INFO -- : make[2]: Entering directory '/tmp/ruby/build/trunk/ext/digest/sha2' I, [2024-05-19T00:19:36.754948 #3660991] INFO -- : make[2]: Leaving directory '/tmp/ruby/build/trunk/ext/digest/sha2' I, [2024-05-19T00:19:36.776433 #3660991] INFO -- : make[2]: Entering directory '/tmp/ruby/build/trunk/ext/fiddle' I, [2024-05-19T00:19:36.786437 #3660991] INFO -- : make[2]: Leaving directory '/tmp/ruby/build/trunk/ext/fiddle' I, [2024-05-19T00:19:36.791415 #3660991] INFO -- : make[2]: Entering directory '/tmp/ruby/build/trunk/ext/io/console' I, [2024-05-19T00:19:36.795752 #3660991] INFO -- : make[2]: Leaving directory '/tmp/ruby/build/trunk/ext/io/console' I, [2024-05-19T00:19:36.808608 #3660991] INFO -- : make[2]: Entering directory '/tmp/ruby/build/trunk/ext/json' I, [2024-05-19T00:19:36.819175 #3660991] INFO -- : make[2]: Leaving directory '/tmp/ruby/build/trunk/ext/json' I, [2024-05-19T00:19:36.834227 #3660991] INFO -- : make[2]: Entering directory '/tmp/ruby/build/trunk/ext/monitor' I, [2024-05-19T00:19:36.838045 #3660991] INFO -- : make[2]: Leaving directory '/tmp/ruby/build/trunk/ext/monitor' I, [2024-05-19T00:19:36.845156 #3660991] INFO -- : make[2]: Entering directory '/tmp/ruby/build/trunk/ext/objspace' I, [2024-05-19T00:19:36.850602 #3660991] INFO -- : make[2]: Leaving directory '/tmp/ruby/build/trunk/ext/objspace' I, [2024-05-19T00:19:36.868465 #3660991] INFO -- : make[2]: Entering directory '/tmp/ruby/build/trunk/ext/openssl' I, [2024-05-19T00:19:36.885327 #3660991] INFO -- : make[2]: Leaving directory '/tmp/ruby/build/trunk/ext/openssl' I, [2024-05-19T00:19:36.890118 #3660991] INFO -- : make[2]: Entering directory '/tmp/ruby/build/trunk/ext/pathname' I, [2024-05-19T00:19:36.893466 #3660991] INFO -- : make[2]: Leaving directory '/tmp/ruby/build/trunk/ext/pathname' I, [2024-05-19T00:19:36.900661 #3660991] INFO -- : make[2]: Entering directory '/tmp/ruby/build/trunk/ext/psych' I, [2024-05-19T00:19:36.925916 #3660991] INFO -- : make[2]: Leaving directory '/tmp/ruby/build/trunk/ext/psych' I, [2024-05-19T00:19:36.930767 #3660991] INFO -- : make[2]: Entering directory '/tmp/ruby/build/trunk/ext/pty' I, [2024-05-19T00:19:36.934860 #3660991] INFO -- : make[2]: Leaving directory '/tmp/ruby/build/trunk/ext/pty' I, [2024-05-19T00:19:36.950962 #3660991] INFO -- : make[2]: Entering directory '/tmp/ruby/build/trunk/ext/ripper' I, [2024-05-19T00:19:36.959347 #3660991] INFO -- : make[2]: Leaving directory '/tmp/ruby/build/trunk/ext/ripper' I, [2024-05-19T00:19:36.961817 #3660991] INFO -- : make[2]: Entering directory '/tmp/ruby/build/trunk/ext/rubyvm' I, [2024-05-19T00:19:36.965046 #3660991] INFO -- : make[2]: Leaving directory '/tmp/ruby/build/trunk/ext/rubyvm' I, [2024-05-19T00:19:36.978103 #3660991] INFO -- : make[2]: Entering directory '/tmp/ruby/build/trunk/ext/socket' I, [2024-05-19T00:19:36.987199 #3660991] INFO -- : make[2]: Leaving directory '/tmp/ruby/build/trunk/ext/socket' I, [2024-05-19T00:19:37.005150 #3660991] INFO -- : make[2]: Entering directory '/tmp/ruby/build/trunk/.bundle/gems/bigdecimal-3.1.8/ext/bigdecimal' I, [2024-05-19T00:19:37.033510 #3660991] INFO -- : make[2]: Leaving directory '/tmp/ruby/build/trunk/.bundle/gems/bigdecimal-3.1.8/ext/bigdecimal' I, [2024-05-19T00:19:37.035613 #3660991] INFO -- : make[2]: Entering directory '/tmp/ruby/build/trunk/.bundle/gems/debug-1.9.2/ext/debug' I, [2024-05-19T00:19:37.056940 #3660991] INFO -- : make[2]: Leaving directory '/tmp/ruby/build/trunk/.bundle/gems/debug-1.9.2/ext/debug' I, [2024-05-19T00:19:37.058995 #3660991] INFO -- : make[2]: Entering directory '/tmp/ruby/build/trunk/.bundle/gems/nkf-0.2.0/ext/nkf' I, [2024-05-19T00:19:37.080436 #3660991] INFO -- : make[2]: Leaving directory '/tmp/ruby/build/trunk/.bundle/gems/nkf-0.2.0/ext/nkf' I, [2024-05-19T00:19:37.082460 #3660991] INFO -- : make[2]: Entering directory '/tmp/ruby/build/trunk/.bundle/gems/racc-1.7.3/ext/racc/cparse' I, [2024-05-19T00:19:37.103458 #3660991] INFO -- : make[2]: Leaving directory '/tmp/ruby/build/trunk/.bundle/gems/racc-1.7.3/ext/racc/cparse' I, [2024-05-19T00:19:37.105992 #3660991] INFO -- : make[2]: Entering directory '/tmp/ruby/build/trunk/.bundle/gems/rbs-3.4.4/ext/rbs_extension' I, [2024-05-19T00:19:37.127684 #3660991] INFO -- : make[2]: Leaving directory '/tmp/ruby/build/trunk/.bundle/gems/rbs-3.4.4/ext/rbs_extension' I, [2024-05-19T00:19:37.129526 #3660991] INFO -- : make[2]: Entering directory '/tmp/ruby/build/trunk/.bundle/gems/syslog-0.1.2/ext/syslog' I, [2024-05-19T00:19:37.152958 #3660991] INFO -- : make[2]: Leaving directory '/tmp/ruby/build/trunk/.bundle/gems/syslog-0.1.2/ext/syslog' I, [2024-05-19T00:19:37.183309 #3660991] INFO -- : make[2]: Entering directory '/tmp/ruby/build/trunk' I, [2024-05-19T00:19:37.249376 #3660991] INFO -- : make[2]: 'ruby' is up to date. I, [2024-05-19T00:19:37.249415 #3660991] INFO -- : make[2]: Leaving directory '/tmp/ruby/build/trunk' I, [2024-05-19T00:19:37.249697 #3660991] INFO -- : make[1]: Leaving directory '/tmp/ruby/build/trunk' I, [2024-05-19T00:19:37.253322 #3660991] INFO -- : make[1]: Entering directory '/tmp/ruby/build/trunk' I, [2024-05-19T00:19:37.253346 #3660991] INFO -- : make[1]: Nothing to be done for 'note'. I, [2024-05-19T00:19:37.253353 #3660991] INFO -- : make[1]: Leaving directory '/tmp/ruby/build/trunk' E, [2024-05-19T00:19:37.310455 #3660991] ERROR -- : $ /tmp/ruby/build/trunk/miniruby -I/tmp/ruby/src/trunk/lib /tmp/ruby/src/trunk/tool/runruby.rb --archdir=/tmp/ruby/build/trunk --extout=.ext -- /tmp/ruby/src/trunk/spec/mspec/bin/mspec-run -B /tmp/ruby/src/trunk/spec/default.mspec --error-output stderr --debug -fy -o /tmp/rubytest.i2qdlq/1-mspec-multi-0 E, [2024-05-19T00:19:37.310668 #3660991] ERROR -- : $ /tmp/ruby/build/trunk/miniruby -I/tmp/ruby/src/trunk/lib /tmp/ruby/src/trunk/tool/runruby.rb --archdir=/tmp/ruby/build/trunk --extout=.ext -- /tmp/ruby/src/trunk/spec/mspec/bin/mspec-run -B /tmp/ruby/src/trunk/spec/default.mspec --error-output stderr --debug -fy -o /tmp/rubytest.i2qdlq/2-mspec-multi-1 E, [2024-05-19T00:19:37.310919 #3660991] ERROR -- : $ /tmp/ruby/build/trunk/miniruby -I/tmp/ruby/src/trunk/lib /tmp/ruby/src/trunk/tool/runruby.rb --archdir=/tmp/ruby/build/trunk --extout=.ext -- /tmp/ruby/src/trunk/spec/mspec/bin/mspec-run -B /tmp/ruby/src/trunk/spec/default.mspec --error-output stderr --debug -fy -o /tmp/rubytest.i2qdlq/3-mspec-multi-2 E, [2024-05-19T00:19:37.311130 #3660991] ERROR -- : $ /tmp/ruby/build/trunk/miniruby -I/tmp/ruby/src/trunk/lib /tmp/ruby/src/trunk/tool/runruby.rb --archdir=/tmp/ruby/build/trunk --extout=.ext -- /tmp/ruby/src/trunk/spec/mspec/bin/mspec-run -B /tmp/ruby/src/trunk/spec/default.mspec --error-output stderr --debug -fy -o /tmp/rubytest.i2qdlq/4-mspec-multi-3 E, [2024-05-19T00:19:37.311325 #3660991] ERROR -- : $ /tmp/ruby/build/trunk/miniruby -I/tmp/ruby/src/trunk/lib /tmp/ruby/src/trunk/tool/runruby.rb --archdir=/tmp/ruby/build/trunk --extout=.ext -- /tmp/ruby/src/trunk/spec/mspec/bin/mspec-run -B /tmp/ruby/src/trunk/spec/default.mspec --error-output stderr --debug -fy -o /tmp/rubytest.i2qdlq/5-mspec-multi-4 E, [2024-05-19T00:19:37.311435 #3660991] ERROR -- : $ /tmp/ruby/build/trunk/miniruby -I/tmp/ruby/src/trunk/lib /tmp/ruby/src/trunk/tool/runruby.rb --archdir=/tmp/ruby/build/trunk --extout=.ext -- /tmp/ruby/src/trunk/spec/mspec/bin/mspec-run -B /tmp/ruby/src/trunk/spec/default.mspec --error-output stderr --debug -fy -o /tmp/rubytest.i2qdlq/6-mspec-multi-5 E, [2024-05-19T00:19:37.311855 #3660991] ERROR -- : $ /tmp/ruby/build/trunk/miniruby -I/tmp/ruby/src/trunk/lib /tmp/ruby/src/trunk/tool/runruby.rb --archdir=/tmp/ruby/build/trunk --extout=.ext -- /tmp/ruby/src/trunk/spec/mspec/bin/mspec-run -B /tmp/ruby/src/trunk/spec/default.mspec --error-output stderr --debug -fy -o /tmp/rubytest.i2qdlq/7-mspec-multi-6 E, [2024-05-19T00:19:37.312157 #3660991] ERROR -- : $ /tmp/ruby/build/trunk/miniruby -I/tmp/ruby/src/trunk/lib /tmp/ruby/src/trunk/tool/runruby.rb --archdir=/tmp/ruby/build/trunk --extout=.ext -- /tmp/ruby/src/trunk/spec/mspec/bin/mspec-run -B /tmp/ruby/src/trunk/spec/default.mspec --error-output stderr --debug -fy -o /tmp/rubytest.i2qdlq/8-mspec-multi-7 E, [2024-05-19T00:19:37.312477 #3660991] ERROR -- : $ /tmp/ruby/build/trunk/miniruby -I/tmp/ruby/src/trunk/lib /tmp/ruby/src/trunk/tool/runruby.rb --archdir=/tmp/ruby/build/trunk --extout=.ext -- /tmp/ruby/src/trunk/spec/mspec/bin/mspec-run -B /tmp/ruby/src/trunk/spec/default.mspec --error-output stderr --debug -fy -o /tmp/rubytest.i2qdlq/9-mspec-multi-8 E, [2024-05-19T00:19:37.312837 #3660991] ERROR -- : $ /tmp/ruby/build/trunk/miniruby -I/tmp/ruby/src/trunk/lib /tmp/ruby/src/trunk/tool/runruby.rb --archdir=/tmp/ruby/build/trunk --extout=.ext -- /tmp/ruby/src/trunk/spec/mspec/bin/mspec-run -B /tmp/ruby/src/trunk/spec/default.mspec --error-output stderr --debug -fy -o /tmp/rubytest.i2qdlq/10-mspec-multi-9 E, [2024-05-19T00:19:37.313219 #3660991] ERROR -- : $ /tmp/ruby/build/trunk/miniruby -I/tmp/ruby/src/trunk/lib /tmp/ruby/src/trunk/tool/runruby.rb --archdir=/tmp/ruby/build/trunk --extout=.ext -- /tmp/ruby/src/trunk/spec/mspec/bin/mspec-run -B /tmp/ruby/src/trunk/spec/default.mspec --error-output stderr --debug -fy -o /tmp/rubytest.i2qdlq/11-mspec-multi-10 E, [2024-05-19T00:19:37.313504 #3660991] ERROR -- : $ /tmp/ruby/build/trunk/miniruby -I/tmp/ruby/src/trunk/lib /tmp/ruby/src/trunk/tool/runruby.rb --archdir=/tmp/ruby/build/trunk --extout=.ext -- /tmp/ruby/src/trunk/spec/mspec/bin/mspec-run -B /tmp/ruby/src/trunk/spec/default.mspec --error-output stderr --debug -fy -o /tmp/rubytest.i2qdlq/12-mspec-multi-11 E, [2024-05-19T00:19:37.313803 #3660991] ERROR -- : $ /tmp/ruby/build/trunk/miniruby -I/tmp/ruby/src/trunk/lib /tmp/ruby/src/trunk/tool/runruby.rb --archdir=/tmp/ruby/build/trunk --extout=.ext -- /tmp/ruby/src/trunk/spec/mspec/bin/mspec-run -B /tmp/ruby/src/trunk/spec/default.mspec --error-output stderr --debug -fy -o /tmp/rubytest.i2qdlq/13-mspec-multi-12 E, [2024-05-19T00:19:37.314051 #3660991] ERROR -- : $ /tmp/ruby/build/trunk/miniruby -I/tmp/ruby/src/trunk/lib /tmp/ruby/src/trunk/tool/runruby.rb --archdir=/tmp/ruby/build/trunk --extout=.ext -- /tmp/ruby/src/trunk/spec/mspec/bin/mspec-run -B /tmp/ruby/src/trunk/spec/default.mspec --error-output stderr --debug -fy -o /tmp/rubytest.i2qdlq/14-mspec-multi-13 E, [2024-05-19T00:19:37.314262 #3660991] ERROR -- : $ /tmp/ruby/build/trunk/miniruby -I/tmp/ruby/src/trunk/lib /tmp/ruby/src/trunk/tool/runruby.rb --archdir=/tmp/ruby/build/trunk --extout=.ext -- /tmp/ruby/src/trunk/spec/mspec/bin/mspec-run -B /tmp/ruby/src/trunk/spec/default.mspec --error-output stderr --debug -fy -o /tmp/rubytest.i2qdlq/15-mspec-multi-14 E, [2024-05-19T00:19:37.314464 #3660991] ERROR -- : $ /tmp/ruby/build/trunk/miniruby -I/tmp/ruby/src/trunk/lib /tmp/ruby/src/trunk/tool/runruby.rb --archdir=/tmp/ruby/build/trunk --extout=.ext -- /tmp/ruby/src/trunk/spec/mspec/bin/mspec-run -B /tmp/ruby/src/trunk/spec/default.mspec --error-output stderr --debug -fy -o /tmp/rubytest.i2qdlq/16-mspec-multi-15 E, [2024-05-19T00:19:37.314662 #3660991] ERROR -- : $ /tmp/ruby/build/trunk/miniruby -I/tmp/ruby/src/trunk/lib /tmp/ruby/src/trunk/tool/runruby.rb --archdir=/tmp/ruby/build/trunk --extout=.ext -- /tmp/ruby/src/trunk/spec/mspec/bin/mspec-run -B /tmp/ruby/src/trunk/spec/default.mspec --error-output stderr --debug -fy -o /tmp/rubytest.i2qdlq/17-mspec-multi-16 E, [2024-05-19T00:19:37.314829 #3660991] ERROR -- : $ /tmp/ruby/build/trunk/miniruby -I/tmp/ruby/src/trunk/lib /tmp/ruby/src/trunk/tool/runruby.rb --archdir=/tmp/ruby/build/trunk --extout=.ext -- /tmp/ruby/src/trunk/spec/mspec/bin/mspec-run -B /tmp/ruby/src/trunk/spec/default.mspec --error-output stderr --debug -fy -o /tmp/rubytest.i2qdlq/18-mspec-multi-17 E, [2024-05-19T00:19:37.317774 #3660991] ERROR -- : $ /tmp/ruby/build/trunk/miniruby -I/tmp/ruby/src/trunk/lib /tmp/ruby/src/trunk/tool/runruby.rb --archdir=/tmp/ruby/build/trunk --extout=.ext -- /tmp/ruby/src/trunk/spec/mspec/bin/mspec-run -B /tmp/ruby/src/trunk/spec/default.mspec --error-output stderr --debug -fy -o /tmp/rubytest.i2qdlq/19-mspec-multi-18 E, [2024-05-19T00:19:37.318046 #3660991] ERROR -- : $ /tmp/ruby/build/trunk/miniruby -I/tmp/ruby/src/trunk/lib /tmp/ruby/src/trunk/tool/runruby.rb --archdir=/tmp/ruby/build/trunk --extout=.ext -- /tmp/ruby/src/trunk/spec/mspec/bin/mspec-run -B /tmp/ruby/src/trunk/spec/default.mspec --error-output stderr --debug -fy -o /tmp/rubytest.i2qdlq/20-mspec-multi-19 I, [2024-05-19T00:19:37.493978 #3660991] INFO -- : ruby 3.4.0dev (2024-05-18T15:29:00Z master dbbaf871de) [x86_64-linux] I, [2024-05-19T00:19:38.114872 #3660991] INFO -- : 0 ......................................................................... I, [2024-05-19T00:19:38.494882 #3660991] INFO -- : 73 ......................................................................... I, [2024-05-19T00:19:38.626210 #3660991] INFO -- : 146 ......................................................................... I, [2024-05-19T00:19:38.680091 #3660991] INFO -- : 219 ......................................................................... I, [2024-05-19T00:19:38.745555 #3660991] INFO -- : 292 ......................................................................... I, [2024-05-19T00:19:38.788295 #3660991] INFO -- : 365 ......................................................................... I, [2024-05-19T00:19:38.807104 #3660991] INFO -- : 438 ......................................................................... I, [2024-05-19T00:19:38.825192 #3660991] INFO -- : 511 ......................................................................... I, [2024-05-19T00:19:38.843805 #3660991] INFO -- : 584 ......................................................................... I, [2024-05-19T00:19:38.907080 #3660991] INFO -- : 657 ......................................................................... I, [2024-05-19T00:19:38.938169 #3660991] INFO -- : 730 ......................................................................... I, [2024-05-19T00:19:38.959132 #3660991] INFO -- : 803 ......................................................................... I, [2024-05-19T00:19:38.992997 #3660991] INFO -- : 876 ......................................................................... I, [2024-05-19T00:19:39.047305 #3660991] INFO -- : 949 ......................................................................... I, [2024-05-19T00:19:39.137781 #3660991] INFO -- : 1022 ......................................................................... I, [2024-05-19T00:19:39.287443 #3660991] INFO -- : 1095 ......................................................................... I, [2024-05-19T00:19:39.413002 #3660991] INFO -- : 1168 ......................................................................... I, [2024-05-19T00:19:39.474049 #3660991] INFO -- : 1241 ......................................................................... I, [2024-05-19T00:19:39.524753 #3660991] INFO -- : 1314 ......................................................................... I, [2024-05-19T00:19:39.542631 #3660991] INFO -- : 1387 ......................................................................... I, [2024-05-19T00:19:39.628150 #3660991] INFO -- : 1460 ......................................................................... I, [2024-05-19T00:19:40.121174 #3660991] INFO -- : 1533 ......................................................................... I, [2024-05-19T00:19:40.168629 #3660991] INFO -- : 1606 ......................................................................... I, [2024-05-19T00:19:40.251320 #3660991] INFO -- : 1679 ......................................................................... I, [2024-05-19T00:19:40.374736 #3660991] INFO -- : 1752 ......................................................................... I, [2024-05-19T00:19:40.459330 #3660991] INFO -- : 1825 ......................................................................... I, [2024-05-19T00:19:40.620807 #3660991] INFO -- : 1898 ......................................................................... I, [2024-05-19T00:19:40.675277 #3660991] INFO -- : 1971 ......................................................................... I, [2024-05-19T00:19:40.751797 #3660991] INFO -- : 2044 ......................................................................... I, [2024-05-19T00:19:40.788112 #3660991] INFO -- : 2117 ......................................................................... I, [2024-05-19T00:19:40.802306 #3660991] INFO -- : 2190 ......................................................................... I, [2024-05-19T00:19:40.820480 #3660991] INFO -- : 2263 ......................................................................... I, [2024-05-19T00:19:40.835360 #3660991] INFO -- : 2336 ......................................................................... I, [2024-05-19T00:19:40.873021 #3660991] INFO -- : 2409 ......................................................................... I, [2024-05-19T00:19:40.978227 #3660991] INFO -- : 2482 ......................................................................... I, [2024-05-19T00:19:41.002197 #3660991] INFO -- : 2555 ......................................................................... I, [2024-05-19T00:19:41.099936 #3660991] INFO -- : 2628 ......................................................................... I, [2024-05-19T00:19:41.208526 #3660991] INFO -- : 2701 ......................................................................... I, [2024-05-19T00:19:41.236054 #3660991] INFO -- : 2774 ......................................................................... I, [2024-05-19T00:19:41.289785 #3660991] INFO -- : 2847 ......................................................................... I, [2024-05-19T00:19:41.323484 #3660991] INFO -- : 2920 ......................................................................... I, [2024-05-19T00:19:41.349218 #3660991] INFO -- : 2993 ......................................................................... I, [2024-05-19T00:19:41.373396 #3660991] INFO -- : 3066 ......................................................................... I, [2024-05-19T00:19:41.387335 #3660991] INFO -- : 3139 ......................................................................... I, [2024-05-19T00:19:41.397271 #3660991] INFO -- : 3212 ......................................................................... I, [2024-05-19T00:19:41.428020 #3660991] INFO -- : 3285 ......................................................................... I, [2024-05-19T00:19:45.404616 #3660991] INFO -- : 3358 ........................................................................ I, [2024-05-19T00:19:45.404676 #3660991] INFO -- : I, [2024-05-19T00:19:45.404683 #3660991] INFO -- : Finished in 8.091587 seconds I, [2024-05-19T00:19:45.404687 #3660991] INFO -- : I, [2024-05-19T00:19:45.404691 #3660991] INFO -- : 3429 files, 32611 examples, 187070 expectations, 0 failures, 0 errors, 0 tagged I, [2024-05-19T00:19:45.407737 #3660991] INFO -- : $$$[end] "make yes-test-rubyspec MSPECOPT='--error-output stderr --debug -j' TESTS='-j20'" exit with 0.