# Logfile created on 2024-05-18 00:53:09 +0000 by logger.rb/v1.4.3 I, [2024-05-18T00:53:09.394038 #1063579] INFO -- : #, @formatter=nil, @logdev=#, @binmode=false, @mon_data=#, @mon_data_owner_object_id=860>>> I, [2024-05-18T00:53:09.394164 #1063579] INFO -- : $$$[beg] make update-unicode -j20 I, [2024-05-18T00:53:09.452815 #1063579] INFO -- : Downloading Unicode emoji 15.0 files... I, [2024-05-18T00:53:09.453008 #1063579] INFO -- : Downloading Unicode emoji 15.0 files... I, [2024-05-18T00:53:09.453709 #1063579] INFO -- : Downloading Unicode emoji 15.0 files... I, [2024-05-18T00:53:09.495139 #1063579] INFO -- : made symlink emoji/15.0/emoji-sequences.txt to /tmp/ruby/src/trunk/.downloaded-cache/emoji/15.0/emoji-sequences.txt I, [2024-05-18T00:53:09.495745 #1063579] INFO -- : downloading emoji/15.0/emoji-test.txt ... downloading emoji/15.0/emoji-sequences.txt ... /tmp/ruby/src/trunk/enc/unicode/data/emoji/15.0/emoji-sequences.txt already exists E, [2024-05-18T00:53:09.957395 #1063579] ERROR -- : /tmp/ruby/src/trunk/tool/downloader.rb:302:in `rescue in download': failed to download emoji/15.0/emoji-test.txt (RuntimeError) E, [2024-05-18T00:53:09.957525 #1063579] ERROR -- : OpenURI::HTTPError: 403 Forbidden: https://www.unicode.org/Public/emoji/15.0/emoji-test.txt E, [2024-05-18T00:53:09.957545 #1063579] ERROR -- : from /tmp/ruby/src/trunk/tool/downloader.rb:201:in `download' E, [2024-05-18T00:53:09.957557 #1063579] ERROR -- : from /tmp/ruby/src/trunk/tool/downloader.rb:136:in `download' E, [2024-05-18T00:53:09.957568 #1063579] ERROR -- : from /tmp/ruby/src/trunk/tool/downloader.rb:482:in `block in
' E, [2024-05-18T00:53:09.957580 #1063579] ERROR -- : from /tmp/ruby/src/trunk/tool/downloader.rb:465:in `each' E, [2024-05-18T00:53:09.957592 #1063579] ERROR -- : from /tmp/ruby/src/trunk/tool/downloader.rb:465:in `
' E, [2024-05-18T00:53:09.957603 #1063579] ERROR -- : /usr/lib/ruby/3.0.0/open-uri.rb:364:in `open_http': 403 Forbidden (OpenURI::HTTPError) E, [2024-05-18T00:53:09.957614 #1063579] ERROR -- : from /usr/lib/ruby/3.0.0/open-uri.rb:741:in `buffer_open' E, [2024-05-18T00:53:09.957628 #1063579] ERROR -- : from /usr/lib/ruby/3.0.0/open-uri.rb:212:in `block in open_loop' E, [2024-05-18T00:53:09.957639 #1063579] ERROR -- : from /usr/lib/ruby/3.0.0/open-uri.rb:210:in `catch' E, [2024-05-18T00:53:09.957650 #1063579] ERROR -- : from /usr/lib/ruby/3.0.0/open-uri.rb:210:in `open_loop' E, [2024-05-18T00:53:09.957660 #1063579] ERROR -- : from /usr/lib/ruby/3.0.0/open-uri.rb:151:in `open_uri' E, [2024-05-18T00:53:09.957671 #1063579] ERROR -- : from /usr/lib/ruby/3.0.0/open-uri.rb:721:in `open' E, [2024-05-18T00:53:09.957681 #1063579] ERROR -- : from /usr/lib/ruby/3.0.0/open-uri.rb:729:in `read' E, [2024-05-18T00:53:09.957692 #1063579] ERROR -- : from /tmp/ruby/src/trunk/tool/downloader.rb:247:in `block in download' E, [2024-05-18T00:53:09.957719 #1063579] ERROR -- : from /tmp/ruby/src/trunk/tool/downloader.rb:378:in `with_retry' E, [2024-05-18T00:53:09.957740 #1063579] ERROR -- : from /tmp/ruby/src/trunk/tool/downloader.rb:246:in `download' E, [2024-05-18T00:53:09.957751 #1063579] ERROR -- : from /tmp/ruby/src/trunk/tool/downloader.rb:136:in `download' E, [2024-05-18T00:53:09.957762 #1063579] ERROR -- : from /tmp/ruby/src/trunk/tool/downloader.rb:482:in `block in
' E, [2024-05-18T00:53:09.957773 #1063579] ERROR -- : from /tmp/ruby/src/trunk/tool/downloader.rb:465:in `each' E, [2024-05-18T00:53:09.957784 #1063579] ERROR -- : from /tmp/ruby/src/trunk/tool/downloader.rb:465:in `
' E, [2024-05-18T00:53:09.961698 #1063579] ERROR -- : make: *** [uncommon.mk:1765: /tmp/ruby/src/trunk/enc/unicode/data/emoji/15.0/emoji-zwj-sequences.txt] Error 1 E, [2024-05-18T00:53:09.961753 #1063579] ERROR -- : make: *** Waiting for unfinished jobs.... E, [2024-05-18T00:53:09.978059 #1063579] ERROR -- : /tmp/ruby/src/trunk/tool/downloader.rb:302:in `rescue in download': failed to download emoji/15.0/emoji-test.txt (RuntimeError) E, [2024-05-18T00:53:09.978192 #1063579] ERROR -- : OpenURI::HTTPError: 403 Forbidden: https://www.unicode.org/Public/emoji/15.0/emoji-test.txt E, [2024-05-18T00:53:09.978218 #1063579] ERROR -- : from /tmp/ruby/src/trunk/tool/downloader.rb:201:in `download' E, [2024-05-18T00:53:09.978233 #1063579] ERROR -- : from /tmp/ruby/src/trunk/tool/downloader.rb:136:in `download' E, [2024-05-18T00:53:09.978248 #1063579] ERROR -- : from /tmp/ruby/src/trunk/tool/downloader.rb:482:in `block in
' E, [2024-05-18T00:53:09.978263 #1063579] ERROR -- : from /tmp/ruby/src/trunk/tool/downloader.rb:465:in `each' E, [2024-05-18T00:53:09.978277 #1063579] ERROR -- : from /tmp/ruby/src/trunk/tool/downloader.rb:465:in `
' E, [2024-05-18T00:53:09.978291 #1063579] ERROR -- : /usr/lib/ruby/3.0.0/open-uri.rb:364:in `open_http': 403 Forbidden (OpenURI::HTTPError) E, [2024-05-18T00:53:09.978306 #1063579] ERROR -- : from /usr/lib/ruby/3.0.0/open-uri.rb:741:in `buffer_open' E, [2024-05-18T00:53:09.978325 #1063579] ERROR -- : from /usr/lib/ruby/3.0.0/open-uri.rb:212:in `block in open_loop' E, [2024-05-18T00:53:09.978341 #1063579] ERROR -- : from /usr/lib/ruby/3.0.0/open-uri.rb:210:in `catch' E, [2024-05-18T00:53:09.978355 #1063579] ERROR -- : from /usr/lib/ruby/3.0.0/open-uri.rb:210:in `open_loop' E, [2024-05-18T00:53:09.978369 #1063579] ERROR -- : from /usr/lib/ruby/3.0.0/open-uri.rb:151:in `open_uri' E, [2024-05-18T00:53:09.978383 #1063579] ERROR -- : from /usr/lib/ruby/3.0.0/open-uri.rb:721:in `open' E, [2024-05-18T00:53:09.978397 #1063579] ERROR -- : from /usr/lib/ruby/3.0.0/open-uri.rb:729:in `read' E, [2024-05-18T00:53:09.978411 #1063579] ERROR -- : from /tmp/ruby/src/trunk/tool/downloader.rb:247:in `block in download' E, [2024-05-18T00:53:09.978426 #1063579] ERROR -- : from /tmp/ruby/src/trunk/tool/downloader.rb:378:in `with_retry' E, [2024-05-18T00:53:09.978444 #1063579] ERROR -- : from /tmp/ruby/src/trunk/tool/downloader.rb:246:in `download' E, [2024-05-18T00:53:09.978458 #1063579] ERROR -- : from /tmp/ruby/src/trunk/tool/downloader.rb:136:in `download' E, [2024-05-18T00:53:09.978473 #1063579] ERROR -- : from /tmp/ruby/src/trunk/tool/downloader.rb:482:in `block in
' E, [2024-05-18T00:53:09.978487 #1063579] ERROR -- : from /tmp/ruby/src/trunk/tool/downloader.rb:465:in `each' E, [2024-05-18T00:53:09.978501 #1063579] ERROR -- : from /tmp/ruby/src/trunk/tool/downloader.rb:465:in `
' E, [2024-05-18T00:53:09.982955 #1063579] ERROR -- : make: *** [uncommon.mk:1765: /tmp/ruby/src/trunk/enc/unicode/data/emoji/15.0/emoji-sequences.txt] Error 1 E, [2024-05-18T00:53:09.983020 #1063579] ERROR -- : make: *** Deleting file '/tmp/ruby/src/trunk/enc/unicode/data/emoji/15.0/emoji-sequences.txt' E, [2024-05-18T00:53:10.381680 #1063579] ERROR -- : /tmp/ruby/src/trunk/tool/downloader.rb:302:in `rescue in download': failed to download emoji/15.0/emoji-sequences.txt (RuntimeError) E, [2024-05-18T00:53:10.381855 #1063579] ERROR -- : EOFError: end of file reached: https://www.unicode.org/Public/emoji/15.0/emoji-sequences.txt E, [2024-05-18T00:53:10.381882 #1063579] ERROR -- : from /tmp/ruby/src/trunk/tool/downloader.rb:201:in `download' E, [2024-05-18T00:53:10.381896 #1063579] ERROR -- : from /tmp/ruby/src/trunk/tool/downloader.rb:136:in `download' E, [2024-05-18T00:53:10.381909 #1063579] ERROR -- : from /tmp/ruby/src/trunk/tool/downloader.rb:482:in `block in
' E, [2024-05-18T00:53:10.381922 #1063579] ERROR -- : from /tmp/ruby/src/trunk/tool/downloader.rb:465:in `each' E, [2024-05-18T00:53:10.381935 #1063579] ERROR -- : from /tmp/ruby/src/trunk/tool/downloader.rb:465:in `
' E, [2024-05-18T00:53:10.381948 #1063579] ERROR -- : /usr/lib/ruby/3.0.0/net/protocol.rb:227:in `rbuf_fill': end of file reached (EOFError) E, [2024-05-18T00:53:10.381966 #1063579] ERROR -- : from /usr/lib/ruby/3.0.0/net/protocol.rb:193:in `readuntil' E, [2024-05-18T00:53:10.381979 #1063579] ERROR -- : from /usr/lib/ruby/3.0.0/net/protocol.rb:203:in `readline' E, [2024-05-18T00:53:10.381992 #1063579] ERROR -- : from /usr/lib/ruby/3.0.0/net/http/response.rb:42:in `read_status_line' E, [2024-05-18T00:53:10.382006 #1063579] ERROR -- : from /usr/lib/ruby/3.0.0/net/http/response.rb:31:in `read_new' E, [2024-05-18T00:53:10.382019 #1063579] ERROR -- : from /usr/lib/ruby/3.0.0/net/http.rb:1557:in `block in transport_request' E, [2024-05-18T00:53:10.382032 #1063579] ERROR -- : from /usr/lib/ruby/3.0.0/net/http.rb:1548:in `catch' E, [2024-05-18T00:53:10.382262 #1063579] ERROR -- : from /usr/lib/ruby/3.0.0/net/http.rb:1548:in `transport_request' E, [2024-05-18T00:53:10.382280 #1063579] ERROR -- : from /usr/lib/ruby/3.0.0/net/http.rb:1521:in `request' E, [2024-05-18T00:53:10.382293 #1063579] ERROR -- : from /usr/lib/ruby/3.0.0/open-uri.rb:329:in `block in open_http' E, [2024-05-18T00:53:10.382306 #1063579] ERROR -- : from /usr/lib/ruby/3.0.0/net/http.rb:960:in `start' E, [2024-05-18T00:53:10.382319 #1063579] ERROR -- : from /usr/lib/ruby/3.0.0/open-uri.rb:323:in `open_http' E, [2024-05-18T00:53:10.382332 #1063579] ERROR -- : from /usr/lib/ruby/3.0.0/open-uri.rb:741:in `buffer_open' E, [2024-05-18T00:53:10.382348 #1063579] ERROR -- : from /usr/lib/ruby/3.0.0/open-uri.rb:212:in `block in open_loop' E, [2024-05-18T00:53:10.382361 #1063579] ERROR -- : from /usr/lib/ruby/3.0.0/open-uri.rb:210:in `catch' E, [2024-05-18T00:53:10.382374 #1063579] ERROR -- : from /usr/lib/ruby/3.0.0/open-uri.rb:210:in `open_loop' E, [2024-05-18T00:53:10.382387 #1063579] ERROR -- : from /usr/lib/ruby/3.0.0/open-uri.rb:151:in `open_uri' E, [2024-05-18T00:53:10.382400 #1063579] ERROR -- : from /usr/lib/ruby/3.0.0/open-uri.rb:721:in `open' E, [2024-05-18T00:53:10.382413 #1063579] ERROR -- : from /usr/lib/ruby/3.0.0/open-uri.rb:729:in `read' E, [2024-05-18T00:53:10.382426 #1063579] ERROR -- : from /tmp/ruby/src/trunk/tool/downloader.rb:247:in `block in download' E, [2024-05-18T00:53:10.382439 #1063579] ERROR -- : from /tmp/ruby/src/trunk/tool/downloader.rb:378:in `with_retry' E, [2024-05-18T00:53:10.382453 #1063579] ERROR -- : from /tmp/ruby/src/trunk/tool/downloader.rb:246:in `download' E, [2024-05-18T00:53:10.382475 #1063579] ERROR -- : from /tmp/ruby/src/trunk/tool/downloader.rb:136:in `download' E, [2024-05-18T00:53:10.382486 #1063579] ERROR -- : from /tmp/ruby/src/trunk/tool/downloader.rb:482:in `block in
' E, [2024-05-18T00:53:10.382498 #1063579] ERROR -- : from /tmp/ruby/src/trunk/tool/downloader.rb:465:in `each' E, [2024-05-18T00:53:10.382510 #1063579] ERROR -- : from /tmp/ruby/src/trunk/tool/downloader.rb:465:in `
' E, [2024-05-18T00:53:10.386564 #1063579] ERROR -- : make: *** [uncommon.mk:1765: /tmp/ruby/src/trunk/enc/unicode/data/emoji/15.0/emoji-test.txt] Error 1 I, [2024-05-18T00:53:10.386679 #1063579] INFO -- : downloading emoji/15.0/emoji-test.txt ... I, [2024-05-18T00:53:10.387471 #1063579] INFO -- : $$$[end] "make update-unicode -j20" exit with 512. I, [2024-05-18T00:53:10.387551 #1063579] INFO -- : $$$[beg] make update-download -j20 I, [2024-05-18T00:53:10.502482 #1063579] INFO -- : tool/config.guess already exists I, [2024-05-18T00:53:10.502521 #1063579] INFO -- : tool/config.sub already exists I, [2024-05-18T00:53:10.504596 #1063579] INFO -- : Update power_assert to 84e85124c5014a139af39161d484156cfe87a9ed I, [2024-05-18T00:53:10.504762 #1063579] INFO -- : Update rbs to ba7872795d5de04adb8ff500c0e6afdc81a041dd I, [2024-05-18T00:53:10.505516 #1063579] INFO -- : Update typeprof to b19a6416da3a05d57fadd6ffdadb382b6d236ca5 I, [2024-05-18T00:53:10.505909 #1063579] INFO -- : echo 84e85124c5014a139af39161d484156cfe87a9ed | /bin/sh /tmp/ruby/src/trunk/tool/ifchange /tmp/ruby/src/trunk/.bundle/.timestamp/power_assert.revision - I, [2024-05-18T00:53:10.506121 #1063579] INFO -- : echo ba7872795d5de04adb8ff500c0e6afdc81a041dd | /bin/sh /tmp/ruby/src/trunk/tool/ifchange /tmp/ruby/src/trunk/.bundle/.timestamp/rbs.revision - I, [2024-05-18T00:53:10.506703 #1063579] INFO -- : echo b19a6416da3a05d57fadd6ffdadb382b6d236ca5 | /bin/sh /tmp/ruby/src/trunk/tool/ifchange /tmp/ruby/src/trunk/.bundle/.timestamp/typeprof.revision - I, [2024-05-18T00:53:10.507810 #1063579] INFO -- : /tmp/ruby/src/trunk/.bundle/.timestamp/power_assert.revision unchanged I, [2024-05-18T00:53:10.507950 #1063579] INFO -- : /tmp/ruby/src/trunk/.bundle/.timestamp/rbs.revision unchanged I, [2024-05-18T00:53:10.508279 #1063579] INFO -- : /tmp/ruby/src/trunk/.bundle/.timestamp/typeprof.revision unchanged I, [2024-05-18T00:53:10.509068 #1063579] INFO -- : Building power_assert@84e85124c5014a139af39161d484156cfe87a9ed to /tmp/ruby/src/trunk/gems/power_assert-2.0.3.gem I, [2024-05-18T00:53:10.577941 #1063579] INFO -- : Successfully built RubyGem I, [2024-05-18T00:53:10.577985 #1063579] INFO -- : Name: power_assert I, [2024-05-18T00:53:10.577992 #1063579] INFO -- : Version: 2.0.4dev I, [2024-05-18T00:53:10.577996 #1063579] INFO -- : File: power_assert-2.0.4dev.gem I, [2024-05-18T00:53:10.622792 #1063579] INFO -- : $$$[end] "make update-download -j20" exit with 0. I, [2024-05-18T00:53:10.622827 #1063579] INFO -- : $$$[beg] make update-rubyspec -j20 I, [2024-05-18T00:53:10.680453 #1063579] INFO -- : make: Nothing to be done for 'update-rubyspec'. I, [2024-05-18T00:53:10.680790 #1063579] INFO -- : $$$[end] "make update-rubyspec -j20" exit with 0. I, [2024-05-18T00:53:10.680828 #1063579] INFO -- : $$$[beg] make update-src -j20 I, [2024-05-18T00:53:11.235126 #1063579] INFO -- : Already up to date. I, [2024-05-18T00:53:11.250489 #1063579] INFO -- : Latest commit hash = cce7c25a42 I, [2024-05-18T00:53:11.252057 #1063579] INFO -- : $$$[end] "make update-src -j20" exit with 0. I, [2024-05-18T00:53:11.252106 #1063579] INFO -- : $$$[beg] make after-update -j20 I, [2024-05-18T00:53:11.329727 #1063579] INFO -- : generating /tmp/ruby/src/trunk/ext/ripper/eventids2table.c I, [2024-05-18T00:53:11.333940 #1063579] INFO -- : make[1]: Entering directory '/tmp/ruby/src/trunk/ext/ripper' I, [2024-05-18T00:53:11.333989 #1063579] INFO -- : make[1]: Nothing to be done for 'src'. I, [2024-05-18T00:53:11.334002 #1063579] INFO -- : make[1]: Leaving directory '/tmp/ruby/src/trunk/ext/ripper' I, [2024-05-18T00:53:11.350472 #1063579] INFO -- : /tmp/ruby/src/trunk/revision.h updated I, [2024-05-18T00:53:11.351678 #1063579] INFO -- : generating x86_64-linux-fake.rb I, [2024-05-18T00:53:11.402483 #1063579] INFO -- : x86_64-linux-fake.rb updated I, [2024-05-18T00:53:11.403827 #1063579] INFO -- : generating enc.mk I, [2024-05-18T00:53:11.521321 #1063579] INFO -- : making srcs under enc I, [2024-05-18T00:53:11.551162 #1063579] INFO -- : make[1]: Entering directory '/tmp/ruby/build/trunk' I, [2024-05-18T00:53:11.551184 #1063579] INFO -- : make[1]: Nothing to be done for 'srcs'. I, [2024-05-18T00:53:11.551190 #1063579] INFO -- : make[1]: Leaving directory '/tmp/ruby/build/trunk' I, [2024-05-18T00:53:11.595416 #1063579] INFO -- : Update power_assert to 84e85124c5014a139af39161d484156cfe87a9ed I, [2024-05-18T00:53:11.595594 #1063579] INFO -- : Update rbs to ba7872795d5de04adb8ff500c0e6afdc81a041dd I, [2024-05-18T00:53:11.595830 #1063579] INFO -- : Update typeprof to b19a6416da3a05d57fadd6ffdadb382b6d236ca5 I, [2024-05-18T00:53:11.596611 #1063579] INFO -- : echo 84e85124c5014a139af39161d484156cfe87a9ed | /bin/sh /tmp/ruby/src/trunk/tool/ifchange /tmp/ruby/src/trunk/.bundle/.timestamp/power_assert.revision - I, [2024-05-18T00:53:11.597407 #1063579] INFO -- : echo ba7872795d5de04adb8ff500c0e6afdc81a041dd | /bin/sh /tmp/ruby/src/trunk/tool/ifchange /tmp/ruby/src/trunk/.bundle/.timestamp/rbs.revision - I, [2024-05-18T00:53:11.597640 #1063579] INFO -- : echo b19a6416da3a05d57fadd6ffdadb382b6d236ca5 | /bin/sh /tmp/ruby/src/trunk/tool/ifchange /tmp/ruby/src/trunk/.bundle/.timestamp/typeprof.revision - I, [2024-05-18T00:53:11.598627 #1063579] INFO -- : /tmp/ruby/src/trunk/.bundle/.timestamp/power_assert.revision unchanged I, [2024-05-18T00:53:11.599130 #1063579] INFO -- : /tmp/ruby/src/trunk/.bundle/.timestamp/rbs.revision unchanged I, [2024-05-18T00:53:11.599466 #1063579] INFO -- : /tmp/ruby/src/trunk/.bundle/.timestamp/typeprof.revision unchanged I, [2024-05-18T00:53:11.599509 #1063579] INFO -- : Building power_assert@84e85124c5014a139af39161d484156cfe87a9ed to /tmp/ruby/src/trunk/gems/power_assert-2.0.3.gem I, [2024-05-18T00:53:11.668662 #1063579] INFO -- : Successfully built RubyGem I, [2024-05-18T00:53:11.668702 #1063579] INFO -- : Name: power_assert I, [2024-05-18T00:53:11.668707 #1063579] INFO -- : Version: 2.0.4dev I, [2024-05-18T00:53:11.668711 #1063579] INFO -- : File: power_assert-2.0.4dev.gem I, [2024-05-18T00:53:11.670886 #1063579] INFO -- : Extracting bundle gem power_assert-2.0.3... I, [2024-05-18T00:53:11.733342 #1063579] INFO -- : Try with hash version of bundled gems instead of gems/power_assert-2.0.3.gem. We don't use this gem with release version of Ruby. I, [2024-05-18T00:53:11.738277 #1063579] INFO -- : Unpacked gems/power_assert-2.0.4dev.gem I, [2024-05-18T00:53:11.740179 #1063579] INFO -- : $$$[end] "make after-update -j20" exit with 0. I, [2024-05-18T00:53:11.740351 #1063579] INFO -- : $$$[beg] make miniruby -j20 I, [2024-05-18T00:53:11.799824 #1063579] INFO -- : BASERUBY = /usr/bin/ruby --disable=gems I, [2024-05-18T00:53:11.799851 #1063579] INFO -- : CC = gcc I, [2024-05-18T00:53:11.799857 #1063579] INFO -- : LD = ld I, [2024-05-18T00:53:11.799861 #1063579] INFO -- : LDSHARED = gcc -shared I, [2024-05-18T00:53:11.799864 #1063579] INFO -- : CFLAGS = -O3 -fno-fast-math -ggdb3 -Wall -Wextra -Wdeprecated-declarations -Wdiv-by-zero -Wduplicated-cond -Wimplicit-function-declaration -Wimplicit-int -Wpointer-arith -Wwrite-strings -Wold-style-definition -Wimplicit-fallthrough=0 -Wmissing-noreturn -Wno-cast-function-type -Wno-constant-logical-operand -Wno-long-long -Wno-missing-field-initializers -Wno-overlength-strings -Wno-packed-bitfield-compat -Wno-parentheses-equality -Wno-self-assign -Wno-tautological-compare -Wno-unused-parameter -Wno-unused-value -Wsuggest-attribute=format -Wsuggest-attribute=noreturn -Wunused-variable -Wmisleading-indentation -Wundef -fPIC I, [2024-05-18T00:53:11.799869 #1063579] INFO -- : XCFLAGS = -U_FORTIFY_SOURCE -D_FORTIFY_SOURCE=2 -fstack-protector-strong -fno-strict-overflow -fvisibility=hidden -fexcess-precision=standard -DRUBY_EXPORT -I. -I.ext/include/x86_64-linux -I/tmp/ruby/src/trunk/include -I/tmp/ruby/src/trunk -I/tmp/ruby/src/trunk/prism -I/tmp/ruby/src/trunk/enc/unicode/15.0.0 I, [2024-05-18T00:53:11.799872 #1063579] INFO -- : CPPFLAGS = I, [2024-05-18T00:53:11.799876 #1063579] INFO -- : DLDFLAGS = -Wl,--compress-debug-sections=zlib -Wl,-soname,libruby.so.3.4 -fstack-protector-strong I, [2024-05-18T00:53:11.799880 #1063579] INFO -- : SOLIBS = -lz -lrt -lrt -lgmp -ldl -lcrypt -lm -lpthread I, [2024-05-18T00:53:11.799883 #1063579] INFO -- : LANG = en_US.UTF-8 I, [2024-05-18T00:53:11.799888 #1063579] INFO -- : LC_ALL = I, [2024-05-18T00:53:11.799894 #1063579] INFO -- : LC_CTYPE = I, [2024-05-18T00:53:11.799897 #1063579] INFO -- : MFLAGS = -j20 --jobserver-auth=4,5 I, [2024-05-18T00:53:11.799906 #1063579] INFO -- : RUSTC = no I, [2024-05-18T00:53:11.799910 #1063579] INFO -- : YJIT_RUSTC_ARGS = --crate-name=yjit --crate-type=staticlib --edition=2021 -g -C lto=thin -C opt-level=3 -C overflow-checks=on '--out-dir=/tmp/ruby/build/trunk/yjit/target/release/' /tmp/ruby/src/trunk/yjit/src/lib.rs I, [2024-05-18T00:53:11.801404 #1063579] INFO -- : gcc (Ubuntu 11.4.0-1ubuntu1~22.04) 11.4.0 I, [2024-05-18T00:53:11.801428 #1063579] INFO -- : Copyright (C) 2021 Free Software Foundation, Inc. I, [2024-05-18T00:53:11.801434 #1063579] INFO -- : This is free software; see the source for copying conditions. There is NO I, [2024-05-18T00:53:11.801442 #1063579] INFO -- : warranty; not even for MERCHANTABILITY or FITNESS FOR A PARTICULAR PURPOSE. I, [2024-05-18T00:53:11.801446 #1063579] INFO -- : I, [2024-05-18T00:53:11.823724 #1063579] INFO -- : compiling /tmp/ruby/src/trunk/version.c I, [2024-05-18T00:53:11.925811 #1063579] INFO -- : linking miniruby I, [2024-05-18T00:53:12.456828 #1063579] INFO -- : $$$[end] "make miniruby -j20" exit with 0. I, [2024-05-18T00:53:12.456945 #1063579] INFO -- : $$$[beg] make ruby -j20 I, [2024-05-18T00:53:12.514517 #1063579] INFO -- : BASERUBY = /usr/bin/ruby --disable=gems I, [2024-05-18T00:53:12.514547 #1063579] INFO -- : CC = gcc I, [2024-05-18T00:53:12.514553 #1063579] INFO -- : LD = ld I, [2024-05-18T00:53:12.514557 #1063579] INFO -- : LDSHARED = gcc -shared I, [2024-05-18T00:53:12.514564 #1063579] INFO -- : CFLAGS = -O3 -fno-fast-math -ggdb3 -Wall -Wextra -Wdeprecated-declarations -Wdiv-by-zero -Wduplicated-cond -Wimplicit-function-declaration -Wimplicit-int -Wpointer-arith -Wwrite-strings -Wold-style-definition -Wimplicit-fallthrough=0 -Wmissing-noreturn -Wno-cast-function-type -Wno-constant-logical-operand -Wno-long-long -Wno-missing-field-initializers -Wno-overlength-strings -Wno-packed-bitfield-compat -Wno-parentheses-equality -Wno-self-assign -Wno-tautological-compare -Wno-unused-parameter -Wno-unused-value -Wsuggest-attribute=format -Wsuggest-attribute=noreturn -Wunused-variable -Wmisleading-indentation -Wundef -fPIC I, [2024-05-18T00:53:12.514569 #1063579] INFO -- : XCFLAGS = -U_FORTIFY_SOURCE -D_FORTIFY_SOURCE=2 -fstack-protector-strong -fno-strict-overflow -fvisibility=hidden -fexcess-precision=standard -DRUBY_EXPORT -I. -I.ext/include/x86_64-linux -I/tmp/ruby/src/trunk/include -I/tmp/ruby/src/trunk -I/tmp/ruby/src/trunk/prism -I/tmp/ruby/src/trunk/enc/unicode/15.0.0 I, [2024-05-18T00:53:12.514573 #1063579] INFO -- : CPPFLAGS = I, [2024-05-18T00:53:12.514581 #1063579] INFO -- : DLDFLAGS = -Wl,--compress-debug-sections=zlib -Wl,-soname,libruby.so.3.4 -fstack-protector-strong I, [2024-05-18T00:53:12.514585 #1063579] INFO -- : SOLIBS = -lz -lrt -lrt -lgmp -ldl -lcrypt -lm -lpthread I, [2024-05-18T00:53:12.514588 #1063579] INFO -- : LANG = en_US.UTF-8 I, [2024-05-18T00:53:12.514592 #1063579] INFO -- : LC_ALL = I, [2024-05-18T00:53:12.514596 #1063579] INFO -- : LC_CTYPE = I, [2024-05-18T00:53:12.514600 #1063579] INFO -- : MFLAGS = -j20 --jobserver-auth=4,5 I, [2024-05-18T00:53:12.514603 #1063579] INFO -- : RUSTC = no I, [2024-05-18T00:53:12.514607 #1063579] INFO -- : YJIT_RUSTC_ARGS = --crate-name=yjit --crate-type=staticlib --edition=2021 -g -C lto=thin -C opt-level=3 -C overflow-checks=on '--out-dir=/tmp/ruby/build/trunk/yjit/target/release/' /tmp/ruby/src/trunk/yjit/src/lib.rs I, [2024-05-18T00:53:12.515996 #1063579] INFO -- : gcc (Ubuntu 11.4.0-1ubuntu1~22.04) 11.4.0 I, [2024-05-18T00:53:12.516032 #1063579] INFO -- : Copyright (C) 2021 Free Software Foundation, Inc. I, [2024-05-18T00:53:12.516039 #1063579] INFO -- : This is free software; see the source for copying conditions. There is NO I, [2024-05-18T00:53:12.516044 #1063579] INFO -- : warranty; not even for MERCHANTABILITY or FITNESS FOR A PARTICULAR PURPOSE. I, [2024-05-18T00:53:12.516052 #1063579] INFO -- : I, [2024-05-18T00:53:12.626437 #1063579] INFO -- : builtin_binary.inc updated I, [2024-05-18T00:53:12.631442 #1063579] INFO -- : c5234a9416e4f20f175185e840b25b0f08674d14078ed7083f37e655458e3ca9 builtin_binary.inc I, [2024-05-18T00:53:12.632159 #1063579] INFO -- : compiling /tmp/ruby/src/trunk/builtin.c I, [2024-05-18T00:53:12.815378 #1063579] INFO -- : linking static-library libruby-static.a I, [2024-05-18T00:53:13.127918 #1063579] INFO -- : linking shared-library libruby.so.3.4.0 I, [2024-05-18T00:53:14.679272 #1063579] INFO -- : linking ruby I, [2024-05-18T00:53:14.703612 #1063579] INFO -- : $$$[end] "make ruby -j20" exit with 0. I, [2024-05-18T00:53:14.703755 #1063579] INFO -- : $$$[beg] make all -j20 I, [2024-05-18T00:53:14.767085 #1063579] INFO -- : BASERUBY = /usr/bin/ruby --disable=gems I, [2024-05-18T00:53:14.767115 #1063579] INFO -- : CC = gcc I, [2024-05-18T00:53:14.767120 #1063579] INFO -- : LD = ld I, [2024-05-18T00:53:14.767124 #1063579] INFO -- : LDSHARED = gcc -shared I, [2024-05-18T00:53:14.767128 #1063579] INFO -- : CFLAGS = -O3 -fno-fast-math -ggdb3 -Wall -Wextra -Wdeprecated-declarations -Wdiv-by-zero -Wduplicated-cond -Wimplicit-function-declaration -Wimplicit-int -Wpointer-arith -Wwrite-strings -Wold-style-definition -Wimplicit-fallthrough=0 -Wmissing-noreturn -Wno-cast-function-type -Wno-constant-logical-operand -Wno-long-long -Wno-missing-field-initializers -Wno-overlength-strings -Wno-packed-bitfield-compat -Wno-parentheses-equality -Wno-self-assign -Wno-tautological-compare -Wno-unused-parameter -Wno-unused-value -Wsuggest-attribute=format -Wsuggest-attribute=noreturn -Wunused-variable -Wmisleading-indentation -Wundef -fPIC I, [2024-05-18T00:53:14.767132 #1063579] INFO -- : XCFLAGS = -U_FORTIFY_SOURCE -D_FORTIFY_SOURCE=2 -fstack-protector-strong -fno-strict-overflow -fvisibility=hidden -fexcess-precision=standard -DRUBY_EXPORT -I. -I.ext/include/x86_64-linux -I/tmp/ruby/src/trunk/include -I/tmp/ruby/src/trunk -I/tmp/ruby/src/trunk/prism -I/tmp/ruby/src/trunk/enc/unicode/15.0.0 I, [2024-05-18T00:53:14.767136 #1063579] INFO -- : CPPFLAGS = I, [2024-05-18T00:53:14.767140 #1063579] INFO -- : DLDFLAGS = -Wl,--compress-debug-sections=zlib -Wl,-soname,libruby.so.3.4 -fstack-protector-strong I, [2024-05-18T00:53:14.767143 #1063579] INFO -- : SOLIBS = -lz -lrt -lrt -lgmp -ldl -lcrypt -lm -lpthread I, [2024-05-18T00:53:14.767147 #1063579] INFO -- : LANG = en_US.UTF-8 I, [2024-05-18T00:53:14.767150 #1063579] INFO -- : LC_ALL = I, [2024-05-18T00:53:14.767154 #1063579] INFO -- : LC_CTYPE = I, [2024-05-18T00:53:14.767157 #1063579] INFO -- : MFLAGS = -j20 --jobserver-auth=4,5 I, [2024-05-18T00:53:14.767160 #1063579] INFO -- : RUSTC = no I, [2024-05-18T00:53:14.767164 #1063579] INFO -- : YJIT_RUSTC_ARGS = --crate-name=yjit --crate-type=staticlib --edition=2021 -g -C lto=thin -C opt-level=3 -C overflow-checks=on '--out-dir=/tmp/ruby/build/trunk/yjit/target/release/' /tmp/ruby/src/trunk/yjit/src/lib.rs I, [2024-05-18T00:53:14.768358 #1063579] INFO -- : gcc (Ubuntu 11.4.0-1ubuntu1~22.04) 11.4.0 I, [2024-05-18T00:53:14.768378 #1063579] INFO -- : Copyright (C) 2021 Free Software Foundation, Inc. I, [2024-05-18T00:53:14.768387 #1063579] INFO -- : This is free software; see the source for copying conditions. There is NO I, [2024-05-18T00:53:14.768391 #1063579] INFO -- : warranty; not even for MERCHANTABILITY or FITNESS FOR A PARTICULAR PURPOSE. I, [2024-05-18T00:53:14.768394 #1063579] INFO -- : I, [2024-05-18T00:53:14.801136 #1063579] INFO -- : generating enc.mk I, [2024-05-18T00:53:14.803036 #1063579] INFO -- : building spec/ruby/optional/capi/ext/array_spec.so I, [2024-05-18T00:53:14.803347 #1063579] INFO -- : building spec/ruby/optional/capi/ext/basic_object_spec.so I, [2024-05-18T00:53:14.803836 #1063579] INFO -- : building spec/ruby/optional/capi/ext/bignum_spec.so I, [2024-05-18T00:53:14.804811 #1063579] INFO -- : building spec/ruby/optional/capi/ext/binding_spec.so I, [2024-05-18T00:53:14.805443 #1063579] INFO -- : building spec/ruby/optional/capi/ext/boolean_spec.so I, [2024-05-18T00:53:14.805736 #1063579] INFO -- : building spec/ruby/optional/capi/ext/class_id_under_autoload_spec.so I, [2024-05-18T00:53:14.806404 #1063579] INFO -- : building spec/ruby/optional/capi/ext/class_spec.so I, [2024-05-18T00:53:14.807550 #1063579] INFO -- : building spec/ruby/optional/capi/ext/class_under_autoload_spec.so I, [2024-05-18T00:53:14.807920 #1063579] INFO -- : building spec/ruby/optional/capi/ext/complex_spec.so I, [2024-05-18T00:53:14.808956 #1063579] INFO -- : building spec/ruby/optional/capi/ext/constants_spec.so I, [2024-05-18T00:53:14.809973 #1063579] INFO -- : building spec/ruby/optional/capi/ext/data_spec.so I, [2024-05-18T00:53:14.810862 #1063579] INFO -- : building spec/ruby/optional/capi/ext/debug_spec.so I, [2024-05-18T00:53:14.811190 #1063579] INFO -- : building spec/ruby/optional/capi/ext/encoding_spec.so I, [2024-05-18T00:53:14.811821 #1063579] INFO -- : building spec/ruby/optional/capi/ext/enumerator_spec.so I, [2024-05-18T00:53:14.812075 #1063579] INFO -- : building spec/ruby/optional/capi/ext/exception_spec.so I, [2024-05-18T00:53:14.812838 #1063579] INFO -- : building spec/ruby/optional/capi/ext/fiber_spec.so I, [2024-05-18T00:53:14.813185 #1063579] INFO -- : building spec/ruby/optional/capi/ext/file_spec.so I, [2024-05-18T00:53:14.813791 #1063579] INFO -- : building spec/ruby/optional/capi/ext/fixnum_spec.so I, [2024-05-18T00:53:14.814048 #1063579] INFO -- : building spec/ruby/optional/capi/ext/float_spec.so I, [2024-05-18T00:53:14.939117 #1063579] INFO -- : building spec/ruby/optional/capi/ext/gc_spec.so I, [2024-05-18T00:53:14.957378 #1063579] INFO -- : building spec/ruby/optional/capi/ext/globals_spec.so I, [2024-05-18T00:53:14.957698 #1063579] INFO -- : building spec/ruby/optional/capi/ext/hash_spec.so I, [2024-05-18T00:53:14.960633 #1063579] INFO -- : building spec/ruby/optional/capi/ext/integer_spec.so I, [2024-05-18T00:53:14.976144 #1063579] INFO -- : building spec/ruby/optional/capi/ext/io_spec.so I, [2024-05-18T00:53:14.976899 #1063579] INFO -- : building spec/ruby/optional/capi/ext/kernel_spec.so I, [2024-05-18T00:53:14.977165 #1063579] INFO -- : building spec/ruby/optional/capi/ext/language_spec.so I, [2024-05-18T00:53:14.977650 #1063579] INFO -- : building spec/ruby/optional/capi/ext/marshal_spec.so I, [2024-05-18T00:53:14.978527 #1063579] INFO -- : building spec/ruby/optional/capi/ext/module_spec.so I, [2024-05-18T00:53:14.980393 #1063579] INFO -- : building spec/ruby/optional/capi/ext/module_under_autoload_spec.so I, [2024-05-18T00:53:14.982218 #1063579] INFO -- : building spec/ruby/optional/capi/ext/mutex_spec.so I, [2024-05-18T00:53:14.984634 #1063579] INFO -- : building spec/ruby/optional/capi/ext/numeric_spec.so I, [2024-05-18T00:53:14.988449 #1063579] INFO -- : building spec/ruby/optional/capi/ext/object_spec.so I, [2024-05-18T00:53:14.994860 #1063579] INFO -- : building spec/ruby/optional/capi/ext/proc_spec.so I, [2024-05-18T00:53:15.004764 #1063579] INFO -- : building spec/ruby/optional/capi/ext/range_spec.so I, [2024-05-18T00:53:15.004835 #1063579] INFO -- : building spec/ruby/optional/capi/ext/rational_spec.so I, [2024-05-18T00:53:15.019392 #1063579] INFO -- : building spec/ruby/optional/capi/ext/rbasic_spec.so I, [2024-05-18T00:53:15.057118 #1063579] INFO -- : building spec/ruby/optional/capi/ext/regexp_spec.so I, [2024-05-18T00:53:15.095850 #1063579] INFO -- : building spec/ruby/optional/capi/ext/string_spec.so I, [2024-05-18T00:53:15.126622 #1063579] INFO -- : building spec/ruby/optional/capi/ext/struct_spec.so I, [2024-05-18T00:53:15.130390 #1063579] INFO -- : building spec/ruby/optional/capi/ext/st_spec.so I, [2024-05-18T00:53:15.131886 #1063579] INFO -- : building spec/ruby/optional/capi/ext/symbol_spec.so I, [2024-05-18T00:53:15.133979 #1063579] INFO -- : building spec/ruby/optional/capi/ext/thread_spec.so I, [2024-05-18T00:53:15.138068 #1063579] INFO -- : building spec/ruby/optional/capi/ext/time_spec.so I, [2024-05-18T00:53:15.139645 #1063579] INFO -- : building spec/ruby/optional/capi/ext/tracepoint_spec.so I, [2024-05-18T00:53:15.143807 #1063579] INFO -- : building spec/ruby/optional/capi/ext/typed_data_spec.so I, [2024-05-18T00:53:15.157993 #1063579] INFO -- : building spec/ruby/optional/capi/ext/util_spec.so I, [2024-05-18T00:53:15.162044 #1063579] INFO -- : making enc I, [2024-05-18T00:53:15.177979 #1063579] INFO -- : making srcs under enc I, [2024-05-18T00:53:15.191836 #1063579] INFO -- : make[1]: Entering directory '/tmp/ruby/build/trunk' I, [2024-05-18T00:53:15.191900 #1063579] INFO -- : make[1]: Nothing to be done for 'enc'. I, [2024-05-18T00:53:15.191910 #1063579] INFO -- : make[1]: Leaving directory '/tmp/ruby/build/trunk' I, [2024-05-18T00:53:15.227039 #1063579] INFO -- : make[1]: Entering directory '/tmp/ruby/build/trunk' I, [2024-05-18T00:53:15.227092 #1063579] INFO -- : make[1]: Nothing to be done for 'srcs'. I, [2024-05-18T00:53:15.227103 #1063579] INFO -- : make[1]: Leaving directory '/tmp/ruby/build/trunk' I, [2024-05-18T00:53:15.227890 #1063579] INFO -- : generating transdb.h I, [2024-05-18T00:53:15.348697 #1063579] INFO -- : transdb.h unchanged I, [2024-05-18T00:53:15.350172 #1063579] INFO -- : generating makefiles ext/configure-ext.mk I, [2024-05-18T00:53:15.350431 #1063579] INFO -- : making trans I, [2024-05-18T00:53:15.376914 #1063579] INFO -- : ext/configure-ext.mk updated I, [2024-05-18T00:53:15.379310 #1063579] INFO -- : make[1]: Entering directory '/tmp/ruby/build/trunk' I, [2024-05-18T00:53:15.386370 #1063579] INFO -- : make[1]: Entering directory '/tmp/ruby/build/trunk' I, [2024-05-18T00:53:15.386438 #1063579] INFO -- : make[1]: Nothing to be done for 'trans'. I, [2024-05-18T00:53:15.386447 #1063579] INFO -- : make[1]: Leaving directory '/tmp/ruby/build/trunk' I, [2024-05-18T00:53:15.444006 #1063579] INFO -- : making encs I, [2024-05-18T00:53:15.488995 #1063579] INFO -- : make[1]: Entering directory '/tmp/ruby/build/trunk' I, [2024-05-18T00:53:15.489052 #1063579] INFO -- : make[1]: Nothing to be done for 'encs'. I, [2024-05-18T00:53:15.489060 #1063579] INFO -- : make[1]: Leaving directory '/tmp/ruby/build/trunk' I, [2024-05-18T00:53:15.532053 #1063579] INFO -- : make[1]: Leaving directory '/tmp/ruby/build/trunk' I, [2024-05-18T00:53:15.533406 #1063579] INFO -- : generating makefile exts.mk I, [2024-05-18T00:53:15.569955 #1063579] INFO -- : exts.mk unchanged I, [2024-05-18T00:53:15.574204 #1063579] INFO -- : make[1]: Entering directory '/tmp/ruby/build/trunk' I, [2024-05-18T00:53:15.593254 #1063579] INFO -- : make[2]: Entering directory '/tmp/ruby/build/trunk/ext/digest' I, [2024-05-18T00:53:15.594357 #1063579] INFO -- : make[2]: Entering directory '/tmp/ruby/build/trunk/ext/json' I, [2024-05-18T00:53:15.594953 #1063579] INFO -- : make[2]: Entering directory '/tmp/ruby/build/trunk/ext/io/console' I, [2024-05-18T00:53:15.595020 #1063579] INFO -- : make[2]: Entering directory '/tmp/ruby/build/trunk/ext/coverage' I, [2024-05-18T00:53:15.595648 #1063579] INFO -- : make[2]: Entering directory '/tmp/ruby/build/trunk/ext/date' I, [2024-05-18T00:53:15.595862 #1063579] INFO -- : make[2]: Entering directory '/tmp/ruby/build/trunk/ext/rubyvm' I, [2024-05-18T00:53:15.596832 #1063579] INFO -- : make[2]: Entering directory '/tmp/ruby/build/trunk/ext/monitor' I, [2024-05-18T00:53:15.597412 #1063579] INFO -- : make[2]: Entering directory '/tmp/ruby/build/trunk/ext/fiddle' I, [2024-05-18T00:53:15.598285 #1063579] INFO -- : make[2]: Entering directory '/tmp/ruby/build/trunk/ext/pathname' I, [2024-05-18T00:53:15.598352 #1063579] INFO -- : make[2]: Leaving directory '/tmp/ruby/build/trunk/ext/rubyvm' I, [2024-05-18T00:53:15.598508 #1063579] INFO -- : make[2]: Leaving directory '/tmp/ruby/build/trunk/ext/io/console' I, [2024-05-18T00:53:15.598644 #1063579] INFO -- : make[2]: Leaving directory '/tmp/ruby/build/trunk/ext/digest' I, [2024-05-18T00:53:15.598945 #1063579] INFO -- : make[2]: Leaving directory '/tmp/ruby/build/trunk/ext/coverage' I, [2024-05-18T00:53:15.598977 #1063579] INFO -- : make[2]: Entering directory '/tmp/ruby/build/trunk/ext/pty' I, [2024-05-18T00:53:15.599122 #1063579] INFO -- : make[2]: Entering directory '/tmp/ruby/build/trunk/ext/objspace' I, [2024-05-18T00:53:15.599624 #1063579] INFO -- : make[2]: Entering directory '/tmp/ruby/build/trunk/ext/psych' I, [2024-05-18T00:53:15.599808 #1063579] INFO -- : make[2]: Leaving directory '/tmp/ruby/build/trunk/ext/json' I, [2024-05-18T00:53:15.600137 #1063579] INFO -- : make[2]: Leaving directory '/tmp/ruby/build/trunk/ext/monitor' I, [2024-05-18T00:53:15.600870 #1063579] INFO -- : make[2]: Entering directory '/tmp/ruby/build/trunk/.bundle/gems/debug-1.9.2/ext/debug' I, [2024-05-18T00:53:15.600903 #1063579] INFO -- : make[2]: Entering directory '/tmp/ruby/build/trunk/.bundle/gems/bigdecimal-3.1.8/ext/bigdecimal' I, [2024-05-18T00:53:15.600933 #1063579] INFO -- : make[2]: Leaving directory '/tmp/ruby/build/trunk/ext/pathname' I, [2024-05-18T00:53:15.601106 #1063579] INFO -- : make[2]: Entering directory '/tmp/ruby/build/trunk/.bundle/gems/nkf-0.2.0/ext/nkf' I, [2024-05-18T00:53:15.601380 #1063579] INFO -- : make[2]: Entering directory '/tmp/ruby/build/trunk/.bundle/gems/racc-1.7.3/ext/racc/cparse' I, [2024-05-18T00:53:15.601628 #1063579] INFO -- : make[2]: Leaving directory '/tmp/ruby/build/trunk/ext/pty' I, [2024-05-18T00:53:15.601845 #1063579] INFO -- : make[2]: Leaving directory '/tmp/ruby/build/trunk/ext/date' I, [2024-05-18T00:53:15.601876 #1063579] INFO -- : make[2]: Entering directory '/tmp/ruby/build/trunk/ext/ripper' I, [2024-05-18T00:53:15.602211 #1063579] INFO -- : make[2]: Entering directory '/tmp/ruby/build/trunk/.bundle/gems/rbs-3.4.4/ext/rbs_extension' I, [2024-05-18T00:53:15.602348 #1063579] INFO -- : make[2]: Entering directory '/tmp/ruby/build/trunk/.bundle/gems/syslog-0.1.2/ext/syslog' I, [2024-05-18T00:53:15.603276 #1063579] INFO -- : make[2]: Leaving directory '/tmp/ruby/build/trunk/ext/objspace' I, [2024-05-18T00:53:15.606058 #1063579] INFO -- : make[2]: Entering directory '/tmp/ruby/build/trunk/ext/digest/sha2' I, [2024-05-18T00:53:15.606114 #1063579] INFO -- : make[2]: Entering directory '/tmp/ruby/build/trunk/ext/socket' I, [2024-05-18T00:53:15.607463 #1063579] INFO -- : make[2]: Leaving directory '/tmp/ruby/build/trunk/ext/fiddle' I, [2024-05-18T00:53:15.607599 #1063579] INFO -- : make[2]: Leaving directory '/tmp/ruby/build/trunk/ext/ripper' I, [2024-05-18T00:53:15.608350 #1063579] INFO -- : make[2]: Leaving directory '/tmp/ruby/build/trunk/ext/digest/sha2' I, [2024-05-18T00:53:15.611059 #1063579] INFO -- : make[2]: Entering directory '/tmp/ruby/build/trunk/ext/openssl' I, [2024-05-18T00:53:15.611902 #1063579] INFO -- : make[2]: Leaving directory '/tmp/ruby/build/trunk/ext/socket' I, [2024-05-18T00:53:15.615765 #1063579] INFO -- : make[2]: Leaving directory '/tmp/ruby/build/trunk/ext/psych' I, [2024-05-18T00:53:15.622352 #1063579] INFO -- : make[2]: Leaving directory '/tmp/ruby/build/trunk/ext/openssl' I, [2024-05-18T00:53:15.624613 #1063579] INFO -- : make[2]: Leaving directory '/tmp/ruby/build/trunk/.bundle/gems/nkf-0.2.0/ext/nkf' I, [2024-05-18T00:53:15.624652 #1063579] INFO -- : make[2]: Leaving directory '/tmp/ruby/build/trunk/.bundle/gems/bigdecimal-3.1.8/ext/bigdecimal' I, [2024-05-18T00:53:15.625692 #1063579] INFO -- : make[2]: Leaving directory '/tmp/ruby/build/trunk/.bundle/gems/rbs-3.4.4/ext/rbs_extension' I, [2024-05-18T00:53:15.633353 #1063579] INFO -- : make[2]: Leaving directory '/tmp/ruby/build/trunk/.bundle/gems/debug-1.9.2/ext/debug' I, [2024-05-18T00:53:15.633963 #1063579] INFO -- : make[2]: Leaving directory '/tmp/ruby/build/trunk/.bundle/gems/syslog-0.1.2/ext/syslog' I, [2024-05-18T00:53:15.637605 #1063579] INFO -- : make[2]: Leaving directory '/tmp/ruby/build/trunk/.bundle/gems/racc-1.7.3/ext/racc/cparse' I, [2024-05-18T00:53:15.661498 #1063579] INFO -- : make[2]: Entering directory '/tmp/ruby/build/trunk' I, [2024-05-18T00:53:15.731834 #1063579] INFO -- : linking ruby I, [2024-05-18T00:53:15.754512 #1063579] INFO -- : make[2]: Leaving directory '/tmp/ruby/build/trunk' I, [2024-05-18T00:53:15.755039 #1063579] INFO -- : make[1]: Leaving directory '/tmp/ruby/build/trunk' I, [2024-05-18T00:53:15.758359 #1063579] INFO -- : make[1]: Entering directory '/tmp/ruby/build/trunk' I, [2024-05-18T00:53:15.758388 #1063579] INFO -- : make[1]: Nothing to be done for 'note'. I, [2024-05-18T00:53:15.758396 #1063579] INFO -- : make[1]: Leaving directory '/tmp/ruby/build/trunk' I, [2024-05-18T00:53:15.759020 #1063579] INFO -- : $$$[end] "make all -j20" exit with 0. I, [2024-05-18T00:53:15.759181 #1063579] INFO -- : $$$[beg] make install -j20 I, [2024-05-18T00:53:15.837092 #1063579] INFO -- : Update power_assert to 84e85124c5014a139af39161d484156cfe87a9ed I, [2024-05-18T00:53:15.837339 #1063579] INFO -- : Update rbs to ba7872795d5de04adb8ff500c0e6afdc81a041dd I, [2024-05-18T00:53:15.838354 #1063579] INFO -- : Update typeprof to b19a6416da3a05d57fadd6ffdadb382b6d236ca5 I, [2024-05-18T00:53:15.839447 #1063579] INFO -- : echo 84e85124c5014a139af39161d484156cfe87a9ed | /bin/sh /tmp/ruby/src/trunk/tool/ifchange /tmp/ruby/src/trunk/.bundle/.timestamp/power_assert.revision - I, [2024-05-18T00:53:15.839516 #1063579] INFO -- : echo ba7872795d5de04adb8ff500c0e6afdc81a041dd | /bin/sh /tmp/ruby/src/trunk/tool/ifchange /tmp/ruby/src/trunk/.bundle/.timestamp/rbs.revision - I, [2024-05-18T00:53:15.840631 #1063579] INFO -- : BASERUBY = /usr/bin/ruby --disable=gems I, [2024-05-18T00:53:15.840704 #1063579] INFO -- : CC = gcc I, [2024-05-18T00:53:15.840724 #1063579] INFO -- : LD = ld I, [2024-05-18T00:53:15.840743 #1063579] INFO -- : LDSHARED = gcc -shared I, [2024-05-18T00:53:15.840759 #1063579] INFO -- : CFLAGS = -O3 -fno-fast-math -ggdb3 -Wall -Wextra -Wdeprecated-declarations -Wdiv-by-zero -Wduplicated-cond -Wimplicit-function-declaration -Wimplicit-int -Wpointer-arith -Wwrite-strings -Wold-style-definition -Wimplicit-fallthrough=0 -Wmissing-noreturn -Wno-cast-function-type -Wno-constant-logical-operand -Wno-long-long -Wno-missing-field-initializers -Wno-overlength-strings -Wno-packed-bitfield-compat -Wno-parentheses-equality -Wno-self-assign -Wno-tautological-compare -Wno-unused-parameter -Wno-unused-value -Wsuggest-attribute=format -Wsuggest-attribute=noreturn -Wunused-variable -Wmisleading-indentation -Wundef -fPIC I, [2024-05-18T00:53:15.840775 #1063579] INFO -- : XCFLAGS = -U_FORTIFY_SOURCE -D_FORTIFY_SOURCE=2 -fstack-protector-strong -fno-strict-overflow -fvisibility=hidden -fexcess-precision=standard -DRUBY_EXPORT -I. -I.ext/include/x86_64-linux -I/tmp/ruby/src/trunk/include -I/tmp/ruby/src/trunk -I/tmp/ruby/src/trunk/prism -I/tmp/ruby/src/trunk/enc/unicode/15.0.0 I, [2024-05-18T00:53:15.840791 #1063579] INFO -- : CPPFLAGS = I, [2024-05-18T00:53:15.840806 #1063579] INFO -- : DLDFLAGS = -Wl,--compress-debug-sections=zlib -Wl,-soname,libruby.so.3.4 -fstack-protector-strong I, [2024-05-18T00:53:15.840824 #1063579] INFO -- : SOLIBS = -lz -lrt -lrt -lgmp -ldl -lcrypt -lm -lpthread I, [2024-05-18T00:53:15.840839 #1063579] INFO -- : LANG = en_US.UTF-8 I, [2024-05-18T00:53:15.840853 #1063579] INFO -- : LC_ALL = I, [2024-05-18T00:53:15.840867 #1063579] INFO -- : LC_CTYPE = I, [2024-05-18T00:53:15.840881 #1063579] INFO -- : MFLAGS = -j20 --jobserver-auth=4,5 I, [2024-05-18T00:53:15.840895 #1063579] INFO -- : RUSTC = no I, [2024-05-18T00:53:15.840911 #1063579] INFO -- : YJIT_RUSTC_ARGS = --crate-name=yjit --crate-type=staticlib --edition=2021 -g -C lto=thin -C opt-level=3 -C overflow-checks=on '--out-dir=/tmp/ruby/build/trunk/yjit/target/release/' /tmp/ruby/src/trunk/yjit/src/lib.rs I, [2024-05-18T00:53:15.842634 #1063579] INFO -- : /tmp/ruby/src/trunk/.bundle/.timestamp/power_assert.revision unchanged I, [2024-05-18T00:53:15.843081 #1063579] INFO -- : /tmp/ruby/src/trunk/.bundle/.timestamp/rbs.revision unchanged I, [2024-05-18T00:53:15.873448 #1063579] INFO -- : echo b19a6416da3a05d57fadd6ffdadb382b6d236ca5 | /bin/sh /tmp/ruby/src/trunk/tool/ifchange /tmp/ruby/src/trunk/.bundle/.timestamp/typeprof.revision - I, [2024-05-18T00:53:15.874212 #1063579] INFO -- : gcc (Ubuntu 11.4.0-1ubuntu1~22.04) 11.4.0 I, [2024-05-18T00:53:15.874268 #1063579] INFO -- : Copyright (C) 2021 Free Software Foundation, Inc. I, [2024-05-18T00:53:15.874281 #1063579] INFO -- : This is free software; see the source for copying conditions. There is NO I, [2024-05-18T00:53:15.874302 #1063579] INFO -- : warranty; not even for MERCHANTABILITY or FITNESS FOR A PARTICULAR PURPOSE. I, [2024-05-18T00:53:15.874314 #1063579] INFO -- : I, [2024-05-18T00:53:15.874325 #1063579] INFO -- : generating enc.mk I, [2024-05-18T00:53:15.875431 #1063579] INFO -- : /tmp/ruby/src/trunk/.bundle/.timestamp/typeprof.revision unchanged I, [2024-05-18T00:53:15.995902 #1063579] INFO -- : Building power_assert@84e85124c5014a139af39161d484156cfe87a9ed to /tmp/ruby/src/trunk/gems/power_assert-2.0.3.gem I, [2024-05-18T00:53:15.996203 #1063579] INFO -- : making srcs under enc I, [2024-05-18T00:53:15.997055 #1063579] INFO -- : making enc I, [2024-05-18T00:53:16.014718 #1063579] INFO -- : make[1]: Entering directory '/tmp/ruby/build/trunk' I, [2024-05-18T00:53:16.014770 #1063579] INFO -- : make[1]: Nothing to be done for 'enc'. I, [2024-05-18T00:53:16.014783 #1063579] INFO -- : make[1]: Leaving directory '/tmp/ruby/build/trunk' I, [2024-05-18T00:53:16.026406 #1063579] INFO -- : make[1]: Entering directory '/tmp/ruby/build/trunk' I, [2024-05-18T00:53:16.026467 #1063579] INFO -- : make[1]: Nothing to be done for 'srcs'. I, [2024-05-18T00:53:16.026481 #1063579] INFO -- : make[1]: Leaving directory '/tmp/ruby/build/trunk' I, [2024-05-18T00:53:16.027180 #1063579] INFO -- : generating transdb.h I, [2024-05-18T00:53:16.064540 #1063579] INFO -- : Successfully built RubyGem I, [2024-05-18T00:53:16.064602 #1063579] INFO -- : Name: power_assert I, [2024-05-18T00:53:16.064616 #1063579] INFO -- : Version: 2.0.4dev I, [2024-05-18T00:53:16.064626 #1063579] INFO -- : File: power_assert-2.0.4dev.gem I, [2024-05-18T00:53:16.066656 #1063579] INFO -- : Extracting bundle gem power_assert-2.0.3... I, [2024-05-18T00:53:16.123905 #1063579] INFO -- : transdb.h unchanged I, [2024-05-18T00:53:16.125477 #1063579] INFO -- : generating makefiles ext/configure-ext.mk I, [2024-05-18T00:53:16.125860 #1063579] INFO -- : making trans I, [2024-05-18T00:53:16.127659 #1063579] INFO -- : Try with hash version of bundled gems instead of gems/power_assert-2.0.3.gem. We don't use this gem with release version of Ruby. I, [2024-05-18T00:53:16.132713 #1063579] INFO -- : Unpacked gems/power_assert-2.0.4dev.gem I, [2024-05-18T00:53:16.153058 #1063579] INFO -- : ext/configure-ext.mk unchanged I, [2024-05-18T00:53:16.155534 #1063579] INFO -- : make[1]: Entering directory '/tmp/ruby/build/trunk' I, [2024-05-18T00:53:16.162111 #1063579] INFO -- : make[1]: Entering directory '/tmp/ruby/build/trunk' I, [2024-05-18T00:53:16.162203 #1063579] INFO -- : make[1]: Nothing to be done for 'trans'. I, [2024-05-18T00:53:16.162213 #1063579] INFO -- : make[1]: Leaving directory '/tmp/ruby/build/trunk' I, [2024-05-18T00:53:16.163099 #1063579] INFO -- : making encs I, [2024-05-18T00:53:16.220418 #1063579] INFO -- : make[1]: Entering directory '/tmp/ruby/build/trunk' I, [2024-05-18T00:53:16.220497 #1063579] INFO -- : make[1]: Nothing to be done for 'encs'. I, [2024-05-18T00:53:16.220524 #1063579] INFO -- : make[1]: Leaving directory '/tmp/ruby/build/trunk' I, [2024-05-18T00:53:16.305313 #1063579] INFO -- : make[1]: Leaving directory '/tmp/ruby/build/trunk' I, [2024-05-18T00:53:16.306024 #1063579] INFO -- : generating makefile exts.mk I, [2024-05-18T00:53:16.342377 #1063579] INFO -- : exts.mk unchanged I, [2024-05-18T00:53:16.347015 #1063579] INFO -- : make[1]: Entering directory '/tmp/ruby/build/trunk' I, [2024-05-18T00:53:16.366751 #1063579] INFO -- : make[2]: Entering directory '/tmp/ruby/build/trunk/ext/digest' I, [2024-05-18T00:53:16.366947 #1063579] INFO -- : make[2]: Entering directory '/tmp/ruby/build/trunk/ext/json' I, [2024-05-18T00:53:16.368016 #1063579] INFO -- : make[2]: Entering directory '/tmp/ruby/build/trunk/ext/coverage' I, [2024-05-18T00:53:16.368486 #1063579] INFO -- : make[2]: Entering directory '/tmp/ruby/build/trunk/ext/io/console' I, [2024-05-18T00:53:16.369044 #1063579] INFO -- : make[2]: Entering directory '/tmp/ruby/build/trunk/ext/date' I, [2024-05-18T00:53:16.369135 #1063579] INFO -- : make[2]: Entering directory '/tmp/ruby/build/trunk/ext/monitor' I, [2024-05-18T00:53:16.370660 #1063579] INFO -- : make[2]: Entering directory '/tmp/ruby/build/trunk/ext/fiddle' I, [2024-05-18T00:53:16.371044 #1063579] INFO -- : make[2]: Entering directory '/tmp/ruby/build/trunk/ext/pathname' I, [2024-05-18T00:53:16.371055 #1063579] INFO -- : make[2]: Entering directory '/tmp/ruby/build/trunk/ext/rubyvm' I, [2024-05-18T00:53:16.371285 #1063579] INFO -- : make[2]: Leaving directory '/tmp/ruby/build/trunk/ext/digest' I, [2024-05-18T00:53:16.371510 #1063579] INFO -- : make[2]: Leaving directory '/tmp/ruby/build/trunk/ext/monitor' I, [2024-05-18T00:53:16.371535 #1063579] INFO -- : make[2]: Entering directory '/tmp/ruby/build/trunk/ext/pty' I, [2024-05-18T00:53:16.371598 #1063579] INFO -- : make[2]: Leaving directory '/tmp/ruby/build/trunk/ext/io/console' I, [2024-05-18T00:53:16.371915 #1063579] INFO -- : make[2]: Leaving directory '/tmp/ruby/build/trunk/ext/coverage' I, [2024-05-18T00:53:16.371994 #1063579] INFO -- : make[2]: Entering directory '/tmp/ruby/build/trunk/ext/objspace' I, [2024-05-18T00:53:16.372384 #1063579] INFO -- : make[2]: Leaving directory '/tmp/ruby/build/trunk/ext/json' I, [2024-05-18T00:53:16.372595 #1063579] INFO -- : make[2]: Leaving directory '/tmp/ruby/build/trunk/ext/date' I, [2024-05-18T00:53:16.373107 #1063579] INFO -- : make[2]: Entering directory '/tmp/ruby/build/trunk/ext/psych' I, [2024-05-18T00:53:16.373120 #1063579] INFO -- : make[2]: Leaving directory '/tmp/ruby/build/trunk/ext/rubyvm' I, [2024-05-18T00:53:16.373707 #1063579] INFO -- : make[2]: Leaving directory '/tmp/ruby/build/trunk/ext/pathname' I, [2024-05-18T00:53:16.374205 #1063579] INFO -- : make[2]: Leaving directory '/tmp/ruby/build/trunk/ext/pty' I, [2024-05-18T00:53:16.374465 #1063579] INFO -- : make[2]: Entering directory '/tmp/ruby/build/trunk/ext/ripper' I, [2024-05-18T00:53:16.375657 #1063579] INFO -- : make[2]: Entering directory '/tmp/ruby/build/trunk/.bundle/gems/bigdecimal-3.1.8/ext/bigdecimal' I, [2024-05-18T00:53:16.376216 #1063579] INFO -- : make[2]: Entering directory '/tmp/ruby/build/trunk/.bundle/gems/racc-1.7.3/ext/racc/cparse' I, [2024-05-18T00:53:16.376243 #1063579] INFO -- : make[2]: Leaving directory '/tmp/ruby/build/trunk/ext/objspace' I, [2024-05-18T00:53:16.376329 #1063579] INFO -- : make[2]: Entering directory '/tmp/ruby/build/trunk/.bundle/gems/debug-1.9.2/ext/debug' I, [2024-05-18T00:53:16.376690 #1063579] INFO -- : make[2]: Entering directory '/tmp/ruby/build/trunk/.bundle/gems/nkf-0.2.0/ext/nkf' I, [2024-05-18T00:53:16.376720 #1063579] INFO -- : make[2]: Entering directory '/tmp/ruby/build/trunk/.bundle/gems/rbs-3.4.4/ext/rbs_extension' I, [2024-05-18T00:53:16.377016 #1063579] INFO -- : make[2]: Entering directory '/tmp/ruby/build/trunk/.bundle/gems/syslog-0.1.2/ext/syslog' I, [2024-05-18T00:53:16.377590 #1063579] INFO -- : make[2]: Leaving directory '/tmp/ruby/build/trunk/ext/fiddle' I, [2024-05-18T00:53:16.378984 #1063579] INFO -- : make[2]: Leaving directory '/tmp/ruby/build/trunk/ext/ripper' I, [2024-05-18T00:53:16.381493 #1063579] INFO -- : make[2]: Entering directory '/tmp/ruby/build/trunk/ext/socket' I, [2024-05-18T00:53:16.383896 #1063579] INFO -- : make[2]: Leaving directory '/tmp/ruby/build/trunk/ext/psych' I, [2024-05-18T00:53:16.383933 #1063579] INFO -- : make[2]: Entering directory '/tmp/ruby/build/trunk/ext/digest/sha2' I, [2024-05-18T00:53:16.384646 #1063579] INFO -- : make[2]: Entering directory '/tmp/ruby/build/trunk/ext/openssl' I, [2024-05-18T00:53:16.387087 #1063579] INFO -- : make[2]: Leaving directory '/tmp/ruby/build/trunk/ext/digest/sha2' I, [2024-05-18T00:53:16.389848 #1063579] INFO -- : make[2]: Leaving directory '/tmp/ruby/build/trunk/ext/socket' I, [2024-05-18T00:53:16.396013 #1063579] INFO -- : make[2]: Leaving directory '/tmp/ruby/build/trunk/ext/openssl' I, [2024-05-18T00:53:16.398363 #1063579] INFO -- : make[2]: Leaving directory '/tmp/ruby/build/trunk/.bundle/gems/bigdecimal-3.1.8/ext/bigdecimal' I, [2024-05-18T00:53:16.398412 #1063579] INFO -- : make[2]: Leaving directory '/tmp/ruby/build/trunk/.bundle/gems/racc-1.7.3/ext/racc/cparse' I, [2024-05-18T00:53:16.399807 #1063579] INFO -- : make[2]: Leaving directory '/tmp/ruby/build/trunk/.bundle/gems/rbs-3.4.4/ext/rbs_extension' I, [2024-05-18T00:53:16.399974 #1063579] INFO -- : make[2]: Leaving directory '/tmp/ruby/build/trunk/.bundle/gems/debug-1.9.2/ext/debug' I, [2024-05-18T00:53:16.402277 #1063579] INFO -- : make[2]: Leaving directory '/tmp/ruby/build/trunk/.bundle/gems/syslog-0.1.2/ext/syslog' I, [2024-05-18T00:53:16.407701 #1063579] INFO -- : make[2]: Leaving directory '/tmp/ruby/build/trunk/.bundle/gems/nkf-0.2.0/ext/nkf' I, [2024-05-18T00:53:16.431141 #1063579] INFO -- : make[2]: Entering directory '/tmp/ruby/build/trunk' I, [2024-05-18T00:53:16.500005 #1063579] INFO -- : make[2]: 'ruby' is up to date. I, [2024-05-18T00:53:16.500042 #1063579] INFO -- : make[2]: Leaving directory '/tmp/ruby/build/trunk' I, [2024-05-18T00:53:16.500392 #1063579] INFO -- : make[1]: Leaving directory '/tmp/ruby/build/trunk' I, [2024-05-18T00:53:16.504260 #1063579] INFO -- : make[1]: Entering directory '/tmp/ruby/build/trunk' I, [2024-05-18T00:53:16.504282 #1063579] INFO -- : make[1]: Nothing to be done for 'note'. I, [2024-05-18T00:53:16.504287 #1063579] INFO -- : make[1]: Leaving directory '/tmp/ruby/build/trunk' I, [2024-05-18T00:53:16.504713 #1063579] INFO -- : ./miniruby -I/tmp/ruby/src/trunk/lib -I. -I.ext/common /tmp/ruby/src/trunk/tool/runruby.rb --extout=.ext -- --disable-gems -r./x86_64-linux-fake /tmp/ruby/src/trunk/tool/rbinstall.rb --make="make" --dest-dir="" --extout=".ext" --ext-build-dir="./ext" --mflags="-j20 --jobserver-auth=4,5" --make-flags=" -j20 --jobserver-auth=4,5" --data-mode=0644 --prog-mode=0755 --installed-list .installed.list --mantype="doc" --gnumake --install=all --exclude=doc I, [2024-05-18T00:53:16.601826 #1063579] INFO -- : Installing to I, [2024-05-18T00:53:16.601885 #1063579] INFO -- : installing binary commands: /tmp/ruby/install/trunk/bin I, [2024-05-18T00:53:16.601982 #1063579] INFO -- : installing base libraries: /tmp/ruby/install/trunk/lib I, [2024-05-18T00:53:16.609157 #1063579] INFO -- : installing arch files: /tmp/ruby/install/trunk/lib/ruby/3.4.0+0/x86_64-linux I, [2024-05-18T00:53:16.609181 #1063579] INFO -- : installing pkgconfig data: /tmp/ruby/install/trunk/lib/pkgconfig I, [2024-05-18T00:53:16.609188 #1063579] INFO -- : installing extension objects: /tmp/ruby/install/trunk/lib/ruby/3.4.0+0/x86_64-linux I, [2024-05-18T00:53:16.618480 #1063579] INFO -- : installing extension objects: /tmp/ruby/install/trunk/lib/ruby/site_ruby/3.4.0+0/x86_64-linux I, [2024-05-18T00:53:16.618503 #1063579] INFO -- : installing extension objects: /tmp/ruby/install/trunk/lib/ruby/vendor_ruby/3.4.0+0/x86_64-linux I, [2024-05-18T00:53:16.618510 #1063579] INFO -- : installing extension headers: /tmp/ruby/install/trunk/include/ruby-3.4.0+0/x86_64-linux I, [2024-05-18T00:53:16.618657 #1063579] INFO -- : installing extension scripts: /tmp/ruby/install/trunk/lib/ruby/3.4.0+0 I, [2024-05-18T00:53:16.621359 #1063579] INFO -- : installing extension scripts: /tmp/ruby/install/trunk/lib/ruby/site_ruby/3.4.0+0 I, [2024-05-18T00:53:16.621380 #1063579] INFO -- : installing extension scripts: /tmp/ruby/install/trunk/lib/ruby/vendor_ruby/3.4.0+0 I, [2024-05-18T00:53:16.621390 #1063579] INFO -- : installing extension headers: /tmp/ruby/install/trunk/include/ruby-3.4.0+0/ruby I, [2024-05-18T00:53:16.621394 #1063579] INFO -- : installing command scripts: /tmp/ruby/install/trunk/bin I, [2024-05-18T00:53:16.621399 #1063579] INFO -- : installing library scripts: /tmp/ruby/install/trunk/lib/ruby/3.4.0+0 I, [2024-05-18T00:53:16.653853 #1063579] INFO -- : installing common headers: /tmp/ruby/install/trunk/include/ruby-3.4.0+0 I, [2024-05-18T00:53:16.660253 #1063579] INFO -- : installing manpages: /tmp/ruby/install/trunk/share/man/man1 I, [2024-05-18T00:53:16.660286 #1063579] INFO -- : installing default gems from lib: /tmp/ruby/install/trunk/lib/ruby/gems/3.4.0+0 I, [2024-05-18T00:53:16.683163 #1063579] INFO -- : benchmark 0.3.0 I, [2024-05-18T00:53:16.685089 #1063579] INFO -- : bundler 2.6.0.dev I, [2024-05-18T00:53:16.687005 #1063579] INFO -- : cgi 0.4.1 I, [2024-05-18T00:53:16.687738 #1063579] INFO -- : delegate 0.3.1 I, [2024-05-18T00:53:16.688272 #1063579] INFO -- : did_you_mean 1.6.3 I, [2024-05-18T00:53:16.688763 #1063579] INFO -- : english 0.8.0 I, [2024-05-18T00:53:16.689231 #1063579] INFO -- : erb 4.0.4 I, [2024-05-18T00:53:16.690326 #1063579] INFO -- : error_highlight 0.6.0 I, [2024-05-18T00:53:16.691069 #1063579] INFO -- : fileutils 1.7.2 I, [2024-05-18T00:53:16.691738 #1063579] INFO -- : find 0.2.0 I, [2024-05-18T00:53:16.692533 #1063579] INFO -- : forwardable 1.3.3 I, [2024-05-18T00:53:16.693347 #1063579] INFO -- : ipaddr 1.2.6 I, [2024-05-18T00:53:16.694309 #1063579] INFO -- : irb 1.13.1 I, [2024-05-18T00:53:16.695093 #1063579] INFO -- : logger 1.6.0 I, [2024-05-18T00:53:16.695575 #1063579] INFO -- : net-http 0.4.1 I, [2024-05-18T00:53:16.696037 #1063579] INFO -- : net-protocol 0.2.2 I, [2024-05-18T00:53:16.696515 #1063579] INFO -- : open-uri 0.4.1 I, [2024-05-18T00:53:16.697099 #1063579] INFO -- : open3 0.2.1 I, [2024-05-18T00:53:16.697580 #1063579] INFO -- : optparse 0.5.0 I, [2024-05-18T00:53:16.698070 #1063579] INFO -- : ostruct 0.6.0 I, [2024-05-18T00:53:16.698497 #1063579] INFO -- : pp 0.5.0 I, [2024-05-18T00:53:16.699023 #1063579] INFO -- : prettyprint 0.2.0 I, [2024-05-18T00:53:16.699481 #1063579] INFO -- : prism 0.29.0 I, [2024-05-18T00:53:16.699939 #1063579] INFO -- : pstore 0.1.3 I, [2024-05-18T00:53:16.700492 #1063579] INFO -- : rdoc 6.6.3.1 I, [2024-05-18T00:53:16.701454 #1063579] INFO -- : readline 0.0.4 I, [2024-05-18T00:53:16.701978 #1063579] INFO -- : reline 0.5.7 I, [2024-05-18T00:53:16.702516 #1063579] INFO -- : resolv 0.4.0 I, [2024-05-18T00:53:16.702978 #1063579] INFO -- : ruby2_keywords 0.0.5 I, [2024-05-18T00:53:16.703497 #1063579] INFO -- : securerandom 0.3.1 I, [2024-05-18T00:53:16.704435 #1063579] INFO -- : set 1.1.0 I, [2024-05-18T00:53:16.705209 #1063579] INFO -- : shellwords 0.2.0 I, [2024-05-18T00:53:16.705697 #1063579] INFO -- : singleton 0.2.0 I, [2024-05-18T00:53:16.706158 #1063579] INFO -- : syntax_suggest 2.0.0 I, [2024-05-18T00:53:16.706851 #1063579] INFO -- : tempfile 0.2.1 I, [2024-05-18T00:53:16.707328 #1063579] INFO -- : time 0.3.0 I, [2024-05-18T00:53:16.707738 #1063579] INFO -- : timeout 0.4.1 I, [2024-05-18T00:53:16.708289 #1063579] INFO -- : tmpdir 0.2.0 I, [2024-05-18T00:53:16.708769 #1063579] INFO -- : tsort 0.2.0 I, [2024-05-18T00:53:16.709234 #1063579] INFO -- : un 0.3.0 I, [2024-05-18T00:53:16.709587 #1063579] INFO -- : uri 0.13.0 I, [2024-05-18T00:53:16.710254 #1063579] INFO -- : weakref 0.1.3 I, [2024-05-18T00:53:16.710731 #1063579] INFO -- : yaml 0.3.0 I, [2024-05-18T00:53:16.711058 #1063579] INFO -- : installing default gems from ext: /tmp/ruby/install/trunk/lib/ruby/gems/3.4.0+0 I, [2024-05-18T00:53:16.717571 #1063579] INFO -- : date 3.3.4 I, [2024-05-18T00:53:16.718107 #1063579] INFO -- : digest 3.1.1 I, [2024-05-18T00:53:16.718601 #1063579] INFO -- : etc 1.4.3 I, [2024-05-18T00:53:16.719089 #1063579] INFO -- : fcntl 1.1.0 I, [2024-05-18T00:53:16.719555 #1063579] INFO -- : fiddle 1.1.3 I, [2024-05-18T00:53:16.720197 #1063579] INFO -- : io-console 0.7.2 I, [2024-05-18T00:53:16.720673 #1063579] INFO -- : io-nonblock 0.3.0 I, [2024-05-18T00:53:16.721069 #1063579] INFO -- : io-wait 0.3.1 I, [2024-05-18T00:53:16.721639 #1063579] INFO -- : json 2.7.2 I, [2024-05-18T00:53:16.722269 #1063579] INFO -- : openssl 3.2.0 I, [2024-05-18T00:53:16.722779 #1063579] INFO -- : pathname 0.3.0 I, [2024-05-18T00:53:16.723261 #1063579] INFO -- : psych 5.1.2 I, [2024-05-18T00:53:16.723801 #1063579] INFO -- : stringio 3.1.1 I, [2024-05-18T00:53:16.724329 #1063579] INFO -- : strscan 3.1.1 I, [2024-05-18T00:53:16.724784 #1063579] INFO -- : zlib 3.1.0 I, [2024-05-18T00:53:16.725141 #1063579] INFO -- : installing bundled gems: /tmp/ruby/install/trunk/lib/ruby/gems/3.4.0+0 I, [2024-05-18T00:53:16.725727 #1063579] INFO -- : minitest 5.23.0 I, [2024-05-18T00:53:16.734175 #1063579] INFO -- : rake 13.2.1 I, [2024-05-18T00:53:16.737668 #1063579] INFO -- : test-unit 3.6.2 I, [2024-05-18T00:53:16.742329 #1063579] INFO -- : rexml 3.2.6 I, [2024-05-18T00:53:16.746143 #1063579] INFO -- : rss 0.3.0 I, [2024-05-18T00:53:16.748866 #1063579] INFO -- : net-ftp 0.3.4 I, [2024-05-18T00:53:16.750469 #1063579] INFO -- : net-imap 0.4.11 I, [2024-05-18T00:53:16.754230 #1063579] INFO -- : net-pop 0.1.2 I, [2024-05-18T00:53:16.755240 #1063579] INFO -- : net-smtp 0.5.0 I, [2024-05-18T00:53:16.756403 #1063579] INFO -- : matrix 0.4.2 I, [2024-05-18T00:53:16.759734 #1063579] INFO -- : prime 0.1.2 I, [2024-05-18T00:53:16.764575 #1063579] INFO -- : rbs 3.4.4 I, [2024-05-18T00:53:16.786926 #1063579] INFO -- : typeprof 0.21.11 I, [2024-05-18T00:53:16.789243 #1063579] INFO -- : debug 1.9.2 I, [2024-05-18T00:53:16.792582 #1063579] INFO -- : racc 1.7.3 I, [2024-05-18T00:53:16.795297 #1063579] INFO -- : mutex_m 0.2.0 I, [2024-05-18T00:53:16.796662 #1063579] INFO -- : getoptlong 0.2.1 I, [2024-05-18T00:53:16.798030 #1063579] INFO -- : base64 0.2.0 I, [2024-05-18T00:53:16.799132 #1063579] INFO -- : bigdecimal 3.1.8 I, [2024-05-18T00:53:16.801414 #1063579] INFO -- : observer 0.1.2 I, [2024-05-18T00:53:16.802983 #1063579] INFO -- : abbrev 0.1.2 I, [2024-05-18T00:53:16.804105 #1063579] INFO -- : resolv-replace 0.1.1 I, [2024-05-18T00:53:16.805566 #1063579] INFO -- : rinda 0.2.0 I, [2024-05-18T00:53:16.806853 #1063579] INFO -- : drb 2.2.1 I, [2024-05-18T00:53:16.808679 #1063579] INFO -- : nkf 0.2.0 I, [2024-05-18T00:53:16.811144 #1063579] INFO -- : syslog 0.1.2 I, [2024-05-18T00:53:16.812820 #1063579] INFO -- : csv 3.3.0 I, [2024-05-18T00:53:16.815553 #1063579] INFO -- : installing bundled gem cache: /tmp/ruby/install/trunk/lib/ruby/gems/3.4.0+0/cache I, [2024-05-18T00:53:16.817079 #1063579] INFO -- : skipped bundled gems: I, [2024-05-18T00:53:16.817100 #1063579] INFO -- : power_assert-2.0.4dev.gem not found in bundled_gems I, [2024-05-18T00:53:16.819989 #1063579] INFO -- : $$$[end] "make install -j20" exit with 0. I, [2024-05-18T00:53:16.820111 #1063579] INFO -- : $$$[beg] make yes-btest TESTOPTS='-q -j20' I, [2024-05-18T00:53:22.061522 #1063579] INFO -- : PASS all 1936 tests E, [2024-05-18T00:53:22.067123 #1063579] ERROR -- : I, [2024-05-18T00:53:22.067371 #1063579] INFO -- : $$$[end] "make yes-btest TESTOPTS='-q -j20'" exit with 0. I, [2024-05-18T00:53:22.067457 #1063579] INFO -- : $$$[beg] make yes-test-basic TESTS='-j20' I, [2024-05-18T00:53:22.128623 #1063579] INFO -- : BASERUBY = /usr/bin/ruby --disable=gems I, [2024-05-18T00:53:22.128670 #1063579] INFO -- : CC = gcc I, [2024-05-18T00:53:22.128684 #1063579] INFO -- : LD = ld I, [2024-05-18T00:53:22.128695 #1063579] INFO -- : LDSHARED = gcc -shared I, [2024-05-18T00:53:22.128706 #1063579] INFO -- : CFLAGS = -O3 -fno-fast-math -ggdb3 -Wall -Wextra -Wdeprecated-declarations -Wdiv-by-zero -Wduplicated-cond -Wimplicit-function-declaration -Wimplicit-int -Wpointer-arith -Wwrite-strings -Wold-style-definition -Wimplicit-fallthrough=0 -Wmissing-noreturn -Wno-cast-function-type -Wno-constant-logical-operand -Wno-long-long -Wno-missing-field-initializers -Wno-overlength-strings -Wno-packed-bitfield-compat -Wno-parentheses-equality -Wno-self-assign -Wno-tautological-compare -Wno-unused-parameter -Wno-unused-value -Wsuggest-attribute=format -Wsuggest-attribute=noreturn -Wunused-variable -Wmisleading-indentation -Wundef -fPIC I, [2024-05-18T00:53:22.128719 #1063579] INFO -- : XCFLAGS = -U_FORTIFY_SOURCE -D_FORTIFY_SOURCE=2 -fstack-protector-strong -fno-strict-overflow -fvisibility=hidden -fexcess-precision=standard -DRUBY_EXPORT -I. -I.ext/include/x86_64-linux -I/tmp/ruby/src/trunk/include -I/tmp/ruby/src/trunk -I/tmp/ruby/src/trunk/prism -I/tmp/ruby/src/trunk/enc/unicode/15.0.0 I, [2024-05-18T00:53:22.128729 #1063579] INFO -- : CPPFLAGS = I, [2024-05-18T00:53:22.128740 #1063579] INFO -- : DLDFLAGS = -Wl,--compress-debug-sections=zlib -Wl,-soname,libruby.so.3.4 -fstack-protector-strong I, [2024-05-18T00:53:22.128750 #1063579] INFO -- : SOLIBS = -lz -lrt -lrt -lgmp -ldl -lcrypt -lm -lpthread I, [2024-05-18T00:53:22.128761 #1063579] INFO -- : LANG = en_US.UTF-8 I, [2024-05-18T00:53:22.128770 #1063579] INFO -- : LC_ALL = I, [2024-05-18T00:53:22.128780 #1063579] INFO -- : LC_CTYPE = I, [2024-05-18T00:53:22.128790 #1063579] INFO -- : MFLAGS = I, [2024-05-18T00:53:22.128800 #1063579] INFO -- : RUSTC = no I, [2024-05-18T00:53:22.128811 #1063579] INFO -- : YJIT_RUSTC_ARGS = --crate-name=yjit --crate-type=staticlib --edition=2021 -g -C lto=thin -C opt-level=3 -C overflow-checks=on '--out-dir=/tmp/ruby/build/trunk/yjit/target/release/' /tmp/ruby/src/trunk/yjit/src/lib.rs I, [2024-05-18T00:53:22.129287 #1063579] INFO -- : gcc (Ubuntu 11.4.0-1ubuntu1~22.04) 11.4.0 I, [2024-05-18T00:53:22.129338 #1063579] INFO -- : Copyright (C) 2021 Free Software Foundation, Inc. I, [2024-05-18T00:53:22.129352 #1063579] INFO -- : This is free software; see the source for copying conditions. There is NO I, [2024-05-18T00:53:22.129368 #1063579] INFO -- : warranty; not even for MERCHANTABILITY or FITNESS FOR A PARTICULAR PURPOSE. I, [2024-05-18T00:53:22.129384 #1063579] INFO -- : I, [2024-05-18T00:53:22.235462 #1063579] INFO -- : Checking leaked global symbols...none I, [2024-05-18T00:53:22.276070 #1063579] INFO -- : /tmp/ruby/src/trunk/basictest/test.rb:assignment ....................................................................................................................................................................................................................................................................................................................................................................................OK 372 I, [2024-05-18T00:53:22.276149 #1063579] INFO -- : /tmp/ruby/src/trunk/basictest/test.rb:condition ..OK 2 I, [2024-05-18T00:53:22.276162 #1063579] INFO -- : /tmp/ruby/src/trunk/basictest/test.rb:if/unless ...OK 3 I, [2024-05-18T00:53:22.276173 #1063579] INFO -- : /tmp/ruby/src/trunk/basictest/test.rb:case .....OK 5 I, [2024-05-18T00:53:22.276343 #1063579] INFO -- : /tmp/ruby/src/trunk/basictest/test.rb:while/until ........OK 8 I, [2024-05-18T00:53:22.276394 #1063579] INFO -- : /tmp/ruby/src/trunk/basictest/test.rb:exception ..........OK 10 I, [2024-05-18T00:53:22.276662 #1063579] INFO -- : /tmp/ruby/src/trunk/basictest/test.rb:array .......................................OK 39 I, [2024-05-18T00:53:22.276765 #1063579] INFO -- : /tmp/ruby/src/trunk/basictest/test.rb:hash ...........................OK 27 I, [2024-05-18T00:53:22.277476 #1063579] INFO -- : /tmp/ruby/src/trunk/basictest/test.rb:iterator ...........................................................................................................OK 107 I, [2024-05-18T00:53:22.277754 #1063579] INFO -- : /tmp/ruby/src/trunk/basictest/test.rb:float ................................................................................OK 80 I, [2024-05-18T00:53:22.278752 #1063579] INFO -- : /tmp/ruby/src/trunk/basictest/test.rb:bignum ...............................OK 31 I, [2024-05-18T00:53:22.279525 #1063579] INFO -- : /tmp/ruby/src/trunk/basictest/test.rb:string & char ..............................................................OK 62 I, [2024-05-18T00:53:22.279553 #1063579] INFO -- : /tmp/ruby/src/trunk/basictest/test.rb:assignment ..........OK 10 I, [2024-05-18T00:53:22.279582 #1063579] INFO -- : /tmp/ruby/src/trunk/basictest/test.rb:call ......OK 6 I, [2024-05-18T00:53:22.279631 #1063579] INFO -- : /tmp/ruby/src/trunk/basictest/test.rb:proc .........OK 9 I, [2024-05-18T00:53:22.380259 #1063579] INFO -- : /tmp/ruby/src/trunk/basictest/test.rb:signal ..OK 2 I, [2024-05-18T00:53:22.382171 #1063579] INFO -- : /tmp/ruby/src/trunk/basictest/test.rb:eval ...........................OK 27 I, [2024-05-18T00:53:22.502569 #1063579] INFO -- : /tmp/ruby/src/trunk/basictest/test.rb:system ........OK 8 I, [2024-05-18T00:53:22.502653 #1063579] INFO -- : /tmp/ruby/src/trunk/basictest/test.rb:const .....OK 5 I, [2024-05-18T00:53:22.502667 #1063579] INFO -- : /tmp/ruby/src/trunk/basictest/test.rb:clone .....OK 5 I, [2024-05-18T00:53:22.502681 #1063579] INFO -- : /tmp/ruby/src/trunk/basictest/test.rb:marshal ....OK 4 I, [2024-05-18T00:53:22.502698 #1063579] INFO -- : /tmp/ruby/src/trunk/basictest/test.rb:pack ....OK 4 I, [2024-05-18T00:53:22.502730 #1063579] INFO -- : /tmp/ruby/src/trunk/basictest/test.rb:math ..OK 2 I, [2024-05-18T00:53:22.502769 #1063579] INFO -- : /tmp/ruby/src/trunk/basictest/test.rb:struct ......OK 6 I, [2024-05-18T00:53:22.502878 #1063579] INFO -- : /tmp/ruby/src/trunk/basictest/test.rb:variable ............OK 12 I, [2024-05-18T00:53:22.502904 #1063579] INFO -- : /tmp/ruby/src/trunk/basictest/test.rb:trace ...OK 3 I, [2024-05-18T00:53:22.502927 #1063579] INFO -- : /tmp/ruby/src/trunk/basictest/test.rb:defined? ............OK 12 I, [2024-05-18T00:53:22.502967 #1063579] INFO -- : /tmp/ruby/src/trunk/basictest/test.rb:alias ......OK 6 I, [2024-05-18T00:53:22.503323 #1063579] INFO -- : /tmp/ruby/src/trunk/basictest/test.rb:path .......................OK 23 I, [2024-05-18T00:53:22.536984 #1063579] INFO -- : /tmp/ruby/src/trunk/basictest/test.rb:gc ....OK 4 I, [2024-05-18T00:53:22.539316 #1063579] INFO -- : I, [2024-05-18T00:53:22.539406 #1063579] INFO -- : test succeeded I, [2024-05-18T00:53:22.540834 #1063579] INFO -- : $$$[end] "make yes-test-basic TESTS='-j20'" exit with 0. I, [2024-05-18T00:53:22.540943 #1063579] INFO -- : $$$[beg] make yes-test-all TESTOPTS='--stderr-on-failure' TESTS='-j20' I, [2024-05-18T00:53:22.638129 #1063579] INFO -- : BASERUBY = /usr/bin/ruby --disable=gems I, [2024-05-18T00:53:22.638165 #1063579] INFO -- : CC = gcc I, [2024-05-18T00:53:22.638171 #1063579] INFO -- : LD = ld I, [2024-05-18T00:53:22.638176 #1063579] INFO -- : LDSHARED = gcc -shared I, [2024-05-18T00:53:22.638181 #1063579] INFO -- : CFLAGS = -O3 -fno-fast-math -ggdb3 -Wall -Wextra -Wdeprecated-declarations -Wdiv-by-zero -Wduplicated-cond -Wimplicit-function-declaration -Wimplicit-int -Wpointer-arith -Wwrite-strings -Wold-style-definition -Wimplicit-fallthrough=0 -Wmissing-noreturn -Wno-cast-function-type -Wno-constant-logical-operand -Wno-long-long -Wno-missing-field-initializers -Wno-overlength-strings -Wno-packed-bitfield-compat -Wno-parentheses-equality -Wno-self-assign -Wno-tautological-compare -Wno-unused-parameter -Wno-unused-value -Wsuggest-attribute=format -Wsuggest-attribute=noreturn -Wunused-variable -Wmisleading-indentation -Wundef -fPIC I, [2024-05-18T00:53:22.638186 #1063579] INFO -- : XCFLAGS = -U_FORTIFY_SOURCE -D_FORTIFY_SOURCE=2 -fstack-protector-strong -fno-strict-overflow -fvisibility=hidden -fexcess-precision=standard -DRUBY_EXPORT -I. -I.ext/include/x86_64-linux -I/tmp/ruby/src/trunk/include -I/tmp/ruby/src/trunk -I/tmp/ruby/src/trunk/prism -I/tmp/ruby/src/trunk/enc/unicode/15.0.0 I, [2024-05-18T00:53:22.638190 #1063579] INFO -- : CPPFLAGS = I, [2024-05-18T00:53:22.638193 #1063579] INFO -- : DLDFLAGS = -Wl,--compress-debug-sections=zlib -Wl,-soname,libruby.so.3.4 -fstack-protector-strong I, [2024-05-18T00:53:22.638197 #1063579] INFO -- : SOLIBS = -lz -lrt -lrt -lgmp -ldl -lcrypt -lm -lpthread I, [2024-05-18T00:53:22.638201 #1063579] INFO -- : LANG = en_US.UTF-8 I, [2024-05-18T00:53:22.638204 #1063579] INFO -- : LC_ALL = I, [2024-05-18T00:53:22.638208 #1063579] INFO -- : LC_CTYPE = I, [2024-05-18T00:53:22.638211 #1063579] INFO -- : MFLAGS = I, [2024-05-18T00:53:22.638214 #1063579] INFO -- : RUSTC = no I, [2024-05-18T00:53:22.638223 #1063579] INFO -- : YJIT_RUSTC_ARGS = --crate-name=yjit --crate-type=staticlib --edition=2021 -g -C lto=thin -C opt-level=3 -C overflow-checks=on '--out-dir=/tmp/ruby/build/trunk/yjit/target/release/' /tmp/ruby/src/trunk/yjit/src/lib.rs I, [2024-05-18T00:53:22.638770 #1063579] INFO -- : gcc (Ubuntu 11.4.0-1ubuntu1~22.04) 11.4.0 I, [2024-05-18T00:53:22.638791 #1063579] INFO -- : Copyright (C) 2021 Free Software Foundation, Inc. I, [2024-05-18T00:53:22.638798 #1063579] INFO -- : This is free software; see the source for copying conditions. There is NO I, [2024-05-18T00:53:22.638803 #1063579] INFO -- : warranty; not even for MERCHANTABILITY or FITNESS FOR A PARTICULAR PURPOSE. I, [2024-05-18T00:53:22.638807 #1063579] INFO -- : I, [2024-05-18T00:53:22.640491 #1063579] INFO -- : generating enc.mk I, [2024-05-18T00:53:22.760684 #1063579] INFO -- : making enc I, [2024-05-18T00:53:22.778827 #1063579] INFO -- : make[1]: Entering directory '/tmp/ruby/build/trunk' I, [2024-05-18T00:53:22.778852 #1063579] INFO -- : make[1]: Nothing to be done for 'enc'. I, [2024-05-18T00:53:22.778859 #1063579] INFO -- : make[1]: Leaving directory '/tmp/ruby/build/trunk' I, [2024-05-18T00:53:22.779454 #1063579] INFO -- : making srcs under enc I, [2024-05-18T00:53:22.809512 #1063579] INFO -- : make[1]: Entering directory '/tmp/ruby/build/trunk' I, [2024-05-18T00:53:22.809542 #1063579] INFO -- : make[1]: Nothing to be done for 'srcs'. I, [2024-05-18T00:53:22.809548 #1063579] INFO -- : make[1]: Leaving directory '/tmp/ruby/build/trunk' I, [2024-05-18T00:53:22.810469 #1063579] INFO -- : generating transdb.h I, [2024-05-18T00:53:22.906234 #1063579] INFO -- : transdb.h unchanged I, [2024-05-18T00:53:22.907488 #1063579] INFO -- : making trans I, [2024-05-18T00:53:22.941170 #1063579] INFO -- : make[1]: Entering directory '/tmp/ruby/build/trunk' I, [2024-05-18T00:53:22.941192 #1063579] INFO -- : make[1]: Nothing to be done for 'trans'. I, [2024-05-18T00:53:22.941197 #1063579] INFO -- : make[1]: Leaving directory '/tmp/ruby/build/trunk' I, [2024-05-18T00:53:22.941875 #1063579] INFO -- : making encs I, [2024-05-18T00:53:22.980391 #1063579] INFO -- : make[1]: Entering directory '/tmp/ruby/build/trunk' I, [2024-05-18T00:53:22.980412 #1063579] INFO -- : make[1]: Nothing to be done for 'encs'. I, [2024-05-18T00:53:22.980417 #1063579] INFO -- : make[1]: Leaving directory '/tmp/ruby/build/trunk' I, [2024-05-18T00:53:22.982251 #1063579] INFO -- : generating makefiles ext/configure-ext.mk I, [2024-05-18T00:53:23.008860 #1063579] INFO -- : ext/configure-ext.mk updated I, [2024-05-18T00:53:23.011280 #1063579] INFO -- : make[1]: Entering directory '/tmp/ruby/build/trunk' I, [2024-05-18T00:53:24.358783 #1063579] INFO -- : make[1]: Leaving directory '/tmp/ruby/build/trunk' I, [2024-05-18T00:53:24.359472 #1063579] INFO -- : generating makefile exts.mk I, [2024-05-18T00:53:24.395430 #1063579] INFO -- : exts.mk unchanged I, [2024-05-18T00:53:24.399977 #1063579] INFO -- : make[1]: Entering directory '/tmp/ruby/build/trunk' I, [2024-05-18T00:53:24.727361 #1063579] INFO -- : make[2]: Entering directory '/tmp/ruby/build/trunk/ext/coverage' I, [2024-05-18T00:53:24.731650 #1063579] INFO -- : make[2]: Leaving directory '/tmp/ruby/build/trunk/ext/coverage' I, [2024-05-18T00:53:24.737331 #1063579] INFO -- : make[2]: Entering directory '/tmp/ruby/build/trunk/ext/date' I, [2024-05-18T00:53:24.740809 #1063579] INFO -- : make[2]: Leaving directory '/tmp/ruby/build/trunk/ext/date' I, [2024-05-18T00:53:24.743981 #1063579] INFO -- : make[2]: Entering directory '/tmp/ruby/build/trunk/ext/digest' I, [2024-05-18T00:53:24.752969 #1063579] INFO -- : make[2]: Leaving directory '/tmp/ruby/build/trunk/ext/digest' I, [2024-05-18T00:53:24.778294 #1063579] INFO -- : make[2]: Entering directory '/tmp/ruby/build/trunk/ext/digest/sha2' I, [2024-05-18T00:53:24.782885 #1063579] INFO -- : make[2]: Leaving directory '/tmp/ruby/build/trunk/ext/digest/sha2' I, [2024-05-18T00:53:24.804092 #1063579] INFO -- : make[2]: Entering directory '/tmp/ruby/build/trunk/ext/fiddle' I, [2024-05-18T00:53:24.814594 #1063579] INFO -- : make[2]: Leaving directory '/tmp/ruby/build/trunk/ext/fiddle' I, [2024-05-18T00:53:24.818364 #1063579] INFO -- : make[2]: Entering directory '/tmp/ruby/build/trunk/ext/io/console' I, [2024-05-18T00:53:24.822459 #1063579] INFO -- : make[2]: Leaving directory '/tmp/ruby/build/trunk/ext/io/console' I, [2024-05-18T00:53:24.834999 #1063579] INFO -- : make[2]: Entering directory '/tmp/ruby/build/trunk/ext/json' I, [2024-05-18T00:53:24.845568 #1063579] INFO -- : make[2]: Leaving directory '/tmp/ruby/build/trunk/ext/json' I, [2024-05-18T00:53:24.860801 #1063579] INFO -- : make[2]: Entering directory '/tmp/ruby/build/trunk/ext/monitor' I, [2024-05-18T00:53:24.864831 #1063579] INFO -- : make[2]: Leaving directory '/tmp/ruby/build/trunk/ext/monitor' I, [2024-05-18T00:53:24.872553 #1063579] INFO -- : make[2]: Entering directory '/tmp/ruby/build/trunk/ext/objspace' I, [2024-05-18T00:53:24.878786 #1063579] INFO -- : make[2]: Leaving directory '/tmp/ruby/build/trunk/ext/objspace' I, [2024-05-18T00:53:24.899662 #1063579] INFO -- : make[2]: Entering directory '/tmp/ruby/build/trunk/ext/openssl' I, [2024-05-18T00:53:24.918061 #1063579] INFO -- : make[2]: Leaving directory '/tmp/ruby/build/trunk/ext/openssl' I, [2024-05-18T00:53:24.921522 #1063579] INFO -- : make[2]: Entering directory '/tmp/ruby/build/trunk/ext/pathname' I, [2024-05-18T00:53:24.925371 #1063579] INFO -- : make[2]: Leaving directory '/tmp/ruby/build/trunk/ext/pathname' I, [2024-05-18T00:53:24.932597 #1063579] INFO -- : make[2]: Entering directory '/tmp/ruby/build/trunk/ext/psych' I, [2024-05-18T00:53:24.953178 #1063579] INFO -- : make[2]: Leaving directory '/tmp/ruby/build/trunk/ext/psych' I, [2024-05-18T00:53:24.957138 #1063579] INFO -- : make[2]: Entering directory '/tmp/ruby/build/trunk/ext/pty' I, [2024-05-18T00:53:24.961091 #1063579] INFO -- : make[2]: Leaving directory '/tmp/ruby/build/trunk/ext/pty' I, [2024-05-18T00:53:24.977016 #1063579] INFO -- : make[2]: Entering directory '/tmp/ruby/build/trunk/ext/ripper' I, [2024-05-18T00:53:24.984759 #1063579] INFO -- : make[2]: Leaving directory '/tmp/ruby/build/trunk/ext/ripper' I, [2024-05-18T00:53:24.987243 #1063579] INFO -- : make[2]: Entering directory '/tmp/ruby/build/trunk/ext/rubyvm' I, [2024-05-18T00:53:24.990536 #1063579] INFO -- : make[2]: Leaving directory '/tmp/ruby/build/trunk/ext/rubyvm' I, [2024-05-18T00:53:25.001961 #1063579] INFO -- : make[2]: Entering directory '/tmp/ruby/build/trunk/ext/socket' I, [2024-05-18T00:53:25.009221 #1063579] INFO -- : make[2]: Leaving directory '/tmp/ruby/build/trunk/ext/socket' I, [2024-05-18T00:53:25.026706 #1063579] INFO -- : make[2]: Entering directory '/tmp/ruby/build/trunk/.bundle/gems/bigdecimal-3.1.8/ext/bigdecimal' I, [2024-05-18T00:53:25.057160 #1063579] INFO -- : make[2]: Leaving directory '/tmp/ruby/build/trunk/.bundle/gems/bigdecimal-3.1.8/ext/bigdecimal' I, [2024-05-18T00:53:25.059136 #1063579] INFO -- : make[2]: Entering directory '/tmp/ruby/build/trunk/.bundle/gems/debug-1.9.2/ext/debug' I, [2024-05-18T00:53:25.080829 #1063579] INFO -- : make[2]: Leaving directory '/tmp/ruby/build/trunk/.bundle/gems/debug-1.9.2/ext/debug' I, [2024-05-18T00:53:25.082690 #1063579] INFO -- : make[2]: Entering directory '/tmp/ruby/build/trunk/.bundle/gems/nkf-0.2.0/ext/nkf' I, [2024-05-18T00:53:25.104869 #1063579] INFO -- : make[2]: Leaving directory '/tmp/ruby/build/trunk/.bundle/gems/nkf-0.2.0/ext/nkf' I, [2024-05-18T00:53:25.106806 #1063579] INFO -- : make[2]: Entering directory '/tmp/ruby/build/trunk/.bundle/gems/racc-1.7.3/ext/racc/cparse' I, [2024-05-18T00:53:25.128092 #1063579] INFO -- : make[2]: Leaving directory '/tmp/ruby/build/trunk/.bundle/gems/racc-1.7.3/ext/racc/cparse' I, [2024-05-18T00:53:25.130670 #1063579] INFO -- : make[2]: Entering directory '/tmp/ruby/build/trunk/.bundle/gems/rbs-3.4.4/ext/rbs_extension' I, [2024-05-18T00:53:25.155913 #1063579] INFO -- : make[2]: Leaving directory '/tmp/ruby/build/trunk/.bundle/gems/rbs-3.4.4/ext/rbs_extension' I, [2024-05-18T00:53:25.158925 #1063579] INFO -- : make[2]: Entering directory '/tmp/ruby/build/trunk/.bundle/gems/syslog-0.1.2/ext/syslog' I, [2024-05-18T00:53:25.186472 #1063579] INFO -- : make[2]: Leaving directory '/tmp/ruby/build/trunk/.bundle/gems/syslog-0.1.2/ext/syslog' I, [2024-05-18T00:53:25.211199 #1063579] INFO -- : make[2]: Entering directory '/tmp/ruby/build/trunk' I, [2024-05-18T00:53:25.273843 #1063579] INFO -- : make[2]: 'ruby' is up to date. I, [2024-05-18T00:53:25.273881 #1063579] INFO -- : make[2]: Leaving directory '/tmp/ruby/build/trunk' I, [2024-05-18T00:53:25.274079 #1063579] INFO -- : make[1]: Leaving directory '/tmp/ruby/build/trunk' I, [2024-05-18T00:53:25.277756 #1063579] INFO -- : make[1]: Entering directory '/tmp/ruby/build/trunk' I, [2024-05-18T00:53:25.277777 #1063579] INFO -- : make[1]: Nothing to be done for 'note'. I, [2024-05-18T00:53:25.277783 #1063579] INFO -- : make[1]: Leaving directory '/tmp/ruby/build/trunk' I, [2024-05-18T00:53:25.360391 #1063579] INFO -- : Run options: I, [2024-05-18T00:53:25.360450 #1063579] INFO -- : --seed=29489 I, [2024-05-18T00:53:25.360456 #1063579] INFO -- : "--ruby=./miniruby -I/tmp/ruby/src/trunk/lib -I. -I.ext/common /tmp/ruby/src/trunk/tool/runruby.rb --extout=.ext -- --disable-gems" I, [2024-05-18T00:53:25.360460 #1063579] INFO -- : --excludes-dir=/tmp/ruby/src/trunk/test/.excludes I, [2024-05-18T00:53:25.360472 #1063579] INFO -- : --name=!/memory_leak/ I, [2024-05-18T00:53:25.360480 #1063579] INFO -- : --stderr-on-failure I, [2024-05-18T00:53:25.360483 #1063579] INFO -- : -j20 I, [2024-05-18T00:53:25.360487 #1063579] INFO -- : I, [2024-05-18T00:53:25.360491 #1063579] INFO -- : # Running tests: I, [2024-05-18T00:53:25.360494 #1063579] INFO -- : I, [2024-05-18T00:53:25.509856 #1063579] INFO -- : [ 1/885] 1104909=test_yaml I, [2024-05-18T00:53:25.509932 #1063579] INFO -- : [ 2/885] 1104913=test_forwardable I, [2024-05-18T00:53:25.510136 #1063579] INFO -- : [ 3/885] 1104910=test_wait I, [2024-05-18T00:53:25.510166 #1063579] INFO -- : [ 4/885] 1104911=test_handle I, [2024-05-18T00:53:25.512199 #1063579] INFO -- : [ 5/885] 1104912=test_big2str I, [2024-05-18T00:53:25.512953 #1063579] INFO -- : [ 6/885] 1104922=test_bmethod I, [2024-05-18T00:53:25.513042 #1063579] INFO -- : [ 7/885] 1104926=test_ractor I, [2024-05-18T00:53:25.514113 #1063579] INFO -- : [ 8/885] 1104912=test_euc_tw I, [2024-05-18T00:53:25.514150 #1063579] INFO -- : [ 9/885] 1104923=test_ansi_without_terminfo I, [2024-05-18T00:53:25.516200 #1063579] INFO -- : [ 10/885] 1104927=test_gem_commands_sources_command I, [2024-05-18T00:53:25.516261 #1063579] INFO -- : [ 11/885] 1104924=test_nowrite I, [2024-05-18T00:53:25.516269 #1063579] INFO -- : [ 12/885] 1104925=test_thread_queue I, [2024-05-18T00:53:25.516275 #1063579] INFO -- : [ 13/885] 1104908=test_rdoc_markup_formatter I, [2024-05-18T00:53:25.517410 #1063579] INFO -- : [ 14/885] 1104922=test_comparable I, [2024-05-18T00:53:25.520269 #1063579] INFO -- : [ 15/885] 1104912=test_rdoc_parser_c I, [2024-05-18T00:53:25.522440 #1063579] INFO -- : [ 16/885] 1104922=test_io_timeout I, [2024-05-18T00:53:25.526196 #1063579] INFO -- : [ 17/885] 1104922=test_shapes I, [2024-05-18T00:53:25.535303 #1063579] INFO -- : [ 18/885] 1104913=json_fixtures_test I, [2024-05-18T00:53:25.537082 #1063579] INFO -- : [ 19/885] 1104922=test_pstore I, [2024-05-18T00:53:25.538262 #1063579] INFO -- : [ 20/885] 1104915=test_cstr I, [2024-05-18T00:53:25.539113 #1063579] INFO -- : [ 21/885] 1104926=test_profile_frames I, [2024-05-18T00:53:25.541929 #1063579] INFO -- : [ 22/885] 1104924=test_gbk I, [2024-05-18T00:53:25.544169 #1063579] INFO -- : [ 23/885] 1104921=test_class2name I, [2024-05-18T00:53:25.544249 #1063579] INFO -- : [ 24/885] 1104916=test_enc_str_buf_cat I, [2024-05-18T00:53:25.544297 #1063579] INFO -- : [ 25/885] 1104919=test_gem_ext_cmake_builder I, [2024-05-18T00:53:25.544462 #1063579] INFO -- : [ 26/885] 1104914=test_gem_commands_contents_command I, [2024-05-18T00:53:25.544547 #1063579] INFO -- : [ 27/885] 1104917=test_cgi_util I, [2024-05-18T00:53:25.544643 #1063579] INFO -- : [ 28/885] 1104918=test_require I, [2024-05-18T00:53:25.544766 #1063579] INFO -- : [ 29/885] 1104920=test_marshalable I, [2024-05-18T00:53:25.546946 #1063579] INFO -- : [ 30/885] 1104913=test_digest I, [2024-05-18T00:53:25.547830 #1063579] INFO -- : [ 31/885] 1104921=test_ractor I, [2024-05-18T00:53:25.548886 #1063579] INFO -- : [ 32/885] 1104924=test_find I, [2024-05-18T00:53:25.553148 #1063579] INFO -- : [ 33/885] 1104916=test_fiddle I, [2024-05-18T00:53:25.560911 #1063579] INFO -- : [ 34/885] 1104924=test_wss I, [2024-05-18T00:53:25.562977 #1063579] INFO -- : [ 35/885] 1104911=test_rdoc_markdown I, [2024-05-18T00:53:25.569312 #1063579] INFO -- : [ 36/885] 1104916=test_gem_available_set I, [2024-05-18T00:53:25.578825 #1063579] INFO -- : [ 37/885] 1104910=test_rdoc_any_method I, [2024-05-18T00:53:25.579073 #1063579] INFO -- : [ 38/885] 1104920=test_modify_expand I, [2024-05-18T00:53:25.579206 #1063579] INFO -- : [ 39/885] 1104924=test_file I, [2024-05-18T00:53:25.582294 #1063579] INFO -- : [ 40/885] 1104924=test_coverage I, [2024-05-18T00:53:25.582799 #1063579] INFO -- : [ 41/885] 1104923=test_rdoc_encoding I, [2024-05-18T00:53:25.582834 #1063579] INFO -- : [ 42/885] 1104920=regexp_test I, [2024-05-18T00:53:25.587956 #1063579] INFO -- : [ 43/885] 1104922=test_gem_package_tar_reader I, [2024-05-18T00:53:25.605253 #1063579] INFO -- : [ 44/885] 1104909=test_init I, [2024-05-18T00:53:25.626303 #1063579] INFO -- : [ 45/885] 1104908=test_complexrational I, [2024-05-18T00:53:25.631978 #1063579] INFO -- : [ 46/885] 1104915=test_pathname I, [2024-05-18T00:53:25.632415 #1063579] INFO -- : [ 47/885] 1104908=test_gem_source_vendor I, [2024-05-18T00:53:25.679924 #1063579] INFO -- : [ 48/885] 1104921=test_gem_commands_owner_command I, [2024-05-18T00:53:25.687706 #1063579] INFO -- : [ 49/885] 1104920=test_recorder I, [2024-05-18T00:53:25.694177 #1063579] INFO -- : [ 50/885] 1104920=test_deprecate I, [2024-05-18T00:53:25.722625 #1063579] INFO -- : [ 51/885] 1104923=test_rdoc_constant I, [2024-05-18T00:53:25.727220 #1063579] INFO -- : [ 52/885] 1104926=test_bash_completion I, [2024-05-18T00:53:25.730476 #1063579] INFO -- : [ 53/885] 1104926=test_formatter I, [2024-05-18T00:53:25.737152 #1063579] INFO -- : [ 54/885] 1104926=test_yamlstore I, [2024-05-18T00:53:25.752982 #1063579] INFO -- : [ 55/885] 1104919=test_gem_installer I, [2024-05-18T00:53:25.756355 #1063579] INFO -- : [ 56/885] 1104917=test_date_strftime I, [2024-05-18T00:53:25.767625 #1063579] INFO -- : [ 57/885] 1104926=test_rdoc_parser_rd I, [2024-05-18T00:53:25.779149 #1063579] INFO -- : [ 58/885] 1104922=test_irb I, [2024-05-18T00:53:25.809450 #1063579] INFO -- : [ 59/885] 1104916=test_class I, [2024-05-18T00:53:25.824816 #1063579] INFO -- : [ 60/885] 1104915=test_rdoc_normal_class I, [2024-05-18T00:53:25.843814 #1063579] INFO -- : [ 61/885] 1104912=test_const I, [2024-05-18T00:53:25.845915 #1063579] INFO -- : [ 62/885] 1104912=json_string_matching_test I, [2024-05-18T00:53:25.849886 #1063579] INFO -- : [ 63/885] 1104927=test_load I, [2024-05-18T00:53:25.852362 #1063579] INFO -- : [ 64/885] 1104912=test_random I, [2024-05-18T00:53:25.853205 #1063579] INFO -- : [ 65/885] 1104908=test_asn1 I, [2024-05-18T00:53:25.854951 #1063579] INFO -- : [ 66/885] 1104927=test_tempfile I, [2024-05-18T00:53:25.855515 #1063579] INFO -- : [ 67/885] 1104923=parse_comments_test I, [2024-05-18T00:53:25.862126 #1063579] INFO -- : [ 68/885] 1104911=test_noarg I, [2024-05-18T00:53:25.865183 #1063579] INFO -- : [ 69/885] 1104914=test_function I, [2024-05-18T00:53:25.876483 #1063579] INFO -- : [ 70/885] 1104908=test_queue I, [2024-05-18T00:53:25.880325 #1063579] INFO -- : [ 71/885] 1104908=test_internal_ivar I, [2024-05-18T00:53:25.881924 #1063579] INFO -- : [ 72/885] 1104908=test_gem_resolver_index_specification I, [2024-05-18T00:53:25.885702 #1063579] INFO -- : [ 73/885] 1104912=test_utf32 I, [2024-05-18T00:53:25.889520 #1063579] INFO -- : [ 74/885] 1104912=test_basicsocket I, [2024-05-18T00:53:25.898103 #1063579] INFO -- : [ 75/885] 1104912=test_duplicate I, [2024-05-18T00:53:25.904968 #1063579] INFO -- : [ 76/885] 1104912=test_rdoc_markup I, [2024-05-18T00:53:25.906386 #1063579] INFO -- : [ 77/885] 1104923=test_gem_commands_help_command I, [2024-05-18T00:53:25.909559 #1063579] INFO -- : [ 78/885] 1104912=test_prettyprint I, [2024-05-18T00:53:25.921857 #1063579] INFO -- : [ 79/885] 1104912=test_tracepoint I, [2024-05-18T00:53:25.928674 #1063579] INFO -- : [ 80/885] 1104926=test_too_many_dummy_encodings I, [2024-05-18T00:53:25.941267 #1063579] INFO -- : [ 81/885] 1104920=test_gem_commands_list_command I, [2024-05-18T00:53:25.948717 #1063579] INFO -- : [ 82/885] 1104908=test_stack I, [2024-05-18T00:53:25.956799 #1063579] INFO -- : [ 83/885] 1104920=test_rdoc_include I, [2024-05-18T00:53:25.997135 #1063579] INFO -- : [ 84/885] 1104911=test_reqarg I, [2024-05-18T00:53:26.008152 #1063579] INFO -- : [ 85/885] 1104926=test_fileutils I, [2024-05-18T00:53:26.022205 #1063579] INFO -- : [ 86/885] 1104915=test_string_processing I, [2024-05-18T00:53:26.064905 #1063579] INFO -- : [ 87/885] 1104909=test_emitter I, [2024-05-18T00:53:26.067622 #1063579] INFO -- : [ 88/885] 1104909=test_resource I, [2024-05-18T00:53:26.085997 #1063579] INFO -- : [ 89/885] 1104915=test_gem_commands_signin_command I, [2024-05-18T00:53:26.086930 #1063579] INFO -- : [ 90/885] 1104914=test_ldap I, [2024-05-18T00:53:26.093343 #1063579] INFO -- : [ 91/885] 1104909=test_gem_version I, [2024-05-18T00:53:26.104794 #1063579] INFO -- : [ 92/885] 1104927=test_rdoc_options I, [2024-05-18T00:53:26.107536 #1063579] INFO -- : [ 93/885] 1104912=test_econv I, [2024-05-18T00:53:26.124887 #1063579] INFO -- : [ 94/885] 1104914=test_cesu8 I, [2024-05-18T00:53:26.127312 #1063579] INFO -- : [ 95/885] 1104914=test_inlinecache I, [2024-05-18T00:53:26.164913 #1063579] INFO -- : [ 96/885] 1104923=test_rdoc_markup_verbatim I, [2024-05-18T00:53:26.169419 #1063579] INFO -- : [ 97/885] 1104923=test_gem_resolver_specification I, [2024-05-18T00:53:26.176976 #1063579] INFO -- : [ 98/885] 1104922=test_gem_dependency I, [2024-05-18T00:53:26.196706 #1063579] INFO -- : [ 99/885] 1104923=test_path_to_class I, [2024-05-18T00:53:26.199056 #1063579] INFO -- : [100/885] 1104923=test_gem_ext_ext_conf_builder I, [2024-05-18T00:53:26.199115 #1063579] INFO -- : [101/885] 1104914=test_frozen_error I, [2024-05-18T00:53:26.203004 #1063579] INFO -- : [102/885] 1104914=test_method_cache I, [2024-05-18T00:53:26.206516 #1063579] INFO -- : [103/885] 1104914=test_gem_stub_specification I, [2024-05-18T00:53:26.228123 #1063579] INFO -- : [104/885] 1104920=test_gem_commands_search_command I, [2024-05-18T00:53:26.235283 #1063579] INFO -- : [105/885] 1104920=test_complex I, [2024-05-18T00:53:26.240095 #1063579] INFO -- : [106/885] 1104910=test_scanner_events I, [2024-05-18T00:53:26.278247 #1063579] INFO -- : [107/885] 1104910=test_gem_resolver_installed_specification I, [2024-05-18T00:53:26.282189 #1063579] INFO -- : [108/885] 1104911=test_mdns I, [2024-05-18T00:53:26.301512 #1063579] INFO -- : [109/885] 1104922=test_parse I, [2024-05-18T00:53:26.308848 #1063579] INFO -- : [110/885] 1104909=test_gem_remote_fetcher I, [2024-05-18T00:53:26.310116 #1063579] INFO -- : [111/885] 1104911=test_undef I, [2024-05-18T00:53:26.313260 #1063579] INFO -- : [112/885] 1104911=test_objspace I, [2024-05-18T00:53:26.318775 #1063579] INFO -- : [113/885] 1104915=ripper_test I, [2024-05-18T00:53:26.331993 #1063579] INFO -- : [114/885] 1104926=test_line_editor I, [2024-05-18T00:53:26.349615 #1063579] INFO -- : [115/885] 1104914=comments_test I, [2024-05-18T00:53:26.353931 #1063579] INFO -- : [116/885] 1104917=test_gem_requirement I, [2024-05-18T00:53:26.359461 #1063579] INFO -- : [117/885] 1104924=test_sprintf I, [2024-05-18T00:53:26.364915 #1063579] INFO -- : [118/885] 1104920=test_string_memory I, [2024-05-18T00:53:26.380471 #1063579] INFO -- : [119/885] 1104913=test_gem_security_trust_dir I, [2024-05-18T00:53:26.408254 #1063579] INFO -- : [120/885] 1104926=test_set I, [2024-05-18T00:53:26.414120 #1063579] INFO -- : [121/885] 1104926=test_show_source I, [2024-05-18T00:53:26.421149 #1063579] INFO -- : [122/885] 1104921=test_remote_fetch_error I, [2024-05-18T00:53:26.429920 #1063579] INFO -- : [123/885] 1104920=test_have_library I, [2024-05-18T00:53:26.432096 #1063579] INFO -- : [124/885] 1104921=test_lock_native_thread I, [2024-05-18T00:53:26.434149 #1063579] INFO -- : [125/885] 1104914=test_c_struct_entry I, [2024-05-18T00:53:26.447937 #1063579] INFO -- : [126/885] 1104910=test_gem_commands_stale_command I, [2024-05-18T00:53:26.463025 #1063579] INFO -- : [127/885] 1104910=test_protect I, [2024-05-18T00:53:26.465270 #1063579] INFO -- : [128/885] 1104910=test_win32ole_typelib I, [2024-05-18T00:53:26.470318 #1063579] INFO -- : [129/885] 1104910=test_gem_request_set_lockfile I, [2024-05-18T00:53:26.477385 #1063579] INFO -- : [130/885] 1104926=test_raise_exception I, [2024-05-18T00:53:26.516496 #1063579] INFO -- : [131/885] 1104924=test_postponed_job I, [2024-05-18T00:53:26.606968 #1063579] INFO -- : [132/885] 1104927=test_alias_and_anchor I, [2024-05-18T00:53:26.620720 #1063579] INFO -- : [133/885] 1104927=test_external_new I, [2024-05-18T00:53:26.623919 #1063579] INFO -- : [134/885] 1104913=test_gem_resolver_dependency_request I, [2024-05-18T00:53:26.629709 #1063579] INFO -- : [135/885] 1104927=test_tree_builder I, [2024-05-18T00:53:26.632540 #1063579] INFO -- : [136/885] 1104914=test_hash I, [2024-05-18T00:53:26.634503 #1063579] INFO -- : [137/885] 1104927=test_gem_commands_environment_command I, [2024-05-18T00:53:26.645952 #1063579] INFO -- : [138/885] 1104913=test_m17n I, [2024-05-18T00:53:26.668123 #1063579] INFO -- : [139/885] 1104914=test_ws I, [2024-05-18T00:53:26.669253 #1063579] INFO -- : [140/885] 1104927=test_yjit I, [2024-05-18T00:53:26.674731 #1063579] INFO -- : [141/885] 1104914=test_workspace I, [2024-05-18T00:53:26.675516 #1063579] INFO -- : [142/885] 1104927=test_weakmap I, [2024-05-18T00:53:26.691092 #1063579] INFO -- : [143/885] 1104917=test_kill_ring I, [2024-05-18T00:53:26.713025 #1063579] INFO -- : [144/885] 1104921=test_framework I, [2024-05-18T00:53:26.727022 #1063579] INFO -- : [145/885] 1104913=test_ns_spki I, [2024-05-18T00:53:26.729001 #1063579] INFO -- : [146/885] 1104921=test_argf I, [2024-05-18T00:53:26.752083 #1063579] INFO -- : [147/885] 1104913=test_type_completor I, [2024-05-18T00:53:26.755988 #1063579] INFO -- : [148/885] 1104917=test_summary I, [2024-05-18T00:53:26.756758 #1063579] INFO -- : [149/885] 1104913=test_console_attr I, [2024-05-18T00:53:26.757262 #1063579] INFO -- : [150/885] 1104913=test_date_attr I, [2024-05-18T00:53:26.762181 #1063579] INFO -- : [151/885] 1104913=test_ellipsize I, [2024-05-18T00:53:26.766936 #1063579] INFO -- : [152/885] 1104913=warnings_test I, [2024-05-18T00:53:26.817903 #1063579] INFO -- : [153/885] 1104910=test_kwargs I, [2024-05-18T00:53:26.821021 #1063579] INFO -- : [154/885] 1104910=test_io_wait I, [2024-05-18T00:53:26.840373 #1063579] INFO -- : [155/885] 1104915=test_gem_commands_exec_command I, [2024-05-18T00:53:26.855817 #1063579] INFO -- : [156/885] 1104908=test_hash I, [2024-05-18T00:53:26.869674 #1063579] INFO -- : [157/885] 1104922=test_ubf_async_safe I, [2024-05-18T00:53:26.877084 #1063579] INFO -- : [158/885] 1104913=test_sorted_set I, [2024-05-18T00:53:26.877676 #1063579] INFO -- : [159/885] 1104922=test_emoji I, [2024-05-18T00:53:26.880166 #1063579] INFO -- : [160/885] 1104924=test_win32ole_type_event I, [2024-05-18T00:53:26.880748 #1063579] INFO -- : [161/885] 1104917=test_io I, [2024-05-18T00:53:26.885399 #1063579] INFO -- : [162/885] 1104924=test_gem_commands_uninstall_command I, [2024-05-18T00:53:26.889757 #1063579] INFO -- : [163/885] 1104914=test_condition I, [2024-05-18T00:53:26.892904 #1063579] INFO -- : [164/885] 1104914=test_gem_source_specific_file I, [2024-05-18T00:53:26.906726 #1063579] INFO -- : [165/885] 1104922=test_foreach I, [2024-05-18T00:53:26.910409 #1063579] INFO -- : [166/885] 1104922=test_cp949 I, [2024-05-18T00:53:26.914035 #1063579] INFO -- : [167/885] 1104922=test_win32ole_record I, [2024-05-18T00:53:26.920969 #1063579] INFO -- : [168/885] 1104922=test_gem_unsatisfiable_dependency_error I, [2024-05-18T00:53:26.936933 #1063579] INFO -- : [169/885] 1104922=test_gem_commands_query_command I, [2024-05-18T00:53:26.953795 #1063579] INFO -- : [170/885] 1104918=test_method I, [2024-05-18T00:53:26.988210 #1063579] INFO -- : [171/885] 1104914=test_rdoc_rubygems_hook I, [2024-05-18T00:53:27.046795 #1063579] INFO -- : [172/885] 1104913=test_pattern_key_name_check I, [2024-05-18T00:53:27.065218 #1063579] INFO -- : [173/885] 1104913=test_to_ruby I, [2024-05-18T00:53:27.101883 #1063579] INFO -- : [174/885] 1104913=test_pack I, [2024-05-18T00:53:27.104056 #1063579] INFO -- : [175/885] 1104917=test_array_create I, [2024-05-18T00:53:27.105895 #1063579] INFO -- : [176/885] 1104917=test_gem_impossible_dependencies_error I, [2024-05-18T00:53:27.108375 #1063579] INFO -- : [177/885] 1104912=test_ftp I, [2024-05-18T00:53:27.114324 #1063579] INFO -- : [178/885] 1104917=test_euc_kr I, [2024-05-18T00:53:27.116742 #1063579] INFO -- : [179/885] 1104917=test_rdoc_context_section I, [2024-05-18T00:53:27.120640 #1063579] INFO -- : [180/885] 1104926=test_pkcs12 I, [2024-05-18T00:53:27.124118 #1063579] INFO -- : [181/885] 1104912=test_system I, [2024-05-18T00:53:27.156606 #1063579] INFO -- : [182/885] 1104910=test_gem_util I, [2024-05-18T00:53:27.209911 #1063579] INFO -- : [183/885] 1104914=test_iseq_load I, [2024-05-18T00:53:27.275522 #1063579] INFO -- : [184/885] 1104917=test_gem_package_tar_header I, [2024-05-18T00:53:27.301347 #1063579] INFO -- : [185/885] 1104913=test_pkey_dh I, [2024-05-18T00:53:27.304621 #1063579] INFO -- : [186/885] 1104917=test_bigzero I, [2024-05-18T00:53:27.308030 #1063579] INFO -- : [187/885] 1104910=test_gem_resolver_activation_request I, [2024-05-18T00:53:27.311011 #1063579] INFO -- : [188/885] 1104917=test_getopts I, [2024-05-18T00:53:27.313172 #1063579] INFO -- : [189/885] 1104917=test_protocol I, [2024-05-18T00:53:27.321264 #1063579] INFO -- : [190/885] 1104910=test_ripper I, [2024-05-18T00:53:27.377102 #1063579] INFO -- : [191/885] 1104913=test_gem_config_file I, [2024-05-18T00:53:27.459076 #1063579] INFO -- : [192/885] 1104913=test_etc I, [2024-05-18T00:53:27.476343 #1063579] INFO -- : [193/885] 1104923=test_yjit_exit_locations I, [2024-05-18T00:53:27.477683 #1063579] INFO -- : [194/885] 1104923=test_yaml_tree I, [2024-05-18T00:53:27.528752 #1063579] INFO -- : [195/885] 1104923=test_config I, [2024-05-18T00:53:27.544828 #1063579] INFO -- : [196/885] 1104913=test_sleep I, [2024-05-18T00:53:27.545549 #1063579] INFO -- : [197/885] 1104922=test_gem_commands_fetch_command I, [2024-05-18T00:53:27.567101 #1063579] INFO -- : [198/885] 1104916=test_math I, [2024-05-18T00:53:27.574727 #1063579] INFO -- : [199/885] 1104923=test_gc I, [2024-05-18T00:53:27.578256 #1063579] INFO -- : [200/885] 1104923=test_libs I, [2024-05-18T00:53:27.593873 #1063579] INFO -- : [201/885] 1104916=test_unicode_escape I, [2024-05-18T00:53:27.603460 #1063579] INFO -- : [202/885] 1104926=test_io I, [2024-05-18T00:53:27.621870 #1063579] INFO -- : [203/885] 1104917=test_utf16 I, [2024-05-18T00:53:27.622469 #1063579] INFO -- : [204/885] 1104920=test_autoload I, [2024-05-18T00:53:27.625518 #1063579] INFO -- : [205/885] 1104923=test_rendering I, [2024-05-18T00:53:27.631826 #1063579] INFO -- : [206/885] 1104917=test_face I, [2024-05-18T00:53:27.656451 #1063579] INFO -- : [207/885] 1104917=test_sizeof I, [2024-05-18T00:53:27.683032 #1063579] INFO -- : [208/885] 1104923=test_case I, [2024-05-18T00:53:27.688706 #1063579] INFO -- : [209/885] 1104916=test_rdoc_task I, [2024-05-18T00:53:27.695935 #1063579] INFO -- : [210/885] 1104922=test_gem_resolver_conflict I, [2024-05-18T00:53:27.709649 #1063579] INFO -- : [211/885] 1104916=ruby_parser_test I, [2024-05-18T00:53:27.711863 #1063579] INFO -- : [212/885] 1104922=test_backtrace I, [2024-05-18T00:53:27.719051 #1063579] INFO -- : [213/885] 1104923=test_pack I, [2024-05-18T00:53:27.720546 #1063579] INFO -- : [214/885] 1104910=test_io_buffer I, [2024-05-18T00:53:27.739617 #1063579] INFO -- : [215/885] 1104923=test_rdoc_markup_indented_paragraph I, [2024-05-18T00:53:27.742920 #1063579] INFO -- : [216/885] 1104923=test_rdoc_require I, [2024-05-18T00:53:27.754790 #1063579] INFO -- : [217/885] 1104923=locals_test I, [2024-05-18T00:53:27.795374 #1063579] INFO -- : [218/885] 1104916=test_readpartial I, [2024-05-18T00:53:27.834864 #1063579] INFO -- : [219/885] 1104910=test_gem_commands_install_command I, [2024-05-18T00:53:27.837400 #1063579] INFO -- : [220/885] 1104915=test_clone I, [2024-05-18T00:53:27.884354 #1063579] INFO -- : [221/885] 1104914=test_optparse I, [2024-05-18T00:53:27.929056 #1063579] INFO -- : [222/885] 1104924=test_array I, [2024-05-18T00:53:27.940769 #1063579] INFO -- : [223/885] 1104924=test_fstring I, [2024-05-18T00:53:27.953378 #1063579] INFO -- : [224/885] 1104914=test_gem_resolver_best_set I, [2024-05-18T00:53:28.004376 #1063579] INFO -- : [225/885] 1104914=encoding_test I, [2024-05-18T00:53:28.033984 #1063579] INFO -- : [226/885] 1104915=test_typeddata I, [2024-05-18T00:53:28.057912 #1063579] INFO -- : [227/885] 1104923=test_rdoc_markup_to_html_crossref I, [2024-05-18T00:53:28.059612 #1063579] INFO -- : [228/885] 1104914=test_webauthn_poller I, [2024-05-18T00:53:28.098165 #1063579] INFO -- : [229/885] 1104924=test_rdoc_markup_raw I, [2024-05-18T00:53:28.147504 #1063579] INFO -- : [230/885] 1104912=test_rat I, [2024-05-18T00:53:28.154269 #1063579] INFO -- : [231/885] 1104912=test_files_sample I, [2024-05-18T00:53:28.200515 #1063579] INFO -- : [232/885] 1104914=test_stringscanner I, [2024-05-18T00:53:28.201929 #1063579] INFO -- : [233/885] 1104916=test_yield I, [2024-05-18T00:53:28.253976 #1063579] INFO -- : [234/885] 1104912=test_rdoc_alias I, [2024-05-18T00:53:28.261301 #1063579] INFO -- : [235/885] 1104914=test_convertible I, [2024-05-18T00:53:28.265037 #1063579] INFO -- : [236/885] 1104924=parser_test I, [2024-05-18T00:53:28.275608 #1063579] INFO -- : [237/885] 1104912=test_date_conv I, [2024-05-18T00:53:28.291016 #1063579] INFO -- : [238/885] 1104915=test_optimization I, [2024-05-18T00:53:28.297213 #1063579] INFO -- : [239/885] 1104912=test_ole_methods I, [2024-05-18T00:53:28.299294 #1063579] INFO -- : [240/885] 1104912=test_erb_m17n I, [2024-05-18T00:53:28.301432 #1063579] INFO -- : [241/885] 1104909=test_egrep_cpp I, [2024-05-18T00:53:28.306201 #1063579] INFO -- : [242/885] 1104912=test_cgi_tag_helper I, [2024-05-18T00:53:28.318874 #1063579] INFO -- : [243/885] 1104912=test_zlib I, [2024-05-18T00:53:28.365694 #1063579] INFO -- : [244/885] 1104924=test_gem_package_old I, [2024-05-18T00:53:28.393018 #1063579] INFO -- : [245/885] 1104924=test_gem_resolver_index_set I, [2024-05-18T00:53:28.418207 #1063579] INFO -- : [246/885] 1104924=test_gc_compact I, [2024-05-18T00:53:28.445858 #1063579] INFO -- : [247/885] 1104923=test_proc I, [2024-05-18T00:53:28.446291 #1063579] INFO -- : [248/885] 1104909=test_string I, [2024-05-18T00:53:28.640086 #1063579] INFO -- : [249/885] 1104927=test_gem_validator I, [2024-05-18T00:53:28.665643 #1063579] INFO -- : [250/885] 1104927=test_files_test_2 I, [2024-05-18T00:53:29.055657 #1063579] INFO -- : [251/885] 1104922=test_fnmatch I, [2024-05-18T00:53:29.070098 #1063579] INFO -- : [252/885] 1104910=test_require_path_check I, [2024-05-18T00:53:29.095378 #1063579] INFO -- : [253/885] 1104922=test_rdoc_markup_parser I, [2024-05-18T00:53:29.158506 #1063579] INFO -- : [254/885] 1104910=test_folderitem2_invokeverb I, [2024-05-18T00:53:29.162404 #1063579] INFO -- : [255/885] 1104910=test_string I, [2024-05-18T00:53:29.168781 #1063579] INFO -- : [256/885] 1104923=test_rdoc_stats I, [2024-05-18T00:53:29.177183 #1063579] INFO -- : [257/885] 1104910=test_pattern_matching I, [2024-05-18T00:53:29.194748 #1063579] INFO -- : [258/885] 1104923=test_raise I, [2024-05-18T00:53:29.197635 #1063579] INFO -- : [259/885] 1104923=test_x509attr I, [2024-05-18T00:53:29.207737 #1063579] INFO -- : [260/885] 1104910=test_gem_request_set_lockfile_parser I, [2024-05-18T00:53:29.212318 #1063579] INFO -- : [261/885] 1104923=test_depth_first I, [2024-05-18T00:53:29.214675 #1063579] INFO -- : [262/885] 1104923=test_rdoc_store I, [2024-05-18T00:53:29.310204 #1063579] INFO -- : [263/885] 1104922=json_addition_test I, [2024-05-18T00:53:29.325060 #1063579] INFO -- : [264/885] 1104910=test_custom_command I, [2024-05-18T00:53:29.338641 #1063579] INFO -- : [265/885] 1104922=test_gem_dependency_resolution_error I, [2024-05-18T00:53:29.338967 #1063579] INFO -- : [266/885] 1104922=test_rdoc_parser I, [2024-05-18T00:53:29.376609 #1063579] INFO -- : [267/885] 1104922=test_qsort I, [2024-05-18T00:53:29.377935 #1063579] INFO -- : [268/885] 1104922=test_default_gems I, [2024-05-18T00:53:29.422503 #1063579] INFO -- : [269/885] 1104918=test_rdoc_rd_inline_parser I, [2024-05-18T00:53:29.431576 #1063579] INFO -- : [270/885] 1104922=test_rdoc_markup_to_rdoc I, [2024-05-18T00:53:29.440007 #1063579] INFO -- : [271/885] 1104910=test_mul I, [2024-05-18T00:53:29.453010 #1063579] INFO -- : [272/885] 1104910=test_win32ole_type I, [2024-05-18T00:53:29.454024 #1063579] INFO -- : [273/885] 1104910=test_null I, [2024-05-18T00:53:29.461610 #1063579] INFO -- : [274/885] 1104910=test_rdoc_markup_attributes I, [2024-05-18T00:53:29.463738 #1063579] INFO -- : [275/885] 1104922=test_date_parse I, [2024-05-18T00:53:29.465230 #1063579] INFO -- : [276/885] 1104910=test_pkey_ec I, [2024-05-18T00:53:29.554236 #1063579] INFO -- : [277/885] 1104910=test_trick I, [2024-05-18T00:53:29.572570 #1063579] INFO -- : [278/885] 1104922=test_thread I, [2024-05-18T00:53:29.576283 #1063579] INFO -- : [279/885] 1104922=test_pipe I, [2024-05-18T00:53:29.581410 #1063579] INFO -- : [280/885] 1104918=test_rdoc_i18n_text I, [2024-05-18T00:53:29.590343 #1063579] INFO -- : [281/885] 1104918=test_io_buffer I, [2024-05-18T00:53:29.593275 #1063579] INFO -- : [282/885] 1104913=test_defined I, [2024-05-18T00:53:29.626263 #1063579] INFO -- : [283/885] 1104918=test_backtrace I, [2024-05-18T00:53:29.638254 #1063579] INFO -- : [284/885] 1104918=test_key_name_check I, [2024-05-18T00:53:29.651126 #1063579] INFO -- : [285/885] 1104918=test_rdoc_rdoc I, [2024-05-18T00:53:29.687726 #1063579] INFO -- : [286/885] 1104913=test_windows_1251 I, [2024-05-18T00:53:29.694589 #1063579] INFO -- : [287/885] 1104913=test_time I, [2024-05-18T00:53:29.750662 #1063579] INFO -- : [288/885] 1104918=test_gb18030 I, [2024-05-18T00:53:29.761891 #1063579] INFO -- : [289/885] 1104918=test_svcb_https I, [2024-05-18T00:53:29.772484 #1063579] INFO -- : [290/885] 1104922=test_buffering I, [2024-05-18T00:53:29.774955 #1063579] INFO -- : [291/885] 1104918=test_gem_uninstaller I, [2024-05-18T00:53:29.791810 #1063579] INFO -- : [292/885] 1104922=test_bug-5832 I, [2024-05-18T00:53:29.801680 #1063579] INFO -- : [293/885] 1104922=test_files_ext I, [2024-05-18T00:53:29.826968 #1063579] INFO -- : [294/885] 1104913=test_gem_silent_ui I, [2024-05-18T00:53:29.840776 #1063579] INFO -- : [295/885] 1104925=test_emitter I, [2024-05-18T00:53:29.866545 #1063579] INFO -- : [296/885] 1104913=test_kdf I, [2024-05-18T00:53:29.867266 #1063579] INFO -- : [297/885] 1104925=test_gem_doctor I, [2024-05-18T00:53:29.900361 #1063579] INFO -- : [298/885] 1104922=test_eval_history I, [2024-05-18T00:53:29.908139 #1063579] INFO -- : [299/885] 1104922=dispatcher_test I, [2024-05-18T00:53:29.932926 #1063579] INFO -- : [300/885] 1104913=test_kernel I, [2024-05-18T00:53:29.985773 #1063579] INFO -- : [301/885] 1104922=test_rdoc_markup_paragraph I, [2024-05-18T00:53:29.998377 #1063579] INFO -- : [302/885] 1104922=!Nothing_to_test I, [2024-05-18T00:53:30.002778 #1063579] INFO -- : [303/885] 1104922=test_enc_raise I, [2024-05-18T00:53:30.013080 #1063579] INFO -- : [304/885] 1104922=test_psych I, [2024-05-18T00:53:30.027432 #1063579] INFO -- : [305/885] 1104922=test_object_create_start I, [2024-05-18T00:53:30.040029 #1063579] INFO -- : [306/885] 1104922=test_gem_ext_cargo_builder_unit I, [2024-05-18T00:53:30.046089 #1063579] INFO -- : [307/885] 1104923=test_date I, [2024-05-18T00:53:30.052234 #1063579] INFO -- : [308/885] 1104922=test_gem_rdoc I, [2024-05-18T00:53:30.054446 #1063579] INFO -- : [309/885] 1104923=test_command I, [2024-05-18T00:53:30.124545 #1063579] INFO -- : [310/885] 1104925=test_at_exit I, [2024-05-18T00:53:30.142710 #1063579] INFO -- : [311/885] 1104925=test_hmac I, [2024-05-18T00:53:30.146424 #1063579] INFO -- : [312/885] 1104922=test_rdoc_markup_to_tt_only I, [2024-05-18T00:53:30.148282 #1063579] INFO -- : [313/885] 1104925=test_rdoc_tom_doc I, [2024-05-18T00:53:30.172263 #1063579] INFO -- : [314/885] 1104922=test_gem_commands_lock_command I, [2024-05-18T00:53:30.200161 #1063579] INFO -- : [315/885] 1104922=test_ifunless I, [2024-05-18T00:53:30.201249 #1063579] INFO -- : [316/885] 1104922=test_assignment I, [2024-05-18T00:53:30.249763 #1063579] INFO -- : [317/885] 1104919=test_numeric I, [2024-05-18T00:53:30.313610 #1063579] INFO -- : [318/885] 1104925=test_gem_spec_fetcher I, [2024-05-18T00:53:30.322798 #1063579] INFO -- : [319/885] 1104919=test_common I, [2024-05-18T00:53:30.355622 #1063579] INFO -- : [320/885] 1104923=test_key_actor_vi I, [2024-05-18T00:53:30.453568 #1063579] INFO -- : [321/885] 1104913=test_bug-3571 I, [2024-05-18T00:53:30.473798 #1063579] INFO -- : [322/885] 1104913=test_gem_command I, [2024-05-18T00:53:30.478660 #1063579] INFO -- : [323/885] 1104923=test_address_resolve I, [2024-05-18T00:53:30.481358 #1063579] INFO -- : [324/885] 1104925=test_rdoc_token_stream I, [2024-05-18T00:53:30.484577 #1063579] INFO -- : [325/885] 1104925=test_config I, [2024-05-18T00:53:30.493576 #1063579] INFO -- : [326/885] 1104912=test_gem_source_list I, [2024-05-18T00:53:30.497860 #1063579] INFO -- : [327/885] 1104923=test_optarg I, [2024-05-18T00:53:30.536764 #1063579] INFO -- : [328/885] 1104919=test_yaml_special_cases I, [2024-05-18T00:53:30.544630 #1063579] INFO -- : [329/885] 1104919=test_gem_ext_configure_builder I, [2024-05-18T00:53:30.554984 #1063579] INFO -- : [330/885] 1104913=test_frozen I, [2024-05-18T00:53:30.558323 #1063579] INFO -- : [331/885] 1104913=test_pp I, [2024-05-18T00:53:30.565515 #1063579] INFO -- : [332/885] 1104925=test_macro I, [2024-05-18T00:53:30.578668 #1063579] INFO -- : [333/885] 1104925=test_rdoc_single_class I, [2024-05-18T00:53:30.582192 #1063579] INFO -- : [334/885] 1104925=test_nil I, [2024-05-18T00:53:30.586395 #1063579] INFO -- : [335/885] 1104925=test_num2int I, [2024-05-18T00:53:30.598491 #1063579] INFO -- : [336/885] 1104925=test_verbose I, [2024-05-18T00:53:30.609700 #1063579] INFO -- : [337/885] 1104913=test_iter_break I, [2024-05-18T00:53:30.609906 #1063579] INFO -- : [338/885] 1104918=test_zsh_completion I, [2024-05-18T00:53:30.612574 #1063579] INFO -- : [339/885] 1104925=test_exception I, [2024-05-18T00:53:30.614586 #1063579] INFO -- : [340/885] 1104918=test_logperiod I, [2024-05-18T00:53:30.617014 #1063579] INFO -- : [341/885] 1104913=test_c_union_entity I, [2024-05-18T00:53:30.621822 #1063579] INFO -- : [342/885] 1104919=test_rdoc_normal_module I, [2024-05-18T00:53:30.622853 #1063579] INFO -- : [343/885] 1104918=test_rdoc_markdown_test I, [2024-05-18T00:53:30.626426 #1063579] INFO -- : [344/885] 1104925=test_securerandom I, [2024-05-18T00:53:30.632390 #1063579] INFO -- : [345/885] 1104923=test_switch_hitter I, [2024-05-18T00:53:30.640269 #1063579] INFO -- : [346/885] 1104923=test_singleton I, [2024-05-18T00:53:30.651636 #1063579] INFO -- : [347/885] 1104923=test_flush I, [2024-05-18T00:53:30.668960 #1063579] INFO -- : [348/885] 1104925=test_io_console I, [2024-05-18T00:53:30.671514 #1063579] INFO -- : [349/885] 1104923=test_stringchar I, [2024-05-18T00:53:30.677303 #1063579] INFO -- : [350/885] 1104913=test_hash_create I, [2024-05-18T00:53:30.680213 #1063579] INFO -- : [351/885] 1104913=newline_test I, [2024-05-18T00:53:30.686833 #1063579] INFO -- : [352/885] 1104912=test_uncorrectable_name_check I, [2024-05-18T00:53:30.701068 #1063579] INFO -- : [353/885] 1104912=test_thread_fd_close I, [2024-05-18T00:53:30.701754 #1063579] INFO -- : [354/885] 1104912=test_passing_block I, [2024-05-18T00:53:30.709075 #1063579] INFO -- : [355/885] 1104912=test_pack I, [2024-05-18T00:53:30.715312 #1063579] INFO -- : [356/885] 1104908=test_last_thread I, [2024-05-18T00:53:30.722825 #1063579] INFO -- : [357/885] 1104923=test_process I, [2024-05-18T00:53:30.767459 #1063579] INFO -- : [358/885] 1104913=test_gem_security_policy I, [2024-05-18T00:53:30.774011 #1063579] INFO -- : [359/885] 1104917=test_gem_source_local I, [2024-05-18T00:53:30.837987 #1063579] INFO -- : [360/885] 1104919=test_logdevice I, [2024-05-18T00:53:30.929258 #1063579] INFO -- : [361/885] 1104912=test_arity I, [2024-05-18T00:53:30.933318 #1063579] INFO -- : [362/885] 1104912=test_gem_ext_rake_builder I, [2024-05-18T00:53:30.960851 #1063579] INFO -- : [363/885] 1104924=test_x509cert I, [2024-05-18T00:53:31.007463 #1063579] INFO -- : [364/885] 1104917=test_gc I, [2024-05-18T00:53:31.010046 #1063579] INFO -- : [365/885] 1104921=test_gem_resolver_lock_specification I, [2024-05-18T00:53:31.012373 #1063579] INFO -- : [366/885] 1104916=test_err_in_callback I, [2024-05-18T00:53:31.014874 #1063579] INFO -- : [367/885] 1104916=test_flags I, [2024-05-18T00:53:31.030789 #1063579] INFO -- : [368/885] 1104913=test_inadvertent_creation I, [2024-05-18T00:53:31.053133 #1063579] INFO -- : [369/885] 1104921=test_enumerator I, [2024-05-18T00:53:31.135842 #1063579] INFO -- : [370/885] 1104913=test_http I, [2024-05-18T00:53:31.150651 #1063579] INFO -- : [371/885] 1104913=test_gem_commands_which_command I, [2024-05-18T00:53:31.181333 #1063579] INFO -- : [372/885] 1104913=test_shift_jis I, [2024-05-18T00:53:31.202391 #1063579] INFO -- : [373/885] 1104913=test_gem_commands_specification_command I, [2024-05-18T00:53:31.239059 #1063579] INFO -- : [374/885] 1104924=test_gem_resolver I, [2024-05-18T00:53:31.318837 #1063579] INFO -- : [375/885] 1104913=test_gem_resolver_composed_set I, [2024-05-18T00:53:31.328321 #1063579] INFO -- : [376/885] 1104913=test_safe_load I, [2024-05-18T00:53:31.339002 #1063579] INFO -- : [377/885] 1104913=test_gem_commands_dependency_command I, [2024-05-18T00:53:31.376079 #1063579] INFO -- : [378/885] 1104918=test_name_error I, [2024-05-18T00:53:31.402455 #1063579] INFO -- : [379/885] 1104913=test_rdoc_markup_attribute_manager I, [2024-05-18T00:53:31.463365 #1063579] INFO -- : [380/885] 1104918=test_httpresponse I, [2024-05-18T00:53:31.484895 #1063579] INFO -- : [381/885] 1104924=test_open-uri I, [2024-05-18T00:53:31.545442 #1063579] INFO -- : [382/885] 1104918=test_rdoc_parser_ruby I, [2024-05-18T00:53:31.578632 #1063579] INFO -- : [383/885] 1104919=test_nil2vtempty I, [2024-05-18T00:53:31.580801 #1063579] INFO -- : [384/885] 1104919=test_stream I, [2024-05-18T00:53:31.587188 #1063579] INFO -- : [385/885] 1104913=test_rdoc_context I, [2024-05-18T00:53:31.588545 #1063579] INFO -- : [386/885] 1104919=test_rdoc_text I, [2024-05-18T00:53:31.650395 #1063579] INFO -- : [387/885] 1104919=test_tcp I, [2024-05-18T00:53:31.684646 #1063579] INFO -- : [388/885] 1104919=test_iso_8859 I, [2024-05-18T00:53:31.717647 #1063579] INFO -- : [389/885] 1104919=test_require I, [2024-05-18T00:53:31.720228 #1063579] INFO -- : [390/885] 1104919=test_rdoc_markup_to_joined_paragraph I, [2024-05-18T00:53:31.727685 #1063579] INFO -- : [391/885] 1104927=test_date_time I, [2024-05-18T00:53:31.730213 #1063579] INFO -- : [392/885] 1104919=test_date_new I, [2024-05-18T00:53:31.735263 #1063579] INFO -- : [393/885] 1104912=index_write_test I, [2024-05-18T00:53:31.737564 #1063579] INFO -- : [394/885] 1104919=test_data I, [2024-05-18T00:53:31.740712 #1063579] INFO -- : [395/885] 1104927=test_syntax I, [2024-05-18T00:53:31.753133 #1063579] INFO -- : [396/885] 1104919=test_gem_safe_yaml I, [2024-05-18T00:53:31.771488 #1063579] INFO -- : [397/885] 1104919=test_gem_commands_info_command I, [2024-05-18T00:53:31.781332 #1063579] INFO -- : [398/885] 1104908=test_gem_dependency_installer I, [2024-05-18T00:53:31.793194 #1063579] INFO -- : [399/885] 1104919=test_scalar I, [2024-05-18T00:53:31.796455 #1063579] INFO -- : [400/885] 1104919=test_rdoc_cross_reference I, [2024-05-18T00:53:31.808741 #1063579] INFO -- : [401/885] 1104912=test_store I, [2024-05-18T00:53:31.826377 #1063579] INFO -- : [402/885] 1104924=test_case_options I, [2024-05-18T00:53:31.829656 #1063579] INFO -- : [403/885] 1104924=test_exception I, [2024-05-18T00:53:31.959420 #1063579] INFO -- : [404/885] 1104912=test_gem_package_tar_reader_entry I, [2024-05-18T00:53:32.021113 #1063579] INFO -- : [405/885] 1104922=test_gem_name_tuple I, [2024-05-18T00:53:32.039269 #1063579] INFO -- : [406/885] 1104922=test_rand I, [2024-05-18T00:53:32.058222 #1063579] INFO -- : [407/885] 1104916=test_bug_reporter I, [2024-05-18T00:53:32.106197 #1063579] INFO -- : [408/885] 1104912=test_gem_ext_cargo_builder_link_flag_converter I, [2024-05-18T00:53:32.128470 #1063579] INFO -- : [409/885] 1104910=test_gem_commands_mirror I, [2024-05-18T00:53:32.134711 #1063579] INFO -- : [410/885] 1104910=test_sprintf_comb I, [2024-05-18T00:53:32.151801 #1063579] INFO -- : [411/885] 1104912=test_method_cache I, [2024-05-18T00:53:32.156640 #1063579] INFO -- : [412/885] 1104912=test_gem_request I, [2024-05-18T00:53:32.244053 #1063579] INFO -- : [413/885] 1104918=test_scan_args I, [2024-05-18T00:53:32.254636 #1063579] INFO -- : [414/885] 1104918=test_generic I, [2024-05-18T00:53:32.282711 #1063579] INFO -- : [415/885] 1104918=test_win32ole I, [2024-05-18T00:53:32.286561 #1063579] INFO -- : [416/885] 1104918=test_settracefunc I, [2024-05-18T00:53:32.300564 #1063579] INFO -- : [417/885] 1104913=test_gem_text I, [2024-05-18T00:53:32.303590 #1063579] INFO -- : [418/885] 1104912=test_enumerator_kw I, [2024-05-18T00:53:32.305173 #1063579] INFO -- : [419/885] 1104912=test_parser_events I, [2024-05-18T00:53:32.314489 #1063579] INFO -- : [420/885] 1104910=test_reline I, [2024-05-18T00:53:32.319951 #1063579] INFO -- : [421/885] 1104922=test_case I, [2024-05-18T00:53:32.320225 #1063579] INFO -- : [422/885] 1104922=test_pkey I, [2024-05-18T00:53:32.342510 #1063579] INFO -- : [423/885] 1104919=test_grapheme_breaks I, [2024-05-18T00:53:32.344360 #1063579] INFO -- : [424/885] 1104913=test_gem_version_option I, [2024-05-18T00:53:32.364522 #1063579] INFO -- : [425/885] 1104922=test_gem_request_connection_pools I, [2024-05-18T00:53:32.375747 #1063579] INFO -- : [426/885] 1104919=test_cclass I, [2024-05-18T00:53:32.379048 #1063579] INFO -- : [427/885] 1104913=test_ractor I, [2024-05-18T00:53:32.400312 #1063579] INFO -- : [428/885] 1104912=test_m17n_comb I, [2024-05-18T00:53:32.415760 #1063579] INFO -- : [429/885] 1104916=test_memory_view I, [2024-05-18T00:53:32.443845 #1063579] INFO -- : [430/885] 1104913=test_rdoc_markup_to_markdown I, [2024-05-18T00:53:32.478620 #1063579] INFO -- : [431/885] 1104913=test_json_tree I, [2024-05-18T00:53:32.482504 #1063579] INFO -- : [432/885] 1104913=test_ansi_with_terminfo I, [2024-05-18T00:53:32.522771 #1063579] INFO -- : [433/885] 1104919=test_rdoc_generator_pot_po I, [2024-05-18T00:53:32.530127 #1063579] INFO -- : [434/885] 1104919=test_gem_install_update_options I, [2024-05-18T00:53:32.530858 #1063579] INFO -- : [435/885] 1104913=parse_test I, [2024-05-18T00:53:32.546158 #1063579] INFO -- : [436/885] 1104916=test_require_lib I, [2024-05-18T00:53:32.549211 #1063579] INFO -- : [437/885] 1104910=test_ractor I, [2024-05-18T00:53:32.562092 #1063579] INFO -- : [438/885] 1104910=test_severity I, [2024-05-18T00:53:32.571707 #1063579] INFO -- : [439/885] 1104910=test_rdoc_generator_ri I, [2024-05-18T00:53:32.576601 #1063579] INFO -- : [440/885] 1104910=test_extlibs I, [2024-05-18T00:53:32.622596 #1063579] INFO -- : [441/885] 1104919=test_gem_stream_ui I, [2024-05-18T00:53:32.721870 #1063579] INFO -- : [442/885] 1104919=test_dot_dot I, [2024-05-18T00:53:32.725411 #1063579] INFO -- : [443/885] 1104919=test_c_struct_builder I, [2024-05-18T00:53:32.822564 #1063579] INFO -- : [444/885] 1104919=test_str2big I, [2024-05-18T00:53:32.825858 #1063579] INFO -- : [445/885] 1104919=test_literal I, [2024-05-18T00:53:32.973438 #1063579] INFO -- : [446/885] 1104911=test_objectspace I, [2024-05-18T00:53:33.004645 #1063579] INFO -- : [447/885] 1104920=test_thread I, [2024-05-18T00:53:33.204734 #1063579] INFO -- : [448/885] 1104919=test_socket I, [2024-05-18T00:53:33.221862 #1063579] INFO -- : [449/885] 1104920=test_rdoc_markup_to_table_of_contents I, [2024-05-18T00:53:33.222458 #1063579] INFO -- : [450/885] 1104914=test_rubygems I, [2024-05-18T00:53:33.227412 #1063579] INFO -- : [451/885] 1104918=test_call I, [2024-05-18T00:53:33.253242 #1063579] INFO -- : [452/885] 1104920=test_https_proxy I, [2024-05-18T00:53:33.315136 #1063579] INFO -- : [453/885] 1104920=test_rubyoptions I, [2024-05-18T00:53:33.371975 #1063579] INFO -- : [454/885] 1104914=test_super I, [2024-05-18T00:53:33.381239 #1063579] INFO -- : [455/885] 1104925=test_integer I, [2024-05-18T00:53:33.395899 #1063579] INFO -- : [456/885] 1104922=test_cgi_modruby I, [2024-05-18T00:53:33.401285 #1063579] INFO -- : [457/885] 1104918=test_usrmarshal I, [2024-05-18T00:53:33.402292 #1063579] INFO -- : [458/885] 1104922=test_object_references I, [2024-05-18T00:53:33.415276 #1063579] INFO -- : [459/885] 1104922=test_gem_resolver_git_specification I, [2024-05-18T00:53:33.594097 #1063579] INFO -- : [460/885] 1104918=test_have_func I, [2024-05-18T00:53:33.630605 #1063579] INFO -- : [461/885] 1104922=test_gem_request_set_lockfile_tokenizer I, [2024-05-18T00:53:33.687058 #1063579] INFO -- : [462/885] 1104922=test_stat I, [2024-05-18T00:53:33.692444 #1063579] INFO -- : [463/885] 1104922=test_capacity I, [2024-05-18T00:53:33.697135 #1063579] INFO -- : [464/885] 1104922=test_nextafter I, [2024-05-18T00:53:33.798528 #1063579] INFO -- : [465/885] 1104908=test_dryrun I, [2024-05-18T00:53:33.813434 #1063579] INFO -- : [466/885] 1104922=test_integer I, [2024-05-18T00:53:33.827938 #1063579] INFO -- : [467/885] 1104908=desugar_compiler_test I, [2024-05-18T00:53:33.894656 #1063579] INFO -- : [468/885] 1104922=test_env I, [2024-05-18T00:53:33.897929 #1063579] INFO -- : [469/885] 1104911=test_rdoc_attr I, [2024-05-18T00:53:33.910046 #1063579] INFO -- : [470/885] 1104911=test_gem_commands_setup_command I, [2024-05-18T00:53:33.925559 #1063579] INFO -- : [471/885] 1104908=test_parser I, [2024-05-18T00:53:33.957739 #1063579] INFO -- : [472/885] 1104908=test_cgi_core I, [2024-05-18T00:53:33.976569 #1063579] INFO -- : [473/885] 1104908=test_gem I, [2024-05-18T00:53:33.984133 #1063579] INFO -- : [474/885] 1104914=test_gem_source_lock I, [2024-05-18T00:53:34.025959 #1063579] INFO -- : [475/885] 1104914=test_ractor I, [2024-05-18T00:53:34.041940 #1063579] INFO -- : [476/885] 1104914=test_dns I, [2024-05-18T00:53:34.274379 #1063579] INFO -- : [477/885] 1104912=test_gem_commands_open_command I, [2024-05-18T00:53:34.355999 #1063579] INFO -- : [478/885] 1104912=test_registry I, [2024-05-18T00:53:34.358497 #1063579] INFO -- : [479/885] 1104912=parse_stream_test I, [2024-05-18T00:53:34.369974 #1063579] INFO -- : [480/885] 1104912=test_rendering I, [2024-05-18T00:53:34.415338 #1063579] INFO -- : [481/885] 1104912=test_debugger_integration I, [2024-05-18T00:53:34.442328 #1063579] INFO -- : [482/885] 1104912=test_my_integer I, [2024-05-18T00:53:34.445101 #1063579] INFO -- : [483/885] 1104910=json_ext_parser_test I, [2024-05-18T00:53:34.445532 #1063579] INFO -- : [484/885] 1104912=test_thread I, [2024-05-18T00:53:34.451708 #1063579] INFO -- : [485/885] 1104910=test_ractor I, [2024-05-18T00:53:34.537217 #1063579] INFO -- : [486/885] 1104924=test_ssl I, [2024-05-18T00:53:34.553666 #1063579] INFO -- : [487/885] 1104914=test_reline_key I, [2024-05-18T00:53:34.562380 #1063579] INFO -- : [488/885] 1104914=test_rb_str_dup I, [2024-05-18T00:53:34.567526 #1063579] INFO -- : [489/885] 1104914=test_ancdata I, [2024-05-18T00:53:34.569650 #1063579] INFO -- : [490/885] 1104914=test_singleton_function I, [2024-05-18T00:53:34.570914 #1063579] INFO -- : [491/885] 1104914=test_timeout I, [2024-05-18T00:53:34.634327 #1063579] INFO -- : [492/885] 1104919=test_alias I, [2024-05-18T00:53:34.784723 #1063579] INFO -- : [493/885] 1104919=test_weakref I, [2024-05-18T00:53:34.796517 #1063579] INFO -- : [494/885] 1104926=test_nonblock I, [2024-05-18T00:53:34.832346 #1063579] INFO -- : [495/885] 1104926=test_marshal I, [2024-05-18T00:53:34.852562 #1063579] INFO -- : [496/885] 1104911=test_unicode_normalize I, [2024-05-18T00:53:34.885907 #1063579] INFO -- : [497/885] 1104910=test_trace I, [2024-05-18T00:53:34.897706 #1063579] INFO -- : [498/885] 1104910=ractor_test I, [2024-05-18T00:53:34.959184 #1063579] INFO -- : [499/885] 1104919=test_time_tz I, [2024-05-18T00:53:34.976492 #1063579] INFO -- : [500/885] 1104924=test_win32ole_event I, [2024-05-18T00:53:34.979421 #1063579] INFO -- : [501/885] 1104910=test_rdoc_generator_json_index I, [2024-05-18T00:53:34.982815 #1063579] INFO -- : [502/885] 1104924=test_rdoc_class_module I, [2024-05-18T00:53:34.998441 #1063579] INFO -- : [503/885] 1104919=test_bignum I, [2024-05-18T00:53:35.026326 #1063579] INFO -- : [504/885] 1104910=test_gem_ci_detector I, [2024-05-18T00:53:35.036710 #1063579] INFO -- : [505/885] 1104910=test_stringio I, [2024-05-18T00:53:35.106879 #1063579] INFO -- : [506/885] 1104919=test_arity I, [2024-05-18T00:53:35.113215 #1063579] INFO -- : [507/885] 1104919=test_io_wait_uncommon I, [2024-05-18T00:53:35.115671 #1063579] INFO -- : [508/885] 1104919=test_win32ole_variable I, [2024-05-18T00:53:35.119227 #1063579] INFO -- : [509/885] 1104919=test_enum I, [2024-05-18T00:53:35.154833 #1063579] INFO -- : [510/885] 1104910=test_gem_specification I, [2024-05-18T00:53:35.232803 #1063579] INFO -- : [511/885] 1104913=test_threadgroup I, [2024-05-18T00:53:35.371823 #1063579] INFO -- : [512/885] 1104926=test_gem_package I, [2024-05-18T00:53:35.399770 #1063579] INFO -- : [513/885] 1104918=test_resolve_symbol I, [2024-05-18T00:53:35.424477 #1063579] INFO -- : [514/885] 1104914=test_complex2 I, [2024-05-18T00:53:35.441448 #1063579] INFO -- : [515/885] 1104914=test_have_macro I, [2024-05-18T00:53:35.448607 #1063579] INFO -- : [516/885] 1104918=test_merge_keys I, [2024-05-18T00:53:35.459112 #1063579] INFO -- : [517/885] 1104918=test_rdoc_extend I, [2024-05-18T00:53:35.478918 #1063579] INFO -- : [518/885] 1104918=test_win32ole_variant I, [2024-05-18T00:53:35.480879 #1063579] INFO -- : [519/885] 1104918=test_mixed_unicode_escapes I, [2024-05-18T00:53:35.484626 #1063579] INFO -- : [520/885] 1104918=test_history I, [2024-05-18T00:53:35.536373 #1063579] INFO -- : [521/885] 1104918=test_rdoc_markup_to_ansi I, [2024-05-18T00:53:35.562935 #1063579] INFO -- : [522/885] 1104918=test_ipaddr I, [2024-05-18T00:53:35.590372 #1063579] INFO -- : [523/885] 1104918=test_gem_resolver_api_specification I, [2024-05-18T00:53:35.635206 #1063579] INFO -- : [524/885] 1104918=test_member I, [2024-05-18T00:53:35.637085 #1063579] INFO -- : [525/885] 1104918=test_numeric I, [2024-05-18T00:53:35.650262 #1063579] INFO -- : [526/885] 1104918=test_cgi_multipart I, [2024-05-18T00:53:35.712767 #1063579] INFO -- : [527/885] 1104924=test_gem_commands_cleanup_command I, [2024-05-18T00:53:35.801271 #1063579] INFO -- : [528/885] 1104914=test_word I, [2024-05-18T00:53:35.808303 #1063579] INFO -- : [529/885] 1104914=test_date_ractor I, [2024-05-18T00:53:35.819111 #1063579] INFO -- : [530/885] 1104918=test_gem_console_ui I, [2024-05-18T00:53:35.820417 #1063579] INFO -- : [531/885] 1104918=test_dir I, [2024-05-18T00:53:35.842039 #1063579] INFO -- : [532/885] 1104908=format_errors_test I, [2024-05-18T00:53:35.847368 #1063579] INFO -- : [533/885] 1104908=test_autoconf I, [2024-05-18T00:53:35.851457 #1063579] INFO -- : [534/885] 1104908=test_eval I, [2024-05-18T00:53:35.852679 #1063579] INFO -- : [535/885] 1104908=test_ractor_compatibility I, [2024-05-18T00:53:35.945638 #1063579] INFO -- : [536/885] 1104919=location_test I, [2024-05-18T00:53:35.948217 #1063579] INFO -- : [537/885] 1104925=test_symbol I, [2024-05-18T00:53:35.951061 #1063579] INFO -- : [538/885] 1104925=test_coderange I, [2024-05-18T00:53:35.956207 #1063579] INFO -- : [539/885] 1104925=test_mailto I, [2024-05-18T00:53:35.976291 #1063579] INFO -- : [540/885] 1104925=test_rdoc_comment I, [2024-05-18T00:53:36.022721 #1063579] INFO -- : [541/885] 1104925=test_error_highlight I, [2024-05-18T00:53:36.032342 #1063579] INFO -- : [542/885] 1104918=test_resize I, [2024-05-18T00:53:36.041801 #1063579] INFO -- : [543/885] 1104918=test_rdoc_generator_darkfish I, [2024-05-18T00:53:36.074592 #1063579] INFO -- : [544/885] 1104919=test_http_request I, [2024-05-18T00:53:36.093626 #1063579] INFO -- : [545/885] 1104914=test_gem_source_fetch_problem I, [2024-05-18T00:53:36.113470 #1063579] INFO -- : [546/885] 1104919=json_generic_object_test I, [2024-05-18T00:53:36.119083 #1063579] INFO -- : [547/885] 1104915=test_function_entry I, [2024-05-18T00:53:36.121580 #1063579] INFO -- : [548/885] 1104914=test_pkcs7 I, [2024-05-18T00:53:36.126512 #1063579] INFO -- : [549/885] 1104915=test_arith_seq_beg_len_step I, [2024-05-18T00:53:36.131475 #1063579] INFO -- : [550/885] 1104919=test_gem_resolver_requirement_list I, [2024-05-18T00:53:36.136541 #1063579] INFO -- : [551/885] 1104919=test_unix I, [2024-05-18T00:53:36.173039 #1063579] INFO -- : [552/885] 1104916=test_lazy_enumerator I, [2024-05-18T00:53:36.183171 #1063579] INFO -- : [553/885] 1104919=test_enc_associate I, [2024-05-18T00:53:36.200296 #1063579] INFO -- : [554/885] 1104915=test_find_executable I, [2024-05-18T00:53:36.219931 #1063579] INFO -- : [555/885] 1104915=ruby_api_test I, [2024-05-18T00:53:36.235988 #1063579] INFO -- : [556/885] 1104913=test_gem_commands_pristine_command I, [2024-05-18T00:53:36.268209 #1063579] INFO -- : [557/885] 1104926=test_context I, [2024-05-18T00:53:36.278731 #1063579] INFO -- : [558/885] 1104924=test_nofree I, [2024-05-18T00:53:36.285610 #1063579] INFO -- : [559/885] 1104924=test_coder I, [2024-05-18T00:53:36.297212 #1063579] INFO -- : [560/885] 1104914=test_symbol I, [2024-05-18T00:53:36.298255 #1063579] INFO -- : [561/885] 1104924=test_pkey_rsa I, [2024-05-18T00:53:36.331167 #1063579] INFO -- : [562/885] 1104908=test_numhash I, [2024-05-18T00:53:36.336064 #1063579] INFO -- : [563/885] 1104908=test_weakkeymap I, [2024-05-18T00:53:36.362449 #1063579] INFO -- : [564/885] 1104915=test_gem_commands_push_command I, [2024-05-18T00:53:36.398392 #1063579] INFO -- : [565/885] 1104926=test_rdoc_markup_hard_break I, [2024-05-18T00:53:36.401555 #1063579] INFO -- : [566/885] 1104918=test_date_strptime I, [2024-05-18T00:53:36.402913 #1063579] INFO -- : [567/885] 1104926=test_gem_package_task I, [2024-05-18T00:53:36.407603 #1063579] INFO -- : [568/885] 1104926=test_placearg I, [2024-05-18T00:53:36.465506 #1063579] INFO -- : [569/885] 1104916=test_gem_platform I, [2024-05-18T00:53:36.477071 #1063579] INFO -- : [570/885] 1104925=test_delete I, [2024-05-18T00:53:36.484274 #1063579] INFO -- : [571/885] 1104925=test_win32ole_method I, [2024-05-18T00:53:36.486553 #1063579] INFO -- : [572/885] 1104925=test_continuation I, [2024-05-18T00:53:36.510272 #1063579] INFO -- : [573/885] 1104925=test_fd_setsize I, [2024-05-18T00:53:36.515394 #1063579] INFO -- : [574/885] 1104925=test_keyword I, [2024-05-18T00:53:36.528783 #1063579] INFO -- : [575/885] 1104908=test_class_name_check I, [2024-05-18T00:53:36.536597 #1063579] INFO -- : [576/885] 1104926=test_files_test I, [2024-05-18T00:53:36.544612 #1063579] INFO -- : [577/885] 1104908=test_gem_update_suggestion I, [2024-05-18T00:53:36.576044 #1063579] INFO -- : [578/885] 1104916=test_file_exhaustive I, [2024-05-18T00:53:36.579463 #1063579] INFO -- : [579/885] 1104918=test_logger I, [2024-05-18T00:53:36.596343 #1063579] INFO -- : [580/885] 1104918=test_import I, [2024-05-18T00:53:36.602402 #1063579] INFO -- : [581/885] 1104908=test_gem_resolver_lock_set I, [2024-05-18T00:53:36.606361 #1063579] INFO -- : [582/885] 1104922=test_not I, [2024-05-18T00:53:36.609730 #1063579] INFO -- : [583/885] 1104922=test_rdoc_parser_markdown I, [2024-05-18T00:53:36.614661 #1063579] INFO -- : [584/885] 1104924=test_cgi_header I, [2024-05-18T00:53:36.618118 #1063579] INFO -- : [585/885] 1104908=heredoc_dedent_test I, [2024-05-18T00:53:36.622659 #1063579] INFO -- : [586/885] 1104908=test_object I, [2024-05-18T00:53:36.625404 #1063579] INFO -- : [587/885] 1104922=version_test I, [2024-05-18T00:53:36.625539 #1063579] INFO -- : [588/885] 1104908=test_key_actor_emacs I, [2024-05-18T00:53:36.628593 #1063579] INFO -- : [589/885] 1104922=test_gem_command_manager I, [2024-05-18T00:53:36.637399 #1063579] INFO -- : [590/885] 1104924=test_gem_gemcutter_utilities I, [2024-05-18T00:53:36.638225 #1063579] INFO -- : [591/885] 1104926=test_basicinstructions I, [2024-05-18T00:53:36.708714 #1063579] INFO -- : [592/885] 1104926=test_arithmetic_sequence I, [2024-05-18T00:53:36.727429 #1063579] INFO -- : [593/885] 1104926=compiler_test I, [2024-05-18T00:53:36.736067 #1063579] INFO -- : [594/885] 1104919=test_flip I, [2024-05-18T00:53:36.772089 #1063579] INFO -- : [595/885] 1104919=test_change_word I, [2024-05-18T00:53:36.780139 #1063579] INFO -- : [596/885] 1104919=test_ossl I, [2024-05-18T00:53:36.788124 #1063579] INFO -- : [597/885] 1104908=test_normalize I, [2024-05-18T00:53:36.788642 #1063579] INFO -- : [598/885] 1104908=test_timeout I, [2024-05-18T00:53:36.792936 #1063579] INFO -- : [599/885] 1104926=test_gem_local_remote_options I, [2024-05-18T00:53:36.793842 #1063579] INFO -- : [600/885] 1104908=test_date_arith I, [2024-05-18T00:53:36.796928 #1063579] INFO -- : [601/885] 1104922=test_object I, [2024-05-18T00:53:36.799063 #1063579] INFO -- : [602/885] 1104908=test_ruby_lex I, [2024-05-18T00:53:36.834905 #1063579] INFO -- : [603/885] 1104915=test_sleep I, [2024-05-18T00:53:36.849177 #1063579] INFO -- : [604/885] 1104926=test_type I, [2024-05-18T00:53:36.868556 #1063579] INFO -- : [605/885] 1104926=test_ractor I, [2024-05-18T00:53:36.931398 #1063579] INFO -- : [606/885] 1104908=test_func I, [2024-05-18T00:53:36.933013 #1063579] INFO -- : [607/885] 1104926=test_big5 I, [2024-05-18T00:53:36.936379 #1063579] INFO -- : [608/885] 1104926=test_pointer I, [2024-05-18T00:53:36.948174 #1063579] INFO -- : [609/885] 1104909=test_rdoc_rd_block_parser I, [2024-05-18T00:53:36.975529 #1063579] INFO -- : [610/885] 1104924=test_tsort I, [2024-05-18T00:53:36.988866 #1063579] INFO -- : [611/885] 1104924=test_signedness I, [2024-05-18T00:53:37.018491 #1063579] INFO -- : [612/885] 1104925=test_regexp I, [2024-05-18T00:53:37.086544 #1063579] INFO -- : [613/885] 1104909=test_gem_commands_check_command I, [2024-05-18T00:53:37.107226 #1063579] INFO -- : [614/885] 1104909=errors_test I, [2024-05-18T00:53:37.148571 #1063579] INFO -- : [615/885] 1104921=test_vm_dump I, [2024-05-18T00:53:37.149765 #1063579] INFO -- : [616/885] 1104921=test_tmpdir I, [2024-05-18T00:53:37.167673 #1063579] INFO -- : [617/885] 1104922=test_rdoc_markup_document I, [2024-05-18T00:53:37.175845 #1063579] INFO -- : [618/885] 1104922=test_integer_comb I, [2024-05-18T00:53:37.188966 #1063579] INFO -- : [619/885] 1104910=test_file I, [2024-05-18T00:53:37.209188 #1063579] INFO -- : [620/885] 1104921=test_force_exit I, [2024-05-18T00:53:37.262866 #1063579] INFO -- : [621/885] 1104909=unescape_test I, [2024-05-18T00:53:37.285140 #1063579] INFO -- : [622/885] 1104921=test_ostruct I, [2024-05-18T00:53:37.432444 #1063579] INFO -- : [623/885] 1104921=test_data_error I, [2024-05-18T00:53:37.525926 #1063579] INFO -- : [624/885] 1104921=bom_test I, [2024-05-18T00:53:37.556515 #1063579] INFO -- : [625/885] 1104913=test_udp I, [2024-05-18T00:53:37.566113 #1063579] INFO -- : [626/885] 1104913=static_inspect_test I, [2024-05-18T00:53:37.574762 #1063579] INFO -- : [627/885] 1104913=test_gem_uri_formatter I, [2024-05-18T00:53:37.576759 #1063579] INFO -- : [628/885] 1104926=test_encoding I, [2024-05-18T00:53:37.592084 #1063579] INFO -- : [629/885] 1104913=test_helper I, [2024-05-18T00:53:37.600790 #1063579] INFO -- : [630/885] 1104913=test_erb_command I, [2024-05-18T00:53:37.609332 #1063579] INFO -- : [631/885] 1104921=test_pty I, [2024-05-18T00:53:37.635654 #1063579] INFO -- : [632/885] 1104913=test_dup I, [2024-05-18T00:53:37.813348 #1063579] INFO -- : [633/885] 1104926=test_constant I, [2024-05-18T00:53:37.837188 #1063579] INFO -- : [634/885] 1104913=command_line_test I, [2024-05-18T00:53:37.841365 #1063579] INFO -- : [635/885] 1104913=test_project_sanity I, [2024-05-18T00:53:37.913424 #1063579] INFO -- : [636/885] 1104913=test_range I, [2024-05-18T00:53:37.918961 #1063579] INFO -- : [637/885] 1104917=test_rdoc_ri_paths I, [2024-05-18T00:53:37.938345 #1063579] INFO -- : [638/885] 1104917=test_ts I, [2024-05-18T00:53:37.970919 #1063579] INFO -- : [639/885] 1104927=library_symbols_test I, [2024-05-18T00:53:38.005202 #1063579] INFO -- : [640/885] 1104918=test_addr I, [2024-05-18T00:53:38.019239 #1063579] INFO -- : [641/885] 1104918=test_locale I, [2024-05-18T00:53:38.019305 #1063579] INFO -- : [642/885] 1104927=test_ensured I, [2024-05-18T00:53:38.089123 #1063579] INFO -- : [643/885] 1104921=test_gem_resolver_vendor_set I, [2024-05-18T00:53:38.090201 #1063579] INFO -- : [644/885] 1104927=test_config I, [2024-05-18T00:53:38.105386 #1063579] INFO -- : [645/885] 1104921=test_enumerable I, [2024-05-18T00:53:38.112058 #1063579] INFO -- : [646/885] 1104918=test_gem_safe_marshal I, [2024-05-18T00:53:38.117015 #1063579] INFO -- : [647/885] 1104921=test_gem_resolver_api_set I, [2024-05-18T00:53:38.181897 #1063579] INFO -- : [648/885] 1104921=test_transcode I, [2024-05-18T00:53:38.254488 #1063579] INFO -- : [649/885] 1104908=test_eval I, [2024-05-18T00:53:38.390245 #1063579] INFO -- : [650/885] 1104917=json_generator_test I, [2024-05-18T00:53:38.408077 #1063579] INFO -- : [651/885] 1104908=test_rdoc_code_object I, [2024-05-18T00:53:38.408971 #1063579] INFO -- : [652/885] 1104921=test_x509store I, [2024-05-18T00:53:38.448410 #1063579] INFO -- : [653/885] 1104909=test_fips I, [2024-05-18T00:53:38.503820 #1063579] INFO -- : [654/885] 1104917=test_x509name I, [2024-05-18T00:53:38.521292 #1063579] INFO -- : [655/885] 1104927=test_update I, [2024-05-18T00:53:38.524993 #1063579] INFO -- : [656/885] 1104927=test_lambda I, [2024-05-18T00:53:38.531385 #1063579] INFO -- : [657/885] 1104914=test_gem_request_set_gem_dependency_api I, [2024-05-18T00:53:38.548054 #1063579] INFO -- : [658/885] 1104913=test_ast I, [2024-05-18T00:53:38.551399 #1063579] INFO -- : [659/885] 1104917=test_jaro_winkler I, [2024-05-18T00:53:38.563051 #1063579] INFO -- : [660/885] 1104917=test_random_formatter I, [2024-05-18T00:53:38.604083 #1063579] INFO -- : [661/885] 1104927=test_helper I, [2024-05-18T00:53:38.604466 #1063579] INFO -- : [662/885] 1104927=test_webauthn_listener I, [2024-05-18T00:53:38.606364 #1063579] INFO -- : [663/885] 1104917=test_gem_commands_build_command I, [2024-05-18T00:53:38.657695 #1063579] INFO -- : [664/885] 1104921=test_case_comprehensive I, [2024-05-18T00:53:38.662703 #1063579] INFO -- : [665/885] 1104927=test_interned_str I, [2024-05-18T00:53:38.664652 #1063579] INFO -- : [666/885] 1104927=test_did_you_mean I, [2024-05-18T00:53:38.695234 #1063579] INFO -- : [667/885] 1104918=test_io_m17n I, [2024-05-18T00:53:38.715873 #1063579] INFO -- : [668/885] 1104914=test_variable_name_check I, [2024-05-18T00:53:38.717239 #1063579] INFO -- : [669/885] 1104909=test_gem_commands_server_command I, [2024-05-18T00:53:38.723309 #1063579] INFO -- : [670/885] 1104909=test_option I, [2024-05-18T00:53:38.758925 #1063579] INFO -- : [671/885] 1104914=test_append I, [2024-05-18T00:53:38.762652 #1063579] INFO -- : [672/885] 1104914=test_tracer I, [2024-05-18T00:53:38.766979 #1063579] INFO -- : [673/885] 1104914=test_cmethod I, [2024-05-18T00:53:38.767039 #1063579] INFO -- : [674/885] 1104914=test_exception_at_throwing I, [2024-05-18T00:53:38.783214 #1063579] INFO -- : [675/885] 1104908=test_iseq I, [2024-05-18T00:53:38.794952 #1063579] INFO -- : [676/885] 1104927=test_rdoc_markup_heading I, [2024-05-18T00:53:38.804288 #1063579] INFO -- : [677/885] 1104927=test_ocsp I, [2024-05-18T00:53:38.842959 #1063579] INFO -- : [678/885] 1104914=test_class I, [2024-05-18T00:53:38.843815 #1063579] INFO -- : [679/885] 1104917=test_pkey_dsa I, [2024-05-18T00:53:38.851221 #1063579] INFO -- : [680/885] 1104914=test_scheduler I, [2024-05-18T00:53:38.877144 #1063579] INFO -- : [681/885] 1104909=test_within_pipe I, [2024-05-18T00:53:38.913696 #1063579] INFO -- : [682/885] 1104909=test_emoji_breaks I, [2024-05-18T00:53:38.919477 #1063579] INFO -- : [683/885] 1104909=test_gem_bundler_version_finder I, [2024-05-18T00:53:38.936263 #1063579] INFO -- : [684/885] 1104909=reflection_test I, [2024-05-18T00:53:38.944381 #1063579] INFO -- : [685/885] 1104909=test_beginendblock I, [2024-05-18T00:53:39.002667 #1063579] INFO -- : [686/885] 1104914=test_files_lib I, [2024-05-18T00:53:39.170332 #1063579] INFO -- : [687/885] 1104927=test_gem_commands_unpack_command I, [2024-05-18T00:53:39.264610 #1063579] INFO -- : [688/885] 1104909=test_rdoc_markup_to_bs I, [2024-05-18T00:53:39.300925 #1063579] INFO -- : [689/885] 1104909=test_help I, [2024-05-18T00:53:39.303944 #1063579] INFO -- : [690/885] 1104909=test_rdoc_markup_pre_process I, [2024-05-18T00:53:39.408949 #1063579] INFO -- : [691/885] 1104909=test_printf I, [2024-05-18T00:53:39.416707 #1063579] INFO -- : [692/885] 1104909=test_stream I, [2024-05-18T00:53:39.422662 #1063579] INFO -- : [693/885] 1104909=test_to_ary_concat I, [2024-05-18T00:53:39.444010 #1063579] INFO -- : [694/885] 1104908=test_webauthn_listener_response I, [2024-05-18T00:53:39.455296 #1063579] INFO -- : [695/885] 1104922=test_time I, [2024-05-18T00:53:39.460870 #1063579] INFO -- : [696/885] 1104908=test_pinned I, [2024-05-18T00:53:39.512821 #1063579] INFO -- : [697/885] 1104908=test_popen_deadlock I, [2024-05-18T00:53:39.528548 #1063579] INFO -- : [698/885] 1104927=test_delegate I, [2024-05-18T00:53:39.540846 #1063579] INFO -- : [699/885] 1104927=test_mkmf I, [2024-05-18T00:53:39.545331 #1063579] INFO -- : [700/885] 1104924=test_date_marshal I, [2024-05-18T00:53:39.550099 #1063579] INFO -- : [701/885] 1104924=test_history I, [2024-05-18T00:53:39.557935 #1063579] INFO -- : [702/885] 1104927=test_recursion I, [2024-05-18T00:53:39.564177 #1063579] INFO -- : [703/885] 1104927=test_exit I, [2024-05-18T00:53:39.604711 #1063579] INFO -- : [704/885] 1104922=test_digest I, [2024-05-18T00:53:39.618944 #1063579] INFO -- : [705/885] 1104922=test_gem_security I, [2024-05-18T00:53:39.644838 #1063579] INFO -- : [706/885] 1104927=test_rdoc_servlet I, [2024-05-18T00:53:39.657037 #1063579] INFO -- : [707/885] 1104924=test_ractor I, [2024-05-18T00:53:39.704029 #1063579] INFO -- : [708/885] 1104917=test_open3 I, [2024-05-18T00:53:39.740800 #1063579] INFO -- : [709/885] 1104924=test_multi_irb_commands I, [2024-05-18T00:53:39.744286 #1063579] INFO -- : [710/885] 1104924=test_fiber I, [2024-05-18T00:53:39.815582 #1063579] INFO -- : [711/885] 1104927=test_bundled_ca I, [2024-05-18T00:53:39.882693 #1063579] INFO -- : [712/885] 1104911=test_closure I, [2024-05-18T00:53:40.000748 #1063579] INFO -- : [713/885] 1104918=test_primitive I, [2024-05-18T00:53:40.012608 #1063579] INFO -- : [714/885] 1104918=test_human_typo I, [2024-05-18T00:53:40.017421 #1063579] INFO -- : [715/885] 1104918=test_rbconfig I, [2024-05-18T00:53:40.021173 #1063579] INFO -- : [716/885] 1104918=test_acceptable I, [2024-05-18T00:53:40.104662 #1063579] INFO -- : [717/885] 1104908=test_rdoc_generator_pot_po_entry I, [2024-05-18T00:53:40.110426 #1063579] INFO -- : [718/885] 1104908=test_euc_jp I, [2024-05-18T00:53:40.112647 #1063579] INFO -- : [719/885] 1104908=test_document I, [2024-05-18T00:53:40.116844 #1063579] INFO -- : [720/885] 1104908=test_pair I, [2024-05-18T00:53:40.185568 #1063579] INFO -- : [721/885] 1104918=test_win32ole_param I, [2024-05-18T00:53:40.196547 #1063579] INFO -- : [722/885] 1104918=test_gem_commands_yank_command I, [2024-05-18T00:53:40.211221 #1063579] INFO -- : [723/885] 1104926=test_rdoc_i18n_locale I, [2024-05-18T00:53:40.221080 #1063579] INFO -- : [724/885] 1104926=test_chilled I, [2024-05-18T00:53:40.224838 #1063579] INFO -- : [725/885] 1104926=test_name_error_extension I, [2024-05-18T00:53:40.243418 #1063579] INFO -- : [726/885] 1104926=test_rdoc_ri_driver I, [2024-05-18T00:53:40.461312 #1063579] INFO -- : [727/885] 1104926=test_httpheader I, [2024-05-18T00:53:40.468045 #1063579] INFO -- : [728/885] 1104911=test_gem_resolver_local_specification I, [2024-05-18T00:53:40.493866 #1063579] INFO -- : [729/885] 1104911=test_set_len I, [2024-05-18T00:53:40.499807 #1063579] INFO -- : [730/885] 1104926=test_encoding I, [2024-05-18T00:53:40.503595 #1063579] INFO -- : [731/885] 1104911=test_httpresponses I, [2024-05-18T00:53:40.511731 #1063579] INFO -- : [732/885] 1104926=test_sockopt I, [2024-05-18T00:53:40.524653 #1063579] INFO -- : [733/885] 1104926=test_rdoc_markup_to_label I, [2024-05-18T00:53:40.534097 #1063579] INFO -- : [734/885] 1104911=test_install I, [2024-05-18T00:53:40.565196 #1063579] INFO -- : [735/885] 1104926=test_key_stroke I, [2024-05-18T00:53:40.578416 #1063579] INFO -- : [736/885] 1104926=json_encoding_test I, [2024-05-18T00:53:40.590281 #1063579] INFO -- : [737/885] 1104926=test_color I, [2024-05-18T00:53:40.640514 #1063579] INFO -- : [738/885] 1104926=test_bug-14834 I, [2024-05-18T00:53:40.669345 #1063579] INFO -- : [739/885] 1104918=test_rdoc_markup_to_html I, [2024-05-18T00:53:40.705202 #1063579] INFO -- : [740/885] 1104926=test_date_compat I, [2024-05-18T00:53:40.707251 #1063579] INFO -- : [741/885] 1104926=test_terminfo I, [2024-05-18T00:53:40.708481 #1063579] INFO -- : [742/885] 1104926=test_compile_prism I, [2024-05-18T00:53:40.764437 #1063579] INFO -- : [743/885] 1104918=test_win32ole_param_event I, [2024-05-18T00:53:40.765066 #1063579] INFO -- : [744/885] 1104918=test_bn I, [2024-05-18T00:53:40.802448 #1063579] INFO -- : [745/885] 1104918=redundant_return_test I, [2024-05-18T00:53:40.805550 #1063579] INFO -- : [746/885] 1104911=test_case_mapping I, [2024-05-18T00:53:40.814744 #1063579] INFO -- : [747/885] 1104911=test_path I, [2024-05-18T00:53:40.825265 #1063579] INFO -- : [748/885] 1104911=test_tree_spell_checker I, [2024-05-18T00:53:40.857957 #1063579] INFO -- : [749/885] 1104911=test_http I, [2024-05-18T00:53:40.869397 #1063579] INFO -- : [750/885] 1104918=test_addrinfo I, [2024-05-18T00:53:40.897903 #1063579] INFO -- : [751/885] 1104918=test_rdoc_method_attr I, [2024-05-18T00:53:40.973543 #1063579] INFO -- : [752/885] 1104926=test_data I, [2024-05-18T00:53:40.979696 #1063579] INFO -- : [753/885] 1104926=static_literals_test I, [2024-05-18T00:53:40.980239 #1063579] INFO -- : [754/885] 1104926=test_filter I, [2024-05-18T00:53:41.029972 #1063579] INFO -- : [755/885] 1104926=test_gem_gem_runner I, [2024-05-18T00:53:41.033712 #1063579] INFO -- : [756/885] 1104918=test_rdoc_generator_pot I, [2024-05-18T00:53:41.038666 #1063579] INFO -- : [757/885] 1104918=test_unicode I, [2024-05-18T00:53:41.053110 #1063579] INFO -- : [758/885] 1104918=test_enumerator I, [2024-05-18T00:53:41.060066 #1063579] INFO -- : [759/885] 1104918=test_rdoc_parser_changelog I, [2024-05-18T00:53:41.076885 #1063579] INFO -- : [760/885] 1104926=parameters_signature_test I, [2024-05-18T00:53:41.082594 #1063579] INFO -- : [761/885] 1104926=test_koi8 I, [2024-05-18T00:53:41.087154 #1063579] INFO -- : [762/885] 1104926=test_ssl_session I, [2024-05-18T00:53:41.181138 #1063579] INFO -- : [763/885] 1104918=test_thread_cv I, [2024-05-18T00:53:41.201174 #1063579] INFO -- : [764/885] 1104927=test_lexer I, [2024-05-18T00:53:41.209189 #1063579] INFO -- : [765/885] 1104927=test_gem_resolver_vendor_specification I, [2024-05-18T00:53:41.253056 #1063579] INFO -- : [766/885] 1104927=test_gem_commands_update_command I, [2024-05-18T00:53:41.468944 #1063579] INFO -- : [767/885] 1104909=test_notimplement I, [2024-05-18T00:53:41.473979 #1063579] INFO -- : [768/885] 1104909=test_random I, [2024-05-18T00:53:41.487166 #1063579] INFO -- : [769/885] 1104909=test_gem_uri I, [2024-05-18T00:53:41.509058 #1063579] INFO -- : [770/885] 1104909=test_key_event_record I, [2024-05-18T00:53:41.509624 #1063579] INFO -- : [771/885] 1104909=test_gem_ext_cargo_builder I, [2024-05-18T00:53:41.533872 #1063579] INFO -- : [772/885] 1104909=test_ssl I, [2024-05-18T00:53:41.810455 #1063579] INFO -- : [773/885] 1104918=constant_path_node_test I, [2024-05-18T00:53:41.822254 #1063579] INFO -- : [774/885] 1104918=test_gem_request_set I, [2024-05-18T00:53:41.841254 #1063579] INFO -- : [775/885] 1104915=test_module I, [2024-05-18T00:53:41.980546 #1063579] INFO -- : [776/885] 1104916=test_parser I, [2024-05-18T00:53:42.004365 #1063579] INFO -- : [777/885] 1104916=test_arith_seq_extract I, [2024-05-18T00:53:42.040584 #1063579] INFO -- : [778/885] 1104914=test_method_name_check I, [2024-05-18T00:53:42.057638 #1063579] INFO -- : [779/885] 1104917=test_buffered_io I, [2024-05-18T00:53:42.069533 #1063579] INFO -- : [780/885] 1104914=test_monitor I, [2024-05-18T00:53:42.129657 #1063579] INFO -- : [781/885] 1104917=test_rubyvm I, [2024-05-18T00:53:42.136868 #1063579] INFO -- : [782/885] 1104917=test_configuration I, [2024-05-18T00:53:42.168177 #1063579] INFO -- : [783/885] 1104926=test_rdoc_generator_markup I, [2024-05-18T00:53:42.178838 #1063579] INFO -- : [784/885] 1104926=test_whileuntil I, [2024-05-18T00:53:42.179750 #1063579] INFO -- : [785/885] 1104926=test_boolean I, [2024-05-18T00:53:42.179934 #1063579] INFO -- : [786/885] 1104916=test_stringify_symbols I, [2024-05-18T00:53:42.187512 #1063579] INFO -- : [787/885] 1104918=test_instrumentation_api I, [2024-05-18T00:53:42.187739 #1063579] INFO -- : [788/885] 1104926=integer_parse_test I, [2024-05-18T00:53:42.191380 #1063579] INFO -- : [789/885] 1104916=test_nesting_parser I, [2024-05-18T00:53:42.192594 #1063579] INFO -- : [790/885] 1104926=test_win32ole_method_event I, [2024-05-18T00:53:42.198696 #1063579] INFO -- : [791/885] 1104926=test_benchmark I, [2024-05-18T00:53:42.215458 #1063579] INFO -- : [792/885] 1104917=test_gem_dependency_list I, [2024-05-18T00:53:42.255351 #1063579] INFO -- : [793/885] 1104917=test_array I, [2024-05-18T00:53:42.283292 #1063579] INFO -- : [794/885] 1104914=test_gem_package_tar_writer I, [2024-05-18T00:53:42.301597 #1063579] INFO -- : [795/885] 1104916=test_helper_method I, [2024-05-18T00:53:42.308444 #1063579] INFO -- : [796/885] 1104916=test_gem_commands_outdated_command I, [2024-05-18T00:53:42.326061 #1063579] INFO -- : [797/885] 1104920=test_scalar_scanner I, [2024-05-18T00:53:42.333543 #1063579] INFO -- : [798/885] 1104920=test_gem_source I, [2024-05-18T00:53:42.337593 #1063579] INFO -- : [799/885] 1104927=test_load I, [2024-05-18T00:53:42.340224 #1063579] INFO -- : [800/885] 1104927=test_gem_commands_rebuild_command I, [2024-05-18T00:53:42.348305 #1063579] INFO -- : [801/885] 1104916=test_yamldbm I, [2024-05-18T00:53:42.357920 #1063579] INFO -- : [802/885] 1104916=test_rdoc_parser_simple I, [2024-05-18T00:53:42.384009 #1063579] INFO -- : [803/885] 1104927=test_provider I, [2024-05-18T00:53:42.415865 #1063579] INFO -- : [804/885] 1104914=test_abi I, [2024-05-18T00:53:42.538232 #1063579] INFO -- : [805/885] 1104916=test_evaluation I, [2024-05-18T00:53:42.541959 #1063579] INFO -- : [806/885] 1104916=test_gem_ext_builder I, [2024-05-18T00:53:42.569316 #1063579] INFO -- : [807/885] 1104914=test_https I, [2024-05-18T00:53:42.596261 #1063579] INFO -- : [808/885] 1104920=test_gem_source_installed I, [2024-05-18T00:53:42.616610 #1063579] INFO -- : [809/885] 1104920=test_x509ext I, [2024-05-18T00:53:42.625999 #1063579] INFO -- : [810/885] 1104920=test_erb I, [2024-05-18T00:53:42.668295 #1063579] INFO -- : [811/885] 1104920=test_gem_commands_cert_command I, [2024-05-18T00:53:42.752763 #1063579] INFO -- : [812/885] 1104927=test_completion I, [2024-05-18T00:53:42.908234 #1063579] INFO -- : [813/885] 1104914=test_yield_block I, [2024-05-18T00:53:42.925932 #1063579] INFO -- : [814/885] 1104914=test_len I, [2024-05-18T00:53:42.927848 #1063579] INFO -- : [815/885] 1104914=test_rational2 I, [2024-05-18T00:53:42.935352 #1063579] INFO -- : [816/885] 1104914=test_rational I, [2024-05-18T00:53:42.953567 #1063579] INFO -- : [817/885] 1104914=test_spell_checker I, [2024-05-18T00:53:42.958786 #1063579] INFO -- : [818/885] 1104914=test_propertyputref I, [2024-05-18T00:53:42.958862 #1063579] INFO -- : [819/885] 1104914=attribute_write_test I, [2024-05-18T00:53:42.966256 #1063579] INFO -- : [820/885] 1104914=test_assembler I, [2024-05-18T00:53:42.979825 #1063579] INFO -- : [821/885] 1104914=test_require I, [2024-05-18T00:53:43.253194 #1063579] INFO -- : [822/885] 1104910=test_cgi_cookie I, [2024-05-18T00:53:43.257910 #1063579] INFO -- : [823/885] 1104910=test_float I, [2024-05-18T00:53:43.390713 #1063579] INFO -- : [824/885] 1104908=test_gem_resolver_installer_set I, [2024-05-18T00:53:43.471164 #1063579] INFO -- : [825/885] 1104927=test_dir_m17n I, [2024-05-18T00:53:43.492444 #1063579] INFO -- : [826/885] 1104912=test_gem_source_git I, [2024-05-18T00:53:43.498793 #1063579] INFO -- : [827/885] 1104926=test_regex_casefold I, [2024-05-18T00:53:43.588026 #1063579] INFO -- : [828/885] 1104908=test_refinement I, [2024-05-18T00:53:43.595246 #1063579] INFO -- : [829/885] 1104916=test_gem_commands_signout_command I, [2024-05-18T00:53:43.604958 #1063579] INFO -- : [830/885] 1104916=test_x509crl I, [2024-05-18T00:53:43.672134 #1063579] INFO -- : [831/885] 1104915=test_signal I, [2024-05-18T00:53:43.794238 #1063579] INFO -- : [832/885] 1104916=test_fixnum I, [2024-05-18T00:53:43.807299 #1063579] INFO -- : [833/885] 1104916=test_rdoc_top_level I, [2024-05-18T00:53:43.945626 #1063579] INFO -- : [834/885] 1104926=test_metaclass I, [2024-05-18T00:53:43.947208 #1063579] INFO -- : [835/885] 1104926=test_cgi_session I, [2024-05-18T00:53:43.957671 #1063579] INFO -- : [836/885] 1104912=test_rdoc_rd I, [2024-05-18T00:53:43.958841 #1063579] INFO -- : [837/885] 1104926=test_windows_1252 I, [2024-05-18T00:53:43.964859 #1063579] INFO -- : [838/885] 1104926=test_input_method I, [2024-05-18T00:53:43.978429 #1063579] INFO -- : [839/885] 1104912=test_process I, [2024-05-18T00:53:43.981189 #1063579] INFO -- : [840/885] 1104926=test_omap I, [2024-05-18T00:53:43.987036 #1063579] INFO -- : [841/885] 1104926=test_string I, [2024-05-18T00:53:43.989073 #1063579] INFO -- : [842/885] 1104926=test_iterator I, [2024-05-18T00:53:44.003508 #1063579] INFO -- : [843/885] 1104912=test_digest_extend I, [2024-05-18T00:53:44.015906 #1063579] INFO -- : [844/885] 1104912=test_shellwords I, [2024-05-18T00:53:44.021603 #1063579] INFO -- : [845/885] 1104912=test_memory_view I, [2024-05-18T00:53:44.034170 #1063579] INFO -- : [846/885] 1104912=pattern_test I, [2024-05-18T00:53:44.050312 #1063579] INFO -- : [847/885] 1104926=test_debug I, [2024-05-18T00:53:44.053808 #1063579] INFO -- : [848/885] 1104912=test_gem_security_signer I, [2024-05-18T00:53:44.055051 #1063579] INFO -- : [849/885] 1104926=test_cipher I, [2024-05-18T00:53:44.097625 #1063579] INFO -- : [850/885] 1104926=test_new I, [2024-05-18T00:53:44.101140 #1063579] INFO -- : [851/885] 1104926=test_storage I, [2024-05-18T00:53:44.105309 #1063579] INFO -- : [852/885] 1104926=test_gem_resolver_git_set I, [2024-05-18T00:53:44.130514 #1063579] INFO -- : [853/885] 1104912=json_common_interface_test I, [2024-05-18T00:53:44.136240 #1063579] INFO -- : [854/885] 1104912=test_dln I, [2024-05-18T00:53:44.140523 #1063579] INFO -- : [855/885] 1104912=test_gem_source_subpath_problem I, [2024-05-18T00:53:44.141705 #1063579] INFO -- : [856/885] 1104916=test_win32ole_variant_outarg I, [2024-05-18T00:53:44.146315 #1063579] INFO -- : [857/885] 1104916=test_config I, [2024-05-18T00:53:44.187210 #1063579] INFO -- : [858/885] 1104916=test_nomethod_error I, [2024-05-18T00:53:44.188326 #1063579] INFO -- : [859/885] 1104916=json_parser_test I, [2024-05-18T00:53:44.226442 #1063579] INFO -- : [860/885] 1104912=memsize_test I, [2024-05-18T00:53:44.227704 #1063579] INFO -- : [861/885] 1104912=test_cparser I, [2024-05-18T00:53:44.240850 #1063579] INFO -- : [862/885] 1104916=test_pkg_config I, [2024-05-18T00:53:44.255248 #1063579] INFO -- : [863/885] 1104916=test_variable I, [2024-05-18T00:53:44.361398 #1063579] INFO -- : [864/885] 1104916=fuzzer_test I, [2024-05-18T00:53:44.369022 #1063579] INFO -- : [865/885] 1104916=test_sexp I, [2024-05-18T00:53:44.381351 #1063579] INFO -- : [866/885] 1104916=test_rdoc_markup_include I, [2024-05-18T00:53:44.383047 #1063579] INFO -- : [867/885] 1104916=test_rdoc_markup_to_html_snippet I, [2024-05-18T00:53:44.440155 #1063579] INFO -- : [868/885] 1104916=magic_comment_test I, [2024-05-18T00:53:44.446531 #1063579] INFO -- : [869/885] 1104916=test_struct I, [2024-05-18T00:53:44.448156 #1063579] INFO -- : [870/885] 1104926=test_key_error I, [2024-05-18T00:53:44.449125 #1063579] INFO -- : [871/885] 1104916=test_win32ole_variant_m I, [2024-05-18T00:53:44.450933 #1063579] INFO -- : [872/885] 1104916=test_engine I, [2024-05-18T00:53:44.452349 #1063579] INFO -- : [873/885] 1104926=test_allocation I, [2024-05-18T00:53:44.453731 #1063579] INFO -- : [874/885] 1104916=test_div I, [2024-05-18T00:53:44.456057 #1063579] INFO -- : [875/885] 1104916=test_color_printer I, [2024-05-18T00:53:44.461893 #1063579] INFO -- : [876/885] 1104916=test_deprecated I, [2024-05-18T00:53:44.467256 #1063579] INFO -- : [877/885] 1104916=test_insns_leaf I, [2024-05-18T00:53:44.470470 #1063579] INFO -- : [878/885] 1104916=test_serialize_subclasses I, [2024-05-18T00:53:44.474058 #1063579] INFO -- : [879/885] 1104916=test_struct I, [2024-05-18T00:53:44.691295 #1063579] INFO -- : [880/885] 1104910=test_gem_path_support I, [2024-05-18T00:53:44.717606 #1063579] INFO -- : [881/885] 1104910=test_set I, [2024-05-18T00:53:44.739193 #1063579] INFO -- : [882/885] 1104910=test_files_test_1 I, [2024-05-18T00:53:44.806347 #1063579] INFO -- : [883/885] 1104912=test_rdoc_rd_inline I, [2024-05-18T00:53:44.826363 #1063579] INFO -- : [884/885] 1104912=test_x509req I, [2024-05-18T00:53:44.860167 #1063579] INFO -- : [885/885] 1104927=test_mutex I, [2024-05-18T00:54:03.838954 #1063579] INFO -- : Finished tests in 38.483413s, 686.2697 tests/s, 243034.0807 assertions/s. I, [2024-05-18T00:54:03.839681 #1063579] INFO -- : 26410 tests, 9352781 assertions, 0 failures, 0 errors, 312 skips I, [2024-05-18T00:54:03.839847 #1063579] INFO -- : I, [2024-05-18T00:54:03.839878 #1063579] INFO -- : ruby -v: ruby 3.4.0dev (2024-05-17T20:42:14Z master cce7c25a42) [x86_64-linux] I, [2024-05-18T00:54:03.841967 #1063579] INFO -- : $$$[end] "make yes-test-all TESTOPTS='--stderr-on-failure' TESTS='-j20'" exit with 0. I, [2024-05-18T00:54:03.842143 #1063579] INFO -- : $$$[beg] make yes-test-rubyspec MSPECOPT='--error-output stderr --debug -j' TESTS='-j20' I, [2024-05-18T00:54:03.931490 #1063579] INFO -- : BASERUBY = /usr/bin/ruby --disable=gems I, [2024-05-18T00:54:03.931529 #1063579] INFO -- : CC = gcc I, [2024-05-18T00:54:03.931534 #1063579] INFO -- : LD = ld I, [2024-05-18T00:54:03.931539 #1063579] INFO -- : LDSHARED = gcc -shared I, [2024-05-18T00:54:03.931544 #1063579] INFO -- : CFLAGS = -O3 -fno-fast-math -ggdb3 -Wall -Wextra -Wdeprecated-declarations -Wdiv-by-zero -Wduplicated-cond -Wimplicit-function-declaration -Wimplicit-int -Wpointer-arith -Wwrite-strings -Wold-style-definition -Wimplicit-fallthrough=0 -Wmissing-noreturn -Wno-cast-function-type -Wno-constant-logical-operand -Wno-long-long -Wno-missing-field-initializers -Wno-overlength-strings -Wno-packed-bitfield-compat -Wno-parentheses-equality -Wno-self-assign -Wno-tautological-compare -Wno-unused-parameter -Wno-unused-value -Wsuggest-attribute=format -Wsuggest-attribute=noreturn -Wunused-variable -Wmisleading-indentation -Wundef -fPIC I, [2024-05-18T00:54:03.931548 #1063579] INFO -- : XCFLAGS = -U_FORTIFY_SOURCE -D_FORTIFY_SOURCE=2 -fstack-protector-strong -fno-strict-overflow -fvisibility=hidden -fexcess-precision=standard -DRUBY_EXPORT -I. -I.ext/include/x86_64-linux -I/tmp/ruby/src/trunk/include -I/tmp/ruby/src/trunk -I/tmp/ruby/src/trunk/prism -I/tmp/ruby/src/trunk/enc/unicode/15.0.0 I, [2024-05-18T00:54:03.931552 #1063579] INFO -- : CPPFLAGS = I, [2024-05-18T00:54:03.931556 #1063579] INFO -- : DLDFLAGS = -Wl,--compress-debug-sections=zlib -Wl,-soname,libruby.so.3.4 -fstack-protector-strong I, [2024-05-18T00:54:03.931560 #1063579] INFO -- : SOLIBS = -lz -lrt -lrt -lgmp -ldl -lcrypt -lm -lpthread I, [2024-05-18T00:54:03.931563 #1063579] INFO -- : LANG = en_US.UTF-8 I, [2024-05-18T00:54:03.931567 #1063579] INFO -- : LC_ALL = I, [2024-05-18T00:54:03.931571 #1063579] INFO -- : LC_CTYPE = I, [2024-05-18T00:54:03.931574 #1063579] INFO -- : MFLAGS = I, [2024-05-18T00:54:03.931578 #1063579] INFO -- : RUSTC = no I, [2024-05-18T00:54:03.931581 #1063579] INFO -- : YJIT_RUSTC_ARGS = --crate-name=yjit --crate-type=staticlib --edition=2021 -g -C lto=thin -C opt-level=3 -C overflow-checks=on '--out-dir=/tmp/ruby/build/trunk/yjit/target/release/' /tmp/ruby/src/trunk/yjit/src/lib.rs I, [2024-05-18T00:54:03.932333 #1063579] INFO -- : gcc (Ubuntu 11.4.0-1ubuntu1~22.04) 11.4.0 I, [2024-05-18T00:54:03.932353 #1063579] INFO -- : Copyright (C) 2021 Free Software Foundation, Inc. I, [2024-05-18T00:54:03.932359 #1063579] INFO -- : This is free software; see the source for copying conditions. There is NO I, [2024-05-18T00:54:03.932363 #1063579] INFO -- : warranty; not even for MERCHANTABILITY or FITNESS FOR A PARTICULAR PURPOSE. I, [2024-05-18T00:54:03.932367 #1063579] INFO -- : I, [2024-05-18T00:54:03.934205 #1063579] INFO -- : generating enc.mk I, [2024-05-18T00:54:04.052037 #1063579] INFO -- : making enc I, [2024-05-18T00:54:04.069187 #1063579] INFO -- : make[1]: Entering directory '/tmp/ruby/build/trunk' I, [2024-05-18T00:54:04.069220 #1063579] INFO -- : make[1]: Nothing to be done for 'enc'. I, [2024-05-18T00:54:04.069229 #1063579] INFO -- : make[1]: Leaving directory '/tmp/ruby/build/trunk' I, [2024-05-18T00:54:04.070033 #1063579] INFO -- : making srcs under enc I, [2024-05-18T00:54:04.101906 #1063579] INFO -- : make[1]: Entering directory '/tmp/ruby/build/trunk' I, [2024-05-18T00:54:04.101927 #1063579] INFO -- : make[1]: Nothing to be done for 'srcs'. I, [2024-05-18T00:54:04.101932 #1063579] INFO -- : make[1]: Leaving directory '/tmp/ruby/build/trunk' I, [2024-05-18T00:54:04.102943 #1063579] INFO -- : generating transdb.h I, [2024-05-18T00:54:04.199369 #1063579] INFO -- : transdb.h unchanged I, [2024-05-18T00:54:04.200723 #1063579] INFO -- : making trans I, [2024-05-18T00:54:04.234595 #1063579] INFO -- : make[1]: Entering directory '/tmp/ruby/build/trunk' I, [2024-05-18T00:54:04.234617 #1063579] INFO -- : make[1]: Nothing to be done for 'trans'. I, [2024-05-18T00:54:04.234624 #1063579] INFO -- : make[1]: Leaving directory '/tmp/ruby/build/trunk' I, [2024-05-18T00:54:04.235391 #1063579] INFO -- : making encs I, [2024-05-18T00:54:04.272734 #1063579] INFO -- : make[1]: Entering directory '/tmp/ruby/build/trunk' I, [2024-05-18T00:54:04.272756 #1063579] INFO -- : make[1]: Nothing to be done for 'encs'. I, [2024-05-18T00:54:04.272761 #1063579] INFO -- : make[1]: Leaving directory '/tmp/ruby/build/trunk' I, [2024-05-18T00:54:04.274691 #1063579] INFO -- : generating makefiles ext/configure-ext.mk I, [2024-05-18T00:54:04.301223 #1063579] INFO -- : ext/configure-ext.mk updated I, [2024-05-18T00:54:04.303847 #1063579] INFO -- : make[1]: Entering directory '/tmp/ruby/build/trunk' I, [2024-05-18T00:54:05.658223 #1063579] INFO -- : make[1]: Leaving directory '/tmp/ruby/build/trunk' I, [2024-05-18T00:54:05.658905 #1063579] INFO -- : generating makefile exts.mk I, [2024-05-18T00:54:05.694839 #1063579] INFO -- : exts.mk unchanged I, [2024-05-18T00:54:05.699270 #1063579] INFO -- : make[1]: Entering directory '/tmp/ruby/build/trunk' I, [2024-05-18T00:54:05.997464 #1063579] INFO -- : make[2]: Entering directory '/tmp/ruby/build/trunk/ext/coverage' I, [2024-05-18T00:54:06.000397 #1063579] INFO -- : make[2]: Leaving directory '/tmp/ruby/build/trunk/ext/coverage' I, [2024-05-18T00:54:06.005076 #1063579] INFO -- : make[2]: Entering directory '/tmp/ruby/build/trunk/ext/date' I, [2024-05-18T00:54:06.008829 #1063579] INFO -- : make[2]: Leaving directory '/tmp/ruby/build/trunk/ext/date' I, [2024-05-18T00:54:06.012091 #1063579] INFO -- : make[2]: Entering directory '/tmp/ruby/build/trunk/ext/digest' I, [2024-05-18T00:54:06.020994 #1063579] INFO -- : make[2]: Leaving directory '/tmp/ruby/build/trunk/ext/digest' I, [2024-05-18T00:54:06.047756 #1063579] INFO -- : make[2]: Entering directory '/tmp/ruby/build/trunk/ext/digest/sha2' I, [2024-05-18T00:54:06.052431 #1063579] INFO -- : make[2]: Leaving directory '/tmp/ruby/build/trunk/ext/digest/sha2' I, [2024-05-18T00:54:06.073752 #1063579] INFO -- : make[2]: Entering directory '/tmp/ruby/build/trunk/ext/fiddle' I, [2024-05-18T00:54:06.084654 #1063579] INFO -- : make[2]: Leaving directory '/tmp/ruby/build/trunk/ext/fiddle' I, [2024-05-18T00:54:06.089618 #1063579] INFO -- : make[2]: Entering directory '/tmp/ruby/build/trunk/ext/io/console' I, [2024-05-18T00:54:06.093885 #1063579] INFO -- : make[2]: Leaving directory '/tmp/ruby/build/trunk/ext/io/console' I, [2024-05-18T00:54:06.106105 #1063579] INFO -- : make[2]: Entering directory '/tmp/ruby/build/trunk/ext/json' I, [2024-05-18T00:54:06.116224 #1063579] INFO -- : make[2]: Leaving directory '/tmp/ruby/build/trunk/ext/json' I, [2024-05-18T00:54:06.131638 #1063579] INFO -- : make[2]: Entering directory '/tmp/ruby/build/trunk/ext/monitor' I, [2024-05-18T00:54:06.135678 #1063579] INFO -- : make[2]: Leaving directory '/tmp/ruby/build/trunk/ext/monitor' I, [2024-05-18T00:54:06.142607 #1063579] INFO -- : make[2]: Entering directory '/tmp/ruby/build/trunk/ext/objspace' I, [2024-05-18T00:54:06.147786 #1063579] INFO -- : make[2]: Leaving directory '/tmp/ruby/build/trunk/ext/objspace' I, [2024-05-18T00:54:06.163215 #1063579] INFO -- : make[2]: Entering directory '/tmp/ruby/build/trunk/ext/openssl' I, [2024-05-18T00:54:06.178964 #1063579] INFO -- : make[2]: Leaving directory '/tmp/ruby/build/trunk/ext/openssl' I, [2024-05-18T00:54:06.183278 #1063579] INFO -- : make[2]: Entering directory '/tmp/ruby/build/trunk/ext/pathname' I, [2024-05-18T00:54:06.186471 #1063579] INFO -- : make[2]: Leaving directory '/tmp/ruby/build/trunk/ext/pathname' I, [2024-05-18T00:54:06.193235 #1063579] INFO -- : make[2]: Entering directory '/tmp/ruby/build/trunk/ext/psych' I, [2024-05-18T00:54:06.216954 #1063579] INFO -- : make[2]: Leaving directory '/tmp/ruby/build/trunk/ext/psych' I, [2024-05-18T00:54:06.221684 #1063579] INFO -- : make[2]: Entering directory '/tmp/ruby/build/trunk/ext/pty' I, [2024-05-18T00:54:06.225810 #1063579] INFO -- : make[2]: Leaving directory '/tmp/ruby/build/trunk/ext/pty' I, [2024-05-18T00:54:06.242252 #1063579] INFO -- : make[2]: Entering directory '/tmp/ruby/build/trunk/ext/ripper' I, [2024-05-18T00:54:06.250650 #1063579] INFO -- : make[2]: Leaving directory '/tmp/ruby/build/trunk/ext/ripper' I, [2024-05-18T00:54:06.252627 #1063579] INFO -- : make[2]: Entering directory '/tmp/ruby/build/trunk/ext/rubyvm' I, [2024-05-18T00:54:06.255440 #1063579] INFO -- : make[2]: Leaving directory '/tmp/ruby/build/trunk/ext/rubyvm' I, [2024-05-18T00:54:06.268259 #1063579] INFO -- : make[2]: Entering directory '/tmp/ruby/build/trunk/ext/socket' I, [2024-05-18T00:54:06.279045 #1063579] INFO -- : make[2]: Leaving directory '/tmp/ruby/build/trunk/ext/socket' I, [2024-05-18T00:54:06.297593 #1063579] INFO -- : make[2]: Entering directory '/tmp/ruby/build/trunk/.bundle/gems/bigdecimal-3.1.8/ext/bigdecimal' I, [2024-05-18T00:54:06.324831 #1063579] INFO -- : make[2]: Leaving directory '/tmp/ruby/build/trunk/.bundle/gems/bigdecimal-3.1.8/ext/bigdecimal' I, [2024-05-18T00:54:06.326959 #1063579] INFO -- : make[2]: Entering directory '/tmp/ruby/build/trunk/.bundle/gems/debug-1.9.2/ext/debug' I, [2024-05-18T00:54:06.348251 #1063579] INFO -- : make[2]: Leaving directory '/tmp/ruby/build/trunk/.bundle/gems/debug-1.9.2/ext/debug' I, [2024-05-18T00:54:06.350147 #1063579] INFO -- : make[2]: Entering directory '/tmp/ruby/build/trunk/.bundle/gems/nkf-0.2.0/ext/nkf' I, [2024-05-18T00:54:06.371729 #1063579] INFO -- : make[2]: Leaving directory '/tmp/ruby/build/trunk/.bundle/gems/nkf-0.2.0/ext/nkf' I, [2024-05-18T00:54:06.373707 #1063579] INFO -- : make[2]: Entering directory '/tmp/ruby/build/trunk/.bundle/gems/racc-1.7.3/ext/racc/cparse' I, [2024-05-18T00:54:06.395926 #1063579] INFO -- : make[2]: Leaving directory '/tmp/ruby/build/trunk/.bundle/gems/racc-1.7.3/ext/racc/cparse' I, [2024-05-18T00:54:06.398285 #1063579] INFO -- : make[2]: Entering directory '/tmp/ruby/build/trunk/.bundle/gems/rbs-3.4.4/ext/rbs_extension' I, [2024-05-18T00:54:06.421486 #1063579] INFO -- : make[2]: Leaving directory '/tmp/ruby/build/trunk/.bundle/gems/rbs-3.4.4/ext/rbs_extension' I, [2024-05-18T00:54:06.423682 #1063579] INFO -- : make[2]: Entering directory '/tmp/ruby/build/trunk/.bundle/gems/syslog-0.1.2/ext/syslog' I, [2024-05-18T00:54:06.447544 #1063579] INFO -- : make[2]: Leaving directory '/tmp/ruby/build/trunk/.bundle/gems/syslog-0.1.2/ext/syslog' I, [2024-05-18T00:54:06.476527 #1063579] INFO -- : make[2]: Entering directory '/tmp/ruby/build/trunk' I, [2024-05-18T00:54:06.540799 #1063579] INFO -- : make[2]: 'ruby' is up to date. I, [2024-05-18T00:54:06.540839 #1063579] INFO -- : make[2]: Leaving directory '/tmp/ruby/build/trunk' I, [2024-05-18T00:54:06.541239 #1063579] INFO -- : make[1]: Leaving directory '/tmp/ruby/build/trunk' I, [2024-05-18T00:54:06.544960 #1063579] INFO -- : make[1]: Entering directory '/tmp/ruby/build/trunk' I, [2024-05-18T00:54:06.544981 #1063579] INFO -- : make[1]: Nothing to be done for 'note'. I, [2024-05-18T00:54:06.544987 #1063579] INFO -- : make[1]: Leaving directory '/tmp/ruby/build/trunk' E, [2024-05-18T00:54:06.601940 #1063579] ERROR -- : $ /tmp/ruby/build/trunk/miniruby -I/tmp/ruby/src/trunk/lib /tmp/ruby/src/trunk/tool/runruby.rb --archdir=/tmp/ruby/build/trunk --extout=.ext -- /tmp/ruby/src/trunk/spec/mspec/bin/mspec-run -B /tmp/ruby/src/trunk/spec/default.mspec --error-output stderr --debug -fy -o /tmp/rubytest.dqlc5t/1-mspec-multi-0 E, [2024-05-18T00:54:06.602191 #1063579] ERROR -- : $ /tmp/ruby/build/trunk/miniruby -I/tmp/ruby/src/trunk/lib /tmp/ruby/src/trunk/tool/runruby.rb --archdir=/tmp/ruby/build/trunk --extout=.ext -- /tmp/ruby/src/trunk/spec/mspec/bin/mspec-run -B /tmp/ruby/src/trunk/spec/default.mspec --error-output stderr --debug -fy -o /tmp/rubytest.dqlc5t/2-mspec-multi-1 E, [2024-05-18T00:54:06.602466 #1063579] ERROR -- : $ /tmp/ruby/build/trunk/miniruby -I/tmp/ruby/src/trunk/lib /tmp/ruby/src/trunk/tool/runruby.rb --archdir=/tmp/ruby/build/trunk --extout=.ext -- /tmp/ruby/src/trunk/spec/mspec/bin/mspec-run -B /tmp/ruby/src/trunk/spec/default.mspec --error-output stderr --debug -fy -o /tmp/rubytest.dqlc5t/3-mspec-multi-2 E, [2024-05-18T00:54:06.602726 #1063579] ERROR -- : $ /tmp/ruby/build/trunk/miniruby -I/tmp/ruby/src/trunk/lib /tmp/ruby/src/trunk/tool/runruby.rb --archdir=/tmp/ruby/build/trunk --extout=.ext -- /tmp/ruby/src/trunk/spec/mspec/bin/mspec-run -B /tmp/ruby/src/trunk/spec/default.mspec --error-output stderr --debug -fy -o /tmp/rubytest.dqlc5t/4-mspec-multi-3 E, [2024-05-18T00:54:06.603011 #1063579] ERROR -- : $ /tmp/ruby/build/trunk/miniruby -I/tmp/ruby/src/trunk/lib /tmp/ruby/src/trunk/tool/runruby.rb --archdir=/tmp/ruby/build/trunk --extout=.ext -- /tmp/ruby/src/trunk/spec/mspec/bin/mspec-run -B /tmp/ruby/src/trunk/spec/default.mspec --error-output stderr --debug -fy -o /tmp/rubytest.dqlc5t/5-mspec-multi-4 E, [2024-05-18T00:54:06.603148 #1063579] ERROR -- : $ /tmp/ruby/build/trunk/miniruby -I/tmp/ruby/src/trunk/lib /tmp/ruby/src/trunk/tool/runruby.rb --archdir=/tmp/ruby/build/trunk --extout=.ext -- /tmp/ruby/src/trunk/spec/mspec/bin/mspec-run -B /tmp/ruby/src/trunk/spec/default.mspec --error-output stderr --debug -fy -o /tmp/rubytest.dqlc5t/6-mspec-multi-5 E, [2024-05-18T00:54:06.603416 #1063579] ERROR -- : $ /tmp/ruby/build/trunk/miniruby -I/tmp/ruby/src/trunk/lib /tmp/ruby/src/trunk/tool/runruby.rb --archdir=/tmp/ruby/build/trunk --extout=.ext -- /tmp/ruby/src/trunk/spec/mspec/bin/mspec-run -B /tmp/ruby/src/trunk/spec/default.mspec --error-output stderr --debug -fy -o /tmp/rubytest.dqlc5t/7-mspec-multi-6 E, [2024-05-18T00:54:06.603623 #1063579] ERROR -- : $ /tmp/ruby/build/trunk/miniruby -I/tmp/ruby/src/trunk/lib /tmp/ruby/src/trunk/tool/runruby.rb --archdir=/tmp/ruby/build/trunk --extout=.ext -- /tmp/ruby/src/trunk/spec/mspec/bin/mspec-run -B /tmp/ruby/src/trunk/spec/default.mspec --error-output stderr --debug -fy -o /tmp/rubytest.dqlc5t/8-mspec-multi-7 E, [2024-05-18T00:54:06.603867 #1063579] ERROR -- : $ /tmp/ruby/build/trunk/miniruby -I/tmp/ruby/src/trunk/lib /tmp/ruby/src/trunk/tool/runruby.rb --archdir=/tmp/ruby/build/trunk --extout=.ext -- /tmp/ruby/src/trunk/spec/mspec/bin/mspec-run -B /tmp/ruby/src/trunk/spec/default.mspec --error-output stderr --debug -fy -o /tmp/rubytest.dqlc5t/9-mspec-multi-8 E, [2024-05-18T00:54:06.604140 #1063579] ERROR -- : $ /tmp/ruby/build/trunk/miniruby -I/tmp/ruby/src/trunk/lib /tmp/ruby/src/trunk/tool/runruby.rb --archdir=/tmp/ruby/build/trunk --extout=.ext -- /tmp/ruby/src/trunk/spec/mspec/bin/mspec-run -B /tmp/ruby/src/trunk/spec/default.mspec --error-output stderr --debug -fy -o /tmp/rubytest.dqlc5t/10-mspec-multi-9 E, [2024-05-18T00:54:06.604494 #1063579] ERROR -- : $ /tmp/ruby/build/trunk/miniruby -I/tmp/ruby/src/trunk/lib /tmp/ruby/src/trunk/tool/runruby.rb --archdir=/tmp/ruby/build/trunk --extout=.ext -- /tmp/ruby/src/trunk/spec/mspec/bin/mspec-run -B /tmp/ruby/src/trunk/spec/default.mspec --error-output stderr --debug -fy -o /tmp/rubytest.dqlc5t/11-mspec-multi-10 E, [2024-05-18T00:54:06.604758 #1063579] ERROR -- : $ /tmp/ruby/build/trunk/miniruby -I/tmp/ruby/src/trunk/lib /tmp/ruby/src/trunk/tool/runruby.rb --archdir=/tmp/ruby/build/trunk --extout=.ext -- /tmp/ruby/src/trunk/spec/mspec/bin/mspec-run -B /tmp/ruby/src/trunk/spec/default.mspec --error-output stderr --debug -fy -o /tmp/rubytest.dqlc5t/12-mspec-multi-11 E, [2024-05-18T00:54:06.605018 #1063579] ERROR -- : $ /tmp/ruby/build/trunk/miniruby -I/tmp/ruby/src/trunk/lib /tmp/ruby/src/trunk/tool/runruby.rb --archdir=/tmp/ruby/build/trunk --extout=.ext -- /tmp/ruby/src/trunk/spec/mspec/bin/mspec-run -B /tmp/ruby/src/trunk/spec/default.mspec --error-output stderr --debug -fy -o /tmp/rubytest.dqlc5t/13-mspec-multi-12 E, [2024-05-18T00:54:06.605296 #1063579] ERROR -- : $ /tmp/ruby/build/trunk/miniruby -I/tmp/ruby/src/trunk/lib /tmp/ruby/src/trunk/tool/runruby.rb --archdir=/tmp/ruby/build/trunk --extout=.ext -- /tmp/ruby/src/trunk/spec/mspec/bin/mspec-run -B /tmp/ruby/src/trunk/spec/default.mspec --error-output stderr --debug -fy -o /tmp/rubytest.dqlc5t/14-mspec-multi-13 E, [2024-05-18T00:54:06.605545 #1063579] ERROR -- : $ /tmp/ruby/build/trunk/miniruby -I/tmp/ruby/src/trunk/lib /tmp/ruby/src/trunk/tool/runruby.rb --archdir=/tmp/ruby/build/trunk --extout=.ext -- /tmp/ruby/src/trunk/spec/mspec/bin/mspec-run -B /tmp/ruby/src/trunk/spec/default.mspec --error-output stderr --debug -fy -o /tmp/rubytest.dqlc5t/15-mspec-multi-14 E, [2024-05-18T00:54:06.605730 #1063579] ERROR -- : $ /tmp/ruby/build/trunk/miniruby -I/tmp/ruby/src/trunk/lib /tmp/ruby/src/trunk/tool/runruby.rb --archdir=/tmp/ruby/build/trunk --extout=.ext -- /tmp/ruby/src/trunk/spec/mspec/bin/mspec-run -B /tmp/ruby/src/trunk/spec/default.mspec --error-output stderr --debug -fy -o /tmp/rubytest.dqlc5t/16-mspec-multi-15 E, [2024-05-18T00:54:06.605895 #1063579] ERROR -- : $ /tmp/ruby/build/trunk/miniruby -I/tmp/ruby/src/trunk/lib /tmp/ruby/src/trunk/tool/runruby.rb --archdir=/tmp/ruby/build/trunk --extout=.ext -- /tmp/ruby/src/trunk/spec/mspec/bin/mspec-run -B /tmp/ruby/src/trunk/spec/default.mspec --error-output stderr --debug -fy -o /tmp/rubytest.dqlc5t/17-mspec-multi-16 E, [2024-05-18T00:54:06.606069 #1063579] ERROR -- : $ /tmp/ruby/build/trunk/miniruby -I/tmp/ruby/src/trunk/lib /tmp/ruby/src/trunk/tool/runruby.rb --archdir=/tmp/ruby/build/trunk --extout=.ext -- /tmp/ruby/src/trunk/spec/mspec/bin/mspec-run -B /tmp/ruby/src/trunk/spec/default.mspec --error-output stderr --debug -fy -o /tmp/rubytest.dqlc5t/18-mspec-multi-17 E, [2024-05-18T00:54:06.608921 #1063579] ERROR -- : $ /tmp/ruby/build/trunk/miniruby -I/tmp/ruby/src/trunk/lib /tmp/ruby/src/trunk/tool/runruby.rb --archdir=/tmp/ruby/build/trunk --extout=.ext -- /tmp/ruby/src/trunk/spec/mspec/bin/mspec-run -B /tmp/ruby/src/trunk/spec/default.mspec --error-output stderr --debug -fy -o /tmp/rubytest.dqlc5t/19-mspec-multi-18 E, [2024-05-18T00:54:06.609140 #1063579] ERROR -- : $ /tmp/ruby/build/trunk/miniruby -I/tmp/ruby/src/trunk/lib /tmp/ruby/src/trunk/tool/runruby.rb --archdir=/tmp/ruby/build/trunk --extout=.ext -- /tmp/ruby/src/trunk/spec/mspec/bin/mspec-run -B /tmp/ruby/src/trunk/spec/default.mspec --error-output stderr --debug -fy -o /tmp/rubytest.dqlc5t/20-mspec-multi-19 I, [2024-05-18T00:54:06.786063 #1063579] INFO -- : ruby 3.4.0dev (2024-05-17T20:42:14Z master cce7c25a42) [x86_64-linux] I, [2024-05-18T00:54:07.415088 #1063579] INFO -- : 0 ......................................................................... I, [2024-05-18T00:54:07.800023 #1063579] INFO -- : 73 ......................................................................... I, [2024-05-18T00:54:07.952884 #1063579] INFO -- : 146 ......................................................................... I, [2024-05-18T00:54:08.004377 #1063579] INFO -- : 219 ......................................................................... I, [2024-05-18T00:54:08.058000 #1063579] INFO -- : 292 ......................................................................... I, [2024-05-18T00:54:08.099267 #1063579] INFO -- : 365 ......................................................................... I, [2024-05-18T00:54:08.118607 #1063579] INFO -- : 438 ......................................................................... I, [2024-05-18T00:54:08.133489 #1063579] INFO -- : 511 ......................................................................... I, [2024-05-18T00:54:08.148752 #1063579] INFO -- : 584 ......................................................................... I, [2024-05-18T00:54:08.211110 #1063579] INFO -- : 657 ......................................................................... I, [2024-05-18T00:54:08.243413 #1063579] INFO -- : 730 ......................................................................... I, [2024-05-18T00:54:08.269707 #1063579] INFO -- : 803 ......................................................................... I, [2024-05-18T00:54:08.304363 #1063579] INFO -- : 876 ......................................................................... I, [2024-05-18T00:54:08.349046 #1063579] INFO -- : 949 ......................................................................... I, [2024-05-18T00:54:08.431373 #1063579] INFO -- : 1022 ......................................................................... I, [2024-05-18T00:54:08.602288 #1063579] INFO -- : 1095 ......................................................................... I, [2024-05-18T00:54:08.732888 #1063579] INFO -- : 1168 ......................................................................... I, [2024-05-18T00:54:08.782697 #1063579] INFO -- : 1241 ......................................................................... I, [2024-05-18T00:54:08.831950 #1063579] INFO -- : 1314 ......................................................................... I, [2024-05-18T00:54:08.852189 #1063579] INFO -- : 1387 ......................................................................... I, [2024-05-18T00:54:08.943678 #1063579] INFO -- : 1460 ......................................................................... I, [2024-05-18T00:54:09.388784 #1063579] INFO -- : 1533 ......................................................................... I, [2024-05-18T00:54:09.450839 #1063579] INFO -- : 1606 ......................................................................... I, [2024-05-18T00:54:09.548844 #1063579] INFO -- : 1679 ......................................................................... I, [2024-05-18T00:54:09.668732 #1063579] INFO -- : 1752 ......................................................................... I, [2024-05-18T00:54:09.780978 #1063579] INFO -- : 1825 ......................................................................... I, [2024-05-18T00:54:09.865060 #1063579] INFO -- : 1898 ......................................................................... I, [2024-05-18T00:54:09.960848 #1063579] INFO -- : 1971 ......................................................................... I, [2024-05-18T00:54:10.078147 #1063579] INFO -- : 2044 ......................................................................... I, [2024-05-18T00:54:10.115133 #1063579] INFO -- : 2117 ......................................................................... I, [2024-05-18T00:54:10.126913 #1063579] INFO -- : 2190 ......................................................................... I, [2024-05-18T00:54:10.141156 #1063579] INFO -- : 2263 ......................................................................... I, [2024-05-18T00:54:10.155604 #1063579] INFO -- : 2336 ......................................................................... I, [2024-05-18T00:54:10.192326 #1063579] INFO -- : 2409 ......................................................................... I, [2024-05-18T00:54:10.295764 #1063579] INFO -- : 2482 ......................................................................... I, [2024-05-18T00:54:10.321607 #1063579] INFO -- : 2555 ......................................................................... I, [2024-05-18T00:54:10.400140 #1063579] INFO -- : 2628 ......................................................................... I, [2024-05-18T00:54:10.516837 #1063579] INFO -- : 2701 ......................................................................... I, [2024-05-18T00:54:10.545218 #1063579] INFO -- : 2774 ......................................................................... I, [2024-05-18T00:54:10.608477 #1063579] INFO -- : 2847 ......................................................................... I, [2024-05-18T00:54:10.642660 #1063579] INFO -- : 2920 ......................................................................... I, [2024-05-18T00:54:10.672924 #1063579] INFO -- : 2993 ......................................................................... I, [2024-05-18T00:54:10.702281 #1063579] INFO -- : 3066 ......................................................................... I, [2024-05-18T00:54:10.719842 #1063579] INFO -- : 3139 ......................................................................... I, [2024-05-18T00:54:10.731541 #1063579] INFO -- : 3212 ......................................................................... I, [2024-05-18T00:54:10.767279 #1063579] INFO -- : 3285 ......................................................................... I, [2024-05-18T00:54:14.727469 #1063579] INFO -- : 3358 ........................................................................ I, [2024-05-18T00:54:14.727532 #1063579] INFO -- : I, [2024-05-18T00:54:14.727540 #1063579] INFO -- : Finished in 8.123028 seconds I, [2024-05-18T00:54:14.727544 #1063579] INFO -- : I, [2024-05-18T00:54:14.727549 #1063579] INFO -- : 3429 files, 32611 examples, 172033 expectations, 0 failures, 0 errors, 0 tagged I, [2024-05-18T00:54:14.730952 #1063579] INFO -- : $$$[end] "make yes-test-rubyspec MSPECOPT='--error-output stderr --debug -j' TESTS='-j20'" exit with 0.