# Logfile created on 2024-05-17 19:59:34 +0000 by logger.rb/v1.4.3 I, [2024-05-17T19:59:34.221545 #3468197] INFO -- : #, @formatter=nil, @logdev=#, @binmode=false, @mon_data=#, @mon_data_owner_object_id=860>>> I, [2024-05-17T19:59:34.221672 #3468197] INFO -- : $$$[beg] make update-unicode -j20 I, [2024-05-17T19:59:34.281078 #3468197] INFO -- : Downloading Unicode emoji 15.0 files... I, [2024-05-17T19:59:34.281282 #3468197] INFO -- : Downloading Unicode emoji 15.0 files... I, [2024-05-17T19:59:34.282016 #3468197] INFO -- : Downloading Unicode emoji 15.0 files... I, [2024-05-17T19:59:34.324394 #3468197] INFO -- : made symlink emoji/15.0/emoji-sequences.txt to /tmp/ruby/src/trunk/.downloaded-cache/emoji/15.0/emoji-sequences.txt I, [2024-05-17T19:59:34.324432 #3468197] INFO -- : downloading emoji/15.0/emoji-sequences.txt ... downloading emoji/15.0/emoji-test.txt ... /tmp/ruby/src/trunk/enc/unicode/data/emoji/15.0/emoji-sequences.txt already exists E, [2024-05-17T19:59:34.779527 #3468197] ERROR -- : /tmp/ruby/src/trunk/tool/downloader.rb:302:in `rescue in download': failed to download emoji/15.0/emoji-test.txt (RuntimeError) E, [2024-05-17T19:59:34.779683 #3468197] ERROR -- : OpenURI::HTTPError: 403 Forbidden: https://www.unicode.org/Public/emoji/15.0/emoji-test.txt E, [2024-05-17T19:59:34.779763 #3468197] ERROR -- : from /tmp/ruby/src/trunk/tool/downloader.rb:201:in `download' E, [2024-05-17T19:59:34.779788 #3468197] ERROR -- : from /tmp/ruby/src/trunk/tool/downloader.rb:136:in `download' E, [2024-05-17T19:59:34.779812 #3468197] ERROR -- : from /tmp/ruby/src/trunk/tool/downloader.rb:482:in `block in
' E, [2024-05-17T19:59:34.779837 #3468197] ERROR -- : from /tmp/ruby/src/trunk/tool/downloader.rb:465:in `each' E, [2024-05-17T19:59:34.779857 #3468197] ERROR -- : from /tmp/ruby/src/trunk/tool/downloader.rb:465:in `
' E, [2024-05-17T19:59:34.779875 #3468197] ERROR -- : /usr/lib/ruby/3.0.0/open-uri.rb:364:in `open_http': 403 Forbidden (OpenURI::HTTPError) E, [2024-05-17T19:59:34.779895 #3468197] ERROR -- : from /usr/lib/ruby/3.0.0/open-uri.rb:741:in `buffer_open' E, [2024-05-17T19:59:34.779919 #3468197] ERROR -- : from /usr/lib/ruby/3.0.0/open-uri.rb:212:in `block in open_loop' E, [2024-05-17T19:59:34.779938 #3468197] ERROR -- : from /usr/lib/ruby/3.0.0/open-uri.rb:210:in `catch' E, [2024-05-17T19:59:34.779962 #3468197] ERROR -- : from /usr/lib/ruby/3.0.0/open-uri.rb:210:in `open_loop' E, [2024-05-17T19:59:34.779981 #3468197] ERROR -- : from /usr/lib/ruby/3.0.0/open-uri.rb:151:in `open_uri' E, [2024-05-17T19:59:34.779999 #3468197] ERROR -- : from /usr/lib/ruby/3.0.0/open-uri.rb:721:in `open' E, [2024-05-17T19:59:34.780018 #3468197] ERROR -- : from /usr/lib/ruby/3.0.0/open-uri.rb:729:in `read' E, [2024-05-17T19:59:34.780035 #3468197] ERROR -- : from /tmp/ruby/src/trunk/tool/downloader.rb:247:in `block in download' E, [2024-05-17T19:59:34.780076 #3468197] ERROR -- : from /tmp/ruby/src/trunk/tool/downloader.rb:378:in `with_retry' E, [2024-05-17T19:59:34.780096 #3468197] ERROR -- : from /tmp/ruby/src/trunk/tool/downloader.rb:246:in `download' E, [2024-05-17T19:59:34.780119 #3468197] ERROR -- : from /tmp/ruby/src/trunk/tool/downloader.rb:136:in `download' E, [2024-05-17T19:59:34.780138 #3468197] ERROR -- : from /tmp/ruby/src/trunk/tool/downloader.rb:482:in `block in
' E, [2024-05-17T19:59:34.780157 #3468197] ERROR -- : from /tmp/ruby/src/trunk/tool/downloader.rb:465:in `each' E, [2024-05-17T19:59:34.780176 #3468197] ERROR -- : from /tmp/ruby/src/trunk/tool/downloader.rb:465:in `
' E, [2024-05-17T19:59:34.780195 #3468197] ERROR -- : /tmp/ruby/src/trunk/tool/downloader.rb:302:in `rescue in download': failed to download emoji/15.0/emoji-test.txt (RuntimeError) E, [2024-05-17T19:59:34.780216 #3468197] ERROR -- : OpenURI::HTTPError: 403 Forbidden: https://www.unicode.org/Public/emoji/15.0/emoji-test.txt E, [2024-05-17T19:59:34.780235 #3468197] ERROR -- : from /tmp/ruby/src/trunk/tool/downloader.rb:201:in `download' E, [2024-05-17T19:59:34.780258 #3468197] ERROR -- : from /tmp/ruby/src/trunk/tool/downloader.rb:136:in `download' E, [2024-05-17T19:59:34.780277 #3468197] ERROR -- : from /tmp/ruby/src/trunk/tool/downloader.rb:482:in `block in
' E, [2024-05-17T19:59:34.780295 #3468197] ERROR -- : from /tmp/ruby/src/trunk/tool/downloader.rb:465:in `each' E, [2024-05-17T19:59:34.780318 #3468197] ERROR -- : from /tmp/ruby/src/trunk/tool/downloader.rb:465:in `
' E, [2024-05-17T19:59:34.780337 #3468197] ERROR -- : /usr/lib/ruby/3.0.0/open-uri.rb:364:in `open_http': 403 Forbidden (OpenURI::HTTPError) E, [2024-05-17T19:59:34.780356 #3468197] ERROR -- : from /usr/lib/ruby/3.0.0/open-uri.rb:741:in `buffer_open' E, [2024-05-17T19:59:34.780376 #3468197] ERROR -- : from /usr/lib/ruby/3.0.0/open-uri.rb:212:in `block in open_loop' E, [2024-05-17T19:59:34.780395 #3468197] ERROR -- : from /usr/lib/ruby/3.0.0/open-uri.rb:210:in `catch' E, [2024-05-17T19:59:34.780417 #3468197] ERROR -- : from /usr/lib/ruby/3.0.0/open-uri.rb:210:in `open_loop' E, [2024-05-17T19:59:34.780435 #3468197] ERROR -- : from /usr/lib/ruby/3.0.0/open-uri.rb:151:in `open_uri' E, [2024-05-17T19:59:34.780454 #3468197] ERROR -- : from /usr/lib/ruby/3.0.0/open-uri.rb:721:in `open' E, [2024-05-17T19:59:34.780475 #3468197] ERROR -- : from /usr/lib/ruby/3.0.0/open-uri.rb:729:in `read' E, [2024-05-17T19:59:34.780495 #3468197] ERROR -- : from /tmp/ruby/src/trunk/tool/downloader.rb:247:in `block in download' E, [2024-05-17T19:59:34.780517 #3468197] ERROR -- : from /tmp/ruby/src/trunk/tool/downloader.rb:378:in `with_retry' E, [2024-05-17T19:59:34.780538 #3468197] ERROR -- : from /tmp/ruby/src/trunk/tool/downloader.rb:246:in `download' E, [2024-05-17T19:59:34.780559 #3468197] ERROR -- : from /tmp/ruby/src/trunk/tool/downloader.rb:136:in `download' E, [2024-05-17T19:59:34.780580 #3468197] ERROR -- : from /tmp/ruby/src/trunk/tool/downloader.rb:482:in `block in
' E, [2024-05-17T19:59:34.780606 #3468197] ERROR -- : from /tmp/ruby/src/trunk/tool/downloader.rb:465:in `each' E, [2024-05-17T19:59:34.780628 #3468197] ERROR -- : from /tmp/ruby/src/trunk/tool/downloader.rb:465:in `
' E, [2024-05-17T19:59:34.784790 #3468197] ERROR -- : make: *** [uncommon.mk:1765: /tmp/ruby/src/trunk/enc/unicode/data/emoji/15.0/emoji-sequences.txt] Error 1 E, [2024-05-17T19:59:34.784850 #3468197] ERROR -- : make: *** Deleting file '/tmp/ruby/src/trunk/enc/unicode/data/emoji/15.0/emoji-sequences.txt' E, [2024-05-17T19:59:34.784864 #3468197] ERROR -- : make: *** Waiting for unfinished jobs.... E, [2024-05-17T19:59:34.784874 #3468197] ERROR -- : make: *** [uncommon.mk:1765: /tmp/ruby/src/trunk/enc/unicode/data/emoji/15.0/emoji-test.txt] Error 1 E, [2024-05-17T19:59:35.245622 #3468197] ERROR -- : /tmp/ruby/src/trunk/tool/downloader.rb:302:in `rescue in download': failed to download emoji/15.0/emoji-sequences.txt (RuntimeError) E, [2024-05-17T19:59:35.245744 #3468197] ERROR -- : EOFError: end of file reached: https://www.unicode.org/Public/emoji/15.0/emoji-sequences.txt E, [2024-05-17T19:59:35.245791 #3468197] ERROR -- : from /tmp/ruby/src/trunk/tool/downloader.rb:201:in `download' E, [2024-05-17T19:59:35.245805 #3468197] ERROR -- : from /tmp/ruby/src/trunk/tool/downloader.rb:136:in `download' E, [2024-05-17T19:59:35.245818 #3468197] ERROR -- : from /tmp/ruby/src/trunk/tool/downloader.rb:482:in `block in
' E, [2024-05-17T19:59:35.245830 #3468197] ERROR -- : from /tmp/ruby/src/trunk/tool/downloader.rb:465:in `each' E, [2024-05-17T19:59:35.245842 #3468197] ERROR -- : from /tmp/ruby/src/trunk/tool/downloader.rb:465:in `
' E, [2024-05-17T19:59:35.245855 #3468197] ERROR -- : /usr/lib/ruby/3.0.0/net/protocol.rb:227:in `rbuf_fill': end of file reached (EOFError) E, [2024-05-17T19:59:35.245871 #3468197] ERROR -- : from /usr/lib/ruby/3.0.0/net/protocol.rb:193:in `readuntil' E, [2024-05-17T19:59:35.245883 #3468197] ERROR -- : from /usr/lib/ruby/3.0.0/net/protocol.rb:203:in `readline' E, [2024-05-17T19:59:35.245895 #3468197] ERROR -- : from /usr/lib/ruby/3.0.0/net/http/response.rb:42:in `read_status_line' E, [2024-05-17T19:59:35.245906 #3468197] ERROR -- : from /usr/lib/ruby/3.0.0/net/http/response.rb:31:in `read_new' E, [2024-05-17T19:59:35.246137 #3468197] ERROR -- : from /usr/lib/ruby/3.0.0/net/http.rb:1557:in `block in transport_request' E, [2024-05-17T19:59:35.246156 #3468197] ERROR -- : from /usr/lib/ruby/3.0.0/net/http.rb:1548:in `catch' E, [2024-05-17T19:59:35.246168 #3468197] ERROR -- : from /usr/lib/ruby/3.0.0/net/http.rb:1548:in `transport_request' E, [2024-05-17T19:59:35.246178 #3468197] ERROR -- : from /usr/lib/ruby/3.0.0/net/http.rb:1521:in `request' E, [2024-05-17T19:59:35.246189 #3468197] ERROR -- : from /usr/lib/ruby/3.0.0/open-uri.rb:329:in `block in open_http' E, [2024-05-17T19:59:35.246200 #3468197] ERROR -- : from /usr/lib/ruby/3.0.0/net/http.rb:960:in `start' E, [2024-05-17T19:59:35.246210 #3468197] ERROR -- : from /usr/lib/ruby/3.0.0/open-uri.rb:323:in `open_http' E, [2024-05-17T19:59:35.246221 #3468197] ERROR -- : from /usr/lib/ruby/3.0.0/open-uri.rb:741:in `buffer_open' E, [2024-05-17T19:59:35.246232 #3468197] ERROR -- : from /usr/lib/ruby/3.0.0/open-uri.rb:212:in `block in open_loop' E, [2024-05-17T19:59:35.246246 #3468197] ERROR -- : from /usr/lib/ruby/3.0.0/open-uri.rb:210:in `catch' E, [2024-05-17T19:59:35.246256 #3468197] ERROR -- : from /usr/lib/ruby/3.0.0/open-uri.rb:210:in `open_loop' E, [2024-05-17T19:59:35.246267 #3468197] ERROR -- : from /usr/lib/ruby/3.0.0/open-uri.rb:151:in `open_uri' E, [2024-05-17T19:59:35.246277 #3468197] ERROR -- : from /usr/lib/ruby/3.0.0/open-uri.rb:721:in `open' E, [2024-05-17T19:59:35.246288 #3468197] ERROR -- : from /usr/lib/ruby/3.0.0/open-uri.rb:729:in `read' E, [2024-05-17T19:59:35.246299 #3468197] ERROR -- : from /tmp/ruby/src/trunk/tool/downloader.rb:247:in `block in download' E, [2024-05-17T19:59:35.246309 #3468197] ERROR -- : from /tmp/ruby/src/trunk/tool/downloader.rb:378:in `with_retry' E, [2024-05-17T19:59:35.246320 #3468197] ERROR -- : from /tmp/ruby/src/trunk/tool/downloader.rb:246:in `download' E, [2024-05-17T19:59:35.246333 #3468197] ERROR -- : from /tmp/ruby/src/trunk/tool/downloader.rb:136:in `download' E, [2024-05-17T19:59:35.246344 #3468197] ERROR -- : from /tmp/ruby/src/trunk/tool/downloader.rb:482:in `block in
' E, [2024-05-17T19:59:35.246354 #3468197] ERROR -- : from /tmp/ruby/src/trunk/tool/downloader.rb:465:in `each' E, [2024-05-17T19:59:35.246365 #3468197] ERROR -- : from /tmp/ruby/src/trunk/tool/downloader.rb:465:in `
' E, [2024-05-17T19:59:35.250242 #3468197] ERROR -- : make: *** [uncommon.mk:1765: /tmp/ruby/src/trunk/enc/unicode/data/emoji/15.0/emoji-zwj-sequences.txt] Error 1 I, [2024-05-17T19:59:35.250335 #3468197] INFO -- : downloading emoji/15.0/emoji-test.txt ... I, [2024-05-17T19:59:35.250796 #3468197] INFO -- : $$$[end] "make update-unicode -j20" exit with 512. I, [2024-05-17T19:59:35.250856 #3468197] INFO -- : $$$[beg] make update-download -j20 I, [2024-05-17T19:59:35.359042 #3468197] INFO -- : tool/config.guess already exists I, [2024-05-17T19:59:35.359091 #3468197] INFO -- : tool/config.sub already exists I, [2024-05-17T19:59:35.361320 #3468197] INFO -- : Update power_assert to 84e85124c5014a139af39161d484156cfe87a9ed I, [2024-05-17T19:59:35.361491 #3468197] INFO -- : Update rbs to ba7872795d5de04adb8ff500c0e6afdc81a041dd I, [2024-05-17T19:59:35.362281 #3468197] INFO -- : Update typeprof to b19a6416da3a05d57fadd6ffdadb382b6d236ca5 I, [2024-05-17T19:59:35.362721 #3468197] INFO -- : echo 84e85124c5014a139af39161d484156cfe87a9ed | /bin/sh /tmp/ruby/src/trunk/tool/ifchange /tmp/ruby/src/trunk/.bundle/.timestamp/power_assert.revision - I, [2024-05-17T19:59:35.362917 #3468197] INFO -- : echo ba7872795d5de04adb8ff500c0e6afdc81a041dd | /bin/sh /tmp/ruby/src/trunk/tool/ifchange /tmp/ruby/src/trunk/.bundle/.timestamp/rbs.revision - I, [2024-05-17T19:59:35.363356 #3468197] INFO -- : echo b19a6416da3a05d57fadd6ffdadb382b6d236ca5 | /bin/sh /tmp/ruby/src/trunk/tool/ifchange /tmp/ruby/src/trunk/.bundle/.timestamp/typeprof.revision - I, [2024-05-17T19:59:35.364479 #3468197] INFO -- : /tmp/ruby/src/trunk/.bundle/.timestamp/power_assert.revision unchanged I, [2024-05-17T19:59:35.364749 #3468197] INFO -- : /tmp/ruby/src/trunk/.bundle/.timestamp/rbs.revision unchanged I, [2024-05-17T19:59:35.365198 #3468197] INFO -- : /tmp/ruby/src/trunk/.bundle/.timestamp/typeprof.revision unchanged I, [2024-05-17T19:59:35.365946 #3468197] INFO -- : Building power_assert@84e85124c5014a139af39161d484156cfe87a9ed to /tmp/ruby/src/trunk/gems/power_assert-2.0.3.gem I, [2024-05-17T19:59:35.436164 #3468197] INFO -- : Successfully built RubyGem I, [2024-05-17T19:59:35.436206 #3468197] INFO -- : Name: power_assert I, [2024-05-17T19:59:35.436212 #3468197] INFO -- : Version: 2.0.4dev I, [2024-05-17T19:59:35.436216 #3468197] INFO -- : File: power_assert-2.0.4dev.gem I, [2024-05-17T19:59:35.481816 #3468197] INFO -- : $$$[end] "make update-download -j20" exit with 0. I, [2024-05-17T19:59:35.481850 #3468197] INFO -- : $$$[beg] make update-rubyspec -j20 I, [2024-05-17T19:59:35.540065 #3468197] INFO -- : make: Nothing to be done for 'update-rubyspec'. I, [2024-05-17T19:59:35.540503 #3468197] INFO -- : $$$[end] "make update-rubyspec -j20" exit with 0. I, [2024-05-17T19:59:35.540531 #3468197] INFO -- : $$$[beg] make update-src -j20 I, [2024-05-17T19:59:36.270206 #3468197] INFO -- : Already up to date. I, [2024-05-17T19:59:36.288409 #3468197] INFO -- : Latest commit hash = e61d24d77e I, [2024-05-17T19:59:36.289998 #3468197] INFO -- : $$$[end] "make update-src -j20" exit with 0. I, [2024-05-17T19:59:36.290040 #3468197] INFO -- : $$$[beg] make after-update -j20 I, [2024-05-17T19:59:36.362909 #3468197] INFO -- : generating /tmp/ruby/src/trunk/ext/ripper/eventids2table.c I, [2024-05-17T19:59:36.367150 #3468197] INFO -- : make[1]: Entering directory '/tmp/ruby/src/trunk/ext/ripper' I, [2024-05-17T19:59:36.367173 #3468197] INFO -- : make[1]: Nothing to be done for 'src'. I, [2024-05-17T19:59:36.367180 #3468197] INFO -- : make[1]: Leaving directory '/tmp/ruby/src/trunk/ext/ripper' I, [2024-05-17T19:59:36.383811 #3468197] INFO -- : /tmp/ruby/src/trunk/revision.h updated I, [2024-05-17T19:59:36.385159 #3468197] INFO -- : generating x86_64-linux-fake.rb I, [2024-05-17T19:59:36.436122 #3468197] INFO -- : x86_64-linux-fake.rb updated I, [2024-05-17T19:59:36.437227 #3468197] INFO -- : generating enc.mk I, [2024-05-17T19:59:36.554203 #3468197] INFO -- : making srcs under enc I, [2024-05-17T19:59:36.583619 #3468197] INFO -- : make[1]: Entering directory '/tmp/ruby/build/trunk' I, [2024-05-17T19:59:36.583641 #3468197] INFO -- : make[1]: Nothing to be done for 'srcs'. I, [2024-05-17T19:59:36.583647 #3468197] INFO -- : make[1]: Leaving directory '/tmp/ruby/build/trunk' I, [2024-05-17T19:59:36.629107 #3468197] INFO -- : Update power_assert to 84e85124c5014a139af39161d484156cfe87a9ed I, [2024-05-17T19:59:36.629452 #3468197] INFO -- : Update rbs to ba7872795d5de04adb8ff500c0e6afdc81a041dd I, [2024-05-17T19:59:36.630173 #3468197] INFO -- : Update typeprof to b19a6416da3a05d57fadd6ffdadb382b6d236ca5 I, [2024-05-17T19:59:36.630533 #3468197] INFO -- : echo 84e85124c5014a139af39161d484156cfe87a9ed | /bin/sh /tmp/ruby/src/trunk/tool/ifchange /tmp/ruby/src/trunk/.bundle/.timestamp/power_assert.revision - I, [2024-05-17T19:59:36.630713 #3468197] INFO -- : echo ba7872795d5de04adb8ff500c0e6afdc81a041dd | /bin/sh /tmp/ruby/src/trunk/tool/ifchange /tmp/ruby/src/trunk/.bundle/.timestamp/rbs.revision - I, [2024-05-17T19:59:36.631881 #3468197] INFO -- : echo b19a6416da3a05d57fadd6ffdadb382b6d236ca5 | /bin/sh /tmp/ruby/src/trunk/tool/ifchange /tmp/ruby/src/trunk/.bundle/.timestamp/typeprof.revision - I, [2024-05-17T19:59:36.632569 #3468197] INFO -- : /tmp/ruby/src/trunk/.bundle/.timestamp/power_assert.revision unchanged I, [2024-05-17T19:59:36.632591 #3468197] INFO -- : /tmp/ruby/src/trunk/.bundle/.timestamp/rbs.revision unchanged I, [2024-05-17T19:59:36.633788 #3468197] INFO -- : Building power_assert@84e85124c5014a139af39161d484156cfe87a9ed to /tmp/ruby/src/trunk/gems/power_assert-2.0.3.gem I, [2024-05-17T19:59:36.633975 #3468197] INFO -- : /tmp/ruby/src/trunk/.bundle/.timestamp/typeprof.revision unchanged I, [2024-05-17T19:59:36.702600 #3468197] INFO -- : Successfully built RubyGem I, [2024-05-17T19:59:36.702655 #3468197] INFO -- : Name: power_assert I, [2024-05-17T19:59:36.702668 #3468197] INFO -- : Version: 2.0.4dev I, [2024-05-17T19:59:36.702679 #3468197] INFO -- : File: power_assert-2.0.4dev.gem I, [2024-05-17T19:59:36.704643 #3468197] INFO -- : Extracting bundle gem power_assert-2.0.3... I, [2024-05-17T19:59:36.765147 #3468197] INFO -- : Try with hash version of bundled gems instead of gems/power_assert-2.0.3.gem. We don't use this gem with release version of Ruby. I, [2024-05-17T19:59:36.770127 #3468197] INFO -- : Unpacked gems/power_assert-2.0.4dev.gem I, [2024-05-17T19:59:36.771838 #3468197] INFO -- : $$$[end] "make after-update -j20" exit with 0. I, [2024-05-17T19:59:36.772021 #3468197] INFO -- : $$$[beg] make miniruby -j20 I, [2024-05-17T19:59:36.828566 #3468197] INFO -- : BASERUBY = /usr/bin/ruby --disable=gems I, [2024-05-17T19:59:36.828594 #3468197] INFO -- : CC = gcc I, [2024-05-17T19:59:36.828599 #3468197] INFO -- : LD = ld I, [2024-05-17T19:59:36.828603 #3468197] INFO -- : LDSHARED = gcc -shared I, [2024-05-17T19:59:36.828607 #3468197] INFO -- : CFLAGS = -O3 -fno-fast-math -ggdb3 -Wall -Wextra -Wdeprecated-declarations -Wdiv-by-zero -Wduplicated-cond -Wimplicit-function-declaration -Wimplicit-int -Wpointer-arith -Wwrite-strings -Wold-style-definition -Wimplicit-fallthrough=0 -Wmissing-noreturn -Wno-cast-function-type -Wno-constant-logical-operand -Wno-long-long -Wno-missing-field-initializers -Wno-overlength-strings -Wno-packed-bitfield-compat -Wno-parentheses-equality -Wno-self-assign -Wno-tautological-compare -Wno-unused-parameter -Wno-unused-value -Wsuggest-attribute=format -Wsuggest-attribute=noreturn -Wunused-variable -Wmisleading-indentation -Wundef -fPIC I, [2024-05-17T19:59:36.828611 #3468197] INFO -- : XCFLAGS = -U_FORTIFY_SOURCE -D_FORTIFY_SOURCE=2 -fstack-protector-strong -fno-strict-overflow -fvisibility=hidden -fexcess-precision=standard -DRUBY_EXPORT -I. -I.ext/include/x86_64-linux -I/tmp/ruby/src/trunk/include -I/tmp/ruby/src/trunk -I/tmp/ruby/src/trunk/prism -I/tmp/ruby/src/trunk/enc/unicode/15.0.0 I, [2024-05-17T19:59:36.828615 #3468197] INFO -- : CPPFLAGS = I, [2024-05-17T19:59:36.828618 #3468197] INFO -- : DLDFLAGS = -Wl,--compress-debug-sections=zlib -Wl,-soname,libruby.so.3.4 -fstack-protector-strong I, [2024-05-17T19:59:36.828622 #3468197] INFO -- : SOLIBS = -lz -lrt -lrt -lgmp -ldl -lcrypt -lm -lpthread I, [2024-05-17T19:59:36.828626 #3468197] INFO -- : LANG = en_US.UTF-8 I, [2024-05-17T19:59:36.828630 #3468197] INFO -- : LC_ALL = I, [2024-05-17T19:59:36.828634 #3468197] INFO -- : LC_CTYPE = I, [2024-05-17T19:59:36.828637 #3468197] INFO -- : MFLAGS = -j20 --jobserver-auth=4,5 I, [2024-05-17T19:59:36.828646 #3468197] INFO -- : RUSTC = no I, [2024-05-17T19:59:36.828650 #3468197] INFO -- : YJIT_RUSTC_ARGS = --crate-name=yjit --crate-type=staticlib --edition=2021 -g -C lto=thin -C opt-level=3 -C overflow-checks=on '--out-dir=/tmp/ruby/build/trunk/yjit/target/release/' /tmp/ruby/src/trunk/yjit/src/lib.rs I, [2024-05-17T19:59:36.829990 #3468197] INFO -- : gcc (Ubuntu 11.4.0-1ubuntu1~22.04) 11.4.0 I, [2024-05-17T19:59:36.830010 #3468197] INFO -- : Copyright (C) 2021 Free Software Foundation, Inc. I, [2024-05-17T19:59:36.830016 #3468197] INFO -- : This is free software; see the source for copying conditions. There is NO I, [2024-05-17T19:59:36.830023 #3468197] INFO -- : warranty; not even for MERCHANTABILITY or FITNESS FOR A PARTICULAR PURPOSE. I, [2024-05-17T19:59:36.830027 #3468197] INFO -- : I, [2024-05-17T19:59:36.851717 #3468197] INFO -- : compiling /tmp/ruby/src/trunk/version.c I, [2024-05-17T19:59:36.953615 #3468197] INFO -- : linking miniruby I, [2024-05-17T19:59:37.482793 #3468197] INFO -- : $$$[end] "make miniruby -j20" exit with 0. I, [2024-05-17T19:59:37.482899 #3468197] INFO -- : $$$[beg] make ruby -j20 I, [2024-05-17T19:59:37.540234 #3468197] INFO -- : BASERUBY = /usr/bin/ruby --disable=gems I, [2024-05-17T19:59:37.540277 #3468197] INFO -- : CC = gcc I, [2024-05-17T19:59:37.540290 #3468197] INFO -- : LD = ld I, [2024-05-17T19:59:37.540301 #3468197] INFO -- : LDSHARED = gcc -shared I, [2024-05-17T19:59:37.540318 #3468197] INFO -- : CFLAGS = -O3 -fno-fast-math -ggdb3 -Wall -Wextra -Wdeprecated-declarations -Wdiv-by-zero -Wduplicated-cond -Wimplicit-function-declaration -Wimplicit-int -Wpointer-arith -Wwrite-strings -Wold-style-definition -Wimplicit-fallthrough=0 -Wmissing-noreturn -Wno-cast-function-type -Wno-constant-logical-operand -Wno-long-long -Wno-missing-field-initializers -Wno-overlength-strings -Wno-packed-bitfield-compat -Wno-parentheses-equality -Wno-self-assign -Wno-tautological-compare -Wno-unused-parameter -Wno-unused-value -Wsuggest-attribute=format -Wsuggest-attribute=noreturn -Wunused-variable -Wmisleading-indentation -Wundef -fPIC I, [2024-05-17T19:59:37.540330 #3468197] INFO -- : XCFLAGS = -U_FORTIFY_SOURCE -D_FORTIFY_SOURCE=2 -fstack-protector-strong -fno-strict-overflow -fvisibility=hidden -fexcess-precision=standard -DRUBY_EXPORT -I. -I.ext/include/x86_64-linux -I/tmp/ruby/src/trunk/include -I/tmp/ruby/src/trunk -I/tmp/ruby/src/trunk/prism -I/tmp/ruby/src/trunk/enc/unicode/15.0.0 I, [2024-05-17T19:59:37.540341 #3468197] INFO -- : CPPFLAGS = I, [2024-05-17T19:59:37.540352 #3468197] INFO -- : DLDFLAGS = -Wl,--compress-debug-sections=zlib -Wl,-soname,libruby.so.3.4 -fstack-protector-strong I, [2024-05-17T19:59:37.540363 #3468197] INFO -- : SOLIBS = -lz -lrt -lrt -lgmp -ldl -lcrypt -lm -lpthread I, [2024-05-17T19:59:37.540373 #3468197] INFO -- : LANG = en_US.UTF-8 I, [2024-05-17T19:59:37.540382 #3468197] INFO -- : LC_ALL = I, [2024-05-17T19:59:37.540392 #3468197] INFO -- : LC_CTYPE = I, [2024-05-17T19:59:37.540402 #3468197] INFO -- : MFLAGS = -j20 --jobserver-auth=4,5 I, [2024-05-17T19:59:37.540412 #3468197] INFO -- : RUSTC = no I, [2024-05-17T19:59:37.540422 #3468197] INFO -- : YJIT_RUSTC_ARGS = --crate-name=yjit --crate-type=staticlib --edition=2021 -g -C lto=thin -C opt-level=3 -C overflow-checks=on '--out-dir=/tmp/ruby/build/trunk/yjit/target/release/' /tmp/ruby/src/trunk/yjit/src/lib.rs I, [2024-05-17T19:59:37.541800 #3468197] INFO -- : gcc (Ubuntu 11.4.0-1ubuntu1~22.04) 11.4.0 I, [2024-05-17T19:59:37.541841 #3468197] INFO -- : Copyright (C) 2021 Free Software Foundation, Inc. I, [2024-05-17T19:59:37.541853 #3468197] INFO -- : This is free software; see the source for copying conditions. There is NO I, [2024-05-17T19:59:37.541865 #3468197] INFO -- : warranty; not even for MERCHANTABILITY or FITNESS FOR A PARTICULAR PURPOSE. I, [2024-05-17T19:59:37.541882 #3468197] INFO -- : I, [2024-05-17T19:59:37.647595 #3468197] INFO -- : builtin_binary.inc updated I, [2024-05-17T19:59:37.652325 #3468197] INFO -- : c5234a9416e4f20f175185e840b25b0f08674d14078ed7083f37e655458e3ca9 builtin_binary.inc I, [2024-05-17T19:59:37.653120 #3468197] INFO -- : compiling /tmp/ruby/src/trunk/builtin.c I, [2024-05-17T19:59:37.835408 #3468197] INFO -- : linking static-library libruby-static.a I, [2024-05-17T19:59:38.147494 #3468197] INFO -- : linking shared-library libruby.so.3.4.0 I, [2024-05-17T19:59:39.706242 #3468197] INFO -- : linking ruby I, [2024-05-17T19:59:39.730198 #3468197] INFO -- : $$$[end] "make ruby -j20" exit with 0. I, [2024-05-17T19:59:39.730351 #3468197] INFO -- : $$$[beg] make all -j20 I, [2024-05-17T19:59:39.793134 #3468197] INFO -- : BASERUBY = /usr/bin/ruby --disable=gems I, [2024-05-17T19:59:39.793164 #3468197] INFO -- : CC = gcc I, [2024-05-17T19:59:39.793169 #3468197] INFO -- : LD = ld I, [2024-05-17T19:59:39.793173 #3468197] INFO -- : LDSHARED = gcc -shared I, [2024-05-17T19:59:39.793176 #3468197] INFO -- : CFLAGS = -O3 -fno-fast-math -ggdb3 -Wall -Wextra -Wdeprecated-declarations -Wdiv-by-zero -Wduplicated-cond -Wimplicit-function-declaration -Wimplicit-int -Wpointer-arith -Wwrite-strings -Wold-style-definition -Wimplicit-fallthrough=0 -Wmissing-noreturn -Wno-cast-function-type -Wno-constant-logical-operand -Wno-long-long -Wno-missing-field-initializers -Wno-overlength-strings -Wno-packed-bitfield-compat -Wno-parentheses-equality -Wno-self-assign -Wno-tautological-compare -Wno-unused-parameter -Wno-unused-value -Wsuggest-attribute=format -Wsuggest-attribute=noreturn -Wunused-variable -Wmisleading-indentation -Wundef -fPIC I, [2024-05-17T19:59:39.793180 #3468197] INFO -- : XCFLAGS = -U_FORTIFY_SOURCE -D_FORTIFY_SOURCE=2 -fstack-protector-strong -fno-strict-overflow -fvisibility=hidden -fexcess-precision=standard -DRUBY_EXPORT -I. -I.ext/include/x86_64-linux -I/tmp/ruby/src/trunk/include -I/tmp/ruby/src/trunk -I/tmp/ruby/src/trunk/prism -I/tmp/ruby/src/trunk/enc/unicode/15.0.0 I, [2024-05-17T19:59:39.793184 #3468197] INFO -- : CPPFLAGS = I, [2024-05-17T19:59:39.793188 #3468197] INFO -- : DLDFLAGS = -Wl,--compress-debug-sections=zlib -Wl,-soname,libruby.so.3.4 -fstack-protector-strong I, [2024-05-17T19:59:39.793191 #3468197] INFO -- : SOLIBS = -lz -lrt -lrt -lgmp -ldl -lcrypt -lm -lpthread I, [2024-05-17T19:59:39.793195 #3468197] INFO -- : LANG = en_US.UTF-8 I, [2024-05-17T19:59:39.793198 #3468197] INFO -- : LC_ALL = I, [2024-05-17T19:59:39.793202 #3468197] INFO -- : LC_CTYPE = I, [2024-05-17T19:59:39.793205 #3468197] INFO -- : MFLAGS = -j20 --jobserver-auth=4,5 I, [2024-05-17T19:59:39.793209 #3468197] INFO -- : RUSTC = no I, [2024-05-17T19:59:39.793212 #3468197] INFO -- : YJIT_RUSTC_ARGS = --crate-name=yjit --crate-type=staticlib --edition=2021 -g -C lto=thin -C opt-level=3 -C overflow-checks=on '--out-dir=/tmp/ruby/build/trunk/yjit/target/release/' /tmp/ruby/src/trunk/yjit/src/lib.rs I, [2024-05-17T19:59:39.794591 #3468197] INFO -- : gcc (Ubuntu 11.4.0-1ubuntu1~22.04) 11.4.0 I, [2024-05-17T19:59:39.794611 #3468197] INFO -- : Copyright (C) 2021 Free Software Foundation, Inc. I, [2024-05-17T19:59:39.794620 #3468197] INFO -- : This is free software; see the source for copying conditions. There is NO I, [2024-05-17T19:59:39.794626 #3468197] INFO -- : warranty; not even for MERCHANTABILITY or FITNESS FOR A PARTICULAR PURPOSE. I, [2024-05-17T19:59:39.794631 #3468197] INFO -- : I, [2024-05-17T19:59:39.826248 #3468197] INFO -- : generating enc.mk I, [2024-05-17T19:59:39.828050 #3468197] INFO -- : building spec/ruby/optional/capi/ext/array_spec.so I, [2024-05-17T19:59:39.828372 #3468197] INFO -- : building spec/ruby/optional/capi/ext/basic_object_spec.so I, [2024-05-17T19:59:39.829104 #3468197] INFO -- : building spec/ruby/optional/capi/ext/bignum_spec.so I, [2024-05-17T19:59:39.829958 #3468197] INFO -- : building spec/ruby/optional/capi/ext/binding_spec.so I, [2024-05-17T19:59:39.830661 #3468197] INFO -- : building spec/ruby/optional/capi/ext/boolean_spec.so I, [2024-05-17T19:59:39.831432 #3468197] INFO -- : building spec/ruby/optional/capi/ext/class_id_under_autoload_spec.so I, [2024-05-17T19:59:39.831872 #3468197] INFO -- : building spec/ruby/optional/capi/ext/class_spec.so I, [2024-05-17T19:59:39.832430 #3468197] INFO -- : building spec/ruby/optional/capi/ext/class_under_autoload_spec.so I, [2024-05-17T19:59:39.833577 #3468197] INFO -- : building spec/ruby/optional/capi/ext/complex_spec.so I, [2024-05-17T19:59:39.834452 #3468197] INFO -- : building spec/ruby/optional/capi/ext/constants_spec.so I, [2024-05-17T19:59:39.835165 #3468197] INFO -- : building spec/ruby/optional/capi/ext/data_spec.so I, [2024-05-17T19:59:39.835464 #3468197] INFO -- : building spec/ruby/optional/capi/ext/debug_spec.so I, [2024-05-17T19:59:39.836063 #3468197] INFO -- : building spec/ruby/optional/capi/ext/encoding_spec.so I, [2024-05-17T19:59:39.836872 #3468197] INFO -- : building spec/ruby/optional/capi/ext/enumerator_spec.so I, [2024-05-17T19:59:39.837170 #3468197] INFO -- : building spec/ruby/optional/capi/ext/exception_spec.so I, [2024-05-17T19:59:39.837926 #3468197] INFO -- : building spec/ruby/optional/capi/ext/fiber_spec.so I, [2024-05-17T19:59:39.838592 #3468197] INFO -- : building spec/ruby/optional/capi/ext/file_spec.so I, [2024-05-17T19:59:39.838880 #3468197] INFO -- : building spec/ruby/optional/capi/ext/fixnum_spec.so I, [2024-05-17T19:59:39.839391 #3468197] INFO -- : building spec/ruby/optional/capi/ext/float_spec.so I, [2024-05-17T19:59:39.958244 #3468197] INFO -- : building spec/ruby/optional/capi/ext/gc_spec.so I, [2024-05-17T19:59:39.961628 #3468197] INFO -- : building spec/ruby/optional/capi/ext/globals_spec.so I, [2024-05-17T19:59:39.971412 #3468197] INFO -- : building spec/ruby/optional/capi/ext/hash_spec.so I, [2024-05-17T19:59:39.976786 #3468197] INFO -- : building spec/ruby/optional/capi/ext/integer_spec.so I, [2024-05-17T19:59:39.988678 #3468197] INFO -- : building spec/ruby/optional/capi/ext/io_spec.so I, [2024-05-17T19:59:39.996078 #3468197] INFO -- : building spec/ruby/optional/capi/ext/language_spec.so I, [2024-05-17T19:59:39.996160 #3468197] INFO -- : building spec/ruby/optional/capi/ext/kernel_spec.so I, [2024-05-17T19:59:39.996487 #3468197] INFO -- : building spec/ruby/optional/capi/ext/marshal_spec.so I, [2024-05-17T19:59:40.003686 #3468197] INFO -- : building spec/ruby/optional/capi/ext/module_spec.so I, [2024-05-17T19:59:40.010037 #3468197] INFO -- : building spec/ruby/optional/capi/ext/module_under_autoload_spec.so I, [2024-05-17T19:59:40.012793 #3468197] INFO -- : building spec/ruby/optional/capi/ext/mutex_spec.so I, [2024-05-17T19:59:40.017394 #3468197] INFO -- : building spec/ruby/optional/capi/ext/numeric_spec.so I, [2024-05-17T19:59:40.020163 #3468197] INFO -- : building spec/ruby/optional/capi/ext/object_spec.so I, [2024-05-17T19:59:40.023574 #3468197] INFO -- : building spec/ruby/optional/capi/ext/proc_spec.so I, [2024-05-17T19:59:40.037084 #3468197] INFO -- : building spec/ruby/optional/capi/ext/range_spec.so I, [2024-05-17T19:59:40.037375 #3468197] INFO -- : building spec/ruby/optional/capi/ext/rational_spec.so I, [2024-05-17T19:59:40.067467 #3468197] INFO -- : building spec/ruby/optional/capi/ext/rbasic_spec.so I, [2024-05-17T19:59:40.103110 #3468197] INFO -- : building spec/ruby/optional/capi/ext/regexp_spec.so I, [2024-05-17T19:59:40.120896 #3468197] INFO -- : building spec/ruby/optional/capi/ext/string_spec.so I, [2024-05-17T19:59:40.126884 #3468197] INFO -- : building spec/ruby/optional/capi/ext/struct_spec.so I, [2024-05-17T19:59:40.137348 #3468197] INFO -- : building spec/ruby/optional/capi/ext/st_spec.so I, [2024-05-17T19:59:40.141619 #3468197] INFO -- : building spec/ruby/optional/capi/ext/symbol_spec.so I, [2024-05-17T19:59:40.146331 #3468197] INFO -- : building spec/ruby/optional/capi/ext/thread_spec.so I, [2024-05-17T19:59:40.153035 #3468197] INFO -- : building spec/ruby/optional/capi/ext/time_spec.so I, [2024-05-17T19:59:40.164679 #3468197] INFO -- : building spec/ruby/optional/capi/ext/tracepoint_spec.so I, [2024-05-17T19:59:40.169759 #3468197] INFO -- : building spec/ruby/optional/capi/ext/typed_data_spec.so I, [2024-05-17T19:59:40.170661 #3468197] INFO -- : building spec/ruby/optional/capi/ext/util_spec.so I, [2024-05-17T19:59:40.201241 #3468197] INFO -- : making enc I, [2024-05-17T19:59:40.205404 #3468197] INFO -- : making srcs under enc I, [2024-05-17T19:59:40.228685 #3468197] INFO -- : make[1]: Entering directory '/tmp/ruby/build/trunk' I, [2024-05-17T19:59:40.228756 #3468197] INFO -- : make[1]: Nothing to be done for 'enc'. I, [2024-05-17T19:59:40.228783 #3468197] INFO -- : make[1]: Leaving directory '/tmp/ruby/build/trunk' I, [2024-05-17T19:59:40.248010 #3468197] INFO -- : make[1]: Entering directory '/tmp/ruby/build/trunk' I, [2024-05-17T19:59:40.248068 #3468197] INFO -- : make[1]: Nothing to be done for 'srcs'. I, [2024-05-17T19:59:40.248081 #3468197] INFO -- : make[1]: Leaving directory '/tmp/ruby/build/trunk' I, [2024-05-17T19:59:40.248605 #3468197] INFO -- : generating transdb.h I, [2024-05-17T19:59:40.345897 #3468197] INFO -- : transdb.h unchanged I, [2024-05-17T19:59:40.347226 #3468197] INFO -- : generating makefiles ext/configure-ext.mk I, [2024-05-17T19:59:40.347601 #3468197] INFO -- : making trans I, [2024-05-17T19:59:40.373655 #3468197] INFO -- : ext/configure-ext.mk updated I, [2024-05-17T19:59:40.376215 #3468197] INFO -- : make[1]: Entering directory '/tmp/ruby/build/trunk' I, [2024-05-17T19:59:40.381725 #3468197] INFO -- : make[1]: Entering directory '/tmp/ruby/build/trunk' I, [2024-05-17T19:59:40.381839 #3468197] INFO -- : make[1]: Nothing to be done for 'trans'. I, [2024-05-17T19:59:40.381849 #3468197] INFO -- : make[1]: Leaving directory '/tmp/ruby/build/trunk' I, [2024-05-17T19:59:40.382779 #3468197] INFO -- : making encs I, [2024-05-17T19:59:40.440232 #3468197] INFO -- : make[1]: Entering directory '/tmp/ruby/build/trunk' I, [2024-05-17T19:59:40.441298 #3468197] INFO -- : make[1]: Nothing to be done for 'encs'. I, [2024-05-17T19:59:40.441394 #3468197] INFO -- : make[1]: Leaving directory '/tmp/ruby/build/trunk' I, [2024-05-17T19:59:40.529136 #3468197] INFO -- : make[1]: Leaving directory '/tmp/ruby/build/trunk' I, [2024-05-17T19:59:40.529973 #3468197] INFO -- : generating makefile exts.mk I, [2024-05-17T19:59:40.567431 #3468197] INFO -- : exts.mk unchanged I, [2024-05-17T19:59:40.571830 #3468197] INFO -- : make[1]: Entering directory '/tmp/ruby/build/trunk' I, [2024-05-17T19:59:40.590481 #3468197] INFO -- : make[2]: Entering directory '/tmp/ruby/build/trunk/ext/digest' I, [2024-05-17T19:59:40.592008 #3468197] INFO -- : make[2]: Entering directory '/tmp/ruby/build/trunk/ext/json' I, [2024-05-17T19:59:40.592245 #3468197] INFO -- : make[2]: Entering directory '/tmp/ruby/build/trunk/ext/coverage' I, [2024-05-17T19:59:40.592564 #3468197] INFO -- : make[2]: Entering directory '/tmp/ruby/build/trunk/ext/date' I, [2024-05-17T19:59:40.592593 #3468197] INFO -- : make[2]: Entering directory '/tmp/ruby/build/trunk/ext/io/console' I, [2024-05-17T19:59:40.593534 #3468197] INFO -- : make[2]: Entering directory '/tmp/ruby/build/trunk/ext/monitor' I, [2024-05-17T19:59:40.594106 #3468197] INFO -- : make[2]: Entering directory '/tmp/ruby/build/trunk/ext/rubyvm' I, [2024-05-17T19:59:40.594565 #3468197] INFO -- : make[2]: Leaving directory '/tmp/ruby/build/trunk/ext/digest' I, [2024-05-17T19:59:40.594835 #3468197] INFO -- : make[2]: Entering directory '/tmp/ruby/build/trunk/ext/pathname' I, [2024-05-17T19:59:40.595326 #3468197] INFO -- : make[2]: Entering directory '/tmp/ruby/build/trunk/ext/pty' I, [2024-05-17T19:59:40.595362 #3468197] INFO -- : make[2]: Leaving directory '/tmp/ruby/build/trunk/ext/coverage' I, [2024-05-17T19:59:40.595474 #3468197] INFO -- : make[2]: Entering directory '/tmp/ruby/build/trunk/ext/fiddle' I, [2024-05-17T19:59:40.595869 #3468197] INFO -- : make[2]: Leaving directory '/tmp/ruby/build/trunk/ext/io/console' I, [2024-05-17T19:59:40.596016 #3468197] INFO -- : make[2]: Leaving directory '/tmp/ruby/build/trunk/ext/monitor' I, [2024-05-17T19:59:40.596049 #3468197] INFO -- : make[2]: Leaving directory '/tmp/ruby/build/trunk/ext/date' I, [2024-05-17T19:59:40.596065 #3468197] INFO -- : make[2]: Leaving directory '/tmp/ruby/build/trunk/ext/rubyvm' I, [2024-05-17T19:59:40.596362 #3468197] INFO -- : make[2]: Entering directory '/tmp/ruby/build/trunk/ext/objspace' I, [2024-05-17T19:59:40.597016 #3468197] INFO -- : make[2]: Entering directory '/tmp/ruby/build/trunk/ext/psych' I, [2024-05-17T19:59:40.597359 #3468197] INFO -- : make[2]: Leaving directory '/tmp/ruby/build/trunk/ext/pathname' I, [2024-05-17T19:59:40.598002 #3468197] INFO -- : make[2]: Leaving directory '/tmp/ruby/build/trunk/ext/pty' I, [2024-05-17T19:59:40.598404 #3468197] INFO -- : make[2]: Entering directory '/tmp/ruby/build/trunk/.bundle/gems/bigdecimal-3.1.8/ext/bigdecimal' I, [2024-05-17T19:59:40.598457 #3468197] INFO -- : make[2]: Entering directory '/tmp/ruby/build/trunk/.bundle/gems/debug-1.9.2/ext/debug' I, [2024-05-17T19:59:40.598638 #3468197] INFO -- : make[2]: Entering directory '/tmp/ruby/build/trunk/.bundle/gems/nkf-0.2.0/ext/nkf' I, [2024-05-17T19:59:40.598722 #3468197] INFO -- : make[2]: Entering directory '/tmp/ruby/build/trunk/.bundle/gems/racc-1.7.3/ext/racc/cparse' I, [2024-05-17T19:59:40.598854 #3468197] INFO -- : make[2]: Entering directory '/tmp/ruby/build/trunk/.bundle/gems/syslog-0.1.2/ext/syslog' I, [2024-05-17T19:59:40.599383 #3468197] INFO -- : make[2]: Entering directory '/tmp/ruby/build/trunk/.bundle/gems/rbs-3.4.4/ext/rbs_extension' I, [2024-05-17T19:59:40.599572 #3468197] INFO -- : make[2]: Entering directory '/tmp/ruby/build/trunk/ext/ripper' I, [2024-05-17T19:59:40.601590 #3468197] INFO -- : make[2]: Leaving directory '/tmp/ruby/build/trunk/ext/json' I, [2024-05-17T19:59:40.601999 #3468197] INFO -- : make[2]: Leaving directory '/tmp/ruby/build/trunk/ext/objspace' I, [2024-05-17T19:59:40.602348 #3468197] INFO -- : make[2]: Leaving directory '/tmp/ruby/build/trunk/ext/fiddle' I, [2024-05-17T19:59:40.605232 #3468197] INFO -- : make[2]: Leaving directory '/tmp/ruby/build/trunk/ext/ripper' I, [2024-05-17T19:59:40.605268 #3468197] INFO -- : make[2]: Entering directory '/tmp/ruby/build/trunk/ext/digest/sha2' I, [2024-05-17T19:59:40.605957 #3468197] INFO -- : make[2]: Entering directory '/tmp/ruby/build/trunk/ext/socket' I, [2024-05-17T19:59:40.607544 #3468197] INFO -- : make[2]: Leaving directory '/tmp/ruby/build/trunk/ext/digest/sha2' I, [2024-05-17T19:59:40.608326 #3468197] INFO -- : make[2]: Entering directory '/tmp/ruby/build/trunk/ext/openssl' I, [2024-05-17T19:59:40.611744 #3468197] INFO -- : make[2]: Leaving directory '/tmp/ruby/build/trunk/ext/socket' I, [2024-05-17T19:59:40.612944 #3468197] INFO -- : make[2]: Leaving directory '/tmp/ruby/build/trunk/ext/psych' I, [2024-05-17T19:59:40.619627 #3468197] INFO -- : make[2]: Leaving directory '/tmp/ruby/build/trunk/ext/openssl' I, [2024-05-17T19:59:40.621795 #3468197] INFO -- : make[2]: Leaving directory '/tmp/ruby/build/trunk/.bundle/gems/debug-1.9.2/ext/debug' I, [2024-05-17T19:59:40.621832 #3468197] INFO -- : make[2]: Leaving directory '/tmp/ruby/build/trunk/.bundle/gems/syslog-0.1.2/ext/syslog' I, [2024-05-17T19:59:40.623066 #3468197] INFO -- : make[2]: Leaving directory '/tmp/ruby/build/trunk/.bundle/gems/bigdecimal-3.1.8/ext/bigdecimal' I, [2024-05-17T19:59:40.625606 #3468197] INFO -- : make[2]: Leaving directory '/tmp/ruby/build/trunk/.bundle/gems/racc-1.7.3/ext/racc/cparse' I, [2024-05-17T19:59:40.630819 #3468197] INFO -- : make[2]: Leaving directory '/tmp/ruby/build/trunk/.bundle/gems/nkf-0.2.0/ext/nkf' I, [2024-05-17T19:59:40.631777 #3468197] INFO -- : make[2]: Leaving directory '/tmp/ruby/build/trunk/.bundle/gems/rbs-3.4.4/ext/rbs_extension' I, [2024-05-17T19:59:40.655713 #3468197] INFO -- : make[2]: Entering directory '/tmp/ruby/build/trunk' I, [2024-05-17T19:59:40.722855 #3468197] INFO -- : linking ruby I, [2024-05-17T19:59:40.746088 #3468197] INFO -- : make[2]: Leaving directory '/tmp/ruby/build/trunk' I, [2024-05-17T19:59:40.746639 #3468197] INFO -- : make[1]: Leaving directory '/tmp/ruby/build/trunk' I, [2024-05-17T19:59:40.750397 #3468197] INFO -- : make[1]: Entering directory '/tmp/ruby/build/trunk' I, [2024-05-17T19:59:40.750430 #3468197] INFO -- : make[1]: Nothing to be done for 'note'. I, [2024-05-17T19:59:40.750437 #3468197] INFO -- : make[1]: Leaving directory '/tmp/ruby/build/trunk' I, [2024-05-17T19:59:40.751160 #3468197] INFO -- : $$$[end] "make all -j20" exit with 0. I, [2024-05-17T19:59:40.751347 #3468197] INFO -- : $$$[beg] make install -j20 I, [2024-05-17T19:59:40.818767 #3468197] INFO -- : Update power_assert to 84e85124c5014a139af39161d484156cfe87a9ed I, [2024-05-17T19:59:40.818891 #3468197] INFO -- : Update rbs to ba7872795d5de04adb8ff500c0e6afdc81a041dd I, [2024-05-17T19:59:40.819342 #3468197] INFO -- : Update typeprof to b19a6416da3a05d57fadd6ffdadb382b6d236ca5 I, [2024-05-17T19:59:40.820083 #3468197] INFO -- : echo 84e85124c5014a139af39161d484156cfe87a9ed | /bin/sh /tmp/ruby/src/trunk/tool/ifchange /tmp/ruby/src/trunk/.bundle/.timestamp/power_assert.revision - I, [2024-05-17T19:59:40.820893 #3468197] INFO -- : BASERUBY = /usr/bin/ruby --disable=gems I, [2024-05-17T19:59:40.820937 #3468197] INFO -- : CC = gcc I, [2024-05-17T19:59:40.820951 #3468197] INFO -- : LD = ld I, [2024-05-17T19:59:40.820963 #3468197] INFO -- : LDSHARED = gcc -shared I, [2024-05-17T19:59:40.820977 #3468197] INFO -- : CFLAGS = -O3 -fno-fast-math -ggdb3 -Wall -Wextra -Wdeprecated-declarations -Wdiv-by-zero -Wduplicated-cond -Wimplicit-function-declaration -Wimplicit-int -Wpointer-arith -Wwrite-strings -Wold-style-definition -Wimplicit-fallthrough=0 -Wmissing-noreturn -Wno-cast-function-type -Wno-constant-logical-operand -Wno-long-long -Wno-missing-field-initializers -Wno-overlength-strings -Wno-packed-bitfield-compat -Wno-parentheses-equality -Wno-self-assign -Wno-tautological-compare -Wno-unused-parameter -Wno-unused-value -Wsuggest-attribute=format -Wsuggest-attribute=noreturn -Wunused-variable -Wmisleading-indentation -Wundef -fPIC I, [2024-05-17T19:59:40.820988 #3468197] INFO -- : XCFLAGS = -U_FORTIFY_SOURCE -D_FORTIFY_SOURCE=2 -fstack-protector-strong -fno-strict-overflow -fvisibility=hidden -fexcess-precision=standard -DRUBY_EXPORT -I. -I.ext/include/x86_64-linux -I/tmp/ruby/src/trunk/include -I/tmp/ruby/src/trunk -I/tmp/ruby/src/trunk/prism -I/tmp/ruby/src/trunk/enc/unicode/15.0.0 I, [2024-05-17T19:59:40.820999 #3468197] INFO -- : CPPFLAGS = I, [2024-05-17T19:59:40.821010 #3468197] INFO -- : DLDFLAGS = -Wl,--compress-debug-sections=zlib -Wl,-soname,libruby.so.3.4 -fstack-protector-strong I, [2024-05-17T19:59:40.821023 #3468197] INFO -- : SOLIBS = -lz -lrt -lrt -lgmp -ldl -lcrypt -lm -lpthread I, [2024-05-17T19:59:40.821034 #3468197] INFO -- : LANG = en_US.UTF-8 I, [2024-05-17T19:59:40.821044 #3468197] INFO -- : LC_ALL = I, [2024-05-17T19:59:40.821054 #3468197] INFO -- : LC_CTYPE = I, [2024-05-17T19:59:40.821065 #3468197] INFO -- : MFLAGS = -j20 --jobserver-auth=4,5 I, [2024-05-17T19:59:40.821076 #3468197] INFO -- : RUSTC = no I, [2024-05-17T19:59:40.821087 #3468197] INFO -- : YJIT_RUSTC_ARGS = --crate-name=yjit --crate-type=staticlib --edition=2021 -g -C lto=thin -C opt-level=3 -C overflow-checks=on '--out-dir=/tmp/ruby/build/trunk/yjit/target/release/' /tmp/ruby/src/trunk/yjit/src/lib.rs I, [2024-05-17T19:59:40.822070 #3468197] INFO -- : /tmp/ruby/src/trunk/.bundle/.timestamp/power_assert.revision unchanged I, [2024-05-17T19:59:40.855996 #3468197] INFO -- : echo ba7872795d5de04adb8ff500c0e6afdc81a041dd | /bin/sh /tmp/ruby/src/trunk/tool/ifchange /tmp/ruby/src/trunk/.bundle/.timestamp/rbs.revision - I, [2024-05-17T19:59:40.856157 #3468197] INFO -- : echo b19a6416da3a05d57fadd6ffdadb382b6d236ca5 | /bin/sh /tmp/ruby/src/trunk/tool/ifchange /tmp/ruby/src/trunk/.bundle/.timestamp/typeprof.revision - I, [2024-05-17T19:59:40.856967 #3468197] INFO -- : generating enc.mk I, [2024-05-17T19:59:40.857017 #3468197] INFO -- : gcc (Ubuntu 11.4.0-1ubuntu1~22.04) 11.4.0 I, [2024-05-17T19:59:40.857030 #3468197] INFO -- : Copyright (C) 2021 Free Software Foundation, Inc. I, [2024-05-17T19:59:40.857040 #3468197] INFO -- : This is free software; see the source for copying conditions. There is NO I, [2024-05-17T19:59:40.857060 #3468197] INFO -- : warranty; not even for MERCHANTABILITY or FITNESS FOR A PARTICULAR PURPOSE. I, [2024-05-17T19:59:40.857071 #3468197] INFO -- : I, [2024-05-17T19:59:40.858123 #3468197] INFO -- : /tmp/ruby/src/trunk/.bundle/.timestamp/typeprof.revision unchanged I, [2024-05-17T19:59:40.858177 #3468197] INFO -- : /tmp/ruby/src/trunk/.bundle/.timestamp/rbs.revision unchanged I, [2024-05-17T19:59:40.977403 #3468197] INFO -- : Building power_assert@84e85124c5014a139af39161d484156cfe87a9ed to /tmp/ruby/src/trunk/gems/power_assert-2.0.3.gem I, [2024-05-17T19:59:40.978118 #3468197] INFO -- : making srcs under enc I, [2024-05-17T19:59:40.978397 #3468197] INFO -- : making enc I, [2024-05-17T19:59:40.995432 #3468197] INFO -- : make[1]: Entering directory '/tmp/ruby/build/trunk' I, [2024-05-17T19:59:40.995485 #3468197] INFO -- : make[1]: Nothing to be done for 'enc'. I, [2024-05-17T19:59:40.995499 #3468197] INFO -- : make[1]: Leaving directory '/tmp/ruby/build/trunk' I, [2024-05-17T19:59:41.007539 #3468197] INFO -- : make[1]: Entering directory '/tmp/ruby/build/trunk' I, [2024-05-17T19:59:41.007596 #3468197] INFO -- : make[1]: Nothing to be done for 'srcs'. I, [2024-05-17T19:59:41.007610 #3468197] INFO -- : make[1]: Leaving directory '/tmp/ruby/build/trunk' I, [2024-05-17T19:59:41.008369 #3468197] INFO -- : generating transdb.h I, [2024-05-17T19:59:41.046068 #3468197] INFO -- : Successfully built RubyGem I, [2024-05-17T19:59:41.046130 #3468197] INFO -- : Name: power_assert I, [2024-05-17T19:59:41.046144 #3468197] INFO -- : Version: 2.0.4dev I, [2024-05-17T19:59:41.046156 #3468197] INFO -- : File: power_assert-2.0.4dev.gem I, [2024-05-17T19:59:41.048197 #3468197] INFO -- : Extracting bundle gem power_assert-2.0.3... I, [2024-05-17T19:59:41.106440 #3468197] INFO -- : transdb.h unchanged I, [2024-05-17T19:59:41.108157 #3468197] INFO -- : generating makefiles ext/configure-ext.mk I, [2024-05-17T19:59:41.108220 #3468197] INFO -- : making trans I, [2024-05-17T19:59:41.108873 #3468197] INFO -- : Try with hash version of bundled gems instead of gems/power_assert-2.0.3.gem. We don't use this gem with release version of Ruby. I, [2024-05-17T19:59:41.113846 #3468197] INFO -- : Unpacked gems/power_assert-2.0.4dev.gem I, [2024-05-17T19:59:41.135957 #3468197] INFO -- : ext/configure-ext.mk unchanged I, [2024-05-17T19:59:41.138536 #3468197] INFO -- : make[1]: Entering directory '/tmp/ruby/build/trunk' I, [2024-05-17T19:59:41.142798 #3468197] INFO -- : make[1]: Entering directory '/tmp/ruby/build/trunk' I, [2024-05-17T19:59:41.142896 #3468197] INFO -- : make[1]: Nothing to be done for 'trans'. I, [2024-05-17T19:59:41.142908 #3468197] INFO -- : make[1]: Leaving directory '/tmp/ruby/build/trunk' I, [2024-05-17T19:59:41.143652 #3468197] INFO -- : making encs I, [2024-05-17T19:59:41.202813 #3468197] INFO -- : make[1]: Entering directory '/tmp/ruby/build/trunk' I, [2024-05-17T19:59:41.202898 #3468197] INFO -- : make[1]: Nothing to be done for 'encs'. I, [2024-05-17T19:59:41.202929 #3468197] INFO -- : make[1]: Leaving directory '/tmp/ruby/build/trunk' I, [2024-05-17T19:59:41.293030 #3468197] INFO -- : make[1]: Leaving directory '/tmp/ruby/build/trunk' I, [2024-05-17T19:59:41.293706 #3468197] INFO -- : generating makefile exts.mk I, [2024-05-17T19:59:41.331528 #3468197] INFO -- : exts.mk unchanged I, [2024-05-17T19:59:41.336856 #3468197] INFO -- : make[1]: Entering directory '/tmp/ruby/build/trunk' I, [2024-05-17T19:59:41.378689 #3468197] INFO -- : make[2]: Entering directory '/tmp/ruby/build/trunk/ext/digest' I, [2024-05-17T19:59:41.381431 #3468197] INFO -- : make[2]: Entering directory '/tmp/ruby/build/trunk/ext/json' I, [2024-05-17T19:59:41.382170 #3468197] INFO -- : make[2]: Entering directory '/tmp/ruby/build/trunk/ext/coverage' I, [2024-05-17T19:59:41.383264 #3468197] INFO -- : make[2]: Entering directory '/tmp/ruby/build/trunk/ext/io/console' I, [2024-05-17T19:59:41.383447 #3468197] INFO -- : make[2]: Entering directory '/tmp/ruby/build/trunk/ext/date' I, [2024-05-17T19:59:41.383932 #3468197] INFO -- : make[2]: Entering directory '/tmp/ruby/build/trunk/ext/monitor' I, [2024-05-17T19:59:41.385023 #3468197] INFO -- : make[2]: Leaving directory '/tmp/ruby/build/trunk/ext/digest' I, [2024-05-17T19:59:41.386268 #3468197] INFO -- : make[2]: Entering directory '/tmp/ruby/build/trunk/ext/pty' I, [2024-05-17T19:59:41.386616 #3468197] INFO -- : make[2]: Entering directory '/tmp/ruby/build/trunk/ext/fiddle' I, [2024-05-17T19:59:41.386648 #3468197] INFO -- : make[2]: Entering directory '/tmp/ruby/build/trunk/ext/objspace' I, [2024-05-17T19:59:41.386693 #3468197] INFO -- : make[2]: Entering directory '/tmp/ruby/build/trunk/ext/pathname' I, [2024-05-17T19:59:41.387225 #3468197] INFO -- : make[2]: Leaving directory '/tmp/ruby/build/trunk/ext/coverage' I, [2024-05-17T19:59:41.387265 #3468197] INFO -- : make[2]: Leaving directory '/tmp/ruby/build/trunk/ext/date' I, [2024-05-17T19:59:41.387681 #3468197] INFO -- : make[2]: Leaving directory '/tmp/ruby/build/trunk/ext/monitor' I, [2024-05-17T19:59:41.387813 #3468197] INFO -- : make[2]: Leaving directory '/tmp/ruby/build/trunk/ext/io/console' I, [2024-05-17T19:59:41.388171 #3468197] INFO -- : make[2]: Entering directory '/tmp/ruby/build/trunk/ext/psych' I, [2024-05-17T19:59:41.389951 #3468197] INFO -- : make[2]: Leaving directory '/tmp/ruby/build/trunk/ext/pathname' I, [2024-05-17T19:59:41.390251 #3468197] INFO -- : make[2]: Leaving directory '/tmp/ruby/build/trunk/ext/pty' I, [2024-05-17T19:59:41.390617 #3468197] INFO -- : make[2]: Entering directory '/tmp/ruby/build/trunk/ext/rubyvm' I, [2024-05-17T19:59:41.391789 #3468197] INFO -- : make[2]: Leaving directory '/tmp/ruby/build/trunk/ext/objspace' I, [2024-05-17T19:59:41.392206 #3468197] INFO -- : make[2]: Entering directory '/tmp/ruby/build/trunk/.bundle/gems/bigdecimal-3.1.8/ext/bigdecimal' I, [2024-05-17T19:59:41.392367 #3468197] INFO -- : make[2]: Entering directory '/tmp/ruby/build/trunk/.bundle/gems/nkf-0.2.0/ext/nkf' I, [2024-05-17T19:59:41.392525 #3468197] INFO -- : make[2]: Entering directory '/tmp/ruby/build/trunk/.bundle/gems/debug-1.9.2/ext/debug' I, [2024-05-17T19:59:41.392757 #3468197] INFO -- : make[2]: Entering directory '/tmp/ruby/build/trunk/.bundle/gems/racc-1.7.3/ext/racc/cparse' I, [2024-05-17T19:59:41.393283 #3468197] INFO -- : make[2]: Leaving directory '/tmp/ruby/build/trunk/ext/rubyvm' I, [2024-05-17T19:59:41.393605 #3468197] INFO -- : make[2]: Leaving directory '/tmp/ruby/build/trunk/ext/json' I, [2024-05-17T19:59:41.394211 #3468197] INFO -- : make[2]: Leaving directory '/tmp/ruby/build/trunk/ext/fiddle' I, [2024-05-17T19:59:41.396521 #3468197] INFO -- : make[2]: Entering directory '/tmp/ruby/build/trunk/.bundle/gems/rbs-3.4.4/ext/rbs_extension' I, [2024-05-17T19:59:41.398116 #3468197] INFO -- : make[2]: Entering directory '/tmp/ruby/build/trunk/ext/ripper' I, [2024-05-17T19:59:41.399154 #3468197] INFO -- : make[2]: Entering directory '/tmp/ruby/build/trunk/ext/openssl' I, [2024-05-17T19:59:41.399265 #3468197] INFO -- : make[2]: Entering directory '/tmp/ruby/build/trunk/.bundle/gems/syslog-0.1.2/ext/syslog' I, [2024-05-17T19:59:41.402080 #3468197] INFO -- : make[2]: Entering directory '/tmp/ruby/build/trunk/ext/socket' I, [2024-05-17T19:59:41.402607 #3468197] INFO -- : make[2]: Entering directory '/tmp/ruby/build/trunk/ext/digest/sha2' I, [2024-05-17T19:59:41.402632 #3468197] INFO -- : make[2]: Leaving directory '/tmp/ruby/build/trunk/ext/psych' I, [2024-05-17T19:59:41.403371 #3468197] INFO -- : make[2]: Leaving directory '/tmp/ruby/build/trunk/ext/ripper' I, [2024-05-17T19:59:41.405833 #3468197] INFO -- : make[2]: Leaving directory '/tmp/ruby/build/trunk/ext/digest/sha2' I, [2024-05-17T19:59:41.408089 #3468197] INFO -- : make[2]: Leaving directory '/tmp/ruby/build/trunk/ext/socket' I, [2024-05-17T19:59:41.414563 #3468197] INFO -- : make[2]: Leaving directory '/tmp/ruby/build/trunk/ext/openssl' I, [2024-05-17T19:59:41.416543 #3468197] INFO -- : make[2]: Leaving directory '/tmp/ruby/build/trunk/.bundle/gems/nkf-0.2.0/ext/nkf' I, [2024-05-17T19:59:41.416641 #3468197] INFO -- : make[2]: Leaving directory '/tmp/ruby/build/trunk/.bundle/gems/bigdecimal-3.1.8/ext/bigdecimal' I, [2024-05-17T19:59:41.416785 #3468197] INFO -- : make[2]: Leaving directory '/tmp/ruby/build/trunk/.bundle/gems/racc-1.7.3/ext/racc/cparse' I, [2024-05-17T19:59:41.419952 #3468197] INFO -- : make[2]: Leaving directory '/tmp/ruby/build/trunk/.bundle/gems/rbs-3.4.4/ext/rbs_extension' I, [2024-05-17T19:59:41.421309 #3468197] INFO -- : make[2]: Leaving directory '/tmp/ruby/build/trunk/.bundle/gems/syslog-0.1.2/ext/syslog' I, [2024-05-17T19:59:41.425248 #3468197] INFO -- : make[2]: Leaving directory '/tmp/ruby/build/trunk/.bundle/gems/debug-1.9.2/ext/debug' I, [2024-05-17T19:59:41.449133 #3468197] INFO -- : make[2]: Entering directory '/tmp/ruby/build/trunk' I, [2024-05-17T19:59:41.515343 #3468197] INFO -- : make[2]: 'ruby' is up to date. I, [2024-05-17T19:59:41.515378 #3468197] INFO -- : make[2]: Leaving directory '/tmp/ruby/build/trunk' I, [2024-05-17T19:59:41.515666 #3468197] INFO -- : make[1]: Leaving directory '/tmp/ruby/build/trunk' I, [2024-05-17T19:59:41.519568 #3468197] INFO -- : make[1]: Entering directory '/tmp/ruby/build/trunk' I, [2024-05-17T19:59:41.519589 #3468197] INFO -- : make[1]: Nothing to be done for 'note'. I, [2024-05-17T19:59:41.519595 #3468197] INFO -- : make[1]: Leaving directory '/tmp/ruby/build/trunk' I, [2024-05-17T19:59:41.519729 #3468197] INFO -- : ./miniruby -I/tmp/ruby/src/trunk/lib -I. -I.ext/common /tmp/ruby/src/trunk/tool/runruby.rb --extout=.ext -- --disable-gems -r./x86_64-linux-fake /tmp/ruby/src/trunk/tool/rbinstall.rb --make="make" --dest-dir="" --extout=".ext" --ext-build-dir="./ext" --mflags="-j20 --jobserver-auth=4,5" --make-flags=" -j20 --jobserver-auth=4,5" --data-mode=0644 --prog-mode=0755 --installed-list .installed.list --mantype="doc" --gnumake --install=all --exclude=doc I, [2024-05-17T19:59:41.615793 #3468197] INFO -- : Installing to I, [2024-05-17T19:59:41.615841 #3468197] INFO -- : installing binary commands: /tmp/ruby/install/trunk/bin I, [2024-05-17T19:59:41.615942 #3468197] INFO -- : installing base libraries: /tmp/ruby/install/trunk/lib I, [2024-05-17T19:59:41.622912 #3468197] INFO -- : installing arch files: /tmp/ruby/install/trunk/lib/ruby/3.4.0+0/x86_64-linux I, [2024-05-17T19:59:41.622937 #3468197] INFO -- : installing pkgconfig data: /tmp/ruby/install/trunk/lib/pkgconfig I, [2024-05-17T19:59:41.622947 #3468197] INFO -- : installing extension objects: /tmp/ruby/install/trunk/lib/ruby/3.4.0+0/x86_64-linux I, [2024-05-17T19:59:41.632325 #3468197] INFO -- : installing extension objects: /tmp/ruby/install/trunk/lib/ruby/site_ruby/3.4.0+0/x86_64-linux I, [2024-05-17T19:59:41.632348 #3468197] INFO -- : installing extension objects: /tmp/ruby/install/trunk/lib/ruby/vendor_ruby/3.4.0+0/x86_64-linux I, [2024-05-17T19:59:41.632355 #3468197] INFO -- : installing extension headers: /tmp/ruby/install/trunk/include/ruby-3.4.0+0/x86_64-linux I, [2024-05-17T19:59:41.632489 #3468197] INFO -- : installing extension scripts: /tmp/ruby/install/trunk/lib/ruby/3.4.0+0 I, [2024-05-17T19:59:41.635207 #3468197] INFO -- : installing extension scripts: /tmp/ruby/install/trunk/lib/ruby/site_ruby/3.4.0+0 I, [2024-05-17T19:59:41.635230 #3468197] INFO -- : installing extension scripts: /tmp/ruby/install/trunk/lib/ruby/vendor_ruby/3.4.0+0 I, [2024-05-17T19:59:41.635236 #3468197] INFO -- : installing extension headers: /tmp/ruby/install/trunk/include/ruby-3.4.0+0/ruby I, [2024-05-17T19:59:41.635240 #3468197] INFO -- : installing command scripts: /tmp/ruby/install/trunk/bin I, [2024-05-17T19:59:41.635244 #3468197] INFO -- : installing library scripts: /tmp/ruby/install/trunk/lib/ruby/3.4.0+0 I, [2024-05-17T19:59:41.667840 #3468197] INFO -- : installing common headers: /tmp/ruby/install/trunk/include/ruby-3.4.0+0 I, [2024-05-17T19:59:41.674293 #3468197] INFO -- : installing manpages: /tmp/ruby/install/trunk/share/man/man1 I, [2024-05-17T19:59:41.674326 #3468197] INFO -- : installing default gems from lib: /tmp/ruby/install/trunk/lib/ruby/gems/3.4.0+0 I, [2024-05-17T19:59:41.696970 #3468197] INFO -- : benchmark 0.3.0 I, [2024-05-17T19:59:41.698858 #3468197] INFO -- : bundler 2.6.0.dev I, [2024-05-17T19:59:41.700983 #3468197] INFO -- : cgi 0.4.1 I, [2024-05-17T19:59:41.701555 #3468197] INFO -- : delegate 0.3.1 I, [2024-05-17T19:59:41.702019 #3468197] INFO -- : did_you_mean 1.6.3 I, [2024-05-17T19:59:41.702480 #3468197] INFO -- : english 0.8.0 I, [2024-05-17T19:59:41.702940 #3468197] INFO -- : erb 4.0.4 I, [2024-05-17T19:59:41.703994 #3468197] INFO -- : error_highlight 0.6.0 I, [2024-05-17T19:59:41.704882 #3468197] INFO -- : fileutils 1.7.2 I, [2024-05-17T19:59:41.705765 #3468197] INFO -- : find 0.2.0 I, [2024-05-17T19:59:41.706465 #3468197] INFO -- : forwardable 1.3.3 I, [2024-05-17T19:59:41.707592 #3468197] INFO -- : ipaddr 1.2.6 I, [2024-05-17T19:59:41.708170 #3468197] INFO -- : irb 1.13.1 I, [2024-05-17T19:59:41.708943 #3468197] INFO -- : logger 1.6.0 I, [2024-05-17T19:59:41.709416 #3468197] INFO -- : net-http 0.4.1 I, [2024-05-17T19:59:41.709906 #3468197] INFO -- : net-protocol 0.2.2 I, [2024-05-17T19:59:41.710379 #3468197] INFO -- : open-uri 0.4.1 I, [2024-05-17T19:59:41.710857 #3468197] INFO -- : open3 0.2.1 I, [2024-05-17T19:59:41.711324 #3468197] INFO -- : optparse 0.5.0 I, [2024-05-17T19:59:41.711738 #3468197] INFO -- : ostruct 0.6.0 I, [2024-05-17T19:59:41.712186 #3468197] INFO -- : pp 0.5.0 I, [2024-05-17T19:59:41.712784 #3468197] INFO -- : prettyprint 0.2.0 I, [2024-05-17T19:59:41.713152 #3468197] INFO -- : prism 0.29.0 I, [2024-05-17T19:59:41.713728 #3468197] INFO -- : pstore 0.1.3 I, [2024-05-17T19:59:41.714205 #3468197] INFO -- : rdoc 6.6.3.1 I, [2024-05-17T19:59:41.715148 #3468197] INFO -- : readline 0.0.4 I, [2024-05-17T19:59:41.715674 #3468197] INFO -- : reline 0.5.7 I, [2024-05-17T19:59:41.716193 #3468197] INFO -- : resolv 0.4.0 I, [2024-05-17T19:59:41.716591 #3468197] INFO -- : ruby2_keywords 0.0.5 I, [2024-05-17T19:59:41.717084 #3468197] INFO -- : securerandom 0.3.1 I, [2024-05-17T19:59:41.718160 #3468197] INFO -- : set 1.1.0 I, [2024-05-17T19:59:41.718900 #3468197] INFO -- : shellwords 0.2.0 I, [2024-05-17T19:59:41.719376 #3468197] INFO -- : singleton 0.2.0 I, [2024-05-17T19:59:41.719826 #3468197] INFO -- : syntax_suggest 2.0.0 I, [2024-05-17T19:59:41.720676 #3468197] INFO -- : tempfile 0.2.1 I, [2024-05-17T19:59:41.721019 #3468197] INFO -- : time 0.3.0 I, [2024-05-17T19:59:41.721559 #3468197] INFO -- : timeout 0.4.1 I, [2024-05-17T19:59:41.722029 #3468197] INFO -- : tmpdir 0.2.0 I, [2024-05-17T19:59:41.722510 #3468197] INFO -- : tsort 0.2.0 I, [2024-05-17T19:59:41.722948 #3468197] INFO -- : un 0.3.0 I, [2024-05-17T19:59:41.723422 #3468197] INFO -- : uri 0.13.0 I, [2024-05-17T19:59:41.723895 #3468197] INFO -- : weakref 0.1.3 I, [2024-05-17T19:59:41.724413 #3468197] INFO -- : yaml 0.3.0 I, [2024-05-17T19:59:41.724729 #3468197] INFO -- : installing default gems from ext: /tmp/ruby/install/trunk/lib/ruby/gems/3.4.0+0 I, [2024-05-17T19:59:41.731228 #3468197] INFO -- : date 3.3.4 I, [2024-05-17T19:59:41.731772 #3468197] INFO -- : digest 3.1.1 I, [2024-05-17T19:59:41.732261 #3468197] INFO -- : etc 1.4.3 I, [2024-05-17T19:59:41.732779 #3468197] INFO -- : fcntl 1.1.0 I, [2024-05-17T19:59:41.733265 #3468197] INFO -- : fiddle 1.1.3 I, [2024-05-17T19:59:41.733730 #3468197] INFO -- : io-console 0.7.2 I, [2024-05-17T19:59:41.734201 #3468197] INFO -- : io-nonblock 0.3.0 I, [2024-05-17T19:59:41.734675 #3468197] INFO -- : io-wait 0.3.1 I, [2024-05-17T19:59:41.735086 #3468197] INFO -- : json 2.7.2 I, [2024-05-17T19:59:41.735600 #3468197] INFO -- : openssl 3.2.0 I, [2024-05-17T19:59:41.736201 #3468197] INFO -- : pathname 0.3.0 I, [2024-05-17T19:59:41.736731 #3468197] INFO -- : psych 5.1.2 I, [2024-05-17T19:59:41.737290 #3468197] INFO -- : stringio 3.1.1 I, [2024-05-17T19:59:41.737786 #3468197] INFO -- : strscan 3.1.1 I, [2024-05-17T19:59:41.738238 #3468197] INFO -- : zlib 3.1.0 I, [2024-05-17T19:59:41.738634 #3468197] INFO -- : installing bundled gems: /tmp/ruby/install/trunk/lib/ruby/gems/3.4.0+0 I, [2024-05-17T19:59:41.739179 #3468197] INFO -- : minitest 5.23.0 I, [2024-05-17T19:59:41.747618 #3468197] INFO -- : rake 13.2.1 I, [2024-05-17T19:59:41.751015 #3468197] INFO -- : test-unit 3.6.2 I, [2024-05-17T19:59:41.756041 #3468197] INFO -- : rexml 3.2.6 I, [2024-05-17T19:59:41.759723 #3468197] INFO -- : rss 0.3.0 I, [2024-05-17T19:59:41.762442 #3468197] INFO -- : net-ftp 0.3.4 I, [2024-05-17T19:59:41.764043 #3468197] INFO -- : net-imap 0.4.11 I, [2024-05-17T19:59:41.767733 #3468197] INFO -- : net-pop 0.1.2 I, [2024-05-17T19:59:41.768895 #3468197] INFO -- : net-smtp 0.5.0 I, [2024-05-17T19:59:41.770040 #3468197] INFO -- : matrix 0.4.2 I, [2024-05-17T19:59:41.773312 #3468197] INFO -- : prime 0.1.2 I, [2024-05-17T19:59:41.778135 #3468197] INFO -- : rbs 3.4.4 I, [2024-05-17T19:59:41.800317 #3468197] INFO -- : typeprof 0.21.11 I, [2024-05-17T19:59:41.802645 #3468197] INFO -- : debug 1.9.2 I, [2024-05-17T19:59:41.805703 #3468197] INFO -- : racc 1.7.3 I, [2024-05-17T19:59:41.808612 #3468197] INFO -- : mutex_m 0.2.0 I, [2024-05-17T19:59:41.809935 #3468197] INFO -- : getoptlong 0.2.1 I, [2024-05-17T19:59:41.811319 #3468197] INFO -- : base64 0.2.0 I, [2024-05-17T19:59:41.812422 #3468197] INFO -- : bigdecimal 3.1.8 I, [2024-05-17T19:59:41.814489 #3468197] INFO -- : observer 0.1.2 I, [2024-05-17T19:59:41.816231 #3468197] INFO -- : abbrev 0.1.2 I, [2024-05-17T19:59:41.817327 #3468197] INFO -- : resolv-replace 0.1.1 I, [2024-05-17T19:59:41.818789 #3468197] INFO -- : rinda 0.2.0 I, [2024-05-17T19:59:41.820103 #3468197] INFO -- : drb 2.2.1 I, [2024-05-17T19:59:41.821710 #3468197] INFO -- : nkf 0.2.0 I, [2024-05-17T19:59:41.824310 #3468197] INFO -- : syslog 0.1.2 I, [2024-05-17T19:59:41.825976 #3468197] INFO -- : csv 3.3.0 I, [2024-05-17T19:59:41.828715 #3468197] INFO -- : installing bundled gem cache: /tmp/ruby/install/trunk/lib/ruby/gems/3.4.0+0/cache I, [2024-05-17T19:59:41.830084 #3468197] INFO -- : skipped bundled gems: I, [2024-05-17T19:59:41.830105 #3468197] INFO -- : power_assert-2.0.4dev.gem not found in bundled_gems I, [2024-05-17T19:59:41.833190 #3468197] INFO -- : $$$[end] "make install -j20" exit with 0. I, [2024-05-17T19:59:41.833288 #3468197] INFO -- : $$$[beg] make yes-btest TESTOPTS='-q -j20' I, [2024-05-17T19:59:47.860400 #3468197] INFO -- : PASS all 1936 tests E, [2024-05-17T19:59:47.870019 #3468197] ERROR -- : I, [2024-05-17T19:59:47.870404 #3468197] INFO -- : $$$[end] "make yes-btest TESTOPTS='-q -j20'" exit with 0. I, [2024-05-17T19:59:47.870498 #3468197] INFO -- : $$$[beg] make yes-test-basic TESTS='-j20' I, [2024-05-17T19:59:47.938103 #3468197] INFO -- : BASERUBY = /usr/bin/ruby --disable=gems I, [2024-05-17T19:59:47.938133 #3468197] INFO -- : CC = gcc I, [2024-05-17T19:59:47.938140 #3468197] INFO -- : LD = ld I, [2024-05-17T19:59:47.938144 #3468197] INFO -- : LDSHARED = gcc -shared I, [2024-05-17T19:59:47.938149 #3468197] INFO -- : CFLAGS = -O3 -fno-fast-math -ggdb3 -Wall -Wextra -Wdeprecated-declarations -Wdiv-by-zero -Wduplicated-cond -Wimplicit-function-declaration -Wimplicit-int -Wpointer-arith -Wwrite-strings -Wold-style-definition -Wimplicit-fallthrough=0 -Wmissing-noreturn -Wno-cast-function-type -Wno-constant-logical-operand -Wno-long-long -Wno-missing-field-initializers -Wno-overlength-strings -Wno-packed-bitfield-compat -Wno-parentheses-equality -Wno-self-assign -Wno-tautological-compare -Wno-unused-parameter -Wno-unused-value -Wsuggest-attribute=format -Wsuggest-attribute=noreturn -Wunused-variable -Wmisleading-indentation -Wundef -fPIC I, [2024-05-17T19:59:47.938154 #3468197] INFO -- : XCFLAGS = -U_FORTIFY_SOURCE -D_FORTIFY_SOURCE=2 -fstack-protector-strong -fno-strict-overflow -fvisibility=hidden -fexcess-precision=standard -DRUBY_EXPORT -I. -I.ext/include/x86_64-linux -I/tmp/ruby/src/trunk/include -I/tmp/ruby/src/trunk -I/tmp/ruby/src/trunk/prism -I/tmp/ruby/src/trunk/enc/unicode/15.0.0 I, [2024-05-17T19:59:47.938159 #3468197] INFO -- : CPPFLAGS = I, [2024-05-17T19:59:47.938163 #3468197] INFO -- : DLDFLAGS = -Wl,--compress-debug-sections=zlib -Wl,-soname,libruby.so.3.4 -fstack-protector-strong I, [2024-05-17T19:59:47.938167 #3468197] INFO -- : SOLIBS = -lz -lrt -lrt -lgmp -ldl -lcrypt -lm -lpthread I, [2024-05-17T19:59:47.938171 #3468197] INFO -- : LANG = en_US.UTF-8 I, [2024-05-17T19:59:47.938176 #3468197] INFO -- : LC_ALL = I, [2024-05-17T19:59:47.938180 #3468197] INFO -- : LC_CTYPE = I, [2024-05-17T19:59:47.938184 #3468197] INFO -- : MFLAGS = I, [2024-05-17T19:59:47.938187 #3468197] INFO -- : RUSTC = no I, [2024-05-17T19:59:47.938191 #3468197] INFO -- : YJIT_RUSTC_ARGS = --crate-name=yjit --crate-type=staticlib --edition=2021 -g -C lto=thin -C opt-level=3 -C overflow-checks=on '--out-dir=/tmp/ruby/build/trunk/yjit/target/release/' /tmp/ruby/src/trunk/yjit/src/lib.rs I, [2024-05-17T19:59:47.938867 #3468197] INFO -- : gcc (Ubuntu 11.4.0-1ubuntu1~22.04) 11.4.0 I, [2024-05-17T19:59:47.938898 #3468197] INFO -- : Copyright (C) 2021 Free Software Foundation, Inc. I, [2024-05-17T19:59:47.938912 #3468197] INFO -- : This is free software; see the source for copying conditions. There is NO I, [2024-05-17T19:59:47.938917 #3468197] INFO -- : warranty; not even for MERCHANTABILITY or FITNESS FOR A PARTICULAR PURPOSE. I, [2024-05-17T19:59:47.938922 #3468197] INFO -- : I, [2024-05-17T19:59:48.046656 #3468197] INFO -- : Checking leaked global symbols...none I, [2024-05-17T19:59:48.089968 #3468197] INFO -- : /tmp/ruby/src/trunk/basictest/test.rb:assignment ....................................................................................................................................................................................................................................................................................................................................................................................OK 372 I, [2024-05-17T19:59:48.090023 #3468197] INFO -- : /tmp/ruby/src/trunk/basictest/test.rb:condition ..OK 2 I, [2024-05-17T19:59:48.090036 #3468197] INFO -- : /tmp/ruby/src/trunk/basictest/test.rb:if/unless ...OK 3 I, [2024-05-17T19:59:48.090040 #3468197] INFO -- : /tmp/ruby/src/trunk/basictest/test.rb:case .....OK 5 I, [2024-05-17T19:59:48.090255 #3468197] INFO -- : /tmp/ruby/src/trunk/basictest/test.rb:while/until ........OK 8 I, [2024-05-17T19:59:48.090310 #3468197] INFO -- : /tmp/ruby/src/trunk/basictest/test.rb:exception ..........OK 10 I, [2024-05-17T19:59:48.090591 #3468197] INFO -- : /tmp/ruby/src/trunk/basictest/test.rb:array .......................................OK 39 I, [2024-05-17T19:59:48.090694 #3468197] INFO -- : /tmp/ruby/src/trunk/basictest/test.rb:hash ...........................OK 27 I, [2024-05-17T19:59:48.091432 #3468197] INFO -- : /tmp/ruby/src/trunk/basictest/test.rb:iterator ...........................................................................................................OK 107 I, [2024-05-17T19:59:48.091719 #3468197] INFO -- : /tmp/ruby/src/trunk/basictest/test.rb:float ................................................................................OK 80 I, [2024-05-17T19:59:48.092749 #3468197] INFO -- : /tmp/ruby/src/trunk/basictest/test.rb:bignum ...............................OK 31 I, [2024-05-17T19:59:48.093522 #3468197] INFO -- : /tmp/ruby/src/trunk/basictest/test.rb:string & char ..............................................................OK 62 I, [2024-05-17T19:59:48.093555 #3468197] INFO -- : /tmp/ruby/src/trunk/basictest/test.rb:assignment ..........OK 10 I, [2024-05-17T19:59:48.093582 #3468197] INFO -- : /tmp/ruby/src/trunk/basictest/test.rb:call ......OK 6 I, [2024-05-17T19:59:48.093636 #3468197] INFO -- : /tmp/ruby/src/trunk/basictest/test.rb:proc .........OK 9 I, [2024-05-17T19:59:48.194270 #3468197] INFO -- : /tmp/ruby/src/trunk/basictest/test.rb:signal ..OK 2 I, [2024-05-17T19:59:48.197216 #3468197] INFO -- : /tmp/ruby/src/trunk/basictest/test.rb:eval ...........................OK 27 I, [2024-05-17T19:59:48.316534 #3468197] INFO -- : /tmp/ruby/src/trunk/basictest/test.rb:system ........OK 8 I, [2024-05-17T19:59:48.316594 #3468197] INFO -- : /tmp/ruby/src/trunk/basictest/test.rb:const .....OK 5 I, [2024-05-17T19:59:48.316601 #3468197] INFO -- : /tmp/ruby/src/trunk/basictest/test.rb:clone .....OK 5 I, [2024-05-17T19:59:48.316707 #3468197] INFO -- : /tmp/ruby/src/trunk/basictest/test.rb:marshal ....OK 4 I, [2024-05-17T19:59:48.316734 #3468197] INFO -- : /tmp/ruby/src/trunk/basictest/test.rb:pack ....OK 4 I, [2024-05-17T19:59:48.316752 #3468197] INFO -- : /tmp/ruby/src/trunk/basictest/test.rb:math ..OK 2 I, [2024-05-17T19:59:48.316835 #3468197] INFO -- : /tmp/ruby/src/trunk/basictest/test.rb:struct ......OK 6 I, [2024-05-17T19:59:48.316938 #3468197] INFO -- : /tmp/ruby/src/trunk/basictest/test.rb:variable ............OK 12 I, [2024-05-17T19:59:48.316959 #3468197] INFO -- : /tmp/ruby/src/trunk/basictest/test.rb:trace ...OK 3 I, [2024-05-17T19:59:48.316966 #3468197] INFO -- : /tmp/ruby/src/trunk/basictest/test.rb:defined? ............OK 12 I, [2024-05-17T19:59:48.317003 #3468197] INFO -- : /tmp/ruby/src/trunk/basictest/test.rb:alias ......OK 6 I, [2024-05-17T19:59:48.317351 #3468197] INFO -- : /tmp/ruby/src/trunk/basictest/test.rb:path .......................OK 23 I, [2024-05-17T19:59:48.352587 #3468197] INFO -- : /tmp/ruby/src/trunk/basictest/test.rb:gc ....OK 4 I, [2024-05-17T19:59:48.355029 #3468197] INFO -- : I, [2024-05-17T19:59:48.355052 #3468197] INFO -- : test succeeded I, [2024-05-17T19:59:48.356417 #3468197] INFO -- : $$$[end] "make yes-test-basic TESTS='-j20'" exit with 0. I, [2024-05-17T19:59:48.356521 #3468197] INFO -- : $$$[beg] make yes-test-all TESTOPTS='--stderr-on-failure' TESTS='-j20' I, [2024-05-17T19:59:48.455197 #3468197] INFO -- : BASERUBY = /usr/bin/ruby --disable=gems I, [2024-05-17T19:59:48.455234 #3468197] INFO -- : CC = gcc I, [2024-05-17T19:59:48.455240 #3468197] INFO -- : LD = ld I, [2024-05-17T19:59:48.455244 #3468197] INFO -- : LDSHARED = gcc -shared I, [2024-05-17T19:59:48.455248 #3468197] INFO -- : CFLAGS = -O3 -fno-fast-math -ggdb3 -Wall -Wextra -Wdeprecated-declarations -Wdiv-by-zero -Wduplicated-cond -Wimplicit-function-declaration -Wimplicit-int -Wpointer-arith -Wwrite-strings -Wold-style-definition -Wimplicit-fallthrough=0 -Wmissing-noreturn -Wno-cast-function-type -Wno-constant-logical-operand -Wno-long-long -Wno-missing-field-initializers -Wno-overlength-strings -Wno-packed-bitfield-compat -Wno-parentheses-equality -Wno-self-assign -Wno-tautological-compare -Wno-unused-parameter -Wno-unused-value -Wsuggest-attribute=format -Wsuggest-attribute=noreturn -Wunused-variable -Wmisleading-indentation -Wundef -fPIC I, [2024-05-17T19:59:48.455253 #3468197] INFO -- : XCFLAGS = -U_FORTIFY_SOURCE -D_FORTIFY_SOURCE=2 -fstack-protector-strong -fno-strict-overflow -fvisibility=hidden -fexcess-precision=standard -DRUBY_EXPORT -I. -I.ext/include/x86_64-linux -I/tmp/ruby/src/trunk/include -I/tmp/ruby/src/trunk -I/tmp/ruby/src/trunk/prism -I/tmp/ruby/src/trunk/enc/unicode/15.0.0 I, [2024-05-17T19:59:48.455256 #3468197] INFO -- : CPPFLAGS = I, [2024-05-17T19:59:48.455260 #3468197] INFO -- : DLDFLAGS = -Wl,--compress-debug-sections=zlib -Wl,-soname,libruby.so.3.4 -fstack-protector-strong I, [2024-05-17T19:59:48.455264 #3468197] INFO -- : SOLIBS = -lz -lrt -lrt -lgmp -ldl -lcrypt -lm -lpthread I, [2024-05-17T19:59:48.455268 #3468197] INFO -- : LANG = en_US.UTF-8 I, [2024-05-17T19:59:48.455271 #3468197] INFO -- : LC_ALL = I, [2024-05-17T19:59:48.455275 #3468197] INFO -- : LC_CTYPE = I, [2024-05-17T19:59:48.455278 #3468197] INFO -- : MFLAGS = I, [2024-05-17T19:59:48.455282 #3468197] INFO -- : RUSTC = no I, [2024-05-17T19:59:48.455285 #3468197] INFO -- : YJIT_RUSTC_ARGS = --crate-name=yjit --crate-type=staticlib --edition=2021 -g -C lto=thin -C opt-level=3 -C overflow-checks=on '--out-dir=/tmp/ruby/build/trunk/yjit/target/release/' /tmp/ruby/src/trunk/yjit/src/lib.rs I, [2024-05-17T19:59:48.455782 #3468197] INFO -- : gcc (Ubuntu 11.4.0-1ubuntu1~22.04) 11.4.0 I, [2024-05-17T19:59:48.455803 #3468197] INFO -- : Copyright (C) 2021 Free Software Foundation, Inc. I, [2024-05-17T19:59:48.455809 #3468197] INFO -- : This is free software; see the source for copying conditions. There is NO I, [2024-05-17T19:59:48.455813 #3468197] INFO -- : warranty; not even for MERCHANTABILITY or FITNESS FOR A PARTICULAR PURPOSE. I, [2024-05-17T19:59:48.455817 #3468197] INFO -- : I, [2024-05-17T19:59:48.457458 #3468197] INFO -- : generating enc.mk I, [2024-05-17T19:59:48.575331 #3468197] INFO -- : making enc I, [2024-05-17T19:59:48.592418 #3468197] INFO -- : make[1]: Entering directory '/tmp/ruby/build/trunk' I, [2024-05-17T19:59:48.592445 #3468197] INFO -- : make[1]: Nothing to be done for 'enc'. I, [2024-05-17T19:59:48.592452 #3468197] INFO -- : make[1]: Leaving directory '/tmp/ruby/build/trunk' I, [2024-05-17T19:59:48.593142 #3468197] INFO -- : making srcs under enc I, [2024-05-17T19:59:48.622722 #3468197] INFO -- : make[1]: Entering directory '/tmp/ruby/build/trunk' I, [2024-05-17T19:59:48.622752 #3468197] INFO -- : make[1]: Nothing to be done for 'srcs'. I, [2024-05-17T19:59:48.622758 #3468197] INFO -- : make[1]: Leaving directory '/tmp/ruby/build/trunk' I, [2024-05-17T19:59:48.623665 #3468197] INFO -- : generating transdb.h I, [2024-05-17T19:59:48.719968 #3468197] INFO -- : transdb.h unchanged I, [2024-05-17T19:59:48.721238 #3468197] INFO -- : making trans I, [2024-05-17T19:59:48.754954 #3468197] INFO -- : make[1]: Entering directory '/tmp/ruby/build/trunk' I, [2024-05-17T19:59:48.754975 #3468197] INFO -- : make[1]: Nothing to be done for 'trans'. I, [2024-05-17T19:59:48.754981 #3468197] INFO -- : make[1]: Leaving directory '/tmp/ruby/build/trunk' I, [2024-05-17T19:59:48.755697 #3468197] INFO -- : making encs I, [2024-05-17T19:59:48.794781 #3468197] INFO -- : make[1]: Entering directory '/tmp/ruby/build/trunk' I, [2024-05-17T19:59:48.794802 #3468197] INFO -- : make[1]: Nothing to be done for 'encs'. I, [2024-05-17T19:59:48.794808 #3468197] INFO -- : make[1]: Leaving directory '/tmp/ruby/build/trunk' I, [2024-05-17T19:59:48.796541 #3468197] INFO -- : generating makefiles ext/configure-ext.mk I, [2024-05-17T19:59:48.823829 #3468197] INFO -- : ext/configure-ext.mk updated I, [2024-05-17T19:59:48.826435 #3468197] INFO -- : make[1]: Entering directory '/tmp/ruby/build/trunk' I, [2024-05-17T19:59:50.178804 #3468197] INFO -- : make[1]: Leaving directory '/tmp/ruby/build/trunk' I, [2024-05-17T19:59:50.179446 #3468197] INFO -- : generating makefile exts.mk I, [2024-05-17T19:59:50.216002 #3468197] INFO -- : exts.mk unchanged I, [2024-05-17T19:59:50.220613 #3468197] INFO -- : make[1]: Entering directory '/tmp/ruby/build/trunk' I, [2024-05-17T19:59:50.555278 #3468197] INFO -- : make[2]: Entering directory '/tmp/ruby/build/trunk/ext/coverage' I, [2024-05-17T19:59:50.559926 #3468197] INFO -- : make[2]: Leaving directory '/tmp/ruby/build/trunk/ext/coverage' I, [2024-05-17T19:59:50.566404 #3468197] INFO -- : make[2]: Entering directory '/tmp/ruby/build/trunk/ext/date' I, [2024-05-17T19:59:50.571566 #3468197] INFO -- : make[2]: Leaving directory '/tmp/ruby/build/trunk/ext/date' I, [2024-05-17T19:59:50.575346 #3468197] INFO -- : make[2]: Entering directory '/tmp/ruby/build/trunk/ext/digest' I, [2024-05-17T19:59:50.584152 #3468197] INFO -- : make[2]: Leaving directory '/tmp/ruby/build/trunk/ext/digest' I, [2024-05-17T19:59:50.610530 #3468197] INFO -- : make[2]: Entering directory '/tmp/ruby/build/trunk/ext/digest/sha2' I, [2024-05-17T19:59:50.615422 #3468197] INFO -- : make[2]: Leaving directory '/tmp/ruby/build/trunk/ext/digest/sha2' I, [2024-05-17T19:59:50.637042 #3468197] INFO -- : make[2]: Entering directory '/tmp/ruby/build/trunk/ext/fiddle' I, [2024-05-17T19:59:50.647526 #3468197] INFO -- : make[2]: Leaving directory '/tmp/ruby/build/trunk/ext/fiddle' I, [2024-05-17T19:59:50.652506 #3468197] INFO -- : make[2]: Entering directory '/tmp/ruby/build/trunk/ext/io/console' I, [2024-05-17T19:59:50.656622 #3468197] INFO -- : make[2]: Leaving directory '/tmp/ruby/build/trunk/ext/io/console' I, [2024-05-17T19:59:50.669558 #3468197] INFO -- : make[2]: Entering directory '/tmp/ruby/build/trunk/ext/json' I, [2024-05-17T19:59:50.680228 #3468197] INFO -- : make[2]: Leaving directory '/tmp/ruby/build/trunk/ext/json' I, [2024-05-17T19:59:50.695426 #3468197] INFO -- : make[2]: Entering directory '/tmp/ruby/build/trunk/ext/monitor' I, [2024-05-17T19:59:50.699279 #3468197] INFO -- : make[2]: Leaving directory '/tmp/ruby/build/trunk/ext/monitor' I, [2024-05-17T19:59:50.706143 #3468197] INFO -- : make[2]: Entering directory '/tmp/ruby/build/trunk/ext/objspace' I, [2024-05-17T19:59:50.712224 #3468197] INFO -- : make[2]: Leaving directory '/tmp/ruby/build/trunk/ext/objspace' I, [2024-05-17T19:59:50.730927 #3468197] INFO -- : make[2]: Entering directory '/tmp/ruby/build/trunk/ext/openssl' I, [2024-05-17T19:59:50.747136 #3468197] INFO -- : make[2]: Leaving directory '/tmp/ruby/build/trunk/ext/openssl' I, [2024-05-17T19:59:50.750130 #3468197] INFO -- : make[2]: Entering directory '/tmp/ruby/build/trunk/ext/pathname' I, [2024-05-17T19:59:50.752556 #3468197] INFO -- : make[2]: Leaving directory '/tmp/ruby/build/trunk/ext/pathname' I, [2024-05-17T19:59:50.756742 #3468197] INFO -- : make[2]: Entering directory '/tmp/ruby/build/trunk/ext/psych' I, [2024-05-17T19:59:50.781050 #3468197] INFO -- : make[2]: Leaving directory '/tmp/ruby/build/trunk/ext/psych' I, [2024-05-17T19:59:50.785988 #3468197] INFO -- : make[2]: Entering directory '/tmp/ruby/build/trunk/ext/pty' I, [2024-05-17T19:59:50.790102 #3468197] INFO -- : make[2]: Leaving directory '/tmp/ruby/build/trunk/ext/pty' I, [2024-05-17T19:59:50.806088 #3468197] INFO -- : make[2]: Entering directory '/tmp/ruby/build/trunk/ext/ripper' I, [2024-05-17T19:59:50.814264 #3468197] INFO -- : make[2]: Leaving directory '/tmp/ruby/build/trunk/ext/ripper' I, [2024-05-17T19:59:50.816762 #3468197] INFO -- : make[2]: Entering directory '/tmp/ruby/build/trunk/ext/rubyvm' I, [2024-05-17T19:59:50.820024 #3468197] INFO -- : make[2]: Leaving directory '/tmp/ruby/build/trunk/ext/rubyvm' I, [2024-05-17T19:59:50.833375 #3468197] INFO -- : make[2]: Entering directory '/tmp/ruby/build/trunk/ext/socket' I, [2024-05-17T19:59:50.842170 #3468197] INFO -- : make[2]: Leaving directory '/tmp/ruby/build/trunk/ext/socket' I, [2024-05-17T19:59:50.854244 #3468197] INFO -- : make[2]: Entering directory '/tmp/ruby/build/trunk/.bundle/gems/bigdecimal-3.1.8/ext/bigdecimal' I, [2024-05-17T19:59:50.877263 #3468197] INFO -- : make[2]: Leaving directory '/tmp/ruby/build/trunk/.bundle/gems/bigdecimal-3.1.8/ext/bigdecimal' I, [2024-05-17T19:59:50.879294 #3468197] INFO -- : make[2]: Entering directory '/tmp/ruby/build/trunk/.bundle/gems/debug-1.9.2/ext/debug' I, [2024-05-17T19:59:50.900899 #3468197] INFO -- : make[2]: Leaving directory '/tmp/ruby/build/trunk/.bundle/gems/debug-1.9.2/ext/debug' I, [2024-05-17T19:59:50.903049 #3468197] INFO -- : make[2]: Entering directory '/tmp/ruby/build/trunk/.bundle/gems/nkf-0.2.0/ext/nkf' I, [2024-05-17T19:59:50.924521 #3468197] INFO -- : make[2]: Leaving directory '/tmp/ruby/build/trunk/.bundle/gems/nkf-0.2.0/ext/nkf' I, [2024-05-17T19:59:50.926512 #3468197] INFO -- : make[2]: Entering directory '/tmp/ruby/build/trunk/.bundle/gems/racc-1.7.3/ext/racc/cparse' I, [2024-05-17T19:59:50.948371 #3468197] INFO -- : make[2]: Leaving directory '/tmp/ruby/build/trunk/.bundle/gems/racc-1.7.3/ext/racc/cparse' I, [2024-05-17T19:59:50.951050 #3468197] INFO -- : make[2]: Entering directory '/tmp/ruby/build/trunk/.bundle/gems/rbs-3.4.4/ext/rbs_extension' I, [2024-05-17T19:59:50.973713 #3468197] INFO -- : make[2]: Leaving directory '/tmp/ruby/build/trunk/.bundle/gems/rbs-3.4.4/ext/rbs_extension' I, [2024-05-17T19:59:50.976010 #3468197] INFO -- : make[2]: Entering directory '/tmp/ruby/build/trunk/.bundle/gems/syslog-0.1.2/ext/syslog' I, [2024-05-17T19:59:51.006295 #3468197] INFO -- : make[2]: Leaving directory '/tmp/ruby/build/trunk/.bundle/gems/syslog-0.1.2/ext/syslog' I, [2024-05-17T19:59:51.029626 #3468197] INFO -- : make[2]: Entering directory '/tmp/ruby/build/trunk' I, [2024-05-17T19:59:51.100212 #3468197] INFO -- : make[2]: 'ruby' is up to date. I, [2024-05-17T19:59:51.100251 #3468197] INFO -- : make[2]: Leaving directory '/tmp/ruby/build/trunk' I, [2024-05-17T19:59:51.100505 #3468197] INFO -- : make[1]: Leaving directory '/tmp/ruby/build/trunk' I, [2024-05-17T19:59:51.104518 #3468197] INFO -- : make[1]: Entering directory '/tmp/ruby/build/trunk' I, [2024-05-17T19:59:51.104540 #3468197] INFO -- : make[1]: Nothing to be done for 'note'. I, [2024-05-17T19:59:51.104546 #3468197] INFO -- : make[1]: Leaving directory '/tmp/ruby/build/trunk' I, [2024-05-17T19:59:51.179585 #3468197] INFO -- : Run options: I, [2024-05-17T19:59:51.179627 #3468197] INFO -- : --seed=15541 I, [2024-05-17T19:59:51.179633 #3468197] INFO -- : "--ruby=./miniruby -I/tmp/ruby/src/trunk/lib -I. -I.ext/common /tmp/ruby/src/trunk/tool/runruby.rb --extout=.ext -- --disable-gems" I, [2024-05-17T19:59:51.179637 #3468197] INFO -- : --excludes-dir=/tmp/ruby/src/trunk/test/.excludes I, [2024-05-17T19:59:51.179647 #3468197] INFO -- : --name=!/memory_leak/ I, [2024-05-17T19:59:51.179668 #3468197] INFO -- : --stderr-on-failure I, [2024-05-17T19:59:51.179672 #3468197] INFO -- : -j20 I, [2024-05-17T19:59:51.179676 #3468197] INFO -- : I, [2024-05-17T19:59:51.179679 #3468197] INFO -- : # Running tests: I, [2024-05-17T19:59:51.179683 #3468197] INFO -- : I, [2024-05-17T19:59:51.329935 #3468197] INFO -- : [ 1/885] 3509546=test_digest I, [2024-05-17T19:59:51.329993 #3468197] INFO -- : [ 2/885] 3509528=test_ractor I, [2024-05-17T19:59:51.330002 #3468197] INFO -- : [ 3/885] 3509530=test_gem_security I, [2024-05-17T19:59:51.330009 #3468197] INFO -- : [ 4/885] 3509531=test_rdoc_servlet I, [2024-05-17T19:59:51.330015 #3468197] INFO -- : [ 5/885] 3509533=test_multi_irb_commands I, [2024-05-17T19:59:51.331722 #3468197] INFO -- : [ 6/885] 3509529=test_fiber I, [2024-05-17T19:59:51.331785 #3468197] INFO -- : [ 7/885] 3509545=test_open3 I, [2024-05-17T19:59:51.331879 #3468197] INFO -- : [ 8/885] 3509543=test_closure I, [2024-05-17T19:59:51.332894 #3468197] INFO -- : [ 9/885] 3509542=test_bundled_ca I, [2024-05-17T19:59:51.332987 #3468197] INFO -- : [ 10/885] 3509544=test_delegate I, [2024-05-17T19:59:51.335436 #3468197] INFO -- : [ 11/885] 3509547=test_popen_deadlock I, [2024-05-17T19:59:51.340482 #3468197] INFO -- : [ 12/885] 3509546=test_history I, [2024-05-17T19:59:51.342570 #3468197] INFO -- : [ 13/885] 3509533=test_mkmf I, [2024-05-17T19:59:51.352272 #3468197] INFO -- : [ 14/885] 3509544=test_date_marshal I, [2024-05-17T19:59:51.355838 #3468197] INFO -- : [ 15/885] 3509544=test_recursion I, [2024-05-17T19:59:51.359189 #3468197] INFO -- : [ 16/885] 3509544=test_exit I, [2024-05-17T19:59:51.364260 #3468197] INFO -- : [ 17/885] 3509534=test_rdoc_markup_pre_process I, [2024-05-17T19:59:51.364320 #3468197] INFO -- : [ 18/885] 3509538=test_printf I, [2024-05-17T19:59:51.364331 #3468197] INFO -- : [ 19/885] 3509535=test_to_ary_concat I, [2024-05-17T19:59:51.364338 #3468197] INFO -- : [ 20/885] 3509541=test_webauthn_listener_response I, [2024-05-17T19:59:51.364344 #3468197] INFO -- : [ 21/885] 3509539=test_time I, [2024-05-17T19:59:51.364350 #3468197] INFO -- : [ 22/885] 3509540=test_stream I, [2024-05-17T19:59:51.364356 #3468197] INFO -- : [ 23/885] 3509537=test_pinned I, [2024-05-17T19:59:51.367710 #3468197] INFO -- : [ 24/885] 3509532=test_emoji_breaks I, [2024-05-17T19:59:51.372184 #3468197] INFO -- : [ 25/885] 3509533=test_gem_bundler_version_finder I, [2024-05-17T19:59:51.377184 #3468197] INFO -- : [ 26/885] 3509532=test_within_pipe I, [2024-05-17T19:59:51.388313 #3468197] INFO -- : [ 27/885] 3509537=reflection_test I, [2024-05-17T19:59:51.393841 #3468197] INFO -- : [ 28/885] 3509528=test_files_lib I, [2024-05-17T19:59:51.395247 #3468197] INFO -- : [ 29/885] 3509536=test_gem_commands_unpack_command I, [2024-05-17T19:59:51.401241 #3468197] INFO -- : [ 30/885] 3509540=test_beginendblock I, [2024-05-17T19:59:51.408283 #3468197] INFO -- : [ 31/885] 3509538=test_rdoc_markup_to_bs I, [2024-05-17T19:59:51.442767 #3468197] INFO -- : [ 32/885] 3509543=test_help I, [2024-05-17T19:59:51.443876 #3468197] INFO -- : [ 33/885] 3509532=test_ocsp I, [2024-05-17T19:59:51.462828 #3468197] INFO -- : [ 34/885] 3509546=test_class I, [2024-05-17T19:59:51.470222 #3468197] INFO -- : [ 35/885] 3509546=test_pkey_dsa I, [2024-05-17T19:59:51.476591 #3468197] INFO -- : [ 36/885] 3509543=test_scheduler I, [2024-05-17T19:59:51.480182 #3468197] INFO -- : [ 37/885] 3509537=test_exception_at_throwing I, [2024-05-17T19:59:51.537079 #3468197] INFO -- : [ 38/885] 3509537=test_iseq I, [2024-05-17T19:59:51.570352 #3468197] INFO -- : [ 39/885] 3509534=test_rdoc_markup_heading I, [2024-05-17T19:59:51.580459 #3468197] INFO -- : [ 40/885] 3509534=test_io_m17n I, [2024-05-17T19:59:51.582304 #3468197] INFO -- : [ 41/885] 3509544=test_variable_name_check I, [2024-05-17T19:59:51.582335 #3468197] INFO -- : [ 42/885] 3509539=test_did_you_mean I, [2024-05-17T19:59:51.582671 #3468197] INFO -- : [ 43/885] 3509541=test_gem_commands_server_command I, [2024-05-17T19:59:51.585554 #3468197] INFO -- : [ 44/885] 3509533=test_append I, [2024-05-17T19:59:51.587219 #3468197] INFO -- : [ 45/885] 3509541=test_option I, [2024-05-17T19:59:51.592317 #3468197] INFO -- : [ 46/885] 3509533=test_cmethod I, [2024-05-17T19:59:51.596301 #3468197] INFO -- : [ 47/885] 3509533=test_tracer I, [2024-05-17T19:59:51.613263 #3468197] INFO -- : [ 48/885] 3509538=test_gem_commands_build_command I, [2024-05-17T19:59:51.626103 #3468197] INFO -- : [ 49/885] 3509544=test_interned_str I, [2024-05-17T19:59:51.626918 #3468197] INFO -- : [ 50/885] 3509543=test_case_comprehensive I, [2024-05-17T19:59:51.628844 #3468197] INFO -- : [ 51/885] 3509544=test_ssl_session I, [2024-05-17T19:59:51.654644 #3468197] INFO -- : [ 52/885] 3509531=test_thread_cv I, [2024-05-17T19:59:51.685414 #3468197] INFO -- : [ 53/885] 3509533=test_lexer I, [2024-05-17T19:59:51.692812 #3468197] INFO -- : [ 54/885] 3509533=test_gem_resolver_vendor_specification I, [2024-05-17T19:59:51.709333 #3468197] INFO -- : [ 55/885] 3509533=test_gem_commands_update_command I, [2024-05-17T19:59:51.714793 #3468197] INFO -- : [ 56/885] 3509541=test_gem_uri I, [2024-05-17T19:59:51.719098 #3468197] INFO -- : [ 57/885] 3509539=test_key_event_record I, [2024-05-17T19:59:51.738139 #3468197] INFO -- : [ 58/885] 3509541=test_notimplement I, [2024-05-17T19:59:51.742635 #3468197] INFO -- : [ 59/885] 3509541=test_random I, [2024-05-17T19:59:51.755946 #3468197] INFO -- : [ 60/885] 3509541=test_rdoc_method_attr I, [2024-05-17T19:59:51.773288 #3468197] INFO -- : [ 61/885] 3509535=test_filter I, [2024-05-17T19:59:51.781323 #3468197] INFO -- : [ 62/885] 3509539=test_gem_gem_runner I, [2024-05-17T19:59:51.790396 #3468197] INFO -- : [ 63/885] 3509532=test_data I, [2024-05-17T19:59:51.795135 #3468197] INFO -- : [ 64/885] 3509532=static_literals_test I, [2024-05-17T19:59:51.808136 #3468197] INFO -- : [ 65/885] 3509535=test_rdoc_generator_pot I, [2024-05-17T19:59:51.847418 #3468197] INFO -- : [ 66/885] 3509536=test_enumerator I, [2024-05-17T19:59:51.848944 #3468197] INFO -- : [ 67/885] 3509536=test_rdoc_parser_changelog I, [2024-05-17T19:59:51.854111 #3468197] INFO -- : [ 68/885] 3509540=parameters_signature_test I, [2024-05-17T19:59:51.877103 #3468197] INFO -- : [ 69/885] 3509532=test_koi8 I, [2024-05-17T19:59:51.882490 #3468197] INFO -- : [ 70/885] 3509532=test_unicode I, [2024-05-17T19:59:51.895356 #3468197] INFO -- : [ 71/885] 3509532=test_bn I, [2024-05-17T19:59:51.906250 #3468197] INFO -- : [ 72/885] 3509532=test_win32ole_param_event I, [2024-05-17T19:59:51.908412 #3468197] INFO -- : [ 73/885] 3509532=test_path I, [2024-05-17T19:59:51.924053 #3468197] INFO -- : [ 74/885] 3509532=redundant_return_test I, [2024-05-17T19:59:51.927833 #3468197] INFO -- : [ 75/885] 3509532=test_case_mapping I, [2024-05-17T19:59:51.930762 #3468197] INFO -- : [ 76/885] 3509540=test_tree_spell_checker I, [2024-05-17T19:59:51.936856 #3468197] INFO -- : [ 77/885] 3509532=test_http I, [2024-05-17T19:59:51.962787 #3468197] INFO -- : [ 78/885] 3509540=test_addrinfo I, [2024-05-17T19:59:51.977132 #3468197] INFO -- : [ 79/885] 3509547=test_bug-14834 I, [2024-05-17T19:59:51.979298 #3468197] INFO -- : [ 80/885] 3509535=test_date_compat I, [2024-05-17T19:59:51.982952 #3468197] INFO -- : [ 81/885] 3509535=test_rdoc_markup_to_html I, [2024-05-17T19:59:51.986273 #3468197] INFO -- : [ 82/885] 3509541=test_terminfo I, [2024-05-17T19:59:51.998451 #3468197] INFO -- : [ 83/885] 3509540=test_compile_prism I, [2024-05-17T19:59:52.034057 #3468197] INFO -- : [ 84/885] 3509539=test_key_stroke I, [2024-05-17T19:59:52.042170 #3468197] INFO -- : [ 85/885] 3509541=json_encoding_test I, [2024-05-17T19:59:52.042709 #3468197] INFO -- : [ 86/885] 3509539=test_color I, [2024-05-17T19:59:52.045351 #3468197] INFO -- : [ 87/885] 3509538=test_httpheader I, [2024-05-17T19:59:52.055139 #3468197] INFO -- : [ 88/885] 3509541=test_gem_resolver_local_specification I, [2024-05-17T19:59:52.055398 #3468197] INFO -- : [ 89/885] 3509536=test_rdoc_ri_driver I, [2024-05-17T19:59:52.061165 #3468197] INFO -- : [ 90/885] 3509547=test_set_len I, [2024-05-17T19:59:52.063756 #3468197] INFO -- : [ 91/885] 3509547=test_encoding I, [2024-05-17T19:59:52.078382 #3468197] INFO -- : [ 92/885] 3509535=test_httpresponses I, [2024-05-17T19:59:52.088471 #3468197] INFO -- : [ 93/885] 3509547=test_sockopt I, [2024-05-17T19:59:52.095044 #3468197] INFO -- : [ 94/885] 3509547=test_install I, [2024-05-17T19:59:52.105103 #3468197] INFO -- : [ 95/885] 3509538=test_rdoc_markup_to_label I, [2024-05-17T19:59:52.120040 #3468197] INFO -- : [ 96/885] 3509541=test_document I, [2024-05-17T19:59:52.126151 #3468197] INFO -- : [ 97/885] 3509541=test_acceptable I, [2024-05-17T19:59:52.126794 #3468197] INFO -- : [ 98/885] 3509538=test_euc_jp I, [2024-05-17T19:59:52.129429 #3468197] INFO -- : [ 99/885] 3509538=test_rdoc_generator_pot_po_entry I, [2024-05-17T19:59:52.132212 #3468197] INFO -- : [100/885] 3509539=test_pair I, [2024-05-17T19:59:52.134340 #3468197] INFO -- : [101/885] 3509538=test_win32ole_param I, [2024-05-17T19:59:52.138301 #3468197] INFO -- : [102/885] 3509538=test_gem_commands_yank_command I, [2024-05-17T19:59:52.140253 #3468197] INFO -- : [103/885] 3509535=test_chilled I, [2024-05-17T19:59:52.142728 #3468197] INFO -- : [104/885] 3509535=test_name_error_extension I, [2024-05-17T19:59:52.144145 #3468197] INFO -- : [105/885] 3509537=test_rdoc_i18n_locale I, [2024-05-17T19:59:52.149920 #3468197] INFO -- : [106/885] 3509535=test_primitive I, [2024-05-17T19:59:52.161538 #3468197] INFO -- : [107/885] 3509535=test_human_typo I, [2024-05-17T19:59:52.162316 #3468197] INFO -- : [108/885] 3509535=test_rbconfig I, [2024-05-17T19:59:52.166357 #3468197] INFO -- : [109/885] 3509535=test_rational2 I, [2024-05-17T19:59:52.177174 #3468197] INFO -- : [110/885] 3509535=test_rational I, [2024-05-17T19:59:52.200375 #3468197] INFO -- : [111/885] 3509535=test_assembler I, [2024-05-17T19:59:52.204838 #3468197] INFO -- : [112/885] 3509535=test_spell_checker I, [2024-05-17T19:59:52.212185 #3468197] INFO -- : [113/885] 3509535=test_propertyputref I, [2024-05-17T19:59:52.215560 #3468197] INFO -- : [114/885] 3509535=attribute_write_test I, [2024-05-17T19:59:52.235622 #3468197] INFO -- : [115/885] 3509547=test_x509ext I, [2024-05-17T19:59:52.259548 #3468197] INFO -- : [116/885] 3509541=test_erb I, [2024-05-17T19:59:52.261047 #3468197] INFO -- : [117/885] 3509536=test_gem_source_installed I, [2024-05-17T19:59:52.268946 #3468197] INFO -- : [118/885] 3509547=test_gem_commands_cert_command I, [2024-05-17T19:59:52.270729 #3468197] INFO -- : [119/885] 3509536=test_completion I, [2024-05-17T19:59:52.285674 #3468197] INFO -- : [120/885] 3509531=test_len I, [2024-05-17T19:59:52.289577 #3468197] INFO -- : [121/885] 3509531=test_yield_block I, [2024-05-17T19:59:52.290081 #3468197] INFO -- : [122/885] 3509541=test_rdoc_parser_simple I, [2024-05-17T19:59:52.291474 #3468197] INFO -- : [123/885] 3509535=test_load I, [2024-05-17T19:59:52.292745 #3468197] INFO -- : [124/885] 3509531=test_gem_commands_rebuild_command I, [2024-05-17T19:59:52.294900 #3468197] INFO -- : [125/885] 3509540=test_yamldbm I, [2024-05-17T19:59:52.295357 #3468197] INFO -- : [126/885] 3509535=test_abi I, [2024-05-17T19:59:52.295381 #3468197] INFO -- : [127/885] 3509537=test_provider I, [2024-05-17T19:59:52.299629 #3468197] INFO -- : [128/885] 3509541=test_evaluation I, [2024-05-17T19:59:52.300136 #3468197] INFO -- : [129/885] 3509540=test_https I, [2024-05-17T19:59:52.306477 #3468197] INFO -- : [130/885] 3509541=test_gem_ext_builder I, [2024-05-17T19:59:52.392150 #3468197] INFO -- : [131/885] 3509546=test_win32ole_method_event I, [2024-05-17T19:59:52.395055 #3468197] INFO -- : [132/885] 3509546=test_nesting_parser I, [2024-05-17T19:59:52.409070 #3468197] INFO -- : [133/885] 3509546=test_gem_dependency_list I, [2024-05-17T19:59:52.500556 #3468197] INFO -- : [134/885] 3509535=test_benchmark I, [2024-05-17T19:59:52.535144 #3468197] INFO -- : [135/885] 3509544=test_gem_commands_outdated_command I, [2024-05-17T19:59:52.539702 #3468197] INFO -- : [136/885] 3509531=test_array I, [2024-05-17T19:59:52.581958 #3468197] INFO -- : [137/885] 3509546=test_gem_package_tar_writer I, [2024-05-17T19:59:52.593109 #3468197] INFO -- : [138/885] 3509544=test_helper_method I, [2024-05-17T19:59:52.628713 #3468197] INFO -- : [139/885] 3509538=test_gem_source I, [2024-05-17T19:59:52.635233 #3468197] INFO -- : [140/885] 3509537=test_scalar_scanner I, [2024-05-17T19:59:52.662586 #3468197] INFO -- : [141/885] 3509537=test_boolean I, [2024-05-17T19:59:52.665651 #3468197] INFO -- : [142/885] 3509546=test_stringify_symbols I, [2024-05-17T19:59:52.670903 #3468197] INFO -- : [143/885] 3509546=integer_parse_test I, [2024-05-17T19:59:52.671472 #3468197] INFO -- : [144/885] 3509544=test_instrumentation_api I, [2024-05-17T19:59:52.680693 #3468197] INFO -- : [145/885] 3509537=test_buffered_io I, [2024-05-17T19:59:52.746219 #3468197] INFO -- : [146/885] 3509542=test_monitor I, [2024-05-17T19:59:52.774426 #3468197] INFO -- : [147/885] 3509546=test_configuration I, [2024-05-17T19:59:52.789561 #3468197] INFO -- : [148/885] 3509537=test_rubyvm I, [2024-05-17T19:59:52.800169 #3468197] INFO -- : [149/885] 3509537=test_rdoc_generator_markup I, [2024-05-17T19:59:52.813647 #3468197] INFO -- : [150/885] 3509537=test_whileuntil I, [2024-05-17T19:59:52.819630 #3468197] INFO -- : [151/885] 3509537=test_parser I, [2024-05-17T19:59:52.821695 #3468197] INFO -- : [152/885] 3509536=test_arith_seq_extract I, [2024-05-17T19:59:52.824136 #3468197] INFO -- : [153/885] 3509540=test_method_name_check I, [2024-05-17T19:59:52.837582 #3468197] INFO -- : [154/885] 3509537=test_gem_ext_cargo_builder I, [2024-05-17T19:59:52.843882 #3468197] INFO -- : [155/885] 3509540=test_ssl I, [2024-05-17T19:59:52.857040 #3468197] INFO -- : [156/885] 3509546=constant_path_node_test I, [2024-05-17T19:59:52.865635 #3468197] INFO -- : [157/885] 3509546=test_gem_request_set I, [2024-05-17T19:59:52.879654 #3468197] INFO -- : [158/885] 3509538=test_module I, [2024-05-17T19:59:52.956203 #3468197] INFO -- : [159/885] 3509542=test_set I, [2024-05-17T19:59:52.973657 #3468197] INFO -- : [160/885] 3509536=test_struct I, [2024-05-17T19:59:52.987710 #3468197] INFO -- : [161/885] 3509542=test_gem_path_support I, [2024-05-17T19:59:53.000464 #3468197] INFO -- : [162/885] 3509534=test_files_test_1 I, [2024-05-17T19:59:53.009337 #3468197] INFO -- : [163/885] 3509542=test_rdoc_rd_inline I, [2024-05-17T19:59:53.033261 #3468197] INFO -- : [164/885] 3509537=test_x509req I, [2024-05-17T19:59:53.053302 #3468197] INFO -- : [165/885] 3509533=test_mutex I, [2024-05-17T19:59:53.098622 #3468197] INFO -- : [166/885] 3509542=test_key_error I, [2024-05-17T19:59:53.101603 #3468197] INFO -- : [167/885] 3509542=test_win32ole_variant_m I, [2024-05-17T19:59:53.101947 #3468197] INFO -- : [168/885] 3509542=test_engine I, [2024-05-17T19:59:53.115165 #3468197] INFO -- : [169/885] 3509542=test_allocation I, [2024-05-17T19:59:53.206572 #3468197] INFO -- : [170/885] 3509546=test_div I, [2024-05-17T19:59:53.207002 #3468197] INFO -- : [171/885] 3509546=test_deprecated I, [2024-05-17T19:59:53.213450 #3468197] INFO -- : [172/885] 3509546=test_color_printer I, [2024-05-17T19:59:53.214692 #3468197] INFO -- : [173/885] 3509546=test_insns_leaf I, [2024-05-17T19:59:53.217261 #3468197] INFO -- : [174/885] 3509546=test_serialize_subclasses I, [2024-05-17T19:59:53.224918 #3468197] INFO -- : [175/885] 3509546=test_cparser I, [2024-05-17T19:59:53.229760 #3468197] INFO -- : [176/885] 3509537=test_pkg_config I, [2024-05-17T19:59:53.299788 #3468197] INFO -- : [177/885] 3509537=fuzzer_test I, [2024-05-17T19:59:53.308448 #3468197] INFO -- : [178/885] 3509537=test_rdoc_markup_include I, [2024-05-17T19:59:53.330485 #3468197] INFO -- : [179/885] 3509537=test_sexp I, [2024-05-17T19:59:53.350482 #3468197] INFO -- : [180/885] 3509537=test_variable I, [2024-05-17T19:59:53.350816 #3468197] INFO -- : [181/885] 3509541=test_struct I, [2024-05-17T19:59:53.359962 #3468197] INFO -- : [182/885] 3509541=test_rdoc_markup_to_html_snippet I, [2024-05-17T19:59:53.425170 #3468197] INFO -- : [183/885] 3509541=magic_comment_test I, [2024-05-17T19:59:53.461014 #3468197] INFO -- : [184/885] 3509537=test_dln I, [2024-05-17T19:59:53.466225 #3468197] INFO -- : [185/885] 3509537=test_gem_source_subpath_problem I, [2024-05-17T19:59:53.482574 #3468197] INFO -- : [186/885] 3509541=json_common_interface_test I, [2024-05-17T19:59:53.490343 #3468197] INFO -- : [187/885] 3509541=test_win32ole_variant_outarg I, [2024-05-17T19:59:53.497595 #3468197] INFO -- : [188/885] 3509541=test_config I, [2024-05-17T19:59:53.535815 #3468197] INFO -- : [189/885] 3509541=test_nomethod_error I, [2024-05-17T19:59:53.539200 #3468197] INFO -- : [190/885] 3509541=json_parser_test I, [2024-05-17T19:59:53.576529 #3468197] INFO -- : [191/885] 3509541=memsize_test I, [2024-05-17T19:59:53.578929 #3468197] INFO -- : [192/885] 3509541=test_cipher I, [2024-05-17T19:59:53.602741 #3468197] INFO -- : [193/885] 3509537=test_gem_security_signer I, [2024-05-17T19:59:53.609114 #3468197] INFO -- : [194/885] 3509546=test_new I, [2024-05-17T19:59:53.612685 #3468197] INFO -- : [195/885] 3509546=test_storage I, [2024-05-17T19:59:53.614992 #3468197] INFO -- : [196/885] 3509545=test_gem_resolver_git_set I, [2024-05-17T19:59:53.616625 #3468197] INFO -- : [197/885] 3509546=test_string I, [2024-05-17T19:59:53.620667 #3468197] INFO -- : [198/885] 3509546=test_iterator I, [2024-05-17T19:59:53.622329 #3468197] INFO -- : [199/885] 3509541=test_omap I, [2024-05-17T19:59:53.628315 #3468197] INFO -- : [200/885] 3509541=test_digest_extend I, [2024-05-17T19:59:53.630483 #3468197] INFO -- : [201/885] 3509536=test_shellwords I, [2024-05-17T19:59:53.636594 #3468197] INFO -- : [202/885] 3509536=test_debug I, [2024-05-17T19:59:53.639878 #3468197] INFO -- : [203/885] 3509541=test_memory_view I, [2024-05-17T19:59:53.643614 #3468197] INFO -- : [204/885] 3509536=pattern_test I, [2024-05-17T19:59:53.662232 #3468197] INFO -- : [205/885] 3509541=test_signal I, [2024-05-17T19:59:53.690109 #3468197] INFO -- : [206/885] 3509546=test_fixnum I, [2024-05-17T19:59:53.702699 #3468197] INFO -- : [207/885] 3509546=test_x509crl I, [2024-05-17T19:59:53.708958 #3468197] INFO -- : [208/885] 3509537=test_cgi_session I, [2024-05-17T19:59:53.716804 #3468197] INFO -- : [209/885] 3509535=test_rdoc_rd I, [2024-05-17T19:59:53.726094 #3468197] INFO -- : [210/885] 3509537=test_rdoc_top_level I, [2024-05-17T19:59:53.728596 #3468197] INFO -- : [211/885] 3509535=test_metaclass I, [2024-05-17T19:59:53.733518 #3468197] INFO -- : [212/885] 3509535=test_windows_1252 I, [2024-05-17T19:59:53.737780 #3468197] INFO -- : [213/885] 3509535=test_input_method I, [2024-05-17T19:59:53.747519 #3468197] INFO -- : [214/885] 3509536=test_process I, [2024-05-17T19:59:53.773323 #3468197] INFO -- : [215/885] 3509536=test_float I, [2024-05-17T19:59:53.871119 #3468197] INFO -- : [216/885] 3509546=test_require I, [2024-05-17T19:59:53.884475 #3468197] INFO -- : [217/885] 3509535=test_cgi_cookie I, [2024-05-17T19:59:53.905252 #3468197] INFO -- : [218/885] 3509535=test_dir_m17n I, [2024-05-17T19:59:54.081577 #3468197] INFO -- : [219/885] 3509537=test_gem_resolver_installer_set I, [2024-05-17T19:59:54.090784 #3468197] INFO -- : [220/885] 3509545=test_regex_casefold I, [2024-05-17T19:59:54.186844 #3468197] INFO -- : [221/885] 3509533=test_refinement I, [2024-05-17T19:59:54.295090 #3468197] INFO -- : [222/885] 3509537=test_gem_commands_signout_command I, [2024-05-17T19:59:54.307752 #3468197] INFO -- : [223/885] 3509537=test_gem_source_git I, [2024-05-17T19:59:54.311794 #3468197] INFO -- : [224/885] 3509528=test_rb_str_dup I, [2024-05-17T19:59:54.317078 #3468197] INFO -- : [225/885] 3509528=test_reline_key I, [2024-05-17T19:59:54.370823 #3468197] INFO -- : [226/885] 3509528=test_ancdata I, [2024-05-17T19:59:54.387429 #3468197] INFO -- : [227/885] 3509528=test_singleton_function I, [2024-05-17T19:59:54.388356 #3468197] INFO -- : [228/885] 3509528=test_alias I, [2024-05-17T19:59:54.393481 #3468197] INFO -- : [229/885] 3509545=test_timeout I, [2024-05-17T19:59:54.526114 #3468197] INFO -- : [230/885] 3509547=test_marshal I, [2024-05-17T19:59:54.537701 #3468197] INFO -- : [231/885] 3509528=test_unicode_normalize I, [2024-05-17T19:59:54.744343 #3468197] INFO -- : [232/885] 3509537=test_weakref I, [2024-05-17T19:59:54.820573 #3468197] INFO -- : [233/885] 3509538=test_nonblock I, [2024-05-17T19:59:54.847669 #3468197] INFO -- : [234/885] 3509538=test_my_integer I, [2024-05-17T19:59:54.855168 #3468197] INFO -- : [235/885] 3509538=json_ext_parser_test I, [2024-05-17T19:59:54.862730 #3468197] INFO -- : [236/885] 3509538=test_thread I, [2024-05-17T19:59:54.921618 #3468197] INFO -- : [237/885] 3509547=test_rendering I, [2024-05-17T19:59:54.927284 #3468197] INFO -- : [238/885] 3509537=test_debugger_integration I, [2024-05-17T19:59:54.941461 #3468197] INFO -- : [239/885] 3509537=test_ractor I, [2024-05-17T19:59:54.991472 #3468197] INFO -- : [240/885] 3509547=test_ssl I, [2024-05-17T19:59:55.097324 #3468197] INFO -- : [241/885] 3509545=test_gem_source_lock I, [2024-05-17T19:59:55.159223 #3468197] INFO -- : [242/885] 3509545=test_gem I, [2024-05-17T19:59:55.221962 #3468197] INFO -- : [243/885] 3509535=test_ractor I, [2024-05-17T19:59:55.229671 #3468197] INFO -- : [244/885] 3509535=test_dns I, [2024-05-17T19:59:55.251281 #3468197] INFO -- : [245/885] 3509536=test_gem_commands_open_command I, [2024-05-17T19:59:55.252991 #3468197] INFO -- : [246/885] 3509537=parse_stream_test I, [2024-05-17T19:59:55.257364 #3468197] INFO -- : [247/885] 3509537=test_registry I, [2024-05-17T19:59:55.260369 #3468197] INFO -- : [248/885] 3509537=test_parser I, [2024-05-17T19:59:55.268499 #3468197] INFO -- : [249/885] 3509537=test_cgi_core I, [2024-05-17T19:59:55.276317 #3468197] INFO -- : [250/885] 3509537=test_gem_commands_setup_command I, [2024-05-17T19:59:55.355413 #3468197] INFO -- : [251/885] 3509536=test_dryrun I, [2024-05-17T19:59:55.368619 #3468197] INFO -- : [252/885] 3509536=test_integer I, [2024-05-17T19:59:55.383434 #3468197] INFO -- : [253/885] 3509534=desugar_compiler_test I, [2024-05-17T19:59:55.432961 #3468197] INFO -- : [254/885] 3509536=test_env I, [2024-05-17T19:59:55.440208 #3468197] INFO -- : [255/885] 3509534=test_rdoc_attr I, [2024-05-17T19:59:55.448682 #3468197] INFO -- : [256/885] 3509534=test_object_references I, [2024-05-17T19:59:55.473164 #3468197] INFO -- : [257/885] 3509534=test_usrmarshal I, [2024-05-17T19:59:55.560860 #3468197] INFO -- : [258/885] 3509547=test_gem_resolver_git_specification I, [2024-05-17T19:59:55.613425 #3468197] INFO -- : [259/885] 3509539=test_gem_request_set_lockfile_tokenizer I, [2024-05-17T19:59:55.624100 #3468197] INFO -- : [260/885] 3509544=test_stat I, [2024-05-17T19:59:55.625008 #3468197] INFO -- : [261/885] 3509544=test_have_func I, [2024-05-17T19:59:55.643372 #3468197] INFO -- : [262/885] 3509534=test_nextafter I, [2024-05-17T19:59:55.660690 #3468197] INFO -- : [263/885] 3509539=test_capacity I, [2024-05-17T19:59:55.664753 #3468197] INFO -- : [264/885] 3509539=test_call I, [2024-05-17T19:59:55.691950 #3468197] INFO -- : [265/885] 3509530=test_https_proxy I, [2024-05-17T19:59:55.693590 #3468197] INFO -- : [266/885] 3509541=test_rubygems I, [2024-05-17T19:59:55.714157 #3468197] INFO -- : [267/885] 3509534=test_super I, [2024-05-17T19:59:55.733868 #3468197] INFO -- : [268/885] 3509542=test_rubyoptions I, [2024-05-17T19:59:55.738457 #3468197] INFO -- : [269/885] 3509535=test_cgi_modruby I, [2024-05-17T19:59:55.746759 #3468197] INFO -- : [270/885] 3509535=test_integer I, [2024-05-17T19:59:55.761339 #3468197] INFO -- : [271/885] 3509530=test_unix I, [2024-05-17T19:59:55.774264 #3468197] INFO -- : [272/885] 3509537=test_lazy_enumerator I, [2024-05-17T19:59:55.787643 #3468197] INFO -- : [273/885] 3509547=test_enc_associate I, [2024-05-17T19:59:55.787709 #3468197] INFO -- : [274/885] 3509530=ruby_api_test I, [2024-05-17T19:59:55.794506 #3468197] INFO -- : [275/885] 3509539=test_find_executable I, [2024-05-17T19:59:55.815016 #3468197] INFO -- : [276/885] 3509539=test_coder I, [2024-05-17T19:59:55.846901 #3468197] INFO -- : [277/885] 3509539=test_symbol I, [2024-05-17T19:59:55.862482 #3468197] INFO -- : [278/885] 3509531=test_gem_commands_pristine_command I, [2024-05-17T19:59:55.902839 #3468197] INFO -- : [279/885] 3509541=test_context I, [2024-05-17T19:59:55.944861 #3468197] INFO -- : [280/885] 3509530=test_nofree I, [2024-05-17T19:59:55.947080 #3468197] INFO -- : [281/885] 3509530=test_function_entry I, [2024-05-17T19:59:55.951834 #3468197] INFO -- : [282/885] 3509530=test_pkcs7 I, [2024-05-17T19:59:56.024186 #3468197] INFO -- : [283/885] 3509541=test_gem_resolver_requirement_list I, [2024-05-17T19:59:56.032326 #3468197] INFO -- : [284/885] 3509541=test_arith_seq_beg_len_step I, [2024-05-17T19:59:56.074519 #3468197] INFO -- : [285/885] 3509541=test_coderange I, [2024-05-17T19:59:56.080425 #3468197] INFO -- : [286/885] 3509541=location_test I, [2024-05-17T19:59:56.091003 #3468197] INFO -- : [287/885] 3509530=test_symbol I, [2024-05-17T19:59:56.106453 #3468197] INFO -- : [288/885] 3509530=test_mailto I, [2024-05-17T19:59:56.111497 #3468197] INFO -- : [289/885] 3509541=test_rdoc_generator_darkfish I, [2024-05-17T19:59:56.116634 #3468197] INFO -- : [290/885] 3509530=test_rdoc_comment I, [2024-05-17T19:59:56.225877 #3468197] INFO -- : [291/885] 3509547=test_error_highlight I, [2024-05-17T19:59:56.287156 #3468197] INFO -- : [292/885] 3509534=test_resize I, [2024-05-17T19:59:56.291664 #3468197] INFO -- : [293/885] 3509534=test_http_request I, [2024-05-17T19:59:56.293397 #3468197] INFO -- : [294/885] 3509530=test_gem_source_fetch_problem I, [2024-05-17T19:59:56.306075 #3468197] INFO -- : [295/885] 3509537=json_generic_object_test I, [2024-05-17T19:59:56.311615 #3468197] INFO -- : [296/885] 3509530=test_numeric I, [2024-05-17T19:59:56.319538 #3468197] INFO -- : [297/885] 3509530=test_member I, [2024-05-17T19:59:56.322042 #3468197] INFO -- : [298/885] 3509530=test_cgi_multipart I, [2024-05-17T19:59:56.338039 #3468197] INFO -- : [299/885] 3509537=test_gem_commands_cleanup_command I, [2024-05-17T19:59:56.347240 #3468197] INFO -- : [300/885] 3509534=test_word I, [2024-05-17T19:59:56.348673 #3468197] INFO -- : [301/885] 3509534=test_ractor_compatibility I, [2024-05-17T19:59:56.407431 #3468197] INFO -- : [302/885] 3509541=test_date_ractor I, [2024-05-17T19:59:56.454040 #3468197] INFO -- : [303/885] 3509530=test_gem_console_ui I, [2024-05-17T19:59:56.464394 #3468197] INFO -- : [304/885] 3509530=test_dir I, [2024-05-17T19:59:56.582959 #3468197] INFO -- : [305/885] 3509547=format_errors_test I, [2024-05-17T19:59:56.685537 #3468197] INFO -- : [306/885] 3509547=test_autoconf I, [2024-05-17T19:59:56.690450 #3468197] INFO -- : [307/885] 3509541=test_eval I, [2024-05-17T19:59:56.693112 #3468197] INFO -- : [308/885] 3509547=test_win32ole_variant I, [2024-05-17T19:59:56.694457 #3468197] INFO -- : [309/885] 3509541=test_ipaddr I, [2024-05-17T19:59:56.699561 #3468197] INFO -- : [310/885] 3509547=test_mixed_unicode_escapes I, [2024-05-17T19:59:56.702224 #3468197] INFO -- : [311/885] 3509547=test_history I, [2024-05-17T19:59:56.712285 #3468197] INFO -- : [312/885] 3509547=test_rdoc_markup_to_ansi I, [2024-05-17T19:59:56.722977 #3468197] INFO -- : [313/885] 3509541=test_gem_resolver_api_specification I, [2024-05-17T19:59:56.739493 #3468197] INFO -- : [314/885] 3509530=test_merge_keys I, [2024-05-17T19:59:56.747720 #3468197] INFO -- : [315/885] 3509528=test_rdoc_extend I, [2024-05-17T19:59:56.751530 #3468197] INFO -- : [316/885] 3509530=test_enum I, [2024-05-17T19:59:56.762355 #3468197] INFO -- : [317/885] 3509541=test_gem_specification I, [2024-05-17T19:59:56.833227 #3468197] INFO -- : [318/885] 3509546=test_threadgroup I, [2024-05-17T19:59:56.837353 #3468197] INFO -- : [319/885] 3509534=test_have_macro I, [2024-05-17T19:59:56.881835 #3468197] INFO -- : [320/885] 3509547=test_gem_package I, [2024-05-17T19:59:56.947526 #3468197] INFO -- : [321/885] 3509537=test_resolve_symbol I, [2024-05-17T19:59:56.967451 #3468197] INFO -- : [322/885] 3509545=test_complex2 I, [2024-05-17T19:59:56.975481 #3468197] INFO -- : [323/885] 3509545=test_trace I, [2024-05-17T19:59:56.985658 #3468197] INFO -- : [324/885] 3509545=ractor_test I, [2024-05-17T19:59:56.986672 #3468197] INFO -- : [325/885] 3509528=test_rdoc_generator_json_index I, [2024-05-17T19:59:57.022844 #3468197] INFO -- : [326/885] 3509537=test_time_tz I, [2024-05-17T19:59:57.038988 #3468197] INFO -- : [327/885] 3509545=test_win32ole_event I, [2024-05-17T19:59:57.042910 #3468197] INFO -- : [328/885] 3509545=test_rdoc_class_module I, [2024-05-17T19:59:57.047907 #3468197] INFO -- : [329/885] 3509528=test_bignum I, [2024-05-17T19:59:57.073741 #3468197] INFO -- : [330/885] 3509537=test_gem_ci_detector I, [2024-05-17T19:59:57.086059 #3468197] INFO -- : [331/885] 3509537=test_win32ole_variable I, [2024-05-17T19:59:57.089068 #3468197] INFO -- : [332/885] 3509537=test_stringio I, [2024-05-17T19:59:57.124035 #3468197] INFO -- : [333/885] 3509533=test_arity I, [2024-05-17T19:59:57.126671 #3468197] INFO -- : [334/885] 3509533=test_io_wait_uncommon I, [2024-05-17T19:59:57.129581 #3468197] INFO -- : [335/885] 3509533=test_ractor I, [2024-05-17T19:59:57.167347 #3468197] INFO -- : [336/885] 3509528=test_type I, [2024-05-17T19:59:57.170318 #3468197] INFO -- : [337/885] 3509537=test_func I, [2024-05-17T19:59:57.175535 #3468197] INFO -- : [338/885] 3509528=test_big5 I, [2024-05-17T19:59:57.176323 #3468197] INFO -- : [339/885] 3509528=test_pointer I, [2024-05-17T19:59:57.205482 #3468197] INFO -- : [340/885] 3509544=test_rdoc_rd_block_parser I, [2024-05-17T19:59:57.208433 #3468197] INFO -- : [341/885] 3509533=test_signedness I, [2024-05-17T19:59:57.212084 #3468197] INFO -- : [342/885] 3509531=test_tsort I, [2024-05-17T19:59:57.221619 #3468197] INFO -- : [343/885] 3509531=test_change_word I, [2024-05-17T19:59:57.231008 #3468197] INFO -- : [344/885] 3509531=compiler_test I, [2024-05-17T19:59:57.241800 #3468197] INFO -- : [345/885] 3509529=test_flip I, [2024-05-17T19:59:57.264159 #3468197] INFO -- : [346/885] 3509529=test_timeout I, [2024-05-17T19:59:57.274898 #3468197] INFO -- : [347/885] 3509529=test_ossl I, [2024-05-17T19:59:57.291807 #3468197] INFO -- : [348/885] 3509534=test_normalize I, [2024-05-17T19:59:57.293626 #3468197] INFO -- : [349/885] 3509534=test_date_arith I, [2024-05-17T19:59:57.299913 #3468197] INFO -- : [350/885] 3509531=test_object I, [2024-05-17T19:59:57.306879 #3468197] INFO -- : [351/885] 3509534=test_ruby_lex I, [2024-05-17T19:59:57.368200 #3468197] INFO -- : [352/885] 3509544=test_gem_local_remote_options I, [2024-05-17T19:59:57.403431 #3468197] INFO -- : [353/885] 3509544=test_sleep I, [2024-05-17T19:59:57.486232 #3468197] INFO -- : [354/885] 3509547=test_key_actor_emacs I, [2024-05-17T19:59:57.562889 #3468197] INFO -- : [355/885] 3509534=test_gem_gemcutter_utilities I, [2024-05-17T19:59:57.586732 #3468197] INFO -- : [356/885] 3509547=test_basicinstructions I, [2024-05-17T19:59:57.608764 #3468197] INFO -- : [357/885] 3509530=test_gem_command_manager I, [2024-05-17T19:59:57.662180 #3468197] INFO -- : [358/885] 3509528=test_arithmetic_sequence I, [2024-05-17T19:59:57.665423 #3468197] INFO -- : [359/885] 3509547=test_cgi_header I, [2024-05-17T19:59:57.671892 #3468197] INFO -- : [360/885] 3509547=heredoc_dedent_test I, [2024-05-17T19:59:57.676587 #3468197] INFO -- : [361/885] 3509547=test_object I, [2024-05-17T19:59:57.679346 #3468197] INFO -- : [362/885] 3509528=version_test I, [2024-05-17T19:59:57.681151 #3468197] INFO -- : [363/885] 3509547=test_import I, [2024-05-17T19:59:57.692158 #3468197] INFO -- : [364/885] 3509539=test_gem_resolver_lock_set I, [2024-05-17T19:59:57.710353 #3468197] INFO -- : [365/885] 3509531=test_not I, [2024-05-17T19:59:57.711058 #3468197] INFO -- : [366/885] 3509531=test_rdoc_parser_markdown I, [2024-05-17T19:59:57.719141 #3468197] INFO -- : [367/885] 3509539=test_file_exhaustive I, [2024-05-17T19:59:57.720211 #3468197] INFO -- : [368/885] 3509531=test_files_test I, [2024-05-17T19:59:57.738470 #3468197] INFO -- : [369/885] 3509545=test_gem_update_suggestion I, [2024-05-17T19:59:57.747969 #3468197] INFO -- : [370/885] 3509528=test_logger I, [2024-05-17T19:59:57.772875 #3468197] INFO -- : [371/885] 3509530=test_delete I, [2024-05-17T19:59:57.774772 #3468197] INFO -- : [372/885] 3509531=test_win32ole_method I, [2024-05-17T19:59:57.778195 #3468197] INFO -- : [373/885] 3509530=test_fd_setsize I, [2024-05-17T19:59:57.778319 #3468197] INFO -- : [374/885] 3509531=test_continuation I, [2024-05-17T19:59:57.779153 #3468197] INFO -- : [375/885] 3509530=test_keyword I, [2024-05-17T19:59:57.786576 #3468197] INFO -- : [376/885] 3509531=test_class_name_check I, [2024-05-17T19:59:57.807918 #3468197] INFO -- : [377/885] 3509531=test_pkey_rsa I, [2024-05-17T19:59:57.808470 #3468197] INFO -- : [378/885] 3509528=test_weakkeymap I, [2024-05-17T19:59:57.813676 #3468197] INFO -- : [379/885] 3509545=test_gem_commands_push_command I, [2024-05-17T19:59:57.839491 #3468197] INFO -- : [380/885] 3509546=test_numhash I, [2024-05-17T19:59:57.843607 #3468197] INFO -- : [381/885] 3509546=test_date_strptime I, [2024-05-17T19:59:57.920558 #3468197] INFO -- : [382/885] 3509546=test_gem_package_task I, [2024-05-17T19:59:57.923289 #3468197] INFO -- : [383/885] 3509546=test_placearg I, [2024-05-17T19:59:58.016117 #3468197] INFO -- : [384/885] 3509534=test_rdoc_markup_hard_break I, [2024-05-17T19:59:58.021058 #3468197] INFO -- : [385/885] 3509534=test_gem_platform I, [2024-05-17T19:59:58.028440 #3468197] INFO -- : [386/885] 3509546=test_lambda I, [2024-05-17T19:59:58.053014 #3468197] INFO -- : [387/885] 3509528=test_gem_request_set_gem_dependency_api I, [2024-05-17T19:59:58.107180 #3468197] INFO -- : [388/885] 3509546=test_ast I, [2024-05-17T19:59:58.115915 #3468197] INFO -- : [389/885] 3509534=test_random_formatter I, [2024-05-17T19:59:58.116760 #3468197] INFO -- : [390/885] 3509531=test_helper I, [2024-05-17T19:59:58.118044 #3468197] INFO -- : [391/885] 3509531=test_jaro_winkler I, [2024-05-17T19:59:58.135260 #3468197] INFO -- : [392/885] 3509531=test_webauthn_listener I, [2024-05-17T19:59:58.139093 #3468197] INFO -- : [393/885] 3509534=test_rdoc_code_object I, [2024-05-17T19:59:58.205902 #3468197] INFO -- : [394/885] 3509531=test_x509store I, [2024-05-17T19:59:58.325530 #3468197] INFO -- : [395/885] 3509536=test_update I, [2024-05-17T19:59:58.327405 #3468197] INFO -- : [396/885] 3509545=test_fips I, [2024-05-17T19:59:58.328307 #3468197] INFO -- : [397/885] 3509536=test_x509name I, [2024-05-17T19:59:58.342506 #3468197] INFO -- : [398/885] 3509528=test_transcode I, [2024-05-17T19:59:58.353637 #3468197] INFO -- : [399/885] 3509536=test_eval I, [2024-05-17T19:59:58.380474 #3468197] INFO -- : [400/885] 3509530=json_generator_test I, [2024-05-17T19:59:58.449793 #3468197] INFO -- : [401/885] 3509531=test_config I, [2024-05-17T19:59:58.470269 #3468197] INFO -- : [402/885] 3509530=test_gem_resolver_vendor_set I, [2024-05-17T19:59:58.492662 #3468197] INFO -- : [403/885] 3509530=test_enumerable I, [2024-05-17T19:59:58.500977 #3468197] INFO -- : [404/885] 3509530=test_gem_safe_marshal I, [2024-05-17T19:59:58.535034 #3468197] INFO -- : [405/885] 3509528=test_gem_resolver_api_set I, [2024-05-17T19:59:58.574386 #3468197] INFO -- : [406/885] 3509541=test_rdoc_ri_paths I, [2024-05-17T19:59:58.587182 #3468197] INFO -- : [407/885] 3509534=test_ts I, [2024-05-17T19:59:58.589009 #3468197] INFO -- : [408/885] 3509528=test_ensured I, [2024-05-17T19:59:58.607393 #3468197] INFO -- : [409/885] 3509545=library_symbols_test I, [2024-05-17T19:59:58.608442 #3468197] INFO -- : [410/885] 3509541=test_addr I, [2024-05-17T19:59:58.617388 #3468197] INFO -- : [411/885] 3509536=test_locale I, [2024-05-17T19:59:58.632394 #3468197] INFO -- : [412/885] 3509541=test_gem_uri_formatter I, [2024-05-17T19:59:58.644622 #3468197] INFO -- : [413/885] 3509536=test_helper I, [2024-05-17T19:59:58.648531 #3468197] INFO -- : [414/885] 3509528=test_erb_command I, [2024-05-17T19:59:58.648952 #3468197] INFO -- : [415/885] 3509547=test_encoding I, [2024-05-17T19:59:58.650170 #3468197] INFO -- : [416/885] 3509541=test_project_sanity I, [2024-05-17T19:59:58.653528 #3468197] INFO -- : [417/885] 3509536=test_range I, [2024-05-17T19:59:58.664109 #3468197] INFO -- : [418/885] 3509545=test_pty I, [2024-05-17T19:59:58.691982 #3468197] INFO -- : [419/885] 3509528=test_dup I, [2024-05-17T19:59:58.714615 #3468197] INFO -- : [420/885] 3509537=test_constant I, [2024-05-17T19:59:58.718108 #3468197] INFO -- : [421/885] 3509535=command_line_test I, [2024-05-17T19:59:58.719310 #3468197] INFO -- : [422/885] 3509541=test_data_error I, [2024-05-17T19:59:58.722240 #3468197] INFO -- : [423/885] 3509535=bom_test I, [2024-05-17T19:59:58.728783 #3468197] INFO -- : [424/885] 3509535=test_file I, [2024-05-17T19:59:58.805742 #3468197] INFO -- : [425/885] 3509541=test_force_exit I, [2024-05-17T19:59:58.809077 #3468197] INFO -- : [426/885] 3509541=unescape_test I, [2024-05-17T19:59:58.889449 #3468197] INFO -- : [427/885] 3509547=test_ostruct I, [2024-05-17T19:59:58.891448 #3468197] INFO -- : [428/885] 3509528=test_udp I, [2024-05-17T19:59:58.905001 #3468197] INFO -- : [429/885] 3509528=static_inspect_test I, [2024-05-17T19:59:58.913213 #3468197] INFO -- : [430/885] 3509528=errors_test I, [2024-05-17T19:59:58.927212 #3468197] INFO -- : [431/885] 3509531=test_regexp I, [2024-05-17T19:59:58.973158 #3468197] INFO -- : [432/885] 3509530=test_gem_commands_check_command I, [2024-05-17T19:59:58.986807 #3468197] INFO -- : [433/885] 3509530=test_vm_dump I, [2024-05-17T19:59:58.987703 #3468197] INFO -- : [434/885] 3509530=test_tmpdir I, [2024-05-17T19:59:59.006051 #3468197] INFO -- : [435/885] 3509528=test_rdoc_markup_document I, [2024-05-17T19:59:59.013382 #3468197] INFO -- : [436/885] 3509528=test_integer_comb I, [2024-05-17T19:59:59.019290 #3468197] INFO -- : [437/885] 3509547=test_rdoc_rdoc I, [2024-05-17T19:59:59.043576 #3468197] INFO -- : [438/885] 3509534=test_windows_1251 I, [2024-05-17T19:59:59.047928 #3468197] INFO -- : [439/885] 3509534=test_time I, [2024-05-17T19:59:59.064195 #3468197] INFO -- : [440/885] 3509530=test_svcb_https I, [2024-05-17T19:59:59.071681 #3468197] INFO -- : [441/885] 3509530=test_buffering I, [2024-05-17T19:59:59.075754 #3468197] INFO -- : [442/885] 3509530=test_gb18030 I, [2024-05-17T19:59:59.079495 #3468197] INFO -- : [443/885] 3509530=test_gem_uninstaller I, [2024-05-17T19:59:59.121087 #3468197] INFO -- : [444/885] 3509547=test_rdoc_i18n_text I, [2024-05-17T19:59:59.128415 #3468197] INFO -- : [445/885] 3509547=test_io_buffer I, [2024-05-17T19:59:59.165895 #3468197] INFO -- : [446/885] 3509547=test_defined I, [2024-05-17T19:59:59.169590 #3468197] INFO -- : [447/885] 3509545=test_backtrace I, [2024-05-17T19:59:59.173415 #3468197] INFO -- : [448/885] 3509545=test_key_name_check I, [2024-05-17T19:59:59.185602 #3468197] INFO -- : [449/885] 3509545=test_date_parse I, [2024-05-17T19:59:59.185949 #3468197] INFO -- : [450/885] 3509534=test_pkey_ec I, [2024-05-17T19:59:59.227631 #3468197] INFO -- : [451/885] 3509547=test_trick I, [2024-05-17T19:59:59.268120 #3468197] INFO -- : [452/885] 3509534=test_thread I, [2024-05-17T19:59:59.269077 #3468197] INFO -- : [453/885] 3509534=test_pipe I, [2024-05-17T19:59:59.299966 #3468197] INFO -- : [454/885] 3509545=test_rdoc_rd_inline_parser I, [2024-05-17T19:59:59.313687 #3468197] INFO -- : [455/885] 3509545=test_rdoc_markup_to_rdoc I, [2024-05-17T19:59:59.344411 #3468197] INFO -- : [456/885] 3509545=test_default_gems I, [2024-05-17T19:59:59.396737 #3468197] INFO -- : [457/885] 3509545=test_win32ole_type I, [2024-05-17T19:59:59.403363 #3468197] INFO -- : [458/885] 3509545=test_null I, [2024-05-17T19:59:59.407652 #3468197] INFO -- : [459/885] 3509534=test_mul I, [2024-05-17T19:59:59.411383 #3468197] INFO -- : [460/885] 3509545=test_rdoc_markup_attributes I, [2024-05-17T19:59:59.412832 #3468197] INFO -- : [461/885] 3509534=json_addition_test I, [2024-05-17T19:59:59.415582 #3468197] INFO -- : [462/885] 3509545=test_custom_command I, [2024-05-17T19:59:59.428409 #3468197] INFO -- : [463/885] 3509536=test_gem_dependency_resolution_error I, [2024-05-17T19:59:59.439910 #3468197] INFO -- : [464/885] 3509536=test_rdoc_parser I, [2024-05-17T19:59:59.440679 #3468197] INFO -- : [465/885] 3509534=test_qsort I, [2024-05-17T19:59:59.445161 #3468197] INFO -- : [466/885] 3509534=test_string I, [2024-05-17T19:59:59.455849 #3468197] INFO -- : [467/885] 3509534=test_rdoc_stats I, [2024-05-17T19:59:59.459134 #3468197] INFO -- : [468/885] 3509536=test_pattern_matching I, [2024-05-17T19:59:59.481881 #3468197] INFO -- : [469/885] 3509534=test_gem_request_set_lockfile_parser I, [2024-05-17T19:59:59.489382 #3468197] INFO -- : [470/885] 3509536=test_depth_first I, [2024-05-17T19:59:59.494705 #3468197] INFO -- : [471/885] 3509536=test_raise I, [2024-05-17T19:59:59.497996 #3468197] INFO -- : [472/885] 3509536=test_x509attr I, [2024-05-17T19:59:59.502039 #3468197] INFO -- : [473/885] 3509536=test_rdoc_store I, [2024-05-17T19:59:59.528795 #3468197] INFO -- : [474/885] 3509545=test_gem_validator I, [2024-05-17T19:59:59.541507 #3468197] INFO -- : [475/885] 3509545=test_fnmatch I, [2024-05-17T19:59:59.566946 #3468197] INFO -- : [476/885] 3509534=test_files_test_2 I, [2024-05-17T19:59:59.568541 #3468197] INFO -- : [477/885] 3509534=test_require_path_check I, [2024-05-17T19:59:59.582447 #3468197] INFO -- : [478/885] 3509545=test_rdoc_markup_parser I, [2024-05-17T19:59:59.616679 #3468197] INFO -- : [479/885] 3509533=test_folderitem2_invokeverb I, [2024-05-17T19:59:59.619105 #3468197] INFO -- : [480/885] 3509533=test_ole_methods I, [2024-05-17T19:59:59.620941 #3468197] INFO -- : [481/885] 3509533=test_erb_m17n I, [2024-05-17T19:59:59.625737 #3468197] INFO -- : [482/885] 3509545=test_date_conv I, [2024-05-17T19:59:59.628790 #3468197] INFO -- : [483/885] 3509533=test_optimization I, [2024-05-17T19:59:59.638785 #3468197] INFO -- : [484/885] 3509545=test_cgi_tag_helper I, [2024-05-17T19:59:59.648260 #3468197] INFO -- : [485/885] 3509534=test_zlib I, [2024-05-17T19:59:59.656528 #3468197] INFO -- : [486/885] 3509545=test_egrep_cpp I, [2024-05-17T19:59:59.796539 #3468197] INFO -- : [487/885] 3509545=test_gem_resolver_index_set I, [2024-05-17T19:59:59.832970 #3468197] INFO -- : [488/885] 3509545=test_gem_package_old I, [2024-05-17T19:59:59.866804 #3468197] INFO -- : [489/885] 3509545=test_gc_compact I, [2024-05-17T19:59:59.898234 #3468197] INFO -- : [490/885] 3509541=test_proc I, [2024-05-17T19:59:59.950987 #3468197] INFO -- : [491/885] 3509530=test_string I, [2024-05-17T20:00:00.184193 #3468197] INFO -- : [492/885] 3509536=test_macro I, [2024-05-17T20:00:00.196480 #3468197] INFO -- : [493/885] 3509536=test_gem_ext_configure_builder I, [2024-05-17T20:00:00.219947 #3468197] INFO -- : [494/885] 3509536=test_frozen I, [2024-05-17T20:00:00.221355 #3468197] INFO -- : [495/885] 3509536=test_pp I, [2024-05-17T20:00:00.256527 #3468197] INFO -- : [496/885] 3509536=test_verbose I, [2024-05-17T20:00:00.274528 #3468197] INFO -- : [497/885] 3509536=test_rdoc_single_class I, [2024-05-17T20:00:00.278081 #3468197] INFO -- : [498/885] 3509536=test_nil I, [2024-05-17T20:00:00.283658 #3468197] INFO -- : [499/885] 3509536=test_num2int I, [2024-05-17T20:00:00.290754 #3468197] INFO -- : [500/885] 3509536=test_zsh_completion I, [2024-05-17T20:00:00.294689 #3468197] INFO -- : [501/885] 3509536=test_exception I, [2024-05-17T20:00:00.301514 #3468197] INFO -- : [502/885] 3509536=test_iter_break I, [2024-05-17T20:00:00.302753 #3468197] INFO -- : [503/885] 3509536=test_address_resolve I, [2024-05-17T20:00:00.314413 #3468197] INFO -- : [504/885] 3509536=test_rdoc_token_stream I, [2024-05-17T20:00:00.327710 #3468197] INFO -- : [505/885] 3509536=test_config I, [2024-05-17T20:00:00.366667 #3468197] INFO -- : [506/885] 3509536=test_gem_source_list I, [2024-05-17T20:00:00.397758 #3468197] INFO -- : [507/885] 3509536=test_optarg I, [2024-05-17T20:00:00.524916 #3468197] INFO -- : [508/885] 3509536=test_yaml_special_cases I, [2024-05-17T20:00:00.538740 #3468197] INFO -- : [509/885] 3509536=test_ifunless I, [2024-05-17T20:00:00.544611 #3468197] INFO -- : [510/885] 3509536=test_assignment I, [2024-05-17T20:00:00.698175 #3468197] INFO -- : [511/885] 3509541=test_gem_commands_lock_command I, [2024-05-17T20:00:00.724135 #3468197] INFO -- : [512/885] 3509541=test_numeric I, [2024-05-17T20:00:00.809929 #3468197] INFO -- : [513/885] 3509541=test_common I, [2024-05-17T20:00:00.930848 #3468197] INFO -- : [514/885] 3509540=test_gem_spec_fetcher I, [2024-05-17T20:00:01.027421 #3468197] INFO -- : [515/885] 3509537=test_gem_command I, [2024-05-17T20:00:01.041031 #3468197] INFO -- : [516/885] 3509541=test_key_actor_vi I, [2024-05-17T20:00:01.083788 #3468197] INFO -- : [517/885] 3509537=test_bug-3571 I, [2024-05-17T20:00:01.097125 #3468197] INFO -- : [518/885] 3509537=test_hmac I, [2024-05-17T20:00:01.100012 #3468197] INFO -- : [519/885] 3509537=test_rdoc_markup_to_tt_only I, [2024-05-17T20:00:01.128508 #3468197] INFO -- : [520/885] 3509537=test_rdoc_tom_doc I, [2024-05-17T20:00:01.153446 #3468197] INFO -- : [521/885] 3509537=test_object_create_start I, [2024-05-17T20:00:01.155626 #3468197] INFO -- : [522/885] 3509537=test_command I, [2024-05-17T20:00:01.186831 #3468197] INFO -- : [523/885] 3509541=test_at_exit I, [2024-05-17T20:00:01.204914 #3468197] INFO -- : [524/885] 3509541=test_gem_ext_cargo_builder_unit I, [2024-05-17T20:00:01.215149 #3468197] INFO -- : [525/885] 3509541=test_date I, [2024-05-17T20:00:01.221680 #3468197] INFO -- : [526/885] 3509541=test_gem_rdoc I, [2024-05-17T20:00:01.255007 #3468197] INFO -- : [527/885] 3509547=test_rdoc_markup_paragraph I, [2024-05-17T20:00:01.260811 #3468197] INFO -- : [528/885] 3509547=test_enc_raise I, [2024-05-17T20:00:01.265021 #3468197] INFO -- : [529/885] 3509547=test_psych I, [2024-05-17T20:00:01.266554 #3468197] INFO -- : [530/885] 3509540=!Nothing_to_test I, [2024-05-17T20:00:01.268152 #3468197] INFO -- : [531/885] 3509540=test_kdf I, [2024-05-17T20:00:01.287094 #3468197] INFO -- : [532/885] 3509547=test_gem_doctor I, [2024-05-17T20:00:01.315685 #3468197] INFO -- : [533/885] 3509541=test_eval_history I, [2024-05-17T20:00:01.319659 #3468197] INFO -- : [534/885] 3509547=dispatcher_test I, [2024-05-17T20:00:01.328071 #3468197] INFO -- : [535/885] 3509541=test_kernel I, [2024-05-17T20:00:01.332927 #3468197] INFO -- : [536/885] 3509540=test_bug-5832 I, [2024-05-17T20:00:01.335018 #3468197] INFO -- : [537/885] 3509540=test_files_ext I, [2024-05-17T20:00:01.338789 #3468197] INFO -- : [538/885] 3509532=test_gem_silent_ui I, [2024-05-17T20:00:01.341671 #3468197] INFO -- : [539/885] 3509547=test_emitter I, [2024-05-17T20:00:01.346771 #3468197] INFO -- : [540/885] 3509547=test_rdoc_text I, [2024-05-17T20:00:01.381679 #3468197] INFO -- : [541/885] 3509547=test_iso_8859 I, [2024-05-17T20:00:01.415579 #3468197] INFO -- : [542/885] 3509547=test_tcp I, [2024-05-17T20:00:01.417595 #3468197] INFO -- : [543/885] 3509540=test_date_new I, [2024-05-17T20:00:01.428508 #3468197] INFO -- : [544/885] 3509540=index_write_test I, [2024-05-17T20:00:01.431134 #3468197] INFO -- : [545/885] 3509540=test_data I, [2024-05-17T20:00:01.437785 #3468197] INFO -- : [546/885] 3509540=test_require I, [2024-05-17T20:00:01.440825 #3468197] INFO -- : [547/885] 3509540=test_rdoc_markup_to_joined_paragraph I, [2024-05-17T20:00:01.450185 #3468197] INFO -- : [548/885] 3509547=test_date_time I, [2024-05-17T20:00:01.458877 #3468197] INFO -- : [549/885] 3509547=test_gem_safe_yaml I, [2024-05-17T20:00:01.464957 #3468197] INFO -- : [550/885] 3509537=test_syntax I, [2024-05-17T20:00:01.470194 #3468197] INFO -- : [551/885] 3509547=test_httpresponse I, [2024-05-17T20:00:01.522829 #3468197] INFO -- : [552/885] 3509547=test_open-uri I, [2024-05-17T20:00:01.541447 #3468197] INFO -- : [553/885] 3509532=test_rdoc_parser_ruby I, [2024-05-17T20:00:01.603905 #3468197] INFO -- : [554/885] 3509540=test_stream I, [2024-05-17T20:00:01.612927 #3468197] INFO -- : [555/885] 3509540=test_nil2vtempty I, [2024-05-17T20:00:01.617551 #3468197] INFO -- : [556/885] 3509540=test_rdoc_context I, [2024-05-17T20:00:01.782994 #3468197] INFO -- : [557/885] 3509547=test_gem_resolver_composed_set I, [2024-05-17T20:00:01.795924 #3468197] INFO -- : [558/885] 3509547=test_safe_load I, [2024-05-17T20:00:01.802888 #3468197] INFO -- : [559/885] 3509547=test_gem_resolver I, [2024-05-17T20:00:01.820446 #3468197] INFO -- : [560/885] 3509528=test_gem_commands_dependency_command I, [2024-05-17T20:00:01.957962 #3468197] INFO -- : [561/885] 3509528=test_name_error I, [2024-05-17T20:00:02.020548 #3468197] INFO -- : [562/885] 3509541=test_rdoc_markup_attribute_manager I, [2024-05-17T20:00:02.027140 #3468197] INFO -- : [563/885] 3509547=test_enumerator I, [2024-05-17T20:00:02.028572 #3468197] INFO -- : [564/885] 3509528=test_flags I, [2024-05-17T20:00:02.052845 #3468197] INFO -- : [565/885] 3509541=test_inadvertent_creation I, [2024-05-17T20:00:02.181820 #3468197] INFO -- : [566/885] 3509541=test_gem_commands_which_command I, [2024-05-17T20:00:02.191275 #3468197] INFO -- : [567/885] 3509545=test_shift_jis I, [2024-05-17T20:00:02.199322 #3468197] INFO -- : [568/885] 3509545=test_http I, [2024-05-17T20:00:02.207756 #3468197] INFO -- : [569/885] 3509541=test_gem_commands_specification_command I, [2024-05-17T20:00:02.218052 #3468197] INFO -- : [570/885] 3509545=test_logdevice I, [2024-05-17T20:00:02.276499 #3468197] INFO -- : [571/885] 3509536=test_arity I, [2024-05-17T20:00:02.282991 #3468197] INFO -- : [572/885] 3509536=test_gem_ext_rake_builder I, [2024-05-17T20:00:02.289752 #3468197] INFO -- : [573/885] 3509541=test_gc I, [2024-05-17T20:00:02.318006 #3468197] INFO -- : [574/885] 3509532=test_x509cert I, [2024-05-17T20:00:02.409308 #3468197] INFO -- : [575/885] 3509544=test_err_in_callback I, [2024-05-17T20:00:02.420963 #3468197] INFO -- : [576/885] 3509544=test_gem_resolver_lock_specification I, [2024-05-17T20:00:02.466543 #3468197] INFO -- : [577/885] 3509544=test_pack I, [2024-05-17T20:00:02.536118 #3468197] INFO -- : [578/885] 3509540=test_last_thread I, [2024-05-17T20:00:02.581364 #3468197] INFO -- : [579/885] 3509532=test_process I, [2024-05-17T20:00:02.626139 #3468197] INFO -- : [580/885] 3509534=test_gem_security_policy I, [2024-05-17T20:00:02.646011 #3468197] INFO -- : [581/885] 3509544=test_gem_source_local I, [2024-05-17T20:00:02.924063 #3468197] INFO -- : [582/885] 3509544=test_hash_create I, [2024-05-17T20:00:02.928211 #3468197] INFO -- : [583/885] 3509544=test_stringchar I, [2024-05-17T20:00:02.958291 #3468197] INFO -- : [584/885] 3509534=test_uncorrectable_name_check I, [2024-05-17T20:00:02.961533 #3468197] INFO -- : [585/885] 3509528=newline_test I, [2024-05-17T20:00:02.966894 #3468197] INFO -- : [586/885] 3509534=test_thread_fd_close I, [2024-05-17T20:00:02.968179 #3468197] INFO -- : [587/885] 3509534=test_passing_block I, [2024-05-17T20:00:02.973304 #3468197] INFO -- : [588/885] 3509534=test_rdoc_normal_module I, [2024-05-17T20:00:02.983938 #3468197] INFO -- : [589/885] 3509536=test_c_union_entity I, [2024-05-17T20:00:03.025082 #3468197] INFO -- : [590/885] 3509534=test_rdoc_markdown_test I, [2024-05-17T20:00:03.038789 #3468197] INFO -- : [591/885] 3509545=test_logperiod I, [2024-05-17T20:00:03.039361 #3468197] INFO -- : [592/885] 3509536=test_securerandom I, [2024-05-17T20:00:03.040186 #3468197] INFO -- : [593/885] 3509544=test_switch_hitter I, [2024-05-17T20:00:03.044111 #3468197] INFO -- : [594/885] 3509545=test_flush I, [2024-05-17T20:00:03.054239 #3468197] INFO -- : [595/885] 3509545=test_singleton I, [2024-05-17T20:00:03.056277 #3468197] INFO -- : [596/885] 3509544=test_io_console I, [2024-05-17T20:00:03.060063 #3468197] INFO -- : [597/885] 3509528=test_str2big I, [2024-05-17T20:00:03.060458 #3468197] INFO -- : [598/885] 3509545=test_dot_dot I, [2024-05-17T20:00:03.065777 #3468197] INFO -- : [599/885] 3509545=test_c_struct_builder I, [2024-05-17T20:00:03.068302 #3468197] INFO -- : [600/885] 3509528=test_literal I, [2024-05-17T20:00:03.073832 #3468197] INFO -- : [601/885] 3509536=test_thread I, [2024-05-17T20:00:03.130254 #3468197] INFO -- : [602/885] 3509539=test_socket I, [2024-05-17T20:00:03.235434 #3468197] INFO -- : [603/885] 3509545=test_objectspace I, [2024-05-17T20:00:03.292335 #3468197] INFO -- : [604/885] 3509536=test_rdoc_markup_to_table_of_contents I, [2024-05-17T20:00:03.323046 #3468197] INFO -- : [605/885] 3509536=test_require_lib I, [2024-05-17T20:00:03.622738 #3468197] INFO -- : [606/885] 3509540=test_gem_install_update_options I, [2024-05-17T20:00:03.720355 #3468197] INFO -- : [607/885] 3509540=parse_test I, [2024-05-17T20:00:03.731855 #3468197] INFO -- : [608/885] 3509528=test_ractor I, [2024-05-17T20:00:03.743748 #3468197] INFO -- : [609/885] 3509528=test_severity I, [2024-05-17T20:00:03.753056 #3468197] INFO -- : [610/885] 3509528=test_gem_stream_ui I, [2024-05-17T20:00:03.800381 #3468197] INFO -- : [611/885] 3509538=test_rdoc_generator_ri I, [2024-05-17T20:00:03.812584 #3468197] INFO -- : [612/885] 3509538=test_extlibs I, [2024-05-17T20:00:03.844522 #3468197] INFO -- : [613/885] 3509528=test_ractor I, [2024-05-17T20:00:03.925196 #3468197] INFO -- : [614/885] 3509528=test_m17n_comb I, [2024-05-17T20:00:03.958460 #3468197] INFO -- : [615/885] 3509529=test_memory_view I, [2024-05-17T20:00:03.994003 #3468197] INFO -- : [616/885] 3509529=test_rdoc_markup_to_markdown I, [2024-05-17T20:00:04.170274 #3468197] INFO -- : [617/885] 3509529=test_json_tree I, [2024-05-17T20:00:04.183913 #3468197] INFO -- : [618/885] 3509545=test_rdoc_generator_pot_po I, [2024-05-17T20:00:04.186184 #3468197] INFO -- : [619/885] 3509545=test_ansi_with_terminfo I, [2024-05-17T20:00:04.188124 #3468197] INFO -- : [620/885] 3509529=test_parser_events I, [2024-05-17T20:00:04.200076 #3468197] INFO -- : [621/885] 3509545=test_reline I, [2024-05-17T20:00:04.257469 #3468197] INFO -- : [622/885] 3509529=test_case I, [2024-05-17T20:00:04.257533 #3468197] INFO -- : [623/885] 3509529=test_pkey I, [2024-05-17T20:00:04.298299 #3468197] INFO -- : [624/885] 3509534=test_gem_request_connection_pools I, [2024-05-17T20:00:04.307371 #3468197] INFO -- : [625/885] 3509529=test_grapheme_breaks I, [2024-05-17T20:00:04.333550 #3468197] INFO -- : [626/885] 3509529=test_gem_version_option I, [2024-05-17T20:00:04.409406 #3468197] INFO -- : [627/885] 3509539=test_cclass I, [2024-05-17T20:00:04.472246 #3468197] INFO -- : [628/885] 3509539=test_scan_args I, [2024-05-17T20:00:04.473730 #3468197] INFO -- : [629/885] 3509539=test_win32ole I, [2024-05-17T20:00:04.482976 #3468197] INFO -- : [630/885] 3509539=test_generic I, [2024-05-17T20:00:04.520712 #3468197] INFO -- : [631/885] 3509539=test_settracefunc I, [2024-05-17T20:00:04.521242 #3468197] INFO -- : [632/885] 3509529=test_gem_text I, [2024-05-17T20:00:04.546804 #3468197] INFO -- : [633/885] 3509545=test_enumerator_kw I, [2024-05-17T20:00:04.550022 #3468197] INFO -- : [634/885] 3509545=test_gem_ext_cargo_builder_link_flag_converter I, [2024-05-17T20:00:04.567930 #3468197] INFO -- : [635/885] 3509529=test_gem_commands_mirror I, [2024-05-17T20:00:04.572926 #3468197] INFO -- : [636/885] 3509529=test_sprintf_comb I, [2024-05-17T20:00:04.610627 #3468197] INFO -- : [637/885] 3509545=test_method_cache I, [2024-05-17T20:00:04.614955 #3468197] INFO -- : [638/885] 3509545=test_gem_request I, [2024-05-17T20:00:04.724424 #3468197] INFO -- : [639/885] 3509529=test_exception I, [2024-05-17T20:00:04.776906 #3468197] INFO -- : [640/885] 3509545=test_rand I, [2024-05-17T20:00:04.791110 #3468197] INFO -- : [641/885] 3509535=test_gem_package_tar_reader_entry I, [2024-05-17T20:00:05.040218 #3468197] INFO -- : [642/885] 3509542=test_gem_name_tuple I, [2024-05-17T20:00:05.067861 #3468197] INFO -- : [643/885] 3509542=test_bug_reporter I, [2024-05-17T20:00:05.097463 #3468197] INFO -- : [644/885] 3509535=test_gem_dependency_installer I, [2024-05-17T20:00:05.127098 #3468197] INFO -- : [645/885] 3509545=test_scalar I, [2024-05-17T20:00:05.140423 #3468197] INFO -- : [646/885] 3509545=test_gem_commands_info_command I, [2024-05-17T20:00:05.156879 #3468197] INFO -- : [647/885] 3509545=test_rdoc_cross_reference I, [2024-05-17T20:00:05.348305 #3468197] INFO -- : [648/885] 3509534=test_store I, [2024-05-17T20:00:05.471035 #3468197] INFO -- : [649/885] 3509542=test_case_options I, [2024-05-17T20:00:05.483736 #3468197] INFO -- : [650/885] 3509542=test_recorder I, [2024-05-17T20:00:05.498074 #3468197] INFO -- : [651/885] 3509542=test_gem_source_vendor I, [2024-05-17T20:00:05.501802 #3468197] INFO -- : [652/885] 3509542=test_gem_commands_owner_command I, [2024-05-17T20:00:05.518979 #3468197] INFO -- : [653/885] 3509539=test_deprecate I, [2024-05-17T20:00:05.547639 #3468197] INFO -- : [654/885] 3509539=test_rdoc_constant I, [2024-05-17T20:00:05.554629 #3468197] INFO -- : [655/885] 3509538=test_bash_completion I, [2024-05-17T20:00:05.560312 #3468197] INFO -- : [656/885] 3509538=test_formatter I, [2024-05-17T20:00:05.563440 #3468197] INFO -- : [657/885] 3509538=test_rdoc_any_method I, [2024-05-17T20:00:05.599864 #3468197] INFO -- : [658/885] 3509545=test_modify_expand I, [2024-05-17T20:00:05.603902 #3468197] INFO -- : [659/885] 3509545=test_rdoc_markdown I, [2024-05-17T20:00:05.609891 #3468197] INFO -- : [660/885] 3509534=test_gem_available_set I, [2024-05-17T20:00:05.736550 #3468197] INFO -- : [661/885] 3509534=test_file I, [2024-05-17T20:00:05.741479 #3468197] INFO -- : [662/885] 3509534=regexp_test I, [2024-05-17T20:00:05.748408 #3468197] INFO -- : [663/885] 3509534=test_gem_package_tar_reader I, [2024-05-17T20:00:05.785731 #3468197] INFO -- : [664/885] 3509534=test_coverage I, [2024-05-17T20:00:05.790708 #3468197] INFO -- : [665/885] 3509544=test_rdoc_encoding I, [2024-05-17T20:00:05.813130 #3468197] INFO -- : [666/885] 3509539=test_pathname I, [2024-05-17T20:00:05.820055 #3468197] INFO -- : [667/885] 3509544=test_init I, [2024-05-17T20:00:05.852426 #3468197] INFO -- : [668/885] 3509545=test_complexrational I, [2024-05-17T20:00:05.857034 #3468197] INFO -- : [669/885] 3509545=test_ractor I, [2024-05-17T20:00:05.909875 #3468197] INFO -- : [670/885] 3509538=test_find I, [2024-05-17T20:00:05.926617 #3468197] INFO -- : [671/885] 3509538=test_fiddle I, [2024-05-17T20:00:05.948238 #3468197] INFO -- : [672/885] 3509528=test_wss I, [2024-05-17T20:00:05.951755 #3468197] INFO -- : [673/885] 3509545=test_gem_commands_contents_command I, [2024-05-17T20:00:05.970035 #3468197] INFO -- : [674/885] 3509528=test_gem_ext_cmake_builder I, [2024-05-17T20:00:05.983067 #3468197] INFO -- : [675/885] 3509538=test_require I, [2024-05-17T20:00:05.987226 #3468197] INFO -- : [676/885] 3509528=test_cgi_util I, [2024-05-17T20:00:06.027949 #3468197] INFO -- : [677/885] 3509545=test_marshalable I, [2024-05-17T20:00:06.032736 #3468197] INFO -- : [678/885] 3509545=test_digest I, [2024-05-17T20:00:06.078568 #3468197] INFO -- : [679/885] 3509539=test_pstore I, [2024-05-17T20:00:06.109237 #3468197] INFO -- : [680/885] 3509542=test_cstr I, [2024-05-17T20:00:06.122569 #3468197] INFO -- : [681/885] 3509539=test_profile_frames I, [2024-05-17T20:00:06.173931 #3468197] INFO -- : [682/885] 3509544=test_class2name I, [2024-05-17T20:00:06.180282 #3468197] INFO -- : [683/885] 3509544=test_gbk I, [2024-05-17T20:00:06.184003 #3468197] INFO -- : [684/885] 3509544=test_enc_str_buf_cat I, [2024-05-17T20:00:06.195901 #3468197] INFO -- : [685/885] 3509544=test_comparable I, [2024-05-17T20:00:06.197888 #3468197] INFO -- : [686/885] 3509544=test_rdoc_parser_c I, [2024-05-17T20:00:06.265971 #3468197] INFO -- : [687/885] 3509528=test_io_timeout I, [2024-05-17T20:00:06.272030 #3468197] INFO -- : [688/885] 3509528=test_shapes I, [2024-05-17T20:00:06.276148 #3468197] INFO -- : [689/885] 3509528=json_fixtures_test I, [2024-05-17T20:00:06.276964 #3468197] INFO -- : [690/885] 3509533=test_euc_tw I, [2024-05-17T20:00:06.281658 #3468197] INFO -- : [691/885] 3509533=test_ractor I, [2024-05-17T20:00:06.286982 #3468197] INFO -- : [692/885] 3509528=test_bmethod I, [2024-05-17T20:00:06.301005 #3468197] INFO -- : [693/885] 3509539=test_ansi_without_terminfo I, [2024-05-17T20:00:06.303748 #3468197] INFO -- : [694/885] 3509533=test_gem_commands_sources_command I, [2024-05-17T20:00:06.306194 #3468197] INFO -- : [695/885] 3509540=test_thread_queue I, [2024-05-17T20:00:06.309397 #3468197] INFO -- : [696/885] 3509539=test_nowrite I, [2024-05-17T20:00:06.320601 #3468197] INFO -- : [697/885] 3509528=test_rdoc_markup_formatter I, [2024-05-17T20:00:06.327563 #3468197] INFO -- : [698/885] 3509539=test_forwardable I, [2024-05-17T20:00:06.342635 #3468197] INFO -- : [699/885] 3509528=test_yaml I, [2024-05-17T20:00:06.345742 #3468197] INFO -- : [700/885] 3509539=test_wait I, [2024-05-17T20:00:06.354843 #3468197] INFO -- : [701/885] 3509543=test_handle I, [2024-05-17T20:00:06.410369 #3468197] INFO -- : [702/885] 3509539=test_big2str I, [2024-05-17T20:00:06.418306 #3468197] INFO -- : [703/885] 3509539=test_scanner_events I, [2024-05-17T20:00:06.444716 #3468197] INFO -- : [704/885] 3509543=test_gem_resolver_installed_specification I, [2024-05-17T20:00:06.450052 #3468197] INFO -- : [705/885] 3509539=test_parse I, [2024-05-17T20:00:06.455146 #3468197] INFO -- : [706/885] 3509528=test_mdns I, [2024-05-17T20:00:06.474847 #3468197] INFO -- : [707/885] 3509528=test_gem_remote_fetcher I, [2024-05-17T20:00:06.480532 #3468197] INFO -- : [708/885] 3509544=test_inlinecache I, [2024-05-17T20:00:06.491480 #3468197] INFO -- : [709/885] 3509533=test_rdoc_markup_verbatim I, [2024-05-17T20:00:06.511981 #3468197] INFO -- : [710/885] 3509533=test_path_to_class I, [2024-05-17T20:00:06.513166 #3468197] INFO -- : [711/885] 3509533=test_gem_resolver_specification I, [2024-05-17T20:00:06.526240 #3468197] INFO -- : [712/885] 3509533=test_gem_dependency I, [2024-05-17T20:00:06.544713 #3468197] INFO -- : [713/885] 3509544=test_frozen_error I, [2024-05-17T20:00:06.548367 #3468197] INFO -- : [714/885] 3509544=test_method_cache I, [2024-05-17T20:00:06.548603 #3468197] INFO -- : [715/885] 3509544=test_gem_stub_specification I, [2024-05-17T20:00:06.614709 #3468197] INFO -- : [716/885] 3509543=test_gem_ext_ext_conf_builder I, [2024-05-17T20:00:06.630894 #3468197] INFO -- : [717/885] 3509533=test_complex I, [2024-05-17T20:00:06.670393 #3468197] INFO -- : [718/885] 3509542=test_gem_commands_search_command I, [2024-05-17T20:00:06.680579 #3468197] INFO -- : [719/885] 3509542=test_fileutils I, [2024-05-17T20:00:06.686300 #3468197] INFO -- : [720/885] 3509544=test_string_processing I, [2024-05-17T20:00:06.690579 #3468197] INFO -- : [721/885] 3509544=test_ldap I, [2024-05-17T20:00:06.715742 #3468197] INFO -- : [722/885] 3509544=test_emitter I, [2024-05-17T20:00:06.717503 #3468197] INFO -- : [723/885] 3509529=test_resource I, [2024-05-17T20:00:06.719060 #3468197] INFO -- : [724/885] 3509544=test_gem_commands_signin_command I, [2024-05-17T20:00:06.748885 #3468197] INFO -- : [725/885] 3509529=test_gem_version I, [2024-05-17T20:00:06.758670 #3468197] INFO -- : [726/885] 3509533=test_econv I, [2024-05-17T20:00:06.780528 #3468197] INFO -- : [727/885] 3509534=test_cesu8 I, [2024-05-17T20:00:06.800121 #3468197] INFO -- : [728/885] 3509534=test_rdoc_options I, [2024-05-17T20:00:06.820300 #3468197] INFO -- : [729/885] 3509529=test_too_many_dummy_encodings I, [2024-05-17T20:00:06.836172 #3468197] INFO -- : [730/885] 3509544=test_gem_commands_list_command I, [2024-05-17T20:00:06.851346 #3468197] INFO -- : [731/885] 3509544=test_stack I, [2024-05-17T20:00:06.886371 #3468197] INFO -- : [732/885] 3509529=test_rdoc_include I, [2024-05-17T20:00:06.923468 #3468197] INFO -- : [733/885] 3509545=test_reqarg I, [2024-05-17T20:00:06.964068 #3468197] INFO -- : [734/885] 3509529=test_internal_ivar I, [2024-05-17T20:00:06.970542 #3468197] INFO -- : [735/885] 3509529=test_gem_resolver_index_specification I, [2024-05-17T20:00:07.013166 #3468197] INFO -- : [736/885] 3509542=test_duplicate I, [2024-05-17T20:00:07.019618 #3468197] INFO -- : [737/885] 3509542=test_utf32 I, [2024-05-17T20:00:07.025209 #3468197] INFO -- : [738/885] 3509542=test_basicsocket I, [2024-05-17T20:00:07.035791 #3468197] INFO -- : [739/885] 3509542=test_prettyprint I, [2024-05-17T20:00:07.045088 #3468197] INFO -- : [740/885] 3509539=test_tracepoint I, [2024-05-17T20:00:07.045943 #3468197] INFO -- : [741/885] 3509534=test_rdoc_markup I, [2024-05-17T20:00:07.049466 #3468197] INFO -- : [742/885] 3509529=test_gem_commands_help_command I, [2024-05-17T20:00:07.061620 #3468197] INFO -- : [743/885] 3509534=test_tempfile I, [2024-05-17T20:00:07.062792 #3468197] INFO -- : [744/885] 3509542=parse_comments_test I, [2024-05-17T20:00:07.072800 #3468197] INFO -- : [745/885] 3509536=test_noarg I, [2024-05-17T20:00:07.166807 #3468197] INFO -- : [746/885] 3509529=test_function I, [2024-05-17T20:00:07.175678 #3468197] INFO -- : [747/885] 3509538=test_queue I, [2024-05-17T20:00:07.176834 #3468197] INFO -- : [748/885] 3509542=test_irb I, [2024-05-17T20:00:07.188500 #3468197] INFO -- : [749/885] 3509538=json_string_matching_test I, [2024-05-17T20:00:07.190315 #3468197] INFO -- : [750/885] 3509538=test_load I, [2024-05-17T20:00:07.199990 #3468197] INFO -- : [751/885] 3509538=test_class I, [2024-05-17T20:00:07.231426 #3468197] INFO -- : [752/885] 3509536=test_rdoc_normal_class I, [2024-05-17T20:00:07.258293 #3468197] INFO -- : [753/885] 3509539=test_const I, [2024-05-17T20:00:07.264991 #3468197] INFO -- : [754/885] 3509539=test_asn1 I, [2024-05-17T20:00:07.276938 #3468197] INFO -- : [755/885] 3509536=test_random I, [2024-05-17T20:00:07.281805 #3468197] INFO -- : [756/885] 3509536=test_yamlstore I, [2024-05-17T20:00:07.284696 #3468197] INFO -- : [757/885] 3509539=test_gem_installer I, [2024-05-17T20:00:07.304432 #3468197] INFO -- : [758/885] 3509536=test_date_strftime I, [2024-05-17T20:00:07.340411 #3468197] INFO -- : [759/885] 3509545=test_rdoc_parser_rd I, [2024-05-17T20:00:07.355945 #3468197] INFO -- : [760/885] 3509545=test_ftp I, [2024-05-17T20:00:07.361336 #3468197] INFO -- : [761/885] 3509545=test_euc_kr I, [2024-05-17T20:00:07.366822 #3468197] INFO -- : [762/885] 3509545=test_rdoc_context_section I, [2024-05-17T20:00:07.375560 #3468197] INFO -- : [763/885] 3509534=test_gem_commands_query_command I, [2024-05-17T20:00:07.385589 #3468197] INFO -- : [764/885] 3509545=test_method I, [2024-05-17T20:00:07.398102 #3468197] INFO -- : [765/885] 3509529=test_rdoc_rubygems_hook I, [2024-05-17T20:00:07.445737 #3468197] INFO -- : [766/885] 3509535=test_pattern_key_name_check I, [2024-05-17T20:00:07.453118 #3468197] INFO -- : [767/885] 3509535=test_to_ruby I, [2024-05-17T20:00:07.473783 #3468197] INFO -- : [768/885] 3509529=test_gem_impossible_dependencies_error I, [2024-05-17T20:00:07.476637 #3468197] INFO -- : [769/885] 3509535=test_pack I, [2024-05-17T20:00:07.481303 #3468197] INFO -- : [770/885] 3509529=test_array_create I, [2024-05-17T20:00:07.483526 #3468197] INFO -- : [771/885] 3509529=test_sorted_set I, [2024-05-17T20:00:07.611565 #3468197] INFO -- : [772/885] 3509544=test_emoji I, [2024-05-17T20:00:07.626276 #3468197] INFO -- : [773/885] 3509544=test_win32ole_type_event I, [2024-05-17T20:00:07.626954 #3468197] INFO -- : [774/885] 3509544=test_hash I, [2024-05-17T20:00:07.648831 #3468197] INFO -- : [775/885] 3509542=test_ubf_async_safe I, [2024-05-17T20:00:07.657448 #3468197] INFO -- : [776/885] 3509542=test_io I, [2024-05-17T20:00:07.699752 #3468197] INFO -- : [777/885] 3509535=test_cp949 I, [2024-05-17T20:00:07.711754 #3468197] INFO -- : [778/885] 3509535=test_gem_commands_uninstall_command I, [2024-05-17T20:00:07.723107 #3468197] INFO -- : [779/885] 3509533=test_condition I, [2024-05-17T20:00:07.725595 #3468197] INFO -- : [780/885] 3509529=test_gem_source_specific_file I, [2024-05-17T20:00:07.728646 #3468197] INFO -- : [781/885] 3509533=test_foreach I, [2024-05-17T20:00:07.730030 #3468197] INFO -- : [782/885] 3509536=test_gem_unsatisfiable_dependency_error I, [2024-05-17T20:00:07.730713 #3468197] INFO -- : [783/885] 3509533=test_win32ole_record I, [2024-05-17T20:00:07.736467 #3468197] INFO -- : [784/885] 3509533=test_type_completor I, [2024-05-17T20:00:07.737711 #3468197] INFO -- : [785/885] 3509533=test_console_attr I, [2024-05-17T20:00:07.738902 #3468197] INFO -- : [786/885] 3509533=test_summary I, [2024-05-17T20:00:07.743410 #3468197] INFO -- : [787/885] 3509536=test_ellipsize I, [2024-05-17T20:00:07.760148 #3468197] INFO -- : [788/885] 3509536=test_date_attr I, [2024-05-17T20:00:07.763636 #3468197] INFO -- : [789/885] 3509536=test_io_wait I, [2024-05-17T20:00:07.836238 #3468197] INFO -- : [790/885] 3509529=test_gem_commands_exec_command I, [2024-05-17T20:00:07.852385 #3468197] INFO -- : [791/885] 3509543=warnings_test I, [2024-05-17T20:00:07.877123 #3468197] INFO -- : [792/885] 3509533=test_kwargs I, [2024-05-17T20:00:07.884444 #3468197] INFO -- : [793/885] 3509533=test_ws I, [2024-05-17T20:00:07.895086 #3468197] INFO -- : [794/885] 3509542=test_gem_commands_environment_command I, [2024-05-17T20:00:07.903146 #3468197] INFO -- : [795/885] 3509533=test_m17n I, [2024-05-17T20:00:07.940281 #3468197] INFO -- : [796/885] 3509542=test_workspace I, [2024-05-17T20:00:07.955306 #3468197] INFO -- : [797/885] 3509543=test_weakmap I, [2024-05-17T20:00:07.967070 #3468197] INFO -- : [798/885] 3509533=test_yjit I, [2024-05-17T20:00:07.967496 #3468197] INFO -- : [799/885] 3509533=test_kill_ring I, [2024-05-17T20:00:07.976753 #3468197] INFO -- : [800/885] 3509533=test_framework I, [2024-05-17T20:00:07.989575 #3468197] INFO -- : [801/885] 3509533=test_ns_spki I, [2024-05-17T20:00:08.001528 #3468197] INFO -- : [802/885] 3509534=test_argf I, [2024-05-17T20:00:08.008171 #3468197] INFO -- : [803/885] 3509533=test_gem_request_set_lockfile I, [2024-05-17T20:00:08.035633 #3468197] INFO -- : [804/885] 3509537=test_raise_exception I, [2024-05-17T20:00:08.097371 #3468197] INFO -- : [805/885] 3509536=test_protect I, [2024-05-17T20:00:08.102516 #3468197] INFO -- : [806/885] 3509542=test_win32ole_typelib I, [2024-05-17T20:00:08.108711 #3468197] INFO -- : [807/885] 3509542=test_gem_resolver_dependency_request I, [2024-05-17T20:00:08.109225 #3468197] INFO -- : [808/885] 3509536=test_tree_builder I, [2024-05-17T20:00:08.116060 #3468197] INFO -- : [809/885] 3509536=test_hash I, [2024-05-17T20:00:08.126776 #3468197] INFO -- : [810/885] 3509536=test_postponed_job I, [2024-05-17T20:00:08.183238 #3468197] INFO -- : [811/885] 3509542=test_alias_and_anchor I, [2024-05-17T20:00:08.189966 #3468197] INFO -- : [812/885] 3509542=test_external_new I, [2024-05-17T20:00:08.199236 #3468197] INFO -- : [813/885] 3509542=test_show_source I, [2024-05-17T20:00:08.208975 #3468197] INFO -- : [814/885] 3509542=test_set I, [2024-05-17T20:00:08.210306 #3468197] INFO -- : [815/885] 3509542=test_lock_native_thread I, [2024-05-17T20:00:08.333796 #3468197] INFO -- : [816/885] 3509533=test_c_struct_entry I, [2024-05-17T20:00:08.438087 #3468197] INFO -- : [817/885] 3509541=test_gem_commands_stale_command I, [2024-05-17T20:00:08.444530 #3468197] INFO -- : [818/885] 3509535=test_remote_fetch_error I, [2024-05-17T20:00:08.445031 #3468197] INFO -- : [819/885] 3509541=test_have_library I, [2024-05-17T20:00:08.470182 #3468197] INFO -- : [820/885] 3509535=ripper_test I, [2024-05-17T20:00:08.500911 #3468197] INFO -- : [821/885] 3509536=test_objspace I, [2024-05-17T20:00:08.512608 #3468197] INFO -- : [822/885] 3509528=test_line_editor I, [2024-05-17T20:00:08.521331 #3468197] INFO -- : [823/885] 3509528=test_undef I, [2024-05-17T20:00:08.526325 #3468197] INFO -- : [824/885] 3509542=test_string_memory I, [2024-05-17T20:00:08.532119 #3468197] INFO -- : [825/885] 3509528=comments_test I, [2024-05-17T20:00:08.539704 #3468197] INFO -- : [826/885] 3509528=test_gem_requirement I, [2024-05-17T20:00:08.591844 #3468197] INFO -- : [827/885] 3509542=test_sprintf I, [2024-05-17T20:00:08.645316 #3468197] INFO -- : [828/885] 3509528=test_gem_security_trust_dir I, [2024-05-17T20:00:08.685299 #3468197] INFO -- : [829/885] 3509528=test_stringscanner I, [2024-05-17T20:00:08.692543 #3468197] INFO -- : [830/885] 3509533=test_files_sample I, [2024-05-17T20:00:08.705396 #3468197] INFO -- : [831/885] 3509537=test_rdoc_alias I, [2024-05-17T20:00:08.713892 #3468197] INFO -- : [832/885] 3509528=test_yield I, [2024-05-17T20:00:08.723880 #3468197] INFO -- : [833/885] 3509537=test_convertible I, [2024-05-17T20:00:08.731410 #3468197] INFO -- : [834/885] 3509529=parser_test I, [2024-05-17T20:00:08.800895 #3468197] INFO -- : [835/885] 3509533=test_optparse I, [2024-05-17T20:00:08.801097 #3468197] INFO -- : [836/885] 3509533=test_array I, [2024-05-17T20:00:08.813620 #3468197] INFO -- : [837/885] 3509529=test_fstring I, [2024-05-17T20:00:08.837530 #3468197] INFO -- : [838/885] 3509533=test_rdoc_markup_to_html_crossref I, [2024-05-17T20:00:08.887242 #3468197] INFO -- : [839/885] 3509542=test_gem_resolver_best_set I, [2024-05-17T20:00:08.958976 #3468197] INFO -- : [840/885] 3509529=encoding_test I, [2024-05-17T20:00:08.969479 #3468197] INFO -- : [841/885] 3509542=test_typeddata I, [2024-05-17T20:00:09.041110 #3468197] INFO -- : [842/885] 3509529=test_rat I, [2024-05-17T20:00:09.049602 #3468197] INFO -- : [843/885] 3509529=test_webauthn_poller I, [2024-05-17T20:00:09.125530 #3468197] INFO -- : [844/885] 3509535=test_rdoc_markup_raw I, [2024-05-17T20:00:09.152973 #3468197] INFO -- : [845/885] 3509535=test_rdoc_require I, [2024-05-17T20:00:09.166960 #3468197] INFO -- : [846/885] 3509535=locals_test I, [2024-05-17T20:00:09.191685 #3468197] INFO -- : [847/885] 3509529=test_readpartial I, [2024-05-17T20:00:09.243957 #3468197] INFO -- : [848/885] 3509542=test_gem_commands_install_command I, [2024-05-17T20:00:09.245835 #3468197] INFO -- : [849/885] 3509533=test_clone I, [2024-05-17T20:00:09.469750 #3468197] INFO -- : [850/885] 3509533=test_gem_resolver_conflict I, [2024-05-17T20:00:09.475982 #3468197] INFO -- : [851/885] 3509533=test_rdoc_task I, [2024-05-17T20:00:09.480118 #3468197] INFO -- : [852/885] 3509535=ruby_parser_test I, [2024-05-17T20:00:09.481457 #3468197] INFO -- : [853/885] 3509533=test_backtrace I, [2024-05-17T20:00:09.498473 #3468197] INFO -- : [854/885] 3509535=test_pack I, [2024-05-17T20:00:09.513572 #3468197] INFO -- : [855/885] 3509535=test_io_buffer I, [2024-05-17T20:00:09.516876 #3468197] INFO -- : [856/885] 3509538=test_rdoc_markup_indented_paragraph I, [2024-05-17T20:00:09.524055 #3468197] INFO -- : [857/885] 3509538=test_io I, [2024-05-17T20:00:09.596587 #3468197] INFO -- : [858/885] 3509529=test_unicode_escape I, [2024-05-17T20:00:09.618992 #3468197] INFO -- : [859/885] 3509535=test_utf16 I, [2024-05-17T20:00:09.627375 #3468197] INFO -- : [860/885] 3509535=test_autoload I, [2024-05-17T20:00:09.643089 #3468197] INFO -- : [861/885] 3509541=test_rendering I, [2024-05-17T20:00:09.647732 #3468197] INFO -- : [862/885] 3509541=test_sizeof I, [2024-05-17T20:00:09.707760 #3468197] INFO -- : [863/885] 3509529=test_case I, [2024-05-17T20:00:09.724769 #3468197] INFO -- : [864/885] 3509529=test_face I, [2024-05-17T20:00:09.788110 #3468197] INFO -- : [865/885] 3509529=test_yaml_tree I, [2024-05-17T20:00:09.817961 #3468197] INFO -- : [866/885] 3509529=test_sleep I, [2024-05-17T20:00:10.553126 #3468197] INFO -- : [867/885] 3509542=test_config I, [2024-05-17T20:00:10.609701 #3468197] INFO -- : [868/885] 3509542=test_libs I, [2024-05-17T20:00:10.636963 #3468197] INFO -- : [869/885] 3509542=test_gem_commands_fetch_command I, [2024-05-17T20:00:10.756845 #3468197] INFO -- : [870/885] 3509533=test_math I, [2024-05-17T20:00:10.763004 #3468197] INFO -- : [871/885] 3509542=test_gc I, [2024-05-17T20:00:10.764266 #3468197] INFO -- : [872/885] 3509542=test_getopts I, [2024-05-17T20:00:10.766329 #3468197] INFO -- : [873/885] 3509533=test_protocol I, [2024-05-17T20:00:10.770440 #3468197] INFO -- : [874/885] 3509542=test_gem_resolver_activation_request I, [2024-05-17T20:00:10.779706 #3468197] INFO -- : [875/885] 3509542=test_gem_config_file I, [2024-05-17T20:00:10.790892 #3468197] INFO -- : [876/885] 3509540=test_ripper I, [2024-05-17T20:00:10.867936 #3468197] INFO -- : [877/885] 3509542=test_etc I, [2024-05-17T20:00:10.925116 #3468197] INFO -- : [878/885] 3509542=test_yjit_exit_locations I, [2024-05-17T20:00:10.926970 #3468197] INFO -- : [879/885] 3509542=test_system I, [2024-05-17T20:00:11.089035 #3468197] INFO -- : [880/885] 3509533=test_pkcs12 I, [2024-05-17T20:00:11.112377 #3468197] INFO -- : [881/885] 3509528=test_gem_package_tar_header I, [2024-05-17T20:00:11.154875 #3468197] INFO -- : [882/885] 3509528=test_gem_util I, [2024-05-17T20:00:11.180461 #3468197] INFO -- : [883/885] 3509540=test_iseq_load I, [2024-05-17T20:00:11.210310 #3468197] INFO -- : [884/885] 3509530=test_pkey_dh I, [2024-05-17T20:00:11.282673 #3468197] INFO -- : [885/885] 3509543=test_bigzero I, [2024-05-17T20:00:28.036768 #3468197] INFO -- : Finished tests in 36.862153s, 715.3407 tests/s, 253784.9332 assertions/s. I, [2024-05-17T20:00:28.037579 #3468197] INFO -- : 26369 tests, 9355059 assertions, 0 failures, 0 errors, 306 skips I, [2024-05-17T20:00:28.037612 #3468197] INFO -- : I, [2024-05-17T20:00:28.037620 #3468197] INFO -- : ruby -v: ruby 3.4.0dev (2024-05-17T15:29:00Z master e61d24d77e) [x86_64-linux] I, [2024-05-17T20:00:28.040040 #3468197] INFO -- : $$$[end] "make yes-test-all TESTOPTS='--stderr-on-failure' TESTS='-j20'" exit with 0. I, [2024-05-17T20:00:28.040172 #3468197] INFO -- : $$$[beg] make yes-test-rubyspec MSPECOPT='--error-output stderr --debug -j' TESTS='-j20' I, [2024-05-17T20:00:28.130810 #3468197] INFO -- : BASERUBY = /usr/bin/ruby --disable=gems I, [2024-05-17T20:00:28.130853 #3468197] INFO -- : CC = gcc I, [2024-05-17T20:00:28.130860 #3468197] INFO -- : LD = ld I, [2024-05-17T20:00:28.130864 #3468197] INFO -- : LDSHARED = gcc -shared I, [2024-05-17T20:00:28.130868 #3468197] INFO -- : CFLAGS = -O3 -fno-fast-math -ggdb3 -Wall -Wextra -Wdeprecated-declarations -Wdiv-by-zero -Wduplicated-cond -Wimplicit-function-declaration -Wimplicit-int -Wpointer-arith -Wwrite-strings -Wold-style-definition -Wimplicit-fallthrough=0 -Wmissing-noreturn -Wno-cast-function-type -Wno-constant-logical-operand -Wno-long-long -Wno-missing-field-initializers -Wno-overlength-strings -Wno-packed-bitfield-compat -Wno-parentheses-equality -Wno-self-assign -Wno-tautological-compare -Wno-unused-parameter -Wno-unused-value -Wsuggest-attribute=format -Wsuggest-attribute=noreturn -Wunused-variable -Wmisleading-indentation -Wundef -fPIC I, [2024-05-17T20:00:28.130874 #3468197] INFO -- : XCFLAGS = -U_FORTIFY_SOURCE -D_FORTIFY_SOURCE=2 -fstack-protector-strong -fno-strict-overflow -fvisibility=hidden -fexcess-precision=standard -DRUBY_EXPORT -I. -I.ext/include/x86_64-linux -I/tmp/ruby/src/trunk/include -I/tmp/ruby/src/trunk -I/tmp/ruby/src/trunk/prism -I/tmp/ruby/src/trunk/enc/unicode/15.0.0 I, [2024-05-17T20:00:28.130878 #3468197] INFO -- : CPPFLAGS = I, [2024-05-17T20:00:28.130882 #3468197] INFO -- : DLDFLAGS = -Wl,--compress-debug-sections=zlib -Wl,-soname,libruby.so.3.4 -fstack-protector-strong I, [2024-05-17T20:00:28.130886 #3468197] INFO -- : SOLIBS = -lz -lrt -lrt -lgmp -ldl -lcrypt -lm -lpthread I, [2024-05-17T20:00:28.130890 #3468197] INFO -- : LANG = en_US.UTF-8 I, [2024-05-17T20:00:28.130894 #3468197] INFO -- : LC_ALL = I, [2024-05-17T20:00:28.130897 #3468197] INFO -- : LC_CTYPE = I, [2024-05-17T20:00:28.130901 #3468197] INFO -- : MFLAGS = I, [2024-05-17T20:00:28.130904 #3468197] INFO -- : RUSTC = no I, [2024-05-17T20:00:28.130908 #3468197] INFO -- : YJIT_RUSTC_ARGS = --crate-name=yjit --crate-type=staticlib --edition=2021 -g -C lto=thin -C opt-level=3 -C overflow-checks=on '--out-dir=/tmp/ruby/build/trunk/yjit/target/release/' /tmp/ruby/src/trunk/yjit/src/lib.rs I, [2024-05-17T20:00:28.131470 #3468197] INFO -- : gcc (Ubuntu 11.4.0-1ubuntu1~22.04) 11.4.0 I, [2024-05-17T20:00:28.131477 #3468197] INFO -- : Copyright (C) 2021 Free Software Foundation, Inc. I, [2024-05-17T20:00:28.131481 #3468197] INFO -- : This is free software; see the source for copying conditions. There is NO I, [2024-05-17T20:00:28.131485 #3468197] INFO -- : warranty; not even for MERCHANTABILITY or FITNESS FOR A PARTICULAR PURPOSE. I, [2024-05-17T20:00:28.131489 #3468197] INFO -- : I, [2024-05-17T20:00:28.133221 #3468197] INFO -- : generating enc.mk I, [2024-05-17T20:00:28.250069 #3468197] INFO -- : making enc I, [2024-05-17T20:00:28.267335 #3468197] INFO -- : make[1]: Entering directory '/tmp/ruby/build/trunk' I, [2024-05-17T20:00:28.267356 #3468197] INFO -- : make[1]: Nothing to be done for 'enc'. I, [2024-05-17T20:00:28.267362 #3468197] INFO -- : make[1]: Leaving directory '/tmp/ruby/build/trunk' I, [2024-05-17T20:00:28.267945 #3468197] INFO -- : making srcs under enc I, [2024-05-17T20:00:28.297227 #3468197] INFO -- : make[1]: Entering directory '/tmp/ruby/build/trunk' I, [2024-05-17T20:00:28.297248 #3468197] INFO -- : make[1]: Nothing to be done for 'srcs'. I, [2024-05-17T20:00:28.297253 #3468197] INFO -- : make[1]: Leaving directory '/tmp/ruby/build/trunk' I, [2024-05-17T20:00:28.298195 #3468197] INFO -- : generating transdb.h I, [2024-05-17T20:00:28.395163 #3468197] INFO -- : transdb.h unchanged I, [2024-05-17T20:00:28.396543 #3468197] INFO -- : making trans I, [2024-05-17T20:00:28.431233 #3468197] INFO -- : make[1]: Entering directory '/tmp/ruby/build/trunk' I, [2024-05-17T20:00:28.431254 #3468197] INFO -- : make[1]: Nothing to be done for 'trans'. I, [2024-05-17T20:00:28.431259 #3468197] INFO -- : make[1]: Leaving directory '/tmp/ruby/build/trunk' I, [2024-05-17T20:00:28.432006 #3468197] INFO -- : making encs I, [2024-05-17T20:00:28.469790 #3468197] INFO -- : make[1]: Entering directory '/tmp/ruby/build/trunk' I, [2024-05-17T20:00:28.469812 #3468197] INFO -- : make[1]: Nothing to be done for 'encs'. I, [2024-05-17T20:00:28.469817 #3468197] INFO -- : make[1]: Leaving directory '/tmp/ruby/build/trunk' I, [2024-05-17T20:00:28.471690 #3468197] INFO -- : generating makefiles ext/configure-ext.mk I, [2024-05-17T20:00:28.498348 #3468197] INFO -- : ext/configure-ext.mk updated I, [2024-05-17T20:00:28.500799 #3468197] INFO -- : make[1]: Entering directory '/tmp/ruby/build/trunk' I, [2024-05-17T20:00:29.850683 #3468197] INFO -- : make[1]: Leaving directory '/tmp/ruby/build/trunk' I, [2024-05-17T20:00:29.851421 #3468197] INFO -- : generating makefile exts.mk I, [2024-05-17T20:00:29.887815 #3468197] INFO -- : exts.mk unchanged I, [2024-05-17T20:00:29.892295 #3468197] INFO -- : make[1]: Entering directory '/tmp/ruby/build/trunk' I, [2024-05-17T20:00:30.214320 #3468197] INFO -- : make[2]: Entering directory '/tmp/ruby/build/trunk/ext/coverage' I, [2024-05-17T20:00:30.217791 #3468197] INFO -- : make[2]: Leaving directory '/tmp/ruby/build/trunk/ext/coverage' I, [2024-05-17T20:00:30.223728 #3468197] INFO -- : make[2]: Entering directory '/tmp/ruby/build/trunk/ext/date' I, [2024-05-17T20:00:30.228662 #3468197] INFO -- : make[2]: Leaving directory '/tmp/ruby/build/trunk/ext/date' I, [2024-05-17T20:00:30.232528 #3468197] INFO -- : make[2]: Entering directory '/tmp/ruby/build/trunk/ext/digest' I, [2024-05-17T20:00:30.241236 #3468197] INFO -- : make[2]: Leaving directory '/tmp/ruby/build/trunk/ext/digest' I, [2024-05-17T20:00:30.267485 #3468197] INFO -- : make[2]: Entering directory '/tmp/ruby/build/trunk/ext/digest/sha2' I, [2024-05-17T20:00:30.272296 #3468197] INFO -- : make[2]: Leaving directory '/tmp/ruby/build/trunk/ext/digest/sha2' I, [2024-05-17T20:00:30.292707 #3468197] INFO -- : make[2]: Entering directory '/tmp/ruby/build/trunk/ext/fiddle' I, [2024-05-17T20:00:30.303506 #3468197] INFO -- : make[2]: Leaving directory '/tmp/ruby/build/trunk/ext/fiddle' I, [2024-05-17T20:00:30.308498 #3468197] INFO -- : make[2]: Entering directory '/tmp/ruby/build/trunk/ext/io/console' I, [2024-05-17T20:00:30.312625 #3468197] INFO -- : make[2]: Leaving directory '/tmp/ruby/build/trunk/ext/io/console' I, [2024-05-17T20:00:30.325297 #3468197] INFO -- : make[2]: Entering directory '/tmp/ruby/build/trunk/ext/json' I, [2024-05-17T20:00:30.335719 #3468197] INFO -- : make[2]: Leaving directory '/tmp/ruby/build/trunk/ext/json' I, [2024-05-17T20:00:30.350257 #3468197] INFO -- : make[2]: Entering directory '/tmp/ruby/build/trunk/ext/monitor' I, [2024-05-17T20:00:30.354105 #3468197] INFO -- : make[2]: Leaving directory '/tmp/ruby/build/trunk/ext/monitor' I, [2024-05-17T20:00:30.361249 #3468197] INFO -- : make[2]: Entering directory '/tmp/ruby/build/trunk/ext/objspace' I, [2024-05-17T20:00:30.367400 #3468197] INFO -- : make[2]: Leaving directory '/tmp/ruby/build/trunk/ext/objspace' I, [2024-05-17T20:00:30.386709 #3468197] INFO -- : make[2]: Entering directory '/tmp/ruby/build/trunk/ext/openssl' I, [2024-05-17T20:00:30.405739 #3468197] INFO -- : make[2]: Leaving directory '/tmp/ruby/build/trunk/ext/openssl' I, [2024-05-17T20:00:30.409094 #3468197] INFO -- : make[2]: Entering directory '/tmp/ruby/build/trunk/ext/pathname' I, [2024-05-17T20:00:30.412777 #3468197] INFO -- : make[2]: Leaving directory '/tmp/ruby/build/trunk/ext/pathname' I, [2024-05-17T20:00:30.419361 #3468197] INFO -- : make[2]: Entering directory '/tmp/ruby/build/trunk/ext/psych' I, [2024-05-17T20:00:30.441894 #3468197] INFO -- : make[2]: Leaving directory '/tmp/ruby/build/trunk/ext/psych' I, [2024-05-17T20:00:30.445242 #3468197] INFO -- : make[2]: Entering directory '/tmp/ruby/build/trunk/ext/pty' I, [2024-05-17T20:00:30.448476 #3468197] INFO -- : make[2]: Leaving directory '/tmp/ruby/build/trunk/ext/pty' I, [2024-05-17T20:00:30.463700 #3468197] INFO -- : make[2]: Entering directory '/tmp/ruby/build/trunk/ext/ripper' I, [2024-05-17T20:00:30.471996 #3468197] INFO -- : make[2]: Leaving directory '/tmp/ruby/build/trunk/ext/ripper' I, [2024-05-17T20:00:30.474453 #3468197] INFO -- : make[2]: Entering directory '/tmp/ruby/build/trunk/ext/rubyvm' I, [2024-05-17T20:00:30.477692 #3468197] INFO -- : make[2]: Leaving directory '/tmp/ruby/build/trunk/ext/rubyvm' I, [2024-05-17T20:00:30.489475 #3468197] INFO -- : make[2]: Entering directory '/tmp/ruby/build/trunk/ext/socket' I, [2024-05-17T20:00:30.496862 #3468197] INFO -- : make[2]: Leaving directory '/tmp/ruby/build/trunk/ext/socket' I, [2024-05-17T20:00:30.514750 #3468197] INFO -- : make[2]: Entering directory '/tmp/ruby/build/trunk/.bundle/gems/bigdecimal-3.1.8/ext/bigdecimal' I, [2024-05-17T20:00:30.539975 #3468197] INFO -- : make[2]: Leaving directory '/tmp/ruby/build/trunk/.bundle/gems/bigdecimal-3.1.8/ext/bigdecimal' I, [2024-05-17T20:00:30.541807 #3468197] INFO -- : make[2]: Entering directory '/tmp/ruby/build/trunk/.bundle/gems/debug-1.9.2/ext/debug' I, [2024-05-17T20:00:30.563391 #3468197] INFO -- : make[2]: Leaving directory '/tmp/ruby/build/trunk/.bundle/gems/debug-1.9.2/ext/debug' I, [2024-05-17T20:00:30.565322 #3468197] INFO -- : make[2]: Entering directory '/tmp/ruby/build/trunk/.bundle/gems/nkf-0.2.0/ext/nkf' I, [2024-05-17T20:00:30.586767 #3468197] INFO -- : make[2]: Leaving directory '/tmp/ruby/build/trunk/.bundle/gems/nkf-0.2.0/ext/nkf' I, [2024-05-17T20:00:30.588774 #3468197] INFO -- : make[2]: Entering directory '/tmp/ruby/build/trunk/.bundle/gems/racc-1.7.3/ext/racc/cparse' I, [2024-05-17T20:00:30.610097 #3468197] INFO -- : make[2]: Leaving directory '/tmp/ruby/build/trunk/.bundle/gems/racc-1.7.3/ext/racc/cparse' I, [2024-05-17T20:00:30.612617 #3468197] INFO -- : make[2]: Entering directory '/tmp/ruby/build/trunk/.bundle/gems/rbs-3.4.4/ext/rbs_extension' I, [2024-05-17T20:00:30.635717 #3468197] INFO -- : make[2]: Leaving directory '/tmp/ruby/build/trunk/.bundle/gems/rbs-3.4.4/ext/rbs_extension' I, [2024-05-17T20:00:30.637577 #3468197] INFO -- : make[2]: Entering directory '/tmp/ruby/build/trunk/.bundle/gems/syslog-0.1.2/ext/syslog' I, [2024-05-17T20:00:30.659048 #3468197] INFO -- : make[2]: Leaving directory '/tmp/ruby/build/trunk/.bundle/gems/syslog-0.1.2/ext/syslog' I, [2024-05-17T20:00:30.682437 #3468197] INFO -- : make[2]: Entering directory '/tmp/ruby/build/trunk' I, [2024-05-17T20:00:30.746599 #3468197] INFO -- : make[2]: 'ruby' is up to date. I, [2024-05-17T20:00:30.746635 #3468197] INFO -- : make[2]: Leaving directory '/tmp/ruby/build/trunk' I, [2024-05-17T20:00:30.747037 #3468197] INFO -- : make[1]: Leaving directory '/tmp/ruby/build/trunk' I, [2024-05-17T20:00:30.751297 #3468197] INFO -- : make[1]: Entering directory '/tmp/ruby/build/trunk' I, [2024-05-17T20:00:30.751334 #3468197] INFO -- : make[1]: Nothing to be done for 'note'. I, [2024-05-17T20:00:30.751345 #3468197] INFO -- : make[1]: Leaving directory '/tmp/ruby/build/trunk' E, [2024-05-17T20:00:30.812821 #3468197] ERROR -- : $ /tmp/ruby/build/trunk/miniruby -I/tmp/ruby/src/trunk/lib /tmp/ruby/src/trunk/tool/runruby.rb --archdir=/tmp/ruby/build/trunk --extout=.ext -- /tmp/ruby/src/trunk/spec/mspec/bin/mspec-run -B /tmp/ruby/src/trunk/spec/default.mspec --error-output stderr --debug -fy -o /tmp/rubytest.4wflow/1-mspec-multi-0 E, [2024-05-17T20:00:30.812991 #3468197] ERROR -- : $ /tmp/ruby/build/trunk/miniruby -I/tmp/ruby/src/trunk/lib /tmp/ruby/src/trunk/tool/runruby.rb --archdir=/tmp/ruby/build/trunk --extout=.ext -- /tmp/ruby/src/trunk/spec/mspec/bin/mspec-run -B /tmp/ruby/src/trunk/spec/default.mspec --error-output stderr --debug -fy -o /tmp/rubytest.4wflow/2-mspec-multi-1 E, [2024-05-17T20:00:30.813325 #3468197] ERROR -- : $ /tmp/ruby/build/trunk/miniruby -I/tmp/ruby/src/trunk/lib /tmp/ruby/src/trunk/tool/runruby.rb --archdir=/tmp/ruby/build/trunk --extout=.ext -- /tmp/ruby/src/trunk/spec/mspec/bin/mspec-run -B /tmp/ruby/src/trunk/spec/default.mspec --error-output stderr --debug -fy -o /tmp/rubytest.4wflow/3-mspec-multi-2 E, [2024-05-17T20:00:30.813608 #3468197] ERROR -- : $ /tmp/ruby/build/trunk/miniruby -I/tmp/ruby/src/trunk/lib /tmp/ruby/src/trunk/tool/runruby.rb --archdir=/tmp/ruby/build/trunk --extout=.ext -- /tmp/ruby/src/trunk/spec/mspec/bin/mspec-run -B /tmp/ruby/src/trunk/spec/default.mspec --error-output stderr --debug -fy -o /tmp/rubytest.4wflow/4-mspec-multi-3 E, [2024-05-17T20:00:30.813903 #3468197] ERROR -- : $ /tmp/ruby/build/trunk/miniruby -I/tmp/ruby/src/trunk/lib /tmp/ruby/src/trunk/tool/runruby.rb --archdir=/tmp/ruby/build/trunk --extout=.ext -- /tmp/ruby/src/trunk/spec/mspec/bin/mspec-run -B /tmp/ruby/src/trunk/spec/default.mspec --error-output stderr --debug -fy -o /tmp/rubytest.4wflow/5-mspec-multi-4 E, [2024-05-17T20:00:30.814129 #3468197] ERROR -- : $ /tmp/ruby/build/trunk/miniruby -I/tmp/ruby/src/trunk/lib /tmp/ruby/src/trunk/tool/runruby.rb --archdir=/tmp/ruby/build/trunk --extout=.ext -- /tmp/ruby/src/trunk/spec/mspec/bin/mspec-run -B /tmp/ruby/src/trunk/spec/default.mspec --error-output stderr --debug -fy -o /tmp/rubytest.4wflow/6-mspec-multi-5 E, [2024-05-17T20:00:30.814291 #3468197] ERROR -- : $ /tmp/ruby/build/trunk/miniruby -I/tmp/ruby/src/trunk/lib /tmp/ruby/src/trunk/tool/runruby.rb --archdir=/tmp/ruby/build/trunk --extout=.ext -- /tmp/ruby/src/trunk/spec/mspec/bin/mspec-run -B /tmp/ruby/src/trunk/spec/default.mspec --error-output stderr --debug -fy -o /tmp/rubytest.4wflow/7-mspec-multi-6 E, [2024-05-17T20:00:30.814549 #3468197] ERROR -- : $ /tmp/ruby/build/trunk/miniruby -I/tmp/ruby/src/trunk/lib /tmp/ruby/src/trunk/tool/runruby.rb --archdir=/tmp/ruby/build/trunk --extout=.ext -- /tmp/ruby/src/trunk/spec/mspec/bin/mspec-run -B /tmp/ruby/src/trunk/spec/default.mspec --error-output stderr --debug -fy -o /tmp/rubytest.4wflow/8-mspec-multi-7 E, [2024-05-17T20:00:30.814741 #3468197] ERROR -- : $ /tmp/ruby/build/trunk/miniruby -I/tmp/ruby/src/trunk/lib /tmp/ruby/src/trunk/tool/runruby.rb --archdir=/tmp/ruby/build/trunk --extout=.ext -- /tmp/ruby/src/trunk/spec/mspec/bin/mspec-run -B /tmp/ruby/src/trunk/spec/default.mspec --error-output stderr --debug -fy -o /tmp/rubytest.4wflow/9-mspec-multi-8 E, [2024-05-17T20:00:30.814881 #3468197] ERROR -- : $ /tmp/ruby/build/trunk/miniruby -I/tmp/ruby/src/trunk/lib /tmp/ruby/src/trunk/tool/runruby.rb --archdir=/tmp/ruby/build/trunk --extout=.ext -- /tmp/ruby/src/trunk/spec/mspec/bin/mspec-run -B /tmp/ruby/src/trunk/spec/default.mspec --error-output stderr --debug -fy -o /tmp/rubytest.4wflow/10-mspec-multi-9 E, [2024-05-17T20:00:30.815061 #3468197] ERROR -- : $ /tmp/ruby/build/trunk/miniruby -I/tmp/ruby/src/trunk/lib /tmp/ruby/src/trunk/tool/runruby.rb --archdir=/tmp/ruby/build/trunk --extout=.ext -- /tmp/ruby/src/trunk/spec/mspec/bin/mspec-run -B /tmp/ruby/src/trunk/spec/default.mspec --error-output stderr --debug -fy -o /tmp/rubytest.4wflow/11-mspec-multi-10 E, [2024-05-17T20:00:30.815243 #3468197] ERROR -- : $ /tmp/ruby/build/trunk/miniruby -I/tmp/ruby/src/trunk/lib /tmp/ruby/src/trunk/tool/runruby.rb --archdir=/tmp/ruby/build/trunk --extout=.ext -- /tmp/ruby/src/trunk/spec/mspec/bin/mspec-run -B /tmp/ruby/src/trunk/spec/default.mspec --error-output stderr --debug -fy -o /tmp/rubytest.4wflow/12-mspec-multi-11 E, [2024-05-17T20:00:30.815410 #3468197] ERROR -- : $ /tmp/ruby/build/trunk/miniruby -I/tmp/ruby/src/trunk/lib /tmp/ruby/src/trunk/tool/runruby.rb --archdir=/tmp/ruby/build/trunk --extout=.ext -- /tmp/ruby/src/trunk/spec/mspec/bin/mspec-run -B /tmp/ruby/src/trunk/spec/default.mspec --error-output stderr --debug -fy -o /tmp/rubytest.4wflow/13-mspec-multi-12 E, [2024-05-17T20:00:30.815631 #3468197] ERROR -- : $ /tmp/ruby/build/trunk/miniruby -I/tmp/ruby/src/trunk/lib /tmp/ruby/src/trunk/tool/runruby.rb --archdir=/tmp/ruby/build/trunk --extout=.ext -- /tmp/ruby/src/trunk/spec/mspec/bin/mspec-run -B /tmp/ruby/src/trunk/spec/default.mspec --error-output stderr --debug -fy -o /tmp/rubytest.4wflow/14-mspec-multi-13 E, [2024-05-17T20:00:30.815849 #3468197] ERROR -- : $ /tmp/ruby/build/trunk/miniruby -I/tmp/ruby/src/trunk/lib /tmp/ruby/src/trunk/tool/runruby.rb --archdir=/tmp/ruby/build/trunk --extout=.ext -- /tmp/ruby/src/trunk/spec/mspec/bin/mspec-run -B /tmp/ruby/src/trunk/spec/default.mspec --error-output stderr --debug -fy -o /tmp/rubytest.4wflow/15-mspec-multi-14 E, [2024-05-17T20:00:30.816006 #3468197] ERROR -- : $ /tmp/ruby/build/trunk/miniruby -I/tmp/ruby/src/trunk/lib /tmp/ruby/src/trunk/tool/runruby.rb --archdir=/tmp/ruby/build/trunk --extout=.ext -- /tmp/ruby/src/trunk/spec/mspec/bin/mspec-run -B /tmp/ruby/src/trunk/spec/default.mspec --error-output stderr --debug -fy -o /tmp/rubytest.4wflow/16-mspec-multi-15 E, [2024-05-17T20:00:30.816182 #3468197] ERROR -- : $ /tmp/ruby/build/trunk/miniruby -I/tmp/ruby/src/trunk/lib /tmp/ruby/src/trunk/tool/runruby.rb --archdir=/tmp/ruby/build/trunk --extout=.ext -- /tmp/ruby/src/trunk/spec/mspec/bin/mspec-run -B /tmp/ruby/src/trunk/spec/default.mspec --error-output stderr --debug -fy -o /tmp/rubytest.4wflow/17-mspec-multi-16 E, [2024-05-17T20:00:30.816384 #3468197] ERROR -- : $ /tmp/ruby/build/trunk/miniruby -I/tmp/ruby/src/trunk/lib /tmp/ruby/src/trunk/tool/runruby.rb --archdir=/tmp/ruby/build/trunk --extout=.ext -- /tmp/ruby/src/trunk/spec/mspec/bin/mspec-run -B /tmp/ruby/src/trunk/spec/default.mspec --error-output stderr --debug -fy -o /tmp/rubytest.4wflow/18-mspec-multi-17 E, [2024-05-17T20:00:30.819392 #3468197] ERROR -- : $ /tmp/ruby/build/trunk/miniruby -I/tmp/ruby/src/trunk/lib /tmp/ruby/src/trunk/tool/runruby.rb --archdir=/tmp/ruby/build/trunk --extout=.ext -- /tmp/ruby/src/trunk/spec/mspec/bin/mspec-run -B /tmp/ruby/src/trunk/spec/default.mspec --error-output stderr --debug -fy -o /tmp/rubytest.4wflow/19-mspec-multi-18 E, [2024-05-17T20:00:30.819749 #3468197] ERROR -- : $ /tmp/ruby/build/trunk/miniruby -I/tmp/ruby/src/trunk/lib /tmp/ruby/src/trunk/tool/runruby.rb --archdir=/tmp/ruby/build/trunk --extout=.ext -- /tmp/ruby/src/trunk/spec/mspec/bin/mspec-run -B /tmp/ruby/src/trunk/spec/default.mspec --error-output stderr --debug -fy -o /tmp/rubytest.4wflow/20-mspec-multi-19 I, [2024-05-17T20:00:30.983914 #3468197] INFO -- : ruby 3.4.0dev (2024-05-17T15:29:00Z master e61d24d77e) [x86_64-linux] I, [2024-05-17T20:00:31.589072 #3468197] INFO -- : 0 ......................................................................... I, [2024-05-17T20:00:31.993224 #3468197] INFO -- : 73 ......................................................................... I, [2024-05-17T20:00:32.140095 #3468197] INFO -- : 146 ......................................................................... I, [2024-05-17T20:00:32.195626 #3468197] INFO -- : 219 ......................................................................... I, [2024-05-17T20:00:32.253586 #3468197] INFO -- : 292 ......................................................................... I, [2024-05-17T20:00:32.297325 #3468197] INFO -- : 365 ......................................................................... I, [2024-05-17T20:00:32.317251 #3468197] INFO -- : 438 ......................................................................... I, [2024-05-17T20:00:32.335362 #3468197] INFO -- : 511 ......................................................................... I, [2024-05-17T20:00:32.352509 #3468197] INFO -- : 584 ......................................................................... I, [2024-05-17T20:00:32.405981 #3468197] INFO -- : 657 ......................................................................... I, [2024-05-17T20:00:32.435034 #3468197] INFO -- : 730 ......................................................................... I, [2024-05-17T20:00:32.456810 #3468197] INFO -- : 803 ......................................................................... I, [2024-05-17T20:00:32.486865 #3468197] INFO -- : 876 ......................................................................... I, [2024-05-17T20:00:32.536101 #3468197] INFO -- : 949 ......................................................................... I, [2024-05-17T20:00:32.627530 #3468197] INFO -- : 1022 ......................................................................... I, [2024-05-17T20:00:32.781464 #3468197] INFO -- : 1095 ......................................................................... I, [2024-05-17T20:00:32.899115 #3468197] INFO -- : 1168 ......................................................................... I, [2024-05-17T20:00:32.954725 #3468197] INFO -- : 1241 ......................................................................... I, [2024-05-17T20:00:33.002216 #3468197] INFO -- : 1314 ......................................................................... I, [2024-05-17T20:00:33.031547 #3468197] INFO -- : 1387 ......................................................................... I, [2024-05-17T20:00:33.116533 #3468197] INFO -- : 1460 ......................................................................... I, [2024-05-17T20:00:33.633262 #3468197] INFO -- : 1533 ......................................................................... I, [2024-05-17T20:00:33.696082 #3468197] INFO -- : 1606 ......................................................................... I, [2024-05-17T20:00:33.808092 #3468197] INFO -- : 1679 ......................................................................... I, [2024-05-17T20:00:33.907781 #3468197] INFO -- : 1752 ......................................................................... I, [2024-05-17T20:00:33.992792 #3468197] INFO -- : 1825 ......................................................................... I, [2024-05-17T20:00:34.095871 #3468197] INFO -- : 1898 ......................................................................... I, [2024-05-17T20:00:34.173800 #3468197] INFO -- : 1971 ......................................................................... I, [2024-05-17T20:00:34.244613 #3468197] INFO -- : 2044 ......................................................................... I, [2024-05-17T20:00:34.283449 #3468197] INFO -- : 2117 ......................................................................... I, [2024-05-17T20:00:34.301966 #3468197] INFO -- : 2190 ......................................................................... I, [2024-05-17T20:00:34.323641 #3468197] INFO -- : 2263 ......................................................................... I, [2024-05-17T20:00:34.336362 #3468197] INFO -- : 2336 ......................................................................... I, [2024-05-17T20:00:34.374838 #3468197] INFO -- : 2409 ......................................................................... I, [2024-05-17T20:00:34.487718 #3468197] INFO -- : 2482 ......................................................................... I, [2024-05-17T20:00:34.511448 #3468197] INFO -- : 2555 ......................................................................... I, [2024-05-17T20:00:34.625387 #3468197] INFO -- : 2628 ......................................................................... I, [2024-05-17T20:00:34.724354 #3468197] INFO -- : 2701 ......................................................................... I, [2024-05-17T20:00:34.757995 #3468197] INFO -- : 2774 ......................................................................... I, [2024-05-17T20:00:34.821388 #3468197] INFO -- : 2847 ......................................................................... I, [2024-05-17T20:00:34.850573 #3468197] INFO -- : 2920 ......................................................................... I, [2024-05-17T20:00:34.876328 #3468197] INFO -- : 2993 ......................................................................... I, [2024-05-17T20:00:34.899706 #3468197] INFO -- : 3066 ......................................................................... I, [2024-05-17T20:00:34.910673 #3468197] INFO -- : 3139 ......................................................................... I, [2024-05-17T20:00:34.921960 #3468197] INFO -- : 3212 ......................................................................... I, [2024-05-17T20:00:34.952462 #3468197] INFO -- : 3285 ......................................................................... I, [2024-05-17T20:00:38.926818 #3468197] INFO -- : 3358 ........................................................................ I, [2024-05-17T20:00:38.926884 #3468197] INFO -- : I, [2024-05-17T20:00:38.926891 #3468197] INFO -- : Finished in 8.111476 seconds I, [2024-05-17T20:00:38.926895 #3468197] INFO -- : I, [2024-05-17T20:00:38.926900 #3468197] INFO -- : 3429 files, 32611 examples, 212292 expectations, 0 failures, 0 errors, 0 tagged I, [2024-05-17T20:00:38.930016 #3468197] INFO -- : $$$[end] "make yes-test-rubyspec MSPECOPT='--error-output stderr --debug -j' TESTS='-j20'" exit with 0.