# Logfile created on 2024-05-17 18:54:21 +0000 by logger.rb/v1.4.3 I, [2024-05-17T18:54:21.608591 #82067] INFO -- : #, @formatter=nil, @logdev=#, @binmode=false, @mon_data=#, @mon_data_owner_object_id=860>>> I, [2024-05-17T18:54:21.608714 #82067] INFO -- : $$$[beg] make update-unicode -j20 I, [2024-05-17T18:54:21.667643 #82067] INFO -- : Downloading Unicode emoji 15.0 files... I, [2024-05-17T18:54:21.667887 #82067] INFO -- : Downloading Unicode emoji 15.0 files... I, [2024-05-17T18:54:21.668871 #82067] INFO -- : Downloading Unicode emoji 15.0 files... I, [2024-05-17T18:54:21.709809 #82067] INFO -- : made symlink emoji/15.0/emoji-sequences.txt to /tmp/ruby/src/trunk/.downloaded-cache/emoji/15.0/emoji-sequences.txt I, [2024-05-17T18:54:21.710029 #82067] INFO -- : downloading emoji/15.0/emoji-test.txt ... /tmp/ruby/src/trunk/enc/unicode/data/emoji/15.0/emoji-sequences.txt already exists I, [2024-05-17T18:54:21.710792 #82067] INFO -- : downloading emoji/15.0/emoji-test.txt ... /tmp/ruby/src/trunk/enc/unicode/data/emoji/15.0/emoji-sequences.txt already exists E, [2024-05-17T18:54:22.154023 #82067] ERROR -- : /tmp/ruby/src/trunk/tool/downloader.rb:302:in `rescue in download': failed to download emoji/15.0/emoji-test.txt (RuntimeError) E, [2024-05-17T18:54:22.154111 #82067] ERROR -- : OpenURI::HTTPError: 403 Forbidden: https://www.unicode.org/Public/emoji/15.0/emoji-test.txt E, [2024-05-17T18:54:22.154127 #82067] ERROR -- : from /tmp/ruby/src/trunk/tool/downloader.rb:201:in `download' E, [2024-05-17T18:54:22.154137 #82067] ERROR -- : from /tmp/ruby/src/trunk/tool/downloader.rb:136:in `download' E, [2024-05-17T18:54:22.154146 #82067] ERROR -- : from /tmp/ruby/src/trunk/tool/downloader.rb:482:in `block in
' E, [2024-05-17T18:54:22.154156 #82067] ERROR -- : from /tmp/ruby/src/trunk/tool/downloader.rb:465:in `each' E, [2024-05-17T18:54:22.154164 #82067] ERROR -- : from /tmp/ruby/src/trunk/tool/downloader.rb:465:in `
' E, [2024-05-17T18:54:22.154174 #82067] ERROR -- : /usr/lib/ruby/3.0.0/open-uri.rb:364:in `open_http': 403 Forbidden (OpenURI::HTTPError) E, [2024-05-17T18:54:22.154183 #82067] ERROR -- : from /usr/lib/ruby/3.0.0/open-uri.rb:741:in `buffer_open' E, [2024-05-17T18:54:22.154206 #82067] ERROR -- : from /usr/lib/ruby/3.0.0/open-uri.rb:212:in `block in open_loop' E, [2024-05-17T18:54:22.154215 #82067] ERROR -- : from /usr/lib/ruby/3.0.0/open-uri.rb:210:in `catch' E, [2024-05-17T18:54:22.154224 #82067] ERROR -- : from /usr/lib/ruby/3.0.0/open-uri.rb:210:in `open_loop' E, [2024-05-17T18:54:22.154233 #82067] ERROR -- : from /usr/lib/ruby/3.0.0/open-uri.rb:151:in `open_uri' E, [2024-05-17T18:54:22.154242 #82067] ERROR -- : from /usr/lib/ruby/3.0.0/open-uri.rb:721:in `open' E, [2024-05-17T18:54:22.154251 #82067] ERROR -- : from /usr/lib/ruby/3.0.0/open-uri.rb:729:in `read' E, [2024-05-17T18:54:22.154274 #82067] ERROR -- : from /tmp/ruby/src/trunk/tool/downloader.rb:247:in `block in download' E, [2024-05-17T18:54:22.154284 #82067] ERROR -- : from /tmp/ruby/src/trunk/tool/downloader.rb:378:in `with_retry' E, [2024-05-17T18:54:22.154293 #82067] ERROR -- : from /tmp/ruby/src/trunk/tool/downloader.rb:246:in `download' E, [2024-05-17T18:54:22.154305 #82067] ERROR -- : from /tmp/ruby/src/trunk/tool/downloader.rb:136:in `download' E, [2024-05-17T18:54:22.154314 #82067] ERROR -- : from /tmp/ruby/src/trunk/tool/downloader.rb:482:in `block in
' E, [2024-05-17T18:54:22.154324 #82067] ERROR -- : from /tmp/ruby/src/trunk/tool/downloader.rb:465:in `each' E, [2024-05-17T18:54:22.154333 #82067] ERROR -- : from /tmp/ruby/src/trunk/tool/downloader.rb:465:in `
' E, [2024-05-17T18:54:22.158047 #82067] ERROR -- : make: *** [uncommon.mk:1765: /tmp/ruby/src/trunk/enc/unicode/data/emoji/15.0/emoji-sequences.txt] Error 1 E, [2024-05-17T18:54:22.158104 #82067] ERROR -- : make: *** Deleting file '/tmp/ruby/src/trunk/enc/unicode/data/emoji/15.0/emoji-sequences.txt' E, [2024-05-17T18:54:22.158117 #82067] ERROR -- : make: *** Waiting for unfinished jobs.... E, [2024-05-17T18:54:22.168279 #82067] ERROR -- : /tmp/ruby/src/trunk/tool/downloader.rb:302:in `rescue in download': failed to download emoji/15.0/emoji-test.txt (RuntimeError) E, [2024-05-17T18:54:22.168344 #82067] ERROR -- : OpenURI::HTTPError: 403 Forbidden: https://www.unicode.org/Public/emoji/15.0/emoji-test.txt E, [2024-05-17T18:54:22.168358 #82067] ERROR -- : from /tmp/ruby/src/trunk/tool/downloader.rb:201:in `download' E, [2024-05-17T18:54:22.168368 #82067] ERROR -- : from /tmp/ruby/src/trunk/tool/downloader.rb:136:in `download' E, [2024-05-17T18:54:22.168384 #82067] ERROR -- : from /tmp/ruby/src/trunk/tool/downloader.rb:482:in `block in
' E, [2024-05-17T18:54:22.168394 #82067] ERROR -- : from /tmp/ruby/src/trunk/tool/downloader.rb:465:in `each' E, [2024-05-17T18:54:22.168403 #82067] ERROR -- : from /tmp/ruby/src/trunk/tool/downloader.rb:465:in `
' E, [2024-05-17T18:54:22.168412 #82067] ERROR -- : /usr/lib/ruby/3.0.0/open-uri.rb:364:in `open_http': 403 Forbidden (OpenURI::HTTPError) E, [2024-05-17T18:54:22.168425 #82067] ERROR -- : from /usr/lib/ruby/3.0.0/open-uri.rb:741:in `buffer_open' E, [2024-05-17T18:54:22.168434 #82067] ERROR -- : from /usr/lib/ruby/3.0.0/open-uri.rb:212:in `block in open_loop' E, [2024-05-17T18:54:22.168444 #82067] ERROR -- : from /usr/lib/ruby/3.0.0/open-uri.rb:210:in `catch' E, [2024-05-17T18:54:22.168452 #82067] ERROR -- : from /usr/lib/ruby/3.0.0/open-uri.rb:210:in `open_loop' E, [2024-05-17T18:54:22.168462 #82067] ERROR -- : from /usr/lib/ruby/3.0.0/open-uri.rb:151:in `open_uri' E, [2024-05-17T18:54:22.168471 #82067] ERROR -- : from /usr/lib/ruby/3.0.0/open-uri.rb:721:in `open' E, [2024-05-17T18:54:22.168480 #82067] ERROR -- : from /usr/lib/ruby/3.0.0/open-uri.rb:729:in `read' E, [2024-05-17T18:54:22.168489 #82067] ERROR -- : from /tmp/ruby/src/trunk/tool/downloader.rb:247:in `block in download' E, [2024-05-17T18:54:22.168501 #82067] ERROR -- : from /tmp/ruby/src/trunk/tool/downloader.rb:378:in `with_retry' E, [2024-05-17T18:54:22.168510 #82067] ERROR -- : from /tmp/ruby/src/trunk/tool/downloader.rb:246:in `download' E, [2024-05-17T18:54:22.168519 #82067] ERROR -- : from /tmp/ruby/src/trunk/tool/downloader.rb:136:in `download' E, [2024-05-17T18:54:22.168528 #82067] ERROR -- : from /tmp/ruby/src/trunk/tool/downloader.rb:482:in `block in
' E, [2024-05-17T18:54:22.168538 #82067] ERROR -- : from /tmp/ruby/src/trunk/tool/downloader.rb:465:in `each' E, [2024-05-17T18:54:22.168547 #82067] ERROR -- : from /tmp/ruby/src/trunk/tool/downloader.rb:465:in `
' E, [2024-05-17T18:54:22.172184 #82067] ERROR -- : make: *** [uncommon.mk:1765: /tmp/ruby/src/trunk/enc/unicode/data/emoji/15.0/emoji-zwj-sequences.txt] Error 1 E, [2024-05-17T18:54:22.179963 #82067] ERROR -- : /tmp/ruby/src/trunk/tool/downloader.rb:302:in `rescue in download': failed to download emoji/15.0/emoji-test.txt (RuntimeError) E, [2024-05-17T18:54:22.180054 #82067] ERROR -- : OpenURI::HTTPError: 403 Forbidden: https://www.unicode.org/Public/emoji/15.0/emoji-test.txt E, [2024-05-17T18:54:22.180069 #82067] ERROR -- : from /tmp/ruby/src/trunk/tool/downloader.rb:201:in `download' E, [2024-05-17T18:54:22.180079 #82067] ERROR -- : from /tmp/ruby/src/trunk/tool/downloader.rb:136:in `download' E, [2024-05-17T18:54:22.180089 #82067] ERROR -- : from /tmp/ruby/src/trunk/tool/downloader.rb:482:in `block in
' E, [2024-05-17T18:54:22.180099 #82067] ERROR -- : from /tmp/ruby/src/trunk/tool/downloader.rb:465:in `each' E, [2024-05-17T18:54:22.180109 #82067] ERROR -- : from /tmp/ruby/src/trunk/tool/downloader.rb:465:in `
' E, [2024-05-17T18:54:22.180118 #82067] ERROR -- : /usr/lib/ruby/3.0.0/open-uri.rb:364:in `open_http': 403 Forbidden (OpenURI::HTTPError) E, [2024-05-17T18:54:22.180132 #82067] ERROR -- : from /usr/lib/ruby/3.0.0/open-uri.rb:741:in `buffer_open' E, [2024-05-17T18:54:22.180141 #82067] ERROR -- : from /usr/lib/ruby/3.0.0/open-uri.rb:212:in `block in open_loop' E, [2024-05-17T18:54:22.180150 #82067] ERROR -- : from /usr/lib/ruby/3.0.0/open-uri.rb:210:in `catch' E, [2024-05-17T18:54:22.180344 #82067] ERROR -- : from /usr/lib/ruby/3.0.0/open-uri.rb:210:in `open_loop' E, [2024-05-17T18:54:22.180356 #82067] ERROR -- : from /usr/lib/ruby/3.0.0/open-uri.rb:151:in `open_uri' E, [2024-05-17T18:54:22.180366 #82067] ERROR -- : from /usr/lib/ruby/3.0.0/open-uri.rb:721:in `open' E, [2024-05-17T18:54:22.180375 #82067] ERROR -- : from /usr/lib/ruby/3.0.0/open-uri.rb:729:in `read' E, [2024-05-17T18:54:22.180384 #82067] ERROR -- : from /tmp/ruby/src/trunk/tool/downloader.rb:247:in `block in download' E, [2024-05-17T18:54:22.180393 #82067] ERROR -- : from /tmp/ruby/src/trunk/tool/downloader.rb:378:in `with_retry' E, [2024-05-17T18:54:22.180402 #82067] ERROR -- : from /tmp/ruby/src/trunk/tool/downloader.rb:246:in `download' E, [2024-05-17T18:54:22.180412 #82067] ERROR -- : from /tmp/ruby/src/trunk/tool/downloader.rb:136:in `download' E, [2024-05-17T18:54:22.180421 #82067] ERROR -- : from /tmp/ruby/src/trunk/tool/downloader.rb:482:in `block in
' E, [2024-05-17T18:54:22.180433 #82067] ERROR -- : from /tmp/ruby/src/trunk/tool/downloader.rb:465:in `each' E, [2024-05-17T18:54:22.180448 #82067] ERROR -- : from /tmp/ruby/src/trunk/tool/downloader.rb:465:in `
' E, [2024-05-17T18:54:22.183580 #82067] ERROR -- : make: *** [uncommon.mk:1765: /tmp/ruby/src/trunk/enc/unicode/data/emoji/15.0/emoji-test.txt] Error 1 I, [2024-05-17T18:54:22.183683 #82067] INFO -- : downloading emoji/15.0/emoji-test.txt ... I, [2024-05-17T18:54:22.184469 #82067] INFO -- : $$$[end] "make update-unicode -j20" exit with 512. I, [2024-05-17T18:54:22.184528 #82067] INFO -- : $$$[beg] make update-download -j20 I, [2024-05-17T18:54:22.295654 #82067] INFO -- : tool/config.guess already exists I, [2024-05-17T18:54:22.295709 #82067] INFO -- : tool/config.sub already exists I, [2024-05-17T18:54:22.297675 #82067] INFO -- : Update power_assert to 84e85124c5014a139af39161d484156cfe87a9ed I, [2024-05-17T18:54:22.297838 #82067] INFO -- : Update rbs to ba7872795d5de04adb8ff500c0e6afdc81a041dd I, [2024-05-17T18:54:22.298161 #82067] INFO -- : Update typeprof to b19a6416da3a05d57fadd6ffdadb382b6d236ca5 I, [2024-05-17T18:54:22.298715 #82067] INFO -- : echo 84e85124c5014a139af39161d484156cfe87a9ed | /bin/sh /tmp/ruby/src/trunk/tool/ifchange /tmp/ruby/src/trunk/.bundle/.timestamp/power_assert.revision - I, [2024-05-17T18:54:22.299126 #82067] INFO -- : echo ba7872795d5de04adb8ff500c0e6afdc81a041dd | /bin/sh /tmp/ruby/src/trunk/tool/ifchange /tmp/ruby/src/trunk/.bundle/.timestamp/rbs.revision - I, [2024-05-17T18:54:22.299277 #82067] INFO -- : echo b19a6416da3a05d57fadd6ffdadb382b6d236ca5 | /bin/sh /tmp/ruby/src/trunk/tool/ifchange /tmp/ruby/src/trunk/.bundle/.timestamp/typeprof.revision - I, [2024-05-17T18:54:22.300612 #82067] INFO -- : /tmp/ruby/src/trunk/.bundle/.timestamp/power_assert.revision unchanged I, [2024-05-17T18:54:22.301161 #82067] INFO -- : /tmp/ruby/src/trunk/.bundle/.timestamp/rbs.revision unchanged I, [2024-05-17T18:54:22.301473 #82067] INFO -- : /tmp/ruby/src/trunk/.bundle/.timestamp/typeprof.revision unchanged I, [2024-05-17T18:54:22.301692 #82067] INFO -- : Building power_assert@84e85124c5014a139af39161d484156cfe87a9ed to /tmp/ruby/src/trunk/gems/power_assert-2.0.3.gem I, [2024-05-17T18:54:22.371601 #82067] INFO -- : Successfully built RubyGem I, [2024-05-17T18:54:22.371642 #82067] INFO -- : Name: power_assert I, [2024-05-17T18:54:22.371647 #82067] INFO -- : Version: 2.0.4dev I, [2024-05-17T18:54:22.371651 #82067] INFO -- : File: power_assert-2.0.4dev.gem I, [2024-05-17T18:54:22.417062 #82067] INFO -- : $$$[end] "make update-download -j20" exit with 0. I, [2024-05-17T18:54:22.417102 #82067] INFO -- : $$$[beg] make update-rubyspec -j20 I, [2024-05-17T18:54:22.475408 #82067] INFO -- : make: Nothing to be done for 'update-rubyspec'. I, [2024-05-17T18:54:22.475729 #82067] INFO -- : $$$[end] "make update-rubyspec -j20" exit with 0. I, [2024-05-17T18:54:22.475787 #82067] INFO -- : $$$[beg] make update-src -j20 I, [2024-05-17T18:54:23.108649 #82067] INFO -- : Already up to date. I, [2024-05-17T18:54:23.126433 #82067] INFO -- : Latest commit hash = e61d24d77e I, [2024-05-17T18:54:23.127681 #82067] INFO -- : $$$[end] "make update-src -j20" exit with 0. I, [2024-05-17T18:54:23.127723 #82067] INFO -- : $$$[beg] make after-update -j20 I, [2024-05-17T18:54:23.208581 #82067] INFO -- : generating /tmp/ruby/src/trunk/ext/ripper/eventids2table.c I, [2024-05-17T18:54:23.212812 #82067] INFO -- : make[1]: Entering directory '/tmp/ruby/src/trunk/ext/ripper' I, [2024-05-17T18:54:23.212858 #82067] INFO -- : make[1]: Nothing to be done for 'src'. I, [2024-05-17T18:54:23.212871 #82067] INFO -- : make[1]: Leaving directory '/tmp/ruby/src/trunk/ext/ripper' I, [2024-05-17T18:54:23.230011 #82067] INFO -- : /tmp/ruby/src/trunk/revision.h updated I, [2024-05-17T18:54:23.231332 #82067] INFO -- : generating x86_64-linux-fake.rb I, [2024-05-17T18:54:23.284162 #82067] INFO -- : x86_64-linux-fake.rb updated I, [2024-05-17T18:54:23.285374 #82067] INFO -- : generating enc.mk I, [2024-05-17T18:54:23.401214 #82067] INFO -- : making srcs under enc I, [2024-05-17T18:54:23.430545 #82067] INFO -- : make[1]: Entering directory '/tmp/ruby/build/trunk' I, [2024-05-17T18:54:23.430613 #82067] INFO -- : make[1]: Nothing to be done for 'srcs'. I, [2024-05-17T18:54:23.430627 #82067] INFO -- : make[1]: Leaving directory '/tmp/ruby/build/trunk' I, [2024-05-17T18:54:23.475330 #82067] INFO -- : Update power_assert to 84e85124c5014a139af39161d484156cfe87a9ed I, [2024-05-17T18:54:23.475457 #82067] INFO -- : Update rbs to ba7872795d5de04adb8ff500c0e6afdc81a041dd I, [2024-05-17T18:54:23.475931 #82067] INFO -- : Update typeprof to b19a6416da3a05d57fadd6ffdadb382b6d236ca5 I, [2024-05-17T18:54:23.476659 #82067] INFO -- : echo 84e85124c5014a139af39161d484156cfe87a9ed | /bin/sh /tmp/ruby/src/trunk/tool/ifchange /tmp/ruby/src/trunk/.bundle/.timestamp/power_assert.revision - I, [2024-05-17T18:54:23.477427 #82067] INFO -- : echo ba7872795d5de04adb8ff500c0e6afdc81a041dd | /bin/sh /tmp/ruby/src/trunk/tool/ifchange /tmp/ruby/src/trunk/.bundle/.timestamp/rbs.revision - I, [2024-05-17T18:54:23.477637 #82067] INFO -- : echo b19a6416da3a05d57fadd6ffdadb382b6d236ca5 | /bin/sh /tmp/ruby/src/trunk/tool/ifchange /tmp/ruby/src/trunk/.bundle/.timestamp/typeprof.revision - I, [2024-05-17T18:54:23.478804 #82067] INFO -- : /tmp/ruby/src/trunk/.bundle/.timestamp/power_assert.revision unchanged I, [2024-05-17T18:54:23.479364 #82067] INFO -- : /tmp/ruby/src/trunk/.bundle/.timestamp/rbs.revision unchanged I, [2024-05-17T18:54:23.479486 #82067] INFO -- : /tmp/ruby/src/trunk/.bundle/.timestamp/typeprof.revision unchanged I, [2024-05-17T18:54:23.479771 #82067] INFO -- : Building power_assert@84e85124c5014a139af39161d484156cfe87a9ed to /tmp/ruby/src/trunk/gems/power_assert-2.0.3.gem I, [2024-05-17T18:54:23.548637 #82067] INFO -- : Successfully built RubyGem I, [2024-05-17T18:54:23.548685 #82067] INFO -- : Name: power_assert I, [2024-05-17T18:54:23.548699 #82067] INFO -- : Version: 2.0.4dev I, [2024-05-17T18:54:23.548704 #82067] INFO -- : File: power_assert-2.0.4dev.gem I, [2024-05-17T18:54:23.550877 #82067] INFO -- : Extracting bundle gem power_assert-2.0.3... I, [2024-05-17T18:54:23.611238 #82067] INFO -- : Try with hash version of bundled gems instead of gems/power_assert-2.0.3.gem. We don't use this gem with release version of Ruby. I, [2024-05-17T18:54:23.616184 #82067] INFO -- : Unpacked gems/power_assert-2.0.4dev.gem I, [2024-05-17T18:54:23.618536 #82067] INFO -- : $$$[end] "make after-update -j20" exit with 0. I, [2024-05-17T18:54:23.618631 #82067] INFO -- : $$$[beg] make miniruby -j20 I, [2024-05-17T18:54:23.675362 #82067] INFO -- : BASERUBY = /usr/bin/ruby --disable=gems I, [2024-05-17T18:54:23.675389 #82067] INFO -- : CC = gcc I, [2024-05-17T18:54:23.675394 #82067] INFO -- : LD = ld I, [2024-05-17T18:54:23.675398 #82067] INFO -- : LDSHARED = gcc -shared I, [2024-05-17T18:54:23.675402 #82067] INFO -- : CFLAGS = -O3 -fno-fast-math -ggdb3 -Wall -Wextra -Wdeprecated-declarations -Wdiv-by-zero -Wduplicated-cond -Wimplicit-function-declaration -Wimplicit-int -Wpointer-arith -Wwrite-strings -Wold-style-definition -Wimplicit-fallthrough=0 -Wmissing-noreturn -Wno-cast-function-type -Wno-constant-logical-operand -Wno-long-long -Wno-missing-field-initializers -Wno-overlength-strings -Wno-packed-bitfield-compat -Wno-parentheses-equality -Wno-self-assign -Wno-tautological-compare -Wno-unused-parameter -Wno-unused-value -Wsuggest-attribute=format -Wsuggest-attribute=noreturn -Wunused-variable -Wmisleading-indentation -Wundef -fPIC I, [2024-05-17T18:54:23.675406 #82067] INFO -- : XCFLAGS = -U_FORTIFY_SOURCE -D_FORTIFY_SOURCE=2 -fstack-protector-strong -fno-strict-overflow -fvisibility=hidden -fexcess-precision=standard -DRUBY_EXPORT -I. -I.ext/include/x86_64-linux -I/tmp/ruby/src/trunk/include -I/tmp/ruby/src/trunk -I/tmp/ruby/src/trunk/prism -I/tmp/ruby/src/trunk/enc/unicode/15.0.0 I, [2024-05-17T18:54:23.675410 #82067] INFO -- : CPPFLAGS = I, [2024-05-17T18:54:23.675414 #82067] INFO -- : DLDFLAGS = -Wl,--compress-debug-sections=zlib -Wl,-soname,libruby.so.3.4 -fstack-protector-strong I, [2024-05-17T18:54:23.675417 #82067] INFO -- : SOLIBS = -lz -lrt -lrt -lgmp -ldl -lcrypt -lm -lpthread I, [2024-05-17T18:54:23.675421 #82067] INFO -- : LANG = en_US.UTF-8 I, [2024-05-17T18:54:23.675425 #82067] INFO -- : LC_ALL = I, [2024-05-17T18:54:23.675429 #82067] INFO -- : LC_CTYPE = I, [2024-05-17T18:54:23.675432 #82067] INFO -- : MFLAGS = -j20 --jobserver-auth=4,5 I, [2024-05-17T18:54:23.675436 #82067] INFO -- : RUSTC = no I, [2024-05-17T18:54:23.675439 #82067] INFO -- : YJIT_RUSTC_ARGS = --crate-name=yjit --crate-type=staticlib --edition=2021 -g -C lto=thin -C opt-level=3 -C overflow-checks=on '--out-dir=/tmp/ruby/build/trunk/yjit/target/release/' /tmp/ruby/src/trunk/yjit/src/lib.rs I, [2024-05-17T18:54:23.676659 #82067] INFO -- : gcc (Ubuntu 11.4.0-1ubuntu1~22.04) 11.4.0 I, [2024-05-17T18:54:23.676680 #82067] INFO -- : Copyright (C) 2021 Free Software Foundation, Inc. I, [2024-05-17T18:54:23.676686 #82067] INFO -- : This is free software; see the source for copying conditions. There is NO I, [2024-05-17T18:54:23.676694 #82067] INFO -- : warranty; not even for MERCHANTABILITY or FITNESS FOR A PARTICULAR PURPOSE. I, [2024-05-17T18:54:23.676698 #82067] INFO -- : I, [2024-05-17T18:54:23.697632 #82067] INFO -- : compiling /tmp/ruby/src/trunk/version.c I, [2024-05-17T18:54:23.800914 #82067] INFO -- : linking miniruby I, [2024-05-17T18:54:24.329841 #82067] INFO -- : $$$[end] "make miniruby -j20" exit with 0. I, [2024-05-17T18:54:24.329952 #82067] INFO -- : $$$[beg] make ruby -j20 I, [2024-05-17T18:54:24.387900 #82067] INFO -- : BASERUBY = /usr/bin/ruby --disable=gems I, [2024-05-17T18:54:24.387944 #82067] INFO -- : CC = gcc I, [2024-05-17T18:54:24.387956 #82067] INFO -- : LD = ld I, [2024-05-17T18:54:24.387973 #82067] INFO -- : LDSHARED = gcc -shared I, [2024-05-17T18:54:24.387992 #82067] INFO -- : CFLAGS = -O3 -fno-fast-math -ggdb3 -Wall -Wextra -Wdeprecated-declarations -Wdiv-by-zero -Wduplicated-cond -Wimplicit-function-declaration -Wimplicit-int -Wpointer-arith -Wwrite-strings -Wold-style-definition -Wimplicit-fallthrough=0 -Wmissing-noreturn -Wno-cast-function-type -Wno-constant-logical-operand -Wno-long-long -Wno-missing-field-initializers -Wno-overlength-strings -Wno-packed-bitfield-compat -Wno-parentheses-equality -Wno-self-assign -Wno-tautological-compare -Wno-unused-parameter -Wno-unused-value -Wsuggest-attribute=format -Wsuggest-attribute=noreturn -Wunused-variable -Wmisleading-indentation -Wundef -fPIC I, [2024-05-17T18:54:24.388004 #82067] INFO -- : XCFLAGS = -U_FORTIFY_SOURCE -D_FORTIFY_SOURCE=2 -fstack-protector-strong -fno-strict-overflow -fvisibility=hidden -fexcess-precision=standard -DRUBY_EXPORT -I. -I.ext/include/x86_64-linux -I/tmp/ruby/src/trunk/include -I/tmp/ruby/src/trunk -I/tmp/ruby/src/trunk/prism -I/tmp/ruby/src/trunk/enc/unicode/15.0.0 I, [2024-05-17T18:54:24.388015 #82067] INFO -- : CPPFLAGS = I, [2024-05-17T18:54:24.388025 #82067] INFO -- : DLDFLAGS = -Wl,--compress-debug-sections=zlib -Wl,-soname,libruby.so.3.4 -fstack-protector-strong I, [2024-05-17T18:54:24.388036 #82067] INFO -- : SOLIBS = -lz -lrt -lrt -lgmp -ldl -lcrypt -lm -lpthread I, [2024-05-17T18:54:24.388045 #82067] INFO -- : LANG = en_US.UTF-8 I, [2024-05-17T18:54:24.388055 #82067] INFO -- : LC_ALL = I, [2024-05-17T18:54:24.388064 #82067] INFO -- : LC_CTYPE = I, [2024-05-17T18:54:24.388074 #82067] INFO -- : MFLAGS = -j20 --jobserver-auth=4,5 I, [2024-05-17T18:54:24.388083 #82067] INFO -- : RUSTC = no I, [2024-05-17T18:54:24.388094 #82067] INFO -- : YJIT_RUSTC_ARGS = --crate-name=yjit --crate-type=staticlib --edition=2021 -g -C lto=thin -C opt-level=3 -C overflow-checks=on '--out-dir=/tmp/ruby/build/trunk/yjit/target/release/' /tmp/ruby/src/trunk/yjit/src/lib.rs I, [2024-05-17T18:54:24.389283 #82067] INFO -- : gcc (Ubuntu 11.4.0-1ubuntu1~22.04) 11.4.0 I, [2024-05-17T18:54:24.389325 #82067] INFO -- : Copyright (C) 2021 Free Software Foundation, Inc. I, [2024-05-17T18:54:24.389338 #82067] INFO -- : This is free software; see the source for copying conditions. There is NO I, [2024-05-17T18:54:24.389355 #82067] INFO -- : warranty; not even for MERCHANTABILITY or FITNESS FOR A PARTICULAR PURPOSE. I, [2024-05-17T18:54:24.389365 #82067] INFO -- : I, [2024-05-17T18:54:24.495395 #82067] INFO -- : builtin_binary.inc updated I, [2024-05-17T18:54:24.499896 #82067] INFO -- : c5234a9416e4f20f175185e840b25b0f08674d14078ed7083f37e655458e3ca9 builtin_binary.inc I, [2024-05-17T18:54:24.500561 #82067] INFO -- : compiling /tmp/ruby/src/trunk/builtin.c I, [2024-05-17T18:54:24.683703 #82067] INFO -- : linking static-library libruby-static.a I, [2024-05-17T18:54:24.994612 #82067] INFO -- : linking shared-library libruby.so.3.4.0 I, [2024-05-17T18:54:26.539637 #82067] INFO -- : linking ruby I, [2024-05-17T18:54:26.565419 #82067] INFO -- : $$$[end] "make ruby -j20" exit with 0. I, [2024-05-17T18:54:26.565546 #82067] INFO -- : $$$[beg] make all -j20 I, [2024-05-17T18:54:26.628089 #82067] INFO -- : BASERUBY = /usr/bin/ruby --disable=gems I, [2024-05-17T18:54:26.628137 #82067] INFO -- : CC = gcc I, [2024-05-17T18:54:26.628142 #82067] INFO -- : LD = ld I, [2024-05-17T18:54:26.628147 #82067] INFO -- : LDSHARED = gcc -shared I, [2024-05-17T18:54:26.628151 #82067] INFO -- : CFLAGS = -O3 -fno-fast-math -ggdb3 -Wall -Wextra -Wdeprecated-declarations -Wdiv-by-zero -Wduplicated-cond -Wimplicit-function-declaration -Wimplicit-int -Wpointer-arith -Wwrite-strings -Wold-style-definition -Wimplicit-fallthrough=0 -Wmissing-noreturn -Wno-cast-function-type -Wno-constant-logical-operand -Wno-long-long -Wno-missing-field-initializers -Wno-overlength-strings -Wno-packed-bitfield-compat -Wno-parentheses-equality -Wno-self-assign -Wno-tautological-compare -Wno-unused-parameter -Wno-unused-value -Wsuggest-attribute=format -Wsuggest-attribute=noreturn -Wunused-variable -Wmisleading-indentation -Wundef -fPIC I, [2024-05-17T18:54:26.628162 #82067] INFO -- : XCFLAGS = -U_FORTIFY_SOURCE -D_FORTIFY_SOURCE=2 -fstack-protector-strong -fno-strict-overflow -fvisibility=hidden -fexcess-precision=standard -DRUBY_EXPORT -I. -I.ext/include/x86_64-linux -I/tmp/ruby/src/trunk/include -I/tmp/ruby/src/trunk -I/tmp/ruby/src/trunk/prism -I/tmp/ruby/src/trunk/enc/unicode/15.0.0 I, [2024-05-17T18:54:26.628166 #82067] INFO -- : CPPFLAGS = I, [2024-05-17T18:54:26.628169 #82067] INFO -- : DLDFLAGS = -Wl,--compress-debug-sections=zlib -Wl,-soname,libruby.so.3.4 -fstack-protector-strong I, [2024-05-17T18:54:26.628173 #82067] INFO -- : SOLIBS = -lz -lrt -lrt -lgmp -ldl -lcrypt -lm -lpthread I, [2024-05-17T18:54:26.628177 #82067] INFO -- : LANG = en_US.UTF-8 I, [2024-05-17T18:54:26.628180 #82067] INFO -- : LC_ALL = I, [2024-05-17T18:54:26.628183 #82067] INFO -- : LC_CTYPE = I, [2024-05-17T18:54:26.628187 #82067] INFO -- : MFLAGS = -j20 --jobserver-auth=4,5 I, [2024-05-17T18:54:26.628191 #82067] INFO -- : RUSTC = no I, [2024-05-17T18:54:26.628194 #82067] INFO -- : YJIT_RUSTC_ARGS = --crate-name=yjit --crate-type=staticlib --edition=2021 -g -C lto=thin -C opt-level=3 -C overflow-checks=on '--out-dir=/tmp/ruby/build/trunk/yjit/target/release/' /tmp/ruby/src/trunk/yjit/src/lib.rs I, [2024-05-17T18:54:26.629683 #82067] INFO -- : gcc (Ubuntu 11.4.0-1ubuntu1~22.04) 11.4.0 I, [2024-05-17T18:54:26.629706 #82067] INFO -- : Copyright (C) 2021 Free Software Foundation, Inc. I, [2024-05-17T18:54:26.629716 #82067] INFO -- : This is free software; see the source for copying conditions. There is NO I, [2024-05-17T18:54:26.629720 #82067] INFO -- : warranty; not even for MERCHANTABILITY or FITNESS FOR A PARTICULAR PURPOSE. I, [2024-05-17T18:54:26.629724 #82067] INFO -- : I, [2024-05-17T18:54:26.663077 #82067] INFO -- : generating enc.mk I, [2024-05-17T18:54:26.665015 #82067] INFO -- : building spec/ruby/optional/capi/ext/array_spec.so I, [2024-05-17T18:54:26.665285 #82067] INFO -- : building spec/ruby/optional/capi/ext/basic_object_spec.so I, [2024-05-17T18:54:26.665965 #82067] INFO -- : building spec/ruby/optional/capi/ext/bignum_spec.so I, [2024-05-17T18:54:26.666681 #82067] INFO -- : building spec/ruby/optional/capi/ext/binding_spec.so I, [2024-05-17T18:54:26.667095 #82067] INFO -- : building spec/ruby/optional/capi/ext/boolean_spec.so I, [2024-05-17T18:54:26.667417 #82067] INFO -- : building spec/ruby/optional/capi/ext/class_id_under_autoload_spec.so I, [2024-05-17T18:54:26.668185 #82067] INFO -- : building spec/ruby/optional/capi/ext/class_spec.so I, [2024-05-17T18:54:26.669306 #82067] INFO -- : building spec/ruby/optional/capi/ext/class_under_autoload_spec.so I, [2024-05-17T18:54:26.670172 #82067] INFO -- : building spec/ruby/optional/capi/ext/complex_spec.so I, [2024-05-17T18:54:26.670916 #82067] INFO -- : building spec/ruby/optional/capi/ext/constants_spec.so I, [2024-05-17T18:54:26.671304 #82067] INFO -- : building spec/ruby/optional/capi/ext/data_spec.so I, [2024-05-17T18:54:26.672026 #82067] INFO -- : building spec/ruby/optional/capi/ext/debug_spec.so I, [2024-05-17T18:54:26.672199 #82067] INFO -- : building spec/ruby/optional/capi/ext/encoding_spec.so I, [2024-05-17T18:54:26.673056 #82067] INFO -- : building spec/ruby/optional/capi/ext/enumerator_spec.so I, [2024-05-17T18:54:26.673792 #82067] INFO -- : building spec/ruby/optional/capi/ext/exception_spec.so I, [2024-05-17T18:54:26.674181 #82067] INFO -- : building spec/ruby/optional/capi/ext/fiber_spec.so I, [2024-05-17T18:54:26.674615 #82067] INFO -- : building spec/ruby/optional/capi/ext/file_spec.so I, [2024-05-17T18:54:26.675233 #82067] INFO -- : building spec/ruby/optional/capi/ext/fixnum_spec.so I, [2024-05-17T18:54:26.675602 #82067] INFO -- : building spec/ruby/optional/capi/ext/float_spec.so I, [2024-05-17T18:54:26.798574 #82067] INFO -- : building spec/ruby/optional/capi/ext/gc_spec.so I, [2024-05-17T18:54:26.806406 #82067] INFO -- : building spec/ruby/optional/capi/ext/globals_spec.so I, [2024-05-17T18:54:26.807671 #82067] INFO -- : building spec/ruby/optional/capi/ext/hash_spec.so I, [2024-05-17T18:54:26.814126 #82067] INFO -- : building spec/ruby/optional/capi/ext/integer_spec.so I, [2024-05-17T18:54:26.818537 #82067] INFO -- : building spec/ruby/optional/capi/ext/io_spec.so I, [2024-05-17T18:54:26.824564 #82067] INFO -- : building spec/ruby/optional/capi/ext/kernel_spec.so I, [2024-05-17T18:54:26.829667 #82067] INFO -- : building spec/ruby/optional/capi/ext/language_spec.so I, [2024-05-17T18:54:26.831755 #82067] INFO -- : building spec/ruby/optional/capi/ext/marshal_spec.so I, [2024-05-17T18:54:26.835216 #82067] INFO -- : building spec/ruby/optional/capi/ext/module_spec.so I, [2024-05-17T18:54:26.837555 #82067] INFO -- : building spec/ruby/optional/capi/ext/module_under_autoload_spec.so I, [2024-05-17T18:54:26.843330 #82067] INFO -- : building spec/ruby/optional/capi/ext/mutex_spec.so I, [2024-05-17T18:54:26.843627 #82067] INFO -- : building spec/ruby/optional/capi/ext/numeric_spec.so I, [2024-05-17T18:54:26.860095 #82067] INFO -- : building spec/ruby/optional/capi/ext/object_spec.so I, [2024-05-17T18:54:26.860882 #82067] INFO -- : building spec/ruby/optional/capi/ext/proc_spec.so I, [2024-05-17T18:54:26.866358 #82067] INFO -- : building spec/ruby/optional/capi/ext/range_spec.so I, [2024-05-17T18:54:26.900455 #82067] INFO -- : building spec/ruby/optional/capi/ext/rational_spec.so I, [2024-05-17T18:54:26.913662 #82067] INFO -- : building spec/ruby/optional/capi/ext/rbasic_spec.so I, [2024-05-17T18:54:26.925801 #82067] INFO -- : building spec/ruby/optional/capi/ext/regexp_spec.so I, [2024-05-17T18:54:26.962022 #82067] INFO -- : building spec/ruby/optional/capi/ext/string_spec.so I, [2024-05-17T18:54:26.969837 #82067] INFO -- : building spec/ruby/optional/capi/ext/struct_spec.so I, [2024-05-17T18:54:26.973635 #82067] INFO -- : building spec/ruby/optional/capi/ext/st_spec.so I, [2024-05-17T18:54:26.978867 #82067] INFO -- : building spec/ruby/optional/capi/ext/symbol_spec.so I, [2024-05-17T18:54:26.982612 #82067] INFO -- : building spec/ruby/optional/capi/ext/thread_spec.so I, [2024-05-17T18:54:26.990284 #82067] INFO -- : building spec/ruby/optional/capi/ext/tracepoint_spec.so I, [2024-05-17T18:54:26.990420 #82067] INFO -- : building spec/ruby/optional/capi/ext/time_spec.so I, [2024-05-17T18:54:26.993335 #82067] INFO -- : building spec/ruby/optional/capi/ext/typed_data_spec.so I, [2024-05-17T18:54:27.001615 #82067] INFO -- : building spec/ruby/optional/capi/ext/util_spec.so I, [2024-05-17T18:54:27.040448 #82067] INFO -- : making enc I, [2024-05-17T18:54:27.046654 #82067] INFO -- : making srcs under enc I, [2024-05-17T18:54:27.067446 #82067] INFO -- : make[1]: Entering directory '/tmp/ruby/build/trunk' I, [2024-05-17T18:54:27.067546 #82067] INFO -- : make[1]: Nothing to be done for 'enc'. I, [2024-05-17T18:54:27.067562 #82067] INFO -- : make[1]: Leaving directory '/tmp/ruby/build/trunk' I, [2024-05-17T18:54:27.095862 #82067] INFO -- : make[1]: Entering directory '/tmp/ruby/build/trunk' I, [2024-05-17T18:54:27.095924 #82067] INFO -- : make[1]: Nothing to be done for 'srcs'. I, [2024-05-17T18:54:27.095935 #82067] INFO -- : make[1]: Leaving directory '/tmp/ruby/build/trunk' I, [2024-05-17T18:54:27.096733 #82067] INFO -- : generating transdb.h I, [2024-05-17T18:54:27.204248 #82067] INFO -- : transdb.h unchanged I, [2024-05-17T18:54:27.205695 #82067] INFO -- : generating makefiles ext/configure-ext.mk I, [2024-05-17T18:54:27.205982 #82067] INFO -- : making trans I, [2024-05-17T18:54:27.232728 #82067] INFO -- : ext/configure-ext.mk updated I, [2024-05-17T18:54:27.235332 #82067] INFO -- : make[1]: Entering directory '/tmp/ruby/build/trunk' I, [2024-05-17T18:54:27.240822 #82067] INFO -- : make[1]: Entering directory '/tmp/ruby/build/trunk' I, [2024-05-17T18:54:27.240921 #82067] INFO -- : make[1]: Nothing to be done for 'trans'. I, [2024-05-17T18:54:27.240949 #82067] INFO -- : make[1]: Leaving directory '/tmp/ruby/build/trunk' I, [2024-05-17T18:54:27.244165 #82067] INFO -- : making encs I, [2024-05-17T18:54:27.306634 #82067] INFO -- : make[1]: Entering directory '/tmp/ruby/build/trunk' I, [2024-05-17T18:54:27.306711 #82067] INFO -- : make[1]: Nothing to be done for 'encs'. I, [2024-05-17T18:54:27.306734 #82067] INFO -- : make[1]: Leaving directory '/tmp/ruby/build/trunk' I, [2024-05-17T18:54:27.387969 #82067] INFO -- : make[1]: Leaving directory '/tmp/ruby/build/trunk' I, [2024-05-17T18:54:27.388754 #82067] INFO -- : generating makefile exts.mk I, [2024-05-17T18:54:27.426734 #82067] INFO -- : exts.mk unchanged I, [2024-05-17T18:54:27.431790 #82067] INFO -- : make[1]: Entering directory '/tmp/ruby/build/trunk' I, [2024-05-17T18:54:27.450462 #82067] INFO -- : make[2]: Entering directory '/tmp/ruby/build/trunk/ext/digest' I, [2024-05-17T18:54:27.451723 #82067] INFO -- : make[2]: Entering directory '/tmp/ruby/build/trunk/ext/json' I, [2024-05-17T18:54:27.451865 #82067] INFO -- : make[2]: Entering directory '/tmp/ruby/build/trunk/ext/coverage' I, [2024-05-17T18:54:27.452321 #82067] INFO -- : make[2]: Entering directory '/tmp/ruby/build/trunk/ext/io/console' I, [2024-05-17T18:54:27.453838 #82067] INFO -- : make[2]: Entering directory '/tmp/ruby/build/trunk/ext/date' I, [2024-05-17T18:54:27.453867 #82067] INFO -- : make[2]: Entering directory '/tmp/ruby/build/trunk/ext/rubyvm' I, [2024-05-17T18:54:27.453877 #82067] INFO -- : make[2]: Entering directory '/tmp/ruby/build/trunk/ext/monitor' I, [2024-05-17T18:54:27.454452 #82067] INFO -- : make[2]: Entering directory '/tmp/ruby/build/trunk/ext/pathname' I, [2024-05-17T18:54:27.455014 #82067] INFO -- : make[2]: Entering directory '/tmp/ruby/build/trunk/ext/fiddle' I, [2024-05-17T18:54:27.455474 #82067] INFO -- : make[2]: Entering directory '/tmp/ruby/build/trunk/ext/pty' I, [2024-05-17T18:54:27.455628 #82067] INFO -- : make[2]: Leaving directory '/tmp/ruby/build/trunk/ext/coverage' I, [2024-05-17T18:54:27.455655 #82067] INFO -- : make[2]: Leaving directory '/tmp/ruby/build/trunk/ext/io/console' I, [2024-05-17T18:54:27.456013 #82067] INFO -- : make[2]: Leaving directory '/tmp/ruby/build/trunk/ext/rubyvm' I, [2024-05-17T18:54:27.456301 #82067] INFO -- : make[2]: Entering directory '/tmp/ruby/build/trunk/ext/objspace' I, [2024-05-17T18:54:27.456833 #82067] INFO -- : make[2]: Leaving directory '/tmp/ruby/build/trunk/ext/monitor' I, [2024-05-17T18:54:27.456857 #82067] INFO -- : make[2]: Leaving directory '/tmp/ruby/build/trunk/ext/digest' I, [2024-05-17T18:54:27.456937 #82067] INFO -- : make[2]: Entering directory '/tmp/ruby/build/trunk/ext/psych' I, [2024-05-17T18:54:27.457385 #82067] INFO -- : make[2]: Entering directory '/tmp/ruby/build/trunk/.bundle/gems/bigdecimal-3.1.8/ext/bigdecimal' I, [2024-05-17T18:54:27.457453 #82067] INFO -- : make[2]: Leaving directory '/tmp/ruby/build/trunk/ext/pathname' I, [2024-05-17T18:54:27.457653 #82067] INFO -- : make[2]: Leaving directory '/tmp/ruby/build/trunk/ext/date' I, [2024-05-17T18:54:27.458145 #82067] INFO -- : make[2]: Entering directory '/tmp/ruby/build/trunk/.bundle/gems/debug-1.9.2/ext/debug' I, [2024-05-17T18:54:27.458755 #82067] INFO -- : make[2]: Leaving directory '/tmp/ruby/build/trunk/ext/pty' I, [2024-05-17T18:54:27.459346 #82067] INFO -- : make[2]: Entering directory '/tmp/ruby/build/trunk/.bundle/gems/racc-1.7.3/ext/racc/cparse' I, [2024-05-17T18:54:27.459599 #82067] INFO -- : make[2]: Entering directory '/tmp/ruby/build/trunk/.bundle/gems/nkf-0.2.0/ext/nkf' I, [2024-05-17T18:54:27.459639 #82067] INFO -- : make[2]: Entering directory '/tmp/ruby/build/trunk/ext/ripper' I, [2024-05-17T18:54:27.460146 #82067] INFO -- : make[2]: Entering directory '/tmp/ruby/build/trunk/.bundle/gems/syslog-0.1.2/ext/syslog' I, [2024-05-17T18:54:27.460404 #82067] INFO -- : make[2]: Entering directory '/tmp/ruby/build/trunk/.bundle/gems/rbs-3.4.4/ext/rbs_extension' I, [2024-05-17T18:54:27.461010 #82067] INFO -- : make[2]: Leaving directory '/tmp/ruby/build/trunk/ext/json' I, [2024-05-17T18:54:27.462696 #82067] INFO -- : make[2]: Leaving directory '/tmp/ruby/build/trunk/ext/fiddle' I, [2024-05-17T18:54:27.463359 #82067] INFO -- : make[2]: Entering directory '/tmp/ruby/build/trunk/ext/digest/sha2' I, [2024-05-17T18:54:27.463523 #82067] INFO -- : make[2]: Entering directory '/tmp/ruby/build/trunk/ext/socket' I, [2024-05-17T18:54:27.465584 #82067] INFO -- : make[2]: Leaving directory '/tmp/ruby/build/trunk/ext/ripper' I, [2024-05-17T18:54:27.466648 #82067] INFO -- : make[2]: Leaving directory '/tmp/ruby/build/trunk/ext/digest/sha2' I, [2024-05-17T18:54:27.467166 #82067] INFO -- : make[2]: Leaving directory '/tmp/ruby/build/trunk/ext/objspace' I, [2024-05-17T18:54:27.467667 #82067] INFO -- : make[2]: Leaving directory '/tmp/ruby/build/trunk/ext/psych' I, [2024-05-17T18:54:27.468057 #82067] INFO -- : make[2]: Entering directory '/tmp/ruby/build/trunk/ext/openssl' I, [2024-05-17T18:54:27.469369 #82067] INFO -- : make[2]: Leaving directory '/tmp/ruby/build/trunk/ext/socket' I, [2024-05-17T18:54:27.480562 #82067] INFO -- : make[2]: Leaving directory '/tmp/ruby/build/trunk/ext/openssl' I, [2024-05-17T18:54:27.481432 #82067] INFO -- : make[2]: Leaving directory '/tmp/ruby/build/trunk/.bundle/gems/bigdecimal-3.1.8/ext/bigdecimal' I, [2024-05-17T18:54:27.481642 #82067] INFO -- : make[2]: Leaving directory '/tmp/ruby/build/trunk/.bundle/gems/debug-1.9.2/ext/debug' I, [2024-05-17T18:54:27.482525 #82067] INFO -- : make[2]: Leaving directory '/tmp/ruby/build/trunk/.bundle/gems/racc-1.7.3/ext/racc/cparse' I, [2024-05-17T18:54:27.484811 #82067] INFO -- : make[2]: Leaving directory '/tmp/ruby/build/trunk/.bundle/gems/rbs-3.4.4/ext/rbs_extension' I, [2024-05-17T18:54:27.490776 #82067] INFO -- : make[2]: Leaving directory '/tmp/ruby/build/trunk/.bundle/gems/nkf-0.2.0/ext/nkf' I, [2024-05-17T18:54:27.493307 #82067] INFO -- : make[2]: Leaving directory '/tmp/ruby/build/trunk/.bundle/gems/syslog-0.1.2/ext/syslog' I, [2024-05-17T18:54:27.517705 #82067] INFO -- : make[2]: Entering directory '/tmp/ruby/build/trunk' I, [2024-05-17T18:54:27.596754 #82067] INFO -- : linking ruby I, [2024-05-17T18:54:27.619443 #82067] INFO -- : make[2]: Leaving directory '/tmp/ruby/build/trunk' I, [2024-05-17T18:54:27.619992 #82067] INFO -- : make[1]: Leaving directory '/tmp/ruby/build/trunk' I, [2024-05-17T18:54:27.624156 #82067] INFO -- : make[1]: Entering directory '/tmp/ruby/build/trunk' I, [2024-05-17T18:54:27.624187 #82067] INFO -- : make[1]: Nothing to be done for 'note'. I, [2024-05-17T18:54:27.624199 #82067] INFO -- : make[1]: Leaving directory '/tmp/ruby/build/trunk' I, [2024-05-17T18:54:27.624969 #82067] INFO -- : $$$[end] "make all -j20" exit with 0. I, [2024-05-17T18:54:27.625141 #82067] INFO -- : $$$[beg] make install -j20 I, [2024-05-17T18:54:27.690692 #82067] INFO -- : Update power_assert to 84e85124c5014a139af39161d484156cfe87a9ed I, [2024-05-17T18:54:27.690979 #82067] INFO -- : Update rbs to ba7872795d5de04adb8ff500c0e6afdc81a041dd I, [2024-05-17T18:54:27.691528 #82067] INFO -- : Update typeprof to b19a6416da3a05d57fadd6ffdadb382b6d236ca5 I, [2024-05-17T18:54:27.692841 #82067] INFO -- : echo 84e85124c5014a139af39161d484156cfe87a9ed | /bin/sh /tmp/ruby/src/trunk/tool/ifchange /tmp/ruby/src/trunk/.bundle/.timestamp/power_assert.revision - I, [2024-05-17T18:54:27.694131 #82067] INFO -- : BASERUBY = /usr/bin/ruby --disable=gems I, [2024-05-17T18:54:27.694177 #82067] INFO -- : CC = gcc I, [2024-05-17T18:54:27.694199 #82067] INFO -- : LD = ld I, [2024-05-17T18:54:27.694215 #82067] INFO -- : LDSHARED = gcc -shared I, [2024-05-17T18:54:27.694230 #82067] INFO -- : CFLAGS = -O3 -fno-fast-math -ggdb3 -Wall -Wextra -Wdeprecated-declarations -Wdiv-by-zero -Wduplicated-cond -Wimplicit-function-declaration -Wimplicit-int -Wpointer-arith -Wwrite-strings -Wold-style-definition -Wimplicit-fallthrough=0 -Wmissing-noreturn -Wno-cast-function-type -Wno-constant-logical-operand -Wno-long-long -Wno-missing-field-initializers -Wno-overlength-strings -Wno-packed-bitfield-compat -Wno-parentheses-equality -Wno-self-assign -Wno-tautological-compare -Wno-unused-parameter -Wno-unused-value -Wsuggest-attribute=format -Wsuggest-attribute=noreturn -Wunused-variable -Wmisleading-indentation -Wundef -fPIC I, [2024-05-17T18:54:27.694256 #82067] INFO -- : XCFLAGS = -U_FORTIFY_SOURCE -D_FORTIFY_SOURCE=2 -fstack-protector-strong -fno-strict-overflow -fvisibility=hidden -fexcess-precision=standard -DRUBY_EXPORT -I. -I.ext/include/x86_64-linux -I/tmp/ruby/src/trunk/include -I/tmp/ruby/src/trunk -I/tmp/ruby/src/trunk/prism -I/tmp/ruby/src/trunk/enc/unicode/15.0.0 I, [2024-05-17T18:54:27.694272 #82067] INFO -- : CPPFLAGS = I, [2024-05-17T18:54:27.694289 #82067] INFO -- : DLDFLAGS = -Wl,--compress-debug-sections=zlib -Wl,-soname,libruby.so.3.4 -fstack-protector-strong I, [2024-05-17T18:54:27.694304 #82067] INFO -- : SOLIBS = -lz -lrt -lrt -lgmp -ldl -lcrypt -lm -lpthread I, [2024-05-17T18:54:27.694318 #82067] INFO -- : LANG = en_US.UTF-8 I, [2024-05-17T18:54:27.694332 #82067] INFO -- : LC_ALL = I, [2024-05-17T18:54:27.694347 #82067] INFO -- : LC_CTYPE = I, [2024-05-17T18:54:27.694360 #82067] INFO -- : MFLAGS = -j20 --jobserver-auth=4,5 I, [2024-05-17T18:54:27.694373 #82067] INFO -- : RUSTC = no I, [2024-05-17T18:54:27.694386 #82067] INFO -- : YJIT_RUSTC_ARGS = --crate-name=yjit --crate-type=staticlib --edition=2021 -g -C lto=thin -C opt-level=3 -C overflow-checks=on '--out-dir=/tmp/ruby/build/trunk/yjit/target/release/' /tmp/ruby/src/trunk/yjit/src/lib.rs I, [2024-05-17T18:54:27.696080 #82067] INFO -- : /tmp/ruby/src/trunk/.bundle/.timestamp/power_assert.revision unchanged I, [2024-05-17T18:54:27.725006 #82067] INFO -- : echo ba7872795d5de04adb8ff500c0e6afdc81a041dd | /bin/sh /tmp/ruby/src/trunk/tool/ifchange /tmp/ruby/src/trunk/.bundle/.timestamp/rbs.revision - I, [2024-05-17T18:54:27.725199 #82067] INFO -- : echo b19a6416da3a05d57fadd6ffdadb382b6d236ca5 | /bin/sh /tmp/ruby/src/trunk/tool/ifchange /tmp/ruby/src/trunk/.bundle/.timestamp/typeprof.revision - I, [2024-05-17T18:54:27.725928 #82067] INFO -- : gcc (Ubuntu 11.4.0-1ubuntu1~22.04) 11.4.0 I, [2024-05-17T18:54:27.725948 #82067] INFO -- : Copyright (C) 2021 Free Software Foundation, Inc. I, [2024-05-17T18:54:27.725953 #82067] INFO -- : This is free software; see the source for copying conditions. There is NO I, [2024-05-17T18:54:27.725957 #82067] INFO -- : warranty; not even for MERCHANTABILITY or FITNESS FOR A PARTICULAR PURPOSE. I, [2024-05-17T18:54:27.725961 #82067] INFO -- : I, [2024-05-17T18:54:27.726087 #82067] INFO -- : generating enc.mk I, [2024-05-17T18:54:27.727103 #82067] INFO -- : /tmp/ruby/src/trunk/.bundle/.timestamp/rbs.revision unchanged I, [2024-05-17T18:54:27.727157 #82067] INFO -- : /tmp/ruby/src/trunk/.bundle/.timestamp/typeprof.revision unchanged I, [2024-05-17T18:54:27.849609 #82067] INFO -- : Building power_assert@84e85124c5014a139af39161d484156cfe87a9ed to /tmp/ruby/src/trunk/gems/power_assert-2.0.3.gem I, [2024-05-17T18:54:27.850338 #82067] INFO -- : making srcs under enc I, [2024-05-17T18:54:27.850596 #82067] INFO -- : making enc I, [2024-05-17T18:54:27.867501 #82067] INFO -- : make[1]: Entering directory '/tmp/ruby/build/trunk' I, [2024-05-17T18:54:27.867541 #82067] INFO -- : make[1]: Nothing to be done for 'enc'. I, [2024-05-17T18:54:27.867554 #82067] INFO -- : make[1]: Leaving directory '/tmp/ruby/build/trunk' I, [2024-05-17T18:54:27.879619 #82067] INFO -- : make[1]: Entering directory '/tmp/ruby/build/trunk' I, [2024-05-17T18:54:27.879667 #82067] INFO -- : make[1]: Nothing to be done for 'srcs'. I, [2024-05-17T18:54:27.879692 #82067] INFO -- : make[1]: Leaving directory '/tmp/ruby/build/trunk' I, [2024-05-17T18:54:27.880374 #82067] INFO -- : generating transdb.h I, [2024-05-17T18:54:27.918735 #82067] INFO -- : Successfully built RubyGem I, [2024-05-17T18:54:27.918777 #82067] INFO -- : Name: power_assert I, [2024-05-17T18:54:27.918784 #82067] INFO -- : Version: 2.0.4dev I, [2024-05-17T18:54:27.918788 #82067] INFO -- : File: power_assert-2.0.4dev.gem I, [2024-05-17T18:54:27.921118 #82067] INFO -- : Extracting bundle gem power_assert-2.0.3... I, [2024-05-17T18:54:27.976723 #82067] INFO -- : transdb.h unchanged I, [2024-05-17T18:54:27.978461 #82067] INFO -- : generating makefiles ext/configure-ext.mk I, [2024-05-17T18:54:27.978831 #82067] INFO -- : making trans I, [2024-05-17T18:54:27.983449 #82067] INFO -- : Try with hash version of bundled gems instead of gems/power_assert-2.0.3.gem. We don't use this gem with release version of Ruby. I, [2024-05-17T18:54:27.988459 #82067] INFO -- : Unpacked gems/power_assert-2.0.4dev.gem I, [2024-05-17T18:54:28.005621 #82067] INFO -- : ext/configure-ext.mk unchanged I, [2024-05-17T18:54:28.008089 #82067] INFO -- : make[1]: Entering directory '/tmp/ruby/build/trunk' I, [2024-05-17T18:54:28.015368 #82067] INFO -- : make[1]: Entering directory '/tmp/ruby/build/trunk' I, [2024-05-17T18:54:28.015451 #82067] INFO -- : make[1]: Nothing to be done for 'trans'. I, [2024-05-17T18:54:28.015464 #82067] INFO -- : make[1]: Leaving directory '/tmp/ruby/build/trunk' I, [2024-05-17T18:54:28.016321 #82067] INFO -- : making encs I, [2024-05-17T18:54:28.073225 #82067] INFO -- : make[1]: Entering directory '/tmp/ruby/build/trunk' I, [2024-05-17T18:54:28.073299 #82067] INFO -- : make[1]: Nothing to be done for 'encs'. I, [2024-05-17T18:54:28.073326 #82067] INFO -- : make[1]: Leaving directory '/tmp/ruby/build/trunk' I, [2024-05-17T18:54:28.152158 #82067] INFO -- : make[1]: Leaving directory '/tmp/ruby/build/trunk' I, [2024-05-17T18:54:28.152918 #82067] INFO -- : generating makefile exts.mk I, [2024-05-17T18:54:28.189761 #82067] INFO -- : exts.mk unchanged I, [2024-05-17T18:54:28.194280 #82067] INFO -- : make[1]: Entering directory '/tmp/ruby/build/trunk' I, [2024-05-17T18:54:28.212585 #82067] INFO -- : make[2]: Entering directory '/tmp/ruby/build/trunk/ext/digest' I, [2024-05-17T18:54:28.213974 #82067] INFO -- : make[2]: Entering directory '/tmp/ruby/build/trunk/ext/json' I, [2024-05-17T18:54:28.214163 #82067] INFO -- : make[2]: Entering directory '/tmp/ruby/build/trunk/ext/coverage' I, [2024-05-17T18:54:28.214735 #82067] INFO -- : make[2]: Entering directory '/tmp/ruby/build/trunk/ext/io/console' I, [2024-05-17T18:54:28.214833 #82067] INFO -- : make[2]: Entering directory '/tmp/ruby/build/trunk/ext/date' I, [2024-05-17T18:54:28.215807 #82067] INFO -- : make[2]: Entering directory '/tmp/ruby/build/trunk/ext/monitor' I, [2024-05-17T18:54:28.215833 #82067] INFO -- : make[2]: Entering directory '/tmp/ruby/build/trunk/ext/pty' I, [2024-05-17T18:54:28.216117 #82067] INFO -- : make[2]: Entering directory '/tmp/ruby/build/trunk/ext/fiddle' I, [2024-05-17T18:54:28.216752 #82067] INFO -- : make[2]: Entering directory '/tmp/ruby/build/trunk/ext/pathname' I, [2024-05-17T18:54:28.217130 #82067] INFO -- : make[2]: Leaving directory '/tmp/ruby/build/trunk/ext/coverage' I, [2024-05-17T18:54:28.217380 #82067] INFO -- : make[2]: Entering directory '/tmp/ruby/build/trunk/ext/rubyvm' I, [2024-05-17T18:54:28.217389 #82067] INFO -- : make[2]: Leaving directory '/tmp/ruby/build/trunk/ext/io/console' I, [2024-05-17T18:54:28.217574 #82067] INFO -- : make[2]: Leaving directory '/tmp/ruby/build/trunk/ext/digest' I, [2024-05-17T18:54:28.218255 #82067] INFO -- : make[2]: Entering directory '/tmp/ruby/build/trunk/ext/objspace' I, [2024-05-17T18:54:28.218364 #82067] INFO -- : make[2]: Leaving directory '/tmp/ruby/build/trunk/ext/date' I, [2024-05-17T18:54:28.218778 #82067] INFO -- : make[2]: Leaving directory '/tmp/ruby/build/trunk/ext/pty' I, [2024-05-17T18:54:28.218829 #82067] INFO -- : make[2]: Entering directory '/tmp/ruby/build/trunk/ext/psych' I, [2024-05-17T18:54:28.218903 #82067] INFO -- : make[2]: Leaving directory '/tmp/ruby/build/trunk/ext/monitor' I, [2024-05-17T18:54:28.219078 #82067] INFO -- : make[2]: Leaving directory '/tmp/ruby/build/trunk/ext/pathname' I, [2024-05-17T18:54:28.219479 #82067] INFO -- : make[2]: Leaving directory '/tmp/ruby/build/trunk/ext/rubyvm' I, [2024-05-17T18:54:28.219512 #82067] INFO -- : make[2]: Leaving directory '/tmp/ruby/build/trunk/ext/json' I, [2024-05-17T18:54:28.220017 #82067] INFO -- : make[2]: Entering directory '/tmp/ruby/build/trunk/.bundle/gems/bigdecimal-3.1.8/ext/bigdecimal' I, [2024-05-17T18:54:28.221188 #82067] INFO -- : make[2]: Entering directory '/tmp/ruby/build/trunk/.bundle/gems/debug-1.9.2/ext/debug' I, [2024-05-17T18:54:28.221403 #82067] INFO -- : make[2]: Entering directory '/tmp/ruby/build/trunk/.bundle/gems/nkf-0.2.0/ext/nkf' I, [2024-05-17T18:54:28.221518 #82067] INFO -- : make[2]: Entering directory '/tmp/ruby/build/trunk/.bundle/gems/racc-1.7.3/ext/racc/cparse' I, [2024-05-17T18:54:28.221809 #82067] INFO -- : make[2]: Entering directory '/tmp/ruby/build/trunk/.bundle/gems/syslog-0.1.2/ext/syslog' I, [2024-05-17T18:54:28.222046 #82067] INFO -- : make[2]: Entering directory '/tmp/ruby/build/trunk/.bundle/gems/rbs-3.4.4/ext/rbs_extension' I, [2024-05-17T18:54:28.222890 #82067] INFO -- : make[2]: Leaving directory '/tmp/ruby/build/trunk/ext/fiddle' I, [2024-05-17T18:54:28.223699 #82067] INFO -- : make[2]: Entering directory '/tmp/ruby/build/trunk/ext/ripper' I, [2024-05-17T18:54:28.227219 #82067] INFO -- : make[2]: Entering directory '/tmp/ruby/build/trunk/ext/digest/sha2' I, [2024-05-17T18:54:28.227641 #82067] INFO -- : make[2]: Leaving directory '/tmp/ruby/build/trunk/ext/ripper' I, [2024-05-17T18:54:28.227681 #82067] INFO -- : make[2]: Leaving directory '/tmp/ruby/build/trunk/ext/objspace' I, [2024-05-17T18:54:28.227897 #82067] INFO -- : make[2]: Entering directory '/tmp/ruby/build/trunk/ext/socket' I, [2024-05-17T18:54:28.230130 #82067] INFO -- : make[2]: Leaving directory '/tmp/ruby/build/trunk/ext/psych' I, [2024-05-17T18:54:28.230484 #82067] INFO -- : make[2]: Leaving directory '/tmp/ruby/build/trunk/ext/digest/sha2' I, [2024-05-17T18:54:28.230956 #82067] INFO -- : make[2]: Entering directory '/tmp/ruby/build/trunk/ext/openssl' I, [2024-05-17T18:54:28.236523 #82067] INFO -- : make[2]: Leaving directory '/tmp/ruby/build/trunk/ext/socket' I, [2024-05-17T18:54:28.242952 #82067] INFO -- : make[2]: Leaving directory '/tmp/ruby/build/trunk/ext/openssl' I, [2024-05-17T18:54:28.243461 #82067] INFO -- : make[2]: Leaving directory '/tmp/ruby/build/trunk/.bundle/gems/bigdecimal-3.1.8/ext/bigdecimal' I, [2024-05-17T18:54:28.243510 #82067] INFO -- : make[2]: Leaving directory '/tmp/ruby/build/trunk/.bundle/gems/debug-1.9.2/ext/debug' I, [2024-05-17T18:54:28.245345 #82067] INFO -- : make[2]: Leaving directory '/tmp/ruby/build/trunk/.bundle/gems/rbs-3.4.4/ext/rbs_extension' I, [2024-05-17T18:54:28.245623 #82067] INFO -- : make[2]: Leaving directory '/tmp/ruby/build/trunk/.bundle/gems/syslog-0.1.2/ext/syslog' I, [2024-05-17T18:54:28.252956 #82067] INFO -- : make[2]: Leaving directory '/tmp/ruby/build/trunk/.bundle/gems/racc-1.7.3/ext/racc/cparse' I, [2024-05-17T18:54:28.254077 #82067] INFO -- : make[2]: Leaving directory '/tmp/ruby/build/trunk/.bundle/gems/nkf-0.2.0/ext/nkf' I, [2024-05-17T18:54:28.277890 #82067] INFO -- : make[2]: Entering directory '/tmp/ruby/build/trunk' I, [2024-05-17T18:54:28.348537 #82067] INFO -- : make[2]: 'ruby' is up to date. I, [2024-05-17T18:54:28.348602 #82067] INFO -- : make[2]: Leaving directory '/tmp/ruby/build/trunk' I, [2024-05-17T18:54:28.348879 #82067] INFO -- : make[1]: Leaving directory '/tmp/ruby/build/trunk' I, [2024-05-17T18:54:28.352567 #82067] INFO -- : make[1]: Entering directory '/tmp/ruby/build/trunk' I, [2024-05-17T18:54:28.352620 #82067] INFO -- : make[1]: Nothing to be done for 'note'. I, [2024-05-17T18:54:28.352633 #82067] INFO -- : make[1]: Leaving directory '/tmp/ruby/build/trunk' I, [2024-05-17T18:54:28.353016 #82067] INFO -- : ./miniruby -I/tmp/ruby/src/trunk/lib -I. -I.ext/common /tmp/ruby/src/trunk/tool/runruby.rb --extout=.ext -- --disable-gems -r./x86_64-linux-fake /tmp/ruby/src/trunk/tool/rbinstall.rb --make="make" --dest-dir="" --extout=".ext" --ext-build-dir="./ext" --mflags="-j20 --jobserver-auth=4,5" --make-flags=" -j20 --jobserver-auth=4,5" --data-mode=0644 --prog-mode=0755 --installed-list .installed.list --mantype="doc" --gnumake --install=all --exclude=doc I, [2024-05-17T18:54:28.451504 #82067] INFO -- : Installing to I, [2024-05-17T18:54:28.451569 #82067] INFO -- : installing binary commands: /tmp/ruby/install/trunk/bin I, [2024-05-17T18:54:28.451594 #82067] INFO -- : installing base libraries: /tmp/ruby/install/trunk/lib I, [2024-05-17T18:54:28.458868 #82067] INFO -- : installing arch files: /tmp/ruby/install/trunk/lib/ruby/3.4.0+0/x86_64-linux I, [2024-05-17T18:54:28.458938 #82067] INFO -- : installing pkgconfig data: /tmp/ruby/install/trunk/lib/pkgconfig I, [2024-05-17T18:54:28.458953 #82067] INFO -- : installing extension objects: /tmp/ruby/install/trunk/lib/ruby/3.4.0+0/x86_64-linux I, [2024-05-17T18:54:28.468353 #82067] INFO -- : installing extension objects: /tmp/ruby/install/trunk/lib/ruby/site_ruby/3.4.0+0/x86_64-linux I, [2024-05-17T18:54:28.468416 #82067] INFO -- : installing extension objects: /tmp/ruby/install/trunk/lib/ruby/vendor_ruby/3.4.0+0/x86_64-linux I, [2024-05-17T18:54:28.468430 #82067] INFO -- : installing extension headers: /tmp/ruby/install/trunk/include/ruby-3.4.0+0/x86_64-linux I, [2024-05-17T18:54:28.468451 #82067] INFO -- : installing extension scripts: /tmp/ruby/install/trunk/lib/ruby/3.4.0+0 I, [2024-05-17T18:54:28.471253 #82067] INFO -- : installing extension scripts: /tmp/ruby/install/trunk/lib/ruby/site_ruby/3.4.0+0 I, [2024-05-17T18:54:28.471320 #82067] INFO -- : installing extension scripts: /tmp/ruby/install/trunk/lib/ruby/vendor_ruby/3.4.0+0 I, [2024-05-17T18:54:28.471334 #82067] INFO -- : installing extension headers: /tmp/ruby/install/trunk/include/ruby-3.4.0+0/ruby I, [2024-05-17T18:54:28.471346 #82067] INFO -- : installing command scripts: /tmp/ruby/install/trunk/bin I, [2024-05-17T18:54:28.471358 #82067] INFO -- : installing library scripts: /tmp/ruby/install/trunk/lib/ruby/3.4.0+0 I, [2024-05-17T18:54:28.503767 #82067] INFO -- : installing common headers: /tmp/ruby/install/trunk/include/ruby-3.4.0+0 I, [2024-05-17T18:54:28.510191 #82067] INFO -- : installing manpages: /tmp/ruby/install/trunk/share/man/man1 I, [2024-05-17T18:54:28.510265 #82067] INFO -- : installing default gems from lib: /tmp/ruby/install/trunk/lib/ruby/gems/3.4.0+0 I, [2024-05-17T18:54:28.533040 #82067] INFO -- : benchmark 0.3.0 I, [2024-05-17T18:54:28.534887 #82067] INFO -- : bundler 2.6.0.dev I, [2024-05-17T18:54:28.536970 #82067] INFO -- : cgi 0.4.1 I, [2024-05-17T18:54:28.537517 #82067] INFO -- : delegate 0.3.1 I, [2024-05-17T18:54:28.537975 #82067] INFO -- : did_you_mean 1.6.3 I, [2024-05-17T18:54:28.538445 #82067] INFO -- : english 0.8.0 I, [2024-05-17T18:54:28.538894 #82067] INFO -- : erb 4.0.4 I, [2024-05-17T18:54:28.539929 #82067] INFO -- : error_highlight 0.6.0 I, [2024-05-17T18:54:28.540826 #82067] INFO -- : fileutils 1.7.2 I, [2024-05-17T18:54:28.541502 #82067] INFO -- : find 0.2.0 I, [2024-05-17T18:54:28.542342 #82067] INFO -- : forwardable 1.3.3 I, [2024-05-17T18:54:28.543389 #82067] INFO -- : ipaddr 1.2.6 I, [2024-05-17T18:54:28.543904 #82067] INFO -- : irb 1.13.1 I, [2024-05-17T18:54:28.544745 #82067] INFO -- : logger 1.6.0 I, [2024-05-17T18:54:28.545207 #82067] INFO -- : net-http 0.4.1 I, [2024-05-17T18:54:28.545687 #82067] INFO -- : net-protocol 0.2.2 I, [2024-05-17T18:54:28.546185 #82067] INFO -- : open-uri 0.4.1 I, [2024-05-17T18:54:28.546684 #82067] INFO -- : open3 0.2.1 I, [2024-05-17T18:54:28.547134 #82067] INFO -- : optparse 0.5.0 I, [2024-05-17T18:54:28.547537 #82067] INFO -- : ostruct 0.6.0 I, [2024-05-17T18:54:28.548086 #82067] INFO -- : pp 0.5.0 I, [2024-05-17T18:54:28.548522 #82067] INFO -- : prettyprint 0.2.0 I, [2024-05-17T18:54:28.549024 #82067] INFO -- : prism 0.29.0 I, [2024-05-17T18:54:28.549530 #82067] INFO -- : pstore 0.1.3 I, [2024-05-17T18:54:28.549995 #82067] INFO -- : rdoc 6.6.3.1 I, [2024-05-17T18:54:28.550953 #82067] INFO -- : readline 0.0.4 I, [2024-05-17T18:54:28.551478 #82067] INFO -- : reline 0.5.7 I, [2024-05-17T18:54:28.551977 #82067] INFO -- : resolv 0.4.0 I, [2024-05-17T18:54:28.552451 #82067] INFO -- : ruby2_keywords 0.0.5 I, [2024-05-17T18:54:28.552992 #82067] INFO -- : securerandom 0.3.1 I, [2024-05-17T18:54:28.553860 #82067] INFO -- : set 1.1.0 I, [2024-05-17T18:54:28.554688 #82067] INFO -- : shellwords 0.2.0 I, [2024-05-17T18:54:28.555168 #82067] INFO -- : singleton 0.2.0 I, [2024-05-17T18:54:28.555626 #82067] INFO -- : syntax_suggest 2.0.0 I, [2024-05-17T18:54:28.556381 #82067] INFO -- : tempfile 0.2.1 I, [2024-05-17T18:54:28.556867 #82067] INFO -- : time 0.3.0 I, [2024-05-17T18:54:28.557344 #82067] INFO -- : timeout 0.4.1 I, [2024-05-17T18:54:28.557796 #82067] INFO -- : tmpdir 0.2.0 I, [2024-05-17T18:54:28.558270 #82067] INFO -- : tsort 0.2.0 I, [2024-05-17T18:54:28.558664 #82067] INFO -- : un 0.3.0 I, [2024-05-17T18:54:28.559150 #82067] INFO -- : uri 0.13.0 I, [2024-05-17T18:54:28.559657 #82067] INFO -- : weakref 0.1.3 I, [2024-05-17T18:54:28.560134 #82067] INFO -- : yaml 0.3.0 I, [2024-05-17T18:54:28.560435 #82067] INFO -- : installing default gems from ext: /tmp/ruby/install/trunk/lib/ruby/gems/3.4.0+0 I, [2024-05-17T18:54:28.567171 #82067] INFO -- : date 3.3.4 I, [2024-05-17T18:54:28.567594 #82067] INFO -- : digest 3.1.1 I, [2024-05-17T18:54:28.568014 #82067] INFO -- : etc 1.4.3 I, [2024-05-17T18:54:28.568581 #82067] INFO -- : fcntl 1.1.0 I, [2024-05-17T18:54:28.569054 #82067] INFO -- : fiddle 1.1.3 I, [2024-05-17T18:54:28.569536 #82067] INFO -- : io-console 0.7.2 I, [2024-05-17T18:54:28.570000 #82067] INFO -- : io-nonblock 0.3.0 I, [2024-05-17T18:54:28.570450 #82067] INFO -- : io-wait 0.3.1 I, [2024-05-17T18:54:28.570929 #82067] INFO -- : json 2.7.2 I, [2024-05-17T18:54:28.571414 #82067] INFO -- : openssl 3.2.0 I, [2024-05-17T18:54:28.571972 #82067] INFO -- : pathname 0.3.0 I, [2024-05-17T18:54:28.572439 #82067] INFO -- : psych 5.1.2 I, [2024-05-17T18:54:28.573054 #82067] INFO -- : stringio 3.1.1 I, [2024-05-17T18:54:28.573540 #82067] INFO -- : strscan 3.1.1 I, [2024-05-17T18:54:28.573977 #82067] INFO -- : zlib 3.1.0 I, [2024-05-17T18:54:28.574335 #82067] INFO -- : installing bundled gems: /tmp/ruby/install/trunk/lib/ruby/gems/3.4.0+0 I, [2024-05-17T18:54:28.574896 #82067] INFO -- : minitest 5.23.0 I, [2024-05-17T18:54:28.583276 #82067] INFO -- : rake 13.2.1 I, [2024-05-17T18:54:28.586667 #82067] INFO -- : test-unit 3.6.2 I, [2024-05-17T18:54:28.591484 #82067] INFO -- : rexml 3.2.6 I, [2024-05-17T18:54:28.595167 #82067] INFO -- : rss 0.3.0 I, [2024-05-17T18:54:28.597864 #82067] INFO -- : net-ftp 0.3.4 I, [2024-05-17T18:54:28.599435 #82067] INFO -- : net-imap 0.4.11 I, [2024-05-17T18:54:28.603123 #82067] INFO -- : net-pop 0.1.2 I, [2024-05-17T18:54:28.604265 #82067] INFO -- : net-smtp 0.5.0 I, [2024-05-17T18:54:28.605407 #82067] INFO -- : matrix 0.4.2 I, [2024-05-17T18:54:28.608685 #82067] INFO -- : prime 0.1.2 I, [2024-05-17T18:54:28.613361 #82067] INFO -- : rbs 3.4.4 I, [2024-05-17T18:54:28.635240 #82067] INFO -- : typeprof 0.21.11 I, [2024-05-17T18:54:28.638027 #82067] INFO -- : debug 1.9.2 I, [2024-05-17T18:54:28.641087 #82067] INFO -- : racc 1.7.3 I, [2024-05-17T18:54:28.643810 #82067] INFO -- : mutex_m 0.2.0 I, [2024-05-17T18:54:28.645337 #82067] INFO -- : getoptlong 0.2.1 I, [2024-05-17T18:54:28.646713 #82067] INFO -- : base64 0.2.0 I, [2024-05-17T18:54:28.647819 #82067] INFO -- : bigdecimal 3.1.8 I, [2024-05-17T18:54:28.649868 #82067] INFO -- : observer 0.1.2 I, [2024-05-17T18:54:28.651461 #82067] INFO -- : abbrev 0.1.2 I, [2024-05-17T18:54:28.652584 #82067] INFO -- : resolv-replace 0.1.1 I, [2024-05-17T18:54:28.654027 #82067] INFO -- : rinda 0.2.0 I, [2024-05-17T18:54:28.655320 #82067] INFO -- : drb 2.2.1 I, [2024-05-17T18:54:28.656935 #82067] INFO -- : nkf 0.2.0 I, [2024-05-17T18:54:28.659388 #82067] INFO -- : syslog 0.1.2 I, [2024-05-17T18:54:28.661214 #82067] INFO -- : csv 3.3.0 I, [2024-05-17T18:54:28.663866 #82067] INFO -- : installing bundled gem cache: /tmp/ruby/install/trunk/lib/ruby/gems/3.4.0+0/cache I, [2024-05-17T18:54:28.665322 #82067] INFO -- : skipped bundled gems: I, [2024-05-17T18:54:28.665387 #82067] INFO -- : power_assert-2.0.4dev.gem not found in bundled_gems I, [2024-05-17T18:54:28.668842 #82067] INFO -- : $$$[end] "make install -j20" exit with 0. I, [2024-05-17T18:54:28.668983 #82067] INFO -- : $$$[beg] make yes-btest TESTOPTS='-q -j20' I, [2024-05-17T18:54:34.041423 #82067] INFO -- : PASS all 1936 tests E, [2024-05-17T18:54:34.047142 #82067] ERROR -- : I, [2024-05-17T18:54:34.047312 #82067] INFO -- : $$$[end] "make yes-btest TESTOPTS='-q -j20'" exit with 0. I, [2024-05-17T18:54:34.047403 #82067] INFO -- : $$$[beg] make yes-test-basic TESTS='-j20' I, [2024-05-17T18:54:34.110473 #82067] INFO -- : BASERUBY = /usr/bin/ruby --disable=gems I, [2024-05-17T18:54:34.110521 #82067] INFO -- : CC = gcc I, [2024-05-17T18:54:34.110535 #82067] INFO -- : LD = ld I, [2024-05-17T18:54:34.110548 #82067] INFO -- : LDSHARED = gcc -shared I, [2024-05-17T18:54:34.110559 #82067] INFO -- : CFLAGS = -O3 -fno-fast-math -ggdb3 -Wall -Wextra -Wdeprecated-declarations -Wdiv-by-zero -Wduplicated-cond -Wimplicit-function-declaration -Wimplicit-int -Wpointer-arith -Wwrite-strings -Wold-style-definition -Wimplicit-fallthrough=0 -Wmissing-noreturn -Wno-cast-function-type -Wno-constant-logical-operand -Wno-long-long -Wno-missing-field-initializers -Wno-overlength-strings -Wno-packed-bitfield-compat -Wno-parentheses-equality -Wno-self-assign -Wno-tautological-compare -Wno-unused-parameter -Wno-unused-value -Wsuggest-attribute=format -Wsuggest-attribute=noreturn -Wunused-variable -Wmisleading-indentation -Wundef -fPIC I, [2024-05-17T18:54:34.110580 #82067] INFO -- : XCFLAGS = -U_FORTIFY_SOURCE -D_FORTIFY_SOURCE=2 -fstack-protector-strong -fno-strict-overflow -fvisibility=hidden -fexcess-precision=standard -DRUBY_EXPORT -I. -I.ext/include/x86_64-linux -I/tmp/ruby/src/trunk/include -I/tmp/ruby/src/trunk -I/tmp/ruby/src/trunk/prism -I/tmp/ruby/src/trunk/enc/unicode/15.0.0 I, [2024-05-17T18:54:34.110592 #82067] INFO -- : CPPFLAGS = I, [2024-05-17T18:54:34.110602 #82067] INFO -- : DLDFLAGS = -Wl,--compress-debug-sections=zlib -Wl,-soname,libruby.so.3.4 -fstack-protector-strong I, [2024-05-17T18:54:34.110613 #82067] INFO -- : SOLIBS = -lz -lrt -lrt -lgmp -ldl -lcrypt -lm -lpthread I, [2024-05-17T18:54:34.110623 #82067] INFO -- : LANG = en_US.UTF-8 I, [2024-05-17T18:54:34.110634 #82067] INFO -- : LC_ALL = I, [2024-05-17T18:54:34.110643 #82067] INFO -- : LC_CTYPE = I, [2024-05-17T18:54:34.110653 #82067] INFO -- : MFLAGS = I, [2024-05-17T18:54:34.110663 #82067] INFO -- : RUSTC = no I, [2024-05-17T18:54:34.110673 #82067] INFO -- : YJIT_RUSTC_ARGS = --crate-name=yjit --crate-type=staticlib --edition=2021 -g -C lto=thin -C opt-level=3 -C overflow-checks=on '--out-dir=/tmp/ruby/build/trunk/yjit/target/release/' /tmp/ruby/src/trunk/yjit/src/lib.rs I, [2024-05-17T18:54:34.111120 #82067] INFO -- : gcc (Ubuntu 11.4.0-1ubuntu1~22.04) 11.4.0 I, [2024-05-17T18:54:34.111164 #82067] INFO -- : Copyright (C) 2021 Free Software Foundation, Inc. I, [2024-05-17T18:54:34.111178 #82067] INFO -- : This is free software; see the source for copying conditions. There is NO I, [2024-05-17T18:54:34.111201 #82067] INFO -- : warranty; not even for MERCHANTABILITY or FITNESS FOR A PARTICULAR PURPOSE. I, [2024-05-17T18:54:34.111213 #82067] INFO -- : I, [2024-05-17T18:54:34.219170 #82067] INFO -- : Checking leaked global symbols...none I, [2024-05-17T18:54:34.259439 #82067] INFO -- : /tmp/ruby/src/trunk/basictest/test.rb:assignment ....................................................................................................................................................................................................................................................................................................................................................................................OK 372 I, [2024-05-17T18:54:34.259524 #82067] INFO -- : /tmp/ruby/src/trunk/basictest/test.rb:condition ..OK 2 I, [2024-05-17T18:54:34.259540 #82067] INFO -- : /tmp/ruby/src/trunk/basictest/test.rb:if/unless ...OK 3 I, [2024-05-17T18:54:34.259553 #82067] INFO -- : /tmp/ruby/src/trunk/basictest/test.rb:case .....OK 5 I, [2024-05-17T18:54:34.259699 #82067] INFO -- : /tmp/ruby/src/trunk/basictest/test.rb:while/until ........OK 8 I, [2024-05-17T18:54:34.259759 #82067] INFO -- : /tmp/ruby/src/trunk/basictest/test.rb:exception ..........OK 10 I, [2024-05-17T18:54:34.260027 #82067] INFO -- : /tmp/ruby/src/trunk/basictest/test.rb:array .......................................OK 39 I, [2024-05-17T18:54:34.260126 #82067] INFO -- : /tmp/ruby/src/trunk/basictest/test.rb:hash ...........................OK 27 I, [2024-05-17T18:54:34.260841 #82067] INFO -- : /tmp/ruby/src/trunk/basictest/test.rb:iterator ...........................................................................................................OK 107 I, [2024-05-17T18:54:34.261109 #82067] INFO -- : /tmp/ruby/src/trunk/basictest/test.rb:float ................................................................................OK 80 I, [2024-05-17T18:54:34.262114 #82067] INFO -- : /tmp/ruby/src/trunk/basictest/test.rb:bignum ...............................OK 31 I, [2024-05-17T18:54:34.262896 #82067] INFO -- : /tmp/ruby/src/trunk/basictest/test.rb:string & char ..............................................................OK 62 I, [2024-05-17T18:54:34.262917 #82067] INFO -- : /tmp/ruby/src/trunk/basictest/test.rb:assignment ..........OK 10 I, [2024-05-17T18:54:34.262941 #82067] INFO -- : /tmp/ruby/src/trunk/basictest/test.rb:call ......OK 6 I, [2024-05-17T18:54:34.262989 #82067] INFO -- : /tmp/ruby/src/trunk/basictest/test.rb:proc .........OK 9 I, [2024-05-17T18:54:34.363565 #82067] INFO -- : /tmp/ruby/src/trunk/basictest/test.rb:signal ..OK 2 I, [2024-05-17T18:54:34.365285 #82067] INFO -- : /tmp/ruby/src/trunk/basictest/test.rb:eval ...........................OK 27 I, [2024-05-17T18:54:34.485298 #82067] INFO -- : /tmp/ruby/src/trunk/basictest/test.rb:system ........OK 8 I, [2024-05-17T18:54:34.485396 #82067] INFO -- : /tmp/ruby/src/trunk/basictest/test.rb:const .....OK 5 I, [2024-05-17T18:54:34.485411 #82067] INFO -- : /tmp/ruby/src/trunk/basictest/test.rb:clone .....OK 5 I, [2024-05-17T18:54:34.485542 #82067] INFO -- : /tmp/ruby/src/trunk/basictest/test.rb:marshal ....OK 4 I, [2024-05-17T18:54:34.485566 #82067] INFO -- : /tmp/ruby/src/trunk/basictest/test.rb:pack ....OK 4 I, [2024-05-17T18:54:34.485594 #82067] INFO -- : /tmp/ruby/src/trunk/basictest/test.rb:math ..OK 2 I, [2024-05-17T18:54:34.485618 #82067] INFO -- : /tmp/ruby/src/trunk/basictest/test.rb:struct ......OK 6 I, [2024-05-17T18:54:34.485702 #82067] INFO -- : /tmp/ruby/src/trunk/basictest/test.rb:variable ............OK 12 I, [2024-05-17T18:54:34.485728 #82067] INFO -- : /tmp/ruby/src/trunk/basictest/test.rb:trace ...OK 3 I, [2024-05-17T18:54:34.485772 #82067] INFO -- : /tmp/ruby/src/trunk/basictest/test.rb:defined? ............OK 12 I, [2024-05-17T18:54:34.485865 #82067] INFO -- : /tmp/ruby/src/trunk/basictest/test.rb:alias ......OK 6 I, [2024-05-17T18:54:34.486209 #82067] INFO -- : /tmp/ruby/src/trunk/basictest/test.rb:path .......................OK 23 I, [2024-05-17T18:54:34.519439 #82067] INFO -- : /tmp/ruby/src/trunk/basictest/test.rb:gc ....OK 4 I, [2024-05-17T18:54:34.521718 #82067] INFO -- : I, [2024-05-17T18:54:34.521827 #82067] INFO -- : test succeeded I, [2024-05-17T18:54:34.523272 #82067] INFO -- : $$$[end] "make yes-test-basic TESTS='-j20'" exit with 0. I, [2024-05-17T18:54:34.523381 #82067] INFO -- : $$$[beg] make yes-test-all TESTOPTS='--stderr-on-failure' TESTS='-j20' I, [2024-05-17T18:54:34.620224 #82067] INFO -- : BASERUBY = /usr/bin/ruby --disable=gems I, [2024-05-17T18:54:34.620280 #82067] INFO -- : CC = gcc I, [2024-05-17T18:54:34.620292 #82067] INFO -- : LD = ld I, [2024-05-17T18:54:34.620303 #82067] INFO -- : LDSHARED = gcc -shared I, [2024-05-17T18:54:34.620321 #82067] INFO -- : CFLAGS = -O3 -fno-fast-math -ggdb3 -Wall -Wextra -Wdeprecated-declarations -Wdiv-by-zero -Wduplicated-cond -Wimplicit-function-declaration -Wimplicit-int -Wpointer-arith -Wwrite-strings -Wold-style-definition -Wimplicit-fallthrough=0 -Wmissing-noreturn -Wno-cast-function-type -Wno-constant-logical-operand -Wno-long-long -Wno-missing-field-initializers -Wno-overlength-strings -Wno-packed-bitfield-compat -Wno-parentheses-equality -Wno-self-assign -Wno-tautological-compare -Wno-unused-parameter -Wno-unused-value -Wsuggest-attribute=format -Wsuggest-attribute=noreturn -Wunused-variable -Wmisleading-indentation -Wundef -fPIC I, [2024-05-17T18:54:34.620332 #82067] INFO -- : XCFLAGS = -U_FORTIFY_SOURCE -D_FORTIFY_SOURCE=2 -fstack-protector-strong -fno-strict-overflow -fvisibility=hidden -fexcess-precision=standard -DRUBY_EXPORT -I. -I.ext/include/x86_64-linux -I/tmp/ruby/src/trunk/include -I/tmp/ruby/src/trunk -I/tmp/ruby/src/trunk/prism -I/tmp/ruby/src/trunk/enc/unicode/15.0.0 I, [2024-05-17T18:54:34.620343 #82067] INFO -- : CPPFLAGS = I, [2024-05-17T18:54:34.620355 #82067] INFO -- : DLDFLAGS = -Wl,--compress-debug-sections=zlib -Wl,-soname,libruby.so.3.4 -fstack-protector-strong I, [2024-05-17T18:54:34.620366 #82067] INFO -- : SOLIBS = -lz -lrt -lrt -lgmp -ldl -lcrypt -lm -lpthread I, [2024-05-17T18:54:34.620386 #82067] INFO -- : LANG = en_US.UTF-8 I, [2024-05-17T18:54:34.620397 #82067] INFO -- : LC_ALL = I, [2024-05-17T18:54:34.620407 #82067] INFO -- : LC_CTYPE = I, [2024-05-17T18:54:34.620417 #82067] INFO -- : MFLAGS = I, [2024-05-17T18:54:34.620427 #82067] INFO -- : RUSTC = no I, [2024-05-17T18:54:34.620437 #82067] INFO -- : YJIT_RUSTC_ARGS = --crate-name=yjit --crate-type=staticlib --edition=2021 -g -C lto=thin -C opt-level=3 -C overflow-checks=on '--out-dir=/tmp/ruby/build/trunk/yjit/target/release/' /tmp/ruby/src/trunk/yjit/src/lib.rs I, [2024-05-17T18:54:34.620949 #82067] INFO -- : gcc (Ubuntu 11.4.0-1ubuntu1~22.04) 11.4.0 I, [2024-05-17T18:54:34.621002 #82067] INFO -- : Copyright (C) 2021 Free Software Foundation, Inc. I, [2024-05-17T18:54:34.621015 #82067] INFO -- : This is free software; see the source for copying conditions. There is NO I, [2024-05-17T18:54:34.621032 #82067] INFO -- : warranty; not even for MERCHANTABILITY or FITNESS FOR A PARTICULAR PURPOSE. I, [2024-05-17T18:54:34.621042 #82067] INFO -- : I, [2024-05-17T18:54:34.622684 #82067] INFO -- : generating enc.mk I, [2024-05-17T18:54:34.741323 #82067] INFO -- : making enc I, [2024-05-17T18:54:34.758535 #82067] INFO -- : make[1]: Entering directory '/tmp/ruby/build/trunk' I, [2024-05-17T18:54:34.758603 #82067] INFO -- : make[1]: Nothing to be done for 'enc'. I, [2024-05-17T18:54:34.758619 #82067] INFO -- : make[1]: Leaving directory '/tmp/ruby/build/trunk' I, [2024-05-17T18:54:34.759282 #82067] INFO -- : making srcs under enc I, [2024-05-17T18:54:34.789327 #82067] INFO -- : make[1]: Entering directory '/tmp/ruby/build/trunk' I, [2024-05-17T18:54:34.789396 #82067] INFO -- : make[1]: Nothing to be done for 'srcs'. I, [2024-05-17T18:54:34.789413 #82067] INFO -- : make[1]: Leaving directory '/tmp/ruby/build/trunk' I, [2024-05-17T18:54:34.790320 #82067] INFO -- : generating transdb.h I, [2024-05-17T18:54:34.887377 #82067] INFO -- : transdb.h unchanged I, [2024-05-17T18:54:34.888872 #82067] INFO -- : making trans I, [2024-05-17T18:54:34.923074 #82067] INFO -- : make[1]: Entering directory '/tmp/ruby/build/trunk' I, [2024-05-17T18:54:34.923138 #82067] INFO -- : make[1]: Nothing to be done for 'trans'. I, [2024-05-17T18:54:34.923151 #82067] INFO -- : make[1]: Leaving directory '/tmp/ruby/build/trunk' I, [2024-05-17T18:54:34.923723 #82067] INFO -- : making encs I, [2024-05-17T18:54:34.962629 #82067] INFO -- : make[1]: Entering directory '/tmp/ruby/build/trunk' I, [2024-05-17T18:54:34.962652 #82067] INFO -- : make[1]: Nothing to be done for 'encs'. I, [2024-05-17T18:54:34.962661 #82067] INFO -- : make[1]: Leaving directory '/tmp/ruby/build/trunk' I, [2024-05-17T18:54:34.964561 #82067] INFO -- : generating makefiles ext/configure-ext.mk I, [2024-05-17T18:54:34.991096 #82067] INFO -- : ext/configure-ext.mk updated I, [2024-05-17T18:54:34.993596 #82067] INFO -- : make[1]: Entering directory '/tmp/ruby/build/trunk' I, [2024-05-17T18:54:36.337507 #82067] INFO -- : make[1]: Leaving directory '/tmp/ruby/build/trunk' I, [2024-05-17T18:54:36.338153 #82067] INFO -- : generating makefile exts.mk I, [2024-05-17T18:54:36.375054 #82067] INFO -- : exts.mk unchanged I, [2024-05-17T18:54:36.379230 #82067] INFO -- : make[1]: Entering directory '/tmp/ruby/build/trunk' I, [2024-05-17T18:54:36.685298 #82067] INFO -- : make[2]: Entering directory '/tmp/ruby/build/trunk/ext/coverage' I, [2024-05-17T18:54:36.689998 #82067] INFO -- : make[2]: Leaving directory '/tmp/ruby/build/trunk/ext/coverage' I, [2024-05-17T18:54:36.696538 #82067] INFO -- : make[2]: Entering directory '/tmp/ruby/build/trunk/ext/date' I, [2024-05-17T18:54:36.701646 #82067] INFO -- : make[2]: Leaving directory '/tmp/ruby/build/trunk/ext/date' I, [2024-05-17T18:54:36.705430 #82067] INFO -- : make[2]: Entering directory '/tmp/ruby/build/trunk/ext/digest' I, [2024-05-17T18:54:36.714298 #82067] INFO -- : make[2]: Leaving directory '/tmp/ruby/build/trunk/ext/digest' I, [2024-05-17T18:54:36.741335 #82067] INFO -- : make[2]: Entering directory '/tmp/ruby/build/trunk/ext/digest/sha2' I, [2024-05-17T18:54:36.746268 #82067] INFO -- : make[2]: Leaving directory '/tmp/ruby/build/trunk/ext/digest/sha2' I, [2024-05-17T18:54:36.768264 #82067] INFO -- : make[2]: Entering directory '/tmp/ruby/build/trunk/ext/fiddle' I, [2024-05-17T18:54:36.779500 #82067] INFO -- : make[2]: Leaving directory '/tmp/ruby/build/trunk/ext/fiddle' I, [2024-05-17T18:54:36.784527 #82067] INFO -- : make[2]: Entering directory '/tmp/ruby/build/trunk/ext/io/console' I, [2024-05-17T18:54:36.788703 #82067] INFO -- : make[2]: Leaving directory '/tmp/ruby/build/trunk/ext/io/console' I, [2024-05-17T18:54:36.801475 #82067] INFO -- : make[2]: Entering directory '/tmp/ruby/build/trunk/ext/json' I, [2024-05-17T18:54:36.812042 #82067] INFO -- : make[2]: Leaving directory '/tmp/ruby/build/trunk/ext/json' I, [2024-05-17T18:54:36.827300 #82067] INFO -- : make[2]: Entering directory '/tmp/ruby/build/trunk/ext/monitor' I, [2024-05-17T18:54:36.831273 #82067] INFO -- : make[2]: Leaving directory '/tmp/ruby/build/trunk/ext/monitor' I, [2024-05-17T18:54:36.838224 #82067] INFO -- : make[2]: Entering directory '/tmp/ruby/build/trunk/ext/objspace' I, [2024-05-17T18:54:36.844634 #82067] INFO -- : make[2]: Leaving directory '/tmp/ruby/build/trunk/ext/objspace' I, [2024-05-17T18:54:36.861785 #82067] INFO -- : make[2]: Entering directory '/tmp/ruby/build/trunk/ext/openssl' I, [2024-05-17T18:54:36.874935 #82067] INFO -- : make[2]: Leaving directory '/tmp/ruby/build/trunk/ext/openssl' I, [2024-05-17T18:54:36.877924 #82067] INFO -- : make[2]: Entering directory '/tmp/ruby/build/trunk/ext/pathname' I, [2024-05-17T18:54:36.880405 #82067] INFO -- : make[2]: Leaving directory '/tmp/ruby/build/trunk/ext/pathname' I, [2024-05-17T18:54:36.884652 #82067] INFO -- : make[2]: Entering directory '/tmp/ruby/build/trunk/ext/psych' I, [2024-05-17T18:54:36.905673 #82067] INFO -- : make[2]: Leaving directory '/tmp/ruby/build/trunk/ext/psych' I, [2024-05-17T18:54:36.911101 #82067] INFO -- : make[2]: Entering directory '/tmp/ruby/build/trunk/ext/pty' I, [2024-05-17T18:54:36.915098 #82067] INFO -- : make[2]: Leaving directory '/tmp/ruby/build/trunk/ext/pty' I, [2024-05-17T18:54:36.931425 #82067] INFO -- : make[2]: Entering directory '/tmp/ruby/build/trunk/ext/ripper' I, [2024-05-17T18:54:36.939759 #82067] INFO -- : make[2]: Leaving directory '/tmp/ruby/build/trunk/ext/ripper' I, [2024-05-17T18:54:36.942183 #82067] INFO -- : make[2]: Entering directory '/tmp/ruby/build/trunk/ext/rubyvm' I, [2024-05-17T18:54:36.945495 #82067] INFO -- : make[2]: Leaving directory '/tmp/ruby/build/trunk/ext/rubyvm' I, [2024-05-17T18:54:36.957783 #82067] INFO -- : make[2]: Entering directory '/tmp/ruby/build/trunk/ext/socket' I, [2024-05-17T18:54:36.965891 #82067] INFO -- : make[2]: Leaving directory '/tmp/ruby/build/trunk/ext/socket' I, [2024-05-17T18:54:36.984003 #82067] INFO -- : make[2]: Entering directory '/tmp/ruby/build/trunk/.bundle/gems/bigdecimal-3.1.8/ext/bigdecimal' I, [2024-05-17T18:54:37.016998 #82067] INFO -- : make[2]: Leaving directory '/tmp/ruby/build/trunk/.bundle/gems/bigdecimal-3.1.8/ext/bigdecimal' I, [2024-05-17T18:54:37.018828 #82067] INFO -- : make[2]: Entering directory '/tmp/ruby/build/trunk/.bundle/gems/debug-1.9.2/ext/debug' I, [2024-05-17T18:54:37.042846 #82067] INFO -- : make[2]: Leaving directory '/tmp/ruby/build/trunk/.bundle/gems/debug-1.9.2/ext/debug' I, [2024-05-17T18:54:37.044690 #82067] INFO -- : make[2]: Entering directory '/tmp/ruby/build/trunk/.bundle/gems/nkf-0.2.0/ext/nkf' I, [2024-05-17T18:54:37.065891 #82067] INFO -- : make[2]: Leaving directory '/tmp/ruby/build/trunk/.bundle/gems/nkf-0.2.0/ext/nkf' I, [2024-05-17T18:54:37.067807 #82067] INFO -- : make[2]: Entering directory '/tmp/ruby/build/trunk/.bundle/gems/racc-1.7.3/ext/racc/cparse' I, [2024-05-17T18:54:37.090898 #82067] INFO -- : make[2]: Leaving directory '/tmp/ruby/build/trunk/.bundle/gems/racc-1.7.3/ext/racc/cparse' I, [2024-05-17T18:54:37.093200 #82067] INFO -- : make[2]: Entering directory '/tmp/ruby/build/trunk/.bundle/gems/rbs-3.4.4/ext/rbs_extension' I, [2024-05-17T18:54:37.117719 #82067] INFO -- : make[2]: Leaving directory '/tmp/ruby/build/trunk/.bundle/gems/rbs-3.4.4/ext/rbs_extension' I, [2024-05-17T18:54:37.119680 #82067] INFO -- : make[2]: Entering directory '/tmp/ruby/build/trunk/.bundle/gems/syslog-0.1.2/ext/syslog' I, [2024-05-17T18:54:37.143464 #82067] INFO -- : make[2]: Leaving directory '/tmp/ruby/build/trunk/.bundle/gems/syslog-0.1.2/ext/syslog' I, [2024-05-17T18:54:37.168168 #82067] INFO -- : make[2]: Entering directory '/tmp/ruby/build/trunk' I, [2024-05-17T18:54:37.237059 #82067] INFO -- : make[2]: 'ruby' is up to date. I, [2024-05-17T18:54:37.237096 #82067] INFO -- : make[2]: Leaving directory '/tmp/ruby/build/trunk' I, [2024-05-17T18:54:37.237505 #82067] INFO -- : make[1]: Leaving directory '/tmp/ruby/build/trunk' I, [2024-05-17T18:54:37.241098 #82067] INFO -- : make[1]: Entering directory '/tmp/ruby/build/trunk' I, [2024-05-17T18:54:37.241127 #82067] INFO -- : make[1]: Nothing to be done for 'note'. I, [2024-05-17T18:54:37.241134 #82067] INFO -- : make[1]: Leaving directory '/tmp/ruby/build/trunk' I, [2024-05-17T18:54:37.317846 #82067] INFO -- : Run options: I, [2024-05-17T18:54:37.318003 #82067] INFO -- : --seed=19537 I, [2024-05-17T18:54:37.318011 #82067] INFO -- : "--ruby=./miniruby -I/tmp/ruby/src/trunk/lib -I. -I.ext/common /tmp/ruby/src/trunk/tool/runruby.rb --extout=.ext -- --disable-gems" I, [2024-05-17T18:54:37.318016 #82067] INFO -- : --excludes-dir=/tmp/ruby/src/trunk/test/.excludes I, [2024-05-17T18:54:37.318020 #82067] INFO -- : --name=!/memory_leak/ I, [2024-05-17T18:54:37.318024 #82067] INFO -- : --stderr-on-failure I, [2024-05-17T18:54:37.318027 #82067] INFO -- : -j20 I, [2024-05-17T18:54:37.318031 #82067] INFO -- : I, [2024-05-17T18:54:37.318035 #82067] INFO -- : # Running tests: I, [2024-05-17T18:54:37.318038 #82067] INFO -- : I, [2024-05-17T18:54:37.466688 #82067] INFO -- : [ 1/885] 123399=test_pkey I, [2024-05-17T18:54:37.466753 #82067] INFO -- : [ 2/885] 123401=test_case I, [2024-05-17T18:54:37.466887 #82067] INFO -- : [ 3/885] 123402=test_reline I, [2024-05-17T18:54:37.466980 #82067] INFO -- : [ 4/885] 123403=test_parser_events I, [2024-05-17T18:54:37.467080 #82067] INFO -- : [ 5/885] 123404=test_cclass I, [2024-05-17T18:54:37.467359 #82067] INFO -- : [ 6/885] 123400=test_gem_request_connection_pools I, [2024-05-17T18:54:37.470185 #82067] INFO -- : [ 7/885] 123414=test_gem_version_option I, [2024-05-17T18:54:37.470324 #82067] INFO -- : [ 8/885] 123413=test_grapheme_breaks I, [2024-05-17T18:54:37.470748 #82067] INFO -- : [ 9/885] 123418=test_m17n_comb I, [2024-05-17T18:54:37.471304 #82067] INFO -- : [ 10/885] 123417=test_memory_view I, [2024-05-17T18:54:37.472868 #82067] INFO -- : [ 11/885] 123415=test_ractor I, [2024-05-17T18:54:37.491930 #82067] INFO -- : [ 12/885] 123401=test_rdoc_generator_pot_po I, [2024-05-17T18:54:37.497107 #82067] INFO -- : [ 13/885] 123413=test_ansi_with_terminfo I, [2024-05-17T18:54:37.501049 #82067] INFO -- : [ 14/885] 123405=test_json_tree I, [2024-05-17T18:54:37.501111 #82067] INFO -- : [ 15/885] 123406=test_rdoc_markup_to_markdown I, [2024-05-17T18:54:37.501281 #82067] INFO -- : [ 16/885] 123407=test_severity I, [2024-05-17T18:54:37.501435 #82067] INFO -- : [ 17/885] 123412=test_ractor I, [2024-05-17T18:54:37.501533 #82067] INFO -- : [ 18/885] 123408=test_require_lib I, [2024-05-17T18:54:37.502301 #82067] INFO -- : [ 19/885] 123409=parse_test I, [2024-05-17T18:54:37.502339 #82067] INFO -- : [ 20/885] 123410=test_gem_install_update_options I, [2024-05-17T18:54:37.506887 #82067] INFO -- : [ 21/885] 123417=test_gem_stream_ui I, [2024-05-17T18:54:37.510333 #82067] INFO -- : [ 22/885] 123399=test_extlibs I, [2024-05-17T18:54:37.523294 #82067] INFO -- : [ 23/885] 123407=test_rdoc_generator_ri I, [2024-05-17T18:54:37.523367 #82067] INFO -- : [ 24/885] 123416=test_literal I, [2024-05-17T18:54:37.523776 #82067] INFO -- : [ 25/885] 123412=test_str2big I, [2024-05-17T18:54:37.525944 #82067] INFO -- : [ 26/885] 123411=test_c_struct_builder I, [2024-05-17T18:54:37.531184 #82067] INFO -- : [ 27/885] 123412=test_dot_dot I, [2024-05-17T18:54:37.534238 #82067] INFO -- : [ 28/885] 123413=test_rdoc_markup_to_table_of_contents I, [2024-05-17T18:54:37.534875 #82067] INFO -- : [ 29/885] 123412=test_socket I, [2024-05-17T18:54:37.541428 #82067] INFO -- : [ 30/885] 123415=test_thread I, [2024-05-17T18:54:37.544964 #82067] INFO -- : [ 31/885] 123403=test_objectspace I, [2024-05-17T18:54:37.550639 #82067] INFO -- : [ 32/885] 123405=test_rdoc_cross_reference I, [2024-05-17T18:54:37.562387 #82067] INFO -- : [ 33/885] 123411=test_scalar I, [2024-05-17T18:54:37.584169 #82067] INFO -- : [ 34/885] 123411=test_gem_dependency_installer I, [2024-05-17T18:54:37.618812 #82067] INFO -- : [ 35/885] 123404=test_gem_commands_info_command I, [2024-05-17T18:54:37.622061 #82067] INFO -- : [ 36/885] 123401=test_case_options I, [2024-05-17T18:54:37.627138 #82067] INFO -- : [ 37/885] 123401=test_store I, [2024-05-17T18:54:37.645775 #82067] INFO -- : [ 38/885] 123407=test_exception I, [2024-05-17T18:54:37.677349 #82067] INFO -- : [ 39/885] 123414=test_bug_reporter I, [2024-05-17T18:54:37.707290 #82067] INFO -- : [ 40/885] 123406=test_rand I, [2024-05-17T18:54:37.736405 #82067] INFO -- : [ 41/885] 123413=test_gem_name_tuple I, [2024-05-17T18:54:37.746438 #82067] INFO -- : [ 42/885] 123401=test_gem_package_tar_reader_entry I, [2024-05-17T18:54:37.773166 #82067] INFO -- : [ 43/885] 123417=test_gem_ext_cargo_builder_link_flag_converter I, [2024-05-17T18:54:37.788115 #82067] INFO -- : [ 44/885] 123415=test_gem_commands_mirror I, [2024-05-17T18:54:37.817556 #82067] INFO -- : [ 45/885] 123417=test_gem_request I, [2024-05-17T18:54:37.825045 #82067] INFO -- : [ 46/885] 123402=test_method_cache I, [2024-05-17T18:54:37.826508 #82067] INFO -- : [ 47/885] 123402=test_sprintf_comb I, [2024-05-17T18:54:37.846939 #82067] INFO -- : [ 48/885] 123404=test_generic I, [2024-05-17T18:54:37.851943 #82067] INFO -- : [ 49/885] 123410=test_win32ole I, [2024-05-17T18:54:37.860520 #82067] INFO -- : [ 50/885] 123410=test_scan_args I, [2024-05-17T18:54:37.863898 #82067] INFO -- : [ 51/885] 123406=test_enumerator_kw I, [2024-05-17T18:54:37.866580 #82067] INFO -- : [ 52/885] 123406=test_settracefunc I, [2024-05-17T18:54:37.875480 #82067] INFO -- : [ 53/885] 123410=test_gem_text I, [2024-05-17T18:54:37.880431 #82067] INFO -- : [ 54/885] 123404=test_shift_jis I, [2024-05-17T18:54:37.883400 #82067] INFO -- : [ 55/885] 123404=test_gem_commands_which_command I, [2024-05-17T18:54:37.917727 #82067] INFO -- : [ 56/885] 123410=test_http I, [2024-05-17T18:54:37.920429 #82067] INFO -- : [ 57/885] 123404=test_enumerator I, [2024-05-17T18:54:37.928384 #82067] INFO -- : [ 58/885] 123415=test_inadvertent_creation I, [2024-05-17T18:54:37.933548 #82067] INFO -- : [ 59/885] 123410=test_flags I, [2024-05-17T18:54:37.954923 #82067] INFO -- : [ 60/885] 123417=test_gem_commands_specification_command I, [2024-05-17T18:54:37.955882 #82067] INFO -- : [ 61/885] 123413=test_gem_commands_dependency_command I, [2024-05-17T18:54:37.982782 #82067] INFO -- : [ 62/885] 123402=test_safe_load I, [2024-05-17T18:54:37.990163 #82067] INFO -- : [ 63/885] 123405=test_gem_resolver_composed_set I, [2024-05-17T18:54:38.005206 #82067] INFO -- : [ 64/885] 123415=test_gem_resolver I, [2024-05-17T18:54:38.008215 #82067] INFO -- : [ 65/885] 123402=test_name_error I, [2024-05-17T18:54:38.064859 #82067] INFO -- : [ 66/885] 123401=test_rdoc_markup_attribute_manager I, [2024-05-17T18:54:38.084613 #82067] INFO -- : [ 67/885] 123401=test_httpresponse I, [2024-05-17T18:54:38.090172 #82067] INFO -- : [ 68/885] 123413=test_open-uri I, [2024-05-17T18:54:38.100028 #82067] INFO -- : [ 69/885] 123417=test_rdoc_parser_ruby I, [2024-05-17T18:54:38.115179 #82067] INFO -- : [ 70/885] 123414=test_rdoc_context I, [2024-05-17T18:54:38.132031 #82067] INFO -- : [ 71/885] 123405=test_stream I, [2024-05-17T18:54:38.135818 #82067] INFO -- : [ 72/885] 123401=test_nil2vtempty I, [2024-05-17T18:54:38.139551 #82067] INFO -- : [ 73/885] 123402=test_iso_8859 I, [2024-05-17T18:54:38.139715 #82067] INFO -- : [ 74/885] 123401=test_tcp I, [2024-05-17T18:54:38.142124 #82067] INFO -- : [ 75/885] 123405=test_rdoc_text I, [2024-05-17T18:54:38.157638 #82067] INFO -- : [ 76/885] 123402=test_gem_safe_yaml I, [2024-05-17T18:54:38.164796 #82067] INFO -- : [ 77/885] 123416=test_syntax I, [2024-05-17T18:54:38.184693 #82067] INFO -- : [ 78/885] 123405=test_date_new I, [2024-05-17T18:54:38.190201 #82067] INFO -- : [ 79/885] 123405=index_write_test I, [2024-05-17T18:54:38.221443 #82067] INFO -- : [ 80/885] 123415=test_data I, [2024-05-17T18:54:38.227702 #82067] INFO -- : [ 81/885] 123415=test_rdoc_markup_to_joined_paragraph I, [2024-05-17T18:54:38.247677 #82067] INFO -- : [ 82/885] 123405=test_date_time I, [2024-05-17T18:54:38.251399 #82067] INFO -- : [ 83/885] 123401=test_require I, [2024-05-17T18:54:38.257282 #82067] INFO -- : [ 84/885] 123405=test_securerandom I, [2024-05-17T18:54:38.257352 #82067] INFO -- : [ 85/885] 123401=test_c_union_entity I, [2024-05-17T18:54:38.290296 #82067] INFO -- : [ 86/885] 123405=test_rdoc_normal_module I, [2024-05-17T18:54:38.308870 #82067] INFO -- : [ 87/885] 123402=test_rdoc_markdown_test I, [2024-05-17T18:54:38.336261 #82067] INFO -- : [ 88/885] 123405=test_logperiod I, [2024-05-17T18:54:38.341949 #82067] INFO -- : [ 89/885] 123405=test_io_console I, [2024-05-17T18:54:38.345139 #82067] INFO -- : [ 90/885] 123401=test_singleton I, [2024-05-17T18:54:38.350359 #82067] INFO -- : [ 91/885] 123401=test_flush I, [2024-05-17T18:54:38.352796 #82067] INFO -- : [ 92/885] 123401=test_switch_hitter I, [2024-05-17T18:54:38.354047 #82067] INFO -- : [ 93/885] 123415=test_uncorrectable_name_check I, [2024-05-17T18:54:38.362104 #82067] INFO -- : [ 94/885] 123401=newline_test I, [2024-05-17T18:54:38.363641 #82067] INFO -- : [ 95/885] 123415=test_hash_create I, [2024-05-17T18:54:38.368815 #82067] INFO -- : [ 96/885] 123415=test_stringchar I, [2024-05-17T18:54:38.439887 #82067] INFO -- : [ 97/885] 123415=test_passing_block I, [2024-05-17T18:54:38.443435 #82067] INFO -- : [ 98/885] 123415=test_thread_fd_close I, [2024-05-17T18:54:38.446359 #82067] INFO -- : [ 99/885] 123415=test_process I, [2024-05-17T18:54:38.487148 #82067] INFO -- : [100/885] 123403=test_last_thread I, [2024-05-17T18:54:38.490644 #82067] INFO -- : [101/885] 123401=test_pack I, [2024-05-17T18:54:38.538209 #82067] INFO -- : [102/885] 123413=test_gem_security_policy I, [2024-05-17T18:54:38.640882 #82067] INFO -- : [103/885] 123401=test_gem_source_local I, [2024-05-17T18:54:38.660319 #82067] INFO -- : [104/885] 123417=test_gem_ext_rake_builder I, [2024-05-17T18:54:38.672123 #82067] INFO -- : [105/885] 123400=test_arity I, [2024-05-17T18:54:38.676887 #82067] INFO -- : [106/885] 123400=test_logdevice I, [2024-05-17T18:54:38.684370 #82067] INFO -- : [107/885] 123412=test_err_in_callback I, [2024-05-17T18:54:38.686966 #82067] INFO -- : [108/885] 123412=test_gem_resolver_lock_specification I, [2024-05-17T18:54:38.806270 #82067] INFO -- : [109/885] 123413=test_gc I, [2024-05-17T18:54:38.842366 #82067] INFO -- : [110/885] 123406=test_x509cert I, [2024-05-17T18:54:38.878938 #82067] INFO -- : [111/885] 123412=test_rdoc_markup_to_tt_only I, [2024-05-17T18:54:38.910815 #82067] INFO -- : [112/885] 123401=test_hmac I, [2024-05-17T18:54:38.927610 #82067] INFO -- : [113/885] 123401=test_rdoc_tom_doc I, [2024-05-17T18:54:38.956009 #82067] INFO -- : [114/885] 123401=test_numeric I, [2024-05-17T18:54:39.037437 #82067] INFO -- : [115/885] 123412=test_ifunless I, [2024-05-17T18:54:39.040265 #82067] INFO -- : [116/885] 123401=test_assignment I, [2024-05-17T18:54:39.042439 #82067] INFO -- : [117/885] 123412=test_gem_commands_lock_command I, [2024-05-17T18:54:39.060677 #82067] INFO -- : [118/885] 123402=test_gem_command I, [2024-05-17T18:54:39.060895 #82067] INFO -- : [119/885] 123412=test_bug-3571 I, [2024-05-17T18:54:39.065529 #82067] INFO -- : [120/885] 123410=test_key_actor_vi I, [2024-05-17T18:54:39.077195 #82067] INFO -- : [121/885] 123412=test_common I, [2024-05-17T18:54:39.125764 #82067] INFO -- : [122/885] 123402=test_gem_spec_fetcher I, [2024-05-17T18:54:39.150744 #82067] INFO -- : [123/885] 123407=test_rdoc_token_stream I, [2024-05-17T18:54:39.158294 #82067] INFO -- : [124/885] 123406=test_address_resolve I, [2024-05-17T18:54:39.164731 #82067] INFO -- : [125/885] 123407=test_gem_source_list I, [2024-05-17T18:54:39.176229 #82067] INFO -- : [126/885] 123406=test_optarg I, [2024-05-17T18:54:39.207664 #82067] INFO -- : [127/885] 123410=test_yaml_special_cases I, [2024-05-17T18:54:39.216366 #82067] INFO -- : [128/885] 123414=test_config I, [2024-05-17T18:54:39.219321 #82067] INFO -- : [129/885] 123410=test_verbose I, [2024-05-17T18:54:39.235379 #82067] INFO -- : [130/885] 123410=test_rdoc_single_class I, [2024-05-17T18:54:39.293820 #82067] INFO -- : [131/885] 123412=test_num2int I, [2024-05-17T18:54:39.300124 #82067] INFO -- : [132/885] 123402=test_nil I, [2024-05-17T18:54:39.302407 #82067] INFO -- : [133/885] 123414=test_macro I, [2024-05-17T18:54:39.305758 #82067] INFO -- : [134/885] 123406=test_pp I, [2024-05-17T18:54:39.306374 #82067] INFO -- : [135/885] 123412=test_gem_ext_configure_builder I, [2024-05-17T18:54:39.306670 #82067] INFO -- : [136/885] 123402=test_frozen I, [2024-05-17T18:54:39.312505 #82067] INFO -- : [137/885] 123402=test_exception I, [2024-05-17T18:54:39.314091 #82067] INFO -- : [138/885] 123414=test_zsh_completion I, [2024-05-17T18:54:39.318389 #82067] INFO -- : [139/885] 123414=test_iter_break I, [2024-05-17T18:54:39.321328 #82067] INFO -- : [140/885] 123414=test_files_ext I, [2024-05-17T18:54:39.323255 #82067] INFO -- : [141/885] 123402=test_bug-5832 I, [2024-05-17T18:54:39.329500 #82067] INFO -- : [142/885] 123402=test_emitter I, [2024-05-17T18:54:39.334759 #82067] INFO -- : [143/885] 123402=test_gem_silent_ui I, [2024-05-17T18:54:39.340840 #82067] INFO -- : [144/885] 123406=test_gem_doctor I, [2024-05-17T18:54:39.345061 #82067] INFO -- : [145/885] 123412=test_kdf I, [2024-05-17T18:54:39.363750 #82067] INFO -- : [146/885] 123402=test_kernel I, [2024-05-17T18:54:39.368947 #82067] INFO -- : [147/885] 123410=dispatcher_test I, [2024-05-17T18:54:39.402581 #82067] INFO -- : [148/885] 123418=test_eval_history I, [2024-05-17T18:54:39.413958 #82067] INFO -- : [149/885] 123417=test_psych I, [2024-05-17T18:54:39.416402 #82067] INFO -- : [150/885] 123399=test_enc_raise I, [2024-05-17T18:54:39.416865 #82067] INFO -- : [151/885] 123407=!Nothing_to_test I, [2024-05-17T18:54:39.418317 #82067] INFO -- : [152/885] 123407=test_rdoc_markup_paragraph I, [2024-05-17T18:54:39.421151 #82067] INFO -- : [153/885] 123399=test_object_create_start I, [2024-05-17T18:54:39.423506 #82067] INFO -- : [154/885] 123407=test_command I, [2024-05-17T18:54:39.424763 #82067] INFO -- : [155/885] 123399=test_at_exit I, [2024-05-17T18:54:39.433658 #82067] INFO -- : [156/885] 123412=test_date I, [2024-05-17T18:54:39.438671 #82067] INFO -- : [157/885] 123412=test_gem_rdoc I, [2024-05-17T18:54:39.441572 #82067] INFO -- : [158/885] 123399=test_gem_ext_cargo_builder_unit I, [2024-05-17T18:54:39.452009 #82067] INFO -- : [159/885] 123417=test_win32ole_type I, [2024-05-17T18:54:39.456726 #82067] INFO -- : [160/885] 123417=test_null I, [2024-05-17T18:54:39.458950 #82067] INFO -- : [161/885] 123417=test_mul I, [2024-05-17T18:54:39.459462 #82067] INFO -- : [162/885] 123414=test_rdoc_rd_inline_parser I, [2024-05-17T18:54:39.460201 #82067] INFO -- : [163/885] 123410=test_rdoc_markup_to_rdoc I, [2024-05-17T18:54:39.476004 #82067] INFO -- : [164/885] 123417=test_default_gems I, [2024-05-17T18:54:39.485614 #82067] INFO -- : [165/885] 123414=test_rdoc_markup_attributes I, [2024-05-17T18:54:39.488901 #82067] INFO -- : [166/885] 123414=test_date_parse I, [2024-05-17T18:54:39.489698 #82067] INFO -- : [167/885] 123406=test_pipe I, [2024-05-17T18:54:39.510086 #82067] INFO -- : [168/885] 123400=test_thread I, [2024-05-17T18:54:39.512521 #82067] INFO -- : [169/885] 123418=test_trick I, [2024-05-17T18:54:39.513970 #82067] INFO -- : [170/885] 123400=test_pkey_ec I, [2024-05-17T18:54:39.514031 #82067] INFO -- : [171/885] 123410=test_backtrace I, [2024-05-17T18:54:39.518224 #82067] INFO -- : [172/885] 123410=test_defined I, [2024-05-17T18:54:39.537146 #82067] INFO -- : [173/885] 123412=test_key_name_check I, [2024-05-17T18:54:39.538830 #82067] INFO -- : [174/885] 123417=test_io_buffer I, [2024-05-17T18:54:39.547182 #82067] INFO -- : [175/885] 123412=test_rdoc_i18n_text I, [2024-05-17T18:54:39.554633 #82067] INFO -- : [176/885] 123412=test_time I, [2024-05-17T18:54:39.561780 #82067] INFO -- : [177/885] 123403=test_windows_1251 I, [2024-05-17T18:54:39.568170 #82067] INFO -- : [178/885] 123403=test_rdoc_rdoc I, [2024-05-17T18:54:39.584833 #82067] INFO -- : [179/885] 123406=test_gem_uninstaller I, [2024-05-17T18:54:39.595569 #82067] INFO -- : [180/885] 123410=test_svcb_https I, [2024-05-17T18:54:39.600854 #82067] INFO -- : [181/885] 123400=test_buffering I, [2024-05-17T18:54:39.602924 #82067] INFO -- : [182/885] 123414=test_gb18030 I, [2024-05-17T18:54:39.605589 #82067] INFO -- : [183/885] 123400=test_cgi_tag_helper I, [2024-05-17T18:54:39.607740 #82067] INFO -- : [184/885] 123417=test_zlib I, [2024-05-17T18:54:39.613547 #82067] INFO -- : [185/885] 123414=test_egrep_cpp I, [2024-05-17T18:54:39.617432 #82067] INFO -- : [186/885] 123410=test_ole_methods I, [2024-05-17T18:54:39.620073 #82067] INFO -- : [187/885] 123410=test_erb_m17n I, [2024-05-17T18:54:39.621091 #82067] INFO -- : [188/885] 123400=test_optimization I, [2024-05-17T18:54:39.630324 #82067] INFO -- : [189/885] 123410=test_date_conv I, [2024-05-17T18:54:39.635036 #82067] INFO -- : [190/885] 123410=test_string I, [2024-05-17T18:54:39.638396 #82067] INFO -- : [191/885] 123399=test_proc I, [2024-05-17T18:54:39.679605 #82067] INFO -- : [192/885] 123412=test_gc_compact I, [2024-05-17T18:54:39.809173 #82067] INFO -- : [193/885] 123414=test_gem_resolver_index_set I, [2024-05-17T18:54:39.816014 #82067] INFO -- : [194/885] 123407=test_gem_package_old I, [2024-05-17T18:54:39.835817 #82067] INFO -- : [195/885] 123403=test_gem_validator I, [2024-05-17T18:54:39.836675 #82067] INFO -- : [196/885] 123414=test_folderitem2_invokeverb I, [2024-05-17T18:54:39.839699 #82067] INFO -- : [197/885] 123414=test_require_path_check I, [2024-05-17T18:54:39.852190 #82067] INFO -- : [198/885] 123409=test_rdoc_markup_parser I, [2024-05-17T18:54:39.858290 #82067] INFO -- : [199/885] 123407=test_fnmatch I, [2024-05-17T18:54:39.867654 #82067] INFO -- : [200/885] 123402=test_files_test_2 I, [2024-05-17T18:54:39.899982 #82067] INFO -- : [201/885] 123407=test_pattern_matching I, [2024-05-17T18:54:39.913901 #82067] INFO -- : [202/885] 123414=test_rdoc_stats I, [2024-05-17T18:54:39.922646 #82067] INFO -- : [203/885] 123407=test_string I, [2024-05-17T18:54:39.941811 #82067] INFO -- : [204/885] 123414=test_rdoc_store I, [2024-05-17T18:54:39.956105 #82067] INFO -- : [205/885] 123407=test_gem_request_set_lockfile_parser I, [2024-05-17T18:54:39.967401 #82067] INFO -- : [206/885] 123411=test_depth_first I, [2024-05-17T18:54:39.972432 #82067] INFO -- : [207/885] 123411=test_x509attr I, [2024-05-17T18:54:39.997120 #82067] INFO -- : [208/885] 123411=test_raise I, [2024-05-17T18:54:40.001722 #82067] INFO -- : [209/885] 123411=json_addition_test I, [2024-05-17T18:54:40.018184 #82067] INFO -- : [210/885] 123411=test_custom_command I, [2024-05-17T18:54:40.050691 #82067] INFO -- : [211/885] 123409=test_qsort I, [2024-05-17T18:54:40.058228 #82067] INFO -- : [212/885] 123409=test_rdoc_parser I, [2024-05-17T18:54:40.072909 #82067] INFO -- : [213/885] 123407=test_gem_dependency_resolution_error I, [2024-05-17T18:54:40.081717 #82067] INFO -- : [214/885] 123407=test_io_buffer I, [2024-05-17T18:54:40.097140 #82067] INFO -- : [215/885] 123409=ruby_parser_test I, [2024-05-17T18:54:40.100080 #82067] INFO -- : [216/885] 123409=test_pack I, [2024-05-17T18:54:40.106462 #82067] INFO -- : [217/885] 123403=test_backtrace I, [2024-05-17T18:54:40.120683 #82067] INFO -- : [218/885] 123409=test_gem_resolver_conflict I, [2024-05-17T18:54:40.126968 #82067] INFO -- : [219/885] 123411=test_rdoc_task I, [2024-05-17T18:54:40.177419 #82067] INFO -- : [220/885] 123411=test_rdoc_markup_indented_paragraph I, [2024-05-17T18:54:40.198719 #82067] INFO -- : [221/885] 123407=locals_test I, [2024-05-17T18:54:40.259008 #82067] INFO -- : [222/885] 123409=test_rdoc_require I, [2024-05-17T18:54:40.267601 #82067] INFO -- : [223/885] 123411=test_gem_commands_install_command I, [2024-05-17T18:54:40.272791 #82067] INFO -- : [224/885] 123409=test_clone I, [2024-05-17T18:54:40.418097 #82067] INFO -- : [225/885] 123409=test_readpartial I, [2024-05-17T18:54:40.465646 #82067] INFO -- : [226/885] 123399=test_fstring I, [2024-05-17T18:54:40.503788 #82067] INFO -- : [227/885] 123407=test_array I, [2024-05-17T18:54:40.504086 #82067] INFO -- : [228/885] 123414=test_optparse I, [2024-05-17T18:54:40.504926 #82067] INFO -- : [229/885] 123406=test_rat I, [2024-05-17T18:54:40.510823 #82067] INFO -- : [230/885] 123407=test_webauthn_poller I, [2024-05-17T18:54:40.516671 #82067] INFO -- : [231/885] 123406=test_rdoc_markup_raw I, [2024-05-17T18:54:40.527543 #82067] INFO -- : [232/885] 123406=test_rdoc_markup_to_html_crossref I, [2024-05-17T18:54:40.555737 #82067] INFO -- : [233/885] 123414=test_typeddata I, [2024-05-17T18:54:40.582446 #82067] INFO -- : [234/885] 123399=test_gem_resolver_best_set I, [2024-05-17T18:54:40.626432 #82067] INFO -- : [235/885] 123399=encoding_test I, [2024-05-17T18:54:40.648304 #82067] INFO -- : [236/885] 123407=test_stringscanner I, [2024-05-17T18:54:40.677833 #82067] INFO -- : [237/885] 123407=test_files_sample I, [2024-05-17T18:54:40.724939 #82067] INFO -- : [238/885] 123414=test_convertible I, [2024-05-17T18:54:40.753321 #82067] INFO -- : [239/885] 123399=parser_test I, [2024-05-17T18:54:40.755440 #82067] INFO -- : [240/885] 123407=test_rdoc_alias I, [2024-05-17T18:54:40.757546 #82067] INFO -- : [241/885] 123399=test_yield I, [2024-05-17T18:54:40.771705 #82067] INFO -- : [242/885] 123401=test_system I, [2024-05-17T18:54:40.805155 #82067] INFO -- : [243/885] 123407=test_pkcs12 I, [2024-05-17T18:54:40.831488 #82067] INFO -- : [244/885] 123409=test_bigzero I, [2024-05-17T18:54:40.834892 #82067] INFO -- : [245/885] 123409=test_pkey_dh I, [2024-05-17T18:54:40.890314 #82067] INFO -- : [246/885] 123406=test_gem_package_tar_header I, [2024-05-17T18:54:40.924447 #82067] INFO -- : [247/885] 123406=test_iseq_load I, [2024-05-17T18:54:40.939009 #82067] INFO -- : [248/885] 123409=test_gem_util I, [2024-05-17T18:54:40.990580 #82067] INFO -- : [249/885] 123405=test_gem_config_file I, [2024-05-17T18:54:41.105417 #82067] INFO -- : [250/885] 123405=test_ripper I, [2024-05-17T18:54:41.126340 #82067] INFO -- : [251/885] 123409=test_protocol I, [2024-05-17T18:54:41.147986 #82067] INFO -- : [252/885] 123408=test_getopts I, [2024-05-17T18:54:41.162456 #82067] INFO -- : [253/885] 123408=test_gem_resolver_activation_request I, [2024-05-17T18:54:41.210450 #82067] INFO -- : [254/885] 123407=test_yjit_exit_locations I, [2024-05-17T18:54:41.214280 #82067] INFO -- : [255/885] 123407=test_etc I, [2024-05-17T18:54:41.330818 #82067] INFO -- : [256/885] 123407=test_yaml_tree I, [2024-05-17T18:54:41.351542 #82067] INFO -- : [257/885] 123407=test_libs I, [2024-05-17T18:54:41.363190 #82067] INFO -- : [258/885] 123408=test_gc I, [2024-05-17T18:54:41.368926 #82067] INFO -- : [259/885] 123408=test_gem_commands_fetch_command I, [2024-05-17T18:54:41.385271 #82067] INFO -- : [260/885] 123407=test_math I, [2024-05-17T18:54:41.404400 #82067] INFO -- : [261/885] 123407=test_sleep I, [2024-05-17T18:54:41.437596 #82067] INFO -- : [262/885] 123403=test_config I, [2024-05-17T18:54:41.439572 #82067] INFO -- : [263/885] 123409=test_autoload I, [2024-05-17T18:54:41.446690 #82067] INFO -- : [264/885] 123405=test_utf16 I, [2024-05-17T18:54:41.453366 #82067] INFO -- : [265/885] 123405=test_io I, [2024-05-17T18:54:41.490677 #82067] INFO -- : [266/885] 123403=test_unicode_escape I, [2024-05-17T18:54:41.536517 #82067] INFO -- : [267/885] 123408=test_case I, [2024-05-17T18:54:41.559640 #82067] INFO -- : [268/885] 123408=test_sizeof I, [2024-05-17T18:54:41.591581 #82067] INFO -- : [269/885] 123403=test_face I, [2024-05-17T18:54:41.597043 #82067] INFO -- : [270/885] 123411=test_rendering I, [2024-05-17T18:54:41.598229 #82067] INFO -- : [271/885] 123411=test_console_attr I, [2024-05-17T18:54:41.605036 #82067] INFO -- : [272/885] 123411=test_summary I, [2024-05-17T18:54:41.691362 #82067] INFO -- : [273/885] 123403=test_type_completor I, [2024-05-17T18:54:41.693722 #82067] INFO -- : [274/885] 123403=test_gem_commands_exec_command I, [2024-05-17T18:54:41.714411 #82067] INFO -- : [275/885] 123406=test_io_wait I, [2024-05-17T18:54:41.735374 #82067] INFO -- : [276/885] 123411=test_kwargs I, [2024-05-17T18:54:41.736363 #82067] INFO -- : [277/885] 123401=warnings_test I, [2024-05-17T18:54:41.740518 #82067] INFO -- : [278/885] 123411=test_ellipsize I, [2024-05-17T18:54:41.746309 #82067] INFO -- : [279/885] 123401=test_date_attr I, [2024-05-17T18:54:41.748773 #82067] INFO -- : [280/885] 123401=test_io I, [2024-05-17T18:54:41.752251 #82067] INFO -- : [281/885] 123411=test_emoji I, [2024-05-17T18:54:41.767729 #82067] INFO -- : [282/885] 123417=test_win32ole_type_event I, [2024-05-17T18:54:41.769545 #82067] INFO -- : [283/885] 123417=test_sorted_set I, [2024-05-17T18:54:41.791906 #82067] INFO -- : [284/885] 123411=test_hash I, [2024-05-17T18:54:41.939432 #82067] INFO -- : [285/885] 123417=test_ubf_async_safe I, [2024-05-17T18:54:41.940152 #82067] INFO -- : [286/885] 123417=test_gem_unsatisfiable_dependency_error I, [2024-05-17T18:54:41.959528 #82067] INFO -- : [287/885] 123417=test_win32ole_record I, [2024-05-17T18:54:41.967487 #82067] INFO -- : [288/885] 123417=test_cp949 I, [2024-05-17T18:54:41.973933 #82067] INFO -- : [289/885] 123417=test_condition I, [2024-05-17T18:54:41.977751 #82067] INFO -- : [290/885] 123417=test_foreach I, [2024-05-17T18:54:41.981453 #82067] INFO -- : [291/885] 123417=test_gem_source_specific_file I, [2024-05-17T18:54:42.001590 #82067] INFO -- : [292/885] 123401=test_gem_commands_uninstall_command I, [2024-05-17T18:54:42.042158 #82067] INFO -- : [293/885] 123406=test_rdoc_rubygems_hook I, [2024-05-17T18:54:42.060412 #82067] INFO -- : [294/885] 123418=test_method I, [2024-05-17T18:54:42.074974 #82067] INFO -- : [295/885] 123417=test_gem_commands_query_command I, [2024-05-17T18:54:42.115987 #82067] INFO -- : [296/885] 123406=test_gem_impossible_dependencies_error I, [2024-05-17T18:54:42.120579 #82067] INFO -- : [297/885] 123406=test_pack I, [2024-05-17T18:54:42.227733 #82067] INFO -- : [298/885] 123412=test_array_create I, [2024-05-17T18:54:42.234435 #82067] INFO -- : [299/885] 123412=test_to_ruby I, [2024-05-17T18:54:42.240846 #82067] INFO -- : [300/885] 123412=test_pattern_key_name_check I, [2024-05-17T18:54:42.246559 #82067] INFO -- : [301/885] 123412=test_ftp I, [2024-05-17T18:54:42.251759 #82067] INFO -- : [302/885] 123412=test_euc_kr I, [2024-05-17T18:54:42.253610 #82067] INFO -- : [303/885] 123412=test_rdoc_context_section I, [2024-05-17T18:54:42.263924 #82067] INFO -- : [304/885] 123412=test_objspace I, [2024-05-17T18:54:42.313246 #82067] INFO -- : [305/885] 123406=ripper_test I, [2024-05-17T18:54:42.641952 #82067] INFO -- : [306/885] 123401=test_line_editor I, [2024-05-17T18:54:42.689636 #82067] INFO -- : [307/885] 123403=test_undef I, [2024-05-17T18:54:42.696609 #82067] INFO -- : [308/885] 123403=test_gem_security_trust_dir I, [2024-05-17T18:54:42.698518 #82067] INFO -- : [309/885] 123401=test_string_memory I, [2024-05-17T18:54:42.702701 #82067] INFO -- : [310/885] 123417=test_gem_requirement I, [2024-05-17T18:54:42.729608 #82067] INFO -- : [311/885] 123403=test_sprintf I, [2024-05-17T18:54:42.745392 #82067] INFO -- : [312/885] 123401=comments_test I, [2024-05-17T18:54:42.750312 #82067] INFO -- : [313/885] 123401=test_show_source I, [2024-05-17T18:54:42.804713 #82067] INFO -- : [314/885] 123401=test_set I, [2024-05-17T18:54:42.812999 #82067] INFO -- : [315/885] 123401=test_gem_commands_stale_command I, [2024-05-17T18:54:42.822770 #82067] INFO -- : [316/885] 123401=test_c_struct_entry I, [2024-05-17T18:54:42.842500 #82067] INFO -- : [317/885] 123417=test_lock_native_thread I, [2024-05-17T18:54:42.920918 #82067] INFO -- : [318/885] 123403=test_have_library I, [2024-05-17T18:54:42.937099 #82067] INFO -- : [319/885] 123406=test_remote_fetch_error I, [2024-05-17T18:54:42.949717 #82067] INFO -- : [320/885] 123406=test_hash I, [2024-05-17T18:54:42.973380 #82067] INFO -- : [321/885] 123406=test_gem_resolver_dependency_request I, [2024-05-17T18:54:43.002339 #82067] INFO -- : [322/885] 123406=test_tree_builder I, [2024-05-17T18:54:43.010073 #82067] INFO -- : [323/885] 123406=test_external_new I, [2024-05-17T18:54:43.016055 #82067] INFO -- : [324/885] 123406=test_alias_and_anchor I, [2024-05-17T18:54:43.018054 #82067] INFO -- : [325/885] 123406=test_postponed_job I, [2024-05-17T18:54:43.060747 #82067] INFO -- : [326/885] 123401=test_raise_exception I, [2024-05-17T18:54:43.126379 #82067] INFO -- : [327/885] 123417=test_gem_request_set_lockfile I, [2024-05-17T18:54:43.402008 #82067] INFO -- : [328/885] 123406=test_win32ole_typelib I, [2024-05-17T18:54:43.408698 #82067] INFO -- : [329/885] 123406=test_protect I, [2024-05-17T18:54:43.409909 #82067] INFO -- : [330/885] 123406=test_weakmap I, [2024-05-17T18:54:43.442373 #82067] INFO -- : [331/885] 123417=test_workspace I, [2024-05-17T18:54:43.446936 #82067] INFO -- : [332/885] 123407=test_yjit I, [2024-05-17T18:54:43.456722 #82067] INFO -- : [333/885] 123407=test_ws I, [2024-05-17T18:54:43.462427 #82067] INFO -- : [334/885] 123404=test_m17n I, [2024-05-17T18:54:43.467730 #82067] INFO -- : [335/885] 123407=test_gem_commands_environment_command I, [2024-05-17T18:54:43.509495 #82067] INFO -- : [336/885] 123402=test_argf I, [2024-05-17T18:54:43.522579 #82067] INFO -- : [337/885] 123407=test_framework I, [2024-05-17T18:54:43.524472 #82067] INFO -- : [338/885] 123407=test_ns_spki I, [2024-05-17T18:54:43.545767 #82067] INFO -- : [339/885] 123404=test_kill_ring I, [2024-05-17T18:54:43.560249 #82067] INFO -- : [340/885] 123407=test_too_many_dummy_encodings I, [2024-05-17T18:54:43.594500 #82067] INFO -- : [341/885] 123404=test_gem_commands_list_command I, [2024-05-17T18:54:43.605632 #82067] INFO -- : [342/885] 123404=test_stack I, [2024-05-17T18:54:43.637621 #82067] INFO -- : [343/885] 123407=test_rdoc_include I, [2024-05-17T18:54:43.661673 #82067] INFO -- : [344/885] 123407=test_reqarg I, [2024-05-17T18:54:43.661739 #82067] INFO -- : [345/885] 123417=test_ldap I, [2024-05-17T18:54:43.665228 #82067] INFO -- : [346/885] 123417=test_gem_commands_signin_command I, [2024-05-17T18:54:43.704669 #82067] INFO -- : [347/885] 123401=test_resource I, [2024-05-17T18:54:43.728616 #82067] INFO -- : [348/885] 123401=test_emitter I, [2024-05-17T18:54:43.734308 #82067] INFO -- : [349/885] 123401=test_fileutils I, [2024-05-17T18:54:43.779973 #82067] INFO -- : [350/885] 123416=test_string_processing I, [2024-05-17T18:54:43.780277 #82067] INFO -- : [351/885] 123417=test_cesu8 I, [2024-05-17T18:54:43.785131 #82067] INFO -- : [352/885] 123417=test_econv I, [2024-05-17T18:54:43.824880 #82067] INFO -- : [353/885] 123416=test_rdoc_options I, [2024-05-17T18:54:44.049638 #82067] INFO -- : [354/885] 123407=test_gem_version I, [2024-05-17T18:54:44.102574 #82067] INFO -- : [355/885] 123399=test_path_to_class I, [2024-05-17T18:54:44.111343 #82067] INFO -- : [356/885] 123399=test_gem_dependency I, [2024-05-17T18:54:44.143203 #82067] INFO -- : [357/885] 123407=test_gem_resolver_specification I, [2024-05-17T18:54:44.152859 #82067] INFO -- : [358/885] 123403=test_rdoc_markup_verbatim I, [2024-05-17T18:54:44.154425 #82067] INFO -- : [359/885] 123401=test_inlinecache I, [2024-05-17T18:54:44.164207 #82067] INFO -- : [360/885] 123403=test_complex I, [2024-05-17T18:54:44.190546 #82067] INFO -- : [361/885] 123407=test_gem_commands_search_command I, [2024-05-17T18:54:44.203837 #82067] INFO -- : [362/885] 123407=test_frozen_error I, [2024-05-17T18:54:44.212224 #82067] INFO -- : [363/885] 123407=test_method_cache I, [2024-05-17T18:54:44.215635 #82067] INFO -- : [364/885] 123407=test_gem_stub_specification I, [2024-05-17T18:54:44.232803 #82067] INFO -- : [365/885] 123401=test_gem_ext_ext_conf_builder I, [2024-05-17T18:54:44.232866 #82067] INFO -- : [366/885] 123399=test_gem_resolver_installed_specification I, [2024-05-17T18:54:44.258192 #82067] INFO -- : [367/885] 123416=test_scanner_events I, [2024-05-17T18:54:44.290459 #82067] INFO -- : [368/885] 123399=test_gem_remote_fetcher I, [2024-05-17T18:54:44.300041 #82067] INFO -- : [369/885] 123416=test_parse I, [2024-05-17T18:54:44.328027 #82067] INFO -- : [370/885] 123403=test_mdns I, [2024-05-17T18:54:44.348273 #82067] INFO -- : [371/885] 123403=test_gem_installer I, [2024-05-17T18:54:44.429667 #82067] INFO -- : [372/885] 123407=test_yamlstore I, [2024-05-17T18:54:44.442813 #82067] INFO -- : [373/885] 123407=test_date_strftime I, [2024-05-17T18:54:44.531325 #82067] INFO -- : [374/885] 123418=test_rdoc_parser_rd I, [2024-05-17T18:54:44.581692 #82067] INFO -- : [375/885] 123404=test_irb I, [2024-05-17T18:54:44.762850 #82067] INFO -- : [376/885] 123418=test_asn1 I, [2024-05-17T18:54:44.817763 #82067] INFO -- : [377/885] 123408=test_random I, [2024-05-17T18:54:44.822475 #82067] INFO -- : [378/885] 123418=test_load I, [2024-05-17T18:54:44.831043 #82067] INFO -- : [379/885] 123408=json_string_matching_test I, [2024-05-17T18:54:44.832233 #82067] INFO -- : [380/885] 123418=test_const I, [2024-05-17T18:54:44.833125 #82067] INFO -- : [381/885] 123417=test_rdoc_normal_class I, [2024-05-17T18:54:44.837682 #82067] INFO -- : [382/885] 123418=test_class I, [2024-05-17T18:54:44.848484 #82067] INFO -- : [383/885] 123408=test_noarg I, [2024-05-17T18:54:44.876565 #82067] INFO -- : [384/885] 123407=parse_comments_test I, [2024-05-17T18:54:44.876978 #82067] INFO -- : [385/885] 123407=test_tempfile I, [2024-05-17T18:54:44.883262 #82067] INFO -- : [386/885] 123416=test_queue I, [2024-05-17T18:54:44.901755 #82067] INFO -- : [387/885] 123417=test_function I, [2024-05-17T18:54:44.909361 #82067] INFO -- : [388/885] 123416=test_gem_resolver_index_specification I, [2024-05-17T18:54:44.914941 #82067] INFO -- : [389/885] 123404=test_internal_ivar I, [2024-05-17T18:54:44.919988 #82067] INFO -- : [390/885] 123404=test_prettyprint I, [2024-05-17T18:54:44.941832 #82067] INFO -- : [391/885] 123404=test_tracepoint I, [2024-05-17T18:54:45.021406 #82067] INFO -- : [392/885] 123408=test_rdoc_markup I, [2024-05-17T18:54:45.143214 #82067] INFO -- : [393/885] 123417=test_gem_commands_help_command I, [2024-05-17T18:54:45.153551 #82067] INFO -- : [394/885] 123416=test_duplicate I, [2024-05-17T18:54:45.158113 #82067] INFO -- : [395/885] 123416=test_basicsocket I, [2024-05-17T18:54:45.163133 #82067] INFO -- : [396/885] 123407=test_utf32 I, [2024-05-17T18:54:45.167287 #82067] INFO -- : [397/885] 123416=test_require I, [2024-05-17T18:54:45.170550 #82067] INFO -- : [398/885] 123407=test_cgi_util I, [2024-05-17T18:54:45.173638 #82067] INFO -- : [399/885] 123417=test_gem_commands_contents_command I, [2024-05-17T18:54:45.185789 #82067] INFO -- : [400/885] 123408=test_gem_ext_cmake_builder I, [2024-05-17T18:54:45.196072 #82067] INFO -- : [401/885] 123404=test_digest I, [2024-05-17T18:54:45.208932 #82067] INFO -- : [402/885] 123408=test_marshalable I, [2024-05-17T18:54:45.223102 #82067] INFO -- : [403/885] 123408=test_find I, [2024-05-17T18:54:45.237717 #82067] INFO -- : [404/885] 123408=test_ractor I, [2024-05-17T18:54:45.271256 #82067] INFO -- : [405/885] 123417=test_wss I, [2024-05-17T18:54:45.284781 #82067] INFO -- : [406/885] 123417=test_fiddle I, [2024-05-17T18:54:45.343268 #82067] INFO -- : [407/885] 123417=test_file I, [2024-05-17T18:54:45.345049 #82067] INFO -- : [408/885] 123417=test_modify_expand I, [2024-05-17T18:54:45.348388 #82067] INFO -- : [409/885] 123417=test_rdoc_any_method I, [2024-05-17T18:54:45.357138 #82067] INFO -- : [410/885] 123408=test_gem_available_set I, [2024-05-17T18:54:45.420758 #82067] INFO -- : [411/885] 123407=test_rdoc_markdown I, [2024-05-17T18:54:45.459992 #82067] INFO -- : [412/885] 123401=test_pathname I, [2024-05-17T18:54:45.463157 #82067] INFO -- : [413/885] 123408=test_init I, [2024-05-17T18:54:45.558003 #82067] INFO -- : [414/885] 123414=test_complexrational I, [2024-05-17T18:54:45.565313 #82067] INFO -- : [415/885] 123414=test_gem_package_tar_reader I, [2024-05-17T18:54:45.599299 #82067] INFO -- : [416/885] 123414=regexp_test I, [2024-05-17T18:54:45.657909 #82067] INFO -- : [417/885] 123411=test_coverage I, [2024-05-17T18:54:45.662888 #82067] INFO -- : [418/885] 123407=test_rdoc_encoding I, [2024-05-17T18:54:45.675536 #82067] INFO -- : [419/885] 123401=test_recorder I, [2024-05-17T18:54:45.677829 #82067] INFO -- : [420/885] 123401=test_gem_commands_owner_command I, [2024-05-17T18:54:45.689553 #82067] INFO -- : [421/885] 123417=test_gem_source_vendor I, [2024-05-17T18:54:45.692637 #82067] INFO -- : [422/885] 123407=test_bash_completion I, [2024-05-17T18:54:45.697420 #82067] INFO -- : [423/885] 123417=test_formatter I, [2024-05-17T18:54:45.701694 #82067] INFO -- : [424/885] 123407=test_rdoc_constant I, [2024-05-17T18:54:45.705314 #82067] INFO -- : [425/885] 123417=test_deprecate I, [2024-05-17T18:54:45.715290 #82067] INFO -- : [426/885] 123414=test_handle I, [2024-05-17T18:54:45.731647 #82067] INFO -- : [427/885] 123417=test_wait I, [2024-05-17T18:54:45.789433 #82067] INFO -- : [428/885] 123407=test_forwardable I, [2024-05-17T18:54:45.805835 #82067] INFO -- : [429/885] 123417=test_yaml I, [2024-05-17T18:54:45.806991 #82067] INFO -- : [430/885] 123407=test_big2str I, [2024-05-17T18:54:45.813215 #82067] INFO -- : [431/885] 123407=test_ansi_without_terminfo I, [2024-05-17T18:54:45.823655 #82067] INFO -- : [432/885] 123407=test_gem_commands_sources_command I, [2024-05-17T18:54:45.929814 #82067] INFO -- : [433/885] 123417=test_ractor I, [2024-05-17T18:54:45.932374 #82067] INFO -- : [434/885] 123414=test_euc_tw I, [2024-05-17T18:54:45.935623 #82067] INFO -- : [435/885] 123414=test_bmethod I, [2024-05-17T18:54:45.940669 #82067] INFO -- : [436/885] 123408=test_rdoc_markup_formatter I, [2024-05-17T18:54:45.942462 #82067] INFO -- : [437/885] 123414=test_thread_queue I, [2024-05-17T18:54:45.945069 #82067] INFO -- : [438/885] 123417=test_nowrite I, [2024-05-17T18:54:45.951604 #82067] INFO -- : [439/885] 123408=test_rdoc_parser_c I, [2024-05-17T18:54:45.957809 #82067] INFO -- : [440/885] 123417=test_comparable I, [2024-05-17T18:54:45.965128 #82067] INFO -- : [441/885] 123417=json_fixtures_test I, [2024-05-17T18:54:45.970596 #82067] INFO -- : [442/885] 123407=test_shapes I, [2024-05-17T18:54:45.973645 #82067] INFO -- : [443/885] 123407=test_io_timeout I, [2024-05-17T18:54:45.983708 #82067] INFO -- : [444/885] 123417=test_profile_frames I, [2024-05-17T18:54:45.990851 #82067] INFO -- : [445/885] 123407=test_cstr I, [2024-05-17T18:54:46.008790 #82067] INFO -- : [446/885] 123404=test_pstore I, [2024-05-17T18:54:46.071982 #82067] INFO -- : [447/885] 123404=test_enc_str_buf_cat I, [2024-05-17T18:54:46.074323 #82067] INFO -- : [448/885] 123404=test_class2name I, [2024-05-17T18:54:46.078970 #82067] INFO -- : [449/885] 123404=test_gbk I, [2024-05-17T18:54:46.082438 #82067] INFO -- : [450/885] 123404=test_win32ole_variant_outarg I, [2024-05-17T18:54:46.088413 #82067] INFO -- : [451/885] 123404=test_dln I, [2024-05-17T18:54:46.090750 #82067] INFO -- : [452/885] 123404=test_gem_source_subpath_problem I, [2024-05-17T18:54:46.153551 #82067] INFO -- : [453/885] 123417=json_common_interface_test I, [2024-05-17T18:54:46.165959 #82067] INFO -- : [454/885] 123417=memsize_test I, [2024-05-17T18:54:46.203836 #82067] INFO -- : [455/885] 123404=test_nomethod_error I, [2024-05-17T18:54:46.208362 #82067] INFO -- : [456/885] 123404=json_parser_test I, [2024-05-17T18:54:46.233616 #82067] INFO -- : [457/885] 123417=test_config I, [2024-05-17T18:54:46.242844 #82067] INFO -- : [458/885] 123408=test_pkg_config I, [2024-05-17T18:54:46.261956 #82067] INFO -- : [459/885] 123408=test_cparser I, [2024-05-17T18:54:46.264397 #82067] INFO -- : [460/885] 123404=test_struct I, [2024-05-17T18:54:46.275066 #82067] INFO -- : [461/885] 123401=test_rdoc_markup_to_html_snippet I, [2024-05-17T18:54:46.275943 #82067] INFO -- : [462/885] 123404=magic_comment_test I, [2024-05-17T18:54:46.306612 #82067] INFO -- : [463/885] 123417=test_sexp I, [2024-05-17T18:54:46.321496 #82067] INFO -- : [464/885] 123417=test_rdoc_markup_include I, [2024-05-17T18:54:46.326525 #82067] INFO -- : [465/885] 123417=fuzzer_test I, [2024-05-17T18:54:46.338286 #82067] INFO -- : [466/885] 123417=test_variable I, [2024-05-17T18:54:46.345330 #82067] INFO -- : [467/885] 123404=test_engine I, [2024-05-17T18:54:46.353675 #82067] INFO -- : [468/885] 123404=test_win32ole_variant_m I, [2024-05-17T18:54:46.356380 #82067] INFO -- : [469/885] 123404=test_div I, [2024-05-17T18:54:46.359982 #82067] INFO -- : [470/885] 123404=test_allocation I, [2024-05-17T18:54:46.378273 #82067] INFO -- : [471/885] 123399=test_key_error I, [2024-05-17T18:54:46.379933 #82067] INFO -- : [472/885] 123401=test_serialize_subclasses I, [2024-05-17T18:54:46.385632 #82067] INFO -- : [473/885] 123399=test_insns_leaf I, [2024-05-17T18:54:46.392153 #82067] INFO -- : [474/885] 123401=test_color_printer I, [2024-05-17T18:54:46.394813 #82067] INFO -- : [475/885] 123399=test_deprecated I, [2024-05-17T18:54:46.401133 #82067] INFO -- : [476/885] 123399=test_files_test_1 I, [2024-05-17T18:54:46.407968 #82067] INFO -- : [477/885] 123401=test_set I, [2024-05-17T18:54:46.453732 #82067] INFO -- : [478/885] 123401=test_gem_path_support I, [2024-05-17T18:54:46.473057 #82067] INFO -- : [479/885] 123417=test_struct I, [2024-05-17T18:54:46.475387 #82067] INFO -- : [480/885] 123416=test_x509req I, [2024-05-17T18:54:46.488954 #82067] INFO -- : [481/885] 123401=test_mutex I, [2024-05-17T18:54:46.674971 #82067] INFO -- : [482/885] 123411=test_rdoc_rd_inline I, [2024-05-17T18:54:46.689013 #82067] INFO -- : [483/885] 123411=test_float I, [2024-05-17T18:54:46.707187 #82067] INFO -- : [484/885] 123416=test_cgi_cookie I, [2024-05-17T18:54:46.715753 #82067] INFO -- : [485/885] 123416=test_require I, [2024-05-17T18:54:46.735245 #82067] INFO -- : [486/885] 123409=test_gem_commands_signout_command I, [2024-05-17T18:54:46.747303 #82067] INFO -- : [487/885] 123407=test_refinement I, [2024-05-17T18:54:46.761017 #82067] INFO -- : [488/885] 123409=test_regex_casefold I, [2024-05-17T18:54:46.764354 #82067] INFO -- : [489/885] 123406=test_gem_source_git I, [2024-05-17T18:54:46.781771 #82067] INFO -- : [490/885] 123408=test_dir_m17n I, [2024-05-17T18:54:46.894958 #82067] INFO -- : [491/885] 123418=test_gem_resolver_installer_set I, [2024-05-17T18:54:46.943975 #82067] INFO -- : [492/885] 123417=test_cgi_session I, [2024-05-17T18:54:46.958670 #82067] INFO -- : [493/885] 123417=test_rdoc_rd I, [2024-05-17T18:54:46.979952 #82067] INFO -- : [494/885] 123417=test_metaclass I, [2024-05-17T18:54:46.985178 #82067] INFO -- : [495/885] 123417=test_rdoc_top_level I, [2024-05-17T18:54:47.207563 #82067] INFO -- : [496/885] 123413=test_signal I, [2024-05-17T18:54:47.207629 #82067] INFO -- : [497/885] 123409=test_fixnum I, [2024-05-17T18:54:47.220548 #82067] INFO -- : [498/885] 123409=test_x509crl I, [2024-05-17T18:54:47.223113 #82067] INFO -- : [499/885] 123418=test_process I, [2024-05-17T18:54:47.244128 #82067] INFO -- : [500/885] 123418=test_windows_1252 I, [2024-05-17T18:54:47.246810 #82067] INFO -- : [501/885] 123418=test_input_method I, [2024-05-17T18:54:47.251768 #82067] INFO -- : [502/885] 123417=test_digest_extend I, [2024-05-17T18:54:47.263256 #82067] INFO -- : [503/885] 123417=test_string I, [2024-05-17T18:54:47.264936 #82067] INFO -- : [504/885] 123417=test_iterator I, [2024-05-17T18:54:47.296871 #82067] INFO -- : [505/885] 123406=test_omap I, [2024-05-17T18:54:47.302688 #82067] INFO -- : [506/885] 123406=test_debug I, [2024-05-17T18:54:47.307410 #82067] INFO -- : [507/885] 123406=test_memory_view I, [2024-05-17T18:54:47.320533 #82067] INFO -- : [508/885] 123418=pattern_test I, [2024-05-17T18:54:47.325919 #82067] INFO -- : [509/885] 123406=test_shellwords I, [2024-05-17T18:54:47.330097 #82067] INFO -- : [510/885] 123406=test_new I, [2024-05-17T18:54:47.336243 #82067] INFO -- : [511/885] 123406=test_cipher I, [2024-05-17T18:54:47.343045 #82067] INFO -- : [512/885] 123409=test_gem_security_signer I, [2024-05-17T18:54:47.349805 #82067] INFO -- : [513/885] 123417=test_storage I, [2024-05-17T18:54:47.355437 #82067] INFO -- : [514/885] 123417=test_gem_resolver_git_set I, [2024-05-17T18:54:47.379249 #82067] INFO -- : [515/885] 123406=test_gem_dependency_list I, [2024-05-17T18:54:47.414363 #82067] INFO -- : [516/885] 123409=test_benchmark I, [2024-05-17T18:54:47.435556 #82067] INFO -- : [517/885] 123418=test_win32ole_method_event I, [2024-05-17T18:54:47.439189 #82067] INFO -- : [518/885] 123418=test_nesting_parser I, [2024-05-17T18:54:47.439587 #82067] INFO -- : [519/885] 123406=test_gem_source I, [2024-05-17T18:54:47.458143 #82067] INFO -- : [520/885] 123418=test_scalar_scanner I, [2024-05-17T18:54:47.472692 #82067] INFO -- : [521/885] 123418=test_gem_commands_outdated_command I, [2024-05-17T18:54:47.523995 #82067] INFO -- : [522/885] 123418=test_gem_package_tar_writer I, [2024-05-17T18:54:47.604505 #82067] INFO -- : [523/885] 123418=test_helper_method I, [2024-05-17T18:54:47.614103 #82067] INFO -- : [524/885] 123418=test_array I, [2024-05-17T18:54:47.622420 #82067] INFO -- : [525/885] 123401=test_abi I, [2024-05-17T18:54:47.676866 #82067] INFO -- : [526/885] 123417=test_provider I, [2024-05-17T18:54:47.749701 #82067] INFO -- : [527/885] 123406=test_rdoc_parser_simple I, [2024-05-17T18:54:47.799529 #82067] INFO -- : [528/885] 123406=test_gem_commands_rebuild_command I, [2024-05-17T18:54:47.803882 #82067] INFO -- : [529/885] 123401=test_yamldbm I, [2024-05-17T18:54:47.807535 #82067] INFO -- : [530/885] 123402=test_load I, [2024-05-17T18:54:47.811130 #82067] INFO -- : [531/885] 123402=test_https I, [2024-05-17T18:54:47.815234 #82067] INFO -- : [532/885] 123401=test_gem_ext_builder I, [2024-05-17T18:54:47.842964 #82067] INFO -- : [533/885] 123406=test_evaluation I, [2024-05-17T18:54:47.856779 #82067] INFO -- : [534/885] 123406=test_x509ext I, [2024-05-17T18:54:47.860347 #82067] INFO -- : [535/885] 123406=test_erb I, [2024-05-17T18:54:47.921764 #82067] INFO -- : [536/885] 123406=test_gem_source_installed I, [2024-05-17T18:54:47.934635 #82067] INFO -- : [537/885] 123406=test_len I, [2024-05-17T18:54:47.941316 #82067] INFO -- : [538/885] 123406=test_yield_block I, [2024-05-17T18:54:47.946279 #82067] INFO -- : [539/885] 123406=test_completion I, [2024-05-17T18:54:47.982326 #82067] INFO -- : [540/885] 123400=test_gem_commands_cert_command I, [2024-05-17T18:54:48.049733 #82067] INFO -- : [541/885] 123417=test_rational I, [2024-05-17T18:54:48.069869 #82067] INFO -- : [542/885] 123417=test_rational2 I, [2024-05-17T18:54:48.070839 #82067] INFO -- : [543/885] 123417=test_assembler I, [2024-05-17T18:54:48.074152 #82067] INFO -- : [544/885] 123417=test_propertyputref I, [2024-05-17T18:54:48.075855 #82067] INFO -- : [545/885] 123417=attribute_write_test I, [2024-05-17T18:54:48.079718 #82067] INFO -- : [546/885] 123417=test_spell_checker I, [2024-05-17T18:54:48.088746 #82067] INFO -- : [547/885] 123417=constant_path_node_test I, [2024-05-17T18:54:48.090621 #82067] INFO -- : [548/885] 123417=test_gem_ext_cargo_builder I, [2024-05-17T18:54:48.091229 #82067] INFO -- : [549/885] 123411=test_ssl I, [2024-05-17T18:54:48.116818 #82067] INFO -- : [550/885] 123417=test_module I, [2024-05-17T18:54:48.153698 #82067] INFO -- : [551/885] 123408=test_gem_request_set I, [2024-05-17T18:54:48.193202 #82067] INFO -- : [552/885] 123402=test_arith_seq_extract I, [2024-05-17T18:54:48.415371 #82067] INFO -- : [553/885] 123402=test_method_name_check I, [2024-05-17T18:54:48.437117 #82067] INFO -- : [554/885] 123402=test_parser I, [2024-05-17T18:54:48.456866 #82067] INFO -- : [555/885] 123402=test_configuration I, [2024-05-17T18:54:48.499007 #82067] INFO -- : [556/885] 123408=test_rubyvm I, [2024-05-17T18:54:48.500279 #82067] INFO -- : [557/885] 123408=test_buffered_io I, [2024-05-17T18:54:48.567171 #82067] INFO -- : [558/885] 123402=test_monitor I, [2024-05-17T18:54:48.580874 #82067] INFO -- : [559/885] 123406=test_whileuntil I, [2024-05-17T18:54:48.591458 #82067] INFO -- : [560/885] 123406=test_rdoc_generator_markup I, [2024-05-17T18:54:48.593515 #82067] INFO -- : [561/885] 123406=test_boolean I, [2024-05-17T18:54:48.594099 #82067] INFO -- : [562/885] 123408=test_instrumentation_api I, [2024-05-17T18:54:48.606770 #82067] INFO -- : [563/885] 123406=integer_parse_test I, [2024-05-17T18:54:48.609261 #82067] INFO -- : [564/885] 123406=test_stringify_symbols I, [2024-05-17T18:54:48.623397 #82067] INFO -- : [565/885] 123406=test_date_compat I, [2024-05-17T18:54:48.629580 #82067] INFO -- : [566/885] 123406=test_rdoc_markup_to_html I, [2024-05-17T18:54:48.674072 #82067] INFO -- : [567/885] 123409=test_bug-14834 I, [2024-05-17T18:54:48.738911 #82067] INFO -- : [568/885] 123409=test_compile_prism I, [2024-05-17T18:54:48.745205 #82067] INFO -- : [569/885] 123406=test_terminfo I, [2024-05-17T18:54:48.752769 #82067] INFO -- : [570/885] 123406=test_path I, [2024-05-17T18:54:48.757983 #82067] INFO -- : [571/885] 123401=test_case_mapping I, [2024-05-17T18:54:48.760712 #82067] INFO -- : [572/885] 123406=redundant_return_test I, [2024-05-17T18:54:48.764621 #82067] INFO -- : [573/885] 123401=test_bn I, [2024-05-17T18:54:48.769549 #82067] INFO -- : [574/885] 123406=test_win32ole_param_event I, [2024-05-17T18:54:48.772364 #82067] INFO -- : [575/885] 123406=test_addrinfo I, [2024-05-17T18:54:48.775363 #82067] INFO -- : [576/885] 123402=test_http I, [2024-05-17T18:54:48.784125 #82067] INFO -- : [577/885] 123404=test_tree_spell_checker I, [2024-05-17T18:54:48.784397 #82067] INFO -- : [578/885] 123401=test_gem_gem_runner I, [2024-05-17T18:54:48.803807 #82067] INFO -- : [579/885] 123406=test_filter I, [2024-05-17T18:54:48.826016 #82067] INFO -- : [580/885] 123401=static_literals_test I, [2024-05-17T18:54:48.829311 #82067] INFO -- : [581/885] 123404=test_data I, [2024-05-17T18:54:48.831064 #82067] INFO -- : [582/885] 123406=test_rdoc_method_attr I, [2024-05-17T18:54:48.831830 #82067] INFO -- : [583/885] 123401=test_koi8 I, [2024-05-17T18:54:48.837913 #82067] INFO -- : [584/885] 123404=parameters_signature_test I, [2024-05-17T18:54:48.841232 #82067] INFO -- : [585/885] 123401=test_rdoc_parser_changelog I, [2024-05-17T18:54:48.845153 #82067] INFO -- : [586/885] 123404=test_enumerator I, [2024-05-17T18:54:48.849979 #82067] INFO -- : [587/885] 123404=test_unicode I, [2024-05-17T18:54:48.856186 #82067] INFO -- : [588/885] 123404=test_rdoc_generator_pot I, [2024-05-17T18:54:48.926325 #82067] INFO -- : [589/885] 123401=test_thread_cv I, [2024-05-17T18:54:48.948784 #82067] INFO -- : [590/885] 123406=test_lexer I, [2024-05-17T18:54:48.967632 #82067] INFO -- : [591/885] 123406=test_ssl_session I, [2024-05-17T18:54:48.992734 #82067] INFO -- : [592/885] 123404=test_key_event_record I, [2024-05-17T18:54:48.994224 #82067] INFO -- : [593/885] 123404=test_gem_uri I, [2024-05-17T18:54:49.028434 #82067] INFO -- : [594/885] 123404=test_random I, [2024-05-17T18:54:49.038101 #82067] INFO -- : [595/885] 123404=test_notimplement I, [2024-05-17T18:54:49.039294 #82067] INFO -- : [596/885] 123409=test_gem_commands_update_command I, [2024-05-17T18:54:49.043147 #82067] INFO -- : [597/885] 123404=test_gem_resolver_vendor_specification I, [2024-05-17T18:54:49.075601 #82067] INFO -- : [598/885] 123404=test_human_typo I, [2024-05-17T18:54:49.086326 #82067] INFO -- : [599/885] 123404=test_primitive I, [2024-05-17T18:54:49.100239 #82067] INFO -- : [600/885] 123404=test_rbconfig I, [2024-05-17T18:54:49.101706 #82067] INFO -- : [601/885] 123404=test_win32ole_param I, [2024-05-17T18:54:49.105564 #82067] INFO -- : [602/885] 123400=test_gem_commands_yank_command I, [2024-05-17T18:54:49.118123 #82067] INFO -- : [603/885] 123404=test_pair I, [2024-05-17T18:54:49.154489 #82067] INFO -- : [604/885] 123403=test_document I, [2024-05-17T18:54:49.160386 #82067] INFO -- : [605/885] 123403=test_rdoc_generator_pot_po_entry I, [2024-05-17T18:54:49.162624 #82067] INFO -- : [606/885] 123403=test_euc_jp I, [2024-05-17T18:54:49.170669 #82067] INFO -- : [607/885] 123403=test_acceptable I, [2024-05-17T18:54:49.211926 #82067] INFO -- : [608/885] 123410=test_name_error_extension I, [2024-05-17T18:54:49.218644 #82067] INFO -- : [609/885] 123410=test_chilled I, [2024-05-17T18:54:49.222470 #82067] INFO -- : [610/885] 123410=test_rdoc_i18n_locale I, [2024-05-17T18:54:49.224600 #82067] INFO -- : [611/885] 123410=test_encoding I, [2024-05-17T18:54:49.232726 #82067] INFO -- : [612/885] 123410=test_httpresponses I, [2024-05-17T18:54:49.251347 #82067] INFO -- : [613/885] 123405=test_set_len I, [2024-05-17T18:54:49.252839 #82067] INFO -- : [614/885] 123405=test_httpheader I, [2024-05-17T18:54:49.265222 #82067] INFO -- : [615/885] 123410=test_gem_resolver_local_specification I, [2024-05-17T18:54:49.282655 #82067] INFO -- : [616/885] 123410=test_rdoc_ri_driver I, [2024-05-17T18:54:49.298681 #82067] INFO -- : [617/885] 123403=test_install I, [2024-05-17T18:54:49.302189 #82067] INFO -- : [618/885] 123405=test_rdoc_markup_to_label I, [2024-05-17T18:54:49.324182 #82067] INFO -- : [619/885] 123405=test_sockopt I, [2024-05-17T18:54:49.325130 #82067] INFO -- : [620/885] 123405=test_color I, [2024-05-17T18:54:49.332444 #82067] INFO -- : [621/885] 123413=json_encoding_test I, [2024-05-17T18:54:49.349179 #82067] INFO -- : [622/885] 123413=test_key_stroke I, [2024-05-17T18:54:49.359731 #82067] INFO -- : [623/885] 123413=reflection_test I, [2024-05-17T18:54:49.405922 #82067] INFO -- : [624/885] 123405=test_gem_bundler_version_finder I, [2024-05-17T18:54:49.423041 #82067] INFO -- : [625/885] 123413=test_emoji_breaks I, [2024-05-17T18:54:49.426884 #82067] INFO -- : [626/885] 123405=test_within_pipe I, [2024-05-17T18:54:49.430091 #82067] INFO -- : [627/885] 123407=test_rdoc_markup_to_bs I, [2024-05-17T18:54:49.441774 #82067] INFO -- : [628/885] 123413=test_help I, [2024-05-17T18:54:49.449373 #82067] INFO -- : [629/885] 123405=test_gem_commands_unpack_command I, [2024-05-17T18:54:49.452758 #82067] INFO -- : [630/885] 123399=test_files_lib I, [2024-05-17T18:54:49.453631 #82067] INFO -- : [631/885] 123399=test_beginendblock I, [2024-05-17T18:54:49.455433 #82067] INFO -- : [632/885] 123413=test_time I, [2024-05-17T18:54:49.464265 #82067] INFO -- : [633/885] 123407=test_webauthn_listener_response I, [2024-05-17T18:54:49.485301 #82067] INFO -- : [634/885] 123407=test_to_ary_concat I, [2024-05-17T18:54:49.536457 #82067] INFO -- : [635/885] 123403=test_stream I, [2024-05-17T18:54:49.538161 #82067] INFO -- : [636/885] 123403=test_printf I, [2024-05-17T18:54:49.547366 #82067] INFO -- : [637/885] 123403=test_rdoc_markup_pre_process I, [2024-05-17T18:54:49.555854 #82067] INFO -- : [638/885] 123410=test_pinned I, [2024-05-17T18:54:49.558122 #82067] INFO -- : [639/885] 123401=test_history I, [2024-05-17T18:54:49.573232 #82067] INFO -- : [640/885] 123400=test_date_marshal I, [2024-05-17T18:54:49.579949 #82067] INFO -- : [641/885] 123400=test_mkmf I, [2024-05-17T18:54:49.584260 #82067] INFO -- : [642/885] 123401=test_delegate I, [2024-05-17T18:54:49.595441 #82067] INFO -- : [643/885] 123410=test_popen_deadlock I, [2024-05-17T18:54:49.595514 #82067] INFO -- : [644/885] 123401=test_exit I, [2024-05-17T18:54:49.612853 #82067] INFO -- : [645/885] 123400=test_recursion I, [2024-05-17T18:54:49.615836 #82067] INFO -- : [646/885] 123400=test_ractor I, [2024-05-17T18:54:49.628459 #82067] INFO -- : [647/885] 123413=test_gem_security I, [2024-05-17T18:54:49.636182 #82067] INFO -- : [648/885] 123403=test_rdoc_servlet I, [2024-05-17T18:54:49.671231 #82067] INFO -- : [649/885] 123400=test_digest I, [2024-05-17T18:54:49.675020 #82067] INFO -- : [650/885] 123400=test_bundled_ca I, [2024-05-17T18:54:49.685491 #82067] INFO -- : [651/885] 123401=test_closure I, [2024-05-17T18:54:49.698417 #82067] INFO -- : [652/885] 123405=test_fiber I, [2024-05-17T18:54:49.816994 #82067] INFO -- : [653/885] 123403=test_multi_irb_commands I, [2024-05-17T18:54:49.821327 #82067] INFO -- : [654/885] 123403=test_open3 I, [2024-05-17T18:54:49.891127 #82067] INFO -- : [655/885] 123399=test_gem_commands_build_command I, [2024-05-17T18:54:49.937918 #82067] INFO -- : [656/885] 123416=test_interned_str I, [2024-05-17T18:54:49.940938 #82067] INFO -- : [657/885] 123416=test_case_comprehensive I, [2024-05-17T18:54:50.004260 #82067] INFO -- : [658/885] 123406=test_gem_commands_server_command I, [2024-05-17T18:54:50.020945 #82067] INFO -- : [659/885] 123406=test_variable_name_check I, [2024-05-17T18:54:50.073362 #82067] INFO -- : [660/885] 123401=test_io_m17n I, [2024-05-17T18:54:50.091829 #82067] INFO -- : [661/885] 123409=test_did_you_mean I, [2024-05-17T18:54:50.136050 #82067] INFO -- : [662/885] 123406=test_cmethod I, [2024-05-17T18:54:50.140442 #82067] INFO -- : [663/885] 123406=test_tracer I, [2024-05-17T18:54:50.157875 #82067] INFO -- : [664/885] 123406=test_append I, [2024-05-17T18:54:50.170981 #82067] INFO -- : [665/885] 123406=test_option I, [2024-05-17T18:54:50.207708 #82067] INFO -- : [666/885] 123399=test_rdoc_markup_heading I, [2024-05-17T18:54:50.223993 #82067] INFO -- : [667/885] 123410=test_iseq I, [2024-05-17T18:54:50.248467 #82067] INFO -- : [668/885] 123409=test_exception_at_throwing I, [2024-05-17T18:54:50.312462 #82067] INFO -- : [669/885] 123409=test_pkey_dsa I, [2024-05-17T18:54:50.324658 #82067] INFO -- : [670/885] 123414=test_class I, [2024-05-17T18:54:50.330224 #82067] INFO -- : [671/885] 123406=test_ocsp I, [2024-05-17T18:54:50.351799 #82067] INFO -- : [672/885] 123414=test_scheduler I, [2024-05-17T18:54:50.357201 #82067] INFO -- : [673/885] 123399=test_enumerable I, [2024-05-17T18:54:50.360278 #82067] INFO -- : [674/885] 123399=test_config I, [2024-05-17T18:54:50.508419 #82067] INFO -- : [675/885] 123414=test_gem_resolver_vendor_set I, [2024-05-17T18:54:50.525599 #82067] INFO -- : [676/885] 123414=test_gem_resolver_api_set I, [2024-05-17T18:54:50.598414 #82067] INFO -- : [677/885] 123414=test_gem_safe_marshal I, [2024-05-17T18:54:50.663636 #82067] INFO -- : [678/885] 123406=test_transcode I, [2024-05-17T18:54:50.700267 #82067] INFO -- : [679/885] 123407=json_generator_test I, [2024-05-17T18:54:50.704175 #82067] INFO -- : [680/885] 123409=test_eval I, [2024-05-17T18:54:50.759914 #82067] INFO -- : [681/885] 123407=test_x509store I, [2024-05-17T18:54:50.825116 #82067] INFO -- : [682/885] 123399=test_rdoc_code_object I, [2024-05-17T18:54:50.849483 #82067] INFO -- : [683/885] 123417=test_update I, [2024-05-17T18:54:50.854181 #82067] INFO -- : [684/885] 123417=test_x509name I, [2024-05-17T18:54:50.856234 #82067] INFO -- : [685/885] 123410=test_fips I, [2024-05-17T18:54:50.858074 #82067] INFO -- : [686/885] 123406=test_helper I, [2024-05-17T18:54:50.858400 #82067] INFO -- : [687/885] 123406=test_random_formatter I, [2024-05-17T18:54:50.880969 #82067] INFO -- : [688/885] 123417=test_jaro_winkler I, [2024-05-17T18:54:50.882598 #82067] INFO -- : [689/885] 123406=test_lambda I, [2024-05-17T18:54:50.885867 #82067] INFO -- : [690/885] 123417=test_gem_request_set_gem_dependency_api I, [2024-05-17T18:54:50.896475 #82067] INFO -- : [691/885] 123409=test_ast I, [2024-05-17T18:54:50.942461 #82067] INFO -- : [692/885] 123406=test_webauthn_listener I, [2024-05-17T18:54:50.971059 #82067] INFO -- : [693/885] 123407=errors_test I, [2024-05-17T18:54:50.997806 #82067] INFO -- : [694/885] 123406=test_regexp I, [2024-05-17T18:54:51.016151 #82067] INFO -- : [695/885] 123414=test_gem_commands_check_command I, [2024-05-17T18:54:51.041631 #82067] INFO -- : [696/885] 123414=test_tmpdir I, [2024-05-17T18:54:51.042513 #82067] INFO -- : [697/885] 123407=test_integer_comb I, [2024-05-17T18:54:51.088112 #82067] INFO -- : [698/885] 123410=test_rdoc_markup_document I, [2024-05-17T18:54:51.101977 #82067] INFO -- : [699/885] 123414=test_vm_dump I, [2024-05-17T18:54:51.102279 #82067] INFO -- : [700/885] 123414=test_udp I, [2024-05-17T18:54:51.107610 #82067] INFO -- : [701/885] 123414=bom_test I, [2024-05-17T18:54:51.111581 #82067] INFO -- : [702/885] 123410=test_data_error I, [2024-05-17T18:54:51.117550 #82067] INFO -- : [703/885] 123414=unescape_test I, [2024-05-17T18:54:51.138124 #82067] INFO -- : [704/885] 123417=test_ostruct I, [2024-05-17T18:54:51.181307 #82067] INFO -- : [705/885] 123410=test_file I, [2024-05-17T18:54:51.246261 #82067] INFO -- : [706/885] 123399=test_force_exit I, [2024-05-17T18:54:51.269864 #82067] INFO -- : [707/885] 123401=static_inspect_test I, [2024-05-17T18:54:51.277153 #82067] INFO -- : [708/885] 123401=test_helper I, [2024-05-17T18:54:51.279100 #82067] INFO -- : [709/885] 123401=test_erb_command I, [2024-05-17T18:54:51.288315 #82067] INFO -- : [710/885] 123417=test_encoding I, [2024-05-17T18:54:51.315391 #82067] INFO -- : [711/885] 123401=test_gem_uri_formatter I, [2024-05-17T18:54:51.330818 #82067] INFO -- : [712/885] 123399=test_range I, [2024-05-17T18:54:51.340442 #82067] INFO -- : [713/885] 123401=test_project_sanity I, [2024-05-17T18:54:51.376813 #82067] INFO -- : [714/885] 123401=command_line_test I, [2024-05-17T18:54:51.381400 #82067] INFO -- : [715/885] 123401=test_dup I, [2024-05-17T18:54:51.455003 #82067] INFO -- : [716/885] 123417=test_pty I, [2024-05-17T18:54:51.523916 #82067] INFO -- : [717/885] 123401=test_constant I, [2024-05-17T18:54:51.555059 #82067] INFO -- : [718/885] 123400=test_rdoc_ri_paths I, [2024-05-17T18:54:51.568341 #82067] INFO -- : [719/885] 123408=test_ensured I, [2024-05-17T18:54:51.630210 #82067] INFO -- : [720/885] 123408=test_addr I, [2024-05-17T18:54:51.635865 #82067] INFO -- : [721/885] 123408=test_locale I, [2024-05-17T18:54:51.681560 #82067] INFO -- : [722/885] 123408=library_symbols_test I, [2024-05-17T18:54:51.728862 #82067] INFO -- : [723/885] 123400=test_ts I, [2024-05-17T18:54:51.749782 #82067] INFO -- : [724/885] 123408=test_object I, [2024-05-17T18:54:51.756703 #82067] INFO -- : [725/885] 123408=heredoc_dedent_test I, [2024-05-17T18:54:51.760142 #82067] INFO -- : [726/885] 123408=test_cgi_header I, [2024-05-17T18:54:51.770907 #82067] INFO -- : [727/885] 123408=version_test I, [2024-05-17T18:54:51.773329 #82067] INFO -- : [728/885] 123408=test_basicinstructions I, [2024-05-17T18:54:51.856625 #82067] INFO -- : [729/885] 123408=test_gem_gemcutter_utilities I, [2024-05-17T18:54:51.942790 #82067] INFO -- : [730/885] 123417=test_gem_command_manager I, [2024-05-17T18:54:52.063430 #82067] INFO -- : [731/885] 123414=test_key_actor_emacs I, [2024-05-17T18:54:52.073893 #82067] INFO -- : [732/885] 123417=test_arithmetic_sequence I, [2024-05-17T18:54:52.074932 #82067] INFO -- : [733/885] 123403=test_timeout I, [2024-05-17T18:54:52.080329 #82067] INFO -- : [734/885] 123403=test_ossl I, [2024-05-17T18:54:52.089087 #82067] INFO -- : [735/885] 123417=test_normalize I, [2024-05-17T18:54:52.089267 #82067] INFO -- : [736/885] 123417=test_change_word I, [2024-05-17T18:54:52.096996 #82067] INFO -- : [737/885] 123417=test_flip I, [2024-05-17T18:54:52.116611 #82067] INFO -- : [738/885] 123417=compiler_test I, [2024-05-17T18:54:52.122696 #82067] INFO -- : [739/885] 123400=test_sleep I, [2024-05-17T18:54:52.125918 #82067] INFO -- : [740/885] 123417=test_object I, [2024-05-17T18:54:52.145276 #82067] INFO -- : [741/885] 123414=test_ruby_lex I, [2024-05-17T18:54:52.178540 #82067] INFO -- : [742/885] 123399=test_date_arith I, [2024-05-17T18:54:52.194654 #82067] INFO -- : [743/885] 123399=test_gem_local_remote_options I, [2024-05-17T18:54:52.204745 #82067] INFO -- : [744/885] 123408=test_func I, [2024-05-17T18:54:52.237228 #82067] INFO -- : [745/885] 123399=test_big5 I, [2024-05-17T18:54:52.241252 #82067] INFO -- : [746/885] 123399=test_pointer I, [2024-05-17T18:54:52.263645 #82067] INFO -- : [747/885] 123414=test_ractor I, [2024-05-17T18:54:52.304632 #82067] INFO -- : [748/885] 123414=test_type I, [2024-05-17T18:54:52.309700 #82067] INFO -- : [749/885] 123414=test_signedness I, [2024-05-17T18:54:52.410083 #82067] INFO -- : [750/885] 123417=test_tsort I, [2024-05-17T18:54:52.419626 #82067] INFO -- : [751/885] 123417=test_rdoc_rd_block_parser I, [2024-05-17T18:54:52.440854 #82067] INFO -- : [752/885] 123417=test_gem_commands_push_command I, [2024-05-17T18:54:52.541930 #82067] INFO -- : [753/885] 123404=test_weakkeymap I, [2024-05-17T18:54:52.668377 #82067] INFO -- : [754/885] 123407=test_numhash I, [2024-05-17T18:54:52.676468 #82067] INFO -- : [755/885] 123407=test_pkey_rsa I, [2024-05-17T18:54:52.693499 #82067] INFO -- : [756/885] 123418=test_gem_platform I, [2024-05-17T18:54:52.768170 #82067] INFO -- : [757/885] 123404=test_placearg I, [2024-05-17T18:54:52.779754 #82067] INFO -- : [758/885] 123418=test_gem_package_task I, [2024-05-17T18:54:52.786044 #82067] INFO -- : [759/885] 123418=test_date_strptime I, [2024-05-17T18:54:52.843987 #82067] INFO -- : [760/885] 123404=test_rdoc_markup_hard_break I, [2024-05-17T18:54:52.849097 #82067] INFO -- : [761/885] 123404=test_win32ole_method I, [2024-05-17T18:54:52.850221 #82067] INFO -- : [762/885] 123404=test_delete I, [2024-05-17T18:54:52.854302 #82067] INFO -- : [763/885] 123407=test_keyword I, [2024-05-17T18:54:52.855390 #82067] INFO -- : [764/885] 123404=test_class_name_check I, [2024-05-17T18:54:52.874688 #82067] INFO -- : [765/885] 123404=test_fd_setsize I, [2024-05-17T18:54:52.876237 #82067] INFO -- : [766/885] 123404=test_continuation I, [2024-05-17T18:54:52.883366 #82067] INFO -- : [767/885] 123404=test_file_exhaustive I, [2024-05-17T18:54:52.937910 #82067] INFO -- : [768/885] 123418=test_files_test I, [2024-05-17T18:54:52.938630 #82067] INFO -- : [769/885] 123412=test_gem_update_suggestion I, [2024-05-17T18:54:52.962976 #82067] INFO -- : [770/885] 123399=test_logger I, [2024-05-17T18:54:52.981240 #82067] INFO -- : [771/885] 123399=test_not I, [2024-05-17T18:54:52.984813 #82067] INFO -- : [772/885] 123399=test_gem_resolver_lock_set I, [2024-05-17T18:54:52.991382 #82067] INFO -- : [773/885] 123412=test_import I, [2024-05-17T18:54:53.006088 #82067] INFO -- : [774/885] 123399=test_rdoc_parser_markdown I, [2024-05-17T18:54:53.022483 #82067] INFO -- : [775/885] 123417=test_gem_commands_cleanup_command I, [2024-05-17T18:54:53.024648 #82067] INFO -- : [776/885] 123399=test_word I, [2024-05-17T18:54:53.029980 #82067] INFO -- : [777/885] 123399=test_cgi_multipart I, [2024-05-17T18:54:53.040056 #82067] INFO -- : [778/885] 123418=test_numeric I, [2024-05-17T18:54:53.046647 #82067] INFO -- : [779/885] 123418=test_member I, [2024-05-17T18:54:53.053700 #82067] INFO -- : [780/885] 123418=test_ractor_compatibility I, [2024-05-17T18:54:53.171129 #82067] INFO -- : [781/885] 123399=test_eval I, [2024-05-17T18:54:53.173699 #82067] INFO -- : [782/885] 123399=test_autoconf I, [2024-05-17T18:54:53.181391 #82067] INFO -- : [783/885] 123399=test_date_ractor I, [2024-05-17T18:54:53.265737 #82067] INFO -- : [784/885] 123413=test_gem_console_ui I, [2024-05-17T18:54:53.271883 #82067] INFO -- : [785/885] 123413=format_errors_test I, [2024-05-17T18:54:53.273770 #82067] INFO -- : [786/885] 123413=test_dir I, [2024-05-17T18:54:53.345472 #82067] INFO -- : [787/885] 123407=test_mailto I, [2024-05-17T18:54:53.354875 #82067] INFO -- : [788/885] 123407=test_coderange I, [2024-05-17T18:54:53.358001 #82067] INFO -- : [789/885] 123407=test_symbol I, [2024-05-17T18:54:53.366067 #82067] INFO -- : [790/885] 123407=location_test I, [2024-05-17T18:54:53.395059 #82067] INFO -- : [791/885] 123407=test_gem_source_fetch_problem I, [2024-05-17T18:54:53.400654 #82067] INFO -- : [792/885] 123407=json_generic_object_test I, [2024-05-17T18:54:53.404647 #82067] INFO -- : [793/885] 123399=test_http_request I, [2024-05-17T18:54:53.406628 #82067] INFO -- : [794/885] 123407=test_rdoc_generator_darkfish I, [2024-05-17T18:54:53.447133 #82067] INFO -- : [795/885] 123408=test_error_highlight I, [2024-05-17T18:54:53.447811 #82067] INFO -- : [796/885] 123412=test_resize I, [2024-05-17T18:54:53.451647 #82067] INFO -- : [797/885] 123399=test_rdoc_comment I, [2024-05-17T18:54:53.453171 #82067] INFO -- : [798/885] 123412=test_function_entry I, [2024-05-17T18:54:53.453985 #82067] INFO -- : [799/885] 123412=test_gem_resolver_requirement_list I, [2024-05-17T18:54:53.459155 #82067] INFO -- : [800/885] 123412=test_arith_seq_beg_len_step I, [2024-05-17T18:54:53.468061 #82067] INFO -- : [801/885] 123413=test_pkcs7 I, [2024-05-17T18:54:53.496570 #82067] INFO -- : [802/885] 123399=test_lazy_enumerator I, [2024-05-17T18:54:53.501942 #82067] INFO -- : [803/885] 123412=test_enc_associate I, [2024-05-17T18:54:53.513661 #82067] INFO -- : [804/885] 123418=test_unix I, [2024-05-17T18:54:53.548429 #82067] INFO -- : [805/885] 123418=test_symbol I, [2024-05-17T18:54:53.563312 #82067] INFO -- : [806/885] 123401=test_coder I, [2024-05-17T18:54:53.571273 #82067] INFO -- : [807/885] 123401=test_nofree I, [2024-05-17T18:54:53.573658 #82067] INFO -- : [808/885] 123401=test_context I, [2024-05-17T18:54:53.621021 #82067] INFO -- : [809/885] 123407=test_gem_commands_pristine_command I, [2024-05-17T18:54:53.621636 #82067] INFO -- : [810/885] 123413=ruby_api_test I, [2024-05-17T18:54:53.627412 #82067] INFO -- : [811/885] 123417=test_find_executable I, [2024-05-17T18:54:53.654157 #82067] INFO -- : [812/885] 123417=test_rdoc_generator_json_index I, [2024-05-17T18:54:53.684980 #82067] INFO -- : [813/885] 123417=test_win32ole_event I, [2024-05-17T18:54:53.692878 #82067] INFO -- : [814/885] 123401=test_time_tz I, [2024-05-17T18:54:53.693786 #82067] INFO -- : [815/885] 123417=test_trace I, [2024-05-17T18:54:53.703609 #82067] INFO -- : [816/885] 123417=ractor_test I, [2024-05-17T18:54:53.718756 #82067] INFO -- : [817/885] 123413=test_win32ole_variable I, [2024-05-17T18:54:53.722150 #82067] INFO -- : [818/885] 123413=test_io_wait_uncommon I, [2024-05-17T18:54:53.728434 #82067] INFO -- : [819/885] 123413=test_stringio I, [2024-05-17T18:54:53.754092 #82067] INFO -- : [820/885] 123408=test_arity I, [2024-05-17T18:54:53.758189 #82067] INFO -- : [821/885] 123401=test_gem_ci_detector I, [2024-05-17T18:54:53.760099 #82067] INFO -- : [822/885] 123408=test_rdoc_class_module I, [2024-05-17T18:54:53.775372 #82067] INFO -- : [823/885] 123401=test_bignum I, [2024-05-17T18:54:53.781780 #82067] INFO -- : [824/885] 123417=test_threadgroup I, [2024-05-17T18:54:53.827495 #82067] INFO -- : [825/885] 123413=test_enum I, [2024-05-17T18:54:53.855031 #82067] INFO -- : [826/885] 123401=test_gem_specification I, [2024-05-17T18:54:53.928804 #82067] INFO -- : [827/885] 123412=test_have_macro I, [2024-05-17T18:54:53.944834 #82067] INFO -- : [828/885] 123399=test_gem_package I, [2024-05-17T18:54:54.159271 #82067] INFO -- : [829/885] 123408=test_resolve_symbol I, [2024-05-17T18:54:54.199084 #82067] INFO -- : [830/885] 123408=test_complex2 I, [2024-05-17T18:54:54.207533 #82067] INFO -- : [831/885] 123408=test_merge_keys I, [2024-05-17T18:54:54.217165 #82067] INFO -- : [832/885] 123408=test_rdoc_extend I, [2024-05-17T18:54:54.223989 #82067] INFO -- : [833/885] 123408=test_ipaddr I, [2024-05-17T18:54:54.239021 #82067] INFO -- : [834/885] 123408=test_rdoc_markup_to_ansi I, [2024-05-17T18:54:54.269903 #82067] INFO -- : [835/885] 123408=test_mixed_unicode_escapes I, [2024-05-17T18:54:54.273348 #82067] INFO -- : [836/885] 123408=test_history I, [2024-05-17T18:54:54.282670 #82067] INFO -- : [837/885] 123408=test_win32ole_variant I, [2024-05-17T18:54:54.287150 #82067] INFO -- : [838/885] 123408=test_gem_resolver_api_specification I, [2024-05-17T18:54:54.314297 #82067] INFO -- : [839/885] 123408=test_parser I, [2024-05-17T18:54:54.329179 #82067] INFO -- : [840/885] 123408=test_cgi_core I, [2024-05-17T18:54:54.330732 #82067] INFO -- : [841/885] 123399=test_dns I, [2024-05-17T18:54:54.348948 #82067] INFO -- : [842/885] 123408=test_gem_commands_open_command I, [2024-05-17T18:54:54.448181 #82067] INFO -- : [843/885] 123408=test_ractor I, [2024-05-17T18:54:54.449510 #82067] INFO -- : [844/885] 123412=test_gem_source_lock I, [2024-05-17T18:54:54.459847 #82067] INFO -- : [845/885] 123408=test_gem I, [2024-05-17T18:54:54.473030 #82067] INFO -- : [846/885] 123414=parse_stream_test I, [2024-05-17T18:54:54.479087 #82067] INFO -- : [847/885] 123414=test_registry I, [2024-05-17T18:54:54.481995 #82067] INFO -- : [848/885] 123414=test_ractor I, [2024-05-17T18:54:54.501040 #82067] INFO -- : [849/885] 123412=json_ext_parser_test I, [2024-05-17T18:54:54.509472 #82067] INFO -- : [850/885] 123412=test_thread I, [2024-05-17T18:54:54.696625 #82067] INFO -- : [851/885] 123413=test_my_integer I, [2024-05-17T18:54:54.702496 #82067] INFO -- : [852/885] 123413=test_rendering I, [2024-05-17T18:54:54.708986 #82067] INFO -- : [853/885] 123407=test_debugger_integration I, [2024-05-17T18:54:54.713633 #82067] INFO -- : [854/885] 123413=test_ssl I, [2024-05-17T18:54:54.716384 #82067] INFO -- : [855/885] 123407=test_ancdata I, [2024-05-17T18:54:54.721860 #82067] INFO -- : [856/885] 123407=test_singleton_function I, [2024-05-17T18:54:54.722772 #82067] INFO -- : [857/885] 123407=test_rb_str_dup I, [2024-05-17T18:54:54.726755 #82067] INFO -- : [858/885] 123407=test_reline_key I, [2024-05-17T18:54:54.732718 #82067] INFO -- : [859/885] 123407=test_unicode_normalize I, [2024-05-17T18:54:54.788873 #82067] INFO -- : [860/885] 123417=test_marshal I, [2024-05-17T18:54:54.821622 #82067] INFO -- : [861/885] 123399=test_nonblock I, [2024-05-17T18:54:54.822667 #82067] INFO -- : [862/885] 123414=test_weakref I, [2024-05-17T18:54:54.836170 #82067] INFO -- : [863/885] 123399=test_alias I, [2024-05-17T18:54:54.954278 #82067] INFO -- : [864/885] 123415=test_timeout I, [2024-05-17T18:54:54.977346 #82067] INFO -- : [865/885] 123414=test_https_proxy I, [2024-05-17T18:54:55.000856 #82067] INFO -- : [866/885] 123399=test_call I, [2024-05-17T18:54:55.009811 #82067] INFO -- : [867/885] 123414=test_rubygems I, [2024-05-17T18:54:55.120724 #82067] INFO -- : [868/885] 123414=test_cgi_modruby I, [2024-05-17T18:54:55.134355 #82067] INFO -- : [869/885] 123414=test_integer I, [2024-05-17T18:54:55.144136 #82067] INFO -- : [870/885] 123399=test_super I, [2024-05-17T18:54:55.153066 #82067] INFO -- : [871/885] 123401=test_rubyoptions I, [2024-05-17T18:54:55.154442 #82067] INFO -- : [872/885] 123413=test_gem_resolver_git_specification I, [2024-05-17T18:54:55.403956 #82067] INFO -- : [873/885] 123413=test_object_references I, [2024-05-17T18:54:55.443682 #82067] INFO -- : [874/885] 123413=test_usrmarshal I, [2024-05-17T18:54:55.606704 #82067] INFO -- : [875/885] 123405=test_nextafter I, [2024-05-17T18:54:55.615363 #82067] INFO -- : [876/885] 123417=test_capacity I, [2024-05-17T18:54:55.622521 #82067] INFO -- : [877/885] 123417=test_gem_request_set_lockfile_tokenizer I, [2024-05-17T18:54:55.639958 #82067] INFO -- : [878/885] 123413=test_stat I, [2024-05-17T18:54:55.644428 #82067] INFO -- : [879/885] 123413=test_have_func I, [2024-05-17T18:54:55.648619 #82067] INFO -- : [880/885] 123399=desugar_compiler_test I, [2024-05-17T18:54:55.657981 #82067] INFO -- : [881/885] 123399=test_integer I, [2024-05-17T18:54:55.660900 #82067] INFO -- : [882/885] 123417=test_dryrun I, [2024-05-17T18:54:55.672049 #82067] INFO -- : [883/885] 123405=test_rdoc_attr I, [2024-05-17T18:54:55.675067 #82067] INFO -- : [884/885] 123417=test_env I, [2024-05-17T18:54:55.680884 #82067] INFO -- : [885/885] 123405=test_gem_commands_setup_command I, [2024-05-17T18:55:16.393548 #82067] INFO -- : Finished tests in 39.080518s, 675.1958 tests/s, 239296.8041 assertions/s. I, [2024-05-17T18:55:16.394123 #82067] INFO -- : 26387 tests, 9351843 assertions, 0 failures, 0 errors, 304 skips I, [2024-05-17T18:55:16.394145 #82067] INFO -- : I, [2024-05-17T18:55:16.394152 #82067] INFO -- : ruby -v: ruby 3.4.0dev (2024-05-17T15:29:00Z master e61d24d77e) [x86_64-linux] I, [2024-05-17T18:55:16.396136 #82067] INFO -- : $$$[end] "make yes-test-all TESTOPTS='--stderr-on-failure' TESTS='-j20'" exit with 0. I, [2024-05-17T18:55:16.396280 #82067] INFO -- : $$$[beg] make yes-test-rubyspec MSPECOPT='--error-output stderr --debug -j' TESTS='-j20' I, [2024-05-17T18:55:16.483018 #82067] INFO -- : BASERUBY = /usr/bin/ruby --disable=gems I, [2024-05-17T18:55:16.483058 #82067] INFO -- : CC = gcc I, [2024-05-17T18:55:16.483064 #82067] INFO -- : LD = ld I, [2024-05-17T18:55:16.483069 #82067] INFO -- : LDSHARED = gcc -shared I, [2024-05-17T18:55:16.483083 #82067] INFO -- : CFLAGS = -O3 -fno-fast-math -ggdb3 -Wall -Wextra -Wdeprecated-declarations -Wdiv-by-zero -Wduplicated-cond -Wimplicit-function-declaration -Wimplicit-int -Wpointer-arith -Wwrite-strings -Wold-style-definition -Wimplicit-fallthrough=0 -Wmissing-noreturn -Wno-cast-function-type -Wno-constant-logical-operand -Wno-long-long -Wno-missing-field-initializers -Wno-overlength-strings -Wno-packed-bitfield-compat -Wno-parentheses-equality -Wno-self-assign -Wno-tautological-compare -Wno-unused-parameter -Wno-unused-value -Wsuggest-attribute=format -Wsuggest-attribute=noreturn -Wunused-variable -Wmisleading-indentation -Wundef -fPIC I, [2024-05-17T18:55:16.483088 #82067] INFO -- : XCFLAGS = -U_FORTIFY_SOURCE -D_FORTIFY_SOURCE=2 -fstack-protector-strong -fno-strict-overflow -fvisibility=hidden -fexcess-precision=standard -DRUBY_EXPORT -I. -I.ext/include/x86_64-linux -I/tmp/ruby/src/trunk/include -I/tmp/ruby/src/trunk -I/tmp/ruby/src/trunk/prism -I/tmp/ruby/src/trunk/enc/unicode/15.0.0 I, [2024-05-17T18:55:16.483093 #82067] INFO -- : CPPFLAGS = I, [2024-05-17T18:55:16.483097 #82067] INFO -- : DLDFLAGS = -Wl,--compress-debug-sections=zlib -Wl,-soname,libruby.so.3.4 -fstack-protector-strong I, [2024-05-17T18:55:16.483101 #82067] INFO -- : SOLIBS = -lz -lrt -lrt -lgmp -ldl -lcrypt -lm -lpthread I, [2024-05-17T18:55:16.483105 #82067] INFO -- : LANG = en_US.UTF-8 I, [2024-05-17T18:55:16.483109 #82067] INFO -- : LC_ALL = I, [2024-05-17T18:55:16.483113 #82067] INFO -- : LC_CTYPE = I, [2024-05-17T18:55:16.483117 #82067] INFO -- : MFLAGS = I, [2024-05-17T18:55:16.483121 #82067] INFO -- : RUSTC = no I, [2024-05-17T18:55:16.483125 #82067] INFO -- : YJIT_RUSTC_ARGS = --crate-name=yjit --crate-type=staticlib --edition=2021 -g -C lto=thin -C opt-level=3 -C overflow-checks=on '--out-dir=/tmp/ruby/build/trunk/yjit/target/release/' /tmp/ruby/src/trunk/yjit/src/lib.rs I, [2024-05-17T18:55:16.483568 #82067] INFO -- : gcc (Ubuntu 11.4.0-1ubuntu1~22.04) 11.4.0 I, [2024-05-17T18:55:16.483590 #82067] INFO -- : Copyright (C) 2021 Free Software Foundation, Inc. I, [2024-05-17T18:55:16.483594 #82067] INFO -- : This is free software; see the source for copying conditions. There is NO I, [2024-05-17T18:55:16.483598 #82067] INFO -- : warranty; not even for MERCHANTABILITY or FITNESS FOR A PARTICULAR PURPOSE. I, [2024-05-17T18:55:16.483602 #82067] INFO -- : I, [2024-05-17T18:55:16.485333 #82067] INFO -- : generating enc.mk I, [2024-05-17T18:55:16.603270 #82067] INFO -- : making enc I, [2024-05-17T18:55:16.620496 #82067] INFO -- : make[1]: Entering directory '/tmp/ruby/build/trunk' I, [2024-05-17T18:55:16.620523 #82067] INFO -- : make[1]: Nothing to be done for 'enc'. I, [2024-05-17T18:55:16.620530 #82067] INFO -- : make[1]: Leaving directory '/tmp/ruby/build/trunk' I, [2024-05-17T18:55:16.621147 #82067] INFO -- : making srcs under enc I, [2024-05-17T18:55:16.651077 #82067] INFO -- : make[1]: Entering directory '/tmp/ruby/build/trunk' I, [2024-05-17T18:55:16.651102 #82067] INFO -- : make[1]: Nothing to be done for 'srcs'. I, [2024-05-17T18:55:16.651107 #82067] INFO -- : make[1]: Leaving directory '/tmp/ruby/build/trunk' I, [2024-05-17T18:55:16.651918 #82067] INFO -- : generating transdb.h I, [2024-05-17T18:55:16.751987 #82067] INFO -- : transdb.h unchanged I, [2024-05-17T18:55:16.753302 #82067] INFO -- : making trans I, [2024-05-17T18:55:16.787904 #82067] INFO -- : make[1]: Entering directory '/tmp/ruby/build/trunk' I, [2024-05-17T18:55:16.787927 #82067] INFO -- : make[1]: Nothing to be done for 'trans'. I, [2024-05-17T18:55:16.787933 #82067] INFO -- : make[1]: Leaving directory '/tmp/ruby/build/trunk' I, [2024-05-17T18:55:16.788631 #82067] INFO -- : making encs I, [2024-05-17T18:55:16.828316 #82067] INFO -- : make[1]: Entering directory '/tmp/ruby/build/trunk' I, [2024-05-17T18:55:16.828337 #82067] INFO -- : make[1]: Nothing to be done for 'encs'. I, [2024-05-17T18:55:16.828343 #82067] INFO -- : make[1]: Leaving directory '/tmp/ruby/build/trunk' I, [2024-05-17T18:55:16.830272 #82067] INFO -- : generating makefiles ext/configure-ext.mk I, [2024-05-17T18:55:16.856624 #82067] INFO -- : ext/configure-ext.mk updated I, [2024-05-17T18:55:16.859149 #82067] INFO -- : make[1]: Entering directory '/tmp/ruby/build/trunk' I, [2024-05-17T18:55:18.207643 #82067] INFO -- : make[1]: Leaving directory '/tmp/ruby/build/trunk' I, [2024-05-17T18:55:18.208104 #82067] INFO -- : generating makefile exts.mk I, [2024-05-17T18:55:18.244756 #82067] INFO -- : exts.mk unchanged I, [2024-05-17T18:55:18.249151 #82067] INFO -- : make[1]: Entering directory '/tmp/ruby/build/trunk' I, [2024-05-17T18:55:18.545195 #82067] INFO -- : make[2]: Entering directory '/tmp/ruby/build/trunk/ext/coverage' I, [2024-05-17T18:55:18.549930 #82067] INFO -- : make[2]: Leaving directory '/tmp/ruby/build/trunk/ext/coverage' I, [2024-05-17T18:55:18.556350 #82067] INFO -- : make[2]: Entering directory '/tmp/ruby/build/trunk/ext/date' I, [2024-05-17T18:55:18.561470 #82067] INFO -- : make[2]: Leaving directory '/tmp/ruby/build/trunk/ext/date' I, [2024-05-17T18:55:18.565270 #82067] INFO -- : make[2]: Entering directory '/tmp/ruby/build/trunk/ext/digest' I, [2024-05-17T18:55:18.574111 #82067] INFO -- : make[2]: Leaving directory '/tmp/ruby/build/trunk/ext/digest' I, [2024-05-17T18:55:18.600440 #82067] INFO -- : make[2]: Entering directory '/tmp/ruby/build/trunk/ext/digest/sha2' I, [2024-05-17T18:55:18.605444 #82067] INFO -- : make[2]: Leaving directory '/tmp/ruby/build/trunk/ext/digest/sha2' I, [2024-05-17T18:55:18.626909 #82067] INFO -- : make[2]: Entering directory '/tmp/ruby/build/trunk/ext/fiddle' I, [2024-05-17T18:55:18.637199 #82067] INFO -- : make[2]: Leaving directory '/tmp/ruby/build/trunk/ext/fiddle' I, [2024-05-17T18:55:18.642280 #82067] INFO -- : make[2]: Entering directory '/tmp/ruby/build/trunk/ext/io/console' I, [2024-05-17T18:55:18.645941 #82067] INFO -- : make[2]: Leaving directory '/tmp/ruby/build/trunk/ext/io/console' I, [2024-05-17T18:55:18.659159 #82067] INFO -- : make[2]: Entering directory '/tmp/ruby/build/trunk/ext/json' I, [2024-05-17T18:55:18.669761 #82067] INFO -- : make[2]: Leaving directory '/tmp/ruby/build/trunk/ext/json' I, [2024-05-17T18:55:18.685298 #82067] INFO -- : make[2]: Entering directory '/tmp/ruby/build/trunk/ext/monitor' I, [2024-05-17T18:55:18.689328 #82067] INFO -- : make[2]: Leaving directory '/tmp/ruby/build/trunk/ext/monitor' I, [2024-05-17T18:55:18.696505 #82067] INFO -- : make[2]: Entering directory '/tmp/ruby/build/trunk/ext/objspace' I, [2024-05-17T18:55:18.702723 #82067] INFO -- : make[2]: Leaving directory '/tmp/ruby/build/trunk/ext/objspace' I, [2024-05-17T18:55:18.720490 #82067] INFO -- : make[2]: Entering directory '/tmp/ruby/build/trunk/ext/openssl' I, [2024-05-17T18:55:18.736707 #82067] INFO -- : make[2]: Leaving directory '/tmp/ruby/build/trunk/ext/openssl' I, [2024-05-17T18:55:18.740693 #82067] INFO -- : make[2]: Entering directory '/tmp/ruby/build/trunk/ext/pathname' I, [2024-05-17T18:55:18.744663 #82067] INFO -- : make[2]: Leaving directory '/tmp/ruby/build/trunk/ext/pathname' I, [2024-05-17T18:55:18.751526 #82067] INFO -- : make[2]: Entering directory '/tmp/ruby/build/trunk/ext/psych' I, [2024-05-17T18:55:18.769808 #82067] INFO -- : make[2]: Leaving directory '/tmp/ruby/build/trunk/ext/psych' I, [2024-05-17T18:55:18.772955 #82067] INFO -- : make[2]: Entering directory '/tmp/ruby/build/trunk/ext/pty' I, [2024-05-17T18:55:18.775545 #82067] INFO -- : make[2]: Leaving directory '/tmp/ruby/build/trunk/ext/pty' I, [2024-05-17T18:55:18.785128 #82067] INFO -- : make[2]: Entering directory '/tmp/ruby/build/trunk/ext/ripper' I, [2024-05-17T18:55:18.792052 #82067] INFO -- : make[2]: Leaving directory '/tmp/ruby/build/trunk/ext/ripper' I, [2024-05-17T18:55:18.794645 #82067] INFO -- : make[2]: Entering directory '/tmp/ruby/build/trunk/ext/rubyvm' I, [2024-05-17T18:55:18.797665 #82067] INFO -- : make[2]: Leaving directory '/tmp/ruby/build/trunk/ext/rubyvm' I, [2024-05-17T18:55:18.810548 #82067] INFO -- : make[2]: Entering directory '/tmp/ruby/build/trunk/ext/socket' I, [2024-05-17T18:55:18.817476 #82067] INFO -- : make[2]: Leaving directory '/tmp/ruby/build/trunk/ext/socket' I, [2024-05-17T18:55:18.831436 #82067] INFO -- : make[2]: Entering directory '/tmp/ruby/build/trunk/.bundle/gems/bigdecimal-3.1.8/ext/bigdecimal' I, [2024-05-17T18:55:18.856520 #82067] INFO -- : make[2]: Leaving directory '/tmp/ruby/build/trunk/.bundle/gems/bigdecimal-3.1.8/ext/bigdecimal' I, [2024-05-17T18:55:18.858560 #82067] INFO -- : make[2]: Entering directory '/tmp/ruby/build/trunk/.bundle/gems/debug-1.9.2/ext/debug' I, [2024-05-17T18:55:18.880936 #82067] INFO -- : make[2]: Leaving directory '/tmp/ruby/build/trunk/.bundle/gems/debug-1.9.2/ext/debug' I, [2024-05-17T18:55:18.882784 #82067] INFO -- : make[2]: Entering directory '/tmp/ruby/build/trunk/.bundle/gems/nkf-0.2.0/ext/nkf' I, [2024-05-17T18:55:18.904813 #82067] INFO -- : make[2]: Leaving directory '/tmp/ruby/build/trunk/.bundle/gems/nkf-0.2.0/ext/nkf' I, [2024-05-17T18:55:18.906835 #82067] INFO -- : make[2]: Entering directory '/tmp/ruby/build/trunk/.bundle/gems/racc-1.7.3/ext/racc/cparse' I, [2024-05-17T18:55:18.928146 #82067] INFO -- : make[2]: Leaving directory '/tmp/ruby/build/trunk/.bundle/gems/racc-1.7.3/ext/racc/cparse' I, [2024-05-17T18:55:18.930648 #82067] INFO -- : make[2]: Entering directory '/tmp/ruby/build/trunk/.bundle/gems/rbs-3.4.4/ext/rbs_extension' I, [2024-05-17T18:55:18.954525 #82067] INFO -- : make[2]: Leaving directory '/tmp/ruby/build/trunk/.bundle/gems/rbs-3.4.4/ext/rbs_extension' I, [2024-05-17T18:55:18.956528 #82067] INFO -- : make[2]: Entering directory '/tmp/ruby/build/trunk/.bundle/gems/syslog-0.1.2/ext/syslog' I, [2024-05-17T18:55:18.978651 #82067] INFO -- : make[2]: Leaving directory '/tmp/ruby/build/trunk/.bundle/gems/syslog-0.1.2/ext/syslog' I, [2024-05-17T18:55:19.002666 #82067] INFO -- : make[2]: Entering directory '/tmp/ruby/build/trunk' I, [2024-05-17T18:55:19.067842 #82067] INFO -- : make[2]: 'ruby' is up to date. I, [2024-05-17T18:55:19.067878 #82067] INFO -- : make[2]: Leaving directory '/tmp/ruby/build/trunk' I, [2024-05-17T18:55:19.068291 #82067] INFO -- : make[1]: Leaving directory '/tmp/ruby/build/trunk' I, [2024-05-17T18:55:19.072026 #82067] INFO -- : make[1]: Entering directory '/tmp/ruby/build/trunk' I, [2024-05-17T18:55:19.072049 #82067] INFO -- : make[1]: Nothing to be done for 'note'. I, [2024-05-17T18:55:19.072055 #82067] INFO -- : make[1]: Leaving directory '/tmp/ruby/build/trunk' E, [2024-05-17T18:55:19.131936 #82067] ERROR -- : $ /tmp/ruby/build/trunk/miniruby -I/tmp/ruby/src/trunk/lib /tmp/ruby/src/trunk/tool/runruby.rb --archdir=/tmp/ruby/build/trunk --extout=.ext -- /tmp/ruby/src/trunk/spec/mspec/bin/mspec-run -B /tmp/ruby/src/trunk/spec/default.mspec --error-output stderr --debug -fy -o /tmp/rubytest.bh2qon/1-mspec-multi-0 E, [2024-05-17T18:55:19.132152 #82067] ERROR -- : $ /tmp/ruby/build/trunk/miniruby -I/tmp/ruby/src/trunk/lib /tmp/ruby/src/trunk/tool/runruby.rb --archdir=/tmp/ruby/build/trunk --extout=.ext -- /tmp/ruby/src/trunk/spec/mspec/bin/mspec-run -B /tmp/ruby/src/trunk/spec/default.mspec --error-output stderr --debug -fy -o /tmp/rubytest.bh2qon/2-mspec-multi-1 E, [2024-05-17T18:55:19.132428 #82067] ERROR -- : $ /tmp/ruby/build/trunk/miniruby -I/tmp/ruby/src/trunk/lib /tmp/ruby/src/trunk/tool/runruby.rb --archdir=/tmp/ruby/build/trunk --extout=.ext -- /tmp/ruby/src/trunk/spec/mspec/bin/mspec-run -B /tmp/ruby/src/trunk/spec/default.mspec --error-output stderr --debug -fy -o /tmp/rubytest.bh2qon/3-mspec-multi-2 E, [2024-05-17T18:55:19.132705 #82067] ERROR -- : $ /tmp/ruby/build/trunk/miniruby -I/tmp/ruby/src/trunk/lib /tmp/ruby/src/trunk/tool/runruby.rb --archdir=/tmp/ruby/build/trunk --extout=.ext -- /tmp/ruby/src/trunk/spec/mspec/bin/mspec-run -B /tmp/ruby/src/trunk/spec/default.mspec --error-output stderr --debug -fy -o /tmp/rubytest.bh2qon/4-mspec-multi-3 E, [2024-05-17T18:55:19.132980 #82067] ERROR -- : $ /tmp/ruby/build/trunk/miniruby -I/tmp/ruby/src/trunk/lib /tmp/ruby/src/trunk/tool/runruby.rb --archdir=/tmp/ruby/build/trunk --extout=.ext -- /tmp/ruby/src/trunk/spec/mspec/bin/mspec-run -B /tmp/ruby/src/trunk/spec/default.mspec --error-output stderr --debug -fy -o /tmp/rubytest.bh2qon/5-mspec-multi-4 E, [2024-05-17T18:55:19.133103 #82067] ERROR -- : $ /tmp/ruby/build/trunk/miniruby -I/tmp/ruby/src/trunk/lib /tmp/ruby/src/trunk/tool/runruby.rb --archdir=/tmp/ruby/build/trunk --extout=.ext -- /tmp/ruby/src/trunk/spec/mspec/bin/mspec-run -B /tmp/ruby/src/trunk/spec/default.mspec --error-output stderr --debug -fy -o /tmp/rubytest.bh2qon/6-mspec-multi-5 E, [2024-05-17T18:55:19.133412 #82067] ERROR -- : $ /tmp/ruby/build/trunk/miniruby -I/tmp/ruby/src/trunk/lib /tmp/ruby/src/trunk/tool/runruby.rb --archdir=/tmp/ruby/build/trunk --extout=.ext -- /tmp/ruby/src/trunk/spec/mspec/bin/mspec-run -B /tmp/ruby/src/trunk/spec/default.mspec --error-output stderr --debug -fy -o /tmp/rubytest.bh2qon/7-mspec-multi-6 E, [2024-05-17T18:55:19.133612 #82067] ERROR -- : $ /tmp/ruby/build/trunk/miniruby -I/tmp/ruby/src/trunk/lib /tmp/ruby/src/trunk/tool/runruby.rb --archdir=/tmp/ruby/build/trunk --extout=.ext -- /tmp/ruby/src/trunk/spec/mspec/bin/mspec-run -B /tmp/ruby/src/trunk/spec/default.mspec --error-output stderr --debug -fy -o /tmp/rubytest.bh2qon/8-mspec-multi-7 E, [2024-05-17T18:55:19.133803 #82067] ERROR -- : $ /tmp/ruby/build/trunk/miniruby -I/tmp/ruby/src/trunk/lib /tmp/ruby/src/trunk/tool/runruby.rb --archdir=/tmp/ruby/build/trunk --extout=.ext -- /tmp/ruby/src/trunk/spec/mspec/bin/mspec-run -B /tmp/ruby/src/trunk/spec/default.mspec --error-output stderr --debug -fy -o /tmp/rubytest.bh2qon/9-mspec-multi-8 E, [2024-05-17T18:55:19.134002 #82067] ERROR -- : $ /tmp/ruby/build/trunk/miniruby -I/tmp/ruby/src/trunk/lib /tmp/ruby/src/trunk/tool/runruby.rb --archdir=/tmp/ruby/build/trunk --extout=.ext -- /tmp/ruby/src/trunk/spec/mspec/bin/mspec-run -B /tmp/ruby/src/trunk/spec/default.mspec --error-output stderr --debug -fy -o /tmp/rubytest.bh2qon/10-mspec-multi-9 E, [2024-05-17T18:55:19.134182 #82067] ERROR -- : $ /tmp/ruby/build/trunk/miniruby -I/tmp/ruby/src/trunk/lib /tmp/ruby/src/trunk/tool/runruby.rb --archdir=/tmp/ruby/build/trunk --extout=.ext -- /tmp/ruby/src/trunk/spec/mspec/bin/mspec-run -B /tmp/ruby/src/trunk/spec/default.mspec --error-output stderr --debug -fy -o /tmp/rubytest.bh2qon/11-mspec-multi-10 E, [2024-05-17T18:55:19.134457 #82067] ERROR -- : $ /tmp/ruby/build/trunk/miniruby -I/tmp/ruby/src/trunk/lib /tmp/ruby/src/trunk/tool/runruby.rb --archdir=/tmp/ruby/build/trunk --extout=.ext -- /tmp/ruby/src/trunk/spec/mspec/bin/mspec-run -B /tmp/ruby/src/trunk/spec/default.mspec --error-output stderr --debug -fy -o /tmp/rubytest.bh2qon/12-mspec-multi-11 E, [2024-05-17T18:55:19.134695 #82067] ERROR -- : $ /tmp/ruby/build/trunk/miniruby -I/tmp/ruby/src/trunk/lib /tmp/ruby/src/trunk/tool/runruby.rb --archdir=/tmp/ruby/build/trunk --extout=.ext -- /tmp/ruby/src/trunk/spec/mspec/bin/mspec-run -B /tmp/ruby/src/trunk/spec/default.mspec --error-output stderr --debug -fy -o /tmp/rubytest.bh2qon/13-mspec-multi-12 E, [2024-05-17T18:55:19.134877 #82067] ERROR -- : $ /tmp/ruby/build/trunk/miniruby -I/tmp/ruby/src/trunk/lib /tmp/ruby/src/trunk/tool/runruby.rb --archdir=/tmp/ruby/build/trunk --extout=.ext -- /tmp/ruby/src/trunk/spec/mspec/bin/mspec-run -B /tmp/ruby/src/trunk/spec/default.mspec --error-output stderr --debug -fy -o /tmp/rubytest.bh2qon/14-mspec-multi-13 E, [2024-05-17T18:55:19.135115 #82067] ERROR -- : $ /tmp/ruby/build/trunk/miniruby -I/tmp/ruby/src/trunk/lib /tmp/ruby/src/trunk/tool/runruby.rb --archdir=/tmp/ruby/build/trunk --extout=.ext -- /tmp/ruby/src/trunk/spec/mspec/bin/mspec-run -B /tmp/ruby/src/trunk/spec/default.mspec --error-output stderr --debug -fy -o /tmp/rubytest.bh2qon/15-mspec-multi-14 E, [2024-05-17T18:55:19.135355 #82067] ERROR -- : $ /tmp/ruby/build/trunk/miniruby -I/tmp/ruby/src/trunk/lib /tmp/ruby/src/trunk/tool/runruby.rb --archdir=/tmp/ruby/build/trunk --extout=.ext -- /tmp/ruby/src/trunk/spec/mspec/bin/mspec-run -B /tmp/ruby/src/trunk/spec/default.mspec --error-output stderr --debug -fy -o /tmp/rubytest.bh2qon/16-mspec-multi-15 E, [2024-05-17T18:55:19.135657 #82067] ERROR -- : $ /tmp/ruby/build/trunk/miniruby -I/tmp/ruby/src/trunk/lib /tmp/ruby/src/trunk/tool/runruby.rb --archdir=/tmp/ruby/build/trunk --extout=.ext -- /tmp/ruby/src/trunk/spec/mspec/bin/mspec-run -B /tmp/ruby/src/trunk/spec/default.mspec --error-output stderr --debug -fy -o /tmp/rubytest.bh2qon/17-mspec-multi-16 E, [2024-05-17T18:55:19.135891 #82067] ERROR -- : $ /tmp/ruby/build/trunk/miniruby -I/tmp/ruby/src/trunk/lib /tmp/ruby/src/trunk/tool/runruby.rb --archdir=/tmp/ruby/build/trunk --extout=.ext -- /tmp/ruby/src/trunk/spec/mspec/bin/mspec-run -B /tmp/ruby/src/trunk/spec/default.mspec --error-output stderr --debug -fy -o /tmp/rubytest.bh2qon/18-mspec-multi-17 E, [2024-05-17T18:55:19.138441 #82067] ERROR -- : $ /tmp/ruby/build/trunk/miniruby -I/tmp/ruby/src/trunk/lib /tmp/ruby/src/trunk/tool/runruby.rb --archdir=/tmp/ruby/build/trunk --extout=.ext -- /tmp/ruby/src/trunk/spec/mspec/bin/mspec-run -B /tmp/ruby/src/trunk/spec/default.mspec --error-output stderr --debug -fy -o /tmp/rubytest.bh2qon/19-mspec-multi-18 E, [2024-05-17T18:55:19.138840 #82067] ERROR -- : $ /tmp/ruby/build/trunk/miniruby -I/tmp/ruby/src/trunk/lib /tmp/ruby/src/trunk/tool/runruby.rb --archdir=/tmp/ruby/build/trunk --extout=.ext -- /tmp/ruby/src/trunk/spec/mspec/bin/mspec-run -B /tmp/ruby/src/trunk/spec/default.mspec --error-output stderr --debug -fy -o /tmp/rubytest.bh2qon/20-mspec-multi-19 I, [2024-05-17T18:55:19.307321 #82067] INFO -- : ruby 3.4.0dev (2024-05-17T15:29:00Z master e61d24d77e) [x86_64-linux] I, [2024-05-17T18:55:19.931659 #82067] INFO -- : 0 ......................................................................... I, [2024-05-17T18:55:20.306801 #82067] INFO -- : 73 ......................................................................... I, [2024-05-17T18:55:20.460250 #82067] INFO -- : 146 ......................................................................... I, [2024-05-17T18:55:20.502347 #82067] INFO -- : 219 ......................................................................... I, [2024-05-17T18:55:20.563345 #82067] INFO -- : 292 ......................................................................... I, [2024-05-17T18:55:20.601188 #82067] INFO -- : 365 ......................................................................... I, [2024-05-17T18:55:20.621625 #82067] INFO -- : 438 ......................................................................... I, [2024-05-17T18:55:20.639403 #82067] INFO -- : 511 ......................................................................... I, [2024-05-17T18:55:20.656928 #82067] INFO -- : 584 ......................................................................... I, [2024-05-17T18:55:20.720804 #82067] INFO -- : 657 ......................................................................... I, [2024-05-17T18:55:20.753285 #82067] INFO -- : 730 ......................................................................... I, [2024-05-17T18:55:20.774217 #82067] INFO -- : 803 ......................................................................... I, [2024-05-17T18:55:20.804181 #82067] INFO -- : 876 ......................................................................... I, [2024-05-17T18:55:20.850772 #82067] INFO -- : 949 ......................................................................... I, [2024-05-17T18:55:20.932461 #82067] INFO -- : 1022 ......................................................................... I, [2024-05-17T18:55:21.115627 #82067] INFO -- : 1095 ......................................................................... I, [2024-05-17T18:55:21.224728 #82067] INFO -- : 1168 ......................................................................... I, [2024-05-17T18:55:21.280382 #82067] INFO -- : 1241 ......................................................................... I, [2024-05-17T18:55:21.322428 #82067] INFO -- : 1314 ......................................................................... I, [2024-05-17T18:55:21.337387 #82067] INFO -- : 1387 ......................................................................... I, [2024-05-17T18:55:21.459385 #82067] INFO -- : 1460 ......................................................................... I, [2024-05-17T18:55:21.940164 #82067] INFO -- : 1533 ......................................................................... I, [2024-05-17T18:55:21.993803 #82067] INFO -- : 1606 ......................................................................... I, [2024-05-17T18:55:22.118162 #82067] INFO -- : 1679 ......................................................................... I, [2024-05-17T18:55:22.235543 #82067] INFO -- : 1752 ......................................................................... I, [2024-05-17T18:55:22.321865 #82067] INFO -- : 1825 ......................................................................... I, [2024-05-17T18:55:22.413027 #82067] INFO -- : 1898 ......................................................................... I, [2024-05-17T18:55:22.493955 #82067] INFO -- : 1971 ......................................................................... I, [2024-05-17T18:55:22.560119 #82067] INFO -- : 2044 ......................................................................... I, [2024-05-17T18:55:22.600829 #82067] INFO -- : 2117 ......................................................................... I, [2024-05-17T18:55:22.623280 #82067] INFO -- : 2190 ......................................................................... I, [2024-05-17T18:55:22.646304 #82067] INFO -- : 2263 ......................................................................... I, [2024-05-17T18:55:22.659865 #82067] INFO -- : 2336 ......................................................................... I, [2024-05-17T18:55:22.696479 #82067] INFO -- : 2409 ......................................................................... I, [2024-05-17T18:55:22.811215 #82067] INFO -- : 2482 ......................................................................... I, [2024-05-17T18:55:22.835872 #82067] INFO -- : 2555 ......................................................................... I, [2024-05-17T18:55:22.934289 #82067] INFO -- : 2628 ......................................................................... I, [2024-05-17T18:55:23.019190 #82067] INFO -- : 2701 ......................................................................... I, [2024-05-17T18:55:23.048240 #82067] INFO -- : 2774 ......................................................................... I, [2024-05-17T18:55:23.103639 #82067] INFO -- : 2847 ......................................................................... I, [2024-05-17T18:55:23.137576 #82067] INFO -- : 2920 ......................................................................... I, [2024-05-17T18:55:23.163569 #82067] INFO -- : 2993 ......................................................................... I, [2024-05-17T18:55:23.187438 #82067] INFO -- : 3066 ......................................................................... I, [2024-05-17T18:55:23.201467 #82067] INFO -- : 3139 ......................................................................... I, [2024-05-17T18:55:23.209407 #82067] INFO -- : 3212 ......................................................................... I, [2024-05-17T18:55:23.240373 #82067] INFO -- : 3285 ......................................................................... I, [2024-05-17T18:55:27.210377 #82067] INFO -- : 3358 ........................................................................ I, [2024-05-17T18:55:27.210421 #82067] INFO -- : I, [2024-05-17T18:55:27.210451 #82067] INFO -- : Finished in 8.077642 seconds I, [2024-05-17T18:55:27.210455 #82067] INFO -- : I, [2024-05-17T18:55:27.210459 #82067] INFO -- : 3429 files, 32611 examples, 206839 expectations, 0 failures, 0 errors, 0 tagged I, [2024-05-17T18:55:27.212530 #82067] INFO -- : $$$[end] "make yes-test-rubyspec MSPECOPT='--error-output stderr --debug -j' TESTS='-j20'" exit with 0.