# Logfile created on 2024-05-17 14:34:06 +0000 by logger.rb/v1.4.3 I, [2024-05-17T14:34:06.939913 #2896882] INFO -- : #, @formatter=nil, @logdev=#, @binmode=false, @mon_data=#, @mon_data_owner_object_id=860>>> I, [2024-05-17T14:34:06.940036 #2896882] INFO -- : $$$[beg] make update-unicode -j20 I, [2024-05-17T14:34:06.999353 #2896882] INFO -- : Downloading Unicode emoji 15.0 files... I, [2024-05-17T14:34:06.999533 #2896882] INFO -- : Downloading Unicode emoji 15.0 files... I, [2024-05-17T14:34:06.999789 #2896882] INFO -- : Downloading Unicode emoji 15.0 files... I, [2024-05-17T14:34:07.041869 #2896882] INFO -- : made symlink emoji/15.0/emoji-sequences.txt to /tmp/ruby/src/trunk/.downloaded-cache/emoji/15.0/emoji-sequences.txt E, [2024-05-17T14:34:07.496821 #2896882] ERROR -- : /tmp/ruby/src/trunk/tool/downloader.rb:302:in `rescue in download': failed to download emoji/15.0/emoji-test.txt (RuntimeError) E, [2024-05-17T14:34:07.497004 #2896882] ERROR -- : OpenURI::HTTPError: 403 Forbidden: https://www.unicode.org/Public/emoji/15.0/emoji-test.txt E, [2024-05-17T14:34:07.497040 #2896882] ERROR -- : from /tmp/ruby/src/trunk/tool/downloader.rb:201:in `download' E, [2024-05-17T14:34:07.497056 #2896882] ERROR -- : from /tmp/ruby/src/trunk/tool/downloader.rb:136:in `download' E, [2024-05-17T14:34:07.497070 #2896882] ERROR -- : from /tmp/ruby/src/trunk/tool/downloader.rb:482:in `block in
' E, [2024-05-17T14:34:07.497085 #2896882] ERROR -- : from /tmp/ruby/src/trunk/tool/downloader.rb:465:in `each' E, [2024-05-17T14:34:07.497099 #2896882] ERROR -- : from /tmp/ruby/src/trunk/tool/downloader.rb:465:in `
' E, [2024-05-17T14:34:07.497112 #2896882] ERROR -- : /usr/lib/ruby/3.0.0/open-uri.rb:364:in `open_http': 403 Forbidden (OpenURI::HTTPError) E, [2024-05-17T14:34:07.497125 #2896882] ERROR -- : from /usr/lib/ruby/3.0.0/open-uri.rb:741:in `buffer_open' E, [2024-05-17T14:34:07.497142 #2896882] ERROR -- : from /usr/lib/ruby/3.0.0/open-uri.rb:212:in `block in open_loop' E, [2024-05-17T14:34:07.497155 #2896882] ERROR -- : from /usr/lib/ruby/3.0.0/open-uri.rb:210:in `catch' E, [2024-05-17T14:34:07.497169 #2896882] ERROR -- : from /usr/lib/ruby/3.0.0/open-uri.rb:210:in `open_loop' E, [2024-05-17T14:34:07.497181 #2896882] ERROR -- : from /usr/lib/ruby/3.0.0/open-uri.rb:151:in `open_uri' E, [2024-05-17T14:34:07.497194 #2896882] ERROR -- : from /usr/lib/ruby/3.0.0/open-uri.rb:721:in `open' E, [2024-05-17T14:34:07.497207 #2896882] ERROR -- : from /usr/lib/ruby/3.0.0/open-uri.rb:729:in `read' E, [2024-05-17T14:34:07.497220 #2896882] ERROR -- : from /tmp/ruby/src/trunk/tool/downloader.rb:247:in `block in download' E, [2024-05-17T14:34:07.497233 #2896882] ERROR -- : from /tmp/ruby/src/trunk/tool/downloader.rb:378:in `with_retry' E, [2024-05-17T14:34:07.497250 #2896882] ERROR -- : from /tmp/ruby/src/trunk/tool/downloader.rb:246:in `download' E, [2024-05-17T14:34:07.497285 #2896882] ERROR -- : from /tmp/ruby/src/trunk/tool/downloader.rb:136:in `download' E, [2024-05-17T14:34:07.497298 #2896882] ERROR -- : from /tmp/ruby/src/trunk/tool/downloader.rb:482:in `block in
' E, [2024-05-17T14:34:07.497311 #2896882] ERROR -- : from /tmp/ruby/src/trunk/tool/downloader.rb:465:in `each' E, [2024-05-17T14:34:07.497324 #2896882] ERROR -- : from /tmp/ruby/src/trunk/tool/downloader.rb:465:in `
' E, [2024-05-17T14:34:07.501590 #2896882] ERROR -- : make: *** [uncommon.mk:1765: /tmp/ruby/src/trunk/enc/unicode/data/emoji/15.0/emoji-test.txt] Error 1 E, [2024-05-17T14:34:07.501650 #2896882] ERROR -- : make: *** Waiting for unfinished jobs.... E, [2024-05-17T14:34:07.930554 #2896882] ERROR -- : /tmp/ruby/src/trunk/tool/downloader.rb:302:in `rescue in download': failed to download emoji/15.0/emoji-sequences.txt (RuntimeError) E, [2024-05-17T14:34:07.930737 #2896882] ERROR -- : EOFError: end of file reached: https://www.unicode.org/Public/emoji/15.0/emoji-sequences.txt E, [2024-05-17T14:34:07.930762 #2896882] ERROR -- : from /tmp/ruby/src/trunk/tool/downloader.rb:201:in `download' E, [2024-05-17T14:34:07.930776 #2896882] ERROR -- : from /tmp/ruby/src/trunk/tool/downloader.rb:136:in `download' E, [2024-05-17T14:34:07.930790 #2896882] ERROR -- : from /tmp/ruby/src/trunk/tool/downloader.rb:482:in `block in
' E, [2024-05-17T14:34:07.930804 #2896882] ERROR -- : from /tmp/ruby/src/trunk/tool/downloader.rb:465:in `each' E, [2024-05-17T14:34:07.930817 #2896882] ERROR -- : from /tmp/ruby/src/trunk/tool/downloader.rb:465:in `
' E, [2024-05-17T14:34:07.930831 #2896882] ERROR -- : /usr/lib/ruby/3.0.0/net/protocol.rb:227:in `rbuf_fill': end of file reached (EOFError) E, [2024-05-17T14:34:07.930845 #2896882] ERROR -- : from /usr/lib/ruby/3.0.0/net/protocol.rb:193:in `readuntil' E, [2024-05-17T14:34:07.930865 #2896882] ERROR -- : from /usr/lib/ruby/3.0.0/net/protocol.rb:203:in `readline' E, [2024-05-17T14:34:07.930878 #2896882] ERROR -- : from /usr/lib/ruby/3.0.0/net/http/response.rb:42:in `read_status_line' E, [2024-05-17T14:34:07.930893 #2896882] ERROR -- : from /usr/lib/ruby/3.0.0/net/http/response.rb:31:in `read_new' E, [2024-05-17T14:34:07.930907 #2896882] ERROR -- : from /usr/lib/ruby/3.0.0/net/http.rb:1557:in `block in transport_request' E, [2024-05-17T14:34:07.930920 #2896882] ERROR -- : from /usr/lib/ruby/3.0.0/net/http.rb:1548:in `catch' E, [2024-05-17T14:34:07.930933 #2896882] ERROR -- : from /usr/lib/ruby/3.0.0/net/http.rb:1548:in `transport_request' E, [2024-05-17T14:34:07.930946 #2896882] ERROR -- : from /usr/lib/ruby/3.0.0/net/http.rb:1521:in `request' E, [2024-05-17T14:34:07.930959 #2896882] ERROR -- : from /usr/lib/ruby/3.0.0/open-uri.rb:329:in `block in open_http' E, [2024-05-17T14:34:07.930975 #2896882] ERROR -- : from /usr/lib/ruby/3.0.0/net/http.rb:960:in `start' E, [2024-05-17T14:34:07.930988 #2896882] ERROR -- : from /usr/lib/ruby/3.0.0/open-uri.rb:323:in `open_http' E, [2024-05-17T14:34:07.931000 #2896882] ERROR -- : from /usr/lib/ruby/3.0.0/open-uri.rb:741:in `buffer_open' E, [2024-05-17T14:34:07.931013 #2896882] ERROR -- : from /usr/lib/ruby/3.0.0/open-uri.rb:212:in `block in open_loop' E, [2024-05-17T14:34:07.931025 #2896882] ERROR -- : from /usr/lib/ruby/3.0.0/open-uri.rb:210:in `catch' E, [2024-05-17T14:34:07.931038 #2896882] ERROR -- : from /usr/lib/ruby/3.0.0/open-uri.rb:210:in `open_loop' E, [2024-05-17T14:34:07.931051 #2896882] ERROR -- : from /usr/lib/ruby/3.0.0/open-uri.rb:151:in `open_uri' E, [2024-05-17T14:34:07.931064 #2896882] ERROR -- : from /usr/lib/ruby/3.0.0/open-uri.rb:721:in `open' E, [2024-05-17T14:34:07.931087 #2896882] ERROR -- : from /usr/lib/ruby/3.0.0/open-uri.rb:729:in `read' E, [2024-05-17T14:34:07.931109 #2896882] ERROR -- : from /tmp/ruby/src/trunk/tool/downloader.rb:247:in `block in download' E, [2024-05-17T14:34:07.931125 #2896882] ERROR -- : from /tmp/ruby/src/trunk/tool/downloader.rb:378:in `with_retry' E, [2024-05-17T14:34:07.931138 #2896882] ERROR -- : from /tmp/ruby/src/trunk/tool/downloader.rb:246:in `download' E, [2024-05-17T14:34:07.931171 #2896882] ERROR -- : from /tmp/ruby/src/trunk/tool/downloader.rb:136:in `download' E, [2024-05-17T14:34:07.931185 #2896882] ERROR -- : from /tmp/ruby/src/trunk/tool/downloader.rb:482:in `block in
' E, [2024-05-17T14:34:07.931198 #2896882] ERROR -- : from /tmp/ruby/src/trunk/tool/downloader.rb:465:in `each' E, [2024-05-17T14:34:07.931211 #2896882] ERROR -- : from /tmp/ruby/src/trunk/tool/downloader.rb:465:in `
' E, [2024-05-17T14:34:07.935726 #2896882] ERROR -- : make: *** [uncommon.mk:1765: /tmp/ruby/src/trunk/enc/unicode/data/emoji/15.0/emoji-sequences.txt] Error 1 E, [2024-05-17T14:34:07.935785 #2896882] ERROR -- : make: *** Deleting file '/tmp/ruby/src/trunk/enc/unicode/data/emoji/15.0/emoji-sequences.txt' E, [2024-05-17T14:34:07.998929 #2896882] ERROR -- : /tmp/ruby/src/trunk/tool/downloader.rb:302:in `rescue in download': failed to download emoji/15.0/emoji-sequences.txt (RuntimeError) E, [2024-05-17T14:34:07.999069 #2896882] ERROR -- : EOFError: end of file reached: https://www.unicode.org/Public/emoji/15.0/emoji-sequences.txt E, [2024-05-17T14:34:07.999092 #2896882] ERROR -- : from /tmp/ruby/src/trunk/tool/downloader.rb:201:in `download' E, [2024-05-17T14:34:07.999376 #2896882] ERROR -- : from /tmp/ruby/src/trunk/tool/downloader.rb:136:in `download' E, [2024-05-17T14:34:07.999390 #2896882] ERROR -- : from /tmp/ruby/src/trunk/tool/downloader.rb:482:in `block in
' E, [2024-05-17T14:34:07.999404 #2896882] ERROR -- : from /tmp/ruby/src/trunk/tool/downloader.rb:465:in `each' E, [2024-05-17T14:34:07.999416 #2896882] ERROR -- : from /tmp/ruby/src/trunk/tool/downloader.rb:465:in `
' E, [2024-05-17T14:34:07.999429 #2896882] ERROR -- : /usr/lib/ruby/3.0.0/net/protocol.rb:227:in `rbuf_fill': end of file reached (EOFError) E, [2024-05-17T14:34:07.999443 #2896882] ERROR -- : from /usr/lib/ruby/3.0.0/net/protocol.rb:193:in `readuntil' E, [2024-05-17T14:34:07.999455 #2896882] ERROR -- : from /usr/lib/ruby/3.0.0/net/protocol.rb:203:in `readline' E, [2024-05-17T14:34:07.999491 #2896882] ERROR -- : from /usr/lib/ruby/3.0.0/net/http/response.rb:42:in `read_status_line' E, [2024-05-17T14:34:07.999504 #2896882] ERROR -- : from /usr/lib/ruby/3.0.0/net/http/response.rb:31:in `read_new' E, [2024-05-17T14:34:07.999517 #2896882] ERROR -- : from /usr/lib/ruby/3.0.0/net/http.rb:1557:in `block in transport_request' E, [2024-05-17T14:34:07.999530 #2896882] ERROR -- : from /usr/lib/ruby/3.0.0/net/http.rb:1548:in `catch' E, [2024-05-17T14:34:07.999554 #2896882] ERROR -- : from /usr/lib/ruby/3.0.0/net/http.rb:1548:in `transport_request' E, [2024-05-17T14:34:07.999567 #2896882] ERROR -- : from /usr/lib/ruby/3.0.0/net/http.rb:1521:in `request' E, [2024-05-17T14:34:07.999580 #2896882] ERROR -- : from /usr/lib/ruby/3.0.0/open-uri.rb:329:in `block in open_http' E, [2024-05-17T14:34:07.999593 #2896882] ERROR -- : from /usr/lib/ruby/3.0.0/net/http.rb:960:in `start' E, [2024-05-17T14:34:07.999609 #2896882] ERROR -- : from /usr/lib/ruby/3.0.0/open-uri.rb:323:in `open_http' E, [2024-05-17T14:34:07.999622 #2896882] ERROR -- : from /usr/lib/ruby/3.0.0/open-uri.rb:741:in `buffer_open' E, [2024-05-17T14:34:07.999635 #2896882] ERROR -- : from /usr/lib/ruby/3.0.0/open-uri.rb:212:in `block in open_loop' E, [2024-05-17T14:34:07.999648 #2896882] ERROR -- : from /usr/lib/ruby/3.0.0/open-uri.rb:210:in `catch' E, [2024-05-17T14:34:07.999661 #2896882] ERROR -- : from /usr/lib/ruby/3.0.0/open-uri.rb:210:in `open_loop' E, [2024-05-17T14:34:07.999674 #2896882] ERROR -- : from /usr/lib/ruby/3.0.0/open-uri.rb:151:in `open_uri' E, [2024-05-17T14:34:07.999686 #2896882] ERROR -- : from /usr/lib/ruby/3.0.0/open-uri.rb:721:in `open' E, [2024-05-17T14:34:07.999746 #2896882] ERROR -- : from /usr/lib/ruby/3.0.0/open-uri.rb:729:in `read' E, [2024-05-17T14:34:07.999758 #2896882] ERROR -- : from /tmp/ruby/src/trunk/tool/downloader.rb:247:in `block in download' E, [2024-05-17T14:34:07.999781 #2896882] ERROR -- : from /tmp/ruby/src/trunk/tool/downloader.rb:378:in `with_retry' E, [2024-05-17T14:34:07.999811 #2896882] ERROR -- : from /tmp/ruby/src/trunk/tool/downloader.rb:246:in `download' E, [2024-05-17T14:34:07.999823 #2896882] ERROR -- : from /tmp/ruby/src/trunk/tool/downloader.rb:136:in `download' E, [2024-05-17T14:34:07.999834 #2896882] ERROR -- : from /tmp/ruby/src/trunk/tool/downloader.rb:482:in `block in
' E, [2024-05-17T14:34:07.999846 #2896882] ERROR -- : from /tmp/ruby/src/trunk/tool/downloader.rb:465:in `each' E, [2024-05-17T14:34:07.999858 #2896882] ERROR -- : from /tmp/ruby/src/trunk/tool/downloader.rb:465:in `
' I, [2024-05-17T14:34:08.004244 #2896882] INFO -- : downloading emoji/15.0/emoji-sequences.txt ... downloading emoji/15.0/emoji-sequences.txt ... downloading emoji/15.0/emoji-test.txt ... E, [2024-05-17T14:34:08.004395 #2896882] ERROR -- : make: *** [uncommon.mk:1765: /tmp/ruby/src/trunk/enc/unicode/data/emoji/15.0/emoji-zwj-sequences.txt] Error 1 I, [2024-05-17T14:34:08.004842 #2896882] INFO -- : $$$[end] "make update-unicode -j20" exit with 512. I, [2024-05-17T14:34:08.004908 #2896882] INFO -- : $$$[beg] make update-download -j20 I, [2024-05-17T14:34:08.108552 #2896882] INFO -- : tool/config.guess already exists I, [2024-05-17T14:34:08.108593 #2896882] INFO -- : tool/config.sub already exists I, [2024-05-17T14:34:08.110836 #2896882] INFO -- : Update power_assert to 84e85124c5014a139af39161d484156cfe87a9ed I, [2024-05-17T14:34:08.111068 #2896882] INFO -- : Update rbs to ba7872795d5de04adb8ff500c0e6afdc81a041dd I, [2024-05-17T14:34:08.111694 #2896882] INFO -- : Update typeprof to b19a6416da3a05d57fadd6ffdadb382b6d236ca5 I, [2024-05-17T14:34:08.112300 #2896882] INFO -- : echo 84e85124c5014a139af39161d484156cfe87a9ed | /bin/sh /tmp/ruby/src/trunk/tool/ifchange /tmp/ruby/src/trunk/.bundle/.timestamp/power_assert.revision - I, [2024-05-17T14:34:08.112509 #2896882] INFO -- : echo ba7872795d5de04adb8ff500c0e6afdc81a041dd | /bin/sh /tmp/ruby/src/trunk/tool/ifchange /tmp/ruby/src/trunk/.bundle/.timestamp/rbs.revision - I, [2024-05-17T14:34:08.113150 #2896882] INFO -- : echo b19a6416da3a05d57fadd6ffdadb382b6d236ca5 | /bin/sh /tmp/ruby/src/trunk/tool/ifchange /tmp/ruby/src/trunk/.bundle/.timestamp/typeprof.revision - I, [2024-05-17T14:34:08.114523 #2896882] INFO -- : /tmp/ruby/src/trunk/.bundle/.timestamp/power_assert.revision unchanged I, [2024-05-17T14:34:08.114878 #2896882] INFO -- : /tmp/ruby/src/trunk/.bundle/.timestamp/typeprof.revision unchanged I, [2024-05-17T14:34:08.114894 #2896882] INFO -- : /tmp/ruby/src/trunk/.bundle/.timestamp/rbs.revision unchanged I, [2024-05-17T14:34:08.115796 #2896882] INFO -- : Building power_assert@84e85124c5014a139af39161d484156cfe87a9ed to /tmp/ruby/src/trunk/gems/power_assert-2.0.3.gem I, [2024-05-17T14:34:08.184267 #2896882] INFO -- : Successfully built RubyGem I, [2024-05-17T14:34:08.184334 #2896882] INFO -- : Name: power_assert I, [2024-05-17T14:34:08.184352 #2896882] INFO -- : Version: 2.0.4dev I, [2024-05-17T14:34:08.184367 #2896882] INFO -- : File: power_assert-2.0.4dev.gem I, [2024-05-17T14:34:08.231099 #2896882] INFO -- : $$$[end] "make update-download -j20" exit with 0. I, [2024-05-17T14:34:08.231139 #2896882] INFO -- : $$$[beg] make update-rubyspec -j20 I, [2024-05-17T14:34:08.288484 #2896882] INFO -- : make: Nothing to be done for 'update-rubyspec'. I, [2024-05-17T14:34:08.288761 #2896882] INFO -- : $$$[end] "make update-rubyspec -j20" exit with 0. I, [2024-05-17T14:34:08.288787 #2896882] INFO -- : $$$[beg] make update-src -j20 E, [2024-05-17T14:34:09.145987 #2896882] ERROR -- : From https://github.com/ruby/ruby E, [2024-05-17T14:34:09.146052 #2896882] ERROR -- : 2d825ca..4ba0579 master -> origin/master I, [2024-05-17T14:34:09.173300 #2896882] INFO -- : Updating 2d825ca..4ba0579 I, [2024-05-17T14:34:09.173383 #2896882] INFO -- : Fast-forward I, [2024-05-17T14:34:09.178012 #2896882] INFO -- : prism_compile.c | 3 ++- I, [2024-05-17T14:34:09.178082 #2896882] INFO -- : test/.excludes-prism/TestSyntax.rb | 1 - I, [2024-05-17T14:34:09.178116 #2896882] INFO -- : 2 files changed, 2 insertions(+), 2 deletions(-) I, [2024-05-17T14:34:09.187967 #2896882] INFO -- : Latest commit hash = 4ba0579da6 I, [2024-05-17T14:34:09.189117 #2896882] INFO -- : $$$[end] "make update-src -j20" exit with 0. I, [2024-05-17T14:34:09.189158 #2896882] INFO -- : $$$[beg] make after-update -j20 I, [2024-05-17T14:34:09.263819 #2896882] INFO -- : generating /tmp/ruby/src/trunk/ext/ripper/eventids2table.c I, [2024-05-17T14:34:09.267965 #2896882] INFO -- : make[1]: Entering directory '/tmp/ruby/src/trunk/ext/ripper' I, [2024-05-17T14:34:09.267986 #2896882] INFO -- : make[1]: Nothing to be done for 'src'. I, [2024-05-17T14:34:09.267992 #2896882] INFO -- : make[1]: Leaving directory '/tmp/ruby/src/trunk/ext/ripper' I, [2024-05-17T14:34:09.284712 #2896882] INFO -- : /tmp/ruby/src/trunk/revision.h updated I, [2024-05-17T14:34:09.286006 #2896882] INFO -- : generating x86_64-linux-fake.rb I, [2024-05-17T14:34:09.340283 #2896882] INFO -- : x86_64-linux-fake.rb updated I, [2024-05-17T14:34:09.341701 #2896882] INFO -- : generating enc.mk I, [2024-05-17T14:34:09.461058 #2896882] INFO -- : making srcs under enc I, [2024-05-17T14:34:09.490992 #2896882] INFO -- : make[1]: Entering directory '/tmp/ruby/build/trunk' I, [2024-05-17T14:34:09.491015 #2896882] INFO -- : make[1]: Nothing to be done for 'srcs'. I, [2024-05-17T14:34:09.491021 #2896882] INFO -- : make[1]: Leaving directory '/tmp/ruby/build/trunk' I, [2024-05-17T14:34:09.535395 #2896882] INFO -- : Update power_assert to 84e85124c5014a139af39161d484156cfe87a9ed I, [2024-05-17T14:34:09.535572 #2896882] INFO -- : Update rbs to ba7872795d5de04adb8ff500c0e6afdc81a041dd I, [2024-05-17T14:34:09.535750 #2896882] INFO -- : Update typeprof to b19a6416da3a05d57fadd6ffdadb382b6d236ca5 I, [2024-05-17T14:34:09.537478 #2896882] INFO -- : echo 84e85124c5014a139af39161d484156cfe87a9ed | /bin/sh /tmp/ruby/src/trunk/tool/ifchange /tmp/ruby/src/trunk/.bundle/.timestamp/power_assert.revision - I, [2024-05-17T14:34:09.537686 #2896882] INFO -- : echo ba7872795d5de04adb8ff500c0e6afdc81a041dd | /bin/sh /tmp/ruby/src/trunk/tool/ifchange /tmp/ruby/src/trunk/.bundle/.timestamp/rbs.revision - I, [2024-05-17T14:34:09.537886 #2896882] INFO -- : echo b19a6416da3a05d57fadd6ffdadb382b6d236ca5 | /bin/sh /tmp/ruby/src/trunk/tool/ifchange /tmp/ruby/src/trunk/.bundle/.timestamp/typeprof.revision - I, [2024-05-17T14:34:09.539304 #2896882] INFO -- : /tmp/ruby/src/trunk/.bundle/.timestamp/power_assert.revision unchanged I, [2024-05-17T14:34:09.539616 #2896882] INFO -- : /tmp/ruby/src/trunk/.bundle/.timestamp/typeprof.revision unchanged I, [2024-05-17T14:34:09.539810 #2896882] INFO -- : /tmp/ruby/src/trunk/.bundle/.timestamp/rbs.revision unchanged I, [2024-05-17T14:34:09.540388 #2896882] INFO -- : Building power_assert@84e85124c5014a139af39161d484156cfe87a9ed to /tmp/ruby/src/trunk/gems/power_assert-2.0.3.gem I, [2024-05-17T14:34:09.609918 #2896882] INFO -- : Successfully built RubyGem I, [2024-05-17T14:34:09.609956 #2896882] INFO -- : Name: power_assert I, [2024-05-17T14:34:09.609962 #2896882] INFO -- : Version: 2.0.4dev I, [2024-05-17T14:34:09.609965 #2896882] INFO -- : File: power_assert-2.0.4dev.gem I, [2024-05-17T14:34:09.612281 #2896882] INFO -- : Extracting bundle gem power_assert-2.0.3... I, [2024-05-17T14:34:09.674586 #2896882] INFO -- : Try with hash version of bundled gems instead of gems/power_assert-2.0.3.gem. We don't use this gem with release version of Ruby. I, [2024-05-17T14:34:09.679522 #2896882] INFO -- : Unpacked gems/power_assert-2.0.4dev.gem I, [2024-05-17T14:34:09.681552 #2896882] INFO -- : $$$[end] "make after-update -j20" exit with 0. I, [2024-05-17T14:34:09.681789 #2896882] INFO -- : $$$[beg] make miniruby -j20 I, [2024-05-17T14:34:09.743944 #2896882] INFO -- : BASERUBY = /usr/bin/ruby --disable=gems I, [2024-05-17T14:34:09.743989 #2896882] INFO -- : CC = gcc I, [2024-05-17T14:34:09.743998 #2896882] INFO -- : LD = ld I, [2024-05-17T14:34:09.744005 #2896882] INFO -- : LDSHARED = gcc -shared I, [2024-05-17T14:34:09.744020 #2896882] INFO -- : CFLAGS = -O3 -fno-fast-math -ggdb3 -Wall -Wextra -Wdeprecated-declarations -Wdiv-by-zero -Wduplicated-cond -Wimplicit-function-declaration -Wimplicit-int -Wpointer-arith -Wwrite-strings -Wold-style-definition -Wimplicit-fallthrough=0 -Wmissing-noreturn -Wno-cast-function-type -Wno-constant-logical-operand -Wno-long-long -Wno-missing-field-initializers -Wno-overlength-strings -Wno-packed-bitfield-compat -Wno-parentheses-equality -Wno-self-assign -Wno-tautological-compare -Wno-unused-parameter -Wno-unused-value -Wsuggest-attribute=format -Wsuggest-attribute=noreturn -Wunused-variable -Wmisleading-indentation -Wundef -fPIC I, [2024-05-17T14:34:09.744027 #2896882] INFO -- : XCFLAGS = -U_FORTIFY_SOURCE -D_FORTIFY_SOURCE=2 -fstack-protector-strong -fno-strict-overflow -fvisibility=hidden -fexcess-precision=standard -DRUBY_EXPORT -I. -I.ext/include/x86_64-linux -I/tmp/ruby/src/trunk/include -I/tmp/ruby/src/trunk -I/tmp/ruby/src/trunk/prism -I/tmp/ruby/src/trunk/enc/unicode/15.0.0 I, [2024-05-17T14:34:09.744034 #2896882] INFO -- : CPPFLAGS = I, [2024-05-17T14:34:09.744041 #2896882] INFO -- : DLDFLAGS = -Wl,--compress-debug-sections=zlib -Wl,-soname,libruby.so.3.4 -fstack-protector-strong I, [2024-05-17T14:34:09.744049 #2896882] INFO -- : SOLIBS = -lz -lrt -lrt -lgmp -ldl -lcrypt -lm -lpthread I, [2024-05-17T14:34:09.744055 #2896882] INFO -- : LANG = en_US.UTF-8 I, [2024-05-17T14:34:09.744061 #2896882] INFO -- : LC_ALL = I, [2024-05-17T14:34:09.744067 #2896882] INFO -- : LC_CTYPE = I, [2024-05-17T14:34:09.744073 #2896882] INFO -- : MFLAGS = -j20 --jobserver-auth=4,5 I, [2024-05-17T14:34:09.744079 #2896882] INFO -- : RUSTC = no I, [2024-05-17T14:34:09.744085 #2896882] INFO -- : YJIT_RUSTC_ARGS = --crate-name=yjit --crate-type=staticlib --edition=2021 -g -C lto=thin -C opt-level=3 -C overflow-checks=on '--out-dir=/tmp/ruby/build/trunk/yjit/target/release/' /tmp/ruby/src/trunk/yjit/src/lib.rs I, [2024-05-17T14:34:09.746535 #2896882] INFO -- : gcc (Ubuntu 11.4.0-1ubuntu1~22.04) 11.4.0 I, [2024-05-17T14:34:09.746578 #2896882] INFO -- : Copyright (C) 2021 Free Software Foundation, Inc. I, [2024-05-17T14:34:09.746588 #2896882] INFO -- : This is free software; see the source for copying conditions. There is NO I, [2024-05-17T14:34:09.746596 #2896882] INFO -- : warranty; not even for MERCHANTABILITY or FITNESS FOR A PARTICULAR PURPOSE. I, [2024-05-17T14:34:09.746603 #2896882] INFO -- : I, [2024-05-17T14:34:09.767830 #2896882] INFO -- : compiling /tmp/ruby/src/trunk/compile.c I, [2024-05-17T14:34:09.777346 #2896882] INFO -- : compiling /tmp/ruby/src/trunk/version.c I, [2024-05-17T14:34:17.770845 #2896882] INFO -- : linking miniruby I, [2024-05-17T14:34:18.299342 #2896882] INFO -- : $$$[end] "make miniruby -j20" exit with 0. I, [2024-05-17T14:34:18.299465 #2896882] INFO -- : $$$[beg] make ruby -j20 I, [2024-05-17T14:34:18.357553 #2896882] INFO -- : BASERUBY = /usr/bin/ruby --disable=gems I, [2024-05-17T14:34:18.357583 #2896882] INFO -- : CC = gcc I, [2024-05-17T14:34:18.357589 #2896882] INFO -- : LD = ld I, [2024-05-17T14:34:18.357593 #2896882] INFO -- : LDSHARED = gcc -shared I, [2024-05-17T14:34:18.357598 #2896882] INFO -- : CFLAGS = -O3 -fno-fast-math -ggdb3 -Wall -Wextra -Wdeprecated-declarations -Wdiv-by-zero -Wduplicated-cond -Wimplicit-function-declaration -Wimplicit-int -Wpointer-arith -Wwrite-strings -Wold-style-definition -Wimplicit-fallthrough=0 -Wmissing-noreturn -Wno-cast-function-type -Wno-constant-logical-operand -Wno-long-long -Wno-missing-field-initializers -Wno-overlength-strings -Wno-packed-bitfield-compat -Wno-parentheses-equality -Wno-self-assign -Wno-tautological-compare -Wno-unused-parameter -Wno-unused-value -Wsuggest-attribute=format -Wsuggest-attribute=noreturn -Wunused-variable -Wmisleading-indentation -Wundef -fPIC I, [2024-05-17T14:34:18.357602 #2896882] INFO -- : XCFLAGS = -U_FORTIFY_SOURCE -D_FORTIFY_SOURCE=2 -fstack-protector-strong -fno-strict-overflow -fvisibility=hidden -fexcess-precision=standard -DRUBY_EXPORT -I. -I.ext/include/x86_64-linux -I/tmp/ruby/src/trunk/include -I/tmp/ruby/src/trunk -I/tmp/ruby/src/trunk/prism -I/tmp/ruby/src/trunk/enc/unicode/15.0.0 I, [2024-05-17T14:34:18.357612 #2896882] INFO -- : CPPFLAGS = I, [2024-05-17T14:34:18.357616 #2896882] INFO -- : DLDFLAGS = -Wl,--compress-debug-sections=zlib -Wl,-soname,libruby.so.3.4 -fstack-protector-strong I, [2024-05-17T14:34:18.357620 #2896882] INFO -- : SOLIBS = -lz -lrt -lrt -lgmp -ldl -lcrypt -lm -lpthread I, [2024-05-17T14:34:18.357623 #2896882] INFO -- : LANG = en_US.UTF-8 I, [2024-05-17T14:34:18.357627 #2896882] INFO -- : LC_ALL = I, [2024-05-17T14:34:18.357630 #2896882] INFO -- : LC_CTYPE = I, [2024-05-17T14:34:18.357634 #2896882] INFO -- : MFLAGS = -j20 --jobserver-auth=4,5 I, [2024-05-17T14:34:18.357637 #2896882] INFO -- : RUSTC = no I, [2024-05-17T14:34:18.357642 #2896882] INFO -- : YJIT_RUSTC_ARGS = --crate-name=yjit --crate-type=staticlib --edition=2021 -g -C lto=thin -C opt-level=3 -C overflow-checks=on '--out-dir=/tmp/ruby/build/trunk/yjit/target/release/' /tmp/ruby/src/trunk/yjit/src/lib.rs I, [2024-05-17T14:34:18.358997 #2896882] INFO -- : gcc (Ubuntu 11.4.0-1ubuntu1~22.04) 11.4.0 I, [2024-05-17T14:34:18.359018 #2896882] INFO -- : Copyright (C) 2021 Free Software Foundation, Inc. I, [2024-05-17T14:34:18.359024 #2896882] INFO -- : This is free software; see the source for copying conditions. There is NO I, [2024-05-17T14:34:18.359028 #2896882] INFO -- : warranty; not even for MERCHANTABILITY or FITNESS FOR A PARTICULAR PURPOSE. I, [2024-05-17T14:34:18.359032 #2896882] INFO -- : I, [2024-05-17T14:34:18.468298 #2896882] INFO -- : builtin_binary.inc updated I, [2024-05-17T14:34:18.472812 #2896882] INFO -- : c5234a9416e4f20f175185e840b25b0f08674d14078ed7083f37e655458e3ca9 builtin_binary.inc I, [2024-05-17T14:34:18.473427 #2896882] INFO -- : compiling /tmp/ruby/src/trunk/builtin.c I, [2024-05-17T14:34:18.656694 #2896882] INFO -- : linking static-library libruby-static.a I, [2024-05-17T14:34:18.971338 #2896882] INFO -- : linking shared-library libruby.so.3.4.0 I, [2024-05-17T14:34:20.530423 #2896882] INFO -- : linking ruby I, [2024-05-17T14:34:20.558005 #2896882] INFO -- : $$$[end] "make ruby -j20" exit with 0. I, [2024-05-17T14:34:20.558191 #2896882] INFO -- : $$$[beg] make all -j20 I, [2024-05-17T14:34:20.620492 #2896882] INFO -- : BASERUBY = /usr/bin/ruby --disable=gems I, [2024-05-17T14:34:20.620549 #2896882] INFO -- : CC = gcc I, [2024-05-17T14:34:20.620559 #2896882] INFO -- : LD = ld I, [2024-05-17T14:34:20.620566 #2896882] INFO -- : LDSHARED = gcc -shared I, [2024-05-17T14:34:20.620572 #2896882] INFO -- : CFLAGS = -O3 -fno-fast-math -ggdb3 -Wall -Wextra -Wdeprecated-declarations -Wdiv-by-zero -Wduplicated-cond -Wimplicit-function-declaration -Wimplicit-int -Wpointer-arith -Wwrite-strings -Wold-style-definition -Wimplicit-fallthrough=0 -Wmissing-noreturn -Wno-cast-function-type -Wno-constant-logical-operand -Wno-long-long -Wno-missing-field-initializers -Wno-overlength-strings -Wno-packed-bitfield-compat -Wno-parentheses-equality -Wno-self-assign -Wno-tautological-compare -Wno-unused-parameter -Wno-unused-value -Wsuggest-attribute=format -Wsuggest-attribute=noreturn -Wunused-variable -Wmisleading-indentation -Wundef -fPIC I, [2024-05-17T14:34:20.620580 #2896882] INFO -- : XCFLAGS = -U_FORTIFY_SOURCE -D_FORTIFY_SOURCE=2 -fstack-protector-strong -fno-strict-overflow -fvisibility=hidden -fexcess-precision=standard -DRUBY_EXPORT -I. -I.ext/include/x86_64-linux -I/tmp/ruby/src/trunk/include -I/tmp/ruby/src/trunk -I/tmp/ruby/src/trunk/prism -I/tmp/ruby/src/trunk/enc/unicode/15.0.0 I, [2024-05-17T14:34:20.620587 #2896882] INFO -- : CPPFLAGS = I, [2024-05-17T14:34:20.620593 #2896882] INFO -- : DLDFLAGS = -Wl,--compress-debug-sections=zlib -Wl,-soname,libruby.so.3.4 -fstack-protector-strong I, [2024-05-17T14:34:20.620600 #2896882] INFO -- : SOLIBS = -lz -lrt -lrt -lgmp -ldl -lcrypt -lm -lpthread I, [2024-05-17T14:34:20.620606 #2896882] INFO -- : LANG = en_US.UTF-8 I, [2024-05-17T14:34:20.620620 #2896882] INFO -- : LC_ALL = I, [2024-05-17T14:34:20.620627 #2896882] INFO -- : LC_CTYPE = I, [2024-05-17T14:34:20.620633 #2896882] INFO -- : MFLAGS = -j20 --jobserver-auth=4,5 I, [2024-05-17T14:34:20.620639 #2896882] INFO -- : RUSTC = no I, [2024-05-17T14:34:20.620648 #2896882] INFO -- : YJIT_RUSTC_ARGS = --crate-name=yjit --crate-type=staticlib --edition=2021 -g -C lto=thin -C opt-level=3 -C overflow-checks=on '--out-dir=/tmp/ruby/build/trunk/yjit/target/release/' /tmp/ruby/src/trunk/yjit/src/lib.rs I, [2024-05-17T14:34:20.622877 #2896882] INFO -- : gcc (Ubuntu 11.4.0-1ubuntu1~22.04) 11.4.0 I, [2024-05-17T14:34:20.622925 #2896882] INFO -- : Copyright (C) 2021 Free Software Foundation, Inc. I, [2024-05-17T14:34:20.622942 #2896882] INFO -- : This is free software; see the source for copying conditions. There is NO I, [2024-05-17T14:34:20.622958 #2896882] INFO -- : warranty; not even for MERCHANTABILITY or FITNESS FOR A PARTICULAR PURPOSE. I, [2024-05-17T14:34:20.622972 #2896882] INFO -- : I, [2024-05-17T14:34:20.655082 #2896882] INFO -- : generating enc.mk I, [2024-05-17T14:34:20.656902 #2896882] INFO -- : building spec/ruby/optional/capi/ext/array_spec.so I, [2024-05-17T14:34:20.657201 #2896882] INFO -- : building spec/ruby/optional/capi/ext/basic_object_spec.so I, [2024-05-17T14:34:20.657971 #2896882] INFO -- : building spec/ruby/optional/capi/ext/bignum_spec.so I, [2024-05-17T14:34:20.658725 #2896882] INFO -- : building spec/ruby/optional/capi/ext/binding_spec.so I, [2024-05-17T14:34:20.658754 #2896882] INFO -- : building spec/ruby/optional/capi/ext/boolean_spec.so I, [2024-05-17T14:34:20.659548 #2896882] INFO -- : building spec/ruby/optional/capi/ext/class_id_under_autoload_spec.so I, [2024-05-17T14:34:20.660427 #2896882] INFO -- : building spec/ruby/optional/capi/ext/class_spec.so I, [2024-05-17T14:34:20.661224 #2896882] INFO -- : building spec/ruby/optional/capi/ext/class_under_autoload_spec.so I, [2024-05-17T14:34:20.661664 #2896882] INFO -- : building spec/ruby/optional/capi/ext/complex_spec.so I, [2024-05-17T14:34:20.662518 #2896882] INFO -- : building spec/ruby/optional/capi/ext/constants_spec.so I, [2024-05-17T14:34:20.663367 #2896882] INFO -- : building spec/ruby/optional/capi/ext/data_spec.so I, [2024-05-17T14:34:20.663656 #2896882] INFO -- : building spec/ruby/optional/capi/ext/debug_spec.so I, [2024-05-17T14:34:20.664454 #2896882] INFO -- : building spec/ruby/optional/capi/ext/encoding_spec.so I, [2024-05-17T14:34:20.665295 #2896882] INFO -- : building spec/ruby/optional/capi/ext/enumerator_spec.so I, [2024-05-17T14:34:20.665506 #2896882] INFO -- : building spec/ruby/optional/capi/ext/exception_spec.so I, [2024-05-17T14:34:20.666124 #2896882] INFO -- : building spec/ruby/optional/capi/ext/fiber_spec.so I, [2024-05-17T14:34:20.666363 #2896882] INFO -- : building spec/ruby/optional/capi/ext/file_spec.so I, [2024-05-17T14:34:20.667083 #2896882] INFO -- : building spec/ruby/optional/capi/ext/fixnum_spec.so I, [2024-05-17T14:34:20.667365 #2896882] INFO -- : building spec/ruby/optional/capi/ext/float_spec.so I, [2024-05-17T14:34:20.792331 #2896882] INFO -- : building spec/ruby/optional/capi/ext/gc_spec.so I, [2024-05-17T14:34:20.803995 #2896882] INFO -- : building spec/ruby/optional/capi/ext/globals_spec.so I, [2024-05-17T14:34:20.807809 #2896882] INFO -- : building spec/ruby/optional/capi/ext/hash_spec.so I, [2024-05-17T14:34:20.810259 #2896882] INFO -- : building spec/ruby/optional/capi/ext/integer_spec.so I, [2024-05-17T14:34:20.814852 #2896882] INFO -- : building spec/ruby/optional/capi/ext/kernel_spec.so I, [2024-05-17T14:34:20.815088 #2896882] INFO -- : building spec/ruby/optional/capi/ext/io_spec.so I, [2024-05-17T14:34:20.823070 #2896882] INFO -- : building spec/ruby/optional/capi/ext/language_spec.so I, [2024-05-17T14:34:20.848311 #2896882] INFO -- : building spec/ruby/optional/capi/ext/marshal_spec.so I, [2024-05-17T14:34:20.848654 #2896882] INFO -- : building spec/ruby/optional/capi/ext/module_spec.so I, [2024-05-17T14:34:20.849029 #2896882] INFO -- : building spec/ruby/optional/capi/ext/module_under_autoload_spec.so I, [2024-05-17T14:34:20.849367 #2896882] INFO -- : building spec/ruby/optional/capi/ext/mutex_spec.so I, [2024-05-17T14:34:20.850168 #2896882] INFO -- : building spec/ruby/optional/capi/ext/numeric_spec.so I, [2024-05-17T14:34:20.855916 #2896882] INFO -- : building spec/ruby/optional/capi/ext/object_spec.so I, [2024-05-17T14:34:20.865374 #2896882] INFO -- : building spec/ruby/optional/capi/ext/proc_spec.so I, [2024-05-17T14:34:20.876874 #2896882] INFO -- : building spec/ruby/optional/capi/ext/range_spec.so I, [2024-05-17T14:34:20.889407 #2896882] INFO -- : building spec/ruby/optional/capi/ext/rational_spec.so I, [2024-05-17T14:34:20.894873 #2896882] INFO -- : building spec/ruby/optional/capi/ext/rbasic_spec.so I, [2024-05-17T14:34:20.901209 #2896882] INFO -- : building spec/ruby/optional/capi/ext/regexp_spec.so I, [2024-05-17T14:34:20.942830 #2896882] INFO -- : building spec/ruby/optional/capi/ext/string_spec.so I, [2024-05-17T14:34:20.972223 #2896882] INFO -- : building spec/ruby/optional/capi/ext/struct_spec.so I, [2024-05-17T14:34:20.979436 #2896882] INFO -- : building spec/ruby/optional/capi/ext/st_spec.so I, [2024-05-17T14:34:20.979929 #2896882] INFO -- : building spec/ruby/optional/capi/ext/symbol_spec.so I, [2024-05-17T14:34:20.980339 #2896882] INFO -- : building spec/ruby/optional/capi/ext/thread_spec.so I, [2024-05-17T14:34:20.986996 #2896882] INFO -- : building spec/ruby/optional/capi/ext/time_spec.so I, [2024-05-17T14:34:20.988755 #2896882] INFO -- : building spec/ruby/optional/capi/ext/tracepoint_spec.so I, [2024-05-17T14:34:20.998274 #2896882] INFO -- : building spec/ruby/optional/capi/ext/typed_data_spec.so I, [2024-05-17T14:34:20.999197 #2896882] INFO -- : building spec/ruby/optional/capi/ext/util_spec.so I, [2024-05-17T14:34:21.015694 #2896882] INFO -- : making enc I, [2024-05-17T14:34:21.033180 #2896882] INFO -- : making srcs under enc I, [2024-05-17T14:34:21.042293 #2896882] INFO -- : make[1]: Entering directory '/tmp/ruby/build/trunk' I, [2024-05-17T14:34:21.043314 #2896882] INFO -- : make[1]: Nothing to be done for 'enc'. I, [2024-05-17T14:34:21.043330 #2896882] INFO -- : make[1]: Leaving directory '/tmp/ruby/build/trunk' I, [2024-05-17T14:34:21.081957 #2896882] INFO -- : make[1]: Entering directory '/tmp/ruby/build/trunk' I, [2024-05-17T14:34:21.082022 #2896882] INFO -- : make[1]: Nothing to be done for 'srcs'. I, [2024-05-17T14:34:21.082034 #2896882] INFO -- : make[1]: Leaving directory '/tmp/ruby/build/trunk' I, [2024-05-17T14:34:21.082913 #2896882] INFO -- : generating transdb.h I, [2024-05-17T14:34:21.194500 #2896882] INFO -- : transdb.h unchanged I, [2024-05-17T14:34:21.196038 #2896882] INFO -- : generating makefiles ext/configure-ext.mk I, [2024-05-17T14:34:21.196289 #2896882] INFO -- : making trans I, [2024-05-17T14:34:21.223708 #2896882] INFO -- : ext/configure-ext.mk updated I, [2024-05-17T14:34:21.226335 #2896882] INFO -- : make[1]: Entering directory '/tmp/ruby/build/trunk' I, [2024-05-17T14:34:21.232031 #2896882] INFO -- : make[1]: Entering directory '/tmp/ruby/build/trunk' I, [2024-05-17T14:34:21.232137 #2896882] INFO -- : make[1]: Nothing to be done for 'trans'. I, [2024-05-17T14:34:21.232165 #2896882] INFO -- : make[1]: Leaving directory '/tmp/ruby/build/trunk' I, [2024-05-17T14:34:21.308793 #2896882] INFO -- : making encs I, [2024-05-17T14:34:21.367432 #2896882] INFO -- : make[1]: Entering directory '/tmp/ruby/build/trunk' I, [2024-05-17T14:34:21.367482 #2896882] INFO -- : make[1]: Nothing to be done for 'encs'. I, [2024-05-17T14:34:21.367488 #2896882] INFO -- : make[1]: Leaving directory '/tmp/ruby/build/trunk' I, [2024-05-17T14:34:21.379047 #2896882] INFO -- : make[1]: Leaving directory '/tmp/ruby/build/trunk' I, [2024-05-17T14:34:21.379894 #2896882] INFO -- : generating makefile exts.mk I, [2024-05-17T14:34:21.416841 #2896882] INFO -- : exts.mk unchanged I, [2024-05-17T14:34:21.421545 #2896882] INFO -- : make[1]: Entering directory '/tmp/ruby/build/trunk' I, [2024-05-17T14:34:21.439361 #2896882] INFO -- : make[2]: Entering directory '/tmp/ruby/build/trunk/ext/digest' I, [2024-05-17T14:34:21.440476 #2896882] INFO -- : make[2]: Entering directory '/tmp/ruby/build/trunk/ext/coverage' I, [2024-05-17T14:34:21.440744 #2896882] INFO -- : make[2]: Entering directory '/tmp/ruby/build/trunk/ext/json' I, [2024-05-17T14:34:21.441093 #2896882] INFO -- : make[2]: Entering directory '/tmp/ruby/build/trunk/ext/io/console' I, [2024-05-17T14:34:21.441490 #2896882] INFO -- : make[2]: Entering directory '/tmp/ruby/build/trunk/ext/date' I, [2024-05-17T14:34:21.442559 #2896882] INFO -- : make[2]: Entering directory '/tmp/ruby/build/trunk/ext/monitor' I, [2024-05-17T14:34:21.443312 #2896882] INFO -- : make[2]: Entering directory '/tmp/ruby/build/trunk/ext/pathname' I, [2024-05-17T14:34:21.443453 #2896882] INFO -- : make[2]: Leaving directory '/tmp/ruby/build/trunk/ext/coverage' I, [2024-05-17T14:34:21.443616 #2896882] INFO -- : make[2]: Leaving directory '/tmp/ruby/build/trunk/ext/io/console' I, [2024-05-17T14:34:21.443751 #2896882] INFO -- : make[2]: Entering directory '/tmp/ruby/build/trunk/ext/fiddle' I, [2024-05-17T14:34:21.443988 #2896882] INFO -- : make[2]: Leaving directory '/tmp/ruby/build/trunk/ext/digest' I, [2024-05-17T14:34:21.444019 #2896882] INFO -- : make[2]: Entering directory '/tmp/ruby/build/trunk/ext/pty' I, [2024-05-17T14:34:21.444396 #2896882] INFO -- : make[2]: Entering directory '/tmp/ruby/build/trunk/ext/rubyvm' I, [2024-05-17T14:34:21.444992 #2896882] INFO -- : make[2]: Entering directory '/tmp/ruby/build/trunk/ext/objspace' I, [2024-05-17T14:34:21.445191 #2896882] INFO -- : make[2]: Entering directory '/tmp/ruby/build/trunk/ext/psych' I, [2024-05-17T14:34:21.445629 #2896882] INFO -- : make[2]: Entering directory '/tmp/ruby/build/trunk/.bundle/gems/bigdecimal-3.1.8/ext/bigdecimal' I, [2024-05-17T14:34:21.445705 #2896882] INFO -- : make[2]: Leaving directory '/tmp/ruby/build/trunk/ext/monitor' I, [2024-05-17T14:34:21.445731 #2896882] INFO -- : make[2]: Leaving directory '/tmp/ruby/build/trunk/ext/date' I, [2024-05-17T14:34:21.446267 #2896882] INFO -- : make[2]: Leaving directory '/tmp/ruby/build/trunk/ext/json' I, [2024-05-17T14:34:21.446506 #2896882] INFO -- : make[2]: Leaving directory '/tmp/ruby/build/trunk/ext/rubyvm' I, [2024-05-17T14:34:21.447012 #2896882] INFO -- : make[2]: Leaving directory '/tmp/ruby/build/trunk/ext/pathname' I, [2024-05-17T14:34:21.447115 #2896882] INFO -- : make[2]: Leaving directory '/tmp/ruby/build/trunk/ext/pty' I, [2024-05-17T14:34:21.448027 #2896882] INFO -- : make[2]: Entering directory '/tmp/ruby/build/trunk/ext/ripper' I, [2024-05-17T14:34:21.448770 #2896882] INFO -- : make[2]: Entering directory '/tmp/ruby/build/trunk/.bundle/gems/debug-1.9.2/ext/debug' I, [2024-05-17T14:34:21.448802 #2896882] INFO -- : make[2]: Entering directory '/tmp/ruby/build/trunk/.bundle/gems/nkf-0.2.0/ext/nkf' I, [2024-05-17T14:34:21.448984 #2896882] INFO -- : make[2]: Entering directory '/tmp/ruby/build/trunk/.bundle/gems/racc-1.7.3/ext/racc/cparse' I, [2024-05-17T14:34:21.449074 #2896882] INFO -- : make[2]: Entering directory '/tmp/ruby/build/trunk/.bundle/gems/syslog-0.1.2/ext/syslog' I, [2024-05-17T14:34:21.449419 #2896882] INFO -- : make[2]: Entering directory '/tmp/ruby/build/trunk/.bundle/gems/rbs-3.4.4/ext/rbs_extension' I, [2024-05-17T14:34:21.450550 #2896882] INFO -- : make[2]: Leaving directory '/tmp/ruby/build/trunk/ext/fiddle' I, [2024-05-17T14:34:21.452318 #2896882] INFO -- : make[2]: Entering directory '/tmp/ruby/build/trunk/ext/digest/sha2' I, [2024-05-17T14:34:21.452365 #2896882] INFO -- : make[2]: Leaving directory '/tmp/ruby/build/trunk/ext/objspace' I, [2024-05-17T14:34:21.453232 #2896882] INFO -- : make[2]: Leaving directory '/tmp/ruby/build/trunk/ext/ripper' I, [2024-05-17T14:34:21.454123 #2896882] INFO -- : make[2]: Entering directory '/tmp/ruby/build/trunk/ext/socket' I, [2024-05-17T14:34:21.454495 #2896882] INFO -- : make[2]: Leaving directory '/tmp/ruby/build/trunk/ext/digest/sha2' I, [2024-05-17T14:34:21.456555 #2896882] INFO -- : make[2]: Entering directory '/tmp/ruby/build/trunk/ext/openssl' I, [2024-05-17T14:34:21.457846 #2896882] INFO -- : make[2]: Leaving directory '/tmp/ruby/build/trunk/ext/psych' I, [2024-05-17T14:34:21.460097 #2896882] INFO -- : make[2]: Leaving directory '/tmp/ruby/build/trunk/ext/socket' I, [2024-05-17T14:34:21.469484 #2896882] INFO -- : make[2]: Leaving directory '/tmp/ruby/build/trunk/.bundle/gems/bigdecimal-3.1.8/ext/bigdecimal' I, [2024-05-17T14:34:21.472312 #2896882] INFO -- : make[2]: Leaving directory '/tmp/ruby/build/trunk/.bundle/gems/syslog-0.1.2/ext/syslog' I, [2024-05-17T14:34:21.472413 #2896882] INFO -- : make[2]: Leaving directory '/tmp/ruby/build/trunk/.bundle/gems/racc-1.7.3/ext/racc/cparse' I, [2024-05-17T14:34:21.472537 #2896882] INFO -- : make[2]: Leaving directory '/tmp/ruby/build/trunk/.bundle/gems/rbs-3.4.4/ext/rbs_extension' I, [2024-05-17T14:34:21.472722 #2896882] INFO -- : make[2]: Leaving directory '/tmp/ruby/build/trunk/ext/openssl' I, [2024-05-17T14:34:21.478556 #2896882] INFO -- : make[2]: Leaving directory '/tmp/ruby/build/trunk/.bundle/gems/debug-1.9.2/ext/debug' I, [2024-05-17T14:34:21.481900 #2896882] INFO -- : make[2]: Leaving directory '/tmp/ruby/build/trunk/.bundle/gems/nkf-0.2.0/ext/nkf' I, [2024-05-17T14:34:21.505962 #2896882] INFO -- : make[2]: Entering directory '/tmp/ruby/build/trunk' I, [2024-05-17T14:34:21.573775 #2896882] INFO -- : linking ruby I, [2024-05-17T14:34:21.595951 #2896882] INFO -- : make[2]: Leaving directory '/tmp/ruby/build/trunk' I, [2024-05-17T14:34:21.596371 #2896882] INFO -- : make[1]: Leaving directory '/tmp/ruby/build/trunk' I, [2024-05-17T14:34:21.600026 #2896882] INFO -- : make[1]: Entering directory '/tmp/ruby/build/trunk' I, [2024-05-17T14:34:21.600092 #2896882] INFO -- : make[1]: Nothing to be done for 'note'. I, [2024-05-17T14:34:21.600108 #2896882] INFO -- : make[1]: Leaving directory '/tmp/ruby/build/trunk' I, [2024-05-17T14:34:21.601043 #2896882] INFO -- : $$$[end] "make all -j20" exit with 0. I, [2024-05-17T14:34:21.601221 #2896882] INFO -- : $$$[beg] make install -j20 I, [2024-05-17T14:34:21.666988 #2896882] INFO -- : Update power_assert to 84e85124c5014a139af39161d484156cfe87a9ed I, [2024-05-17T14:34:21.667171 #2896882] INFO -- : Update rbs to ba7872795d5de04adb8ff500c0e6afdc81a041dd I, [2024-05-17T14:34:21.667372 #2896882] INFO -- : Update typeprof to b19a6416da3a05d57fadd6ffdadb382b6d236ca5 I, [2024-05-17T14:34:21.669389 #2896882] INFO -- : BASERUBY = /usr/bin/ruby --disable=gems I, [2024-05-17T14:34:21.669421 #2896882] INFO -- : CC = gcc I, [2024-05-17T14:34:21.669432 #2896882] INFO -- : LD = ld I, [2024-05-17T14:34:21.669440 #2896882] INFO -- : LDSHARED = gcc -shared I, [2024-05-17T14:34:21.669448 #2896882] INFO -- : CFLAGS = -O3 -fno-fast-math -ggdb3 -Wall -Wextra -Wdeprecated-declarations -Wdiv-by-zero -Wduplicated-cond -Wimplicit-function-declaration -Wimplicit-int -Wpointer-arith -Wwrite-strings -Wold-style-definition -Wimplicit-fallthrough=0 -Wmissing-noreturn -Wno-cast-function-type -Wno-constant-logical-operand -Wno-long-long -Wno-missing-field-initializers -Wno-overlength-strings -Wno-packed-bitfield-compat -Wno-parentheses-equality -Wno-self-assign -Wno-tautological-compare -Wno-unused-parameter -Wno-unused-value -Wsuggest-attribute=format -Wsuggest-attribute=noreturn -Wunused-variable -Wmisleading-indentation -Wundef -fPIC I, [2024-05-17T14:34:21.669457 #2896882] INFO -- : XCFLAGS = -U_FORTIFY_SOURCE -D_FORTIFY_SOURCE=2 -fstack-protector-strong -fno-strict-overflow -fvisibility=hidden -fexcess-precision=standard -DRUBY_EXPORT -I. -I.ext/include/x86_64-linux -I/tmp/ruby/src/trunk/include -I/tmp/ruby/src/trunk -I/tmp/ruby/src/trunk/prism -I/tmp/ruby/src/trunk/enc/unicode/15.0.0 I, [2024-05-17T14:34:21.669464 #2896882] INFO -- : CPPFLAGS = I, [2024-05-17T14:34:21.669471 #2896882] INFO -- : DLDFLAGS = -Wl,--compress-debug-sections=zlib -Wl,-soname,libruby.so.3.4 -fstack-protector-strong I, [2024-05-17T14:34:21.669476 #2896882] INFO -- : SOLIBS = -lz -lrt -lrt -lgmp -ldl -lcrypt -lm -lpthread I, [2024-05-17T14:34:21.669489 #2896882] INFO -- : LANG = en_US.UTF-8 I, [2024-05-17T14:34:21.669495 #2896882] INFO -- : LC_ALL = I, [2024-05-17T14:34:21.669500 #2896882] INFO -- : LC_CTYPE = I, [2024-05-17T14:34:21.669504 #2896882] INFO -- : MFLAGS = -j20 --jobserver-auth=4,5 I, [2024-05-17T14:34:21.669512 #2896882] INFO -- : RUSTC = no I, [2024-05-17T14:34:21.669516 #2896882] INFO -- : YJIT_RUSTC_ARGS = --crate-name=yjit --crate-type=staticlib --edition=2021 -g -C lto=thin -C opt-level=3 -C overflow-checks=on '--out-dir=/tmp/ruby/build/trunk/yjit/target/release/' /tmp/ruby/src/trunk/yjit/src/lib.rs I, [2024-05-17T14:34:21.700725 #2896882] INFO -- : echo 84e85124c5014a139af39161d484156cfe87a9ed | /bin/sh /tmp/ruby/src/trunk/tool/ifchange /tmp/ruby/src/trunk/.bundle/.timestamp/power_assert.revision - I, [2024-05-17T14:34:21.700891 #2896882] INFO -- : echo ba7872795d5de04adb8ff500c0e6afdc81a041dd | /bin/sh /tmp/ruby/src/trunk/tool/ifchange /tmp/ruby/src/trunk/.bundle/.timestamp/rbs.revision - I, [2024-05-17T14:34:21.701096 #2896882] INFO -- : echo b19a6416da3a05d57fadd6ffdadb382b6d236ca5 | /bin/sh /tmp/ruby/src/trunk/tool/ifchange /tmp/ruby/src/trunk/.bundle/.timestamp/typeprof.revision - I, [2024-05-17T14:34:21.701922 #2896882] INFO -- : generating enc.mk I, [2024-05-17T14:34:21.701949 #2896882] INFO -- : gcc (Ubuntu 11.4.0-1ubuntu1~22.04) 11.4.0 I, [2024-05-17T14:34:21.701967 #2896882] INFO -- : Copyright (C) 2021 Free Software Foundation, Inc. I, [2024-05-17T14:34:21.701975 #2896882] INFO -- : This is free software; see the source for copying conditions. There is NO I, [2024-05-17T14:34:21.701983 #2896882] INFO -- : warranty; not even for MERCHANTABILITY or FITNESS FOR A PARTICULAR PURPOSE. I, [2024-05-17T14:34:21.701990 #2896882] INFO -- : I, [2024-05-17T14:34:21.702940 #2896882] INFO -- : /tmp/ruby/src/trunk/.bundle/.timestamp/power_assert.revision unchanged I, [2024-05-17T14:34:21.703023 #2896882] INFO -- : /tmp/ruby/src/trunk/.bundle/.timestamp/rbs.revision unchanged I, [2024-05-17T14:34:21.703131 #2896882] INFO -- : /tmp/ruby/src/trunk/.bundle/.timestamp/typeprof.revision unchanged I, [2024-05-17T14:34:21.826879 #2896882] INFO -- : Building power_assert@84e85124c5014a139af39161d484156cfe87a9ed to /tmp/ruby/src/trunk/gems/power_assert-2.0.3.gem I, [2024-05-17T14:34:21.827496 #2896882] INFO -- : making srcs under enc I, [2024-05-17T14:34:21.827548 #2896882] INFO -- : making enc I, [2024-05-17T14:34:21.844405 #2896882] INFO -- : make[1]: Entering directory '/tmp/ruby/build/trunk' I, [2024-05-17T14:34:21.844448 #2896882] INFO -- : make[1]: Nothing to be done for 'enc'. I, [2024-05-17T14:34:21.844457 #2896882] INFO -- : make[1]: Leaving directory '/tmp/ruby/build/trunk' I, [2024-05-17T14:34:21.857324 #2896882] INFO -- : make[1]: Entering directory '/tmp/ruby/build/trunk' I, [2024-05-17T14:34:21.857351 #2896882] INFO -- : make[1]: Nothing to be done for 'srcs'. I, [2024-05-17T14:34:21.857360 #2896882] INFO -- : make[1]: Leaving directory '/tmp/ruby/build/trunk' I, [2024-05-17T14:34:21.858215 #2896882] INFO -- : generating transdb.h I, [2024-05-17T14:34:21.895767 #2896882] INFO -- : Successfully built RubyGem I, [2024-05-17T14:34:21.895823 #2896882] INFO -- : Name: power_assert I, [2024-05-17T14:34:21.895836 #2896882] INFO -- : Version: 2.0.4dev I, [2024-05-17T14:34:21.895844 #2896882] INFO -- : File: power_assert-2.0.4dev.gem I, [2024-05-17T14:34:21.898083 #2896882] INFO -- : Extracting bundle gem power_assert-2.0.3... I, [2024-05-17T14:34:21.954771 #2896882] INFO -- : transdb.h unchanged I, [2024-05-17T14:34:21.956447 #2896882] INFO -- : generating makefiles ext/configure-ext.mk I, [2024-05-17T14:34:21.956695 #2896882] INFO -- : making trans I, [2024-05-17T14:34:21.959195 #2896882] INFO -- : Try with hash version of bundled gems instead of gems/power_assert-2.0.3.gem. We don't use this gem with release version of Ruby. I, [2024-05-17T14:34:21.964320 #2896882] INFO -- : Unpacked gems/power_assert-2.0.4dev.gem I, [2024-05-17T14:34:21.983908 #2896882] INFO -- : ext/configure-ext.mk unchanged I, [2024-05-17T14:34:21.986375 #2896882] INFO -- : make[1]: Entering directory '/tmp/ruby/build/trunk' I, [2024-05-17T14:34:21.990991 #2896882] INFO -- : make[1]: Entering directory '/tmp/ruby/build/trunk' I, [2024-05-17T14:34:21.991078 #2896882] INFO -- : make[1]: Nothing to be done for 'trans'. I, [2024-05-17T14:34:21.991087 #2896882] INFO -- : make[1]: Leaving directory '/tmp/ruby/build/trunk' I, [2024-05-17T14:34:21.991955 #2896882] INFO -- : making encs I, [2024-05-17T14:34:22.050462 #2896882] INFO -- : make[1]: Entering directory '/tmp/ruby/build/trunk' I, [2024-05-17T14:34:22.050538 #2896882] INFO -- : make[1]: Nothing to be done for 'encs'. I, [2024-05-17T14:34:22.050566 #2896882] INFO -- : make[1]: Leaving directory '/tmp/ruby/build/trunk' I, [2024-05-17T14:34:22.136025 #2896882] INFO -- : make[1]: Leaving directory '/tmp/ruby/build/trunk' I, [2024-05-17T14:34:22.136729 #2896882] INFO -- : generating makefile exts.mk I, [2024-05-17T14:34:22.173711 #2896882] INFO -- : exts.mk unchanged I, [2024-05-17T14:34:22.178380 #2896882] INFO -- : make[1]: Entering directory '/tmp/ruby/build/trunk' I, [2024-05-17T14:34:22.209028 #2896882] INFO -- : make[2]: Entering directory '/tmp/ruby/build/trunk/ext/digest' I, [2024-05-17T14:34:22.211108 #2896882] INFO -- : make[2]: Entering directory '/tmp/ruby/build/trunk/ext/coverage' I, [2024-05-17T14:34:22.211555 #2896882] INFO -- : make[2]: Entering directory '/tmp/ruby/build/trunk/ext/io/console' I, [2024-05-17T14:34:22.211722 #2896882] INFO -- : make[2]: Entering directory '/tmp/ruby/build/trunk/ext/json' I, [2024-05-17T14:34:22.212672 #2896882] INFO -- : make[2]: Entering directory '/tmp/ruby/build/trunk/ext/date' I, [2024-05-17T14:34:22.213712 #2896882] INFO -- : make[2]: Entering directory '/tmp/ruby/build/trunk/ext/rubyvm' I, [2024-05-17T14:34:22.214260 #2896882] INFO -- : make[2]: Entering directory '/tmp/ruby/build/trunk/ext/monitor' I, [2024-05-17T14:34:22.215134 #2896882] INFO -- : make[2]: Entering directory '/tmp/ruby/build/trunk/ext/pathname' I, [2024-05-17T14:34:22.215430 #2896882] INFO -- : make[2]: Entering directory '/tmp/ruby/build/trunk/ext/pty' I, [2024-05-17T14:34:22.215666 #2896882] INFO -- : make[2]: Entering directory '/tmp/ruby/build/trunk/ext/fiddle' I, [2024-05-17T14:34:22.215903 #2896882] INFO -- : make[2]: Leaving directory '/tmp/ruby/build/trunk/ext/digest' I, [2024-05-17T14:34:22.215938 #2896882] INFO -- : make[2]: Leaving directory '/tmp/ruby/build/trunk/ext/io/console' I, [2024-05-17T14:34:22.215957 #2896882] INFO -- : make[2]: Leaving directory '/tmp/ruby/build/trunk/ext/coverage' I, [2024-05-17T14:34:22.216769 #2896882] INFO -- : make[2]: Leaving directory '/tmp/ruby/build/trunk/ext/rubyvm' I, [2024-05-17T14:34:22.217346 #2896882] INFO -- : make[2]: Entering directory '/tmp/ruby/build/trunk/ext/objspace' I, [2024-05-17T14:34:22.217600 #2896882] INFO -- : make[2]: Entering directory '/tmp/ruby/build/trunk/ext/psych' I, [2024-05-17T14:34:22.217927 #2896882] INFO -- : make[2]: Leaving directory '/tmp/ruby/build/trunk/ext/date' I, [2024-05-17T14:34:22.218199 #2896882] INFO -- : make[2]: Leaving directory '/tmp/ruby/build/trunk/ext/monitor' I, [2024-05-17T14:34:22.218330 #2896882] INFO -- : make[2]: Entering directory '/tmp/ruby/build/trunk/.bundle/gems/bigdecimal-3.1.8/ext/bigdecimal' I, [2024-05-17T14:34:22.218648 #2896882] INFO -- : make[2]: Leaving directory '/tmp/ruby/build/trunk/ext/pty' I, [2024-05-17T14:34:22.218765 #2896882] INFO -- : make[2]: Entering directory '/tmp/ruby/build/trunk/.bundle/gems/racc-1.7.3/ext/racc/cparse' I, [2024-05-17T14:34:22.218838 #2896882] INFO -- : make[2]: Entering directory '/tmp/ruby/build/trunk/.bundle/gems/debug-1.9.2/ext/debug' I, [2024-05-17T14:34:22.219321 #2896882] INFO -- : make[2]: Entering directory '/tmp/ruby/build/trunk/.bundle/gems/nkf-0.2.0/ext/nkf' I, [2024-05-17T14:34:22.219919 #2896882] INFO -- : make[2]: Entering directory '/tmp/ruby/build/trunk/.bundle/gems/rbs-3.4.4/ext/rbs_extension' I, [2024-05-17T14:34:22.220047 #2896882] INFO -- : make[2]: Entering directory '/tmp/ruby/build/trunk/.bundle/gems/syslog-0.1.2/ext/syslog' I, [2024-05-17T14:34:22.220113 #2896882] INFO -- : make[2]: Entering directory '/tmp/ruby/build/trunk/ext/ripper' I, [2024-05-17T14:34:22.220139 #2896882] INFO -- : make[2]: Leaving directory '/tmp/ruby/build/trunk/ext/pathname' I, [2024-05-17T14:34:22.222998 #2896882] INFO -- : make[2]: Leaving directory '/tmp/ruby/build/trunk/ext/json' I, [2024-05-17T14:34:22.223058 #2896882] INFO -- : make[2]: Leaving directory '/tmp/ruby/build/trunk/ext/objspace' I, [2024-05-17T14:34:22.223584 #2896882] INFO -- : make[2]: Entering directory '/tmp/ruby/build/trunk/ext/digest/sha2' I, [2024-05-17T14:34:22.224593 #2896882] INFO -- : make[2]: Leaving directory '/tmp/ruby/build/trunk/ext/ripper' I, [2024-05-17T14:34:22.225011 #2896882] INFO -- : make[2]: Entering directory '/tmp/ruby/build/trunk/ext/socket' I, [2024-05-17T14:34:22.226070 #2896882] INFO -- : make[2]: Leaving directory '/tmp/ruby/build/trunk/ext/fiddle' I, [2024-05-17T14:34:22.226843 #2896882] INFO -- : make[2]: Leaving directory '/tmp/ruby/build/trunk/ext/digest/sha2' I, [2024-05-17T14:34:22.228029 #2896882] INFO -- : make[2]: Entering directory '/tmp/ruby/build/trunk/ext/openssl' I, [2024-05-17T14:34:22.231835 #2896882] INFO -- : make[2]: Leaving directory '/tmp/ruby/build/trunk/ext/socket' I, [2024-05-17T14:34:22.232701 #2896882] INFO -- : make[2]: Leaving directory '/tmp/ruby/build/trunk/ext/psych' I, [2024-05-17T14:34:22.239128 #2896882] INFO -- : make[2]: Leaving directory '/tmp/ruby/build/trunk/ext/openssl' I, [2024-05-17T14:34:22.243075 #2896882] INFO -- : make[2]: Leaving directory '/tmp/ruby/build/trunk/.bundle/gems/rbs-3.4.4/ext/rbs_extension' I, [2024-05-17T14:34:22.243959 #2896882] INFO -- : make[2]: Leaving directory '/tmp/ruby/build/trunk/.bundle/gems/racc-1.7.3/ext/racc/cparse' I, [2024-05-17T14:34:22.244535 #2896882] INFO -- : make[2]: Leaving directory '/tmp/ruby/build/trunk/.bundle/gems/nkf-0.2.0/ext/nkf' I, [2024-05-17T14:34:22.248577 #2896882] INFO -- : make[2]: Leaving directory '/tmp/ruby/build/trunk/.bundle/gems/syslog-0.1.2/ext/syslog' I, [2024-05-17T14:34:22.250157 #2896882] INFO -- : make[2]: Leaving directory '/tmp/ruby/build/trunk/.bundle/gems/bigdecimal-3.1.8/ext/bigdecimal' I, [2024-05-17T14:34:22.252900 #2896882] INFO -- : make[2]: Leaving directory '/tmp/ruby/build/trunk/.bundle/gems/debug-1.9.2/ext/debug' I, [2024-05-17T14:34:22.278177 #2896882] INFO -- : make[2]: Entering directory '/tmp/ruby/build/trunk' I, [2024-05-17T14:34:22.347069 #2896882] INFO -- : make[2]: 'ruby' is up to date. I, [2024-05-17T14:34:22.347127 #2896882] INFO -- : make[2]: Leaving directory '/tmp/ruby/build/trunk' I, [2024-05-17T14:34:22.347327 #2896882] INFO -- : make[1]: Leaving directory '/tmp/ruby/build/trunk' I, [2024-05-17T14:34:22.350976 #2896882] INFO -- : make[1]: Entering directory '/tmp/ruby/build/trunk' I, [2024-05-17T14:34:22.351033 #2896882] INFO -- : make[1]: Nothing to be done for 'note'. I, [2024-05-17T14:34:22.351046 #2896882] INFO -- : make[1]: Leaving directory '/tmp/ruby/build/trunk' I, [2024-05-17T14:34:22.351295 #2896882] INFO -- : ./miniruby -I/tmp/ruby/src/trunk/lib -I. -I.ext/common /tmp/ruby/src/trunk/tool/runruby.rb --extout=.ext -- --disable-gems -r./x86_64-linux-fake /tmp/ruby/src/trunk/tool/rbinstall.rb --make="make" --dest-dir="" --extout=".ext" --ext-build-dir="./ext" --mflags="-j20 --jobserver-auth=4,5" --make-flags=" -j20 --jobserver-auth=4,5" --data-mode=0644 --prog-mode=0755 --installed-list .installed.list --mantype="doc" --gnumake --install=all --exclude=doc I, [2024-05-17T14:34:22.448271 #2896882] INFO -- : Installing to I, [2024-05-17T14:34:22.448334 #2896882] INFO -- : installing binary commands: /tmp/ruby/install/trunk/bin I, [2024-05-17T14:34:22.448349 #2896882] INFO -- : installing base libraries: /tmp/ruby/install/trunk/lib I, [2024-05-17T14:34:22.454105 #2896882] INFO -- : installing arch files: /tmp/ruby/install/trunk/lib/ruby/3.4.0+0/x86_64-linux I, [2024-05-17T14:34:22.454177 #2896882] INFO -- : installing pkgconfig data: /tmp/ruby/install/trunk/lib/pkgconfig I, [2024-05-17T14:34:22.454191 #2896882] INFO -- : installing extension objects: /tmp/ruby/install/trunk/lib/ruby/3.4.0+0/x86_64-linux I, [2024-05-17T14:34:22.463554 #2896882] INFO -- : installing extension objects: /tmp/ruby/install/trunk/lib/ruby/site_ruby/3.4.0+0/x86_64-linux I, [2024-05-17T14:34:22.463621 #2896882] INFO -- : installing extension objects: /tmp/ruby/install/trunk/lib/ruby/vendor_ruby/3.4.0+0/x86_64-linux I, [2024-05-17T14:34:22.463636 #2896882] INFO -- : installing extension headers: /tmp/ruby/install/trunk/include/ruby-3.4.0+0/x86_64-linux I, [2024-05-17T14:34:22.463649 #2896882] INFO -- : installing extension scripts: /tmp/ruby/install/trunk/lib/ruby/3.4.0+0 I, [2024-05-17T14:34:22.466444 #2896882] INFO -- : installing extension scripts: /tmp/ruby/install/trunk/lib/ruby/site_ruby/3.4.0+0 I, [2024-05-17T14:34:22.466505 #2896882] INFO -- : installing extension scripts: /tmp/ruby/install/trunk/lib/ruby/vendor_ruby/3.4.0+0 I, [2024-05-17T14:34:22.466520 #2896882] INFO -- : installing extension headers: /tmp/ruby/install/trunk/include/ruby-3.4.0+0/ruby I, [2024-05-17T14:34:22.466537 #2896882] INFO -- : installing command scripts: /tmp/ruby/install/trunk/bin I, [2024-05-17T14:34:22.466551 #2896882] INFO -- : installing library scripts: /tmp/ruby/install/trunk/lib/ruby/3.4.0+0 I, [2024-05-17T14:34:22.499363 #2896882] INFO -- : installing common headers: /tmp/ruby/install/trunk/include/ruby-3.4.0+0 I, [2024-05-17T14:34:22.505696 #2896882] INFO -- : installing manpages: /tmp/ruby/install/trunk/share/man/man1 I, [2024-05-17T14:34:22.505763 #2896882] INFO -- : installing default gems from lib: /tmp/ruby/install/trunk/lib/ruby/gems/3.4.0+0 I, [2024-05-17T14:34:22.528407 #2896882] INFO -- : benchmark 0.3.0 I, [2024-05-17T14:34:22.530302 #2896882] INFO -- : bundler 2.6.0.dev I, [2024-05-17T14:34:22.532433 #2896882] INFO -- : cgi 0.4.1 I, [2024-05-17T14:34:22.532982 #2896882] INFO -- : delegate 0.3.1 I, [2024-05-17T14:34:22.533435 #2896882] INFO -- : did_you_mean 1.6.3 I, [2024-05-17T14:34:22.533902 #2896882] INFO -- : english 0.8.0 I, [2024-05-17T14:34:22.534429 #2896882] INFO -- : erb 4.0.4 I, [2024-05-17T14:34:22.535493 #2896882] INFO -- : error_highlight 0.6.0 I, [2024-05-17T14:34:22.536225 #2896882] INFO -- : fileutils 1.7.2 I, [2024-05-17T14:34:22.536954 #2896882] INFO -- : find 0.2.0 I, [2024-05-17T14:34:22.537970 #2896882] INFO -- : forwardable 1.3.3 I, [2024-05-17T14:34:22.538959 #2896882] INFO -- : ipaddr 1.2.6 I, [2024-05-17T14:34:22.539533 #2896882] INFO -- : irb 1.13.1 I, [2024-05-17T14:34:22.540348 #2896882] INFO -- : logger 1.6.0 I, [2024-05-17T14:34:22.540834 #2896882] INFO -- : net-http 0.4.1 I, [2024-05-17T14:34:22.541341 #2896882] INFO -- : net-protocol 0.2.2 I, [2024-05-17T14:34:22.541843 #2896882] INFO -- : open-uri 0.4.1 I, [2024-05-17T14:34:22.542331 #2896882] INFO -- : open3 0.2.1 I, [2024-05-17T14:34:22.542751 #2896882] INFO -- : optparse 0.5.0 I, [2024-05-17T14:34:22.543289 #2896882] INFO -- : ostruct 0.6.0 I, [2024-05-17T14:34:22.543659 #2896882] INFO -- : pp 0.5.0 I, [2024-05-17T14:34:22.544189 #2896882] INFO -- : prettyprint 0.2.0 I, [2024-05-17T14:34:22.544716 #2896882] INFO -- : prism 0.29.0 I, [2024-05-17T14:34:22.545209 #2896882] INFO -- : pstore 0.1.3 I, [2024-05-17T14:34:22.545708 #2896882] INFO -- : rdoc 6.6.3.1 I, [2024-05-17T14:34:22.546661 #2896882] INFO -- : readline 0.0.4 I, [2024-05-17T14:34:22.547195 #2896882] INFO -- : reline 0.5.7 I, [2024-05-17T14:34:22.547707 #2896882] INFO -- : resolv 0.4.0 I, [2024-05-17T14:34:22.548262 #2896882] INFO -- : ruby2_keywords 0.0.5 I, [2024-05-17T14:34:22.548692 #2896882] INFO -- : securerandom 0.3.1 I, [2024-05-17T14:34:22.549696 #2896882] INFO -- : set 1.1.0 I, [2024-05-17T14:34:22.550493 #2896882] INFO -- : shellwords 0.2.0 I, [2024-05-17T14:34:22.550985 #2896882] INFO -- : singleton 0.2.0 I, [2024-05-17T14:34:22.551442 #2896882] INFO -- : syntax_suggest 2.0.0 I, [2024-05-17T14:34:22.552140 #2896882] INFO -- : tempfile 0.2.1 I, [2024-05-17T14:34:22.552622 #2896882] INFO -- : time 0.3.0 I, [2024-05-17T14:34:22.553117 #2896882] INFO -- : timeout 0.4.1 I, [2024-05-17T14:34:22.553567 #2896882] INFO -- : tmpdir 0.2.0 I, [2024-05-17T14:34:22.554027 #2896882] INFO -- : tsort 0.2.0 I, [2024-05-17T14:34:22.554441 #2896882] INFO -- : un 0.3.0 I, [2024-05-17T14:34:22.554892 #2896882] INFO -- : uri 0.13.0 I, [2024-05-17T14:34:22.555464 #2896882] INFO -- : weakref 0.1.3 I, [2024-05-17T14:34:22.555928 #2896882] INFO -- : yaml 0.3.0 I, [2024-05-17T14:34:22.556361 #2896882] INFO -- : installing default gems from ext: /tmp/ruby/install/trunk/lib/ruby/gems/3.4.0+0 I, [2024-05-17T14:34:22.562773 #2896882] INFO -- : date 3.3.4 I, [2024-05-17T14:34:22.563315 #2896882] INFO -- : digest 3.1.1 I, [2024-05-17T14:34:22.563890 #2896882] INFO -- : etc 1.4.3 I, [2024-05-17T14:34:22.564397 #2896882] INFO -- : fcntl 1.1.0 I, [2024-05-17T14:34:22.564876 #2896882] INFO -- : fiddle 1.1.3 I, [2024-05-17T14:34:22.565362 #2896882] INFO -- : io-console 0.7.2 I, [2024-05-17T14:34:22.565849 #2896882] INFO -- : io-nonblock 0.3.0 I, [2024-05-17T14:34:22.566254 #2896882] INFO -- : io-wait 0.3.1 I, [2024-05-17T14:34:22.566740 #2896882] INFO -- : json 2.7.2 I, [2024-05-17T14:34:22.567271 #2896882] INFO -- : openssl 3.2.0 I, [2024-05-17T14:34:22.567788 #2896882] INFO -- : pathname 0.3.0 I, [2024-05-17T14:34:22.568305 #2896882] INFO -- : psych 5.1.2 I, [2024-05-17T14:34:22.568884 #2896882] INFO -- : stringio 3.1.1 I, [2024-05-17T14:34:22.569360 #2896882] INFO -- : strscan 3.1.1 I, [2024-05-17T14:34:22.569803 #2896882] INFO -- : zlib 3.1.0 I, [2024-05-17T14:34:22.570141 #2896882] INFO -- : installing bundled gems: /tmp/ruby/install/trunk/lib/ruby/gems/3.4.0+0 I, [2024-05-17T14:34:22.570727 #2896882] INFO -- : minitest 5.23.0 I, [2024-05-17T14:34:22.579041 #2896882] INFO -- : rake 13.2.1 I, [2024-05-17T14:34:22.582547 #2896882] INFO -- : test-unit 3.6.2 I, [2024-05-17T14:34:22.587411 #2896882] INFO -- : rexml 3.2.6 I, [2024-05-17T14:34:22.591266 #2896882] INFO -- : rss 0.3.0 I, [2024-05-17T14:34:22.593896 #2896882] INFO -- : net-ftp 0.3.4 I, [2024-05-17T14:34:22.595493 #2896882] INFO -- : net-imap 0.4.11 I, [2024-05-17T14:34:22.599334 #2896882] INFO -- : net-pop 0.1.2 I, [2024-05-17T14:34:22.600359 #2896882] INFO -- : net-smtp 0.5.0 I, [2024-05-17T14:34:22.601528 #2896882] INFO -- : matrix 0.4.2 I, [2024-05-17T14:34:22.604959 #2896882] INFO -- : prime 0.1.2 I, [2024-05-17T14:34:22.609671 #2896882] INFO -- : rbs 3.4.4 I, [2024-05-17T14:34:22.631926 #2896882] INFO -- : typeprof 0.21.11 I, [2024-05-17T14:34:22.634335 #2896882] INFO -- : debug 1.9.2 I, [2024-05-17T14:34:22.637758 #2896882] INFO -- : racc 1.7.3 I, [2024-05-17T14:34:22.640510 #2896882] INFO -- : mutex_m 0.2.0 I, [2024-05-17T14:34:22.641847 #2896882] INFO -- : getoptlong 0.2.1 I, [2024-05-17T14:34:22.643227 #2896882] INFO -- : base64 0.2.0 I, [2024-05-17T14:34:22.644508 #2896882] INFO -- : bigdecimal 3.1.8 I, [2024-05-17T14:34:22.646584 #2896882] INFO -- : observer 0.1.2 I, [2024-05-17T14:34:22.648158 #2896882] INFO -- : abbrev 0.1.2 I, [2024-05-17T14:34:22.649303 #2896882] INFO -- : resolv-replace 0.1.1 I, [2024-05-17T14:34:22.650761 #2896882] INFO -- : rinda 0.2.0 I, [2024-05-17T14:34:22.652082 #2896882] INFO -- : drb 2.2.1 I, [2024-05-17T14:34:22.653698 #2896882] INFO -- : nkf 0.2.0 I, [2024-05-17T14:34:22.656097 #2896882] INFO -- : syslog 0.1.2 I, [2024-05-17T14:34:22.657844 #2896882] INFO -- : csv 3.3.0 I, [2024-05-17T14:34:22.660773 #2896882] INFO -- : installing bundled gem cache: /tmp/ruby/install/trunk/lib/ruby/gems/3.4.0+0/cache I, [2024-05-17T14:34:22.662161 #2896882] INFO -- : skipped bundled gems: I, [2024-05-17T14:34:22.662227 #2896882] INFO -- : power_assert-2.0.4dev.gem not found in bundled_gems I, [2024-05-17T14:34:22.665363 #2896882] INFO -- : $$$[end] "make install -j20" exit with 0. I, [2024-05-17T14:34:22.665503 #2896882] INFO -- : $$$[beg] make yes-btest TESTOPTS='-q -j20' I, [2024-05-17T14:34:28.553231 #2896882] INFO -- : PASS all 1936 tests E, [2024-05-17T14:34:28.558517 #2896882] ERROR -- : I, [2024-05-17T14:34:28.558889 #2896882] INFO -- : $$$[end] "make yes-btest TESTOPTS='-q -j20'" exit with 0. I, [2024-05-17T14:34:28.558984 #2896882] INFO -- : $$$[beg] make yes-test-basic TESTS='-j20' I, [2024-05-17T14:34:28.619013 #2896882] INFO -- : BASERUBY = /usr/bin/ruby --disable=gems I, [2024-05-17T14:34:28.619053 #2896882] INFO -- : CC = gcc I, [2024-05-17T14:34:28.619066 #2896882] INFO -- : LD = ld I, [2024-05-17T14:34:28.619076 #2896882] INFO -- : LDSHARED = gcc -shared I, [2024-05-17T14:34:28.619092 #2896882] INFO -- : CFLAGS = -O3 -fno-fast-math -ggdb3 -Wall -Wextra -Wdeprecated-declarations -Wdiv-by-zero -Wduplicated-cond -Wimplicit-function-declaration -Wimplicit-int -Wpointer-arith -Wwrite-strings -Wold-style-definition -Wimplicit-fallthrough=0 -Wmissing-noreturn -Wno-cast-function-type -Wno-constant-logical-operand -Wno-long-long -Wno-missing-field-initializers -Wno-overlength-strings -Wno-packed-bitfield-compat -Wno-parentheses-equality -Wno-self-assign -Wno-tautological-compare -Wno-unused-parameter -Wno-unused-value -Wsuggest-attribute=format -Wsuggest-attribute=noreturn -Wunused-variable -Wmisleading-indentation -Wundef -fPIC I, [2024-05-17T14:34:28.619112 #2896882] INFO -- : XCFLAGS = -U_FORTIFY_SOURCE -D_FORTIFY_SOURCE=2 -fstack-protector-strong -fno-strict-overflow -fvisibility=hidden -fexcess-precision=standard -DRUBY_EXPORT -I. -I.ext/include/x86_64-linux -I/tmp/ruby/src/trunk/include -I/tmp/ruby/src/trunk -I/tmp/ruby/src/trunk/prism -I/tmp/ruby/src/trunk/enc/unicode/15.0.0 I, [2024-05-17T14:34:28.619124 #2896882] INFO -- : CPPFLAGS = I, [2024-05-17T14:34:28.619134 #2896882] INFO -- : DLDFLAGS = -Wl,--compress-debug-sections=zlib -Wl,-soname,libruby.so.3.4 -fstack-protector-strong I, [2024-05-17T14:34:28.619144 #2896882] INFO -- : SOLIBS = -lz -lrt -lrt -lgmp -ldl -lcrypt -lm -lpthread I, [2024-05-17T14:34:28.619154 #2896882] INFO -- : LANG = en_US.UTF-8 I, [2024-05-17T14:34:28.619163 #2896882] INFO -- : LC_ALL = I, [2024-05-17T14:34:28.619172 #2896882] INFO -- : LC_CTYPE = I, [2024-05-17T14:34:28.619182 #2896882] INFO -- : MFLAGS = I, [2024-05-17T14:34:28.619191 #2896882] INFO -- : RUSTC = no I, [2024-05-17T14:34:28.619201 #2896882] INFO -- : YJIT_RUSTC_ARGS = --crate-name=yjit --crate-type=staticlib --edition=2021 -g -C lto=thin -C opt-level=3 -C overflow-checks=on '--out-dir=/tmp/ruby/build/trunk/yjit/target/release/' /tmp/ruby/src/trunk/yjit/src/lib.rs I, [2024-05-17T14:34:28.619682 #2896882] INFO -- : gcc (Ubuntu 11.4.0-1ubuntu1~22.04) 11.4.0 I, [2024-05-17T14:34:28.619726 #2896882] INFO -- : Copyright (C) 2021 Free Software Foundation, Inc. I, [2024-05-17T14:34:28.619739 #2896882] INFO -- : This is free software; see the source for copying conditions. There is NO I, [2024-05-17T14:34:28.619753 #2896882] INFO -- : warranty; not even for MERCHANTABILITY or FITNESS FOR A PARTICULAR PURPOSE. I, [2024-05-17T14:34:28.619768 #2896882] INFO -- : I, [2024-05-17T14:34:28.730607 #2896882] INFO -- : Checking leaked global symbols...none I, [2024-05-17T14:34:28.776642 #2896882] INFO -- : /tmp/ruby/src/trunk/basictest/test.rb:assignment ....................................................................................................................................................................................................................................................................................................................................................................................OK 372 I, [2024-05-17T14:34:28.776734 #2896882] INFO -- : /tmp/ruby/src/trunk/basictest/test.rb:condition ..OK 2 I, [2024-05-17T14:34:28.776751 #2896882] INFO -- : /tmp/ruby/src/trunk/basictest/test.rb:if/unless ...OK 3 I, [2024-05-17T14:34:28.776778 #2896882] INFO -- : /tmp/ruby/src/trunk/basictest/test.rb:case .....OK 5 I, [2024-05-17T14:34:28.777031 #2896882] INFO -- : /tmp/ruby/src/trunk/basictest/test.rb:while/until ........OK 8 I, [2024-05-17T14:34:28.777100 #2896882] INFO -- : /tmp/ruby/src/trunk/basictest/test.rb:exception ..........OK 10 I, [2024-05-17T14:34:28.777455 #2896882] INFO -- : /tmp/ruby/src/trunk/basictest/test.rb:array .......................................OK 39 I, [2024-05-17T14:34:28.777588 #2896882] INFO -- : /tmp/ruby/src/trunk/basictest/test.rb:hash ...........................OK 27 I, [2024-05-17T14:34:28.778498 #2896882] INFO -- : /tmp/ruby/src/trunk/basictest/test.rb:iterator ...........................................................................................................OK 107 I, [2024-05-17T14:34:28.778832 #2896882] INFO -- : /tmp/ruby/src/trunk/basictest/test.rb:float ................................................................................OK 80 I, [2024-05-17T14:34:28.779891 #2896882] INFO -- : /tmp/ruby/src/trunk/basictest/test.rb:bignum ...............................OK 31 I, [2024-05-17T14:34:28.780682 #2896882] INFO -- : /tmp/ruby/src/trunk/basictest/test.rb:string & char ..............................................................OK 62 I, [2024-05-17T14:34:28.780703 #2896882] INFO -- : /tmp/ruby/src/trunk/basictest/test.rb:assignment ..........OK 10 I, [2024-05-17T14:34:28.780718 #2896882] INFO -- : /tmp/ruby/src/trunk/basictest/test.rb:call ......OK 6 I, [2024-05-17T14:34:28.780764 #2896882] INFO -- : /tmp/ruby/src/trunk/basictest/test.rb:proc .........OK 9 I, [2024-05-17T14:34:28.881320 #2896882] INFO -- : /tmp/ruby/src/trunk/basictest/test.rb:signal ..OK 2 I, [2024-05-17T14:34:28.882834 #2896882] INFO -- : /tmp/ruby/src/trunk/basictest/test.rb:eval ...........................OK 27 I, [2024-05-17T14:34:29.007183 #2896882] INFO -- : /tmp/ruby/src/trunk/basictest/test.rb:system ........OK 8 I, [2024-05-17T14:34:29.007278 #2896882] INFO -- : /tmp/ruby/src/trunk/basictest/test.rb:const .....OK 5 I, [2024-05-17T14:34:29.007312 #2896882] INFO -- : /tmp/ruby/src/trunk/basictest/test.rb:clone .....OK 5 I, [2024-05-17T14:34:29.007331 #2896882] INFO -- : /tmp/ruby/src/trunk/basictest/test.rb:marshal ....OK 4 I, [2024-05-17T14:34:29.007430 #2896882] INFO -- : /tmp/ruby/src/trunk/basictest/test.rb:pack ....OK 4 I, [2024-05-17T14:34:29.007459 #2896882] INFO -- : /tmp/ruby/src/trunk/basictest/test.rb:math ..OK 2 I, [2024-05-17T14:34:29.007478 #2896882] INFO -- : /tmp/ruby/src/trunk/basictest/test.rb:struct ......OK 6 I, [2024-05-17T14:34:29.007624 #2896882] INFO -- : /tmp/ruby/src/trunk/basictest/test.rb:variable ............OK 12 I, [2024-05-17T14:34:29.007653 #2896882] INFO -- : /tmp/ruby/src/trunk/basictest/test.rb:trace ...OK 3 I, [2024-05-17T14:34:29.007671 #2896882] INFO -- : /tmp/ruby/src/trunk/basictest/test.rb:defined? ............OK 12 I, [2024-05-17T14:34:29.007726 #2896882] INFO -- : /tmp/ruby/src/trunk/basictest/test.rb:alias ......OK 6 I, [2024-05-17T14:34:29.008215 #2896882] INFO -- : /tmp/ruby/src/trunk/basictest/test.rb:path .......................OK 23 I, [2024-05-17T14:34:29.052077 #2896882] INFO -- : /tmp/ruby/src/trunk/basictest/test.rb:gc ....OK 4 I, [2024-05-17T14:34:29.054495 #2896882] INFO -- : I, [2024-05-17T14:34:29.054534 #2896882] INFO -- : test succeeded I, [2024-05-17T14:34:29.056154 #2896882] INFO -- : $$$[end] "make yes-test-basic TESTS='-j20'" exit with 0. I, [2024-05-17T14:34:29.056247 #2896882] INFO -- : $$$[beg] make yes-test-all TESTOPTS='--stderr-on-failure' TESTS='-j20' I, [2024-05-17T14:34:29.157767 #2896882] INFO -- : BASERUBY = /usr/bin/ruby --disable=gems I, [2024-05-17T14:34:29.157827 #2896882] INFO -- : CC = gcc I, [2024-05-17T14:34:29.157841 #2896882] INFO -- : LD = ld I, [2024-05-17T14:34:29.157853 #2896882] INFO -- : LDSHARED = gcc -shared I, [2024-05-17T14:34:29.157864 #2896882] INFO -- : CFLAGS = -O3 -fno-fast-math -ggdb3 -Wall -Wextra -Wdeprecated-declarations -Wdiv-by-zero -Wduplicated-cond -Wimplicit-function-declaration -Wimplicit-int -Wpointer-arith -Wwrite-strings -Wold-style-definition -Wimplicit-fallthrough=0 -Wmissing-noreturn -Wno-cast-function-type -Wno-constant-logical-operand -Wno-long-long -Wno-missing-field-initializers -Wno-overlength-strings -Wno-packed-bitfield-compat -Wno-parentheses-equality -Wno-self-assign -Wno-tautological-compare -Wno-unused-parameter -Wno-unused-value -Wsuggest-attribute=format -Wsuggest-attribute=noreturn -Wunused-variable -Wmisleading-indentation -Wundef -fPIC I, [2024-05-17T14:34:29.157877 #2896882] INFO -- : XCFLAGS = -U_FORTIFY_SOURCE -D_FORTIFY_SOURCE=2 -fstack-protector-strong -fno-strict-overflow -fvisibility=hidden -fexcess-precision=standard -DRUBY_EXPORT -I. -I.ext/include/x86_64-linux -I/tmp/ruby/src/trunk/include -I/tmp/ruby/src/trunk -I/tmp/ruby/src/trunk/prism -I/tmp/ruby/src/trunk/enc/unicode/15.0.0 I, [2024-05-17T14:34:29.157889 #2896882] INFO -- : CPPFLAGS = I, [2024-05-17T14:34:29.157900 #2896882] INFO -- : DLDFLAGS = -Wl,--compress-debug-sections=zlib -Wl,-soname,libruby.so.3.4 -fstack-protector-strong I, [2024-05-17T14:34:29.157921 #2896882] INFO -- : SOLIBS = -lz -lrt -lrt -lgmp -ldl -lcrypt -lm -lpthread I, [2024-05-17T14:34:29.157932 #2896882] INFO -- : LANG = en_US.UTF-8 I, [2024-05-17T14:34:29.157942 #2896882] INFO -- : LC_ALL = I, [2024-05-17T14:34:29.157952 #2896882] INFO -- : LC_CTYPE = I, [2024-05-17T14:34:29.157962 #2896882] INFO -- : MFLAGS = I, [2024-05-17T14:34:29.157972 #2896882] INFO -- : RUSTC = no I, [2024-05-17T14:34:29.157984 #2896882] INFO -- : YJIT_RUSTC_ARGS = --crate-name=yjit --crate-type=staticlib --edition=2021 -g -C lto=thin -C opt-level=3 -C overflow-checks=on '--out-dir=/tmp/ruby/build/trunk/yjit/target/release/' /tmp/ruby/src/trunk/yjit/src/lib.rs I, [2024-05-17T14:34:29.158389 #2896882] INFO -- : gcc (Ubuntu 11.4.0-1ubuntu1~22.04) 11.4.0 I, [2024-05-17T14:34:29.158445 #2896882] INFO -- : Copyright (C) 2021 Free Software Foundation, Inc. I, [2024-05-17T14:34:29.158459 #2896882] INFO -- : This is free software; see the source for copying conditions. There is NO I, [2024-05-17T14:34:29.158470 #2896882] INFO -- : warranty; not even for MERCHANTABILITY or FITNESS FOR A PARTICULAR PURPOSE. I, [2024-05-17T14:34:29.158480 #2896882] INFO -- : I, [2024-05-17T14:34:29.160186 #2896882] INFO -- : generating enc.mk I, [2024-05-17T14:34:29.278042 #2896882] INFO -- : making enc I, [2024-05-17T14:34:29.295017 #2896882] INFO -- : make[1]: Entering directory '/tmp/ruby/build/trunk' I, [2024-05-17T14:34:29.295071 #2896882] INFO -- : make[1]: Nothing to be done for 'enc'. I, [2024-05-17T14:34:29.295084 #2896882] INFO -- : make[1]: Leaving directory '/tmp/ruby/build/trunk' I, [2024-05-17T14:34:29.295831 #2896882] INFO -- : making srcs under enc I, [2024-05-17T14:34:29.326110 #2896882] INFO -- : make[1]: Entering directory '/tmp/ruby/build/trunk' I, [2024-05-17T14:34:29.326180 #2896882] INFO -- : make[1]: Nothing to be done for 'srcs'. I, [2024-05-17T14:34:29.326196 #2896882] INFO -- : make[1]: Leaving directory '/tmp/ruby/build/trunk' I, [2024-05-17T14:34:29.327080 #2896882] INFO -- : generating transdb.h I, [2024-05-17T14:34:29.423049 #2896882] INFO -- : transdb.h unchanged I, [2024-05-17T14:34:29.424433 #2896882] INFO -- : making trans I, [2024-05-17T14:34:29.457818 #2896882] INFO -- : make[1]: Entering directory '/tmp/ruby/build/trunk' I, [2024-05-17T14:34:29.457884 #2896882] INFO -- : make[1]: Nothing to be done for 'trans'. I, [2024-05-17T14:34:29.457898 #2896882] INFO -- : make[1]: Leaving directory '/tmp/ruby/build/trunk' I, [2024-05-17T14:34:29.458534 #2896882] INFO -- : making encs I, [2024-05-17T14:34:29.497581 #2896882] INFO -- : make[1]: Entering directory '/tmp/ruby/build/trunk' I, [2024-05-17T14:34:29.497649 #2896882] INFO -- : make[1]: Nothing to be done for 'encs'. I, [2024-05-17T14:34:29.497664 #2896882] INFO -- : make[1]: Leaving directory '/tmp/ruby/build/trunk' I, [2024-05-17T14:34:29.499361 #2896882] INFO -- : generating makefiles ext/configure-ext.mk I, [2024-05-17T14:34:29.527104 #2896882] INFO -- : ext/configure-ext.mk updated I, [2024-05-17T14:34:29.529536 #2896882] INFO -- : make[1]: Entering directory '/tmp/ruby/build/trunk' I, [2024-05-17T14:34:30.884291 #2896882] INFO -- : make[1]: Leaving directory '/tmp/ruby/build/trunk' I, [2024-05-17T14:34:30.885123 #2896882] INFO -- : generating makefile exts.mk I, [2024-05-17T14:34:30.921002 #2896882] INFO -- : exts.mk unchanged I, [2024-05-17T14:34:30.925344 #2896882] INFO -- : make[1]: Entering directory '/tmp/ruby/build/trunk' I, [2024-05-17T14:34:31.257602 #2896882] INFO -- : make[2]: Entering directory '/tmp/ruby/build/trunk/ext/coverage' I, [2024-05-17T14:34:31.262330 #2896882] INFO -- : make[2]: Leaving directory '/tmp/ruby/build/trunk/ext/coverage' I, [2024-05-17T14:34:31.268875 #2896882] INFO -- : make[2]: Entering directory '/tmp/ruby/build/trunk/ext/date' I, [2024-05-17T14:34:31.273643 #2896882] INFO -- : make[2]: Leaving directory '/tmp/ruby/build/trunk/ext/date' I, [2024-05-17T14:34:31.277543 #2896882] INFO -- : make[2]: Entering directory '/tmp/ruby/build/trunk/ext/digest' I, [2024-05-17T14:34:31.286861 #2896882] INFO -- : make[2]: Leaving directory '/tmp/ruby/build/trunk/ext/digest' I, [2024-05-17T14:34:31.313898 #2896882] INFO -- : make[2]: Entering directory '/tmp/ruby/build/trunk/ext/digest/sha2' I, [2024-05-17T14:34:31.318787 #2896882] INFO -- : make[2]: Leaving directory '/tmp/ruby/build/trunk/ext/digest/sha2' I, [2024-05-17T14:34:31.339899 #2896882] INFO -- : make[2]: Entering directory '/tmp/ruby/build/trunk/ext/fiddle' I, [2024-05-17T14:34:31.349401 #2896882] INFO -- : make[2]: Leaving directory '/tmp/ruby/build/trunk/ext/fiddle' I, [2024-05-17T14:34:31.354373 #2896882] INFO -- : make[2]: Entering directory '/tmp/ruby/build/trunk/ext/io/console' I, [2024-05-17T14:34:31.358551 #2896882] INFO -- : make[2]: Leaving directory '/tmp/ruby/build/trunk/ext/io/console' I, [2024-05-17T14:34:31.371325 #2896882] INFO -- : make[2]: Entering directory '/tmp/ruby/build/trunk/ext/json' I, [2024-05-17T14:34:31.382350 #2896882] INFO -- : make[2]: Leaving directory '/tmp/ruby/build/trunk/ext/json' I, [2024-05-17T14:34:31.397814 #2896882] INFO -- : make[2]: Entering directory '/tmp/ruby/build/trunk/ext/monitor' I, [2024-05-17T14:34:31.402005 #2896882] INFO -- : make[2]: Leaving directory '/tmp/ruby/build/trunk/ext/monitor' I, [2024-05-17T14:34:31.409086 #2896882] INFO -- : make[2]: Entering directory '/tmp/ruby/build/trunk/ext/objspace' I, [2024-05-17T14:34:31.415192 #2896882] INFO -- : make[2]: Leaving directory '/tmp/ruby/build/trunk/ext/objspace' I, [2024-05-17T14:34:31.434879 #2896882] INFO -- : make[2]: Entering directory '/tmp/ruby/build/trunk/ext/openssl' I, [2024-05-17T14:34:31.450072 #2896882] INFO -- : make[2]: Leaving directory '/tmp/ruby/build/trunk/ext/openssl' I, [2024-05-17T14:34:31.453090 #2896882] INFO -- : make[2]: Entering directory '/tmp/ruby/build/trunk/ext/pathname' I, [2024-05-17T14:34:31.455654 #2896882] INFO -- : make[2]: Leaving directory '/tmp/ruby/build/trunk/ext/pathname' I, [2024-05-17T14:34:31.461006 #2896882] INFO -- : make[2]: Entering directory '/tmp/ruby/build/trunk/ext/psych' I, [2024-05-17T14:34:31.485475 #2896882] INFO -- : make[2]: Leaving directory '/tmp/ruby/build/trunk/ext/psych' I, [2024-05-17T14:34:31.490432 #2896882] INFO -- : make[2]: Entering directory '/tmp/ruby/build/trunk/ext/pty' I, [2024-05-17T14:34:31.494515 #2896882] INFO -- : make[2]: Leaving directory '/tmp/ruby/build/trunk/ext/pty' I, [2024-05-17T14:34:31.510650 #2896882] INFO -- : make[2]: Entering directory '/tmp/ruby/build/trunk/ext/ripper' I, [2024-05-17T14:34:31.518926 #2896882] INFO -- : make[2]: Leaving directory '/tmp/ruby/build/trunk/ext/ripper' I, [2024-05-17T14:34:31.521540 #2896882] INFO -- : make[2]: Entering directory '/tmp/ruby/build/trunk/ext/rubyvm' I, [2024-05-17T14:34:31.524655 #2896882] INFO -- : make[2]: Leaving directory '/tmp/ruby/build/trunk/ext/rubyvm' I, [2024-05-17T14:34:31.537957 #2896882] INFO -- : make[2]: Entering directory '/tmp/ruby/build/trunk/ext/socket' I, [2024-05-17T14:34:31.547940 #2896882] INFO -- : make[2]: Leaving directory '/tmp/ruby/build/trunk/ext/socket' I, [2024-05-17T14:34:31.565554 #2896882] INFO -- : make[2]: Entering directory '/tmp/ruby/build/trunk/.bundle/gems/bigdecimal-3.1.8/ext/bigdecimal' I, [2024-05-17T14:34:31.594626 #2896882] INFO -- : make[2]: Leaving directory '/tmp/ruby/build/trunk/.bundle/gems/bigdecimal-3.1.8/ext/bigdecimal' I, [2024-05-17T14:34:31.596948 #2896882] INFO -- : make[2]: Entering directory '/tmp/ruby/build/trunk/.bundle/gems/debug-1.9.2/ext/debug' I, [2024-05-17T14:34:31.618866 #2896882] INFO -- : make[2]: Leaving directory '/tmp/ruby/build/trunk/.bundle/gems/debug-1.9.2/ext/debug' I, [2024-05-17T14:34:31.621297 #2896882] INFO -- : make[2]: Entering directory '/tmp/ruby/build/trunk/.bundle/gems/nkf-0.2.0/ext/nkf' I, [2024-05-17T14:34:31.643337 #2896882] INFO -- : make[2]: Leaving directory '/tmp/ruby/build/trunk/.bundle/gems/nkf-0.2.0/ext/nkf' I, [2024-05-17T14:34:31.645355 #2896882] INFO -- : make[2]: Entering directory '/tmp/ruby/build/trunk/.bundle/gems/racc-1.7.3/ext/racc/cparse' I, [2024-05-17T14:34:31.666592 #2896882] INFO -- : make[2]: Leaving directory '/tmp/ruby/build/trunk/.bundle/gems/racc-1.7.3/ext/racc/cparse' I, [2024-05-17T14:34:31.668913 #2896882] INFO -- : make[2]: Entering directory '/tmp/ruby/build/trunk/.bundle/gems/rbs-3.4.4/ext/rbs_extension' I, [2024-05-17T14:34:31.690323 #2896882] INFO -- : make[2]: Leaving directory '/tmp/ruby/build/trunk/.bundle/gems/rbs-3.4.4/ext/rbs_extension' I, [2024-05-17T14:34:31.692293 #2896882] INFO -- : make[2]: Entering directory '/tmp/ruby/build/trunk/.bundle/gems/syslog-0.1.2/ext/syslog' I, [2024-05-17T14:34:31.714143 #2896882] INFO -- : make[2]: Leaving directory '/tmp/ruby/build/trunk/.bundle/gems/syslog-0.1.2/ext/syslog' I, [2024-05-17T14:34:31.738453 #2896882] INFO -- : make[2]: Entering directory '/tmp/ruby/build/trunk' I, [2024-05-17T14:34:31.804440 #2896882] INFO -- : make[2]: 'ruby' is up to date. I, [2024-05-17T14:34:31.804521 #2896882] INFO -- : make[2]: Leaving directory '/tmp/ruby/build/trunk' I, [2024-05-17T14:34:31.804847 #2896882] INFO -- : make[1]: Leaving directory '/tmp/ruby/build/trunk' I, [2024-05-17T14:34:31.808740 #2896882] INFO -- : make[1]: Entering directory '/tmp/ruby/build/trunk' I, [2024-05-17T14:34:31.808815 #2896882] INFO -- : make[1]: Nothing to be done for 'note'. I, [2024-05-17T14:34:31.808834 #2896882] INFO -- : make[1]: Leaving directory '/tmp/ruby/build/trunk' I, [2024-05-17T14:34:31.885510 #2896882] INFO -- : Run options: I, [2024-05-17T14:34:31.885606 #2896882] INFO -- : --seed=44931 I, [2024-05-17T14:34:31.885620 #2896882] INFO -- : "--ruby=./miniruby -I/tmp/ruby/src/trunk/lib -I. -I.ext/common /tmp/ruby/src/trunk/tool/runruby.rb --extout=.ext -- --disable-gems" I, [2024-05-17T14:34:31.885634 #2896882] INFO -- : --excludes-dir=/tmp/ruby/src/trunk/test/.excludes I, [2024-05-17T14:34:31.885645 #2896882] INFO -- : --name=!/memory_leak/ I, [2024-05-17T14:34:31.885655 #2896882] INFO -- : --stderr-on-failure I, [2024-05-17T14:34:31.885666 #2896882] INFO -- : -j20 I, [2024-05-17T14:34:31.885677 #2896882] INFO -- : I, [2024-05-17T14:34:31.885687 #2896882] INFO -- : # Running tests: I, [2024-05-17T14:34:31.885699 #2896882] INFO -- : I, [2024-05-17T14:34:32.034047 #2896882] INFO -- : [ 1/885] 2938261=constant_path_node_test I, [2024-05-17T14:34:32.034123 #2896882] INFO -- : [ 2/885] 2938246=test_ssl I, [2024-05-17T14:34:32.034398 #2896882] INFO -- : [ 3/885] 2938247=test_gem_ext_cargo_builder I, [2024-05-17T14:34:32.034444 #2896882] INFO -- : [ 4/885] 2938248=test_module I, [2024-05-17T14:34:32.034455 #2896882] INFO -- : [ 5/885] 2938249=test_gem_request_set I, [2024-05-17T14:34:32.036976 #2896882] INFO -- : [ 6/885] 2938250=test_method_name_check I, [2024-05-17T14:34:32.037512 #2896882] INFO -- : [ 7/885] 2938260=test_arith_seq_extract I, [2024-05-17T14:34:32.037596 #2896882] INFO -- : [ 8/885] 2938262=test_parser I, [2024-05-17T14:34:32.037917 #2896882] INFO -- : [ 9/885] 2938263=test_configuration I, [2024-05-17T14:34:32.037944 #2896882] INFO -- : [ 10/885] 2938258=test_rubyvm I, [2024-05-17T14:34:32.040332 #2896882] INFO -- : [ 11/885] 2938259=test_monitor I, [2024-05-17T14:34:32.044878 #2896882] INFO -- : [ 12/885] 2938258=test_buffered_io I, [2024-05-17T14:34:32.057400 #2896882] INFO -- : [ 13/885] 2938250=test_whileuntil I, [2024-05-17T14:34:32.059705 #2896882] INFO -- : [ 14/885] 2938250=test_rdoc_generator_markup I, [2024-05-17T14:34:32.068431 #2896882] INFO -- : [ 15/885] 2938261=test_boolean I, [2024-05-17T14:34:32.068489 #2896882] INFO -- : [ 16/885] 2938251=test_stringify_symbols I, [2024-05-17T14:34:32.068936 #2896882] INFO -- : [ 17/885] 2938252=integer_parse_test I, [2024-05-17T14:34:32.069049 #2896882] INFO -- : [ 18/885] 2938256=test_instrumentation_api I, [2024-05-17T14:34:32.069141 #2896882] INFO -- : [ 19/885] 2938255=test_gem_dependency_list I, [2024-05-17T14:34:32.069234 #2896882] INFO -- : [ 20/885] 2938257=test_benchmark I, [2024-05-17T14:34:32.069544 #2896882] INFO -- : [ 21/885] 2938264=test_win32ole_method_event I, [2024-05-17T14:34:32.072928 #2896882] INFO -- : [ 22/885] 2938264=test_nesting_parser I, [2024-05-17T14:34:32.076426 #2896882] INFO -- : [ 23/885] 2938254=test_gem_source I, [2024-05-17T14:34:32.078778 #2896882] INFO -- : [ 24/885] 2938251=test_scalar_scanner I, [2024-05-17T14:34:32.078844 #2896882] INFO -- : [ 25/885] 2938245=test_gem_commands_outdated_command I, [2024-05-17T14:34:32.081615 #2896882] INFO -- : [ 26/885] 2938262=test_array I, [2024-05-17T14:34:32.087784 #2896882] INFO -- : [ 27/885] 2938261=test_helper_method I, [2024-05-17T14:34:32.100092 #2896882] INFO -- : [ 28/885] 2938253=test_gem_package_tar_writer I, [2024-05-17T14:34:32.127469 #2896882] INFO -- : [ 29/885] 2938251=test_abi I, [2024-05-17T14:34:32.144932 #2896882] INFO -- : [ 30/885] 2938263=test_provider I, [2024-05-17T14:34:32.157994 #2896882] INFO -- : [ 31/885] 2938252=test_rdoc_parser_simple I, [2024-05-17T14:34:32.158840 #2896882] INFO -- : [ 32/885] 2938250=test_load I, [2024-05-17T14:34:32.163585 #2896882] INFO -- : [ 33/885] 2938250=test_yamldbm I, [2024-05-17T14:34:32.176651 #2896882] INFO -- : [ 34/885] 2938258=test_gem_commands_rebuild_command I, [2024-05-17T14:34:32.176888 #2896882] INFO -- : [ 35/885] 2938250=test_https I, [2024-05-17T14:34:32.195673 #2896882] INFO -- : [ 36/885] 2938261=test_gem_ext_builder I, [2024-05-17T14:34:32.226517 #2896882] INFO -- : [ 37/885] 2938264=test_evaluation I, [2024-05-17T14:34:32.227441 #2896882] INFO -- : [ 38/885] 2938247=test_erb I, [2024-05-17T14:34:32.230594 #2896882] INFO -- : [ 39/885] 2938264=test_x509ext I, [2024-05-17T14:34:32.249794 #2896882] INFO -- : [ 40/885] 2938259=test_gem_source_installed I, [2024-05-17T14:34:32.259925 #2896882] INFO -- : [ 41/885] 2938251=test_len I, [2024-05-17T14:34:32.261516 #2896882] INFO -- : [ 42/885] 2938251=test_yield_block I, [2024-05-17T14:34:32.264643 #2896882] INFO -- : [ 43/885] 2938251=test_gem_commands_cert_command I, [2024-05-17T14:34:32.265782 #2896882] INFO -- : [ 44/885] 2938260=test_completion I, [2024-05-17T14:34:32.279334 #2896882] INFO -- : [ 45/885] 2938247=test_rational I, [2024-05-17T14:34:32.298305 #2896882] INFO -- : [ 46/885] 2938247=test_rational2 I, [2024-05-17T14:34:32.299979 #2896882] INFO -- : [ 47/885] 2938253=test_assembler I, [2024-05-17T14:34:32.301703 #2896882] INFO -- : [ 48/885] 2938253=test_spell_checker I, [2024-05-17T14:34:32.304649 #2896882] INFO -- : [ 49/885] 2938264=test_propertyputref I, [2024-05-17T14:34:32.306909 #2896882] INFO -- : [ 50/885] 2938264=attribute_write_test I, [2024-05-17T14:34:32.312992 #2896882] INFO -- : [ 51/885] 2938247=test_float I, [2024-05-17T14:34:32.314122 #2896882] INFO -- : [ 52/885] 2938253=test_require I, [2024-05-17T14:34:32.316481 #2896882] INFO -- : [ 53/885] 2938245=test_cgi_cookie I, [2024-05-17T14:34:32.331267 #2896882] INFO -- : [ 54/885] 2938245=test_regex_casefold I, [2024-05-17T14:34:32.346473 #2896882] INFO -- : [ 55/885] 2938255=test_refinement I, [2024-05-17T14:34:32.353804 #2896882] INFO -- : [ 56/885] 2938252=test_gem_commands_signout_command I, [2024-05-17T14:34:32.357636 #2896882] INFO -- : [ 57/885] 2938264=test_gem_source_git I, [2024-05-17T14:34:32.385486 #2896882] INFO -- : [ 58/885] 2938258=test_dir_m17n I, [2024-05-17T14:34:32.465127 #2896882] INFO -- : [ 59/885] 2938259=test_gem_resolver_installer_set I, [2024-05-17T14:34:32.485411 #2896882] INFO -- : [ 60/885] 2938249=test_rdoc_rd I, [2024-05-17T14:34:32.551711 #2896882] INFO -- : [ 61/885] 2938263=test_cgi_session I, [2024-05-17T14:34:32.572911 #2896882] INFO -- : [ 62/885] 2938263=test_rdoc_top_level I, [2024-05-17T14:34:32.586699 #2896882] INFO -- : [ 63/885] 2938252=test_metaclass I, [2024-05-17T14:34:32.590861 #2896882] INFO -- : [ 64/885] 2938252=test_fixnum I, [2024-05-17T14:34:32.596312 #2896882] INFO -- : [ 65/885] 2938254=test_signal I, [2024-05-17T14:34:32.602725 #2896882] INFO -- : [ 66/885] 2938252=test_x509crl I, [2024-05-17T14:34:32.613095 #2896882] INFO -- : [ 67/885] 2938250=test_process I, [2024-05-17T14:34:32.631360 #2896882] INFO -- : [ 68/885] 2938250=test_input_method I, [2024-05-17T14:34:32.632120 #2896882] INFO -- : [ 69/885] 2938249=test_windows_1252 I, [2024-05-17T14:34:32.636126 #2896882] INFO -- : [ 70/885] 2938259=test_digest_extend I, [2024-05-17T14:34:32.640343 #2896882] INFO -- : [ 71/885] 2938249=test_iterator I, [2024-05-17T14:34:32.660530 #2896882] INFO -- : [ 72/885] 2938259=test_string I, [2024-05-17T14:34:32.662558 #2896882] INFO -- : [ 73/885] 2938259=test_omap I, [2024-05-17T14:34:32.668702 #2896882] INFO -- : [ 74/885] 2938259=test_debug I, [2024-05-17T14:34:32.673623 #2896882] INFO -- : [ 75/885] 2938259=test_memory_view I, [2024-05-17T14:34:32.687090 #2896882] INFO -- : [ 76/885] 2938245=pattern_test I, [2024-05-17T14:34:32.697317 #2896882] INFO -- : [ 77/885] 2938259=test_shellwords I, [2024-05-17T14:34:32.699534 #2896882] INFO -- : [ 78/885] 2938259=test_new I, [2024-05-17T14:34:32.705105 #2896882] INFO -- : [ 79/885] 2938259=test_cipher I, [2024-05-17T14:34:32.715851 #2896882] INFO -- : [ 80/885] 2938249=test_gem_security_signer I, [2024-05-17T14:34:32.754214 #2896882] INFO -- : [ 81/885] 2938245=test_storage I, [2024-05-17T14:34:32.755383 #2896882] INFO -- : [ 82/885] 2938259=test_gem_resolver_git_set I, [2024-05-17T14:34:32.756735 #2896882] INFO -- : [ 83/885] 2938245=test_win32ole_variant_outarg I, [2024-05-17T14:34:32.760930 #2896882] INFO -- : [ 84/885] 2938245=test_dln I, [2024-05-17T14:34:32.764978 #2896882] INFO -- : [ 85/885] 2938245=test_gem_source_subpath_problem I, [2024-05-17T14:34:32.789235 #2896882] INFO -- : [ 86/885] 2938250=json_common_interface_test I, [2024-05-17T14:34:32.790529 #2896882] INFO -- : [ 87/885] 2938252=test_nomethod_error I, [2024-05-17T14:34:32.793006 #2896882] INFO -- : [ 88/885] 2938252=json_parser_test I, [2024-05-17T14:34:32.807224 #2896882] INFO -- : [ 89/885] 2938249=memsize_test I, [2024-05-17T14:34:32.809214 #2896882] INFO -- : [ 90/885] 2938250=test_config I, [2024-05-17T14:34:32.833911 #2896882] INFO -- : [ 91/885] 2938252=test_pkg_config I, [2024-05-17T14:34:32.839480 #2896882] INFO -- : [ 92/885] 2938250=test_cparser I, [2024-05-17T14:34:32.857945 #2896882] INFO -- : [ 93/885] 2938245=test_struct I, [2024-05-17T14:34:32.859411 #2896882] INFO -- : [ 94/885] 2938252=magic_comment_test I, [2024-05-17T14:34:32.862216 #2896882] INFO -- : [ 95/885] 2938252=test_rdoc_markup_to_html_snippet I, [2024-05-17T14:34:32.868342 #2896882] INFO -- : [ 96/885] 2938245=fuzzer_test I, [2024-05-17T14:34:32.874710 #2896882] INFO -- : [ 97/885] 2938245=test_rdoc_markup_include I, [2024-05-17T14:34:32.904239 #2896882] INFO -- : [ 98/885] 2938249=test_sexp I, [2024-05-17T14:34:32.920955 #2896882] INFO -- : [ 99/885] 2938249=test_variable I, [2024-05-17T14:34:32.925118 #2896882] INFO -- : [100/885] 2938252=test_allocation I, [2024-05-17T14:34:32.950843 #2896882] INFO -- : [101/885] 2938260=test_div I, [2024-05-17T14:34:32.952621 #2896882] INFO -- : [102/885] 2938260=test_win32ole_variant_m I, [2024-05-17T14:34:32.958097 #2896882] INFO -- : [103/885] 2938260=test_engine I, [2024-05-17T14:34:32.966030 #2896882] INFO -- : [104/885] 2938264=test_key_error I, [2024-05-17T14:34:32.970372 #2896882] INFO -- : [105/885] 2938264=test_insns_leaf I, [2024-05-17T14:34:32.971547 #2896882] INFO -- : [106/885] 2938264=test_serialize_subclasses I, [2024-05-17T14:34:32.978607 #2896882] INFO -- : [107/885] 2938260=test_deprecated I, [2024-05-17T14:34:32.982770 #2896882] INFO -- : [108/885] 2938245=test_color_printer I, [2024-05-17T14:34:32.991187 #2896882] INFO -- : [109/885] 2938264=test_files_test_1 I, [2024-05-17T14:34:32.993060 #2896882] INFO -- : [110/885] 2938260=test_set I, [2024-05-17T14:34:33.015436 #2896882] INFO -- : [111/885] 2938260=test_struct I, [2024-05-17T14:34:33.031651 #2896882] INFO -- : [112/885] 2938245=test_gem_path_support I, [2024-05-17T14:34:33.034292 #2896882] INFO -- : [113/885] 2938259=test_mutex I, [2024-05-17T14:34:33.040118 #2896882] INFO -- : [114/885] 2938249=test_x509req I, [2024-05-17T14:34:33.054251 #2896882] INFO -- : [115/885] 2938245=test_rdoc_rd_inline I, [2024-05-17T14:34:33.059326 #2896882] INFO -- : [116/885] 2938245=test_gem_commands_build_command I, [2024-05-17T14:34:33.060100 #2896882] INFO -- : [117/885] 2938263=test_interned_str I, [2024-05-17T14:34:33.067813 #2896882] INFO -- : [118/885] 2938263=test_case_comprehensive I, [2024-05-17T14:34:33.218331 #2896882] INFO -- : [119/885] 2938257=test_gem_commands_server_command I, [2024-05-17T14:34:33.233219 #2896882] INFO -- : [120/885] 2938245=test_io_m17n I, [2024-05-17T14:34:33.256511 #2896882] INFO -- : [121/885] 2938249=test_variable_name_check I, [2024-05-17T14:34:33.307401 #2896882] INFO -- : [122/885] 2938260=test_did_you_mean I, [2024-05-17T14:34:33.329132 #2896882] INFO -- : [123/885] 2938249=test_cmethod I, [2024-05-17T14:34:33.333846 #2896882] INFO -- : [124/885] 2938249=test_tracer I, [2024-05-17T14:34:33.360955 #2896882] INFO -- : [125/885] 2938257=test_append I, [2024-05-17T14:34:33.362267 #2896882] INFO -- : [126/885] 2938257=test_option I, [2024-05-17T14:34:33.385320 #2896882] INFO -- : [127/885] 2938250=test_rdoc_markup_heading I, [2024-05-17T14:34:33.389711 #2896882] INFO -- : [128/885] 2938260=test_exception_at_throwing I, [2024-05-17T14:34:33.394206 #2896882] INFO -- : [129/885] 2938250=test_iseq I, [2024-05-17T14:34:33.423444 #2896882] INFO -- : [130/885] 2938261=test_pkey_dsa I, [2024-05-17T14:34:33.444333 #2896882] INFO -- : [131/885] 2938260=test_ocsp I, [2024-05-17T14:34:33.448555 #2896882] INFO -- : [132/885] 2938257=test_class I, [2024-05-17T14:34:33.449521 #2896882] INFO -- : [133/885] 2938249=test_scheduler I, [2024-05-17T14:34:33.460334 #2896882] INFO -- : [134/885] 2938257=reflection_test I, [2024-05-17T14:34:33.512871 #2896882] INFO -- : [135/885] 2938248=test_emoji_breaks I, [2024-05-17T14:34:33.519984 #2896882] INFO -- : [136/885] 2938248=test_gem_bundler_version_finder I, [2024-05-17T14:34:33.524847 #2896882] INFO -- : [137/885] 2938257=test_within_pipe I, [2024-05-17T14:34:33.606629 #2896882] INFO -- : [138/885] 2938249=test_help I, [2024-05-17T14:34:33.607629 #2896882] INFO -- : [139/885] 2938249=test_rdoc_markup_to_bs I, [2024-05-17T14:34:33.613879 #2896882] INFO -- : [140/885] 2938257=test_files_lib I, [2024-05-17T14:34:33.622547 #2896882] INFO -- : [141/885] 2938247=test_gem_commands_unpack_command I, [2024-05-17T14:34:33.644372 #2896882] INFO -- : [142/885] 2938249=test_beginendblock I, [2024-05-17T14:34:33.686821 #2896882] INFO -- : [143/885] 2938260=test_to_ary_concat I, [2024-05-17T14:34:33.711599 #2896882] INFO -- : [144/885] 2938248=test_time I, [2024-05-17T14:34:33.738090 #2896882] INFO -- : [145/885] 2938258=test_webauthn_listener_response I, [2024-05-17T14:34:33.749589 #2896882] INFO -- : [146/885] 2938258=test_stream I, [2024-05-17T14:34:33.754423 #2896882] INFO -- : [147/885] 2938258=test_rdoc_markup_pre_process I, [2024-05-17T14:34:33.927863 #2896882] INFO -- : [148/885] 2938248=test_printf I, [2024-05-17T14:34:33.944724 #2896882] INFO -- : [149/885] 2938248=test_pinned I, [2024-05-17T14:34:33.957746 #2896882] INFO -- : [150/885] 2938258=test_history I, [2024-05-17T14:34:33.969946 #2896882] INFO -- : [151/885] 2938248=test_mkmf I, [2024-05-17T14:34:33.994596 #2896882] INFO -- : [152/885] 2938248=test_date_marshal I, [2024-05-17T14:34:34.003532 #2896882] INFO -- : [153/885] 2938248=test_delegate I, [2024-05-17T14:34:34.013752 #2896882] INFO -- : [154/885] 2938250=test_popen_deadlock I, [2024-05-17T14:34:34.015908 #2896882] INFO -- : [155/885] 2938247=test_exit I, [2024-05-17T14:34:34.021080 #2896882] INFO -- : [156/885] 2938248=test_recursion I, [2024-05-17T14:34:34.028457 #2896882] INFO -- : [157/885] 2938248=test_ractor I, [2024-05-17T14:34:34.053719 #2896882] INFO -- : [158/885] 2938249=test_rdoc_servlet I, [2024-05-17T14:34:34.100376 #2896882] INFO -- : [159/885] 2938247=test_gem_security I, [2024-05-17T14:34:34.106475 #2896882] INFO -- : [160/885] 2938258=test_digest I, [2024-05-17T14:34:34.108318 #2896882] INFO -- : [161/885] 2938248=test_closure I, [2024-05-17T14:34:34.129914 #2896882] INFO -- : [162/885] 2938258=test_bundled_ca I, [2024-05-17T14:34:34.133497 #2896882] INFO -- : [163/885] 2938260=test_multi_irb_commands I, [2024-05-17T14:34:34.137149 #2896882] INFO -- : [164/885] 2938260=test_fiber I, [2024-05-17T14:34:34.157284 #2896882] INFO -- : [165/885] 2938262=test_open3 I, [2024-05-17T14:34:34.166782 #2896882] INFO -- : [166/885] 2938259=test_human_typo I, [2024-05-17T14:34:34.177728 #2896882] INFO -- : [167/885] 2938259=test_primitive I, [2024-05-17T14:34:34.182182 #2896882] INFO -- : [168/885] 2938259=test_rbconfig I, [2024-05-17T14:34:34.192395 #2896882] INFO -- : [169/885] 2938259=test_pair I, [2024-05-17T14:34:34.219121 #2896882] INFO -- : [170/885] 2938249=test_win32ole_param I, [2024-05-17T14:34:34.223200 #2896882] INFO -- : [171/885] 2938249=test_gem_commands_yank_command I, [2024-05-17T14:34:34.338158 #2896882] INFO -- : [172/885] 2938248=test_document I, [2024-05-17T14:34:34.355563 #2896882] INFO -- : [173/885] 2938248=test_acceptable I, [2024-05-17T14:34:34.377877 #2896882] INFO -- : [174/885] 2938245=test_euc_jp I, [2024-05-17T14:34:34.385241 #2896882] INFO -- : [175/885] 2938245=test_rdoc_generator_pot_po_entry I, [2024-05-17T14:34:34.390785 #2896882] INFO -- : [176/885] 2938245=test_chilled I, [2024-05-17T14:34:34.397758 #2896882] INFO -- : [177/885] 2938245=test_name_error_extension I, [2024-05-17T14:34:34.418829 #2896882] INFO -- : [178/885] 2938245=test_rdoc_i18n_locale I, [2024-05-17T14:34:34.427848 #2896882] INFO -- : [179/885] 2938245=test_set_len I, [2024-05-17T14:34:34.431050 #2896882] INFO -- : [180/885] 2938245=test_httpresponses I, [2024-05-17T14:34:34.473444 #2896882] INFO -- : [181/885] 2938245=test_encoding I, [2024-05-17T14:34:34.481700 #2896882] INFO -- : [182/885] 2938245=test_httpheader I, [2024-05-17T14:34:34.484194 #2896882] INFO -- : [183/885] 2938248=test_gem_resolver_local_specification I, [2024-05-17T14:34:34.505058 #2896882] INFO -- : [184/885] 2938245=test_rdoc_ri_driver I, [2024-05-17T14:34:34.534350 #2896882] INFO -- : [185/885] 2938248=test_install I, [2024-05-17T14:34:34.621479 #2896882] INFO -- : [186/885] 2938250=test_rdoc_markup_to_label I, [2024-05-17T14:34:34.652037 #2896882] INFO -- : [187/885] 2938250=test_sockopt I, [2024-05-17T14:34:34.656435 #2896882] INFO -- : [188/885] 2938250=json_encoding_test I, [2024-05-17T14:34:34.664573 #2896882] INFO -- : [189/885] 2938254=test_color I, [2024-05-17T14:34:34.667172 #2896882] INFO -- : [190/885] 2938250=test_key_stroke I, [2024-05-17T14:34:34.670697 #2896882] INFO -- : [191/885] 2938261=test_date_compat I, [2024-05-17T14:34:34.671525 #2896882] INFO -- : [192/885] 2938261=test_rdoc_markup_to_html I, [2024-05-17T14:34:34.674304 #2896882] INFO -- : [193/885] 2938250=test_bug-14834 I, [2024-05-17T14:34:34.704532 #2896882] INFO -- : [194/885] 2938249=test_terminfo I, [2024-05-17T14:34:34.707327 #2896882] INFO -- : [195/885] 2938245=test_compile_prism I, [2024-05-17T14:34:34.707604 #2896882] INFO -- : [196/885] 2938248=test_path I, [2024-05-17T14:34:34.709413 #2896882] INFO -- : [197/885] 2938249=redundant_return_test I, [2024-05-17T14:34:34.713078 #2896882] INFO -- : [198/885] 2938249=test_case_mapping I, [2024-05-17T14:34:34.714631 #2896882] INFO -- : [199/885] 2938248=test_bn I, [2024-05-17T14:34:34.725012 #2896882] INFO -- : [200/885] 2938249=test_win32ole_param_event I, [2024-05-17T14:34:34.726317 #2896882] INFO -- : [201/885] 2938249=test_http I, [2024-05-17T14:34:34.732987 #2896882] INFO -- : [202/885] 2938248=test_addrinfo I, [2024-05-17T14:34:34.758088 #2896882] INFO -- : [203/885] 2938250=test_tree_spell_checker I, [2024-05-17T14:34:34.760786 #2896882] INFO -- : [204/885] 2938248=test_filter I, [2024-05-17T14:34:34.781897 #2896882] INFO -- : [205/885] 2938250=test_gem_gem_runner I, [2024-05-17T14:34:34.786395 #2896882] INFO -- : [206/885] 2938254=test_data I, [2024-05-17T14:34:34.789057 #2896882] INFO -- : [207/885] 2938254=static_literals_test I, [2024-05-17T14:34:34.805223 #2896882] INFO -- : [208/885] 2938253=test_rdoc_method_attr I, [2024-05-17T14:34:34.813967 #2896882] INFO -- : [209/885] 2938248=test_enumerator I, [2024-05-17T14:34:34.824027 #2896882] INFO -- : [210/885] 2938248=test_rdoc_parser_changelog I, [2024-05-17T14:34:34.839333 #2896882] INFO -- : [211/885] 2938254=parameters_signature_test I, [2024-05-17T14:34:34.848627 #2896882] INFO -- : [212/885] 2938254=test_koi8 I, [2024-05-17T14:34:34.850115 #2896882] INFO -- : [213/885] 2938254=test_unicode I, [2024-05-17T14:34:34.856514 #2896882] INFO -- : [214/885] 2938254=test_rdoc_generator_pot I, [2024-05-17T14:34:34.952609 #2896882] INFO -- : [215/885] 2938250=test_ssl_session I, [2024-05-17T14:34:34.982201 #2896882] INFO -- : [216/885] 2938261=test_lexer I, [2024-05-17T14:34:34.996164 #2896882] INFO -- : [217/885] 2938245=test_thread_cv I, [2024-05-17T14:34:34.998957 #2896882] INFO -- : [218/885] 2938261=test_gem_uri I, [2024-05-17T14:34:35.006625 #2896882] INFO -- : [219/885] 2938254=test_key_event_record I, [2024-05-17T14:34:35.008036 #2896882] INFO -- : [220/885] 2938254=test_notimplement I, [2024-05-17T14:34:35.011961 #2896882] INFO -- : [221/885] 2938254=test_random I, [2024-05-17T14:34:35.020156 #2896882] INFO -- : [222/885] 2938261=test_gem_resolver_vendor_specification I, [2024-05-17T14:34:35.021505 #2896882] INFO -- : [223/885] 2938254=test_gem_commands_update_command I, [2024-05-17T14:34:35.043129 #2896882] INFO -- : [224/885] 2938261=test_weakkeymap I, [2024-05-17T14:34:35.062268 #2896882] INFO -- : [225/885] 2938248=test_gem_commands_push_command I, [2024-05-17T14:34:35.069232 #2896882] INFO -- : [226/885] 2938256=test_numhash I, [2024-05-17T14:34:35.081104 #2896882] INFO -- : [227/885] 2938256=test_pkey_rsa I, [2024-05-17T14:34:35.137688 #2896882] INFO -- : [228/885] 2938253=test_gem_platform I, [2024-05-17T14:34:35.172048 #2896882] INFO -- : [229/885] 2938255=test_date_strptime I, [2024-05-17T14:34:35.188505 #2896882] INFO -- : [230/885] 2938258=test_gem_package_task I, [2024-05-17T14:34:35.192413 #2896882] INFO -- : [231/885] 2938258=test_placearg I, [2024-05-17T14:34:35.216739 #2896882] INFO -- : [232/885] 2938253=test_rdoc_markup_hard_break I, [2024-05-17T14:34:35.219180 #2896882] INFO -- : [233/885] 2938253=test_win32ole_method I, [2024-05-17T14:34:35.225178 #2896882] INFO -- : [234/885] 2938253=test_delete I, [2024-05-17T14:34:35.226301 #2896882] INFO -- : [235/885] 2938261=test_class_name_check I, [2024-05-17T14:34:35.230680 #2896882] INFO -- : [236/885] 2938253=test_keyword I, [2024-05-17T14:34:35.244528 #2896882] INFO -- : [237/885] 2938261=test_fd_setsize I, [2024-05-17T14:34:35.246245 #2896882] INFO -- : [238/885] 2938261=test_continuation I, [2024-05-17T14:34:35.252232 #2896882] INFO -- : [239/885] 2938261=test_file_exhaustive I, [2024-05-17T14:34:35.282294 #2896882] INFO -- : [240/885] 2938256=test_gem_update_suggestion I, [2024-05-17T14:34:35.298081 #2896882] INFO -- : [241/885] 2938258=test_files_test I, [2024-05-17T14:34:35.314148 #2896882] INFO -- : [242/885] 2938255=test_logger I, [2024-05-17T14:34:35.329703 #2896882] INFO -- : [243/885] 2938255=test_gem_resolver_lock_set I, [2024-05-17T14:34:35.357081 #2896882] INFO -- : [244/885] 2938255=test_not I, [2024-05-17T14:34:35.359524 #2896882] INFO -- : [245/885] 2938255=test_import I, [2024-05-17T14:34:35.367770 #2896882] INFO -- : [246/885] 2938258=test_rdoc_parser_markdown I, [2024-05-17T14:34:35.400221 #2896882] INFO -- : [247/885] 2938258=test_object I, [2024-05-17T14:34:35.402741 #2896882] INFO -- : [248/885] 2938258=test_cgi_header I, [2024-05-17T14:34:35.414339 #2896882] INFO -- : [249/885] 2938258=heredoc_dedent_test I, [2024-05-17T14:34:35.437153 #2896882] INFO -- : [250/885] 2938256=version_test I, [2024-05-17T14:34:35.468028 #2896882] INFO -- : [251/885] 2938264=test_gem_gemcutter_utilities I, [2024-05-17T14:34:35.490805 #2896882] INFO -- : [252/885] 2938251=test_basicinstructions I, [2024-05-17T14:34:35.505883 #2896882] INFO -- : [253/885] 2938248=test_gem_command_manager I, [2024-05-17T14:34:35.506637 #2896882] INFO -- : [254/885] 2938258=test_key_actor_emacs I, [2024-05-17T14:34:35.511721 #2896882] INFO -- : [255/885] 2938256=test_arithmetic_sequence I, [2024-05-17T14:34:35.521413 #2896882] INFO -- : [256/885] 2938256=test_timeout I, [2024-05-17T14:34:35.528029 #2896882] INFO -- : [257/885] 2938256=test_ossl I, [2024-05-17T14:34:35.551031 #2896882] INFO -- : [258/885] 2938251=test_normalize I, [2024-05-17T14:34:35.552949 #2896882] INFO -- : [259/885] 2938251=test_change_word I, [2024-05-17T14:34:35.562969 #2896882] INFO -- : [260/885] 2938251=compiler_test I, [2024-05-17T14:34:35.597055 #2896882] INFO -- : [261/885] 2938248=test_flip I, [2024-05-17T14:34:35.611051 #2896882] INFO -- : [262/885] 2938248=test_sleep I, [2024-05-17T14:34:35.613835 #2896882] INFO -- : [263/885] 2938251=test_date_arith I, [2024-05-17T14:34:35.624241 #2896882] INFO -- : [264/885] 2938258=test_ruby_lex I, [2024-05-17T14:34:35.631134 #2896882] INFO -- : [265/885] 2938245=test_object I, [2024-05-17T14:34:35.636687 #2896882] INFO -- : [266/885] 2938251=test_gem_local_remote_options I, [2024-05-17T14:34:35.654229 #2896882] INFO -- : [267/885] 2938252=test_pointer I, [2024-05-17T14:34:35.677289 #2896882] INFO -- : [268/885] 2938251=test_func I, [2024-05-17T14:34:35.692228 #2896882] INFO -- : [269/885] 2938253=test_big5 I, [2024-05-17T14:34:35.698115 #2896882] INFO -- : [270/885] 2938253=test_ractor I, [2024-05-17T14:34:35.712517 #2896882] INFO -- : [271/885] 2938255=test_type I, [2024-05-17T14:34:35.714657 #2896882] INFO -- : [272/885] 2938255=test_signedness I, [2024-05-17T14:34:35.769164 #2896882] INFO -- : [273/885] 2938258=test_tsort I, [2024-05-17T14:34:35.772525 #2896882] INFO -- : [274/885] 2938253=test_rdoc_rd_block_parser I, [2024-05-17T14:34:35.774879 #2896882] INFO -- : [275/885] 2938258=errors_test I, [2024-05-17T14:34:35.806990 #2896882] INFO -- : [276/885] 2938253=test_gem_commands_check_command I, [2024-05-17T14:34:35.822840 #2896882] INFO -- : [277/885] 2938264=test_regexp I, [2024-05-17T14:34:35.840377 #2896882] INFO -- : [278/885] 2938253=test_rdoc_markup_document I, [2024-05-17T14:34:35.848914 #2896882] INFO -- : [279/885] 2938253=test_integer_comb I, [2024-05-17T14:34:35.867328 #2896882] INFO -- : [280/885] 2938258=test_tmpdir I, [2024-05-17T14:34:35.907747 #2896882] INFO -- : [281/885] 2938245=test_vm_dump I, [2024-05-17T14:34:35.907879 #2896882] INFO -- : [282/885] 2938245=test_udp I, [2024-05-17T14:34:35.943586 #2896882] INFO -- : [283/885] 2938245=test_data_error I, [2024-05-17T14:34:35.978752 #2896882] INFO -- : [284/885] 2938258=bom_test I, [2024-05-17T14:34:35.990826 #2896882] INFO -- : [285/885] 2938258=test_file I, [2024-05-17T14:34:36.044583 #2896882] INFO -- : [286/885] 2938245=test_force_exit I, [2024-05-17T14:34:36.072384 #2896882] INFO -- : [287/885] 2938254=unescape_test I, [2024-05-17T14:34:36.077280 #2896882] INFO -- : [288/885] 2938250=test_ostruct I, [2024-05-17T14:34:36.081809 #2896882] INFO -- : [289/885] 2938252=static_inspect_test I, [2024-05-17T14:34:36.082078 #2896882] INFO -- : [290/885] 2938252=test_helper I, [2024-05-17T14:34:36.082330 #2896882] INFO -- : [291/885] 2938252=test_erb_command I, [2024-05-17T14:34:36.114666 #2896882] INFO -- : [292/885] 2938252=test_encoding I, [2024-05-17T14:34:36.114737 #2896882] INFO -- : [293/885] 2938245=test_gem_uri_formatter I, [2024-05-17T14:34:36.131881 #2896882] INFO -- : [294/885] 2938245=test_project_sanity I, [2024-05-17T14:34:36.198359 #2896882] INFO -- : [295/885] 2938245=test_range I, [2024-05-17T14:34:36.257900 #2896882] INFO -- : [296/885] 2938252=test_constant I, [2024-05-17T14:34:36.264397 #2896882] INFO -- : [297/885] 2938250=test_pty I, [2024-05-17T14:34:36.387550 #2896882] INFO -- : [298/885] 2938251=test_dup I, [2024-05-17T14:34:36.492610 #2896882] INFO -- : [299/885] 2938262=command_line_test I, [2024-05-17T14:34:36.504209 #2896882] INFO -- : [300/885] 2938251=test_rdoc_ri_paths I, [2024-05-17T14:34:36.549524 #2896882] INFO -- : [301/885] 2938262=test_ensured I, [2024-05-17T14:34:36.606829 #2896882] INFO -- : [302/885] 2938262=library_symbols_test I, [2024-05-17T14:34:36.609319 #2896882] INFO -- : [303/885] 2938262=test_locale I, [2024-05-17T14:34:36.625208 #2896882] INFO -- : [304/885] 2938251=test_addr I, [2024-05-17T14:34:36.638982 #2896882] INFO -- : [305/885] 2938251=test_ts I, [2024-05-17T14:34:36.714579 #2896882] INFO -- : [306/885] 2938257=test_enumerable I, [2024-05-17T14:34:36.718518 #2896882] INFO -- : [307/885] 2938257=test_config I, [2024-05-17T14:34:36.739738 #2896882] INFO -- : [308/885] 2938262=test_gem_resolver_vendor_set I, [2024-05-17T14:34:36.741838 #2896882] INFO -- : [309/885] 2938245=test_gem_resolver_api_set I, [2024-05-17T14:34:36.765376 #2896882] INFO -- : [310/885] 2938250=test_gem_safe_marshal I, [2024-05-17T14:34:36.803674 #2896882] INFO -- : [311/885] 2938245=test_transcode I, [2024-05-17T14:34:36.956794 #2896882] INFO -- : [312/885] 2938262=json_generator_test I, [2024-05-17T14:34:37.003031 #2896882] INFO -- : [313/885] 2938245=test_eval I, [2024-05-17T14:34:37.028610 #2896882] INFO -- : [314/885] 2938251=test_x509store I, [2024-05-17T14:34:37.030677 #2896882] INFO -- : [315/885] 2938257=test_rdoc_code_object I, [2024-05-17T14:34:37.059431 #2896882] INFO -- : [316/885] 2938262=test_update I, [2024-05-17T14:34:37.061461 #2896882] INFO -- : [317/885] 2938262=test_fips I, [2024-05-17T14:34:37.211106 #2896882] INFO -- : [318/885] 2938250=test_x509name I, [2024-05-17T14:34:37.220891 #2896882] INFO -- : [319/885] 2938250=test_random_formatter I, [2024-05-17T14:34:37.223477 #2896882] INFO -- : [320/885] 2938251=test_helper I, [2024-05-17T14:34:37.223605 #2896882] INFO -- : [321/885] 2938251=test_jaro_winkler I, [2024-05-17T14:34:37.230666 #2896882] INFO -- : [322/885] 2938251=test_gem_request_set_gem_dependency_api I, [2024-05-17T14:34:37.239626 #2896882] INFO -- : [323/885] 2938250=test_ast I, [2024-05-17T14:34:37.262629 #2896882] INFO -- : [324/885] 2938245=test_lambda I, [2024-05-17T14:34:37.295707 #2896882] INFO -- : [325/885] 2938262=test_webauthn_listener I, [2024-05-17T14:34:37.338534 #2896882] INFO -- : [326/885] 2938245=test_call I, [2024-05-17T14:34:37.349975 #2896882] INFO -- : [327/885] 2938262=test_https_proxy I, [2024-05-17T14:34:37.360288 #2896882] INFO -- : [328/885] 2938251=test_rubygems I, [2024-05-17T14:34:37.383879 #2896882] INFO -- : [329/885] 2938262=test_cgi_modruby I, [2024-05-17T14:34:37.394894 #2896882] INFO -- : [330/885] 2938262=test_integer I, [2024-05-17T14:34:37.413816 #2896882] INFO -- : [331/885] 2938257=test_super I, [2024-05-17T14:34:37.422362 #2896882] INFO -- : [332/885] 2938245=test_rubyoptions I, [2024-05-17T14:34:37.475706 #2896882] INFO -- : [333/885] 2938259=test_gem_resolver_git_specification I, [2024-05-17T14:34:37.499922 #2896882] INFO -- : [334/885] 2938251=test_object_references I, [2024-05-17T14:34:37.506325 #2896882] INFO -- : [335/885] 2938251=test_usrmarshal I, [2024-05-17T14:34:37.658589 #2896882] INFO -- : [336/885] 2938259=test_nextafter I, [2024-05-17T14:34:37.703555 #2896882] INFO -- : [337/885] 2938259=test_capacity I, [2024-05-17T14:34:37.707666 #2896882] INFO -- : [338/885] 2938259=test_stat I, [2024-05-17T14:34:37.718894 #2896882] INFO -- : [339/885] 2938259=test_gem_request_set_lockfile_tokenizer I, [2024-05-17T14:34:37.722810 #2896882] INFO -- : [340/885] 2938251=test_have_func I, [2024-05-17T14:34:37.746379 #2896882] INFO -- : [341/885] 2938259=test_integer I, [2024-05-17T14:34:37.772705 #2896882] INFO -- : [342/885] 2938257=desugar_compiler_test I, [2024-05-17T14:34:37.773850 #2896882] INFO -- : [343/885] 2938257=test_dryrun I, [2024-05-17T14:34:37.783746 #2896882] INFO -- : [344/885] 2938259=test_rdoc_attr I, [2024-05-17T14:34:37.790036 #2896882] INFO -- : [345/885] 2938257=test_env I, [2024-05-17T14:34:37.895943 #2896882] INFO -- : [346/885] 2938259=test_gem_commands_setup_command I, [2024-05-17T14:34:37.977873 #2896882] INFO -- : [347/885] 2938255=test_parser I, [2024-05-17T14:34:37.989450 #2896882] INFO -- : [348/885] 2938255=test_cgi_core I, [2024-05-17T14:34:38.002531 #2896882] INFO -- : [349/885] 2938255=test_ractor I, [2024-05-17T14:34:38.023163 #2896882] INFO -- : [350/885] 2938255=test_gem_commands_open_command I, [2024-05-17T14:34:38.039357 #2896882] INFO -- : [351/885] 2938254=test_dns I, [2024-05-17T14:34:38.073876 #2896882] INFO -- : [352/885] 2938255=test_gem_source_lock I, [2024-05-17T14:34:38.103926 #2896882] INFO -- : [353/885] 2938255=test_gem I, [2024-05-17T14:34:38.202305 #2896882] INFO -- : [354/885] 2938259=parse_stream_test I, [2024-05-17T14:34:38.252311 #2896882] INFO -- : [355/885] 2938259=test_registry I, [2024-05-17T14:34:38.283593 #2896882] INFO -- : [356/885] 2938259=test_ractor I, [2024-05-17T14:34:38.407639 #2896882] INFO -- : [357/885] 2938252=test_my_integer I, [2024-05-17T14:34:38.412271 #2896882] INFO -- : [358/885] 2938252=json_ext_parser_test I, [2024-05-17T14:34:38.418945 #2896882] INFO -- : [359/885] 2938252=test_thread I, [2024-05-17T14:34:38.458752 #2896882] INFO -- : [360/885] 2938253=test_debugger_integration I, [2024-05-17T14:34:38.460864 #2896882] INFO -- : [361/885] 2938253=test_rendering I, [2024-05-17T14:34:38.522498 #2896882] INFO -- : [362/885] 2938259=test_ssl I, [2024-05-17T14:34:38.522911 #2896882] INFO -- : [363/885] 2938253=test_ancdata I, [2024-05-17T14:34:38.532838 #2896882] INFO -- : [364/885] 2938253=test_singleton_function I, [2024-05-17T14:34:38.533937 #2896882] INFO -- : [365/885] 2938253=test_rb_str_dup I, [2024-05-17T14:34:38.536162 #2896882] INFO -- : [366/885] 2938254=test_reline_key I, [2024-05-17T14:34:38.537607 #2896882] INFO -- : [367/885] 2938253=test_marshal I, [2024-05-17T14:34:38.552286 #2896882] INFO -- : [368/885] 2938254=test_unicode_normalize I, [2024-05-17T14:34:38.829347 #2896882] INFO -- : [369/885] 2938251=test_weakref I, [2024-05-17T14:34:38.939800 #2896882] INFO -- : [370/885] 2938253=test_nonblock I, [2024-05-17T14:34:38.945239 #2896882] INFO -- : [371/885] 2938253=test_alias I, [2024-05-17T14:34:38.984663 #2896882] INFO -- : [372/885] 2938251=test_timeout I, [2024-05-17T14:34:38.988148 #2896882] INFO -- : [373/885] 2938259=test_rdoc_generator_json_index I, [2024-05-17T14:34:39.052721 #2896882] INFO -- : [374/885] 2938259=test_time_tz I, [2024-05-17T14:34:39.074036 #2896882] INFO -- : [375/885] 2938253=test_win32ole_event I, [2024-05-17T14:34:39.077591 #2896882] INFO -- : [376/885] 2938253=ractor_test I, [2024-05-17T14:34:39.121686 #2896882] INFO -- : [377/885] 2938259=test_trace I, [2024-05-17T14:34:39.138651 #2896882] INFO -- : [378/885] 2938259=test_win32ole_variable I, [2024-05-17T14:34:39.142772 #2896882] INFO -- : [379/885] 2938259=test_arity I, [2024-05-17T14:34:39.151565 #2896882] INFO -- : [380/885] 2938259=test_stringio I, [2024-05-17T14:34:39.165346 #2896882] INFO -- : [381/885] 2938253=test_io_wait_uncommon I, [2024-05-17T14:34:39.169917 #2896882] INFO -- : [382/885] 2938253=test_bignum I, [2024-05-17T14:34:39.234061 #2896882] INFO -- : [383/885] 2938259=test_rdoc_class_module I, [2024-05-17T14:34:39.272754 #2896882] INFO -- : [384/885] 2938253=test_gem_ci_detector I, [2024-05-17T14:34:39.278909 #2896882] INFO -- : [385/885] 2938253=test_threadgroup I, [2024-05-17T14:34:39.663913 #2896882] INFO -- : [386/885] 2938251=test_gem_specification I, [2024-05-17T14:34:39.789527 #2896882] INFO -- : [387/885] 2938255=test_enum I, [2024-05-17T14:34:39.871778 #2896882] INFO -- : [388/885] 2938260=test_have_macro I, [2024-05-17T14:34:39.893444 #2896882] INFO -- : [389/885] 2938259=test_resolve_symbol I, [2024-05-17T14:34:39.952984 #2896882] INFO -- : [390/885] 2938259=test_complex2 I, [2024-05-17T14:34:39.976746 #2896882] INFO -- : [391/885] 2938259=test_gem_package I, [2024-05-17T14:34:40.016904 #2896882] INFO -- : [392/885] 2938257=test_merge_keys I, [2024-05-17T14:34:40.023308 #2896882] INFO -- : [393/885] 2938257=test_rdoc_extend I, [2024-05-17T14:34:40.048492 #2896882] INFO -- : [394/885] 2938257=test_ipaddr I, [2024-05-17T14:34:40.073194 #2896882] INFO -- : [395/885] 2938257=test_history I, [2024-05-17T14:34:40.077746 #2896882] INFO -- : [396/885] 2938257=test_mixed_unicode_escapes I, [2024-05-17T14:34:40.080851 #2896882] INFO -- : [397/885] 2938257=test_rdoc_markup_to_ansi I, [2024-05-17T14:34:40.127923 #2896882] INFO -- : [398/885] 2938257=test_win32ole_variant I, [2024-05-17T14:34:40.129686 #2896882] INFO -- : [399/885] 2938257=test_gem_resolver_api_specification I, [2024-05-17T14:34:40.140539 #2896882] INFO -- : [400/885] 2938262=test_cgi_multipart I, [2024-05-17T14:34:40.196533 #2896882] INFO -- : [401/885] 2938257=test_word I, [2024-05-17T14:34:40.198903 #2896882] INFO -- : [402/885] 2938257=test_gem_commands_cleanup_command I, [2024-05-17T14:34:40.260839 #2896882] INFO -- : [403/885] 2938260=test_numeric I, [2024-05-17T14:34:40.264525 #2896882] INFO -- : [404/885] 2938260=test_member I, [2024-05-17T14:34:40.268618 #2896882] INFO -- : [405/885] 2938260=test_ractor_compatibility I, [2024-05-17T14:34:40.279885 #2896882] INFO -- : [406/885] 2938253=test_dir I, [2024-05-17T14:34:40.291024 #2896882] INFO -- : [407/885] 2938262=format_errors_test I, [2024-05-17T14:34:40.293743 #2896882] INFO -- : [408/885] 2938262=test_date_ractor I, [2024-05-17T14:34:40.296989 #2896882] INFO -- : [409/885] 2938246=test_gem_console_ui I, [2024-05-17T14:34:40.419503 #2896882] INFO -- : [410/885] 2938259=test_autoconf I, [2024-05-17T14:34:40.423373 #2896882] INFO -- : [411/885] 2938259=test_eval I, [2024-05-17T14:34:40.425540 #2896882] INFO -- : [412/885] 2938259=test_mailto I, [2024-05-17T14:34:40.433040 #2896882] INFO -- : [413/885] 2938259=test_coderange I, [2024-05-17T14:34:40.433411 #2896882] INFO -- : [414/885] 2938246=location_test I, [2024-05-17T14:34:40.438095 #2896882] INFO -- : [415/885] 2938259=test_symbol I, [2024-05-17T14:34:40.444336 #2896882] INFO -- : [416/885] 2938259=test_http_request I, [2024-05-17T14:34:40.446364 #2896882] INFO -- : [417/885] 2938259=test_gem_source_fetch_problem I, [2024-05-17T14:34:40.455053 #2896882] INFO -- : [418/885] 2938259=json_generic_object_test I, [2024-05-17T14:34:40.465536 #2896882] INFO -- : [419/885] 2938259=test_rdoc_generator_darkfish I, [2024-05-17T14:34:40.519568 #2896882] INFO -- : [420/885] 2938246=test_rdoc_comment I, [2024-05-17T14:34:40.565331 #2896882] INFO -- : [421/885] 2938253=test_resize I, [2024-05-17T14:34:40.566931 #2896882] INFO -- : [422/885] 2938253=test_error_highlight I, [2024-05-17T14:34:40.587536 #2896882] INFO -- : [423/885] 2938262=test_function_entry I, [2024-05-17T14:34:40.592342 #2896882] INFO -- : [424/885] 2938262=test_gem_resolver_requirement_list I, [2024-05-17T14:34:40.596418 #2896882] INFO -- : [425/885] 2938262=test_arith_seq_beg_len_step I, [2024-05-17T14:34:40.614416 #2896882] INFO -- : [426/885] 2938248=test_pkcs7 I, [2024-05-17T14:34:40.626472 #2896882] INFO -- : [427/885] 2938257=test_lazy_enumerator I, [2024-05-17T14:34:40.637418 #2896882] INFO -- : [428/885] 2938260=test_enc_associate I, [2024-05-17T14:34:40.667333 #2896882] INFO -- : [429/885] 2938262=test_unix I, [2024-05-17T14:34:40.669687 #2896882] INFO -- : [430/885] 2938246=test_coder I, [2024-05-17T14:34:40.692504 #2896882] INFO -- : [431/885] 2938246=test_symbol I, [2024-05-17T14:34:40.698925 #2896882] INFO -- : [432/885] 2938262=test_gem_commands_pristine_command I, [2024-05-17T14:34:40.719596 #2896882] INFO -- : [433/885] 2938255=test_context I, [2024-05-17T14:34:40.723729 #2896882] INFO -- : [434/885] 2938259=test_nofree I, [2024-05-17T14:34:40.728903 #2896882] INFO -- : [435/885] 2938259=ruby_api_test I, [2024-05-17T14:34:40.780697 #2896882] INFO -- : [436/885] 2938248=test_find_executable I, [2024-05-17T14:34:40.786011 #2896882] INFO -- : [437/885] 2938248=test_securerandom I, [2024-05-17T14:34:40.808430 #2896882] INFO -- : [438/885] 2938248=test_rdoc_normal_module I, [2024-05-17T14:34:40.858287 #2896882] INFO -- : [439/885] 2938259=test_c_union_entity I, [2024-05-17T14:34:40.867938 #2896882] INFO -- : [440/885] 2938248=test_rdoc_markdown_test I, [2024-05-17T14:34:40.924236 #2896882] INFO -- : [441/885] 2938259=test_logperiod I, [2024-05-17T14:34:40.937541 #2896882] INFO -- : [442/885] 2938255=test_singleton I, [2024-05-17T14:34:40.943896 #2896882] INFO -- : [443/885] 2938255=test_flush I, [2024-05-17T14:34:40.945772 #2896882] INFO -- : [444/885] 2938255=test_io_console I, [2024-05-17T14:34:40.947673 #2896882] INFO -- : [445/885] 2938261=test_switch_hitter I, [2024-05-17T14:34:40.956858 #2896882] INFO -- : [446/885] 2938259=test_uncorrectable_name_check I, [2024-05-17T14:34:40.958258 #2896882] INFO -- : [447/885] 2938259=newline_test I, [2024-05-17T14:34:40.961101 #2896882] INFO -- : [448/885] 2938261=test_hash_create I, [2024-05-17T14:34:40.961486 #2896882] INFO -- : [449/885] 2938261=test_stringchar I, [2024-05-17T14:34:40.982600 #2896882] INFO -- : [450/885] 2938257=test_passing_block I, [2024-05-17T14:34:40.992639 #2896882] INFO -- : [451/885] 2938257=test_thread_fd_close I, [2024-05-17T14:34:40.995818 #2896882] INFO -- : [452/885] 2938257=test_last_thread I, [2024-05-17T14:34:41.011471 #2896882] INFO -- : [453/885] 2938261=test_process I, [2024-05-17T14:34:41.022729 #2896882] INFO -- : [454/885] 2938259=test_pack I, [2024-05-17T14:34:41.044168 #2896882] INFO -- : [455/885] 2938253=test_gem_source_local I, [2024-05-17T14:34:41.125035 #2896882] INFO -- : [456/885] 2938247=test_gem_security_policy I, [2024-05-17T14:34:41.186848 #2896882] INFO -- : [457/885] 2938260=test_arity I, [2024-05-17T14:34:41.202015 #2896882] INFO -- : [458/885] 2938260=test_gem_ext_rake_builder I, [2024-05-17T14:34:41.257744 #2896882] INFO -- : [459/885] 2938259=test_logdevice I, [2024-05-17T14:34:41.275930 #2896882] INFO -- : [460/885] 2938253=test_err_in_callback I, [2024-05-17T14:34:41.282618 #2896882] INFO -- : [461/885] 2938253=test_gem_resolver_lock_specification I, [2024-05-17T14:34:41.307813 #2896882] INFO -- : [462/885] 2938253=test_gc I, [2024-05-17T14:34:41.424959 #2896882] INFO -- : [463/885] 2938247=test_x509cert I, [2024-05-17T14:34:41.521024 #2896882] INFO -- : [464/885] 2938251=test_gem_commands_which_command I, [2024-05-17T14:34:41.537453 #2896882] INFO -- : [465/885] 2938251=test_shift_jis I, [2024-05-17T14:34:41.538866 #2896882] INFO -- : [466/885] 2938251=test_http I, [2024-05-17T14:34:41.556428 #2896882] INFO -- : [467/885] 2938251=test_enumerator I, [2024-05-17T14:34:41.643362 #2896882] INFO -- : [468/885] 2938248=test_flags I, [2024-05-17T14:34:41.678199 #2896882] INFO -- : [469/885] 2938247=test_inadvertent_creation I, [2024-05-17T14:34:41.774138 #2896882] INFO -- : [470/885] 2938247=test_gem_commands_specification_command I, [2024-05-17T14:34:41.889266 #2896882] INFO -- : [471/885] 2938247=test_gem_commands_dependency_command I, [2024-05-17T14:34:41.918231 #2896882] INFO -- : [472/885] 2938256=test_gem_resolver_composed_set I, [2024-05-17T14:34:41.924174 #2896882] INFO -- : [473/885] 2938256=test_safe_load I, [2024-05-17T14:34:41.950450 #2896882] INFO -- : [474/885] 2938256=test_gem_resolver I, [2024-05-17T14:34:41.951256 #2896882] INFO -- : [475/885] 2938262=test_rdoc_markup_attribute_manager I, [2024-05-17T14:34:41.960193 #2896882] INFO -- : [476/885] 2938247=test_name_error I, [2024-05-17T14:34:42.056998 #2896882] INFO -- : [477/885] 2938258=test_rdoc_parser_ruby I, [2024-05-17T14:34:42.060742 #2896882] INFO -- : [478/885] 2938260=test_httpresponse I, [2024-05-17T14:34:42.074707 #2896882] INFO -- : [479/885] 2938257=test_open-uri I, [2024-05-17T14:34:42.086773 #2896882] INFO -- : [480/885] 2938247=test_rdoc_context I, [2024-05-17T14:34:42.099336 #2896882] INFO -- : [481/885] 2938262=test_stream I, [2024-05-17T14:34:42.103792 #2896882] INFO -- : [482/885] 2938259=test_nil2vtempty I, [2024-05-17T14:34:42.103935 #2896882] INFO -- : [483/885] 2938259=test_iso_8859 I, [2024-05-17T14:34:42.105537 #2896882] INFO -- : [484/885] 2938262=test_tcp I, [2024-05-17T14:34:42.129241 #2896882] INFO -- : [485/885] 2938259=test_rdoc_text I, [2024-05-17T14:34:42.153614 #2896882] INFO -- : [486/885] 2938262=test_gem_safe_yaml I, [2024-05-17T14:34:42.155296 #2896882] INFO -- : [487/885] 2938259=test_syntax I, [2024-05-17T14:34:42.162034 #2896882] INFO -- : [488/885] 2938262=test_data I, [2024-05-17T14:34:42.164344 #2896882] INFO -- : [489/885] 2938260=test_date_new I, [2024-05-17T14:34:42.170795 #2896882] INFO -- : [490/885] 2938262=index_write_test I, [2024-05-17T14:34:42.174587 #2896882] INFO -- : [491/885] 2938256=test_require I, [2024-05-17T14:34:42.175452 #2896882] INFO -- : [492/885] 2938262=test_date_time I, [2024-05-17T14:34:42.178086 #2896882] INFO -- : [493/885] 2938256=test_rdoc_markup_to_joined_paragraph I, [2024-05-17T14:34:42.191623 #2896882] INFO -- : [494/885] 2938262=test_rdoc_cross_reference I, [2024-05-17T14:34:42.193938 #2896882] INFO -- : [495/885] 2938260=test_gem_dependency_installer I, [2024-05-17T14:34:42.325662 #2896882] INFO -- : [496/885] 2938256=test_scalar I, [2024-05-17T14:34:42.333679 #2896882] INFO -- : [497/885] 2938256=test_gem_commands_info_command I, [2024-05-17T14:34:42.354692 #2896882] INFO -- : [498/885] 2938256=test_case_options I, [2024-05-17T14:34:42.356649 #2896882] INFO -- : [499/885] 2938256=test_store I, [2024-05-17T14:34:42.444098 #2896882] INFO -- : [500/885] 2938257=test_exception I, [2024-05-17T14:34:42.565093 #2896882] INFO -- : [501/885] 2938256=test_bug_reporter I, [2024-05-17T14:34:42.580614 #2896882] INFO -- : [502/885] 2938258=test_rand I, [2024-05-17T14:34:42.666484 #2896882] INFO -- : [503/885] 2938248=test_gem_package_tar_reader_entry I, [2024-05-17T14:34:42.707243 #2896882] INFO -- : [504/885] 2938262=test_gem_name_tuple I, [2024-05-17T14:34:42.721440 #2896882] INFO -- : [505/885] 2938262=test_gem_ext_cargo_builder_link_flag_converter I, [2024-05-17T14:34:42.757055 #2896882] INFO -- : [506/885] 2938262=test_gem_commands_mirror I, [2024-05-17T14:34:42.760767 #2896882] INFO -- : [507/885] 2938262=test_method_cache I, [2024-05-17T14:34:42.765060 #2896882] INFO -- : [508/885] 2938262=test_gem_request I, [2024-05-17T14:34:42.870523 #2896882] INFO -- : [509/885] 2938248=test_sprintf_comb I, [2024-05-17T14:34:42.898689 #2896882] INFO -- : [510/885] 2938258=test_generic I, [2024-05-17T14:34:42.910414 #2896882] INFO -- : [511/885] 2938262=test_win32ole I, [2024-05-17T14:34:42.916329 #2896882] INFO -- : [512/885] 2938262=test_scan_args I, [2024-05-17T14:34:42.921254 #2896882] INFO -- : [513/885] 2938258=test_enumerator_kw I, [2024-05-17T14:34:42.926509 #2896882] INFO -- : [514/885] 2938258=test_gem_text I, [2024-05-17T14:34:42.935185 #2896882] INFO -- : [515/885] 2938262=test_settracefunc I, [2024-05-17T14:34:42.970433 #2896882] INFO -- : [516/885] 2938258=test_case I, [2024-05-17T14:34:42.971186 #2896882] INFO -- : [517/885] 2938258=test_pkey I, [2024-05-17T14:34:42.984122 #2896882] INFO -- : [518/885] 2938256=test_parser_events I, [2024-05-17T14:34:43.023904 #2896882] INFO -- : [519/885] 2938258=test_reline I, [2024-05-17T14:34:43.038843 #2896882] INFO -- : [520/885] 2938256=test_cclass I, [2024-05-17T14:34:43.052229 #2896882] INFO -- : [521/885] 2938248=test_gem_request_connection_pools I, [2024-05-17T14:34:43.060535 #2896882] INFO -- : [522/885] 2938247=test_grapheme_breaks I, [2024-05-17T14:34:43.079193 #2896882] INFO -- : [523/885] 2938247=test_gem_version_option I, [2024-05-17T14:34:43.120898 #2896882] INFO -- : [524/885] 2938247=test_m17n_comb I, [2024-05-17T14:34:43.172726 #2896882] INFO -- : [525/885] 2938256=test_memory_view I, [2024-05-17T14:34:43.244310 #2896882] INFO -- : [526/885] 2938246=test_ractor I, [2024-05-17T14:34:43.298978 #2896882] INFO -- : [527/885] 2938246=test_rdoc_generator_pot_po I, [2024-05-17T14:34:43.299579 #2896882] INFO -- : [528/885] 2938256=test_ansi_with_terminfo I, [2024-05-17T14:34:43.300379 #2896882] INFO -- : [529/885] 2938246=test_rdoc_markup_to_markdown I, [2024-05-17T14:34:43.351354 #2896882] INFO -- : [530/885] 2938246=test_json_tree I, [2024-05-17T14:34:43.353648 #2896882] INFO -- : [531/885] 2938256=test_ractor I, [2024-05-17T14:34:43.355532 #2896882] INFO -- : [532/885] 2938258=test_severity I, [2024-05-17T14:34:43.362019 #2896882] INFO -- : [533/885] 2938246=test_require_lib I, [2024-05-17T14:34:43.363981 #2896882] INFO -- : [534/885] 2938258=test_gem_install_update_options I, [2024-05-17T14:34:43.372400 #2896882] INFO -- : [535/885] 2938256=parse_test I, [2024-05-17T14:34:43.472852 #2896882] INFO -- : [536/885] 2938258=test_gem_stream_ui I, [2024-05-17T14:34:43.543488 #2896882] INFO -- : [537/885] 2938258=test_rdoc_generator_ri I, [2024-05-17T14:34:43.557696 #2896882] INFO -- : [538/885] 2938258=test_extlibs I, [2024-05-17T14:34:43.637029 #2896882] INFO -- : [539/885] 2938255=test_literal I, [2024-05-17T14:34:43.863011 #2896882] INFO -- : [540/885] 2938254=test_str2big I, [2024-05-17T14:34:43.875672 #2896882] INFO -- : [541/885] 2938254=test_dot_dot I, [2024-05-17T14:34:43.881085 #2896882] INFO -- : [542/885] 2938254=test_c_struct_builder I, [2024-05-17T14:34:43.994642 #2896882] INFO -- : [543/885] 2938262=test_rdoc_markup_to_table_of_contents I, [2024-05-17T14:34:44.019102 #2896882] INFO -- : [544/885] 2938262=test_thread I, [2024-05-17T14:34:44.060760 #2896882] INFO -- : [545/885] 2938254=test_socket I, [2024-05-17T14:34:44.086722 #2896882] INFO -- : [546/885] 2938248=test_objectspace I, [2024-05-17T14:34:44.127388 #2896882] INFO -- : [547/885] 2938249=test_zlib I, [2024-05-17T14:34:44.237939 #2896882] INFO -- : [548/885] 2938262=test_cgi_tag_helper I, [2024-05-17T14:34:44.251777 #2896882] INFO -- : [549/885] 2938255=test_egrep_cpp I, [2024-05-17T14:34:44.268720 #2896882] INFO -- : [550/885] 2938262=test_ole_methods I, [2024-05-17T14:34:44.270882 #2896882] INFO -- : [551/885] 2938262=test_erb_m17n I, [2024-05-17T14:34:44.279638 #2896882] INFO -- : [552/885] 2938262=test_date_conv I, [2024-05-17T14:34:44.296623 #2896882] INFO -- : [553/885] 2938262=test_optimization I, [2024-05-17T14:34:44.368861 #2896882] INFO -- : [554/885] 2938255=test_gc_compact I, [2024-05-17T14:34:44.394157 #2896882] INFO -- : [555/885] 2938260=test_proc I, [2024-05-17T14:34:44.611595 #2896882] INFO -- : [556/885] 2938257=test_string I, [2024-05-17T14:34:45.007716 #2896882] INFO -- : [557/885] 2938248=test_gem_resolver_index_set I, [2024-05-17T14:34:45.039176 #2896882] INFO -- : [558/885] 2938248=test_gem_package_old I, [2024-05-17T14:34:45.073984 #2896882] INFO -- : [559/885] 2938248=test_gem_validator I, [2024-05-17T14:34:45.089693 #2896882] INFO -- : [560/885] 2938248=test_rdoc_markup_parser I, [2024-05-17T14:34:45.143957 #2896882] INFO -- : [561/885] 2938248=test_require_path_check I, [2024-05-17T14:34:45.203038 #2896882] INFO -- : [562/885] 2938248=test_folderitem2_invokeverb I, [2024-05-17T14:34:45.205687 #2896882] INFO -- : [563/885] 2938248=test_fnmatch I, [2024-05-17T14:34:45.218693 #2896882] INFO -- : [564/885] 2938260=test_files_test_2 I, [2024-05-17T14:34:45.250067 #2896882] INFO -- : [565/885] 2938248=test_rdoc_stats I, [2024-05-17T14:34:45.280818 #2896882] INFO -- : [566/885] 2938248=test_pattern_matching I, [2024-05-17T14:34:45.302081 #2896882] INFO -- : [567/885] 2938247=test_string I, [2024-05-17T14:34:45.313437 #2896882] INFO -- : [568/885] 2938248=test_rdoc_store I, [2024-05-17T14:34:45.317749 #2896882] INFO -- : [569/885] 2938247=test_depth_first I, [2024-05-17T14:34:45.323864 #2896882] INFO -- : [570/885] 2938247=test_gem_request_set_lockfile_parser I, [2024-05-17T14:34:45.444072 #2896882] INFO -- : [571/885] 2938247=test_raise I, [2024-05-17T14:34:45.450780 #2896882] INFO -- : [572/885] 2938247=test_x509attr I, [2024-05-17T14:34:45.477770 #2896882] INFO -- : [573/885] 2938247=test_custom_command I, [2024-05-17T14:34:45.552696 #2896882] INFO -- : [574/885] 2938258=json_addition_test I, [2024-05-17T14:34:45.570930 #2896882] INFO -- : [575/885] 2938258=test_gem_dependency_resolution_error I, [2024-05-17T14:34:45.572058 #2896882] INFO -- : [576/885] 2938247=test_rdoc_parser I, [2024-05-17T14:34:45.575963 #2896882] INFO -- : [577/885] 2938258=test_qsort I, [2024-05-17T14:34:45.589666 #2896882] INFO -- : [578/885] 2938258=test_null I, [2024-05-17T14:34:45.593208 #2896882] INFO -- : [579/885] 2938247=test_win32ole_type I, [2024-05-17T14:34:45.594222 #2896882] INFO -- : [580/885] 2938254=test_mul I, [2024-05-17T14:34:45.596875 #2896882] INFO -- : [581/885] 2938258=test_rdoc_markup_to_rdoc I, [2024-05-17T14:34:45.596933 #2896882] INFO -- : [582/885] 2938247=test_rdoc_rd_inline_parser I, [2024-05-17T14:34:45.603343 #2896882] INFO -- : [583/885] 2938254=test_default_gems I, [2024-05-17T14:34:45.622196 #2896882] INFO -- : [584/885] 2938264=test_rdoc_markup_attributes I, [2024-05-17T14:34:45.625658 #2896882] INFO -- : [585/885] 2938258=test_date_parse I, [2024-05-17T14:34:45.628888 #2896882] INFO -- : [586/885] 2938247=test_trick I, [2024-05-17T14:34:45.653436 #2896882] INFO -- : [587/885] 2938254=test_thread I, [2024-05-17T14:34:45.657063 #2896882] INFO -- : [588/885] 2938254=test_pipe I, [2024-05-17T14:34:45.755667 #2896882] INFO -- : [589/885] 2938258=test_pkey_ec I, [2024-05-17T14:34:45.803668 #2896882] INFO -- : [590/885] 2938264=test_io_buffer I, [2024-05-17T14:34:45.841686 #2896882] INFO -- : [591/885] 2938258=test_key_name_check I, [2024-05-17T14:34:45.841755 #2896882] INFO -- : [592/885] 2938254=test_defined I, [2024-05-17T14:34:45.852611 #2896882] INFO -- : [593/885] 2938258=test_backtrace I, [2024-05-17T14:34:45.858821 #2896882] INFO -- : [594/885] 2938258=test_rdoc_i18n_text I, [2024-05-17T14:34:45.861657 #2896882] INFO -- : [595/885] 2938264=test_windows_1251 I, [2024-05-17T14:34:45.863055 #2896882] INFO -- : [596/885] 2938258=test_time I, [2024-05-17T14:34:45.866569 #2896882] INFO -- : [597/885] 2938264=test_rdoc_rdoc I, [2024-05-17T14:34:45.944669 #2896882] INFO -- : [598/885] 2938248=test_gem_uninstaller I, [2024-05-17T14:34:45.964105 #2896882] INFO -- : [599/885] 2938254=test_buffering I, [2024-05-17T14:34:45.972251 #2896882] INFO -- : [600/885] 2938258=test_svcb_https I, [2024-05-17T14:34:45.977569 #2896882] INFO -- : [601/885] 2938258=test_gb18030 I, [2024-05-17T14:34:45.982233 #2896882] INFO -- : [602/885] 2938258=test_bug-5832 I, [2024-05-17T14:34:45.984933 #2896882] INFO -- : [603/885] 2938254=test_files_ext I, [2024-05-17T14:34:45.986981 #2896882] INFO -- : [604/885] 2938258=test_emitter I, [2024-05-17T14:34:45.991998 #2896882] INFO -- : [605/885] 2938264=test_gem_silent_ui I, [2024-05-17T14:34:46.003367 #2896882] INFO -- : [606/885] 2938258=test_kdf I, [2024-05-17T14:34:46.029105 #2896882] INFO -- : [607/885] 2938264=test_gem_doctor I, [2024-05-17T14:34:46.067423 #2896882] INFO -- : [608/885] 2938264=test_kernel I, [2024-05-17T14:34:46.084970 #2896882] INFO -- : [609/885] 2938258=test_eval_history I, [2024-05-17T14:34:46.095499 #2896882] INFO -- : [610/885] 2938258=dispatcher_test I, [2024-05-17T14:34:46.108732 #2896882] INFO -- : [611/885] 2938258=test_enc_raise I, [2024-05-17T14:34:46.114999 #2896882] INFO -- : [612/885] 2938258=test_psych I, [2024-05-17T14:34:46.139128 #2896882] INFO -- : [613/885] 2938258=!Nothing_to_test I, [2024-05-17T14:34:46.139189 #2896882] INFO -- : [614/885] 2938258=test_rdoc_markup_paragraph I, [2024-05-17T14:34:46.140014 #2896882] INFO -- : [615/885] 2938254=test_object_create_start I, [2024-05-17T14:34:46.142920 #2896882] INFO -- : [616/885] 2938254=test_at_exit I, [2024-05-17T14:34:46.145780 #2896882] INFO -- : [617/885] 2938256=test_command I, [2024-05-17T14:34:46.147890 #2896882] INFO -- : [618/885] 2938258=test_gem_ext_cargo_builder_unit I, [2024-05-17T14:34:46.164685 #2896882] INFO -- : [619/885] 2938254=test_gem_rdoc I, [2024-05-17T14:34:46.164958 #2896882] INFO -- : [620/885] 2938258=test_date I, [2024-05-17T14:34:46.177752 #2896882] INFO -- : [621/885] 2938258=test_hmac I, [2024-05-17T14:34:46.185781 #2896882] INFO -- : [622/885] 2938258=test_rdoc_markup_to_tt_only I, [2024-05-17T14:34:46.210037 #2896882] INFO -- : [623/885] 2938258=test_rdoc_tom_doc I, [2024-05-17T14:34:46.225026 #2896882] INFO -- : [624/885] 2938245=test_numeric I, [2024-05-17T14:34:46.230614 #2896882] INFO -- : [625/885] 2938258=test_assignment I, [2024-05-17T14:34:46.264852 #2896882] INFO -- : [626/885] 2938254=test_ifunless I, [2024-05-17T14:34:46.272222 #2896882] INFO -- : [627/885] 2938254=test_gem_commands_lock_command I, [2024-05-17T14:34:46.294747 #2896882] INFO -- : [628/885] 2938254=test_gem_command I, [2024-05-17T14:34:46.309766 #2896882] INFO -- : [629/885] 2938245=test_key_actor_vi I, [2024-05-17T14:34:46.385171 #2896882] INFO -- : [630/885] 2938254=test_bug-3571 I, [2024-05-17T14:34:46.409762 #2896882] INFO -- : [631/885] 2938254=test_common I, [2024-05-17T14:34:46.415302 #2896882] INFO -- : [632/885] 2938245=test_gem_spec_fetcher I, [2024-05-17T14:34:46.503368 #2896882] INFO -- : [633/885] 2938256=test_rdoc_token_stream I, [2024-05-17T14:34:46.518496 #2896882] INFO -- : [634/885] 2938256=test_address_resolve I, [2024-05-17T14:34:46.536604 #2896882] INFO -- : [635/885] 2938256=test_config I, [2024-05-17T14:34:46.563531 #2896882] INFO -- : [636/885] 2938256=test_optarg I, [2024-05-17T14:34:46.576705 #2896882] INFO -- : [637/885] 2938245=test_yaml_special_cases I, [2024-05-17T14:34:46.582627 #2896882] INFO -- : [638/885] 2938245=test_gem_source_list I, [2024-05-17T14:34:46.605958 #2896882] INFO -- : [639/885] 2938254=test_verbose I, [2024-05-17T14:34:46.623565 #2896882] INFO -- : [640/885] 2938254=test_rdoc_single_class I, [2024-05-17T14:34:46.628256 #2896882] INFO -- : [641/885] 2938245=test_num2int I, [2024-05-17T14:34:46.630736 #2896882] INFO -- : [642/885] 2938254=test_nil I, [2024-05-17T14:34:46.634608 #2896882] INFO -- : [643/885] 2938245=test_macro I, [2024-05-17T14:34:46.641349 #2896882] INFO -- : [644/885] 2938245=test_frozen I, [2024-05-17T14:34:46.647577 #2896882] INFO -- : [645/885] 2938245=test_gem_ext_configure_builder I, [2024-05-17T14:34:46.650861 #2896882] INFO -- : [646/885] 2938264=test_pp I, [2024-05-17T14:34:46.651090 #2896882] INFO -- : [647/885] 2938254=test_zsh_completion I, [2024-05-17T14:34:46.658962 #2896882] INFO -- : [648/885] 2938256=test_exception I, [2024-05-17T14:34:46.666879 #2896882] INFO -- : [649/885] 2938256=test_iter_break I, [2024-05-17T14:34:46.671163 #2896882] INFO -- : [650/885] 2938256=test_line_editor I, [2024-05-17T14:34:46.676845 #2896882] INFO -- : [651/885] 2938256=ripper_test I, [2024-05-17T14:34:46.679058 #2896882] INFO -- : [652/885] 2938254=test_objspace I, [2024-05-17T14:34:46.699992 #2896882] INFO -- : [653/885] 2938264=test_undef I, [2024-05-17T14:34:46.708955 #2896882] INFO -- : [654/885] 2938264=test_gem_security_trust_dir I, [2024-05-17T14:34:46.736911 #2896882] INFO -- : [655/885] 2938264=test_string_memory I, [2024-05-17T14:34:46.739326 #2896882] INFO -- : [656/885] 2938245=comments_test I, [2024-05-17T14:34:46.746828 #2896882] INFO -- : [657/885] 2938245=test_sprintf I, [2024-05-17T14:34:46.797923 #2896882] INFO -- : [658/885] 2938264=test_gem_requirement I, [2024-05-17T14:34:46.834051 #2896882] INFO -- : [659/885] 2938248=test_show_source I, [2024-05-17T14:34:46.892703 #2896882] INFO -- : [660/885] 2938264=test_set I, [2024-05-17T14:34:46.917322 #2896882] INFO -- : [661/885] 2938264=test_c_struct_entry I, [2024-05-17T14:34:46.951392 #2896882] INFO -- : [662/885] 2938248=test_lock_native_thread I, [2024-05-17T14:34:46.999440 #2896882] INFO -- : [663/885] 2938255=test_gem_commands_stale_command I, [2024-05-17T14:34:47.009784 #2896882] INFO -- : [664/885] 2938255=test_remote_fetch_error I, [2024-05-17T14:34:47.021134 #2896882] INFO -- : [665/885] 2938255=test_have_library I, [2024-05-17T14:34:47.023861 #2896882] INFO -- : [666/885] 2938246=test_tree_builder I, [2024-05-17T14:34:47.025103 #2896882] INFO -- : [667/885] 2938245=test_gem_resolver_dependency_request I, [2024-05-17T14:34:47.026818 #2896882] INFO -- : [668/885] 2938246=test_hash I, [2024-05-17T14:34:47.037444 #2896882] INFO -- : [669/885] 2938246=test_postponed_job I, [2024-05-17T14:34:47.078163 #2896882] INFO -- : [670/885] 2938245=test_alias_and_anchor I, [2024-05-17T14:34:47.106647 #2896882] INFO -- : [671/885] 2938245=test_external_new I, [2024-05-17T14:34:47.114919 #2896882] INFO -- : [672/885] 2938245=test_gem_request_set_lockfile I, [2024-05-17T14:34:47.149339 #2896882] INFO -- : [673/885] 2938264=test_raise_exception I, [2024-05-17T14:34:47.178298 #2896882] INFO -- : [674/885] 2938256=test_protect I, [2024-05-17T14:34:47.180549 #2896882] INFO -- : [675/885] 2938256=test_win32ole_typelib I, [2024-05-17T14:34:47.186702 #2896882] INFO -- : [676/885] 2938256=test_workspace I, [2024-05-17T14:34:47.258995 #2896882] INFO -- : [677/885] 2938248=test_weakmap I, [2024-05-17T14:34:47.362758 #2896882] INFO -- : [678/885] 2938256=test_yjit I, [2024-05-17T14:34:47.367948 #2896882] INFO -- : [679/885] 2938256=test_ws I, [2024-05-17T14:34:47.395695 #2896882] INFO -- : [680/885] 2938256=test_gem_commands_environment_command I, [2024-05-17T14:34:47.445897 #2896882] INFO -- : [681/885] 2938246=test_m17n I, [2024-05-17T14:34:47.459256 #2896882] INFO -- : [682/885] 2938256=test_argf I, [2024-05-17T14:34:47.465636 #2896882] INFO -- : [683/885] 2938245=test_kill_ring I, [2024-05-17T14:34:47.471528 #2896882] INFO -- : [684/885] 2938245=test_ns_spki I, [2024-05-17T14:34:47.501201 #2896882] INFO -- : [685/885] 2938246=test_framework I, [2024-05-17T14:34:47.506453 #2896882] INFO -- : [686/885] 2938245=test_console_attr I, [2024-05-17T14:34:47.513936 #2896882] INFO -- : [687/885] 2938245=test_summary I, [2024-05-17T14:34:47.520248 #2896882] INFO -- : [688/885] 2938252=test_type_completor I, [2024-05-17T14:34:47.520307 #2896882] INFO -- : [689/885] 2938246=test_io_wait I, [2024-05-17T14:34:47.524109 #2896882] INFO -- : [690/885] 2938252=test_gem_commands_exec_command I, [2024-05-17T14:34:47.642889 #2896882] INFO -- : [691/885] 2938245=warnings_test I, [2024-05-17T14:34:47.657012 #2896882] INFO -- : [692/885] 2938245=test_kwargs I, [2024-05-17T14:34:47.660841 #2896882] INFO -- : [693/885] 2938245=test_ellipsize I, [2024-05-17T14:34:47.668169 #2896882] INFO -- : [694/885] 2938245=test_date_attr I, [2024-05-17T14:34:47.678649 #2896882] INFO -- : [695/885] 2938245=test_io I, [2024-05-17T14:34:47.705658 #2896882] INFO -- : [696/885] 2938249=test_sorted_set I, [2024-05-17T14:34:47.747112 #2896882] INFO -- : [697/885] 2938264=test_win32ole_type_event I, [2024-05-17T14:34:47.749433 #2896882] INFO -- : [698/885] 2938264=test_emoji I, [2024-05-17T14:34:47.776439 #2896882] INFO -- : [699/885] 2938264=test_ubf_async_safe I, [2024-05-17T14:34:47.788075 #2896882] INFO -- : [700/885] 2938264=test_hash I, [2024-05-17T14:34:47.849077 #2896882] INFO -- : [701/885] 2938246=test_gem_unsatisfiable_dependency_error I, [2024-05-17T14:34:47.857043 #2896882] INFO -- : [702/885] 2938247=test_win32ole_record I, [2024-05-17T14:34:47.859552 #2896882] INFO -- : [703/885] 2938247=test_cp949 I, [2024-05-17T14:34:47.862498 #2896882] INFO -- : [704/885] 2938246=test_gem_commands_uninstall_command I, [2024-05-17T14:34:47.865138 #2896882] INFO -- : [705/885] 2938247=test_gem_source_specific_file I, [2024-05-17T14:34:47.911438 #2896882] INFO -- : [706/885] 2938249=test_foreach I, [2024-05-17T14:34:47.916338 #2896882] INFO -- : [707/885] 2938249=test_condition I, [2024-05-17T14:34:47.917404 #2896882] INFO -- : [708/885] 2938258=test_rdoc_rubygems_hook I, [2024-05-17T14:34:47.921462 #2896882] INFO -- : [709/885] 2938249=test_gem_commands_query_command I, [2024-05-17T14:34:47.951830 #2896882] INFO -- : [710/885] 2938245=test_method I, [2024-05-17T14:34:47.961347 #2896882] INFO -- : [711/885] 2938247=test_gem_impossible_dependencies_error I, [2024-05-17T14:34:47.980744 #2896882] INFO -- : [712/885] 2938247=test_array_create I, [2024-05-17T14:34:47.982337 #2896882] INFO -- : [713/885] 2938247=test_pack I, [2024-05-17T14:34:48.015698 #2896882] INFO -- : [714/885] 2938258=test_pattern_key_name_check I, [2024-05-17T14:34:48.025842 #2896882] INFO -- : [715/885] 2938258=test_to_ruby I, [2024-05-17T14:34:48.055662 #2896882] INFO -- : [716/885] 2938258=test_ftp I, [2024-05-17T14:34:48.063698 #2896882] INFO -- : [717/885] 2938258=test_rdoc_context_section I, [2024-05-17T14:34:48.073227 #2896882] INFO -- : [718/885] 2938258=test_euc_kr I, [2024-05-17T14:34:48.091349 #2896882] INFO -- : [719/885] 2938258=test_system I, [2024-05-17T14:34:48.141047 #2896882] INFO -- : [720/885] 2938255=test_pkcs12 I, [2024-05-17T14:34:48.209403 #2896882] INFO -- : [721/885] 2938247=test_pkey_dh I, [2024-05-17T14:34:48.283553 #2896882] INFO -- : [722/885] 2938253=test_bigzero I, [2024-05-17T14:34:48.287151 #2896882] INFO -- : [723/885] 2938247=test_gem_package_tar_header I, [2024-05-17T14:34:48.288836 #2896882] INFO -- : [724/885] 2938253=test_gem_util I, [2024-05-17T14:34:48.339769 #2896882] INFO -- : [725/885] 2938247=test_iseq_load I, [2024-05-17T14:34:48.453325 #2896882] INFO -- : [726/885] 2938253=test_gem_config_file I, [2024-05-17T14:34:48.528285 #2896882] INFO -- : [727/885] 2938255=test_ripper I, [2024-05-17T14:34:48.569121 #2896882] INFO -- : [728/885] 2938253=test_getopts I, [2024-05-17T14:34:48.575271 #2896882] INFO -- : [729/885] 2938253=test_protocol I, [2024-05-17T14:34:48.580382 #2896882] INFO -- : [730/885] 2938246=test_gem_resolver_activation_request I, [2024-05-17T14:34:48.594836 #2896882] INFO -- : [731/885] 2938246=test_yjit_exit_locations I, [2024-05-17T14:34:48.601100 #2896882] INFO -- : [732/885] 2938246=test_etc I, [2024-05-17T14:34:48.602318 #2896882] INFO -- : [733/885] 2938249=test_yaml_tree I, [2024-05-17T14:34:48.640884 #2896882] INFO -- : [734/885] 2938249=test_libs I, [2024-05-17T14:34:48.672432 #2896882] INFO -- : [735/885] 2938249=test_gem_commands_fetch_command I, [2024-05-17T14:34:48.677682 #2896882] INFO -- : [736/885] 2938252=test_math I, [2024-05-17T14:34:48.689009 #2896882] INFO -- : [737/885] 2938252=test_gc I, [2024-05-17T14:34:48.694757 #2896882] INFO -- : [738/885] 2938252=test_sleep I, [2024-05-17T14:34:48.695294 #2896882] INFO -- : [739/885] 2938246=test_config I, [2024-05-17T14:34:48.741221 #2896882] INFO -- : [740/885] 2938260=test_utf16 I, [2024-05-17T14:34:48.749449 #2896882] INFO -- : [741/885] 2938260=test_autoload I, [2024-05-17T14:34:48.761851 #2896882] INFO -- : [742/885] 2938246=test_io I, [2024-05-17T14:34:48.796865 #2896882] INFO -- : [743/885] 2938249=test_unicode_escape I, [2024-05-17T14:34:48.863610 #2896882] INFO -- : [744/885] 2938249=test_sizeof I, [2024-05-17T14:34:48.895368 #2896882] INFO -- : [745/885] 2938253=test_case I, [2024-05-17T14:34:48.935696 #2896882] INFO -- : [746/885] 2938253=test_face I, [2024-05-17T14:34:48.978398 #2896882] INFO -- : [747/885] 2938253=test_rendering I, [2024-05-17T14:34:49.010728 #2896882] INFO -- : [748/885] 2938255=test_backtrace I, [2024-05-17T14:34:49.011434 #2896882] INFO -- : [749/885] 2938259=test_pack I, [2024-05-17T14:34:49.036646 #2896882] INFO -- : [750/885] 2938253=ruby_parser_test I, [2024-05-17T14:34:49.041700 #2896882] INFO -- : [751/885] 2938259=test_io_buffer I, [2024-05-17T14:34:49.065516 #2896882] INFO -- : [752/885] 2938258=test_gem_resolver_conflict I, [2024-05-17T14:34:49.075090 #2896882] INFO -- : [753/885] 2938258=test_rdoc_task I, [2024-05-17T14:34:49.089773 #2896882] INFO -- : [754/885] 2938258=test_rdoc_markup_indented_paragraph I, [2024-05-17T14:34:49.090580 #2896882] INFO -- : [755/885] 2938253=locals_test I, [2024-05-17T14:34:49.100243 #2896882] INFO -- : [756/885] 2938258=test_rdoc_require I, [2024-05-17T14:34:49.111290 #2896882] INFO -- : [757/885] 2938258=test_gem_commands_install_command I, [2024-05-17T14:34:49.155813 #2896882] INFO -- : [758/885] 2938259=test_clone I, [2024-05-17T14:34:49.255135 #2896882] INFO -- : [759/885] 2938247=test_readpartial I, [2024-05-17T14:34:49.331060 #2896882] INFO -- : [760/885] 2938253=test_fstring I, [2024-05-17T14:34:49.382341 #2896882] INFO -- : [761/885] 2938259=test_optparse I, [2024-05-17T14:34:49.428834 #2896882] INFO -- : [762/885] 2938259=test_array I, [2024-05-17T14:34:49.436478 #2896882] INFO -- : [763/885] 2938259=test_rat I, [2024-05-17T14:34:49.446043 #2896882] INFO -- : [764/885] 2938259=test_webauthn_poller I, [2024-05-17T14:34:49.465291 #2896882] INFO -- : [765/885] 2938253=test_rdoc_markup_raw I, [2024-05-17T14:34:49.472440 #2896882] INFO -- : [766/885] 2938253=test_rdoc_markup_to_html_crossref I, [2024-05-17T14:34:49.590947 #2896882] INFO -- : [767/885] 2938259=encoding_test I, [2024-05-17T14:34:49.661249 #2896882] INFO -- : [768/885] 2938259=test_gem_resolver_best_set I, [2024-05-17T14:34:49.666560 #2896882] INFO -- : [769/885] 2938247=test_typeddata I, [2024-05-17T14:34:49.719856 #2896882] INFO -- : [770/885] 2938259=test_stringscanner I, [2024-05-17T14:34:49.724536 #2896882] INFO -- : [771/885] 2938253=test_files_sample I, [2024-05-17T14:34:49.748404 #2896882] INFO -- : [772/885] 2938259=parser_test I, [2024-05-17T14:34:49.748808 #2896882] INFO -- : [773/885] 2938259=test_convertible I, [2024-05-17T14:34:49.804584 #2896882] INFO -- : [774/885] 2938253=test_rdoc_alias I, [2024-05-17T14:34:49.821758 #2896882] INFO -- : [775/885] 2938253=test_yield I, [2024-05-17T14:34:49.880616 #2896882] INFO -- : [776/885] 2938247=test_wait I, [2024-05-17T14:34:49.980732 #2896882] INFO -- : [777/885] 2938247=test_handle I, [2024-05-17T14:34:50.302712 #2896882] INFO -- : [778/885] 2938255=test_forwardable I, [2024-05-17T14:34:50.316638 #2896882] INFO -- : [779/885] 2938255=test_yaml I, [2024-05-17T14:34:50.371787 #2896882] INFO -- : [780/885] 2938247=test_big2str I, [2024-05-17T14:34:50.372905 #2896882] INFO -- : [781/885] 2938247=test_gem_commands_sources_command I, [2024-05-17T14:34:50.410646 #2896882] INFO -- : [782/885] 2938258=test_ansi_without_terminfo I, [2024-05-17T14:34:50.419233 #2896882] INFO -- : [783/885] 2938255=test_euc_tw I, [2024-05-17T14:34:50.420389 #2896882] INFO -- : [784/885] 2938255=test_ractor I, [2024-05-17T14:34:50.422985 #2896882] INFO -- : [785/885] 2938258=test_bmethod I, [2024-05-17T14:34:50.428878 #2896882] INFO -- : [786/885] 2938258=test_rdoc_markup_formatter I, [2024-05-17T14:34:50.435223 #2896882] INFO -- : [787/885] 2938258=test_thread_queue I, [2024-05-17T14:34:50.439214 #2896882] INFO -- : [788/885] 2938255=test_nowrite I, [2024-05-17T14:34:50.470441 #2896882] INFO -- : [789/885] 2938255=test_rdoc_parser_c I, [2024-05-17T14:34:50.547113 #2896882] INFO -- : [790/885] 2938247=test_comparable I, [2024-05-17T14:34:50.557754 #2896882] INFO -- : [791/885] 2938247=test_shapes I, [2024-05-17T14:34:50.566383 #2896882] INFO -- : [792/885] 2938247=json_fixtures_test I, [2024-05-17T14:34:50.570637 #2896882] INFO -- : [793/885] 2938247=test_io_timeout I, [2024-05-17T14:34:50.578433 #2896882] INFO -- : [794/885] 2938247=test_profile_frames I, [2024-05-17T14:34:50.719225 #2896882] INFO -- : [795/885] 2938262=test_pstore I, [2024-05-17T14:34:50.746864 #2896882] INFO -- : [796/885] 2938252=test_cstr I, [2024-05-17T14:34:50.752236 #2896882] INFO -- : [797/885] 2938247=test_enc_str_buf_cat I, [2024-05-17T14:34:50.759064 #2896882] INFO -- : [798/885] 2938247=test_class2name I, [2024-05-17T14:34:50.760755 #2896882] INFO -- : [799/885] 2938262=test_gbk I, [2024-05-17T14:34:50.768459 #2896882] INFO -- : [800/885] 2938262=test_require I, [2024-05-17T14:34:50.774108 #2896882] INFO -- : [801/885] 2938247=test_cgi_util I, [2024-05-17T14:34:50.807135 #2896882] INFO -- : [802/885] 2938255=test_gem_commands_contents_command I, [2024-05-17T14:34:50.873630 #2896882] INFO -- : [803/885] 2938255=test_gem_ext_cmake_builder I, [2024-05-17T14:34:50.884576 #2896882] INFO -- : [804/885] 2938255=test_digest I, [2024-05-17T14:34:51.002421 #2896882] INFO -- : [805/885] 2938247=test_marshalable I, [2024-05-17T14:34:51.005122 #2896882] INFO -- : [806/885] 2938247=test_find I, [2024-05-17T14:34:51.013694 #2896882] INFO -- : [807/885] 2938247=test_ractor I, [2024-05-17T14:34:51.110931 #2896882] INFO -- : [808/885] 2938247=test_wss I, [2024-05-17T14:34:51.131894 #2896882] INFO -- : [809/885] 2938247=test_fiddle I, [2024-05-17T14:34:51.205544 #2896882] INFO -- : [810/885] 2938247=test_file I, [2024-05-17T14:34:51.209827 #2896882] INFO -- : [811/885] 2938247=test_rdoc_any_method I, [2024-05-17T14:34:51.419368 #2896882] INFO -- : [812/885] 2938264=test_modify_expand I, [2024-05-17T14:34:51.425139 #2896882] INFO -- : [813/885] 2938264=test_rdoc_markdown I, [2024-05-17T14:34:51.461591 #2896882] INFO -- : [814/885] 2938251=test_gem_available_set I, [2024-05-17T14:34:51.473198 #2896882] INFO -- : [815/885] 2938247=test_pathname I, [2024-05-17T14:34:51.486962 #2896882] INFO -- : [816/885] 2938252=test_complexrational I, [2024-05-17T14:34:51.493639 #2896882] INFO -- : [817/885] 2938252=test_init I, [2024-05-17T14:34:51.540337 #2896882] INFO -- : [818/885] 2938251=regexp_test I, [2024-05-17T14:34:51.551345 #2896882] INFO -- : [819/885] 2938251=test_gem_package_tar_reader I, [2024-05-17T14:34:51.588911 #2896882] INFO -- : [820/885] 2938251=test_rdoc_encoding I, [2024-05-17T14:34:51.627023 #2896882] INFO -- : [821/885] 2938251=test_coverage I, [2024-05-17T14:34:51.641387 #2896882] INFO -- : [822/885] 2938247=test_recorder I, [2024-05-17T14:34:51.644851 #2896882] INFO -- : [823/885] 2938247=test_gem_source_vendor I, [2024-05-17T14:34:51.657515 #2896882] INFO -- : [824/885] 2938247=test_gem_commands_owner_command I, [2024-05-17T14:34:51.661879 #2896882] INFO -- : [825/885] 2938255=test_bash_completion I, [2024-05-17T14:34:51.669881 #2896882] INFO -- : [826/885] 2938255=test_formatter I, [2024-05-17T14:34:51.674406 #2896882] INFO -- : [827/885] 2938255=test_deprecate I, [2024-05-17T14:34:51.679889 #2896882] INFO -- : [828/885] 2938264=test_rdoc_constant I, [2024-05-17T14:34:51.701494 #2896882] INFO -- : [829/885] 2938255=test_gem_installer I, [2024-05-17T14:34:51.768976 #2896882] INFO -- : [830/885] 2938264=test_yamlstore I, [2024-05-17T14:34:51.778068 #2896882] INFO -- : [831/885] 2938264=test_date_strftime I, [2024-05-17T14:34:51.818090 #2896882] INFO -- : [832/885] 2938249=test_rdoc_parser_rd I, [2024-05-17T14:34:51.821380 #2896882] INFO -- : [833/885] 2938256=test_irb I, [2024-05-17T14:34:51.831945 #2896882] INFO -- : [834/885] 2938249=test_asn1 I, [2024-05-17T14:34:51.856216 #2896882] INFO -- : [835/885] 2938249=test_random I, [2024-05-17T14:34:51.859870 #2896882] INFO -- : [836/885] 2938249=json_string_matching_test I, [2024-05-17T14:34:51.870748 #2896882] INFO -- : [837/885] 2938249=test_load I, [2024-05-17T14:34:51.881908 #2896882] INFO -- : [838/885] 2938249=test_class I, [2024-05-17T14:34:51.939892 #2896882] INFO -- : [839/885] 2938252=test_rdoc_normal_class I, [2024-05-17T14:34:52.014156 #2896882] INFO -- : [840/885] 2938252=test_const I, [2024-05-17T14:34:52.017800 #2896882] INFO -- : [841/885] 2938252=parse_comments_test I, [2024-05-17T14:34:52.022823 #2896882] INFO -- : [842/885] 2938262=test_noarg I, [2024-05-17T14:34:52.025113 #2896882] INFO -- : [843/885] 2938252=test_tempfile I, [2024-05-17T14:34:52.052045 #2896882] INFO -- : [844/885] 2938256=test_function I, [2024-05-17T14:34:52.146209 #2896882] INFO -- : [845/885] 2938264=test_queue I, [2024-05-17T14:34:52.151786 #2896882] INFO -- : [846/885] 2938264=test_gem_resolver_index_specification I, [2024-05-17T14:34:52.195452 #2896882] INFO -- : [847/885] 2938264=test_internal_ivar I, [2024-05-17T14:34:52.201799 #2896882] INFO -- : [848/885] 2938264=test_prettyprint I, [2024-05-17T14:34:52.202958 #2896882] INFO -- : [849/885] 2938253=test_tracepoint I, [2024-05-17T14:34:52.204804 #2896882] INFO -- : [850/885] 2938248=test_gem_commands_help_command I, [2024-05-17T14:34:52.225230 #2896882] INFO -- : [851/885] 2938247=test_rdoc_markup I, [2024-05-17T14:34:52.225870 #2896882] INFO -- : [852/885] 2938264=test_duplicate I, [2024-05-17T14:34:52.229447 #2896882] INFO -- : [853/885] 2938264=test_utf32 I, [2024-05-17T14:34:52.231189 #2896882] INFO -- : [854/885] 2938262=test_basicsocket I, [2024-05-17T14:34:52.235662 #2896882] INFO -- : [855/885] 2938264=test_too_many_dummy_encodings I, [2024-05-17T14:34:52.237393 #2896882] INFO -- : [856/885] 2938247=test_rdoc_include I, [2024-05-17T14:34:52.238899 #2896882] INFO -- : [857/885] 2938262=test_reqarg I, [2024-05-17T14:34:52.251489 #2896882] INFO -- : [858/885] 2938248=test_gem_commands_list_command I, [2024-05-17T14:34:52.251899 #2896882] INFO -- : [859/885] 2938248=test_stack I, [2024-05-17T14:34:52.272970 #2896882] INFO -- : [860/885] 2938256=test_ldap I, [2024-05-17T14:34:52.277138 #2896882] INFO -- : [861/885] 2938256=test_emitter I, [2024-05-17T14:34:52.280510 #2896882] INFO -- : [862/885] 2938247=test_resource I, [2024-05-17T14:34:52.284826 #2896882] INFO -- : [863/885] 2938256=test_gem_commands_signin_command I, [2024-05-17T14:34:52.301407 #2896882] INFO -- : [864/885] 2938247=test_string_processing I, [2024-05-17T14:34:52.309747 #2896882] INFO -- : [865/885] 2938247=test_fileutils I, [2024-05-17T14:34:52.318160 #2896882] INFO -- : [866/885] 2938264=test_econv I, [2024-05-17T14:34:52.329387 #2896882] INFO -- : [867/885] 2938252=test_cesu8 I, [2024-05-17T14:34:52.333672 #2896882] INFO -- : [868/885] 2938252=test_rdoc_options I, [2024-05-17T14:34:52.391249 #2896882] INFO -- : [869/885] 2938256=test_gem_version I, [2024-05-17T14:34:52.465180 #2896882] INFO -- : [870/885] 2938256=test_path_to_class I, [2024-05-17T14:34:52.469134 #2896882] INFO -- : [871/885] 2938256=test_gem_resolver_specification I, [2024-05-17T14:34:52.475275 #2896882] INFO -- : [872/885] 2938253=test_gem_dependency I, [2024-05-17T14:34:52.491124 #2896882] INFO -- : [873/885] 2938256=test_inlinecache I, [2024-05-17T14:34:52.509763 #2896882] INFO -- : [874/885] 2938251=test_rdoc_markup_verbatim I, [2024-05-17T14:34:52.525885 #2896882] INFO -- : [875/885] 2938251=test_complex I, [2024-05-17T14:34:52.563332 #2896882] INFO -- : [876/885] 2938256=test_gem_commands_search_command I, [2024-05-17T14:34:52.568617 #2896882] INFO -- : [877/885] 2938256=test_frozen_error I, [2024-05-17T14:34:52.575252 #2896882] INFO -- : [878/885] 2938256=test_method_cache I, [2024-05-17T14:34:52.576413 #2896882] INFO -- : [879/885] 2938256=test_gem_stub_specification I, [2024-05-17T14:34:52.586640 #2896882] INFO -- : [880/885] 2938262=test_gem_ext_ext_conf_builder I, [2024-05-17T14:34:52.590830 #2896882] INFO -- : [881/885] 2938252=test_gem_resolver_installed_specification I, [2024-05-17T14:34:52.606516 #2896882] INFO -- : [882/885] 2938252=test_scanner_events I, [2024-05-17T14:34:52.607960 #2896882] INFO -- : [883/885] 2938253=test_gem_remote_fetcher I, [2024-05-17T14:34:52.613603 #2896882] INFO -- : [884/885] 2938247=test_parse I, [2024-05-17T14:34:52.637447 #2896882] INFO -- : [885/885] 2938252=test_mdns I, [2024-05-17T14:35:08.150386 #2896882] INFO -- : Finished tests in 36.269917s, 727.9035 tests/s, 257916.0013 assertions/s. I, [2024-05-17T14:35:08.151079 #2896882] INFO -- : 26401 tests, 9354592 assertions, 0 failures, 0 errors, 306 skips I, [2024-05-17T14:35:08.151087 #2896882] INFO -- : I, [2024-05-17T14:35:08.151093 #2896882] INFO -- : ruby -v: ruby 3.4.0dev (2024-05-17T14:33:42Z master 4ba0579da6) [x86_64-linux] I, [2024-05-17T14:35:08.153393 #2896882] INFO -- : $$$[end] "make yes-test-all TESTOPTS='--stderr-on-failure' TESTS='-j20'" exit with 0. I, [2024-05-17T14:35:08.153540 #2896882] INFO -- : $$$[beg] make yes-test-rubyspec MSPECOPT='--error-output stderr --debug -j' TESTS='-j20' I, [2024-05-17T14:35:08.243438 #2896882] INFO -- : BASERUBY = /usr/bin/ruby --disable=gems I, [2024-05-17T14:35:08.243480 #2896882] INFO -- : CC = gcc I, [2024-05-17T14:35:08.243486 #2896882] INFO -- : LD = ld I, [2024-05-17T14:35:08.243490 #2896882] INFO -- : LDSHARED = gcc -shared I, [2024-05-17T14:35:08.243495 #2896882] INFO -- : CFLAGS = -O3 -fno-fast-math -ggdb3 -Wall -Wextra -Wdeprecated-declarations -Wdiv-by-zero -Wduplicated-cond -Wimplicit-function-declaration -Wimplicit-int -Wpointer-arith -Wwrite-strings -Wold-style-definition -Wimplicit-fallthrough=0 -Wmissing-noreturn -Wno-cast-function-type -Wno-constant-logical-operand -Wno-long-long -Wno-missing-field-initializers -Wno-overlength-strings -Wno-packed-bitfield-compat -Wno-parentheses-equality -Wno-self-assign -Wno-tautological-compare -Wno-unused-parameter -Wno-unused-value -Wsuggest-attribute=format -Wsuggest-attribute=noreturn -Wunused-variable -Wmisleading-indentation -Wundef -fPIC I, [2024-05-17T14:35:08.243500 #2896882] INFO -- : XCFLAGS = -U_FORTIFY_SOURCE -D_FORTIFY_SOURCE=2 -fstack-protector-strong -fno-strict-overflow -fvisibility=hidden -fexcess-precision=standard -DRUBY_EXPORT -I. -I.ext/include/x86_64-linux -I/tmp/ruby/src/trunk/include -I/tmp/ruby/src/trunk -I/tmp/ruby/src/trunk/prism -I/tmp/ruby/src/trunk/enc/unicode/15.0.0 I, [2024-05-17T14:35:08.243503 #2896882] INFO -- : CPPFLAGS = I, [2024-05-17T14:35:08.243515 #2896882] INFO -- : DLDFLAGS = -Wl,--compress-debug-sections=zlib -Wl,-soname,libruby.so.3.4 -fstack-protector-strong I, [2024-05-17T14:35:08.243519 #2896882] INFO -- : SOLIBS = -lz -lrt -lrt -lgmp -ldl -lcrypt -lm -lpthread I, [2024-05-17T14:35:08.243523 #2896882] INFO -- : LANG = en_US.UTF-8 I, [2024-05-17T14:35:08.243526 #2896882] INFO -- : LC_ALL = I, [2024-05-17T14:35:08.243530 #2896882] INFO -- : LC_CTYPE = I, [2024-05-17T14:35:08.243533 #2896882] INFO -- : MFLAGS = I, [2024-05-17T14:35:08.243536 #2896882] INFO -- : RUSTC = no I, [2024-05-17T14:35:08.243541 #2896882] INFO -- : YJIT_RUSTC_ARGS = --crate-name=yjit --crate-type=staticlib --edition=2021 -g -C lto=thin -C opt-level=3 -C overflow-checks=on '--out-dir=/tmp/ruby/build/trunk/yjit/target/release/' /tmp/ruby/src/trunk/yjit/src/lib.rs I, [2024-05-17T14:35:08.244323 #2896882] INFO -- : gcc (Ubuntu 11.4.0-1ubuntu1~22.04) 11.4.0 I, [2024-05-17T14:35:08.244345 #2896882] INFO -- : Copyright (C) 2021 Free Software Foundation, Inc. I, [2024-05-17T14:35:08.244350 #2896882] INFO -- : This is free software; see the source for copying conditions. There is NO I, [2024-05-17T14:35:08.244354 #2896882] INFO -- : warranty; not even for MERCHANTABILITY or FITNESS FOR A PARTICULAR PURPOSE. I, [2024-05-17T14:35:08.244359 #2896882] INFO -- : I, [2024-05-17T14:35:08.246050 #2896882] INFO -- : generating enc.mk I, [2024-05-17T14:35:08.362993 #2896882] INFO -- : making enc I, [2024-05-17T14:35:08.380237 #2896882] INFO -- : make[1]: Entering directory '/tmp/ruby/build/trunk' I, [2024-05-17T14:35:08.380259 #2896882] INFO -- : make[1]: Nothing to be done for 'enc'. I, [2024-05-17T14:35:08.380264 #2896882] INFO -- : make[1]: Leaving directory '/tmp/ruby/build/trunk' I, [2024-05-17T14:35:08.380912 #2896882] INFO -- : making srcs under enc I, [2024-05-17T14:35:08.410135 #2896882] INFO -- : make[1]: Entering directory '/tmp/ruby/build/trunk' I, [2024-05-17T14:35:08.410157 #2896882] INFO -- : make[1]: Nothing to be done for 'srcs'. I, [2024-05-17T14:35:08.410163 #2896882] INFO -- : make[1]: Leaving directory '/tmp/ruby/build/trunk' I, [2024-05-17T14:35:08.411117 #2896882] INFO -- : generating transdb.h I, [2024-05-17T14:35:08.507701 #2896882] INFO -- : transdb.h unchanged I, [2024-05-17T14:35:08.508981 #2896882] INFO -- : making trans I, [2024-05-17T14:35:08.543975 #2896882] INFO -- : make[1]: Entering directory '/tmp/ruby/build/trunk' I, [2024-05-17T14:35:08.543998 #2896882] INFO -- : make[1]: Nothing to be done for 'trans'. I, [2024-05-17T14:35:08.544004 #2896882] INFO -- : make[1]: Leaving directory '/tmp/ruby/build/trunk' I, [2024-05-17T14:35:08.544823 #2896882] INFO -- : making encs I, [2024-05-17T14:35:08.581859 #2896882] INFO -- : make[1]: Entering directory '/tmp/ruby/build/trunk' I, [2024-05-17T14:35:08.581879 #2896882] INFO -- : make[1]: Nothing to be done for 'encs'. I, [2024-05-17T14:35:08.581885 #2896882] INFO -- : make[1]: Leaving directory '/tmp/ruby/build/trunk' I, [2024-05-17T14:35:08.583751 #2896882] INFO -- : generating makefiles ext/configure-ext.mk I, [2024-05-17T14:35:08.610326 #2896882] INFO -- : ext/configure-ext.mk updated I, [2024-05-17T14:35:08.612738 #2896882] INFO -- : make[1]: Entering directory '/tmp/ruby/build/trunk' I, [2024-05-17T14:35:09.964189 #2896882] INFO -- : make[1]: Leaving directory '/tmp/ruby/build/trunk' I, [2024-05-17T14:35:09.964984 #2896882] INFO -- : generating makefile exts.mk I, [2024-05-17T14:35:10.000961 #2896882] INFO -- : exts.mk unchanged I, [2024-05-17T14:35:10.005383 #2896882] INFO -- : make[1]: Entering directory '/tmp/ruby/build/trunk' I, [2024-05-17T14:35:10.324238 #2896882] INFO -- : make[2]: Entering directory '/tmp/ruby/build/trunk/ext/coverage' I, [2024-05-17T14:35:10.328869 #2896882] INFO -- : make[2]: Leaving directory '/tmp/ruby/build/trunk/ext/coverage' I, [2024-05-17T14:35:10.335742 #2896882] INFO -- : make[2]: Entering directory '/tmp/ruby/build/trunk/ext/date' I, [2024-05-17T14:35:10.340960 #2896882] INFO -- : make[2]: Leaving directory '/tmp/ruby/build/trunk/ext/date' I, [2024-05-17T14:35:10.344885 #2896882] INFO -- : make[2]: Entering directory '/tmp/ruby/build/trunk/ext/digest' I, [2024-05-17T14:35:10.353907 #2896882] INFO -- : make[2]: Leaving directory '/tmp/ruby/build/trunk/ext/digest' I, [2024-05-17T14:35:10.380738 #2896882] INFO -- : make[2]: Entering directory '/tmp/ruby/build/trunk/ext/digest/sha2' I, [2024-05-17T14:35:10.385619 #2896882] INFO -- : make[2]: Leaving directory '/tmp/ruby/build/trunk/ext/digest/sha2' I, [2024-05-17T14:35:10.407135 #2896882] INFO -- : make[2]: Entering directory '/tmp/ruby/build/trunk/ext/fiddle' I, [2024-05-17T14:35:10.418297 #2896882] INFO -- : make[2]: Leaving directory '/tmp/ruby/build/trunk/ext/fiddle' I, [2024-05-17T14:35:10.423554 #2896882] INFO -- : make[2]: Entering directory '/tmp/ruby/build/trunk/ext/io/console' I, [2024-05-17T14:35:10.427822 #2896882] INFO -- : make[2]: Leaving directory '/tmp/ruby/build/trunk/ext/io/console' I, [2024-05-17T14:35:10.440769 #2896882] INFO -- : make[2]: Entering directory '/tmp/ruby/build/trunk/ext/json' I, [2024-05-17T14:35:10.451342 #2896882] INFO -- : make[2]: Leaving directory '/tmp/ruby/build/trunk/ext/json' I, [2024-05-17T14:35:10.466625 #2896882] INFO -- : make[2]: Entering directory '/tmp/ruby/build/trunk/ext/monitor' I, [2024-05-17T14:35:10.470675 #2896882] INFO -- : make[2]: Leaving directory '/tmp/ruby/build/trunk/ext/monitor' I, [2024-05-17T14:35:10.477782 #2896882] INFO -- : make[2]: Entering directory '/tmp/ruby/build/trunk/ext/objspace' I, [2024-05-17T14:35:10.483853 #2896882] INFO -- : make[2]: Leaving directory '/tmp/ruby/build/trunk/ext/objspace' I, [2024-05-17T14:35:10.502460 #2896882] INFO -- : make[2]: Entering directory '/tmp/ruby/build/trunk/ext/openssl' I, [2024-05-17T14:35:10.521804 #2896882] INFO -- : make[2]: Leaving directory '/tmp/ruby/build/trunk/ext/openssl' I, [2024-05-17T14:35:10.525143 #2896882] INFO -- : make[2]: Entering directory '/tmp/ruby/build/trunk/ext/pathname' I, [2024-05-17T14:35:10.527751 #2896882] INFO -- : make[2]: Leaving directory '/tmp/ruby/build/trunk/ext/pathname' I, [2024-05-17T14:35:10.533300 #2896882] INFO -- : make[2]: Entering directory '/tmp/ruby/build/trunk/ext/psych' I, [2024-05-17T14:35:10.550951 #2896882] INFO -- : make[2]: Leaving directory '/tmp/ruby/build/trunk/ext/psych' I, [2024-05-17T14:35:10.555787 #2896882] INFO -- : make[2]: Entering directory '/tmp/ruby/build/trunk/ext/pty' I, [2024-05-17T14:35:10.559835 #2896882] INFO -- : make[2]: Leaving directory '/tmp/ruby/build/trunk/ext/pty' I, [2024-05-17T14:35:10.572844 #2896882] INFO -- : make[2]: Entering directory '/tmp/ruby/build/trunk/ext/ripper' I, [2024-05-17T14:35:10.578098 #2896882] INFO -- : make[2]: Leaving directory '/tmp/ruby/build/trunk/ext/ripper' I, [2024-05-17T14:35:10.579604 #2896882] INFO -- : make[2]: Entering directory '/tmp/ruby/build/trunk/ext/rubyvm' I, [2024-05-17T14:35:10.581772 #2896882] INFO -- : make[2]: Leaving directory '/tmp/ruby/build/trunk/ext/rubyvm' I, [2024-05-17T14:35:10.592839 #2896882] INFO -- : make[2]: Entering directory '/tmp/ruby/build/trunk/ext/socket' I, [2024-05-17T14:35:10.602715 #2896882] INFO -- : make[2]: Leaving directory '/tmp/ruby/build/trunk/ext/socket' I, [2024-05-17T14:35:10.620920 #2896882] INFO -- : make[2]: Entering directory '/tmp/ruby/build/trunk/.bundle/gems/bigdecimal-3.1.8/ext/bigdecimal' I, [2024-05-17T14:35:10.646913 #2896882] INFO -- : make[2]: Leaving directory '/tmp/ruby/build/trunk/.bundle/gems/bigdecimal-3.1.8/ext/bigdecimal' I, [2024-05-17T14:35:10.648917 #2896882] INFO -- : make[2]: Entering directory '/tmp/ruby/build/trunk/.bundle/gems/debug-1.9.2/ext/debug' I, [2024-05-17T14:35:10.671438 #2896882] INFO -- : make[2]: Leaving directory '/tmp/ruby/build/trunk/.bundle/gems/debug-1.9.2/ext/debug' I, [2024-05-17T14:35:10.673449 #2896882] INFO -- : make[2]: Entering directory '/tmp/ruby/build/trunk/.bundle/gems/nkf-0.2.0/ext/nkf' I, [2024-05-17T14:35:10.694671 #2896882] INFO -- : make[2]: Leaving directory '/tmp/ruby/build/trunk/.bundle/gems/nkf-0.2.0/ext/nkf' I, [2024-05-17T14:35:10.696587 #2896882] INFO -- : make[2]: Entering directory '/tmp/ruby/build/trunk/.bundle/gems/racc-1.7.3/ext/racc/cparse' I, [2024-05-17T14:35:10.717636 #2896882] INFO -- : make[2]: Leaving directory '/tmp/ruby/build/trunk/.bundle/gems/racc-1.7.3/ext/racc/cparse' I, [2024-05-17T14:35:10.719894 #2896882] INFO -- : make[2]: Entering directory '/tmp/ruby/build/trunk/.bundle/gems/rbs-3.4.4/ext/rbs_extension' I, [2024-05-17T14:35:10.740900 #2896882] INFO -- : make[2]: Leaving directory '/tmp/ruby/build/trunk/.bundle/gems/rbs-3.4.4/ext/rbs_extension' I, [2024-05-17T14:35:10.742842 #2896882] INFO -- : make[2]: Entering directory '/tmp/ruby/build/trunk/.bundle/gems/syslog-0.1.2/ext/syslog' I, [2024-05-17T14:35:10.764668 #2896882] INFO -- : make[2]: Leaving directory '/tmp/ruby/build/trunk/.bundle/gems/syslog-0.1.2/ext/syslog' I, [2024-05-17T14:35:10.788683 #2896882] INFO -- : make[2]: Entering directory '/tmp/ruby/build/trunk' I, [2024-05-17T14:35:10.855774 #2896882] INFO -- : make[2]: 'ruby' is up to date. I, [2024-05-17T14:35:10.855814 #2896882] INFO -- : make[2]: Leaving directory '/tmp/ruby/build/trunk' I, [2024-05-17T14:35:10.856075 #2896882] INFO -- : make[1]: Leaving directory '/tmp/ruby/build/trunk' I, [2024-05-17T14:35:10.859728 #2896882] INFO -- : make[1]: Entering directory '/tmp/ruby/build/trunk' I, [2024-05-17T14:35:10.859749 #2896882] INFO -- : make[1]: Nothing to be done for 'note'. I, [2024-05-17T14:35:10.859755 #2896882] INFO -- : make[1]: Leaving directory '/tmp/ruby/build/trunk' E, [2024-05-17T14:35:10.919246 #2896882] ERROR -- : $ /tmp/ruby/build/trunk/miniruby -I/tmp/ruby/src/trunk/lib /tmp/ruby/src/trunk/tool/runruby.rb --archdir=/tmp/ruby/build/trunk --extout=.ext -- /tmp/ruby/src/trunk/spec/mspec/bin/mspec-run -B /tmp/ruby/src/trunk/spec/default.mspec --error-output stderr --debug -fy -o /tmp/rubytest.89p89e/1-mspec-multi-0 E, [2024-05-17T14:35:10.919393 #2896882] ERROR -- : $ /tmp/ruby/build/trunk/miniruby -I/tmp/ruby/src/trunk/lib /tmp/ruby/src/trunk/tool/runruby.rb --archdir=/tmp/ruby/build/trunk --extout=.ext -- /tmp/ruby/src/trunk/spec/mspec/bin/mspec-run -B /tmp/ruby/src/trunk/spec/default.mspec --error-output stderr --debug -fy -o /tmp/rubytest.89p89e/2-mspec-multi-1 E, [2024-05-17T14:35:10.919579 #2896882] ERROR -- : $ /tmp/ruby/build/trunk/miniruby -I/tmp/ruby/src/trunk/lib /tmp/ruby/src/trunk/tool/runruby.rb --archdir=/tmp/ruby/build/trunk --extout=.ext -- /tmp/ruby/src/trunk/spec/mspec/bin/mspec-run -B /tmp/ruby/src/trunk/spec/default.mspec --error-output stderr --debug -fy -o /tmp/rubytest.89p89e/3-mspec-multi-2 E, [2024-05-17T14:35:10.919817 #2896882] ERROR -- : $ /tmp/ruby/build/trunk/miniruby -I/tmp/ruby/src/trunk/lib /tmp/ruby/src/trunk/tool/runruby.rb --archdir=/tmp/ruby/build/trunk --extout=.ext -- /tmp/ruby/src/trunk/spec/mspec/bin/mspec-run -B /tmp/ruby/src/trunk/spec/default.mspec --error-output stderr --debug -fy -o /tmp/rubytest.89p89e/4-mspec-multi-3 E, [2024-05-17T14:35:10.920005 #2896882] ERROR -- : $ /tmp/ruby/build/trunk/miniruby -I/tmp/ruby/src/trunk/lib /tmp/ruby/src/trunk/tool/runruby.rb --archdir=/tmp/ruby/build/trunk --extout=.ext -- /tmp/ruby/src/trunk/spec/mspec/bin/mspec-run -B /tmp/ruby/src/trunk/spec/default.mspec --error-output stderr --debug -fy -o /tmp/rubytest.89p89e/5-mspec-multi-4 E, [2024-05-17T14:35:10.920219 #2896882] ERROR -- : $ /tmp/ruby/build/trunk/miniruby -I/tmp/ruby/src/trunk/lib /tmp/ruby/src/trunk/tool/runruby.rb --archdir=/tmp/ruby/build/trunk --extout=.ext -- /tmp/ruby/src/trunk/spec/mspec/bin/mspec-run -B /tmp/ruby/src/trunk/spec/default.mspec --error-output stderr --debug -fy -o /tmp/rubytest.89p89e/6-mspec-multi-5 E, [2024-05-17T14:35:10.920340 #2896882] ERROR -- : $ /tmp/ruby/build/trunk/miniruby -I/tmp/ruby/src/trunk/lib /tmp/ruby/src/trunk/tool/runruby.rb --archdir=/tmp/ruby/build/trunk --extout=.ext -- /tmp/ruby/src/trunk/spec/mspec/bin/mspec-run -B /tmp/ruby/src/trunk/spec/default.mspec --error-output stderr --debug -fy -o /tmp/rubytest.89p89e/7-mspec-multi-6 E, [2024-05-17T14:35:10.920611 #2896882] ERROR -- : $ /tmp/ruby/build/trunk/miniruby -I/tmp/ruby/src/trunk/lib /tmp/ruby/src/trunk/tool/runruby.rb --archdir=/tmp/ruby/build/trunk --extout=.ext -- /tmp/ruby/src/trunk/spec/mspec/bin/mspec-run -B /tmp/ruby/src/trunk/spec/default.mspec --error-output stderr --debug -fy -o /tmp/rubytest.89p89e/8-mspec-multi-7 E, [2024-05-17T14:35:10.920808 #2896882] ERROR -- : $ /tmp/ruby/build/trunk/miniruby -I/tmp/ruby/src/trunk/lib /tmp/ruby/src/trunk/tool/runruby.rb --archdir=/tmp/ruby/build/trunk --extout=.ext -- /tmp/ruby/src/trunk/spec/mspec/bin/mspec-run -B /tmp/ruby/src/trunk/spec/default.mspec --error-output stderr --debug -fy -o /tmp/rubytest.89p89e/9-mspec-multi-8 E, [2024-05-17T14:35:10.921013 #2896882] ERROR -- : $ /tmp/ruby/build/trunk/miniruby -I/tmp/ruby/src/trunk/lib /tmp/ruby/src/trunk/tool/runruby.rb --archdir=/tmp/ruby/build/trunk --extout=.ext -- /tmp/ruby/src/trunk/spec/mspec/bin/mspec-run -B /tmp/ruby/src/trunk/spec/default.mspec --error-output stderr --debug -fy -o /tmp/rubytest.89p89e/10-mspec-multi-9 E, [2024-05-17T14:35:10.921230 #2896882] ERROR -- : $ /tmp/ruby/build/trunk/miniruby -I/tmp/ruby/src/trunk/lib /tmp/ruby/src/trunk/tool/runruby.rb --archdir=/tmp/ruby/build/trunk --extout=.ext -- /tmp/ruby/src/trunk/spec/mspec/bin/mspec-run -B /tmp/ruby/src/trunk/spec/default.mspec --error-output stderr --debug -fy -o /tmp/rubytest.89p89e/11-mspec-multi-10 E, [2024-05-17T14:35:10.921407 #2896882] ERROR -- : $ /tmp/ruby/build/trunk/miniruby -I/tmp/ruby/src/trunk/lib /tmp/ruby/src/trunk/tool/runruby.rb --archdir=/tmp/ruby/build/trunk --extout=.ext -- /tmp/ruby/src/trunk/spec/mspec/bin/mspec-run -B /tmp/ruby/src/trunk/spec/default.mspec --error-output stderr --debug -fy -o /tmp/rubytest.89p89e/12-mspec-multi-11 E, [2024-05-17T14:35:10.921623 #2896882] ERROR -- : $ /tmp/ruby/build/trunk/miniruby -I/tmp/ruby/src/trunk/lib /tmp/ruby/src/trunk/tool/runruby.rb --archdir=/tmp/ruby/build/trunk --extout=.ext -- /tmp/ruby/src/trunk/spec/mspec/bin/mspec-run -B /tmp/ruby/src/trunk/spec/default.mspec --error-output stderr --debug -fy -o /tmp/rubytest.89p89e/13-mspec-multi-12 E, [2024-05-17T14:35:10.921898 #2896882] ERROR -- : $ /tmp/ruby/build/trunk/miniruby -I/tmp/ruby/src/trunk/lib /tmp/ruby/src/trunk/tool/runruby.rb --archdir=/tmp/ruby/build/trunk --extout=.ext -- /tmp/ruby/src/trunk/spec/mspec/bin/mspec-run -B /tmp/ruby/src/trunk/spec/default.mspec --error-output stderr --debug -fy -o /tmp/rubytest.89p89e/14-mspec-multi-13 E, [2024-05-17T14:35:10.922113 #2896882] ERROR -- : $ /tmp/ruby/build/trunk/miniruby -I/tmp/ruby/src/trunk/lib /tmp/ruby/src/trunk/tool/runruby.rb --archdir=/tmp/ruby/build/trunk --extout=.ext -- /tmp/ruby/src/trunk/spec/mspec/bin/mspec-run -B /tmp/ruby/src/trunk/spec/default.mspec --error-output stderr --debug -fy -o /tmp/rubytest.89p89e/15-mspec-multi-14 E, [2024-05-17T14:35:10.922180 #2896882] ERROR -- : $ /tmp/ruby/build/trunk/miniruby -I/tmp/ruby/src/trunk/lib /tmp/ruby/src/trunk/tool/runruby.rb --archdir=/tmp/ruby/build/trunk --extout=.ext -- /tmp/ruby/src/trunk/spec/mspec/bin/mspec-run -B /tmp/ruby/src/trunk/spec/default.mspec --error-output stderr --debug -fy -o /tmp/rubytest.89p89e/16-mspec-multi-15 E, [2024-05-17T14:35:10.922450 #2896882] ERROR -- : $ /tmp/ruby/build/trunk/miniruby -I/tmp/ruby/src/trunk/lib /tmp/ruby/src/trunk/tool/runruby.rb --archdir=/tmp/ruby/build/trunk --extout=.ext -- /tmp/ruby/src/trunk/spec/mspec/bin/mspec-run -B /tmp/ruby/src/trunk/spec/default.mspec --error-output stderr --debug -fy -o /tmp/rubytest.89p89e/17-mspec-multi-16 E, [2024-05-17T14:35:10.922614 #2896882] ERROR -- : $ /tmp/ruby/build/trunk/miniruby -I/tmp/ruby/src/trunk/lib /tmp/ruby/src/trunk/tool/runruby.rb --archdir=/tmp/ruby/build/trunk --extout=.ext -- /tmp/ruby/src/trunk/spec/mspec/bin/mspec-run -B /tmp/ruby/src/trunk/spec/default.mspec --error-output stderr --debug -fy -o /tmp/rubytest.89p89e/18-mspec-multi-17 E, [2024-05-17T14:35:10.924825 #2896882] ERROR -- : $ /tmp/ruby/build/trunk/miniruby -I/tmp/ruby/src/trunk/lib /tmp/ruby/src/trunk/tool/runruby.rb --archdir=/tmp/ruby/build/trunk --extout=.ext -- /tmp/ruby/src/trunk/spec/mspec/bin/mspec-run -B /tmp/ruby/src/trunk/spec/default.mspec --error-output stderr --debug -fy -o /tmp/rubytest.89p89e/19-mspec-multi-18 E, [2024-05-17T14:35:10.925169 #2896882] ERROR -- : $ /tmp/ruby/build/trunk/miniruby -I/tmp/ruby/src/trunk/lib /tmp/ruby/src/trunk/tool/runruby.rb --archdir=/tmp/ruby/build/trunk --extout=.ext -- /tmp/ruby/src/trunk/spec/mspec/bin/mspec-run -B /tmp/ruby/src/trunk/spec/default.mspec --error-output stderr --debug -fy -o /tmp/rubytest.89p89e/20-mspec-multi-19 I, [2024-05-17T14:35:11.093623 #2896882] INFO -- : ruby 3.4.0dev (2024-05-17T14:33:42Z master 4ba0579da6) [x86_64-linux] I, [2024-05-17T14:35:11.701234 #2896882] INFO -- : 0 ......................................................................... I, [2024-05-17T14:35:12.085221 #2896882] INFO -- : 73 ......................................................................... I, [2024-05-17T14:35:12.242915 #2896882] INFO -- : 146 ......................................................................... I, [2024-05-17T14:35:12.291803 #2896882] INFO -- : 219 ......................................................................... I, [2024-05-17T14:35:12.350496 #2896882] INFO -- : 292 ......................................................................... I, [2024-05-17T14:35:12.392327 #2896882] INFO -- : 365 ......................................................................... I, [2024-05-17T14:35:12.412768 #2896882] INFO -- : 438 ......................................................................... I, [2024-05-17T14:35:12.426809 #2896882] INFO -- : 511 ......................................................................... I, [2024-05-17T14:35:12.441918 #2896882] INFO -- : 584 ......................................................................... I, [2024-05-17T14:35:12.502339 #2896882] INFO -- : 657 ......................................................................... I, [2024-05-17T14:35:12.528162 #2896882] INFO -- : 730 ......................................................................... I, [2024-05-17T14:35:12.549231 #2896882] INFO -- : 803 ......................................................................... I, [2024-05-17T14:35:12.584741 #2896882] INFO -- : 876 ......................................................................... I, [2024-05-17T14:35:12.636888 #2896882] INFO -- : 949 ......................................................................... I, [2024-05-17T14:35:12.722890 #2896882] INFO -- : 1022 ......................................................................... I, [2024-05-17T14:35:12.880728 #2896882] INFO -- : 1095 ......................................................................... I, [2024-05-17T14:35:12.999077 #2896882] INFO -- : 1168 ......................................................................... I, [2024-05-17T14:35:13.058315 #2896882] INFO -- : 1241 ......................................................................... I, [2024-05-17T14:35:13.103268 #2896882] INFO -- : 1314 ......................................................................... I, [2024-05-17T14:35:13.119838 #2896882] INFO -- : 1387 ......................................................................... I, [2024-05-17T14:35:13.211364 #2896882] INFO -- : 1460 ......................................................................... I, [2024-05-17T14:35:13.680243 #2896882] INFO -- : 1533 ......................................................................... I, [2024-05-17T14:35:13.748925 #2896882] INFO -- : 1606 ......................................................................... I, [2024-05-17T14:35:13.857331 #2896882] INFO -- : 1679 ......................................................................... I, [2024-05-17T14:35:13.981869 #2896882] INFO -- : 1752 ......................................................................... I, [2024-05-17T14:35:14.067016 #2896882] INFO -- : 1825 ......................................................................... I, [2024-05-17T14:35:14.189287 #2896882] INFO -- : 1898 ......................................................................... I, [2024-05-17T14:35:14.264013 #2896882] INFO -- : 1971 ......................................................................... I, [2024-05-17T14:35:14.335076 #2896882] INFO -- : 2044 ......................................................................... I, [2024-05-17T14:35:14.388497 #2896882] INFO -- : 2117 ......................................................................... I, [2024-05-17T14:35:14.406163 #2896882] INFO -- : 2190 ......................................................................... I, [2024-05-17T14:35:14.424005 #2896882] INFO -- : 2263 ......................................................................... I, [2024-05-17T14:35:14.438014 #2896882] INFO -- : 2336 ......................................................................... I, [2024-05-17T14:35:14.471512 #2896882] INFO -- : 2409 ......................................................................... I, [2024-05-17T14:35:14.577599 #2896882] INFO -- : 2482 ......................................................................... I, [2024-05-17T14:35:14.599113 #2896882] INFO -- : 2555 ......................................................................... I, [2024-05-17T14:35:14.692866 #2896882] INFO -- : 2628 ......................................................................... I, [2024-05-17T14:35:14.795162 #2896882] INFO -- : 2701 ......................................................................... I, [2024-05-17T14:35:14.825069 #2896882] INFO -- : 2774 ......................................................................... I, [2024-05-17T14:35:14.883397 #2896882] INFO -- : 2847 ......................................................................... I, [2024-05-17T14:35:14.918104 #2896882] INFO -- : 2920 ......................................................................... I, [2024-05-17T14:35:14.945316 #2896882] INFO -- : 2993 ......................................................................... I, [2024-05-17T14:35:14.966572 #2896882] INFO -- : 3066 ......................................................................... I, [2024-05-17T14:35:14.982648 #2896882] INFO -- : 3139 ......................................................................... I, [2024-05-17T14:35:14.992624 #2896882] INFO -- : 3212 ......................................................................... I, [2024-05-17T14:35:15.025547 #2896882] INFO -- : 3285 ......................................................................... I, [2024-05-17T14:35:18.992674 #2896882] INFO -- : 3358 ........................................................................ I, [2024-05-17T14:35:18.992735 #2896882] INFO -- : I, [2024-05-17T14:35:18.992741 #2896882] INFO -- : Finished in 8.072634 seconds I, [2024-05-17T14:35:18.992745 #2896882] INFO -- : I, [2024-05-17T14:35:18.992750 #2896882] INFO -- : 3429 files, 32611 examples, 197610 expectations, 0 failures, 0 errors, 0 tagged I, [2024-05-17T14:35:18.994976 #2896882] INFO -- : $$$[end] "make yes-test-rubyspec MSPECOPT='--error-output stderr --debug -j' TESTS='-j20'" exit with 0.