# Logfile created on 2024-05-17 08:19:48 +0000 by logger.rb/v1.5.0 I, [2024-05-17T08:19:48.242819 #921486] INFO -- : #, @formatter=nil, @logdev=#, @binmode=false, @mon_data=#, @mon_data_owner_object_id=860>>> I, [2024-05-17T08:19:48.244448 #921486] INFO -- : $$$[beg] make update-unicode -j4 I, [2024-05-17T08:19:48.794406 #921486] INFO -- : Downloading Unicode emoji 15.0 files... I, [2024-05-17T08:19:48.795267 #921486] INFO -- : Downloading Unicode emoji 15.0 files... I, [2024-05-17T08:19:48.796140 #921486] INFO -- : Downloading Unicode emoji 15.0 files... I, [2024-05-17T08:19:49.420611 #921486] INFO -- : made symlink emoji/15.0/emoji-sequences.txt to /tmp/ruby/src/trunk/.downloaded-cache/emoji/15.0/emoji-sequences.txt I, [2024-05-17T08:19:49.434864 #921486] INFO -- : downloading emoji/15.0/emoji-test.txt ... /tmp/ruby/src/trunk/enc/unicode/data/emoji/15.0/emoji-sequences.txt already exists I, [2024-05-17T08:19:49.448874 #921486] INFO -- : downloading emoji/15.0/emoji-test.txt ... /tmp/ruby/src/trunk/enc/unicode/data/emoji/15.0/emoji-sequences.txt already exists E, [2024-05-17T08:19:50.174735 #921486] ERROR -- : /tmp/ruby/src/trunk/tool/downloader.rb:302:in `rescue in download': failed to download emoji/15.0/emoji-test.txt (RuntimeError) E, [2024-05-17T08:19:50.175006 #921486] ERROR -- : OpenURI::HTTPError: 403 Forbidden: https://www.unicode.org/Public/emoji/15.0/emoji-test.txt E, [2024-05-17T08:19:50.175130 #921486] ERROR -- : from /tmp/ruby/src/trunk/tool/downloader.rb:201:in `download' E, [2024-05-17T08:19:50.175236 #921486] ERROR -- : from /tmp/ruby/src/trunk/tool/downloader.rb:136:in `download' E, [2024-05-17T08:19:50.175335 #921486] ERROR -- : from /tmp/ruby/src/trunk/tool/downloader.rb:482:in `block in
' E, [2024-05-17T08:19:50.175472 #921486] ERROR -- : from /tmp/ruby/src/trunk/tool/downloader.rb:465:in `each' E, [2024-05-17T08:19:50.175842 #921486] ERROR -- : from /tmp/ruby/src/trunk/tool/downloader.rb:465:in `
' E, [2024-05-17T08:19:50.176069 #921486] ERROR -- : /usr/lib/ruby/3.1.0/open-uri.rb:364:in `open_http': 403 Forbidden (OpenURI::HTTPError) E, [2024-05-17T08:19:50.176177 #921486] ERROR -- : from /usr/lib/ruby/3.1.0/open-uri.rb:741:in `buffer_open' E, [2024-05-17T08:19:50.176291 #921486] ERROR -- : from /usr/lib/ruby/3.1.0/open-uri.rb:212:in `block in open_loop' E, [2024-05-17T08:19:50.176390 #921486] ERROR -- : from /usr/lib/ruby/3.1.0/open-uri.rb:210:in `catch' E, [2024-05-17T08:19:50.176483 #921486] ERROR -- : from /usr/lib/ruby/3.1.0/open-uri.rb:210:in `open_loop' E, [2024-05-17T08:19:50.176576 #921486] ERROR -- : from /usr/lib/ruby/3.1.0/open-uri.rb:151:in `open_uri' E, [2024-05-17T08:19:50.176668 #921486] ERROR -- : from /usr/lib/ruby/3.1.0/open-uri.rb:721:in `open' E, [2024-05-17T08:19:50.176761 #921486] ERROR -- : from /usr/lib/ruby/3.1.0/open-uri.rb:729:in `read' E, [2024-05-17T08:19:50.176919 #921486] ERROR -- : from /tmp/ruby/src/trunk/tool/downloader.rb:247:in `block in download' E, [2024-05-17T08:19:50.177032 #921486] ERROR -- : from /tmp/ruby/src/trunk/tool/downloader.rb:378:in `with_retry' E, [2024-05-17T08:19:50.177170 #921486] ERROR -- : from /tmp/ruby/src/trunk/tool/downloader.rb:246:in `download' E, [2024-05-17T08:19:50.177334 #921486] ERROR -- : from /tmp/ruby/src/trunk/tool/downloader.rb:136:in `download' E, [2024-05-17T08:19:50.177473 #921486] ERROR -- : from /tmp/ruby/src/trunk/tool/downloader.rb:482:in `block in
' E, [2024-05-17T08:19:50.177596 #921486] ERROR -- : from /tmp/ruby/src/trunk/tool/downloader.rb:465:in `each' E, [2024-05-17T08:19:50.177704 #921486] ERROR -- : from /tmp/ruby/src/trunk/tool/downloader.rb:465:in `
' E, [2024-05-17T08:19:50.181702 #921486] ERROR -- : /tmp/ruby/src/trunk/tool/downloader.rb:302:in `rescue in download': failed to download emoji/15.0/emoji-test.txt (RuntimeError) E, [2024-05-17T08:19:50.181900 #921486] ERROR -- : OpenURI::HTTPError: 403 Forbidden: https://www.unicode.org/Public/emoji/15.0/emoji-test.txt E, [2024-05-17T08:19:50.182017 #921486] ERROR -- : from /tmp/ruby/src/trunk/tool/downloader.rb:201:in `download' E, [2024-05-17T08:19:50.182137 #921486] ERROR -- : from /tmp/ruby/src/trunk/tool/downloader.rb:136:in `download' E, [2024-05-17T08:19:50.182239 #921486] ERROR -- : from /tmp/ruby/src/trunk/tool/downloader.rb:482:in `block in
' E, [2024-05-17T08:19:50.182344 #921486] ERROR -- : from /tmp/ruby/src/trunk/tool/downloader.rb:465:in `each' E, [2024-05-17T08:19:50.182494 #921486] ERROR -- : from /tmp/ruby/src/trunk/tool/downloader.rb:465:in `
' E, [2024-05-17T08:19:50.182829 #921486] ERROR -- : /usr/lib/ruby/3.1.0/open-uri.rb:364:in `open_http': 403 Forbidden (OpenURI::HTTPError) E, [2024-05-17T08:19:50.182987 #921486] ERROR -- : from /usr/lib/ruby/3.1.0/open-uri.rb:741:in `buffer_open' E, [2024-05-17T08:19:50.183091 #921486] ERROR -- : from /usr/lib/ruby/3.1.0/open-uri.rb:212:in `block in open_loop' E, [2024-05-17T08:19:50.183188 #921486] ERROR -- : from /usr/lib/ruby/3.1.0/open-uri.rb:210:in `catch' E, [2024-05-17T08:19:50.183305 #921486] ERROR -- : from /usr/lib/ruby/3.1.0/open-uri.rb:210:in `open_loop' E, [2024-05-17T08:19:50.183409 #921486] ERROR -- : from /usr/lib/ruby/3.1.0/open-uri.rb:151:in `open_uri' E, [2024-05-17T08:19:50.183510 #921486] ERROR -- : from /usr/lib/ruby/3.1.0/open-uri.rb:721:in `open' E, [2024-05-17T08:19:50.183607 #921486] ERROR -- : from /usr/lib/ruby/3.1.0/open-uri.rb:729:in `read' E, [2024-05-17T08:19:50.183791 #921486] ERROR -- : from /tmp/ruby/src/trunk/tool/downloader.rb:247:in `block in download' E, [2024-05-17T08:19:50.183956 #921486] ERROR -- : from /tmp/ruby/src/trunk/tool/downloader.rb:378:in `with_retry' E, [2024-05-17T08:19:50.184069 #921486] ERROR -- : from /tmp/ruby/src/trunk/tool/downloader.rb:246:in `download' E, [2024-05-17T08:19:50.184172 #921486] ERROR -- : from /tmp/ruby/src/trunk/tool/downloader.rb:136:in `download' E, [2024-05-17T08:19:50.184271 #921486] ERROR -- : from /tmp/ruby/src/trunk/tool/downloader.rb:482:in `block in
' E, [2024-05-17T08:19:50.184397 #921486] ERROR -- : from /tmp/ruby/src/trunk/tool/downloader.rb:465:in `each' E, [2024-05-17T08:19:50.184502 #921486] ERROR -- : from /tmp/ruby/src/trunk/tool/downloader.rb:465:in `
' E, [2024-05-17T08:19:50.196341 #921486] ERROR -- : make: *** [uncommon.mk:1765: /tmp/ruby/src/trunk/enc/unicode/data/emoji/15.0/emoji-sequences.txt] Error 1 E, [2024-05-17T08:19:50.196549 #921486] ERROR -- : make: *** Deleting file '/tmp/ruby/src/trunk/enc/unicode/data/emoji/15.0/emoji-sequences.txt' E, [2024-05-17T08:19:50.196641 #921486] ERROR -- : make: *** Waiting for unfinished jobs.... E, [2024-05-17T08:19:50.200537 #921486] ERROR -- : /tmp/ruby/src/trunk/tool/downloader.rb:302:in `rescue in download': failed to download emoji/15.0/emoji-test.txt (RuntimeError) E, [2024-05-17T08:19:50.200837 #921486] ERROR -- : OpenURI::HTTPError: 403 Forbidden: https://www.unicode.org/Public/emoji/15.0/emoji-test.txt E, [2024-05-17T08:19:50.201092 #921486] ERROR -- : from /tmp/ruby/src/trunk/tool/downloader.rb:201:in `download' E, [2024-05-17T08:19:50.201258 #921486] ERROR -- : from /tmp/ruby/src/trunk/tool/downloader.rb:136:in `download' E, [2024-05-17T08:19:50.201400 #921486] ERROR -- : from /tmp/ruby/src/trunk/tool/downloader.rb:482:in `block in
' E, [2024-05-17T08:19:50.201536 #921486] ERROR -- : from /tmp/ruby/src/trunk/tool/downloader.rb:465:in `each' E, [2024-05-17T08:19:50.201690 #921486] ERROR -- : from /tmp/ruby/src/trunk/tool/downloader.rb:465:in `
' E, [2024-05-17T08:19:50.202052 #921486] ERROR -- : /usr/lib/ruby/3.1.0/open-uri.rb:364:in `open_http': 403 Forbidden (OpenURI::HTTPError) E, [2024-05-17T08:19:50.202247 #921486] ERROR -- : from /usr/lib/ruby/3.1.0/open-uri.rb:741:in `buffer_open' E, [2024-05-17T08:19:50.202421 #921486] ERROR -- : from /usr/lib/ruby/3.1.0/open-uri.rb:212:in `block in open_loop' E, [2024-05-17T08:19:50.202562 #921486] ERROR -- : from /usr/lib/ruby/3.1.0/open-uri.rb:210:in `catch' E, [2024-05-17T08:19:50.202704 #921486] ERROR -- : from /usr/lib/ruby/3.1.0/open-uri.rb:210:in `open_loop' E, [2024-05-17T08:19:50.202839 #921486] ERROR -- : from /usr/lib/ruby/3.1.0/open-uri.rb:151:in `open_uri' E, [2024-05-17T08:19:50.202993 #921486] ERROR -- : from /usr/lib/ruby/3.1.0/open-uri.rb:721:in `open' E, [2024-05-17T08:19:50.203147 #921486] ERROR -- : from /usr/lib/ruby/3.1.0/open-uri.rb:729:in `read' E, [2024-05-17T08:19:50.203287 #921486] ERROR -- : from /tmp/ruby/src/trunk/tool/downloader.rb:247:in `block in download' E, [2024-05-17T08:19:50.203468 #921486] ERROR -- : from /tmp/ruby/src/trunk/tool/downloader.rb:378:in `with_retry' E, [2024-05-17T08:19:50.203602 #921486] ERROR -- : make: *** [uncommon.mk:1765: /tmp/ruby/src/trunk/enc/unicode/data/emoji/15.0/emoji-test.txt] Error 1 E, [2024-05-17T08:19:50.203828 #921486] ERROR -- : from /tmp/ruby/src/trunk/tool/downloader.rb:246:in `download' E, [2024-05-17T08:19:50.204002 #921486] ERROR -- : from /tmp/ruby/src/trunk/tool/downloader.rb:136:in `download' E, [2024-05-17T08:19:50.204132 #921486] ERROR -- : from /tmp/ruby/src/trunk/tool/downloader.rb:482:in `block in
' E, [2024-05-17T08:19:50.204264 #921486] ERROR -- : from /tmp/ruby/src/trunk/tool/downloader.rb:465:in `each' E, [2024-05-17T08:19:50.204399 #921486] ERROR -- : from /tmp/ruby/src/trunk/tool/downloader.rb:465:in `
' E, [2024-05-17T08:19:50.223106 #921486] ERROR -- : make: *** [uncommon.mk:1765: /tmp/ruby/src/trunk/enc/unicode/data/emoji/15.0/emoji-zwj-sequences.txt] Error 1 I, [2024-05-17T08:19:50.223359 #921486] INFO -- : downloading emoji/15.0/emoji-test.txt ... I, [2024-05-17T08:19:50.224611 #921486] INFO -- : $$$[end] "make update-unicode -j4" exit with 512. I, [2024-05-17T08:19:50.224820 #921486] INFO -- : $$$[beg] make update-download -j4 I, [2024-05-17T08:19:51.387387 #921486] INFO -- : tool/config.guess already exists I, [2024-05-17T08:19:51.387839 #921486] INFO -- : tool/config.sub already exists I, [2024-05-17T08:19:51.405855 #921486] INFO -- : Update minitest to ea9caafc0754b1d6236a490d59e624b53209734a I, [2024-05-17T08:19:51.406581 #921486] INFO -- : Update power_assert to 84e85124c5014a139af39161d484156cfe87a9ed I, [2024-05-17T08:19:51.409322 #921486] INFO -- : Update rbs to ba7872795d5de04adb8ff500c0e6afdc81a041dd I, [2024-05-17T08:19:51.414503 #921486] INFO -- : Update typeprof to b19a6416da3a05d57fadd6ffdadb382b6d236ca5 I, [2024-05-17T08:19:51.421815 #921486] INFO -- : echo ea9caafc0754b1d6236a490d59e624b53209734a | /bin/sh /tmp/ruby/src/trunk/tool/ifchange /tmp/ruby/src/trunk/.bundle/.timestamp/minitest.revision - I, [2024-05-17T08:19:51.423085 #921486] INFO -- : echo 84e85124c5014a139af39161d484156cfe87a9ed | /bin/sh /tmp/ruby/src/trunk/tool/ifchange /tmp/ruby/src/trunk/.bundle/.timestamp/power_assert.revision - I, [2024-05-17T08:19:51.424856 #921486] INFO -- : echo ba7872795d5de04adb8ff500c0e6afdc81a041dd | /bin/sh /tmp/ruby/src/trunk/tool/ifchange /tmp/ruby/src/trunk/.bundle/.timestamp/rbs.revision - I, [2024-05-17T08:19:51.429926 #921486] INFO -- : echo b19a6416da3a05d57fadd6ffdadb382b6d236ca5 | /bin/sh /tmp/ruby/src/trunk/tool/ifchange /tmp/ruby/src/trunk/.bundle/.timestamp/typeprof.revision - I, [2024-05-17T08:19:51.436164 #921486] INFO -- : /tmp/ruby/src/trunk/.bundle/.timestamp/minitest.revision unchanged I, [2024-05-17T08:19:51.436927 #921486] INFO -- : /tmp/ruby/src/trunk/.bundle/.timestamp/rbs.revision unchanged I, [2024-05-17T08:19:51.437645 #921486] INFO -- : /tmp/ruby/src/trunk/.bundle/.timestamp/power_assert.revision unchanged I, [2024-05-17T08:19:51.442137 #921486] INFO -- : /tmp/ruby/src/trunk/.bundle/.timestamp/typeprof.revision unchanged I, [2024-05-17T08:19:52.247636 #921486] INFO -- : Building power_assert@84e85124c5014a139af39161d484156cfe87a9ed to /tmp/ruby/src/trunk/gems/power_assert-2.0.3.gem I, [2024-05-17T08:19:53.170967 #921486] INFO -- : Successfully built RubyGem I, [2024-05-17T08:19:53.171176 #921486] INFO -- : Name: power_assert I, [2024-05-17T08:19:53.171292 #921486] INFO -- : Version: 2.0.4dev I, [2024-05-17T08:19:53.171382 #921486] INFO -- : File: power_assert-2.0.4dev.gem I, [2024-05-17T08:19:53.881299 #921486] INFO -- : $$$[end] "make update-download -j4" exit with 0. I, [2024-05-17T08:19:53.881532 #921486] INFO -- : $$$[beg] make update-rubyspec -j4 I, [2024-05-17T08:19:54.412626 #921486] INFO -- : make: Nothing to be done for 'update-rubyspec'. I, [2024-05-17T08:19:54.414453 #921486] INFO -- : $$$[end] "make update-rubyspec -j4" exit with 0. I, [2024-05-17T08:19:54.414653 #921486] INFO -- : $$$[beg] make update-src -j4 I, [2024-05-17T08:19:55.898921 #921486] INFO -- : Already up to date. I, [2024-05-17T08:19:55.964904 #921486] INFO -- : Latest commit hash = 534f1c37e3 I, [2024-05-17T08:19:55.970451 #921486] INFO -- : $$$[end] "make update-src -j4" exit with 0. I, [2024-05-17T08:19:55.970703 #921486] INFO -- : $$$[beg] make after-update -j4 I, [2024-05-17T08:19:56.824298 #921486] INFO -- : /tmp/ruby/src/trunk/revision.h updated I, [2024-05-17T08:19:56.832122 #921486] INFO -- : generating riscv64-linux-fake.rb I, [2024-05-17T08:19:57.334084 #921486] INFO -- : riscv64-linux-fake.rb updated I, [2024-05-17T08:19:57.340404 #921486] INFO -- : generating enc.mk I, [2024-05-17T08:19:58.960060 #921486] INFO -- : making srcs under enc I, [2024-05-17T08:19:59.254106 #921486] INFO -- : make[1]: Entering directory '/tmp/ruby/build/trunk' I, [2024-05-17T08:19:59.254377 #921486] INFO -- : make[1]: Nothing to be done for 'srcs'. I, [2024-05-17T08:19:59.254593 #921486] INFO -- : make[1]: Leaving directory '/tmp/ruby/build/trunk' I, [2024-05-17T08:19:59.923027 #921486] INFO -- : Update minitest to ea9caafc0754b1d6236a490d59e624b53209734a I, [2024-05-17T08:19:59.924229 #921486] INFO -- : Update power_assert to 84e85124c5014a139af39161d484156cfe87a9ed I, [2024-05-17T08:19:59.924539 #921486] INFO -- : Update rbs to ba7872795d5de04adb8ff500c0e6afdc81a041dd I, [2024-05-17T08:19:59.926705 #921486] INFO -- : Update typeprof to b19a6416da3a05d57fadd6ffdadb382b6d236ca5 I, [2024-05-17T08:19:59.931777 #921486] INFO -- : echo ea9caafc0754b1d6236a490d59e624b53209734a | /bin/sh /tmp/ruby/src/trunk/tool/ifchange /tmp/ruby/src/trunk/.bundle/.timestamp/minitest.revision - I, [2024-05-17T08:19:59.937829 #921486] INFO -- : echo 84e85124c5014a139af39161d484156cfe87a9ed | /bin/sh /tmp/ruby/src/trunk/tool/ifchange /tmp/ruby/src/trunk/.bundle/.timestamp/power_assert.revision - I, [2024-05-17T08:19:59.938579 #921486] INFO -- : echo ba7872795d5de04adb8ff500c0e6afdc81a041dd | /bin/sh /tmp/ruby/src/trunk/tool/ifchange /tmp/ruby/src/trunk/.bundle/.timestamp/rbs.revision - I, [2024-05-17T08:19:59.940259 #921486] INFO -- : echo b19a6416da3a05d57fadd6ffdadb382b6d236ca5 | /bin/sh /tmp/ruby/src/trunk/tool/ifchange /tmp/ruby/src/trunk/.bundle/.timestamp/typeprof.revision - I, [2024-05-17T08:19:59.942136 #921486] INFO -- : /tmp/ruby/src/trunk/.bundle/.timestamp/minitest.revision unchanged I, [2024-05-17T08:19:59.948334 #921486] INFO -- : /tmp/ruby/src/trunk/.bundle/.timestamp/power_assert.revision unchanged I, [2024-05-17T08:19:59.950151 #921486] INFO -- : /tmp/ruby/src/trunk/.bundle/.timestamp/rbs.revision unchanged I, [2024-05-17T08:19:59.950382 #921486] INFO -- : /tmp/ruby/src/trunk/.bundle/.timestamp/typeprof.revision unchanged I, [2024-05-17T08:20:00.751511 #921486] INFO -- : Building power_assert@84e85124c5014a139af39161d484156cfe87a9ed to /tmp/ruby/src/trunk/gems/power_assert-2.0.3.gem I, [2024-05-17T08:20:01.699174 #921486] INFO -- : Successfully built RubyGem I, [2024-05-17T08:20:01.699390 #921486] INFO -- : Name: power_assert I, [2024-05-17T08:20:01.699477 #921486] INFO -- : Version: 2.0.4dev I, [2024-05-17T08:20:01.699559 #921486] INFO -- : File: power_assert-2.0.4dev.gem I, [2024-05-17T08:20:01.714954 #921486] INFO -- : Extracting bundle gem power_assert-2.0.3... I, [2024-05-17T08:20:02.565358 #921486] INFO -- : Try with hash version of bundled gems instead of gems/power_assert-2.0.3.gem. We don't use this gem with release version of Ruby. I, [2024-05-17T08:20:02.620342 #921486] INFO -- : Unpacked gems/power_assert-2.0.4dev.gem I, [2024-05-17T08:20:02.635567 #921486] INFO -- : $$$[end] "make after-update -j4" exit with 0. I, [2024-05-17T08:20:02.636409 #921486] INFO -- : $$$[beg] make miniruby -j4 I, [2024-05-17T08:20:03.180911 #921486] INFO -- : BASERUBY = /usr/bin/ruby --disable=gems I, [2024-05-17T08:20:03.181243 #921486] INFO -- : CC = gcc I, [2024-05-17T08:20:03.181437 #921486] INFO -- : LD = ld I, [2024-05-17T08:20:03.181619 #921486] INFO -- : LDSHARED = gcc -shared I, [2024-05-17T08:20:03.181832 #921486] INFO -- : CFLAGS = -O3 -fno-fast-math -ggdb3 -Wall -Wextra -Wdeprecated-declarations -Wdiv-by-zero -Wduplicated-cond -Wimplicit-function-declaration -Wimplicit-int -Wpointer-arith -Wwrite-strings -Wold-style-definition -Wimplicit-fallthrough=0 -Wmissing-noreturn -Wno-cast-function-type -Wno-constant-logical-operand -Wno-long-long -Wno-missing-field-initializers -Wno-overlength-strings -Wno-packed-bitfield-compat -Wno-parentheses-equality -Wno-self-assign -Wno-tautological-compare -Wno-unused-parameter -Wno-unused-value -Wsuggest-attribute=format -Wsuggest-attribute=noreturn -Wunused-variable -Wmisleading-indentation -Wundef -fPIC I, [2024-05-17T08:20:03.182063 #921486] INFO -- : XCFLAGS = -U_FORTIFY_SOURCE -D_FORTIFY_SOURCE=2 -fstack-protector-strong -fno-strict-overflow -fvisibility=hidden -fexcess-precision=standard -DRUBY_EXPORT -I. -I.ext/include/riscv64-linux -I/tmp/ruby/src/trunk/include -I/tmp/ruby/src/trunk -I/tmp/ruby/src/trunk/prism -I/tmp/ruby/src/trunk/enc/unicode/15.0.0 I, [2024-05-17T08:20:03.182251 #921486] INFO -- : CPPFLAGS = I, [2024-05-17T08:20:03.182417 #921486] INFO -- : DLDFLAGS = -Wl,--compress-debug-sections=zlib -Wl,-soname,libruby.so.3.4 -fstack-protector-strong I, [2024-05-17T08:20:03.182588 #921486] INFO -- : SOLIBS = -lz -lrt -lrt -lgmp -ldl -lcrypt -lm -lpthread I, [2024-05-17T08:20:03.182765 #921486] INFO -- : LANG = I, [2024-05-17T08:20:03.182938 #921486] INFO -- : LC_ALL = I, [2024-05-17T08:20:03.183104 #921486] INFO -- : LC_CTYPE = I, [2024-05-17T08:20:03.183272 #921486] INFO -- : MFLAGS = -j4 --jobserver-auth=4,5 I, [2024-05-17T08:20:03.183434 #921486] INFO -- : RUSTC = rustc I, [2024-05-17T08:20:03.183626 #921486] INFO -- : YJIT_RUSTC_ARGS = --crate-name=yjit --crate-type=staticlib --edition=2021 -g -C lto=thin -C opt-level=3 -C overflow-checks=on '--out-dir=/tmp/ruby/build/trunk/yjit/target/release/' /tmp/ruby/src/trunk/yjit/src/lib.rs I, [2024-05-17T08:20:03.194792 #921486] INFO -- : gcc (Debian 13.2.0-4revyos1) 13.2.0 I, [2024-05-17T08:20:03.194982 #921486] INFO -- : Copyright (C) 2023 Free Software Foundation, Inc. I, [2024-05-17T08:20:03.195073 #921486] INFO -- : This is free software; see the source for copying conditions. There is NO I, [2024-05-17T08:20:03.195159 #921486] INFO -- : warranty; not even for MERCHANTABILITY or FITNESS FOR A PARTICULAR PURPOSE. I, [2024-05-17T08:20:03.195247 #921486] INFO -- : I, [2024-05-17T08:20:03.422945 #921486] INFO -- : compiling /tmp/ruby/src/trunk/version.c I, [2024-05-17T08:20:04.592889 #921486] INFO -- : linking miniruby I, [2024-05-17T08:20:44.991379 #921486] INFO -- : $$$[end] "make miniruby -j4" exit with 0. I, [2024-05-17T08:20:44.992092 #921486] INFO -- : $$$[beg] make ruby -j4 I, [2024-05-17T08:20:45.508246 #921486] INFO -- : BASERUBY = /usr/bin/ruby --disable=gems I, [2024-05-17T08:20:45.508488 #921486] INFO -- : CC = gcc I, [2024-05-17T08:20:45.508610 #921486] INFO -- : LD = ld I, [2024-05-17T08:20:45.508765 #921486] INFO -- : LDSHARED = gcc -shared I, [2024-05-17T08:20:45.508888 #921486] INFO -- : CFLAGS = -O3 -fno-fast-math -ggdb3 -Wall -Wextra -Wdeprecated-declarations -Wdiv-by-zero -Wduplicated-cond -Wimplicit-function-declaration -Wimplicit-int -Wpointer-arith -Wwrite-strings -Wold-style-definition -Wimplicit-fallthrough=0 -Wmissing-noreturn -Wno-cast-function-type -Wno-constant-logical-operand -Wno-long-long -Wno-missing-field-initializers -Wno-overlength-strings -Wno-packed-bitfield-compat -Wno-parentheses-equality -Wno-self-assign -Wno-tautological-compare -Wno-unused-parameter -Wno-unused-value -Wsuggest-attribute=format -Wsuggest-attribute=noreturn -Wunused-variable -Wmisleading-indentation -Wundef -fPIC I, [2024-05-17T08:20:45.509026 #921486] INFO -- : XCFLAGS = -U_FORTIFY_SOURCE -D_FORTIFY_SOURCE=2 -fstack-protector-strong -fno-strict-overflow -fvisibility=hidden -fexcess-precision=standard -DRUBY_EXPORT -I. -I.ext/include/riscv64-linux -I/tmp/ruby/src/trunk/include -I/tmp/ruby/src/trunk -I/tmp/ruby/src/trunk/prism -I/tmp/ruby/src/trunk/enc/unicode/15.0.0 I, [2024-05-17T08:20:45.509149 #921486] INFO -- : CPPFLAGS = I, [2024-05-17T08:20:45.509249 #921486] INFO -- : DLDFLAGS = -Wl,--compress-debug-sections=zlib -Wl,-soname,libruby.so.3.4 -fstack-protector-strong I, [2024-05-17T08:20:45.509349 #921486] INFO -- : SOLIBS = -lz -lrt -lrt -lgmp -ldl -lcrypt -lm -lpthread I, [2024-05-17T08:20:45.509440 #921486] INFO -- : LANG = I, [2024-05-17T08:20:45.509532 #921486] INFO -- : LC_ALL = I, [2024-05-17T08:20:45.509631 #921486] INFO -- : LC_CTYPE = I, [2024-05-17T08:20:45.509732 #921486] INFO -- : MFLAGS = -j4 --jobserver-auth=4,5 I, [2024-05-17T08:20:45.509834 #921486] INFO -- : RUSTC = rustc I, [2024-05-17T08:20:45.509942 #921486] INFO -- : YJIT_RUSTC_ARGS = --crate-name=yjit --crate-type=staticlib --edition=2021 -g -C lto=thin -C opt-level=3 -C overflow-checks=on '--out-dir=/tmp/ruby/build/trunk/yjit/target/release/' /tmp/ruby/src/trunk/yjit/src/lib.rs I, [2024-05-17T08:20:45.523282 #921486] INFO -- : gcc (Debian 13.2.0-4revyos1) 13.2.0 I, [2024-05-17T08:20:45.523493 #921486] INFO -- : Copyright (C) 2023 Free Software Foundation, Inc. I, [2024-05-17T08:20:45.523598 #921486] INFO -- : This is free software; see the source for copying conditions. There is NO I, [2024-05-17T08:20:45.523748 #921486] INFO -- : warranty; not even for MERCHANTABILITY or FITNESS FOR A PARTICULAR PURPOSE. I, [2024-05-17T08:20:45.523884 #921486] INFO -- : I, [2024-05-17T08:20:46.196093 #921486] INFO -- : builtin_binary.inc updated I, [2024-05-17T08:20:46.207645 #921486] INFO -- : 63c4b2d66003409833406b3a662615f9f67397fdf425c22dee41f60d762f36d6 builtin_binary.inc I, [2024-05-17T08:20:46.210611 #921486] INFO -- : compiling /tmp/ruby/src/trunk/builtin.c I, [2024-05-17T08:20:47.903944 #921486] INFO -- : linking static-library libruby-static.a I, [2024-05-17T08:20:54.926103 #921486] INFO -- : linking shared-library libruby.so.3.4.0 I, [2024-05-17T08:21:36.749171 #921486] INFO -- : linking ruby I, [2024-05-17T08:21:36.954303 #921486] INFO -- : $$$[end] "make ruby -j4" exit with 0. I, [2024-05-17T08:21:36.954903 #921486] INFO -- : $$$[beg] make all -j4 I, [2024-05-17T08:21:37.487459 #921486] INFO -- : BASERUBY = /usr/bin/ruby --disable=gems I, [2024-05-17T08:21:37.487757 #921486] INFO -- : CC = gcc I, [2024-05-17T08:21:37.487915 #921486] INFO -- : LD = ld I, [2024-05-17T08:21:37.488046 #921486] INFO -- : LDSHARED = gcc -shared I, [2024-05-17T08:21:37.488205 #921486] INFO -- : CFLAGS = -O3 -fno-fast-math -ggdb3 -Wall -Wextra -Wdeprecated-declarations -Wdiv-by-zero -Wduplicated-cond -Wimplicit-function-declaration -Wimplicit-int -Wpointer-arith -Wwrite-strings -Wold-style-definition -Wimplicit-fallthrough=0 -Wmissing-noreturn -Wno-cast-function-type -Wno-constant-logical-operand -Wno-long-long -Wno-missing-field-initializers -Wno-overlength-strings -Wno-packed-bitfield-compat -Wno-parentheses-equality -Wno-self-assign -Wno-tautological-compare -Wno-unused-parameter -Wno-unused-value -Wsuggest-attribute=format -Wsuggest-attribute=noreturn -Wunused-variable -Wmisleading-indentation -Wundef -fPIC I, [2024-05-17T08:21:37.488421 #921486] INFO -- : XCFLAGS = -U_FORTIFY_SOURCE -D_FORTIFY_SOURCE=2 -fstack-protector-strong -fno-strict-overflow -fvisibility=hidden -fexcess-precision=standard -DRUBY_EXPORT -I. -I.ext/include/riscv64-linux -I/tmp/ruby/src/trunk/include -I/tmp/ruby/src/trunk -I/tmp/ruby/src/trunk/prism -I/tmp/ruby/src/trunk/enc/unicode/15.0.0 I, [2024-05-17T08:21:37.488566 #921486] INFO -- : CPPFLAGS = I, [2024-05-17T08:21:37.488687 #921486] INFO -- : DLDFLAGS = -Wl,--compress-debug-sections=zlib -Wl,-soname,libruby.so.3.4 -fstack-protector-strong I, [2024-05-17T08:21:37.488796 #921486] INFO -- : SOLIBS = -lz -lrt -lrt -lgmp -ldl -lcrypt -lm -lpthread I, [2024-05-17T08:21:37.488893 #921486] INFO -- : LANG = I, [2024-05-17T08:21:37.488985 #921486] INFO -- : LC_ALL = I, [2024-05-17T08:21:37.489082 #921486] INFO -- : LC_CTYPE = I, [2024-05-17T08:21:37.489182 #921486] INFO -- : MFLAGS = -j4 --jobserver-auth=4,5 I, [2024-05-17T08:21:37.489289 #921486] INFO -- : RUSTC = rustc I, [2024-05-17T08:21:37.489410 #921486] INFO -- : YJIT_RUSTC_ARGS = --crate-name=yjit --crate-type=staticlib --edition=2021 -g -C lto=thin -C opt-level=3 -C overflow-checks=on '--out-dir=/tmp/ruby/build/trunk/yjit/target/release/' /tmp/ruby/src/trunk/yjit/src/lib.rs I, [2024-05-17T08:21:37.501871 #921486] INFO -- : gcc (Debian 13.2.0-4revyos1) 13.2.0 I, [2024-05-17T08:21:37.502059 #921486] INFO -- : Copyright (C) 2023 Free Software Foundation, Inc. I, [2024-05-17T08:21:37.502143 #921486] INFO -- : This is free software; see the source for copying conditions. There is NO I, [2024-05-17T08:21:37.502226 #921486] INFO -- : warranty; not even for MERCHANTABILITY or FITNESS FOR A PARTICULAR PURPOSE. I, [2024-05-17T08:21:37.502312 #921486] INFO -- : I, [2024-05-17T08:21:37.810918 #921486] INFO -- : generating enc.mk I, [2024-05-17T08:21:37.828043 #921486] INFO -- : building spec/ruby/optional/capi/ext/array_spec.so I, [2024-05-17T08:21:37.830425 #921486] INFO -- : building spec/ruby/optional/capi/ext/basic_object_spec.so I, [2024-05-17T08:21:37.834433 #921486] INFO -- : building spec/ruby/optional/capi/ext/bignum_spec.so I, [2024-05-17T08:21:38.776992 #921486] INFO -- : building spec/ruby/optional/capi/ext/binding_spec.so I, [2024-05-17T08:21:39.134430 #921486] INFO -- : building spec/ruby/optional/capi/ext/boolean_spec.so I, [2024-05-17T08:21:39.531583 #921486] INFO -- : building spec/ruby/optional/capi/ext/class_id_under_autoload_spec.so I, [2024-05-17T08:21:39.827391 #921486] INFO -- : building spec/ruby/optional/capi/ext/class_spec.so I, [2024-05-17T08:21:40.233693 #921486] INFO -- : building spec/ruby/optional/capi/ext/class_under_autoload_spec.so I, [2024-05-17T08:21:40.366321 #921486] INFO -- : building spec/ruby/optional/capi/ext/complex_spec.so I, [2024-05-17T08:21:40.572935 #921486] INFO -- : building spec/ruby/optional/capi/ext/constants_spec.so I, [2024-05-17T08:21:41.249594 #921486] INFO -- : building spec/ruby/optional/capi/ext/data_spec.so I, [2024-05-17T08:21:41.458685 #921486] INFO -- : building spec/ruby/optional/capi/ext/debug_spec.so I, [2024-05-17T08:21:41.542154 #921486] INFO -- : building spec/ruby/optional/capi/ext/encoding_spec.so I, [2024-05-17T08:21:42.575337 #921486] INFO -- : building spec/ruby/optional/capi/ext/enumerator_spec.so I, [2024-05-17T08:21:42.612643 #921486] INFO -- : building spec/ruby/optional/capi/ext/exception_spec.so I, [2024-05-17T08:21:42.806785 #921486] INFO -- : building spec/ruby/optional/capi/ext/fiber_spec.so I, [2024-05-17T08:21:43.887949 #921486] INFO -- : building spec/ruby/optional/capi/ext/file_spec.so I, [2024-05-17T08:21:44.104869 #921486] INFO -- : building spec/ruby/optional/capi/ext/fixnum_spec.so I, [2024-05-17T08:21:44.135023 #921486] INFO -- : building spec/ruby/optional/capi/ext/float_spec.so I, [2024-05-17T08:21:44.313269 #921486] INFO -- : building spec/ruby/optional/capi/ext/gc_spec.so I, [2024-05-17T08:21:44.966746 #921486] INFO -- : building spec/ruby/optional/capi/ext/globals_spec.so I, [2024-05-17T08:21:45.149443 #921486] INFO -- : building spec/ruby/optional/capi/ext/hash_spec.so I, [2024-05-17T08:21:45.213512 #921486] INFO -- : building spec/ruby/optional/capi/ext/integer_spec.so I, [2024-05-17T08:21:45.671429 #921486] INFO -- : building spec/ruby/optional/capi/ext/io_spec.so I, [2024-05-17T08:21:46.327936 #921486] INFO -- : building spec/ruby/optional/capi/ext/kernel_spec.so I, [2024-05-17T08:21:46.398930 #921486] INFO -- : building spec/ruby/optional/capi/ext/language_spec.so I, [2024-05-17T08:21:46.567874 #921486] INFO -- : building spec/ruby/optional/capi/ext/marshal_spec.so I, [2024-05-17T08:21:47.540808 #921486] INFO -- : building spec/ruby/optional/capi/ext/module_spec.so I, [2024-05-17T08:21:47.618031 #921486] INFO -- : building spec/ruby/optional/capi/ext/module_under_autoload_spec.so I, [2024-05-17T08:21:47.954756 #921486] INFO -- : building spec/ruby/optional/capi/ext/mutex_spec.so I, [2024-05-17T08:21:48.656334 #921486] INFO -- : building spec/ruby/optional/capi/ext/numeric_spec.so I, [2024-05-17T08:21:48.949949 #921486] INFO -- : building spec/ruby/optional/capi/ext/object_spec.so I, [2024-05-17T08:21:49.178957 #921486] INFO -- : building spec/ruby/optional/capi/ext/proc_spec.so I, [2024-05-17T08:21:49.218205 #921486] INFO -- : building spec/ruby/optional/capi/ext/range_spec.so I, [2024-05-17T08:21:50.279229 #921486] INFO -- : building spec/ruby/optional/capi/ext/rational_spec.so I, [2024-05-17T08:21:50.342013 #921486] INFO -- : building spec/ruby/optional/capi/ext/rbasic_spec.so I, [2024-05-17T08:21:50.751179 #921486] INFO -- : building spec/ruby/optional/capi/ext/regexp_spec.so I, [2024-05-17T08:21:51.394957 #921486] INFO -- : building spec/ruby/optional/capi/ext/st_spec.so I, [2024-05-17T08:21:51.711716 #921486] INFO -- : building spec/ruby/optional/capi/ext/string_spec.so I, [2024-05-17T08:21:51.734822 #921486] INFO -- : building spec/ruby/optional/capi/ext/struct_spec.so I, [2024-05-17T08:21:52.083308 #921486] INFO -- : building spec/ruby/optional/capi/ext/symbol_spec.so I, [2024-05-17T08:21:52.577016 #921486] INFO -- : building spec/ruby/optional/capi/ext/thread_spec.so I, [2024-05-17T08:21:52.891243 #921486] INFO -- : building spec/ruby/optional/capi/ext/time_spec.so I, [2024-05-17T08:21:53.713228 #921486] INFO -- : building spec/ruby/optional/capi/ext/tracepoint_spec.so I, [2024-05-17T08:21:54.058054 #921486] INFO -- : building spec/ruby/optional/capi/ext/typed_data_spec.so I, [2024-05-17T08:21:54.281118 #921486] INFO -- : building spec/ruby/optional/capi/ext/util_spec.so I, [2024-05-17T08:21:54.829565 #921486] INFO -- : making enc I, [2024-05-17T08:21:55.047806 #921486] INFO -- : make[1]: Entering directory '/tmp/ruby/build/trunk' I, [2024-05-17T08:21:55.048060 #921486] INFO -- : make[1]: Nothing to be done for 'enc'. I, [2024-05-17T08:21:55.048222 #921486] INFO -- : make[1]: Leaving directory '/tmp/ruby/build/trunk' I, [2024-05-17T08:21:55.061914 #921486] INFO -- : making srcs under enc I, [2024-05-17T08:21:55.401113 #921486] INFO -- : make[1]: Entering directory '/tmp/ruby/build/trunk' I, [2024-05-17T08:21:55.401378 #921486] INFO -- : make[1]: Nothing to be done for 'srcs'. I, [2024-05-17T08:21:55.401519 #921486] INFO -- : make[1]: Leaving directory '/tmp/ruby/build/trunk' I, [2024-05-17T08:21:55.405145 #921486] INFO -- : generating transdb.h I, [2024-05-17T08:21:56.642403 #921486] INFO -- : transdb.h unchanged I, [2024-05-17T08:21:56.648533 #921486] INFO -- : generating makefiles ext/configure-ext.mk I, [2024-05-17T08:21:56.649126 #921486] INFO -- : making trans I, [2024-05-17T08:21:56.843410 #921486] INFO -- : ext/configure-ext.mk updated I, [2024-05-17T08:21:56.854867 #921486] INFO -- : make[1]: Entering directory '/tmp/ruby/build/trunk' I, [2024-05-17T08:21:57.000353 #921486] INFO -- : make[1]: Entering directory '/tmp/ruby/build/trunk' I, [2024-05-17T08:21:57.000577 #921486] INFO -- : make[1]: Nothing to be done for 'trans'. I, [2024-05-17T08:21:57.000703 #921486] INFO -- : make[1]: Leaving directory '/tmp/ruby/build/trunk' I, [2024-05-17T08:21:58.167990 #921486] INFO -- : making encs I, [2024-05-17T08:21:58.591019 #921486] INFO -- : make[1]: Entering directory '/tmp/ruby/build/trunk' I, [2024-05-17T08:21:58.591249 #921486] INFO -- : make[1]: Nothing to be done for 'encs'. I, [2024-05-17T08:21:58.591383 #921486] INFO -- : make[1]: Leaving directory '/tmp/ruby/build/trunk' I, [2024-05-17T08:22:00.346814 #921486] INFO -- : make[1]: Leaving directory '/tmp/ruby/build/trunk' I, [2024-05-17T08:22:00.348764 #921486] INFO -- : generating makefile exts.mk I, [2024-05-17T08:22:00.672740 #921486] INFO -- : exts.mk unchanged I, [2024-05-17T08:22:00.711292 #921486] INFO -- : make[1]: Entering directory '/tmp/ruby/build/trunk' I, [2024-05-17T08:22:01.223373 #921486] INFO -- : make[2]: Entering directory '/tmp/ruby/build/trunk/ext/coverage' I, [2024-05-17T08:22:01.225692 #921486] INFO -- : make[2]: Entering directory '/tmp/ruby/build/trunk/ext/digest' I, [2024-05-17T08:22:01.239881 #921486] INFO -- : make[2]: Entering directory '/tmp/ruby/build/trunk/ext/date' I, [2024-05-17T08:22:01.246585 #921486] INFO -- : make[2]: Leaving directory '/tmp/ruby/build/trunk/ext/coverage' I, [2024-05-17T08:22:01.265557 #921486] INFO -- : make[2]: Leaving directory '/tmp/ruby/build/trunk/ext/date' I, [2024-05-17T08:22:01.268515 #921486] INFO -- : make[2]: Leaving directory '/tmp/ruby/build/trunk/ext/digest' I, [2024-05-17T08:22:01.294820 #921486] INFO -- : make[2]: Entering directory '/tmp/ruby/build/trunk/ext/io/console' I, [2024-05-17T08:22:01.309396 #921486] INFO -- : make[2]: Entering directory '/tmp/ruby/build/trunk/ext/fiddle' I, [2024-05-17T08:22:01.312707 #921486] INFO -- : make[2]: Leaving directory '/tmp/ruby/build/trunk/ext/io/console' I, [2024-05-17T08:22:01.314234 #921486] INFO -- : make[2]: Entering directory '/tmp/ruby/build/trunk/ext/json' I, [2024-05-17T08:22:01.328662 #921486] INFO -- : make[2]: Entering directory '/tmp/ruby/build/trunk/ext/monitor' I, [2024-05-17T08:22:01.352102 #921486] INFO -- : make[2]: Entering directory '/tmp/ruby/build/trunk/ext/objspace' I, [2024-05-17T08:22:01.361347 #921486] INFO -- : make[2]: Leaving directory '/tmp/ruby/build/trunk/ext/monitor' I, [2024-05-17T08:22:01.368597 #921486] INFO -- : make[2]: Leaving directory '/tmp/ruby/build/trunk/ext/fiddle' I, [2024-05-17T08:22:01.371187 #921486] INFO -- : make[2]: Leaving directory '/tmp/ruby/build/trunk/ext/json' I, [2024-05-17T08:22:01.382598 #921486] INFO -- : make[2]: Leaving directory '/tmp/ruby/build/trunk/ext/objspace' I, [2024-05-17T08:22:01.394984 #921486] INFO -- : make[2]: Entering directory '/tmp/ruby/build/trunk/ext/pathname' I, [2024-05-17T08:22:01.409961 #921486] INFO -- : make[2]: Entering directory '/tmp/ruby/build/trunk/ext/psych' I, [2024-05-17T08:22:01.410342 #921486] INFO -- : make[2]: Entering directory '/tmp/ruby/build/trunk/ext/pty' I, [2024-05-17T08:22:01.414210 #921486] INFO -- : make[2]: Leaving directory '/tmp/ruby/build/trunk/ext/pathname' I, [2024-05-17T08:22:01.429227 #921486] INFO -- : make[2]: Leaving directory '/tmp/ruby/build/trunk/ext/pty' I, [2024-05-17T08:22:01.482695 #921486] INFO -- : make[2]: Entering directory '/tmp/ruby/build/trunk/ext/openssl' I, [2024-05-17T08:22:01.483000 #921486] INFO -- : make[2]: Entering directory '/tmp/ruby/build/trunk/ext/ripper' I, [2024-05-17T08:22:01.522675 #921486] INFO -- : make[2]: Entering directory '/tmp/ruby/build/trunk/ext/rubyvm' I, [2024-05-17T08:22:01.526218 #921486] INFO -- : make[2]: Leaving directory '/tmp/ruby/build/trunk/ext/ripper' I, [2024-05-17T08:22:01.535229 #921486] INFO -- : make[2]: Leaving directory '/tmp/ruby/build/trunk/ext/psych' I, [2024-05-17T08:22:01.537982 #921486] INFO -- : make[2]: Leaving directory '/tmp/ruby/build/trunk/ext/rubyvm' I, [2024-05-17T08:22:01.581280 #921486] INFO -- : make[2]: Entering directory '/tmp/ruby/build/trunk/.bundle/gems/bigdecimal-3.1.8/ext/bigdecimal' I, [2024-05-17T08:22:01.601155 #921486] INFO -- : make[2]: Leaving directory '/tmp/ruby/build/trunk/ext/openssl' I, [2024-05-17T08:22:01.606881 #921486] INFO -- : make[2]: Entering directory '/tmp/ruby/build/trunk/.bundle/gems/debug-1.9.2/ext/debug' I, [2024-05-17T08:22:01.611136 #921486] INFO -- : make[2]: Entering directory '/tmp/ruby/build/trunk/ext/socket' I, [2024-05-17T08:22:01.616045 #921486] INFO -- : make[2]: Entering directory '/tmp/ruby/build/trunk/.bundle/gems/nkf-0.2.0/ext/nkf' I, [2024-05-17T08:22:01.671045 #921486] INFO -- : make[2]: Leaving directory '/tmp/ruby/build/trunk/ext/socket' I, [2024-05-17T08:22:01.686377 #921486] INFO -- : make[2]: Entering directory '/tmp/ruby/build/trunk/.bundle/gems/racc-1.7.3/ext/racc/cparse' I, [2024-05-17T08:22:01.743115 #921486] INFO -- : make[2]: Leaving directory '/tmp/ruby/build/trunk/.bundle/gems/bigdecimal-3.1.8/ext/bigdecimal' I, [2024-05-17T08:22:01.761926 #921486] INFO -- : make[2]: Entering directory '/tmp/ruby/build/trunk/.bundle/gems/rbs-3.4.4/ext/rbs_extension' I, [2024-05-17T08:22:01.780386 #921486] INFO -- : make[2]: Leaving directory '/tmp/ruby/build/trunk/.bundle/gems/nkf-0.2.0/ext/nkf' I, [2024-05-17T08:22:01.782136 #921486] INFO -- : make[2]: Leaving directory '/tmp/ruby/build/trunk/.bundle/gems/debug-1.9.2/ext/debug' I, [2024-05-17T08:22:01.795200 #921486] INFO -- : make[2]: Entering directory '/tmp/ruby/build/trunk/.bundle/gems/syslog-0.1.2/ext/syslog' I, [2024-05-17T08:22:01.858279 #921486] INFO -- : make[2]: Leaving directory '/tmp/ruby/build/trunk/.bundle/gems/racc-1.7.3/ext/racc/cparse' I, [2024-05-17T08:22:01.910239 #921486] INFO -- : make[2]: Entering directory '/tmp/ruby/build/trunk/ext/digest/sha2' I, [2024-05-17T08:22:01.929748 #921486] INFO -- : make[2]: Leaving directory '/tmp/ruby/build/trunk/.bundle/gems/rbs-3.4.4/ext/rbs_extension' I, [2024-05-17T08:22:01.935327 #921486] INFO -- : make[2]: Leaving directory '/tmp/ruby/build/trunk/ext/digest/sha2' I, [2024-05-17T08:22:01.958840 #921486] INFO -- : make[2]: Leaving directory '/tmp/ruby/build/trunk/.bundle/gems/syslog-0.1.2/ext/syslog' I, [2024-05-17T08:22:02.173110 #921486] INFO -- : make[2]: Entering directory '/tmp/ruby/build/trunk' I, [2024-05-17T08:22:02.825219 #921486] INFO -- : linking ruby I, [2024-05-17T08:22:03.027367 #921486] INFO -- : make[2]: Leaving directory '/tmp/ruby/build/trunk' I, [2024-05-17T08:22:03.028555 #921486] INFO -- : make[1]: Leaving directory '/tmp/ruby/build/trunk' I, [2024-05-17T08:22:03.062476 #921486] INFO -- : make[1]: Entering directory '/tmp/ruby/build/trunk' I, [2024-05-17T08:22:03.062748 #921486] INFO -- : make[1]: Nothing to be done for 'note'. I, [2024-05-17T08:22:03.062945 #921486] INFO -- : make[1]: Leaving directory '/tmp/ruby/build/trunk' I, [2024-05-17T08:22:03.066435 #921486] INFO -- : $$$[end] "make all -j4" exit with 0. I, [2024-05-17T08:22:03.067152 #921486] INFO -- : $$$[beg] make install -j4 I, [2024-05-17T08:22:03.626447 #921486] INFO -- : Update minitest to ea9caafc0754b1d6236a490d59e624b53209734a I, [2024-05-17T08:22:03.627243 #921486] INFO -- : Update power_assert to 84e85124c5014a139af39161d484156cfe87a9ed I, [2024-05-17T08:22:03.627984 #921486] INFO -- : Update rbs to ba7872795d5de04adb8ff500c0e6afdc81a041dd I, [2024-05-17T08:22:03.630460 #921486] INFO -- : Update typeprof to b19a6416da3a05d57fadd6ffdadb382b6d236ca5 I, [2024-05-17T08:22:03.638555 #921486] INFO -- : echo ea9caafc0754b1d6236a490d59e624b53209734a | /bin/sh /tmp/ruby/src/trunk/tool/ifchange /tmp/ruby/src/trunk/.bundle/.timestamp/minitest.revision - I, [2024-05-17T08:22:03.639105 #921486] INFO -- : echo 84e85124c5014a139af39161d484156cfe87a9ed | /bin/sh /tmp/ruby/src/trunk/tool/ifchange /tmp/ruby/src/trunk/.bundle/.timestamp/power_assert.revision - I, [2024-05-17T08:22:03.639717 #921486] INFO -- : echo ba7872795d5de04adb8ff500c0e6afdc81a041dd | /bin/sh /tmp/ruby/src/trunk/tool/ifchange /tmp/ruby/src/trunk/.bundle/.timestamp/rbs.revision - I, [2024-05-17T08:22:03.647138 #921486] INFO -- : echo b19a6416da3a05d57fadd6ffdadb382b6d236ca5 | /bin/sh /tmp/ruby/src/trunk/tool/ifchange /tmp/ruby/src/trunk/.bundle/.timestamp/typeprof.revision - I, [2024-05-17T08:22:03.649948 #921486] INFO -- : /tmp/ruby/src/trunk/.bundle/.timestamp/minitest.revision unchanged I, [2024-05-17T08:22:03.651829 #921486] INFO -- : /tmp/ruby/src/trunk/.bundle/.timestamp/power_assert.revision unchanged I, [2024-05-17T08:22:03.653867 #921486] INFO -- : /tmp/ruby/src/trunk/.bundle/.timestamp/rbs.revision unchanged I, [2024-05-17T08:22:03.656539 #921486] INFO -- : BASERUBY = /usr/bin/ruby --disable=gems I, [2024-05-17T08:22:03.656755 #921486] INFO -- : CC = gcc I, [2024-05-17T08:22:03.656867 #921486] INFO -- : LD = ld I, [2024-05-17T08:22:03.657009 #921486] INFO -- : LDSHARED = gcc -shared I, [2024-05-17T08:22:03.657158 #921486] INFO -- : CFLAGS = -O3 -fno-fast-math -ggdb3 -Wall -Wextra -Wdeprecated-declarations -Wdiv-by-zero -Wduplicated-cond -Wimplicit-function-declaration -Wimplicit-int -Wpointer-arith -Wwrite-strings -Wold-style-definition -Wimplicit-fallthrough=0 -Wmissing-noreturn -Wno-cast-function-type -Wno-constant-logical-operand -Wno-long-long -Wno-missing-field-initializers -Wno-overlength-strings -Wno-packed-bitfield-compat -Wno-parentheses-equality -Wno-self-assign -Wno-tautological-compare -Wno-unused-parameter -Wno-unused-value -Wsuggest-attribute=format -Wsuggest-attribute=noreturn -Wunused-variable -Wmisleading-indentation -Wundef -fPIC I, [2024-05-17T08:22:03.657346 #921486] INFO -- : XCFLAGS = -U_FORTIFY_SOURCE -D_FORTIFY_SOURCE=2 -fstack-protector-strong -fno-strict-overflow -fvisibility=hidden -fexcess-precision=standard -DRUBY_EXPORT -I. -I.ext/include/riscv64-linux -I/tmp/ruby/src/trunk/include -I/tmp/ruby/src/trunk -I/tmp/ruby/src/trunk/prism -I/tmp/ruby/src/trunk/enc/unicode/15.0.0 I, [2024-05-17T08:22:03.657514 #921486] INFO -- : CPPFLAGS = I, [2024-05-17T08:22:03.657641 #921486] INFO -- : DLDFLAGS = -Wl,--compress-debug-sections=zlib -Wl,-soname,libruby.so.3.4 -fstack-protector-strong I, [2024-05-17T08:22:03.657764 #921486] INFO -- : SOLIBS = -lz -lrt -lrt -lgmp -ldl -lcrypt -lm -lpthread I, [2024-05-17T08:22:03.657891 #921486] INFO -- : LANG = I, [2024-05-17T08:22:03.658013 #921486] INFO -- : LC_ALL = I, [2024-05-17T08:22:03.658131 #921486] INFO -- : LC_CTYPE = I, [2024-05-17T08:22:03.658251 #921486] INFO -- : MFLAGS = -j4 --jobserver-auth=4,5 I, [2024-05-17T08:22:03.658376 #921486] INFO -- : RUSTC = rustc I, [2024-05-17T08:22:03.658505 #921486] INFO -- : YJIT_RUSTC_ARGS = --crate-name=yjit --crate-type=staticlib --edition=2021 -g -C lto=thin -C opt-level=3 -C overflow-checks=on '--out-dir=/tmp/ruby/build/trunk/yjit/target/release/' /tmp/ruby/src/trunk/yjit/src/lib.rs I, [2024-05-17T08:22:03.659620 #921486] INFO -- : /tmp/ruby/src/trunk/.bundle/.timestamp/typeprof.revision unchanged I, [2024-05-17T08:22:03.969089 #921486] INFO -- : generating enc.mk I, [2024-05-17T08:22:03.970372 #921486] INFO -- : gcc (Debian 13.2.0-4revyos1) 13.2.0 I, [2024-05-17T08:22:03.970559 #921486] INFO -- : Copyright (C) 2023 Free Software Foundation, Inc. I, [2024-05-17T08:22:03.970657 #921486] INFO -- : This is free software; see the source for copying conditions. There is NO I, [2024-05-17T08:22:03.970747 #921486] INFO -- : warranty; not even for MERCHANTABILITY or FITNESS FOR A PARTICULAR PURPOSE. I, [2024-05-17T08:22:03.970832 #921486] INFO -- : I, [2024-05-17T08:22:05.446179 #921486] INFO -- : making srcs under enc I, [2024-05-17T08:22:05.775095 #921486] INFO -- : make[1]: Entering directory '/tmp/ruby/build/trunk' I, [2024-05-17T08:22:05.775304 #921486] INFO -- : make[1]: Nothing to be done for 'srcs'. I, [2024-05-17T08:22:05.775475 #921486] INFO -- : make[1]: Leaving directory '/tmp/ruby/build/trunk' I, [2024-05-17T08:22:05.778342 #921486] INFO -- : making enc I, [2024-05-17T08:22:05.955021 #921486] INFO -- : make[1]: Entering directory '/tmp/ruby/build/trunk' I, [2024-05-17T08:22:05.955240 #921486] INFO -- : make[1]: Nothing to be done for 'enc'. I, [2024-05-17T08:22:05.955355 #921486] INFO -- : make[1]: Leaving directory '/tmp/ruby/build/trunk' I, [2024-05-17T08:22:05.958115 #921486] INFO -- : generating transdb.h I, [2024-05-17T08:22:06.282741 #921486] INFO -- : Building power_assert@84e85124c5014a139af39161d484156cfe87a9ed to /tmp/ruby/src/trunk/gems/power_assert-2.0.3.gem I, [2024-05-17T08:22:07.226570 #921486] INFO -- : Successfully built RubyGem I, [2024-05-17T08:22:07.226808 #921486] INFO -- : Name: power_assert I, [2024-05-17T08:22:07.231571 #921486] INFO -- : Version: 2.0.4dev I, [2024-05-17T08:22:07.231822 #921486] INFO -- : File: power_assert-2.0.4dev.gem I, [2024-05-17T08:22:07.242404 #921486] INFO -- : Extracting bundle gem power_assert-2.0.3... I, [2024-05-17T08:22:07.305604 #921486] INFO -- : transdb.h unchanged I, [2024-05-17T08:22:07.311265 #921486] INFO -- : generating makefiles ext/configure-ext.mk I, [2024-05-17T08:22:07.312412 #921486] INFO -- : making trans I, [2024-05-17T08:22:07.506885 #921486] INFO -- : ext/configure-ext.mk unchanged I, [2024-05-17T08:22:07.519558 #921486] INFO -- : make[1]: Entering directory '/tmp/ruby/build/trunk' I, [2024-05-17T08:22:07.678989 #921486] INFO -- : make[1]: Entering directory '/tmp/ruby/build/trunk' I, [2024-05-17T08:22:07.679225 #921486] INFO -- : make[1]: Nothing to be done for 'trans'. I, [2024-05-17T08:22:07.679355 #921486] INFO -- : make[1]: Leaving directory '/tmp/ruby/build/trunk' I, [2024-05-17T08:22:08.212637 #921486] INFO -- : Try with hash version of bundled gems instead of gems/power_assert-2.0.3.gem. We don't use this gem with release version of Ruby. I, [2024-05-17T08:22:08.278037 #921486] INFO -- : Unpacked gems/power_assert-2.0.4dev.gem I, [2024-05-17T08:22:08.665963 #921486] INFO -- : making encs I, [2024-05-17T08:22:09.085218 #921486] INFO -- : make[1]: Entering directory '/tmp/ruby/build/trunk' I, [2024-05-17T08:22:09.085539 #921486] INFO -- : make[1]: Nothing to be done for 'encs'. I, [2024-05-17T08:22:09.085909 #921486] INFO -- : make[1]: Leaving directory '/tmp/ruby/build/trunk' I, [2024-05-17T08:22:11.239858 #921486] INFO -- : make[1]: Leaving directory '/tmp/ruby/build/trunk' I, [2024-05-17T08:22:11.241583 #921486] INFO -- : generating makefile exts.mk I, [2024-05-17T08:22:11.563063 #921486] INFO -- : exts.mk unchanged I, [2024-05-17T08:22:11.600909 #921486] INFO -- : make[1]: Entering directory '/tmp/ruby/build/trunk' I, [2024-05-17T08:22:12.112471 #921486] INFO -- : make[2]: Entering directory '/tmp/ruby/build/trunk/ext/coverage' I, [2024-05-17T08:22:12.117432 #921486] INFO -- : make[2]: Entering directory '/tmp/ruby/build/trunk/ext/digest' I, [2024-05-17T08:22:12.128709 #921486] INFO -- : make[2]: Entering directory '/tmp/ruby/build/trunk/ext/date' I, [2024-05-17T08:22:12.134208 #921486] INFO -- : make[2]: Leaving directory '/tmp/ruby/build/trunk/ext/coverage' I, [2024-05-17T08:22:12.153501 #921486] INFO -- : make[2]: Leaving directory '/tmp/ruby/build/trunk/ext/date' I, [2024-05-17T08:22:12.171179 #921486] INFO -- : make[2]: Leaving directory '/tmp/ruby/build/trunk/ext/digest' I, [2024-05-17T08:22:12.182056 #921486] INFO -- : make[2]: Entering directory '/tmp/ruby/build/trunk/ext/io/console' I, [2024-05-17T08:22:12.197037 #921486] INFO -- : make[2]: Entering directory '/tmp/ruby/build/trunk/ext/fiddle' I, [2024-05-17T08:22:12.201067 #921486] INFO -- : make[2]: Leaving directory '/tmp/ruby/build/trunk/ext/io/console' I, [2024-05-17T08:22:12.202516 #921486] INFO -- : make[2]: Entering directory '/tmp/ruby/build/trunk/ext/json' I, [2024-05-17T08:22:12.241735 #921486] INFO -- : make[2]: Leaving directory '/tmp/ruby/build/trunk/ext/fiddle' I, [2024-05-17T08:22:12.246991 #921486] INFO -- : make[2]: Entering directory '/tmp/ruby/build/trunk/ext/monitor' I, [2024-05-17T08:22:12.249828 #921486] INFO -- : make[2]: Leaving directory '/tmp/ruby/build/trunk/ext/json' I, [2024-05-17T08:22:12.263533 #921486] INFO -- : make[2]: Leaving directory '/tmp/ruby/build/trunk/ext/monitor' I, [2024-05-17T08:22:12.269096 #921486] INFO -- : make[2]: Entering directory '/tmp/ruby/build/trunk/ext/objspace' I, [2024-05-17T08:22:12.276159 #921486] INFO -- : make[2]: Entering directory '/tmp/ruby/build/trunk/ext/pathname' I, [2024-05-17T08:22:12.294423 #921486] INFO -- : make[2]: Leaving directory '/tmp/ruby/build/trunk/ext/pathname' I, [2024-05-17T08:22:12.300995 #921486] INFO -- : make[2]: Leaving directory '/tmp/ruby/build/trunk/ext/objspace' I, [2024-05-17T08:22:12.303747 #921486] INFO -- : make[2]: Entering directory '/tmp/ruby/build/trunk/ext/psych' I, [2024-05-17T08:22:12.322004 #921486] INFO -- : make[2]: Entering directory '/tmp/ruby/build/trunk/ext/pty' I, [2024-05-17T08:22:12.340481 #921486] INFO -- : make[2]: Leaving directory '/tmp/ruby/build/trunk/ext/pty' I, [2024-05-17T08:22:12.357129 #921486] INFO -- : make[2]: Entering directory '/tmp/ruby/build/trunk/ext/openssl' I, [2024-05-17T08:22:12.360279 #921486] INFO -- : make[2]: Entering directory '/tmp/ruby/build/trunk/ext/rubyvm' I, [2024-05-17T08:22:12.389503 #921486] INFO -- : make[2]: Leaving directory '/tmp/ruby/build/trunk/ext/rubyvm' I, [2024-05-17T08:22:12.430689 #921486] INFO -- : make[2]: Entering directory '/tmp/ruby/build/trunk/ext/ripper' I, [2024-05-17T08:22:12.444132 #921486] INFO -- : make[2]: Leaving directory '/tmp/ruby/build/trunk/ext/psych' I, [2024-05-17T08:22:12.463998 #921486] INFO -- : make[2]: Entering directory '/tmp/ruby/build/trunk/ext/socket' I, [2024-05-17T08:22:12.468875 #921486] INFO -- : make[2]: Leaving directory '/tmp/ruby/build/trunk/ext/openssl' I, [2024-05-17T08:22:12.487067 #921486] INFO -- : make[2]: Leaving directory '/tmp/ruby/build/trunk/ext/ripper' I, [2024-05-17T08:22:12.502102 #921486] INFO -- : make[2]: Entering directory '/tmp/ruby/build/trunk/.bundle/gems/bigdecimal-3.1.8/ext/bigdecimal' I, [2024-05-17T08:22:12.516937 #921486] INFO -- : make[2]: Entering directory '/tmp/ruby/build/trunk/.bundle/gems/nkf-0.2.0/ext/nkf' I, [2024-05-17T08:22:12.517435 #921486] INFO -- : make[2]: Entering directory '/tmp/ruby/build/trunk/.bundle/gems/debug-1.9.2/ext/debug' I, [2024-05-17T08:22:12.523438 #921486] INFO -- : make[2]: Leaving directory '/tmp/ruby/build/trunk/ext/socket' I, [2024-05-17T08:22:12.539643 #921486] INFO -- : make[2]: Entering directory '/tmp/ruby/build/trunk/.bundle/gems/racc-1.7.3/ext/racc/cparse' I, [2024-05-17T08:22:12.666013 #921486] INFO -- : make[2]: Leaving directory '/tmp/ruby/build/trunk/.bundle/gems/bigdecimal-3.1.8/ext/bigdecimal' I, [2024-05-17T08:22:12.679291 #921486] INFO -- : make[2]: Leaving directory '/tmp/ruby/build/trunk/.bundle/gems/debug-1.9.2/ext/debug' I, [2024-05-17T08:22:12.681371 #921486] INFO -- : make[2]: Leaving directory '/tmp/ruby/build/trunk/.bundle/gems/nkf-0.2.0/ext/nkf' I, [2024-05-17T08:22:12.685596 #921486] INFO -- : make[2]: Entering directory '/tmp/ruby/build/trunk/.bundle/gems/rbs-3.4.4/ext/rbs_extension' I, [2024-05-17T08:22:12.693900 #921486] INFO -- : make[2]: Entering directory '/tmp/ruby/build/trunk/.bundle/gems/syslog-0.1.2/ext/syslog' I, [2024-05-17T08:22:12.710533 #921486] INFO -- : make[2]: Leaving directory '/tmp/ruby/build/trunk/.bundle/gems/racc-1.7.3/ext/racc/cparse' I, [2024-05-17T08:22:12.779783 #921486] INFO -- : make[2]: Entering directory '/tmp/ruby/build/trunk/ext/digest/sha2' I, [2024-05-17T08:22:12.804482 #921486] INFO -- : make[2]: Leaving directory '/tmp/ruby/build/trunk/ext/digest/sha2' I, [2024-05-17T08:22:12.846781 #921486] INFO -- : make[2]: Leaving directory '/tmp/ruby/build/trunk/.bundle/gems/rbs-3.4.4/ext/rbs_extension' I, [2024-05-17T08:22:12.854912 #921486] INFO -- : make[2]: Leaving directory '/tmp/ruby/build/trunk/.bundle/gems/syslog-0.1.2/ext/syslog' I, [2024-05-17T08:22:13.073303 #921486] INFO -- : make[2]: Entering directory '/tmp/ruby/build/trunk' I, [2024-05-17T08:22:13.722953 #921486] INFO -- : make[2]: 'ruby' is up to date. I, [2024-05-17T08:22:13.723349 #921486] INFO -- : make[2]: Leaving directory '/tmp/ruby/build/trunk' I, [2024-05-17T08:22:13.725494 #921486] INFO -- : make[1]: Leaving directory '/tmp/ruby/build/trunk' I, [2024-05-17T08:22:13.759121 #921486] INFO -- : make[1]: Entering directory '/tmp/ruby/build/trunk' I, [2024-05-17T08:22:13.759316 #921486] INFO -- : make[1]: Nothing to be done for 'note'. I, [2024-05-17T08:22:13.759405 #921486] INFO -- : make[1]: Leaving directory '/tmp/ruby/build/trunk' I, [2024-05-17T08:22:13.760408 #921486] INFO -- : ./miniruby -I/tmp/ruby/src/trunk/lib -I. -I.ext/common /tmp/ruby/src/trunk/tool/runruby.rb --extout=.ext -- --disable-gems -r./riscv64-linux-fake /tmp/ruby/src/trunk/tool/rbinstall.rb --make="make" --dest-dir="" --extout=".ext" --ext-build-dir="./ext" --mflags="-j4 --jobserver-auth=4,5" --make-flags=" -j4 --jobserver-auth=4,5" --data-mode=0644 --prog-mode=0755 --installed-list .installed.list --mantype="doc" --gnumake --install=all --exclude=doc I, [2024-05-17T08:22:15.044002 #921486] INFO -- : Installing to I, [2024-05-17T08:22:15.044442 #921486] INFO -- : installing binary commands: /tmp/ruby/install/trunk/bin I, [2024-05-17T08:22:15.071104 #921486] INFO -- : installing base libraries: /tmp/ruby/install/trunk/lib I, [2024-05-17T08:22:15.144212 #921486] INFO -- : installing arch files: /tmp/ruby/install/trunk/lib/ruby/3.4.0+0/riscv64-linux I, [2024-05-17T08:22:15.145264 #921486] INFO -- : installing pkgconfig data: /tmp/ruby/install/trunk/lib/pkgconfig I, [2024-05-17T08:22:15.146012 #921486] INFO -- : installing extension objects: /tmp/ruby/install/trunk/lib/ruby/3.4.0+0/riscv64-linux I, [2024-05-17T08:22:15.269284 #921486] INFO -- : installing extension objects: /tmp/ruby/install/trunk/lib/ruby/site_ruby/3.4.0+0/riscv64-linux I, [2024-05-17T08:22:15.269698 #921486] INFO -- : installing extension objects: /tmp/ruby/install/trunk/lib/ruby/vendor_ruby/3.4.0+0/riscv64-linux I, [2024-05-17T08:22:15.270432 #921486] INFO -- : installing extension headers: /tmp/ruby/install/trunk/include/ruby-3.4.0+0/riscv64-linux I, [2024-05-17T08:22:15.272729 #921486] INFO -- : installing extension scripts: /tmp/ruby/install/trunk/lib/ruby/3.4.0+0 I, [2024-05-17T08:22:15.316055 #921486] INFO -- : installing extension scripts: /tmp/ruby/install/trunk/lib/ruby/site_ruby/3.4.0+0 I, [2024-05-17T08:22:15.316491 #921486] INFO -- : installing extension scripts: /tmp/ruby/install/trunk/lib/ruby/vendor_ruby/3.4.0+0 I, [2024-05-17T08:22:15.316833 #921486] INFO -- : installing extension headers: /tmp/ruby/install/trunk/include/ruby-3.4.0+0/ruby I, [2024-05-17T08:22:15.317948 #921486] INFO -- : installing command scripts: /tmp/ruby/install/trunk/bin I, [2024-05-17T08:22:15.319078 #921486] INFO -- : installing library scripts: /tmp/ruby/install/trunk/lib/ruby/3.4.0+0 I, [2024-05-17T08:22:15.835386 #921486] INFO -- : installing common headers: /tmp/ruby/install/trunk/include/ruby-3.4.0+0 I, [2024-05-17T08:22:15.924387 #921486] INFO -- : installing manpages: /tmp/ruby/install/trunk/share/man/man1 I, [2024-05-17T08:22:15.926876 #921486] INFO -- : installing default gems from lib: /tmp/ruby/install/trunk/lib/ruby/gems/3.4.0+0 I, [2024-05-17T08:22:16.245016 #921486] INFO -- : benchmark 0.3.0 I, [2024-05-17T08:22:16.287564 #921486] INFO -- : bundler 2.6.0.dev I, [2024-05-17T08:22:16.308766 #921486] INFO -- : cgi 0.4.1 I, [2024-05-17T08:22:16.316121 #921486] INFO -- : delegate 0.3.1 I, [2024-05-17T08:22:16.323229 #921486] INFO -- : did_you_mean 1.6.3 I, [2024-05-17T08:22:16.330384 #921486] INFO -- : english 0.8.0 I, [2024-05-17T08:22:16.337561 #921486] INFO -- : erb 4.0.4 I, [2024-05-17T08:22:16.348132 #921486] INFO -- : error_highlight 0.6.0 I, [2024-05-17T08:22:16.355062 #921486] INFO -- : fileutils 1.7.2 I, [2024-05-17T08:22:16.362255 #921486] INFO -- : find 0.2.0 I, [2024-05-17T08:22:16.369431 #921486] INFO -- : forwardable 1.3.3 I, [2024-05-17T08:22:16.381748 #921486] INFO -- : ipaddr 1.2.6 I, [2024-05-17T08:22:16.390285 #921486] INFO -- : irb 1.13.1 I, [2024-05-17T08:22:16.401597 #921486] INFO -- : logger 1.6.0 I, [2024-05-17T08:22:16.408665 #921486] INFO -- : net-http 0.4.1 I, [2024-05-17T08:22:16.416135 #921486] INFO -- : net-protocol 0.2.2 I, [2024-05-17T08:22:16.423510 #921486] INFO -- : open-uri 0.4.1 I, [2024-05-17T08:22:16.431130 #921486] INFO -- : open3 0.2.1 I, [2024-05-17T08:22:16.438369 #921486] INFO -- : optparse 0.5.0 I, [2024-05-17T08:22:16.445765 #921486] INFO -- : ostruct 0.6.0 I, [2024-05-17T08:22:16.452788 #921486] INFO -- : pp 0.5.0 I, [2024-05-17T08:22:16.466313 #921486] INFO -- : prettyprint 0.2.0 I, [2024-05-17T08:22:16.473528 #921486] INFO -- : prism 0.29.0 I, [2024-05-17T08:22:16.481102 #921486] INFO -- : pstore 0.1.3 I, [2024-05-17T08:22:16.488079 #921486] INFO -- : rdoc 6.6.3.1 I, [2024-05-17T08:22:16.502392 #921486] INFO -- : readline 0.0.4 I, [2024-05-17T08:22:16.509438 #921486] INFO -- : reline 0.5.7 I, [2024-05-17T08:22:16.517140 #921486] INFO -- : resolv 0.4.0 I, [2024-05-17T08:22:16.524339 #921486] INFO -- : ruby2_keywords 0.0.5 I, [2024-05-17T08:22:16.531455 #921486] INFO -- : securerandom 0.3.1 I, [2024-05-17T08:22:16.538600 #921486] INFO -- : set 1.1.0 I, [2024-05-17T08:22:16.550629 #921486] INFO -- : shellwords 0.2.0 I, [2024-05-17T08:22:16.559086 #921486] INFO -- : singleton 0.2.0 I, [2024-05-17T08:22:16.566072 #921486] INFO -- : syntax_suggest 2.0.0 I, [2024-05-17T08:22:16.576390 #921486] INFO -- : tempfile 0.2.1 I, [2024-05-17T08:22:16.583467 #921486] INFO -- : time 0.3.0 I, [2024-05-17T08:22:16.593387 #921486] INFO -- : timeout 0.4.1 I, [2024-05-17T08:22:16.603044 #921486] INFO -- : tmpdir 0.2.0 I, [2024-05-17T08:22:16.612605 #921486] INFO -- : tsort 0.2.0 I, [2024-05-17T08:22:16.621527 #921486] INFO -- : un 0.3.0 I, [2024-05-17T08:22:16.633794 #921486] INFO -- : uri 0.13.0 I, [2024-05-17T08:22:16.648520 #921486] INFO -- : weakref 0.1.3 I, [2024-05-17T08:22:16.656883 #921486] INFO -- : yaml 0.3.0 I, [2024-05-17T08:22:16.662452 #921486] INFO -- : installing default gems from ext: /tmp/ruby/install/trunk/lib/ruby/gems/3.4.0+0 I, [2024-05-17T08:22:16.734141 #921486] INFO -- : date 3.3.4 I, [2024-05-17T08:22:16.742464 #921486] INFO -- : digest 3.1.1 I, [2024-05-17T08:22:16.749563 #921486] INFO -- : etc 1.4.3 I, [2024-05-17T08:22:16.757171 #921486] INFO -- : fcntl 1.1.0 I, [2024-05-17T08:22:16.764622 #921486] INFO -- : fiddle 1.1.3 I, [2024-05-17T08:22:16.771918 #921486] INFO -- : io-console 0.7.2 I, [2024-05-17T08:22:16.779028 #921486] INFO -- : io-nonblock 0.3.0 I, [2024-05-17T08:22:16.786349 #921486] INFO -- : io-wait 0.3.1 I, [2024-05-17T08:22:16.793276 #921486] INFO -- : json 2.7.2 I, [2024-05-17T08:22:16.801118 #921486] INFO -- : openssl 3.2.0 I, [2024-05-17T08:22:16.808729 #921486] INFO -- : pathname 0.3.0 I, [2024-05-17T08:22:16.824498 #921486] INFO -- : psych 5.1.2 I, [2024-05-17T08:22:16.832528 #921486] INFO -- : stringio 3.1.1 I, [2024-05-17T08:22:16.840056 #921486] INFO -- : strscan 3.1.1 I, [2024-05-17T08:22:16.847043 #921486] INFO -- : zlib 3.1.0 I, [2024-05-17T08:22:16.852914 #921486] INFO -- : installing bundled gems: /tmp/ruby/install/trunk/lib/ruby/gems/3.4.0+0 I, [2024-05-17T08:22:16.857975 #921486] INFO -- : minitest 5.22.3 I, [2024-05-17T08:22:16.943899 #921486] INFO -- : rake 13.2.1 I, [2024-05-17T08:22:17.017186 #921486] INFO -- : test-unit 3.6.2 I, [2024-05-17T08:22:17.081671 #921486] INFO -- : rexml 3.2.6 I, [2024-05-17T08:22:17.146754 #921486] INFO -- : rss 0.3.0 I, [2024-05-17T08:22:17.192019 #921486] INFO -- : net-ftp 0.3.4 I, [2024-05-17T08:22:17.222500 #921486] INFO -- : net-imap 0.4.11 I, [2024-05-17T08:22:17.272195 #921486] INFO -- : net-pop 0.1.2 I, [2024-05-17T08:22:17.287878 #921486] INFO -- : net-smtp 0.5.0 I, [2024-05-17T08:22:17.305906 #921486] INFO -- : matrix 0.4.2 I, [2024-05-17T08:22:17.348032 #921486] INFO -- : prime 0.1.2 I, [2024-05-17T08:22:17.409643 #921486] INFO -- : rbs 3.4.4 I, [2024-05-17T08:22:17.815774 #921486] INFO -- : typeprof 0.21.11 I, [2024-05-17T08:22:17.853423 #921486] INFO -- : debug 1.9.2 I, [2024-05-17T08:22:17.897017 #921486] INFO -- : racc 1.7.3 I, [2024-05-17T08:22:17.944434 #921486] INFO -- : mutex_m 0.2.0 I, [2024-05-17T08:22:17.963803 #921486] INFO -- : getoptlong 0.2.1 I, [2024-05-17T08:22:17.986271 #921486] INFO -- : base64 0.2.0 I, [2024-05-17T08:22:18.002765 #921486] INFO -- : bigdecimal 3.1.8 I, [2024-05-17T08:22:18.033972 #921486] INFO -- : observer 0.1.2 I, [2024-05-17T08:22:18.050906 #921486] INFO -- : abbrev 0.1.2 I, [2024-05-17T08:22:18.067340 #921486] INFO -- : resolv-replace 0.1.1 I, [2024-05-17T08:22:18.085921 #921486] INFO -- : rinda 0.2.0 I, [2024-05-17T08:22:18.111124 #921486] INFO -- : drb 2.2.1 I, [2024-05-17T08:22:18.138070 #921486] INFO -- : nkf 0.2.0 I, [2024-05-17T08:22:18.174472 #921486] INFO -- : syslog 0.1.2 I, [2024-05-17T08:22:18.201054 #921486] INFO -- : csv 3.3.0 I, [2024-05-17T08:22:18.240575 #921486] INFO -- : installing bundled gem cache: /tmp/ruby/install/trunk/lib/ruby/gems/3.4.0+0/cache I, [2024-05-17T08:22:18.260364 #921486] INFO -- : skipped bundled gems: I, [2024-05-17T08:22:18.260716 #921486] INFO -- : power_assert-2.0.4dev.gem not found in bundled_gems I, [2024-05-17T08:22:18.285677 #921486] INFO -- : $$$[end] "make install -j4" exit with 0. I, [2024-05-17T08:22:18.286573 #921486] INFO -- : $$$[beg] make yes-btest TESTOPTS='-q -j4' I, [2024-05-17T08:23:35.005582 #921486] INFO -- : PASS all 1936 tests E, [2024-05-17T08:23:35.027589 #921486] ERROR -- : I, [2024-05-17T08:23:35.028191 #921486] INFO -- : $$$[end] "make yes-btest TESTOPTS='-q -j4'" exit with 0. I, [2024-05-17T08:23:35.028812 #921486] INFO -- : $$$[beg] make yes-test-basic TESTS='-j4' I, [2024-05-17T08:23:35.561162 #921486] INFO -- : BASERUBY = /usr/bin/ruby --disable=gems I, [2024-05-17T08:23:35.561438 #921486] INFO -- : CC = gcc I, [2024-05-17T08:23:35.561594 #921486] INFO -- : LD = ld I, [2024-05-17T08:23:35.561732 #921486] INFO -- : LDSHARED = gcc -shared I, [2024-05-17T08:23:35.561911 #921486] INFO -- : CFLAGS = -O3 -fno-fast-math -ggdb3 -Wall -Wextra -Wdeprecated-declarations -Wdiv-by-zero -Wduplicated-cond -Wimplicit-function-declaration -Wimplicit-int -Wpointer-arith -Wwrite-strings -Wold-style-definition -Wimplicit-fallthrough=0 -Wmissing-noreturn -Wno-cast-function-type -Wno-constant-logical-operand -Wno-long-long -Wno-missing-field-initializers -Wno-overlength-strings -Wno-packed-bitfield-compat -Wno-parentheses-equality -Wno-self-assign -Wno-tautological-compare -Wno-unused-parameter -Wno-unused-value -Wsuggest-attribute=format -Wsuggest-attribute=noreturn -Wunused-variable -Wmisleading-indentation -Wundef -fPIC I, [2024-05-17T08:23:35.562063 #921486] INFO -- : XCFLAGS = -U_FORTIFY_SOURCE -D_FORTIFY_SOURCE=2 -fstack-protector-strong -fno-strict-overflow -fvisibility=hidden -fexcess-precision=standard -DRUBY_EXPORT -I. -I.ext/include/riscv64-linux -I/tmp/ruby/src/trunk/include -I/tmp/ruby/src/trunk -I/tmp/ruby/src/trunk/prism -I/tmp/ruby/src/trunk/enc/unicode/15.0.0 I, [2024-05-17T08:23:35.562205 #921486] INFO -- : CPPFLAGS = I, [2024-05-17T08:23:35.562415 #921486] INFO -- : DLDFLAGS = -Wl,--compress-debug-sections=zlib -Wl,-soname,libruby.so.3.4 -fstack-protector-strong I, [2024-05-17T08:23:35.562562 #921486] INFO -- : SOLIBS = -lz -lrt -lrt -lgmp -ldl -lcrypt -lm -lpthread I, [2024-05-17T08:23:35.562689 #921486] INFO -- : LANG = I, [2024-05-17T08:23:35.562916 #921486] INFO -- : LC_ALL = I, [2024-05-17T08:23:35.563087 #921486] INFO -- : LC_CTYPE = I, [2024-05-17T08:23:35.563274 #921486] INFO -- : MFLAGS = I, [2024-05-17T08:23:35.563442 #921486] INFO -- : RUSTC = rustc I, [2024-05-17T08:23:35.563630 #921486] INFO -- : YJIT_RUSTC_ARGS = --crate-name=yjit --crate-type=staticlib --edition=2021 -g -C lto=thin -C opt-level=3 -C overflow-checks=on '--out-dir=/tmp/ruby/build/trunk/yjit/target/release/' /tmp/ruby/src/trunk/yjit/src/lib.rs I, [2024-05-17T08:23:35.567760 #921486] INFO -- : gcc (Debian 13.2.0-4revyos1) 13.2.0 I, [2024-05-17T08:23:35.567999 #921486] INFO -- : Copyright (C) 2023 Free Software Foundation, Inc. I, [2024-05-17T08:23:35.568109 #921486] INFO -- : This is free software; see the source for copying conditions. There is NO I, [2024-05-17T08:23:35.568217 #921486] INFO -- : warranty; not even for MERCHANTABILITY or FITNESS FOR A PARTICULAR PURPOSE. I, [2024-05-17T08:23:35.568328 #921486] INFO -- : I, [2024-05-17T08:23:37.494641 #921486] INFO -- : Checking leaked global symbols...none I, [2024-05-17T08:23:37.794342 #921486] INFO -- : /tmp/ruby/src/trunk/basictest/test.rb:assignment ....................................................................................................................................................................................................................................................................................................................................................................................OK 372 I, [2024-05-17T08:23:37.794634 #921486] INFO -- : /tmp/ruby/src/trunk/basictest/test.rb:condition ..OK 2 I, [2024-05-17T08:23:37.794780 #921486] INFO -- : /tmp/ruby/src/trunk/basictest/test.rb:if/unless ...OK 3 I, [2024-05-17T08:23:37.794982 #921486] INFO -- : /tmp/ruby/src/trunk/basictest/test.rb:case .....OK 5 I, [2024-05-17T08:23:37.796384 #921486] INFO -- : /tmp/ruby/src/trunk/basictest/test.rb:while/until ........OK 8 I, [2024-05-17T08:23:37.797167 #921486] INFO -- : /tmp/ruby/src/trunk/basictest/test.rb:exception ..........OK 10 I, [2024-05-17T08:23:37.799636 #921486] INFO -- : /tmp/ruby/src/trunk/basictest/test.rb:array .......................................OK 39 I, [2024-05-17T08:23:37.801257 #921486] INFO -- : /tmp/ruby/src/trunk/basictest/test.rb:hash ...........................OK 27 I, [2024-05-17T08:23:37.809719 #921486] INFO -- : /tmp/ruby/src/trunk/basictest/test.rb:iterator ...........................................................................................................OK 107 I, [2024-05-17T08:23:37.826057 #921486] INFO -- : /tmp/ruby/src/trunk/basictest/test.rb:float ................................................................................OK 80 I, [2024-05-17T08:23:37.837587 #921486] INFO -- : /tmp/ruby/src/trunk/basictest/test.rb:bignum ...............................OK 31 I, [2024-05-17T08:23:37.849531 #921486] INFO -- : /tmp/ruby/src/trunk/basictest/test.rb:string & char ..............................................................OK 62 I, [2024-05-17T08:23:37.850026 #921486] INFO -- : /tmp/ruby/src/trunk/basictest/test.rb:assignment ..........OK 10 I, [2024-05-17T08:23:37.850511 #921486] INFO -- : /tmp/ruby/src/trunk/basictest/test.rb:call ......OK 6 I, [2024-05-17T08:23:37.851297 #921486] INFO -- : /tmp/ruby/src/trunk/basictest/test.rb:proc .........OK 9 I, [2024-05-17T08:23:37.951930 #921486] INFO -- : /tmp/ruby/src/trunk/basictest/test.rb:signal ..OK 2 I, [2024-05-17T08:23:37.956343 #921486] INFO -- : /tmp/ruby/src/trunk/basictest/test.rb:eval ...........................OK 27 I, [2024-05-17T08:23:38.375937 #921486] INFO -- : /tmp/ruby/src/trunk/basictest/test.rb:system ........OK 8 I, [2024-05-17T08:23:38.376357 #921486] INFO -- : /tmp/ruby/src/trunk/basictest/test.rb:const .....OK 5 I, [2024-05-17T08:23:38.376889 #921486] INFO -- : /tmp/ruby/src/trunk/basictest/test.rb:clone .....OK 5 I, [2024-05-17T08:23:38.377921 #921486] INFO -- : /tmp/ruby/src/trunk/basictest/test.rb:marshal ....OK 4 I, [2024-05-17T08:23:38.378368 #921486] INFO -- : /tmp/ruby/src/trunk/basictest/test.rb:pack ....OK 4 I, [2024-05-17T08:23:38.378565 #921486] INFO -- : /tmp/ruby/src/trunk/basictest/test.rb:math ..OK 2 I, [2024-05-17T08:23:38.379077 #921486] INFO -- : /tmp/ruby/src/trunk/basictest/test.rb:struct ......OK 6 I, [2024-05-17T08:23:38.380119 #921486] INFO -- : /tmp/ruby/src/trunk/basictest/test.rb:variable ............OK 12 I, [2024-05-17T08:23:38.380357 #921486] INFO -- : /tmp/ruby/src/trunk/basictest/test.rb:trace ...OK 3 I, [2024-05-17T08:23:38.384585 #921486] INFO -- : /tmp/ruby/src/trunk/basictest/test.rb:defined? ............OK 12 I, [2024-05-17T08:23:38.385360 #921486] INFO -- : /tmp/ruby/src/trunk/basictest/test.rb:alias ......OK 6 I, [2024-05-17T08:23:38.388426 #921486] INFO -- : /tmp/ruby/src/trunk/basictest/test.rb:path .......................OK 23 I, [2024-05-17T08:23:38.764591 #921486] INFO -- : /tmp/ruby/src/trunk/basictest/test.rb:gc ....OK 4 I, [2024-05-17T08:23:38.781237 #921486] INFO -- : I, [2024-05-17T08:23:38.781475 #921486] INFO -- : test succeeded I, [2024-05-17T08:23:38.787014 #921486] INFO -- : $$$[end] "make yes-test-basic TESTS='-j4'" exit with 0. I, [2024-05-17T08:23:38.787784 #921486] INFO -- : $$$[beg] make yes-test-all TESTOPTS='--stderr-on-failure' TESTS='-j4' I, [2024-05-17T08:23:39.608587 #921486] INFO -- : BASERUBY = /usr/bin/ruby --disable=gems I, [2024-05-17T08:23:39.608866 #921486] INFO -- : CC = gcc I, [2024-05-17T08:23:39.609020 #921486] INFO -- : LD = ld I, [2024-05-17T08:23:39.609210 #921486] INFO -- : LDSHARED = gcc -shared I, [2024-05-17T08:23:39.609369 #921486] INFO -- : CFLAGS = -O3 -fno-fast-math -ggdb3 -Wall -Wextra -Wdeprecated-declarations -Wdiv-by-zero -Wduplicated-cond -Wimplicit-function-declaration -Wimplicit-int -Wpointer-arith -Wwrite-strings -Wold-style-definition -Wimplicit-fallthrough=0 -Wmissing-noreturn -Wno-cast-function-type -Wno-constant-logical-operand -Wno-long-long -Wno-missing-field-initializers -Wno-overlength-strings -Wno-packed-bitfield-compat -Wno-parentheses-equality -Wno-self-assign -Wno-tautological-compare -Wno-unused-parameter -Wno-unused-value -Wsuggest-attribute=format -Wsuggest-attribute=noreturn -Wunused-variable -Wmisleading-indentation -Wundef -fPIC I, [2024-05-17T08:23:39.609521 #921486] INFO -- : XCFLAGS = -U_FORTIFY_SOURCE -D_FORTIFY_SOURCE=2 -fstack-protector-strong -fno-strict-overflow -fvisibility=hidden -fexcess-precision=standard -DRUBY_EXPORT -I. -I.ext/include/riscv64-linux -I/tmp/ruby/src/trunk/include -I/tmp/ruby/src/trunk -I/tmp/ruby/src/trunk/prism -I/tmp/ruby/src/trunk/enc/unicode/15.0.0 I, [2024-05-17T08:23:39.609659 #921486] INFO -- : CPPFLAGS = I, [2024-05-17T08:23:39.609793 #921486] INFO -- : DLDFLAGS = -Wl,--compress-debug-sections=zlib -Wl,-soname,libruby.so.3.4 -fstack-protector-strong I, [2024-05-17T08:23:39.609945 #921486] INFO -- : SOLIBS = -lz -lrt -lrt -lgmp -ldl -lcrypt -lm -lpthread I, [2024-05-17T08:23:39.610077 #921486] INFO -- : LANG = I, [2024-05-17T08:23:39.610208 #921486] INFO -- : LC_ALL = I, [2024-05-17T08:23:39.610346 #921486] INFO -- : LC_CTYPE = I, [2024-05-17T08:23:39.610472 #921486] INFO -- : MFLAGS = I, [2024-05-17T08:23:39.610600 #921486] INFO -- : RUSTC = rustc I, [2024-05-17T08:23:39.610751 #921486] INFO -- : YJIT_RUSTC_ARGS = --crate-name=yjit --crate-type=staticlib --edition=2021 -g -C lto=thin -C opt-level=3 -C overflow-checks=on '--out-dir=/tmp/ruby/build/trunk/yjit/target/release/' /tmp/ruby/src/trunk/yjit/src/lib.rs I, [2024-05-17T08:23:39.614203 #921486] INFO -- : gcc (Debian 13.2.0-4revyos1) 13.2.0 I, [2024-05-17T08:23:39.614392 #921486] INFO -- : Copyright (C) 2023 Free Software Foundation, Inc. I, [2024-05-17T08:23:39.614480 #921486] INFO -- : This is free software; see the source for copying conditions. There is NO I, [2024-05-17T08:23:39.614863 #921486] INFO -- : warranty; not even for MERCHANTABILITY or FITNESS FOR A PARTICULAR PURPOSE. I, [2024-05-17T08:23:39.615183 #921486] INFO -- : I, [2024-05-17T08:23:39.641946 #921486] INFO -- : generating enc.mk I, [2024-05-17T08:23:41.137564 #921486] INFO -- : making enc I, [2024-05-17T08:23:41.303070 #921486] INFO -- : make[1]: Entering directory '/tmp/ruby/build/trunk' I, [2024-05-17T08:23:41.303349 #921486] INFO -- : make[1]: Nothing to be done for 'enc'. I, [2024-05-17T08:23:41.303560 #921486] INFO -- : make[1]: Leaving directory '/tmp/ruby/build/trunk' I, [2024-05-17T08:23:41.306606 #921486] INFO -- : making srcs under enc I, [2024-05-17T08:23:41.601053 #921486] INFO -- : make[1]: Entering directory '/tmp/ruby/build/trunk' I, [2024-05-17T08:23:41.601242 #921486] INFO -- : make[1]: Nothing to be done for 'srcs'. I, [2024-05-17T08:23:41.601335 #921486] INFO -- : make[1]: Leaving directory '/tmp/ruby/build/trunk' I, [2024-05-17T08:23:41.606135 #921486] INFO -- : generating transdb.h I, [2024-05-17T08:23:43.010329 #921486] INFO -- : transdb.h unchanged I, [2024-05-17T08:23:43.016009 #921486] INFO -- : making trans I, [2024-05-17T08:23:43.357461 #921486] INFO -- : make[1]: Entering directory '/tmp/ruby/build/trunk' I, [2024-05-17T08:23:43.357736 #921486] INFO -- : make[1]: Nothing to be done for 'trans'. I, [2024-05-17T08:23:43.357945 #921486] INFO -- : make[1]: Leaving directory '/tmp/ruby/build/trunk' I, [2024-05-17T08:23:43.360961 #921486] INFO -- : making encs I, [2024-05-17T08:23:43.741934 #921486] INFO -- : make[1]: Entering directory '/tmp/ruby/build/trunk' I, [2024-05-17T08:23:43.742198 #921486] INFO -- : make[1]: Nothing to be done for 'encs'. I, [2024-05-17T08:23:43.742458 #921486] INFO -- : make[1]: Leaving directory '/tmp/ruby/build/trunk' I, [2024-05-17T08:23:43.755545 #921486] INFO -- : generating makefiles ext/configure-ext.mk I, [2024-05-17T08:23:43.954827 #921486] INFO -- : ext/configure-ext.mk updated I, [2024-05-17T08:23:43.968222 #921486] INFO -- : make[1]: Entering directory '/tmp/ruby/build/trunk' I, [2024-05-17T08:23:55.953154 #921486] INFO -- : make[1]: Leaving directory '/tmp/ruby/build/trunk' I, [2024-05-17T08:23:55.955311 #921486] INFO -- : generating makefile exts.mk I, [2024-05-17T08:23:56.280399 #921486] INFO -- : exts.mk unchanged I, [2024-05-17T08:23:56.324639 #921486] INFO -- : make[1]: Entering directory '/tmp/ruby/build/trunk' I, [2024-05-17T08:23:58.537384 #921486] INFO -- : make[2]: Entering directory '/tmp/ruby/build/trunk/ext/coverage' I, [2024-05-17T08:23:58.561988 #921486] INFO -- : make[2]: Leaving directory '/tmp/ruby/build/trunk/ext/coverage' I, [2024-05-17T08:23:58.604293 #921486] INFO -- : make[2]: Entering directory '/tmp/ruby/build/trunk/ext/date' I, [2024-05-17T08:23:58.632396 #921486] INFO -- : make[2]: Leaving directory '/tmp/ruby/build/trunk/ext/date' I, [2024-05-17T08:23:58.657131 #921486] INFO -- : make[2]: Entering directory '/tmp/ruby/build/trunk/ext/digest' I, [2024-05-17T08:23:58.715248 #921486] INFO -- : make[2]: Leaving directory '/tmp/ruby/build/trunk/ext/digest' I, [2024-05-17T08:23:58.892971 #921486] INFO -- : make[2]: Entering directory '/tmp/ruby/build/trunk/ext/digest/sha2' I, [2024-05-17T08:23:58.916868 #921486] INFO -- : make[2]: Leaving directory '/tmp/ruby/build/trunk/ext/digest/sha2' I, [2024-05-17T08:23:59.047430 #921486] INFO -- : make[2]: Entering directory '/tmp/ruby/build/trunk/ext/fiddle' I, [2024-05-17T08:23:59.122895 #921486] INFO -- : make[2]: Leaving directory '/tmp/ruby/build/trunk/ext/fiddle' I, [2024-05-17T08:23:59.151058 #921486] INFO -- : make[2]: Entering directory '/tmp/ruby/build/trunk/ext/io/console' I, [2024-05-17T08:23:59.173231 #921486] INFO -- : make[2]: Leaving directory '/tmp/ruby/build/trunk/ext/io/console' I, [2024-05-17T08:23:59.256226 #921486] INFO -- : make[2]: Entering directory '/tmp/ruby/build/trunk/ext/json' I, [2024-05-17T08:23:59.331161 #921486] INFO -- : make[2]: Leaving directory '/tmp/ruby/build/trunk/ext/json' I, [2024-05-17T08:23:59.425813 #921486] INFO -- : make[2]: Entering directory '/tmp/ruby/build/trunk/ext/monitor' I, [2024-05-17T08:23:59.446052 #921486] INFO -- : make[2]: Leaving directory '/tmp/ruby/build/trunk/ext/monitor' I, [2024-05-17T08:23:59.498809 #921486] INFO -- : make[2]: Entering directory '/tmp/ruby/build/trunk/ext/objspace' I, [2024-05-17T08:23:59.534241 #921486] INFO -- : make[2]: Leaving directory '/tmp/ruby/build/trunk/ext/objspace' I, [2024-05-17T08:23:59.657149 #921486] INFO -- : make[2]: Entering directory '/tmp/ruby/build/trunk/ext/openssl' I, [2024-05-17T08:23:59.805933 #921486] INFO -- : make[2]: Leaving directory '/tmp/ruby/build/trunk/ext/openssl' I, [2024-05-17T08:23:59.833136 #921486] INFO -- : make[2]: Entering directory '/tmp/ruby/build/trunk/ext/pathname' I, [2024-05-17T08:23:59.853372 #921486] INFO -- : make[2]: Leaving directory '/tmp/ruby/build/trunk/ext/pathname' I, [2024-05-17T08:23:59.906124 #921486] INFO -- : make[2]: Entering directory '/tmp/ruby/build/trunk/ext/psych' I, [2024-05-17T08:24:00.067423 #921486] INFO -- : make[2]: Leaving directory '/tmp/ruby/build/trunk/ext/psych' I, [2024-05-17T08:24:00.101326 #921486] INFO -- : make[2]: Entering directory '/tmp/ruby/build/trunk/ext/pty' I, [2024-05-17T08:24:00.132318 #921486] INFO -- : make[2]: Leaving directory '/tmp/ruby/build/trunk/ext/pty' I, [2024-05-17T08:24:00.239501 #921486] INFO -- : make[2]: Entering directory '/tmp/ruby/build/trunk/ext/ripper' I, [2024-05-17T08:24:00.289196 #921486] INFO -- : make[2]: Leaving directory '/tmp/ruby/build/trunk/ext/ripper' I, [2024-05-17T08:24:00.302151 #921486] INFO -- : make[2]: Entering directory '/tmp/ruby/build/trunk/ext/rubyvm' I, [2024-05-17T08:24:00.319915 #921486] INFO -- : make[2]: Leaving directory '/tmp/ruby/build/trunk/ext/rubyvm' I, [2024-05-17T08:24:00.410361 #921486] INFO -- : make[2]: Entering directory '/tmp/ruby/build/trunk/ext/socket' I, [2024-05-17T08:24:00.471744 #921486] INFO -- : make[2]: Leaving directory '/tmp/ruby/build/trunk/ext/socket' I, [2024-05-17T08:24:00.602728 #921486] INFO -- : make[2]: Entering directory '/tmp/ruby/build/trunk/.bundle/gems/bigdecimal-3.1.8/ext/bigdecimal' I, [2024-05-17T08:24:00.763027 #921486] INFO -- : make[2]: Leaving directory '/tmp/ruby/build/trunk/.bundle/gems/bigdecimal-3.1.8/ext/bigdecimal' I, [2024-05-17T08:24:00.778091 #921486] INFO -- : make[2]: Entering directory '/tmp/ruby/build/trunk/.bundle/gems/debug-1.9.2/ext/debug' I, [2024-05-17T08:24:00.931116 #921486] INFO -- : make[2]: Leaving directory '/tmp/ruby/build/trunk/.bundle/gems/debug-1.9.2/ext/debug' I, [2024-05-17T08:24:00.948403 #921486] INFO -- : make[2]: Entering directory '/tmp/ruby/build/trunk/.bundle/gems/nkf-0.2.0/ext/nkf' I, [2024-05-17T08:24:01.098826 #921486] INFO -- : make[2]: Leaving directory '/tmp/ruby/build/trunk/.bundle/gems/nkf-0.2.0/ext/nkf' I, [2024-05-17T08:24:01.114032 #921486] INFO -- : make[2]: Entering directory '/tmp/ruby/build/trunk/.bundle/gems/racc-1.7.3/ext/racc/cparse' I, [2024-05-17T08:24:01.266448 #921486] INFO -- : make[2]: Leaving directory '/tmp/ruby/build/trunk/.bundle/gems/racc-1.7.3/ext/racc/cparse' I, [2024-05-17T08:24:01.288611 #921486] INFO -- : make[2]: Entering directory '/tmp/ruby/build/trunk/.bundle/gems/rbs-3.4.4/ext/rbs_extension' I, [2024-05-17T08:24:01.448171 #921486] INFO -- : make[2]: Leaving directory '/tmp/ruby/build/trunk/.bundle/gems/rbs-3.4.4/ext/rbs_extension' I, [2024-05-17T08:24:01.465379 #921486] INFO -- : make[2]: Entering directory '/tmp/ruby/build/trunk/.bundle/gems/syslog-0.1.2/ext/syslog' I, [2024-05-17T08:24:01.621674 #921486] INFO -- : make[2]: Leaving directory '/tmp/ruby/build/trunk/.bundle/gems/syslog-0.1.2/ext/syslog' I, [2024-05-17T08:24:01.849830 #921486] INFO -- : make[2]: Entering directory '/tmp/ruby/build/trunk' I, [2024-05-17T08:24:02.495807 #921486] INFO -- : make[2]: 'ruby' is up to date. I, [2024-05-17T08:24:02.496026 #921486] INFO -- : make[2]: Leaving directory '/tmp/ruby/build/trunk' I, [2024-05-17T08:24:02.497768 #921486] INFO -- : make[1]: Leaving directory '/tmp/ruby/build/trunk' I, [2024-05-17T08:24:02.530021 #921486] INFO -- : make[1]: Entering directory '/tmp/ruby/build/trunk' I, [2024-05-17T08:24:02.530215 #921486] INFO -- : make[1]: Nothing to be done for 'note'. I, [2024-05-17T08:24:02.530304 #921486] INFO -- : make[1]: Leaving directory '/tmp/ruby/build/trunk' I, [2024-05-17T08:24:03.292756 #921486] INFO -- : Run options: I, [2024-05-17T08:24:03.292969 #921486] INFO -- : --seed=29789 I, [2024-05-17T08:24:03.293097 #921486] INFO -- : "--ruby=./miniruby -I/tmp/ruby/src/trunk/lib -I. -I.ext/common /tmp/ruby/src/trunk/tool/runruby.rb --extout=.ext -- --disable-gems" I, [2024-05-17T08:24:03.293224 #921486] INFO -- : --excludes-dir=/tmp/ruby/src/trunk/test/.excludes I, [2024-05-17T08:24:03.293358 #921486] INFO -- : --name=!/memory_leak/ I, [2024-05-17T08:24:03.293488 #921486] INFO -- : --stderr-on-failure I, [2024-05-17T08:24:03.293619 #921486] INFO -- : -j4 I, [2024-05-17T08:24:03.293743 #921486] INFO -- : I, [2024-05-17T08:24:03.293865 #921486] INFO -- : # Running tests: I, [2024-05-17T08:24:03.294014 #921486] INFO -- : I, [2024-05-17T08:24:04.294533 #921486] INFO -- : [ 1/885] 962816=json_fixtures_test I, [2024-05-17T08:24:04.312088 #921486] INFO -- : [ 2/885] 962818=test_shapes I, [2024-05-17T08:24:04.345819 #921486] INFO -- : [ 3/885] 962819=test_io_timeout I, [2024-05-17T08:24:04.356479 #921486] INFO -- : [ 4/885] 962819=test_rdoc_parser_c I, [2024-05-17T08:24:04.361591 #921486] INFO -- : [ 5/885] 962818=test_comparable I, [2024-05-17T08:24:04.361826 #921486] INFO -- : [ 6/885] 962817=test_enc_str_buf_cat I, [2024-05-17T08:24:04.373907 #921486] INFO -- : [ 7/885] 962816=test_gbk I, [2024-05-17T08:24:04.393490 #921486] INFO -- : [ 8/885] 962817=test_class2name I, [2024-05-17T08:24:04.402297 #921486] INFO -- : [ 9/885] 962816=test_profile_frames I, [2024-05-17T08:24:04.413923 #921486] INFO -- : [ 10/885] 962818=test_cstr I, [2024-05-17T08:24:04.440265 #921486] INFO -- : [ 11/885] 962817=test_pstore I, [2024-05-17T08:24:04.741860 #921486] INFO -- : [ 12/885] 962817=test_big2str I, [2024-05-17T08:24:04.810257 #921486] INFO -- : [ 13/885] 962817=test_handle I, [2024-05-17T08:24:05.063967 #921486] INFO -- : [ 14/885] 962818=test_wait I, [2024-05-17T08:24:05.132780 #921486] INFO -- : [ 15/885] 962817=test_yaml I, [2024-05-17T08:24:05.179011 #921486] INFO -- : [ 16/885] 962816=test_forwardable I, [2024-05-17T08:24:05.323157 #921486] INFO -- : [ 17/885] 962816=test_rdoc_markup_formatter I, [2024-05-17T08:24:05.514301 #921486] INFO -- : [ 18/885] 962818=test_nowrite I, [2024-05-17T08:24:05.716637 #921486] INFO -- : [ 19/885] 962818=test_thread_queue I, [2024-05-17T08:24:05.993125 #921486] INFO -- : [ 20/885] 962817=test_ansi_without_terminfo I, [2024-05-17T08:24:06.388921 #921486] INFO -- : [ 21/885] 962816=test_gem_commands_sources_command I, [2024-05-17T08:24:06.394153 #921486] INFO -- : [ 22/885] 962817=test_bmethod I, [2024-05-17T08:24:06.432891 #921486] INFO -- : [ 23/885] 962817=test_ractor I, [2024-05-17T08:24:06.483593 #921486] INFO -- : [ 24/885] 962817=test_euc_tw I, [2024-05-17T08:24:06.515424 #921486] INFO -- : [ 25/885] 962817=test_init I, [2024-05-17T08:24:06.833418 #921486] INFO -- : [ 26/885] 962819=test_complexrational I, [2024-05-17T08:24:06.847760 #921486] INFO -- : [ 27/885] 962819=test_pathname I, [2024-05-17T08:24:08.661471 #921486] INFO -- : [ 28/885] 962819=test_coverage I, [2024-05-17T08:24:09.141356 #921486] INFO -- : [ 29/885] 962817=test_rdoc_encoding I, [2024-05-17T08:24:09.378486 #921486] INFO -- : [ 30/885] 962816=test_gem_package_tar_reader I, [2024-05-17T08:24:09.568446 #921486] INFO -- : [ 31/885] 962816=regexp_test I, [2024-05-17T08:24:10.185271 #921486] INFO -- : [ 32/885] 962817=test_file I, [2024-05-17T08:24:10.280890 #921486] INFO -- : [ 33/885] 962816=test_gem_available_set I, [2024-05-17T08:24:10.333696 #921486] INFO -- : [ 34/885] 962817=test_rdoc_markdown I, [2024-05-17T08:24:10.954826 #921486] INFO -- : [ 35/885] 962816=test_modify_expand I, [2024-05-17T08:24:10.989401 #921486] INFO -- : [ 36/885] 962816=test_rdoc_any_method I, [2024-05-17T08:24:12.159460 #921486] INFO -- : [ 37/885] 962817=test_bash_completion I, [2024-05-17T08:24:12.198328 #921486] INFO -- : [ 38/885] 962817=test_formatter I, [2024-05-17T08:24:12.246482 #921486] INFO -- : [ 39/885] 962817=test_rdoc_constant I, [2024-05-17T08:24:13.116897 #921486] INFO -- : [ 40/885] 962817=test_deprecate I, [2024-05-17T08:24:13.187040 #921486] INFO -- : [ 41/885] 962818=test_gem_commands_owner_command I, [2024-05-17T08:24:13.401001 #921486] INFO -- : [ 42/885] 962819=test_gem_source_vendor I, [2024-05-17T08:24:13.970968 #921486] INFO -- : [ 43/885] 962816=test_recorder I, [2024-05-17T08:24:14.018857 #921486] INFO -- : [ 44/885] 962816=test_digest I, [2024-05-17T08:24:14.976206 #921486] INFO -- : [ 45/885] 962817=test_marshalable I, [2024-05-17T08:24:15.031768 #921486] INFO -- : [ 46/885] 962817=test_cgi_util I, [2024-05-17T08:24:15.373157 #921486] INFO -- : [ 47/885] 962819=test_require I, [2024-05-17T08:24:16.410932 #921486] INFO -- : [ 48/885] 962818=test_gem_ext_cmake_builder I, [2024-05-17T08:24:16.483460 #921486] INFO -- : [ 49/885] 962818=test_gem_commands_contents_command I, [2024-05-17T08:24:16.610273 #921486] INFO -- : [ 50/885] 962817=test_wss I, [2024-05-17T08:24:16.643378 #921486] INFO -- : [ 51/885] 962817=test_fiddle I, [2024-05-17T08:24:16.893978 #921486] INFO -- : [ 52/885] 962817=test_find I, [2024-05-17T08:24:17.005465 #921486] INFO -- : [ 53/885] 962817=test_ractor I, [2024-05-17T08:24:17.035626 #921486] INFO -- : [ 54/885] 962818=test_queue I, [2024-05-17T08:24:17.060541 #921486] INFO -- : [ 55/885] 962818=test_function I, [2024-05-17T08:24:17.204310 #921486] INFO -- : [ 56/885] 962816=parse_comments_test I, [2024-05-17T08:24:17.214891 #921486] INFO -- : [ 57/885] 962816=test_noarg I, [2024-05-17T08:24:17.349239 #921486] INFO -- : [ 58/885] 962818=test_tempfile I, [2024-05-17T08:24:17.461305 #921486] INFO -- : [ 59/885] 962817=test_rdoc_markup I, [2024-05-17T08:24:17.528727 #921486] INFO -- : [ 60/885] 962817=test_gem_commands_help_command I, [2024-05-17T08:24:18.178471 #921486] INFO -- : [ 61/885] 962817=test_prettyprint I, [2024-05-17T08:24:18.365614 #921486] INFO -- : [ 62/885] 962817=test_tracepoint I, [2024-05-17T08:24:18.445787 #921486] INFO -- : [ 63/885] 962818=test_basicsocket I, [2024-05-17T08:24:18.454351 #921486] INFO -- : [ 64/885] 962816=test_utf32 I, [2024-05-17T08:24:18.499567 #921486] INFO -- : [ 65/885] 962816=test_duplicate I, [2024-05-17T08:24:18.535264 #921486] INFO -- : [ 66/885] 962816=test_gem_resolver_index_specification I, [2024-05-17T08:24:18.565217 #921486] INFO -- : [ 67/885] 962818=test_internal_ivar I, [2024-05-17T08:24:18.566905 #921486] INFO -- : [ 68/885] 962818=test_date_strftime I, [2024-05-17T08:24:18.800534 #921486] INFO -- : [ 69/885] 962816=test_rdoc_parser_rd I, [2024-05-17T08:24:18.958309 #921486] INFO -- : [ 70/885] 962816=test_gem_installer I, [2024-05-17T08:24:20.329814 #921486] INFO -- : [ 71/885] 962817=test_yamlstore I, [2024-05-17T08:24:20.359420 #921486] INFO -- : [ 72/885] 962817=test_random I, [2024-05-17T08:24:20.438494 #921486] INFO -- : [ 73/885] 962817=test_asn1 I, [2024-05-17T08:24:20.607160 #921486] INFO -- : [ 74/885] 962817=test_const I, [2024-05-17T08:24:20.627583 #921486] INFO -- : [ 75/885] 962817=test_class I, [2024-05-17T08:24:22.816090 #921486] INFO -- : [ 76/885] 962818=test_rdoc_normal_class I, [2024-05-17T08:24:24.332942 #921486] INFO -- : [ 77/885] 962819=test_load I, [2024-05-17T08:24:24.449197 #921486] INFO -- : [ 78/885] 962819=json_string_matching_test I, [2024-05-17T08:24:24.520662 #921486] INFO -- : [ 79/885] 962819=test_irb I, [2024-05-17T08:24:24.648743 #921486] INFO -- : [ 80/885] 962818=test_gem_commands_search_command I, [2024-05-17T08:24:24.713272 #921486] INFO -- : [ 81/885] 962818=test_complex I, [2024-05-17T08:24:25.412032 #921486] INFO -- : [ 82/885] 962818=test_gem_ext_ext_conf_builder I, [2024-05-17T08:24:27.178011 #921486] INFO -- : [ 83/885] 962819=test_frozen_error I, [2024-05-17T08:24:27.235359 #921486] INFO -- : [ 84/885] 962819=test_gem_stub_specification I, [2024-05-17T08:24:28.213253 #921486] INFO -- : [ 85/885] 962819=test_method_cache I, [2024-05-17T08:24:28.278223 #921486] INFO -- : [ 86/885] 962819=test_gem_dependency I, [2024-05-17T08:24:29.116631 #921486] INFO -- : [ 87/885] 962819=test_gem_resolver_specification I, [2024-05-17T08:24:29.180855 #921486] INFO -- : [ 88/885] 962819=test_path_to_class I, [2024-05-17T08:24:29.203511 #921486] INFO -- : [ 89/885] 962819=test_rdoc_markup_verbatim I, [2024-05-17T08:24:29.222347 #921486] INFO -- : [ 90/885] 962819=test_inlinecache I, [2024-05-17T08:24:30.205304 #921486] INFO -- : [ 91/885] 962819=test_gem_remote_fetcher I, [2024-05-17T08:24:34.292973 #921486] INFO -- : [ 92/885] 962818=test_mdns I, [2024-05-17T08:24:34.383982 #921486] INFO -- : [ 93/885] 962818=test_parse I, [2024-05-17T08:24:38.476762 #921486] INFO -- : [ 94/885] 962818=test_gem_resolver_installed_specification I, [2024-05-17T08:24:38.653150 #921486] INFO -- : [ 95/885] 962818=test_scanner_events I, [2024-05-17T08:24:39.049964 #921486] INFO -- : [ 96/885] 962818=test_gem_commands_list_command I, [2024-05-17T08:24:39.263407 #921486] INFO -- : [ 97/885] 962818=test_stack I, [2024-05-17T08:24:39.451182 #921486] INFO -- : [ 98/885] 962819=test_rdoc_include I, [2024-05-17T08:24:39.650342 #921486] INFO -- : [ 99/885] 962819=test_reqarg I, [2024-05-17T08:24:42.424971 #921486] INFO -- : [100/885] 962819=test_too_many_dummy_encodings I, [2024-05-17T08:24:42.489531 #921486] INFO -- : [101/885] 962819=test_rdoc_options I, [2024-05-17T08:24:44.176373 #921486] INFO -- : [102/885] 962819=test_cesu8 I, [2024-05-17T08:24:44.239746 #921486] INFO -- : [103/885] 962819=test_econv I, [2024-05-17T08:24:44.623289 #921486] INFO -- : [104/885] 962817=test_gem_version I, [2024-05-17T08:24:45.276218 #921486] INFO -- : [105/885] 962817=test_resource I, [2024-05-17T08:24:45.358754 #921486] INFO -- : [106/885] 962817=test_gem_commands_signin_command I, [2024-05-17T08:24:45.961647 #921486] INFO -- : [107/885] 962817=test_emitter I, [2024-05-17T08:24:45.998572 #921486] INFO -- : [108/885] 962817=test_ldap I, [2024-05-17T08:24:46.117643 #921486] INFO -- : [109/885] 962817=test_fileutils I, [2024-05-17T08:24:47.842269 #921486] INFO -- : [110/885] 962817=test_string_processing I, [2024-05-17T08:24:47.847892 #921486] INFO -- : [111/885] 962817=test_external_new I, [2024-05-17T08:24:47.864415 #921486] INFO -- : [112/885] 962818=test_postponed_job I, [2024-05-17T08:24:47.885221 #921486] INFO -- : [113/885] 962817=test_alias_and_anchor I, [2024-05-17T08:24:47.919032 #921486] INFO -- : [114/885] 962817=test_hash I, [2024-05-17T08:24:48.017395 #921486] INFO -- : [115/885] 962817=test_gem_resolver_dependency_request I, [2024-05-17T08:24:48.173989 #921486] INFO -- : [116/885] 962817=test_tree_builder I, [2024-05-17T08:24:48.221317 #921486] INFO -- : [117/885] 962817=test_win32ole_typelib I, [2024-05-17T08:24:48.240057 #921486] INFO -- : [118/885] 962817=test_protect I, [2024-05-17T08:24:48.329965 #921486] INFO -- : [119/885] 962817=test_raise_exception I, [2024-05-17T08:24:50.675488 #921486] INFO -- : [120/885] 962818=test_gem_request_set_lockfile I, [2024-05-17T08:24:51.687487 #921486] INFO -- : [121/885] 962819=test_argf I, [2024-05-17T08:24:52.583550 #921486] INFO -- : [122/885] 962816=test_framework I, [2024-05-17T08:24:52.646376 #921486] INFO -- : [123/885] 962818=test_ns_spki I, [2024-05-17T08:24:52.724968 #921486] INFO -- : [124/885] 962816=test_kill_ring I, [2024-05-17T08:24:52.857130 #921486] INFO -- : [125/885] 962818=test_yjit I, [2024-05-17T08:24:53.122569 #921486] INFO -- : [126/885] 962818=test_workspace I, [2024-05-17T08:24:53.140554 #921486] INFO -- : [127/885] 962817=test_weakmap I, [2024-05-17T08:24:53.253317 #921486] INFO -- : [128/885] 962816=test_m17n I, [2024-05-17T08:24:53.971451 #921486] INFO -- : [129/885] 962816=test_gem_commands_environment_command I, [2024-05-17T08:24:54.444957 #921486] INFO -- : [130/885] 962816=test_ws I, [2024-05-17T08:24:54.515046 #921486] INFO -- : [131/885] 962816=test_gem_security_trust_dir I, [2024-05-17T08:24:54.786435 #921486] INFO -- : [132/885] 962816=test_gem_requirement I, [2024-05-17T08:24:54.808110 #921486] INFO -- : [133/885] 962818=test_sprintf I, [2024-05-17T08:24:55.684613 #921486] INFO -- : [134/885] 962816=comments_test I, [2024-05-17T08:24:55.835920 #921486] INFO -- : [135/885] 962816=test_string_memory I, [2024-05-17T08:24:56.053577 #921486] INFO -- : [136/885] 962816=test_undef I, [2024-05-17T08:24:56.308978 #921486] INFO -- : [137/885] 962816=test_objspace I, [2024-05-17T08:24:57.444983 #921486] INFO -- : [138/885] 962818=ripper_test I, [2024-05-17T08:25:02.660668 #921486] INFO -- : [139/885] 962818=test_line_editor I, [2024-05-17T08:25:02.721149 #921486] INFO -- : [140/885] 962818=test_remote_fetch_error I, [2024-05-17T08:25:03.301978 #921486] INFO -- : [141/885] 962818=test_have_library I, [2024-05-17T08:25:11.187884 #921486] INFO -- : [142/885] 962817=test_gem_commands_stale_command I, [2024-05-17T08:25:11.290750 #921486] INFO -- : [143/885] 962817=test_lock_native_thread I, [2024-05-17T08:25:12.241988 #921486] INFO -- : [144/885] 962818=test_c_struct_entry I, [2024-05-17T08:25:12.731474 #921486] INFO -- : [145/885] 962817=test_set I, [2024-05-17T08:25:12.811536 #921486] INFO -- : [146/885] 962817=test_show_source I, [2024-05-17T08:25:12.892038 #921486] INFO -- : [147/885] 962817=test_pack I, [2024-05-17T08:25:13.470143 #921486] INFO -- : [148/885] 962818=test_array_create I, [2024-05-17T08:25:13.505194 #921486] INFO -- : [149/885] 962818=test_gem_impossible_dependencies_error I, [2024-05-17T08:25:13.562728 #921486] INFO -- : [150/885] 962818=test_pattern_key_name_check I, [2024-05-17T08:25:13.612398 #921486] INFO -- : [151/885] 962818=test_to_ruby I, [2024-05-17T08:25:13.704589 #921486] INFO -- : [152/885] 962818=test_rdoc_rubygems_hook I, [2024-05-17T08:25:14.363352 #921486] INFO -- : [153/885] 962818=test_method I, [2024-05-17T08:25:14.555437 #921486] INFO -- : [154/885] 962817=test_gem_commands_query_command I, [2024-05-17T08:25:18.360163 #921486] INFO -- : [155/885] 962817=test_euc_kr I, [2024-05-17T08:25:18.399320 #921486] INFO -- : [156/885] 962817=test_rdoc_context_section I, [2024-05-17T08:25:18.465241 #921486] INFO -- : [157/885] 962817=test_ftp I, [2024-05-17T08:25:18.763240 #921486] INFO -- : [158/885] 962817=warnings_test I, [2024-05-17T08:25:19.090948 #921486] INFO -- : [159/885] 962817=test_kwargs I, [2024-05-17T08:25:19.163434 #921486] INFO -- : [160/885] 962817=test_gem_commands_exec_command I, [2024-05-17T08:25:26.157774 #921486] INFO -- : [161/885] 962819=test_io_wait I, [2024-05-17T08:25:26.392277 #921486] INFO -- : [162/885] 962817=test_date_attr I, [2024-05-17T08:25:26.397737 #921486] INFO -- : [163/885] 962817=test_ellipsize I, [2024-05-17T08:25:26.520217 #921486] INFO -- : [164/885] 962817=test_summary I, [2024-05-17T08:25:26.529985 #921486] INFO -- : [165/885] 962819=test_console_attr I, [2024-05-17T08:25:26.533436 #921486] INFO -- : [166/885] 962819=test_type_completor I, [2024-05-17T08:25:26.604668 #921486] INFO -- : [167/885] 962819=test_win32ole_record I, [2024-05-17T08:25:26.643070 #921486] INFO -- : [168/885] 962819=test_gem_unsatisfiable_dependency_error I, [2024-05-17T08:25:26.712738 #921486] INFO -- : [169/885] 962819=test_condition I, [2024-05-17T08:25:26.825805 #921486] INFO -- : [170/885] 962819=test_gem_source_specific_file I, [2024-05-17T08:25:27.413840 #921486] INFO -- : [171/885] 962817=test_foreach I, [2024-05-17T08:25:27.440013 #921486] INFO -- : [172/885] 962817=test_gem_commands_uninstall_command I, [2024-05-17T08:25:27.462745 #921486] INFO -- : [173/885] 962819=test_cp949 I, [2024-05-17T08:25:27.523625 #921486] INFO -- : [174/885] 962819=test_io I, [2024-05-17T08:25:28.479491 #921486] INFO -- : [175/885] 962819=test_hash I, [2024-05-17T08:25:33.688007 #921486] INFO -- : [176/885] 962817=test_ubf_async_safe I, [2024-05-17T08:25:33.758937 #921486] INFO -- : [177/885] 962817=test_emoji I, [2024-05-17T08:25:33.924489 #921486] INFO -- : [178/885] 962817=test_win32ole_type_event I, [2024-05-17T08:25:34.566061 #921486] INFO -- : [179/885] 962817=test_sorted_set I, [2024-05-17T08:25:35.869579 #921486] INFO -- : [180/885] 962817=test_gc I, [2024-05-17T08:25:35.912332 #921486] INFO -- : [181/885] 962817=test_math I, [2024-05-17T08:25:36.132346 #921486] INFO -- : [182/885] 962817=test_gem_commands_fetch_command I, [2024-05-17T08:25:37.165240 #921486] INFO -- : [183/885] 962817=test_libs I, [2024-05-17T08:25:37.524094 #921486] INFO -- : [184/885] 962817=test_config I, [2024-05-17T08:25:37.659533 #921486] INFO -- : [185/885] 962817=test_sleep I, [2024-05-17T08:25:39.690462 #921486] INFO -- : [186/885] 962817=test_yaml_tree I, [2024-05-17T08:25:39.890221 #921486] INFO -- : [187/885] 962817=test_face I, [2024-05-17T08:25:39.990947 #921486] INFO -- : [188/885] 962817=test_case I, [2024-05-17T08:25:40.209978 #921486] INFO -- : [189/885] 962817=test_sizeof I, [2024-05-17T08:25:42.962600 #921486] INFO -- : [190/885] 962818=test_rendering I, [2024-05-17T08:25:43.013457 #921486] INFO -- : [191/885] 962818=test_autoload I, [2024-05-17T08:25:56.600068 #921486] INFO -- : [192/885] 962819=test_utf16 I, [2024-05-17T08:25:56.859537 #921486] INFO -- : [193/885] 962819=test_unicode_escape I, [2024-05-17T08:25:57.718888 #921486] INFO -- : [194/885] 962819=test_io I, [2024-05-17T08:26:03.412746 #921486] INFO -- : [195/885] 962818=test_bigzero I, [2024-05-17T08:26:03.469883 #921486] INFO -- : [196/885] 962818=test_pkey_dh I, [2024-05-17T08:26:04.073063 #921486] INFO -- : [197/885] 962818=test_iseq_load I, [2024-05-17T08:26:05.678481 #921486] INFO -- : [198/885] 962817=test_gem_util I, [2024-05-17T08:26:06.853512 #921486] INFO -- : [199/885] 962817=test_gem_package_tar_header I, [2024-05-17T08:26:07.658929 #921486] INFO -- : [200/885] 962817=test_pkcs12 I, [2024-05-17T08:26:07.663799 #921486] INFO -- : [201/885] 962816=test_system I, [2024-05-17T08:26:11.123802 #921486] INFO -- : [202/885] 962818=test_yjit_exit_locations I, [2024-05-17T08:26:11.152306 #921486] INFO -- : [203/885] 962818=test_etc I, [2024-05-17T08:26:11.641337 #921486] INFO -- : [204/885] 962818=test_ripper I, [2024-05-17T08:26:11.930809 #921486] INFO -- : [205/885] 962817=test_gem_config_file I, [2024-05-17T08:26:12.824732 #921486] INFO -- : [206/885] 962817=test_gem_resolver_activation_request I, [2024-05-17T08:26:12.872718 #921486] INFO -- : [207/885] 962817=test_protocol I, [2024-05-17T08:26:13.265060 #921486] INFO -- : [208/885] 962817=test_getopts I, [2024-05-17T08:26:13.328748 #921486] INFO -- : [209/885] 962817=test_webauthn_poller I, [2024-05-17T08:26:13.797445 #921486] INFO -- : [210/885] 962817=test_rdoc_markup_raw I, [2024-05-17T08:26:13.824343 #921486] INFO -- : [211/885] 962817=test_rat I, [2024-05-17T08:26:13.873455 #921486] INFO -- : [212/885] 962817=test_typeddata I, [2024-05-17T08:26:14.290999 #921486] INFO -- : [213/885] 962818=test_gem_resolver_best_set I, [2024-05-17T08:26:14.688091 #921486] INFO -- : [214/885] 962818=encoding_test I, [2024-05-17T08:26:15.461301 #921486] INFO -- : [215/885] 962818=test_rdoc_markup_to_html_crossref I, [2024-05-17T08:26:15.493075 #921486] INFO -- : [216/885] 962816=test_fstring I, [2024-05-17T08:26:16.415209 #921486] INFO -- : [217/885] 962816=test_array I, [2024-05-17T08:26:16.420976 #921486] INFO -- : [218/885] 962817=test_optparse I, [2024-05-17T08:26:16.424912 #921486] INFO -- : [219/885] 962817=test_convertible I, [2024-05-17T08:26:16.505234 #921486] INFO -- : [220/885] 962816=parser_test I, [2024-05-17T08:26:16.505500 #921486] INFO -- : [221/885] 962816=test_yield I, [2024-05-17T08:26:17.780111 #921486] INFO -- : [222/885] 962818=test_rdoc_alias I, [2024-05-17T08:26:18.163381 #921486] INFO -- : [223/885] 962818=test_files_sample I, [2024-05-17T08:26:18.549434 #921486] INFO -- : [224/885] 962818=test_stringscanner I, [2024-05-17T08:26:18.784808 #921486] INFO -- : [225/885] 962818=test_rdoc_markup_indented_paragraph I, [2024-05-17T08:26:18.827946 #921486] INFO -- : [226/885] 962818=test_io_buffer I, [2024-05-17T08:26:18.984062 #921486] INFO -- : [227/885] 962818=ruby_parser_test I, [2024-05-17T08:26:19.014390 #921486] INFO -- : [228/885] 962818=test_backtrace I, [2024-05-17T08:26:22.126190 #921486] INFO -- : [229/885] 962818=test_pack I, [2024-05-17T08:26:22.153983 #921486] INFO -- : [230/885] 962818=test_rdoc_task I, [2024-05-17T08:26:22.190101 #921486] INFO -- : [231/885] 962818=test_gem_resolver_conflict I, [2024-05-17T08:26:22.271121 #921486] INFO -- : [232/885] 962818=test_clone I, [2024-05-17T08:26:23.834575 #921486] INFO -- : [233/885] 962818=test_gem_commands_install_command I, [2024-05-17T08:26:32.418770 #921486] INFO -- : [234/885] 962818=test_readpartial I, [2024-05-17T08:26:32.922882 #921486] INFO -- : [235/885] 962818=locals_test I, [2024-05-17T08:26:33.518551 #921486] INFO -- : [236/885] 962819=test_rdoc_require I, [2024-05-17T08:26:33.637963 #921486] INFO -- : [237/885] 962819=test_rdoc_store I, [2024-05-17T08:26:36.995585 #921486] INFO -- : [238/885] 962818=test_raise I, [2024-05-17T08:26:37.025645 #921486] INFO -- : [239/885] 962818=test_x509attr I, [2024-05-17T08:26:37.051616 #921486] INFO -- : [240/885] 962818=test_gem_request_set_lockfile_parser I, [2024-05-17T08:26:37.755637 #921486] INFO -- : [241/885] 962818=test_depth_first I, [2024-05-17T08:26:37.830965 #921486] INFO -- : [242/885] 962818=test_pattern_matching I, [2024-05-17T08:26:38.000509 #921486] INFO -- : [243/885] 962818=test_rdoc_stats I, [2024-05-17T08:26:38.217830 #921486] INFO -- : [244/885] 962818=test_string I, [2024-05-17T08:26:38.328656 #921486] INFO -- : [245/885] 962818=test_rdoc_parser I, [2024-05-17T08:26:38.465335 #921486] INFO -- : [246/885] 962818=test_qsort I, [2024-05-17T08:26:38.504108 #921486] INFO -- : [247/885] 962818=test_gem_dependency_resolution_error I, [2024-05-17T08:26:38.580221 #921486] INFO -- : [248/885] 962818=json_addition_test I, [2024-05-17T08:26:38.669180 #921486] INFO -- : [249/885] 962818=test_custom_command I, [2024-05-17T08:26:38.757592 #921486] INFO -- : [250/885] 962818=test_proc I, [2024-05-17T08:26:39.035397 #921486] INFO -- : [251/885] 962819=test_string I, [2024-05-17T08:26:45.369093 #921486] INFO -- : [252/885] 962816=test_gc_compact I, [2024-05-17T08:26:48.398432 #921486] INFO -- : [253/885] 962818=test_gem_package_old I, [2024-05-17T08:26:48.690977 #921486] INFO -- : [254/885] 962818=test_gem_resolver_index_set I, [2024-05-17T08:26:48.862665 #921486] INFO -- : [255/885] 962818=test_egrep_cpp I, [2024-05-17T08:26:49.860421 #921486] INFO -- : [256/885] 962818=test_cgi_tag_helper I, [2024-05-17T08:26:49.948709 #921486] INFO -- : [257/885] 962818=test_zlib I, [2024-05-17T08:26:55.739391 #921486] INFO -- : [258/885] 962817=test_optimization I, [2024-05-17T08:27:05.800826 #921486] INFO -- : [259/885] 962816=test_date_conv I, [2024-05-17T08:27:05.844790 #921486] INFO -- : [260/885] 962816=test_erb_m17n I, [2024-05-17T08:27:05.893378 #921486] INFO -- : [261/885] 962816=test_ole_methods I, [2024-05-17T08:27:05.910638 #921486] INFO -- : [262/885] 962816=test_folderitem2_invokeverb I, [2024-05-17T08:27:06.327707 #921486] INFO -- : [263/885] 962816=test_require_path_check I, [2024-05-17T08:27:06.540087 #921486] INFO -- : [264/885] 962816=test_rdoc_markup_parser I, [2024-05-17T08:27:08.892979 #921486] INFO -- : [265/885] 962816=test_files_test_2 I, [2024-05-17T08:27:14.672172 #921486] INFO -- : [266/885] 962818=test_fnmatch I, [2024-05-17T08:27:15.167467 #921486] INFO -- : [267/885] 962818=test_gem_validator I, [2024-05-17T08:27:15.283513 #921486] INFO -- : [268/885] 962818=test_defined I, [2024-05-17T08:27:16.073395 #921486] INFO -- : [269/885] 962818=test_backtrace I, [2024-05-17T08:27:16.109465 #921486] INFO -- : [270/885] 962818=test_key_name_check I, [2024-05-17T08:27:16.171405 #921486] INFO -- : [271/885] 962818=test_io_buffer I, [2024-05-17T08:27:16.519534 #921486] INFO -- : [272/885] 962818=test_rdoc_i18n_text I, [2024-05-17T08:27:16.744614 #921486] INFO -- : [273/885] 962818=test_gem_uninstaller I, [2024-05-17T08:27:24.448023 #921486] INFO -- : [274/885] 962818=test_gb18030 I, [2024-05-17T08:27:24.488449 #921486] INFO -- : [275/885] 962818=test_svcb_https I, [2024-05-17T08:27:24.558073 #921486] INFO -- : [276/885] 962818=test_buffering I, [2024-05-17T08:27:24.600443 #921486] INFO -- : [277/885] 962818=test_windows_1251 I, [2024-05-17T08:27:24.631098 #921486] INFO -- : [278/885] 962818=test_time I, [2024-05-17T08:27:25.699048 #921486] INFO -- : [279/885] 962818=test_rdoc_rdoc I, [2024-05-17T08:27:26.271599 #921486] INFO -- : [280/885] 962818=test_rdoc_markup_attributes I, [2024-05-17T08:27:26.309680 #921486] INFO -- : [281/885] 962818=test_mul I, [2024-05-17T08:27:26.392230 #921486] INFO -- : [282/885] 962818=test_win32ole_type I, [2024-05-17T08:27:26.411851 #921486] INFO -- : [283/885] 962818=test_null I, [2024-05-17T08:27:26.506339 #921486] INFO -- : [284/885] 962818=test_default_gems I, [2024-05-17T08:27:26.890642 #921486] INFO -- : [285/885] 962818=test_rdoc_rd_inline_parser I, [2024-05-17T08:27:27.085623 #921486] INFO -- : [286/885] 962818=test_rdoc_markup_to_rdoc I, [2024-05-17T08:27:27.422373 #921486] INFO -- : [287/885] 962818=test_pipe I, [2024-05-17T08:27:28.355338 #921486] INFO -- : [288/885] 962818=test_trick I, [2024-05-17T08:27:36.923171 #921486] INFO -- : [289/885] 962816=test_thread I, [2024-05-17T08:27:37.137158 #921486] INFO -- : [290/885] 962816=test_pkey_ec I, [2024-05-17T08:27:38.050522 #921486] INFO -- : [291/885] 962816=test_date_parse I, [2024-05-17T08:27:38.934616 #921486] INFO -- : [292/885] 962816=!Nothing_to_test I, [2024-05-17T08:27:38.972600 #921486] INFO -- : [293/885] 962816=test_psych I, [2024-05-17T08:27:39.165205 #921486] INFO -- : [294/885] 962816=test_enc_raise I, [2024-05-17T08:27:39.185344 #921486] INFO -- : [295/885] 962816=test_rdoc_markup_paragraph I, [2024-05-17T08:27:39.216394 #921486] INFO -- : [296/885] 962816=test_date I, [2024-05-17T08:27:39.328491 #921486] INFO -- : [297/885] 962816=test_gem_rdoc I, [2024-05-17T08:27:40.110135 #921486] INFO -- : [298/885] 962816=test_gem_ext_cargo_builder_unit I, [2024-05-17T08:27:40.344012 #921486] INFO -- : [299/885] 962816=test_command I, [2024-05-17T08:27:41.731278 #921486] INFO -- : [300/885] 962819=test_at_exit I, [2024-05-17T08:27:41.817686 #921486] INFO -- : [301/885] 962819=test_object_create_start I, [2024-05-17T08:27:41.841659 #921486] INFO -- : [302/885] 962819=test_emitter I, [2024-05-17T08:27:41.889918 #921486] INFO -- : [303/885] 962819=test_gem_silent_ui I, [2024-05-17T08:27:41.896548 #921486] INFO -- : [304/885] 962818=test_bug-5832 I, [2024-05-17T08:27:42.034376 #921486] INFO -- : [305/885] 962818=test_files_ext I, [2024-05-17T08:27:42.044393 #921486] INFO -- : [306/885] 962818=test_kernel I, [2024-05-17T08:27:42.246696 #921486] INFO -- : [307/885] 962819=dispatcher_test I, [2024-05-17T08:27:42.438757 #921486] INFO -- : [308/885] 962816=test_eval_history I, [2024-05-17T08:27:42.540912 #921486] INFO -- : [309/885] 962816=test_kdf I, [2024-05-17T08:27:42.755417 #921486] INFO -- : [310/885] 962819=test_gem_doctor I, [2024-05-17T08:27:43.019206 #921486] INFO -- : [311/885] 962819=test_gem_source_list I, [2024-05-17T08:27:43.064631 #921486] INFO -- : [312/885] 962816=test_optarg I, [2024-05-17T08:27:43.376694 #921486] INFO -- : [313/885] 962819=test_yaml_special_cases I, [2024-05-17T08:27:43.472213 #921486] INFO -- : [314/885] 962819=test_config I, [2024-05-17T08:27:43.594544 #921486] INFO -- : [315/885] 962816=test_rdoc_token_stream I, [2024-05-17T08:27:43.616930 #921486] INFO -- : [316/885] 962819=test_address_resolve I, [2024-05-17T08:27:43.650025 #921486] INFO -- : [317/885] 962816=test_iter_break I, [2024-05-17T08:27:43.656587 #921486] INFO -- : [318/885] 962816=test_exception I, [2024-05-17T08:27:43.707855 #921486] INFO -- : [319/885] 962816=test_zsh_completion I, [2024-05-17T08:27:43.724265 #921486] INFO -- : [320/885] 962819=test_rdoc_single_class I, [2024-05-17T08:27:43.739287 #921486] INFO -- : [321/885] 962816=test_nil I, [2024-05-17T08:27:43.743342 #921486] INFO -- : [322/885] 962819=test_num2int I, [2024-05-17T08:27:43.772862 #921486] INFO -- : [323/885] 962816=test_verbose I, [2024-05-17T08:27:43.821984 #921486] INFO -- : [324/885] 962819=test_pp I, [2024-05-17T08:27:43.940694 #921486] INFO -- : [325/885] 962816=test_gem_ext_configure_builder I, [2024-05-17T08:27:44.111093 #921486] INFO -- : [326/885] 962819=test_frozen I, [2024-05-17T08:27:44.122937 #921486] INFO -- : [327/885] 962816=test_macro I, [2024-05-17T08:27:44.136187 #921486] INFO -- : [328/885] 962819=test_rdoc_tom_doc I, [2024-05-17T08:27:44.164431 #921486] INFO -- : [329/885] 962816=test_rdoc_markup_to_tt_only I, [2024-05-17T08:27:44.285236 #921486] INFO -- : [330/885] 962819=test_hmac I, [2024-05-17T08:27:44.381403 #921486] INFO -- : [331/885] 962816=test_key_actor_vi I, [2024-05-17T08:27:44.442023 #921486] INFO -- : [332/885] 962819=test_bug-3571 I, [2024-05-17T08:27:44.513578 #921486] INFO -- : [333/885] 962819=test_gem_command I, [2024-05-17T08:27:45.099455 #921486] INFO -- : [334/885] 962819=test_gem_spec_fetcher I, [2024-05-17T08:27:45.316891 #921486] INFO -- : [335/885] 962816=test_common I, [2024-05-17T08:27:46.244368 #921486] INFO -- : [336/885] 962819=test_numeric I, [2024-05-17T08:27:46.320410 #921486] INFO -- : [337/885] 962818=test_gem_commands_lock_command I, [2024-05-17T08:27:46.435013 #921486] INFO -- : [338/885] 962818=test_ifunless I, [2024-05-17T08:27:46.516831 #921486] INFO -- : [339/885] 962818=test_assignment I, [2024-05-17T08:27:46.799809 #921486] INFO -- : [340/885] 962819=test_gem_security_policy I, [2024-05-17T08:27:46.941160 #921486] INFO -- : [341/885] 962817=test_gem_source_local I, [2024-05-17T08:27:47.088420 #921486] INFO -- : [342/885] 962816=test_process I, [2024-05-17T08:27:48.404462 #921486] INFO -- : [343/885] 962817=test_last_thread I, [2024-05-17T08:27:48.870730 #921486] INFO -- : [344/885] 962819=test_pack I, [2024-05-17T08:27:49.893961 #921486] INFO -- : [345/885] 962817=test_gem_resolver_lock_specification I, [2024-05-17T08:27:50.062730 #921486] INFO -- : [346/885] 962817=test_err_in_callback I, [2024-05-17T08:27:50.242029 #921486] INFO -- : [347/885] 962817=test_x509cert I, [2024-05-17T08:27:50.394020 #921486] INFO -- : [348/885] 962819=test_gc I, [2024-05-17T08:27:53.476606 #921486] INFO -- : [349/885] 962817=test_gem_ext_rake_builder I, [2024-05-17T08:27:58.711194 #921486] INFO -- : [350/885] 962817=test_arity I, [2024-05-17T08:27:58.858781 #921486] INFO -- : [351/885] 962817=test_logdevice I, [2024-05-17T08:28:00.369194 #921486] INFO -- : [352/885] 962818=test_io_console I, [2024-05-17T08:28:03.888901 #921486] INFO -- : [353/885] 962817=test_singleton I, [2024-05-17T08:28:03.930573 #921486] INFO -- : [354/885] 962817=test_flush I, [2024-05-17T08:28:03.983144 #921486] INFO -- : [355/885] 962817=test_switch_hitter I, [2024-05-17T08:28:04.072965 #921486] INFO -- : [356/885] 962817=test_securerandom I, [2024-05-17T08:28:04.326350 #921486] INFO -- : [357/885] 962817=test_logperiod I, [2024-05-17T08:28:04.441768 #921486] INFO -- : [358/885] 962817=test_c_union_entity I, [2024-05-17T08:28:04.741236 #921486] INFO -- : [359/885] 962817=test_rdoc_normal_module I, [2024-05-17T08:28:04.974771 #921486] INFO -- : [360/885] 962818=test_rdoc_markdown_test I, [2024-05-17T08:28:05.025099 #921486] INFO -- : [361/885] 962817=test_passing_block I, [2024-05-17T08:28:05.062293 #921486] INFO -- : [362/885] 962817=test_thread_fd_close I, [2024-05-17T08:28:05.087349 #921486] INFO -- : [363/885] 962817=newline_test I, [2024-05-17T08:28:05.646930 #921486] INFO -- : [364/885] 962817=test_uncorrectable_name_check I, [2024-05-17T08:28:05.722956 #921486] INFO -- : [365/885] 962817=test_stringchar I, [2024-05-17T08:28:06.340860 #921486] INFO -- : [366/885] 962817=test_hash_create I, [2024-05-17T08:28:06.499822 #921486] INFO -- : [367/885] 962817=test_rdoc_context I, [2024-05-17T08:28:13.087824 #921486] INFO -- : [368/885] 962817=test_nil2vtempty I, [2024-05-17T08:28:13.126042 #921486] INFO -- : [369/885] 962817=test_stream I, [2024-05-17T08:28:13.364328 #921486] INFO -- : [370/885] 962817=test_httpresponse I, [2024-05-17T08:28:13.790461 #921486] INFO -- : [371/885] 962817=test_open-uri I, [2024-05-17T08:28:13.932651 #921486] INFO -- : [372/885] 962818=test_rdoc_parser_ruby I, [2024-05-17T08:28:15.767501 #921486] INFO -- : [373/885] 962817=test_syntax I, [2024-05-17T08:28:18.411216 #921486] INFO -- : [374/885] 962818=test_gem_safe_yaml I, [2024-05-17T08:28:18.454843 #921486] INFO -- : [375/885] 962818=test_rdoc_markup_to_joined_paragraph I, [2024-05-17T08:28:18.487233 #921486] INFO -- : [376/885] 962818=test_date_time I, [2024-05-17T08:28:18.557153 #921486] INFO -- : [377/885] 962818=test_require I, [2024-05-17T08:28:18.584749 #921486] INFO -- : [378/885] 962818=index_write_test I, [2024-05-17T08:28:18.637056 #921486] INFO -- : [379/885] 962818=test_date_new I, [2024-05-17T08:28:18.715281 #921486] INFO -- : [380/885] 962818=test_data I, [2024-05-17T08:28:18.805404 #921486] INFO -- : [381/885] 962818=test_tcp I, [2024-05-17T08:28:19.241570 #921486] INFO -- : [382/885] 962818=test_iso_8859 I, [2024-05-17T08:28:19.477807 #921486] INFO -- : [383/885] 962818=test_rdoc_text I, [2024-05-17T08:28:19.709146 #921486] INFO -- : [384/885] 962818=test_gem_commands_specification_command I, [2024-05-17T08:28:20.633520 #921486] INFO -- : [385/885] 962818=test_http I, [2024-05-17T08:28:20.670634 #921486] INFO -- : [386/885] 962818=test_shift_jis I, [2024-05-17T08:28:20.754320 #921486] INFO -- : [387/885] 962818=test_gem_commands_which_command I, [2024-05-17T08:28:20.949130 #921486] INFO -- : [388/885] 962818=test_inadvertent_creation I, [2024-05-17T08:28:21.887984 #921486] INFO -- : [389/885] 962818=test_flags I, [2024-05-17T08:28:29.843455 #921486] INFO -- : [390/885] 962818=test_enumerator I, [2024-05-17T08:28:44.283585 #921486] INFO -- : [391/885] 962819=test_name_error I, [2024-05-17T08:28:45.108033 #921486] INFO -- : [392/885] 962819=test_rdoc_markup_attribute_manager I, [2024-05-17T08:28:45.374741 #921486] INFO -- : [393/885] 962819=test_gem_commands_dependency_command I, [2024-05-17T08:28:46.115627 #921486] INFO -- : [394/885] 962819=test_gem_resolver I, [2024-05-17T08:28:47.895352 #921486] INFO -- : [395/885] 962819=test_gem_resolver_composed_set I, [2024-05-17T08:28:48.022464 #921486] INFO -- : [396/885] 962819=test_safe_load I, [2024-05-17T08:28:48.213379 #921486] INFO -- : [397/885] 962819=test_gem_request I, [2024-05-17T08:28:50.972308 #921486] INFO -- : [398/885] 962819=test_method_cache I, [2024-05-17T08:28:51.075421 #921486] INFO -- : [399/885] 962819=test_sprintf_comb I, [2024-05-17T08:28:52.280816 #921486] INFO -- : [400/885] 962819=test_gem_commands_mirror I, [2024-05-17T08:28:52.376115 #921486] INFO -- : [401/885] 962819=test_gem_ext_cargo_builder_link_flag_converter I, [2024-05-17T08:28:52.765681 #921486] INFO -- : [402/885] 962819=test_enumerator_kw I, [2024-05-17T08:28:52.838855 #921486] INFO -- : [403/885] 962819=test_settracefunc I, [2024-05-17T08:29:02.223193 #921486] INFO -- : [404/885] 962819=test_gem_text I, [2024-05-17T08:29:02.968318 #921486] INFO -- : [405/885] 962819=test_generic I, [2024-05-17T08:29:03.159437 #921486] INFO -- : [406/885] 962819=test_win32ole I, [2024-05-17T08:29:03.215093 #921486] INFO -- : [407/885] 962819=test_scan_args I, [2024-05-17T08:29:03.302039 #921486] INFO -- : [408/885] 962819=test_case_options I, [2024-05-17T08:29:03.424859 #921486] INFO -- : [409/885] 962819=test_store I, [2024-05-17T08:29:04.915742 #921486] INFO -- : [410/885] 962819=test_rdoc_cross_reference I, [2024-05-17T08:29:06.134681 #921486] INFO -- : [411/885] 962817=test_gem_commands_info_command I, [2024-05-17T08:29:06.220135 #921486] INFO -- : [412/885] 962817=test_gem_dependency_installer I, [2024-05-17T08:29:08.832295 #921486] INFO -- : [413/885] 962819=test_scalar I, [2024-05-17T08:29:09.109900 #921486] INFO -- : [414/885] 962819=test_bug_reporter I, [2024-05-17T08:29:09.639460 #921486] INFO -- : [415/885] 962819=test_gem_name_tuple I, [2024-05-17T08:29:09.850053 #921486] INFO -- : [416/885] 962819=test_gem_package_tar_reader_entry I, [2024-05-17T08:29:11.365579 #921486] INFO -- : [417/885] 962819=test_rand I, [2024-05-17T08:29:14.402451 #921486] INFO -- : [418/885] 962819=test_exception I, [2024-05-17T08:29:24.795145 #921486] INFO -- : [419/885] 962817=test_rdoc_generator_ri I, [2024-05-17T08:29:25.365864 #921486] INFO -- : [420/885] 962817=test_extlibs I, [2024-05-17T08:29:33.394685 #921486] INFO -- : [421/885] 962819=test_gem_stream_ui I, [2024-05-17T08:29:34.150035 #921486] INFO -- : [422/885] 962819=test_severity I, [2024-05-17T08:29:34.279636 #921486] INFO -- : [423/885] 962819=test_ractor I, [2024-05-17T08:29:34.617222 #921486] INFO -- : [424/885] 962819=parse_test I, [2024-05-17T08:29:40.038774 #921486] INFO -- : [425/885] 962817=test_gem_install_update_options I, [2024-05-17T08:29:40.894107 #921486] INFO -- : [426/885] 962817=test_require_lib I, [2024-05-17T08:29:50.411462 #921486] INFO -- : [427/885] 962816=test_rdoc_markup_to_table_of_contents I, [2024-05-17T08:29:50.625011 #921486] INFO -- : [428/885] 962816=test_objectspace I, [2024-05-17T08:29:55.124394 #921486] INFO -- : [429/885] 962816=test_socket I, [2024-05-17T08:29:59.000869 #921486] INFO -- : [430/885] 962818=test_thread I, [2024-05-17T08:29:59.243876 #921486] INFO -- : [431/885] 962818=test_literal I, [2024-05-17T08:29:59.328824 #921486] INFO -- : [432/885] 962819=test_c_struct_builder I, [2024-05-17T08:30:00.175262 #921486] INFO -- : [433/885] 962819=test_dot_dot I, [2024-05-17T08:30:00.191132 #921486] INFO -- : [434/885] 962819=test_str2big I, [2024-05-17T08:30:00.243845 #921486] INFO -- : [435/885] 962819=test_cclass I, [2024-05-17T08:30:00.801496 #921486] INFO -- : [436/885] 962819=test_grapheme_breaks I, [2024-05-17T08:30:00.894642 #921486] INFO -- : [437/885] 962819=test_gem_version_option I, [2024-05-17T08:30:01.237059 #921486] INFO -- : [438/885] 962819=test_gem_request_connection_pools I, [2024-05-17T08:30:02.639770 #921486] INFO -- : [439/885] 962819=test_pkey I, [2024-05-17T08:30:02.901036 #921486] INFO -- : [440/885] 962819=test_case I, [2024-05-17T08:30:02.940376 #921486] INFO -- : [441/885] 962819=test_reline I, [2024-05-17T08:30:04.686562 #921486] INFO -- : [442/885] 962818=test_parser_events I, [2024-05-17T08:30:05.075177 #921486] INFO -- : [443/885] 962819=test_ansi_with_terminfo I, [2024-05-17T08:30:05.106902 #921486] INFO -- : [444/885] 962819=test_rdoc_generator_pot_po I, [2024-05-17T08:30:05.125879 #921486] INFO -- : [445/885] 962819=test_rdoc_markup_to_markdown I, [2024-05-17T08:30:05.171116 #921486] INFO -- : [446/885] 962818=test_json_tree I, [2024-05-17T08:30:05.221086 #921486] INFO -- : [447/885] 962816=test_m17n_comb I, [2024-05-17T08:30:05.241350 #921486] INFO -- : [448/885] 962818=test_memory_view I, [2024-05-17T08:30:05.574186 #921486] INFO -- : [449/885] 962819=test_ractor I, [2024-05-17T08:30:05.956140 #921486] INFO -- : [450/885] 962819=test_rdoc_attr I, [2024-05-17T08:30:06.132024 #921486] INFO -- : [451/885] 962819=test_env I, [2024-05-17T08:30:06.626627 #921486] INFO -- : [452/885] 962818=desugar_compiler_test I, [2024-05-17T08:30:06.744466 #921486] INFO -- : [453/885] 962818=test_integer I, [2024-05-17T08:30:07.105168 #921486] INFO -- : [454/885] 962818=test_dryrun I, [2024-05-17T08:30:07.363773 #921486] INFO -- : [455/885] 962818=test_gem_commands_setup_command I, [2024-05-17T08:30:09.157736 #921486] INFO -- : [456/885] 962817=test_integer I, [2024-05-17T08:30:11.285053 #921486] INFO -- : [457/885] 962818=test_cgi_modruby I, [2024-05-17T08:30:11.460988 #921486] INFO -- : [458/885] 962818=test_rubyoptions I, [2024-05-17T08:30:25.084435 #921486] INFO -- : [459/885] 962816=test_super I, [2024-05-17T08:30:27.836585 #921486] INFO -- : [460/885] 962819=test_rubygems I, [2024-05-17T08:30:28.803448 #921486] INFO -- : [461/885] 962819=test_https_proxy I, [2024-05-17T08:30:28.997613 #921486] INFO -- : [462/885] 962819=test_call I, [2024-05-17T08:30:29.973974 #921486] INFO -- : [463/885] 962816=test_capacity I, [2024-05-17T08:30:30.022291 #921486] INFO -- : [464/885] 962816=test_nextafter I, [2024-05-17T08:30:30.105388 #921486] INFO -- : [465/885] 962819=test_have_func I, [2024-05-17T08:30:31.023769 #921486] INFO -- : [466/885] 962817=test_gem_request_set_lockfile_tokenizer I, [2024-05-17T08:30:31.096239 #921486] INFO -- : [467/885] 962816=test_stat I, [2024-05-17T08:30:31.119037 #921486] INFO -- : [468/885] 962816=test_gem_resolver_git_specification I, [2024-05-17T08:30:31.466268 #921486] INFO -- : [469/885] 962817=test_usrmarshal I, [2024-05-17T08:30:32.903821 #921486] INFO -- : [470/885] 962816=test_object_references I, [2024-05-17T08:30:33.182317 #921486] INFO -- : [471/885] 962816=test_ssl I, [2024-05-17T08:30:33.997047 #921486] INFO -- : [472/885] 962817=test_ractor I, [2024-05-17T08:30:36.801596 #921486] INFO -- : [473/885] 962816=test_rendering I, [2024-05-17T08:30:36.963822 #921486] INFO -- : [474/885] 962816=test_debugger_integration I, [2024-05-17T08:30:36.986171 #921486] INFO -- : [475/885] 962817=json_ext_parser_test I, [2024-05-17T08:30:37.207907 #921486] INFO -- : [476/885] 962817=test_thread I, [2024-05-17T08:30:37.247977 #921486] INFO -- : [477/885] 962816=test_my_integer I, [2024-05-17T08:30:37.328640 #921486] INFO -- : [478/885] 962816=test_weakref I, [2024-05-17T08:30:39.456575 #921486] INFO -- : [479/885] 962816=test_nonblock I, [2024-05-17T08:30:39.765939 #921486] INFO -- : [480/885] 962816=test_unicode_normalize I, [2024-05-17T08:30:52.361052 #921486] INFO -- : [481/885] 962818=test_marshal I, [2024-05-17T08:31:01.120501 #921486] INFO -- : [482/885] 962818=test_timeout I, [2024-05-17T08:31:02.572304 #921486] INFO -- : [483/885] 962817=test_alias I, [2024-05-17T08:31:04.292210 #921486] INFO -- : [484/885] 962818=test_ancdata I, [2024-05-17T08:31:04.327580 #921486] INFO -- : [485/885] 962818=test_singleton_function I, [2024-05-17T08:31:04.382858 #921486] INFO -- : [486/885] 962818=test_reline_key I, [2024-05-17T08:31:04.447412 #921486] INFO -- : [487/885] 962818=test_rb_str_dup I, [2024-05-17T08:31:04.522202 #921486] INFO -- : [488/885] 962818=test_cgi_core I, [2024-05-17T08:31:04.665019 #921486] INFO -- : [489/885] 962818=test_parser I, [2024-05-17T08:31:04.931929 #921486] INFO -- : [490/885] 962817=test_registry I, [2024-05-17T08:31:04.956773 #921486] INFO -- : [491/885] 962818=parse_stream_test I, [2024-05-17T08:31:05.018237 #921486] INFO -- : [492/885] 962817=test_dns I, [2024-05-17T08:31:05.177075 #921486] INFO -- : [493/885] 962818=test_gem_commands_open_command I, [2024-05-17T08:31:06.480647 #921486] INFO -- : [494/885] 962818=test_ractor I, [2024-05-17T08:31:06.600589 #921486] INFO -- : [495/885] 962817=test_gem I, [2024-05-17T08:31:06.676501 #921486] INFO -- : [496/885] 962818=test_gem_source_lock I, [2024-05-17T08:31:07.202229 #921486] INFO -- : [497/885] 962818=test_rdoc_extend I, [2024-05-17T08:31:07.555554 #921486] INFO -- : [498/885] 962818=test_merge_keys I, [2024-05-17T08:31:07.712969 #921486] INFO -- : [499/885] 962818=test_gem_resolver_api_specification I, [2024-05-17T08:31:08.206406 #921486] INFO -- : [500/885] 962818=test_rdoc_markup_to_ansi I, [2024-05-17T08:31:08.695239 #921486] INFO -- : [501/885] 962818=test_mixed_unicode_escapes I, [2024-05-17T08:31:08.756403 #921486] INFO -- : [502/885] 962818=test_history I, [2024-05-17T08:31:08.921095 #921486] INFO -- : [503/885] 962818=test_ipaddr I, [2024-05-17T08:31:09.306160 #921486] INFO -- : [504/885] 962818=test_win32ole_variant I, [2024-05-17T08:31:09.382056 #921486] INFO -- : [505/885] 962818=test_io_wait_uncommon I, [2024-05-17T08:31:09.422660 #921486] INFO -- : [506/885] 962818=test_stringio I, [2024-05-17T08:31:10.778501 #921486] INFO -- : [507/885] 962818=test_arity I, [2024-05-17T08:31:10.826225 #921486] INFO -- : [508/885] 962818=test_win32ole_variable I, [2024-05-17T08:31:10.902508 #921486] INFO -- : [509/885] 962818=test_gem_ci_detector I, [2024-05-17T08:31:11.210819 #921486] INFO -- : [510/885] 962818=test_rdoc_class_module I, [2024-05-17T08:31:18.918525 #921486] INFO -- : [511/885] 962818=test_bignum I, [2024-05-17T08:31:20.385408 #921486] INFO -- : [512/885] 962818=test_time_tz I, [2024-05-17T08:31:21.310205 #921486] INFO -- : [513/885] 962818=test_win32ole_event I, [2024-05-17T08:31:21.364181 #921486] INFO -- : [514/885] 962818=test_rdoc_generator_json_index I, [2024-05-17T08:31:21.602534 #921486] INFO -- : [515/885] 962818=test_trace I, [2024-05-17T08:31:21.673924 #921486] INFO -- : [516/885] 962818=ractor_test I, [2024-05-17T08:31:22.028969 #921486] INFO -- : [517/885] 962817=test_gem_package I, [2024-05-17T08:31:22.635703 #921486] INFO -- : [518/885] 962818=test_resolve_symbol I, [2024-05-17T08:31:23.522307 #921486] INFO -- : [519/885] 962818=test_complex2 I, [2024-05-17T08:31:23.615712 #921486] INFO -- : [520/885] 962818=test_have_macro I, [2024-05-17T08:31:26.686461 #921486] INFO -- : [521/885] 962818=test_threadgroup I, [2024-05-17T08:31:27.462418 #921486] INFO -- : [522/885] 962817=test_enum I, [2024-05-17T08:31:27.990909 #921486] INFO -- : [523/885] 962818=test_gem_specification I, [2024-05-17T08:31:30.056627 #921486] INFO -- : [524/885] 962819=test_arith_seq_beg_len_step I, [2024-05-17T08:31:30.361161 #921486] INFO -- : [525/885] 962819=test_gem_resolver_requirement_list I, [2024-05-17T08:31:30.368283 #921486] INFO -- : [526/885] 962819=test_pkcs7 I, [2024-05-17T08:31:31.448252 #921486] INFO -- : [527/885] 962816=test_function_entry I, [2024-05-17T08:31:31.488269 #921486] INFO -- : [528/885] 962816=test_nofree I, [2024-05-17T08:31:31.560462 #921486] INFO -- : [529/885] 962816=test_gem_commands_pristine_command I, [2024-05-17T08:31:32.469425 #921486] INFO -- : [530/885] 962819=test_context I, [2024-05-17T08:31:33.226533 #921486] INFO -- : [531/885] 962817=test_symbol I, [2024-05-17T08:31:33.283138 #921486] INFO -- : [532/885] 962819=test_coder I, [2024-05-17T08:31:33.375523 #921486] INFO -- : [533/885] 962819=test_find_executable I, [2024-05-17T08:31:33.590151 #921486] INFO -- : [534/885] 962819=ruby_api_test I, [2024-05-17T08:31:34.533320 #921486] INFO -- : [535/885] 962819=test_lazy_enumerator I, [2024-05-17T08:31:37.594673 #921486] INFO -- : [536/885] 962819=test_enc_associate I, [2024-05-17T08:31:41.415847 #921486] INFO -- : [537/885] 962816=test_unix I, [2024-05-17T08:31:41.734762 #921486] INFO -- : [538/885] 962816=test_autoconf I, [2024-05-17T08:31:41.772483 #921486] INFO -- : [539/885] 962816=test_eval I, [2024-05-17T08:31:41.830531 #921486] INFO -- : [540/885] 962816=test_gem_console_ui I, [2024-05-17T08:31:41.961976 #921486] INFO -- : [541/885] 962816=test_date_ractor I, [2024-05-17T08:31:42.034774 #921486] INFO -- : [542/885] 962819=test_dir I, [2024-05-17T08:31:43.955986 #921486] INFO -- : [543/885] 962816=format_errors_test I, [2024-05-17T08:31:44.034945 #921486] INFO -- : [544/885] 962816=test_ractor_compatibility I, [2024-05-17T08:31:44.233687 #921486] INFO -- : [545/885] 962819=test_gem_commands_cleanup_command I, [2024-05-17T08:31:44.353449 #921486] INFO -- : [546/885] 962818=test_word I, [2024-05-17T08:31:44.410283 #921486] INFO -- : [547/885] 962818=test_cgi_multipart I, [2024-05-17T08:31:44.823802 #921486] INFO -- : [548/885] 962818=test_member I, [2024-05-17T08:31:44.884729 #921486] INFO -- : [549/885] 962818=test_numeric I, [2024-05-17T08:31:44.921208 #921486] INFO -- : [550/885] 962818=json_generic_object_test I, [2024-05-17T08:31:44.975580 #921486] INFO -- : [551/885] 962818=test_gem_source_fetch_problem I, [2024-05-17T08:31:45.022682 #921486] INFO -- : [552/885] 962818=test_http_request I, [2024-05-17T08:31:45.347759 #921486] INFO -- : [553/885] 962818=test_error_highlight I, [2024-05-17T08:31:47.413898 #921486] INFO -- : [554/885] 962816=test_resize I, [2024-05-17T08:31:47.519076 #921486] INFO -- : [555/885] 962816=test_rdoc_comment I, [2024-05-17T08:31:47.821589 #921486] INFO -- : [556/885] 962816=test_rdoc_generator_darkfish I, [2024-05-17T08:31:48.443889 #921486] INFO -- : [557/885] 962819=test_mailto I, [2024-05-17T08:31:48.494428 #921486] INFO -- : [558/885] 962819=test_symbol I, [2024-05-17T08:31:48.599908 #921486] INFO -- : [559/885] 962819=location_test I, [2024-05-17T08:31:48.957103 #921486] INFO -- : [560/885] 962819=test_coderange I, [2024-05-17T08:31:49.016516 #921486] INFO -- : [561/885] 962819=test_logger I, [2024-05-17T08:31:49.237489 #921486] INFO -- : [562/885] 962819=test_files_test I, [2024-05-17T08:31:49.857772 #921486] INFO -- : [563/885] 962819=test_gem_update_suggestion I, [2024-05-17T08:31:50.370548 #921486] INFO -- : [564/885] 962818=test_file_exhaustive I, [2024-05-17T08:31:50.401658 #921486] INFO -- : [565/885] 962819=test_rdoc_parser_markdown I, [2024-05-17T08:31:50.502983 #921486] INFO -- : [566/885] 962819=test_not I, [2024-05-17T08:31:50.571202 #921486] INFO -- : [567/885] 962819=test_gem_resolver_lock_set I, [2024-05-17T08:31:50.669851 #921486] INFO -- : [568/885] 962816=test_import I, [2024-05-17T08:31:50.714534 #921486] INFO -- : [569/885] 962819=test_gem_platform I, [2024-05-17T08:31:51.537614 #921486] INFO -- : [570/885] 962819=test_rdoc_markup_hard_break I, [2024-05-17T08:31:51.585005 #921486] INFO -- : [571/885] 962819=test_placearg I, [2024-05-17T08:31:52.114650 #921486] INFO -- : [572/885] 962819=test_date_strptime I, [2024-05-17T08:31:52.745351 #921486] INFO -- : [573/885] 962817=test_gem_package_task I, [2024-05-17T08:31:52.776597 #921486] INFO -- : [574/885] 962817=test_numhash I, [2024-05-17T08:31:52.783491 #921486] INFO -- : [575/885] 962817=test_weakkeymap I, [2024-05-17T08:31:53.404870 #921486] INFO -- : [576/885] 962819=test_gem_commands_push_command I, [2024-05-17T08:31:54.449748 #921486] INFO -- : [577/885] 962817=test_pkey_rsa I, [2024-05-17T08:31:56.097677 #921486] INFO -- : [578/885] 962819=test_keyword I, [2024-05-17T08:31:57.060148 #921486] INFO -- : [579/885] 962817=test_class_name_check I, [2024-05-17T08:31:57.517019 #921486] INFO -- : [580/885] 962817=test_continuation I, [2024-05-17T08:31:57.565205 #921486] INFO -- : [581/885] 962817=test_fd_setsize I, [2024-05-17T08:31:57.591281 #921486] INFO -- : [582/885] 962817=test_win32ole_method I, [2024-05-17T08:31:57.626496 #921486] INFO -- : [583/885] 962817=test_delete I, [2024-05-17T08:31:57.705246 #921486] INFO -- : [584/885] 962817=test_sleep I, [2024-05-17T08:32:00.308510 #921486] INFO -- : [585/885] 962816=test_gem_local_remote_options I, [2024-05-17T08:32:00.357841 #921486] INFO -- : [586/885] 962819=test_object I, [2024-05-17T08:32:00.619167 #921486] INFO -- : [587/885] 962816=test_ruby_lex I, [2024-05-17T08:32:01.631557 #921486] INFO -- : [588/885] 962816=test_date_arith I, [2024-05-17T08:32:01.727849 #921486] INFO -- : [589/885] 962816=test_ossl I, [2024-05-17T08:32:02.665440 #921486] INFO -- : [590/885] 962817=test_normalize I, [2024-05-17T08:32:02.693060 #921486] INFO -- : [591/885] 962817=test_timeout I, [2024-05-17T08:32:02.728731 #921486] INFO -- : [592/885] 962817=compiler_test I, [2024-05-17T08:32:02.799269 #921486] INFO -- : [593/885] 962817=test_flip I, [2024-05-17T08:32:02.969674 #921486] INFO -- : [594/885] 962819=test_change_word I, [2024-05-17T08:32:03.013603 #921486] INFO -- : [595/885] 962819=test_tsort I, [2024-05-17T08:32:03.034041 #921486] INFO -- : [596/885] 962819=test_signedness I, [2024-05-17T08:32:03.218286 #921486] INFO -- : [597/885] 962817=test_rdoc_rd_block_parser I, [2024-05-17T08:32:03.620071 #921486] INFO -- : [598/885] 962817=test_func I, [2024-05-17T08:32:19.083825 #921486] INFO -- : [599/885] 962817=test_big5 I, [2024-05-17T08:32:19.170327 #921486] INFO -- : [600/885] 962817=test_pointer I, [2024-05-17T08:32:19.792989 #921486] INFO -- : [601/885] 962818=test_type I, [2024-05-17T08:32:19.840405 #921486] INFO -- : [602/885] 962818=test_ractor I, [2024-05-17T08:32:20.485674 #921486] INFO -- : [603/885] 962818=version_test I, [2024-05-17T08:32:20.513715 #921486] INFO -- : [604/885] 962818=test_object I, [2024-05-17T08:32:20.541447 #921486] INFO -- : [605/885] 962818=heredoc_dedent_test I, [2024-05-17T08:32:20.695556 #921486] INFO -- : [606/885] 962818=test_cgi_header I, [2024-05-17T08:32:20.787805 #921486] INFO -- : [607/885] 962818=test_arithmetic_sequence I, [2024-05-17T08:32:20.991555 #921486] INFO -- : [608/885] 962818=test_gem_command_manager I, [2024-05-17T08:32:22.064289 #921486] INFO -- : [609/885] 962818=test_gem_gemcutter_utilities I, [2024-05-17T08:32:22.435416 #921486] INFO -- : [610/885] 962816=test_basicinstructions I, [2024-05-17T08:32:23.081861 #921486] INFO -- : [611/885] 962816=test_key_actor_emacs I, [2024-05-17T08:32:23.474076 #921486] INFO -- : [612/885] 962817=command_line_test I, [2024-05-17T08:32:23.497026 #921486] INFO -- : [613/885] 962817=test_pty I, [2024-05-17T08:32:23.575397 #921486] INFO -- : [614/885] 962818=test_dup I, [2024-05-17T08:32:24.105019 #921486] INFO -- : [615/885] 962816=test_constant I, [2024-05-17T08:32:25.380625 #921486] INFO -- : [616/885] 962818=test_project_sanity I, [2024-05-17T08:32:25.852500 #921486] INFO -- : [617/885] 962818=test_range I, [2024-05-17T08:32:26.103517 #921486] INFO -- : [618/885] 962817=test_encoding I, [2024-05-17T08:32:26.148443 #921486] INFO -- : [619/885] 962819=test_helper I, [2024-05-17T08:32:26.298118 #921486] INFO -- : [620/885] 962819=test_erb_command I, [2024-05-17T08:32:26.456882 #921486] INFO -- : [621/885] 962819=test_gem_uri_formatter I, [2024-05-17T08:32:26.580587 #921486] INFO -- : [622/885] 962819=test_addr I, [2024-05-17T08:32:26.801211 #921486] INFO -- : [623/885] 962819=test_locale I, [2024-05-17T08:32:27.000574 #921486] INFO -- : [624/885] 962819=library_symbols_test I, [2024-05-17T08:32:27.244505 #921486] INFO -- : [625/885] 962819=test_ensured I, [2024-05-17T08:32:27.666323 #921486] INFO -- : [626/885] 962819=test_ts I, [2024-05-17T08:32:27.704910 #921486] INFO -- : [627/885] 962817=test_rdoc_ri_paths I, [2024-05-17T08:32:27.889515 #921486] INFO -- : [628/885] 962817=test_tmpdir I, [2024-05-17T08:32:28.473312 #921486] INFO -- : [629/885] 962817=test_rdoc_markup_document I, [2024-05-17T08:32:28.575102 #921486] INFO -- : [630/885] 962817=test_integer_comb I, [2024-05-17T08:32:33.136041 #921486] INFO -- : [631/885] 962818=test_vm_dump I, [2024-05-17T08:32:33.193331 #921486] INFO -- : [632/885] 962818=test_regexp I, [2024-05-17T08:32:33.267931 #921486] INFO -- : [633/885] 962819=test_gem_commands_check_command I, [2024-05-17T08:32:33.529847 #921486] INFO -- : [634/885] 962819=errors_test I, [2024-05-17T08:32:34.128578 #921486] INFO -- : [635/885] 962819=static_inspect_test I, [2024-05-17T08:32:34.188355 #921486] INFO -- : [636/885] 962819=test_udp I, [2024-05-17T08:32:34.337149 #921486] INFO -- : [637/885] 962819=test_file I, [2024-05-17T08:32:40.884753 #921486] INFO -- : [638/885] 962819=test_force_exit I, [2024-05-17T08:32:40.927289 #921486] INFO -- : [639/885] 962819=test_ostruct I, [2024-05-17T08:32:41.477747 #921486] INFO -- : [640/885] 962816=unescape_test I, [2024-05-17T08:32:42.006084 #921486] INFO -- : [641/885] 962819=bom_test I, [2024-05-17T08:32:42.030500 #921486] INFO -- : [642/885] 962819=test_data_error I, [2024-05-17T08:32:42.691218 #921486] INFO -- : [643/885] 962819=test_x509name I, [2024-05-17T08:32:42.907824 #921486] INFO -- : [644/885] 962819=test_fips I, [2024-05-17T08:32:45.882244 #921486] INFO -- : [645/885] 962819=test_update I, [2024-05-17T08:32:45.928016 #921486] INFO -- : [646/885] 962819=test_x509store I, [2024-05-17T08:32:49.338821 #921486] INFO -- : [647/885] 962819=test_rdoc_code_object I, [2024-05-17T08:32:50.325414 #921486] INFO -- : [648/885] 962817=test_webauthn_listener I, [2024-05-17T08:32:50.402437 #921486] INFO -- : Leaked file descriptor: WebauthnListenerTest#test_wait_for_otp_code_get_follows_options: 11 : # I, [2024-05-17T08:32:50.466172 #921486] INFO -- : COMMAND PID USER FD TYPE DEVICE SIZE/OFF NODE NAME I, [2024-05-17T08:32:50.466421 #921486] INFO -- : ruby 962817 sipeed 11u IPv4 530879 0t0 TCP localhost:37165->localhost:46976 (CLOSE_WAIT) I, [2024-05-17T08:32:50.920996 #921486] INFO -- : [649/885] 962817=test_jaro_winkler I, [2024-05-17T08:32:50.924621 #921486] INFO -- : [650/885] 962817=test_helper I, [2024-05-17T08:32:50.925889 #921486] INFO -- : [651/885] 962817=test_random_formatter I, [2024-05-17T08:32:50.961201 #921486] INFO -- : [652/885] 962817=test_lambda I, [2024-05-17T08:32:51.505788 #921486] INFO -- : [653/885] 962817=test_gem_request_set_gem_dependency_api I, [2024-05-17T08:32:51.866491 #921486] INFO -- : Closed file descriptor: TestGemRequestSetGemDependencyAPI#test_ruby_mismatch: 11 I, [2024-05-17T08:32:52.778979 #921486] INFO -- : [654/885] 962819=test_ast I, [2024-05-17T08:32:53.119047 #921486] INFO -- : [655/885] 962817=test_gem_resolver_api_set I, [2024-05-17T08:32:53.627026 #921486] INFO -- : [656/885] 962817=test_gem_safe_marshal I, [2024-05-17T08:32:58.019564 #921486] INFO -- : [657/885] 962817=test_enumerable I, [2024-05-17T08:32:58.076063 #921486] INFO -- : [658/885] 962817=test_gem_resolver_vendor_set I, [2024-05-17T08:32:58.427789 #921486] INFO -- : [659/885] 962817=test_config I, [2024-05-17T08:32:59.407705 #921486] INFO -- : [660/885] 962816=json_generator_test I, [2024-05-17T08:33:00.259236 #921486] INFO -- : [661/885] 962816=test_eval I, [2024-05-17T08:33:02.188354 #921486] INFO -- : [662/885] 962817=test_transcode I, [2024-05-17T08:33:02.295002 #921486] INFO -- : [663/885] 962816=test_rdoc_markup_heading I, [2024-05-17T08:33:02.681150 #921486] INFO -- : [664/885] 962816=test_iseq I, [2024-05-17T08:33:03.745731 #921486] INFO -- : [665/885] 962817=test_exception_at_throwing I, [2024-05-17T08:33:04.321188 #921486] INFO -- : [666/885] 962817=test_scheduler I, [2024-05-17T08:33:04.782514 #921486] INFO -- : [667/885] 962817=test_pkey_dsa I, [2024-05-17T08:33:07.570757 #921486] INFO -- : [668/885] 962816=test_class I, [2024-05-17T08:33:07.627493 #921486] INFO -- : [669/885] 962816=test_ocsp I, [2024-05-17T08:33:11.072218 #921486] INFO -- : [670/885] 962816=test_case_comprehensive I, [2024-05-17T08:33:11.191148 #921486] INFO -- : [671/885] 962817=test_interned_str I, [2024-05-17T08:33:11.216311 #921486] INFO -- : [672/885] 962817=test_gem_commands_build_command I, [2024-05-17T08:33:13.482772 #921486] INFO -- : [673/885] 962817=test_tracer I, [2024-05-17T08:33:13.490399 #921486] INFO -- : [674/885] 962817=test_cmethod I, [2024-05-17T08:33:14.125966 #921486] INFO -- : [675/885] 962817=test_option I, [2024-05-17T08:33:14.642276 #921486] INFO -- : [676/885] 962817=test_append I, [2024-05-17T08:33:14.699555 #921486] INFO -- : [677/885] 962817=test_gem_commands_server_command I, [2024-05-17T08:33:14.732309 #921486] INFO -- : [678/885] 962817=test_did_you_mean I, [2024-05-17T08:33:15.231460 #921486] INFO -- : [679/885] 962817=test_variable_name_check I, [2024-05-17T08:33:15.837640 #921486] INFO -- : [680/885] 962817=test_io_m17n I, [2024-05-17T08:33:25.446378 #921486] INFO -- : [681/885] 962817=test_exit I, [2024-05-17T08:33:26.049793 #921486] INFO -- : [682/885] 962817=test_recursion I, [2024-05-17T08:33:26.073280 #921486] INFO -- : [683/885] 962817=test_date_marshal I, [2024-05-17T08:33:26.096517 #921486] INFO -- : [684/885] 962817=test_mkmf I, [2024-05-17T08:33:26.306064 #921486] INFO -- : [685/885] 962817=test_history I, [2024-05-17T08:33:26.890357 #921486] INFO -- : [686/885] 962817=test_popen_deadlock I, [2024-05-17T08:33:31.225966 #921486] INFO -- : [687/885] 962817=test_delegate I, [2024-05-17T08:33:31.579274 #921486] INFO -- : [688/885] 962817=test_bundled_ca I, [2024-05-17T08:33:32.656491 #921486] INFO -- : [689/885] 962817=test_closure I, [2024-05-17T08:33:36.061124 #921486] INFO -- : [690/885] 962817=test_open3 I, [2024-05-17T08:33:57.737768 #921486] INFO -- : [691/885] 962817=test_fiber I, [2024-05-17T08:34:11.951285 #921486] INFO -- : [692/885] 962817=test_multi_irb_commands I, [2024-05-17T08:34:12.063090 #921486] INFO -- : [693/885] 962817=test_gem_security I, [2024-05-17T08:34:36.036216 #921486] INFO -- : [694/885] 962818=test_rdoc_servlet I, [2024-05-17T08:34:37.300630 #921486] INFO -- : [695/885] 962818=test_ractor I, [2024-05-17T08:34:37.325759 #921486] INFO -- : [696/885] 962818=test_digest I, [2024-05-17T08:34:37.392960 #921486] INFO -- : [697/885] 962818=test_rdoc_markup_to_bs I, [2024-05-17T08:34:37.660393 #921486] INFO -- : [698/885] 962818=test_help I, [2024-05-17T08:34:37.729104 #921486] INFO -- : [699/885] 962818=test_beginendblock I, [2024-05-17T08:34:40.288037 #921486] INFO -- : [700/885] 962818=test_gem_commands_unpack_command I, [2024-05-17T08:34:42.500214 #921486] INFO -- : [701/885] 962818=test_files_lib I, [2024-05-17T08:34:42.530459 #921486] INFO -- : [702/885] 962818=reflection_test I, [2024-05-17T08:34:42.569569 #921486] INFO -- : [703/885] 962818=test_within_pipe I, [2024-05-17T08:34:42.764605 #921486] INFO -- : [704/885] 962818=test_gem_bundler_version_finder I, [2024-05-17T08:34:42.958889 #921486] INFO -- : [705/885] 962818=test_emoji_breaks I, [2024-05-17T08:34:43.176631 #921486] INFO -- : [706/885] 962818=test_pinned I, [2024-05-17T08:34:43.350096 #921486] INFO -- : [707/885] 962818=test_stream I, [2024-05-17T08:34:43.392594 #921486] INFO -- : [708/885] 962818=test_webauthn_listener_response I, [2024-05-17T08:34:43.572663 #921486] INFO -- : [709/885] 962818=test_time I, [2024-05-17T08:34:45.161643 #921486] INFO -- : [710/885] 962818=test_to_ary_concat I, [2024-05-17T08:34:56.989659 #921486] INFO -- : [711/885] 962818=test_rdoc_markup_pre_process I, [2024-05-17T08:34:57.565522 #921486] INFO -- : [712/885] 962818=test_printf I, [2024-05-17T08:34:57.686608 #921486] INFO -- : [713/885] 962818=test_rdoc_markup_to_label I, [2024-05-17T08:34:58.292819 #921486] INFO -- : [714/885] 962818=test_install I, [2024-05-17T08:34:59.395933 #921486] INFO -- : [715/885] 962818=test_sockopt I, [2024-05-17T08:34:59.444644 #921486] INFO -- : [716/885] 962818=test_encoding I, [2024-05-17T08:34:59.517298 #921486] INFO -- : [717/885] 962818=test_httpresponses I, [2024-05-17T08:34:59.542692 #921486] INFO -- : [718/885] 962818=test_set_len I, [2024-05-17T08:34:59.672965 #921486] INFO -- : [719/885] 962818=test_rdoc_ri_driver I, [2024-05-17T08:35:01.772467 #921486] INFO -- : [720/885] 962818=test_gem_resolver_local_specification I, [2024-05-17T08:35:01.868543 #921486] INFO -- : [721/885] 962818=test_httpheader I, [2024-05-17T08:35:01.928010 #921486] INFO -- : [722/885] 962818=test_color I, [2024-05-17T08:35:02.398274 #921486] INFO -- : [723/885] 962818=json_encoding_test I, [2024-05-17T08:35:02.448772 #921486] INFO -- : [724/885] 962818=test_key_stroke I, [2024-05-17T08:35:02.481205 #921486] INFO -- : [725/885] 962818=test_rbconfig I, [2024-05-17T08:35:02.552534 #921486] INFO -- : [726/885] 962818=test_human_typo I, [2024-05-17T08:35:02.581429 #921486] INFO -- : [727/885] 962818=test_primitive I, [2024-05-17T08:35:02.634957 #921486] INFO -- : [728/885] 962818=test_rdoc_i18n_locale I, [2024-05-17T08:35:02.709138 #921486] INFO -- : [729/885] 962818=test_name_error_extension I, [2024-05-17T08:35:02.740218 #921486] INFO -- : [730/885] 962818=test_chilled I, [2024-05-17T08:35:02.812351 #921486] INFO -- : [731/885] 962818=test_gem_commands_yank_command I, [2024-05-17T08:35:03.699559 #921486] INFO -- : [732/885] 962818=test_win32ole_param I, [2024-05-17T08:35:03.727041 #921486] INFO -- : [733/885] 962818=test_pair I, [2024-05-17T08:35:27.686515 #921486] INFO -- : [734/885] 962818=test_rdoc_generator_pot_po_entry I, [2024-05-17T08:35:27.735726 #921486] INFO -- : [735/885] 962818=test_euc_jp I, [2024-05-17T08:35:27.778097 #921486] INFO -- : [736/885] 962818=test_acceptable I, [2024-05-17T08:35:28.776597 #921486] INFO -- : [737/885] 962818=test_document I, [2024-05-17T08:35:28.817325 #921486] INFO -- : [738/885] 962818=test_unicode I, [2024-05-17T08:35:28.849475 #921486] INFO -- : [739/885] 962818=parameters_signature_test I, [2024-05-17T08:35:28.926272 #921486] INFO -- : [740/885] 962818=test_koi8 I, [2024-05-17T08:35:28.954759 #921486] INFO -- : [741/885] 962818=test_enumerator I, [2024-05-17T08:35:28.984773 #921486] INFO -- : [742/885] 962818=test_rdoc_parser_changelog I, [2024-05-17T08:35:29.409884 #921486] INFO -- : [743/885] 962818=test_rdoc_generator_pot I, [2024-05-17T08:35:29.467175 #921486] INFO -- : [744/885] 962818=test_data I, [2024-05-17T08:35:29.506061 #921486] INFO -- : [745/885] 962818=static_literals_test I, [2024-05-17T08:35:29.590314 #921486] INFO -- : [746/885] 962818=test_gem_gem_runner I, [2024-05-17T08:35:29.858159 #921486] INFO -- : [747/885] 962818=test_filter I, [2024-05-17T08:35:30.015404 #921486] INFO -- : [748/885] 962818=test_rdoc_method_attr I, [2024-05-17T08:35:30.868895 #921486] INFO -- : [749/885] 962818=test_random I, [2024-05-17T08:35:30.940504 #921486] INFO -- : [750/885] 962818=test_notimplement I, [2024-05-17T08:35:30.957106 #921486] INFO -- : [751/885] 962818=test_key_event_record I, [2024-05-17T08:35:30.994488 #921486] INFO -- : [752/885] 962818=test_gem_uri I, [2024-05-17T08:35:31.355292 #921486] INFO -- : [753/885] 962818=test_gem_commands_update_command I, [2024-05-17T08:35:33.339418 #921486] INFO -- : [754/885] 962817=test_gem_resolver_vendor_specification I, [2024-05-17T08:35:33.510688 #921486] INFO -- : [755/885] 962817=test_thread_cv I, [2024-05-17T08:35:34.258661 #921486] INFO -- : [756/885] 962817=test_lexer I, [2024-05-17T08:35:34.390099 #921486] INFO -- : [757/885] 962817=test_ssl_session I, [2024-05-17T08:35:38.919316 #921486] INFO -- : [758/885] 962818=test_compile_prism I, [2024-05-17T08:35:39.267190 #921486] INFO -- : [759/885] 962817=test_terminfo I, [2024-05-17T08:35:39.329452 #921486] INFO -- : [760/885] 962817=test_rdoc_markup_to_html I, [2024-05-17T08:35:40.216616 #921486] INFO -- : [761/885] 962817=test_date_compat I, [2024-05-17T08:35:40.281378 #921486] INFO -- : [762/885] 962817=test_bug-14834 I, [2024-05-17T08:35:40.916428 #921486] INFO -- : [763/885] 962817=test_http I, [2024-05-17T08:35:41.497545 #921486] INFO -- : [764/885] 962818=test_addrinfo I, [2024-05-17T08:35:41.801981 #921486] INFO -- : [765/885] 962818=test_tree_spell_checker I, [2024-05-17T08:35:42.217778 #921486] INFO -- : [766/885] 962818=test_case_mapping I, [2024-05-17T08:35:42.481450 #921486] INFO -- : [767/885] 962818=redundant_return_test I, [2024-05-17T08:35:42.530539 #921486] INFO -- : [768/885] 962818=test_path I, [2024-05-17T08:35:42.605151 #921486] INFO -- : [769/885] 962818=test_win32ole_param_event I, [2024-05-17T08:35:42.673273 #921486] INFO -- : [770/885] 962818=test_bn I, [2024-05-17T08:35:42.758179 #921486] INFO -- : [771/885] 962818=test_whileuntil I, [2024-05-17T08:35:42.787163 #921486] INFO -- : [772/885] 962818=test_rdoc_generator_markup I, [2024-05-17T08:35:42.836608 #921486] INFO -- : [773/885] 962818=test_rubyvm I, [2024-05-17T08:35:42.876797 #921486] INFO -- : [774/885] 962818=test_configuration I, [2024-05-17T08:35:43.605301 #921486] INFO -- : [775/885] 962818=test_buffered_io I, [2024-05-17T08:35:43.645887 #921486] INFO -- : [776/885] 962818=test_monitor I, [2024-05-17T08:35:43.978685 #921486] INFO -- : [777/885] 962818=test_instrumentation_api I, [2024-05-17T08:35:48.043329 #921486] INFO -- : [778/885] 962818=integer_parse_test I, [2024-05-17T08:35:48.128890 #921486] INFO -- : [779/885] 962818=test_stringify_symbols I, [2024-05-17T08:35:48.236296 #921486] INFO -- : [780/885] 962818=test_boolean I, [2024-05-17T08:35:48.467645 #921486] INFO -- : [781/885] 962818=test_module I, [2024-05-17T08:35:58.293940 #921486] INFO -- : [782/885] 962817=test_gem_request_set I, [2024-05-17T08:36:00.569720 #921486] INFO -- : [783/885] 962817=constant_path_node_test I, [2024-05-17T08:36:00.637404 #921486] INFO -- : [784/885] 962817=test_gem_ext_cargo_builder I, [2024-05-17T08:36:00.935501 #921486] INFO -- : [785/885] 962817=test_ssl I, [2024-05-17T08:36:07.205788 #921486] INFO -- : [786/885] 962818=test_arith_seq_extract I, [2024-05-17T08:36:08.448229 #921486] INFO -- : [787/885] 962818=test_method_name_check I, [2024-05-17T08:36:08.865962 #921486] INFO -- : [788/885] 962818=test_parser I, [2024-05-17T08:36:09.007991 #921486] INFO -- : [789/885] 962818=test_yield_block I, [2024-05-17T08:36:09.038437 #921486] INFO -- : [790/885] 962818=test_len I, [2024-05-17T08:36:09.045962 #921486] INFO -- : [791/885] 962818=test_completion I, [2024-05-17T08:36:14.504390 #921486] INFO -- : [792/885] 962818=test_gem_commands_cert_command I, [2024-05-17T08:36:40.908187 #921486] INFO -- : [793/885] 962818=test_gem_source_installed I, [2024-05-17T08:36:40.934802 #921486] INFO -- : [794/885] 962818=test_x509ext I, [2024-05-17T08:36:40.993314 #921486] INFO -- : [795/885] 962818=test_erb I, [2024-05-17T08:36:41.490336 #921486] INFO -- : [796/885] 962818=test_spell_checker I, [2024-05-17T08:36:41.510958 #921486] INFO -- : [797/885] 962818=test_propertyputref I, [2024-05-17T08:36:41.572654 #921486] INFO -- : [798/885] 962818=attribute_write_test I, [2024-05-17T08:36:41.605129 #921486] INFO -- : [799/885] 962818=test_assembler I, [2024-05-17T08:36:41.619246 #921486] INFO -- : [800/885] 962818=test_rational I, [2024-05-17T08:36:41.808163 #921486] INFO -- : [801/885] 962818=test_rational2 I, [2024-05-17T08:36:41.937239 #921486] INFO -- : [802/885] 962818=test_scalar_scanner I, [2024-05-17T08:36:42.064988 #921486] INFO -- : [803/885] 962818=test_gem_source I, [2024-05-17T08:36:43.754563 #921486] INFO -- : [804/885] 962816=test_gem_package_tar_writer I, [2024-05-17T08:36:44.072504 #921486] INFO -- : [805/885] 962818=test_helper_method I, [2024-05-17T08:36:44.154401 #921486] INFO -- : [806/885] 962818=test_array I, [2024-05-17T08:36:44.677136 #921486] INFO -- : [807/885] 962816=test_gem_commands_outdated_command I, [2024-05-17T08:36:44.979084 #921486] INFO -- : [808/885] 962816=test_benchmark I, [2024-05-17T08:36:48.235378 #921486] INFO -- : [809/885] 962816=test_gem_dependency_list I, [2024-05-17T08:36:48.773991 #921486] INFO -- : [810/885] 962816=test_nesting_parser I, [2024-05-17T08:36:48.889224 #921486] INFO -- : [811/885] 962816=test_win32ole_method_event I, [2024-05-17T08:36:49.160085 #921486] INFO -- : [812/885] 962816=test_gem_ext_builder I, [2024-05-17T08:36:52.324171 #921486] INFO -- : [813/885] 962817=test_https I, [2024-05-17T08:36:53.182638 #921486] INFO -- : [814/885] 962817=test_evaluation I, [2024-05-17T08:36:53.218852 #921486] INFO -- : [815/885] 962817=test_provider I, [2024-05-17T08:36:57.478605 #921486] INFO -- : [816/885] 962817=test_abi I, [2024-05-17T08:36:57.658254 #921486] INFO -- : [817/885] 962816=test_gem_commands_rebuild_command I, [2024-05-17T08:36:57.893535 #921486] INFO -- : [818/885] 962816=test_yamldbm I, [2024-05-17T08:36:57.902800 #921486] INFO -- : [819/885] 962816=test_load I, [2024-05-17T08:36:57.940912 #921486] INFO -- : [820/885] 962816=test_rdoc_parser_simple I, [2024-05-17T08:36:58.138527 #921486] INFO -- : [821/885] 962816=test_memory_view I, [2024-05-17T08:36:58.270526 #921486] INFO -- : [822/885] 962816=pattern_test I, [2024-05-17T08:36:58.652852 #921486] INFO -- : [823/885] 962816=test_debug I, [2024-05-17T08:36:58.681900 #921486] INFO -- : [824/885] 962817=test_shellwords I, [2024-05-17T08:36:58.723824 #921486] INFO -- : [825/885] 962817=test_digest_extend I, [2024-05-17T08:36:58.760354 #921486] INFO -- : [826/885] 962816=test_omap I, [2024-05-17T08:36:58.796904 #921486] INFO -- : [827/885] 962816=test_string I, [2024-05-17T08:36:58.803762 #921486] INFO -- : [828/885] 962816=test_iterator I, [2024-05-17T08:36:58.840472 #921486] INFO -- : [829/885] 962817=test_storage I, [2024-05-17T08:36:58.860764 #921486] INFO -- : [830/885] 962817=test_gem_resolver_git_set I, [2024-05-17T08:36:59.475298 #921486] INFO -- : [831/885] 962816=test_new I, [2024-05-17T08:36:59.686087 #921486] INFO -- : [832/885] 962816=test_gem_security_signer I, [2024-05-17T08:37:00.328480 #921486] INFO -- : [833/885] 962816=test_cipher I, [2024-05-17T08:37:00.785676 #921486] INFO -- : [834/885] 962816=test_gem_source_git I, [2024-05-17T08:37:01.076279 #921486] INFO -- : [835/885] 962817=test_refinement I, [2024-05-17T08:37:04.881594 #921486] INFO -- : [836/885] 962816=test_gem_commands_signout_command I, [2024-05-17T08:37:05.028339 #921486] INFO -- : [837/885] 962816=test_regex_casefold I, [2024-05-17T08:37:09.213318 #921486] INFO -- : [838/885] 962816=test_gem_resolver_installer_set I, [2024-05-17T08:37:10.737783 #921486] INFO -- : [839/885] 962816=test_dir_m17n I, [2024-05-17T08:37:21.703117 #921486] INFO -- : [840/885] 962816=test_cgi_cookie I, [2024-05-17T08:37:21.970351 #921486] INFO -- : [841/885] 962816=test_require I, [2024-05-17T08:37:26.352331 #921486] INFO -- : [842/885] 962817=test_float I, [2024-05-17T08:37:31.677165 #921486] INFO -- : [843/885] 962817=test_process I, [2024-05-17T08:37:31.741689 #921486] INFO -- : [844/885] 962817=test_windows_1252 I, [2024-05-17T08:37:31.789008 #921486] INFO -- : [845/885] 962817=test_input_method I, [2024-05-17T08:37:32.108098 #921486] INFO -- : [846/885] 962817=test_metaclass I, [2024-05-17T08:37:32.188676 #921486] INFO -- : [847/885] 962817=test_rdoc_top_level I, [2024-05-17T08:37:34.832384 #921486] INFO -- : [848/885] 962817=test_cgi_session I, [2024-05-17T08:37:34.895091 #921486] INFO -- : [849/885] 962817=test_rdoc_rd I, [2024-05-17T08:37:35.036172 #921486] INFO -- : [850/885] 962817=test_x509crl I, [2024-05-17T08:37:36.735197 #921486] INFO -- : [851/885] 962817=test_signal I, [2024-05-17T08:37:41.986796 #921486] INFO -- : [852/885] 962816=test_fixnum I, [2024-05-17T08:37:42.088783 #921486] INFO -- : [853/885] 962816=test_serialize_subclasses I, [2024-05-17T08:37:42.141467 #921486] INFO -- : [854/885] 962816=test_insns_leaf I, [2024-05-17T08:37:42.187903 #921486] INFO -- : [855/885] 962816=test_color_printer I, [2024-05-17T08:37:42.219550 #921486] INFO -- : [856/885] 962816=test_deprecated I, [2024-05-17T08:37:42.249802 #921486] INFO -- : [857/885] 962816=test_win32ole_variant_m I, [2024-05-17T08:37:42.251587 #921486] INFO -- : [858/885] 962816=test_engine I, [2024-05-17T08:37:42.708935 #921486] INFO -- : [859/885] 962816=test_allocation I, [2024-05-17T08:37:42.728591 #921486] INFO -- : [860/885] 962817=test_div I, [2024-05-17T08:37:42.763188 #921486] INFO -- : [861/885] 962817=test_key_error I, [2024-05-17T08:37:42.850021 #921486] INFO -- : [862/885] 962817=test_x509req I, [2024-05-17T08:37:44.708322 #921486] INFO -- : [863/885] 962817=test_mutex I, [2024-05-17T08:37:45.969040 #921486] INFO -- : [864/885] 962817=test_rdoc_rd_inline I, [2024-05-17T08:37:46.089475 #921486] INFO -- : [865/885] 962817=test_files_test_1 I, [2024-05-17T08:37:46.188226 #921486] INFO -- : [866/885] 962818=test_gem_path_support I, [2024-05-17T08:37:46.398179 #921486] INFO -- : [867/885] 962818=test_struct I, [2024-05-17T08:37:52.878159 #921486] INFO -- : [868/885] 962818=test_set I, [2024-05-17T08:37:53.080910 #921486] INFO -- : [869/885] 962818=memsize_test I, [2024-05-17T08:37:53.110279 #921486] INFO -- : [870/885] 962818=test_nomethod_error I, [2024-05-17T08:37:53.165239 #921486] INFO -- : [871/885] 962818=json_parser_test I, [2024-05-17T08:37:53.504480 #921486] INFO -- : [872/885] 962818=test_config I, [2024-05-17T08:37:54.041148 #921486] INFO -- : [873/885] 962818=test_win32ole_variant_outarg I, [2024-05-17T08:37:54.072441 #921486] INFO -- : [874/885] 962818=json_common_interface_test I, [2024-05-17T08:37:54.163858 #921486] INFO -- : [875/885] 962818=test_dln I, [2024-05-17T08:37:54.385072 #921486] INFO -- : [876/885] 962818=test_gem_source_subpath_problem I, [2024-05-17T08:37:55.025394 #921486] INFO -- : [877/885] 962818=test_rdoc_markup_to_html_snippet I, [2024-05-17T08:37:55.499823 #921486] INFO -- : [878/885] 962818=magic_comment_test I, [2024-05-17T08:37:55.539362 #921486] INFO -- : [879/885] 962818=test_struct I, [2024-05-17T08:37:55.616564 #921486] INFO -- : [880/885] 962818=test_variable I, [2024-05-17T08:37:56.391471 #921486] INFO -- : [881/885] 962818=test_sexp I, [2024-05-17T08:37:56.672525 #921486] INFO -- : [882/885] 962818=test_rdoc_markup_include I, [2024-05-17T08:37:56.703093 #921486] INFO -- : [883/885] 962818=fuzzer_test I, [2024-05-17T08:37:56.854569 #921486] INFO -- : [884/885] 962818=test_pkg_config I, [2024-05-17T08:37:57.122609 #921486] INFO -- : [885/885] 962818=test_cparser I, [2024-05-17T08:39:10.220626 #921486] INFO -- : Finished tests in 906.983041s, 29.0193 tests/s, 10304.4981 assertions/s. I, [2024-05-17T08:39:10.227402 #921486] INFO -- : 26320 tests, 9346005 assertions, 0 failures, 0 errors, 324 skips I, [2024-05-17T08:39:10.227992 #921486] INFO -- : I, [2024-05-17T08:39:10.228250 #921486] INFO -- : ruby -v: ruby 3.4.0dev (2024-05-17T02:50:59Z master 534f1c37e3) [riscv64-linux] I, [2024-05-17T08:39:10.245924 #921486] INFO -- : $$$[end] "make yes-test-all TESTOPTS='--stderr-on-failure' TESTS='-j4'" exit with 0. I, [2024-05-17T08:39:10.246655 #921486] INFO -- : $$$[beg] make yes-test-rubyspec MSPECOPT='--error-output stderr --debug -j' TESTS='-j4' I, [2024-05-17T08:39:11.075140 #921486] INFO -- : BASERUBY = /usr/bin/ruby --disable=gems I, [2024-05-17T08:39:11.075347 #921486] INFO -- : CC = gcc I, [2024-05-17T08:39:11.075448 #921486] INFO -- : LD = ld I, [2024-05-17T08:39:11.075549 #921486] INFO -- : LDSHARED = gcc -shared I, [2024-05-17T08:39:11.075662 #921486] INFO -- : CFLAGS = -O3 -fno-fast-math -ggdb3 -Wall -Wextra -Wdeprecated-declarations -Wdiv-by-zero -Wduplicated-cond -Wimplicit-function-declaration -Wimplicit-int -Wpointer-arith -Wwrite-strings -Wold-style-definition -Wimplicit-fallthrough=0 -Wmissing-noreturn -Wno-cast-function-type -Wno-constant-logical-operand -Wno-long-long -Wno-missing-field-initializers -Wno-overlength-strings -Wno-packed-bitfield-compat -Wno-parentheses-equality -Wno-self-assign -Wno-tautological-compare -Wno-unused-parameter -Wno-unused-value -Wsuggest-attribute=format -Wsuggest-attribute=noreturn -Wunused-variable -Wmisleading-indentation -Wundef -fPIC I, [2024-05-17T08:39:11.075849 #921486] INFO -- : XCFLAGS = -U_FORTIFY_SOURCE -D_FORTIFY_SOURCE=2 -fstack-protector-strong -fno-strict-overflow -fvisibility=hidden -fexcess-precision=standard -DRUBY_EXPORT -I. -I.ext/include/riscv64-linux -I/tmp/ruby/src/trunk/include -I/tmp/ruby/src/trunk -I/tmp/ruby/src/trunk/prism -I/tmp/ruby/src/trunk/enc/unicode/15.0.0 I, [2024-05-17T08:39:11.076003 #921486] INFO -- : CPPFLAGS = I, [2024-05-17T08:39:11.076199 #921486] INFO -- : DLDFLAGS = -Wl,--compress-debug-sections=zlib -Wl,-soname,libruby.so.3.4 -fstack-protector-strong I, [2024-05-17T08:39:11.076325 #921486] INFO -- : SOLIBS = -lz -lrt -lrt -lgmp -ldl -lcrypt -lm -lpthread I, [2024-05-17T08:39:11.076419 #921486] INFO -- : LANG = I, [2024-05-17T08:39:11.076517 #921486] INFO -- : LC_ALL = I, [2024-05-17T08:39:11.076611 #921486] INFO -- : LC_CTYPE = I, [2024-05-17T08:39:11.076696 #921486] INFO -- : MFLAGS = I, [2024-05-17T08:39:11.076778 #921486] INFO -- : RUSTC = rustc I, [2024-05-17T08:39:11.076863 #921486] INFO -- : YJIT_RUSTC_ARGS = --crate-name=yjit --crate-type=staticlib --edition=2021 -g -C lto=thin -C opt-level=3 -C overflow-checks=on '--out-dir=/tmp/ruby/build/trunk/yjit/target/release/' /tmp/ruby/src/trunk/yjit/src/lib.rs I, [2024-05-17T08:39:11.078460 #921486] INFO -- : gcc (Debian 13.2.0-4revyos1) 13.2.0 I, [2024-05-17T08:39:11.078625 #921486] INFO -- : Copyright (C) 2023 Free Software Foundation, Inc. I, [2024-05-17T08:39:11.078720 #921486] INFO -- : This is free software; see the source for copying conditions. There is NO I, [2024-05-17T08:39:11.078810 #921486] INFO -- : warranty; not even for MERCHANTABILITY or FITNESS FOR A PARTICULAR PURPOSE. I, [2024-05-17T08:39:11.078903 #921486] INFO -- : I, [2024-05-17T08:39:11.095333 #921486] INFO -- : generating enc.mk I, [2024-05-17T08:39:12.559919 #921486] INFO -- : making enc I, [2024-05-17T08:39:12.732391 #921486] INFO -- : make[1]: Entering directory '/tmp/ruby/build/trunk' I, [2024-05-17T08:39:12.732601 #921486] INFO -- : make[1]: Nothing to be done for 'enc'. I, [2024-05-17T08:39:12.732707 #921486] INFO -- : make[1]: Leaving directory '/tmp/ruby/build/trunk' I, [2024-05-17T08:39:12.735244 #921486] INFO -- : making srcs under enc I, [2024-05-17T08:39:13.033089 #921486] INFO -- : make[1]: Entering directory '/tmp/ruby/build/trunk' I, [2024-05-17T08:39:13.033287 #921486] INFO -- : make[1]: Nothing to be done for 'srcs'. I, [2024-05-17T08:39:13.033386 #921486] INFO -- : make[1]: Leaving directory '/tmp/ruby/build/trunk' I, [2024-05-17T08:39:13.038259 #921486] INFO -- : generating transdb.h I, [2024-05-17T08:39:14.275827 #921486] INFO -- : transdb.h unchanged I, [2024-05-17T08:39:14.281490 #921486] INFO -- : making trans I, [2024-05-17T08:39:14.627438 #921486] INFO -- : make[1]: Entering directory '/tmp/ruby/build/trunk' I, [2024-05-17T08:39:14.627639 #921486] INFO -- : make[1]: Nothing to be done for 'trans'. I, [2024-05-17T08:39:14.627787 #921486] INFO -- : make[1]: Leaving directory '/tmp/ruby/build/trunk' I, [2024-05-17T08:39:14.630394 #921486] INFO -- : making encs I, [2024-05-17T08:39:15.023564 #921486] INFO -- : make[1]: Entering directory '/tmp/ruby/build/trunk' I, [2024-05-17T08:39:15.023831 #921486] INFO -- : make[1]: Nothing to be done for 'encs'. I, [2024-05-17T08:39:15.023935 #921486] INFO -- : make[1]: Leaving directory '/tmp/ruby/build/trunk' I, [2024-05-17T08:39:15.037377 #921486] INFO -- : generating makefiles ext/configure-ext.mk I, [2024-05-17T08:39:15.241622 #921486] INFO -- : ext/configure-ext.mk updated I, [2024-05-17T08:39:15.255479 #921486] INFO -- : make[1]: Entering directory '/tmp/ruby/build/trunk' I, [2024-05-17T08:39:27.221760 #921486] INFO -- : make[1]: Leaving directory '/tmp/ruby/build/trunk' I, [2024-05-17T08:39:27.223387 #921486] INFO -- : generating makefile exts.mk I, [2024-05-17T08:39:27.559057 #921486] INFO -- : exts.mk unchanged I, [2024-05-17T08:39:27.595398 #921486] INFO -- : make[1]: Entering directory '/tmp/ruby/build/trunk' I, [2024-05-17T08:39:29.842838 #921486] INFO -- : make[2]: Entering directory '/tmp/ruby/build/trunk/ext/coverage' I, [2024-05-17T08:39:29.868142 #921486] INFO -- : make[2]: Leaving directory '/tmp/ruby/build/trunk/ext/coverage' I, [2024-05-17T08:39:29.918090 #921486] INFO -- : make[2]: Entering directory '/tmp/ruby/build/trunk/ext/date' I, [2024-05-17T08:39:29.946391 #921486] INFO -- : make[2]: Leaving directory '/tmp/ruby/build/trunk/ext/date' I, [2024-05-17T08:39:29.970750 #921486] INFO -- : make[2]: Entering directory '/tmp/ruby/build/trunk/ext/digest' I, [2024-05-17T08:39:30.026995 #921486] INFO -- : make[2]: Leaving directory '/tmp/ruby/build/trunk/ext/digest' I, [2024-05-17T08:39:30.191442 #921486] INFO -- : make[2]: Entering directory '/tmp/ruby/build/trunk/ext/digest/sha2' I, [2024-05-17T08:39:30.218614 #921486] INFO -- : make[2]: Leaving directory '/tmp/ruby/build/trunk/ext/digest/sha2' I, [2024-05-17T08:39:30.351979 #921486] INFO -- : make[2]: Entering directory '/tmp/ruby/build/trunk/ext/fiddle' I, [2024-05-17T08:39:30.418970 #921486] INFO -- : make[2]: Leaving directory '/tmp/ruby/build/trunk/ext/fiddle' I, [2024-05-17T08:39:30.452432 #921486] INFO -- : make[2]: Entering directory '/tmp/ruby/build/trunk/ext/io/console' I, [2024-05-17T08:39:30.473209 #921486] INFO -- : make[2]: Leaving directory '/tmp/ruby/build/trunk/ext/io/console' I, [2024-05-17T08:39:30.548110 #921486] INFO -- : make[2]: Entering directory '/tmp/ruby/build/trunk/ext/json' I, [2024-05-17T08:39:30.636608 #921486] INFO -- : make[2]: Leaving directory '/tmp/ruby/build/trunk/ext/json' I, [2024-05-17T08:39:30.735290 #921486] INFO -- : make[2]: Entering directory '/tmp/ruby/build/trunk/ext/monitor' I, [2024-05-17T08:39:30.755274 #921486] INFO -- : make[2]: Leaving directory '/tmp/ruby/build/trunk/ext/monitor' I, [2024-05-17T08:39:30.809189 #921486] INFO -- : make[2]: Entering directory '/tmp/ruby/build/trunk/ext/objspace' I, [2024-05-17T08:39:30.844947 #921486] INFO -- : make[2]: Leaving directory '/tmp/ruby/build/trunk/ext/objspace' I, [2024-05-17T08:39:30.973859 #921486] INFO -- : make[2]: Entering directory '/tmp/ruby/build/trunk/ext/openssl' I, [2024-05-17T08:39:31.101227 #921486] INFO -- : make[2]: Leaving directory '/tmp/ruby/build/trunk/ext/openssl' I, [2024-05-17T08:39:31.141764 #921486] INFO -- : make[2]: Entering directory '/tmp/ruby/build/trunk/ext/pathname' I, [2024-05-17T08:39:31.160364 #921486] INFO -- : make[2]: Leaving directory '/tmp/ruby/build/trunk/ext/pathname' I, [2024-05-17T08:39:31.204824 #921486] INFO -- : make[2]: Entering directory '/tmp/ruby/build/trunk/ext/psych' I, [2024-05-17T08:39:31.367371 #921486] INFO -- : make[2]: Leaving directory '/tmp/ruby/build/trunk/ext/psych' I, [2024-05-17T08:39:31.400814 #921486] INFO -- : make[2]: Entering directory '/tmp/ruby/build/trunk/ext/pty' I, [2024-05-17T08:39:31.431444 #921486] INFO -- : make[2]: Leaving directory '/tmp/ruby/build/trunk/ext/pty' I, [2024-05-17T08:39:31.539755 #921486] INFO -- : make[2]: Entering directory '/tmp/ruby/build/trunk/ext/ripper' I, [2024-05-17T08:39:31.586926 #921486] INFO -- : make[2]: Leaving directory '/tmp/ruby/build/trunk/ext/ripper' I, [2024-05-17T08:39:31.598497 #921486] INFO -- : make[2]: Entering directory '/tmp/ruby/build/trunk/ext/rubyvm' I, [2024-05-17T08:39:31.613895 #921486] INFO -- : make[2]: Leaving directory '/tmp/ruby/build/trunk/ext/rubyvm' I, [2024-05-17T08:39:31.702599 #921486] INFO -- : make[2]: Entering directory '/tmp/ruby/build/trunk/ext/socket' I, [2024-05-17T08:39:31.761706 #921486] INFO -- : make[2]: Leaving directory '/tmp/ruby/build/trunk/ext/socket' I, [2024-05-17T08:39:31.885266 #921486] INFO -- : make[2]: Entering directory '/tmp/ruby/build/trunk/.bundle/gems/bigdecimal-3.1.8/ext/bigdecimal' I, [2024-05-17T08:39:32.046560 #921486] INFO -- : make[2]: Leaving directory '/tmp/ruby/build/trunk/.bundle/gems/bigdecimal-3.1.8/ext/bigdecimal' I, [2024-05-17T08:39:32.065420 #921486] INFO -- : make[2]: Entering directory '/tmp/ruby/build/trunk/.bundle/gems/debug-1.9.2/ext/debug' I, [2024-05-17T08:39:32.221960 #921486] INFO -- : make[2]: Leaving directory '/tmp/ruby/build/trunk/.bundle/gems/debug-1.9.2/ext/debug' I, [2024-05-17T08:39:32.239917 #921486] INFO -- : make[2]: Entering directory '/tmp/ruby/build/trunk/.bundle/gems/nkf-0.2.0/ext/nkf' I, [2024-05-17T08:39:32.396676 #921486] INFO -- : make[2]: Leaving directory '/tmp/ruby/build/trunk/.bundle/gems/nkf-0.2.0/ext/nkf' I, [2024-05-17T08:39:32.411385 #921486] INFO -- : make[2]: Entering directory '/tmp/ruby/build/trunk/.bundle/gems/racc-1.7.3/ext/racc/cparse' I, [2024-05-17T08:39:32.561164 #921486] INFO -- : make[2]: Leaving directory '/tmp/ruby/build/trunk/.bundle/gems/racc-1.7.3/ext/racc/cparse' I, [2024-05-17T08:39:32.592501 #921486] INFO -- : make[2]: Entering directory '/tmp/ruby/build/trunk/.bundle/gems/rbs-3.4.4/ext/rbs_extension' I, [2024-05-17T08:39:32.749651 #921486] INFO -- : make[2]: Leaving directory '/tmp/ruby/build/trunk/.bundle/gems/rbs-3.4.4/ext/rbs_extension' I, [2024-05-17T08:39:32.767402 #921486] INFO -- : make[2]: Entering directory '/tmp/ruby/build/trunk/.bundle/gems/syslog-0.1.2/ext/syslog' I, [2024-05-17T08:39:32.922711 #921486] INFO -- : make[2]: Leaving directory '/tmp/ruby/build/trunk/.bundle/gems/syslog-0.1.2/ext/syslog' I, [2024-05-17T08:39:33.144386 #921486] INFO -- : make[2]: Entering directory '/tmp/ruby/build/trunk' I, [2024-05-17T08:39:33.793224 #921486] INFO -- : make[2]: 'ruby' is up to date. I, [2024-05-17T08:39:33.793441 #921486] INFO -- : make[2]: Leaving directory '/tmp/ruby/build/trunk' I, [2024-05-17T08:39:33.795222 #921486] INFO -- : make[1]: Leaving directory '/tmp/ruby/build/trunk' I, [2024-05-17T08:39:33.827935 #921486] INFO -- : make[1]: Entering directory '/tmp/ruby/build/trunk' I, [2024-05-17T08:39:33.828129 #921486] INFO -- : make[1]: Nothing to be done for 'note'. I, [2024-05-17T08:39:33.828225 #921486] INFO -- : make[1]: Leaving directory '/tmp/ruby/build/trunk' E, [2024-05-17T08:39:34.380380 #921486] ERROR -- : $ /tmp/ruby/build/trunk/miniruby -I/tmp/ruby/src/trunk/lib /tmp/ruby/src/trunk/tool/runruby.rb --archdir=/tmp/ruby/build/trunk --extout=.ext -- /tmp/ruby/src/trunk/spec/mspec/bin/mspec-run -B /tmp/ruby/src/trunk/spec/default.mspec --error-output stderr --debug -fy -o /tmp/rubytest.4vlq9n/1-mspec-multi-0 E, [2024-05-17T08:39:34.381491 #921486] ERROR -- : $ /tmp/ruby/build/trunk/miniruby -I/tmp/ruby/src/trunk/lib /tmp/ruby/src/trunk/tool/runruby.rb --archdir=/tmp/ruby/build/trunk --extout=.ext -- /tmp/ruby/src/trunk/spec/mspec/bin/mspec-run -B /tmp/ruby/src/trunk/spec/default.mspec --error-output stderr --debug -fy -o /tmp/rubytest.4vlq9n/2-mspec-multi-1 E, [2024-05-17T08:39:34.382506 #921486] ERROR -- : $ /tmp/ruby/build/trunk/miniruby -I/tmp/ruby/src/trunk/lib /tmp/ruby/src/trunk/tool/runruby.rb --archdir=/tmp/ruby/build/trunk --extout=.ext -- /tmp/ruby/src/trunk/spec/mspec/bin/mspec-run -B /tmp/ruby/src/trunk/spec/default.mspec --error-output stderr --debug -fy -o /tmp/rubytest.4vlq9n/3-mspec-multi-2 E, [2024-05-17T08:39:34.383567 #921486] ERROR -- : $ /tmp/ruby/build/trunk/miniruby -I/tmp/ruby/src/trunk/lib /tmp/ruby/src/trunk/tool/runruby.rb --archdir=/tmp/ruby/build/trunk --extout=.ext -- /tmp/ruby/src/trunk/spec/mspec/bin/mspec-run -B /tmp/ruby/src/trunk/spec/default.mspec --error-output stderr --debug -fy -o /tmp/rubytest.4vlq9n/4-mspec-multi-3 I, [2024-05-17T08:39:35.388777 #921486] INFO -- : ruby 3.4.0dev (2024-05-17T02:50:59Z master 534f1c37e3) [riscv64-linux] I, [2024-05-17T08:40:07.357857 #921486] INFO -- : 0 ......................................................................... I, [2024-05-17T08:40:18.460276 #921486] INFO -- : 73 ......................................................................... I, [2024-05-17T08:40:19.589970 #921486] INFO -- : 146 ......................................................................... I, [2024-05-17T08:40:21.468138 #921486] INFO -- : 219 ......................................................................... I, [2024-05-17T08:40:22.139983 #921486] INFO -- : 292 ......................................................................... I, [2024-05-17T08:40:23.212948 #921486] INFO -- : 365 ......................................................................... I, [2024-05-17T08:40:23.933511 #921486] INFO -- : 438 ......................................................................... I, [2024-05-17T08:40:24.306915 #921486] INFO -- : 511 ......................................................................... I, [2024-05-17T08:40:24.649544 #921486] INFO -- : 584 ......................................................................... I, [2024-05-17T08:40:27.766601 #921486] INFO -- : 657 ......................................................................... I, [2024-05-17T08:40:28.269320 #921486] INFO -- : 730 ......................................................................... I, [2024-05-17T08:40:28.555145 #921486] INFO -- : 803 ......................................................................... I, [2024-05-17T08:40:29.576865 #921486] INFO -- : 876 ......................................................................... I, [2024-05-17T08:40:30.217525 #921486] INFO -- : 949 ......................................................................... I, [2024-05-17T08:40:33.017612 #921486] INFO -- : 1022 ......................................................................... I, [2024-05-17T08:40:44.577053 #921486] INFO -- : 1095 ......................................................................... I, [2024-05-17T08:40:50.250819 #921486] INFO -- : 1168 ......................................................................... I, [2024-05-17T08:40:51.282885 #921486] INFO -- : 1241 ......................................................................... I, [2024-05-17T08:40:52.224784 #921486] INFO -- : 1314 ......................................................................... I, [2024-05-17T08:40:52.561452 #921486] INFO -- : 1387 ......................................................................... I, [2024-05-17T08:40:58.839983 #921486] INFO -- : 1460 ......................................................................... I, [2024-05-17T08:41:15.961263 #921486] INFO -- : 1533 ......................................................................... I, [2024-05-17T08:41:18.361856 #921486] INFO -- : 1606 ......................................................................... I, [2024-05-17T08:41:21.636683 #921486] INFO -- : 1679 ......................................................................... I, [2024-05-17T08:41:23.904416 #921486] INFO -- : 1752 ......................................................................... I, [2024-05-17T08:41:26.118382 #921486] INFO -- : 1825 ......................................................................... I, [2024-05-17T08:41:28.315560 #921486] INFO -- : 1898 ......................................................................... I, [2024-05-17T08:41:29.860507 #921486] INFO -- : 1971 ......................................................................... I, [2024-05-17T08:41:32.076257 #921486] INFO -- : 2044 ......................................................................... I, [2024-05-17T08:41:33.241279 #921486] INFO -- : 2117 ......................................................................... I, [2024-05-17T08:41:33.842818 #921486] INFO -- : 2190 ......................................................................... I, [2024-05-17T08:41:34.112093 #921486] INFO -- : 2263 ......................................................................... I, [2024-05-17T08:41:34.385043 #921486] INFO -- : 2336 ......................................................................... I, [2024-05-17T08:41:34.918748 #921486] INFO -- : 2409 ......................................................................... I, [2024-05-17T08:41:36.073574 #921486] INFO -- : 2482 ......................................................................... I, [2024-05-17T08:41:36.877847 #921486] INFO -- : 2555 ......................................................................... I, [2024-05-17T08:41:40.007044 #921486] INFO -- : 2628 ......................................................................... I, [2024-05-17T08:41:42.070076 #921486] INFO -- : 2701 ......................................................................... I, [2024-05-17T08:41:42.821176 #921486] INFO -- : 2774 ......................................................................... I, [2024-05-17T08:41:44.271714 #921486] INFO -- : 2847 ......................................................................... I, [2024-05-17T08:41:45.478550 #921486] INFO -- : 2920 ......................................................................... I, [2024-05-17T08:41:46.312332 #921486] INFO -- : 2993 ......................................................................... I, [2024-05-17T08:41:46.737399 #921486] INFO -- : 3066 ......................................................................... I, [2024-05-17T08:41:46.985208 #921486] INFO -- : 3139 ......................................................................... I, [2024-05-17T08:41:47.226710 #921486] INFO -- : 3212 ......................................................................... I, [2024-05-17T08:41:47.633647 #921486] INFO -- : 3285 ......................................................................... I, [2024-05-17T08:41:54.062394 #921486] INFO -- : 3358 ........................................................................ I, [2024-05-17T08:41:54.062945 #921486] INFO -- : I, [2024-05-17T08:41:54.063067 #921486] INFO -- : Finished in 139.682503 seconds I, [2024-05-17T08:41:54.063159 #921486] INFO -- : I, [2024-05-17T08:41:54.063252 #921486] INFO -- : 3429 files, 32608 examples, 135079 expectations, 0 failures, 0 errors, 0 tagged I, [2024-05-17T08:41:54.075791 #921486] INFO -- : $$$[end] "make yes-test-rubyspec MSPECOPT='--error-output stderr --debug -j' TESTS='-j4'" exit with 0.