# Logfile created on 2024-05-17 04:46:18 +0000 by logger.rb/v1.4.3 I, [2024-05-17T04:46:18.804503 #3307373] INFO -- : #, @formatter=nil, @logdev=#, @binmode=false, @mon_data=#, @mon_data_owner_object_id=860>>> I, [2024-05-17T04:46:18.804625 #3307373] INFO -- : $$$[beg] make update-unicode -j20 I, [2024-05-17T04:46:18.863375 #3307373] INFO -- : Downloading Unicode emoji 15.0 files... I, [2024-05-17T04:46:18.863511 #3307373] INFO -- : Downloading Unicode emoji 15.0 files... I, [2024-05-17T04:46:18.863805 #3307373] INFO -- : Downloading Unicode emoji 15.0 files... I, [2024-05-17T04:46:18.906203 #3307373] INFO -- : made symlink emoji/15.0/emoji-sequences.txt to /tmp/ruby/src/trunk/.downloaded-cache/emoji/15.0/emoji-sequences.txt I, [2024-05-17T04:46:18.906363 #3307373] INFO -- : downloading emoji/15.0/emoji-test.txt ... downloading emoji/15.0/emoji-sequences.txt ... /tmp/ruby/src/trunk/enc/unicode/data/emoji/15.0/emoji-sequences.txt already exists E, [2024-05-17T04:46:19.352423 #3307373] ERROR -- : /tmp/ruby/src/trunk/tool/downloader.rb:302:in `rescue in download': failed to download emoji/15.0/emoji-test.txt (RuntimeError) E, [2024-05-17T04:46:19.352515 #3307373] ERROR -- : OpenURI::HTTPError: 403 Forbidden: https://www.unicode.org/Public/emoji/15.0/emoji-test.txt E, [2024-05-17T04:46:19.352529 #3307373] ERROR -- : from /tmp/ruby/src/trunk/tool/downloader.rb:201:in `download' E, [2024-05-17T04:46:19.352539 #3307373] ERROR -- : from /tmp/ruby/src/trunk/tool/downloader.rb:136:in `download' E, [2024-05-17T04:46:19.352549 #3307373] ERROR -- : from /tmp/ruby/src/trunk/tool/downloader.rb:482:in `block in
' E, [2024-05-17T04:46:19.352558 #3307373] ERROR -- : from /tmp/ruby/src/trunk/tool/downloader.rb:465:in `each' E, [2024-05-17T04:46:19.352567 #3307373] ERROR -- : from /tmp/ruby/src/trunk/tool/downloader.rb:465:in `
' E, [2024-05-17T04:46:19.352576 #3307373] ERROR -- : /usr/lib/ruby/3.0.0/open-uri.rb:364:in `open_http': 403 Forbidden (OpenURI::HTTPError) E, [2024-05-17T04:46:19.352591 #3307373] ERROR -- : from /usr/lib/ruby/3.0.0/open-uri.rb:741:in `buffer_open' E, [2024-05-17T04:46:19.352603 #3307373] ERROR -- : from /usr/lib/ruby/3.0.0/open-uri.rb:212:in `block in open_loop' E, [2024-05-17T04:46:19.352612 #3307373] ERROR -- : from /usr/lib/ruby/3.0.0/open-uri.rb:210:in `catch' E, [2024-05-17T04:46:19.352622 #3307373] ERROR -- : from /usr/lib/ruby/3.0.0/open-uri.rb:210:in `open_loop' E, [2024-05-17T04:46:19.352635 #3307373] ERROR -- : from /usr/lib/ruby/3.0.0/open-uri.rb:151:in `open_uri' E, [2024-05-17T04:46:19.352644 #3307373] ERROR -- : from /usr/lib/ruby/3.0.0/open-uri.rb:721:in `open' E, [2024-05-17T04:46:19.352652 #3307373] ERROR -- : from /usr/lib/ruby/3.0.0/open-uri.rb:729:in `read' E, [2024-05-17T04:46:19.352661 #3307373] ERROR -- : from /tmp/ruby/src/trunk/tool/downloader.rb:247:in `block in download' E, [2024-05-17T04:46:19.352682 #3307373] ERROR -- : from /tmp/ruby/src/trunk/tool/downloader.rb:378:in `with_retry' E, [2024-05-17T04:46:19.352694 #3307373] ERROR -- : from /tmp/ruby/src/trunk/tool/downloader.rb:246:in `download' E, [2024-05-17T04:46:19.352703 #3307373] ERROR -- : from /tmp/ruby/src/trunk/tool/downloader.rb:136:in `download' E, [2024-05-17T04:46:19.352712 #3307373] ERROR -- : from /tmp/ruby/src/trunk/tool/downloader.rb:482:in `block in
' E, [2024-05-17T04:46:19.352720 #3307373] ERROR -- : from /tmp/ruby/src/trunk/tool/downloader.rb:465:in `each' E, [2024-05-17T04:46:19.352729 #3307373] ERROR -- : from /tmp/ruby/src/trunk/tool/downloader.rb:465:in `
' E, [2024-05-17T04:46:19.355943 #3307373] ERROR -- : make: *** [uncommon.mk:1765: /tmp/ruby/src/trunk/enc/unicode/data/emoji/15.0/emoji-test.txt] Error 1 E, [2024-05-17T04:46:19.355993 #3307373] ERROR -- : make: *** Waiting for unfinished jobs.... E, [2024-05-17T04:46:19.383529 #3307373] ERROR -- : /tmp/ruby/src/trunk/tool/downloader.rb:302:in `rescue in download': failed to download emoji/15.0/emoji-test.txt (RuntimeError) E, [2024-05-17T04:46:19.383725 #3307373] ERROR -- : OpenURI::HTTPError: 403 Forbidden: https://www.unicode.org/Public/emoji/15.0/emoji-test.txt E, [2024-05-17T04:46:19.383762 #3307373] ERROR -- : from /tmp/ruby/src/trunk/tool/downloader.rb:201:in `download' E, [2024-05-17T04:46:19.383777 #3307373] ERROR -- : from /tmp/ruby/src/trunk/tool/downloader.rb:136:in `download' E, [2024-05-17T04:46:19.383791 #3307373] ERROR -- : from /tmp/ruby/src/trunk/tool/downloader.rb:482:in `block in
' E, [2024-05-17T04:46:19.383805 #3307373] ERROR -- : from /tmp/ruby/src/trunk/tool/downloader.rb:465:in `each' E, [2024-05-17T04:46:19.383818 #3307373] ERROR -- : from /tmp/ruby/src/trunk/tool/downloader.rb:465:in `
' E, [2024-05-17T04:46:19.383832 #3307373] ERROR -- : /usr/lib/ruby/3.0.0/open-uri.rb:364:in `open_http': 403 Forbidden (OpenURI::HTTPError) E, [2024-05-17T04:46:19.383845 #3307373] ERROR -- : from /usr/lib/ruby/3.0.0/open-uri.rb:741:in `buffer_open' E, [2024-05-17T04:46:19.383865 #3307373] ERROR -- : from /usr/lib/ruby/3.0.0/open-uri.rb:212:in `block in open_loop' E, [2024-05-17T04:46:19.383878 #3307373] ERROR -- : from /usr/lib/ruby/3.0.0/open-uri.rb:210:in `catch' E, [2024-05-17T04:46:19.383890 #3307373] ERROR -- : from /usr/lib/ruby/3.0.0/open-uri.rb:210:in `open_loop' E, [2024-05-17T04:46:19.383904 #3307373] ERROR -- : from /usr/lib/ruby/3.0.0/open-uri.rb:151:in `open_uri' E, [2024-05-17T04:46:19.383917 #3307373] ERROR -- : from /usr/lib/ruby/3.0.0/open-uri.rb:721:in `open' E, [2024-05-17T04:46:19.383929 #3307373] ERROR -- : from /usr/lib/ruby/3.0.0/open-uri.rb:729:in `read' E, [2024-05-17T04:46:19.383942 #3307373] ERROR -- : from /tmp/ruby/src/trunk/tool/downloader.rb:247:in `block in download' E, [2024-05-17T04:46:19.383956 #3307373] ERROR -- : from /tmp/ruby/src/trunk/tool/downloader.rb:378:in `with_retry' E, [2024-05-17T04:46:19.383984 #3307373] ERROR -- : from /tmp/ruby/src/trunk/tool/downloader.rb:246:in `download' E, [2024-05-17T04:46:19.383997 #3307373] ERROR -- : from /tmp/ruby/src/trunk/tool/downloader.rb:136:in `download' E, [2024-05-17T04:46:19.384010 #3307373] ERROR -- : from /tmp/ruby/src/trunk/tool/downloader.rb:482:in `block in
' E, [2024-05-17T04:46:19.384023 #3307373] ERROR -- : from /tmp/ruby/src/trunk/tool/downloader.rb:465:in `each' E, [2024-05-17T04:46:19.384037 #3307373] ERROR -- : from /tmp/ruby/src/trunk/tool/downloader.rb:465:in `
' E, [2024-05-17T04:46:19.388368 #3307373] ERROR -- : make: *** [uncommon.mk:1765: /tmp/ruby/src/trunk/enc/unicode/data/emoji/15.0/emoji-sequences.txt] Error 1 E, [2024-05-17T04:46:19.388427 #3307373] ERROR -- : make: *** Deleting file '/tmp/ruby/src/trunk/enc/unicode/data/emoji/15.0/emoji-sequences.txt' E, [2024-05-17T04:46:19.872586 #3307373] ERROR -- : /tmp/ruby/src/trunk/tool/downloader.rb:302:in `rescue in download': failed to download emoji/15.0/emoji-sequences.txt (RuntimeError) E, [2024-05-17T04:46:19.872729 #3307373] ERROR -- : EOFError: end of file reached: https://www.unicode.org/Public/emoji/15.0/emoji-sequences.txt E, [2024-05-17T04:46:19.872776 #3307373] ERROR -- : from /tmp/ruby/src/trunk/tool/downloader.rb:201:in `download' E, [2024-05-17T04:46:19.872792 #3307373] ERROR -- : from /tmp/ruby/src/trunk/tool/downloader.rb:136:in `download' E, [2024-05-17T04:46:19.872807 #3307373] ERROR -- : from /tmp/ruby/src/trunk/tool/downloader.rb:482:in `block in
' E, [2024-05-17T04:46:19.872822 #3307373] ERROR -- : from /tmp/ruby/src/trunk/tool/downloader.rb:465:in `each' E, [2024-05-17T04:46:19.872836 #3307373] ERROR -- : from /tmp/ruby/src/trunk/tool/downloader.rb:465:in `
' E, [2024-05-17T04:46:19.872851 #3307373] ERROR -- : /usr/lib/ruby/3.0.0/net/protocol.rb:227:in `rbuf_fill': end of file reached (EOFError) E, [2024-05-17T04:46:19.872872 #3307373] ERROR -- : from /usr/lib/ruby/3.0.0/net/protocol.rb:193:in `readuntil' E, [2024-05-17T04:46:19.872886 #3307373] ERROR -- : from /usr/lib/ruby/3.0.0/net/protocol.rb:203:in `readline' E, [2024-05-17T04:46:19.872900 #3307373] ERROR -- : from /usr/lib/ruby/3.0.0/net/http/response.rb:42:in `read_status_line' E, [2024-05-17T04:46:19.872914 #3307373] ERROR -- : from /usr/lib/ruby/3.0.0/net/http/response.rb:31:in `read_new' E, [2024-05-17T04:46:19.872929 #3307373] ERROR -- : from /usr/lib/ruby/3.0.0/net/http.rb:1557:in `block in transport_request' E, [2024-05-17T04:46:19.872943 #3307373] ERROR -- : from /usr/lib/ruby/3.0.0/net/http.rb:1548:in `catch' E, [2024-05-17T04:46:19.873211 #3307373] ERROR -- : from /usr/lib/ruby/3.0.0/net/http.rb:1548:in `transport_request' E, [2024-05-17T04:46:19.873226 #3307373] ERROR -- : from /usr/lib/ruby/3.0.0/net/http.rb:1521:in `request' E, [2024-05-17T04:46:19.873239 #3307373] ERROR -- : from /usr/lib/ruby/3.0.0/open-uri.rb:329:in `block in open_http' E, [2024-05-17T04:46:19.873252 #3307373] ERROR -- : from /usr/lib/ruby/3.0.0/net/http.rb:960:in `start' E, [2024-05-17T04:46:19.873264 #3307373] ERROR -- : from /usr/lib/ruby/3.0.0/open-uri.rb:323:in `open_http' E, [2024-05-17T04:46:19.873281 #3307373] ERROR -- : from /usr/lib/ruby/3.0.0/open-uri.rb:741:in `buffer_open' E, [2024-05-17T04:46:19.873294 #3307373] ERROR -- : from /usr/lib/ruby/3.0.0/open-uri.rb:212:in `block in open_loop' E, [2024-05-17T04:46:19.873306 #3307373] ERROR -- : from /usr/lib/ruby/3.0.0/open-uri.rb:210:in `catch' E, [2024-05-17T04:46:19.873319 #3307373] ERROR -- : from /usr/lib/ruby/3.0.0/open-uri.rb:210:in `open_loop' E, [2024-05-17T04:46:19.873332 #3307373] ERROR -- : from /usr/lib/ruby/3.0.0/open-uri.rb:151:in `open_uri' E, [2024-05-17T04:46:19.873345 #3307373] ERROR -- : from /usr/lib/ruby/3.0.0/open-uri.rb:721:in `open' E, [2024-05-17T04:46:19.873362 #3307373] ERROR -- : from /usr/lib/ruby/3.0.0/open-uri.rb:729:in `read' E, [2024-05-17T04:46:19.873375 #3307373] ERROR -- : from /tmp/ruby/src/trunk/tool/downloader.rb:247:in `block in download' E, [2024-05-17T04:46:19.873388 #3307373] ERROR -- : from /tmp/ruby/src/trunk/tool/downloader.rb:378:in `with_retry' E, [2024-05-17T04:46:19.873404 #3307373] ERROR -- : from /tmp/ruby/src/trunk/tool/downloader.rb:246:in `download' E, [2024-05-17T04:46:19.873417 #3307373] ERROR -- : from /tmp/ruby/src/trunk/tool/downloader.rb:136:in `download' E, [2024-05-17T04:46:19.873430 #3307373] ERROR -- : from /tmp/ruby/src/trunk/tool/downloader.rb:482:in `block in
' E, [2024-05-17T04:46:19.873443 #3307373] ERROR -- : from /tmp/ruby/src/trunk/tool/downloader.rb:465:in `each' E, [2024-05-17T04:46:19.873455 #3307373] ERROR -- : from /tmp/ruby/src/trunk/tool/downloader.rb:465:in `
' E, [2024-05-17T04:46:19.877656 #3307373] ERROR -- : make: *** [uncommon.mk:1765: /tmp/ruby/src/trunk/enc/unicode/data/emoji/15.0/emoji-zwj-sequences.txt] Error 1 I, [2024-05-17T04:46:19.877759 #3307373] INFO -- : downloading emoji/15.0/emoji-test.txt ... I, [2024-05-17T04:46:19.878254 #3307373] INFO -- : $$$[end] "make update-unicode -j20" exit with 512. I, [2024-05-17T04:46:19.878323 #3307373] INFO -- : $$$[beg] make update-download -j20 I, [2024-05-17T04:46:19.992663 #3307373] INFO -- : tool/config.guess already exists I, [2024-05-17T04:46:19.992710 #3307373] INFO -- : tool/config.sub already exists I, [2024-05-17T04:46:19.994815 #3307373] INFO -- : Update minitest to ea9caafc0754b1d6236a490d59e624b53209734a I, [2024-05-17T04:46:19.995091 #3307373] INFO -- : Update power_assert to 84e85124c5014a139af39161d484156cfe87a9ed I, [2024-05-17T04:46:19.995671 #3307373] INFO -- : Update rbs to ba7872795d5de04adb8ff500c0e6afdc81a041dd I, [2024-05-17T04:46:19.995875 #3307373] INFO -- : Update typeprof to b19a6416da3a05d57fadd6ffdadb382b6d236ca5 I, [2024-05-17T04:46:19.996095 #3307373] INFO -- : echo ea9caafc0754b1d6236a490d59e624b53209734a | /bin/sh /tmp/ruby/src/trunk/tool/ifchange /tmp/ruby/src/trunk/.bundle/.timestamp/minitest.revision - I, [2024-05-17T04:46:19.996335 #3307373] INFO -- : echo 84e85124c5014a139af39161d484156cfe87a9ed | /bin/sh /tmp/ruby/src/trunk/tool/ifchange /tmp/ruby/src/trunk/.bundle/.timestamp/power_assert.revision - I, [2024-05-17T04:46:19.996844 #3307373] INFO -- : echo ba7872795d5de04adb8ff500c0e6afdc81a041dd | /bin/sh /tmp/ruby/src/trunk/tool/ifchange /tmp/ruby/src/trunk/.bundle/.timestamp/rbs.revision - I, [2024-05-17T04:46:19.997768 #3307373] INFO -- : echo b19a6416da3a05d57fadd6ffdadb382b6d236ca5 | /bin/sh /tmp/ruby/src/trunk/tool/ifchange /tmp/ruby/src/trunk/.bundle/.timestamp/typeprof.revision - I, [2024-05-17T04:46:19.998307 #3307373] INFO -- : /tmp/ruby/src/trunk/.bundle/.timestamp/minitest.revision unchanged I, [2024-05-17T04:46:19.998350 #3307373] INFO -- : /tmp/ruby/src/trunk/.bundle/.timestamp/power_assert.revision unchanged I, [2024-05-17T04:46:19.998611 #3307373] INFO -- : /tmp/ruby/src/trunk/.bundle/.timestamp/rbs.revision unchanged I, [2024-05-17T04:46:19.999421 #3307373] INFO -- : Building power_assert@84e85124c5014a139af39161d484156cfe87a9ed to /tmp/ruby/src/trunk/gems/power_assert-2.0.3.gem I, [2024-05-17T04:46:19.999577 #3307373] INFO -- : /tmp/ruby/src/trunk/.bundle/.timestamp/typeprof.revision unchanged I, [2024-05-17T04:46:20.068424 #3307373] INFO -- : Successfully built RubyGem I, [2024-05-17T04:46:20.068480 #3307373] INFO -- : Name: power_assert I, [2024-05-17T04:46:20.068498 #3307373] INFO -- : Version: 2.0.4dev I, [2024-05-17T04:46:20.068509 #3307373] INFO -- : File: power_assert-2.0.4dev.gem I, [2024-05-17T04:46:20.113741 #3307373] INFO -- : $$$[end] "make update-download -j20" exit with 0. I, [2024-05-17T04:46:20.113781 #3307373] INFO -- : $$$[beg] make update-rubyspec -j20 I, [2024-05-17T04:46:20.171195 #3307373] INFO -- : make: Nothing to be done for 'update-rubyspec'. I, [2024-05-17T04:46:20.171473 #3307373] INFO -- : $$$[end] "make update-rubyspec -j20" exit with 0. I, [2024-05-17T04:46:20.171503 #3307373] INFO -- : $$$[beg] make update-src -j20 I, [2024-05-17T04:46:20.826453 #3307373] INFO -- : Already up to date. I, [2024-05-17T04:46:20.844470 #3307373] INFO -- : Latest commit hash = 534f1c37e3 I, [2024-05-17T04:46:20.845890 #3307373] INFO -- : $$$[end] "make update-src -j20" exit with 0. I, [2024-05-17T04:46:20.845951 #3307373] INFO -- : $$$[beg] make after-update -j20 I, [2024-05-17T04:46:20.923989 #3307373] INFO -- : generating /tmp/ruby/src/trunk/ext/ripper/eventids2table.c I, [2024-05-17T04:46:20.928201 #3307373] INFO -- : make[1]: Entering directory '/tmp/ruby/src/trunk/ext/ripper' I, [2024-05-17T04:46:20.928223 #3307373] INFO -- : make[1]: Nothing to be done for 'src'. I, [2024-05-17T04:46:20.928233 #3307373] INFO -- : make[1]: Leaving directory '/tmp/ruby/src/trunk/ext/ripper' I, [2024-05-17T04:46:20.944501 #3307373] INFO -- : /tmp/ruby/src/trunk/revision.h updated I, [2024-05-17T04:46:20.945789 #3307373] INFO -- : generating x86_64-linux-fake.rb I, [2024-05-17T04:46:20.996751 #3307373] INFO -- : x86_64-linux-fake.rb updated I, [2024-05-17T04:46:20.998212 #3307373] INFO -- : generating enc.mk I, [2024-05-17T04:46:21.116627 #3307373] INFO -- : making srcs under enc I, [2024-05-17T04:46:21.146478 #3307373] INFO -- : make[1]: Entering directory '/tmp/ruby/build/trunk' I, [2024-05-17T04:46:21.146526 #3307373] INFO -- : make[1]: Nothing to be done for 'srcs'. I, [2024-05-17T04:46:21.146533 #3307373] INFO -- : make[1]: Leaving directory '/tmp/ruby/build/trunk' I, [2024-05-17T04:46:21.191306 #3307373] INFO -- : Update minitest to ea9caafc0754b1d6236a490d59e624b53209734a I, [2024-05-17T04:46:21.191425 #3307373] INFO -- : Update power_assert to 84e85124c5014a139af39161d484156cfe87a9ed I, [2024-05-17T04:46:21.191810 #3307373] INFO -- : Update rbs to ba7872795d5de04adb8ff500c0e6afdc81a041dd I, [2024-05-17T04:46:21.191965 #3307373] INFO -- : Update typeprof to b19a6416da3a05d57fadd6ffdadb382b6d236ca5 I, [2024-05-17T04:46:21.193037 #3307373] INFO -- : echo ea9caafc0754b1d6236a490d59e624b53209734a | /bin/sh /tmp/ruby/src/trunk/tool/ifchange /tmp/ruby/src/trunk/.bundle/.timestamp/minitest.revision - I, [2024-05-17T04:46:21.193521 #3307373] INFO -- : echo 84e85124c5014a139af39161d484156cfe87a9ed | /bin/sh /tmp/ruby/src/trunk/tool/ifchange /tmp/ruby/src/trunk/.bundle/.timestamp/power_assert.revision - I, [2024-05-17T04:46:21.194508 #3307373] INFO -- : echo ba7872795d5de04adb8ff500c0e6afdc81a041dd | /bin/sh /tmp/ruby/src/trunk/tool/ifchange /tmp/ruby/src/trunk/.bundle/.timestamp/rbs.revision - I, [2024-05-17T04:46:21.194795 #3307373] INFO -- : echo b19a6416da3a05d57fadd6ffdadb382b6d236ca5 | /bin/sh /tmp/ruby/src/trunk/tool/ifchange /tmp/ruby/src/trunk/.bundle/.timestamp/typeprof.revision - I, [2024-05-17T04:46:21.195243 #3307373] INFO -- : /tmp/ruby/src/trunk/.bundle/.timestamp/minitest.revision unchanged I, [2024-05-17T04:46:21.195326 #3307373] INFO -- : /tmp/ruby/src/trunk/.bundle/.timestamp/power_assert.revision unchanged I, [2024-05-17T04:46:21.196272 #3307373] INFO -- : Building power_assert@84e85124c5014a139af39161d484156cfe87a9ed to /tmp/ruby/src/trunk/gems/power_assert-2.0.3.gem I, [2024-05-17T04:46:21.196293 #3307373] INFO -- : /tmp/ruby/src/trunk/.bundle/.timestamp/rbs.revision unchanged I, [2024-05-17T04:46:21.196459 #3307373] INFO -- : /tmp/ruby/src/trunk/.bundle/.timestamp/typeprof.revision unchanged I, [2024-05-17T04:46:21.265483 #3307373] INFO -- : Successfully built RubyGem I, [2024-05-17T04:46:21.265521 #3307373] INFO -- : Name: power_assert I, [2024-05-17T04:46:21.265527 #3307373] INFO -- : Version: 2.0.4dev I, [2024-05-17T04:46:21.265535 #3307373] INFO -- : File: power_assert-2.0.4dev.gem I, [2024-05-17T04:46:21.267579 #3307373] INFO -- : Extracting bundle gem power_assert-2.0.3... I, [2024-05-17T04:46:21.328376 #3307373] INFO -- : Try with hash version of bundled gems instead of gems/power_assert-2.0.3.gem. We don't use this gem with release version of Ruby. I, [2024-05-17T04:46:21.333315 #3307373] INFO -- : Unpacked gems/power_assert-2.0.4dev.gem I, [2024-05-17T04:46:21.335389 #3307373] INFO -- : $$$[end] "make after-update -j20" exit with 0. I, [2024-05-17T04:46:21.335504 #3307373] INFO -- : $$$[beg] make miniruby -j20 I, [2024-05-17T04:46:21.391781 #3307373] INFO -- : BASERUBY = /usr/bin/ruby --disable=gems I, [2024-05-17T04:46:21.391825 #3307373] INFO -- : CC = gcc I, [2024-05-17T04:46:21.391837 #3307373] INFO -- : LD = ld I, [2024-05-17T04:46:21.391847 #3307373] INFO -- : LDSHARED = gcc -shared I, [2024-05-17T04:46:21.391858 #3307373] INFO -- : CFLAGS = -O3 -fno-fast-math -ggdb3 -Wall -Wextra -Wdeprecated-declarations -Wdiv-by-zero -Wduplicated-cond -Wimplicit-function-declaration -Wimplicit-int -Wpointer-arith -Wwrite-strings -Wold-style-definition -Wimplicit-fallthrough=0 -Wmissing-noreturn -Wno-cast-function-type -Wno-constant-logical-operand -Wno-long-long -Wno-missing-field-initializers -Wno-overlength-strings -Wno-packed-bitfield-compat -Wno-parentheses-equality -Wno-self-assign -Wno-tautological-compare -Wno-unused-parameter -Wno-unused-value -Wsuggest-attribute=format -Wsuggest-attribute=noreturn -Wunused-variable -Wmisleading-indentation -Wundef -fPIC I, [2024-05-17T04:46:21.391868 #3307373] INFO -- : XCFLAGS = -U_FORTIFY_SOURCE -D_FORTIFY_SOURCE=2 -fstack-protector-strong -fno-strict-overflow -fvisibility=hidden -fexcess-precision=standard -DRUBY_EXPORT -I. -I.ext/include/x86_64-linux -I/tmp/ruby/src/trunk/include -I/tmp/ruby/src/trunk -I/tmp/ruby/src/trunk/prism -I/tmp/ruby/src/trunk/enc/unicode/15.0.0 I, [2024-05-17T04:46:21.391887 #3307373] INFO -- : CPPFLAGS = I, [2024-05-17T04:46:21.391898 #3307373] INFO -- : DLDFLAGS = -Wl,--compress-debug-sections=zlib -Wl,-soname,libruby.so.3.4 -fstack-protector-strong I, [2024-05-17T04:46:21.391908 #3307373] INFO -- : SOLIBS = -lz -lrt -lrt -lgmp -ldl -lcrypt -lm -lpthread I, [2024-05-17T04:46:21.391918 #3307373] INFO -- : LANG = en_US.UTF-8 I, [2024-05-17T04:46:21.391927 #3307373] INFO -- : LC_ALL = I, [2024-05-17T04:46:21.391936 #3307373] INFO -- : LC_CTYPE = I, [2024-05-17T04:46:21.391946 #3307373] INFO -- : MFLAGS = -j20 --jobserver-auth=4,5 I, [2024-05-17T04:46:21.391955 #3307373] INFO -- : RUSTC = no I, [2024-05-17T04:46:21.391964 #3307373] INFO -- : YJIT_RUSTC_ARGS = --crate-name=yjit --crate-type=staticlib --edition=2021 -g -C lto=thin -C opt-level=3 -C overflow-checks=on '--out-dir=/tmp/ruby/build/trunk/yjit/target/release/' /tmp/ruby/src/trunk/yjit/src/lib.rs I, [2024-05-17T04:46:21.393149 #3307373] INFO -- : gcc (Ubuntu 11.4.0-1ubuntu1~22.04) 11.4.0 I, [2024-05-17T04:46:21.393193 #3307373] INFO -- : Copyright (C) 2021 Free Software Foundation, Inc. I, [2024-05-17T04:46:21.393205 #3307373] INFO -- : This is free software; see the source for copying conditions. There is NO I, [2024-05-17T04:46:21.393216 #3307373] INFO -- : warranty; not even for MERCHANTABILITY or FITNESS FOR A PARTICULAR PURPOSE. I, [2024-05-17T04:46:21.393226 #3307373] INFO -- : I, [2024-05-17T04:46:21.414117 #3307373] INFO -- : compiling /tmp/ruby/src/trunk/version.c I, [2024-05-17T04:46:21.522385 #3307373] INFO -- : linking miniruby I, [2024-05-17T04:46:22.056671 #3307373] INFO -- : $$$[end] "make miniruby -j20" exit with 0. I, [2024-05-17T04:46:22.056805 #3307373] INFO -- : $$$[beg] make ruby -j20 I, [2024-05-17T04:46:22.115070 #3307373] INFO -- : BASERUBY = /usr/bin/ruby --disable=gems I, [2024-05-17T04:46:22.115097 #3307373] INFO -- : CC = gcc I, [2024-05-17T04:46:22.115103 #3307373] INFO -- : LD = ld I, [2024-05-17T04:46:22.115107 #3307373] INFO -- : LDSHARED = gcc -shared I, [2024-05-17T04:46:22.115114 #3307373] INFO -- : CFLAGS = -O3 -fno-fast-math -ggdb3 -Wall -Wextra -Wdeprecated-declarations -Wdiv-by-zero -Wduplicated-cond -Wimplicit-function-declaration -Wimplicit-int -Wpointer-arith -Wwrite-strings -Wold-style-definition -Wimplicit-fallthrough=0 -Wmissing-noreturn -Wno-cast-function-type -Wno-constant-logical-operand -Wno-long-long -Wno-missing-field-initializers -Wno-overlength-strings -Wno-packed-bitfield-compat -Wno-parentheses-equality -Wno-self-assign -Wno-tautological-compare -Wno-unused-parameter -Wno-unused-value -Wsuggest-attribute=format -Wsuggest-attribute=noreturn -Wunused-variable -Wmisleading-indentation -Wundef -fPIC I, [2024-05-17T04:46:22.115118 #3307373] INFO -- : XCFLAGS = -U_FORTIFY_SOURCE -D_FORTIFY_SOURCE=2 -fstack-protector-strong -fno-strict-overflow -fvisibility=hidden -fexcess-precision=standard -DRUBY_EXPORT -I. -I.ext/include/x86_64-linux -I/tmp/ruby/src/trunk/include -I/tmp/ruby/src/trunk -I/tmp/ruby/src/trunk/prism -I/tmp/ruby/src/trunk/enc/unicode/15.0.0 I, [2024-05-17T04:46:22.115122 #3307373] INFO -- : CPPFLAGS = I, [2024-05-17T04:46:22.115126 #3307373] INFO -- : DLDFLAGS = -Wl,--compress-debug-sections=zlib -Wl,-soname,libruby.so.3.4 -fstack-protector-strong I, [2024-05-17T04:46:22.115129 #3307373] INFO -- : SOLIBS = -lz -lrt -lrt -lgmp -ldl -lcrypt -lm -lpthread I, [2024-05-17T04:46:22.115133 #3307373] INFO -- : LANG = en_US.UTF-8 I, [2024-05-17T04:46:22.115136 #3307373] INFO -- : LC_ALL = I, [2024-05-17T04:46:22.115140 #3307373] INFO -- : LC_CTYPE = I, [2024-05-17T04:46:22.115143 #3307373] INFO -- : MFLAGS = -j20 --jobserver-auth=4,5 I, [2024-05-17T04:46:22.115147 #3307373] INFO -- : RUSTC = no I, [2024-05-17T04:46:22.115151 #3307373] INFO -- : YJIT_RUSTC_ARGS = --crate-name=yjit --crate-type=staticlib --edition=2021 -g -C lto=thin -C opt-level=3 -C overflow-checks=on '--out-dir=/tmp/ruby/build/trunk/yjit/target/release/' /tmp/ruby/src/trunk/yjit/src/lib.rs I, [2024-05-17T04:46:22.116462 #3307373] INFO -- : gcc (Ubuntu 11.4.0-1ubuntu1~22.04) 11.4.0 I, [2024-05-17T04:46:22.116492 #3307373] INFO -- : Copyright (C) 2021 Free Software Foundation, Inc. I, [2024-05-17T04:46:22.116499 #3307373] INFO -- : This is free software; see the source for copying conditions. There is NO I, [2024-05-17T04:46:22.116504 #3307373] INFO -- : warranty; not even for MERCHANTABILITY or FITNESS FOR A PARTICULAR PURPOSE. I, [2024-05-17T04:46:22.116508 #3307373] INFO -- : I, [2024-05-17T04:46:22.228543 #3307373] INFO -- : builtin_binary.inc updated I, [2024-05-17T04:46:22.233086 #3307373] INFO -- : c5234a9416e4f20f175185e840b25b0f08674d14078ed7083f37e655458e3ca9 builtin_binary.inc I, [2024-05-17T04:46:22.233899 #3307373] INFO -- : compiling /tmp/ruby/src/trunk/builtin.c I, [2024-05-17T04:46:22.415899 #3307373] INFO -- : linking static-library libruby-static.a I, [2024-05-17T04:46:22.725868 #3307373] INFO -- : linking shared-library libruby.so.3.4.0 I, [2024-05-17T04:46:24.285559 #3307373] INFO -- : linking ruby I, [2024-05-17T04:46:24.310700 #3307373] INFO -- : $$$[end] "make ruby -j20" exit with 0. I, [2024-05-17T04:46:24.310825 #3307373] INFO -- : $$$[beg] make all -j20 I, [2024-05-17T04:46:24.367416 #3307373] INFO -- : BASERUBY = /usr/bin/ruby --disable=gems I, [2024-05-17T04:46:24.367461 #3307373] INFO -- : CC = gcc I, [2024-05-17T04:46:24.367474 #3307373] INFO -- : LD = ld I, [2024-05-17T04:46:24.367485 #3307373] INFO -- : LDSHARED = gcc -shared I, [2024-05-17T04:46:24.367496 #3307373] INFO -- : CFLAGS = -O3 -fno-fast-math -ggdb3 -Wall -Wextra -Wdeprecated-declarations -Wdiv-by-zero -Wduplicated-cond -Wimplicit-function-declaration -Wimplicit-int -Wpointer-arith -Wwrite-strings -Wold-style-definition -Wimplicit-fallthrough=0 -Wmissing-noreturn -Wno-cast-function-type -Wno-constant-logical-operand -Wno-long-long -Wno-missing-field-initializers -Wno-overlength-strings -Wno-packed-bitfield-compat -Wno-parentheses-equality -Wno-self-assign -Wno-tautological-compare -Wno-unused-parameter -Wno-unused-value -Wsuggest-attribute=format -Wsuggest-attribute=noreturn -Wunused-variable -Wmisleading-indentation -Wundef -fPIC I, [2024-05-17T04:46:24.367511 #3307373] INFO -- : XCFLAGS = -U_FORTIFY_SOURCE -D_FORTIFY_SOURCE=2 -fstack-protector-strong -fno-strict-overflow -fvisibility=hidden -fexcess-precision=standard -DRUBY_EXPORT -I. -I.ext/include/x86_64-linux -I/tmp/ruby/src/trunk/include -I/tmp/ruby/src/trunk -I/tmp/ruby/src/trunk/prism -I/tmp/ruby/src/trunk/enc/unicode/15.0.0 I, [2024-05-17T04:46:24.367522 #3307373] INFO -- : CPPFLAGS = I, [2024-05-17T04:46:24.367532 #3307373] INFO -- : DLDFLAGS = -Wl,--compress-debug-sections=zlib -Wl,-soname,libruby.so.3.4 -fstack-protector-strong I, [2024-05-17T04:46:24.367544 #3307373] INFO -- : SOLIBS = -lz -lrt -lrt -lgmp -ldl -lcrypt -lm -lpthread I, [2024-05-17T04:46:24.367554 #3307373] INFO -- : LANG = en_US.UTF-8 I, [2024-05-17T04:46:24.367564 #3307373] INFO -- : LC_ALL = I, [2024-05-17T04:46:24.367575 #3307373] INFO -- : LC_CTYPE = I, [2024-05-17T04:46:24.367585 #3307373] INFO -- : MFLAGS = -j20 --jobserver-auth=4,5 I, [2024-05-17T04:46:24.367596 #3307373] INFO -- : RUSTC = no I, [2024-05-17T04:46:24.367609 #3307373] INFO -- : YJIT_RUSTC_ARGS = --crate-name=yjit --crate-type=staticlib --edition=2021 -g -C lto=thin -C opt-level=3 -C overflow-checks=on '--out-dir=/tmp/ruby/build/trunk/yjit/target/release/' /tmp/ruby/src/trunk/yjit/src/lib.rs I, [2024-05-17T04:46:24.368987 #3307373] INFO -- : gcc (Ubuntu 11.4.0-1ubuntu1~22.04) 11.4.0 I, [2024-05-17T04:46:24.369037 #3307373] INFO -- : Copyright (C) 2021 Free Software Foundation, Inc. I, [2024-05-17T04:46:24.369053 #3307373] INFO -- : This is free software; see the source for copying conditions. There is NO I, [2024-05-17T04:46:24.369066 #3307373] INFO -- : warranty; not even for MERCHANTABILITY or FITNESS FOR A PARTICULAR PURPOSE. I, [2024-05-17T04:46:24.369089 #3307373] INFO -- : I, [2024-05-17T04:46:24.398543 #3307373] INFO -- : generating enc.mk I, [2024-05-17T04:46:24.400321 #3307373] INFO -- : building spec/ruby/optional/capi/ext/array_spec.so I, [2024-05-17T04:46:24.400625 #3307373] INFO -- : building spec/ruby/optional/capi/ext/basic_object_spec.so I, [2024-05-17T04:46:24.401460 #3307373] INFO -- : building spec/ruby/optional/capi/ext/bignum_spec.so I, [2024-05-17T04:46:24.402214 #3307373] INFO -- : building spec/ruby/optional/capi/ext/binding_spec.so I, [2024-05-17T04:46:24.402266 #3307373] INFO -- : building spec/ruby/optional/capi/ext/boolean_spec.so I, [2024-05-17T04:46:24.403107 #3307373] INFO -- : building spec/ruby/optional/capi/ext/class_id_under_autoload_spec.so I, [2024-05-17T04:46:24.404027 #3307373] INFO -- : building spec/ruby/optional/capi/ext/class_spec.so I, [2024-05-17T04:46:24.404353 #3307373] INFO -- : building spec/ruby/optional/capi/ext/class_under_autoload_spec.so I, [2024-05-17T04:46:24.405308 #3307373] INFO -- : building spec/ruby/optional/capi/ext/complex_spec.so I, [2024-05-17T04:46:24.406211 #3307373] INFO -- : building spec/ruby/optional/capi/ext/constants_spec.so I, [2024-05-17T04:46:24.406637 #3307373] INFO -- : building spec/ruby/optional/capi/ext/data_spec.so I, [2024-05-17T04:46:24.407528 #3307373] INFO -- : building spec/ruby/optional/capi/ext/debug_spec.so I, [2024-05-17T04:46:24.408328 #3307373] INFO -- : building spec/ruby/optional/capi/ext/encoding_spec.so I, [2024-05-17T04:46:24.408998 #3307373] INFO -- : building spec/ruby/optional/capi/ext/enumerator_spec.so I, [2024-05-17T04:46:24.409369 #3307373] INFO -- : building spec/ruby/optional/capi/ext/exception_spec.so I, [2024-05-17T04:46:24.409983 #3307373] INFO -- : building spec/ruby/optional/capi/ext/fiber_spec.so I, [2024-05-17T04:46:24.410273 #3307373] INFO -- : building spec/ruby/optional/capi/ext/file_spec.so I, [2024-05-17T04:46:24.410925 #3307373] INFO -- : building spec/ruby/optional/capi/ext/fixnum_spec.so I, [2024-05-17T04:46:24.411376 #3307373] INFO -- : building spec/ruby/optional/capi/ext/float_spec.so I, [2024-05-17T04:46:24.518603 #3307373] INFO -- : building spec/ruby/optional/capi/ext/gc_spec.so I, [2024-05-17T04:46:24.540677 #3307373] INFO -- : building spec/ruby/optional/capi/ext/globals_spec.so I, [2024-05-17T04:46:24.554610 #3307373] INFO -- : building spec/ruby/optional/capi/ext/hash_spec.so I, [2024-05-17T04:46:24.556660 #3307373] INFO -- : building spec/ruby/optional/capi/ext/integer_spec.so I, [2024-05-17T04:46:24.560168 #3307373] INFO -- : building spec/ruby/optional/capi/ext/io_spec.so I, [2024-05-17T04:46:24.565918 #3307373] INFO -- : building spec/ruby/optional/capi/ext/kernel_spec.so I, [2024-05-17T04:46:24.568131 #3307373] INFO -- : building spec/ruby/optional/capi/ext/language_spec.so I, [2024-05-17T04:46:24.570929 #3307373] INFO -- : building spec/ruby/optional/capi/ext/marshal_spec.so I, [2024-05-17T04:46:24.575054 #3307373] INFO -- : building spec/ruby/optional/capi/ext/module_under_autoload_spec.so I, [2024-05-17T04:46:24.575135 #3307373] INFO -- : building spec/ruby/optional/capi/ext/module_spec.so I, [2024-05-17T04:46:24.576426 #3307373] INFO -- : building spec/ruby/optional/capi/ext/mutex_spec.so I, [2024-05-17T04:46:24.580298 #3307373] INFO -- : building spec/ruby/optional/capi/ext/numeric_spec.so I, [2024-05-17T04:46:24.597335 #3307373] INFO -- : building spec/ruby/optional/capi/ext/object_spec.so I, [2024-05-17T04:46:24.598097 #3307373] INFO -- : building spec/ruby/optional/capi/ext/proc_spec.so I, [2024-05-17T04:46:24.600821 #3307373] INFO -- : building spec/ruby/optional/capi/ext/range_spec.so I, [2024-05-17T04:46:24.605523 #3307373] INFO -- : building spec/ruby/optional/capi/ext/rational_spec.so I, [2024-05-17T04:46:24.639412 #3307373] INFO -- : building spec/ruby/optional/capi/ext/rbasic_spec.so I, [2024-05-17T04:46:24.659399 #3307373] INFO -- : building spec/ruby/optional/capi/ext/regexp_spec.so I, [2024-05-17T04:46:24.683577 #3307373] INFO -- : building spec/ruby/optional/capi/ext/string_spec.so I, [2024-05-17T04:46:24.705661 #3307373] INFO -- : building spec/ruby/optional/capi/ext/struct_spec.so I, [2024-05-17T04:46:24.716782 #3307373] INFO -- : building spec/ruby/optional/capi/ext/st_spec.so I, [2024-05-17T04:46:24.718343 #3307373] INFO -- : building spec/ruby/optional/capi/ext/symbol_spec.so I, [2024-05-17T04:46:24.725714 #3307373] INFO -- : building spec/ruby/optional/capi/ext/thread_spec.so I, [2024-05-17T04:46:24.727315 #3307373] INFO -- : building spec/ruby/optional/capi/ext/time_spec.so I, [2024-05-17T04:46:24.727643 #3307373] INFO -- : building spec/ruby/optional/capi/ext/tracepoint_spec.so I, [2024-05-17T04:46:24.729563 #3307373] INFO -- : building spec/ruby/optional/capi/ext/typed_data_spec.so I, [2024-05-17T04:46:24.741287 #3307373] INFO -- : building spec/ruby/optional/capi/ext/util_spec.so I, [2024-05-17T04:46:24.749975 #3307373] INFO -- : making enc I, [2024-05-17T04:46:24.752945 #3307373] INFO -- : making srcs under enc I, [2024-05-17T04:46:24.778221 #3307373] INFO -- : make[1]: Entering directory '/tmp/ruby/build/trunk' I, [2024-05-17T04:46:24.778295 #3307373] INFO -- : make[1]: Nothing to be done for 'enc'. I, [2024-05-17T04:46:24.778320 #3307373] INFO -- : make[1]: Leaving directory '/tmp/ruby/build/trunk' I, [2024-05-17T04:46:24.792573 #3307373] INFO -- : make[1]: Entering directory '/tmp/ruby/build/trunk' I, [2024-05-17T04:46:24.792629 #3307373] INFO -- : make[1]: Nothing to be done for 'srcs'. I, [2024-05-17T04:46:24.792637 #3307373] INFO -- : make[1]: Leaving directory '/tmp/ruby/build/trunk' I, [2024-05-17T04:46:24.793119 #3307373] INFO -- : generating transdb.h I, [2024-05-17T04:46:24.892553 #3307373] INFO -- : transdb.h unchanged I, [2024-05-17T04:46:24.893766 #3307373] INFO -- : generating makefiles ext/configure-ext.mk I, [2024-05-17T04:46:24.893881 #3307373] INFO -- : making trans I, [2024-05-17T04:46:24.919973 #3307373] INFO -- : ext/configure-ext.mk updated I, [2024-05-17T04:46:24.922138 #3307373] INFO -- : make[1]: Entering directory '/tmp/ruby/build/trunk' I, [2024-05-17T04:46:24.928964 #3307373] INFO -- : make[1]: Entering directory '/tmp/ruby/build/trunk' I, [2024-05-17T04:46:24.930171 #3307373] INFO -- : make[1]: Nothing to be done for 'trans'. I, [2024-05-17T04:46:24.930216 #3307373] INFO -- : make[1]: Leaving directory '/tmp/ruby/build/trunk' I, [2024-05-17T04:46:24.930228 #3307373] INFO -- : making encs I, [2024-05-17T04:46:24.987153 #3307373] INFO -- : make[1]: Entering directory '/tmp/ruby/build/trunk' I, [2024-05-17T04:46:24.987223 #3307373] INFO -- : make[1]: Nothing to be done for 'encs'. I, [2024-05-17T04:46:24.987246 #3307373] INFO -- : make[1]: Leaving directory '/tmp/ruby/build/trunk' I, [2024-05-17T04:46:25.074092 #3307373] INFO -- : make[1]: Leaving directory '/tmp/ruby/build/trunk' I, [2024-05-17T04:46:25.074591 #3307373] INFO -- : generating makefile exts.mk I, [2024-05-17T04:46:25.111894 #3307373] INFO -- : exts.mk unchanged I, [2024-05-17T04:46:25.116520 #3307373] INFO -- : make[1]: Entering directory '/tmp/ruby/build/trunk' I, [2024-05-17T04:46:25.134312 #3307373] INFO -- : make[2]: Entering directory '/tmp/ruby/build/trunk/ext/digest' I, [2024-05-17T04:46:25.135971 #3307373] INFO -- : make[2]: Entering directory '/tmp/ruby/build/trunk/ext/json' I, [2024-05-17T04:46:25.136102 #3307373] INFO -- : make[2]: Entering directory '/tmp/ruby/build/trunk/ext/date' I, [2024-05-17T04:46:25.136202 #3307373] INFO -- : make[2]: Entering directory '/tmp/ruby/build/trunk/ext/coverage' I, [2024-05-17T04:46:25.136809 #3307373] INFO -- : make[2]: Entering directory '/tmp/ruby/build/trunk/ext/io/console' I, [2024-05-17T04:46:25.137522 #3307373] INFO -- : make[2]: Entering directory '/tmp/ruby/build/trunk/ext/monitor' I, [2024-05-17T04:46:25.137875 #3307373] INFO -- : make[2]: Leaving directory '/tmp/ruby/build/trunk/ext/digest' I, [2024-05-17T04:46:25.138622 #3307373] INFO -- : make[2]: Entering directory '/tmp/ruby/build/trunk/ext/fiddle' I, [2024-05-17T04:46:25.139278 #3307373] INFO -- : make[2]: Leaving directory '/tmp/ruby/build/trunk/ext/coverage' I, [2024-05-17T04:46:25.139342 #3307373] INFO -- : make[2]: Entering directory '/tmp/ruby/build/trunk/ext/pty' I, [2024-05-17T04:46:25.139429 #3307373] INFO -- : make[2]: Entering directory '/tmp/ruby/build/trunk/ext/pathname' I, [2024-05-17T04:46:25.139485 #3307373] INFO -- : make[2]: Leaving directory '/tmp/ruby/build/trunk/ext/io/console' I, [2024-05-17T04:46:25.139544 #3307373] INFO -- : make[2]: Entering directory '/tmp/ruby/build/trunk/ext/rubyvm' I, [2024-05-17T04:46:25.139701 #3307373] INFO -- : make[2]: Leaving directory '/tmp/ruby/build/trunk/ext/date' I, [2024-05-17T04:46:25.140055 #3307373] INFO -- : make[2]: Leaving directory '/tmp/ruby/build/trunk/ext/monitor' I, [2024-05-17T04:46:25.140284 #3307373] INFO -- : make[2]: Entering directory '/tmp/ruby/build/trunk/ext/objspace' I, [2024-05-17T04:46:25.141394 #3307373] INFO -- : make[2]: Entering directory '/tmp/ruby/build/trunk/ext/psych' I, [2024-05-17T04:46:25.141468 #3307373] INFO -- : make[2]: Leaving directory '/tmp/ruby/build/trunk/ext/json' I, [2024-05-17T04:46:25.141766 #3307373] INFO -- : make[2]: Entering directory '/tmp/ruby/build/trunk/.bundle/gems/bigdecimal-3.1.8/ext/bigdecimal' I, [2024-05-17T04:46:25.141920 #3307373] INFO -- : make[2]: Entering directory '/tmp/ruby/build/trunk/.bundle/gems/debug-1.9.2/ext/debug' I, [2024-05-17T04:46:25.141972 #3307373] INFO -- : make[2]: Leaving directory '/tmp/ruby/build/trunk/ext/pty' I, [2024-05-17T04:46:25.142120 #3307373] INFO -- : make[2]: Leaving directory '/tmp/ruby/build/trunk/ext/rubyvm' I, [2024-05-17T04:46:25.142341 #3307373] INFO -- : make[2]: Leaving directory '/tmp/ruby/build/trunk/ext/pathname' I, [2024-05-17T04:46:25.142741 #3307373] INFO -- : make[2]: Entering directory '/tmp/ruby/build/trunk/.bundle/gems/nkf-0.2.0/ext/nkf' I, [2024-05-17T04:46:25.144283 #3307373] INFO -- : make[2]: Entering directory '/tmp/ruby/build/trunk/ext/ripper' I, [2024-05-17T04:46:25.144548 #3307373] INFO -- : make[2]: Leaving directory '/tmp/ruby/build/trunk/ext/objspace' I, [2024-05-17T04:46:25.144713 #3307373] INFO -- : make[2]: Leaving directory '/tmp/ruby/build/trunk/ext/fiddle' I, [2024-05-17T04:46:25.147919 #3307373] INFO -- : make[2]: Leaving directory '/tmp/ruby/build/trunk/ext/ripper' I, [2024-05-17T04:46:25.149546 #3307373] INFO -- : make[2]: Entering directory '/tmp/ruby/build/trunk/ext/socket' I, [2024-05-17T04:46:25.150134 #3307373] INFO -- : make[2]: Entering directory '/tmp/ruby/build/trunk/.bundle/gems/racc-1.7.3/ext/racc/cparse' I, [2024-05-17T04:46:25.150837 #3307373] INFO -- : make[2]: Entering directory '/tmp/ruby/build/trunk/ext/openssl' I, [2024-05-17T04:46:25.151406 #3307373] INFO -- : make[2]: Entering directory '/tmp/ruby/build/trunk/.bundle/gems/syslog-0.1.2/ext/syslog' I, [2024-05-17T04:46:25.151828 #3307373] INFO -- : make[2]: Entering directory '/tmp/ruby/build/trunk/.bundle/gems/rbs-3.4.4/ext/rbs_extension' I, [2024-05-17T04:46:25.151857 #3307373] INFO -- : make[2]: Leaving directory '/tmp/ruby/build/trunk/ext/psych' I, [2024-05-17T04:46:25.157147 #3307373] INFO -- : make[2]: Entering directory '/tmp/ruby/build/trunk/ext/digest/sha2' I, [2024-05-17T04:46:25.158047 #3307373] INFO -- : make[2]: Leaving directory '/tmp/ruby/build/trunk/ext/socket' I, [2024-05-17T04:46:25.159289 #3307373] INFO -- : make[2]: Leaving directory '/tmp/ruby/build/trunk/ext/digest/sha2' I, [2024-05-17T04:46:25.163716 #3307373] INFO -- : make[2]: Leaving directory '/tmp/ruby/build/trunk/.bundle/gems/bigdecimal-3.1.8/ext/bigdecimal' I, [2024-05-17T04:46:25.165512 #3307373] INFO -- : make[2]: Leaving directory '/tmp/ruby/build/trunk/.bundle/gems/debug-1.9.2/ext/debug' I, [2024-05-17T04:46:25.166173 #3307373] INFO -- : make[2]: Leaving directory '/tmp/ruby/build/trunk/.bundle/gems/nkf-0.2.0/ext/nkf' I, [2024-05-17T04:46:25.167068 #3307373] INFO -- : make[2]: Leaving directory '/tmp/ruby/build/trunk/ext/openssl' I, [2024-05-17T04:46:25.171732 #3307373] INFO -- : make[2]: Leaving directory '/tmp/ruby/build/trunk/.bundle/gems/racc-1.7.3/ext/racc/cparse' I, [2024-05-17T04:46:25.177213 #3307373] INFO -- : make[2]: Leaving directory '/tmp/ruby/build/trunk/.bundle/gems/rbs-3.4.4/ext/rbs_extension' I, [2024-05-17T04:46:25.181179 #3307373] INFO -- : make[2]: Leaving directory '/tmp/ruby/build/trunk/.bundle/gems/syslog-0.1.2/ext/syslog' I, [2024-05-17T04:46:25.204995 #3307373] INFO -- : make[2]: Entering directory '/tmp/ruby/build/trunk' I, [2024-05-17T04:46:25.271651 #3307373] INFO -- : linking ruby I, [2024-05-17T04:46:25.295103 #3307373] INFO -- : make[2]: Leaving directory '/tmp/ruby/build/trunk' I, [2024-05-17T04:46:25.295509 #3307373] INFO -- : make[1]: Leaving directory '/tmp/ruby/build/trunk' I, [2024-05-17T04:46:25.301752 #3307373] INFO -- : make[1]: Entering directory '/tmp/ruby/build/trunk' I, [2024-05-17T04:46:25.301792 #3307373] INFO -- : make[1]: Nothing to be done for 'note'. I, [2024-05-17T04:46:25.301802 #3307373] INFO -- : make[1]: Leaving directory '/tmp/ruby/build/trunk' I, [2024-05-17T04:46:25.302683 #3307373] INFO -- : $$$[end] "make all -j20" exit with 0. I, [2024-05-17T04:46:25.302884 #3307373] INFO -- : $$$[beg] make install -j20 I, [2024-05-17T04:46:25.372751 #3307373] INFO -- : Update minitest to ea9caafc0754b1d6236a490d59e624b53209734a I, [2024-05-17T04:46:25.372977 #3307373] INFO -- : Update power_assert to 84e85124c5014a139af39161d484156cfe87a9ed I, [2024-05-17T04:46:25.373892 #3307373] INFO -- : Update rbs to ba7872795d5de04adb8ff500c0e6afdc81a041dd I, [2024-05-17T04:46:25.374114 #3307373] INFO -- : Update typeprof to b19a6416da3a05d57fadd6ffdadb382b6d236ca5 I, [2024-05-17T04:46:25.375032 #3307373] INFO -- : echo ea9caafc0754b1d6236a490d59e624b53209734a | /bin/sh /tmp/ruby/src/trunk/tool/ifchange /tmp/ruby/src/trunk/.bundle/.timestamp/minitest.revision - I, [2024-05-17T04:46:25.375171 #3307373] INFO -- : echo 84e85124c5014a139af39161d484156cfe87a9ed | /bin/sh /tmp/ruby/src/trunk/tool/ifchange /tmp/ruby/src/trunk/.bundle/.timestamp/power_assert.revision - I, [2024-05-17T04:46:25.376202 #3307373] INFO -- : BASERUBY = /usr/bin/ruby --disable=gems I, [2024-05-17T04:46:25.376246 #3307373] INFO -- : CC = gcc I, [2024-05-17T04:46:25.376264 #3307373] INFO -- : LD = ld I, [2024-05-17T04:46:25.376279 #3307373] INFO -- : LDSHARED = gcc -shared I, [2024-05-17T04:46:25.376294 #3307373] INFO -- : CFLAGS = -O3 -fno-fast-math -ggdb3 -Wall -Wextra -Wdeprecated-declarations -Wdiv-by-zero -Wduplicated-cond -Wimplicit-function-declaration -Wimplicit-int -Wpointer-arith -Wwrite-strings -Wold-style-definition -Wimplicit-fallthrough=0 -Wmissing-noreturn -Wno-cast-function-type -Wno-constant-logical-operand -Wno-long-long -Wno-missing-field-initializers -Wno-overlength-strings -Wno-packed-bitfield-compat -Wno-parentheses-equality -Wno-self-assign -Wno-tautological-compare -Wno-unused-parameter -Wno-unused-value -Wsuggest-attribute=format -Wsuggest-attribute=noreturn -Wunused-variable -Wmisleading-indentation -Wundef -fPIC I, [2024-05-17T04:46:25.376310 #3307373] INFO -- : XCFLAGS = -U_FORTIFY_SOURCE -D_FORTIFY_SOURCE=2 -fstack-protector-strong -fno-strict-overflow -fvisibility=hidden -fexcess-precision=standard -DRUBY_EXPORT -I. -I.ext/include/x86_64-linux -I/tmp/ruby/src/trunk/include -I/tmp/ruby/src/trunk -I/tmp/ruby/src/trunk/prism -I/tmp/ruby/src/trunk/enc/unicode/15.0.0 I, [2024-05-17T04:46:25.376325 #3307373] INFO -- : CPPFLAGS = I, [2024-05-17T04:46:25.376340 #3307373] INFO -- : DLDFLAGS = -Wl,--compress-debug-sections=zlib -Wl,-soname,libruby.so.3.4 -fstack-protector-strong I, [2024-05-17T04:46:25.376355 #3307373] INFO -- : SOLIBS = -lz -lrt -lrt -lgmp -ldl -lcrypt -lm -lpthread I, [2024-05-17T04:46:25.376369 #3307373] INFO -- : LANG = en_US.UTF-8 I, [2024-05-17T04:46:25.376383 #3307373] INFO -- : LC_ALL = I, [2024-05-17T04:46:25.376397 #3307373] INFO -- : LC_CTYPE = I, [2024-05-17T04:46:25.376419 #3307373] INFO -- : MFLAGS = -j20 --jobserver-auth=4,5 I, [2024-05-17T04:46:25.376434 #3307373] INFO -- : RUSTC = no I, [2024-05-17T04:46:25.376459 #3307373] INFO -- : YJIT_RUSTC_ARGS = --crate-name=yjit --crate-type=staticlib --edition=2021 -g -C lto=thin -C opt-level=3 -C overflow-checks=on '--out-dir=/tmp/ruby/build/trunk/yjit/target/release/' /tmp/ruby/src/trunk/yjit/src/lib.rs I, [2024-05-17T04:46:25.377958 #3307373] INFO -- : /tmp/ruby/src/trunk/.bundle/.timestamp/minitest.revision unchanged I, [2024-05-17T04:46:25.378000 #3307373] INFO -- : /tmp/ruby/src/trunk/.bundle/.timestamp/power_assert.revision unchanged I, [2024-05-17T04:46:25.403972 #3307373] INFO -- : echo ba7872795d5de04adb8ff500c0e6afdc81a041dd | /bin/sh /tmp/ruby/src/trunk/tool/ifchange /tmp/ruby/src/trunk/.bundle/.timestamp/rbs.revision - I, [2024-05-17T04:46:25.404028 #3307373] INFO -- : echo b19a6416da3a05d57fadd6ffdadb382b6d236ca5 | /bin/sh /tmp/ruby/src/trunk/tool/ifchange /tmp/ruby/src/trunk/.bundle/.timestamp/typeprof.revision - I, [2024-05-17T04:46:25.404772 #3307373] INFO -- : generating enc.mk I, [2024-05-17T04:46:25.404803 #3307373] INFO -- : gcc (Ubuntu 11.4.0-1ubuntu1~22.04) 11.4.0 I, [2024-05-17T04:46:25.404815 #3307373] INFO -- : Copyright (C) 2021 Free Software Foundation, Inc. I, [2024-05-17T04:46:25.404826 #3307373] INFO -- : This is free software; see the source for copying conditions. There is NO I, [2024-05-17T04:46:25.404837 #3307373] INFO -- : warranty; not even for MERCHANTABILITY or FITNESS FOR A PARTICULAR PURPOSE. I, [2024-05-17T04:46:25.404847 #3307373] INFO -- : I, [2024-05-17T04:46:25.406173 #3307373] INFO -- : /tmp/ruby/src/trunk/.bundle/.timestamp/rbs.revision unchanged I, [2024-05-17T04:46:25.406301 #3307373] INFO -- : /tmp/ruby/src/trunk/.bundle/.timestamp/typeprof.revision unchanged I, [2024-05-17T04:46:25.526744 #3307373] INFO -- : Building power_assert@84e85124c5014a139af39161d484156cfe87a9ed to /tmp/ruby/src/trunk/gems/power_assert-2.0.3.gem I, [2024-05-17T04:46:25.527486 #3307373] INFO -- : making srcs under enc I, [2024-05-17T04:46:25.527536 #3307373] INFO -- : making enc I, [2024-05-17T04:46:25.544145 #3307373] INFO -- : make[1]: Entering directory '/tmp/ruby/build/trunk' I, [2024-05-17T04:46:25.544194 #3307373] INFO -- : make[1]: Nothing to be done for 'enc'. I, [2024-05-17T04:46:25.544207 #3307373] INFO -- : make[1]: Leaving directory '/tmp/ruby/build/trunk' I, [2024-05-17T04:46:25.557091 #3307373] INFO -- : make[1]: Entering directory '/tmp/ruby/build/trunk' I, [2024-05-17T04:46:25.557154 #3307373] INFO -- : make[1]: Nothing to be done for 'srcs'. I, [2024-05-17T04:46:25.557170 #3307373] INFO -- : make[1]: Leaving directory '/tmp/ruby/build/trunk' I, [2024-05-17T04:46:25.557879 #3307373] INFO -- : generating transdb.h I, [2024-05-17T04:46:25.595403 #3307373] INFO -- : Successfully built RubyGem I, [2024-05-17T04:46:25.595461 #3307373] INFO -- : Name: power_assert I, [2024-05-17T04:46:25.595473 #3307373] INFO -- : Version: 2.0.4dev I, [2024-05-17T04:46:25.595484 #3307373] INFO -- : File: power_assert-2.0.4dev.gem I, [2024-05-17T04:46:25.597664 #3307373] INFO -- : Extracting bundle gem power_assert-2.0.3... I, [2024-05-17T04:46:25.654763 #3307373] INFO -- : transdb.h unchanged I, [2024-05-17T04:46:25.656314 #3307373] INFO -- : generating makefiles ext/configure-ext.mk I, [2024-05-17T04:46:25.656389 #3307373] INFO -- : making trans I, [2024-05-17T04:46:25.659660 #3307373] INFO -- : Try with hash version of bundled gems instead of gems/power_assert-2.0.3.gem. We don't use this gem with release version of Ruby. I, [2024-05-17T04:46:25.664691 #3307373] INFO -- : Unpacked gems/power_assert-2.0.4dev.gem I, [2024-05-17T04:46:25.683252 #3307373] INFO -- : ext/configure-ext.mk unchanged I, [2024-05-17T04:46:25.685793 #3307373] INFO -- : make[1]: Entering directory '/tmp/ruby/build/trunk' I, [2024-05-17T04:46:25.691792 #3307373] INFO -- : make[1]: Entering directory '/tmp/ruby/build/trunk' I, [2024-05-17T04:46:25.691897 #3307373] INFO -- : make[1]: Nothing to be done for 'trans'. I, [2024-05-17T04:46:25.691928 #3307373] INFO -- : make[1]: Leaving directory '/tmp/ruby/build/trunk' I, [2024-05-17T04:46:25.692988 #3307373] INFO -- : making encs I, [2024-05-17T04:46:25.752285 #3307373] INFO -- : make[1]: Entering directory '/tmp/ruby/build/trunk' I, [2024-05-17T04:46:25.752356 #3307373] INFO -- : make[1]: Nothing to be done for 'encs'. I, [2024-05-17T04:46:25.752382 #3307373] INFO -- : make[1]: Leaving directory '/tmp/ruby/build/trunk' I, [2024-05-17T04:46:25.840403 #3307373] INFO -- : make[1]: Leaving directory '/tmp/ruby/build/trunk' I, [2024-05-17T04:46:25.841108 #3307373] INFO -- : generating makefile exts.mk I, [2024-05-17T04:46:25.878127 #3307373] INFO -- : exts.mk unchanged I, [2024-05-17T04:46:25.882494 #3307373] INFO -- : make[1]: Entering directory '/tmp/ruby/build/trunk' I, [2024-05-17T04:46:25.900852 #3307373] INFO -- : make[2]: Entering directory '/tmp/ruby/build/trunk/ext/digest' I, [2024-05-17T04:46:25.902008 #3307373] INFO -- : make[2]: Entering directory '/tmp/ruby/build/trunk/ext/json' I, [2024-05-17T04:46:25.902093 #3307373] INFO -- : make[2]: Entering directory '/tmp/ruby/build/trunk/ext/coverage' I, [2024-05-17T04:46:25.902819 #3307373] INFO -- : make[2]: Entering directory '/tmp/ruby/build/trunk/ext/io/console' I, [2024-05-17T04:46:25.903016 #3307373] INFO -- : make[2]: Entering directory '/tmp/ruby/build/trunk/ext/date' I, [2024-05-17T04:46:25.903198 #3307373] INFO -- : make[2]: Entering directory '/tmp/ruby/build/trunk/ext/rubyvm' I, [2024-05-17T04:46:25.903830 #3307373] INFO -- : make[2]: Entering directory '/tmp/ruby/build/trunk/ext/monitor' I, [2024-05-17T04:46:25.904624 #3307373] INFO -- : make[2]: Entering directory '/tmp/ruby/build/trunk/ext/pathname' I, [2024-05-17T04:46:25.905039 #3307373] INFO -- : make[2]: Entering directory '/tmp/ruby/build/trunk/ext/pty' I, [2024-05-17T04:46:25.905179 #3307373] INFO -- : make[2]: Entering directory '/tmp/ruby/build/trunk/ext/fiddle' I, [2024-05-17T04:46:25.905746 #3307373] INFO -- : make[2]: Leaving directory '/tmp/ruby/build/trunk/ext/coverage' I, [2024-05-17T04:46:25.905854 #3307373] INFO -- : make[2]: Leaving directory '/tmp/ruby/build/trunk/ext/rubyvm' I, [2024-05-17T04:46:25.906273 #3307373] INFO -- : make[2]: Leaving directory '/tmp/ruby/build/trunk/ext/io/console' I, [2024-05-17T04:46:25.906306 #3307373] INFO -- : make[2]: Entering directory '/tmp/ruby/build/trunk/ext/objspace' I, [2024-05-17T04:46:25.906331 #3307373] INFO -- : make[2]: Leaving directory '/tmp/ruby/build/trunk/ext/date' I, [2024-05-17T04:46:25.906786 #3307373] INFO -- : make[2]: Entering directory '/tmp/ruby/build/trunk/ext/psych' I, [2024-05-17T04:46:25.906896 #3307373] INFO -- : make[2]: Leaving directory '/tmp/ruby/build/trunk/ext/monitor' I, [2024-05-17T04:46:25.907134 #3307373] INFO -- : make[2]: Leaving directory '/tmp/ruby/build/trunk/ext/digest' I, [2024-05-17T04:46:25.907238 #3307373] INFO -- : make[2]: Leaving directory '/tmp/ruby/build/trunk/ext/pty' I, [2024-05-17T04:46:25.907921 #3307373] INFO -- : make[2]: Leaving directory '/tmp/ruby/build/trunk/ext/pathname' I, [2024-05-17T04:46:25.909526 #3307373] INFO -- : make[2]: Entering directory '/tmp/ruby/build/trunk/ext/ripper' I, [2024-05-17T04:46:25.909614 #3307373] INFO -- : make[2]: Entering directory '/tmp/ruby/build/trunk/.bundle/gems/bigdecimal-3.1.8/ext/bigdecimal' I, [2024-05-17T04:46:25.909820 #3307373] INFO -- : make[2]: Entering directory '/tmp/ruby/build/trunk/.bundle/gems/debug-1.9.2/ext/debug' I, [2024-05-17T04:46:25.909851 #3307373] INFO -- : make[2]: Entering directory '/tmp/ruby/build/trunk/.bundle/gems/nkf-0.2.0/ext/nkf' I, [2024-05-17T04:46:25.909910 #3307373] INFO -- : make[2]: Entering directory '/tmp/ruby/build/trunk/.bundle/gems/racc-1.7.3/ext/racc/cparse' I, [2024-05-17T04:46:25.910069 #3307373] INFO -- : make[2]: Leaving directory '/tmp/ruby/build/trunk/ext/objspace' I, [2024-05-17T04:46:25.910093 #3307373] INFO -- : make[2]: Entering directory '/tmp/ruby/build/trunk/.bundle/gems/syslog-0.1.2/ext/syslog' I, [2024-05-17T04:46:25.910467 #3307373] INFO -- : make[2]: Entering directory '/tmp/ruby/build/trunk/.bundle/gems/rbs-3.4.4/ext/rbs_extension' I, [2024-05-17T04:46:25.911422 #3307373] INFO -- : make[2]: Leaving directory '/tmp/ruby/build/trunk/ext/fiddle' I, [2024-05-17T04:46:25.911507 #3307373] INFO -- : make[2]: Leaving directory '/tmp/ruby/build/trunk/ext/json' I, [2024-05-17T04:46:25.913462 #3307373] INFO -- : make[2]: Entering directory '/tmp/ruby/build/trunk/ext/socket' I, [2024-05-17T04:46:25.913601 #3307373] INFO -- : make[2]: Entering directory '/tmp/ruby/build/trunk/ext/digest/sha2' I, [2024-05-17T04:46:25.916618 #3307373] INFO -- : make[2]: Leaving directory '/tmp/ruby/build/trunk/ext/digest/sha2' I, [2024-05-17T04:46:25.916869 #3307373] INFO -- : make[2]: Leaving directory '/tmp/ruby/build/trunk/ext/ripper' I, [2024-05-17T04:46:25.917575 #3307373] INFO -- : make[2]: Leaving directory '/tmp/ruby/build/trunk/ext/psych' I, [2024-05-17T04:46:25.917660 #3307373] INFO -- : make[2]: Entering directory '/tmp/ruby/build/trunk/ext/openssl' I, [2024-05-17T04:46:25.921935 #3307373] INFO -- : make[2]: Leaving directory '/tmp/ruby/build/trunk/ext/socket' I, [2024-05-17T04:46:25.928895 #3307373] INFO -- : make[2]: Leaving directory '/tmp/ruby/build/trunk/ext/openssl' I, [2024-05-17T04:46:25.933084 #3307373] INFO -- : make[2]: Leaving directory '/tmp/ruby/build/trunk/.bundle/gems/nkf-0.2.0/ext/nkf' I, [2024-05-17T04:46:25.933472 #3307373] INFO -- : make[2]: Leaving directory '/tmp/ruby/build/trunk/.bundle/gems/bigdecimal-3.1.8/ext/bigdecimal' I, [2024-05-17T04:46:25.934103 #3307373] INFO -- : make[2]: Leaving directory '/tmp/ruby/build/trunk/.bundle/gems/racc-1.7.3/ext/racc/cparse' I, [2024-05-17T04:46:25.937068 #3307373] INFO -- : make[2]: Leaving directory '/tmp/ruby/build/trunk/.bundle/gems/syslog-0.1.2/ext/syslog' I, [2024-05-17T04:46:25.943124 #3307373] INFO -- : make[2]: Leaving directory '/tmp/ruby/build/trunk/.bundle/gems/rbs-3.4.4/ext/rbs_extension' I, [2024-05-17T04:46:25.946032 #3307373] INFO -- : make[2]: Leaving directory '/tmp/ruby/build/trunk/.bundle/gems/debug-1.9.2/ext/debug' I, [2024-05-17T04:46:25.969761 #3307373] INFO -- : make[2]: Entering directory '/tmp/ruby/build/trunk' I, [2024-05-17T04:46:26.042308 #3307373] INFO -- : make[2]: 'ruby' is up to date. I, [2024-05-17T04:46:26.042367 #3307373] INFO -- : make[2]: Leaving directory '/tmp/ruby/build/trunk' I, [2024-05-17T04:46:26.042751 #3307373] INFO -- : make[1]: Leaving directory '/tmp/ruby/build/trunk' I, [2024-05-17T04:46:26.046187 #3307373] INFO -- : make[1]: Entering directory '/tmp/ruby/build/trunk' I, [2024-05-17T04:46:26.046256 #3307373] INFO -- : make[1]: Nothing to be done for 'note'. I, [2024-05-17T04:46:26.046272 #3307373] INFO -- : make[1]: Leaving directory '/tmp/ruby/build/trunk' I, [2024-05-17T04:46:26.046561 #3307373] INFO -- : ./miniruby -I/tmp/ruby/src/trunk/lib -I. -I.ext/common /tmp/ruby/src/trunk/tool/runruby.rb --extout=.ext -- --disable-gems -r./x86_64-linux-fake /tmp/ruby/src/trunk/tool/rbinstall.rb --make="make" --dest-dir="" --extout=".ext" --ext-build-dir="./ext" --mflags="-j20 --jobserver-auth=4,5" --make-flags=" -j20 --jobserver-auth=4,5" --data-mode=0644 --prog-mode=0755 --installed-list .installed.list --mantype="doc" --gnumake --install=all --exclude=doc I, [2024-05-17T04:46:26.142828 #3307373] INFO -- : Installing to I, [2024-05-17T04:46:26.142906 #3307373] INFO -- : installing binary commands: /tmp/ruby/install/trunk/bin I, [2024-05-17T04:46:26.142920 #3307373] INFO -- : installing base libraries: /tmp/ruby/install/trunk/lib I, [2024-05-17T04:46:26.149912 #3307373] INFO -- : installing arch files: /tmp/ruby/install/trunk/lib/ruby/3.4.0+0/x86_64-linux I, [2024-05-17T04:46:26.149970 #3307373] INFO -- : installing pkgconfig data: /tmp/ruby/install/trunk/lib/pkgconfig I, [2024-05-17T04:46:26.149983 #3307373] INFO -- : installing extension objects: /tmp/ruby/install/trunk/lib/ruby/3.4.0+0/x86_64-linux I, [2024-05-17T04:46:26.159176 #3307373] INFO -- : installing extension objects: /tmp/ruby/install/trunk/lib/ruby/site_ruby/3.4.0+0/x86_64-linux I, [2024-05-17T04:46:26.159244 #3307373] INFO -- : installing extension objects: /tmp/ruby/install/trunk/lib/ruby/vendor_ruby/3.4.0+0/x86_64-linux I, [2024-05-17T04:46:26.159258 #3307373] INFO -- : installing extension headers: /tmp/ruby/install/trunk/include/ruby-3.4.0+0/x86_64-linux I, [2024-05-17T04:46:26.159279 #3307373] INFO -- : installing extension scripts: /tmp/ruby/install/trunk/lib/ruby/3.4.0+0 I, [2024-05-17T04:46:26.162056 #3307373] INFO -- : installing extension scripts: /tmp/ruby/install/trunk/lib/ruby/site_ruby/3.4.0+0 I, [2024-05-17T04:46:26.162115 #3307373] INFO -- : installing extension scripts: /tmp/ruby/install/trunk/lib/ruby/vendor_ruby/3.4.0+0 I, [2024-05-17T04:46:26.162134 #3307373] INFO -- : installing extension headers: /tmp/ruby/install/trunk/include/ruby-3.4.0+0/ruby I, [2024-05-17T04:46:26.162145 #3307373] INFO -- : installing command scripts: /tmp/ruby/install/trunk/bin I, [2024-05-17T04:46:26.162156 #3307373] INFO -- : installing library scripts: /tmp/ruby/install/trunk/lib/ruby/3.4.0+0 I, [2024-05-17T04:46:26.194301 #3307373] INFO -- : installing common headers: /tmp/ruby/install/trunk/include/ruby-3.4.0+0 I, [2024-05-17T04:46:26.200627 #3307373] INFO -- : installing manpages: /tmp/ruby/install/trunk/share/man/man1 I, [2024-05-17T04:46:26.200694 #3307373] INFO -- : installing default gems from lib: /tmp/ruby/install/trunk/lib/ruby/gems/3.4.0+0 I, [2024-05-17T04:46:26.223268 #3307373] INFO -- : benchmark 0.3.0 I, [2024-05-17T04:46:26.225223 #3307373] INFO -- : bundler 2.6.0.dev I, [2024-05-17T04:46:26.227087 #3307373] INFO -- : cgi 0.4.1 I, [2024-05-17T04:46:26.227810 #3307373] INFO -- : delegate 0.3.1 I, [2024-05-17T04:46:26.228283 #3307373] INFO -- : did_you_mean 1.6.3 I, [2024-05-17T04:46:26.228783 #3307373] INFO -- : english 0.8.0 I, [2024-05-17T04:46:26.229237 #3307373] INFO -- : erb 4.0.4 I, [2024-05-17T04:46:26.230426 #3307373] INFO -- : error_highlight 0.6.0 I, [2024-05-17T04:46:26.231153 #3307373] INFO -- : fileutils 1.7.2 I, [2024-05-17T04:46:26.231839 #3307373] INFO -- : find 0.2.0 I, [2024-05-17T04:46:26.232579 #3307373] INFO -- : forwardable 1.3.3 I, [2024-05-17T04:46:26.233354 #3307373] INFO -- : ipaddr 1.2.6 I, [2024-05-17T04:46:26.234263 #3307373] INFO -- : irb 1.13.1 I, [2024-05-17T04:46:26.235011 #3307373] INFO -- : logger 1.6.0 I, [2024-05-17T04:46:26.235492 #3307373] INFO -- : net-http 0.4.1 I, [2024-05-17T04:46:26.235905 #3307373] INFO -- : net-protocol 0.2.2 I, [2024-05-17T04:46:26.236476 #3307373] INFO -- : open-uri 0.4.1 I, [2024-05-17T04:46:26.236959 #3307373] INFO -- : open3 0.2.1 I, [2024-05-17T04:46:26.237431 #3307373] INFO -- : optparse 0.5.0 I, [2024-05-17T04:46:26.237919 #3307373] INFO -- : ostruct 0.6.0 I, [2024-05-17T04:46:26.238278 #3307373] INFO -- : pp 0.5.0 I, [2024-05-17T04:46:26.238797 #3307373] INFO -- : prettyprint 0.2.0 I, [2024-05-17T04:46:26.239263 #3307373] INFO -- : prism 0.29.0 I, [2024-05-17T04:46:26.239791 #3307373] INFO -- : pstore 0.1.3 I, [2024-05-17T04:46:26.240348 #3307373] INFO -- : rdoc 6.6.3.1 I, [2024-05-17T04:46:26.241306 #3307373] INFO -- : readline 0.0.4 I, [2024-05-17T04:46:26.241816 #3307373] INFO -- : reline 0.5.7 I, [2024-05-17T04:46:26.242344 #3307373] INFO -- : resolv 0.4.0 I, [2024-05-17T04:46:26.242801 #3307373] INFO -- : ruby2_keywords 0.0.5 I, [2024-05-17T04:46:26.243309 #3307373] INFO -- : securerandom 0.3.1 I, [2024-05-17T04:46:26.244234 #3307373] INFO -- : set 1.1.0 I, [2024-05-17T04:46:26.244993 #3307373] INFO -- : shellwords 0.2.0 I, [2024-05-17T04:46:26.245492 #3307373] INFO -- : singleton 0.2.0 I, [2024-05-17T04:46:26.245940 #3307373] INFO -- : syntax_suggest 2.0.0 I, [2024-05-17T04:46:26.246573 #3307373] INFO -- : tempfile 0.2.1 I, [2024-05-17T04:46:26.247105 #3307373] INFO -- : time 0.3.0 I, [2024-05-17T04:46:26.247593 #3307373] INFO -- : timeout 0.4.1 I, [2024-05-17T04:46:26.248104 #3307373] INFO -- : tmpdir 0.2.0 I, [2024-05-17T04:46:26.248597 #3307373] INFO -- : tsort 0.2.0 I, [2024-05-17T04:46:26.249002 #3307373] INFO -- : un 0.3.0 I, [2024-05-17T04:46:26.249507 #3307373] INFO -- : uri 0.13.0 I, [2024-05-17T04:46:26.250077 #3307373] INFO -- : weakref 0.1.3 I, [2024-05-17T04:46:26.250474 #3307373] INFO -- : yaml 0.3.0 I, [2024-05-17T04:46:26.250893 #3307373] INFO -- : installing default gems from ext: /tmp/ruby/install/trunk/lib/ruby/gems/3.4.0+0 I, [2024-05-17T04:46:26.257405 #3307373] INFO -- : date 3.3.4 I, [2024-05-17T04:46:26.257939 #3307373] INFO -- : digest 3.1.1 I, [2024-05-17T04:46:26.258420 #3307373] INFO -- : etc 1.4.3 I, [2024-05-17T04:46:26.258934 #3307373] INFO -- : fcntl 1.1.0 I, [2024-05-17T04:46:26.259399 #3307373] INFO -- : fiddle 1.1.3 I, [2024-05-17T04:46:26.259825 #3307373] INFO -- : io-console 0.7.2 I, [2024-05-17T04:46:26.260348 #3307373] INFO -- : io-nonblock 0.3.0 I, [2024-05-17T04:46:26.260813 #3307373] INFO -- : io-wait 0.3.1 I, [2024-05-17T04:46:26.261369 #3307373] INFO -- : json 2.7.2 I, [2024-05-17T04:46:26.261932 #3307373] INFO -- : openssl 3.2.0 I, [2024-05-17T04:46:26.262435 #3307373] INFO -- : pathname 0.3.0 I, [2024-05-17T04:46:26.262903 #3307373] INFO -- : psych 5.1.2 I, [2024-05-17T04:46:26.263463 #3307373] INFO -- : stringio 3.1.1 I, [2024-05-17T04:46:26.263939 #3307373] INFO -- : strscan 3.1.1 I, [2024-05-17T04:46:26.264453 #3307373] INFO -- : zlib 3.1.0 I, [2024-05-17T04:46:26.264849 #3307373] INFO -- : installing bundled gems: /tmp/ruby/install/trunk/lib/ruby/gems/3.4.0+0 I, [2024-05-17T04:46:26.265254 #3307373] INFO -- : minitest 5.22.3 I, [2024-05-17T04:46:26.272745 #3307373] INFO -- : rake 13.2.1 I, [2024-05-17T04:46:26.276240 #3307373] INFO -- : test-unit 3.6.2 I, [2024-05-17T04:46:26.280943 #3307373] INFO -- : rexml 3.2.6 I, [2024-05-17T04:46:26.284561 #3307373] INFO -- : rss 0.3.0 I, [2024-05-17T04:46:26.287239 #3307373] INFO -- : net-ftp 0.3.4 I, [2024-05-17T04:46:26.288880 #3307373] INFO -- : net-imap 0.4.11 I, [2024-05-17T04:46:26.292475 #3307373] INFO -- : net-pop 0.1.2 I, [2024-05-17T04:46:26.293537 #3307373] INFO -- : net-smtp 0.5.0 I, [2024-05-17T04:46:26.294693 #3307373] INFO -- : matrix 0.4.2 I, [2024-05-17T04:46:26.298212 #3307373] INFO -- : prime 0.1.2 I, [2024-05-17T04:46:26.302878 #3307373] INFO -- : rbs 3.4.4 I, [2024-05-17T04:46:26.324873 #3307373] INFO -- : typeprof 0.21.11 I, [2024-05-17T04:46:26.327178 #3307373] INFO -- : debug 1.9.2 I, [2024-05-17T04:46:26.330632 #3307373] INFO -- : racc 1.7.3 I, [2024-05-17T04:46:26.333226 #3307373] INFO -- : mutex_m 0.2.0 I, [2024-05-17T04:46:26.334619 #3307373] INFO -- : getoptlong 0.2.1 I, [2024-05-17T04:46:26.336223 #3307373] INFO -- : base64 0.2.0 I, [2024-05-17T04:46:26.337330 #3307373] INFO -- : bigdecimal 3.1.8 I, [2024-05-17T04:46:26.339379 #3307373] INFO -- : observer 0.1.2 I, [2024-05-17T04:46:26.340549 #3307373] INFO -- : abbrev 0.1.2 I, [2024-05-17T04:46:26.342107 #3307373] INFO -- : resolv-replace 0.1.1 I, [2024-05-17T04:46:26.343363 #3307373] INFO -- : rinda 0.2.0 I, [2024-05-17T04:46:26.344950 #3307373] INFO -- : drb 2.2.1 I, [2024-05-17T04:46:26.346541 #3307373] INFO -- : nkf 0.2.0 I, [2024-05-17T04:46:26.349065 #3307373] INFO -- : syslog 0.1.2 I, [2024-05-17T04:46:26.350726 #3307373] INFO -- : csv 3.3.0 I, [2024-05-17T04:46:26.353565 #3307373] INFO -- : installing bundled gem cache: /tmp/ruby/install/trunk/lib/ruby/gems/3.4.0+0/cache I, [2024-05-17T04:46:26.354901 #3307373] INFO -- : skipped bundled gems: I, [2024-05-17T04:46:26.354967 #3307373] INFO -- : power_assert-2.0.4dev.gem not found in bundled_gems I, [2024-05-17T04:46:26.357922 #3307373] INFO -- : $$$[end] "make install -j20" exit with 0. I, [2024-05-17T04:46:26.358077 #3307373] INFO -- : $$$[beg] make yes-btest TESTOPTS='-q -j20' I, [2024-05-17T04:46:32.435069 #3307373] INFO -- : PASS all 1936 tests E, [2024-05-17T04:46:32.440279 #3307373] ERROR -- : I, [2024-05-17T04:46:32.440576 #3307373] INFO -- : $$$[end] "make yes-btest TESTOPTS='-q -j20'" exit with 0. I, [2024-05-17T04:46:32.440675 #3307373] INFO -- : $$$[beg] make yes-test-basic TESTS='-j20' I, [2024-05-17T04:46:32.502062 #3307373] INFO -- : BASERUBY = /usr/bin/ruby --disable=gems I, [2024-05-17T04:46:32.502105 #3307373] INFO -- : CC = gcc I, [2024-05-17T04:46:32.502117 #3307373] INFO -- : LD = ld I, [2024-05-17T04:46:32.502129 #3307373] INFO -- : LDSHARED = gcc -shared I, [2024-05-17T04:46:32.502139 #3307373] INFO -- : CFLAGS = -O3 -fno-fast-math -ggdb3 -Wall -Wextra -Wdeprecated-declarations -Wdiv-by-zero -Wduplicated-cond -Wimplicit-function-declaration -Wimplicit-int -Wpointer-arith -Wwrite-strings -Wold-style-definition -Wimplicit-fallthrough=0 -Wmissing-noreturn -Wno-cast-function-type -Wno-constant-logical-operand -Wno-long-long -Wno-missing-field-initializers -Wno-overlength-strings -Wno-packed-bitfield-compat -Wno-parentheses-equality -Wno-self-assign -Wno-tautological-compare -Wno-unused-parameter -Wno-unused-value -Wsuggest-attribute=format -Wsuggest-attribute=noreturn -Wunused-variable -Wmisleading-indentation -Wundef -fPIC I, [2024-05-17T04:46:32.502151 #3307373] INFO -- : XCFLAGS = -U_FORTIFY_SOURCE -D_FORTIFY_SOURCE=2 -fstack-protector-strong -fno-strict-overflow -fvisibility=hidden -fexcess-precision=standard -DRUBY_EXPORT -I. -I.ext/include/x86_64-linux -I/tmp/ruby/src/trunk/include -I/tmp/ruby/src/trunk -I/tmp/ruby/src/trunk/prism -I/tmp/ruby/src/trunk/enc/unicode/15.0.0 I, [2024-05-17T04:46:32.502175 #3307373] INFO -- : CPPFLAGS = I, [2024-05-17T04:46:32.502187 #3307373] INFO -- : DLDFLAGS = -Wl,--compress-debug-sections=zlib -Wl,-soname,libruby.so.3.4 -fstack-protector-strong I, [2024-05-17T04:46:32.502197 #3307373] INFO -- : SOLIBS = -lz -lrt -lrt -lgmp -ldl -lcrypt -lm -lpthread I, [2024-05-17T04:46:32.502207 #3307373] INFO -- : LANG = en_US.UTF-8 I, [2024-05-17T04:46:32.502216 #3307373] INFO -- : LC_ALL = I, [2024-05-17T04:46:32.502226 #3307373] INFO -- : LC_CTYPE = I, [2024-05-17T04:46:32.502235 #3307373] INFO -- : MFLAGS = I, [2024-05-17T04:46:32.502244 #3307373] INFO -- : RUSTC = no I, [2024-05-17T04:46:32.502254 #3307373] INFO -- : YJIT_RUSTC_ARGS = --crate-name=yjit --crate-type=staticlib --edition=2021 -g -C lto=thin -C opt-level=3 -C overflow-checks=on '--out-dir=/tmp/ruby/build/trunk/yjit/target/release/' /tmp/ruby/src/trunk/yjit/src/lib.rs I, [2024-05-17T04:46:32.502613 #3307373] INFO -- : gcc (Ubuntu 11.4.0-1ubuntu1~22.04) 11.4.0 I, [2024-05-17T04:46:32.502653 #3307373] INFO -- : Copyright (C) 2021 Free Software Foundation, Inc. I, [2024-05-17T04:46:32.502666 #3307373] INFO -- : This is free software; see the source for copying conditions. There is NO I, [2024-05-17T04:46:32.502685 #3307373] INFO -- : warranty; not even for MERCHANTABILITY or FITNESS FOR A PARTICULAR PURPOSE. I, [2024-05-17T04:46:32.502697 #3307373] INFO -- : I, [2024-05-17T04:46:32.606836 #3307373] INFO -- : Checking leaked global symbols...none I, [2024-05-17T04:46:32.649158 #3307373] INFO -- : /tmp/ruby/src/trunk/basictest/test.rb:assignment ....................................................................................................................................................................................................................................................................................................................................................................................OK 372 I, [2024-05-17T04:46:32.649237 #3307373] INFO -- : /tmp/ruby/src/trunk/basictest/test.rb:condition ..OK 2 I, [2024-05-17T04:46:32.649251 #3307373] INFO -- : /tmp/ruby/src/trunk/basictest/test.rb:if/unless ...OK 3 I, [2024-05-17T04:46:32.649263 #3307373] INFO -- : /tmp/ruby/src/trunk/basictest/test.rb:case .....OK 5 I, [2024-05-17T04:46:32.649411 #3307373] INFO -- : /tmp/ruby/src/trunk/basictest/test.rb:while/until ........OK 8 I, [2024-05-17T04:46:32.649460 #3307373] INFO -- : /tmp/ruby/src/trunk/basictest/test.rb:exception ..........OK 10 I, [2024-05-17T04:46:32.649725 #3307373] INFO -- : /tmp/ruby/src/trunk/basictest/test.rb:array .......................................OK 39 I, [2024-05-17T04:46:32.649823 #3307373] INFO -- : /tmp/ruby/src/trunk/basictest/test.rb:hash ...........................OK 27 I, [2024-05-17T04:46:32.650530 #3307373] INFO -- : /tmp/ruby/src/trunk/basictest/test.rb:iterator ...........................................................................................................OK 107 I, [2024-05-17T04:46:32.650803 #3307373] INFO -- : /tmp/ruby/src/trunk/basictest/test.rb:float ................................................................................OK 80 I, [2024-05-17T04:46:32.651793 #3307373] INFO -- : /tmp/ruby/src/trunk/basictest/test.rb:bignum ...............................OK 31 I, [2024-05-17T04:46:32.652551 #3307373] INFO -- : /tmp/ruby/src/trunk/basictest/test.rb:string & char ..............................................................OK 62 I, [2024-05-17T04:46:32.652588 #3307373] INFO -- : /tmp/ruby/src/trunk/basictest/test.rb:assignment ..........OK 10 I, [2024-05-17T04:46:32.652593 #3307373] INFO -- : /tmp/ruby/src/trunk/basictest/test.rb:call ......OK 6 I, [2024-05-17T04:46:32.652640 #3307373] INFO -- : /tmp/ruby/src/trunk/basictest/test.rb:proc .........OK 9 I, [2024-05-17T04:46:32.753129 #3307373] INFO -- : /tmp/ruby/src/trunk/basictest/test.rb:signal ..OK 2 I, [2024-05-17T04:46:32.754820 #3307373] INFO -- : /tmp/ruby/src/trunk/basictest/test.rb:eval ...........................OK 27 I, [2024-05-17T04:46:32.862062 #3307373] INFO -- : /tmp/ruby/src/trunk/basictest/test.rb:system ........OK 8 I, [2024-05-17T04:46:32.862123 #3307373] INFO -- : /tmp/ruby/src/trunk/basictest/test.rb:const .....OK 5 I, [2024-05-17T04:46:32.862130 #3307373] INFO -- : /tmp/ruby/src/trunk/basictest/test.rb:clone .....OK 5 I, [2024-05-17T04:46:32.862262 #3307373] INFO -- : /tmp/ruby/src/trunk/basictest/test.rb:marshal ....OK 4 I, [2024-05-17T04:46:32.863797 #3307373] INFO -- : /tmp/ruby/src/trunk/basictest/test.rb:pack ....OK 4 I, [2024-05-17T04:46:32.863826 #3307373] INFO -- : /tmp/ruby/src/trunk/basictest/test.rb:math ..OK 2 I, [2024-05-17T04:46:32.863832 #3307373] INFO -- : /tmp/ruby/src/trunk/basictest/test.rb:struct ......OK 6 I, [2024-05-17T04:46:32.863835 #3307373] INFO -- : /tmp/ruby/src/trunk/basictest/test.rb:variable ............OK 12 I, [2024-05-17T04:46:32.863839 #3307373] INFO -- : /tmp/ruby/src/trunk/basictest/test.rb:trace ...OK 3 I, [2024-05-17T04:46:32.863842 #3307373] INFO -- : /tmp/ruby/src/trunk/basictest/test.rb:defined? ............OK 12 I, [2024-05-17T04:46:32.863846 #3307373] INFO -- : /tmp/ruby/src/trunk/basictest/test.rb:alias ......OK 6 I, [2024-05-17T04:46:32.863849 #3307373] INFO -- : /tmp/ruby/src/trunk/basictest/test.rb:path .......................OK 23 I, [2024-05-17T04:46:32.896067 #3307373] INFO -- : /tmp/ruby/src/trunk/basictest/test.rb:gc ....OK 4 I, [2024-05-17T04:46:32.898527 #3307373] INFO -- : I, [2024-05-17T04:46:32.898556 #3307373] INFO -- : test succeeded I, [2024-05-17T04:46:32.899908 #3307373] INFO -- : $$$[end] "make yes-test-basic TESTS='-j20'" exit with 0. I, [2024-05-17T04:46:32.900003 #3307373] INFO -- : $$$[beg] make yes-test-all TESTOPTS='--stderr-on-failure' TESTS='-j20' I, [2024-05-17T04:46:32.986275 #3307373] INFO -- : BASERUBY = /usr/bin/ruby --disable=gems I, [2024-05-17T04:46:32.986310 #3307373] INFO -- : CC = gcc I, [2024-05-17T04:46:32.986315 #3307373] INFO -- : LD = ld I, [2024-05-17T04:46:32.986319 #3307373] INFO -- : LDSHARED = gcc -shared I, [2024-05-17T04:46:32.986323 #3307373] INFO -- : CFLAGS = -O3 -fno-fast-math -ggdb3 -Wall -Wextra -Wdeprecated-declarations -Wdiv-by-zero -Wduplicated-cond -Wimplicit-function-declaration -Wimplicit-int -Wpointer-arith -Wwrite-strings -Wold-style-definition -Wimplicit-fallthrough=0 -Wmissing-noreturn -Wno-cast-function-type -Wno-constant-logical-operand -Wno-long-long -Wno-missing-field-initializers -Wno-overlength-strings -Wno-packed-bitfield-compat -Wno-parentheses-equality -Wno-self-assign -Wno-tautological-compare -Wno-unused-parameter -Wno-unused-value -Wsuggest-attribute=format -Wsuggest-attribute=noreturn -Wunused-variable -Wmisleading-indentation -Wundef -fPIC I, [2024-05-17T04:46:32.986327 #3307373] INFO -- : XCFLAGS = -U_FORTIFY_SOURCE -D_FORTIFY_SOURCE=2 -fstack-protector-strong -fno-strict-overflow -fvisibility=hidden -fexcess-precision=standard -DRUBY_EXPORT -I. -I.ext/include/x86_64-linux -I/tmp/ruby/src/trunk/include -I/tmp/ruby/src/trunk -I/tmp/ruby/src/trunk/prism -I/tmp/ruby/src/trunk/enc/unicode/15.0.0 I, [2024-05-17T04:46:32.986330 #3307373] INFO -- : CPPFLAGS = I, [2024-05-17T04:46:32.986334 #3307373] INFO -- : DLDFLAGS = -Wl,--compress-debug-sections=zlib -Wl,-soname,libruby.so.3.4 -fstack-protector-strong I, [2024-05-17T04:46:32.986338 #3307373] INFO -- : SOLIBS = -lz -lrt -lrt -lgmp -ldl -lcrypt -lm -lpthread I, [2024-05-17T04:46:32.986341 #3307373] INFO -- : LANG = en_US.UTF-8 I, [2024-05-17T04:46:32.986345 #3307373] INFO -- : LC_ALL = I, [2024-05-17T04:46:32.986348 #3307373] INFO -- : LC_CTYPE = I, [2024-05-17T04:46:32.986352 #3307373] INFO -- : MFLAGS = I, [2024-05-17T04:46:32.986355 #3307373] INFO -- : RUSTC = no I, [2024-05-17T04:46:32.986360 #3307373] INFO -- : YJIT_RUSTC_ARGS = --crate-name=yjit --crate-type=staticlib --edition=2021 -g -C lto=thin -C opt-level=3 -C overflow-checks=on '--out-dir=/tmp/ruby/build/trunk/yjit/target/release/' /tmp/ruby/src/trunk/yjit/src/lib.rs I, [2024-05-17T04:46:32.987052 #3307373] INFO -- : gcc (Ubuntu 11.4.0-1ubuntu1~22.04) 11.4.0 I, [2024-05-17T04:46:32.987072 #3307373] INFO -- : Copyright (C) 2021 Free Software Foundation, Inc. I, [2024-05-17T04:46:32.987077 #3307373] INFO -- : This is free software; see the source for copying conditions. There is NO I, [2024-05-17T04:46:32.987081 #3307373] INFO -- : warranty; not even for MERCHANTABILITY or FITNESS FOR A PARTICULAR PURPOSE. I, [2024-05-17T04:46:32.987085 #3307373] INFO -- : I, [2024-05-17T04:46:32.988848 #3307373] INFO -- : generating enc.mk I, [2024-05-17T04:46:33.108642 #3307373] INFO -- : making enc I, [2024-05-17T04:46:33.125968 #3307373] INFO -- : make[1]: Entering directory '/tmp/ruby/build/trunk' I, [2024-05-17T04:46:33.125996 #3307373] INFO -- : make[1]: Nothing to be done for 'enc'. I, [2024-05-17T04:46:33.126003 #3307373] INFO -- : make[1]: Leaving directory '/tmp/ruby/build/trunk' I, [2024-05-17T04:46:33.126755 #3307373] INFO -- : making srcs under enc I, [2024-05-17T04:46:33.156238 #3307373] INFO -- : make[1]: Entering directory '/tmp/ruby/build/trunk' I, [2024-05-17T04:46:33.156260 #3307373] INFO -- : make[1]: Nothing to be done for 'srcs'. I, [2024-05-17T04:46:33.156265 #3307373] INFO -- : make[1]: Leaving directory '/tmp/ruby/build/trunk' I, [2024-05-17T04:46:33.157237 #3307373] INFO -- : generating transdb.h I, [2024-05-17T04:46:33.257207 #3307373] INFO -- : transdb.h unchanged I, [2024-05-17T04:46:33.258533 #3307373] INFO -- : making trans I, [2024-05-17T04:46:33.293106 #3307373] INFO -- : make[1]: Entering directory '/tmp/ruby/build/trunk' I, [2024-05-17T04:46:33.293126 #3307373] INFO -- : make[1]: Nothing to be done for 'trans'. I, [2024-05-17T04:46:33.293132 #3307373] INFO -- : make[1]: Leaving directory '/tmp/ruby/build/trunk' I, [2024-05-17T04:46:33.293893 #3307373] INFO -- : making encs I, [2024-05-17T04:46:33.331133 #3307373] INFO -- : make[1]: Entering directory '/tmp/ruby/build/trunk' I, [2024-05-17T04:46:33.331155 #3307373] INFO -- : make[1]: Nothing to be done for 'encs'. I, [2024-05-17T04:46:33.331160 #3307373] INFO -- : make[1]: Leaving directory '/tmp/ruby/build/trunk' I, [2024-05-17T04:46:33.332962 #3307373] INFO -- : generating makefiles ext/configure-ext.mk I, [2024-05-17T04:46:33.359546 #3307373] INFO -- : ext/configure-ext.mk updated I, [2024-05-17T04:46:33.361931 #3307373] INFO -- : make[1]: Entering directory '/tmp/ruby/build/trunk' I, [2024-05-17T04:46:34.708994 #3307373] INFO -- : make[1]: Leaving directory '/tmp/ruby/build/trunk' I, [2024-05-17T04:46:34.709753 #3307373] INFO -- : generating makefile exts.mk I, [2024-05-17T04:46:34.747974 #3307373] INFO -- : exts.mk unchanged I, [2024-05-17T04:46:34.752444 #3307373] INFO -- : make[1]: Entering directory '/tmp/ruby/build/trunk' I, [2024-05-17T04:46:35.074111 #3307373] INFO -- : make[2]: Entering directory '/tmp/ruby/build/trunk/ext/coverage' I, [2024-05-17T04:46:35.078823 #3307373] INFO -- : make[2]: Leaving directory '/tmp/ruby/build/trunk/ext/coverage' I, [2024-05-17T04:46:35.085301 #3307373] INFO -- : make[2]: Entering directory '/tmp/ruby/build/trunk/ext/date' I, [2024-05-17T04:46:35.090277 #3307373] INFO -- : make[2]: Leaving directory '/tmp/ruby/build/trunk/ext/date' I, [2024-05-17T04:46:35.093924 #3307373] INFO -- : make[2]: Entering directory '/tmp/ruby/build/trunk/ext/digest' I, [2024-05-17T04:46:35.102837 #3307373] INFO -- : make[2]: Leaving directory '/tmp/ruby/build/trunk/ext/digest' I, [2024-05-17T04:46:35.129037 #3307373] INFO -- : make[2]: Entering directory '/tmp/ruby/build/trunk/ext/digest/sha2' I, [2024-05-17T04:46:35.133919 #3307373] INFO -- : make[2]: Leaving directory '/tmp/ruby/build/trunk/ext/digest/sha2' I, [2024-05-17T04:46:35.155368 #3307373] INFO -- : make[2]: Entering directory '/tmp/ruby/build/trunk/ext/fiddle' I, [2024-05-17T04:46:35.165937 #3307373] INFO -- : make[2]: Leaving directory '/tmp/ruby/build/trunk/ext/fiddle' I, [2024-05-17T04:46:35.171065 #3307373] INFO -- : make[2]: Entering directory '/tmp/ruby/build/trunk/ext/io/console' I, [2024-05-17T04:46:35.175281 #3307373] INFO -- : make[2]: Leaving directory '/tmp/ruby/build/trunk/ext/io/console' I, [2024-05-17T04:46:35.188036 #3307373] INFO -- : make[2]: Entering directory '/tmp/ruby/build/trunk/ext/json' I, [2024-05-17T04:46:35.197526 #3307373] INFO -- : make[2]: Leaving directory '/tmp/ruby/build/trunk/ext/json' I, [2024-05-17T04:46:35.211634 #3307373] INFO -- : make[2]: Entering directory '/tmp/ruby/build/trunk/ext/monitor' I, [2024-05-17T04:46:35.215786 #3307373] INFO -- : make[2]: Leaving directory '/tmp/ruby/build/trunk/ext/monitor' I, [2024-05-17T04:46:35.222755 #3307373] INFO -- : make[2]: Entering directory '/tmp/ruby/build/trunk/ext/objspace' I, [2024-05-17T04:46:35.228748 #3307373] INFO -- : make[2]: Leaving directory '/tmp/ruby/build/trunk/ext/objspace' I, [2024-05-17T04:46:35.248023 #3307373] INFO -- : make[2]: Entering directory '/tmp/ruby/build/trunk/ext/openssl' I, [2024-05-17T04:46:35.262453 #3307373] INFO -- : make[2]: Leaving directory '/tmp/ruby/build/trunk/ext/openssl' I, [2024-05-17T04:46:35.265414 #3307373] INFO -- : make[2]: Entering directory '/tmp/ruby/build/trunk/ext/pathname' I, [2024-05-17T04:46:35.267892 #3307373] INFO -- : make[2]: Leaving directory '/tmp/ruby/build/trunk/ext/pathname' I, [2024-05-17T04:46:35.272632 #3307373] INFO -- : make[2]: Entering directory '/tmp/ruby/build/trunk/ext/psych' I, [2024-05-17T04:46:35.293290 #3307373] INFO -- : make[2]: Leaving directory '/tmp/ruby/build/trunk/ext/psych' I, [2024-05-17T04:46:35.297300 #3307373] INFO -- : make[2]: Entering directory '/tmp/ruby/build/trunk/ext/pty' I, [2024-05-17T04:46:35.300460 #3307373] INFO -- : make[2]: Leaving directory '/tmp/ruby/build/trunk/ext/pty' I, [2024-05-17T04:46:35.315263 #3307373] INFO -- : make[2]: Entering directory '/tmp/ruby/build/trunk/ext/ripper' I, [2024-05-17T04:46:35.321827 #3307373] INFO -- : make[2]: Leaving directory '/tmp/ruby/build/trunk/ext/ripper' I, [2024-05-17T04:46:35.324324 #3307373] INFO -- : make[2]: Entering directory '/tmp/ruby/build/trunk/ext/rubyvm' I, [2024-05-17T04:46:35.327586 #3307373] INFO -- : make[2]: Leaving directory '/tmp/ruby/build/trunk/ext/rubyvm' I, [2024-05-17T04:46:35.338465 #3307373] INFO -- : make[2]: Entering directory '/tmp/ruby/build/trunk/ext/socket' I, [2024-05-17T04:46:35.348351 #3307373] INFO -- : make[2]: Leaving directory '/tmp/ruby/build/trunk/ext/socket' I, [2024-05-17T04:46:35.366735 #3307373] INFO -- : make[2]: Entering directory '/tmp/ruby/build/trunk/.bundle/gems/bigdecimal-3.1.8/ext/bigdecimal' I, [2024-05-17T04:46:35.393134 #3307373] INFO -- : make[2]: Leaving directory '/tmp/ruby/build/trunk/.bundle/gems/bigdecimal-3.1.8/ext/bigdecimal' I, [2024-05-17T04:46:35.395133 #3307373] INFO -- : make[2]: Entering directory '/tmp/ruby/build/trunk/.bundle/gems/debug-1.9.2/ext/debug' I, [2024-05-17T04:46:35.417551 #3307373] INFO -- : make[2]: Leaving directory '/tmp/ruby/build/trunk/.bundle/gems/debug-1.9.2/ext/debug' I, [2024-05-17T04:46:35.419614 #3307373] INFO -- : make[2]: Entering directory '/tmp/ruby/build/trunk/.bundle/gems/nkf-0.2.0/ext/nkf' I, [2024-05-17T04:46:35.441844 #3307373] INFO -- : make[2]: Leaving directory '/tmp/ruby/build/trunk/.bundle/gems/nkf-0.2.0/ext/nkf' I, [2024-05-17T04:46:35.443847 #3307373] INFO -- : make[2]: Entering directory '/tmp/ruby/build/trunk/.bundle/gems/racc-1.7.3/ext/racc/cparse' I, [2024-05-17T04:46:35.465159 #3307373] INFO -- : make[2]: Leaving directory '/tmp/ruby/build/trunk/.bundle/gems/racc-1.7.3/ext/racc/cparse' I, [2024-05-17T04:46:35.467462 #3307373] INFO -- : make[2]: Entering directory '/tmp/ruby/build/trunk/.bundle/gems/rbs-3.4.4/ext/rbs_extension' I, [2024-05-17T04:46:35.488547 #3307373] INFO -- : make[2]: Leaving directory '/tmp/ruby/build/trunk/.bundle/gems/rbs-3.4.4/ext/rbs_extension' I, [2024-05-17T04:46:35.490444 #3307373] INFO -- : make[2]: Entering directory '/tmp/ruby/build/trunk/.bundle/gems/syslog-0.1.2/ext/syslog' I, [2024-05-17T04:46:35.511787 #3307373] INFO -- : make[2]: Leaving directory '/tmp/ruby/build/trunk/.bundle/gems/syslog-0.1.2/ext/syslog' I, [2024-05-17T04:46:35.536368 #3307373] INFO -- : make[2]: Entering directory '/tmp/ruby/build/trunk' I, [2024-05-17T04:46:35.603010 #3307373] INFO -- : make[2]: 'ruby' is up to date. I, [2024-05-17T04:46:35.603053 #3307373] INFO -- : make[2]: Leaving directory '/tmp/ruby/build/trunk' I, [2024-05-17T04:46:35.603313 #3307373] INFO -- : make[1]: Leaving directory '/tmp/ruby/build/trunk' I, [2024-05-17T04:46:35.607212 #3307373] INFO -- : make[1]: Entering directory '/tmp/ruby/build/trunk' I, [2024-05-17T04:46:35.607238 #3307373] INFO -- : make[1]: Nothing to be done for 'note'. I, [2024-05-17T04:46:35.607246 #3307373] INFO -- : make[1]: Leaving directory '/tmp/ruby/build/trunk' I, [2024-05-17T04:46:35.682112 #3307373] INFO -- : Run options: I, [2024-05-17T04:46:35.682169 #3307373] INFO -- : --seed=19766 I, [2024-05-17T04:46:35.682176 #3307373] INFO -- : "--ruby=./miniruby -I/tmp/ruby/src/trunk/lib -I. -I.ext/common /tmp/ruby/src/trunk/tool/runruby.rb --extout=.ext -- --disable-gems" I, [2024-05-17T04:46:35.682180 #3307373] INFO -- : --excludes-dir=/tmp/ruby/src/trunk/test/.excludes I, [2024-05-17T04:46:35.682184 #3307373] INFO -- : --name=!/memory_leak/ I, [2024-05-17T04:46:35.682188 #3307373] INFO -- : --stderr-on-failure I, [2024-05-17T04:46:35.682191 #3307373] INFO -- : -j20 I, [2024-05-17T04:46:35.682195 #3307373] INFO -- : I, [2024-05-17T04:46:35.682199 #3307373] INFO -- : # Running tests: I, [2024-05-17T04:46:35.682203 #3307373] INFO -- : I, [2024-05-17T04:46:35.832562 #3307373] INFO -- : [ 1/885] 3348748=test_beginendblock I, [2024-05-17T04:46:35.832624 #3307373] INFO -- : [ 2/885] 3348737=test_files_lib I, [2024-05-17T04:46:35.832634 #3307373] INFO -- : [ 3/885] 3348738=test_gem_commands_unpack_command I, [2024-05-17T04:46:35.833751 #3307373] INFO -- : [ 4/885] 3348735=test_rdoc_markup_to_bs I, [2024-05-17T04:46:35.834267 #3307373] INFO -- : [ 5/885] 3348749=test_help I, [2024-05-17T04:46:35.834292 #3307373] INFO -- : [ 6/885] 3348751=test_within_pipe I, [2024-05-17T04:46:35.835709 #3307373] INFO -- : [ 7/885] 3348750=test_emoji_breaks I, [2024-05-17T04:46:35.835814 #3307373] INFO -- : [ 8/885] 3348747=test_gem_bundler_version_finder I, [2024-05-17T04:46:35.836487 #3307373] INFO -- : [ 9/885] 3348752=reflection_test I, [2024-05-17T04:46:35.837870 #3307373] INFO -- : [ 10/885] 3348733=test_pinned I, [2024-05-17T04:46:35.839324 #3307373] INFO -- : [ 11/885] 3348734=test_rdoc_markup_pre_process I, [2024-05-17T04:46:35.846321 #3307373] INFO -- : [ 12/885] 3348750=test_printf I, [2024-05-17T04:46:35.846995 #3307373] INFO -- : [ 13/885] 3348749=test_stream I, [2024-05-17T04:46:35.847106 #3307373] INFO -- : [ 14/885] 3348736=test_to_ary_concat I, [2024-05-17T04:46:35.854456 #3307373] INFO -- : [ 15/885] 3348733=test_webauthn_listener_response I, [2024-05-17T04:46:35.857845 #3307373] INFO -- : [ 16/885] 3348750=test_time I, [2024-05-17T04:46:35.864971 #3307373] INFO -- : [ 17/885] 3348746=test_recursion I, [2024-05-17T04:46:35.865044 #3307373] INFO -- : [ 18/885] 3348741=test_exit I, [2024-05-17T04:46:35.865061 #3307373] INFO -- : [ 19/885] 3348739=test_popen_deadlock I, [2024-05-17T04:46:35.865115 #3307373] INFO -- : [ 20/885] 3348740=test_delegate I, [2024-05-17T04:46:35.865296 #3307373] INFO -- : [ 21/885] 3348745=test_mkmf I, [2024-05-17T04:46:35.865399 #3307373] INFO -- : [ 22/885] 3348743=test_date_marshal I, [2024-05-17T04:46:35.865913 #3307373] INFO -- : [ 23/885] 3348744=test_history I, [2024-05-17T04:46:35.873918 #3307373] INFO -- : [ 24/885] 3348742=test_open3 I, [2024-05-17T04:46:35.877010 #3307373] INFO -- : [ 25/885] 3348743=test_multi_irb_commands I, [2024-05-17T04:46:35.880536 #3307373] INFO -- : [ 26/885] 3348746=test_fiber I, [2024-05-17T04:46:35.885921 #3307373] INFO -- : [ 27/885] 3348740=test_bundled_ca I, [2024-05-17T04:46:35.890708 #3307373] INFO -- : [ 28/885] 3348743=test_closure I, [2024-05-17T04:46:35.896480 #3307373] INFO -- : [ 29/885] 3348749=test_digest I, [2024-05-17T04:46:35.913881 #3307373] INFO -- : [ 30/885] 3348752=test_gem_security I, [2024-05-17T04:46:35.918987 #3307373] INFO -- : [ 31/885] 3348745=test_rdoc_servlet I, [2024-05-17T04:46:35.922318 #3307373] INFO -- : [ 32/885] 3348751=test_ractor I, [2024-05-17T04:46:35.943552 #3307373] INFO -- : [ 33/885] 3348749=test_case_comprehensive I, [2024-05-17T04:46:35.994056 #3307373] INFO -- : [ 34/885] 3348743=test_interned_str I, [2024-05-17T04:46:35.994775 #3307373] INFO -- : [ 35/885] 3348735=test_gem_commands_build_command I, [2024-05-17T04:46:35.995850 #3307373] INFO -- : [ 36/885] 3348743=test_option I, [2024-05-17T04:46:36.002877 #3307373] INFO -- : [ 37/885] 3348751=test_append I, [2024-05-17T04:46:36.006619 #3307373] INFO -- : [ 38/885] 3348751=test_tracer I, [2024-05-17T04:46:36.028907 #3307373] INFO -- : [ 39/885] 3348733=test_cmethod I, [2024-05-17T04:46:36.031661 #3307373] INFO -- : [ 40/885] 3348733=test_did_you_mean I, [2024-05-17T04:46:36.050854 #3307373] INFO -- : [ 41/885] 3348734=test_io_m17n I, [2024-05-17T04:46:36.050917 #3307373] INFO -- : [ 42/885] 3348744=test_variable_name_check I, [2024-05-17T04:46:36.056772 #3307373] INFO -- : [ 43/885] 3348747=test_gem_commands_server_command I, [2024-05-17T04:46:36.057935 #3307373] INFO -- : [ 44/885] 3348747=test_exception_at_throwing I, [2024-05-17T04:46:36.074562 #3307373] INFO -- : [ 45/885] 3348751=test_iseq I, [2024-05-17T04:46:36.091169 #3307373] INFO -- : [ 46/885] 3348744=test_rdoc_markup_heading I, [2024-05-17T04:46:36.096204 #3307373] INFO -- : [ 47/885] 3348750=test_scheduler I, [2024-05-17T04:46:36.146716 #3307373] INFO -- : [ 48/885] 3348747=test_ocsp I, [2024-05-17T04:46:36.149049 #3307373] INFO -- : [ 49/885] 3348743=test_class I, [2024-05-17T04:46:36.162331 #3307373] INFO -- : [ 50/885] 3348743=test_pkey_dsa I, [2024-05-17T04:46:36.168875 #3307373] INFO -- : [ 51/885] 3348733=test_terminfo I, [2024-05-17T04:46:36.172123 #3307373] INFO -- : [ 52/885] 3348741=test_compile_prism I, [2024-05-17T04:46:36.222792 #3307373] INFO -- : [ 53/885] 3348733=test_bug-14834 I, [2024-05-17T04:46:36.223096 #3307373] INFO -- : [ 54/885] 3348748=test_rdoc_markup_to_html I, [2024-05-17T04:46:36.225729 #3307373] INFO -- : [ 55/885] 3348744=test_date_compat I, [2024-05-17T04:46:36.226439 #3307373] INFO -- : [ 56/885] 3348744=test_tree_spell_checker I, [2024-05-17T04:46:36.234197 #3307373] INFO -- : [ 57/885] 3348736=test_http I, [2024-05-17T04:46:36.251541 #3307373] INFO -- : [ 58/885] 3348750=test_addrinfo I, [2024-05-17T04:46:36.268579 #3307373] INFO -- : [ 59/885] 3348744=test_win32ole_param_event I, [2024-05-17T04:46:36.270459 #3307373] INFO -- : [ 60/885] 3348744=test_bn I, [2024-05-17T04:46:36.290932 #3307373] INFO -- : [ 61/885] 3348745=redundant_return_test I, [2024-05-17T04:46:36.306171 #3307373] INFO -- : [ 62/885] 3348733=test_case_mapping I, [2024-05-17T04:46:36.309179 #3307373] INFO -- : [ 63/885] 3348738=test_path I, [2024-05-17T04:46:36.314020 #3307373] INFO -- : [ 64/885] 3348733=test_rdoc_generator_pot I, [2024-05-17T04:46:36.316999 #3307373] INFO -- : [ 65/885] 3348738=test_unicode I, [2024-05-17T04:46:36.328577 #3307373] INFO -- : [ 66/885] 3348744=test_enumerator I, [2024-05-17T04:46:36.332675 #3307373] INFO -- : [ 67/885] 3348750=test_rdoc_parser_changelog I, [2024-05-17T04:46:36.337053 #3307373] INFO -- : [ 68/885] 3348744=parameters_signature_test I, [2024-05-17T04:46:36.369915 #3307373] INFO -- : [ 69/885] 3348745=test_koi8 I, [2024-05-17T04:46:36.375161 #3307373] INFO -- : [ 70/885] 3348745=test_rdoc_method_attr I, [2024-05-17T04:46:36.381538 #3307373] INFO -- : [ 71/885] 3348738=test_data I, [2024-05-17T04:46:36.384157 #3307373] INFO -- : [ 72/885] 3348738=static_literals_test I, [2024-05-17T04:46:36.396976 #3307373] INFO -- : [ 73/885] 3348735=test_filter I, [2024-05-17T04:46:36.417634 #3307373] INFO -- : [ 74/885] 3348744=test_gem_gem_runner I, [2024-05-17T04:46:36.437880 #3307373] INFO -- : [ 75/885] 3348735=test_gem_resolver_vendor_specification I, [2024-05-17T04:46:36.448136 #3307373] INFO -- : [ 76/885] 3348748=test_gem_commands_update_command I, [2024-05-17T04:46:36.459275 #3307373] INFO -- : [ 77/885] 3348735=test_notimplement I, [2024-05-17T04:46:36.459905 #3307373] INFO -- : [ 78/885] 3348738=test_random I, [2024-05-17T04:46:36.462152 #3307373] INFO -- : [ 79/885] 3348735=test_gem_uri I, [2024-05-17T04:46:36.465929 #3307373] INFO -- : [ 80/885] 3348747=test_key_event_record I, [2024-05-17T04:46:36.466817 #3307373] INFO -- : [ 81/885] 3348738=test_ssl_session I, [2024-05-17T04:46:36.479507 #3307373] INFO -- : [ 82/885] 3348733=test_thread_cv I, [2024-05-17T04:46:36.483672 #3307373] INFO -- : [ 83/885] 3348735=test_lexer I, [2024-05-17T04:46:36.490572 #3307373] INFO -- : [ 84/885] 3348741=test_rbconfig I, [2024-05-17T04:46:36.491643 #3307373] INFO -- : [ 85/885] 3348735=test_primitive I, [2024-05-17T04:46:36.494338 #3307373] INFO -- : [ 86/885] 3348741=test_human_typo I, [2024-05-17T04:46:36.498229 #3307373] INFO -- : [ 87/885] 3348735=test_rdoc_i18n_locale I, [2024-05-17T04:46:36.500847 #3307373] INFO -- : [ 88/885] 3348745=test_chilled I, [2024-05-17T04:46:36.501429 #3307373] INFO -- : [ 89/885] 3348735=test_name_error_extension I, [2024-05-17T04:46:36.502065 #3307373] INFO -- : [ 90/885] 3348741=test_acceptable I, [2024-05-17T04:46:36.504501 #3307373] INFO -- : [ 91/885] 3348745=test_rdoc_generator_pot_po_entry I, [2024-05-17T04:46:36.506592 #3307373] INFO -- : [ 92/885] 3348735=test_euc_jp I, [2024-05-17T04:46:36.508610 #3307373] INFO -- : [ 93/885] 3348735=test_document I, [2024-05-17T04:46:36.508928 #3307373] INFO -- : [ 94/885] 3348745=test_pair I, [2024-05-17T04:46:36.514152 #3307373] INFO -- : [ 95/885] 3348735=test_win32ole_param I, [2024-05-17T04:46:36.515145 #3307373] INFO -- : [ 96/885] 3348735=test_gem_commands_yank_command I, [2024-05-17T04:46:36.515172 #3307373] INFO -- : [ 97/885] 3348747=test_sockopt I, [2024-05-17T04:46:36.517645 #3307373] INFO -- : [ 98/885] 3348747=test_rdoc_markup_to_label I, [2024-05-17T04:46:36.546102 #3307373] INFO -- : [ 99/885] 3348739=test_install I, [2024-05-17T04:46:36.582322 #3307373] INFO -- : [100/885] 3348750=test_rdoc_ri_driver I, [2024-05-17T04:46:36.615846 #3307373] INFO -- : [101/885] 3348741=test_httpheader I, [2024-05-17T04:46:36.634161 #3307373] INFO -- : [102/885] 3348747=test_gem_resolver_local_specification I, [2024-05-17T04:46:36.654023 #3307373] INFO -- : [103/885] 3348744=test_set_len I, [2024-05-17T04:46:36.656858 #3307373] INFO -- : [104/885] 3348741=test_encoding I, [2024-05-17T04:46:36.658832 #3307373] INFO -- : [105/885] 3348744=test_httpresponses I, [2024-05-17T04:46:36.679825 #3307373] INFO -- : [106/885] 3348747=test_key_stroke I, [2024-05-17T04:46:36.682941 #3307373] INFO -- : [107/885] 3348741=json_encoding_test I, [2024-05-17T04:46:36.686335 #3307373] INFO -- : [108/885] 3348747=test_color I, [2024-05-17T04:46:36.699969 #3307373] INFO -- : [109/885] 3348741=test_array I, [2024-05-17T04:46:36.708392 #3307373] INFO -- : [110/885] 3348751=test_gem_package_tar_writer I, [2024-05-17T04:46:36.712275 #3307373] INFO -- : [111/885] 3348744=test_helper_method I, [2024-05-17T04:46:36.721120 #3307373] INFO -- : [112/885] 3348744=test_gem_commands_outdated_command I, [2024-05-17T04:46:36.732874 #3307373] INFO -- : [113/885] 3348747=test_scalar_scanner I, [2024-05-17T04:46:36.737691 #3307373] INFO -- : [114/885] 3348747=test_gem_source I, [2024-05-17T04:46:36.762431 #3307373] INFO -- : [115/885] 3348744=test_nesting_parser I, [2024-05-17T04:46:36.768039 #3307373] INFO -- : [116/885] 3348739=test_win32ole_method_event I, [2024-05-17T04:46:36.770688 #3307373] INFO -- : [117/885] 3348739=test_benchmark I, [2024-05-17T04:46:36.772683 #3307373] INFO -- : [118/885] 3348744=test_gem_dependency_list I, [2024-05-17T04:46:36.810939 #3307373] INFO -- : [119/885] 3348744=test_evaluation I, [2024-05-17T04:46:36.818133 #3307373] INFO -- : [120/885] 3348744=test_gem_ext_builder I, [2024-05-17T04:46:36.891817 #3307373] INFO -- : [121/885] 3348750=test_https I, [2024-05-17T04:46:36.905142 #3307373] INFO -- : [122/885] 3348747=test_load I, [2024-05-17T04:46:36.913746 #3307373] INFO -- : [123/885] 3348747=test_gem_commands_rebuild_command I, [2024-05-17T04:46:36.946504 #3307373] INFO -- : [124/885] 3348747=test_yamldbm I, [2024-05-17T04:46:36.955026 #3307373] INFO -- : [125/885] 3348747=test_rdoc_parser_simple I, [2024-05-17T04:46:36.980046 #3307373] INFO -- : [126/885] 3348747=test_provider I, [2024-05-17T04:46:36.983872 #3307373] INFO -- : [127/885] 3348735=test_abi I, [2024-05-17T04:46:37.004452 #3307373] INFO -- : [128/885] 3348751=test_gem_commands_cert_command I, [2024-05-17T04:46:37.115875 #3307373] INFO -- : [129/885] 3348733=test_completion I, [2024-05-17T04:46:37.144505 #3307373] INFO -- : [130/885] 3348735=test_yield_block I, [2024-05-17T04:46:37.148616 #3307373] INFO -- : [131/885] 3348735=test_len I, [2024-05-17T04:46:37.153951 #3307373] INFO -- : [132/885] 3348735=test_gem_source_installed I, [2024-05-17T04:46:37.164484 #3307373] INFO -- : [133/885] 3348740=test_x509ext I, [2024-05-17T04:46:37.167315 #3307373] INFO -- : [134/885] 3348735=test_erb I, [2024-05-17T04:46:37.173121 #3307373] INFO -- : [135/885] 3348740=test_spell_checker I, [2024-05-17T04:46:37.177470 #3307373] INFO -- : [136/885] 3348740=test_propertyputref I, [2024-05-17T04:46:37.180876 #3307373] INFO -- : [137/885] 3348740=attribute_write_test I, [2024-05-17T04:46:37.229759 #3307373] INFO -- : [138/885] 3348735=test_assembler I, [2024-05-17T04:46:37.232359 #3307373] INFO -- : [139/885] 3348735=test_rational2 I, [2024-05-17T04:46:37.242830 #3307373] INFO -- : [140/885] 3348747=test_rational I, [2024-05-17T04:46:37.248662 #3307373] INFO -- : [141/885] 3348735=test_gem_request_set I, [2024-05-17T04:46:37.256128 #3307373] INFO -- : [142/885] 3348747=test_module I, [2024-05-17T04:46:37.258346 #3307373] INFO -- : [143/885] 3348740=test_gem_ext_cargo_builder I, [2024-05-17T04:46:37.282940 #3307373] INFO -- : [144/885] 3348740=test_ssl I, [2024-05-17T04:46:37.312019 #3307373] INFO -- : [145/885] 3348750=constant_path_node_test I, [2024-05-17T04:46:37.323241 #3307373] INFO -- : [146/885] 3348734=test_parser I, [2024-05-17T04:46:37.360589 #3307373] INFO -- : [147/885] 3348734=test_arith_seq_extract I, [2024-05-17T04:46:37.405585 #3307373] INFO -- : [148/885] 3348750=test_method_name_check I, [2024-05-17T04:46:37.418498 #3307373] INFO -- : [149/885] 3348750=test_rdoc_generator_markup I, [2024-05-17T04:46:37.432554 #3307373] INFO -- : [150/885] 3348750=test_whileuntil I, [2024-05-17T04:46:37.436668 #3307373] INFO -- : [151/885] 3348750=test_buffered_io I, [2024-05-17T04:46:37.437485 #3307373] INFO -- : [152/885] 3348750=test_monitor I, [2024-05-17T04:46:37.449350 #3307373] INFO -- : [153/885] 3348738=test_rubyvm I, [2024-05-17T04:46:37.451305 #3307373] INFO -- : [154/885] 3348738=test_configuration I, [2024-05-17T04:46:37.518749 #3307373] INFO -- : [155/885] 3348734=test_stringify_symbols I, [2024-05-17T04:46:37.534998 #3307373] INFO -- : [156/885] 3348734=test_instrumentation_api I, [2024-05-17T04:46:37.580226 #3307373] INFO -- : [157/885] 3348738=integer_parse_test I, [2024-05-17T04:46:37.584740 #3307373] INFO -- : [158/885] 3348738=test_boolean I, [2024-05-17T04:46:37.587248 #3307373] INFO -- : [159/885] 3348735=test_config I, [2024-05-17T04:46:37.589698 #3307373] INFO -- : [160/885] 3348738=test_nomethod_error I, [2024-05-17T04:46:37.594896 #3307373] INFO -- : [161/885] 3348738=json_parser_test I, [2024-05-17T04:46:37.615400 #3307373] INFO -- : [162/885] 3348733=memsize_test I, [2024-05-17T04:46:37.621109 #3307373] INFO -- : [163/885] 3348735=json_common_interface_test I, [2024-05-17T04:46:37.629410 #3307373] INFO -- : [164/885] 3348735=test_dln I, [2024-05-17T04:46:37.631036 #3307373] INFO -- : [165/885] 3348735=test_gem_source_subpath_problem I, [2024-05-17T04:46:37.648051 #3307373] INFO -- : [166/885] 3348738=test_win32ole_variant_outarg I, [2024-05-17T04:46:37.651890 #3307373] INFO -- : [167/885] 3348738=test_variable I, [2024-05-17T04:46:37.657987 #3307373] INFO -- : [168/885] 3348750=fuzzer_test I, [2024-05-17T04:46:37.666425 #3307373] INFO -- : [169/885] 3348750=test_sexp I, [2024-05-17T04:46:37.678154 #3307373] INFO -- : [170/885] 3348733=test_rdoc_markup_include I, [2024-05-17T04:46:37.681760 #3307373] INFO -- : [171/885] 3348733=test_rdoc_markup_to_html_snippet I, [2024-05-17T04:46:37.694404 #3307373] INFO -- : [172/885] 3348750=magic_comment_test I, [2024-05-17T04:46:37.701382 #3307373] INFO -- : [173/885] 3348750=test_struct I, [2024-05-17T04:46:37.727042 #3307373] INFO -- : [174/885] 3348750=test_cparser I, [2024-05-17T04:46:37.732174 #3307373] INFO -- : [175/885] 3348738=test_pkg_config I, [2024-05-17T04:46:37.734514 #3307373] INFO -- : [176/885] 3348735=test_color_printer I, [2024-05-17T04:46:37.748510 #3307373] INFO -- : [177/885] 3348738=test_deprecated I, [2024-05-17T04:46:37.750634 #3307373] INFO -- : [178/885] 3348738=test_insns_leaf I, [2024-05-17T04:46:37.755623 #3307373] INFO -- : [179/885] 3348738=test_serialize_subclasses I, [2024-05-17T04:46:37.757606 #3307373] INFO -- : [180/885] 3348733=test_key_error I, [2024-05-17T04:46:37.758091 #3307373] INFO -- : [181/885] 3348744=test_win32ole_variant_m I, [2024-05-17T04:46:37.759609 #3307373] INFO -- : [182/885] 3348738=test_engine I, [2024-05-17T04:46:37.760087 #3307373] INFO -- : [183/885] 3348738=test_allocation I, [2024-05-17T04:46:37.764063 #3307373] INFO -- : [184/885] 3348733=test_div I, [2024-05-17T04:46:37.764274 #3307373] INFO -- : [185/885] 3348744=test_rdoc_rd_inline I, [2024-05-17T04:46:37.768522 #3307373] INFO -- : [186/885] 3348733=test_x509req I, [2024-05-17T04:46:37.770894 #3307373] INFO -- : [187/885] 3348744=test_mutex I, [2024-05-17T04:46:37.794439 #3307373] INFO -- : [188/885] 3348735=test_struct I, [2024-05-17T04:46:37.803708 #3307373] INFO -- : [189/885] 3348748=test_gem_path_support I, [2024-05-17T04:46:37.812995 #3307373] INFO -- : [190/885] 3348743=test_set I, [2024-05-17T04:46:37.819478 #3307373] INFO -- : [191/885] 3348748=test_files_test_1 I, [2024-05-17T04:46:37.851133 #3307373] INFO -- : [192/885] 3348743=test_gem_resolver_installer_set I, [2024-05-17T04:46:37.927277 #3307373] INFO -- : [193/885] 3348739=test_dir_m17n I, [2024-05-17T04:46:37.963518 #3307373] INFO -- : [194/885] 3348733=test_gem_source_git I, [2024-05-17T04:46:38.225511 #3307373] INFO -- : [195/885] 3348750=test_regex_casefold I, [2024-05-17T04:46:38.245658 #3307373] INFO -- : [196/885] 3348743=test_refinement I, [2024-05-17T04:46:38.263400 #3307373] INFO -- : [197/885] 3348742=test_gem_commands_signout_command I, [2024-05-17T04:46:38.348213 #3307373] INFO -- : [198/885] 3348735=test_require I, [2024-05-17T04:46:38.413441 #3307373] INFO -- : [199/885] 3348733=test_cgi_cookie I, [2024-05-17T04:46:38.421144 #3307373] INFO -- : [200/885] 3348733=test_float I, [2024-05-17T04:46:38.469602 #3307373] INFO -- : [201/885] 3348742=test_windows_1252 I, [2024-05-17T04:46:38.471867 #3307373] INFO -- : [202/885] 3348742=test_input_method I, [2024-05-17T04:46:38.592740 #3307373] INFO -- : [203/885] 3348750=test_process I, [2024-05-17T04:46:38.616811 #3307373] INFO -- : [204/885] 3348750=test_x509crl I, [2024-05-17T04:46:38.735110 #3307373] INFO -- : [205/885] 3348750=test_signal I, [2024-05-17T04:46:38.752358 #3307373] INFO -- : [206/885] 3348737=test_fixnum I, [2024-05-17T04:46:38.761848 #3307373] INFO -- : [207/885] 3348737=test_rdoc_top_level I, [2024-05-17T04:46:38.788439 #3307373] INFO -- : [208/885] 3348742=test_metaclass I, [2024-05-17T04:46:38.796165 #3307373] INFO -- : [209/885] 3348742=test_cgi_session I, [2024-05-17T04:46:38.809776 #3307373] INFO -- : [210/885] 3348742=test_rdoc_rd I, [2024-05-17T04:46:38.847476 #3307373] INFO -- : [211/885] 3348742=test_shellwords I, [2024-05-17T04:46:38.851707 #3307373] INFO -- : [212/885] 3348742=test_memory_view I, [2024-05-17T04:46:38.874583 #3307373] INFO -- : [213/885] 3348742=pattern_test I, [2024-05-17T04:46:38.894736 #3307373] INFO -- : [214/885] 3348744=test_debug I, [2024-05-17T04:46:38.899741 #3307373] INFO -- : [215/885] 3348744=test_omap I, [2024-05-17T04:46:38.912285 #3307373] INFO -- : [216/885] 3348744=test_string I, [2024-05-17T04:46:38.914576 #3307373] INFO -- : [217/885] 3348744=test_iterator I, [2024-05-17T04:46:38.972348 #3307373] INFO -- : [218/885] 3348747=test_digest_extend I, [2024-05-17T04:46:38.983901 #3307373] INFO -- : [219/885] 3348742=test_storage I, [2024-05-17T04:46:38.986350 #3307373] INFO -- : [220/885] 3348752=test_gem_resolver_git_set I, [2024-05-17T04:46:38.989274 #3307373] INFO -- : [221/885] 3348742=test_gem_security_signer I, [2024-05-17T04:46:39.000079 #3307373] INFO -- : [222/885] 3348747=test_cipher I, [2024-05-17T04:46:39.019639 #3307373] INFO -- : [223/885] 3348744=test_new I, [2024-05-17T04:46:39.023391 #3307373] INFO -- : [224/885] 3348744=test_cgi_core I, [2024-05-17T04:46:39.039422 #3307373] INFO -- : [225/885] 3348744=test_parser I, [2024-05-17T04:46:39.041845 #3307373] INFO -- : [226/885] 3348737=test_registry I, [2024-05-17T04:46:39.043344 #3307373] INFO -- : [227/885] 3348737=parse_stream_test I, [2024-05-17T04:46:39.048224 #3307373] INFO -- : [228/885] 3348747=test_gem I, [2024-05-17T04:46:39.053705 #3307373] INFO -- : [229/885] 3348744=test_gem_source_lock I, [2024-05-17T04:46:39.078840 #3307373] INFO -- : [230/885] 3348739=test_ractor I, [2024-05-17T04:46:39.084805 #3307373] INFO -- : [231/885] 3348737=test_dns I, [2024-05-17T04:46:39.093779 #3307373] INFO -- : [232/885] 3348739=test_gem_commands_open_command I, [2024-05-17T04:46:39.105220 #3307373] INFO -- : [233/885] 3348744=test_ssl I, [2024-05-17T04:46:39.105651 #3307373] INFO -- : [234/885] 3348742=test_rendering I, [2024-05-17T04:46:39.119477 #3307373] INFO -- : [235/885] 3348742=test_debugger_integration I, [2024-05-17T04:46:39.137549 #3307373] INFO -- : [236/885] 3348742=test_my_integer I, [2024-05-17T04:46:39.146510 #3307373] INFO -- : [237/885] 3348742=json_ext_parser_test I, [2024-05-17T04:46:39.151024 #3307373] INFO -- : [238/885] 3348742=test_thread I, [2024-05-17T04:46:39.261850 #3307373] INFO -- : [239/885] 3348751=test_ractor I, [2024-05-17T04:46:39.276805 #3307373] INFO -- : [240/885] 3348739=test_timeout I, [2024-05-17T04:46:39.280891 #3307373] INFO -- : [241/885] 3348752=test_alias I, [2024-05-17T04:46:39.408627 #3307373] INFO -- : [242/885] 3348752=test_weakref I, [2024-05-17T04:46:39.521783 #3307373] INFO -- : [243/885] 3348751=test_nonblock I, [2024-05-17T04:46:39.535515 #3307373] INFO -- : [244/885] 3348751=test_marshal I, [2024-05-17T04:46:39.537562 #3307373] INFO -- : [245/885] 3348752=test_unicode_normalize I, [2024-05-17T04:46:39.561331 #3307373] INFO -- : [246/885] 3348744=test_reline_key I, [2024-05-17T04:46:39.564147 #3307373] INFO -- : [247/885] 3348737=test_rb_str_dup I, [2024-05-17T04:46:39.568280 #3307373] INFO -- : [248/885] 3348737=test_ancdata I, [2024-05-17T04:46:39.570091 #3307373] INFO -- : [249/885] 3348744=test_singleton_function I, [2024-05-17T04:46:39.570697 #3307373] INFO -- : [250/885] 3348744=test_rubyoptions I, [2024-05-17T04:46:39.573602 #3307373] INFO -- : [251/885] 3348737=test_super I, [2024-05-17T04:46:39.577979 #3307373] INFO -- : [252/885] 3348741=test_integer I, [2024-05-17T04:46:39.740949 #3307373] INFO -- : [253/885] 3348733=test_cgi_modruby I, [2024-05-17T04:46:39.747168 #3307373] INFO -- : [254/885] 3348733=test_rubygems I, [2024-05-17T04:46:39.821200 #3307373] INFO -- : [255/885] 3348738=test_call I, [2024-05-17T04:46:39.871576 #3307373] INFO -- : [256/885] 3348751=test_https_proxy I, [2024-05-17T04:46:39.908354 #3307373] INFO -- : [257/885] 3348751=test_have_func I, [2024-05-17T04:46:39.924156 #3307373] INFO -- : [258/885] 3348737=test_gem_request_set_lockfile_tokenizer I, [2024-05-17T04:46:39.926317 #3307373] INFO -- : [259/885] 3348733=test_stat I, [2024-05-17T04:46:39.934245 #3307373] INFO -- : [260/885] 3348733=test_capacity I, [2024-05-17T04:46:39.935761 #3307373] INFO -- : [261/885] 3348733=test_nextafter I, [2024-05-17T04:46:39.946423 #3307373] INFO -- : [262/885] 3348745=test_usrmarshal I, [2024-05-17T04:46:39.947839 #3307373] INFO -- : [263/885] 3348739=test_object_references I, [2024-05-17T04:46:39.976166 #3307373] INFO -- : [264/885] 3348739=test_gem_resolver_git_specification I, [2024-05-17T04:46:39.979421 #3307373] INFO -- : [265/885] 3348738=test_env I, [2024-05-17T04:46:40.028262 #3307373] INFO -- : [266/885] 3348733=test_rdoc_attr I, [2024-05-17T04:46:40.037875 #3307373] INFO -- : [267/885] 3348733=test_dryrun I, [2024-05-17T04:46:40.055608 #3307373] INFO -- : [268/885] 3348733=test_integer I, [2024-05-17T04:46:40.106849 #3307373] INFO -- : [269/885] 3348737=desugar_compiler_test I, [2024-05-17T04:46:40.122386 #3307373] INFO -- : [270/885] 3348737=test_gem_commands_setup_command I, [2024-05-17T04:46:40.129102 #3307373] INFO -- : [271/885] 3348745=test_date_ractor I, [2024-05-17T04:46:40.132214 #3307373] INFO -- : [272/885] 3348733=test_gem_console_ui I, [2024-05-17T04:46:40.140365 #3307373] INFO -- : [273/885] 3348733=test_dir I, [2024-05-17T04:46:40.206551 #3307373] INFO -- : [274/885] 3348739=format_errors_test I, [2024-05-17T04:46:40.258553 #3307373] INFO -- : [275/885] 3348748=test_autoconf I, [2024-05-17T04:46:40.263741 #3307373] INFO -- : [276/885] 3348748=test_eval I, [2024-05-17T04:46:40.266315 #3307373] INFO -- : [277/885] 3348748=test_ractor_compatibility I, [2024-05-17T04:46:40.299476 #3307373] INFO -- : [278/885] 3348739=test_member I, [2024-05-17T04:46:40.302627 #3307373] INFO -- : [279/885] 3348739=test_numeric I, [2024-05-17T04:46:40.314586 #3307373] INFO -- : [280/885] 3348739=test_cgi_multipart I, [2024-05-17T04:46:40.394612 #3307373] INFO -- : [281/885] 3348733=test_gem_commands_cleanup_command I, [2024-05-17T04:46:40.412805 #3307373] INFO -- : [282/885] 3348745=test_word I, [2024-05-17T04:46:40.415075 #3307373] INFO -- : [283/885] 3348745=test_rdoc_comment I, [2024-05-17T04:46:40.453398 #3307373] INFO -- : [284/885] 3348745=test_error_highlight I, [2024-05-17T04:46:40.479734 #3307373] INFO -- : [285/885] 3348739=test_resize I, [2024-05-17T04:46:40.483947 #3307373] INFO -- : [286/885] 3348739=test_rdoc_generator_darkfish I, [2024-05-17T04:46:40.511358 #3307373] INFO -- : [287/885] 3348734=test_http_request I, [2024-05-17T04:46:40.530028 #3307373] INFO -- : [288/885] 3348737=test_gem_source_fetch_problem I, [2024-05-17T04:46:40.533822 #3307373] INFO -- : [289/885] 3348737=json_generic_object_test I, [2024-05-17T04:46:40.548215 #3307373] INFO -- : [290/885] 3348737=location_test I, [2024-05-17T04:46:40.550519 #3307373] INFO -- : [291/885] 3348748=test_symbol I, [2024-05-17T04:46:40.559182 #3307373] INFO -- : [292/885] 3348748=test_coderange I, [2024-05-17T04:46:40.559946 #3307373] INFO -- : [293/885] 3348748=test_mailto I, [2024-05-17T04:46:40.569294 #3307373] INFO -- : [294/885] 3348734=test_pkcs7 I, [2024-05-17T04:46:40.570104 #3307373] INFO -- : [295/885] 3348735=test_arith_seq_beg_len_step I, [2024-05-17T04:46:40.575516 #3307373] INFO -- : [296/885] 3348737=test_gem_resolver_requirement_list I, [2024-05-17T04:46:40.577684 #3307373] INFO -- : [297/885] 3348748=test_function_entry I, [2024-05-17T04:46:40.579606 #3307373] INFO -- : [298/885] 3348748=test_find_executable I, [2024-05-17T04:46:40.580528 #3307373] INFO -- : [299/885] 3348737=ruby_api_test I, [2024-05-17T04:46:40.598556 #3307373] INFO -- : [300/885] 3348748=test_gem_commands_pristine_command I, [2024-05-17T04:46:40.606954 #3307373] INFO -- : [301/885] 3348743=test_context I, [2024-05-17T04:46:40.636347 #3307373] INFO -- : [302/885] 3348735=test_nofree I, [2024-05-17T04:46:40.636409 #3307373] INFO -- : [303/885] 3348735=test_coder I, [2024-05-17T04:46:40.648411 #3307373] INFO -- : [304/885] 3348735=test_symbol I, [2024-05-17T04:46:40.674781 #3307373] INFO -- : [305/885] 3348737=test_unix I, [2024-05-17T04:46:40.696825 #3307373] INFO -- : [306/885] 3348737=test_lazy_enumerator I, [2024-05-17T04:46:40.761143 #3307373] INFO -- : [307/885] 3348750=test_enc_associate I, [2024-05-17T04:46:40.818560 #3307373] INFO -- : [308/885] 3348734=test_rdoc_class_module I, [2024-05-17T04:46:40.828090 #3307373] INFO -- : [309/885] 3348743=test_bignum I, [2024-05-17T04:46:40.869173 #3307373] INFO -- : [310/885] 3348733=test_gem_ci_detector I, [2024-05-17T04:46:40.877626 #3307373] INFO -- : [311/885] 3348747=test_stringio I, [2024-05-17T04:46:40.882350 #3307373] INFO -- : [312/885] 3348733=test_arity I, [2024-05-17T04:46:40.888075 #3307373] INFO -- : [313/885] 3348733=test_io_wait_uncommon I, [2024-05-17T04:46:40.891676 #3307373] INFO -- : [314/885] 3348733=test_win32ole_variable I, [2024-05-17T04:46:40.895044 #3307373] INFO -- : [315/885] 3348733=test_trace I, [2024-05-17T04:46:40.913686 #3307373] INFO -- : [316/885] 3348733=ractor_test I, [2024-05-17T04:46:40.963176 #3307373] INFO -- : [317/885] 3348743=test_time_tz I, [2024-05-17T04:46:40.982612 #3307373] INFO -- : [318/885] 3348737=test_win32ole_event I, [2024-05-17T04:46:40.985957 #3307373] INFO -- : [319/885] 3348733=test_rdoc_generator_json_index I, [2024-05-17T04:46:40.986751 #3307373] INFO -- : [320/885] 3348745=test_gem_package I, [2024-05-17T04:46:40.987003 #3307373] INFO -- : [321/885] 3348737=test_resolve_symbol I, [2024-05-17T04:46:40.988625 #3307373] INFO -- : [322/885] 3348747=test_complex2 I, [2024-05-17T04:46:40.996120 #3307373] INFO -- : [323/885] 3348747=test_have_macro I, [2024-05-17T04:46:41.008825 #3307373] INFO -- : [324/885] 3348743=test_enum I, [2024-05-17T04:46:41.008971 #3307373] INFO -- : [325/885] 3348733=test_gem_specification I, [2024-05-17T04:46:41.044377 #3307373] INFO -- : [326/885] 3348739=test_threadgroup I, [2024-05-17T04:46:41.064445 #3307373] INFO -- : [327/885] 3348737=test_rdoc_extend I, [2024-05-17T04:46:41.131590 #3307373] INFO -- : [328/885] 3348737=test_merge_keys I, [2024-05-17T04:46:41.140805 #3307373] INFO -- : [329/885] 3348737=test_gem_resolver_api_specification I, [2024-05-17T04:46:41.188819 #3307373] INFO -- : [330/885] 3348737=test_win32ole_variant I, [2024-05-17T04:46:41.197129 #3307373] INFO -- : [331/885] 3348737=test_mixed_unicode_escapes I, [2024-05-17T04:46:41.200552 #3307373] INFO -- : [332/885] 3348737=test_history I, [2024-05-17T04:46:41.246396 #3307373] INFO -- : [333/885] 3348737=test_rdoc_markup_to_ansi I, [2024-05-17T04:46:41.282215 #3307373] INFO -- : [334/885] 3348737=test_ipaddr I, [2024-05-17T04:46:41.300233 #3307373] INFO -- : [335/885] 3348737=version_test I, [2024-05-17T04:46:41.307148 #3307373] INFO -- : [336/885] 3348737=test_cgi_header I, [2024-05-17T04:46:41.314214 #3307373] INFO -- : [337/885] 3348750=heredoc_dedent_test I, [2024-05-17T04:46:41.316628 #3307373] INFO -- : [338/885] 3348734=test_object I, [2024-05-17T04:46:41.319744 #3307373] INFO -- : [339/885] 3348737=test_arithmetic_sequence I, [2024-05-17T04:46:41.320293 #3307373] INFO -- : [340/885] 3348750=test_key_actor_emacs I, [2024-05-17T04:46:41.331098 #3307373] INFO -- : [341/885] 3348737=test_gem_command_manager I, [2024-05-17T04:46:41.335783 #3307373] INFO -- : [342/885] 3348734=test_gem_gemcutter_utilities I, [2024-05-17T04:46:41.471728 #3307373] INFO -- : [343/885] 3348747=test_basicinstructions I, [2024-05-17T04:46:41.499080 #3307373] INFO -- : [344/885] 3348737=test_gem_local_remote_options I, [2024-05-17T04:46:41.530601 #3307373] INFO -- : [345/885] 3348750=test_date_arith I, [2024-05-17T04:46:41.534295 #3307373] INFO -- : [346/885] 3348737=test_object I, [2024-05-17T04:46:41.541410 #3307373] INFO -- : [347/885] 3348750=test_ruby_lex I, [2024-05-17T04:46:41.546586 #3307373] INFO -- : [348/885] 3348751=test_sleep I, [2024-05-17T04:46:41.576067 #3307373] INFO -- : [349/885] 3348747=compiler_test I, [2024-05-17T04:46:41.637131 #3307373] INFO -- : [350/885] 3348747=test_flip I, [2024-05-17T04:46:41.657385 #3307373] INFO -- : [351/885] 3348747=test_change_word I, [2024-05-17T04:46:41.668119 #3307373] INFO -- : [352/885] 3348750=test_ossl I, [2024-05-17T04:46:41.679859 #3307373] INFO -- : [353/885] 3348747=test_normalize I, [2024-05-17T04:46:41.680991 #3307373] INFO -- : [354/885] 3348747=test_timeout I, [2024-05-17T04:46:41.692248 #3307373] INFO -- : [355/885] 3348747=test_rdoc_rd_block_parser I, [2024-05-17T04:46:41.730731 #3307373] INFO -- : [356/885] 3348747=test_tsort I, [2024-05-17T04:46:41.736183 #3307373] INFO -- : [357/885] 3348747=test_signedness I, [2024-05-17T04:46:41.753544 #3307373] INFO -- : [358/885] 3348746=test_type I, [2024-05-17T04:46:41.761523 #3307373] INFO -- : [359/885] 3348746=test_ractor I, [2024-05-17T04:46:41.764583 #3307373] INFO -- : [360/885] 3348745=test_func I, [2024-05-17T04:46:41.774392 #3307373] INFO -- : [361/885] 3348748=test_big5 I, [2024-05-17T04:46:41.778268 #3307373] INFO -- : [362/885] 3348748=test_pointer I, [2024-05-17T04:46:41.817343 #3307373] INFO -- : [363/885] 3348734=test_rdoc_markup_hard_break I, [2024-05-17T04:46:41.817928 #3307373] INFO -- : [364/885] 3348734=test_date_strptime I, [2024-05-17T04:46:41.821961 #3307373] INFO -- : [365/885] 3348746=test_gem_package_task I, [2024-05-17T04:46:41.899831 #3307373] INFO -- : [366/885] 3348743=test_placearg I, [2024-05-17T04:46:41.909813 #3307373] INFO -- : [367/885] 3348734=test_gem_platform I, [2024-05-17T04:46:41.912989 #3307373] INFO -- : [368/885] 3348737=test_pkey_rsa I, [2024-05-17T04:46:41.971388 #3307373] INFO -- : [369/885] 3348734=test_numhash I, [2024-05-17T04:46:41.977179 #3307373] INFO -- : [370/885] 3348734=test_weakkeymap I, [2024-05-17T04:46:42.002191 #3307373] INFO -- : [371/885] 3348746=test_gem_commands_push_command I, [2024-05-17T04:46:42.048465 #3307373] INFO -- : [372/885] 3348739=test_continuation I, [2024-05-17T04:46:42.049574 #3307373] INFO -- : [373/885] 3348743=test_fd_setsize I, [2024-05-17T04:46:42.051645 #3307373] INFO -- : [374/885] 3348743=test_keyword I, [2024-05-17T04:46:42.053531 #3307373] INFO -- : [375/885] 3348739=test_class_name_check I, [2024-05-17T04:46:42.080324 #3307373] INFO -- : [376/885] 3348739=test_delete I, [2024-05-17T04:46:42.085238 #3307373] INFO -- : [377/885] 3348739=test_win32ole_method I, [2024-05-17T04:46:42.086626 #3307373] INFO -- : [378/885] 3348739=test_logger I, [2024-05-17T04:46:42.110167 #3307373] INFO -- : [379/885] 3348739=test_files_test I, [2024-05-17T04:46:42.148255 #3307373] INFO -- : [380/885] 3348737=test_gem_update_suggestion I, [2024-05-17T04:46:42.183188 #3307373] INFO -- : [381/885] 3348734=test_file_exhaustive I, [2024-05-17T04:46:42.213478 #3307373] INFO -- : [382/885] 3348748=test_rdoc_parser_markdown I, [2024-05-17T04:46:42.215167 #3307373] INFO -- : [383/885] 3348739=test_import I, [2024-05-17T04:46:42.218791 #3307373] INFO -- : [384/885] 3348737=test_gem_resolver_lock_set I, [2024-05-17T04:46:42.225253 #3307373] INFO -- : [385/885] 3348748=test_not I, [2024-05-17T04:46:42.230472 #3307373] INFO -- : [386/885] 3348748=test_gem_safe_marshal I, [2024-05-17T04:46:42.238879 #3307373] INFO -- : [387/885] 3348737=test_gem_resolver_api_set I, [2024-05-17T04:46:42.297162 #3307373] INFO -- : [388/885] 3348737=test_gem_resolver_vendor_set I, [2024-05-17T04:46:42.314486 #3307373] INFO -- : [389/885] 3348737=test_config I, [2024-05-17T04:46:42.424511 #3307373] INFO -- : [390/885] 3348741=test_enumerable I, [2024-05-17T04:46:42.427661 #3307373] INFO -- : [391/885] 3348741=test_eval I, [2024-05-17T04:46:42.489538 #3307373] INFO -- : [392/885] 3348735=json_generator_test I, [2024-05-17T04:46:42.554391 #3307373] INFO -- : [393/885] 3348746=test_transcode I, [2024-05-17T04:46:42.577329 #3307373] INFO -- : [394/885] 3348735=test_fips I, [2024-05-17T04:46:42.578339 #3307373] INFO -- : [395/885] 3348743=test_x509name I, [2024-05-17T04:46:42.586529 #3307373] INFO -- : [396/885] 3348743=test_update I, [2024-05-17T04:46:42.590238 #3307373] INFO -- : [397/885] 3348743=test_rdoc_code_object I, [2024-05-17T04:46:42.647347 #3307373] INFO -- : [398/885] 3348741=test_x509store I, [2024-05-17T04:46:42.729676 #3307373] INFO -- : [399/885] 3348748=test_webauthn_listener I, [2024-05-17T04:46:42.736645 #3307373] INFO -- : [400/885] 3348738=test_lambda I, [2024-05-17T04:46:42.763176 #3307373] INFO -- : [401/885] 3348746=test_gem_request_set_gem_dependency_api I, [2024-05-17T04:46:42.776796 #3307373] INFO -- : [402/885] 3348752=test_ast I, [2024-05-17T04:46:42.785795 #3307373] INFO -- : [403/885] 3348748=test_jaro_winkler I, [2024-05-17T04:46:42.789300 #3307373] INFO -- : [404/885] 3348748=test_random_formatter I, [2024-05-17T04:46:42.797155 #3307373] INFO -- : [405/885] 3348737=test_helper I, [2024-05-17T04:46:42.797452 #3307373] INFO -- : [406/885] 3348737=test_vm_dump I, [2024-05-17T04:46:42.798173 #3307373] INFO -- : [407/885] 3348737=test_tmpdir I, [2024-05-17T04:46:42.812573 #3307373] INFO -- : [408/885] 3348748=test_rdoc_markup_document I, [2024-05-17T04:46:42.817408 #3307373] INFO -- : [409/885] 3348738=test_integer_comb I, [2024-05-17T04:46:42.819781 #3307373] INFO -- : [410/885] 3348748=test_regexp I, [2024-05-17T04:46:42.831816 #3307373] INFO -- : [411/885] 3348735=test_gem_commands_check_command I, [2024-05-17T04:46:42.860616 #3307373] INFO -- : [412/885] 3348741=errors_test I, [2024-05-17T04:46:42.870029 #3307373] INFO -- : [413/885] 3348735=static_inspect_test I, [2024-05-17T04:46:42.875011 #3307373] INFO -- : [414/885] 3348737=test_file I, [2024-05-17T04:46:42.907169 #3307373] INFO -- : [415/885] 3348733=test_force_exit I, [2024-05-17T04:46:42.912821 #3307373] INFO -- : [416/885] 3348733=unescape_test I, [2024-05-17T04:46:42.916807 #3307373] INFO -- : [417/885] 3348739=test_ostruct I, [2024-05-17T04:46:42.966232 #3307373] INFO -- : [418/885] 3348735=test_data_error I, [2024-05-17T04:46:42.979674 #3307373] INFO -- : [419/885] 3348746=bom_test I, [2024-05-17T04:46:42.990459 #3307373] INFO -- : [420/885] 3348745=test_udp I, [2024-05-17T04:46:42.993426 #3307373] INFO -- : [421/885] 3348741=test_pty I, [2024-05-17T04:46:42.996769 #3307373] INFO -- : [422/885] 3348745=test_dup I, [2024-05-17T04:46:43.045613 #3307373] INFO -- : [423/885] 3348739=test_constant I, [2024-05-17T04:46:43.057699 #3307373] INFO -- : [424/885] 3348735=command_line_test I, [2024-05-17T04:46:43.068005 #3307373] INFO -- : [425/885] 3348735=test_project_sanity I, [2024-05-17T04:46:43.082137 #3307373] INFO -- : [426/885] 3348746=test_range I, [2024-05-17T04:46:43.121695 #3307373] INFO -- : [427/885] 3348735=test_gem_uri_formatter I, [2024-05-17T04:46:43.145044 #3307373] INFO -- : [428/885] 3348735=test_encoding I, [2024-05-17T04:46:43.202785 #3307373] INFO -- : [429/885] 3348745=test_helper I, [2024-05-17T04:46:43.212903 #3307373] INFO -- : [430/885] 3348745=test_erb_command I, [2024-05-17T04:46:43.220322 #3307373] INFO -- : [431/885] 3348743=test_ts I, [2024-05-17T04:46:43.252525 #3307373] INFO -- : [432/885] 3348745=library_symbols_test I, [2024-05-17T04:46:43.264875 #3307373] INFO -- : [433/885] 3348745=test_addr I, [2024-05-17T04:46:43.288709 #3307373] INFO -- : [434/885] 3348745=test_locale I, [2024-05-17T04:46:43.379694 #3307373] INFO -- : [435/885] 3348735=test_ensured I, [2024-05-17T04:46:43.425932 #3307373] INFO -- : [436/885] 3348745=test_rdoc_ri_paths I, [2024-05-17T04:46:43.446552 #3307373] INFO -- : [437/885] 3348735=test_rdoc_markup_attributes I, [2024-05-17T04:46:43.449136 #3307373] INFO -- : [438/885] 3348745=test_default_gems I, [2024-05-17T04:46:43.458400 #3307373] INFO -- : [439/885] 3348735=test_rdoc_rd_inline_parser I, [2024-05-17T04:46:43.464071 #3307373] INFO -- : [440/885] 3348741=test_rdoc_markup_to_rdoc I, [2024-05-17T04:46:43.489956 #3307373] INFO -- : [441/885] 3348735=test_mul I, [2024-05-17T04:46:43.497200 #3307373] INFO -- : [442/885] 3348735=test_win32ole_type I, [2024-05-17T04:46:43.497413 #3307373] INFO -- : [443/885] 3348735=test_null I, [2024-05-17T04:46:43.500855 #3307373] INFO -- : [444/885] 3348735=test_pkey_ec I, [2024-05-17T04:46:43.518329 #3307373] INFO -- : [445/885] 3348745=test_trick I, [2024-05-17T04:46:43.580038 #3307373] INFO -- : [446/885] 3348735=test_thread I, [2024-05-17T04:46:43.595755 #3307373] INFO -- : [447/885] 3348735=test_pipe I, [2024-05-17T04:46:43.689710 #3307373] INFO -- : [448/885] 3348741=test_date_parse I, [2024-05-17T04:46:43.723927 #3307373] INFO -- : [449/885] 3348735=test_rdoc_i18n_text I, [2024-05-17T04:46:43.728709 #3307373] INFO -- : [450/885] 3348735=test_io_buffer I, [2024-05-17T04:46:43.743316 #3307373] INFO -- : [451/885] 3348743=test_defined I, [2024-05-17T04:46:43.766376 #3307373] INFO -- : [452/885] 3348735=test_backtrace I, [2024-05-17T04:46:43.774970 #3307373] INFO -- : [453/885] 3348735=test_key_name_check I, [2024-05-17T04:46:43.776945 #3307373] INFO -- : [454/885] 3348735=test_gb18030 I, [2024-05-17T04:46:43.781606 #3307373] INFO -- : [455/885] 3348735=test_svcb_https I, [2024-05-17T04:46:43.797057 #3307373] INFO -- : [456/885] 3348735=test_buffering I, [2024-05-17T04:46:43.806054 #3307373] INFO -- : [457/885] 3348735=test_gem_uninstaller I, [2024-05-17T04:46:43.810520 #3307373] INFO -- : [458/885] 3348741=test_rdoc_rdoc I, [2024-05-17T04:46:43.823315 #3307373] INFO -- : [459/885] 3348743=test_windows_1251 I, [2024-05-17T04:46:43.827116 #3307373] INFO -- : [460/885] 3348733=test_time I, [2024-05-17T04:46:43.839682 #3307373] INFO -- : [461/885] 3348743=test_gem_package_old I, [2024-05-17T04:46:43.884408 #3307373] INFO -- : [462/885] 3348743=test_gem_resolver_index_set I, [2024-05-17T04:46:43.888761 #3307373] INFO -- : [463/885] 3348746=test_gc_compact I, [2024-05-17T04:46:43.924043 #3307373] INFO -- : [464/885] 3348743=test_proc I, [2024-05-17T04:46:43.932502 #3307373] INFO -- : [465/885] 3348741=test_string I, [2024-05-17T04:46:43.954356 #3307373] INFO -- : [466/885] 3348733=test_date_conv I, [2024-05-17T04:46:43.961928 #3307373] INFO -- : [467/885] 3348733=test_optimization I, [2024-05-17T04:46:44.016734 #3307373] INFO -- : [468/885] 3348747=test_ole_methods I, [2024-05-17T04:46:44.021051 #3307373] INFO -- : [469/885] 3348747=test_erb_m17n I, [2024-05-17T04:46:44.023942 #3307373] INFO -- : [470/885] 3348747=test_egrep_cpp I, [2024-05-17T04:46:44.150948 #3307373] INFO -- : [471/885] 3348747=test_cgi_tag_helper I, [2024-05-17T04:46:44.166883 #3307373] INFO -- : [472/885] 3348747=test_zlib I, [2024-05-17T04:46:44.563042 #3307373] INFO -- : [473/885] 3348738=test_files_test_2 I, [2024-05-17T04:46:44.613569 #3307373] INFO -- : [474/885] 3348743=test_fnmatch I, [2024-05-17T04:46:44.666150 #3307373] INFO -- : [475/885] 3348743=test_require_path_check I, [2024-05-17T04:46:44.737320 #3307373] INFO -- : [476/885] 3348735=test_rdoc_markup_parser I, [2024-05-17T04:46:44.773538 #3307373] INFO -- : [477/885] 3348735=test_folderitem2_invokeverb I, [2024-05-17T04:46:44.780574 #3307373] INFO -- : [478/885] 3348735=test_gem_validator I, [2024-05-17T04:46:44.793152 #3307373] INFO -- : [479/885] 3348735=test_raise I, [2024-05-17T04:46:44.796316 #3307373] INFO -- : [480/885] 3348735=test_x509attr I, [2024-05-17T04:46:44.797634 #3307373] INFO -- : [481/885] 3348735=test_gem_request_set_lockfile_parser I, [2024-05-17T04:46:44.842680 #3307373] INFO -- : [482/885] 3348743=test_depth_first I, [2024-05-17T04:46:44.847456 #3307373] INFO -- : [483/885] 3348743=test_rdoc_store I, [2024-05-17T04:46:44.889314 #3307373] INFO -- : [484/885] 3348735=test_string I, [2024-05-17T04:46:44.900823 #3307373] INFO -- : [485/885] 3348735=test_rdoc_stats I, [2024-05-17T04:46:44.966653 #3307373] INFO -- : [486/885] 3348735=test_pattern_matching I, [2024-05-17T04:46:44.988920 #3307373] INFO -- : [487/885] 3348735=test_gem_dependency_resolution_error I, [2024-05-17T04:46:44.990812 #3307373] INFO -- : [488/885] 3348735=test_rdoc_parser I, [2024-05-17T04:46:45.027581 #3307373] INFO -- : [489/885] 3348735=test_qsort I, [2024-05-17T04:46:45.031019 #3307373] INFO -- : [490/885] 3348735=json_addition_test I, [2024-05-17T04:46:45.046078 #3307373] INFO -- : [491/885] 3348735=test_custom_command I, [2024-05-17T04:46:45.082983 #3307373] INFO -- : [492/885] 3348735=test_rdoc_tom_doc I, [2024-05-17T04:46:45.090835 #3307373] INFO -- : [493/885] 3348735=test_hmac I, [2024-05-17T04:46:45.096929 #3307373] INFO -- : [494/885] 3348735=test_rdoc_markup_to_tt_only I, [2024-05-17T04:46:45.124754 #3307373] INFO -- : [495/885] 3348735=test_gem_spec_fetcher I, [2024-05-17T04:46:45.124972 #3307373] INFO -- : [496/885] 3348740=test_common I, [2024-05-17T04:46:45.279025 #3307373] INFO -- : [497/885] 3348735=test_key_actor_vi I, [2024-05-17T04:46:45.325469 #3307373] INFO -- : [498/885] 3348740=test_bug-3571 I, [2024-05-17T04:46:45.337399 #3307373] INFO -- : [499/885] 3348740=test_gem_command I, [2024-05-17T04:46:45.374463 #3307373] INFO -- : [500/885] 3348739=test_gem_commands_lock_command I, [2024-05-17T04:46:45.381272 #3307373] INFO -- : [501/885] 3348735=test_ifunless I, [2024-05-17T04:46:45.390808 #3307373] INFO -- : [502/885] 3348735=test_assignment I, [2024-05-17T04:46:45.395270 #3307373] INFO -- : [503/885] 3348739=test_numeric I, [2024-05-17T04:46:45.428678 #3307373] INFO -- : [504/885] 3348740=test_config I, [2024-05-17T04:46:45.479654 #3307373] INFO -- : [505/885] 3348739=test_gem_source_list I, [2024-05-17T04:46:45.501994 #3307373] INFO -- : [506/885] 3348740=test_optarg I, [2024-05-17T04:46:45.546005 #3307373] INFO -- : [507/885] 3348739=test_yaml_special_cases I, [2024-05-17T04:46:45.565651 #3307373] INFO -- : [508/885] 3348739=test_address_resolve I, [2024-05-17T04:46:45.573482 #3307373] INFO -- : [509/885] 3348739=test_rdoc_token_stream I, [2024-05-17T04:46:45.575787 #3307373] INFO -- : [510/885] 3348739=test_iter_break I, [2024-05-17T04:46:45.580546 #3307373] INFO -- : [511/885] 3348739=test_zsh_completion I, [2024-05-17T04:46:45.582086 #3307373] INFO -- : [512/885] 3348739=test_exception I, [2024-05-17T04:46:45.593108 #3307373] INFO -- : [513/885] 3348739=test_gem_ext_configure_builder I, [2024-05-17T04:46:45.601020 #3307373] INFO -- : [514/885] 3348743=test_frozen I, [2024-05-17T04:46:45.601623 #3307373] INFO -- : [515/885] 3348743=test_pp I, [2024-05-17T04:46:45.617191 #3307373] INFO -- : [516/885] 3348736=test_macro I, [2024-05-17T04:46:45.618718 #3307373] INFO -- : [517/885] 3348740=test_rdoc_single_class I, [2024-05-17T04:46:45.636111 #3307373] INFO -- : [518/885] 3348739=test_nil I, [2024-05-17T04:46:45.640419 #3307373] INFO -- : [519/885] 3348739=test_num2int I, [2024-05-17T04:46:45.644088 #3307373] INFO -- : [520/885] 3348743=test_verbose I, [2024-05-17T04:46:45.648421 #3307373] INFO -- : [521/885] 3348739=test_gem_silent_ui I, [2024-05-17T04:46:45.651281 #3307373] INFO -- : [522/885] 3348743=test_emitter I, [2024-05-17T04:46:45.653695 #3307373] INFO -- : [523/885] 3348743=test_bug-5832 I, [2024-05-17T04:46:45.655941 #3307373] INFO -- : [524/885] 3348743=test_files_ext I, [2024-05-17T04:46:45.682044 #3307373] INFO -- : [525/885] 3348739=test_eval_history I, [2024-05-17T04:46:45.689389 #3307373] INFO -- : [526/885] 3348736=dispatcher_test I, [2024-05-17T04:46:45.724755 #3307373] INFO -- : [527/885] 3348740=test_kernel I, [2024-05-17T04:46:45.784205 #3307373] INFO -- : [528/885] 3348743=test_kdf I, [2024-05-17T04:46:45.789659 #3307373] INFO -- : [529/885] 3348739=test_gem_doctor I, [2024-05-17T04:46:45.795559 #3307373] INFO -- : [530/885] 3348736=test_rdoc_markup_paragraph I, [2024-05-17T04:46:45.805965 #3307373] INFO -- : [531/885] 3348745=!Nothing_to_test I, [2024-05-17T04:46:45.806463 #3307373] INFO -- : [532/885] 3348745=test_enc_raise I, [2024-05-17T04:46:45.814150 #3307373] INFO -- : [533/885] 3348739=test_psych I, [2024-05-17T04:46:45.817108 #3307373] INFO -- : [534/885] 3348745=test_gem_ext_cargo_builder_unit I, [2024-05-17T04:46:45.835950 #3307373] INFO -- : [535/885] 3348739=test_date I, [2024-05-17T04:46:45.837585 #3307373] INFO -- : [536/885] 3348745=test_gem_rdoc I, [2024-05-17T04:46:45.844410 #3307373] INFO -- : [537/885] 3348739=test_command I, [2024-05-17T04:46:45.846180 #3307373] INFO -- : [538/885] 3348743=test_at_exit I, [2024-05-17T04:46:45.865797 #3307373] INFO -- : [539/885] 3348743=test_object_create_start I, [2024-05-17T04:46:45.867568 #3307373] INFO -- : [540/885] 3348743=test_gem_commands_specification_command I, [2024-05-17T04:46:45.919506 #3307373] INFO -- : [541/885] 3348745=test_flags I, [2024-05-17T04:46:45.957385 #3307373] INFO -- : [542/885] 3348736=test_inadvertent_creation I, [2024-05-17T04:46:45.967078 #3307373] INFO -- : [543/885] 3348743=test_enumerator I, [2024-05-17T04:46:46.059240 #3307373] INFO -- : [544/885] 3348736=test_http I, [2024-05-17T04:46:46.060945 #3307373] INFO -- : [545/885] 3348736=test_gem_commands_which_command I, [2024-05-17T04:46:46.103321 #3307373] INFO -- : [546/885] 3348739=test_shift_jis I, [2024-05-17T04:46:46.104298 #3307373] INFO -- : [547/885] 3348739=test_name_error I, [2024-05-17T04:46:46.129969 #3307373] INFO -- : [548/885] 3348740=test_rdoc_markup_attribute_manager I, [2024-05-17T04:46:46.153040 #3307373] INFO -- : [549/885] 3348740=test_gem_resolver I, [2024-05-17T04:46:46.177697 #3307373] INFO -- : [550/885] 3348739=test_gem_resolver_composed_set I, [2024-05-17T04:46:46.192486 #3307373] INFO -- : [551/885] 3348739=test_safe_load I, [2024-05-17T04:46:46.196163 #3307373] INFO -- : [552/885] 3348739=test_gem_commands_dependency_command I, [2024-05-17T04:46:46.218194 #3307373] INFO -- : [553/885] 3348746=test_nil2vtempty I, [2024-05-17T04:46:46.220834 #3307373] INFO -- : [554/885] 3348746=test_stream I, [2024-05-17T04:46:46.228484 #3307373] INFO -- : [555/885] 3348746=test_rdoc_context I, [2024-05-17T04:46:46.268389 #3307373] INFO -- : [556/885] 3348736=test_httpresponse I, [2024-05-17T04:46:46.272750 #3307373] INFO -- : [557/885] 3348739=test_open-uri I, [2024-05-17T04:46:46.294469 #3307373] INFO -- : [558/885] 3348736=test_rdoc_parser_ruby I, [2024-05-17T04:46:46.346152 #3307373] INFO -- : [559/885] 3348740=test_require I, [2024-05-17T04:46:46.348902 #3307373] INFO -- : [560/885] 3348740=test_rdoc_markup_to_joined_paragraph I, [2024-05-17T04:46:46.353956 #3307373] INFO -- : [561/885] 3348740=test_date_time I, [2024-05-17T04:46:46.367567 #3307373] INFO -- : [562/885] 3348740=test_date_new I, [2024-05-17T04:46:46.379832 #3307373] INFO -- : [563/885] 3348740=index_write_test I, [2024-05-17T04:46:46.385766 #3307373] INFO -- : [564/885] 3348740=test_data I, [2024-05-17T04:46:46.391421 #3307373] INFO -- : [565/885] 3348740=test_syntax I, [2024-05-17T04:46:46.549169 #3307373] INFO -- : [566/885] 3348751=test_gem_safe_yaml I, [2024-05-17T04:46:46.558339 #3307373] INFO -- : [567/885] 3348751=test_rdoc_text I, [2024-05-17T04:46:46.607086 #3307373] INFO -- : [568/885] 3348735=test_tcp I, [2024-05-17T04:46:46.643599 #3307373] INFO -- : [569/885] 3348739=test_iso_8859 I, [2024-05-17T04:46:46.666609 #3307373] INFO -- : [570/885] 3348735=test_switch_hitter I, [2024-05-17T04:46:46.676204 #3307373] INFO -- : [571/885] 3348735=test_flush I, [2024-05-17T04:46:46.678366 #3307373] INFO -- : [572/885] 3348735=test_singleton I, [2024-05-17T04:46:46.683139 #3307373] INFO -- : [573/885] 3348735=test_io_console I, [2024-05-17T04:46:46.687905 #3307373] INFO -- : [574/885] 3348739=test_logperiod I, [2024-05-17T04:46:46.695216 #3307373] INFO -- : [575/885] 3348739=test_c_union_entity I, [2024-05-17T04:46:46.753662 #3307373] INFO -- : [576/885] 3348751=test_rdoc_normal_module I, [2024-05-17T04:46:46.756803 #3307373] INFO -- : [577/885] 3348739=test_rdoc_markdown_test I, [2024-05-17T04:46:46.780111 #3307373] INFO -- : [578/885] 3348745=test_securerandom I, [2024-05-17T04:46:46.813410 #3307373] INFO -- : [579/885] 3348745=test_thread_fd_close I, [2024-05-17T04:46:46.815665 #3307373] INFO -- : [580/885] 3348745=test_passing_block I, [2024-05-17T04:46:46.820727 #3307373] INFO -- : [581/885] 3348736=test_stringchar I, [2024-05-17T04:46:46.822118 #3307373] INFO -- : [582/885] 3348745=test_hash_create I, [2024-05-17T04:46:46.824793 #3307373] INFO -- : [583/885] 3348745=newline_test I, [2024-05-17T04:46:46.841826 #3307373] INFO -- : [584/885] 3348751=test_uncorrectable_name_check I, [2024-05-17T04:46:46.850795 #3307373] INFO -- : [585/885] 3348751=test_gem_security_policy I, [2024-05-17T04:46:46.895267 #3307373] INFO -- : [586/885] 3348736=test_gem_source_local I, [2024-05-17T04:46:46.899431 #3307373] INFO -- : [587/885] 3348745=test_pack I, [2024-05-17T04:46:47.039829 #3307373] INFO -- : [588/885] 3348746=test_last_thread I, [2024-05-17T04:46:47.067282 #3307373] INFO -- : [589/885] 3348736=test_process I, [2024-05-17T04:46:47.100389 #3307373] INFO -- : [590/885] 3348751=test_x509cert I, [2024-05-17T04:46:47.113327 #3307373] INFO -- : [591/885] 3348745=test_gc I, [2024-05-17T04:46:47.346083 #3307373] INFO -- : [592/885] 3348751=test_gem_resolver_lock_specification I, [2024-05-17T04:46:47.391800 #3307373] INFO -- : [593/885] 3348751=test_err_in_callback I, [2024-05-17T04:46:47.400013 #3307373] INFO -- : [594/885] 3348751=test_logdevice I, [2024-05-17T04:46:47.440015 #3307373] INFO -- : [595/885] 3348739=test_arity I, [2024-05-17T04:46:47.441457 #3307373] INFO -- : [596/885] 3348739=test_gem_ext_rake_builder I, [2024-05-17T04:46:47.730617 #3307373] INFO -- : [597/885] 3348738=test_grapheme_breaks I, [2024-05-17T04:46:47.758464 #3307373] INFO -- : [598/885] 3348738=test_gem_version_option I, [2024-05-17T04:46:47.774494 #3307373] INFO -- : [599/885] 3348734=test_gem_request_connection_pools I, [2024-05-17T04:46:47.811976 #3307373] INFO -- : [600/885] 3348738=test_cclass I, [2024-05-17T04:46:47.895051 #3307373] INFO -- : [601/885] 3348738=test_parser_events I, [2024-05-17T04:46:47.898615 #3307373] INFO -- : [602/885] 3348750=test_reline I, [2024-05-17T04:46:47.945975 #3307373] INFO -- : [603/885] 3348738=test_case I, [2024-05-17T04:46:47.949079 #3307373] INFO -- : [604/885] 3348738=test_pkey I, [2024-05-17T04:46:47.975528 #3307373] INFO -- : [605/885] 3348739=test_rdoc_markup_to_markdown I, [2024-05-17T04:46:47.987312 #3307373] INFO -- : [606/885] 3348738=test_json_tree I, [2024-05-17T04:46:47.992532 #3307373] INFO -- : [607/885] 3348738=test_ansi_with_terminfo I, [2024-05-17T04:46:47.994363 #3307373] INFO -- : [608/885] 3348742=test_rdoc_generator_pot_po I, [2024-05-17T04:46:47.995022 #3307373] INFO -- : [609/885] 3348738=test_ractor I, [2024-05-17T04:46:48.000570 #3307373] INFO -- : [610/885] 3348742=test_m17n_comb I, [2024-05-17T04:46:48.025844 #3307373] INFO -- : [611/885] 3348739=test_memory_view I, [2024-05-17T04:46:48.073787 #3307373] INFO -- : [612/885] 3348738=test_rdoc_generator_ri I, [2024-05-17T04:46:48.082809 #3307373] INFO -- : [613/885] 3348746=test_extlibs I, [2024-05-17T04:46:48.121650 #3307373] INFO -- : [614/885] 3348747=test_gem_stream_ui I, [2024-05-17T04:46:48.124216 #3307373] INFO -- : [615/885] 3348751=test_gem_install_update_options I, [2024-05-17T04:46:48.183534 #3307373] INFO -- : [616/885] 3348750=parse_test I, [2024-05-17T04:46:48.188576 #3307373] INFO -- : [617/885] 3348739=test_require_lib I, [2024-05-17T04:46:48.188886 #3307373] INFO -- : [618/885] 3348747=test_ractor I, [2024-05-17T04:46:48.197807 #3307373] INFO -- : [619/885] 3348738=test_severity I, [2024-05-17T04:46:48.204902 #3307373] INFO -- : [620/885] 3348738=test_objectspace I, [2024-05-17T04:46:48.214643 #3307373] INFO -- : [621/885] 3348747=test_thread I, [2024-05-17T04:46:48.235453 #3307373] INFO -- : [622/885] 3348751=test_socket I, [2024-05-17T04:46:48.427936 #3307373] INFO -- : [623/885] 3348747=test_rdoc_markup_to_table_of_contents I, [2024-05-17T04:46:48.451176 #3307373] INFO -- : [624/885] 3348747=test_dot_dot I, [2024-05-17T04:46:48.452136 #3307373] INFO -- : [625/885] 3348744=test_c_struct_builder I, [2024-05-17T04:46:48.454900 #3307373] INFO -- : [626/885] 3348747=test_str2big I, [2024-05-17T04:46:48.458844 #3307373] INFO -- : [627/885] 3348747=test_literal I, [2024-05-17T04:46:48.594926 #3307373] INFO -- : [628/885] 3348744=test_store I, [2024-05-17T04:46:48.726825 #3307373] INFO -- : [629/885] 3348744=test_case_options I, [2024-05-17T04:46:48.728282 #3307373] INFO -- : [630/885] 3348744=test_gem_commands_info_command I, [2024-05-17T04:46:48.744503 #3307373] INFO -- : [631/885] 3348744=test_gem_dependency_installer I, [2024-05-17T04:46:48.801282 #3307373] INFO -- : [632/885] 3348734=test_scalar I, [2024-05-17T04:46:48.806668 #3307373] INFO -- : [633/885] 3348734=test_rdoc_cross_reference I, [2024-05-17T04:46:48.937827 #3307373] INFO -- : [634/885] 3348737=test_gem_package_tar_reader_entry I, [2024-05-17T04:46:48.944385 #3307373] INFO -- : [635/885] 3348747=test_gem_name_tuple I, [2024-05-17T04:46:48.960164 #3307373] INFO -- : [636/885] 3348747=test_rand I, [2024-05-17T04:46:49.074420 #3307373] INFO -- : [637/885] 3348738=test_bug_reporter I, [2024-05-17T04:46:49.113682 #3307373] INFO -- : [638/885] 3348737=test_exception I, [2024-05-17T04:46:49.242316 #3307373] INFO -- : [639/885] 3348734=test_sprintf_comb I, [2024-05-17T04:46:49.263209 #3307373] INFO -- : [640/885] 3348747=test_method_cache I, [2024-05-17T04:46:49.268471 #3307373] INFO -- : [641/885] 3348747=test_gem_request I, [2024-05-17T04:46:49.370253 #3307373] INFO -- : [642/885] 3348734=test_gem_ext_cargo_builder_link_flag_converter I, [2024-05-17T04:46:49.374764 #3307373] INFO -- : [643/885] 3348735=test_gem_commands_mirror I, [2024-05-17T04:46:49.380376 #3307373] INFO -- : [644/885] 3348735=test_settracefunc I, [2024-05-17T04:46:49.417562 #3307373] INFO -- : [645/885] 3348734=test_gem_text I, [2024-05-17T04:46:49.423964 #3307373] INFO -- : [646/885] 3348747=test_enumerator_kw I, [2024-05-17T04:46:49.432275 #3307373] INFO -- : [647/885] 3348747=test_scan_args I, [2024-05-17T04:46:49.439854 #3307373] INFO -- : [648/885] 3348747=test_win32ole I, [2024-05-17T04:46:49.448301 #3307373] INFO -- : [649/885] 3348747=test_generic I, [2024-05-17T04:46:49.458219 #3307373] INFO -- : [650/885] 3348734=test_marshalable I, [2024-05-17T04:46:49.460744 #3307373] INFO -- : [651/885] 3348734=test_digest I, [2024-05-17T04:46:49.464948 #3307373] INFO -- : [652/885] 3348738=test_gem_ext_cmake_builder I, [2024-05-17T04:46:49.476118 #3307373] INFO -- : [653/885] 3348747=test_gem_commands_contents_command I, [2024-05-17T04:46:49.484691 #3307373] INFO -- : [654/885] 3348738=test_cgi_util I, [2024-05-17T04:46:49.559412 #3307373] INFO -- : [655/885] 3348747=test_require I, [2024-05-17T04:46:49.715949 #3307373] INFO -- : [656/885] 3348738=test_fiddle I, [2024-05-17T04:46:49.732186 #3307373] INFO -- : [657/885] 3348742=test_wss I, [2024-05-17T04:46:49.745040 #3307373] INFO -- : [658/885] 3348742=test_ractor I, [2024-05-17T04:46:49.831837 #3307373] INFO -- : [659/885] 3348738=test_find I, [2024-05-17T04:46:49.851636 #3307373] INFO -- : [660/885] 3348738=test_coverage I, [2024-05-17T04:46:49.858569 #3307373] INFO -- : [661/885] 3348742=test_rdoc_encoding I, [2024-05-17T04:46:49.874201 #3307373] INFO -- : [662/885] 3348746=regexp_test I, [2024-05-17T04:46:49.887583 #3307373] INFO -- : [663/885] 3348746=test_gem_package_tar_reader I, [2024-05-17T04:46:49.889422 #3307373] INFO -- : [664/885] 3348742=test_init I, [2024-05-17T04:46:49.917653 #3307373] INFO -- : [665/885] 3348746=test_complexrational I, [2024-05-17T04:46:49.923541 #3307373] INFO -- : [666/885] 3348746=test_pathname I, [2024-05-17T04:46:50.001678 #3307373] INFO -- : [667/885] 3348751=test_rdoc_markdown I, [2024-05-17T04:46:50.115287 #3307373] INFO -- : [668/885] 3348746=test_gem_available_set I, [2024-05-17T04:46:50.202215 #3307373] INFO -- : [669/885] 3348751=test_rdoc_any_method I, [2024-05-17T04:46:50.240732 #3307373] INFO -- : [670/885] 3348746=test_modify_expand I, [2024-05-17T04:46:50.245414 #3307373] INFO -- : [671/885] 3348746=test_file I, [2024-05-17T04:46:50.272036 #3307373] INFO -- : [672/885] 3348746=test_deprecate I, [2024-05-17T04:46:50.284724 #3307373] INFO -- : [673/885] 3348734=test_rdoc_constant I, [2024-05-17T04:46:50.307509 #3307373] INFO -- : [674/885] 3348746=test_bash_completion I, [2024-05-17T04:46:50.310837 #3307373] INFO -- : [675/885] 3348742=test_formatter I, [2024-05-17T04:46:50.316611 #3307373] INFO -- : [676/885] 3348746=test_gem_source_vendor I, [2024-05-17T04:46:50.321403 #3307373] INFO -- : [677/885] 3348742=test_gem_commands_owner_command I, [2024-05-17T04:46:50.326923 #3307373] INFO -- : [678/885] 3348746=test_recorder I, [2024-05-17T04:46:50.333633 #3307373] INFO -- : [679/885] 3348746=test_big2str I, [2024-05-17T04:46:50.343932 #3307373] INFO -- : [680/885] 3348746=test_yaml I, [2024-05-17T04:46:50.417259 #3307373] INFO -- : [681/885] 3348734=test_forwardable I, [2024-05-17T04:46:50.441916 #3307373] INFO -- : [682/885] 3348735=test_wait I, [2024-05-17T04:46:50.442067 #3307373] INFO -- : [683/885] 3348734=test_handle I, [2024-05-17T04:46:50.451877 #3307373] INFO -- : [684/885] 3348746=test_nowrite I, [2024-05-17T04:46:50.490604 #3307373] INFO -- : [685/885] 3348746=test_thread_queue I, [2024-05-17T04:46:50.513899 #3307373] INFO -- : [686/885] 3348735=test_rdoc_markup_formatter I, [2024-05-17T04:46:50.525679 #3307373] INFO -- : [687/885] 3348735=test_bmethod I, [2024-05-17T04:46:50.531361 #3307373] INFO -- : [688/885] 3348735=test_ractor I, [2024-05-17T04:46:50.553940 #3307373] INFO -- : [689/885] 3348735=test_euc_tw I, [2024-05-17T04:46:50.559362 #3307373] INFO -- : [690/885] 3348735=test_ansi_without_terminfo I, [2024-05-17T04:46:50.565772 #3307373] INFO -- : [691/885] 3348751=test_gem_commands_sources_command I, [2024-05-17T04:46:50.586683 #3307373] INFO -- : [692/885] 3348735=test_io_timeout I, [2024-05-17T04:46:50.592367 #3307373] INFO -- : [693/885] 3348735=test_shapes I, [2024-05-17T04:46:50.594740 #3307373] INFO -- : [694/885] 3348735=json_fixtures_test I, [2024-05-17T04:46:50.602080 #3307373] INFO -- : [695/885] 3348735=test_comparable I, [2024-05-17T04:46:50.610122 #3307373] INFO -- : [696/885] 3348735=test_rdoc_parser_c I, [2024-05-17T04:46:50.660868 #3307373] INFO -- : [697/885] 3348750=test_gbk I, [2024-05-17T04:46:50.665028 #3307373] INFO -- : [698/885] 3348750=test_class2name I, [2024-05-17T04:46:50.677773 #3307373] INFO -- : [699/885] 3348750=test_enc_str_buf_cat I, [2024-05-17T04:46:50.682500 #3307373] INFO -- : [700/885] 3348750=test_pstore I, [2024-05-17T04:46:50.684697 #3307373] INFO -- : [701/885] 3348738=test_cstr I, [2024-05-17T04:46:50.690180 #3307373] INFO -- : [702/885] 3348734=test_profile_frames I, [2024-05-17T04:46:50.707280 #3307373] INFO -- : [703/885] 3348751=test_gem_commands_list_command I, [2024-05-17T04:46:50.717250 #3307373] INFO -- : [704/885] 3348751=test_stack I, [2024-05-17T04:46:50.720984 #3307373] INFO -- : [705/885] 3348750=test_rdoc_include I, [2024-05-17T04:46:50.761963 #3307373] INFO -- : [706/885] 3348750=test_reqarg I, [2024-05-17T04:46:50.764627 #3307373] INFO -- : [707/885] 3348747=test_too_many_dummy_encodings I, [2024-05-17T04:46:50.823748 #3307373] INFO -- : [708/885] 3348747=test_gem_version I, [2024-05-17T04:46:50.857820 #3307373] INFO -- : [709/885] 3348735=test_rdoc_options I, [2024-05-17T04:46:50.878566 #3307373] INFO -- : [710/885] 3348742=test_econv I, [2024-05-17T04:46:50.881951 #3307373] INFO -- : [711/885] 3348734=test_cesu8 I, [2024-05-17T04:46:50.885583 #3307373] INFO -- : [712/885] 3348734=test_fileutils I, [2024-05-17T04:46:50.898415 #3307373] INFO -- : [713/885] 3348747=test_string_processing I, [2024-05-17T04:46:50.900941 #3307373] INFO -- : [714/885] 3348747=test_emitter I, [2024-05-17T04:46:50.918012 #3307373] INFO -- : [715/885] 3348747=test_resource I, [2024-05-17T04:46:50.939833 #3307373] INFO -- : [716/885] 3348747=test_gem_commands_signin_command I, [2024-05-17T04:46:51.029620 #3307373] INFO -- : [717/885] 3348747=test_ldap I, [2024-05-17T04:46:51.036837 #3307373] INFO -- : [718/885] 3348747=test_gem_ext_ext_conf_builder I, [2024-05-17T04:46:51.115497 #3307373] INFO -- : [719/885] 3348735=test_frozen_error I, [2024-05-17T04:46:51.120450 #3307373] INFO -- : [720/885] 3348735=test_method_cache I, [2024-05-17T04:46:51.121282 #3307373] INFO -- : [721/885] 3348735=test_gem_stub_specification I, [2024-05-17T04:46:51.167936 #3307373] INFO -- : [722/885] 3348750=test_gem_commands_search_command I, [2024-05-17T04:46:51.224341 #3307373] INFO -- : [723/885] 3348744=test_complex I, [2024-05-17T04:46:51.272780 #3307373] INFO -- : [724/885] 3348735=test_inlinecache I, [2024-05-17T04:46:51.299868 #3307373] INFO -- : [725/885] 3348750=test_rdoc_markup_verbatim I, [2024-05-17T04:46:51.309268 #3307373] INFO -- : [726/885] 3348750=test_gem_resolver_specification I, [2024-05-17T04:46:51.344050 #3307373] INFO -- : [727/885] 3348734=test_gem_dependency I, [2024-05-17T04:46:51.345700 #3307373] INFO -- : [728/885] 3348750=test_path_to_class I, [2024-05-17T04:46:51.347708 #3307373] INFO -- : [729/885] 3348744=test_mdns I, [2024-05-17T04:46:51.351967 #3307373] INFO -- : [730/885] 3348735=test_parse I, [2024-05-17T04:46:51.353782 #3307373] INFO -- : [731/885] 3348750=test_gem_remote_fetcher I, [2024-05-17T04:46:51.367390 #3307373] INFO -- : [732/885] 3348744=test_scanner_events I, [2024-05-17T04:46:51.414117 #3307373] INFO -- : [733/885] 3348744=test_gem_resolver_installed_specification I, [2024-05-17T04:46:51.434664 #3307373] INFO -- : [734/885] 3348744=test_date_strftime I, [2024-05-17T04:46:51.443205 #3307373] INFO -- : [735/885] 3348734=test_rdoc_parser_rd I, [2024-05-17T04:46:51.455138 #3307373] INFO -- : [736/885] 3348734=test_yamlstore I, [2024-05-17T04:46:51.463288 #3307373] INFO -- : [737/885] 3348734=test_gem_installer I, [2024-05-17T04:46:51.469052 #3307373] INFO -- : [738/885] 3348739=test_class I, [2024-05-17T04:46:51.543150 #3307373] INFO -- : [739/885] 3348738=test_rdoc_normal_class I, [2024-05-17T04:46:51.548616 #3307373] INFO -- : [740/885] 3348751=test_const I, [2024-05-17T04:46:51.558188 #3307373] INFO -- : [741/885] 3348751=json_string_matching_test I, [2024-05-17T04:46:51.561062 #3307373] INFO -- : [742/885] 3348751=test_load I, [2024-05-17T04:46:51.565408 #3307373] INFO -- : [743/885] 3348751=test_random I, [2024-05-17T04:46:51.571327 #3307373] INFO -- : [744/885] 3348751=test_asn1 I, [2024-05-17T04:46:51.581106 #3307373] INFO -- : [745/885] 3348751=test_irb I, [2024-05-17T04:46:51.591618 #3307373] INFO -- : [746/885] 3348733=test_function I, [2024-05-17T04:46:51.623778 #3307373] INFO -- : [747/885] 3348738=test_queue I, [2024-05-17T04:46:51.630149 #3307373] INFO -- : [748/885] 3348738=test_tempfile I, [2024-05-17T04:46:51.753098 #3307373] INFO -- : [749/885] 3348751=parse_comments_test I, [2024-05-17T04:46:51.760659 #3307373] INFO -- : [750/885] 3348737=test_noarg I, [2024-05-17T04:46:51.792529 #3307373] INFO -- : [751/885] 3348751=test_utf32 I, [2024-05-17T04:46:51.795347 #3307373] INFO -- : [752/885] 3348751=test_basicsocket I, [2024-05-17T04:46:51.800899 #3307373] INFO -- : [753/885] 3348744=test_duplicate I, [2024-05-17T04:46:51.805403 #3307373] INFO -- : [754/885] 3348744=test_rdoc_markup I, [2024-05-17T04:46:51.807619 #3307373] INFO -- : [755/885] 3348751=test_gem_commands_help_command I, [2024-05-17T04:46:51.812895 #3307373] INFO -- : [756/885] 3348733=test_prettyprint I, [2024-05-17T04:46:51.813152 #3307373] INFO -- : [757/885] 3348744=test_tracepoint I, [2024-05-17T04:46:51.848809 #3307373] INFO -- : [758/885] 3348733=test_internal_ivar I, [2024-05-17T04:46:51.852698 #3307373] INFO -- : [759/885] 3348733=test_gem_resolver_index_specification I, [2024-05-17T04:46:51.881120 #3307373] INFO -- : [760/885] 3348733=test_date_attr I, [2024-05-17T04:46:51.884925 #3307373] INFO -- : [761/885] 3348733=test_ellipsize I, [2024-05-17T04:46:51.899226 #3307373] INFO -- : [762/885] 3348733=warnings_test I, [2024-05-17T04:46:51.904139 #3307373] INFO -- : [763/885] 3348735=test_kwargs I, [2024-05-17T04:46:51.908750 #3307373] INFO -- : [764/885] 3348735=test_io_wait I, [2024-05-17T04:46:51.913679 #3307373] INFO -- : [765/885] 3348751=test_gem_commands_exec_command I, [2024-05-17T04:46:51.914610 #3307373] INFO -- : [766/885] 3348733=test_type_completor I, [2024-05-17T04:46:51.919675 #3307373] INFO -- : [767/885] 3348742=test_summary I, [2024-05-17T04:46:51.921028 #3307373] INFO -- : [768/885] 3348733=test_console_attr I, [2024-05-17T04:46:51.925719 #3307373] INFO -- : [769/885] 3348733=test_gem_commands_uninstall_command I, [2024-05-17T04:46:51.946524 #3307373] INFO -- : [770/885] 3348738=test_condition I, [2024-05-17T04:46:51.949811 #3307373] INFO -- : [771/885] 3348738=test_gem_source_specific_file I, [2024-05-17T04:46:51.968119 #3307373] INFO -- : [772/885] 3348737=test_foreach I, [2024-05-17T04:46:51.971724 #3307373] INFO -- : [773/885] 3348737=test_cp949 I, [2024-05-17T04:46:51.974557 #3307373] INFO -- : [774/885] 3348737=test_win32ole_record I, [2024-05-17T04:46:51.980889 #3307373] INFO -- : [775/885] 3348737=test_gem_unsatisfiable_dependency_error I, [2024-05-17T04:46:51.992331 #3307373] INFO -- : [776/885] 3348737=test_hash I, [2024-05-17T04:46:52.068151 #3307373] INFO -- : [777/885] 3348738=test_ubf_async_safe I, [2024-05-17T04:46:52.078074 #3307373] INFO -- : [778/885] 3348742=test_sorted_set I, [2024-05-17T04:46:52.089731 #3307373] INFO -- : [779/885] 3348738=test_emoji I, [2024-05-17T04:46:52.109185 #3307373] INFO -- : [780/885] 3348738=test_win32ole_type_event I, [2024-05-17T04:46:52.112868 #3307373] INFO -- : [781/885] 3348744=test_io I, [2024-05-17T04:46:52.114299 #3307373] INFO -- : [782/885] 3348738=test_pattern_key_name_check I, [2024-05-17T04:46:52.127710 #3307373] INFO -- : [783/885] 3348738=test_to_ruby I, [2024-05-17T04:46:52.144327 #3307373] INFO -- : [784/885] 3348738=test_pack I, [2024-05-17T04:46:52.239611 #3307373] INFO -- : [785/885] 3348735=test_array_create I, [2024-05-17T04:46:52.240069 #3307373] INFO -- : [786/885] 3348735=test_gem_impossible_dependencies_error I, [2024-05-17T04:46:52.252698 #3307373] INFO -- : [787/885] 3348735=test_gem_commands_query_command I, [2024-05-17T04:46:52.291721 #3307373] INFO -- : [788/885] 3348742=test_method I, [2024-05-17T04:46:52.331529 #3307373] INFO -- : [789/885] 3348738=test_rdoc_rubygems_hook I, [2024-05-17T04:46:52.346890 #3307373] INFO -- : [790/885] 3348744=test_euc_kr I, [2024-05-17T04:46:52.348415 #3307373] INFO -- : [791/885] 3348747=test_rdoc_context_section I, [2024-05-17T04:46:52.353273 #3307373] INFO -- : [792/885] 3348744=test_ftp I, [2024-05-17T04:46:52.357115 #3307373] INFO -- : [793/885] 3348747=comments_test I, [2024-05-17T04:46:52.359178 #3307373] INFO -- : [794/885] 3348744=test_gem_requirement I, [2024-05-17T04:46:52.388594 #3307373] INFO -- : [795/885] 3348747=test_sprintf I, [2024-05-17T04:46:52.432990 #3307373] INFO -- : [796/885] 3348738=test_string_memory I, [2024-05-17T04:46:52.493898 #3307373] INFO -- : [797/885] 3348733=test_gem_security_trust_dir I, [2024-05-17T04:46:52.495058 #3307373] INFO -- : [798/885] 3348744=test_undef I, [2024-05-17T04:46:52.505689 #3307373] INFO -- : [799/885] 3348744=test_objspace I, [2024-05-17T04:46:52.527030 #3307373] INFO -- : [800/885] 3348733=ripper_test I, [2024-05-17T04:46:52.532451 #3307373] INFO -- : [801/885] 3348738=test_line_editor I, [2024-05-17T04:46:52.546600 #3307373] INFO -- : [802/885] 3348738=test_remote_fetch_error I, [2024-05-17T04:46:52.553761 #3307373] INFO -- : [803/885] 3348738=test_have_library I, [2024-05-17T04:46:52.563466 #3307373] INFO -- : [804/885] 3348747=test_lock_native_thread I, [2024-05-17T04:46:52.739013 #3307373] INFO -- : [805/885] 3348735=test_c_struct_entry I, [2024-05-17T04:46:52.764573 #3307373] INFO -- : [806/885] 3348740=test_gem_commands_stale_command I, [2024-05-17T04:46:52.777089 #3307373] INFO -- : [807/885] 3348740=test_set I, [2024-05-17T04:46:52.784364 #3307373] INFO -- : [808/885] 3348740=test_show_source I, [2024-05-17T04:46:52.841824 #3307373] INFO -- : [809/885] 3348740=test_protect I, [2024-05-17T04:46:52.848032 #3307373] INFO -- : [810/885] 3348740=test_win32ole_typelib I, [2024-05-17T04:46:52.848792 #3307373] INFO -- : [811/885] 3348740=test_gem_request_set_lockfile I, [2024-05-17T04:46:52.863657 #3307373] INFO -- : [812/885] 3348747=test_raise_exception I, [2024-05-17T04:46:52.932879 #3307373] INFO -- : [813/885] 3348751=test_postponed_job I, [2024-05-17T04:46:52.959400 #3307373] INFO -- : [814/885] 3348733=test_alias_and_anchor I, [2024-05-17T04:46:52.966107 #3307373] INFO -- : [815/885] 3348733=test_external_new I, [2024-05-17T04:46:52.972787 #3307373] INFO -- : [816/885] 3348733=test_gem_resolver_dependency_request I, [2024-05-17T04:46:52.989411 #3307373] INFO -- : [817/885] 3348733=test_tree_builder I, [2024-05-17T04:46:52.992043 #3307373] INFO -- : [818/885] 3348733=test_hash I, [2024-05-17T04:46:53.004660 #3307373] INFO -- : [819/885] 3348733=test_kill_ring I, [2024-05-17T04:46:53.024154 #3307373] INFO -- : [820/885] 3348733=test_framework I, [2024-05-17T04:46:53.027446 #3307373] INFO -- : [821/885] 3348733=test_ns_spki I, [2024-05-17T04:46:53.061682 #3307373] INFO -- : [822/885] 3348733=test_argf I, [2024-05-17T04:46:53.092460 #3307373] INFO -- : [823/885] 3348735=test_gem_commands_environment_command I, [2024-05-17T04:46:53.136841 #3307373] INFO -- : [824/885] 3348735=test_m17n I, [2024-05-17T04:46:53.203948 #3307373] INFO -- : [825/885] 3348735=test_ws I, [2024-05-17T04:46:53.216896 #3307373] INFO -- : [826/885] 3348740=test_yjit I, [2024-05-17T04:46:53.222394 #3307373] INFO -- : [827/885] 3348735=test_workspace I, [2024-05-17T04:46:53.226674 #3307373] INFO -- : [828/885] 3348740=test_weakmap I, [2024-05-17T04:46:53.267405 #3307373] INFO -- : [829/885] 3348751=test_rdoc_markup_indented_paragraph I, [2024-05-17T04:46:53.276724 #3307373] INFO -- : [830/885] 3348751=test_rdoc_task I, [2024-05-17T04:46:53.284419 #3307373] INFO -- : [831/885] 3348751=test_gem_resolver_conflict I, [2024-05-17T04:46:53.290852 #3307373] INFO -- : [832/885] 3348751=ruby_parser_test I, [2024-05-17T04:46:53.306837 #3307373] INFO -- : [833/885] 3348751=test_backtrace I, [2024-05-17T04:46:53.356568 #3307373] INFO -- : [834/885] 3348735=test_pack I, [2024-05-17T04:46:53.368379 #3307373] INFO -- : [835/885] 3348750=test_io_buffer I, [2024-05-17T04:46:53.398304 #3307373] INFO -- : [836/885] 3348735=test_readpartial I, [2024-05-17T04:46:53.482099 #3307373] INFO -- : [837/885] 3348750=test_gem_commands_install_command I, [2024-05-17T04:46:53.584613 #3307373] INFO -- : [838/885] 3348745=test_clone I, [2024-05-17T04:46:53.672003 #3307373] INFO -- : [839/885] 3348747=test_rdoc_require I, [2024-05-17T04:46:53.694252 #3307373] INFO -- : [840/885] 3348747=locals_test I, [2024-05-17T04:46:53.788644 #3307373] INFO -- : [841/885] 3348745=test_gem_resolver_best_set I, [2024-05-17T04:46:53.793969 #3307373] INFO -- : [842/885] 3348735=encoding_test I, [2024-05-17T04:46:53.829775 #3307373] INFO -- : [843/885] 3348738=test_typeddata I, [2024-05-17T04:46:53.850258 #3307373] INFO -- : [844/885] 3348745=test_rdoc_markup_to_html_crossref I, [2024-05-17T04:46:53.876097 #3307373] INFO -- : [845/885] 3348735=test_webauthn_poller I, [2024-05-17T04:46:53.939421 #3307373] INFO -- : [846/885] 3348741=test_rdoc_markup_raw I, [2024-05-17T04:46:53.944202 #3307373] INFO -- : [847/885] 3348741=test_rat I, [2024-05-17T04:46:53.952805 #3307373] INFO -- : [848/885] 3348741=test_optparse I, [2024-05-17T04:46:53.952890 #3307373] INFO -- : [849/885] 3348741=test_array I, [2024-05-17T04:46:53.961217 #3307373] INFO -- : [850/885] 3348741=test_fstring I, [2024-05-17T04:46:54.017375 #3307373] INFO -- : [851/885] 3348735=test_yield I, [2024-05-17T04:46:54.066683 #3307373] INFO -- : [852/885] 3348738=test_rdoc_alias I, [2024-05-17T04:46:54.077366 #3307373] INFO -- : [853/885] 3348738=test_convertible I, [2024-05-17T04:46:54.086759 #3307373] INFO -- : [854/885] 3348741=parser_test I, [2024-05-17T04:46:54.090077 #3307373] INFO -- : [855/885] 3348741=test_files_sample I, [2024-05-17T04:46:54.107527 #3307373] INFO -- : [856/885] 3348745=test_stringscanner I, [2024-05-17T04:46:54.111097 #3307373] INFO -- : [857/885] 3348747=test_gem_util I, [2024-05-17T04:46:54.159121 #3307373] INFO -- : [858/885] 3348745=test_iseq_load I, [2024-05-17T04:46:54.174416 #3307373] INFO -- : [859/885] 3348741=test_gem_package_tar_header I, [2024-05-17T04:46:54.208898 #3307373] INFO -- : [860/885] 3348741=test_pkey_dh I, [2024-05-17T04:46:54.278591 #3307373] INFO -- : [861/885] 3348747=test_bigzero I, [2024-05-17T04:46:54.284244 #3307373] INFO -- : [862/885] 3348747=test_pkcs12 I, [2024-05-17T04:46:54.331998 #3307373] INFO -- : [863/885] 3348741=test_system I, [2024-05-17T04:46:54.641201 #3307373] INFO -- : [864/885] 3348751=test_etc I, [2024-05-17T04:46:54.746465 #3307373] INFO -- : [865/885] 3348751=test_yjit_exit_locations I, [2024-05-17T04:46:54.752793 #3307373] INFO -- : [866/885] 3348751=test_gem_resolver_activation_request I, [2024-05-17T04:46:54.759758 #3307373] INFO -- : [867/885] 3348751=test_getopts I, [2024-05-17T04:46:54.766011 #3307373] INFO -- : [868/885] 3348751=test_protocol I, [2024-05-17T04:46:54.766345 #3307373] INFO -- : [869/885] 3348750=test_ripper I, [2024-05-17T04:46:54.769784 #3307373] INFO -- : [870/885] 3348746=test_gem_config_file I, [2024-05-17T04:46:54.851357 #3307373] INFO -- : [871/885] 3348747=test_config I, [2024-05-17T04:46:54.899286 #3307373] INFO -- : [872/885] 3348747=test_sleep I, [2024-05-17T04:46:54.913722 #3307373] INFO -- : [873/885] 3348746=test_gem_commands_fetch_command I, [2024-05-17T04:46:55.048942 #3307373] INFO -- : [874/885] 3348746=test_math I, [2024-05-17T04:46:55.057648 #3307373] INFO -- : [875/885] 3348746=test_gc I, [2024-05-17T04:46:55.060522 #3307373] INFO -- : [876/885] 3348746=test_libs I, [2024-05-17T04:46:55.071036 #3307373] INFO -- : [877/885] 3348745=test_yaml_tree I, [2024-05-17T04:46:55.072246 #3307373] INFO -- : [878/885] 3348751=test_rendering I, [2024-05-17T04:46:55.083195 #3307373] INFO -- : [879/885] 3348751=test_face I, [2024-05-17T04:46:55.089831 #3307373] INFO -- : [880/885] 3348746=test_sizeof I, [2024-05-17T04:46:55.097006 #3307373] INFO -- : [881/885] 3348751=test_case I, [2024-05-17T04:46:55.107064 #3307373] INFO -- : [882/885] 3348745=test_unicode_escape I, [2024-05-17T04:46:55.127146 #3307373] INFO -- : [883/885] 3348751=test_io I, [2024-05-17T04:46:55.135650 #3307373] INFO -- : [884/885] 3348750=test_utf16 I, [2024-05-17T04:46:55.149118 #3307373] INFO -- : [885/885] 3348750=test_autoload I, [2024-05-17T04:47:11.343241 #3307373] INFO -- : Finished tests in 35.666060s, 740.4799 tests/s, 262295.4710 assertions/s. I, [2024-05-17T04:47:11.343944 #3307373] INFO -- : 26410 tests, 9355046 assertions, 0 failures, 0 errors, 306 skips I, [2024-05-17T04:47:11.343967 #3307373] INFO -- : I, [2024-05-17T04:47:11.343973 #3307373] INFO -- : ruby -v: ruby 3.4.0dev (2024-05-17T02:50:59Z master 534f1c37e3) [x86_64-linux] I, [2024-05-17T04:47:11.346445 #3307373] INFO -- : $$$[end] "make yes-test-all TESTOPTS='--stderr-on-failure' TESTS='-j20'" exit with 0. I, [2024-05-17T04:47:11.346613 #3307373] INFO -- : $$$[beg] make yes-test-rubyspec MSPECOPT='--error-output stderr --debug -j' TESTS='-j20' I, [2024-05-17T04:47:11.433703 #3307373] INFO -- : BASERUBY = /usr/bin/ruby --disable=gems I, [2024-05-17T04:47:11.433748 #3307373] INFO -- : CC = gcc I, [2024-05-17T04:47:11.433754 #3307373] INFO -- : LD = ld I, [2024-05-17T04:47:11.433759 #3307373] INFO -- : LDSHARED = gcc -shared I, [2024-05-17T04:47:11.433763 #3307373] INFO -- : CFLAGS = -O3 -fno-fast-math -ggdb3 -Wall -Wextra -Wdeprecated-declarations -Wdiv-by-zero -Wduplicated-cond -Wimplicit-function-declaration -Wimplicit-int -Wpointer-arith -Wwrite-strings -Wold-style-definition -Wimplicit-fallthrough=0 -Wmissing-noreturn -Wno-cast-function-type -Wno-constant-logical-operand -Wno-long-long -Wno-missing-field-initializers -Wno-overlength-strings -Wno-packed-bitfield-compat -Wno-parentheses-equality -Wno-self-assign -Wno-tautological-compare -Wno-unused-parameter -Wno-unused-value -Wsuggest-attribute=format -Wsuggest-attribute=noreturn -Wunused-variable -Wmisleading-indentation -Wundef -fPIC I, [2024-05-17T04:47:11.433769 #3307373] INFO -- : XCFLAGS = -U_FORTIFY_SOURCE -D_FORTIFY_SOURCE=2 -fstack-protector-strong -fno-strict-overflow -fvisibility=hidden -fexcess-precision=standard -DRUBY_EXPORT -I. -I.ext/include/x86_64-linux -I/tmp/ruby/src/trunk/include -I/tmp/ruby/src/trunk -I/tmp/ruby/src/trunk/prism -I/tmp/ruby/src/trunk/enc/unicode/15.0.0 I, [2024-05-17T04:47:11.433773 #3307373] INFO -- : CPPFLAGS = I, [2024-05-17T04:47:11.433776 #3307373] INFO -- : DLDFLAGS = -Wl,--compress-debug-sections=zlib -Wl,-soname,libruby.so.3.4 -fstack-protector-strong I, [2024-05-17T04:47:11.433780 #3307373] INFO -- : SOLIBS = -lz -lrt -lrt -lgmp -ldl -lcrypt -lm -lpthread I, [2024-05-17T04:47:11.433784 #3307373] INFO -- : LANG = en_US.UTF-8 I, [2024-05-17T04:47:11.433788 #3307373] INFO -- : LC_ALL = I, [2024-05-17T04:47:11.433792 #3307373] INFO -- : LC_CTYPE = I, [2024-05-17T04:47:11.433795 #3307373] INFO -- : MFLAGS = I, [2024-05-17T04:47:11.433808 #3307373] INFO -- : RUSTC = no I, [2024-05-17T04:47:11.433812 #3307373] INFO -- : YJIT_RUSTC_ARGS = --crate-name=yjit --crate-type=staticlib --edition=2021 -g -C lto=thin -C opt-level=3 -C overflow-checks=on '--out-dir=/tmp/ruby/build/trunk/yjit/target/release/' /tmp/ruby/src/trunk/yjit/src/lib.rs I, [2024-05-17T04:47:11.434446 #3307373] INFO -- : gcc (Ubuntu 11.4.0-1ubuntu1~22.04) 11.4.0 I, [2024-05-17T04:47:11.434467 #3307373] INFO -- : Copyright (C) 2021 Free Software Foundation, Inc. I, [2024-05-17T04:47:11.434472 #3307373] INFO -- : This is free software; see the source for copying conditions. There is NO I, [2024-05-17T04:47:11.434477 #3307373] INFO -- : warranty; not even for MERCHANTABILITY or FITNESS FOR A PARTICULAR PURPOSE. I, [2024-05-17T04:47:11.434480 #3307373] INFO -- : I, [2024-05-17T04:47:11.436063 #3307373] INFO -- : generating enc.mk I, [2024-05-17T04:47:11.555041 #3307373] INFO -- : making enc I, [2024-05-17T04:47:11.572261 #3307373] INFO -- : make[1]: Entering directory '/tmp/ruby/build/trunk' I, [2024-05-17T04:47:11.572284 #3307373] INFO -- : make[1]: Nothing to be done for 'enc'. I, [2024-05-17T04:47:11.572290 #3307373] INFO -- : make[1]: Leaving directory '/tmp/ruby/build/trunk' I, [2024-05-17T04:47:11.572913 #3307373] INFO -- : making srcs under enc I, [2024-05-17T04:47:11.602372 #3307373] INFO -- : make[1]: Entering directory '/tmp/ruby/build/trunk' I, [2024-05-17T04:47:11.602393 #3307373] INFO -- : make[1]: Nothing to be done for 'srcs'. I, [2024-05-17T04:47:11.602399 #3307373] INFO -- : make[1]: Leaving directory '/tmp/ruby/build/trunk' I, [2024-05-17T04:47:11.603210 #3307373] INFO -- : generating transdb.h I, [2024-05-17T04:47:11.699100 #3307373] INFO -- : transdb.h unchanged I, [2024-05-17T04:47:11.700296 #3307373] INFO -- : making trans I, [2024-05-17T04:47:11.735142 #3307373] INFO -- : make[1]: Entering directory '/tmp/ruby/build/trunk' I, [2024-05-17T04:47:11.735164 #3307373] INFO -- : make[1]: Nothing to be done for 'trans'. I, [2024-05-17T04:47:11.735170 #3307373] INFO -- : make[1]: Leaving directory '/tmp/ruby/build/trunk' I, [2024-05-17T04:47:11.735783 #3307373] INFO -- : making encs I, [2024-05-17T04:47:11.777590 #3307373] INFO -- : make[1]: Entering directory '/tmp/ruby/build/trunk' I, [2024-05-17T04:47:11.777611 #3307373] INFO -- : make[1]: Nothing to be done for 'encs'. I, [2024-05-17T04:47:11.777616 #3307373] INFO -- : make[1]: Leaving directory '/tmp/ruby/build/trunk' I, [2024-05-17T04:47:11.779336 #3307373] INFO -- : generating makefiles ext/configure-ext.mk I, [2024-05-17T04:47:11.805936 #3307373] INFO -- : ext/configure-ext.mk updated I, [2024-05-17T04:47:11.808300 #3307373] INFO -- : make[1]: Entering directory '/tmp/ruby/build/trunk' I, [2024-05-17T04:47:13.159014 #3307373] INFO -- : make[1]: Leaving directory '/tmp/ruby/build/trunk' I, [2024-05-17T04:47:13.159765 #3307373] INFO -- : generating makefile exts.mk I, [2024-05-17T04:47:13.196689 #3307373] INFO -- : exts.mk unchanged I, [2024-05-17T04:47:13.201471 #3307373] INFO -- : make[1]: Entering directory '/tmp/ruby/build/trunk' I, [2024-05-17T04:47:13.498564 #3307373] INFO -- : make[2]: Entering directory '/tmp/ruby/build/trunk/ext/coverage' I, [2024-05-17T04:47:13.502461 #3307373] INFO -- : make[2]: Leaving directory '/tmp/ruby/build/trunk/ext/coverage' I, [2024-05-17T04:47:13.509084 #3307373] INFO -- : make[2]: Entering directory '/tmp/ruby/build/trunk/ext/date' I, [2024-05-17T04:47:13.514655 #3307373] INFO -- : make[2]: Leaving directory '/tmp/ruby/build/trunk/ext/date' I, [2024-05-17T04:47:13.518777 #3307373] INFO -- : make[2]: Entering directory '/tmp/ruby/build/trunk/ext/digest' I, [2024-05-17T04:47:13.527718 #3307373] INFO -- : make[2]: Leaving directory '/tmp/ruby/build/trunk/ext/digest' I, [2024-05-17T04:47:13.554821 #3307373] INFO -- : make[2]: Entering directory '/tmp/ruby/build/trunk/ext/digest/sha2' I, [2024-05-17T04:47:13.559828 #3307373] INFO -- : make[2]: Leaving directory '/tmp/ruby/build/trunk/ext/digest/sha2' I, [2024-05-17T04:47:13.581010 #3307373] INFO -- : make[2]: Entering directory '/tmp/ruby/build/trunk/ext/fiddle' I, [2024-05-17T04:47:13.589768 #3307373] INFO -- : make[2]: Leaving directory '/tmp/ruby/build/trunk/ext/fiddle' I, [2024-05-17T04:47:13.594777 #3307373] INFO -- : make[2]: Entering directory '/tmp/ruby/build/trunk/ext/io/console' I, [2024-05-17T04:47:13.598979 #3307373] INFO -- : make[2]: Leaving directory '/tmp/ruby/build/trunk/ext/io/console' I, [2024-05-17T04:47:13.612914 #3307373] INFO -- : make[2]: Entering directory '/tmp/ruby/build/trunk/ext/json' I, [2024-05-17T04:47:13.623935 #3307373] INFO -- : make[2]: Leaving directory '/tmp/ruby/build/trunk/ext/json' I, [2024-05-17T04:47:13.639696 #3307373] INFO -- : make[2]: Entering directory '/tmp/ruby/build/trunk/ext/monitor' I, [2024-05-17T04:47:13.643728 #3307373] INFO -- : make[2]: Leaving directory '/tmp/ruby/build/trunk/ext/monitor' I, [2024-05-17T04:47:13.650820 #3307373] INFO -- : make[2]: Entering directory '/tmp/ruby/build/trunk/ext/objspace' I, [2024-05-17T04:47:13.656157 #3307373] INFO -- : make[2]: Leaving directory '/tmp/ruby/build/trunk/ext/objspace' I, [2024-05-17T04:47:13.671409 #3307373] INFO -- : make[2]: Entering directory '/tmp/ruby/build/trunk/ext/openssl' I, [2024-05-17T04:47:13.685255 #3307373] INFO -- : make[2]: Leaving directory '/tmp/ruby/build/trunk/ext/openssl' I, [2024-05-17T04:47:13.688219 #3307373] INFO -- : make[2]: Entering directory '/tmp/ruby/build/trunk/ext/pathname' I, [2024-05-17T04:47:13.690990 #3307373] INFO -- : make[2]: Leaving directory '/tmp/ruby/build/trunk/ext/pathname' I, [2024-05-17T04:47:13.695798 #3307373] INFO -- : make[2]: Entering directory '/tmp/ruby/build/trunk/ext/psych' I, [2024-05-17T04:47:13.712511 #3307373] INFO -- : make[2]: Leaving directory '/tmp/ruby/build/trunk/ext/psych' I, [2024-05-17T04:47:13.715527 #3307373] INFO -- : make[2]: Entering directory '/tmp/ruby/build/trunk/ext/pty' I, [2024-05-17T04:47:13.718214 #3307373] INFO -- : make[2]: Leaving directory '/tmp/ruby/build/trunk/ext/pty' I, [2024-05-17T04:47:13.728164 #3307373] INFO -- : make[2]: Entering directory '/tmp/ruby/build/trunk/ext/ripper' I, [2024-05-17T04:47:13.733167 #3307373] INFO -- : make[2]: Leaving directory '/tmp/ruby/build/trunk/ext/ripper' I, [2024-05-17T04:47:13.734697 #3307373] INFO -- : make[2]: Entering directory '/tmp/ruby/build/trunk/ext/rubyvm' I, [2024-05-17T04:47:13.736811 #3307373] INFO -- : make[2]: Leaving directory '/tmp/ruby/build/trunk/ext/rubyvm' I, [2024-05-17T04:47:13.748802 #3307373] INFO -- : make[2]: Entering directory '/tmp/ruby/build/trunk/ext/socket' I, [2024-05-17T04:47:13.757861 #3307373] INFO -- : make[2]: Leaving directory '/tmp/ruby/build/trunk/ext/socket' I, [2024-05-17T04:47:13.776319 #3307373] INFO -- : make[2]: Entering directory '/tmp/ruby/build/trunk/.bundle/gems/bigdecimal-3.1.8/ext/bigdecimal' I, [2024-05-17T04:47:13.807130 #3307373] INFO -- : make[2]: Leaving directory '/tmp/ruby/build/trunk/.bundle/gems/bigdecimal-3.1.8/ext/bigdecimal' I, [2024-05-17T04:47:13.809456 #3307373] INFO -- : make[2]: Entering directory '/tmp/ruby/build/trunk/.bundle/gems/debug-1.9.2/ext/debug' I, [2024-05-17T04:47:13.838460 #3307373] INFO -- : make[2]: Leaving directory '/tmp/ruby/build/trunk/.bundle/gems/debug-1.9.2/ext/debug' I, [2024-05-17T04:47:13.840807 #3307373] INFO -- : make[2]: Entering directory '/tmp/ruby/build/trunk/.bundle/gems/nkf-0.2.0/ext/nkf' I, [2024-05-17T04:47:13.865179 #3307373] INFO -- : make[2]: Leaving directory '/tmp/ruby/build/trunk/.bundle/gems/nkf-0.2.0/ext/nkf' I, [2024-05-17T04:47:13.867187 #3307373] INFO -- : make[2]: Entering directory '/tmp/ruby/build/trunk/.bundle/gems/racc-1.7.3/ext/racc/cparse' I, [2024-05-17T04:47:13.888242 #3307373] INFO -- : make[2]: Leaving directory '/tmp/ruby/build/trunk/.bundle/gems/racc-1.7.3/ext/racc/cparse' I, [2024-05-17T04:47:13.890615 #3307373] INFO -- : make[2]: Entering directory '/tmp/ruby/build/trunk/.bundle/gems/rbs-3.4.4/ext/rbs_extension' I, [2024-05-17T04:47:13.912210 #3307373] INFO -- : make[2]: Leaving directory '/tmp/ruby/build/trunk/.bundle/gems/rbs-3.4.4/ext/rbs_extension' I, [2024-05-17T04:47:13.914117 #3307373] INFO -- : make[2]: Entering directory '/tmp/ruby/build/trunk/.bundle/gems/syslog-0.1.2/ext/syslog' I, [2024-05-17T04:47:13.936520 #3307373] INFO -- : make[2]: Leaving directory '/tmp/ruby/build/trunk/.bundle/gems/syslog-0.1.2/ext/syslog' I, [2024-05-17T04:47:13.960109 #3307373] INFO -- : make[2]: Entering directory '/tmp/ruby/build/trunk' I, [2024-05-17T04:47:14.027939 #3307373] INFO -- : make[2]: 'ruby' is up to date. I, [2024-05-17T04:47:14.027977 #3307373] INFO -- : make[2]: Leaving directory '/tmp/ruby/build/trunk' I, [2024-05-17T04:47:14.028398 #3307373] INFO -- : make[1]: Leaving directory '/tmp/ruby/build/trunk' I, [2024-05-17T04:47:14.031953 #3307373] INFO -- : make[1]: Entering directory '/tmp/ruby/build/trunk' I, [2024-05-17T04:47:14.031975 #3307373] INFO -- : make[1]: Nothing to be done for 'note'. I, [2024-05-17T04:47:14.031993 #3307373] INFO -- : make[1]: Leaving directory '/tmp/ruby/build/trunk' E, [2024-05-17T04:47:14.092549 #3307373] ERROR -- : $ /tmp/ruby/build/trunk/miniruby -I/tmp/ruby/src/trunk/lib /tmp/ruby/src/trunk/tool/runruby.rb --archdir=/tmp/ruby/build/trunk --extout=.ext -- /tmp/ruby/src/trunk/spec/mspec/bin/mspec-run -B /tmp/ruby/src/trunk/spec/default.mspec --error-output stderr --debug -fy -o /tmp/rubytest.9lk44y/1-mspec-multi-0 E, [2024-05-17T04:47:14.092787 #3307373] ERROR -- : $ /tmp/ruby/build/trunk/miniruby -I/tmp/ruby/src/trunk/lib /tmp/ruby/src/trunk/tool/runruby.rb --archdir=/tmp/ruby/build/trunk --extout=.ext -- /tmp/ruby/src/trunk/spec/mspec/bin/mspec-run -B /tmp/ruby/src/trunk/spec/default.mspec --error-output stderr --debug -fy -o /tmp/rubytest.9lk44y/2-mspec-multi-1 E, [2024-05-17T04:47:14.093072 #3307373] ERROR -- : $ /tmp/ruby/build/trunk/miniruby -I/tmp/ruby/src/trunk/lib /tmp/ruby/src/trunk/tool/runruby.rb --archdir=/tmp/ruby/build/trunk --extout=.ext -- /tmp/ruby/src/trunk/spec/mspec/bin/mspec-run -B /tmp/ruby/src/trunk/spec/default.mspec --error-output stderr --debug -fy -o /tmp/rubytest.9lk44y/3-mspec-multi-2 E, [2024-05-17T04:47:14.093344 #3307373] ERROR -- : $ /tmp/ruby/build/trunk/miniruby -I/tmp/ruby/src/trunk/lib /tmp/ruby/src/trunk/tool/runruby.rb --archdir=/tmp/ruby/build/trunk --extout=.ext -- /tmp/ruby/src/trunk/spec/mspec/bin/mspec-run -B /tmp/ruby/src/trunk/spec/default.mspec --error-output stderr --debug -fy -o /tmp/rubytest.9lk44y/4-mspec-multi-3 E, [2024-05-17T04:47:14.093612 #3307373] ERROR -- : $ /tmp/ruby/build/trunk/miniruby -I/tmp/ruby/src/trunk/lib /tmp/ruby/src/trunk/tool/runruby.rb --archdir=/tmp/ruby/build/trunk --extout=.ext -- /tmp/ruby/src/trunk/spec/mspec/bin/mspec-run -B /tmp/ruby/src/trunk/spec/default.mspec --error-output stderr --debug -fy -o /tmp/rubytest.9lk44y/5-mspec-multi-4 E, [2024-05-17T04:47:14.093844 #3307373] ERROR -- : $ /tmp/ruby/build/trunk/miniruby -I/tmp/ruby/src/trunk/lib /tmp/ruby/src/trunk/tool/runruby.rb --archdir=/tmp/ruby/build/trunk --extout=.ext -- /tmp/ruby/src/trunk/spec/mspec/bin/mspec-run -B /tmp/ruby/src/trunk/spec/default.mspec --error-output stderr --debug -fy -o /tmp/rubytest.9lk44y/6-mspec-multi-5 E, [2024-05-17T04:47:14.093946 #3307373] ERROR -- : $ /tmp/ruby/build/trunk/miniruby -I/tmp/ruby/src/trunk/lib /tmp/ruby/src/trunk/tool/runruby.rb --archdir=/tmp/ruby/build/trunk --extout=.ext -- /tmp/ruby/src/trunk/spec/mspec/bin/mspec-run -B /tmp/ruby/src/trunk/spec/default.mspec --error-output stderr --debug -fy -o /tmp/rubytest.9lk44y/7-mspec-multi-6 E, [2024-05-17T04:47:14.094147 #3307373] ERROR -- : $ /tmp/ruby/build/trunk/miniruby -I/tmp/ruby/src/trunk/lib /tmp/ruby/src/trunk/tool/runruby.rb --archdir=/tmp/ruby/build/trunk --extout=.ext -- /tmp/ruby/src/trunk/spec/mspec/bin/mspec-run -B /tmp/ruby/src/trunk/spec/default.mspec --error-output stderr --debug -fy -o /tmp/rubytest.9lk44y/8-mspec-multi-7 E, [2024-05-17T04:47:14.094345 #3307373] ERROR -- : $ /tmp/ruby/build/trunk/miniruby -I/tmp/ruby/src/trunk/lib /tmp/ruby/src/trunk/tool/runruby.rb --archdir=/tmp/ruby/build/trunk --extout=.ext -- /tmp/ruby/src/trunk/spec/mspec/bin/mspec-run -B /tmp/ruby/src/trunk/spec/default.mspec --error-output stderr --debug -fy -o /tmp/rubytest.9lk44y/9-mspec-multi-8 E, [2024-05-17T04:47:14.094560 #3307373] ERROR -- : $ /tmp/ruby/build/trunk/miniruby -I/tmp/ruby/src/trunk/lib /tmp/ruby/src/trunk/tool/runruby.rb --archdir=/tmp/ruby/build/trunk --extout=.ext -- /tmp/ruby/src/trunk/spec/mspec/bin/mspec-run -B /tmp/ruby/src/trunk/spec/default.mspec --error-output stderr --debug -fy -o /tmp/rubytest.9lk44y/10-mspec-multi-9 E, [2024-05-17T04:47:14.094953 #3307373] ERROR -- : $ /tmp/ruby/build/trunk/miniruby -I/tmp/ruby/src/trunk/lib /tmp/ruby/src/trunk/tool/runruby.rb --archdir=/tmp/ruby/build/trunk --extout=.ext -- /tmp/ruby/src/trunk/spec/mspec/bin/mspec-run -B /tmp/ruby/src/trunk/spec/default.mspec --error-output stderr --debug -fy -o /tmp/rubytest.9lk44y/11-mspec-multi-10 E, [2024-05-17T04:47:14.095182 #3307373] ERROR -- : $ /tmp/ruby/build/trunk/miniruby -I/tmp/ruby/src/trunk/lib /tmp/ruby/src/trunk/tool/runruby.rb --archdir=/tmp/ruby/build/trunk --extout=.ext -- /tmp/ruby/src/trunk/spec/mspec/bin/mspec-run -B /tmp/ruby/src/trunk/spec/default.mspec --error-output stderr --debug -fy -o /tmp/rubytest.9lk44y/12-mspec-multi-11 E, [2024-05-17T04:47:14.095375 #3307373] ERROR -- : $ /tmp/ruby/build/trunk/miniruby -I/tmp/ruby/src/trunk/lib /tmp/ruby/src/trunk/tool/runruby.rb --archdir=/tmp/ruby/build/trunk --extout=.ext -- /tmp/ruby/src/trunk/spec/mspec/bin/mspec-run -B /tmp/ruby/src/trunk/spec/default.mspec --error-output stderr --debug -fy -o /tmp/rubytest.9lk44y/13-mspec-multi-12 E, [2024-05-17T04:47:14.095561 #3307373] ERROR -- : $ /tmp/ruby/build/trunk/miniruby -I/tmp/ruby/src/trunk/lib /tmp/ruby/src/trunk/tool/runruby.rb --archdir=/tmp/ruby/build/trunk --extout=.ext -- /tmp/ruby/src/trunk/spec/mspec/bin/mspec-run -B /tmp/ruby/src/trunk/spec/default.mspec --error-output stderr --debug -fy -o /tmp/rubytest.9lk44y/14-mspec-multi-13 E, [2024-05-17T04:47:14.095801 #3307373] ERROR -- : $ /tmp/ruby/build/trunk/miniruby -I/tmp/ruby/src/trunk/lib /tmp/ruby/src/trunk/tool/runruby.rb --archdir=/tmp/ruby/build/trunk --extout=.ext -- /tmp/ruby/src/trunk/spec/mspec/bin/mspec-run -B /tmp/ruby/src/trunk/spec/default.mspec --error-output stderr --debug -fy -o /tmp/rubytest.9lk44y/15-mspec-multi-14 E, [2024-05-17T04:47:14.095913 #3307373] ERROR -- : $ /tmp/ruby/build/trunk/miniruby -I/tmp/ruby/src/trunk/lib /tmp/ruby/src/trunk/tool/runruby.rb --archdir=/tmp/ruby/build/trunk --extout=.ext -- /tmp/ruby/src/trunk/spec/mspec/bin/mspec-run -B /tmp/ruby/src/trunk/spec/default.mspec --error-output stderr --debug -fy -o /tmp/rubytest.9lk44y/16-mspec-multi-15 E, [2024-05-17T04:47:14.096091 #3307373] ERROR -- : $ /tmp/ruby/build/trunk/miniruby -I/tmp/ruby/src/trunk/lib /tmp/ruby/src/trunk/tool/runruby.rb --archdir=/tmp/ruby/build/trunk --extout=.ext -- /tmp/ruby/src/trunk/spec/mspec/bin/mspec-run -B /tmp/ruby/src/trunk/spec/default.mspec --error-output stderr --debug -fy -o /tmp/rubytest.9lk44y/17-mspec-multi-16 E, [2024-05-17T04:47:14.096273 #3307373] ERROR -- : $ /tmp/ruby/build/trunk/miniruby -I/tmp/ruby/src/trunk/lib /tmp/ruby/src/trunk/tool/runruby.rb --archdir=/tmp/ruby/build/trunk --extout=.ext -- /tmp/ruby/src/trunk/spec/mspec/bin/mspec-run -B /tmp/ruby/src/trunk/spec/default.mspec --error-output stderr --debug -fy -o /tmp/rubytest.9lk44y/18-mspec-multi-17 E, [2024-05-17T04:47:14.098558 #3307373] ERROR -- : $ /tmp/ruby/build/trunk/miniruby -I/tmp/ruby/src/trunk/lib /tmp/ruby/src/trunk/tool/runruby.rb --archdir=/tmp/ruby/build/trunk --extout=.ext -- /tmp/ruby/src/trunk/spec/mspec/bin/mspec-run -B /tmp/ruby/src/trunk/spec/default.mspec --error-output stderr --debug -fy -o /tmp/rubytest.9lk44y/19-mspec-multi-18 E, [2024-05-17T04:47:14.098880 #3307373] ERROR -- : $ /tmp/ruby/build/trunk/miniruby -I/tmp/ruby/src/trunk/lib /tmp/ruby/src/trunk/tool/runruby.rb --archdir=/tmp/ruby/build/trunk --extout=.ext -- /tmp/ruby/src/trunk/spec/mspec/bin/mspec-run -B /tmp/ruby/src/trunk/spec/default.mspec --error-output stderr --debug -fy -o /tmp/rubytest.9lk44y/20-mspec-multi-19 I, [2024-05-17T04:47:14.264706 #3307373] INFO -- : ruby 3.4.0dev (2024-05-17T02:50:59Z master 534f1c37e3) [x86_64-linux] I, [2024-05-17T04:47:14.863916 #3307373] INFO -- : 0 ......................................................................... I, [2024-05-17T04:47:15.282545 #3307373] INFO -- : 73 ......................................................................... I, [2024-05-17T04:47:15.447422 #3307373] INFO -- : 146 ......................................................................... I, [2024-05-17T04:47:15.491615 #3307373] INFO -- : 219 ......................................................................... I, [2024-05-17T04:47:15.537974 #3307373] INFO -- : 292 ......................................................................... I, [2024-05-17T04:47:15.580407 #3307373] INFO -- : 365 ......................................................................... I, [2024-05-17T04:47:15.599424 #3307373] INFO -- : 438 ......................................................................... I, [2024-05-17T04:47:15.615999 #3307373] INFO -- : 511 ......................................................................... I, [2024-05-17T04:47:15.631423 #3307373] INFO -- : 584 ......................................................................... I, [2024-05-17T04:47:15.682468 #3307373] INFO -- : 657 ......................................................................... I, [2024-05-17T04:47:15.717164 #3307373] INFO -- : 730 ......................................................................... I, [2024-05-17T04:47:15.742867 #3307373] INFO -- : 803 ......................................................................... I, [2024-05-17T04:47:15.778436 #3307373] INFO -- : 876 ......................................................................... I, [2024-05-17T04:47:15.833912 #3307373] INFO -- : 949 ......................................................................... I, [2024-05-17T04:47:15.906793 #3307373] INFO -- : 1022 ......................................................................... I, [2024-05-17T04:47:16.076350 #3307373] INFO -- : 1095 ......................................................................... I, [2024-05-17T04:47:16.192155 #3307373] INFO -- : 1168 ......................................................................... I, [2024-05-17T04:47:16.245120 #3307373] INFO -- : 1241 ......................................................................... I, [2024-05-17T04:47:16.292204 #3307373] INFO -- : 1314 ......................................................................... I, [2024-05-17T04:47:16.311534 #3307373] INFO -- : 1387 ......................................................................... I, [2024-05-17T04:47:16.399901 #3307373] INFO -- : 1460 ......................................................................... I, [2024-05-17T04:47:16.852984 #3307373] INFO -- : 1533 ......................................................................... I, [2024-05-17T04:47:16.926983 #3307373] INFO -- : 1606 ......................................................................... I, [2024-05-17T04:47:17.028190 #3307373] INFO -- : 1679 ......................................................................... I, [2024-05-17T04:47:17.147226 #3307373] INFO -- : 1752 ......................................................................... I, [2024-05-17T04:47:17.238327 #3307373] INFO -- : 1825 ......................................................................... I, [2024-05-17T04:47:17.359477 #3307373] INFO -- : 1898 ......................................................................... I, [2024-05-17T04:47:17.437228 #3307373] INFO -- : 1971 ......................................................................... I, [2024-05-17T04:47:17.496064 #3307373] INFO -- : 2044 ......................................................................... I, [2024-05-17T04:47:17.544435 #3307373] INFO -- : 2117 ......................................................................... I, [2024-05-17T04:47:17.563038 #3307373] INFO -- : 2190 ......................................................................... I, [2024-05-17T04:47:17.582139 #3307373] INFO -- : 2263 ......................................................................... I, [2024-05-17T04:47:17.597009 #3307373] INFO -- : 2336 ......................................................................... I, [2024-05-17T04:47:17.639146 #3307373] INFO -- : 2409 ......................................................................... I, [2024-05-17T04:47:17.733047 #3307373] INFO -- : 2482 ......................................................................... I, [2024-05-17T04:47:17.754186 #3307373] INFO -- : 2555 ......................................................................... I, [2024-05-17T04:47:17.859472 #3307373] INFO -- : 2628 ......................................................................... I, [2024-05-17T04:47:17.965090 #3307373] INFO -- : 2701 ......................................................................... I, [2024-05-17T04:47:17.997360 #3307373] INFO -- : 2774 ......................................................................... I, [2024-05-17T04:47:18.053911 #3307373] INFO -- : 2847 ......................................................................... I, [2024-05-17T04:47:18.084251 #3307373] INFO -- : 2920 ......................................................................... I, [2024-05-17T04:47:18.104044 #3307373] INFO -- : 2993 ......................................................................... I, [2024-05-17T04:47:18.123518 #3307373] INFO -- : 3066 ......................................................................... I, [2024-05-17T04:47:18.138277 #3307373] INFO -- : 3139 ......................................................................... I, [2024-05-17T04:47:18.149280 #3307373] INFO -- : 3212 ......................................................................... I, [2024-05-17T04:47:18.180314 #3307373] INFO -- : 3285 ......................................................................... I, [2024-05-17T04:47:22.147794 #3307373] INFO -- : 3358 ........................................................................ I, [2024-05-17T04:47:22.147843 #3307373] INFO -- : I, [2024-05-17T04:47:22.147851 #3307373] INFO -- : Finished in 8.054529 seconds I, [2024-05-17T04:47:22.147856 #3307373] INFO -- : I, [2024-05-17T04:47:22.147860 #3307373] INFO -- : 3429 files, 32611 examples, 167488 expectations, 0 failures, 0 errors, 0 tagged I, [2024-05-17T04:47:22.149744 #3307373] INFO -- : $$$[end] "make yes-test-rubyspec MSPECOPT='--error-output stderr --debug -j' TESTS='-j20'" exit with 0.