# Logfile created on 2024-05-16 22:10:07 +0000 by logger.rb/v1.4.3 I, [2024-05-16T22:10:07.398772 #988489] INFO -- : #, @formatter=nil, @logdev=#, @binmode=false, @mon_data=#, @mon_data_owner_object_id=860>>> I, [2024-05-16T22:10:07.398900 #988489] INFO -- : $$$[beg] make update-unicode -j20 I, [2024-05-16T22:10:07.457982 #988489] INFO -- : Downloading Unicode emoji 15.0 files... I, [2024-05-16T22:10:07.458187 #988489] INFO -- : Downloading Unicode emoji 15.0 files... I, [2024-05-16T22:10:07.458498 #988489] INFO -- : Downloading Unicode emoji 15.0 files... I, [2024-05-16T22:10:07.499839 #988489] INFO -- : made symlink emoji/15.0/emoji-sequences.txt to /tmp/ruby/src/trunk/.downloaded-cache/emoji/15.0/emoji-sequences.txt I, [2024-05-16T22:10:07.500406 #988489] INFO -- : downloading emoji/15.0/emoji-sequences.txt ... downloading emoji/15.0/emoji-test.txt ... /tmp/ruby/src/trunk/enc/unicode/data/emoji/15.0/emoji-sequences.txt already exists E, [2024-05-16T22:10:07.944899 #988489] ERROR -- : /tmp/ruby/src/trunk/tool/downloader.rb:302:in `rescue in download': failed to download emoji/15.0/emoji-test.txt (RuntimeError) E, [2024-05-16T22:10:07.945041 #988489] ERROR -- : OpenURI::HTTPError: 403 Forbidden: https://www.unicode.org/Public/emoji/15.0/emoji-test.txt E, [2024-05-16T22:10:07.945061 #988489] ERROR -- : from /tmp/ruby/src/trunk/tool/downloader.rb:201:in `download' E, [2024-05-16T22:10:07.945076 #988489] ERROR -- : from /tmp/ruby/src/trunk/tool/downloader.rb:136:in `download' E, [2024-05-16T22:10:07.945088 #988489] ERROR -- : from /tmp/ruby/src/trunk/tool/downloader.rb:482:in `block in
' E, [2024-05-16T22:10:07.945100 #988489] ERROR -- : from /tmp/ruby/src/trunk/tool/downloader.rb:465:in `each' E, [2024-05-16T22:10:07.945112 #988489] ERROR -- : from /tmp/ruby/src/trunk/tool/downloader.rb:465:in `
' E, [2024-05-16T22:10:07.945124 #988489] ERROR -- : /usr/lib/ruby/3.0.0/open-uri.rb:364:in `open_http': 403 Forbidden (OpenURI::HTTPError) E, [2024-05-16T22:10:07.945135 #988489] ERROR -- : from /usr/lib/ruby/3.0.0/open-uri.rb:741:in `buffer_open' E, [2024-05-16T22:10:07.945164 #988489] ERROR -- : from /usr/lib/ruby/3.0.0/open-uri.rb:212:in `block in open_loop' E, [2024-05-16T22:10:07.945177 #988489] ERROR -- : from /usr/lib/ruby/3.0.0/open-uri.rb:210:in `catch' E, [2024-05-16T22:10:07.945189 #988489] ERROR -- : from /usr/lib/ruby/3.0.0/open-uri.rb:210:in `open_loop' E, [2024-05-16T22:10:07.945201 #988489] ERROR -- : from /usr/lib/ruby/3.0.0/open-uri.rb:151:in `open_uri' E, [2024-05-16T22:10:07.945213 #988489] ERROR -- : from /usr/lib/ruby/3.0.0/open-uri.rb:721:in `open' E, [2024-05-16T22:10:07.945224 #988489] ERROR -- : from /usr/lib/ruby/3.0.0/open-uri.rb:729:in `read' E, [2024-05-16T22:10:07.945236 #988489] ERROR -- : from /tmp/ruby/src/trunk/tool/downloader.rb:247:in `block in download' E, [2024-05-16T22:10:07.945268 #988489] ERROR -- : from /tmp/ruby/src/trunk/tool/downloader.rb:378:in `with_retry' E, [2024-05-16T22:10:07.945281 #988489] ERROR -- : from /tmp/ruby/src/trunk/tool/downloader.rb:246:in `download' E, [2024-05-16T22:10:07.945297 #988489] ERROR -- : from /tmp/ruby/src/trunk/tool/downloader.rb:136:in `download' E, [2024-05-16T22:10:07.945309 #988489] ERROR -- : from /tmp/ruby/src/trunk/tool/downloader.rb:482:in `block in
' E, [2024-05-16T22:10:07.945321 #988489] ERROR -- : from /tmp/ruby/src/trunk/tool/downloader.rb:465:in `each' E, [2024-05-16T22:10:07.945333 #988489] ERROR -- : from /tmp/ruby/src/trunk/tool/downloader.rb:465:in `
' E, [2024-05-16T22:10:07.947401 #988489] ERROR -- : /tmp/ruby/src/trunk/tool/downloader.rb:302:in `rescue in download': failed to download emoji/15.0/emoji-test.txt (RuntimeError) E, [2024-05-16T22:10:07.947471 #988489] ERROR -- : OpenURI::HTTPError: 403 Forbidden: https://www.unicode.org/Public/emoji/15.0/emoji-test.txt E, [2024-05-16T22:10:07.947489 #988489] ERROR -- : from /tmp/ruby/src/trunk/tool/downloader.rb:201:in `download' E, [2024-05-16T22:10:07.947511 #988489] ERROR -- : from /tmp/ruby/src/trunk/tool/downloader.rb:136:in `download' E, [2024-05-16T22:10:07.947522 #988489] ERROR -- : from /tmp/ruby/src/trunk/tool/downloader.rb:482:in `block in
' E, [2024-05-16T22:10:07.947532 #988489] ERROR -- : from /tmp/ruby/src/trunk/tool/downloader.rb:465:in `each' E, [2024-05-16T22:10:07.947542 #988489] ERROR -- : from /tmp/ruby/src/trunk/tool/downloader.rb:465:in `
' E, [2024-05-16T22:10:07.947552 #988489] ERROR -- : /usr/lib/ruby/3.0.0/open-uri.rb:364:in `open_http': 403 Forbidden (OpenURI::HTTPError) E, [2024-05-16T22:10:07.947562 #988489] ERROR -- : from /usr/lib/ruby/3.0.0/open-uri.rb:741:in `buffer_open' E, [2024-05-16T22:10:07.947572 #988489] ERROR -- : from /usr/lib/ruby/3.0.0/open-uri.rb:212:in `block in open_loop' E, [2024-05-16T22:10:07.947582 #988489] ERROR -- : from /usr/lib/ruby/3.0.0/open-uri.rb:210:in `catch' E, [2024-05-16T22:10:07.947595 #988489] ERROR -- : from /usr/lib/ruby/3.0.0/open-uri.rb:210:in `open_loop' E, [2024-05-16T22:10:07.947605 #988489] ERROR -- : from /usr/lib/ruby/3.0.0/open-uri.rb:151:in `open_uri' E, [2024-05-16T22:10:07.947615 #988489] ERROR -- : from /usr/lib/ruby/3.0.0/open-uri.rb:721:in `open' E, [2024-05-16T22:10:07.947624 #988489] ERROR -- : from /usr/lib/ruby/3.0.0/open-uri.rb:729:in `read' E, [2024-05-16T22:10:07.947634 #988489] ERROR -- : from /tmp/ruby/src/trunk/tool/downloader.rb:247:in `block in download' E, [2024-05-16T22:10:07.947644 #988489] ERROR -- : from /tmp/ruby/src/trunk/tool/downloader.rb:378:in `with_retry' E, [2024-05-16T22:10:07.947654 #988489] ERROR -- : from /tmp/ruby/src/trunk/tool/downloader.rb:246:in `download' E, [2024-05-16T22:10:07.947663 #988489] ERROR -- : from /tmp/ruby/src/trunk/tool/downloader.rb:136:in `download' E, [2024-05-16T22:10:07.947675 #988489] ERROR -- : from /tmp/ruby/src/trunk/tool/downloader.rb:482:in `block in
' E, [2024-05-16T22:10:07.947686 #988489] ERROR -- : from /tmp/ruby/src/trunk/tool/downloader.rb:465:in `each' E, [2024-05-16T22:10:07.947811 #988489] ERROR -- : from /tmp/ruby/src/trunk/tool/downloader.rb:465:in `
' E, [2024-05-16T22:10:07.949319 #988489] ERROR -- : make: *** [uncommon.mk:1765: /tmp/ruby/src/trunk/enc/unicode/data/emoji/15.0/emoji-zwj-sequences.txt] Error 1 E, [2024-05-16T22:10:07.949383 #988489] ERROR -- : make: *** Waiting for unfinished jobs.... E, [2024-05-16T22:10:07.951182 #988489] ERROR -- : make: *** [uncommon.mk:1765: /tmp/ruby/src/trunk/enc/unicode/data/emoji/15.0/emoji-test.txt] Error 1 E, [2024-05-16T22:10:08.420333 #988489] ERROR -- : /tmp/ruby/src/trunk/tool/downloader.rb:302:in `rescue in download': failed to download emoji/15.0/emoji-sequences.txt (RuntimeError) E, [2024-05-16T22:10:08.420455 #988489] ERROR -- : EOFError: end of file reached: https://www.unicode.org/Public/emoji/15.0/emoji-sequences.txt E, [2024-05-16T22:10:08.420474 #988489] ERROR -- : from /tmp/ruby/src/trunk/tool/downloader.rb:201:in `download' E, [2024-05-16T22:10:08.420502 #988489] ERROR -- : from /tmp/ruby/src/trunk/tool/downloader.rb:136:in `download' E, [2024-05-16T22:10:08.420513 #988489] ERROR -- : from /tmp/ruby/src/trunk/tool/downloader.rb:482:in `block in
' E, [2024-05-16T22:10:08.420524 #988489] ERROR -- : from /tmp/ruby/src/trunk/tool/downloader.rb:465:in `each' E, [2024-05-16T22:10:08.420535 #988489] ERROR -- : from /tmp/ruby/src/trunk/tool/downloader.rb:465:in `
' E, [2024-05-16T22:10:08.420547 #988489] ERROR -- : /usr/lib/ruby/3.0.0/net/protocol.rb:227:in `rbuf_fill': end of file reached (EOFError) E, [2024-05-16T22:10:08.420558 #988489] ERROR -- : from /usr/lib/ruby/3.0.0/net/protocol.rb:193:in `readuntil' E, [2024-05-16T22:10:08.420572 #988489] ERROR -- : from /usr/lib/ruby/3.0.0/net/protocol.rb:203:in `readline' E, [2024-05-16T22:10:08.420583 #988489] ERROR -- : from /usr/lib/ruby/3.0.0/net/http/response.rb:42:in `read_status_line' E, [2024-05-16T22:10:08.420594 #988489] ERROR -- : from /usr/lib/ruby/3.0.0/net/http/response.rb:31:in `read_new' E, [2024-05-16T22:10:08.420605 #988489] ERROR -- : from /usr/lib/ruby/3.0.0/net/http.rb:1557:in `block in transport_request' E, [2024-05-16T22:10:08.420837 #988489] ERROR -- : from /usr/lib/ruby/3.0.0/net/http.rb:1548:in `catch' E, [2024-05-16T22:10:08.420852 #988489] ERROR -- : from /usr/lib/ruby/3.0.0/net/http.rb:1548:in `transport_request' E, [2024-05-16T22:10:08.420863 #988489] ERROR -- : from /usr/lib/ruby/3.0.0/net/http.rb:1521:in `request' E, [2024-05-16T22:10:08.420874 #988489] ERROR -- : from /usr/lib/ruby/3.0.0/open-uri.rb:329:in `block in open_http' E, [2024-05-16T22:10:08.420884 #988489] ERROR -- : from /usr/lib/ruby/3.0.0/net/http.rb:960:in `start' E, [2024-05-16T22:10:08.420895 #988489] ERROR -- : from /usr/lib/ruby/3.0.0/open-uri.rb:323:in `open_http' E, [2024-05-16T22:10:08.420905 #988489] ERROR -- : from /usr/lib/ruby/3.0.0/open-uri.rb:741:in `buffer_open' E, [2024-05-16T22:10:08.420916 #988489] ERROR -- : from /usr/lib/ruby/3.0.0/open-uri.rb:212:in `block in open_loop' E, [2024-05-16T22:10:08.420930 #988489] ERROR -- : from /usr/lib/ruby/3.0.0/open-uri.rb:210:in `catch' E, [2024-05-16T22:10:08.420941 #988489] ERROR -- : from /usr/lib/ruby/3.0.0/open-uri.rb:210:in `open_loop' E, [2024-05-16T22:10:08.420952 #988489] ERROR -- : from /usr/lib/ruby/3.0.0/open-uri.rb:151:in `open_uri' E, [2024-05-16T22:10:08.420962 #988489] ERROR -- : from /usr/lib/ruby/3.0.0/open-uri.rb:721:in `open' E, [2024-05-16T22:10:08.420973 #988489] ERROR -- : from /usr/lib/ruby/3.0.0/open-uri.rb:729:in `read' E, [2024-05-16T22:10:08.420984 #988489] ERROR -- : from /tmp/ruby/src/trunk/tool/downloader.rb:247:in `block in download' E, [2024-05-16T22:10:08.420994 #988489] ERROR -- : from /tmp/ruby/src/trunk/tool/downloader.rb:378:in `with_retry' E, [2024-05-16T22:10:08.421005 #988489] ERROR -- : from /tmp/ruby/src/trunk/tool/downloader.rb:246:in `download' E, [2024-05-16T22:10:08.421015 #988489] ERROR -- : from /tmp/ruby/src/trunk/tool/downloader.rb:136:in `download' E, [2024-05-16T22:10:08.421028 #988489] ERROR -- : from /tmp/ruby/src/trunk/tool/downloader.rb:482:in `block in
' E, [2024-05-16T22:10:08.421039 #988489] ERROR -- : from /tmp/ruby/src/trunk/tool/downloader.rb:465:in `each' E, [2024-05-16T22:10:08.421050 #988489] ERROR -- : from /tmp/ruby/src/trunk/tool/downloader.rb:465:in `
' E, [2024-05-16T22:10:08.424886 #988489] ERROR -- : make: *** [uncommon.mk:1765: /tmp/ruby/src/trunk/enc/unicode/data/emoji/15.0/emoji-sequences.txt] Error 1 E, [2024-05-16T22:10:08.424944 #988489] ERROR -- : make: *** Deleting file '/tmp/ruby/src/trunk/enc/unicode/data/emoji/15.0/emoji-sequences.txt' I, [2024-05-16T22:10:08.425014 #988489] INFO -- : downloading emoji/15.0/emoji-test.txt ... I, [2024-05-16T22:10:08.425578 #988489] INFO -- : $$$[end] "make update-unicode -j20" exit with 512. I, [2024-05-16T22:10:08.425642 #988489] INFO -- : $$$[beg] make update-download -j20 I, [2024-05-16T22:10:08.526888 #988489] INFO -- : tool/config.guess already exists I, [2024-05-16T22:10:08.526938 #988489] INFO -- : tool/config.sub already exists I, [2024-05-16T22:10:08.528887 #988489] INFO -- : Update minitest to ea9caafc0754b1d6236a490d59e624b53209734a I, [2024-05-16T22:10:08.528999 #988489] INFO -- : Update power_assert to 84e85124c5014a139af39161d484156cfe87a9ed I, [2024-05-16T22:10:08.529156 #988489] INFO -- : Update rbs to ba7872795d5de04adb8ff500c0e6afdc81a041dd I, [2024-05-16T22:10:08.529883 #988489] INFO -- : Update typeprof to b19a6416da3a05d57fadd6ffdadb382b6d236ca5 I, [2024-05-16T22:10:08.530171 #988489] INFO -- : echo ea9caafc0754b1d6236a490d59e624b53209734a | /bin/sh /tmp/ruby/src/trunk/tool/ifchange /tmp/ruby/src/trunk/.bundle/.timestamp/minitest.revision - I, [2024-05-16T22:10:08.530339 #988489] INFO -- : echo 84e85124c5014a139af39161d484156cfe87a9ed | /bin/sh /tmp/ruby/src/trunk/tool/ifchange /tmp/ruby/src/trunk/.bundle/.timestamp/power_assert.revision - I, [2024-05-16T22:10:08.530579 #988489] INFO -- : echo ba7872795d5de04adb8ff500c0e6afdc81a041dd | /bin/sh /tmp/ruby/src/trunk/tool/ifchange /tmp/ruby/src/trunk/.bundle/.timestamp/rbs.revision - I, [2024-05-16T22:10:08.531009 #988489] INFO -- : echo b19a6416da3a05d57fadd6ffdadb382b6d236ca5 | /bin/sh /tmp/ruby/src/trunk/tool/ifchange /tmp/ruby/src/trunk/.bundle/.timestamp/typeprof.revision - I, [2024-05-16T22:10:08.531910 #988489] INFO -- : /tmp/ruby/src/trunk/.bundle/.timestamp/minitest.revision unchanged I, [2024-05-16T22:10:08.532128 #988489] INFO -- : /tmp/ruby/src/trunk/.bundle/.timestamp/rbs.revision unchanged I, [2024-05-16T22:10:08.532378 #988489] INFO -- : /tmp/ruby/src/trunk/.bundle/.timestamp/power_assert.revision unchanged I, [2024-05-16T22:10:08.533004 #988489] INFO -- : /tmp/ruby/src/trunk/.bundle/.timestamp/typeprof.revision unchanged I, [2024-05-16T22:10:08.533560 #988489] INFO -- : Building power_assert@84e85124c5014a139af39161d484156cfe87a9ed to /tmp/ruby/src/trunk/gems/power_assert-2.0.3.gem I, [2024-05-16T22:10:08.602623 #988489] INFO -- : Successfully built RubyGem I, [2024-05-16T22:10:08.602680 #988489] INFO -- : Name: power_assert I, [2024-05-16T22:10:08.602699 #988489] INFO -- : Version: 2.0.4dev I, [2024-05-16T22:10:08.602709 #988489] INFO -- : File: power_assert-2.0.4dev.gem I, [2024-05-16T22:10:08.647566 #988489] INFO -- : $$$[end] "make update-download -j20" exit with 0. I, [2024-05-16T22:10:08.647607 #988489] INFO -- : $$$[beg] make update-rubyspec -j20 I, [2024-05-16T22:10:08.705570 #988489] INFO -- : make: Nothing to be done for 'update-rubyspec'. I, [2024-05-16T22:10:08.705936 #988489] INFO -- : $$$[end] "make update-rubyspec -j20" exit with 0. I, [2024-05-16T22:10:08.705960 #988489] INFO -- : $$$[beg] make update-src -j20 I, [2024-05-16T22:10:09.381953 #988489] INFO -- : Already up to date. I, [2024-05-16T22:10:09.399352 #988489] INFO -- : Latest commit hash = 854cbbd5a9 I, [2024-05-16T22:10:09.400833 #988489] INFO -- : $$$[end] "make update-src -j20" exit with 0. I, [2024-05-16T22:10:09.400917 #988489] INFO -- : $$$[beg] make after-update -j20 I, [2024-05-16T22:10:09.481619 #988489] INFO -- : generating /tmp/ruby/src/trunk/ext/ripper/eventids2table.c I, [2024-05-16T22:10:09.487357 #988489] INFO -- : make[1]: Entering directory '/tmp/ruby/src/trunk/ext/ripper' I, [2024-05-16T22:10:09.487379 #988489] INFO -- : make[1]: Nothing to be done for 'src'. I, [2024-05-16T22:10:09.487386 #988489] INFO -- : make[1]: Leaving directory '/tmp/ruby/src/trunk/ext/ripper' I, [2024-05-16T22:10:09.498444 #988489] INFO -- : /tmp/ruby/src/trunk/revision.h updated I, [2024-05-16T22:10:09.499805 #988489] INFO -- : generating x86_64-linux-fake.rb I, [2024-05-16T22:10:09.550603 #988489] INFO -- : x86_64-linux-fake.rb updated I, [2024-05-16T22:10:09.552044 #988489] INFO -- : generating enc.mk I, [2024-05-16T22:10:09.669876 #988489] INFO -- : making srcs under enc I, [2024-05-16T22:10:09.699338 #988489] INFO -- : make[1]: Entering directory '/tmp/ruby/build/trunk' I, [2024-05-16T22:10:09.699369 #988489] INFO -- : make[1]: Nothing to be done for 'srcs'. I, [2024-05-16T22:10:09.699385 #988489] INFO -- : make[1]: Leaving directory '/tmp/ruby/build/trunk' I, [2024-05-16T22:10:09.743800 #988489] INFO -- : Update minitest to ea9caafc0754b1d6236a490d59e624b53209734a I, [2024-05-16T22:10:09.743920 #988489] INFO -- : Update power_assert to 84e85124c5014a139af39161d484156cfe87a9ed I, [2024-05-16T22:10:09.744072 #988489] INFO -- : Update rbs to ba7872795d5de04adb8ff500c0e6afdc81a041dd I, [2024-05-16T22:10:09.745048 #988489] INFO -- : Update typeprof to b19a6416da3a05d57fadd6ffdadb382b6d236ca5 I, [2024-05-16T22:10:09.745546 #988489] INFO -- : echo ea9caafc0754b1d6236a490d59e624b53209734a | /bin/sh /tmp/ruby/src/trunk/tool/ifchange /tmp/ruby/src/trunk/.bundle/.timestamp/minitest.revision - I, [2024-05-16T22:10:09.745787 #988489] INFO -- : echo 84e85124c5014a139af39161d484156cfe87a9ed | /bin/sh /tmp/ruby/src/trunk/tool/ifchange /tmp/ruby/src/trunk/.bundle/.timestamp/power_assert.revision - I, [2024-05-16T22:10:09.746061 #988489] INFO -- : echo ba7872795d5de04adb8ff500c0e6afdc81a041dd | /bin/sh /tmp/ruby/src/trunk/tool/ifchange /tmp/ruby/src/trunk/.bundle/.timestamp/rbs.revision - I, [2024-05-16T22:10:09.747254 #988489] INFO -- : echo b19a6416da3a05d57fadd6ffdadb382b6d236ca5 | /bin/sh /tmp/ruby/src/trunk/tool/ifchange /tmp/ruby/src/trunk/.bundle/.timestamp/typeprof.revision - I, [2024-05-16T22:10:09.747401 #988489] INFO -- : /tmp/ruby/src/trunk/.bundle/.timestamp/minitest.revision unchanged I, [2024-05-16T22:10:09.747529 #988489] INFO -- : /tmp/ruby/src/trunk/.bundle/.timestamp/power_assert.revision unchanged I, [2024-05-16T22:10:09.747880 #988489] INFO -- : /tmp/ruby/src/trunk/.bundle/.timestamp/rbs.revision unchanged I, [2024-05-16T22:10:09.748812 #988489] INFO -- : Building power_assert@84e85124c5014a139af39161d484156cfe87a9ed to /tmp/ruby/src/trunk/gems/power_assert-2.0.3.gem I, [2024-05-16T22:10:09.748950 #988489] INFO -- : /tmp/ruby/src/trunk/.bundle/.timestamp/typeprof.revision unchanged I, [2024-05-16T22:10:09.817893 #988489] INFO -- : Successfully built RubyGem I, [2024-05-16T22:10:09.817959 #988489] INFO -- : Name: power_assert I, [2024-05-16T22:10:09.817976 #988489] INFO -- : Version: 2.0.4dev I, [2024-05-16T22:10:09.817998 #988489] INFO -- : File: power_assert-2.0.4dev.gem I, [2024-05-16T22:10:09.820175 #988489] INFO -- : Extracting bundle gem power_assert-2.0.3... I, [2024-05-16T22:10:09.880968 #988489] INFO -- : Try with hash version of bundled gems instead of gems/power_assert-2.0.3.gem. We don't use this gem with release version of Ruby. I, [2024-05-16T22:10:09.885944 #988489] INFO -- : Unpacked gems/power_assert-2.0.4dev.gem I, [2024-05-16T22:10:09.888178 #988489] INFO -- : $$$[end] "make after-update -j20" exit with 0. I, [2024-05-16T22:10:09.888393 #988489] INFO -- : $$$[beg] make miniruby -j20 I, [2024-05-16T22:10:09.952358 #988489] INFO -- : BASERUBY = /usr/bin/ruby --disable=gems I, [2024-05-16T22:10:09.952419 #988489] INFO -- : CC = gcc I, [2024-05-16T22:10:09.952436 #988489] INFO -- : LD = ld I, [2024-05-16T22:10:09.952449 #988489] INFO -- : LDSHARED = gcc -shared I, [2024-05-16T22:10:09.952463 #988489] INFO -- : CFLAGS = -O3 -fno-fast-math -ggdb3 -Wall -Wextra -Wdeprecated-declarations -Wdiv-by-zero -Wduplicated-cond -Wimplicit-function-declaration -Wimplicit-int -Wpointer-arith -Wwrite-strings -Wold-style-definition -Wimplicit-fallthrough=0 -Wmissing-noreturn -Wno-cast-function-type -Wno-constant-logical-operand -Wno-long-long -Wno-missing-field-initializers -Wno-overlength-strings -Wno-packed-bitfield-compat -Wno-parentheses-equality -Wno-self-assign -Wno-tautological-compare -Wno-unused-parameter -Wno-unused-value -Wsuggest-attribute=format -Wsuggest-attribute=noreturn -Wunused-variable -Wmisleading-indentation -Wundef -fPIC I, [2024-05-16T22:10:09.952478 #988489] INFO -- : XCFLAGS = -U_FORTIFY_SOURCE -D_FORTIFY_SOURCE=2 -fstack-protector-strong -fno-strict-overflow -fvisibility=hidden -fexcess-precision=standard -DRUBY_EXPORT -I. -I.ext/include/x86_64-linux -I/tmp/ruby/src/trunk/include -I/tmp/ruby/src/trunk -I/tmp/ruby/src/trunk/prism -I/tmp/ruby/src/trunk/enc/unicode/15.0.0 I, [2024-05-16T22:10:09.952502 #988489] INFO -- : CPPFLAGS = I, [2024-05-16T22:10:09.952516 #988489] INFO -- : DLDFLAGS = -Wl,--compress-debug-sections=zlib -Wl,-soname,libruby.so.3.4 -fstack-protector-strong I, [2024-05-16T22:10:09.952530 #988489] INFO -- : SOLIBS = -lz -lrt -lrt -lgmp -ldl -lcrypt -lm -lpthread I, [2024-05-16T22:10:09.952543 #988489] INFO -- : LANG = en_US.UTF-8 I, [2024-05-16T22:10:09.952555 #988489] INFO -- : LC_ALL = I, [2024-05-16T22:10:09.952567 #988489] INFO -- : LC_CTYPE = I, [2024-05-16T22:10:09.952580 #988489] INFO -- : MFLAGS = -j20 --jobserver-auth=4,5 I, [2024-05-16T22:10:09.952591 #988489] INFO -- : RUSTC = no I, [2024-05-16T22:10:09.952604 #988489] INFO -- : YJIT_RUSTC_ARGS = --crate-name=yjit --crate-type=staticlib --edition=2021 -g -C lto=thin -C opt-level=3 -C overflow-checks=on '--out-dir=/tmp/ruby/build/trunk/yjit/target/release/' /tmp/ruby/src/trunk/yjit/src/lib.rs I, [2024-05-16T22:10:09.955144 #988489] INFO -- : gcc (Ubuntu 11.4.0-1ubuntu1~22.04) 11.4.0 I, [2024-05-16T22:10:09.955200 #988489] INFO -- : Copyright (C) 2021 Free Software Foundation, Inc. I, [2024-05-16T22:10:09.955218 #988489] INFO -- : This is free software; see the source for copying conditions. There is NO I, [2024-05-16T22:10:09.955234 #988489] INFO -- : warranty; not even for MERCHANTABILITY or FITNESS FOR A PARTICULAR PURPOSE. I, [2024-05-16T22:10:09.955248 #988489] INFO -- : I, [2024-05-16T22:10:09.977739 #988489] INFO -- : compiling /tmp/ruby/src/trunk/version.c I, [2024-05-16T22:10:10.079418 #988489] INFO -- : linking miniruby I, [2024-05-16T22:10:10.606742 #988489] INFO -- : $$$[end] "make miniruby -j20" exit with 0. I, [2024-05-16T22:10:10.606902 #988489] INFO -- : $$$[beg] make ruby -j20 I, [2024-05-16T22:10:10.669326 #988489] INFO -- : BASERUBY = /usr/bin/ruby --disable=gems I, [2024-05-16T22:10:10.669392 #988489] INFO -- : CC = gcc I, [2024-05-16T22:10:10.669408 #988489] INFO -- : LD = ld I, [2024-05-16T22:10:10.669423 #988489] INFO -- : LDSHARED = gcc -shared I, [2024-05-16T22:10:10.669444 #988489] INFO -- : CFLAGS = -O3 -fno-fast-math -ggdb3 -Wall -Wextra -Wdeprecated-declarations -Wdiv-by-zero -Wduplicated-cond -Wimplicit-function-declaration -Wimplicit-int -Wpointer-arith -Wwrite-strings -Wold-style-definition -Wimplicit-fallthrough=0 -Wmissing-noreturn -Wno-cast-function-type -Wno-constant-logical-operand -Wno-long-long -Wno-missing-field-initializers -Wno-overlength-strings -Wno-packed-bitfield-compat -Wno-parentheses-equality -Wno-self-assign -Wno-tautological-compare -Wno-unused-parameter -Wno-unused-value -Wsuggest-attribute=format -Wsuggest-attribute=noreturn -Wunused-variable -Wmisleading-indentation -Wundef -fPIC I, [2024-05-16T22:10:10.669460 #988489] INFO -- : XCFLAGS = -U_FORTIFY_SOURCE -D_FORTIFY_SOURCE=2 -fstack-protector-strong -fno-strict-overflow -fvisibility=hidden -fexcess-precision=standard -DRUBY_EXPORT -I. -I.ext/include/x86_64-linux -I/tmp/ruby/src/trunk/include -I/tmp/ruby/src/trunk -I/tmp/ruby/src/trunk/prism -I/tmp/ruby/src/trunk/enc/unicode/15.0.0 I, [2024-05-16T22:10:10.669474 #988489] INFO -- : CPPFLAGS = I, [2024-05-16T22:10:10.669487 #988489] INFO -- : DLDFLAGS = -Wl,--compress-debug-sections=zlib -Wl,-soname,libruby.so.3.4 -fstack-protector-strong I, [2024-05-16T22:10:10.669501 #988489] INFO -- : SOLIBS = -lz -lrt -lrt -lgmp -ldl -lcrypt -lm -lpthread I, [2024-05-16T22:10:10.669514 #988489] INFO -- : LANG = en_US.UTF-8 I, [2024-05-16T22:10:10.669527 #988489] INFO -- : LC_ALL = I, [2024-05-16T22:10:10.669540 #988489] INFO -- : LC_CTYPE = I, [2024-05-16T22:10:10.669553 #988489] INFO -- : MFLAGS = -j20 --jobserver-auth=4,5 I, [2024-05-16T22:10:10.669568 #988489] INFO -- : RUSTC = no I, [2024-05-16T22:10:10.669581 #988489] INFO -- : YJIT_RUSTC_ARGS = --crate-name=yjit --crate-type=staticlib --edition=2021 -g -C lto=thin -C opt-level=3 -C overflow-checks=on '--out-dir=/tmp/ruby/build/trunk/yjit/target/release/' /tmp/ruby/src/trunk/yjit/src/lib.rs I, [2024-05-16T22:10:10.671633 #988489] INFO -- : gcc (Ubuntu 11.4.0-1ubuntu1~22.04) 11.4.0 I, [2024-05-16T22:10:10.671730 #988489] INFO -- : Copyright (C) 2021 Free Software Foundation, Inc. I, [2024-05-16T22:10:10.671751 #988489] INFO -- : This is free software; see the source for copying conditions. There is NO I, [2024-05-16T22:10:10.671766 #988489] INFO -- : warranty; not even for MERCHANTABILITY or FITNESS FOR A PARTICULAR PURPOSE. I, [2024-05-16T22:10:10.671780 #988489] INFO -- : I, [2024-05-16T22:10:10.782659 #988489] INFO -- : builtin_binary.inc updated I, [2024-05-16T22:10:10.787189 #988489] INFO -- : c5234a9416e4f20f175185e840b25b0f08674d14078ed7083f37e655458e3ca9 builtin_binary.inc I, [2024-05-16T22:10:10.788002 #988489] INFO -- : compiling /tmp/ruby/src/trunk/builtin.c I, [2024-05-16T22:10:10.970859 #988489] INFO -- : linking static-library libruby-static.a I, [2024-05-16T22:10:11.287522 #988489] INFO -- : linking shared-library libruby.so.3.4.0 I, [2024-05-16T22:10:12.846892 #988489] INFO -- : linking ruby I, [2024-05-16T22:10:12.870821 #988489] INFO -- : $$$[end] "make ruby -j20" exit with 0. I, [2024-05-16T22:10:12.870977 #988489] INFO -- : $$$[beg] make all -j20 I, [2024-05-16T22:10:12.928691 #988489] INFO -- : BASERUBY = /usr/bin/ruby --disable=gems I, [2024-05-16T22:10:12.928738 #988489] INFO -- : CC = gcc I, [2024-05-16T22:10:12.928751 #988489] INFO -- : LD = ld I, [2024-05-16T22:10:12.928762 #988489] INFO -- : LDSHARED = gcc -shared I, [2024-05-16T22:10:12.928776 #988489] INFO -- : CFLAGS = -O3 -fno-fast-math -ggdb3 -Wall -Wextra -Wdeprecated-declarations -Wdiv-by-zero -Wduplicated-cond -Wimplicit-function-declaration -Wimplicit-int -Wpointer-arith -Wwrite-strings -Wold-style-definition -Wimplicit-fallthrough=0 -Wmissing-noreturn -Wno-cast-function-type -Wno-constant-logical-operand -Wno-long-long -Wno-missing-field-initializers -Wno-overlength-strings -Wno-packed-bitfield-compat -Wno-parentheses-equality -Wno-self-assign -Wno-tautological-compare -Wno-unused-parameter -Wno-unused-value -Wsuggest-attribute=format -Wsuggest-attribute=noreturn -Wunused-variable -Wmisleading-indentation -Wundef -fPIC I, [2024-05-16T22:10:12.928788 #988489] INFO -- : XCFLAGS = -U_FORTIFY_SOURCE -D_FORTIFY_SOURCE=2 -fstack-protector-strong -fno-strict-overflow -fvisibility=hidden -fexcess-precision=standard -DRUBY_EXPORT -I. -I.ext/include/x86_64-linux -I/tmp/ruby/src/trunk/include -I/tmp/ruby/src/trunk -I/tmp/ruby/src/trunk/prism -I/tmp/ruby/src/trunk/enc/unicode/15.0.0 I, [2024-05-16T22:10:12.928799 #988489] INFO -- : CPPFLAGS = I, [2024-05-16T22:10:12.928811 #988489] INFO -- : DLDFLAGS = -Wl,--compress-debug-sections=zlib -Wl,-soname,libruby.so.3.4 -fstack-protector-strong I, [2024-05-16T22:10:12.928823 #988489] INFO -- : SOLIBS = -lz -lrt -lrt -lgmp -ldl -lcrypt -lm -lpthread I, [2024-05-16T22:10:12.928834 #988489] INFO -- : LANG = en_US.UTF-8 I, [2024-05-16T22:10:12.928845 #988489] INFO -- : LC_ALL = I, [2024-05-16T22:10:12.928856 #988489] INFO -- : LC_CTYPE = I, [2024-05-16T22:10:12.928867 #988489] INFO -- : MFLAGS = -j20 --jobserver-auth=4,5 I, [2024-05-16T22:10:12.928879 #988489] INFO -- : RUSTC = no I, [2024-05-16T22:10:12.928892 #988489] INFO -- : YJIT_RUSTC_ARGS = --crate-name=yjit --crate-type=staticlib --edition=2021 -g -C lto=thin -C opt-level=3 -C overflow-checks=on '--out-dir=/tmp/ruby/build/trunk/yjit/target/release/' /tmp/ruby/src/trunk/yjit/src/lib.rs I, [2024-05-16T22:10:12.930287 #988489] INFO -- : gcc (Ubuntu 11.4.0-1ubuntu1~22.04) 11.4.0 I, [2024-05-16T22:10:12.930335 #988489] INFO -- : Copyright (C) 2021 Free Software Foundation, Inc. I, [2024-05-16T22:10:12.930351 #988489] INFO -- : This is free software; see the source for copying conditions. There is NO I, [2024-05-16T22:10:12.930364 #988489] INFO -- : warranty; not even for MERCHANTABILITY or FITNESS FOR A PARTICULAR PURPOSE. I, [2024-05-16T22:10:12.930376 #988489] INFO -- : I, [2024-05-16T22:10:12.960633 #988489] INFO -- : generating enc.mk I, [2024-05-16T22:10:12.962483 #988489] INFO -- : building spec/ruby/optional/capi/ext/array_spec.so I, [2024-05-16T22:10:12.962732 #988489] INFO -- : building spec/ruby/optional/capi/ext/basic_object_spec.so I, [2024-05-16T22:10:12.963445 #988489] INFO -- : building spec/ruby/optional/capi/ext/bignum_spec.so I, [2024-05-16T22:10:12.964048 #988489] INFO -- : building spec/ruby/optional/capi/ext/binding_spec.so I, [2024-05-16T22:10:12.964102 #988489] INFO -- : building spec/ruby/optional/capi/ext/boolean_spec.so I, [2024-05-16T22:10:12.964893 #988489] INFO -- : building spec/ruby/optional/capi/ext/class_id_under_autoload_spec.so I, [2024-05-16T22:10:12.965421 #988489] INFO -- : building spec/ruby/optional/capi/ext/class_spec.so I, [2024-05-16T22:10:12.966077 #988489] INFO -- : building spec/ruby/optional/capi/ext/class_under_autoload_spec.so I, [2024-05-16T22:10:12.966835 #988489] INFO -- : building spec/ruby/optional/capi/ext/complex_spec.so I, [2024-05-16T22:10:12.967625 #988489] INFO -- : building spec/ruby/optional/capi/ext/constants_spec.so I, [2024-05-16T22:10:12.967917 #988489] INFO -- : building spec/ruby/optional/capi/ext/data_spec.so I, [2024-05-16T22:10:12.968634 #988489] INFO -- : building spec/ruby/optional/capi/ext/debug_spec.so I, [2024-05-16T22:10:12.969265 #988489] INFO -- : building spec/ruby/optional/capi/ext/encoding_spec.so I, [2024-05-16T22:10:12.969611 #988489] INFO -- : building spec/ruby/optional/capi/ext/enumerator_spec.so I, [2024-05-16T22:10:12.970492 #988489] INFO -- : building spec/ruby/optional/capi/ext/exception_spec.so I, [2024-05-16T22:10:12.970731 #988489] INFO -- : building spec/ruby/optional/capi/ext/fiber_spec.so I, [2024-05-16T22:10:12.971532 #988489] INFO -- : building spec/ruby/optional/capi/ext/file_spec.so I, [2024-05-16T22:10:12.971796 #988489] INFO -- : building spec/ruby/optional/capi/ext/fixnum_spec.so I, [2024-05-16T22:10:12.972628 #988489] INFO -- : building spec/ruby/optional/capi/ext/float_spec.so I, [2024-05-16T22:10:13.093428 #988489] INFO -- : building spec/ruby/optional/capi/ext/gc_spec.so I, [2024-05-16T22:10:13.098033 #988489] INFO -- : building spec/ruby/optional/capi/ext/globals_spec.so I, [2024-05-16T22:10:13.111614 #988489] INFO -- : building spec/ruby/optional/capi/ext/hash_spec.so I, [2024-05-16T22:10:13.112163 #988489] INFO -- : building spec/ruby/optional/capi/ext/integer_spec.so I, [2024-05-16T22:10:13.112591 #988489] INFO -- : building spec/ruby/optional/capi/ext/io_spec.so I, [2024-05-16T22:10:13.119274 #988489] INFO -- : building spec/ruby/optional/capi/ext/kernel_spec.so I, [2024-05-16T22:10:13.121502 #988489] INFO -- : building spec/ruby/optional/capi/ext/language_spec.so I, [2024-05-16T22:10:13.124961 #988489] INFO -- : building spec/ruby/optional/capi/ext/marshal_spec.so I, [2024-05-16T22:10:13.132760 #988489] INFO -- : building spec/ruby/optional/capi/ext/module_spec.so I, [2024-05-16T22:10:13.134882 #988489] INFO -- : building spec/ruby/optional/capi/ext/module_under_autoload_spec.so I, [2024-05-16T22:10:13.139544 #988489] INFO -- : building spec/ruby/optional/capi/ext/mutex_spec.so I, [2024-05-16T22:10:13.159605 #988489] INFO -- : building spec/ruby/optional/capi/ext/numeric_spec.so I, [2024-05-16T22:10:13.160087 #988489] INFO -- : building spec/ruby/optional/capi/ext/object_spec.so I, [2024-05-16T22:10:13.162012 #988489] INFO -- : building spec/ruby/optional/capi/ext/proc_spec.so I, [2024-05-16T22:10:13.164428 #988489] INFO -- : building spec/ruby/optional/capi/ext/range_spec.so I, [2024-05-16T22:10:13.184128 #988489] INFO -- : building spec/ruby/optional/capi/ext/rational_spec.so I, [2024-05-16T22:10:13.208967 #988489] INFO -- : building spec/ruby/optional/capi/ext/rbasic_spec.so I, [2024-05-16T22:10:13.226739 #988489] INFO -- : building spec/ruby/optional/capi/ext/regexp_spec.so I, [2024-05-16T22:10:13.260145 #988489] INFO -- : building spec/ruby/optional/capi/ext/string_spec.so I, [2024-05-16T22:10:13.274632 #988489] INFO -- : building spec/ruby/optional/capi/ext/struct_spec.so I, [2024-05-16T22:10:13.276089 #988489] INFO -- : building spec/ruby/optional/capi/ext/st_spec.so I, [2024-05-16T22:10:13.277887 #988489] INFO -- : building spec/ruby/optional/capi/ext/symbol_spec.so I, [2024-05-16T22:10:13.286753 #988489] INFO -- : building spec/ruby/optional/capi/ext/thread_spec.so I, [2024-05-16T22:10:13.287725 #988489] INFO -- : building spec/ruby/optional/capi/ext/time_spec.so I, [2024-05-16T22:10:13.290222 #988489] INFO -- : building spec/ruby/optional/capi/ext/tracepoint_spec.so I, [2024-05-16T22:10:13.293783 #988489] INFO -- : building spec/ruby/optional/capi/ext/typed_data_spec.so I, [2024-05-16T22:10:13.294751 #988489] INFO -- : building spec/ruby/optional/capi/ext/util_spec.so I, [2024-05-16T22:10:13.312556 #988489] INFO -- : making enc I, [2024-05-16T22:10:13.332434 #988489] INFO -- : making srcs under enc I, [2024-05-16T22:10:13.339301 #988489] INFO -- : make[1]: Entering directory '/tmp/ruby/build/trunk' I, [2024-05-16T22:10:13.339376 #988489] INFO -- : make[1]: Nothing to be done for 'enc'. I, [2024-05-16T22:10:13.339403 #988489] INFO -- : make[1]: Leaving directory '/tmp/ruby/build/trunk' I, [2024-05-16T22:10:13.369199 #988489] INFO -- : make[1]: Entering directory '/tmp/ruby/build/trunk' I, [2024-05-16T22:10:13.369257 #988489] INFO -- : make[1]: Nothing to be done for 'srcs'. I, [2024-05-16T22:10:13.369265 #988489] INFO -- : make[1]: Leaving directory '/tmp/ruby/build/trunk' I, [2024-05-16T22:10:13.369705 #988489] INFO -- : generating transdb.h I, [2024-05-16T22:10:13.467566 #988489] INFO -- : transdb.h unchanged I, [2024-05-16T22:10:13.468708 #988489] INFO -- : generating makefiles ext/configure-ext.mk I, [2024-05-16T22:10:13.468932 #988489] INFO -- : making trans I, [2024-05-16T22:10:13.497400 #988489] INFO -- : ext/configure-ext.mk updated I, [2024-05-16T22:10:13.499684 #988489] INFO -- : make[1]: Entering directory '/tmp/ruby/build/trunk' I, [2024-05-16T22:10:13.502637 #988489] INFO -- : make[1]: Entering directory '/tmp/ruby/build/trunk' I, [2024-05-16T22:10:13.502867 #988489] INFO -- : make[1]: Nothing to be done for 'trans'. I, [2024-05-16T22:10:13.502913 #988489] INFO -- : make[1]: Leaving directory '/tmp/ruby/build/trunk' I, [2024-05-16T22:10:13.503490 #988489] INFO -- : making encs I, [2024-05-16T22:10:13.553092 #988489] INFO -- : make[1]: Entering directory '/tmp/ruby/build/trunk' I, [2024-05-16T22:10:13.553177 #988489] INFO -- : make[1]: Nothing to be done for 'encs'. I, [2024-05-16T22:10:13.553205 #988489] INFO -- : make[1]: Leaving directory '/tmp/ruby/build/trunk' I, [2024-05-16T22:10:13.655906 #988489] INFO -- : make[1]: Leaving directory '/tmp/ruby/build/trunk' I, [2024-05-16T22:10:13.656428 #988489] INFO -- : generating makefile exts.mk I, [2024-05-16T22:10:13.693858 #988489] INFO -- : exts.mk unchanged I, [2024-05-16T22:10:13.698546 #988489] INFO -- : make[1]: Entering directory '/tmp/ruby/build/trunk' I, [2024-05-16T22:10:13.716485 #988489] INFO -- : make[2]: Entering directory '/tmp/ruby/build/trunk/ext/digest' I, [2024-05-16T22:10:13.717964 #988489] INFO -- : make[2]: Entering directory '/tmp/ruby/build/trunk/ext/json' I, [2024-05-16T22:10:13.718380 #988489] INFO -- : make[2]: Entering directory '/tmp/ruby/build/trunk/ext/coverage' I, [2024-05-16T22:10:13.718443 #988489] INFO -- : make[2]: Entering directory '/tmp/ruby/build/trunk/ext/io/console' I, [2024-05-16T22:10:13.719019 #988489] INFO -- : make[2]: Entering directory '/tmp/ruby/build/trunk/ext/date' I, [2024-05-16T22:10:13.719529 #988489] INFO -- : make[2]: Entering directory '/tmp/ruby/build/trunk/ext/monitor' I, [2024-05-16T22:10:13.720324 #988489] INFO -- : make[2]: Entering directory '/tmp/ruby/build/trunk/ext/pathname' I, [2024-05-16T22:10:13.721100 #988489] INFO -- : make[2]: Entering directory '/tmp/ruby/build/trunk/ext/fiddle' I, [2024-05-16T22:10:13.721169 #988489] INFO -- : make[2]: Leaving directory '/tmp/ruby/build/trunk/ext/io/console' I, [2024-05-16T22:10:13.721215 #988489] INFO -- : make[2]: Leaving directory '/tmp/ruby/build/trunk/ext/digest' I, [2024-05-16T22:10:13.721351 #988489] INFO -- : make[2]: Entering directory '/tmp/ruby/build/trunk/ext/pty' I, [2024-05-16T22:10:13.721376 #988489] INFO -- : make[2]: Leaving directory '/tmp/ruby/build/trunk/ext/monitor' I, [2024-05-16T22:10:13.722009 #988489] INFO -- : make[2]: Leaving directory '/tmp/ruby/build/trunk/ext/date' I, [2024-05-16T22:10:13.722175 #988489] INFO -- : make[2]: Leaving directory '/tmp/ruby/build/trunk/ext/coverage' I, [2024-05-16T22:10:13.722654 #988489] INFO -- : make[2]: Entering directory '/tmp/ruby/build/trunk/ext/objspace' I, [2024-05-16T22:10:13.722868 #988489] INFO -- : make[2]: Entering directory '/tmp/ruby/build/trunk/ext/psych' I, [2024-05-16T22:10:13.723218 #988489] INFO -- : make[2]: Entering directory '/tmp/ruby/build/trunk/ext/rubyvm' I, [2024-05-16T22:10:13.723561 #988489] INFO -- : make[2]: Leaving directory '/tmp/ruby/build/trunk/ext/pty' I, [2024-05-16T22:10:13.724453 #988489] INFO -- : make[2]: Entering directory '/tmp/ruby/build/trunk/.bundle/gems/bigdecimal-3.1.8/ext/bigdecimal' I, [2024-05-16T22:10:13.724556 #988489] INFO -- : make[2]: Entering directory '/tmp/ruby/build/trunk/.bundle/gems/debug-1.9.2/ext/debug' I, [2024-05-16T22:10:13.724700 #988489] INFO -- : make[2]: Entering directory '/tmp/ruby/build/trunk/.bundle/gems/nkf-0.2.0/ext/nkf' I, [2024-05-16T22:10:13.724731 #988489] INFO -- : make[2]: Entering directory '/tmp/ruby/build/trunk/.bundle/gems/racc-1.7.3/ext/racc/cparse' I, [2024-05-16T22:10:13.725132 #988489] INFO -- : make[2]: Leaving directory '/tmp/ruby/build/trunk/ext/json' I, [2024-05-16T22:10:13.725312 #988489] INFO -- : make[2]: Entering directory '/tmp/ruby/build/trunk/.bundle/gems/rbs-3.4.4/ext/rbs_extension' I, [2024-05-16T22:10:13.725502 #988489] INFO -- : make[2]: Entering directory '/tmp/ruby/build/trunk/ext/ripper' I, [2024-05-16T22:10:13.725586 #988489] INFO -- : make[2]: Leaving directory '/tmp/ruby/build/trunk/ext/pathname' I, [2024-05-16T22:10:13.726147 #988489] INFO -- : make[2]: Entering directory '/tmp/ruby/build/trunk/.bundle/gems/syslog-0.1.2/ext/syslog' I, [2024-05-16T22:10:13.726932 #988489] INFO -- : make[2]: Leaving directory '/tmp/ruby/build/trunk/ext/objspace' I, [2024-05-16T22:10:13.727936 #988489] INFO -- : make[2]: Leaving directory '/tmp/ruby/build/trunk/ext/fiddle' I, [2024-05-16T22:10:13.728498 #988489] INFO -- : make[2]: Leaving directory '/tmp/ruby/build/trunk/ext/rubyvm' I, [2024-05-16T22:10:13.731510 #988489] INFO -- : make[2]: Leaving directory '/tmp/ruby/build/trunk/ext/ripper' I, [2024-05-16T22:10:13.731643 #988489] INFO -- : make[2]: Entering directory '/tmp/ruby/build/trunk/ext/socket' I, [2024-05-16T22:10:13.733331 #988489] INFO -- : make[2]: Entering directory '/tmp/ruby/build/trunk/ext/digest/sha2' I, [2024-05-16T22:10:13.734348 #988489] INFO -- : make[2]: Entering directory '/tmp/ruby/build/trunk/ext/openssl' I, [2024-05-16T22:10:13.735462 #988489] INFO -- : make[2]: Leaving directory '/tmp/ruby/build/trunk/ext/digest/sha2' I, [2024-05-16T22:10:13.736256 #988489] INFO -- : make[2]: Leaving directory '/tmp/ruby/build/trunk/ext/psych' I, [2024-05-16T22:10:13.737542 #988489] INFO -- : make[2]: Leaving directory '/tmp/ruby/build/trunk/ext/socket' I, [2024-05-16T22:10:13.747311 #988489] INFO -- : make[2]: Leaving directory '/tmp/ruby/build/trunk/ext/openssl' I, [2024-05-16T22:10:13.748623 #988489] INFO -- : make[2]: Leaving directory '/tmp/ruby/build/trunk/.bundle/gems/bigdecimal-3.1.8/ext/bigdecimal' I, [2024-05-16T22:10:13.748651 #988489] INFO -- : make[2]: Leaving directory '/tmp/ruby/build/trunk/.bundle/gems/rbs-3.4.4/ext/rbs_extension' I, [2024-05-16T22:10:13.749197 #988489] INFO -- : make[2]: Leaving directory '/tmp/ruby/build/trunk/.bundle/gems/debug-1.9.2/ext/debug' I, [2024-05-16T22:10:13.758118 #988489] INFO -- : make[2]: Leaving directory '/tmp/ruby/build/trunk/.bundle/gems/racc-1.7.3/ext/racc/cparse' I, [2024-05-16T22:10:13.759525 #988489] INFO -- : make[2]: Leaving directory '/tmp/ruby/build/trunk/.bundle/gems/nkf-0.2.0/ext/nkf' I, [2024-05-16T22:10:13.759569 #988489] INFO -- : make[2]: Leaving directory '/tmp/ruby/build/trunk/.bundle/gems/syslog-0.1.2/ext/syslog' I, [2024-05-16T22:10:13.783011 #988489] INFO -- : make[2]: Entering directory '/tmp/ruby/build/trunk' I, [2024-05-16T22:10:13.850490 #988489] INFO -- : linking ruby I, [2024-05-16T22:10:13.873215 #988489] INFO -- : make[2]: Leaving directory '/tmp/ruby/build/trunk' I, [2024-05-16T22:10:13.873548 #988489] INFO -- : make[1]: Leaving directory '/tmp/ruby/build/trunk' I, [2024-05-16T22:10:13.877981 #988489] INFO -- : make[1]: Entering directory '/tmp/ruby/build/trunk' I, [2024-05-16T22:10:13.878024 #988489] INFO -- : make[1]: Nothing to be done for 'note'. I, [2024-05-16T22:10:13.878036 #988489] INFO -- : make[1]: Leaving directory '/tmp/ruby/build/trunk' I, [2024-05-16T22:10:13.878816 #988489] INFO -- : $$$[end] "make all -j20" exit with 0. I, [2024-05-16T22:10:13.879006 #988489] INFO -- : $$$[beg] make install -j20 I, [2024-05-16T22:10:13.947663 #988489] INFO -- : Update minitest to ea9caafc0754b1d6236a490d59e624b53209734a I, [2024-05-16T22:10:13.947723 #988489] INFO -- : Update power_assert to 84e85124c5014a139af39161d484156cfe87a9ed I, [2024-05-16T22:10:13.947972 #988489] INFO -- : Update rbs to ba7872795d5de04adb8ff500c0e6afdc81a041dd I, [2024-05-16T22:10:13.948822 #988489] INFO -- : Update typeprof to b19a6416da3a05d57fadd6ffdadb382b6d236ca5 I, [2024-05-16T22:10:13.949472 #988489] INFO -- : echo ea9caafc0754b1d6236a490d59e624b53209734a | /bin/sh /tmp/ruby/src/trunk/tool/ifchange /tmp/ruby/src/trunk/.bundle/.timestamp/minitest.revision - I, [2024-05-16T22:10:13.949529 #988489] INFO -- : echo 84e85124c5014a139af39161d484156cfe87a9ed | /bin/sh /tmp/ruby/src/trunk/tool/ifchange /tmp/ruby/src/trunk/.bundle/.timestamp/power_assert.revision - I, [2024-05-16T22:10:13.949757 #988489] INFO -- : echo ba7872795d5de04adb8ff500c0e6afdc81a041dd | /bin/sh /tmp/ruby/src/trunk/tool/ifchange /tmp/ruby/src/trunk/.bundle/.timestamp/rbs.revision - I, [2024-05-16T22:10:13.950579 #988489] INFO -- : BASERUBY = /usr/bin/ruby --disable=gems I, [2024-05-16T22:10:13.950621 #988489] INFO -- : CC = gcc I, [2024-05-16T22:10:13.950627 #988489] INFO -- : LD = ld I, [2024-05-16T22:10:13.950631 #988489] INFO -- : LDSHARED = gcc -shared I, [2024-05-16T22:10:13.950636 #988489] INFO -- : CFLAGS = -O3 -fno-fast-math -ggdb3 -Wall -Wextra -Wdeprecated-declarations -Wdiv-by-zero -Wduplicated-cond -Wimplicit-function-declaration -Wimplicit-int -Wpointer-arith -Wwrite-strings -Wold-style-definition -Wimplicit-fallthrough=0 -Wmissing-noreturn -Wno-cast-function-type -Wno-constant-logical-operand -Wno-long-long -Wno-missing-field-initializers -Wno-overlength-strings -Wno-packed-bitfield-compat -Wno-parentheses-equality -Wno-self-assign -Wno-tautological-compare -Wno-unused-parameter -Wno-unused-value -Wsuggest-attribute=format -Wsuggest-attribute=noreturn -Wunused-variable -Wmisleading-indentation -Wundef -fPIC I, [2024-05-16T22:10:13.950642 #988489] INFO -- : XCFLAGS = -U_FORTIFY_SOURCE -D_FORTIFY_SOURCE=2 -fstack-protector-strong -fno-strict-overflow -fvisibility=hidden -fexcess-precision=standard -DRUBY_EXPORT -I. -I.ext/include/x86_64-linux -I/tmp/ruby/src/trunk/include -I/tmp/ruby/src/trunk -I/tmp/ruby/src/trunk/prism -I/tmp/ruby/src/trunk/enc/unicode/15.0.0 I, [2024-05-16T22:10:13.950646 #988489] INFO -- : CPPFLAGS = I, [2024-05-16T22:10:13.950651 #988489] INFO -- : DLDFLAGS = -Wl,--compress-debug-sections=zlib -Wl,-soname,libruby.so.3.4 -fstack-protector-strong I, [2024-05-16T22:10:13.950655 #988489] INFO -- : SOLIBS = -lz -lrt -lrt -lgmp -ldl -lcrypt -lm -lpthread I, [2024-05-16T22:10:13.950658 #988489] INFO -- : LANG = en_US.UTF-8 I, [2024-05-16T22:10:13.950662 #988489] INFO -- : LC_ALL = I, [2024-05-16T22:10:13.950666 #988489] INFO -- : LC_CTYPE = I, [2024-05-16T22:10:13.950671 #988489] INFO -- : MFLAGS = -j20 --jobserver-auth=4,5 I, [2024-05-16T22:10:13.950675 #988489] INFO -- : RUSTC = no I, [2024-05-16T22:10:13.950679 #988489] INFO -- : YJIT_RUSTC_ARGS = --crate-name=yjit --crate-type=staticlib --edition=2021 -g -C lto=thin -C opt-level=3 -C overflow-checks=on '--out-dir=/tmp/ruby/build/trunk/yjit/target/release/' /tmp/ruby/src/trunk/yjit/src/lib.rs I, [2024-05-16T22:10:13.951404 #988489] INFO -- : /tmp/ruby/src/trunk/.bundle/.timestamp/minitest.revision unchanged I, [2024-05-16T22:10:13.951508 #988489] INFO -- : /tmp/ruby/src/trunk/.bundle/.timestamp/power_assert.revision unchanged I, [2024-05-16T22:10:13.951556 #988489] INFO -- : /tmp/ruby/src/trunk/.bundle/.timestamp/rbs.revision unchanged I, [2024-05-16T22:10:13.982268 #988489] INFO -- : echo b19a6416da3a05d57fadd6ffdadb382b6d236ca5 | /bin/sh /tmp/ruby/src/trunk/tool/ifchange /tmp/ruby/src/trunk/.bundle/.timestamp/typeprof.revision - I, [2024-05-16T22:10:13.983143 #988489] INFO -- : gcc (Ubuntu 11.4.0-1ubuntu1~22.04) 11.4.0 I, [2024-05-16T22:10:13.983171 #988489] INFO -- : Copyright (C) 2021 Free Software Foundation, Inc. I, [2024-05-16T22:10:13.983184 #988489] INFO -- : This is free software; see the source for copying conditions. There is NO I, [2024-05-16T22:10:13.983195 #988489] INFO -- : warranty; not even for MERCHANTABILITY or FITNESS FOR A PARTICULAR PURPOSE. I, [2024-05-16T22:10:13.983205 #988489] INFO -- : I, [2024-05-16T22:10:13.983216 #988489] INFO -- : generating enc.mk I, [2024-05-16T22:10:13.984119 #988489] INFO -- : /tmp/ruby/src/trunk/.bundle/.timestamp/typeprof.revision unchanged I, [2024-05-16T22:10:14.104449 #988489] INFO -- : Building power_assert@84e85124c5014a139af39161d484156cfe87a9ed to /tmp/ruby/src/trunk/gems/power_assert-2.0.3.gem I, [2024-05-16T22:10:14.105145 #988489] INFO -- : making srcs under enc I, [2024-05-16T22:10:14.105328 #988489] INFO -- : making enc I, [2024-05-16T22:10:14.122298 #988489] INFO -- : make[1]: Entering directory '/tmp/ruby/build/trunk' I, [2024-05-16T22:10:14.122345 #988489] INFO -- : make[1]: Nothing to be done for 'enc'. I, [2024-05-16T22:10:14.122358 #988489] INFO -- : make[1]: Leaving directory '/tmp/ruby/build/trunk' I, [2024-05-16T22:10:14.134385 #988489] INFO -- : make[1]: Entering directory '/tmp/ruby/build/trunk' I, [2024-05-16T22:10:14.134442 #988489] INFO -- : make[1]: Nothing to be done for 'srcs'. I, [2024-05-16T22:10:14.134455 #988489] INFO -- : make[1]: Leaving directory '/tmp/ruby/build/trunk' I, [2024-05-16T22:10:14.135190 #988489] INFO -- : generating transdb.h I, [2024-05-16T22:10:14.173044 #988489] INFO -- : Successfully built RubyGem I, [2024-05-16T22:10:14.173113 #988489] INFO -- : Name: power_assert I, [2024-05-16T22:10:14.173125 #988489] INFO -- : Version: 2.0.4dev I, [2024-05-16T22:10:14.173137 #988489] INFO -- : File: power_assert-2.0.4dev.gem I, [2024-05-16T22:10:14.175230 #988489] INFO -- : Extracting bundle gem power_assert-2.0.3... I, [2024-05-16T22:10:14.232534 #988489] INFO -- : transdb.h unchanged I, [2024-05-16T22:10:14.234230 #988489] INFO -- : generating makefiles ext/configure-ext.mk I, [2024-05-16T22:10:14.234280 #988489] INFO -- : making trans I, [2024-05-16T22:10:14.236117 #988489] INFO -- : Try with hash version of bundled gems instead of gems/power_assert-2.0.3.gem. We don't use this gem with release version of Ruby. I, [2024-05-16T22:10:14.241121 #988489] INFO -- : Unpacked gems/power_assert-2.0.4dev.gem I, [2024-05-16T22:10:14.261098 #988489] INFO -- : ext/configure-ext.mk unchanged I, [2024-05-16T22:10:14.263335 #988489] INFO -- : make[1]: Entering directory '/tmp/ruby/build/trunk' I, [2024-05-16T22:10:14.267540 #988489] INFO -- : make[1]: Entering directory '/tmp/ruby/build/trunk' I, [2024-05-16T22:10:14.267635 #988489] INFO -- : make[1]: Nothing to be done for 'trans'. I, [2024-05-16T22:10:14.267646 #988489] INFO -- : make[1]: Leaving directory '/tmp/ruby/build/trunk' I, [2024-05-16T22:10:14.268443 #988489] INFO -- : making encs I, [2024-05-16T22:10:14.328492 #988489] INFO -- : make[1]: Entering directory '/tmp/ruby/build/trunk' I, [2024-05-16T22:10:14.328578 #988489] INFO -- : make[1]: Nothing to be done for 'encs'. I, [2024-05-16T22:10:14.328618 #988489] INFO -- : make[1]: Leaving directory '/tmp/ruby/build/trunk' I, [2024-05-16T22:10:14.414813 #988489] INFO -- : make[1]: Leaving directory '/tmp/ruby/build/trunk' I, [2024-05-16T22:10:14.415454 #988489] INFO -- : generating makefile exts.mk I, [2024-05-16T22:10:14.452930 #988489] INFO -- : exts.mk unchanged I, [2024-05-16T22:10:14.457733 #988489] INFO -- : make[1]: Entering directory '/tmp/ruby/build/trunk' I, [2024-05-16T22:10:14.475545 #988489] INFO -- : make[2]: Entering directory '/tmp/ruby/build/trunk/ext/digest' I, [2024-05-16T22:10:14.476893 #988489] INFO -- : make[2]: Entering directory '/tmp/ruby/build/trunk/ext/io/console' I, [2024-05-16T22:10:14.477288 #988489] INFO -- : make[2]: Entering directory '/tmp/ruby/build/trunk/ext/date' I, [2024-05-16T22:10:14.477722 #988489] INFO -- : make[2]: Entering directory '/tmp/ruby/build/trunk/ext/json' I, [2024-05-16T22:10:14.478569 #988489] INFO -- : make[2]: Entering directory '/tmp/ruby/build/trunk/ext/coverage' I, [2024-05-16T22:10:14.479244 #988489] INFO -- : make[2]: Entering directory '/tmp/ruby/build/trunk/ext/rubyvm' I, [2024-05-16T22:10:14.479460 #988489] INFO -- : make[2]: Leaving directory '/tmp/ruby/build/trunk/ext/digest' I, [2024-05-16T22:10:14.479720 #988489] INFO -- : make[2]: Entering directory '/tmp/ruby/build/trunk/ext/monitor' I, [2024-05-16T22:10:14.479924 #988489] INFO -- : make[2]: Entering directory '/tmp/ruby/build/trunk/ext/fiddle' I, [2024-05-16T22:10:14.480185 #988489] INFO -- : make[2]: Entering directory '/tmp/ruby/build/trunk/ext/pathname' I, [2024-05-16T22:10:14.480205 #988489] INFO -- : make[2]: Leaving directory '/tmp/ruby/build/trunk/ext/io/console' I, [2024-05-16T22:10:14.480800 #988489] INFO -- : make[2]: Entering directory '/tmp/ruby/build/trunk/ext/pty' I, [2024-05-16T22:10:14.481586 #988489] INFO -- : make[2]: Entering directory '/tmp/ruby/build/trunk/ext/objspace' I, [2024-05-16T22:10:14.481617 #988489] INFO -- : make[2]: Leaving directory '/tmp/ruby/build/trunk/ext/date' I, [2024-05-16T22:10:14.481831 #988489] INFO -- : make[2]: Leaving directory '/tmp/ruby/build/trunk/ext/rubyvm' I, [2024-05-16T22:10:14.482085 #988489] INFO -- : make[2]: Leaving directory '/tmp/ruby/build/trunk/ext/monitor' I, [2024-05-16T22:10:14.482223 #988489] INFO -- : make[2]: Leaving directory '/tmp/ruby/build/trunk/ext/coverage' I, [2024-05-16T22:10:14.482428 #988489] INFO -- : make[2]: Leaving directory '/tmp/ruby/build/trunk/ext/pathname' I, [2024-05-16T22:10:14.482502 #988489] INFO -- : make[2]: Entering directory '/tmp/ruby/build/trunk/ext/psych' I, [2024-05-16T22:10:14.482733 #988489] INFO -- : make[2]: Leaving directory '/tmp/ruby/build/trunk/ext/json' I, [2024-05-16T22:10:14.483544 #988489] INFO -- : make[2]: Leaving directory '/tmp/ruby/build/trunk/ext/pty' I, [2024-05-16T22:10:14.484389 #988489] INFO -- : make[2]: Leaving directory '/tmp/ruby/build/trunk/ext/objspace' I, [2024-05-16T22:10:14.484990 #988489] INFO -- : make[2]: Entering directory '/tmp/ruby/build/trunk/ext/ripper' I, [2024-05-16T22:10:14.485472 #988489] INFO -- : make[2]: Entering directory '/tmp/ruby/build/trunk/.bundle/gems/nkf-0.2.0/ext/nkf' I, [2024-05-16T22:10:14.485516 #988489] INFO -- : make[2]: Entering directory '/tmp/ruby/build/trunk/.bundle/gems/bigdecimal-3.1.8/ext/bigdecimal' I, [2024-05-16T22:10:14.485607 #988489] INFO -- : make[2]: Entering directory '/tmp/ruby/build/trunk/.bundle/gems/racc-1.7.3/ext/racc/cparse' I, [2024-05-16T22:10:14.485682 #988489] INFO -- : make[2]: Entering directory '/tmp/ruby/build/trunk/.bundle/gems/debug-1.9.2/ext/debug' I, [2024-05-16T22:10:14.485897 #988489] INFO -- : make[2]: Entering directory '/tmp/ruby/build/trunk/.bundle/gems/syslog-0.1.2/ext/syslog' I, [2024-05-16T22:10:14.486210 #988489] INFO -- : make[2]: Entering directory '/tmp/ruby/build/trunk/.bundle/gems/rbs-3.4.4/ext/rbs_extension' I, [2024-05-16T22:10:14.486289 #988489] INFO -- : make[2]: Leaving directory '/tmp/ruby/build/trunk/ext/fiddle' I, [2024-05-16T22:10:14.488541 #988489] INFO -- : make[2]: Entering directory '/tmp/ruby/build/trunk/ext/socket' I, [2024-05-16T22:10:14.490411 #988489] INFO -- : make[2]: Entering directory '/tmp/ruby/build/trunk/ext/digest/sha2' I, [2024-05-16T22:10:14.490530 #988489] INFO -- : make[2]: Leaving directory '/tmp/ruby/build/trunk/ext/ripper' I, [2024-05-16T22:10:14.493808 #988489] INFO -- : make[2]: Leaving directory '/tmp/ruby/build/trunk/ext/digest/sha2' I, [2024-05-16T22:10:14.493851 #988489] INFO -- : make[2]: Entering directory '/tmp/ruby/build/trunk/ext/openssl' I, [2024-05-16T22:10:14.494521 #988489] INFO -- : make[2]: Leaving directory '/tmp/ruby/build/trunk/ext/socket' I, [2024-05-16T22:10:14.494872 #988489] INFO -- : make[2]: Leaving directory '/tmp/ruby/build/trunk/ext/psych' I, [2024-05-16T22:10:14.505186 #988489] INFO -- : make[2]: Leaving directory '/tmp/ruby/build/trunk/ext/openssl' I, [2024-05-16T22:10:14.507976 #988489] INFO -- : make[2]: Leaving directory '/tmp/ruby/build/trunk/.bundle/gems/rbs-3.4.4/ext/rbs_extension' I, [2024-05-16T22:10:14.508838 #988489] INFO -- : make[2]: Leaving directory '/tmp/ruby/build/trunk/.bundle/gems/racc-1.7.3/ext/racc/cparse' I, [2024-05-16T22:10:14.509791 #988489] INFO -- : make[2]: Leaving directory '/tmp/ruby/build/trunk/.bundle/gems/nkf-0.2.0/ext/nkf' I, [2024-05-16T22:10:14.518308 #988489] INFO -- : make[2]: Leaving directory '/tmp/ruby/build/trunk/.bundle/gems/bigdecimal-3.1.8/ext/bigdecimal' I, [2024-05-16T22:10:14.520129 #988489] INFO -- : make[2]: Leaving directory '/tmp/ruby/build/trunk/.bundle/gems/debug-1.9.2/ext/debug' I, [2024-05-16T22:10:14.522866 #988489] INFO -- : make[2]: Leaving directory '/tmp/ruby/build/trunk/.bundle/gems/syslog-0.1.2/ext/syslog' I, [2024-05-16T22:10:14.546450 #988489] INFO -- : make[2]: Entering directory '/tmp/ruby/build/trunk' I, [2024-05-16T22:10:14.610865 #988489] INFO -- : make[2]: 'ruby' is up to date. I, [2024-05-16T22:10:14.610897 #988489] INFO -- : make[2]: Leaving directory '/tmp/ruby/build/trunk' I, [2024-05-16T22:10:14.611247 #988489] INFO -- : make[1]: Leaving directory '/tmp/ruby/build/trunk' I, [2024-05-16T22:10:14.614893 #988489] INFO -- : make[1]: Entering directory '/tmp/ruby/build/trunk' I, [2024-05-16T22:10:14.614925 #988489] INFO -- : make[1]: Nothing to be done for 'note'. I, [2024-05-16T22:10:14.614930 #988489] INFO -- : make[1]: Leaving directory '/tmp/ruby/build/trunk' I, [2024-05-16T22:10:14.615132 #988489] INFO -- : ./miniruby -I/tmp/ruby/src/trunk/lib -I. -I.ext/common /tmp/ruby/src/trunk/tool/runruby.rb --extout=.ext -- --disable-gems -r./x86_64-linux-fake /tmp/ruby/src/trunk/tool/rbinstall.rb --make="make" --dest-dir="" --extout=".ext" --ext-build-dir="./ext" --mflags="-j20 --jobserver-auth=4,5" --make-flags=" -j20 --jobserver-auth=4,5" --data-mode=0644 --prog-mode=0755 --installed-list .installed.list --mantype="doc" --gnumake --install=all --exclude=doc I, [2024-05-16T22:10:14.711347 #988489] INFO -- : Installing to I, [2024-05-16T22:10:14.711411 #988489] INFO -- : installing binary commands: /tmp/ruby/install/trunk/bin I, [2024-05-16T22:10:14.711501 #988489] INFO -- : installing base libraries: /tmp/ruby/install/trunk/lib I, [2024-05-16T22:10:14.718654 #988489] INFO -- : installing arch files: /tmp/ruby/install/trunk/lib/ruby/3.4.0+0/x86_64-linux I, [2024-05-16T22:10:14.718679 #988489] INFO -- : installing pkgconfig data: /tmp/ruby/install/trunk/lib/pkgconfig I, [2024-05-16T22:10:14.718685 #988489] INFO -- : installing extension objects: /tmp/ruby/install/trunk/lib/ruby/3.4.0+0/x86_64-linux I, [2024-05-16T22:10:14.728199 #988489] INFO -- : installing extension objects: /tmp/ruby/install/trunk/lib/ruby/site_ruby/3.4.0+0/x86_64-linux I, [2024-05-16T22:10:14.728222 #988489] INFO -- : installing extension objects: /tmp/ruby/install/trunk/lib/ruby/vendor_ruby/3.4.0+0/x86_64-linux I, [2024-05-16T22:10:14.728228 #988489] INFO -- : installing extension headers: /tmp/ruby/install/trunk/include/ruby-3.4.0+0/x86_64-linux I, [2024-05-16T22:10:14.728366 #988489] INFO -- : installing extension scripts: /tmp/ruby/install/trunk/lib/ruby/3.4.0+0 I, [2024-05-16T22:10:14.731099 #988489] INFO -- : installing extension scripts: /tmp/ruby/install/trunk/lib/ruby/site_ruby/3.4.0+0 I, [2024-05-16T22:10:14.731130 #988489] INFO -- : installing extension scripts: /tmp/ruby/install/trunk/lib/ruby/vendor_ruby/3.4.0+0 I, [2024-05-16T22:10:14.731137 #988489] INFO -- : installing extension headers: /tmp/ruby/install/trunk/include/ruby-3.4.0+0/ruby I, [2024-05-16T22:10:14.731143 #988489] INFO -- : installing command scripts: /tmp/ruby/install/trunk/bin I, [2024-05-16T22:10:14.731148 #988489] INFO -- : installing library scripts: /tmp/ruby/install/trunk/lib/ruby/3.4.0+0 I, [2024-05-16T22:10:14.763610 #988489] INFO -- : installing common headers: /tmp/ruby/install/trunk/include/ruby-3.4.0+0 I, [2024-05-16T22:10:14.770175 #988489] INFO -- : installing manpages: /tmp/ruby/install/trunk/share/man/man1 I, [2024-05-16T22:10:14.770200 #988489] INFO -- : installing default gems from lib: /tmp/ruby/install/trunk/lib/ruby/gems/3.4.0+0 I, [2024-05-16T22:10:14.792924 #988489] INFO -- : benchmark 0.3.0 I, [2024-05-16T22:10:14.794780 #988489] INFO -- : bundler 2.6.0.dev I, [2024-05-16T22:10:14.796945 #988489] INFO -- : cgi 0.4.1 I, [2024-05-16T22:10:14.797476 #988489] INFO -- : delegate 0.3.1 I, [2024-05-16T22:10:14.797946 #988489] INFO -- : did_you_mean 1.6.3 I, [2024-05-16T22:10:14.798416 #988489] INFO -- : english 0.8.0 I, [2024-05-16T22:10:14.798887 #988489] INFO -- : erb 4.0.4 I, [2024-05-16T22:10:14.799986 #988489] INFO -- : error_highlight 0.6.0 I, [2024-05-16T22:10:14.800721 #988489] INFO -- : fileutils 1.7.2 I, [2024-05-16T22:10:14.801430 #988489] INFO -- : find 0.2.0 I, [2024-05-16T22:10:14.802249 #988489] INFO -- : forwardable 1.3.3 I, [2024-05-16T22:10:14.803389 #988489] INFO -- : ipaddr 1.2.6 I, [2024-05-16T22:10:14.804037 #988489] INFO -- : irb 1.13.1 I, [2024-05-16T22:10:14.804815 #988489] INFO -- : logger 1.6.0 I, [2024-05-16T22:10:14.805279 #988489] INFO -- : net-http 0.4.1 I, [2024-05-16T22:10:14.805768 #988489] INFO -- : net-protocol 0.2.2 I, [2024-05-16T22:10:14.806252 #988489] INFO -- : open-uri 0.4.1 I, [2024-05-16T22:10:14.806742 #988489] INFO -- : open3 0.2.1 I, [2024-05-16T22:10:14.807194 #988489] INFO -- : optparse 0.5.0 I, [2024-05-16T22:10:14.807604 #988489] INFO -- : ostruct 0.6.0 I, [2024-05-16T22:10:14.808129 #988489] INFO -- : pp 0.5.0 I, [2024-05-16T22:10:14.808541 #988489] INFO -- : prettyprint 0.2.0 I, [2024-05-16T22:10:14.809064 #988489] INFO -- : prism 0.29.0 I, [2024-05-16T22:10:14.809546 #988489] INFO -- : pstore 0.1.3 I, [2024-05-16T22:10:14.810012 #988489] INFO -- : rdoc 6.6.3.1 I, [2024-05-16T22:10:14.810957 #988489] INFO -- : readline 0.0.4 I, [2024-05-16T22:10:14.811484 #988489] INFO -- : reline 0.5.7 I, [2024-05-16T22:10:14.811993 #988489] INFO -- : resolv 0.4.0 I, [2024-05-16T22:10:14.812504 #988489] INFO -- : ruby2_keywords 0.0.5 I, [2024-05-16T22:10:14.812950 #988489] INFO -- : securerandom 0.3.1 I, [2024-05-16T22:10:14.814012 #988489] INFO -- : set 1.1.0 I, [2024-05-16T22:10:14.814742 #988489] INFO -- : shellwords 0.2.0 I, [2024-05-16T22:10:14.815224 #988489] INFO -- : singleton 0.2.0 I, [2024-05-16T22:10:14.815673 #988489] INFO -- : syntax_suggest 2.0.0 I, [2024-05-16T22:10:14.816349 #988489] INFO -- : tempfile 0.2.1 I, [2024-05-16T22:10:14.816828 #988489] INFO -- : time 0.3.0 I, [2024-05-16T22:10:14.817308 #988489] INFO -- : timeout 0.4.1 I, [2024-05-16T22:10:14.817749 #988489] INFO -- : tmpdir 0.2.0 I, [2024-05-16T22:10:14.818211 #988489] INFO -- : tsort 0.2.0 I, [2024-05-16T22:10:14.818592 #988489] INFO -- : un 0.3.0 I, [2024-05-16T22:10:14.819022 #988489] INFO -- : uri 0.13.0 I, [2024-05-16T22:10:14.819630 #988489] INFO -- : weakref 0.1.3 I, [2024-05-16T22:10:14.820154 #988489] INFO -- : yaml 0.3.0 I, [2024-05-16T22:10:14.820456 #988489] INFO -- : installing default gems from ext: /tmp/ruby/install/trunk/lib/ruby/gems/3.4.0+0 I, [2024-05-16T22:10:14.826975 #988489] INFO -- : date 3.3.4 I, [2024-05-16T22:10:14.827498 #988489] INFO -- : digest 3.1.1 I, [2024-05-16T22:10:14.828000 #988489] INFO -- : etc 1.4.3 I, [2024-05-16T22:10:14.828488 #988489] INFO -- : fcntl 1.1.0 I, [2024-05-16T22:10:14.828943 #988489] INFO -- : fiddle 1.1.3 I, [2024-05-16T22:10:14.829366 #988489] INFO -- : io-console 0.7.2 I, [2024-05-16T22:10:14.829906 #988489] INFO -- : io-nonblock 0.3.0 I, [2024-05-16T22:10:14.830357 #988489] INFO -- : io-wait 0.3.1 I, [2024-05-16T22:10:14.830854 #988489] INFO -- : json 2.7.2 I, [2024-05-16T22:10:14.831302 #988489] INFO -- : openssl 3.2.0 I, [2024-05-16T22:10:14.831876 #988489] INFO -- : pathname 0.3.0 I, [2024-05-16T22:10:14.832413 #988489] INFO -- : psych 5.1.2 I, [2024-05-16T22:10:14.832946 #988489] INFO -- : stringio 3.1.1 I, [2024-05-16T22:10:14.833441 #988489] INFO -- : strscan 3.1.1 I, [2024-05-16T22:10:14.833889 #988489] INFO -- : zlib 3.1.0 I, [2024-05-16T22:10:14.834240 #988489] INFO -- : installing bundled gems: /tmp/ruby/install/trunk/lib/ruby/gems/3.4.0+0 I, [2024-05-16T22:10:14.834544 #988489] INFO -- : minitest 5.22.3 I, [2024-05-16T22:10:14.842122 #988489] INFO -- : rake 13.2.1 I, [2024-05-16T22:10:14.845520 #988489] INFO -- : test-unit 3.6.2 I, [2024-05-16T22:10:14.850337 #988489] INFO -- : rexml 3.2.6 I, [2024-05-16T22:10:14.853895 #988489] INFO -- : rss 0.3.0 I, [2024-05-16T22:10:14.856579 #988489] INFO -- : net-ftp 0.3.4 I, [2024-05-16T22:10:14.858182 #988489] INFO -- : net-imap 0.4.11 I, [2024-05-16T22:10:14.861811 #988489] INFO -- : net-pop 0.1.2 I, [2024-05-16T22:10:14.862851 #988489] INFO -- : net-smtp 0.5.0 I, [2024-05-16T22:10:14.864176 #988489] INFO -- : matrix 0.4.2 I, [2024-05-16T22:10:14.867453 #988489] INFO -- : prime 0.1.2 I, [2024-05-16T22:10:14.872325 #988489] INFO -- : rbs 3.4.4 I, [2024-05-16T22:10:14.894109 #988489] INFO -- : typeprof 0.21.11 I, [2024-05-16T22:10:14.896407 #988489] INFO -- : debug 1.9.2 I, [2024-05-16T22:10:14.899437 #988489] INFO -- : racc 1.7.3 I, [2024-05-16T22:10:14.902177 #988489] INFO -- : mutex_m 0.2.0 I, [2024-05-16T22:10:14.903457 #988489] INFO -- : getoptlong 0.2.1 I, [2024-05-16T22:10:14.905460 #988489] INFO -- : base64 0.2.0 I, [2024-05-16T22:10:14.906581 #988489] INFO -- : bigdecimal 3.1.8 I, [2024-05-16T22:10:14.908744 #988489] INFO -- : observer 0.1.2 I, [2024-05-16T22:10:14.909883 #988489] INFO -- : abbrev 0.1.2 I, [2024-05-16T22:10:14.911419 #988489] INFO -- : resolv-replace 0.1.1 I, [2024-05-16T22:10:14.912888 #988489] INFO -- : rinda 0.2.0 I, [2024-05-16T22:10:14.914367 #988489] INFO -- : drb 2.2.1 I, [2024-05-16T22:10:14.915987 #988489] INFO -- : nkf 0.2.0 I, [2024-05-16T22:10:14.918403 #988489] INFO -- : syslog 0.1.2 I, [2024-05-16T22:10:14.920339 #988489] INFO -- : csv 3.3.0 I, [2024-05-16T22:10:14.923077 #988489] INFO -- : installing bundled gem cache: /tmp/ruby/install/trunk/lib/ruby/gems/3.4.0+0/cache I, [2024-05-16T22:10:14.924475 #988489] INFO -- : skipped bundled gems: I, [2024-05-16T22:10:14.924496 #988489] INFO -- : power_assert-2.0.4dev.gem not found in bundled_gems I, [2024-05-16T22:10:14.927345 #988489] INFO -- : $$$[end] "make install -j20" exit with 0. I, [2024-05-16T22:10:14.927500 #988489] INFO -- : $$$[beg] make yes-btest TESTOPTS='-q -j20' I, [2024-05-16T22:10:20.469474 #988489] INFO -- : PASS all 1936 tests E, [2024-05-16T22:10:20.475113 #988489] ERROR -- : I, [2024-05-16T22:10:20.475268 #988489] INFO -- : $$$[end] "make yes-btest TESTOPTS='-q -j20'" exit with 0. I, [2024-05-16T22:10:20.475407 #988489] INFO -- : $$$[beg] make yes-test-basic TESTS='-j20' I, [2024-05-16T22:10:20.534705 #988489] INFO -- : BASERUBY = /usr/bin/ruby --disable=gems I, [2024-05-16T22:10:20.534747 #988489] INFO -- : CC = gcc I, [2024-05-16T22:10:20.534759 #988489] INFO -- : LD = ld I, [2024-05-16T22:10:20.534764 #988489] INFO -- : LDSHARED = gcc -shared I, [2024-05-16T22:10:20.534769 #988489] INFO -- : CFLAGS = -O3 -fno-fast-math -ggdb3 -Wall -Wextra -Wdeprecated-declarations -Wdiv-by-zero -Wduplicated-cond -Wimplicit-function-declaration -Wimplicit-int -Wpointer-arith -Wwrite-strings -Wold-style-definition -Wimplicit-fallthrough=0 -Wmissing-noreturn -Wno-cast-function-type -Wno-constant-logical-operand -Wno-long-long -Wno-missing-field-initializers -Wno-overlength-strings -Wno-packed-bitfield-compat -Wno-parentheses-equality -Wno-self-assign -Wno-tautological-compare -Wno-unused-parameter -Wno-unused-value -Wsuggest-attribute=format -Wsuggest-attribute=noreturn -Wunused-variable -Wmisleading-indentation -Wundef -fPIC I, [2024-05-16T22:10:20.534774 #988489] INFO -- : XCFLAGS = -U_FORTIFY_SOURCE -D_FORTIFY_SOURCE=2 -fstack-protector-strong -fno-strict-overflow -fvisibility=hidden -fexcess-precision=standard -DRUBY_EXPORT -I. -I.ext/include/x86_64-linux -I/tmp/ruby/src/trunk/include -I/tmp/ruby/src/trunk -I/tmp/ruby/src/trunk/prism -I/tmp/ruby/src/trunk/enc/unicode/15.0.0 I, [2024-05-16T22:10:20.534783 #988489] INFO -- : CPPFLAGS = I, [2024-05-16T22:10:20.534787 #988489] INFO -- : DLDFLAGS = -Wl,--compress-debug-sections=zlib -Wl,-soname,libruby.so.3.4 -fstack-protector-strong I, [2024-05-16T22:10:20.534792 #988489] INFO -- : SOLIBS = -lz -lrt -lrt -lgmp -ldl -lcrypt -lm -lpthread I, [2024-05-16T22:10:20.534802 #988489] INFO -- : LANG = en_US.UTF-8 I, [2024-05-16T22:10:20.534807 #988489] INFO -- : LC_ALL = I, [2024-05-16T22:10:20.534811 #988489] INFO -- : LC_CTYPE = I, [2024-05-16T22:10:20.534815 #988489] INFO -- : MFLAGS = I, [2024-05-16T22:10:20.534820 #988489] INFO -- : RUSTC = no I, [2024-05-16T22:10:20.534824 #988489] INFO -- : YJIT_RUSTC_ARGS = --crate-name=yjit --crate-type=staticlib --edition=2021 -g -C lto=thin -C opt-level=3 -C overflow-checks=on '--out-dir=/tmp/ruby/build/trunk/yjit/target/release/' /tmp/ruby/src/trunk/yjit/src/lib.rs I, [2024-05-16T22:10:20.535402 #988489] INFO -- : gcc (Ubuntu 11.4.0-1ubuntu1~22.04) 11.4.0 I, [2024-05-16T22:10:20.535421 #988489] INFO -- : Copyright (C) 2021 Free Software Foundation, Inc. I, [2024-05-16T22:10:20.535425 #988489] INFO -- : This is free software; see the source for copying conditions. There is NO I, [2024-05-16T22:10:20.535432 #988489] INFO -- : warranty; not even for MERCHANTABILITY or FITNESS FOR A PARTICULAR PURPOSE. I, [2024-05-16T22:10:20.535445 #988489] INFO -- : I, [2024-05-16T22:10:20.644769 #988489] INFO -- : Checking leaked global symbols...none I, [2024-05-16T22:10:20.685772 #988489] INFO -- : /tmp/ruby/src/trunk/basictest/test.rb:assignment ....................................................................................................................................................................................................................................................................................................................................................................................OK 372 I, [2024-05-16T22:10:20.685844 #988489] INFO -- : /tmp/ruby/src/trunk/basictest/test.rb:condition ..OK 2 I, [2024-05-16T22:10:20.685853 #988489] INFO -- : /tmp/ruby/src/trunk/basictest/test.rb:if/unless ...OK 3 I, [2024-05-16T22:10:20.685860 #988489] INFO -- : /tmp/ruby/src/trunk/basictest/test.rb:case .....OK 5 I, [2024-05-16T22:10:20.686055 #988489] INFO -- : /tmp/ruby/src/trunk/basictest/test.rb:while/until ........OK 8 I, [2024-05-16T22:10:20.686126 #988489] INFO -- : /tmp/ruby/src/trunk/basictest/test.rb:exception ..........OK 10 I, [2024-05-16T22:10:20.686453 #988489] INFO -- : /tmp/ruby/src/trunk/basictest/test.rb:array .......................................OK 39 I, [2024-05-16T22:10:20.686591 #988489] INFO -- : /tmp/ruby/src/trunk/basictest/test.rb:hash ...........................OK 27 I, [2024-05-16T22:10:20.687468 #988489] INFO -- : /tmp/ruby/src/trunk/basictest/test.rb:iterator ...........................................................................................................OK 107 I, [2024-05-16T22:10:20.687866 #988489] INFO -- : /tmp/ruby/src/trunk/basictest/test.rb:float ................................................................................OK 80 I, [2024-05-16T22:10:20.688906 #988489] INFO -- : /tmp/ruby/src/trunk/basictest/test.rb:bignum ...............................OK 31 I, [2024-05-16T22:10:20.689744 #988489] INFO -- : /tmp/ruby/src/trunk/basictest/test.rb:string & char ..............................................................OK 62 I, [2024-05-16T22:10:20.689789 #988489] INFO -- : /tmp/ruby/src/trunk/basictest/test.rb:assignment ..........OK 10 I, [2024-05-16T22:10:20.689830 #988489] INFO -- : /tmp/ruby/src/trunk/basictest/test.rb:call ......OK 6 I, [2024-05-16T22:10:20.689897 #988489] INFO -- : /tmp/ruby/src/trunk/basictest/test.rb:proc .........OK 9 I, [2024-05-16T22:10:20.790634 #988489] INFO -- : /tmp/ruby/src/trunk/basictest/test.rb:signal ..OK 2 I, [2024-05-16T22:10:20.793431 #988489] INFO -- : /tmp/ruby/src/trunk/basictest/test.rb:eval ...........................OK 27 I, [2024-05-16T22:10:20.912046 #988489] INFO -- : /tmp/ruby/src/trunk/basictest/test.rb:system ........OK 8 I, [2024-05-16T22:10:20.912111 #988489] INFO -- : /tmp/ruby/src/trunk/basictest/test.rb:const .....OK 5 I, [2024-05-16T22:10:20.912118 #988489] INFO -- : /tmp/ruby/src/trunk/basictest/test.rb:clone .....OK 5 I, [2024-05-16T22:10:20.912232 #988489] INFO -- : /tmp/ruby/src/trunk/basictest/test.rb:marshal ....OK 4 I, [2024-05-16T22:10:20.912284 #988489] INFO -- : /tmp/ruby/src/trunk/basictest/test.rb:pack ....OK 4 I, [2024-05-16T22:10:20.912298 #988489] INFO -- : /tmp/ruby/src/trunk/basictest/test.rb:math ..OK 2 I, [2024-05-16T22:10:20.912347 #988489] INFO -- : /tmp/ruby/src/trunk/basictest/test.rb:struct ......OK 6 I, [2024-05-16T22:10:20.912440 #988489] INFO -- : /tmp/ruby/src/trunk/basictest/test.rb:variable ............OK 12 I, [2024-05-16T22:10:20.912465 #988489] INFO -- : /tmp/ruby/src/trunk/basictest/test.rb:trace ...OK 3 I, [2024-05-16T22:10:20.912522 #988489] INFO -- : /tmp/ruby/src/trunk/basictest/test.rb:defined? ............OK 12 I, [2024-05-16T22:10:20.912565 #988489] INFO -- : /tmp/ruby/src/trunk/basictest/test.rb:alias ......OK 6 I, [2024-05-16T22:10:20.912908 #988489] INFO -- : /tmp/ruby/src/trunk/basictest/test.rb:path .......................OK 23 I, [2024-05-16T22:10:20.946810 #988489] INFO -- : /tmp/ruby/src/trunk/basictest/test.rb:gc ....OK 4 I, [2024-05-16T22:10:20.949182 #988489] INFO -- : I, [2024-05-16T22:10:20.949205 #988489] INFO -- : test succeeded I, [2024-05-16T22:10:20.950901 #988489] INFO -- : $$$[end] "make yes-test-basic TESTS='-j20'" exit with 0. I, [2024-05-16T22:10:20.951065 #988489] INFO -- : $$$[beg] make yes-test-all TESTOPTS='--stderr-on-failure' TESTS='-j20' I, [2024-05-16T22:10:21.038869 #988489] INFO -- : BASERUBY = /usr/bin/ruby --disable=gems I, [2024-05-16T22:10:21.038906 #988489] INFO -- : CC = gcc I, [2024-05-16T22:10:21.038911 #988489] INFO -- : LD = ld I, [2024-05-16T22:10:21.038915 #988489] INFO -- : LDSHARED = gcc -shared I, [2024-05-16T22:10:21.038919 #988489] INFO -- : CFLAGS = -O3 -fno-fast-math -ggdb3 -Wall -Wextra -Wdeprecated-declarations -Wdiv-by-zero -Wduplicated-cond -Wimplicit-function-declaration -Wimplicit-int -Wpointer-arith -Wwrite-strings -Wold-style-definition -Wimplicit-fallthrough=0 -Wmissing-noreturn -Wno-cast-function-type -Wno-constant-logical-operand -Wno-long-long -Wno-missing-field-initializers -Wno-overlength-strings -Wno-packed-bitfield-compat -Wno-parentheses-equality -Wno-self-assign -Wno-tautological-compare -Wno-unused-parameter -Wno-unused-value -Wsuggest-attribute=format -Wsuggest-attribute=noreturn -Wunused-variable -Wmisleading-indentation -Wundef -fPIC I, [2024-05-16T22:10:21.038924 #988489] INFO -- : XCFLAGS = -U_FORTIFY_SOURCE -D_FORTIFY_SOURCE=2 -fstack-protector-strong -fno-strict-overflow -fvisibility=hidden -fexcess-precision=standard -DRUBY_EXPORT -I. -I.ext/include/x86_64-linux -I/tmp/ruby/src/trunk/include -I/tmp/ruby/src/trunk -I/tmp/ruby/src/trunk/prism -I/tmp/ruby/src/trunk/enc/unicode/15.0.0 I, [2024-05-16T22:10:21.038927 #988489] INFO -- : CPPFLAGS = I, [2024-05-16T22:10:21.038931 #988489] INFO -- : DLDFLAGS = -Wl,--compress-debug-sections=zlib -Wl,-soname,libruby.so.3.4 -fstack-protector-strong I, [2024-05-16T22:10:21.038935 #988489] INFO -- : SOLIBS = -lz -lrt -lrt -lgmp -ldl -lcrypt -lm -lpthread I, [2024-05-16T22:10:21.038939 #988489] INFO -- : LANG = en_US.UTF-8 I, [2024-05-16T22:10:21.038942 #988489] INFO -- : LC_ALL = I, [2024-05-16T22:10:21.038946 #988489] INFO -- : LC_CTYPE = I, [2024-05-16T22:10:21.038950 #988489] INFO -- : MFLAGS = I, [2024-05-16T22:10:21.038954 #988489] INFO -- : RUSTC = no I, [2024-05-16T22:10:21.038959 #988489] INFO -- : YJIT_RUSTC_ARGS = --crate-name=yjit --crate-type=staticlib --edition=2021 -g -C lto=thin -C opt-level=3 -C overflow-checks=on '--out-dir=/tmp/ruby/build/trunk/yjit/target/release/' /tmp/ruby/src/trunk/yjit/src/lib.rs I, [2024-05-16T22:10:21.039523 #988489] INFO -- : gcc (Ubuntu 11.4.0-1ubuntu1~22.04) 11.4.0 I, [2024-05-16T22:10:21.039543 #988489] INFO -- : Copyright (C) 2021 Free Software Foundation, Inc. I, [2024-05-16T22:10:21.039549 #988489] INFO -- : This is free software; see the source for copying conditions. There is NO I, [2024-05-16T22:10:21.039553 #988489] INFO -- : warranty; not even for MERCHANTABILITY or FITNESS FOR A PARTICULAR PURPOSE. I, [2024-05-16T22:10:21.039565 #988489] INFO -- : I, [2024-05-16T22:10:21.041228 #988489] INFO -- : generating enc.mk I, [2024-05-16T22:10:21.163479 #988489] INFO -- : making enc I, [2024-05-16T22:10:21.180417 #988489] INFO -- : make[1]: Entering directory '/tmp/ruby/build/trunk' I, [2024-05-16T22:10:21.180442 #988489] INFO -- : make[1]: Nothing to be done for 'enc'. I, [2024-05-16T22:10:21.180448 #988489] INFO -- : make[1]: Leaving directory '/tmp/ruby/build/trunk' I, [2024-05-16T22:10:21.181136 #988489] INFO -- : making srcs under enc I, [2024-05-16T22:10:21.211488 #988489] INFO -- : make[1]: Entering directory '/tmp/ruby/build/trunk' I, [2024-05-16T22:10:21.211510 #988489] INFO -- : make[1]: Nothing to be done for 'srcs'. I, [2024-05-16T22:10:21.211515 #988489] INFO -- : make[1]: Leaving directory '/tmp/ruby/build/trunk' I, [2024-05-16T22:10:21.212378 #988489] INFO -- : generating transdb.h I, [2024-05-16T22:10:21.308220 #988489] INFO -- : transdb.h unchanged I, [2024-05-16T22:10:21.309607 #988489] INFO -- : making trans I, [2024-05-16T22:10:21.343281 #988489] INFO -- : make[1]: Entering directory '/tmp/ruby/build/trunk' I, [2024-05-16T22:10:21.343302 #988489] INFO -- : make[1]: Nothing to be done for 'trans'. I, [2024-05-16T22:10:21.343308 #988489] INFO -- : make[1]: Leaving directory '/tmp/ruby/build/trunk' I, [2024-05-16T22:10:21.343932 #988489] INFO -- : making encs I, [2024-05-16T22:10:21.381280 #988489] INFO -- : make[1]: Entering directory '/tmp/ruby/build/trunk' I, [2024-05-16T22:10:21.381302 #988489] INFO -- : make[1]: Nothing to be done for 'encs'. I, [2024-05-16T22:10:21.381308 #988489] INFO -- : make[1]: Leaving directory '/tmp/ruby/build/trunk' I, [2024-05-16T22:10:21.383214 #988489] INFO -- : generating makefiles ext/configure-ext.mk I, [2024-05-16T22:10:21.410517 #988489] INFO -- : ext/configure-ext.mk updated I, [2024-05-16T22:10:21.412846 #988489] INFO -- : make[1]: Entering directory '/tmp/ruby/build/trunk' I, [2024-05-16T22:10:22.764092 #988489] INFO -- : make[1]: Leaving directory '/tmp/ruby/build/trunk' I, [2024-05-16T22:10:22.764685 #988489] INFO -- : generating makefile exts.mk I, [2024-05-16T22:10:22.801283 #988489] INFO -- : exts.mk unchanged I, [2024-05-16T22:10:22.805689 #988489] INFO -- : make[1]: Entering directory '/tmp/ruby/build/trunk' I, [2024-05-16T22:10:23.096238 #988489] INFO -- : make[2]: Entering directory '/tmp/ruby/build/trunk/ext/coverage' I, [2024-05-16T22:10:23.100723 #988489] INFO -- : make[2]: Leaving directory '/tmp/ruby/build/trunk/ext/coverage' I, [2024-05-16T22:10:23.106144 #988489] INFO -- : make[2]: Entering directory '/tmp/ruby/build/trunk/ext/date' I, [2024-05-16T22:10:23.109604 #988489] INFO -- : make[2]: Leaving directory '/tmp/ruby/build/trunk/ext/date' I, [2024-05-16T22:10:23.112728 #988489] INFO -- : make[2]: Entering directory '/tmp/ruby/build/trunk/ext/digest' I, [2024-05-16T22:10:23.121490 #988489] INFO -- : make[2]: Leaving directory '/tmp/ruby/build/trunk/ext/digest' I, [2024-05-16T22:10:23.148205 #988489] INFO -- : make[2]: Entering directory '/tmp/ruby/build/trunk/ext/digest/sha2' I, [2024-05-16T22:10:23.152952 #988489] INFO -- : make[2]: Leaving directory '/tmp/ruby/build/trunk/ext/digest/sha2' I, [2024-05-16T22:10:23.174205 #988489] INFO -- : make[2]: Entering directory '/tmp/ruby/build/trunk/ext/fiddle' I, [2024-05-16T22:10:23.184776 #988489] INFO -- : make[2]: Leaving directory '/tmp/ruby/build/trunk/ext/fiddle' I, [2024-05-16T22:10:23.189739 #988489] INFO -- : make[2]: Entering directory '/tmp/ruby/build/trunk/ext/io/console' I, [2024-05-16T22:10:23.193826 #988489] INFO -- : make[2]: Leaving directory '/tmp/ruby/build/trunk/ext/io/console' I, [2024-05-16T22:10:23.206585 #988489] INFO -- : make[2]: Entering directory '/tmp/ruby/build/trunk/ext/json' I, [2024-05-16T22:10:23.217320 #988489] INFO -- : make[2]: Leaving directory '/tmp/ruby/build/trunk/ext/json' I, [2024-05-16T22:10:23.232462 #988489] INFO -- : make[2]: Entering directory '/tmp/ruby/build/trunk/ext/monitor' I, [2024-05-16T22:10:23.236412 #988489] INFO -- : make[2]: Leaving directory '/tmp/ruby/build/trunk/ext/monitor' I, [2024-05-16T22:10:23.243764 #988489] INFO -- : make[2]: Entering directory '/tmp/ruby/build/trunk/ext/objspace' I, [2024-05-16T22:10:23.249935 #988489] INFO -- : make[2]: Leaving directory '/tmp/ruby/build/trunk/ext/objspace' I, [2024-05-16T22:10:23.270133 #988489] INFO -- : make[2]: Entering directory '/tmp/ruby/build/trunk/ext/openssl' I, [2024-05-16T22:10:23.292557 #988489] INFO -- : make[2]: Leaving directory '/tmp/ruby/build/trunk/ext/openssl' I, [2024-05-16T22:10:23.297410 #988489] INFO -- : make[2]: Entering directory '/tmp/ruby/build/trunk/ext/pathname' I, [2024-05-16T22:10:23.301484 #988489] INFO -- : make[2]: Leaving directory '/tmp/ruby/build/trunk/ext/pathname' I, [2024-05-16T22:10:23.308704 #988489] INFO -- : make[2]: Entering directory '/tmp/ruby/build/trunk/ext/psych' I, [2024-05-16T22:10:23.332532 #988489] INFO -- : make[2]: Leaving directory '/tmp/ruby/build/trunk/ext/psych' I, [2024-05-16T22:10:23.337680 #988489] INFO -- : make[2]: Entering directory '/tmp/ruby/build/trunk/ext/pty' I, [2024-05-16T22:10:23.341753 #988489] INFO -- : make[2]: Leaving directory '/tmp/ruby/build/trunk/ext/pty' I, [2024-05-16T22:10:23.357851 #988489] INFO -- : make[2]: Entering directory '/tmp/ruby/build/trunk/ext/ripper' I, [2024-05-16T22:10:23.366036 #988489] INFO -- : make[2]: Leaving directory '/tmp/ruby/build/trunk/ext/ripper' I, [2024-05-16T22:10:23.368539 #988489] INFO -- : make[2]: Entering directory '/tmp/ruby/build/trunk/ext/rubyvm' I, [2024-05-16T22:10:23.371758 #988489] INFO -- : make[2]: Leaving directory '/tmp/ruby/build/trunk/ext/rubyvm' I, [2024-05-16T22:10:23.382937 #988489] INFO -- : make[2]: Entering directory '/tmp/ruby/build/trunk/ext/socket' I, [2024-05-16T22:10:23.390052 #988489] INFO -- : make[2]: Leaving directory '/tmp/ruby/build/trunk/ext/socket' I, [2024-05-16T22:10:23.407390 #988489] INFO -- : make[2]: Entering directory '/tmp/ruby/build/trunk/.bundle/gems/bigdecimal-3.1.8/ext/bigdecimal' I, [2024-05-16T22:10:23.434533 #988489] INFO -- : make[2]: Leaving directory '/tmp/ruby/build/trunk/.bundle/gems/bigdecimal-3.1.8/ext/bigdecimal' I, [2024-05-16T22:10:23.436504 #988489] INFO -- : make[2]: Entering directory '/tmp/ruby/build/trunk/.bundle/gems/debug-1.9.2/ext/debug' I, [2024-05-16T22:10:23.458182 #988489] INFO -- : make[2]: Leaving directory '/tmp/ruby/build/trunk/.bundle/gems/debug-1.9.2/ext/debug' I, [2024-05-16T22:10:23.460000 #988489] INFO -- : make[2]: Entering directory '/tmp/ruby/build/trunk/.bundle/gems/nkf-0.2.0/ext/nkf' I, [2024-05-16T22:10:23.481257 #988489] INFO -- : make[2]: Leaving directory '/tmp/ruby/build/trunk/.bundle/gems/nkf-0.2.0/ext/nkf' I, [2024-05-16T22:10:23.483194 #988489] INFO -- : make[2]: Entering directory '/tmp/ruby/build/trunk/.bundle/gems/racc-1.7.3/ext/racc/cparse' I, [2024-05-16T22:10:23.504482 #988489] INFO -- : make[2]: Leaving directory '/tmp/ruby/build/trunk/.bundle/gems/racc-1.7.3/ext/racc/cparse' I, [2024-05-16T22:10:23.506802 #988489] INFO -- : make[2]: Entering directory '/tmp/ruby/build/trunk/.bundle/gems/rbs-3.4.4/ext/rbs_extension' I, [2024-05-16T22:10:23.528625 #988489] INFO -- : make[2]: Leaving directory '/tmp/ruby/build/trunk/.bundle/gems/rbs-3.4.4/ext/rbs_extension' I, [2024-05-16T22:10:23.530582 #988489] INFO -- : make[2]: Entering directory '/tmp/ruby/build/trunk/.bundle/gems/syslog-0.1.2/ext/syslog' I, [2024-05-16T22:10:23.557524 #988489] INFO -- : make[2]: Leaving directory '/tmp/ruby/build/trunk/.bundle/gems/syslog-0.1.2/ext/syslog' I, [2024-05-16T22:10:23.584719 #988489] INFO -- : make[2]: Entering directory '/tmp/ruby/build/trunk' I, [2024-05-16T22:10:23.659346 #988489] INFO -- : make[2]: 'ruby' is up to date. I, [2024-05-16T22:10:23.659384 #988489] INFO -- : make[2]: Leaving directory '/tmp/ruby/build/trunk' I, [2024-05-16T22:10:23.659636 #988489] INFO -- : make[1]: Leaving directory '/tmp/ruby/build/trunk' I, [2024-05-16T22:10:23.663165 #988489] INFO -- : make[1]: Entering directory '/tmp/ruby/build/trunk' I, [2024-05-16T22:10:23.663194 #988489] INFO -- : make[1]: Nothing to be done for 'note'. I, [2024-05-16T22:10:23.663200 #988489] INFO -- : make[1]: Leaving directory '/tmp/ruby/build/trunk' I, [2024-05-16T22:10:23.738619 #988489] INFO -- : Run options: I, [2024-05-16T22:10:23.738679 #988489] INFO -- : --seed=3252 I, [2024-05-16T22:10:23.738685 #988489] INFO -- : "--ruby=./miniruby -I/tmp/ruby/src/trunk/lib -I. -I.ext/common /tmp/ruby/src/trunk/tool/runruby.rb --extout=.ext -- --disable-gems" I, [2024-05-16T22:10:23.738691 #988489] INFO -- : --excludes-dir=/tmp/ruby/src/trunk/test/.excludes I, [2024-05-16T22:10:23.738695 #988489] INFO -- : --name=!/memory_leak/ I, [2024-05-16T22:10:23.738699 #988489] INFO -- : --stderr-on-failure I, [2024-05-16T22:10:23.738703 #988489] INFO -- : -j20 I, [2024-05-16T22:10:23.738707 #988489] INFO -- : I, [2024-05-16T22:10:23.738711 #988489] INFO -- : # Running tests: I, [2024-05-16T22:10:23.738715 #988489] INFO -- : I, [2024-05-16T22:10:23.872494 #988489] INFO -- : [ 1/885] 1029861=test_rational I, [2024-05-16T22:10:23.886831 #988489] INFO -- : [ 2/885] 1029861=test_rational2 I, [2024-05-16T22:10:23.886895 #988489] INFO -- : [ 3/885] 1029846=test_spell_checker I, [2024-05-16T22:10:23.886947 #988489] INFO -- : [ 4/885] 1029847=test_propertyputref I, [2024-05-16T22:10:23.887016 #988489] INFO -- : [ 5/885] 1029848=attribute_write_test I, [2024-05-16T22:10:23.887209 #988489] INFO -- : [ 6/885] 1029849=test_assembler I, [2024-05-16T22:10:23.889405 #988489] INFO -- : [ 7/885] 1029850=test_gem_source_installed I, [2024-05-16T22:10:23.889450 #988489] INFO -- : [ 8/885] 1029847=test_x509ext I, [2024-05-16T22:10:23.890652 #988489] INFO -- : [ 9/885] 1029849=test_erb I, [2024-05-16T22:10:23.891023 #988489] INFO -- : [ 10/885] 1029858=test_yield_block I, [2024-05-16T22:10:23.891187 #988489] INFO -- : [ 11/885] 1029859=test_len I, [2024-05-16T22:10:23.891366 #988489] INFO -- : [ 12/885] 1029863=test_completion I, [2024-05-16T22:10:23.891504 #988489] INFO -- : [ 13/885] 1029860=test_gem_commands_cert_command I, [2024-05-16T22:10:23.891578 #988489] INFO -- : [ 14/885] 1029862=test_provider I, [2024-05-16T22:10:23.893755 #988489] INFO -- : [ 15/885] 1029861=test_abi I, [2024-05-16T22:10:23.895026 #988489] INFO -- : [ 16/885] 1029858=test_gem_commands_rebuild_command I, [2024-05-16T22:10:23.896484 #988489] INFO -- : [ 17/885] 1029859=test_yamldbm I, [2024-05-16T22:10:23.904075 #988489] INFO -- : [ 18/885] 1029846=test_load I, [2024-05-16T22:10:23.910913 #988489] INFO -- : [ 19/885] 1029846=test_rdoc_parser_simple I, [2024-05-16T22:10:23.920608 #988489] INFO -- : [ 20/885] 1029859=test_gem_ext_builder I, [2024-05-16T22:10:23.920675 #988489] INFO -- : [ 21/885] 1029853=test_https I, [2024-05-16T22:10:23.920847 #988489] INFO -- : [ 22/885] 1029851=test_evaluation I, [2024-05-16T22:10:23.921431 #988489] INFO -- : [ 23/885] 1029857=test_benchmark I, [2024-05-16T22:10:23.921545 #988489] INFO -- : [ 24/885] 1029854=test_gem_dependency_list I, [2024-05-16T22:10:23.921682 #988489] INFO -- : [ 25/885] 1029855=test_nesting_parser I, [2024-05-16T22:10:23.921806 #988489] INFO -- : [ 26/885] 1029856=test_win32ole_method_event I, [2024-05-16T22:10:23.924891 #988489] INFO -- : [ 27/885] 1029864=test_scalar_scanner I, [2024-05-16T22:10:23.925636 #988489] INFO -- : [ 28/885] 1029856=test_gem_source I, [2024-05-16T22:10:23.930599 #988489] INFO -- : [ 29/885] 1029845=test_gem_package_tar_writer I, [2024-05-16T22:10:23.938371 #988489] INFO -- : [ 30/885] 1029852=test_helper_method I, [2024-05-16T22:10:23.943706 #988489] INFO -- : [ 31/885] 1029851=test_array I, [2024-05-16T22:10:23.955780 #988489] INFO -- : [ 32/885] 1029847=test_gem_commands_outdated_command I, [2024-05-16T22:10:23.961650 #988489] INFO -- : [ 33/885] 1029864=test_boolean I, [2024-05-16T22:10:23.965609 #988489] INFO -- : [ 34/885] 1029849=test_instrumentation_api I, [2024-05-16T22:10:23.971964 #988489] INFO -- : [ 35/885] 1029864=integer_parse_test I, [2024-05-16T22:10:23.976075 #988489] INFO -- : [ 36/885] 1029848=test_stringify_symbols I, [2024-05-16T22:10:23.982606 #988489] INFO -- : [ 37/885] 1029848=test_rubyvm I, [2024-05-16T22:10:23.990427 #988489] INFO -- : [ 38/885] 1029848=test_configuration I, [2024-05-16T22:10:24.044361 #988489] INFO -- : [ 39/885] 1029852=test_buffered_io I, [2024-05-16T22:10:24.048224 #988489] INFO -- : [ 40/885] 1029861=test_monitor I, [2024-05-16T22:10:24.054051 #988489] INFO -- : [ 41/885] 1029855=test_whileuntil I, [2024-05-16T22:10:24.055804 #988489] INFO -- : [ 42/885] 1029864=test_rdoc_generator_markup I, [2024-05-16T22:10:24.058454 #988489] INFO -- : [ 43/885] 1029855=test_arith_seq_extract I, [2024-05-16T22:10:24.067651 #988489] INFO -- : [ 44/885] 1029848=test_method_name_check I, [2024-05-16T22:10:24.095144 #988489] INFO -- : [ 45/885] 1029848=test_parser I, [2024-05-16T22:10:24.097522 #988489] INFO -- : [ 46/885] 1029850=constant_path_node_test I, [2024-05-16T22:10:24.101279 #988489] INFO -- : [ 47/885] 1029846=test_gem_ext_cargo_builder I, [2024-05-16T22:10:24.134636 #988489] INFO -- : [ 48/885] 1029845=test_ssl I, [2024-05-16T22:10:24.139041 #988489] INFO -- : [ 49/885] 1029858=test_module I, [2024-05-16T22:10:24.140475 #988489] INFO -- : [ 50/885] 1029848=test_gem_request_set I, [2024-05-16T22:10:24.156856 #988489] INFO -- : [ 51/885] 1029852=test_files_test_1 I, [2024-05-16T22:10:24.170165 #988489] INFO -- : [ 52/885] 1029850=test_gem_path_support I, [2024-05-16T22:10:24.197220 #988489] INFO -- : [ 53/885] 1029854=test_struct I, [2024-05-16T22:10:24.205390 #988489] INFO -- : [ 54/885] 1029850=test_set I, [2024-05-16T22:10:24.209437 #988489] INFO -- : [ 55/885] 1029847=test_x509req I, [2024-05-16T22:10:24.221266 #988489] INFO -- : [ 56/885] 1029864=test_mutex I, [2024-05-16T22:10:24.234372 #988489] INFO -- : [ 57/885] 1029850=test_rdoc_rd_inline I, [2024-05-16T22:10:24.252102 #988489] INFO -- : [ 58/885] 1029855=test_win32ole_variant_m I, [2024-05-16T22:10:24.253670 #988489] INFO -- : [ 59/885] 1029855=test_engine I, [2024-05-16T22:10:24.259593 #988489] INFO -- : [ 60/885] 1029861=test_allocation I, [2024-05-16T22:10:24.287712 #988489] INFO -- : [ 61/885] 1029855=test_div I, [2024-05-16T22:10:24.289664 #988489] INFO -- : [ 62/885] 1029855=test_key_error I, [2024-05-16T22:10:24.298630 #988489] INFO -- : [ 63/885] 1029855=test_serialize_subclasses I, [2024-05-16T22:10:24.320654 #988489] INFO -- : [ 64/885] 1029855=test_insns_leaf I, [2024-05-16T22:10:24.323140 #988489] INFO -- : [ 65/885] 1029855=test_color_printer I, [2024-05-16T22:10:24.326831 #988489] INFO -- : [ 66/885] 1029855=test_deprecated I, [2024-05-16T22:10:24.335286 #988489] INFO -- : [ 67/885] 1029855=test_pkg_config I, [2024-05-16T22:10:24.337641 #988489] INFO -- : [ 68/885] 1029846=test_cparser I, [2024-05-16T22:10:24.350635 #988489] INFO -- : [ 69/885] 1029862=test_rdoc_markup_to_html_snippet I, [2024-05-16T22:10:24.362705 #988489] INFO -- : [ 70/885] 1029847=magic_comment_test I, [2024-05-16T22:10:24.373064 #988489] INFO -- : [ 71/885] 1029855=test_struct I, [2024-05-16T22:10:24.376224 #988489] INFO -- : [ 72/885] 1029855=test_variable I, [2024-05-16T22:10:24.388105 #988489] INFO -- : [ 73/885] 1029853=test_sexp I, [2024-05-16T22:10:24.406272 #988489] INFO -- : [ 74/885] 1029850=test_rdoc_markup_include I, [2024-05-16T22:10:24.409077 #988489] INFO -- : [ 75/885] 1029850=fuzzer_test I, [2024-05-16T22:10:24.414917 #988489] INFO -- : [ 76/885] 1029853=test_win32ole_variant_outarg I, [2024-05-16T22:10:24.417580 #988489] INFO -- : [ 77/885] 1029853=json_common_interface_test I, [2024-05-16T22:10:24.419933 #988489] INFO -- : [ 78/885] 1029850=test_dln I, [2024-05-16T22:10:24.421709 #988489] INFO -- : [ 79/885] 1029850=test_gem_source_subpath_problem I, [2024-05-16T22:10:24.430608 #988489] INFO -- : [ 80/885] 1029847=memsize_test I, [2024-05-16T22:10:24.432279 #988489] INFO -- : [ 81/885] 1029847=test_nomethod_error I, [2024-05-16T22:10:24.433791 #988489] INFO -- : [ 82/885] 1029853=json_parser_test I, [2024-05-16T22:10:24.437237 #988489] INFO -- : [ 83/885] 1029847=test_config I, [2024-05-16T22:10:24.445576 #988489] INFO -- : [ 84/885] 1029856=test_new I, [2024-05-16T22:10:24.449660 #988489] INFO -- : [ 85/885] 1029856=test_gem_security_signer I, [2024-05-16T22:10:24.454336 #988489] INFO -- : [ 86/885] 1029847=test_cipher I, [2024-05-16T22:10:24.464009 #988489] INFO -- : [ 87/885] 1029853=test_storage I, [2024-05-16T22:10:24.467655 #988489] INFO -- : [ 88/885] 1029853=test_gem_resolver_git_set I, [2024-05-16T22:10:24.473900 #988489] INFO -- : [ 89/885] 1029863=test_digest_extend I, [2024-05-16T22:10:24.484294 #988489] INFO -- : [ 90/885] 1029863=test_omap I, [2024-05-16T22:10:24.488232 #988489] INFO -- : [ 91/885] 1029855=test_string I, [2024-05-16T22:10:24.492249 #988489] INFO -- : [ 92/885] 1029855=test_iterator I, [2024-05-16T22:10:24.504741 #988489] INFO -- : [ 93/885] 1029847=test_memory_view I, [2024-05-16T22:10:24.509503 #988489] INFO -- : [ 94/885] 1029863=pattern_test I, [2024-05-16T22:10:24.525232 #988489] INFO -- : [ 95/885] 1029847=test_debug I, [2024-05-16T22:10:24.528868 #988489] INFO -- : [ 96/885] 1029847=test_shellwords I, [2024-05-16T22:10:24.535781 #988489] INFO -- : [ 97/885] 1029847=test_metaclass I, [2024-05-16T22:10:24.538930 #988489] INFO -- : [ 98/885] 1029847=test_rdoc_top_level I, [2024-05-16T22:10:24.548442 #988489] INFO -- : [ 99/885] 1029854=test_cgi_session I, [2024-05-16T22:10:24.554521 #988489] INFO -- : [100/885] 1029856=test_rdoc_rd I, [2024-05-16T22:10:24.562632 #988489] INFO -- : [101/885] 1029850=test_x509crl I, [2024-05-16T22:10:24.564925 #988489] INFO -- : [102/885] 1029862=test_signal I, [2024-05-16T22:10:24.572425 #988489] INFO -- : [103/885] 1029854=test_fixnum I, [2024-05-16T22:10:24.575264 #988489] INFO -- : [104/885] 1029855=test_process I, [2024-05-16T22:10:24.580271 #988489] INFO -- : [105/885] 1029854=test_windows_1252 I, [2024-05-16T22:10:24.586133 #988489] INFO -- : [106/885] 1029854=test_input_method I, [2024-05-16T22:10:24.589943 #988489] INFO -- : [107/885] 1029855=test_cgi_cookie I, [2024-05-16T22:10:24.607230 #988489] INFO -- : [108/885] 1029848=test_require I, [2024-05-16T22:10:24.609342 #988489] INFO -- : [109/885] 1029855=test_float I, [2024-05-16T22:10:24.623448 #988489] INFO -- : [110/885] 1029863=test_gem_source_git I, [2024-05-16T22:10:24.718978 #988489] INFO -- : [111/885] 1029856=test_refinement I, [2024-05-16T22:10:24.749753 #988489] INFO -- : [112/885] 1029850=test_gem_commands_signout_command I, [2024-05-16T22:10:24.768885 #988489] INFO -- : [113/885] 1029850=test_regex_casefold I, [2024-05-16T22:10:24.810284 #988489] INFO -- : [114/885] 1029854=test_gem_resolver_installer_set I, [2024-05-16T22:10:24.814598 #988489] INFO -- : [115/885] 1029846=test_dir_m17n I, [2024-05-16T22:10:24.906297 #988489] INFO -- : [116/885] 1029853=test_gem_security I, [2024-05-16T22:10:24.943160 #988489] INFO -- : [117/885] 1029847=test_rdoc_servlet I, [2024-05-16T22:10:24.980504 #988489] INFO -- : [118/885] 1029854=test_ractor I, [2024-05-16T22:10:25.025838 #988489] INFO -- : [119/885] 1029859=test_digest I, [2024-05-16T22:10:25.035519 #988489] INFO -- : [120/885] 1029859=test_bundled_ca I, [2024-05-16T22:10:25.048359 #988489] INFO -- : [121/885] 1029854=test_closure I, [2024-05-16T22:10:25.072886 #988489] INFO -- : [122/885] 1029857=test_open3 I, [2024-05-16T22:10:25.078697 #988489] INFO -- : [123/885] 1029860=test_fiber I, [2024-05-16T22:10:25.086497 #988489] INFO -- : [124/885] 1029847=test_multi_irb_commands I, [2024-05-16T22:10:25.094532 #988489] INFO -- : [125/885] 1029847=test_date_marshal I, [2024-05-16T22:10:25.098385 #988489] INFO -- : [126/885] 1029847=test_mkmf I, [2024-05-16T22:10:25.132088 #988489] INFO -- : [127/885] 1029847=test_history I, [2024-05-16T22:10:25.174035 #988489] INFO -- : [128/885] 1029850=test_popen_deadlock I, [2024-05-16T22:10:25.217395 #988489] INFO -- : [129/885] 1029847=test_delegate I, [2024-05-16T22:10:25.227407 #988489] INFO -- : [130/885] 1029847=test_exit I, [2024-05-16T22:10:25.296287 #988489] INFO -- : [131/885] 1029863=test_recursion I, [2024-05-16T22:10:25.297842 #988489] INFO -- : [132/885] 1029863=test_stream I, [2024-05-16T22:10:25.307939 #988489] INFO -- : [133/885] 1029863=test_webauthn_listener_response I, [2024-05-16T22:10:25.316291 #988489] INFO -- : [134/885] 1029847=test_time I, [2024-05-16T22:10:25.320649 #988489] INFO -- : [135/885] 1029863=test_to_ary_concat I, [2024-05-16T22:10:25.366057 #988489] INFO -- : [136/885] 1029864=test_rdoc_markup_pre_process I, [2024-05-16T22:10:25.379470 #988489] INFO -- : [137/885] 1029854=test_printf I, [2024-05-16T22:10:25.395346 #988489] INFO -- : [138/885] 1029854=test_pinned I, [2024-05-16T22:10:25.405361 #988489] INFO -- : [139/885] 1029864=reflection_test I, [2024-05-16T22:10:25.414609 #988489] INFO -- : [140/885] 1029864=test_within_pipe I, [2024-05-16T22:10:25.421844 #988489] INFO -- : [141/885] 1029854=test_gem_bundler_version_finder I, [2024-05-16T22:10:25.438721 #988489] INFO -- : [142/885] 1029854=test_emoji_breaks I, [2024-05-16T22:10:25.439591 #988489] INFO -- : [143/885] 1029854=test_rdoc_markup_to_bs I, [2024-05-16T22:10:25.461412 #988489] INFO -- : [144/885] 1029847=test_help I, [2024-05-16T22:10:25.466278 #988489] INFO -- : [145/885] 1029847=test_beginendblock I, [2024-05-16T22:10:25.488819 #988489] INFO -- : [146/885] 1029854=test_gem_commands_unpack_command I, [2024-05-16T22:10:25.503353 #988489] INFO -- : [147/885] 1029864=test_files_lib I, [2024-05-16T22:10:25.623812 #988489] INFO -- : [148/885] 1029850=test_pkey_dsa I, [2024-05-16T22:10:25.687189 #988489] INFO -- : [149/885] 1029854=test_class I, [2024-05-16T22:10:25.689114 #988489] INFO -- : [150/885] 1029854=test_ocsp I, [2024-05-16T22:10:25.765670 #988489] INFO -- : [151/885] 1029851=test_scheduler I, [2024-05-16T22:10:25.863651 #988489] INFO -- : [152/885] 1029847=test_rdoc_markup_heading I, [2024-05-16T22:10:25.872182 #988489] INFO -- : [153/885] 1029847=test_iseq I, [2024-05-16T22:10:25.906231 #988489] INFO -- : [154/885] 1029851=test_exception_at_throwing I, [2024-05-16T22:10:25.912213 #988489] INFO -- : [155/885] 1029863=test_gem_commands_server_command I, [2024-05-16T22:10:25.915853 #988489] INFO -- : [156/885] 1029858=test_did_you_mean I, [2024-05-16T22:10:25.918766 #988489] INFO -- : [157/885] 1029863=test_variable_name_check I, [2024-05-16T22:10:25.944833 #988489] INFO -- : [158/885] 1029863=test_io_m17n I, [2024-05-16T22:10:25.954661 #988489] INFO -- : [159/885] 1029854=test_tracer I, [2024-05-16T22:10:25.956377 #988489] INFO -- : [160/885] 1029854=test_cmethod I, [2024-05-16T22:10:25.962215 #988489] INFO -- : [161/885] 1029854=test_option I, [2024-05-16T22:10:25.964407 #988489] INFO -- : [162/885] 1029851=test_append I, [2024-05-16T22:10:25.968826 #988489] INFO -- : [163/885] 1029851=test_gem_commands_build_command I, [2024-05-16T22:10:26.011109 #988489] INFO -- : [164/885] 1029855=test_case_comprehensive I, [2024-05-16T22:10:26.033671 #988489] INFO -- : [165/885] 1029858=test_interned_str I, [2024-05-16T22:10:26.035863 #988489] INFO -- : [166/885] 1029858=test_thread_cv I, [2024-05-16T22:10:26.097968 #988489] INFO -- : [167/885] 1029854=test_lexer I, [2024-05-16T22:10:26.116364 #988489] INFO -- : [168/885] 1029846=test_ssl_session I, [2024-05-16T22:10:26.128949 #988489] INFO -- : [169/885] 1029854=test_random I, [2024-05-16T22:10:26.136206 #988489] INFO -- : [170/885] 1029854=test_notimplement I, [2024-05-16T22:10:26.139965 #988489] INFO -- : [171/885] 1029854=test_key_event_record I, [2024-05-16T22:10:26.148710 #988489] INFO -- : [172/885] 1029854=test_gem_uri I, [2024-05-16T22:10:26.168010 #988489] INFO -- : [173/885] 1029854=test_gem_commands_update_command I, [2024-05-16T22:10:26.379905 #988489] INFO -- : [174/885] 1029851=test_gem_resolver_vendor_specification I, [2024-05-16T22:10:26.426510 #988489] INFO -- : [175/885] 1029851=test_data I, [2024-05-16T22:10:26.436753 #988489] INFO -- : [176/885] 1029851=static_literals_test I, [2024-05-16T22:10:26.452983 #988489] INFO -- : [177/885] 1029859=test_gem_gem_runner I, [2024-05-16T22:10:26.461958 #988489] INFO -- : [178/885] 1029847=test_filter I, [2024-05-16T22:10:26.486098 #988489] INFO -- : [179/885] 1029851=test_rdoc_method_attr I, [2024-05-16T22:10:26.492474 #988489] INFO -- : [180/885] 1029859=test_unicode I, [2024-05-16T22:10:26.509248 #988489] INFO -- : [181/885] 1029847=parameters_signature_test I, [2024-05-16T22:10:26.517660 #988489] INFO -- : [182/885] 1029847=test_koi8 I, [2024-05-16T22:10:26.523963 #988489] INFO -- : [183/885] 1029847=test_enumerator I, [2024-05-16T22:10:26.530018 #988489] INFO -- : [184/885] 1029847=test_rdoc_parser_changelog I, [2024-05-16T22:10:26.534965 #988489] INFO -- : [185/885] 1029859=test_rdoc_generator_pot I, [2024-05-16T22:10:26.575412 #988489] INFO -- : [186/885] 1029861=test_case_mapping I, [2024-05-16T22:10:26.583864 #988489] INFO -- : [187/885] 1029861=redundant_return_test I, [2024-05-16T22:10:26.597625 #988489] INFO -- : [188/885] 1029847=test_path I, [2024-05-16T22:10:26.605546 #988489] INFO -- : [189/885] 1029847=test_win32ole_param_event I, [2024-05-16T22:10:26.617469 #988489] INFO -- : [190/885] 1029847=test_bn I, [2024-05-16T22:10:26.632752 #988489] INFO -- : [191/885] 1029847=test_http I, [2024-05-16T22:10:26.649288 #988489] INFO -- : [192/885] 1029861=test_addrinfo I, [2024-05-16T22:10:26.668981 #988489] INFO -- : [193/885] 1029861=test_tree_spell_checker I, [2024-05-16T22:10:26.671169 #988489] INFO -- : [194/885] 1029858=test_rdoc_markup_to_html I, [2024-05-16T22:10:26.677769 #988489] INFO -- : [195/885] 1029859=test_date_compat I, [2024-05-16T22:10:26.680143 #988489] INFO -- : [196/885] 1029859=test_bug-14834 I, [2024-05-16T22:10:26.692088 #988489] INFO -- : [197/885] 1029862=test_compile_prism I, [2024-05-16T22:10:26.702906 #988489] INFO -- : [198/885] 1029861=test_terminfo I, [2024-05-16T22:10:26.743750 #988489] INFO -- : [199/885] 1029861=test_color I, [2024-05-16T22:10:26.746491 #988489] INFO -- : [200/885] 1029859=json_encoding_test I, [2024-05-16T22:10:26.751383 #988489] INFO -- : [201/885] 1029859=test_key_stroke I, [2024-05-16T22:10:26.759186 #988489] INFO -- : [202/885] 1029859=test_encoding I, [2024-05-16T22:10:26.769924 #988489] INFO -- : [203/885] 1029859=test_httpresponses I, [2024-05-16T22:10:26.791197 #988489] INFO -- : [204/885] 1029861=test_set_len I, [2024-05-16T22:10:26.795831 #988489] INFO -- : [205/885] 1029861=test_rdoc_ri_driver I, [2024-05-16T22:10:26.815249 #988489] INFO -- : [206/885] 1029851=test_gem_resolver_local_specification I, [2024-05-16T22:10:26.843889 #988489] INFO -- : [207/885] 1029859=test_httpheader I, [2024-05-16T22:10:26.849038 #988489] INFO -- : [208/885] 1029851=test_rdoc_markup_to_label I, [2024-05-16T22:10:26.856019 #988489] INFO -- : [209/885] 1029859=test_install I, [2024-05-16T22:10:26.874304 #988489] INFO -- : [210/885] 1029851=test_sockopt I, [2024-05-16T22:10:26.876943 #988489] INFO -- : [211/885] 1029851=test_gem_commands_yank_command I, [2024-05-16T22:10:26.890007 #988489] INFO -- : [212/885] 1029849=test_win32ole_param I, [2024-05-16T22:10:26.892542 #988489] INFO -- : [213/885] 1029849=test_pair I, [2024-05-16T22:10:26.926322 #988489] INFO -- : [214/885] 1029858=test_rdoc_generator_pot_po_entry I, [2024-05-16T22:10:26.937905 #988489] INFO -- : [215/885] 1029858=test_euc_jp I, [2024-05-16T22:10:26.943717 #988489] INFO -- : [216/885] 1029858=test_acceptable I, [2024-05-16T22:10:27.010281 #988489] INFO -- : [217/885] 1029862=test_document I, [2024-05-16T22:10:27.016470 #988489] INFO -- : [218/885] 1029858=test_rdoc_i18n_locale I, [2024-05-16T22:10:27.026517 #988489] INFO -- : [219/885] 1029858=test_name_error_extension I, [2024-05-16T22:10:27.033244 #988489] INFO -- : [220/885] 1029858=test_chilled I, [2024-05-16T22:10:27.034982 #988489] INFO -- : [221/885] 1029858=test_human_typo I, [2024-05-16T22:10:27.038205 #988489] INFO -- : [222/885] 1029862=test_primitive I, [2024-05-16T22:10:27.039084 #988489] INFO -- : [223/885] 1029858=test_rbconfig I, [2024-05-16T22:10:27.040813 #988489] INFO -- : [224/885] 1029846=test_func I, [2024-05-16T22:10:27.042784 #988489] INFO -- : [225/885] 1029858=test_big5 I, [2024-05-16T22:10:27.043142 #988489] INFO -- : [226/885] 1029859=test_pointer I, [2024-05-16T22:10:27.046231 #988489] INFO -- : [227/885] 1029858=test_type I, [2024-05-16T22:10:27.048244 #988489] INFO -- : [228/885] 1029862=test_ractor I, [2024-05-16T22:10:27.052695 #988489] INFO -- : [229/885] 1029858=test_tsort I, [2024-05-16T22:10:27.058116 #988489] INFO -- : [230/885] 1029858=test_signedness I, [2024-05-16T22:10:27.084969 #988489] INFO -- : [231/885] 1029848=test_rdoc_rd_block_parser I, [2024-05-16T22:10:27.122005 #988489] INFO -- : [232/885] 1029862=test_ossl I, [2024-05-16T22:10:27.131522 #988489] INFO -- : [233/885] 1029861=test_normalize I, [2024-05-16T22:10:27.136212 #988489] INFO -- : [234/885] 1029861=test_timeout I, [2024-05-16T22:10:27.140805 #988489] INFO -- : [235/885] 1029861=compiler_test I, [2024-05-16T22:10:27.141700 #988489] INFO -- : [236/885] 1029861=test_flip I, [2024-05-16T22:10:27.159746 #988489] INFO -- : [237/885] 1029861=test_change_word I, [2024-05-16T22:10:27.160638 #988489] INFO -- : [238/885] 1029861=test_sleep I, [2024-05-16T22:10:27.251958 #988489] INFO -- : [239/885] 1029863=test_gem_local_remote_options I, [2024-05-16T22:10:27.292111 #988489] INFO -- : [240/885] 1029848=test_object I, [2024-05-16T22:10:27.297159 #988489] INFO -- : [241/885] 1029863=test_ruby_lex I, [2024-05-16T22:10:27.300467 #988489] INFO -- : [242/885] 1029856=test_date_arith I, [2024-05-16T22:10:27.309395 #988489] INFO -- : [243/885] 1029856=test_gem_command_manager I, [2024-05-16T22:10:27.319831 #988489] INFO -- : [244/885] 1029852=test_gem_gemcutter_utilities I, [2024-05-16T22:10:27.320347 #988489] INFO -- : [245/885] 1029854=test_basicinstructions I, [2024-05-16T22:10:27.345957 #988489] INFO -- : [246/885] 1029851=test_key_actor_emacs I, [2024-05-16T22:10:27.349951 #988489] INFO -- : [247/885] 1029857=test_arithmetic_sequence I, [2024-05-16T22:10:27.357173 #988489] INFO -- : [248/885] 1029857=test_object I, [2024-05-16T22:10:27.376627 #988489] INFO -- : [249/885] 1029857=heredoc_dedent_test I, [2024-05-16T22:10:27.388250 #988489] INFO -- : [250/885] 1029854=test_cgi_header I, [2024-05-16T22:10:27.392384 #988489] INFO -- : [251/885] 1029854=version_test I, [2024-05-16T22:10:27.406668 #988489] INFO -- : [252/885] 1029863=test_not I, [2024-05-16T22:10:27.414465 #988489] INFO -- : [253/885] 1029863=test_gem_resolver_lock_set I, [2024-05-16T22:10:27.440775 #988489] INFO -- : [254/885] 1029863=test_import I, [2024-05-16T22:10:27.443300 #988489] INFO -- : [255/885] 1029854=test_rdoc_parser_markdown I, [2024-05-16T22:10:27.468917 #988489] INFO -- : [256/885] 1029857=test_files_test I, [2024-05-16T22:10:27.476725 #988489] INFO -- : [257/885] 1029854=test_gem_update_suggestion I, [2024-05-16T22:10:27.486338 #988489] INFO -- : [258/885] 1029856=test_file_exhaustive I, [2024-05-16T22:10:27.494262 #988489] INFO -- : [259/885] 1029851=test_logger I, [2024-05-16T22:10:27.507453 #988489] INFO -- : [260/885] 1029851=test_win32ole_method I, [2024-05-16T22:10:27.510640 #988489] INFO -- : [261/885] 1029851=test_delete I, [2024-05-16T22:10:27.515126 #988489] INFO -- : [262/885] 1029851=test_keyword I, [2024-05-16T22:10:27.535978 #988489] INFO -- : [263/885] 1029854=test_class_name_check I, [2024-05-16T22:10:27.541565 #988489] INFO -- : [264/885] 1029859=test_continuation I, [2024-05-16T22:10:27.548906 #988489] INFO -- : [265/885] 1029859=test_fd_setsize I, [2024-05-16T22:10:27.549261 #988489] INFO -- : [266/885] 1029859=test_numhash I, [2024-05-16T22:10:27.552385 #988489] INFO -- : [267/885] 1029854=test_weakkeymap I, [2024-05-16T22:10:27.553663 #988489] INFO -- : [268/885] 1029859=test_gem_commands_push_command I, [2024-05-16T22:10:27.561245 #988489] INFO -- : [269/885] 1029857=test_pkey_rsa I, [2024-05-16T22:10:27.692052 #988489] INFO -- : [270/885] 1029848=test_gem_platform I, [2024-05-16T22:10:27.727280 #988489] INFO -- : [271/885] 1029846=test_rdoc_markup_hard_break I, [2024-05-16T22:10:27.730278 #988489] INFO -- : [272/885] 1029846=test_placearg I, [2024-05-16T22:10:27.760621 #988489] INFO -- : [273/885] 1029852=test_date_strptime I, [2024-05-16T22:10:27.778912 #988489] INFO -- : [274/885] 1029848=test_gem_package_task I, [2024-05-16T22:10:27.784527 #988489] INFO -- : [275/885] 1029848=test_jaro_winkler I, [2024-05-16T22:10:27.788125 #988489] INFO -- : [276/885] 1029848=test_helper I, [2024-05-16T22:10:27.788181 #988489] INFO -- : [277/885] 1029848=test_random_formatter I, [2024-05-16T22:10:27.792667 #988489] INFO -- : [278/885] 1029854=test_lambda I, [2024-05-16T22:10:27.808804 #988489] INFO -- : [279/885] 1029848=test_gem_request_set_gem_dependency_api I, [2024-05-16T22:10:27.839371 #988489] INFO -- : [280/885] 1029854=test_ast I, [2024-05-16T22:10:27.848128 #988489] INFO -- : [281/885] 1029846=test_webauthn_listener I, [2024-05-16T22:10:27.858536 #988489] INFO -- : [282/885] 1029857=test_x509store I, [2024-05-16T22:10:27.895956 #988489] INFO -- : [283/885] 1029846=test_rdoc_code_object I, [2024-05-16T22:10:27.912229 #988489] INFO -- : [284/885] 1029852=test_x509name I, [2024-05-16T22:10:27.927659 #988489] INFO -- : [285/885] 1029852=test_fips I, [2024-05-16T22:10:27.941064 #988489] INFO -- : [286/885] 1029848=test_update I, [2024-05-16T22:10:27.941607 #988489] INFO -- : [287/885] 1029848=test_transcode I, [2024-05-16T22:10:27.957062 #988489] INFO -- : [288/885] 1029863=json_generator_test I, [2024-05-16T22:10:27.994949 #988489] INFO -- : [289/885] 1029851=test_eval I, [2024-05-16T22:10:28.013082 #988489] INFO -- : [290/885] 1029859=test_enumerable I, [2024-05-16T22:10:28.016068 #988489] INFO -- : [291/885] 1029859=test_gem_resolver_vendor_set I, [2024-05-16T22:10:28.032933 #988489] INFO -- : [292/885] 1029859=test_config I, [2024-05-16T22:10:28.078318 #988489] INFO -- : [293/885] 1029863=test_gem_resolver_api_set I, [2024-05-16T22:10:28.124418 #988489] INFO -- : [294/885] 1029863=test_gem_safe_marshal I, [2024-05-16T22:10:28.138420 #988489] INFO -- : [295/885] 1029850=test_rdoc_ri_paths I, [2024-05-16T22:10:28.140457 #988489] INFO -- : [296/885] 1029848=test_addr I, [2024-05-16T22:10:28.152195 #988489] INFO -- : [297/885] 1029846=test_locale I, [2024-05-16T22:10:28.155180 #988489] INFO -- : [298/885] 1029850=library_symbols_test I, [2024-05-16T22:10:28.159059 #988489] INFO -- : [299/885] 1029850=test_ensured I, [2024-05-16T22:10:28.163105 #988489] INFO -- : [300/885] 1029848=test_ts I, [2024-05-16T22:10:28.193633 #988489] INFO -- : [301/885] 1029852=test_encoding I, [2024-05-16T22:10:28.229198 #988489] INFO -- : [302/885] 1029850=test_helper I, [2024-05-16T22:10:28.235291 #988489] INFO -- : [303/885] 1029846=test_erb_command I, [2024-05-16T22:10:28.241704 #988489] INFO -- : [304/885] 1029850=test_gem_uri_formatter I, [2024-05-16T22:10:28.260834 #988489] INFO -- : [305/885] 1029857=command_line_test I, [2024-05-16T22:10:28.261527 #988489] INFO -- : [306/885] 1029850=test_pty I, [2024-05-16T22:10:28.270035 #988489] INFO -- : [307/885] 1029857=test_dup I, [2024-05-16T22:10:28.273110 #988489] INFO -- : [308/885] 1029846=test_constant I, [2024-05-16T22:10:28.292580 #988489] INFO -- : [309/885] 1029851=test_project_sanity I, [2024-05-16T22:10:28.363065 #988489] INFO -- : [310/885] 1029851=test_range I, [2024-05-16T22:10:28.374949 #988489] INFO -- : [311/885] 1029852=test_udp I, [2024-05-16T22:10:28.382510 #988489] INFO -- : [312/885] 1029852=test_file I, [2024-05-16T22:10:28.416788 #988489] INFO -- : [313/885] 1029857=test_force_exit I, [2024-05-16T22:10:28.448990 #988489] INFO -- : [314/885] 1029864=test_ostruct I, [2024-05-16T22:10:28.461474 #988489] INFO -- : [315/885] 1029859=unescape_test I, [2024-05-16T22:10:28.499826 #988489] INFO -- : [316/885] 1029857=bom_test I, [2024-05-16T22:10:28.506291 #988489] INFO -- : [317/885] 1029857=test_data_error I, [2024-05-16T22:10:28.551732 #988489] INFO -- : [318/885] 1029857=static_inspect_test I, [2024-05-16T22:10:28.553575 #988489] INFO -- : [319/885] 1029857=test_regexp I, [2024-05-16T22:10:28.565293 #988489] INFO -- : [320/885] 1029864=test_gem_commands_check_command I, [2024-05-16T22:10:28.597468 #988489] INFO -- : [321/885] 1029848=errors_test I, [2024-05-16T22:10:28.666370 #988489] INFO -- : [322/885] 1029848=test_tmpdir I, [2024-05-16T22:10:28.721540 #988489] INFO -- : [323/885] 1029848=test_rdoc_markup_document I, [2024-05-16T22:10:28.730306 #988489] INFO -- : [324/885] 1029848=test_integer_comb I, [2024-05-16T22:10:28.730708 #988489] INFO -- : [325/885] 1029863=test_vm_dump I, [2024-05-16T22:10:28.735021 #988489] INFO -- : [326/885] 1029863=test_ancdata I, [2024-05-16T22:10:28.736259 #988489] INFO -- : [327/885] 1029863=test_singleton_function I, [2024-05-16T22:10:28.741901 #988489] INFO -- : [328/885] 1029863=test_reline_key I, [2024-05-16T22:10:28.749502 #988489] INFO -- : [329/885] 1029863=test_rb_str_dup I, [2024-05-16T22:10:28.756100 #988489] INFO -- : [330/885] 1029863=test_weakref I, [2024-05-16T22:10:28.785129 #988489] INFO -- : [331/885] 1029864=test_nonblock I, [2024-05-16T22:10:28.794630 #988489] INFO -- : [332/885] 1029850=test_unicode_normalize I, [2024-05-16T22:10:28.808694 #988489] INFO -- : [333/885] 1029864=test_marshal I, [2024-05-16T22:10:28.925447 #988489] INFO -- : [334/885] 1029851=test_timeout I, [2024-05-16T22:10:28.932770 #988489] INFO -- : [335/885] 1029863=test_alias I, [2024-05-16T22:10:29.118903 #988489] INFO -- : [336/885] 1029863=test_ractor I, [2024-05-16T22:10:29.201636 #988489] INFO -- : [337/885] 1029858=test_rendering I, [2024-05-16T22:10:29.261746 #988489] INFO -- : [338/885] 1029858=test_debugger_integration I, [2024-05-16T22:10:29.279364 #988489] INFO -- : [339/885] 1029858=json_ext_parser_test I, [2024-05-16T22:10:29.288810 #988489] INFO -- : [340/885] 1029858=test_thread I, [2024-05-16T22:10:29.295292 #988489] INFO -- : [341/885] 1029864=test_my_integer I, [2024-05-16T22:10:29.297412 #988489] INFO -- : [342/885] 1029864=test_ssl I, [2024-05-16T22:10:29.413614 #988489] INFO -- : [343/885] 1029859=test_dns I, [2024-05-16T22:10:29.530237 #988489] INFO -- : [344/885] 1029863=test_gem_commands_open_command I, [2024-05-16T22:10:29.637617 #988489] INFO -- : [345/885] 1029863=test_ractor I, [2024-05-16T22:10:29.648234 #988489] INFO -- : [346/885] 1029863=test_gem I, [2024-05-16T22:10:29.765453 #988489] INFO -- : [347/885] 1029851=test_gem_source_lock I, [2024-05-16T22:10:29.802186 #988489] INFO -- : [348/885] 1029864=test_registry I, [2024-05-16T22:10:29.803279 #988489] INFO -- : [349/885] 1029864=parse_stream_test I, [2024-05-16T22:10:29.808801 #988489] INFO -- : [350/885] 1029864=test_parser I, [2024-05-16T22:10:29.821018 #988489] INFO -- : [351/885] 1029851=test_cgi_core I, [2024-05-16T22:10:29.839438 #988489] INFO -- : [352/885] 1029864=test_gem_commands_setup_command I, [2024-05-16T22:10:29.848893 #988489] INFO -- : [353/885] 1029851=desugar_compiler_test I, [2024-05-16T22:10:29.849920 #988489] INFO -- : [354/885] 1029859=test_integer I, [2024-05-16T22:10:29.856647 #988489] INFO -- : [355/885] 1029851=test_dryrun I, [2024-05-16T22:10:29.884096 #988489] INFO -- : [356/885] 1029851=test_rdoc_attr I, [2024-05-16T22:10:29.893563 #988489] INFO -- : [357/885] 1029851=test_env I, [2024-05-16T22:10:29.917027 #988489] INFO -- : [358/885] 1029859=test_gem_resolver_git_specification I, [2024-05-16T22:10:30.109256 #988489] INFO -- : [359/885] 1029859=test_usrmarshal I, [2024-05-16T22:10:30.122470 #988489] INFO -- : [360/885] 1029849=test_object_references I, [2024-05-16T22:10:30.151426 #988489] INFO -- : [361/885] 1029849=test_capacity I, [2024-05-16T22:10:30.157330 #988489] INFO -- : [362/885] 1029849=test_nextafter I, [2024-05-16T22:10:30.192892 #988489] INFO -- : [363/885] 1029864=test_have_func I, [2024-05-16T22:10:30.208251 #988489] INFO -- : [364/885] 1029849=test_gem_request_set_lockfile_tokenizer I, [2024-05-16T22:10:30.248100 #988489] INFO -- : [365/885] 1029848=test_stat I, [2024-05-16T22:10:30.255315 #988489] INFO -- : [366/885] 1029848=test_rubygems I, [2024-05-16T22:10:30.280244 #988489] INFO -- : [367/885] 1029846=test_https_proxy I, [2024-05-16T22:10:30.315650 #988489] INFO -- : [368/885] 1029846=test_call I, [2024-05-16T22:10:30.322105 #988489] INFO -- : [369/885] 1029859=test_integer I, [2024-05-16T22:10:30.367503 #988489] INFO -- : [370/885] 1029849=test_cgi_modruby I, [2024-05-16T22:10:30.382480 #988489] INFO -- : [371/885] 1029849=test_rubyoptions I, [2024-05-16T22:10:30.410340 #988489] INFO -- : [372/885] 1029846=test_super I, [2024-05-16T22:10:30.422578 #988489] INFO -- : [373/885] 1029848=test_lazy_enumerator I, [2024-05-16T22:10:30.825095 #988489] INFO -- : [374/885] 1029848=test_enc_associate I, [2024-05-16T22:10:30.940206 #988489] INFO -- : [375/885] 1029860=test_unix I, [2024-05-16T22:10:30.948014 #988489] INFO -- : [376/885] 1029846=test_nofree I, [2024-05-16T22:10:30.950381 #988489] INFO -- : [377/885] 1029846=test_gem_commands_pristine_command I, [2024-05-16T22:10:30.969745 #988489] INFO -- : [378/885] 1029860=test_context I, [2024-05-16T22:10:31.020083 #988489] INFO -- : [379/885] 1029850=test_symbol I, [2024-05-16T22:10:31.177658 #988489] INFO -- : [380/885] 1029860=test_coder I, [2024-05-16T22:10:31.190050 #988489] INFO -- : [381/885] 1029860=test_find_executable I, [2024-05-16T22:10:31.210557 #988489] INFO -- : [382/885] 1029860=ruby_api_test I, [2024-05-16T22:10:31.313469 #988489] INFO -- : [383/885] 1029864=test_function_entry I, [2024-05-16T22:10:31.316800 #988489] INFO -- : [384/885] 1029864=test_arith_seq_beg_len_step I, [2024-05-16T22:10:31.368809 #988489] INFO -- : [385/885] 1029860=test_gem_resolver_requirement_list I, [2024-05-16T22:10:31.370354 #988489] INFO -- : [386/885] 1029860=test_pkcs7 I, [2024-05-16T22:10:31.379018 #988489] INFO -- : [387/885] 1029864=test_mailto I, [2024-05-16T22:10:31.390394 #988489] INFO -- : [388/885] 1029864=test_symbol I, [2024-05-16T22:10:31.394954 #988489] INFO -- : [389/885] 1029864=location_test I, [2024-05-16T22:10:31.398172 #988489] INFO -- : [390/885] 1029848=test_coderange I, [2024-05-16T22:10:31.399237 #988489] INFO -- : [391/885] 1029848=json_generic_object_test I, [2024-05-16T22:10:31.409089 #988489] INFO -- : [392/885] 1029848=test_gem_source_fetch_problem I, [2024-05-16T22:10:31.421958 #988489] INFO -- : [393/885] 1029848=test_http_request I, [2024-05-16T22:10:31.430533 #988489] INFO -- : [394/885] 1029864=test_error_highlight I, [2024-05-16T22:10:31.437903 #988489] INFO -- : [395/885] 1029848=test_resize I, [2024-05-16T22:10:31.446294 #988489] INFO -- : [396/885] 1029848=test_rdoc_comment I, [2024-05-16T22:10:31.489171 #988489] INFO -- : [397/885] 1029848=test_rdoc_generator_darkfish I, [2024-05-16T22:10:31.590271 #988489] INFO -- : [398/885] 1029860=test_gem_commands_cleanup_command I, [2024-05-16T22:10:31.594923 #988489] INFO -- : [399/885] 1029863=test_word I, [2024-05-16T22:10:31.600157 #988489] INFO -- : [400/885] 1029863=test_cgi_multipart I, [2024-05-16T22:10:31.750125 #988489] INFO -- : [401/885] 1029863=test_member I, [2024-05-16T22:10:31.753829 #988489] INFO -- : [402/885] 1029863=test_numeric I, [2024-05-16T22:10:31.760819 #988489] INFO -- : [403/885] 1029863=test_autoconf I, [2024-05-16T22:10:31.766621 #988489] INFO -- : [404/885] 1029863=test_eval I, [2024-05-16T22:10:31.768047 #988489] INFO -- : [405/885] 1029863=test_gem_console_ui I, [2024-05-16T22:10:31.775419 #988489] INFO -- : [406/885] 1029863=test_date_ractor I, [2024-05-16T22:10:31.784389 #988489] INFO -- : [407/885] 1029864=test_dir I, [2024-05-16T22:10:31.800966 #988489] INFO -- : [408/885] 1029848=format_errors_test I, [2024-05-16T22:10:31.801932 #988489] INFO -- : [409/885] 1029848=test_ractor_compatibility I, [2024-05-16T22:10:32.009064 #988489] INFO -- : [410/885] 1029860=test_rdoc_markup_to_ansi I, [2024-05-16T22:10:32.038127 #988489] INFO -- : [411/885] 1029863=test_mixed_unicode_escapes I, [2024-05-16T22:10:32.043857 #988489] INFO -- : [412/885] 1029863=test_history I, [2024-05-16T22:10:32.056307 #988489] INFO -- : [413/885] 1029863=test_ipaddr I, [2024-05-16T22:10:32.062173 #988489] INFO -- : [414/885] 1029864=test_win32ole_variant I, [2024-05-16T22:10:32.064850 #988489] INFO -- : [415/885] 1029864=test_gem_resolver_api_specification I, [2024-05-16T22:10:32.078359 #988489] INFO -- : [416/885] 1029863=test_merge_keys I, [2024-05-16T22:10:32.086730 #988489] INFO -- : [417/885] 1029863=test_rdoc_extend I, [2024-05-16T22:10:32.098145 #988489] INFO -- : [418/885] 1029860=test_threadgroup I, [2024-05-16T22:10:32.110058 #988489] INFO -- : [419/885] 1029864=test_enum I, [2024-05-16T22:10:32.150785 #988489] INFO -- : [420/885] 1029845=test_gem_specification I, [2024-05-16T22:10:32.162339 #988489] INFO -- : [421/885] 1029846=test_gem_package I, [2024-05-16T22:10:32.162605 #988489] INFO -- : [422/885] 1029861=test_resolve_symbol I, [2024-05-16T22:10:32.208228 #988489] INFO -- : [423/885] 1029861=test_complex2 I, [2024-05-16T22:10:32.214827 #988489] INFO -- : [424/885] 1029861=test_have_macro I, [2024-05-16T22:10:32.280481 #988489] INFO -- : [425/885] 1029848=test_time_tz I, [2024-05-16T22:10:32.291609 #988489] INFO -- : [426/885] 1029863=test_win32ole_event I, [2024-05-16T22:10:32.297169 #988489] INFO -- : [427/885] 1029863=test_rdoc_generator_json_index I, [2024-05-16T22:10:32.326339 #988489] INFO -- : [428/885] 1029863=test_trace I, [2024-05-16T22:10:32.333343 #988489] INFO -- : [429/885] 1029848=ractor_test I, [2024-05-16T22:10:32.345984 #988489] INFO -- : [430/885] 1029863=test_io_wait_uncommon I, [2024-05-16T22:10:32.349453 #988489] INFO -- : [431/885] 1029863=test_stringio I, [2024-05-16T22:10:32.410202 #988489] INFO -- : [432/885] 1029848=test_arity I, [2024-05-16T22:10:32.417119 #988489] INFO -- : [433/885] 1029848=test_win32ole_variable I, [2024-05-16T22:10:32.418470 #988489] INFO -- : [434/885] 1029848=test_gem_ci_detector I, [2024-05-16T22:10:32.431515 #988489] INFO -- : [435/885] 1029848=test_rdoc_class_module I, [2024-05-16T22:10:32.455402 #988489] INFO -- : [436/885] 1029863=test_bignum I, [2024-05-16T22:10:32.460195 #988489] INFO -- : [437/885] 1029859=test_tcp I, [2024-05-16T22:10:32.482880 #988489] INFO -- : [438/885] 1029859=test_iso_8859 I, [2024-05-16T22:10:32.523163 #988489] INFO -- : [439/885] 1029859=test_rdoc_text I, [2024-05-16T22:10:32.572496 #988489] INFO -- : [440/885] 1029859=test_syntax I, [2024-05-16T22:10:32.584259 #988489] INFO -- : [441/885] 1029863=test_gem_safe_yaml I, [2024-05-16T22:10:32.594646 #988489] INFO -- : [442/885] 1029863=test_rdoc_markup_to_joined_paragraph I, [2024-05-16T22:10:32.599137 #988489] INFO -- : [443/885] 1029863=test_date_time I, [2024-05-16T22:10:32.606752 #988489] INFO -- : [444/885] 1029846=test_require I, [2024-05-16T22:10:32.608406 #988489] INFO -- : [445/885] 1029846=index_write_test I, [2024-05-16T22:10:32.613937 #988489] INFO -- : [446/885] 1029863=test_date_new I, [2024-05-16T22:10:32.633478 #988489] INFO -- : [447/885] 1029851=test_data I, [2024-05-16T22:10:32.642639 #988489] INFO -- : [448/885] 1029851=test_httpresponse I, [2024-05-16T22:10:32.651389 #988489] INFO -- : [449/885] 1029863=test_open-uri I, [2024-05-16T22:10:32.659287 #988489] INFO -- : [450/885] 1029846=test_rdoc_parser_ruby I, [2024-05-16T22:10:32.711032 #988489] INFO -- : [451/885] 1029856=test_rdoc_context I, [2024-05-16T22:10:32.720906 #988489] INFO -- : [452/885] 1029861=test_nil2vtempty I, [2024-05-16T22:10:32.721714 #988489] INFO -- : [453/885] 1029861=test_stream I, [2024-05-16T22:10:32.737187 #988489] INFO -- : [454/885] 1029851=test_gem_commands_dependency_command I, [2024-05-16T22:10:32.738504 #988489] INFO -- : [455/885] 1029861=test_gem_resolver I, [2024-05-16T22:10:32.819337 #988489] INFO -- : [456/885] 1029851=test_gem_resolver_composed_set I, [2024-05-16T22:10:32.834739 #988489] INFO -- : [457/885] 1029851=test_safe_load I, [2024-05-16T22:10:32.849197 #988489] INFO -- : [458/885] 1029851=test_name_error I, [2024-05-16T22:10:32.935787 #988489] INFO -- : [459/885] 1029851=test_rdoc_markup_attribute_manager I, [2024-05-16T22:10:32.966175 #988489] INFO -- : [460/885] 1029851=test_http I, [2024-05-16T22:10:32.971837 #988489] INFO -- : [461/885] 1029851=test_shift_jis I, [2024-05-16T22:10:32.976072 #988489] INFO -- : [462/885] 1029851=test_gem_commands_which_command I, [2024-05-16T22:10:33.011117 #988489] INFO -- : [463/885] 1029864=test_inadvertent_creation I, [2024-05-16T22:10:33.013515 #988489] INFO -- : [464/885] 1029851=test_flags I, [2024-05-16T22:10:33.033507 #988489] INFO -- : [465/885] 1029848=test_enumerator I, [2024-05-16T22:10:33.057946 #988489] INFO -- : [466/885] 1029863=test_gem_commands_specification_command I, [2024-05-16T22:10:33.102078 #988489] INFO -- : [467/885] 1029860=test_gem_ext_rake_builder I, [2024-05-16T22:10:33.133782 #988489] INFO -- : [468/885] 1029864=test_arity I, [2024-05-16T22:10:33.140590 #988489] INFO -- : [469/885] 1029864=test_logdevice I, [2024-05-16T22:10:33.166829 #988489] INFO -- : [470/885] 1029863=test_gem_resolver_lock_specification I, [2024-05-16T22:10:33.194518 #988489] INFO -- : [471/885] 1029861=test_err_in_callback I, [2024-05-16T22:10:33.196971 #988489] INFO -- : [472/885] 1029863=test_x509cert I, [2024-05-16T22:10:33.198425 #988489] INFO -- : [473/885] 1029861=test_gc I, [2024-05-16T22:10:33.205885 #988489] INFO -- : [474/885] 1029846=test_process I, [2024-05-16T22:10:33.521104 #988489] INFO -- : [475/885] 1029863=test_last_thread I, [2024-05-16T22:10:33.628412 #988489] INFO -- : [476/885] 1029856=test_pack I, [2024-05-16T22:10:33.793689 #988489] INFO -- : [477/885] 1029860=test_gem_security_policy I, [2024-05-16T22:10:33.844554 #988489] INFO -- : [478/885] 1029856=test_gem_source_local I, [2024-05-16T22:10:33.876332 #988489] INFO -- : [479/885] 1029845=newline_test I, [2024-05-16T22:10:33.968573 #988489] INFO -- : [480/885] 1029864=test_uncorrectable_name_check I, [2024-05-16T22:10:33.978432 #988489] INFO -- : [481/885] 1029864=test_stringchar I, [2024-05-16T22:10:34.025345 #988489] INFO -- : [482/885] 1029860=test_hash_create I, [2024-05-16T22:10:34.025707 #988489] INFO -- : [483/885] 1029860=test_passing_block I, [2024-05-16T22:10:34.031651 #988489] INFO -- : [484/885] 1029860=test_thread_fd_close I, [2024-05-16T22:10:34.033012 #988489] INFO -- : [485/885] 1029860=test_securerandom I, [2024-05-16T22:10:34.034935 #988489] INFO -- : [486/885] 1029845=test_logperiod I, [2024-05-16T22:10:34.045694 #988489] INFO -- : [487/885] 1029845=test_c_union_entity I, [2024-05-16T22:10:34.058715 #988489] INFO -- : [488/885] 1029860=test_rdoc_normal_module I, [2024-05-16T22:10:34.059562 #988489] INFO -- : [489/885] 1029851=test_rdoc_markdown_test I, [2024-05-16T22:10:34.083071 #988489] INFO -- : [490/885] 1029864=test_io_console I, [2024-05-16T22:10:34.091095 #988489] INFO -- : [491/885] 1029845=test_singleton I, [2024-05-16T22:10:34.092486 #988489] INFO -- : [492/885] 1029845=test_flush I, [2024-05-16T22:10:34.093051 #988489] INFO -- : [493/885] 1029856=test_switch_hitter I, [2024-05-16T22:10:34.100656 #988489] INFO -- : [494/885] 1029845=test_literal I, [2024-05-16T22:10:34.108231 #988489] INFO -- : [495/885] 1029856=test_c_struct_builder I, [2024-05-16T22:10:34.118326 #988489] INFO -- : [496/885] 1029860=test_dot_dot I, [2024-05-16T22:10:34.119034 #988489] INFO -- : [497/885] 1029860=test_str2big I, [2024-05-16T22:10:34.124732 #988489] INFO -- : [498/885] 1029860=test_rdoc_markup_to_table_of_contents I, [2024-05-16T22:10:34.148253 #988489] INFO -- : [499/885] 1029860=test_objectspace I, [2024-05-16T22:10:34.207628 #988489] INFO -- : [500/885] 1029856=test_socket I, [2024-05-16T22:10:34.466150 #988489] INFO -- : [501/885] 1029852=test_thread I, [2024-05-16T22:10:34.585951 #988489] INFO -- : [502/885] 1029863=test_severity I, [2024-05-16T22:10:34.592740 #988489] INFO -- : [503/885] 1029863=test_ractor I, [2024-05-16T22:10:34.602847 #988489] INFO -- : [504/885] 1029850=parse_test I, [2024-05-16T22:10:34.606367 #988489] INFO -- : [505/885] 1029863=test_gem_install_update_options I, [2024-05-16T22:10:34.622146 #988489] INFO -- : [506/885] 1029853=test_require_lib I, [2024-05-16T22:10:34.687054 #988489] INFO -- : [507/885] 1029852=test_rdoc_generator_ri I, [2024-05-16T22:10:34.688227 #988489] INFO -- : [508/885] 1029863=test_extlibs I, [2024-05-16T22:10:34.817067 #988489] INFO -- : [509/885] 1029852=test_gem_stream_ui I, [2024-05-16T22:10:34.858930 #988489] INFO -- : [510/885] 1029845=test_m17n_comb I, [2024-05-16T22:10:34.888725 #988489] INFO -- : [511/885] 1029851=test_memory_view I, [2024-05-16T22:10:34.890020 #988489] INFO -- : [512/885] 1029852=test_ractor I, [2024-05-16T22:10:34.952208 #988489] INFO -- : [513/885] 1029852=test_ansi_with_terminfo I, [2024-05-16T22:10:34.962135 #988489] INFO -- : [514/885] 1029852=test_rdoc_generator_pot_po I, [2024-05-16T22:10:34.966130 #988489] INFO -- : [515/885] 1029852=test_rdoc_markup_to_markdown I, [2024-05-16T22:10:34.999181 #988489] INFO -- : [516/885] 1029860=test_json_tree I, [2024-05-16T22:10:35.005708 #988489] INFO -- : [517/885] 1029852=test_pkey I, [2024-05-16T22:10:35.006710 #988489] INFO -- : [518/885] 1029860=test_case I, [2024-05-16T22:10:35.009836 #988489] INFO -- : [519/885] 1029860=test_reline I, [2024-05-16T22:10:35.057682 #988489] INFO -- : [520/885] 1029852=test_parser_events I, [2024-05-16T22:10:35.064911 #988489] INFO -- : [521/885] 1029851=test_cclass I, [2024-05-16T22:10:35.107844 #988489] INFO -- : [522/885] 1029852=test_grapheme_breaks I, [2024-05-16T22:10:35.141163 #988489] INFO -- : [523/885] 1029852=test_gem_version_option I, [2024-05-16T22:10:35.181330 #988489] INFO -- : [524/885] 1029852=test_gem_request_connection_pools I, [2024-05-16T22:10:35.207403 #988489] INFO -- : [525/885] 1029851=test_generic I, [2024-05-16T22:10:35.233332 #988489] INFO -- : [526/885] 1029851=test_win32ole I, [2024-05-16T22:10:35.237108 #988489] INFO -- : [527/885] 1029851=test_scan_args I, [2024-05-16T22:10:35.251023 #988489] INFO -- : [528/885] 1029851=test_enumerator_kw I, [2024-05-16T22:10:35.259400 #988489] INFO -- : [529/885] 1029851=test_settracefunc I, [2024-05-16T22:10:35.349301 #988489] INFO -- : [530/885] 1029860=test_gem_text I, [2024-05-16T22:10:35.393663 #988489] INFO -- : [531/885] 1029860=test_gem_commands_mirror I, [2024-05-16T22:10:35.402564 #988489] INFO -- : [532/885] 1029860=test_gem_ext_cargo_builder_link_flag_converter I, [2024-05-16T22:10:35.457820 #988489] INFO -- : [533/885] 1029860=test_gem_request I, [2024-05-16T22:10:35.484902 #988489] INFO -- : [534/885] 1029856=test_method_cache I, [2024-05-16T22:10:35.486117 #988489] INFO -- : [535/885] 1029856=test_sprintf_comb I, [2024-05-16T22:10:35.542934 #988489] INFO -- : [536/885] 1029862=test_exception I, [2024-05-16T22:10:35.636937 #988489] INFO -- : [537/885] 1029856=test_bug_reporter I, [2024-05-16T22:10:35.653025 #988489] INFO -- : [538/885] 1029860=test_gem_name_tuple I, [2024-05-16T22:10:35.673173 #988489] INFO -- : [539/885] 1029860=test_gem_package_tar_reader_entry I, [2024-05-16T22:10:35.851997 #988489] INFO -- : [540/885] 1029847=test_rand I, [2024-05-16T22:10:35.876222 #988489] INFO -- : [541/885] 1029860=test_rdoc_cross_reference I, [2024-05-16T22:10:35.991201 #988489] INFO -- : [542/885] 1029856=test_gem_commands_info_command I, [2024-05-16T22:10:36.008104 #988489] INFO -- : [543/885] 1029856=test_gem_dependency_installer I, [2024-05-16T22:10:36.160932 #988489] INFO -- : [544/885] 1029847=test_scalar I, [2024-05-16T22:10:36.166719 #988489] INFO -- : [545/885] 1029847=test_case_options I, [2024-05-16T22:10:36.171847 #988489] INFO -- : [546/885] 1029847=test_store I, [2024-05-16T22:10:36.215495 #988489] INFO -- : [547/885] 1029852=test_windows_1251 I, [2024-05-16T22:10:36.222647 #988489] INFO -- : [548/885] 1029852=test_time I, [2024-05-16T22:10:36.331997 #988489] INFO -- : [549/885] 1029847=test_rdoc_rdoc I, [2024-05-16T22:10:36.352494 #988489] INFO -- : [550/885] 1029851=test_gem_uninstaller I, [2024-05-16T22:10:36.366492 #988489] INFO -- : [551/885] 1029852=test_gb18030 I, [2024-05-16T22:10:36.372381 #988489] INFO -- : [552/885] 1029852=test_svcb_https I, [2024-05-16T22:10:36.381286 #988489] INFO -- : [553/885] 1029852=test_buffering I, [2024-05-16T22:10:36.382630 #988489] INFO -- : [554/885] 1029860=test_defined I, [2024-05-16T22:10:36.384779 #988489] INFO -- : [555/885] 1029852=test_backtrace I, [2024-05-16T22:10:36.391405 #988489] INFO -- : [556/885] 1029852=test_key_name_check I, [2024-05-16T22:10:36.399778 #988489] INFO -- : [557/885] 1029852=test_io_buffer I, [2024-05-16T22:10:36.404886 #988489] INFO -- : [558/885] 1029847=test_rdoc_i18n_text I, [2024-05-16T22:10:36.410048 #988489] INFO -- : [559/885] 1029847=test_date_parse I, [2024-05-16T22:10:36.439933 #988489] INFO -- : [560/885] 1029852=test_pipe I, [2024-05-16T22:10:36.472711 #988489] INFO -- : [561/885] 1029860=test_trick I, [2024-05-16T22:10:36.477237 #988489] INFO -- : [562/885] 1029845=test_thread I, [2024-05-16T22:10:36.479538 #988489] INFO -- : [563/885] 1029845=test_pkey_ec I, [2024-05-16T22:10:36.525207 #988489] INFO -- : [564/885] 1029847=test_mul I, [2024-05-16T22:10:36.536910 #988489] INFO -- : [565/885] 1029847=test_win32ole_type I, [2024-05-16T22:10:36.538764 #988489] INFO -- : [566/885] 1029847=test_null I, [2024-05-16T22:10:36.543429 #988489] INFO -- : [567/885] 1029847=test_default_gems I, [2024-05-16T22:10:36.551659 #988489] INFO -- : [568/885] 1029852=test_rdoc_rd_inline_parser I, [2024-05-16T22:10:36.557774 #988489] INFO -- : [569/885] 1029845=test_rdoc_markup_to_rdoc I, [2024-05-16T22:10:36.586712 #988489] INFO -- : [570/885] 1029852=test_rdoc_markup_attributes I, [2024-05-16T22:10:36.587889 #988489] INFO -- : [571/885] 1029852=json_addition_test I, [2024-05-16T22:10:36.604287 #988489] INFO -- : [572/885] 1029847=test_custom_command I, [2024-05-16T22:10:36.605191 #988489] INFO -- : [573/885] 1029863=test_rdoc_parser I, [2024-05-16T22:10:36.607678 #988489] INFO -- : [574/885] 1029852=test_qsort I, [2024-05-16T22:10:36.610136 #988489] INFO -- : [575/885] 1029847=test_gem_dependency_resolution_error I, [2024-05-16T22:10:36.611012 #988489] INFO -- : [576/885] 1029852=test_pattern_matching I, [2024-05-16T22:10:36.617567 #988489] INFO -- : [577/885] 1029847=test_rdoc_stats I, [2024-05-16T22:10:36.622862 #988489] INFO -- : [578/885] 1029863=test_string I, [2024-05-16T22:10:36.631605 #988489] INFO -- : [579/885] 1029852=test_rdoc_store I, [2024-05-16T22:10:36.638340 #988489] INFO -- : [580/885] 1029863=test_raise I, [2024-05-16T22:10:36.639177 #988489] INFO -- : [581/885] 1029863=test_x509attr I, [2024-05-16T22:10:36.645518 #988489] INFO -- : [582/885] 1029863=test_gem_request_set_lockfile_parser I, [2024-05-16T22:10:36.653774 #988489] INFO -- : [583/885] 1029847=test_depth_first I, [2024-05-16T22:10:36.658294 #988489] INFO -- : [584/885] 1029847=test_gem_validator I, [2024-05-16T22:10:36.685949 #988489] INFO -- : [585/885] 1029847=test_folderitem2_invokeverb I, [2024-05-16T22:10:36.690986 #988489] INFO -- : [586/885] 1029847=test_require_path_check I, [2024-05-16T22:10:36.713350 #988489] INFO -- : [587/885] 1029845=test_rdoc_markup_parser I, [2024-05-16T22:10:36.714927 #988489] INFO -- : [588/885] 1029863=test_files_test_2 I, [2024-05-16T22:10:36.760053 #988489] INFO -- : [589/885] 1029864=test_fnmatch I, [2024-05-16T22:10:36.765443 #988489] INFO -- : [590/885] 1029845=test_egrep_cpp I, [2024-05-16T22:10:36.798115 #988489] INFO -- : [591/885] 1029847=test_cgi_tag_helper I, [2024-05-16T22:10:36.817845 #988489] INFO -- : [592/885] 1029847=test_zlib I, [2024-05-16T22:10:36.829682 #988489] INFO -- : [593/885] 1029864=test_optimization I, [2024-05-16T22:10:36.872299 #988489] INFO -- : [594/885] 1029850=test_date_conv I, [2024-05-16T22:10:36.883570 #988489] INFO -- : [595/885] 1029850=test_erb_m17n I, [2024-05-16T22:10:36.892516 #988489] INFO -- : [596/885] 1029850=test_ole_methods I, [2024-05-16T22:10:36.897522 #988489] INFO -- : [597/885] 1029850=test_proc I, [2024-05-16T22:10:36.912301 #988489] INFO -- : [598/885] 1029845=test_string I, [2024-05-16T22:10:37.191498 #988489] INFO -- : [599/885] 1029862=test_gc_compact I, [2024-05-16T22:10:37.321355 #988489] INFO -- : [600/885] 1029851=test_gem_package_old I, [2024-05-16T22:10:37.361401 #988489] INFO -- : [601/885] 1029851=test_gem_resolver_index_set I, [2024-05-16T22:10:37.388013 #988489] INFO -- : [602/885] 1029851=test_rdoc_single_class I, [2024-05-16T22:10:37.389176 #988489] INFO -- : [603/885] 1029852=test_nil I, [2024-05-16T22:10:37.411163 #988489] INFO -- : [604/885] 1029851=test_num2int I, [2024-05-16T22:10:37.419686 #988489] INFO -- : [605/885] 1029852=test_verbose I, [2024-05-16T22:10:37.436571 #988489] INFO -- : [606/885] 1029851=test_pp I, [2024-05-16T22:10:37.442107 #988489] INFO -- : [607/885] 1029852=test_gem_ext_configure_builder I, [2024-05-16T22:10:37.483990 #988489] INFO -- : [608/885] 1029852=test_frozen I, [2024-05-16T22:10:37.494420 #988489] INFO -- : [609/885] 1029852=test_macro I, [2024-05-16T22:10:37.496358 #988489] INFO -- : [610/885] 1029852=test_iter_break I, [2024-05-16T22:10:37.504182 #988489] INFO -- : [611/885] 1029852=test_exception I, [2024-05-16T22:10:37.509306 #988489] INFO -- : [612/885] 1029851=test_zsh_completion I, [2024-05-16T22:10:37.516010 #988489] INFO -- : [613/885] 1029852=test_rdoc_token_stream I, [2024-05-16T22:10:37.520740 #988489] INFO -- : [614/885] 1029851=test_address_resolve I, [2024-05-16T22:10:37.521757 #988489] INFO -- : [615/885] 1029852=test_gem_source_list I, [2024-05-16T22:10:37.565508 #988489] INFO -- : [616/885] 1029851=test_optarg I, [2024-05-16T22:10:37.580230 #988489] INFO -- : [617/885] 1029852=test_yaml_special_cases I, [2024-05-16T22:10:37.597597 #988489] INFO -- : [618/885] 1029852=test_config I, [2024-05-16T22:10:37.625228 #988489] INFO -- : [619/885] 1029851=test_numeric I, [2024-05-16T22:10:37.631799 #988489] INFO -- : [620/885] 1029852=test_gem_commands_lock_command I, [2024-05-16T22:10:37.654768 #988489] INFO -- : [621/885] 1029850=test_ifunless I, [2024-05-16T22:10:37.659252 #988489] INFO -- : [622/885] 1029852=test_assignment I, [2024-05-16T22:10:37.670555 #988489] INFO -- : [623/885] 1029850=test_key_actor_vi I, [2024-05-16T22:10:37.718993 #988489] INFO -- : [624/885] 1029851=test_bug-3571 I, [2024-05-16T22:10:37.727862 #988489] INFO -- : [625/885] 1029857=test_gem_command I, [2024-05-16T22:10:37.744570 #988489] INFO -- : [626/885] 1029851=test_gem_spec_fetcher I, [2024-05-16T22:10:37.803685 #988489] INFO -- : [627/885] 1029850=test_common I, [2024-05-16T22:10:37.929702 #988489] INFO -- : [628/885] 1029851=test_rdoc_markup_to_tt_only I, [2024-05-16T22:10:37.978634 #988489] INFO -- : [629/885] 1029853=test_hmac I, [2024-05-16T22:10:37.979713 #988489] INFO -- : [630/885] 1029851=test_rdoc_tom_doc I, [2024-05-16T22:10:37.988083 #988489] INFO -- : [631/885] 1029853=test_object_create_start I, [2024-05-16T22:10:37.990854 #988489] INFO -- : [632/885] 1029853=test_date I, [2024-05-16T22:10:37.996852 #988489] INFO -- : [633/885] 1029853=test_gem_rdoc I, [2024-05-16T22:10:38.003954 #988489] INFO -- : [634/885] 1029850=test_gem_ext_cargo_builder_unit I, [2024-05-16T22:10:38.005239 #988489] INFO -- : [635/885] 1029851=test_command I, [2024-05-16T22:10:38.025559 #988489] INFO -- : [636/885] 1029850=test_at_exit I, [2024-05-16T22:10:38.027154 #988489] INFO -- : [637/885] 1029857=!Nothing_to_test I, [2024-05-16T22:10:38.027706 #988489] INFO -- : [638/885] 1029857=test_psych I, [2024-05-16T22:10:38.046163 #988489] INFO -- : [639/885] 1029850=test_enc_raise I, [2024-05-16T22:10:38.054408 #988489] INFO -- : [640/885] 1029850=test_rdoc_markup_paragraph I, [2024-05-16T22:10:38.060673 #988489] INFO -- : [641/885] 1029850=test_kdf I, [2024-05-16T22:10:38.072539 #988489] INFO -- : [642/885] 1029857=test_gem_doctor I, [2024-05-16T22:10:38.121686 #988489] INFO -- : [643/885] 1029857=test_kernel I, [2024-05-16T22:10:38.148756 #988489] INFO -- : [644/885] 1029850=dispatcher_test I, [2024-05-16T22:10:38.182000 #988489] INFO -- : [645/885] 1029850=test_eval_history I, [2024-05-16T22:10:38.257122 #988489] INFO -- : [646/885] 1029853=test_bug-5832 I, [2024-05-16T22:10:38.263919 #988489] INFO -- : [647/885] 1029858=test_files_ext I, [2024-05-16T22:10:38.264240 #988489] INFO -- : [648/885] 1029853=test_emitter I, [2024-05-16T22:10:38.267140 #988489] INFO -- : [649/885] 1029850=test_gem_silent_ui I, [2024-05-16T22:10:38.276638 #988489] INFO -- : [650/885] 1029856=test_ftp I, [2024-05-16T22:10:38.282398 #988489] INFO -- : [651/885] 1029853=test_euc_kr I, [2024-05-16T22:10:38.289985 #988489] INFO -- : [652/885] 1029853=test_rdoc_context_section I, [2024-05-16T22:10:38.293863 #988489] INFO -- : [653/885] 1029856=test_rdoc_rubygems_hook I, [2024-05-16T22:10:38.308546 #988489] INFO -- : [654/885] 1029850=test_method I, [2024-05-16T22:10:38.348796 #988489] INFO -- : [655/885] 1029853=test_gem_commands_query_command I, [2024-05-16T22:10:38.350059 #988489] INFO -- : [656/885] 1029851=test_pack I, [2024-05-16T22:10:38.354973 #988489] INFO -- : [657/885] 1029856=test_array_create I, [2024-05-16T22:10:38.358491 #988489] INFO -- : [658/885] 1029856=test_gem_impossible_dependencies_error I, [2024-05-16T22:10:38.369559 #988489] INFO -- : [659/885] 1029856=test_pattern_key_name_check I, [2024-05-16T22:10:38.389094 #988489] INFO -- : [660/885] 1029856=test_to_ruby I, [2024-05-16T22:10:38.400584 #988489] INFO -- : [661/885] 1029858=test_io I, [2024-05-16T22:10:38.430000 #988489] INFO -- : [662/885] 1029856=test_hash I, [2024-05-16T22:10:38.586076 #988489] INFO -- : [663/885] 1029851=test_ubf_async_safe I, [2024-05-16T22:10:38.598030 #988489] INFO -- : [664/885] 1029851=test_emoji I, [2024-05-16T22:10:38.628480 #988489] INFO -- : [665/885] 1029851=test_win32ole_type_event I, [2024-05-16T22:10:38.629537 #988489] INFO -- : [666/885] 1029851=test_sorted_set I, [2024-05-16T22:10:38.654820 #988489] INFO -- : [667/885] 1029858=test_win32ole_record I, [2024-05-16T22:10:38.654891 #988489] INFO -- : [668/885] 1029858=test_gem_unsatisfiable_dependency_error I, [2024-05-16T22:10:38.670230 #988489] INFO -- : [669/885] 1029858=test_condition I, [2024-05-16T22:10:38.673800 #988489] INFO -- : [670/885] 1029858=test_gem_source_specific_file I, [2024-05-16T22:10:38.677380 #988489] INFO -- : [671/885] 1029857=test_foreach I, [2024-05-16T22:10:38.679261 #988489] INFO -- : [672/885] 1029857=test_gem_commands_uninstall_command I, [2024-05-16T22:10:38.770977 #988489] INFO -- : [673/885] 1029858=test_cp949 I, [2024-05-16T22:10:38.774245 #988489] INFO -- : [674/885] 1029858=test_summary I, [2024-05-16T22:10:38.837931 #988489] INFO -- : [675/885] 1029858=test_console_attr I, [2024-05-16T22:10:38.840818 #988489] INFO -- : [676/885] 1029858=test_type_completor I, [2024-05-16T22:10:38.843520 #988489] INFO -- : [677/885] 1029858=warnings_test I, [2024-05-16T22:10:38.895200 #988489] INFO -- : [678/885] 1029851=test_kwargs I, [2024-05-16T22:10:38.898787 #988489] INFO -- : [679/885] 1029851=test_gem_commands_exec_command I, [2024-05-16T22:10:38.904249 #988489] INFO -- : [680/885] 1029859=test_io_wait I, [2024-05-16T22:10:38.913332 #988489] INFO -- : [681/885] 1029858=test_date_attr I, [2024-05-16T22:10:38.916549 #988489] INFO -- : [682/885] 1029860=test_ellipsize I, [2024-05-16T22:10:38.922382 #988489] INFO -- : [683/885] 1029858=test_yjit I, [2024-05-16T22:10:38.933648 #988489] INFO -- : [684/885] 1029858=test_workspace I, [2024-05-16T22:10:38.962526 #988489] INFO -- : [685/885] 1029860=test_weakmap I, [2024-05-16T22:10:38.962999 #988489] INFO -- : [686/885] 1029853=test_m17n I, [2024-05-16T22:10:39.023219 #988489] INFO -- : [687/885] 1029853=test_gem_commands_environment_command I, [2024-05-16T22:10:39.071092 #988489] INFO -- : [688/885] 1029853=test_ws I, [2024-05-16T22:10:39.076059 #988489] INFO -- : [689/885] 1029853=test_argf I, [2024-05-16T22:10:39.089525 #988489] INFO -- : [690/885] 1029858=test_framework I, [2024-05-16T22:10:39.097701 #988489] INFO -- : [691/885] 1029858=test_ns_spki I, [2024-05-16T22:10:39.119006 #988489] INFO -- : [692/885] 1029858=test_kill_ring I, [2024-05-16T22:10:39.133363 #988489] INFO -- : [693/885] 1029858=test_external_new I, [2024-05-16T22:10:39.149022 #988489] INFO -- : [694/885] 1029858=test_postponed_job I, [2024-05-16T22:10:39.234899 #988489] INFO -- : [695/885] 1029859=test_alias_and_anchor I, [2024-05-16T22:10:39.240500 #988489] INFO -- : [696/885] 1029859=test_hash I, [2024-05-16T22:10:39.283905 #988489] INFO -- : [697/885] 1029859=test_gem_resolver_dependency_request I, [2024-05-16T22:10:39.300710 #988489] INFO -- : [698/885] 1029859=test_tree_builder I, [2024-05-16T22:10:39.305251 #988489] INFO -- : [699/885] 1029859=test_win32ole_typelib I, [2024-05-16T22:10:39.305308 #988489] INFO -- : [700/885] 1029859=test_protect I, [2024-05-16T22:10:39.310472 #988489] INFO -- : [701/885] 1029859=test_raise_exception I, [2024-05-16T22:10:39.333957 #988489] INFO -- : [702/885] 1029852=test_gem_request_set_lockfile I, [2024-05-16T22:10:39.352733 #988489] INFO -- : [703/885] 1029857=test_set I, [2024-05-16T22:10:39.370634 #988489] INFO -- : [704/885] 1029857=test_show_source I, [2024-05-16T22:10:39.370709 #988489] INFO -- : [705/885] 1029857=test_remote_fetch_error I, [2024-05-16T22:10:39.396792 #988489] INFO -- : [706/885] 1029857=test_have_library I, [2024-05-16T22:10:39.560464 #988489] INFO -- : [707/885] 1029858=test_gem_commands_stale_command I, [2024-05-16T22:10:39.572290 #988489] INFO -- : [708/885] 1029858=test_c_struct_entry I, [2024-05-16T22:10:39.619085 #988489] INFO -- : [709/885] 1029862=test_lock_native_thread I, [2024-05-16T22:10:39.669202 #988489] INFO -- : [710/885] 1029863=test_undef I, [2024-05-16T22:10:39.671929 #988489] INFO -- : [711/885] 1029863=test_objspace I, [2024-05-16T22:10:39.764819 #988489] INFO -- : [712/885] 1029852=ripper_test I, [2024-05-16T22:10:39.845360 #988489] INFO -- : [713/885] 1029849=test_line_editor I, [2024-05-16T22:10:39.855119 #988489] INFO -- : [714/885] 1029858=test_gem_security_trust_dir I, [2024-05-16T22:10:39.915878 #988489] INFO -- : [715/885] 1029858=test_gem_requirement I, [2024-05-16T22:10:39.921453 #988489] INFO -- : [716/885] 1029849=test_sprintf I, [2024-05-16T22:10:39.946737 #988489] INFO -- : [717/885] 1029859=comments_test I, [2024-05-16T22:10:39.953316 #988489] INFO -- : [718/885] 1029859=test_string_memory I, [2024-05-16T22:10:39.978536 #988489] INFO -- : [719/885] 1029862=test_files_sample I, [2024-05-16T22:10:40.035933 #988489] INFO -- : [720/885] 1029858=test_stringscanner I, [2024-05-16T22:10:40.059934 #988489] INFO -- : [721/885] 1029862=test_convertible I, [2024-05-16T22:10:40.065088 #988489] INFO -- : [722/885] 1029859=parser_test I, [2024-05-16T22:10:40.070064 #988489] INFO -- : [723/885] 1029859=test_yield I, [2024-05-16T22:10:40.077581 #988489] INFO -- : [724/885] 1029858=test_rdoc_alias I, [2024-05-16T22:10:40.110853 #988489] INFO -- : [725/885] 1029849=test_fstring I, [2024-05-16T22:10:40.114932 #988489] INFO -- : [726/885] 1029858=test_array I, [2024-05-16T22:10:40.144409 #988489] INFO -- : [727/885] 1029858=test_optparse I, [2024-05-16T22:10:40.145063 #988489] INFO -- : [728/885] 1029858=test_webauthn_poller I, [2024-05-16T22:10:40.235884 #988489] INFO -- : [729/885] 1029849=test_rdoc_markup_raw I, [2024-05-16T22:10:40.307111 #988489] INFO -- : [730/885] 1029851=test_rat I, [2024-05-16T22:10:40.315952 #988489] INFO -- : [731/885] 1029858=test_typeddata I, [2024-05-16T22:10:40.325413 #988489] INFO -- : [732/885] 1029851=test_gem_resolver_best_set I, [2024-05-16T22:10:40.364752 #988489] INFO -- : [733/885] 1029849=encoding_test I, [2024-05-16T22:10:40.390473 #988489] INFO -- : [734/885] 1029861=test_rdoc_markup_to_html_crossref I, [2024-05-16T22:10:40.394036 #988489] INFO -- : [735/885] 1029851=locals_test I, [2024-05-16T22:10:40.551846 #988489] INFO -- : [736/885] 1029852=test_rdoc_require I, [2024-05-16T22:10:40.553598 #988489] INFO -- : [737/885] 1029858=test_clone I, [2024-05-16T22:10:40.571261 #988489] INFO -- : [738/885] 1029849=test_gem_commands_install_command I, [2024-05-16T22:10:40.598517 #988489] INFO -- : [739/885] 1029852=test_readpartial I, [2024-05-16T22:10:40.651211 #988489] INFO -- : [740/885] 1029857=test_io_buffer I, [2024-05-16T22:10:40.777111 #988489] INFO -- : [741/885] 1029857=ruby_parser_test I, [2024-05-16T22:10:40.780024 #988489] INFO -- : [742/885] 1029858=test_backtrace I, [2024-05-16T22:10:40.781392 #988489] INFO -- : [743/885] 1029857=test_pack I, [2024-05-16T22:10:40.801485 #988489] INFO -- : [744/885] 1029857=test_rdoc_task I, [2024-05-16T22:10:40.820354 #988489] INFO -- : [745/885] 1029857=test_gem_resolver_conflict I, [2024-05-16T22:10:40.826132 #988489] INFO -- : [746/885] 1029857=test_rdoc_markup_indented_paragraph I, [2024-05-16T22:10:40.826548 #988489] INFO -- : [747/885] 1029861=test_autoload I, [2024-05-16T22:10:40.873670 #988489] INFO -- : [748/885] 1029851=test_utf16 I, [2024-05-16T22:10:40.887934 #988489] INFO -- : [749/885] 1029851=test_unicode_escape I, [2024-05-16T22:10:40.943017 #988489] INFO -- : [750/885] 1029851=test_io I, [2024-05-16T22:10:40.950990 #988489] INFO -- : [751/885] 1029857=test_face I, [2024-05-16T22:10:40.975515 #988489] INFO -- : [752/885] 1029857=test_case I, [2024-05-16T22:10:41.000662 #988489] INFO -- : [753/885] 1029857=test_sizeof I, [2024-05-16T22:10:41.012303 #988489] INFO -- : [754/885] 1029852=test_rendering I, [2024-05-16T22:10:41.016034 #988489] INFO -- : [755/885] 1029852=test_yaml_tree I, [2024-05-16T22:10:41.066080 #988489] INFO -- : [756/885] 1029852=test_gc I, [2024-05-16T22:10:41.069852 #988489] INFO -- : [757/885] 1029852=test_math I, [2024-05-16T22:10:41.078699 #988489] INFO -- : [758/885] 1029852=test_gem_commands_fetch_command I, [2024-05-16T22:10:41.180716 #988489] INFO -- : [759/885] 1029852=test_libs I, [2024-05-16T22:10:41.208756 #988489] INFO -- : [760/885] 1029852=test_config I, [2024-05-16T22:10:41.250170 #988489] INFO -- : [761/885] 1029852=test_sleep I, [2024-05-16T22:10:41.501191 #988489] INFO -- : [762/885] 1029847=test_ripper I, [2024-05-16T22:10:41.954587 #988489] INFO -- : [763/885] 1029847=test_gem_config_file I, [2024-05-16T22:10:42.019990 #988489] INFO -- : [764/885] 1029849=test_gem_resolver_activation_request I, [2024-05-16T22:10:42.029567 #988489] INFO -- : [765/885] 1029849=test_protocol I, [2024-05-16T22:10:42.107011 #988489] INFO -- : [766/885] 1029847=test_getopts I, [2024-05-16T22:10:42.116423 #988489] INFO -- : [767/885] 1029847=test_yjit_exit_locations I, [2024-05-16T22:10:42.117511 #988489] INFO -- : [768/885] 1029847=test_etc I, [2024-05-16T22:10:42.131048 #988489] INFO -- : [769/885] 1029858=test_pkcs12 I, [2024-05-16T22:10:42.194348 #988489] INFO -- : [770/885] 1029847=test_system I, [2024-05-16T22:10:42.342859 #988489] INFO -- : [771/885] 1029849=test_bigzero I, [2024-05-16T22:10:42.344769 #988489] INFO -- : [772/885] 1029849=test_pkey_dh I, [2024-05-16T22:10:42.350820 #988489] INFO -- : [773/885] 1029856=test_iseq_load I, [2024-05-16T22:10:42.470722 #988489] INFO -- : [774/885] 1029849=test_gem_util I, [2024-05-16T22:10:42.523765 #988489] INFO -- : [775/885] 1029858=test_gem_package_tar_header I, [2024-05-16T22:10:42.561415 #988489] INFO -- : [776/885] 1029858=test_gem_commands_owner_command I, [2024-05-16T22:10:42.633049 #988489] INFO -- : [777/885] 1029849=test_gem_source_vendor I, [2024-05-16T22:10:42.642109 #988489] INFO -- : [778/885] 1029849=test_recorder I, [2024-05-16T22:10:42.651509 #988489] INFO -- : [779/885] 1029849=test_bash_completion I, [2024-05-16T22:10:42.657820 #988489] INFO -- : [780/885] 1029849=test_formatter I, [2024-05-16T22:10:42.674233 #988489] INFO -- : [781/885] 1029849=test_rdoc_constant I, [2024-05-16T22:10:42.788072 #988489] INFO -- : [782/885] 1029849=test_deprecate I, [2024-05-16T22:10:42.812719 #988489] INFO -- : [783/885] 1029849=test_file I, [2024-05-16T22:10:42.830008 #988489] INFO -- : [784/885] 1029860=test_gem_available_set I, [2024-05-16T22:10:42.838096 #988489] INFO -- : [785/885] 1029849=test_rdoc_markdown I, [2024-05-16T22:10:42.911759 #988489] INFO -- : [786/885] 1029860=test_modify_expand I, [2024-05-16T22:10:42.914840 #988489] INFO -- : [787/885] 1029860=test_rdoc_any_method I, [2024-05-16T22:10:43.140445 #988489] INFO -- : [788/885] 1029849=test_init I, [2024-05-16T22:10:43.153105 #988489] INFO -- : [789/885] 1029858=test_complexrational I, [2024-05-16T22:10:43.155154 #988489] INFO -- : [790/885] 1029858=test_pathname I, [2024-05-16T22:10:43.195299 #988489] INFO -- : [791/885] 1029848=test_coverage I, [2024-05-16T22:10:43.215857 #988489] INFO -- : [792/885] 1029856=test_rdoc_encoding I, [2024-05-16T22:10:43.249279 #988489] INFO -- : [793/885] 1029856=test_gem_package_tar_reader I, [2024-05-16T22:10:43.259608 #988489] INFO -- : [794/885] 1029860=regexp_test I, [2024-05-16T22:10:43.275181 #988489] INFO -- : [795/885] 1029860=test_find I, [2024-05-16T22:10:43.284056 #988489] INFO -- : [796/885] 1029856=test_ractor I, [2024-05-16T22:10:43.296735 #988489] INFO -- : [797/885] 1029852=test_wss I, [2024-05-16T22:10:43.301910 #988489] INFO -- : [798/885] 1029852=test_fiddle I, [2024-05-16T22:10:43.317374 #988489] INFO -- : [799/885] 1029860=test_cgi_util I, [2024-05-16T22:10:43.321021 #988489] INFO -- : [800/885] 1029847=test_require I, [2024-05-16T22:10:43.344435 #988489] INFO -- : [801/885] 1029858=test_gem_ext_cmake_builder I, [2024-05-16T22:10:43.369051 #988489] INFO -- : [802/885] 1029858=test_gem_commands_contents_command I, [2024-05-16T22:10:43.396072 #988489] INFO -- : [803/885] 1029856=test_digest I, [2024-05-16T22:10:43.420813 #988489] INFO -- : [804/885] 1029852=test_marshalable I, [2024-05-16T22:10:43.430016 #988489] INFO -- : [805/885] 1029852=test_profile_frames I, [2024-05-16T22:10:43.447831 #988489] INFO -- : [806/885] 1029858=test_cstr I, [2024-05-16T22:10:43.537185 #988489] INFO -- : [807/885] 1029860=test_pstore I, [2024-05-16T22:10:43.541098 #988489] INFO -- : [808/885] 1029853=test_enc_str_buf_cat I, [2024-05-16T22:10:43.544274 #988489] INFO -- : [809/885] 1029853=test_gbk I, [2024-05-16T22:10:43.545500 #988489] INFO -- : [810/885] 1029853=test_class2name I, [2024-05-16T22:10:43.551932 #988489] INFO -- : [811/885] 1029853=test_rdoc_parser_c I, [2024-05-16T22:10:43.556528 #988489] INFO -- : [812/885] 1029864=test_comparable I, [2024-05-16T22:10:43.561164 #988489] INFO -- : [813/885] 1029864=json_fixtures_test I, [2024-05-16T22:10:43.572030 #988489] INFO -- : [814/885] 1029864=test_shapes I, [2024-05-16T22:10:43.573637 #988489] INFO -- : [815/885] 1029864=test_io_timeout I, [2024-05-16T22:10:43.576979 #988489] INFO -- : [816/885] 1029860=test_ansi_without_terminfo I, [2024-05-16T22:10:43.578137 #988489] INFO -- : [817/885] 1029864=test_gem_commands_sources_command I, [2024-05-16T22:10:43.586970 #988489] INFO -- : [818/885] 1029860=test_bmethod I, [2024-05-16T22:10:43.594305 #988489] INFO -- : [819/885] 1029860=test_ractor I, [2024-05-16T22:10:43.600268 #988489] INFO -- : [820/885] 1029849=test_euc_tw I, [2024-05-16T22:10:43.603626 #988489] INFO -- : [821/885] 1029859=test_rdoc_markup_formatter I, [2024-05-16T22:10:43.606410 #988489] INFO -- : [822/885] 1029849=test_nowrite I, [2024-05-16T22:10:43.606615 #988489] INFO -- : [823/885] 1029852=test_thread_queue I, [2024-05-16T22:10:43.609727 #988489] INFO -- : [824/885] 1029860=test_handle I, [2024-05-16T22:10:43.618486 #988489] INFO -- : [825/885] 1029859=test_wait I, [2024-05-16T22:10:43.629178 #988489] INFO -- : [826/885] 1029849=test_yaml I, [2024-05-16T22:10:43.711344 #988489] INFO -- : [827/885] 1029859=test_forwardable I, [2024-05-16T22:10:43.730604 #988489] INFO -- : [828/885] 1029859=test_big2str I, [2024-05-16T22:10:43.734948 #988489] INFO -- : [829/885] 1029859=test_gem_resolver_installed_specification I, [2024-05-16T22:10:43.757466 #988489] INFO -- : [830/885] 1029859=test_scanner_events I, [2024-05-16T22:10:43.758175 #988489] INFO -- : [831/885] 1029849=test_gem_remote_fetcher I, [2024-05-16T22:10:43.768063 #988489] INFO -- : [832/885] 1029864=test_mdns I, [2024-05-16T22:10:43.775141 #988489] INFO -- : [833/885] 1029864=test_parse I, [2024-05-16T22:10:43.778383 #988489] INFO -- : [834/885] 1029853=test_gem_dependency I, [2024-05-16T22:10:43.792817 #988489] INFO -- : [835/885] 1029859=test_gem_resolver_specification I, [2024-05-16T22:10:43.843473 #988489] INFO -- : [836/885] 1029859=test_path_to_class I, [2024-05-16T22:10:43.848252 #988489] INFO -- : [837/885] 1029859=test_rdoc_markup_verbatim I, [2024-05-16T22:10:43.852147 #988489] INFO -- : [838/885] 1029859=test_inlinecache I, [2024-05-16T22:10:43.906956 #988489] INFO -- : [839/885] 1029853=test_gem_commands_search_command I, [2024-05-16T22:10:43.911189 #988489] INFO -- : [840/885] 1029853=test_complex I, [2024-05-16T22:10:43.914592 #988489] INFO -- : [841/885] 1029859=test_gem_ext_ext_conf_builder I, [2024-05-16T22:10:44.037312 #988489] INFO -- : [842/885] 1029848=test_frozen_error I, [2024-05-16T22:10:44.042515 #988489] INFO -- : [843/885] 1029860=test_gem_stub_specification I, [2024-05-16T22:10:44.043794 #988489] INFO -- : [844/885] 1029853=test_method_cache I, [2024-05-16T22:10:44.047101 #988489] INFO -- : [845/885] 1029853=test_resource I, [2024-05-16T22:10:44.049590 #988489] INFO -- : [846/885] 1029848=test_gem_commands_signin_command I, [2024-05-16T22:10:44.056321 #988489] INFO -- : [847/885] 1029853=test_emitter I, [2024-05-16T22:10:44.062238 #988489] INFO -- : [848/885] 1029853=test_ldap I, [2024-05-16T22:10:44.063524 #988489] INFO -- : [849/885] 1029853=test_fileutils I, [2024-05-16T22:10:44.122816 #988489] INFO -- : [850/885] 1029857=test_string_processing I, [2024-05-16T22:10:44.129118 #988489] INFO -- : [851/885] 1029857=test_rdoc_options I, [2024-05-16T22:10:44.149778 #988489] INFO -- : [852/885] 1029860=test_cesu8 I, [2024-05-16T22:10:44.150644 #988489] INFO -- : [853/885] 1029848=test_econv I, [2024-05-16T22:10:44.155783 #988489] INFO -- : [854/885] 1029860=test_gem_version I, [2024-05-16T22:10:44.180629 #988489] INFO -- : [855/885] 1029858=test_too_many_dummy_encodings I, [2024-05-16T22:10:44.228223 #988489] INFO -- : [856/885] 1029860=test_gem_commands_list_command I, [2024-05-16T22:10:44.238448 #988489] INFO -- : [857/885] 1029858=test_stack I, [2024-05-16T22:10:44.239800 #988489] INFO -- : [858/885] 1029860=test_rdoc_include I, [2024-05-16T22:10:44.253535 #988489] INFO -- : [859/885] 1029856=test_reqarg I, [2024-05-16T22:10:44.280329 #988489] INFO -- : [860/885] 1029860=test_gem_resolver_index_specification I, [2024-05-16T22:10:44.335307 #988489] INFO -- : [861/885] 1029860=test_internal_ivar I, [2024-05-16T22:10:44.340337 #988489] INFO -- : [862/885] 1029860=test_rdoc_markup I, [2024-05-16T22:10:44.346599 #988489] INFO -- : [863/885] 1029860=test_gem_commands_help_command I, [2024-05-16T22:10:44.364418 #988489] INFO -- : [864/885] 1029864=test_prettyprint I, [2024-05-16T22:10:44.384437 #988489] INFO -- : [865/885] 1029864=test_tracepoint I, [2024-05-16T22:10:44.400069 #988489] INFO -- : [866/885] 1029857=test_basicsocket I, [2024-05-16T22:10:44.404280 #988489] INFO -- : [867/885] 1029853=test_utf32 I, [2024-05-16T22:10:44.405540 #988489] INFO -- : [868/885] 1029857=test_duplicate I, [2024-05-16T22:10:44.409341 #988489] INFO -- : [869/885] 1029853=parse_comments_test I, [2024-05-16T22:10:44.415612 #988489] INFO -- : [870/885] 1029857=test_noarg I, [2024-05-16T22:10:44.422205 #988489] INFO -- : [871/885] 1029860=test_tempfile I, [2024-05-16T22:10:44.458390 #988489] INFO -- : [872/885] 1029853=test_queue I, [2024-05-16T22:10:44.469076 #988489] INFO -- : [873/885] 1029853=test_function I, [2024-05-16T22:10:44.563363 #988489] INFO -- : [874/885] 1029847=test_irb I, [2024-05-16T22:10:44.626167 #988489] INFO -- : [875/885] 1029857=test_random I, [2024-05-16T22:10:44.628542 #988489] INFO -- : [876/885] 1029857=test_asn1 I, [2024-05-16T22:10:44.641360 #988489] INFO -- : [877/885] 1029856=test_const I, [2024-05-16T22:10:44.643163 #988489] INFO -- : [878/885] 1029864=test_class I, [2024-05-16T22:10:44.644520 #988489] INFO -- : [879/885] 1029857=test_rdoc_normal_class I, [2024-05-16T22:10:44.650278 #988489] INFO -- : [880/885] 1029856=test_load I, [2024-05-16T22:10:44.658725 #988489] INFO -- : [881/885] 1029856=json_string_matching_test I, [2024-05-16T22:10:44.668175 #988489] INFO -- : [882/885] 1029856=test_gem_installer I, [2024-05-16T22:10:44.690071 #988489] INFO -- : [883/885] 1029853=test_yamlstore I, [2024-05-16T22:10:44.710534 #988489] INFO -- : [884/885] 1029857=test_date_strftime I, [2024-05-16T22:10:44.721700 #988489] INFO -- : [885/885] 1029860=test_rdoc_parser_rd I, [2024-05-16T22:10:57.621197 #988489] INFO -- : Finished tests in 33.887513s, 778.5464 tests/s, 276059.2643 assertions/s. I, [2024-05-16T22:10:57.621815 #988489] INFO -- : 26383 tests, 9354962 assertions, 0 failures, 0 errors, 306 skips I, [2024-05-16T22:10:57.621836 #988489] INFO -- : I, [2024-05-16T22:10:57.621843 #988489] INFO -- : ruby -v: ruby 3.4.0dev (2024-05-16T19:35:22Z master 854cbbd5a9) [x86_64-linux] I, [2024-05-16T22:10:57.624080 #988489] INFO -- : $$$[end] "make yes-test-all TESTOPTS='--stderr-on-failure' TESTS='-j20'" exit with 0. I, [2024-05-16T22:10:57.624272 #988489] INFO -- : $$$[beg] make yes-test-rubyspec MSPECOPT='--error-output stderr --debug -j' TESTS='-j20' I, [2024-05-16T22:10:57.713197 #988489] INFO -- : BASERUBY = /usr/bin/ruby --disable=gems I, [2024-05-16T22:10:57.713233 #988489] INFO -- : CC = gcc I, [2024-05-16T22:10:57.713238 #988489] INFO -- : LD = ld I, [2024-05-16T22:10:57.713243 #988489] INFO -- : LDSHARED = gcc -shared I, [2024-05-16T22:10:57.713247 #988489] INFO -- : CFLAGS = -O3 -fno-fast-math -ggdb3 -Wall -Wextra -Wdeprecated-declarations -Wdiv-by-zero -Wduplicated-cond -Wimplicit-function-declaration -Wimplicit-int -Wpointer-arith -Wwrite-strings -Wold-style-definition -Wimplicit-fallthrough=0 -Wmissing-noreturn -Wno-cast-function-type -Wno-constant-logical-operand -Wno-long-long -Wno-missing-field-initializers -Wno-overlength-strings -Wno-packed-bitfield-compat -Wno-parentheses-equality -Wno-self-assign -Wno-tautological-compare -Wno-unused-parameter -Wno-unused-value -Wsuggest-attribute=format -Wsuggest-attribute=noreturn -Wunused-variable -Wmisleading-indentation -Wundef -fPIC I, [2024-05-16T22:10:57.713252 #988489] INFO -- : XCFLAGS = -U_FORTIFY_SOURCE -D_FORTIFY_SOURCE=2 -fstack-protector-strong -fno-strict-overflow -fvisibility=hidden -fexcess-precision=standard -DRUBY_EXPORT -I. -I.ext/include/x86_64-linux -I/tmp/ruby/src/trunk/include -I/tmp/ruby/src/trunk -I/tmp/ruby/src/trunk/prism -I/tmp/ruby/src/trunk/enc/unicode/15.0.0 I, [2024-05-16T22:10:57.713256 #988489] INFO -- : CPPFLAGS = I, [2024-05-16T22:10:57.713260 #988489] INFO -- : DLDFLAGS = -Wl,--compress-debug-sections=zlib -Wl,-soname,libruby.so.3.4 -fstack-protector-strong I, [2024-05-16T22:10:57.713263 #988489] INFO -- : SOLIBS = -lz -lrt -lrt -lgmp -ldl -lcrypt -lm -lpthread I, [2024-05-16T22:10:57.713268 #988489] INFO -- : LANG = en_US.UTF-8 I, [2024-05-16T22:10:57.713272 #988489] INFO -- : LC_ALL = I, [2024-05-16T22:10:57.713276 #988489] INFO -- : LC_CTYPE = I, [2024-05-16T22:10:57.713279 #988489] INFO -- : MFLAGS = I, [2024-05-16T22:10:57.713283 #988489] INFO -- : RUSTC = no I, [2024-05-16T22:10:57.713287 #988489] INFO -- : YJIT_RUSTC_ARGS = --crate-name=yjit --crate-type=staticlib --edition=2021 -g -C lto=thin -C opt-level=3 -C overflow-checks=on '--out-dir=/tmp/ruby/build/trunk/yjit/target/release/' /tmp/ruby/src/trunk/yjit/src/lib.rs I, [2024-05-16T22:10:57.713841 #988489] INFO -- : gcc (Ubuntu 11.4.0-1ubuntu1~22.04) 11.4.0 I, [2024-05-16T22:10:57.713861 #988489] INFO -- : Copyright (C) 2021 Free Software Foundation, Inc. I, [2024-05-16T22:10:57.713867 #988489] INFO -- : This is free software; see the source for copying conditions. There is NO I, [2024-05-16T22:10:57.713871 #988489] INFO -- : warranty; not even for MERCHANTABILITY or FITNESS FOR A PARTICULAR PURPOSE. I, [2024-05-16T22:10:57.713875 #988489] INFO -- : I, [2024-05-16T22:10:57.715547 #988489] INFO -- : generating enc.mk I, [2024-05-16T22:10:57.834084 #988489] INFO -- : making enc I, [2024-05-16T22:10:57.851598 #988489] INFO -- : make[1]: Entering directory '/tmp/ruby/build/trunk' I, [2024-05-16T22:10:57.851629 #988489] INFO -- : make[1]: Nothing to be done for 'enc'. I, [2024-05-16T22:10:57.851637 #988489] INFO -- : make[1]: Leaving directory '/tmp/ruby/build/trunk' I, [2024-05-16T22:10:57.852507 #988489] INFO -- : making srcs under enc I, [2024-05-16T22:10:57.882146 #988489] INFO -- : make[1]: Entering directory '/tmp/ruby/build/trunk' I, [2024-05-16T22:10:57.882173 #988489] INFO -- : make[1]: Nothing to be done for 'srcs'. I, [2024-05-16T22:10:57.882182 #988489] INFO -- : make[1]: Leaving directory '/tmp/ruby/build/trunk' I, [2024-05-16T22:10:57.883258 #988489] INFO -- : generating transdb.h I, [2024-05-16T22:10:57.979400 #988489] INFO -- : transdb.h unchanged I, [2024-05-16T22:10:57.980695 #988489] INFO -- : making trans I, [2024-05-16T22:10:58.014350 #988489] INFO -- : make[1]: Entering directory '/tmp/ruby/build/trunk' I, [2024-05-16T22:10:58.014371 #988489] INFO -- : make[1]: Nothing to be done for 'trans'. I, [2024-05-16T22:10:58.014378 #988489] INFO -- : make[1]: Leaving directory '/tmp/ruby/build/trunk' I, [2024-05-16T22:10:58.015060 #988489] INFO -- : making encs I, [2024-05-16T22:10:58.051706 #988489] INFO -- : make[1]: Entering directory '/tmp/ruby/build/trunk' I, [2024-05-16T22:10:58.051730 #988489] INFO -- : make[1]: Nothing to be done for 'encs'. I, [2024-05-16T22:10:58.051738 #988489] INFO -- : make[1]: Leaving directory '/tmp/ruby/build/trunk' I, [2024-05-16T22:10:58.053462 #988489] INFO -- : generating makefiles ext/configure-ext.mk I, [2024-05-16T22:10:58.080005 #988489] INFO -- : ext/configure-ext.mk updated I, [2024-05-16T22:10:58.082407 #988489] INFO -- : make[1]: Entering directory '/tmp/ruby/build/trunk' I, [2024-05-16T22:10:59.423330 #988489] INFO -- : make[1]: Leaving directory '/tmp/ruby/build/trunk' I, [2024-05-16T22:10:59.424074 #988489] INFO -- : generating makefile exts.mk I, [2024-05-16T22:10:59.462378 #988489] INFO -- : exts.mk unchanged I, [2024-05-16T22:10:59.466840 #988489] INFO -- : make[1]: Entering directory '/tmp/ruby/build/trunk' I, [2024-05-16T22:10:59.811515 #988489] INFO -- : make[2]: Entering directory '/tmp/ruby/build/trunk/ext/coverage' I, [2024-05-16T22:10:59.815484 #988489] INFO -- : make[2]: Leaving directory '/tmp/ruby/build/trunk/ext/coverage' I, [2024-05-16T22:10:59.821995 #988489] INFO -- : make[2]: Entering directory '/tmp/ruby/build/trunk/ext/date' I, [2024-05-16T22:10:59.826726 #988489] INFO -- : make[2]: Leaving directory '/tmp/ruby/build/trunk/ext/date' I, [2024-05-16T22:10:59.830745 #988489] INFO -- : make[2]: Entering directory '/tmp/ruby/build/trunk/ext/digest' I, [2024-05-16T22:10:59.839649 #988489] INFO -- : make[2]: Leaving directory '/tmp/ruby/build/trunk/ext/digest' I, [2024-05-16T22:10:59.865949 #988489] INFO -- : make[2]: Entering directory '/tmp/ruby/build/trunk/ext/digest/sha2' I, [2024-05-16T22:10:59.870842 #988489] INFO -- : make[2]: Leaving directory '/tmp/ruby/build/trunk/ext/digest/sha2' I, [2024-05-16T22:10:59.892259 #988489] INFO -- : make[2]: Entering directory '/tmp/ruby/build/trunk/ext/fiddle' I, [2024-05-16T22:10:59.901015 #988489] INFO -- : make[2]: Leaving directory '/tmp/ruby/build/trunk/ext/fiddle' I, [2024-05-16T22:10:59.905600 #988489] INFO -- : make[2]: Entering directory '/tmp/ruby/build/trunk/ext/io/console' I, [2024-05-16T22:10:59.909708 #988489] INFO -- : make[2]: Leaving directory '/tmp/ruby/build/trunk/ext/io/console' I, [2024-05-16T22:10:59.922328 #988489] INFO -- : make[2]: Entering directory '/tmp/ruby/build/trunk/ext/json' I, [2024-05-16T22:10:59.932937 #988489] INFO -- : make[2]: Leaving directory '/tmp/ruby/build/trunk/ext/json' I, [2024-05-16T22:10:59.948082 #988489] INFO -- : make[2]: Entering directory '/tmp/ruby/build/trunk/ext/monitor' I, [2024-05-16T22:10:59.952131 #988489] INFO -- : make[2]: Leaving directory '/tmp/ruby/build/trunk/ext/monitor' I, [2024-05-16T22:10:59.959393 #988489] INFO -- : make[2]: Entering directory '/tmp/ruby/build/trunk/ext/objspace' I, [2024-05-16T22:10:59.965416 #988489] INFO -- : make[2]: Leaving directory '/tmp/ruby/build/trunk/ext/objspace' I, [2024-05-16T22:10:59.983179 #988489] INFO -- : make[2]: Entering directory '/tmp/ruby/build/trunk/ext/openssl' I, [2024-05-16T22:10:59.998704 #988489] INFO -- : make[2]: Leaving directory '/tmp/ruby/build/trunk/ext/openssl' I, [2024-05-16T22:11:00.003030 #988489] INFO -- : make[2]: Entering directory '/tmp/ruby/build/trunk/ext/pathname' I, [2024-05-16T22:11:00.007130 #988489] INFO -- : make[2]: Leaving directory '/tmp/ruby/build/trunk/ext/pathname' I, [2024-05-16T22:11:00.014266 #988489] INFO -- : make[2]: Entering directory '/tmp/ruby/build/trunk/ext/psych' I, [2024-05-16T22:11:00.038280 #988489] INFO -- : make[2]: Leaving directory '/tmp/ruby/build/trunk/ext/psych' I, [2024-05-16T22:11:00.042882 #988489] INFO -- : make[2]: Entering directory '/tmp/ruby/build/trunk/ext/pty' I, [2024-05-16T22:11:00.046977 #988489] INFO -- : make[2]: Leaving directory '/tmp/ruby/build/trunk/ext/pty' I, [2024-05-16T22:11:00.063255 #988489] INFO -- : make[2]: Entering directory '/tmp/ruby/build/trunk/ext/ripper' I, [2024-05-16T22:11:00.070902 #988489] INFO -- : make[2]: Leaving directory '/tmp/ruby/build/trunk/ext/ripper' I, [2024-05-16T22:11:00.073366 #988489] INFO -- : make[2]: Entering directory '/tmp/ruby/build/trunk/ext/rubyvm' I, [2024-05-16T22:11:00.076648 #988489] INFO -- : make[2]: Leaving directory '/tmp/ruby/build/trunk/ext/rubyvm' I, [2024-05-16T22:11:00.089926 #988489] INFO -- : make[2]: Entering directory '/tmp/ruby/build/trunk/ext/socket' I, [2024-05-16T22:11:00.100698 #988489] INFO -- : make[2]: Leaving directory '/tmp/ruby/build/trunk/ext/socket' I, [2024-05-16T22:11:00.119005 #988489] INFO -- : make[2]: Entering directory '/tmp/ruby/build/trunk/.bundle/gems/bigdecimal-3.1.8/ext/bigdecimal' I, [2024-05-16T22:11:00.143802 #988489] INFO -- : make[2]: Leaving directory '/tmp/ruby/build/trunk/.bundle/gems/bigdecimal-3.1.8/ext/bigdecimal' I, [2024-05-16T22:11:00.145731 #988489] INFO -- : make[2]: Entering directory '/tmp/ruby/build/trunk/.bundle/gems/debug-1.9.2/ext/debug' I, [2024-05-16T22:11:00.166980 #988489] INFO -- : make[2]: Leaving directory '/tmp/ruby/build/trunk/.bundle/gems/debug-1.9.2/ext/debug' I, [2024-05-16T22:11:00.168896 #988489] INFO -- : make[2]: Entering directory '/tmp/ruby/build/trunk/.bundle/gems/nkf-0.2.0/ext/nkf' I, [2024-05-16T22:11:00.191093 #988489] INFO -- : make[2]: Leaving directory '/tmp/ruby/build/trunk/.bundle/gems/nkf-0.2.0/ext/nkf' I, [2024-05-16T22:11:00.193058 #988489] INFO -- : make[2]: Entering directory '/tmp/ruby/build/trunk/.bundle/gems/racc-1.7.3/ext/racc/cparse' I, [2024-05-16T22:11:00.220516 #988489] INFO -- : make[2]: Leaving directory '/tmp/ruby/build/trunk/.bundle/gems/racc-1.7.3/ext/racc/cparse' I, [2024-05-16T22:11:00.224042 #988489] INFO -- : make[2]: Entering directory '/tmp/ruby/build/trunk/.bundle/gems/rbs-3.4.4/ext/rbs_extension' I, [2024-05-16T22:11:00.250631 #988489] INFO -- : make[2]: Leaving directory '/tmp/ruby/build/trunk/.bundle/gems/rbs-3.4.4/ext/rbs_extension' I, [2024-05-16T22:11:00.252634 #988489] INFO -- : make[2]: Entering directory '/tmp/ruby/build/trunk/.bundle/gems/syslog-0.1.2/ext/syslog' I, [2024-05-16T22:11:00.274570 #988489] INFO -- : make[2]: Leaving directory '/tmp/ruby/build/trunk/.bundle/gems/syslog-0.1.2/ext/syslog' I, [2024-05-16T22:11:00.297840 #988489] INFO -- : make[2]: Entering directory '/tmp/ruby/build/trunk' I, [2024-05-16T22:11:00.365821 #988489] INFO -- : make[2]: 'ruby' is up to date. I, [2024-05-16T22:11:00.365861 #988489] INFO -- : make[2]: Leaving directory '/tmp/ruby/build/trunk' I, [2024-05-16T22:11:00.366152 #988489] INFO -- : make[1]: Leaving directory '/tmp/ruby/build/trunk' I, [2024-05-16T22:11:00.369796 #988489] INFO -- : make[1]: Entering directory '/tmp/ruby/build/trunk' I, [2024-05-16T22:11:00.369825 #988489] INFO -- : make[1]: Nothing to be done for 'note'. I, [2024-05-16T22:11:00.369832 #988489] INFO -- : make[1]: Leaving directory '/tmp/ruby/build/trunk' E, [2024-05-16T22:11:00.427000 #988489] ERROR -- : $ /tmp/ruby/build/trunk/miniruby -I/tmp/ruby/src/trunk/lib /tmp/ruby/src/trunk/tool/runruby.rb --archdir=/tmp/ruby/build/trunk --extout=.ext -- /tmp/ruby/src/trunk/spec/mspec/bin/mspec-run -B /tmp/ruby/src/trunk/spec/default.mspec --error-output stderr --debug -fy -o /tmp/rubytest.og2eua/1-mspec-multi-0 E, [2024-05-16T22:11:00.427185 #988489] ERROR -- : $ /tmp/ruby/build/trunk/miniruby -I/tmp/ruby/src/trunk/lib /tmp/ruby/src/trunk/tool/runruby.rb --archdir=/tmp/ruby/build/trunk --extout=.ext -- /tmp/ruby/src/trunk/spec/mspec/bin/mspec-run -B /tmp/ruby/src/trunk/spec/default.mspec --error-output stderr --debug -fy -o /tmp/rubytest.og2eua/2-mspec-multi-1 E, [2024-05-16T22:11:00.427445 #988489] ERROR -- : $ /tmp/ruby/build/trunk/miniruby -I/tmp/ruby/src/trunk/lib /tmp/ruby/src/trunk/tool/runruby.rb --archdir=/tmp/ruby/build/trunk --extout=.ext -- /tmp/ruby/src/trunk/spec/mspec/bin/mspec-run -B /tmp/ruby/src/trunk/spec/default.mspec --error-output stderr --debug -fy -o /tmp/rubytest.og2eua/3-mspec-multi-2 E, [2024-05-16T22:11:00.427588 #988489] ERROR -- : $ /tmp/ruby/build/trunk/miniruby -I/tmp/ruby/src/trunk/lib /tmp/ruby/src/trunk/tool/runruby.rb --archdir=/tmp/ruby/build/trunk --extout=.ext -- /tmp/ruby/src/trunk/spec/mspec/bin/mspec-run -B /tmp/ruby/src/trunk/spec/default.mspec --error-output stderr --debug -fy -o /tmp/rubytest.og2eua/4-mspec-multi-3 E, [2024-05-16T22:11:00.427889 #988489] ERROR -- : $ /tmp/ruby/build/trunk/miniruby -I/tmp/ruby/src/trunk/lib /tmp/ruby/src/trunk/tool/runruby.rb --archdir=/tmp/ruby/build/trunk --extout=.ext -- /tmp/ruby/src/trunk/spec/mspec/bin/mspec-run -B /tmp/ruby/src/trunk/spec/default.mspec --error-output stderr --debug -fy -o /tmp/rubytest.og2eua/5-mspec-multi-4 E, [2024-05-16T22:11:00.428104 #988489] ERROR -- : $ /tmp/ruby/build/trunk/miniruby -I/tmp/ruby/src/trunk/lib /tmp/ruby/src/trunk/tool/runruby.rb --archdir=/tmp/ruby/build/trunk --extout=.ext -- /tmp/ruby/src/trunk/spec/mspec/bin/mspec-run -B /tmp/ruby/src/trunk/spec/default.mspec --error-output stderr --debug -fy -o /tmp/rubytest.og2eua/6-mspec-multi-5 E, [2024-05-16T22:11:00.428228 #988489] ERROR -- : $ /tmp/ruby/build/trunk/miniruby -I/tmp/ruby/src/trunk/lib /tmp/ruby/src/trunk/tool/runruby.rb --archdir=/tmp/ruby/build/trunk --extout=.ext -- /tmp/ruby/src/trunk/spec/mspec/bin/mspec-run -B /tmp/ruby/src/trunk/spec/default.mspec --error-output stderr --debug -fy -o /tmp/rubytest.og2eua/7-mspec-multi-6 E, [2024-05-16T22:11:00.428426 #988489] ERROR -- : $ /tmp/ruby/build/trunk/miniruby -I/tmp/ruby/src/trunk/lib /tmp/ruby/src/trunk/tool/runruby.rb --archdir=/tmp/ruby/build/trunk --extout=.ext -- /tmp/ruby/src/trunk/spec/mspec/bin/mspec-run -B /tmp/ruby/src/trunk/spec/default.mspec --error-output stderr --debug -fy -o /tmp/rubytest.og2eua/8-mspec-multi-7 E, [2024-05-16T22:11:00.428656 #988489] ERROR -- : $ /tmp/ruby/build/trunk/miniruby -I/tmp/ruby/src/trunk/lib /tmp/ruby/src/trunk/tool/runruby.rb --archdir=/tmp/ruby/build/trunk --extout=.ext -- /tmp/ruby/src/trunk/spec/mspec/bin/mspec-run -B /tmp/ruby/src/trunk/spec/default.mspec --error-output stderr --debug -fy -o /tmp/rubytest.og2eua/9-mspec-multi-8 E, [2024-05-16T22:11:00.428884 #988489] ERROR -- : $ /tmp/ruby/build/trunk/miniruby -I/tmp/ruby/src/trunk/lib /tmp/ruby/src/trunk/tool/runruby.rb --archdir=/tmp/ruby/build/trunk --extout=.ext -- /tmp/ruby/src/trunk/spec/mspec/bin/mspec-run -B /tmp/ruby/src/trunk/spec/default.mspec --error-output stderr --debug -fy -o /tmp/rubytest.og2eua/10-mspec-multi-9 E, [2024-05-16T22:11:00.429217 #988489] ERROR -- : $ /tmp/ruby/build/trunk/miniruby -I/tmp/ruby/src/trunk/lib /tmp/ruby/src/trunk/tool/runruby.rb --archdir=/tmp/ruby/build/trunk --extout=.ext -- /tmp/ruby/src/trunk/spec/mspec/bin/mspec-run -B /tmp/ruby/src/trunk/spec/default.mspec --error-output stderr --debug -fy -o /tmp/rubytest.og2eua/11-mspec-multi-10 E, [2024-05-16T22:11:00.429390 #988489] ERROR -- : $ /tmp/ruby/build/trunk/miniruby -I/tmp/ruby/src/trunk/lib /tmp/ruby/src/trunk/tool/runruby.rb --archdir=/tmp/ruby/build/trunk --extout=.ext -- /tmp/ruby/src/trunk/spec/mspec/bin/mspec-run -B /tmp/ruby/src/trunk/spec/default.mspec --error-output stderr --debug -fy -o /tmp/rubytest.og2eua/12-mspec-multi-11 E, [2024-05-16T22:11:00.429585 #988489] ERROR -- : $ /tmp/ruby/build/trunk/miniruby -I/tmp/ruby/src/trunk/lib /tmp/ruby/src/trunk/tool/runruby.rb --archdir=/tmp/ruby/build/trunk --extout=.ext -- /tmp/ruby/src/trunk/spec/mspec/bin/mspec-run -B /tmp/ruby/src/trunk/spec/default.mspec --error-output stderr --debug -fy -o /tmp/rubytest.og2eua/13-mspec-multi-12 E, [2024-05-16T22:11:00.429759 #988489] ERROR -- : $ /tmp/ruby/build/trunk/miniruby -I/tmp/ruby/src/trunk/lib /tmp/ruby/src/trunk/tool/runruby.rb --archdir=/tmp/ruby/build/trunk --extout=.ext -- /tmp/ruby/src/trunk/spec/mspec/bin/mspec-run -B /tmp/ruby/src/trunk/spec/default.mspec --error-output stderr --debug -fy -o /tmp/rubytest.og2eua/14-mspec-multi-13 E, [2024-05-16T22:11:00.429986 #988489] ERROR -- : $ /tmp/ruby/build/trunk/miniruby -I/tmp/ruby/src/trunk/lib /tmp/ruby/src/trunk/tool/runruby.rb --archdir=/tmp/ruby/build/trunk --extout=.ext -- /tmp/ruby/src/trunk/spec/mspec/bin/mspec-run -B /tmp/ruby/src/trunk/spec/default.mspec --error-output stderr --debug -fy -o /tmp/rubytest.og2eua/15-mspec-multi-14 E, [2024-05-16T22:11:00.430091 #988489] ERROR -- : $ /tmp/ruby/build/trunk/miniruby -I/tmp/ruby/src/trunk/lib /tmp/ruby/src/trunk/tool/runruby.rb --archdir=/tmp/ruby/build/trunk --extout=.ext -- /tmp/ruby/src/trunk/spec/mspec/bin/mspec-run -B /tmp/ruby/src/trunk/spec/default.mspec --error-output stderr --debug -fy -o /tmp/rubytest.og2eua/16-mspec-multi-15 E, [2024-05-16T22:11:00.430282 #988489] ERROR -- : $ /tmp/ruby/build/trunk/miniruby -I/tmp/ruby/src/trunk/lib /tmp/ruby/src/trunk/tool/runruby.rb --archdir=/tmp/ruby/build/trunk --extout=.ext -- /tmp/ruby/src/trunk/spec/mspec/bin/mspec-run -B /tmp/ruby/src/trunk/spec/default.mspec --error-output stderr --debug -fy -o /tmp/rubytest.og2eua/17-mspec-multi-16 E, [2024-05-16T22:11:00.430472 #988489] ERROR -- : $ /tmp/ruby/build/trunk/miniruby -I/tmp/ruby/src/trunk/lib /tmp/ruby/src/trunk/tool/runruby.rb --archdir=/tmp/ruby/build/trunk --extout=.ext -- /tmp/ruby/src/trunk/spec/mspec/bin/mspec-run -B /tmp/ruby/src/trunk/spec/default.mspec --error-output stderr --debug -fy -o /tmp/rubytest.og2eua/18-mspec-multi-17 E, [2024-05-16T22:11:00.432787 #988489] ERROR -- : $ /tmp/ruby/build/trunk/miniruby -I/tmp/ruby/src/trunk/lib /tmp/ruby/src/trunk/tool/runruby.rb --archdir=/tmp/ruby/build/trunk --extout=.ext -- /tmp/ruby/src/trunk/spec/mspec/bin/mspec-run -B /tmp/ruby/src/trunk/spec/default.mspec --error-output stderr --debug -fy -o /tmp/rubytest.og2eua/19-mspec-multi-18 E, [2024-05-16T22:11:00.432986 #988489] ERROR -- : $ /tmp/ruby/build/trunk/miniruby -I/tmp/ruby/src/trunk/lib /tmp/ruby/src/trunk/tool/runruby.rb --archdir=/tmp/ruby/build/trunk --extout=.ext -- /tmp/ruby/src/trunk/spec/mspec/bin/mspec-run -B /tmp/ruby/src/trunk/spec/default.mspec --error-output stderr --debug -fy -o /tmp/rubytest.og2eua/20-mspec-multi-19 I, [2024-05-16T22:11:00.597750 #988489] INFO -- : ruby 3.4.0dev (2024-05-16T19:35:22Z master 854cbbd5a9) [x86_64-linux] I, [2024-05-16T22:11:01.192833 #988489] INFO -- : 0 ......................................................................... I, [2024-05-16T22:11:01.638621 #988489] INFO -- : 73 ......................................................................... I, [2024-05-16T22:11:01.770248 #988489] INFO -- : 146 ......................................................................... I, [2024-05-16T22:11:01.826485 #988489] INFO -- : 219 ......................................................................... I, [2024-05-16T22:11:01.879074 #988489] INFO -- : 292 ......................................................................... I, [2024-05-16T22:11:01.918496 #988489] INFO -- : 365 ......................................................................... I, [2024-05-16T22:11:01.941599 #988489] INFO -- : 438 ......................................................................... I, [2024-05-16T22:11:01.960103 #988489] INFO -- : 511 ......................................................................... I, [2024-05-16T22:11:01.977289 #988489] INFO -- : 584 ......................................................................... I, [2024-05-16T22:11:02.052023 #988489] INFO -- : 657 ......................................................................... I, [2024-05-16T22:11:02.083747 #988489] INFO -- : 730 ......................................................................... I, [2024-05-16T22:11:02.097826 #988489] INFO -- : 803 ......................................................................... I, [2024-05-16T22:11:02.128201 #988489] INFO -- : 876 ......................................................................... I, [2024-05-16T22:11:02.161371 #988489] INFO -- : 949 ......................................................................... I, [2024-05-16T22:11:02.247982 #988489] INFO -- : 1022 ......................................................................... I, [2024-05-16T22:11:02.416967 #988489] INFO -- : 1095 ......................................................................... I, [2024-05-16T22:11:02.532710 #988489] INFO -- : 1168 ......................................................................... I, [2024-05-16T22:11:02.585439 #988489] INFO -- : 1241 ......................................................................... I, [2024-05-16T22:11:02.632677 #988489] INFO -- : 1314 ......................................................................... I, [2024-05-16T22:11:02.648824 #988489] INFO -- : 1387 ......................................................................... I, [2024-05-16T22:11:02.743782 #988489] INFO -- : 1460 ......................................................................... I, [2024-05-16T22:11:03.220311 #988489] INFO -- : 1533 ......................................................................... I, [2024-05-16T22:11:03.282188 #988489] INFO -- : 1606 ......................................................................... I, [2024-05-16T22:11:03.372003 #988489] INFO -- : 1679 ......................................................................... I, [2024-05-16T22:11:03.469018 #988489] INFO -- : 1752 ......................................................................... I, [2024-05-16T22:11:03.573863 #988489] INFO -- : 1825 ......................................................................... I, [2024-05-16T22:11:03.676543 #988489] INFO -- : 1898 ......................................................................... I, [2024-05-16T22:11:03.749942 #988489] INFO -- : 1971 ......................................................................... I, [2024-05-16T22:11:03.818202 #988489] INFO -- : 2044 ......................................................................... I, [2024-05-16T22:11:03.876280 #988489] INFO -- : 2117 ......................................................................... I, [2024-05-16T22:11:03.895448 #988489] INFO -- : 2190 ......................................................................... I, [2024-05-16T22:11:03.920289 #988489] INFO -- : 2263 ......................................................................... I, [2024-05-16T22:11:03.933945 #988489] INFO -- : 2336 ......................................................................... I, [2024-05-16T22:11:03.969269 #988489] INFO -- : 2409 ......................................................................... I, [2024-05-16T22:11:04.078908 #988489] INFO -- : 2482 ......................................................................... I, [2024-05-16T22:11:04.101376 #988489] INFO -- : 2555 ......................................................................... I, [2024-05-16T22:11:04.196017 #988489] INFO -- : 2628 ......................................................................... I, [2024-05-16T22:11:04.283862 #988489] INFO -- : 2701 ......................................................................... I, [2024-05-16T22:11:04.318126 #988489] INFO -- : 2774 ......................................................................... I, [2024-05-16T22:11:04.377140 #988489] INFO -- : 2847 ......................................................................... I, [2024-05-16T22:11:04.407488 #988489] INFO -- : 2920 ......................................................................... I, [2024-05-16T22:11:04.432394 #988489] INFO -- : 2993 ......................................................................... I, [2024-05-16T22:11:04.454988 #988489] INFO -- : 3066 ......................................................................... I, [2024-05-16T22:11:04.470483 #988489] INFO -- : 3139 ......................................................................... I, [2024-05-16T22:11:04.479313 #988489] INFO -- : 3212 ......................................................................... I, [2024-05-16T22:11:04.509212 #988489] INFO -- : 3285 ......................................................................... I, [2024-05-16T22:11:08.487320 #988489] INFO -- : 3358 ........................................................................ I, [2024-05-16T22:11:08.487399 #988489] INFO -- : I, [2024-05-16T22:11:08.487412 #988489] INFO -- : Finished in 8.058592 seconds I, [2024-05-16T22:11:08.487420 #988489] INFO -- : I, [2024-05-16T22:11:08.487428 #988489] INFO -- : 3429 files, 32611 examples, 168441 expectations, 0 failures, 0 errors, 0 tagged I, [2024-05-16T22:11:08.490747 #988489] INFO -- : $$$[end] "make yes-test-rubyspec MSPECOPT='--error-output stderr --debug -j' TESTS='-j20'" exit with 0.