# Logfile created on 2024-05-16 22:06:50 +0000 by logger.rb/v1.4.3 I, [2024-05-16T22:06:50.946018 #428793] INFO -- : #, @formatter=nil, @logdev=#, @binmode=false, @mon_data=#, @mon_data_owner_object_id=860>>> I, [2024-05-16T22:06:50.946145 #428793] INFO -- : $$$[beg] make update-unicode -j20 I, [2024-05-16T22:06:51.005425 #428793] INFO -- : Downloading Unicode emoji 15.0 files... I, [2024-05-16T22:06:51.005654 #428793] INFO -- : Downloading Unicode emoji 15.0 files... I, [2024-05-16T22:06:51.006069 #428793] INFO -- : Downloading Unicode emoji 15.0 files... I, [2024-05-16T22:06:51.049622 #428793] INFO -- : made symlink emoji/15.0/emoji-sequences.txt to /tmp/ruby/src/trunk/.downloaded-cache/emoji/15.0/emoji-sequences.txt I, [2024-05-16T22:06:51.049928 #428793] INFO -- : downloading emoji/15.0/emoji-test.txt ... /tmp/ruby/src/trunk/enc/unicode/data/emoji/15.0/emoji-sequences.txt already exists I, [2024-05-16T22:06:51.049988 #428793] INFO -- : downloading emoji/15.0/emoji-test.txt ... /tmp/ruby/src/trunk/enc/unicode/data/emoji/15.0/emoji-sequences.txt already exists E, [2024-05-16T22:06:51.509656 #428793] ERROR -- : /tmp/ruby/src/trunk/tool/downloader.rb:302:in `rescue in download': failed to download emoji/15.0/emoji-test.txt (RuntimeError) E, [2024-05-16T22:06:51.509803 #428793] ERROR -- : OpenURI::HTTPError: 403 Forbidden: https://www.unicode.org/Public/emoji/15.0/emoji-test.txt E, [2024-05-16T22:06:51.509828 #428793] ERROR -- : from /tmp/ruby/src/trunk/tool/downloader.rb:201:in `download' E, [2024-05-16T22:06:51.509842 #428793] ERROR -- : from /tmp/ruby/src/trunk/tool/downloader.rb:136:in `download' E, [2024-05-16T22:06:51.509857 #428793] ERROR -- : from /tmp/ruby/src/trunk/tool/downloader.rb:482:in `block in
' E, [2024-05-16T22:06:51.509871 #428793] ERROR -- : from /tmp/ruby/src/trunk/tool/downloader.rb:465:in `each' E, [2024-05-16T22:06:51.509884 #428793] ERROR -- : from /tmp/ruby/src/trunk/tool/downloader.rb:465:in `
' E, [2024-05-16T22:06:51.509897 #428793] ERROR -- : /usr/lib/ruby/3.0.0/open-uri.rb:364:in `open_http': 403 Forbidden (OpenURI::HTTPError) E, [2024-05-16T22:06:51.509910 #428793] ERROR -- : from /usr/lib/ruby/3.0.0/open-uri.rb:741:in `buffer_open' E, [2024-05-16T22:06:51.509927 #428793] ERROR -- : from /usr/lib/ruby/3.0.0/open-uri.rb:212:in `block in open_loop' E, [2024-05-16T22:06:51.509942 #428793] ERROR -- : from /usr/lib/ruby/3.0.0/open-uri.rb:210:in `catch' E, [2024-05-16T22:06:51.509954 #428793] ERROR -- : from /usr/lib/ruby/3.0.0/open-uri.rb:210:in `open_loop' E, [2024-05-16T22:06:51.509965 #428793] ERROR -- : from /usr/lib/ruby/3.0.0/open-uri.rb:151:in `open_uri' E, [2024-05-16T22:06:51.509977 #428793] ERROR -- : from /usr/lib/ruby/3.0.0/open-uri.rb:721:in `open' E, [2024-05-16T22:06:51.509988 #428793] ERROR -- : from /usr/lib/ruby/3.0.0/open-uri.rb:729:in `read' E, [2024-05-16T22:06:51.510018 #428793] ERROR -- : from /tmp/ruby/src/trunk/tool/downloader.rb:247:in `block in download' E, [2024-05-16T22:06:51.510031 #428793] ERROR -- : from /tmp/ruby/src/trunk/tool/downloader.rb:378:in `with_retry' E, [2024-05-16T22:06:51.510043 #428793] ERROR -- : from /tmp/ruby/src/trunk/tool/downloader.rb:246:in `download' E, [2024-05-16T22:06:51.510059 #428793] ERROR -- : from /tmp/ruby/src/trunk/tool/downloader.rb:136:in `download' E, [2024-05-16T22:06:51.510077 #428793] ERROR -- : from /tmp/ruby/src/trunk/tool/downloader.rb:482:in `block in
' E, [2024-05-16T22:06:51.510089 #428793] ERROR -- : from /tmp/ruby/src/trunk/tool/downloader.rb:465:in `each' E, [2024-05-16T22:06:51.510100 #428793] ERROR -- : from /tmp/ruby/src/trunk/tool/downloader.rb:465:in `
' E, [2024-05-16T22:06:51.510997 #428793] ERROR -- : /tmp/ruby/src/trunk/tool/downloader.rb:302:in `rescue in download': failed to download emoji/15.0/emoji-test.txt (RuntimeError) E, [2024-05-16T22:06:51.511074 #428793] ERROR -- : OpenURI::HTTPError: 403 Forbidden: https://www.unicode.org/Public/emoji/15.0/emoji-test.txt E, [2024-05-16T22:06:51.511092 #428793] ERROR -- : from /tmp/ruby/src/trunk/tool/downloader.rb:201:in `download' E, [2024-05-16T22:06:51.511117 #428793] ERROR -- : from /tmp/ruby/src/trunk/tool/downloader.rb:136:in `download' E, [2024-05-16T22:06:51.511129 #428793] ERROR -- : from /tmp/ruby/src/trunk/tool/downloader.rb:482:in `block in
' E, [2024-05-16T22:06:51.511140 #428793] ERROR -- : from /tmp/ruby/src/trunk/tool/downloader.rb:465:in `each' E, [2024-05-16T22:06:51.511150 #428793] ERROR -- : from /tmp/ruby/src/trunk/tool/downloader.rb:465:in `
' E, [2024-05-16T22:06:51.511161 #428793] ERROR -- : /usr/lib/ruby/3.0.0/open-uri.rb:364:in `open_http': 403 Forbidden (OpenURI::HTTPError) E, [2024-05-16T22:06:51.511172 #428793] ERROR -- : from /usr/lib/ruby/3.0.0/open-uri.rb:741:in `buffer_open' E, [2024-05-16T22:06:51.511182 #428793] ERROR -- : from /usr/lib/ruby/3.0.0/open-uri.rb:212:in `block in open_loop' E, [2024-05-16T22:06:51.511193 #428793] ERROR -- : from /usr/lib/ruby/3.0.0/open-uri.rb:210:in `catch' E, [2024-05-16T22:06:51.511214 #428793] ERROR -- : from /usr/lib/ruby/3.0.0/open-uri.rb:210:in `open_loop' E, [2024-05-16T22:06:51.511224 #428793] ERROR -- : from /usr/lib/ruby/3.0.0/open-uri.rb:151:in `open_uri' E, [2024-05-16T22:06:51.511235 #428793] ERROR -- : from /usr/lib/ruby/3.0.0/open-uri.rb:721:in `open' E, [2024-05-16T22:06:51.511245 #428793] ERROR -- : from /usr/lib/ruby/3.0.0/open-uri.rb:729:in `read' E, [2024-05-16T22:06:51.511256 #428793] ERROR -- : from /tmp/ruby/src/trunk/tool/downloader.rb:247:in `block in download' E, [2024-05-16T22:06:51.511267 #428793] ERROR -- : from /tmp/ruby/src/trunk/tool/downloader.rb:378:in `with_retry' E, [2024-05-16T22:06:51.511277 #428793] ERROR -- : from /tmp/ruby/src/trunk/tool/downloader.rb:246:in `download' E, [2024-05-16T22:06:51.511287 #428793] ERROR -- : from /tmp/ruby/src/trunk/tool/downloader.rb:136:in `download' E, [2024-05-16T22:06:51.511298 #428793] ERROR -- : from /tmp/ruby/src/trunk/tool/downloader.rb:482:in `block in
' E, [2024-05-16T22:06:51.511311 #428793] ERROR -- : from /tmp/ruby/src/trunk/tool/downloader.rb:465:in `each' E, [2024-05-16T22:06:51.511322 #428793] ERROR -- : from /tmp/ruby/src/trunk/tool/downloader.rb:465:in `
' E, [2024-05-16T22:06:51.511332 #428793] ERROR -- : /tmp/ruby/src/trunk/tool/downloader.rb:302:in `rescue in download': failed to download emoji/15.0/emoji-test.txt (RuntimeError) E, [2024-05-16T22:06:51.511346 #428793] ERROR -- : OpenURI::HTTPError: 403 Forbidden: https://www.unicode.org/Public/emoji/15.0/emoji-test.txt E, [2024-05-16T22:06:51.511356 #428793] ERROR -- : from /tmp/ruby/src/trunk/tool/downloader.rb:201:in `download' E, [2024-05-16T22:06:51.511367 #428793] ERROR -- : from /tmp/ruby/src/trunk/tool/downloader.rb:136:in `download' E, [2024-05-16T22:06:51.511378 #428793] ERROR -- : from /tmp/ruby/src/trunk/tool/downloader.rb:482:in `block in
' E, [2024-05-16T22:06:51.511404 #428793] ERROR -- : from /tmp/ruby/src/trunk/tool/downloader.rb:465:in `each' E, [2024-05-16T22:06:51.511415 #428793] ERROR -- : from /tmp/ruby/src/trunk/tool/downloader.rb:465:in `
' E, [2024-05-16T22:06:51.511425 #428793] ERROR -- : /usr/lib/ruby/3.0.0/open-uri.rb:364:in `open_http': 403 Forbidden (OpenURI::HTTPError) E, [2024-05-16T22:06:51.511436 #428793] ERROR -- : from /usr/lib/ruby/3.0.0/open-uri.rb:741:in `buffer_open' E, [2024-05-16T22:06:51.511447 #428793] ERROR -- : from /usr/lib/ruby/3.0.0/open-uri.rb:212:in `block in open_loop' E, [2024-05-16T22:06:51.511457 #428793] ERROR -- : from /usr/lib/ruby/3.0.0/open-uri.rb:210:in `catch' E, [2024-05-16T22:06:51.511468 #428793] ERROR -- : from /usr/lib/ruby/3.0.0/open-uri.rb:210:in `open_loop' E, [2024-05-16T22:06:51.511478 #428793] ERROR -- : from /usr/lib/ruby/3.0.0/open-uri.rb:151:in `open_uri' E, [2024-05-16T22:06:51.511491 #428793] ERROR -- : from /usr/lib/ruby/3.0.0/open-uri.rb:721:in `open' E, [2024-05-16T22:06:51.511502 #428793] ERROR -- : from /usr/lib/ruby/3.0.0/open-uri.rb:729:in `read' E, [2024-05-16T22:06:51.511513 #428793] ERROR -- : from /tmp/ruby/src/trunk/tool/downloader.rb:247:in `block in download' E, [2024-05-16T22:06:51.511523 #428793] ERROR -- : from /tmp/ruby/src/trunk/tool/downloader.rb:378:in `with_retry' E, [2024-05-16T22:06:51.511753 #428793] ERROR -- : from /tmp/ruby/src/trunk/tool/downloader.rb:246:in `download' E, [2024-05-16T22:06:51.511775 #428793] ERROR -- : from /tmp/ruby/src/trunk/tool/downloader.rb:136:in `download' E, [2024-05-16T22:06:51.511788 #428793] ERROR -- : from /tmp/ruby/src/trunk/tool/downloader.rb:482:in `block in
' E, [2024-05-16T22:06:51.511800 #428793] ERROR -- : from /tmp/ruby/src/trunk/tool/downloader.rb:465:in `each' E, [2024-05-16T22:06:51.511810 #428793] ERROR -- : from /tmp/ruby/src/trunk/tool/downloader.rb:465:in `
' E, [2024-05-16T22:06:51.514305 #428793] ERROR -- : make: *** [uncommon.mk:1765: /tmp/ruby/src/trunk/enc/unicode/data/emoji/15.0/emoji-zwj-sequences.txt] Error 1 E, [2024-05-16T22:06:51.514363 #428793] ERROR -- : make: *** Waiting for unfinished jobs.... E, [2024-05-16T22:06:51.515260 #428793] ERROR -- : make: *** [uncommon.mk:1765: /tmp/ruby/src/trunk/enc/unicode/data/emoji/15.0/emoji-sequences.txt] Error 1 E, [2024-05-16T22:06:51.515329 #428793] ERROR -- : make: *** Deleting file '/tmp/ruby/src/trunk/enc/unicode/data/emoji/15.0/emoji-sequences.txt' E, [2024-05-16T22:06:51.515361 #428793] ERROR -- : make: *** [uncommon.mk:1765: /tmp/ruby/src/trunk/enc/unicode/data/emoji/15.0/emoji-test.txt] Error 1 I, [2024-05-16T22:06:51.515402 #428793] INFO -- : downloading emoji/15.0/emoji-test.txt ... I, [2024-05-16T22:06:51.515884 #428793] INFO -- : $$$[end] "make update-unicode -j20" exit with 512. I, [2024-05-16T22:06:51.515979 #428793] INFO -- : $$$[beg] make update-download -j20 I, [2024-05-16T22:06:51.624994 #428793] INFO -- : tool/config.guess already exists I, [2024-05-16T22:06:51.625034 #428793] INFO -- : tool/config.sub already exists I, [2024-05-16T22:06:51.627180 #428793] INFO -- : Update minitest to ea9caafc0754b1d6236a490d59e624b53209734a I, [2024-05-16T22:06:51.627263 #428793] INFO -- : Update power_assert to 84e85124c5014a139af39161d484156cfe87a9ed I, [2024-05-16T22:06:51.627707 #428793] INFO -- : Update rbs to ba7872795d5de04adb8ff500c0e6afdc81a041dd I, [2024-05-16T22:06:51.627810 #428793] INFO -- : Update typeprof to b19a6416da3a05d57fadd6ffdadb382b6d236ca5 I, [2024-05-16T22:06:51.628454 #428793] INFO -- : echo ea9caafc0754b1d6236a490d59e624b53209734a | /bin/sh /tmp/ruby/src/trunk/tool/ifchange /tmp/ruby/src/trunk/.bundle/.timestamp/minitest.revision - I, [2024-05-16T22:06:51.628680 #428793] INFO -- : echo 84e85124c5014a139af39161d484156cfe87a9ed | /bin/sh /tmp/ruby/src/trunk/tool/ifchange /tmp/ruby/src/trunk/.bundle/.timestamp/power_assert.revision - I, [2024-05-16T22:06:51.629127 #428793] INFO -- : echo ba7872795d5de04adb8ff500c0e6afdc81a041dd | /bin/sh /tmp/ruby/src/trunk/tool/ifchange /tmp/ruby/src/trunk/.bundle/.timestamp/rbs.revision - I, [2024-05-16T22:06:51.629405 #428793] INFO -- : echo b19a6416da3a05d57fadd6ffdadb382b6d236ca5 | /bin/sh /tmp/ruby/src/trunk/tool/ifchange /tmp/ruby/src/trunk/.bundle/.timestamp/typeprof.revision - I, [2024-05-16T22:06:51.630573 #428793] INFO -- : /tmp/ruby/src/trunk/.bundle/.timestamp/minitest.revision unchanged I, [2024-05-16T22:06:51.630857 #428793] INFO -- : /tmp/ruby/src/trunk/.bundle/.timestamp/power_assert.revision unchanged I, [2024-05-16T22:06:51.631092 #428793] INFO -- : /tmp/ruby/src/trunk/.bundle/.timestamp/rbs.revision unchanged I, [2024-05-16T22:06:51.631410 #428793] INFO -- : /tmp/ruby/src/trunk/.bundle/.timestamp/typeprof.revision unchanged I, [2024-05-16T22:06:51.631882 #428793] INFO -- : Building power_assert@84e85124c5014a139af39161d484156cfe87a9ed to /tmp/ruby/src/trunk/gems/power_assert-2.0.3.gem I, [2024-05-16T22:06:51.700688 #428793] INFO -- : Successfully built RubyGem I, [2024-05-16T22:06:51.700745 #428793] INFO -- : Name: power_assert I, [2024-05-16T22:06:51.700765 #428793] INFO -- : Version: 2.0.4dev I, [2024-05-16T22:06:51.700777 #428793] INFO -- : File: power_assert-2.0.4dev.gem I, [2024-05-16T22:06:51.748912 #428793] INFO -- : $$$[end] "make update-download -j20" exit with 0. I, [2024-05-16T22:06:51.748966 #428793] INFO -- : $$$[beg] make update-rubyspec -j20 I, [2024-05-16T22:06:51.810669 #428793] INFO -- : make: Nothing to be done for 'update-rubyspec'. I, [2024-05-16T22:06:51.810966 #428793] INFO -- : $$$[end] "make update-rubyspec -j20" exit with 0. I, [2024-05-16T22:06:51.810999 #428793] INFO -- : $$$[beg] make update-src -j20 I, [2024-05-16T22:06:52.366166 #428793] INFO -- : Already up to date. I, [2024-05-16T22:06:52.384393 #428793] INFO -- : Latest commit hash = 854cbbd5a9 I, [2024-05-16T22:06:52.385916 #428793] INFO -- : $$$[end] "make update-src -j20" exit with 0. I, [2024-05-16T22:06:52.385985 #428793] INFO -- : $$$[beg] make after-update -j20 I, [2024-05-16T22:06:52.464537 #428793] INFO -- : generating /tmp/ruby/src/trunk/ext/ripper/eventids2table.c I, [2024-05-16T22:06:52.468991 #428793] INFO -- : make[1]: Entering directory '/tmp/ruby/src/trunk/ext/ripper' I, [2024-05-16T22:06:52.469013 #428793] INFO -- : make[1]: Nothing to be done for 'src'. I, [2024-05-16T22:06:52.469018 #428793] INFO -- : make[1]: Leaving directory '/tmp/ruby/src/trunk/ext/ripper' I, [2024-05-16T22:06:52.486090 #428793] INFO -- : /tmp/ruby/src/trunk/revision.h updated I, [2024-05-16T22:06:52.487628 #428793] INFO -- : generating x86_64-linux-fake.rb I, [2024-05-16T22:06:52.540915 #428793] INFO -- : x86_64-linux-fake.rb updated I, [2024-05-16T22:06:52.542328 #428793] INFO -- : generating enc.mk I, [2024-05-16T22:06:52.659726 #428793] INFO -- : making srcs under enc I, [2024-05-16T22:06:52.689046 #428793] INFO -- : make[1]: Entering directory '/tmp/ruby/build/trunk' I, [2024-05-16T22:06:52.689069 #428793] INFO -- : make[1]: Nothing to be done for 'srcs'. I, [2024-05-16T22:06:52.689074 #428793] INFO -- : make[1]: Leaving directory '/tmp/ruby/build/trunk' I, [2024-05-16T22:06:52.734479 #428793] INFO -- : Update minitest to ea9caafc0754b1d6236a490d59e624b53209734a I, [2024-05-16T22:06:52.734673 #428793] INFO -- : Update power_assert to 84e85124c5014a139af39161d484156cfe87a9ed I, [2024-05-16T22:06:52.735447 #428793] INFO -- : Update rbs to ba7872795d5de04adb8ff500c0e6afdc81a041dd I, [2024-05-16T22:06:52.735803 #428793] INFO -- : Update typeprof to b19a6416da3a05d57fadd6ffdadb382b6d236ca5 I, [2024-05-16T22:06:52.736305 #428793] INFO -- : echo ea9caafc0754b1d6236a490d59e624b53209734a | /bin/sh /tmp/ruby/src/trunk/tool/ifchange /tmp/ruby/src/trunk/.bundle/.timestamp/minitest.revision - I, [2024-05-16T22:06:52.736464 #428793] INFO -- : echo 84e85124c5014a139af39161d484156cfe87a9ed | /bin/sh /tmp/ruby/src/trunk/tool/ifchange /tmp/ruby/src/trunk/.bundle/.timestamp/power_assert.revision - I, [2024-05-16T22:06:52.737858 #428793] INFO -- : echo ba7872795d5de04adb8ff500c0e6afdc81a041dd | /bin/sh /tmp/ruby/src/trunk/tool/ifchange /tmp/ruby/src/trunk/.bundle/.timestamp/rbs.revision - I, [2024-05-16T22:06:52.737913 #428793] INFO -- : echo b19a6416da3a05d57fadd6ffdadb382b6d236ca5 | /bin/sh /tmp/ruby/src/trunk/tool/ifchange /tmp/ruby/src/trunk/.bundle/.timestamp/typeprof.revision - I, [2024-05-16T22:06:52.738474 #428793] INFO -- : /tmp/ruby/src/trunk/.bundle/.timestamp/power_assert.revision unchanged I, [2024-05-16T22:06:52.738507 #428793] INFO -- : /tmp/ruby/src/trunk/.bundle/.timestamp/minitest.revision unchanged I, [2024-05-16T22:06:52.739303 #428793] INFO -- : /tmp/ruby/src/trunk/.bundle/.timestamp/rbs.revision unchanged I, [2024-05-16T22:06:52.739514 #428793] INFO -- : /tmp/ruby/src/trunk/.bundle/.timestamp/typeprof.revision unchanged I, [2024-05-16T22:06:52.739534 #428793] INFO -- : Building power_assert@84e85124c5014a139af39161d484156cfe87a9ed to /tmp/ruby/src/trunk/gems/power_assert-2.0.3.gem I, [2024-05-16T22:06:52.809062 #428793] INFO -- : Successfully built RubyGem I, [2024-05-16T22:06:52.809118 #428793] INFO -- : Name: power_assert I, [2024-05-16T22:06:52.809131 #428793] INFO -- : Version: 2.0.4dev I, [2024-05-16T22:06:52.809142 #428793] INFO -- : File: power_assert-2.0.4dev.gem I, [2024-05-16T22:06:52.811406 #428793] INFO -- : Extracting bundle gem power_assert-2.0.3... I, [2024-05-16T22:06:52.871909 #428793] INFO -- : Try with hash version of bundled gems instead of gems/power_assert-2.0.3.gem. We don't use this gem with release version of Ruby. I, [2024-05-16T22:06:52.876867 #428793] INFO -- : Unpacked gems/power_assert-2.0.4dev.gem I, [2024-05-16T22:06:52.878728 #428793] INFO -- : $$$[end] "make after-update -j20" exit with 0. I, [2024-05-16T22:06:52.878865 #428793] INFO -- : $$$[beg] make miniruby -j20 I, [2024-05-16T22:06:52.935365 #428793] INFO -- : BASERUBY = /usr/bin/ruby --disable=gems I, [2024-05-16T22:06:52.935404 #428793] INFO -- : CC = gcc I, [2024-05-16T22:06:52.935417 #428793] INFO -- : LD = ld I, [2024-05-16T22:06:52.935428 #428793] INFO -- : LDSHARED = gcc -shared I, [2024-05-16T22:06:52.935438 #428793] INFO -- : CFLAGS = -O3 -fno-fast-math -ggdb3 -Wall -Wextra -Wdeprecated-declarations -Wdiv-by-zero -Wduplicated-cond -Wimplicit-function-declaration -Wimplicit-int -Wpointer-arith -Wwrite-strings -Wold-style-definition -Wimplicit-fallthrough=0 -Wmissing-noreturn -Wno-cast-function-type -Wno-constant-logical-operand -Wno-long-long -Wno-missing-field-initializers -Wno-overlength-strings -Wno-packed-bitfield-compat -Wno-parentheses-equality -Wno-self-assign -Wno-tautological-compare -Wno-unused-parameter -Wno-unused-value -Wsuggest-attribute=format -Wsuggest-attribute=noreturn -Wunused-variable -Wmisleading-indentation -Wundef -fPIC I, [2024-05-16T22:06:52.935450 #428793] INFO -- : XCFLAGS = -U_FORTIFY_SOURCE -D_FORTIFY_SOURCE=2 -fstack-protector-strong -fno-strict-overflow -fvisibility=hidden -fexcess-precision=standard -DRUBY_EXPORT -I. -I.ext/include/x86_64-linux -I/tmp/ruby/src/trunk/include -I/tmp/ruby/src/trunk -I/tmp/ruby/src/trunk/prism -I/tmp/ruby/src/trunk/enc/unicode/15.0.0 I, [2024-05-16T22:06:52.935460 #428793] INFO -- : CPPFLAGS = I, [2024-05-16T22:06:52.935470 #428793] INFO -- : DLDFLAGS = -Wl,--compress-debug-sections=zlib -Wl,-soname,libruby.so.3.4 -fstack-protector-strong I, [2024-05-16T22:06:52.935480 #428793] INFO -- : SOLIBS = -lz -lrt -lrt -lgmp -ldl -lcrypt -lm -lpthread I, [2024-05-16T22:06:52.935490 #428793] INFO -- : LANG = en_US.UTF-8 I, [2024-05-16T22:06:52.935500 #428793] INFO -- : LC_ALL = I, [2024-05-16T22:06:52.935509 #428793] INFO -- : LC_CTYPE = I, [2024-05-16T22:06:52.935519 #428793] INFO -- : MFLAGS = -j20 --jobserver-auth=4,5 I, [2024-05-16T22:06:52.935528 #428793] INFO -- : RUSTC = no I, [2024-05-16T22:06:52.935538 #428793] INFO -- : YJIT_RUSTC_ARGS = --crate-name=yjit --crate-type=staticlib --edition=2021 -g -C lto=thin -C opt-level=3 -C overflow-checks=on '--out-dir=/tmp/ruby/build/trunk/yjit/target/release/' /tmp/ruby/src/trunk/yjit/src/lib.rs I, [2024-05-16T22:06:52.936707 #428793] INFO -- : gcc (Ubuntu 11.4.0-1ubuntu1~22.04) 11.4.0 I, [2024-05-16T22:06:52.936754 #428793] INFO -- : Copyright (C) 2021 Free Software Foundation, Inc. I, [2024-05-16T22:06:52.936766 #428793] INFO -- : This is free software; see the source for copying conditions. There is NO I, [2024-05-16T22:06:52.936777 #428793] INFO -- : warranty; not even for MERCHANTABILITY or FITNESS FOR A PARTICULAR PURPOSE. I, [2024-05-16T22:06:52.936787 #428793] INFO -- : I, [2024-05-16T22:06:52.958544 #428793] INFO -- : compiling /tmp/ruby/src/trunk/version.c I, [2024-05-16T22:06:53.061201 #428793] INFO -- : linking miniruby I, [2024-05-16T22:06:53.590046 #428793] INFO -- : $$$[end] "make miniruby -j20" exit with 0. I, [2024-05-16T22:06:53.590170 #428793] INFO -- : $$$[beg] make ruby -j20 I, [2024-05-16T22:06:53.648444 #428793] INFO -- : BASERUBY = /usr/bin/ruby --disable=gems I, [2024-05-16T22:06:53.648470 #428793] INFO -- : CC = gcc I, [2024-05-16T22:06:53.648475 #428793] INFO -- : LD = ld I, [2024-05-16T22:06:53.648479 #428793] INFO -- : LDSHARED = gcc -shared I, [2024-05-16T22:06:53.648484 #428793] INFO -- : CFLAGS = -O3 -fno-fast-math -ggdb3 -Wall -Wextra -Wdeprecated-declarations -Wdiv-by-zero -Wduplicated-cond -Wimplicit-function-declaration -Wimplicit-int -Wpointer-arith -Wwrite-strings -Wold-style-definition -Wimplicit-fallthrough=0 -Wmissing-noreturn -Wno-cast-function-type -Wno-constant-logical-operand -Wno-long-long -Wno-missing-field-initializers -Wno-overlength-strings -Wno-packed-bitfield-compat -Wno-parentheses-equality -Wno-self-assign -Wno-tautological-compare -Wno-unused-parameter -Wno-unused-value -Wsuggest-attribute=format -Wsuggest-attribute=noreturn -Wunused-variable -Wmisleading-indentation -Wundef -fPIC I, [2024-05-16T22:06:53.648489 #428793] INFO -- : XCFLAGS = -U_FORTIFY_SOURCE -D_FORTIFY_SOURCE=2 -fstack-protector-strong -fno-strict-overflow -fvisibility=hidden -fexcess-precision=standard -DRUBY_EXPORT -I. -I.ext/include/x86_64-linux -I/tmp/ruby/src/trunk/include -I/tmp/ruby/src/trunk -I/tmp/ruby/src/trunk/prism -I/tmp/ruby/src/trunk/enc/unicode/15.0.0 I, [2024-05-16T22:06:53.648493 #428793] INFO -- : CPPFLAGS = I, [2024-05-16T22:06:53.648497 #428793] INFO -- : DLDFLAGS = -Wl,--compress-debug-sections=zlib -Wl,-soname,libruby.so.3.4 -fstack-protector-strong I, [2024-05-16T22:06:53.648501 #428793] INFO -- : SOLIBS = -lz -lrt -lrt -lgmp -ldl -lcrypt -lm -lpthread I, [2024-05-16T22:06:53.648505 #428793] INFO -- : LANG = en_US.UTF-8 I, [2024-05-16T22:06:53.648508 #428793] INFO -- : LC_ALL = I, [2024-05-16T22:06:53.648512 #428793] INFO -- : LC_CTYPE = I, [2024-05-16T22:06:53.648516 #428793] INFO -- : MFLAGS = -j20 --jobserver-auth=4,5 I, [2024-05-16T22:06:53.648519 #428793] INFO -- : RUSTC = no I, [2024-05-16T22:06:53.648524 #428793] INFO -- : YJIT_RUSTC_ARGS = --crate-name=yjit --crate-type=staticlib --edition=2021 -g -C lto=thin -C opt-level=3 -C overflow-checks=on '--out-dir=/tmp/ruby/build/trunk/yjit/target/release/' /tmp/ruby/src/trunk/yjit/src/lib.rs I, [2024-05-16T22:06:53.649873 #428793] INFO -- : gcc (Ubuntu 11.4.0-1ubuntu1~22.04) 11.4.0 I, [2024-05-16T22:06:53.649895 #428793] INFO -- : Copyright (C) 2021 Free Software Foundation, Inc. I, [2024-05-16T22:06:53.649900 #428793] INFO -- : This is free software; see the source for copying conditions. There is NO I, [2024-05-16T22:06:53.649904 #428793] INFO -- : warranty; not even for MERCHANTABILITY or FITNESS FOR A PARTICULAR PURPOSE. I, [2024-05-16T22:06:53.649908 #428793] INFO -- : I, [2024-05-16T22:06:53.758017 #428793] INFO -- : builtin_binary.inc updated I, [2024-05-16T22:06:53.763458 #428793] INFO -- : c5234a9416e4f20f175185e840b25b0f08674d14078ed7083f37e655458e3ca9 builtin_binary.inc I, [2024-05-16T22:06:53.764171 #428793] INFO -- : compiling /tmp/ruby/src/trunk/builtin.c I, [2024-05-16T22:06:53.946699 #428793] INFO -- : linking static-library libruby-static.a I, [2024-05-16T22:06:54.257348 #428793] INFO -- : linking shared-library libruby.so.3.4.0 I, [2024-05-16T22:06:55.816260 #428793] INFO -- : linking ruby I, [2024-05-16T22:06:55.840071 #428793] INFO -- : $$$[end] "make ruby -j20" exit with 0. I, [2024-05-16T22:06:55.840242 #428793] INFO -- : $$$[beg] make all -j20 I, [2024-05-16T22:06:55.898712 #428793] INFO -- : BASERUBY = /usr/bin/ruby --disable=gems I, [2024-05-16T22:06:55.898774 #428793] INFO -- : CC = gcc I, [2024-05-16T22:06:55.898792 #428793] INFO -- : LD = ld I, [2024-05-16T22:06:55.898808 #428793] INFO -- : LDSHARED = gcc -shared I, [2024-05-16T22:06:55.898823 #428793] INFO -- : CFLAGS = -O3 -fno-fast-math -ggdb3 -Wall -Wextra -Wdeprecated-declarations -Wdiv-by-zero -Wduplicated-cond -Wimplicit-function-declaration -Wimplicit-int -Wpointer-arith -Wwrite-strings -Wold-style-definition -Wimplicit-fallthrough=0 -Wmissing-noreturn -Wno-cast-function-type -Wno-constant-logical-operand -Wno-long-long -Wno-missing-field-initializers -Wno-overlength-strings -Wno-packed-bitfield-compat -Wno-parentheses-equality -Wno-self-assign -Wno-tautological-compare -Wno-unused-parameter -Wno-unused-value -Wsuggest-attribute=format -Wsuggest-attribute=noreturn -Wunused-variable -Wmisleading-indentation -Wundef -fPIC I, [2024-05-16T22:06:55.898842 #428793] INFO -- : XCFLAGS = -U_FORTIFY_SOURCE -D_FORTIFY_SOURCE=2 -fstack-protector-strong -fno-strict-overflow -fvisibility=hidden -fexcess-precision=standard -DRUBY_EXPORT -I. -I.ext/include/x86_64-linux -I/tmp/ruby/src/trunk/include -I/tmp/ruby/src/trunk -I/tmp/ruby/src/trunk/prism -I/tmp/ruby/src/trunk/enc/unicode/15.0.0 I, [2024-05-16T22:06:55.898857 #428793] INFO -- : CPPFLAGS = I, [2024-05-16T22:06:55.898871 #428793] INFO -- : DLDFLAGS = -Wl,--compress-debug-sections=zlib -Wl,-soname,libruby.so.3.4 -fstack-protector-strong I, [2024-05-16T22:06:55.898886 #428793] INFO -- : SOLIBS = -lz -lrt -lrt -lgmp -ldl -lcrypt -lm -lpthread I, [2024-05-16T22:06:55.898899 #428793] INFO -- : LANG = en_US.UTF-8 I, [2024-05-16T22:06:55.898913 #428793] INFO -- : LC_ALL = I, [2024-05-16T22:06:55.898927 #428793] INFO -- : LC_CTYPE = I, [2024-05-16T22:06:55.898940 #428793] INFO -- : MFLAGS = -j20 --jobserver-auth=4,5 I, [2024-05-16T22:06:55.898954 #428793] INFO -- : RUSTC = no I, [2024-05-16T22:06:55.898971 #428793] INFO -- : YJIT_RUSTC_ARGS = --crate-name=yjit --crate-type=staticlib --edition=2021 -g -C lto=thin -C opt-level=3 -C overflow-checks=on '--out-dir=/tmp/ruby/build/trunk/yjit/target/release/' /tmp/ruby/src/trunk/yjit/src/lib.rs I, [2024-05-16T22:06:55.900860 #428793] INFO -- : gcc (Ubuntu 11.4.0-1ubuntu1~22.04) 11.4.0 I, [2024-05-16T22:06:55.900920 #428793] INFO -- : Copyright (C) 2021 Free Software Foundation, Inc. I, [2024-05-16T22:06:55.900939 #428793] INFO -- : This is free software; see the source for copying conditions. There is NO I, [2024-05-16T22:06:55.900954 #428793] INFO -- : warranty; not even for MERCHANTABILITY or FITNESS FOR A PARTICULAR PURPOSE. I, [2024-05-16T22:06:55.900969 #428793] INFO -- : I, [2024-05-16T22:06:55.933421 #428793] INFO -- : generating enc.mk I, [2024-05-16T22:06:55.935284 #428793] INFO -- : building spec/ruby/optional/capi/ext/array_spec.so I, [2024-05-16T22:06:55.935592 #428793] INFO -- : building spec/ruby/optional/capi/ext/basic_object_spec.so I, [2024-05-16T22:06:55.936118 #428793] INFO -- : building spec/ruby/optional/capi/ext/bignum_spec.so I, [2024-05-16T22:06:55.937034 #428793] INFO -- : building spec/ruby/optional/capi/ext/binding_spec.so I, [2024-05-16T22:06:55.937352 #428793] INFO -- : building spec/ruby/optional/capi/ext/boolean_spec.so I, [2024-05-16T22:06:55.937717 #428793] INFO -- : building spec/ruby/optional/capi/ext/class_id_under_autoload_spec.so I, [2024-05-16T22:06:55.938417 #428793] INFO -- : building spec/ruby/optional/capi/ext/class_spec.so I, [2024-05-16T22:06:55.939373 #428793] INFO -- : building spec/ruby/optional/capi/ext/class_under_autoload_spec.so I, [2024-05-16T22:06:55.939645 #428793] INFO -- : building spec/ruby/optional/capi/ext/complex_spec.so I, [2024-05-16T22:06:55.940573 #428793] INFO -- : building spec/ruby/optional/capi/ext/constants_spec.so I, [2024-05-16T22:06:55.941404 #428793] INFO -- : building spec/ruby/optional/capi/ext/data_spec.so I, [2024-05-16T22:06:55.941748 #428793] INFO -- : building spec/ruby/optional/capi/ext/debug_spec.so I, [2024-05-16T22:06:55.942542 #428793] INFO -- : building spec/ruby/optional/capi/ext/encoding_spec.so I, [2024-05-16T22:06:55.943366 #428793] INFO -- : building spec/ruby/optional/capi/ext/enumerator_spec.so I, [2024-05-16T22:06:55.943652 #428793] INFO -- : building spec/ruby/optional/capi/ext/exception_spec.so I, [2024-05-16T22:06:55.944400 #428793] INFO -- : building spec/ruby/optional/capi/ext/fiber_spec.so I, [2024-05-16T22:06:55.945065 #428793] INFO -- : building spec/ruby/optional/capi/ext/file_spec.so I, [2024-05-16T22:06:55.945519 #428793] INFO -- : building spec/ruby/optional/capi/ext/fixnum_spec.so I, [2024-05-16T22:06:55.956182 #428793] INFO -- : building spec/ruby/optional/capi/ext/float_spec.so I, [2024-05-16T22:06:56.063351 #428793] INFO -- : building spec/ruby/optional/capi/ext/gc_spec.so I, [2024-05-16T22:06:56.075611 #428793] INFO -- : building spec/ruby/optional/capi/ext/globals_spec.so I, [2024-05-16T22:06:56.076012 #428793] INFO -- : building spec/ruby/optional/capi/ext/hash_spec.so I, [2024-05-16T22:06:56.076721 #428793] INFO -- : building spec/ruby/optional/capi/ext/integer_spec.so I, [2024-05-16T22:06:56.080251 #428793] INFO -- : building spec/ruby/optional/capi/ext/io_spec.so I, [2024-05-16T22:06:56.084776 #428793] INFO -- : building spec/ruby/optional/capi/ext/kernel_spec.so I, [2024-05-16T22:06:56.096019 #428793] INFO -- : building spec/ruby/optional/capi/ext/language_spec.so I, [2024-05-16T22:06:56.097887 #428793] INFO -- : building spec/ruby/optional/capi/ext/marshal_spec.so I, [2024-05-16T22:06:56.109247 #428793] INFO -- : building spec/ruby/optional/capi/ext/module_spec.so I, [2024-05-16T22:06:56.124891 #428793] INFO -- : building spec/ruby/optional/capi/ext/module_under_autoload_spec.so I, [2024-05-16T22:06:56.125169 #428793] INFO -- : building spec/ruby/optional/capi/ext/mutex_spec.so I, [2024-05-16T22:06:56.125508 #428793] INFO -- : building spec/ruby/optional/capi/ext/numeric_spec.so I, [2024-05-16T22:06:56.128203 #428793] INFO -- : building spec/ruby/optional/capi/ext/object_spec.so I, [2024-05-16T22:06:56.136017 #428793] INFO -- : building spec/ruby/optional/capi/ext/proc_spec.so I, [2024-05-16T22:06:56.140336 #428793] INFO -- : building spec/ruby/optional/capi/ext/range_spec.so I, [2024-05-16T22:06:56.156719 #428793] INFO -- : building spec/ruby/optional/capi/ext/rational_spec.so I, [2024-05-16T22:06:56.176116 #428793] INFO -- : building spec/ruby/optional/capi/ext/rbasic_spec.so I, [2024-05-16T22:06:56.180309 #428793] INFO -- : building spec/ruby/optional/capi/ext/regexp_spec.so I, [2024-05-16T22:06:56.246815 #428793] INFO -- : building spec/ruby/optional/capi/ext/string_spec.so I, [2024-05-16T22:06:56.252050 #428793] INFO -- : building spec/ruby/optional/capi/ext/struct_spec.so I, [2024-05-16T22:06:56.253592 #428793] INFO -- : building spec/ruby/optional/capi/ext/st_spec.so I, [2024-05-16T22:06:56.256950 #428793] INFO -- : building spec/ruby/optional/capi/ext/symbol_spec.so I, [2024-05-16T22:06:56.262378 #428793] INFO -- : building spec/ruby/optional/capi/ext/time_spec.so I, [2024-05-16T22:06:56.262479 #428793] INFO -- : building spec/ruby/optional/capi/ext/thread_spec.so I, [2024-05-16T22:06:56.274509 #428793] INFO -- : building spec/ruby/optional/capi/ext/tracepoint_spec.so I, [2024-05-16T22:06:56.278060 #428793] INFO -- : building spec/ruby/optional/capi/ext/typed_data_spec.so I, [2024-05-16T22:06:56.285534 #428793] INFO -- : building spec/ruby/optional/capi/ext/util_spec.so I, [2024-05-16T22:06:56.289559 #428793] INFO -- : making enc I, [2024-05-16T22:06:56.290499 #428793] INFO -- : making srcs under enc I, [2024-05-16T22:06:56.317585 #428793] INFO -- : make[1]: Entering directory '/tmp/ruby/build/trunk' I, [2024-05-16T22:06:56.317642 #428793] INFO -- : make[1]: Nothing to be done for 'enc'. I, [2024-05-16T22:06:56.317653 #428793] INFO -- : make[1]: Leaving directory '/tmp/ruby/build/trunk' I, [2024-05-16T22:06:56.338393 #428793] INFO -- : make[1]: Entering directory '/tmp/ruby/build/trunk' I, [2024-05-16T22:06:56.338453 #428793] INFO -- : make[1]: Nothing to be done for 'srcs'. I, [2024-05-16T22:06:56.338461 #428793] INFO -- : make[1]: Leaving directory '/tmp/ruby/build/trunk' I, [2024-05-16T22:06:56.339229 #428793] INFO -- : generating transdb.h I, [2024-05-16T22:06:56.466083 #428793] INFO -- : transdb.h unchanged I, [2024-05-16T22:06:56.467246 #428793] INFO -- : generating makefiles ext/configure-ext.mk I, [2024-05-16T22:06:56.467484 #428793] INFO -- : making trans I, [2024-05-16T22:06:56.494075 #428793] INFO -- : ext/configure-ext.mk updated I, [2024-05-16T22:06:56.496507 #428793] INFO -- : make[1]: Entering directory '/tmp/ruby/build/trunk' I, [2024-05-16T22:06:56.502658 #428793] INFO -- : make[1]: Entering directory '/tmp/ruby/build/trunk' I, [2024-05-16T22:06:56.502746 #428793] INFO -- : make[1]: Nothing to be done for 'trans'. I, [2024-05-16T22:06:56.502756 #428793] INFO -- : make[1]: Leaving directory '/tmp/ruby/build/trunk' I, [2024-05-16T22:06:56.503683 #428793] INFO -- : making encs I, [2024-05-16T22:06:56.561829 #428793] INFO -- : make[1]: Entering directory '/tmp/ruby/build/trunk' I, [2024-05-16T22:06:56.561905 #428793] INFO -- : make[1]: Nothing to be done for 'encs'. I, [2024-05-16T22:06:56.561930 #428793] INFO -- : make[1]: Leaving directory '/tmp/ruby/build/trunk' I, [2024-05-16T22:06:56.649743 #428793] INFO -- : make[1]: Leaving directory '/tmp/ruby/build/trunk' I, [2024-05-16T22:06:56.650345 #428793] INFO -- : generating makefile exts.mk I, [2024-05-16T22:06:56.687064 #428793] INFO -- : exts.mk unchanged I, [2024-05-16T22:06:56.691297 #428793] INFO -- : make[1]: Entering directory '/tmp/ruby/build/trunk' I, [2024-05-16T22:06:56.709088 #428793] INFO -- : make[2]: Entering directory '/tmp/ruby/build/trunk/ext/digest' I, [2024-05-16T22:06:56.710625 #428793] INFO -- : make[2]: Entering directory '/tmp/ruby/build/trunk/ext/coverage' I, [2024-05-16T22:06:56.711530 #428793] INFO -- : make[2]: Entering directory '/tmp/ruby/build/trunk/ext/json' I, [2024-05-16T22:06:56.711543 #428793] INFO -- : make[2]: Entering directory '/tmp/ruby/build/trunk/ext/date' I, [2024-05-16T22:06:56.711684 #428793] INFO -- : make[2]: Entering directory '/tmp/ruby/build/trunk/ext/io/console' I, [2024-05-16T22:06:56.712057 #428793] INFO -- : make[2]: Entering directory '/tmp/ruby/build/trunk/ext/rubyvm' I, [2024-05-16T22:06:56.712821 #428793] INFO -- : make[2]: Entering directory '/tmp/ruby/build/trunk/ext/monitor' I, [2024-05-16T22:06:56.713597 #428793] INFO -- : make[2]: Entering directory '/tmp/ruby/build/trunk/ext/pathname' I, [2024-05-16T22:06:56.713850 #428793] INFO -- : make[2]: Entering directory '/tmp/ruby/build/trunk/ext/fiddle' I, [2024-05-16T22:06:56.713882 #428793] INFO -- : make[2]: Entering directory '/tmp/ruby/build/trunk/ext/pty' I, [2024-05-16T22:06:56.714548 #428793] INFO -- : make[2]: Leaving directory '/tmp/ruby/build/trunk/ext/rubyvm' I, [2024-05-16T22:06:56.714849 #428793] INFO -- : make[2]: Leaving directory '/tmp/ruby/build/trunk/ext/coverage' I, [2024-05-16T22:06:56.714889 #428793] INFO -- : make[2]: Leaving directory '/tmp/ruby/build/trunk/ext/io/console' I, [2024-05-16T22:06:56.715042 #428793] INFO -- : make[2]: Leaving directory '/tmp/ruby/build/trunk/ext/date' I, [2024-05-16T22:06:56.715086 #428793] INFO -- : make[2]: Entering directory '/tmp/ruby/build/trunk/ext/objspace' I, [2024-05-16T22:06:56.715417 #428793] INFO -- : make[2]: Leaving directory '/tmp/ruby/build/trunk/ext/monitor' I, [2024-05-16T22:06:56.715706 #428793] INFO -- : make[2]: Entering directory '/tmp/ruby/build/trunk/ext/psych' I, [2024-05-16T22:06:56.716457 #428793] INFO -- : make[2]: Leaving directory '/tmp/ruby/build/trunk/ext/digest' I, [2024-05-16T22:06:56.716486 #428793] INFO -- : make[2]: Leaving directory '/tmp/ruby/build/trunk/ext/pty' I, [2024-05-16T22:06:56.717096 #428793] INFO -- : make[2]: Leaving directory '/tmp/ruby/build/trunk/ext/pathname' I, [2024-05-16T22:06:56.717490 #428793] INFO -- : make[2]: Entering directory '/tmp/ruby/build/trunk/.bundle/gems/debug-1.9.2/ext/debug' I, [2024-05-16T22:06:56.717524 #428793] INFO -- : make[2]: Entering directory '/tmp/ruby/build/trunk/.bundle/gems/nkf-0.2.0/ext/nkf' I, [2024-05-16T22:06:56.717597 #428793] INFO -- : make[2]: Leaving directory '/tmp/ruby/build/trunk/ext/json' I, [2024-05-16T22:06:56.717621 #428793] INFO -- : make[2]: Entering directory '/tmp/ruby/build/trunk/.bundle/gems/bigdecimal-3.1.8/ext/bigdecimal' I, [2024-05-16T22:06:56.717979 #428793] INFO -- : make[2]: Entering directory '/tmp/ruby/build/trunk/.bundle/gems/racc-1.7.3/ext/racc/cparse' I, [2024-05-16T22:06:56.718108 #428793] INFO -- : make[2]: Entering directory '/tmp/ruby/build/trunk/ext/ripper' I, [2024-05-16T22:06:56.718672 #428793] INFO -- : make[2]: Entering directory '/tmp/ruby/build/trunk/.bundle/gems/syslog-0.1.2/ext/syslog' I, [2024-05-16T22:06:56.718699 #428793] INFO -- : make[2]: Leaving directory '/tmp/ruby/build/trunk/ext/objspace' I, [2024-05-16T22:06:56.719230 #428793] INFO -- : make[2]: Entering directory '/tmp/ruby/build/trunk/.bundle/gems/rbs-3.4.4/ext/rbs_extension' I, [2024-05-16T22:06:56.722573 #428793] INFO -- : make[2]: Entering directory '/tmp/ruby/build/trunk/ext/socket' I, [2024-05-16T22:06:56.723529 #428793] INFO -- : make[2]: Leaving directory '/tmp/ruby/build/trunk/ext/fiddle' I, [2024-05-16T22:06:56.723796 #428793] INFO -- : make[2]: Entering directory '/tmp/ruby/build/trunk/ext/digest/sha2' I, [2024-05-16T22:06:56.724116 #428793] INFO -- : make[2]: Leaving directory '/tmp/ruby/build/trunk/ext/ripper' I, [2024-05-16T22:06:56.726022 #428793] INFO -- : make[2]: Leaving directory '/tmp/ruby/build/trunk/ext/digest/sha2' I, [2024-05-16T22:06:56.726286 #428793] INFO -- : make[2]: Entering directory '/tmp/ruby/build/trunk/ext/openssl' I, [2024-05-16T22:06:56.728173 #428793] INFO -- : make[2]: Leaving directory '/tmp/ruby/build/trunk/ext/psych' I, [2024-05-16T22:06:56.728552 #428793] INFO -- : make[2]: Leaving directory '/tmp/ruby/build/trunk/ext/socket' I, [2024-05-16T22:06:56.737622 #428793] INFO -- : make[2]: Leaving directory '/tmp/ruby/build/trunk/ext/openssl' I, [2024-05-16T22:06:56.740321 #428793] INFO -- : make[2]: Leaving directory '/tmp/ruby/build/trunk/.bundle/gems/debug-1.9.2/ext/debug' I, [2024-05-16T22:06:56.740521 #428793] INFO -- : make[2]: Leaving directory '/tmp/ruby/build/trunk/.bundle/gems/syslog-0.1.2/ext/syslog' I, [2024-05-16T22:06:56.741967 #428793] INFO -- : make[2]: Leaving directory '/tmp/ruby/build/trunk/.bundle/gems/rbs-3.4.4/ext/rbs_extension' I, [2024-05-16T22:06:56.743470 #428793] INFO -- : make[2]: Leaving directory '/tmp/ruby/build/trunk/.bundle/gems/racc-1.7.3/ext/racc/cparse' I, [2024-05-16T22:06:56.748915 #428793] INFO -- : make[2]: Leaving directory '/tmp/ruby/build/trunk/.bundle/gems/nkf-0.2.0/ext/nkf' I, [2024-05-16T22:06:56.750576 #428793] INFO -- : make[2]: Leaving directory '/tmp/ruby/build/trunk/.bundle/gems/bigdecimal-3.1.8/ext/bigdecimal' I, [2024-05-16T22:06:56.774366 #428793] INFO -- : make[2]: Entering directory '/tmp/ruby/build/trunk' I, [2024-05-16T22:06:56.846267 #428793] INFO -- : linking ruby I, [2024-05-16T22:06:56.868800 #428793] INFO -- : make[2]: Leaving directory '/tmp/ruby/build/trunk' I, [2024-05-16T22:06:56.869309 #428793] INFO -- : make[1]: Leaving directory '/tmp/ruby/build/trunk' I, [2024-05-16T22:06:56.873029 #428793] INFO -- : make[1]: Entering directory '/tmp/ruby/build/trunk' I, [2024-05-16T22:06:56.873051 #428793] INFO -- : make[1]: Nothing to be done for 'note'. I, [2024-05-16T22:06:56.873057 #428793] INFO -- : make[1]: Leaving directory '/tmp/ruby/build/trunk' I, [2024-05-16T22:06:56.873910 #428793] INFO -- : $$$[end] "make all -j20" exit with 0. I, [2024-05-16T22:06:56.874047 #428793] INFO -- : $$$[beg] make install -j20 I, [2024-05-16T22:06:56.949349 #428793] INFO -- : Update minitest to ea9caafc0754b1d6236a490d59e624b53209734a I, [2024-05-16T22:06:56.949532 #428793] INFO -- : Update power_assert to 84e85124c5014a139af39161d484156cfe87a9ed I, [2024-05-16T22:06:56.949870 #428793] INFO -- : Update rbs to ba7872795d5de04adb8ff500c0e6afdc81a041dd I, [2024-05-16T22:06:56.950948 #428793] INFO -- : Update typeprof to b19a6416da3a05d57fadd6ffdadb382b6d236ca5 I, [2024-05-16T22:06:56.952233 #428793] INFO -- : echo ea9caafc0754b1d6236a490d59e624b53209734a | /bin/sh /tmp/ruby/src/trunk/tool/ifchange /tmp/ruby/src/trunk/.bundle/.timestamp/minitest.revision - I, [2024-05-16T22:06:56.952454 #428793] INFO -- : echo 84e85124c5014a139af39161d484156cfe87a9ed | /bin/sh /tmp/ruby/src/trunk/tool/ifchange /tmp/ruby/src/trunk/.bundle/.timestamp/power_assert.revision - I, [2024-05-16T22:06:56.952728 #428793] INFO -- : echo ba7872795d5de04adb8ff500c0e6afdc81a041dd | /bin/sh /tmp/ruby/src/trunk/tool/ifchange /tmp/ruby/src/trunk/.bundle/.timestamp/rbs.revision - I, [2024-05-16T22:06:56.953957 #428793] INFO -- : BASERUBY = /usr/bin/ruby --disable=gems I, [2024-05-16T22:06:56.953994 #428793] INFO -- : CC = gcc I, [2024-05-16T22:06:56.954004 #428793] INFO -- : LD = ld I, [2024-05-16T22:06:56.954011 #428793] INFO -- : LDSHARED = gcc -shared I, [2024-05-16T22:06:56.954019 #428793] INFO -- : CFLAGS = -O3 -fno-fast-math -ggdb3 -Wall -Wextra -Wdeprecated-declarations -Wdiv-by-zero -Wduplicated-cond -Wimplicit-function-declaration -Wimplicit-int -Wpointer-arith -Wwrite-strings -Wold-style-definition -Wimplicit-fallthrough=0 -Wmissing-noreturn -Wno-cast-function-type -Wno-constant-logical-operand -Wno-long-long -Wno-missing-field-initializers -Wno-overlength-strings -Wno-packed-bitfield-compat -Wno-parentheses-equality -Wno-self-assign -Wno-tautological-compare -Wno-unused-parameter -Wno-unused-value -Wsuggest-attribute=format -Wsuggest-attribute=noreturn -Wunused-variable -Wmisleading-indentation -Wundef -fPIC I, [2024-05-16T22:06:56.954028 #428793] INFO -- : XCFLAGS = -U_FORTIFY_SOURCE -D_FORTIFY_SOURCE=2 -fstack-protector-strong -fno-strict-overflow -fvisibility=hidden -fexcess-precision=standard -DRUBY_EXPORT -I. -I.ext/include/x86_64-linux -I/tmp/ruby/src/trunk/include -I/tmp/ruby/src/trunk -I/tmp/ruby/src/trunk/prism -I/tmp/ruby/src/trunk/enc/unicode/15.0.0 I, [2024-05-16T22:06:56.954034 #428793] INFO -- : CPPFLAGS = I, [2024-05-16T22:06:56.954041 #428793] INFO -- : DLDFLAGS = -Wl,--compress-debug-sections=zlib -Wl,-soname,libruby.so.3.4 -fstack-protector-strong I, [2024-05-16T22:06:56.954047 #428793] INFO -- : SOLIBS = -lz -lrt -lrt -lgmp -ldl -lcrypt -lm -lpthread I, [2024-05-16T22:06:56.954054 #428793] INFO -- : LANG = en_US.UTF-8 I, [2024-05-16T22:06:56.954063 #428793] INFO -- : LC_ALL = I, [2024-05-16T22:06:56.954069 #428793] INFO -- : LC_CTYPE = I, [2024-05-16T22:06:56.954075 #428793] INFO -- : MFLAGS = -j20 --jobserver-auth=4,5 I, [2024-05-16T22:06:56.954084 #428793] INFO -- : RUSTC = no I, [2024-05-16T22:06:56.954094 #428793] INFO -- : YJIT_RUSTC_ARGS = --crate-name=yjit --crate-type=staticlib --edition=2021 -g -C lto=thin -C opt-level=3 -C overflow-checks=on '--out-dir=/tmp/ruby/build/trunk/yjit/target/release/' /tmp/ruby/src/trunk/yjit/src/lib.rs I, [2024-05-16T22:06:56.955321 #428793] INFO -- : /tmp/ruby/src/trunk/.bundle/.timestamp/minitest.revision unchanged I, [2024-05-16T22:06:56.955572 #428793] INFO -- : /tmp/ruby/src/trunk/.bundle/.timestamp/power_assert.revision unchanged I, [2024-05-16T22:06:56.955956 #428793] INFO -- : /tmp/ruby/src/trunk/.bundle/.timestamp/rbs.revision unchanged I, [2024-05-16T22:06:56.981878 #428793] INFO -- : echo b19a6416da3a05d57fadd6ffdadb382b6d236ca5 | /bin/sh /tmp/ruby/src/trunk/tool/ifchange /tmp/ruby/src/trunk/.bundle/.timestamp/typeprof.revision - I, [2024-05-16T22:06:56.982511 #428793] INFO -- : generating enc.mk I, [2024-05-16T22:06:56.982532 #428793] INFO -- : gcc (Ubuntu 11.4.0-1ubuntu1~22.04) 11.4.0 I, [2024-05-16T22:06:56.982537 #428793] INFO -- : Copyright (C) 2021 Free Software Foundation, Inc. I, [2024-05-16T22:06:56.982541 #428793] INFO -- : This is free software; see the source for copying conditions. There is NO I, [2024-05-16T22:06:56.982545 #428793] INFO -- : warranty; not even for MERCHANTABILITY or FITNESS FOR A PARTICULAR PURPOSE. I, [2024-05-16T22:06:56.982553 #428793] INFO -- : I, [2024-05-16T22:06:56.983792 #428793] INFO -- : /tmp/ruby/src/trunk/.bundle/.timestamp/typeprof.revision unchanged I, [2024-05-16T22:06:57.103353 #428793] INFO -- : Building power_assert@84e85124c5014a139af39161d484156cfe87a9ed to /tmp/ruby/src/trunk/gems/power_assert-2.0.3.gem I, [2024-05-16T22:06:57.103819 #428793] INFO -- : making srcs under enc I, [2024-05-16T22:06:57.103992 #428793] INFO -- : making enc I, [2024-05-16T22:06:57.120981 #428793] INFO -- : make[1]: Entering directory '/tmp/ruby/build/trunk' I, [2024-05-16T22:06:57.121012 #428793] INFO -- : make[1]: Nothing to be done for 'enc'. I, [2024-05-16T22:06:57.121018 #428793] INFO -- : make[1]: Leaving directory '/tmp/ruby/build/trunk' I, [2024-05-16T22:06:57.133419 #428793] INFO -- : make[1]: Entering directory '/tmp/ruby/build/trunk' I, [2024-05-16T22:06:57.133453 #428793] INFO -- : make[1]: Nothing to be done for 'srcs'. I, [2024-05-16T22:06:57.133462 #428793] INFO -- : make[1]: Leaving directory '/tmp/ruby/build/trunk' I, [2024-05-16T22:06:57.134403 #428793] INFO -- : generating transdb.h I, [2024-05-16T22:06:57.172067 #428793] INFO -- : Successfully built RubyGem I, [2024-05-16T22:06:57.172112 #428793] INFO -- : Name: power_assert I, [2024-05-16T22:06:57.172119 #428793] INFO -- : Version: 2.0.4dev I, [2024-05-16T22:06:57.172125 #428793] INFO -- : File: power_assert-2.0.4dev.gem I, [2024-05-16T22:06:57.174288 #428793] INFO -- : Extracting bundle gem power_assert-2.0.3... I, [2024-05-16T22:06:57.230884 #428793] INFO -- : transdb.h unchanged I, [2024-05-16T22:06:57.232662 #428793] INFO -- : generating makefiles ext/configure-ext.mk I, [2024-05-16T22:06:57.232917 #428793] INFO -- : making trans I, [2024-05-16T22:06:57.235085 #428793] INFO -- : Try with hash version of bundled gems instead of gems/power_assert-2.0.3.gem. We don't use this gem with release version of Ruby. I, [2024-05-16T22:06:57.240013 #428793] INFO -- : Unpacked gems/power_assert-2.0.4dev.gem I, [2024-05-16T22:06:57.259509 #428793] INFO -- : ext/configure-ext.mk unchanged I, [2024-05-16T22:06:57.261917 #428793] INFO -- : make[1]: Entering directory '/tmp/ruby/build/trunk' I, [2024-05-16T22:06:57.268005 #428793] INFO -- : make[1]: Entering directory '/tmp/ruby/build/trunk' I, [2024-05-16T22:06:57.268094 #428793] INFO -- : make[1]: Nothing to be done for 'trans'. I, [2024-05-16T22:06:57.268105 #428793] INFO -- : make[1]: Leaving directory '/tmp/ruby/build/trunk' I, [2024-05-16T22:06:57.268979 #428793] INFO -- : making encs I, [2024-05-16T22:06:57.326305 #428793] INFO -- : make[1]: Entering directory '/tmp/ruby/build/trunk' I, [2024-05-16T22:06:57.326370 #428793] INFO -- : make[1]: Nothing to be done for 'encs'. I, [2024-05-16T22:06:57.326380 #428793] INFO -- : make[1]: Leaving directory '/tmp/ruby/build/trunk' I, [2024-05-16T22:06:57.412039 #428793] INFO -- : make[1]: Leaving directory '/tmp/ruby/build/trunk' I, [2024-05-16T22:06:57.412912 #428793] INFO -- : generating makefile exts.mk I, [2024-05-16T22:06:57.450109 #428793] INFO -- : exts.mk unchanged I, [2024-05-16T22:06:57.454711 #428793] INFO -- : make[1]: Entering directory '/tmp/ruby/build/trunk' I, [2024-05-16T22:06:57.478352 #428793] INFO -- : make[2]: Entering directory '/tmp/ruby/build/trunk/ext/digest' I, [2024-05-16T22:06:57.478460 #428793] INFO -- : make[2]: Entering directory '/tmp/ruby/build/trunk/ext/json' I, [2024-05-16T22:06:57.479291 #428793] INFO -- : make[2]: Entering directory '/tmp/ruby/build/trunk/ext/coverage' I, [2024-05-16T22:06:57.480093 #428793] INFO -- : make[2]: Entering directory '/tmp/ruby/build/trunk/ext/io/console' I, [2024-05-16T22:06:57.480610 #428793] INFO -- : make[2]: Entering directory '/tmp/ruby/build/trunk/ext/date' I, [2024-05-16T22:06:57.480643 #428793] INFO -- : make[2]: Entering directory '/tmp/ruby/build/trunk/ext/rubyvm' I, [2024-05-16T22:06:57.481460 #428793] INFO -- : make[2]: Entering directory '/tmp/ruby/build/trunk/ext/monitor' I, [2024-05-16T22:06:57.482091 #428793] INFO -- : make[2]: Entering directory '/tmp/ruby/build/trunk/ext/pathname' I, [2024-05-16T22:06:57.482454 #428793] INFO -- : make[2]: Leaving directory '/tmp/ruby/build/trunk/ext/coverage' I, [2024-05-16T22:06:57.482479 #428793] INFO -- : make[2]: Entering directory '/tmp/ruby/build/trunk/ext/fiddle' I, [2024-05-16T22:06:57.482488 #428793] INFO -- : make[2]: Entering directory '/tmp/ruby/build/trunk/ext/pty' I, [2024-05-16T22:06:57.483160 #428793] INFO -- : make[2]: Leaving directory '/tmp/ruby/build/trunk/ext/rubyvm' I, [2024-05-16T22:06:57.483508 #428793] INFO -- : make[2]: Leaving directory '/tmp/ruby/build/trunk/ext/io/console' I, [2024-05-16T22:06:57.483519 #428793] INFO -- : make[2]: Entering directory '/tmp/ruby/build/trunk/ext/objspace' I, [2024-05-16T22:06:57.484215 #428793] INFO -- : make[2]: Entering directory '/tmp/ruby/build/trunk/ext/psych' I, [2024-05-16T22:06:57.484479 #428793] INFO -- : make[2]: Leaving directory '/tmp/ruby/build/trunk/ext/digest' I, [2024-05-16T22:06:57.484728 #428793] INFO -- : make[2]: Leaving directory '/tmp/ruby/build/trunk/ext/monitor' I, [2024-05-16T22:06:57.484877 #428793] INFO -- : make[2]: Leaving directory '/tmp/ruby/build/trunk/ext/date' I, [2024-05-16T22:06:57.485132 #428793] INFO -- : make[2]: Leaving directory '/tmp/ruby/build/trunk/ext/pty' I, [2024-05-16T22:06:57.485441 #428793] INFO -- : make[2]: Leaving directory '/tmp/ruby/build/trunk/ext/pathname' I, [2024-05-16T22:06:57.485988 #428793] INFO -- : make[2]: Entering directory '/tmp/ruby/build/trunk/ext/ripper' I, [2024-05-16T22:06:57.486851 #428793] INFO -- : make[2]: Entering directory '/tmp/ruby/build/trunk/.bundle/gems/debug-1.9.2/ext/debug' I, [2024-05-16T22:06:57.486919 #428793] INFO -- : make[2]: Entering directory '/tmp/ruby/build/trunk/.bundle/gems/bigdecimal-3.1.8/ext/bigdecimal' I, [2024-05-16T22:06:57.486930 #428793] INFO -- : make[2]: Entering directory '/tmp/ruby/build/trunk/.bundle/gems/nkf-0.2.0/ext/nkf' I, [2024-05-16T22:06:57.487197 #428793] INFO -- : make[2]: Leaving directory '/tmp/ruby/build/trunk/ext/json' I, [2024-05-16T22:06:57.487230 #428793] INFO -- : make[2]: Entering directory '/tmp/ruby/build/trunk/.bundle/gems/racc-1.7.3/ext/racc/cparse' I, [2024-05-16T22:06:57.487364 #428793] INFO -- : make[2]: Entering directory '/tmp/ruby/build/trunk/.bundle/gems/syslog-0.1.2/ext/syslog' I, [2024-05-16T22:06:57.487724 #428793] INFO -- : make[2]: Leaving directory '/tmp/ruby/build/trunk/ext/objspace' I, [2024-05-16T22:06:57.487887 #428793] INFO -- : make[2]: Entering directory '/tmp/ruby/build/trunk/.bundle/gems/rbs-3.4.4/ext/rbs_extension' I, [2024-05-16T22:06:57.489318 #428793] INFO -- : make[2]: Leaving directory '/tmp/ruby/build/trunk/ext/fiddle' I, [2024-05-16T22:06:57.490100 #428793] INFO -- : make[2]: Entering directory '/tmp/ruby/build/trunk/ext/socket' I, [2024-05-16T22:06:57.491235 #428793] INFO -- : make[2]: Leaving directory '/tmp/ruby/build/trunk/ext/ripper' I, [2024-05-16T22:06:57.492527 #428793] INFO -- : make[2]: Entering directory '/tmp/ruby/build/trunk/ext/digest/sha2' I, [2024-05-16T22:06:57.494374 #428793] INFO -- : make[2]: Entering directory '/tmp/ruby/build/trunk/ext/openssl' I, [2024-05-16T22:06:57.495002 #428793] INFO -- : make[2]: Leaving directory '/tmp/ruby/build/trunk/ext/digest/sha2' I, [2024-05-16T22:06:57.496082 #428793] INFO -- : make[2]: Leaving directory '/tmp/ruby/build/trunk/ext/socket' I, [2024-05-16T22:06:57.496951 #428793] INFO -- : make[2]: Leaving directory '/tmp/ruby/build/trunk/ext/psych' I, [2024-05-16T22:06:57.505523 #428793] INFO -- : make[2]: Leaving directory '/tmp/ruby/build/trunk/ext/openssl' I, [2024-05-16T22:06:57.509755 #428793] INFO -- : make[2]: Leaving directory '/tmp/ruby/build/trunk/.bundle/gems/bigdecimal-3.1.8/ext/bigdecimal' I, [2024-05-16T22:06:57.509808 #428793] INFO -- : make[2]: Leaving directory '/tmp/ruby/build/trunk/.bundle/gems/debug-1.9.2/ext/debug' I, [2024-05-16T22:06:57.511699 #428793] INFO -- : make[2]: Leaving directory '/tmp/ruby/build/trunk/.bundle/gems/racc-1.7.3/ext/racc/cparse' I, [2024-05-16T22:06:57.512749 #428793] INFO -- : make[2]: Leaving directory '/tmp/ruby/build/trunk/.bundle/gems/nkf-0.2.0/ext/nkf' I, [2024-05-16T22:06:57.513869 #428793] INFO -- : make[2]: Leaving directory '/tmp/ruby/build/trunk/.bundle/gems/syslog-0.1.2/ext/syslog' I, [2024-05-16T22:06:57.519597 #428793] INFO -- : make[2]: Leaving directory '/tmp/ruby/build/trunk/.bundle/gems/rbs-3.4.4/ext/rbs_extension' I, [2024-05-16T22:06:57.543838 #428793] INFO -- : make[2]: Entering directory '/tmp/ruby/build/trunk' I, [2024-05-16T22:06:57.610784 #428793] INFO -- : make[2]: 'ruby' is up to date. I, [2024-05-16T22:06:57.610821 #428793] INFO -- : make[2]: Leaving directory '/tmp/ruby/build/trunk' I, [2024-05-16T22:06:57.611315 #428793] INFO -- : make[1]: Leaving directory '/tmp/ruby/build/trunk' I, [2024-05-16T22:06:57.614902 #428793] INFO -- : make[1]: Entering directory '/tmp/ruby/build/trunk' I, [2024-05-16T22:06:57.614923 #428793] INFO -- : make[1]: Nothing to be done for 'note'. I, [2024-05-16T22:06:57.614929 #428793] INFO -- : make[1]: Leaving directory '/tmp/ruby/build/trunk' I, [2024-05-16T22:06:57.615154 #428793] INFO -- : ./miniruby -I/tmp/ruby/src/trunk/lib -I. -I.ext/common /tmp/ruby/src/trunk/tool/runruby.rb --extout=.ext -- --disable-gems -r./x86_64-linux-fake /tmp/ruby/src/trunk/tool/rbinstall.rb --make="make" --dest-dir="" --extout=".ext" --ext-build-dir="./ext" --mflags="-j20 --jobserver-auth=4,5" --make-flags=" -j20 --jobserver-auth=4,5" --data-mode=0644 --prog-mode=0755 --installed-list .installed.list --mantype="doc" --gnumake --install=all --exclude=doc I, [2024-05-16T22:06:57.710886 #428793] INFO -- : Installing to I, [2024-05-16T22:06:57.710954 #428793] INFO -- : installing binary commands: /tmp/ruby/install/trunk/bin I, [2024-05-16T22:06:57.711040 #428793] INFO -- : installing base libraries: /tmp/ruby/install/trunk/lib I, [2024-05-16T22:06:57.718254 #428793] INFO -- : installing arch files: /tmp/ruby/install/trunk/lib/ruby/3.4.0+0/x86_64-linux I, [2024-05-16T22:06:57.718279 #428793] INFO -- : installing pkgconfig data: /tmp/ruby/install/trunk/lib/pkgconfig I, [2024-05-16T22:06:57.718286 #428793] INFO -- : installing extension objects: /tmp/ruby/install/trunk/lib/ruby/3.4.0+0/x86_64-linux I, [2024-05-16T22:06:57.727573 #428793] INFO -- : installing extension objects: /tmp/ruby/install/trunk/lib/ruby/site_ruby/3.4.0+0/x86_64-linux I, [2024-05-16T22:06:57.727602 #428793] INFO -- : installing extension objects: /tmp/ruby/install/trunk/lib/ruby/vendor_ruby/3.4.0+0/x86_64-linux I, [2024-05-16T22:06:57.727617 #428793] INFO -- : installing extension headers: /tmp/ruby/install/trunk/include/ruby-3.4.0+0/x86_64-linux I, [2024-05-16T22:06:57.727753 #428793] INFO -- : installing extension scripts: /tmp/ruby/install/trunk/lib/ruby/3.4.0+0 I, [2024-05-16T22:06:57.730454 #428793] INFO -- : installing extension scripts: /tmp/ruby/install/trunk/lib/ruby/site_ruby/3.4.0+0 I, [2024-05-16T22:06:57.730475 #428793] INFO -- : installing extension scripts: /tmp/ruby/install/trunk/lib/ruby/vendor_ruby/3.4.0+0 I, [2024-05-16T22:06:57.730481 #428793] INFO -- : installing extension headers: /tmp/ruby/install/trunk/include/ruby-3.4.0+0/ruby I, [2024-05-16T22:06:57.730484 #428793] INFO -- : installing command scripts: /tmp/ruby/install/trunk/bin I, [2024-05-16T22:06:57.730488 #428793] INFO -- : installing library scripts: /tmp/ruby/install/trunk/lib/ruby/3.4.0+0 I, [2024-05-16T22:06:57.763047 #428793] INFO -- : installing common headers: /tmp/ruby/install/trunk/include/ruby-3.4.0+0 I, [2024-05-16T22:06:57.769063 #428793] INFO -- : installing manpages: /tmp/ruby/install/trunk/share/man/man1 I, [2024-05-16T22:06:57.769099 #428793] INFO -- : installing default gems from lib: /tmp/ruby/install/trunk/lib/ruby/gems/3.4.0+0 I, [2024-05-16T22:06:57.791804 #428793] INFO -- : benchmark 0.3.0 I, [2024-05-16T22:06:57.793657 #428793] INFO -- : bundler 2.6.0.dev I, [2024-05-16T22:06:57.795735 #428793] INFO -- : cgi 0.4.1 I, [2024-05-16T22:06:57.796294 #428793] INFO -- : delegate 0.3.1 I, [2024-05-16T22:06:57.796791 #428793] INFO -- : did_you_mean 1.6.3 I, [2024-05-16T22:06:57.797260 #428793] INFO -- : english 0.8.0 I, [2024-05-16T22:06:57.797736 #428793] INFO -- : erb 4.0.4 I, [2024-05-16T22:06:57.798704 #428793] INFO -- : error_highlight 0.6.0 I, [2024-05-16T22:06:57.799473 #428793] INFO -- : fileutils 1.7.2 I, [2024-05-16T22:06:57.800327 #428793] INFO -- : find 0.2.0 I, [2024-05-16T22:06:57.801084 #428793] INFO -- : forwardable 1.3.3 I, [2024-05-16T22:06:57.802157 #428793] INFO -- : ipaddr 1.2.6 I, [2024-05-16T22:06:57.802731 #428793] INFO -- : irb 1.13.1 I, [2024-05-16T22:06:57.803522 #428793] INFO -- : logger 1.6.0 I, [2024-05-16T22:06:57.804102 #428793] INFO -- : net-http 0.4.1 I, [2024-05-16T22:06:57.804544 #428793] INFO -- : net-protocol 0.2.2 I, [2024-05-16T22:06:57.805033 #428793] INFO -- : open-uri 0.4.1 I, [2024-05-16T22:06:57.805617 #428793] INFO -- : open3 0.2.1 I, [2024-05-16T22:06:57.806066 #428793] INFO -- : optparse 0.5.0 I, [2024-05-16T22:06:57.806552 #428793] INFO -- : ostruct 0.6.0 I, [2024-05-16T22:06:57.806992 #428793] INFO -- : pp 0.5.0 I, [2024-05-16T22:06:57.807526 #428793] INFO -- : prettyprint 0.2.0 I, [2024-05-16T22:06:57.807945 #428793] INFO -- : prism 0.29.0 I, [2024-05-16T22:06:57.808488 #428793] INFO -- : pstore 0.1.3 I, [2024-05-16T22:06:57.808965 #428793] INFO -- : rdoc 6.6.3.1 I, [2024-05-16T22:06:57.809919 #428793] INFO -- : readline 0.0.4 I, [2024-05-16T22:06:57.810464 #428793] INFO -- : reline 0.5.7 I, [2024-05-16T22:06:57.810980 #428793] INFO -- : resolv 0.4.0 I, [2024-05-16T22:06:57.811445 #428793] INFO -- : ruby2_keywords 0.0.5 I, [2024-05-16T22:06:57.811950 #428793] INFO -- : securerandom 0.3.1 I, [2024-05-16T22:06:57.812943 #428793] INFO -- : set 1.1.0 I, [2024-05-16T22:06:57.813598 #428793] INFO -- : shellwords 0.2.0 I, [2024-05-16T22:06:57.814163 #428793] INFO -- : singleton 0.2.0 I, [2024-05-16T22:06:57.814608 #428793] INFO -- : syntax_suggest 2.0.0 I, [2024-05-16T22:06:57.815236 #428793] INFO -- : tempfile 0.2.1 I, [2024-05-16T22:06:57.815787 #428793] INFO -- : time 0.3.0 I, [2024-05-16T22:06:57.816278 #428793] INFO -- : timeout 0.4.1 I, [2024-05-16T22:06:57.816757 #428793] INFO -- : tmpdir 0.2.0 I, [2024-05-16T22:06:57.817323 #428793] INFO -- : tsort 0.2.0 I, [2024-05-16T22:06:57.817591 #428793] INFO -- : un 0.3.0 I, [2024-05-16T22:06:57.818076 #428793] INFO -- : uri 0.13.0 I, [2024-05-16T22:06:57.818599 #428793] INFO -- : weakref 0.1.3 I, [2024-05-16T22:06:57.819150 #428793] INFO -- : yaml 0.3.0 I, [2024-05-16T22:06:57.819454 #428793] INFO -- : installing default gems from ext: /tmp/ruby/install/trunk/lib/ruby/gems/3.4.0+0 I, [2024-05-16T22:06:57.826057 #428793] INFO -- : date 3.3.4 I, [2024-05-16T22:06:57.826595 #428793] INFO -- : digest 3.1.1 I, [2024-05-16T22:06:57.827078 #428793] INFO -- : etc 1.4.3 I, [2024-05-16T22:06:57.827571 #428793] INFO -- : fcntl 1.1.0 I, [2024-05-16T22:06:57.828179 #428793] INFO -- : fiddle 1.1.3 I, [2024-05-16T22:06:57.828679 #428793] INFO -- : io-console 0.7.2 I, [2024-05-16T22:06:57.829146 #428793] INFO -- : io-nonblock 0.3.0 I, [2024-05-16T22:06:57.829533 #428793] INFO -- : io-wait 0.3.1 I, [2024-05-16T22:06:57.830004 #428793] INFO -- : json 2.7.2 I, [2024-05-16T22:06:57.830529 #428793] INFO -- : openssl 3.2.0 I, [2024-05-16T22:06:57.831132 #428793] INFO -- : pathname 0.3.0 I, [2024-05-16T22:06:57.831605 #428793] INFO -- : psych 5.1.2 I, [2024-05-16T22:06:57.832169 #428793] INFO -- : stringio 3.1.1 I, [2024-05-16T22:06:57.832672 #428793] INFO -- : strscan 3.1.1 I, [2024-05-16T22:06:57.833127 #428793] INFO -- : zlib 3.1.0 I, [2024-05-16T22:06:57.833434 #428793] INFO -- : installing bundled gems: /tmp/ruby/install/trunk/lib/ruby/gems/3.4.0+0 I, [2024-05-16T22:06:57.833764 #428793] INFO -- : minitest 5.22.3 I, [2024-05-16T22:06:57.841457 #428793] INFO -- : rake 13.2.1 I, [2024-05-16T22:06:57.844867 #428793] INFO -- : test-unit 3.6.2 I, [2024-05-16T22:06:57.849580 #428793] INFO -- : rexml 3.2.6 I, [2024-05-16T22:06:57.853247 #428793] INFO -- : rss 0.3.0 I, [2024-05-16T22:06:57.855886 #428793] INFO -- : net-ftp 0.3.4 I, [2024-05-16T22:06:57.857501 #428793] INFO -- : net-imap 0.4.11 I, [2024-05-16T22:06:57.861209 #428793] INFO -- : net-pop 0.1.2 I, [2024-05-16T22:06:57.862253 #428793] INFO -- : net-smtp 0.5.0 I, [2024-05-16T22:06:57.863427 #428793] INFO -- : matrix 0.4.2 I, [2024-05-16T22:06:57.866720 #428793] INFO -- : prime 0.1.2 I, [2024-05-16T22:06:57.871607 #428793] INFO -- : rbs 3.4.4 I, [2024-05-16T22:06:57.893487 #428793] INFO -- : typeprof 0.21.11 I, [2024-05-16T22:06:57.895799 #428793] INFO -- : debug 1.9.2 I, [2024-05-16T22:06:57.898823 #428793] INFO -- : racc 1.7.3 I, [2024-05-16T22:06:57.901941 #428793] INFO -- : mutex_m 0.2.0 I, [2024-05-16T22:06:57.903231 #428793] INFO -- : getoptlong 0.2.1 I, [2024-05-16T22:06:57.904645 #428793] INFO -- : base64 0.2.0 I, [2024-05-16T22:06:57.905750 #428793] INFO -- : bigdecimal 3.1.8 I, [2024-05-16T22:06:57.907849 #428793] INFO -- : observer 0.1.2 I, [2024-05-16T22:06:57.908972 #428793] INFO -- : abbrev 0.1.2 I, [2024-05-16T22:06:57.910519 #428793] INFO -- : resolv-replace 0.1.1 I, [2024-05-16T22:06:57.911781 #428793] INFO -- : rinda 0.2.0 I, [2024-05-16T22:06:57.913283 #428793] INFO -- : drb 2.2.1 I, [2024-05-16T22:06:57.914945 #428793] INFO -- : nkf 0.2.0 I, [2024-05-16T22:06:57.917810 #428793] INFO -- : syslog 0.1.2 I, [2024-05-16T22:06:57.919472 #428793] INFO -- : csv 3.3.0 I, [2024-05-16T22:06:57.922204 #428793] INFO -- : installing bundled gem cache: /tmp/ruby/install/trunk/lib/ruby/gems/3.4.0+0/cache I, [2024-05-16T22:06:57.923550 #428793] INFO -- : skipped bundled gems: I, [2024-05-16T22:06:57.923571 #428793] INFO -- : power_assert-2.0.4dev.gem not found in bundled_gems I, [2024-05-16T22:06:57.927068 #428793] INFO -- : $$$[end] "make install -j20" exit with 0. I, [2024-05-16T22:06:57.927180 #428793] INFO -- : $$$[beg] make yes-btest TESTOPTS='-q -j20' I, [2024-05-16T22:07:03.875134 #428793] INFO -- : PASS all 1936 tests E, [2024-05-16T22:07:03.880831 #428793] ERROR -- : I, [2024-05-16T22:07:03.881191 #428793] INFO -- : $$$[end] "make yes-btest TESTOPTS='-q -j20'" exit with 0. I, [2024-05-16T22:07:03.881285 #428793] INFO -- : $$$[beg] make yes-test-basic TESTS='-j20' I, [2024-05-16T22:07:03.941123 #428793] INFO -- : BASERUBY = /usr/bin/ruby --disable=gems I, [2024-05-16T22:07:03.941151 #428793] INFO -- : CC = gcc I, [2024-05-16T22:07:03.941157 #428793] INFO -- : LD = ld I, [2024-05-16T22:07:03.941161 #428793] INFO -- : LDSHARED = gcc -shared I, [2024-05-16T22:07:03.941166 #428793] INFO -- : CFLAGS = -O3 -fno-fast-math -ggdb3 -Wall -Wextra -Wdeprecated-declarations -Wdiv-by-zero -Wduplicated-cond -Wimplicit-function-declaration -Wimplicit-int -Wpointer-arith -Wwrite-strings -Wold-style-definition -Wimplicit-fallthrough=0 -Wmissing-noreturn -Wno-cast-function-type -Wno-constant-logical-operand -Wno-long-long -Wno-missing-field-initializers -Wno-overlength-strings -Wno-packed-bitfield-compat -Wno-parentheses-equality -Wno-self-assign -Wno-tautological-compare -Wno-unused-parameter -Wno-unused-value -Wsuggest-attribute=format -Wsuggest-attribute=noreturn -Wunused-variable -Wmisleading-indentation -Wundef -fPIC I, [2024-05-16T22:07:03.941171 #428793] INFO -- : XCFLAGS = -U_FORTIFY_SOURCE -D_FORTIFY_SOURCE=2 -fstack-protector-strong -fno-strict-overflow -fvisibility=hidden -fexcess-precision=standard -DRUBY_EXPORT -I. -I.ext/include/x86_64-linux -I/tmp/ruby/src/trunk/include -I/tmp/ruby/src/trunk -I/tmp/ruby/src/trunk/prism -I/tmp/ruby/src/trunk/enc/unicode/15.0.0 I, [2024-05-16T22:07:03.941174 #428793] INFO -- : CPPFLAGS = I, [2024-05-16T22:07:03.941178 #428793] INFO -- : DLDFLAGS = -Wl,--compress-debug-sections=zlib -Wl,-soname,libruby.so.3.4 -fstack-protector-strong I, [2024-05-16T22:07:03.941182 #428793] INFO -- : SOLIBS = -lz -lrt -lrt -lgmp -ldl -lcrypt -lm -lpthread I, [2024-05-16T22:07:03.941186 #428793] INFO -- : LANG = en_US.UTF-8 I, [2024-05-16T22:07:03.941191 #428793] INFO -- : LC_ALL = I, [2024-05-16T22:07:03.941195 #428793] INFO -- : LC_CTYPE = I, [2024-05-16T22:07:03.941198 #428793] INFO -- : MFLAGS = I, [2024-05-16T22:07:03.941201 #428793] INFO -- : RUSTC = no I, [2024-05-16T22:07:03.941205 #428793] INFO -- : YJIT_RUSTC_ARGS = --crate-name=yjit --crate-type=staticlib --edition=2021 -g -C lto=thin -C opt-level=3 -C overflow-checks=on '--out-dir=/tmp/ruby/build/trunk/yjit/target/release/' /tmp/ruby/src/trunk/yjit/src/lib.rs I, [2024-05-16T22:07:03.941739 #428793] INFO -- : gcc (Ubuntu 11.4.0-1ubuntu1~22.04) 11.4.0 I, [2024-05-16T22:07:03.941759 #428793] INFO -- : Copyright (C) 2021 Free Software Foundation, Inc. I, [2024-05-16T22:07:03.941765 #428793] INFO -- : This is free software; see the source for copying conditions. There is NO I, [2024-05-16T22:07:03.941770 #428793] INFO -- : warranty; not even for MERCHANTABILITY or FITNESS FOR A PARTICULAR PURPOSE. I, [2024-05-16T22:07:03.941774 #428793] INFO -- : I, [2024-05-16T22:07:04.046126 #428793] INFO -- : Checking leaked global symbols...none I, [2024-05-16T22:07:04.086625 #428793] INFO -- : /tmp/ruby/src/trunk/basictest/test.rb:assignment ....................................................................................................................................................................................................................................................................................................................................................................................OK 372 I, [2024-05-16T22:07:04.086682 #428793] INFO -- : /tmp/ruby/src/trunk/basictest/test.rb:condition ..OK 2 I, [2024-05-16T22:07:04.086688 #428793] INFO -- : /tmp/ruby/src/trunk/basictest/test.rb:if/unless ...OK 3 I, [2024-05-16T22:07:04.086692 #428793] INFO -- : /tmp/ruby/src/trunk/basictest/test.rb:case .....OK 5 I, [2024-05-16T22:07:04.086907 #428793] INFO -- : /tmp/ruby/src/trunk/basictest/test.rb:while/until ........OK 8 I, [2024-05-16T22:07:04.086959 #428793] INFO -- : /tmp/ruby/src/trunk/basictest/test.rb:exception ..........OK 10 I, [2024-05-16T22:07:04.087226 #428793] INFO -- : /tmp/ruby/src/trunk/basictest/test.rb:array .......................................OK 39 I, [2024-05-16T22:07:04.087328 #428793] INFO -- : /tmp/ruby/src/trunk/basictest/test.rb:hash ...........................OK 27 I, [2024-05-16T22:07:04.088048 #428793] INFO -- : /tmp/ruby/src/trunk/basictest/test.rb:iterator ...........................................................................................................OK 107 I, [2024-05-16T22:07:04.088325 #428793] INFO -- : /tmp/ruby/src/trunk/basictest/test.rb:float ................................................................................OK 80 I, [2024-05-16T22:07:04.089329 #428793] INFO -- : /tmp/ruby/src/trunk/basictest/test.rb:bignum ...............................OK 31 I, [2024-05-16T22:07:04.090098 #428793] INFO -- : /tmp/ruby/src/trunk/basictest/test.rb:string & char ..............................................................OK 62 I, [2024-05-16T22:07:04.090130 #428793] INFO -- : /tmp/ruby/src/trunk/basictest/test.rb:assignment ..........OK 10 I, [2024-05-16T22:07:04.090158 #428793] INFO -- : /tmp/ruby/src/trunk/basictest/test.rb:call ......OK 6 I, [2024-05-16T22:07:04.090209 #428793] INFO -- : /tmp/ruby/src/trunk/basictest/test.rb:proc .........OK 9 I, [2024-05-16T22:07:04.190931 #428793] INFO -- : /tmp/ruby/src/trunk/basictest/test.rb:signal ..OK 2 I, [2024-05-16T22:07:04.193493 #428793] INFO -- : /tmp/ruby/src/trunk/basictest/test.rb:eval ...........................OK 27 I, [2024-05-16T22:07:04.300601 #428793] INFO -- : /tmp/ruby/src/trunk/basictest/test.rb:system ........OK 8 I, [2024-05-16T22:07:04.300685 #428793] INFO -- : /tmp/ruby/src/trunk/basictest/test.rb:const .....OK 5 I, [2024-05-16T22:07:04.300700 #428793] INFO -- : /tmp/ruby/src/trunk/basictest/test.rb:clone .....OK 5 I, [2024-05-16T22:07:04.300723 #428793] INFO -- : /tmp/ruby/src/trunk/basictest/test.rb:marshal ....OK 4 I, [2024-05-16T22:07:04.300812 #428793] INFO -- : /tmp/ruby/src/trunk/basictest/test.rb:pack ....OK 4 I, [2024-05-16T22:07:04.300847 #428793] INFO -- : /tmp/ruby/src/trunk/basictest/test.rb:math ..OK 2 I, [2024-05-16T22:07:04.300864 #428793] INFO -- : /tmp/ruby/src/trunk/basictest/test.rb:struct ......OK 6 I, [2024-05-16T22:07:04.300976 #428793] INFO -- : /tmp/ruby/src/trunk/basictest/test.rb:variable ............OK 12 I, [2024-05-16T22:07:04.301000 #428793] INFO -- : /tmp/ruby/src/trunk/basictest/test.rb:trace ...OK 3 I, [2024-05-16T22:07:04.301015 #428793] INFO -- : /tmp/ruby/src/trunk/basictest/test.rb:defined? ............OK 12 I, [2024-05-16T22:07:04.301052 #428793] INFO -- : /tmp/ruby/src/trunk/basictest/test.rb:alias ......OK 6 I, [2024-05-16T22:07:04.301407 #428793] INFO -- : /tmp/ruby/src/trunk/basictest/test.rb:path .......................OK 23 I, [2024-05-16T22:07:04.335441 #428793] INFO -- : /tmp/ruby/src/trunk/basictest/test.rb:gc ....OK 4 I, [2024-05-16T22:07:04.337772 #428793] INFO -- : I, [2024-05-16T22:07:04.337864 #428793] INFO -- : test succeeded I, [2024-05-16T22:07:04.339291 #428793] INFO -- : $$$[end] "make yes-test-basic TESTS='-j20'" exit with 0. I, [2024-05-16T22:07:04.339409 #428793] INFO -- : $$$[beg] make yes-test-all TESTOPTS='--stderr-on-failure' TESTS='-j20' I, [2024-05-16T22:07:04.430887 #428793] INFO -- : BASERUBY = /usr/bin/ruby --disable=gems I, [2024-05-16T22:07:04.430926 #428793] INFO -- : CC = gcc I, [2024-05-16T22:07:04.430932 #428793] INFO -- : LD = ld I, [2024-05-16T22:07:04.430936 #428793] INFO -- : LDSHARED = gcc -shared I, [2024-05-16T22:07:04.430940 #428793] INFO -- : CFLAGS = -O3 -fno-fast-math -ggdb3 -Wall -Wextra -Wdeprecated-declarations -Wdiv-by-zero -Wduplicated-cond -Wimplicit-function-declaration -Wimplicit-int -Wpointer-arith -Wwrite-strings -Wold-style-definition -Wimplicit-fallthrough=0 -Wmissing-noreturn -Wno-cast-function-type -Wno-constant-logical-operand -Wno-long-long -Wno-missing-field-initializers -Wno-overlength-strings -Wno-packed-bitfield-compat -Wno-parentheses-equality -Wno-self-assign -Wno-tautological-compare -Wno-unused-parameter -Wno-unused-value -Wsuggest-attribute=format -Wsuggest-attribute=noreturn -Wunused-variable -Wmisleading-indentation -Wundef -fPIC I, [2024-05-16T22:07:04.430945 #428793] INFO -- : XCFLAGS = -U_FORTIFY_SOURCE -D_FORTIFY_SOURCE=2 -fstack-protector-strong -fno-strict-overflow -fvisibility=hidden -fexcess-precision=standard -DRUBY_EXPORT -I. -I.ext/include/x86_64-linux -I/tmp/ruby/src/trunk/include -I/tmp/ruby/src/trunk -I/tmp/ruby/src/trunk/prism -I/tmp/ruby/src/trunk/enc/unicode/15.0.0 I, [2024-05-16T22:07:04.430950 #428793] INFO -- : CPPFLAGS = I, [2024-05-16T22:07:04.430953 #428793] INFO -- : DLDFLAGS = -Wl,--compress-debug-sections=zlib -Wl,-soname,libruby.so.3.4 -fstack-protector-strong I, [2024-05-16T22:07:04.430957 #428793] INFO -- : SOLIBS = -lz -lrt -lrt -lgmp -ldl -lcrypt -lm -lpthread I, [2024-05-16T22:07:04.430961 #428793] INFO -- : LANG = en_US.UTF-8 I, [2024-05-16T22:07:04.430964 #428793] INFO -- : LC_ALL = I, [2024-05-16T22:07:04.430967 #428793] INFO -- : LC_CTYPE = I, [2024-05-16T22:07:04.430971 #428793] INFO -- : MFLAGS = I, [2024-05-16T22:07:04.430974 #428793] INFO -- : RUSTC = no I, [2024-05-16T22:07:04.430979 #428793] INFO -- : YJIT_RUSTC_ARGS = --crate-name=yjit --crate-type=staticlib --edition=2021 -g -C lto=thin -C opt-level=3 -C overflow-checks=on '--out-dir=/tmp/ruby/build/trunk/yjit/target/release/' /tmp/ruby/src/trunk/yjit/src/lib.rs I, [2024-05-16T22:07:04.431501 #428793] INFO -- : gcc (Ubuntu 11.4.0-1ubuntu1~22.04) 11.4.0 I, [2024-05-16T22:07:04.431522 #428793] INFO -- : Copyright (C) 2021 Free Software Foundation, Inc. I, [2024-05-16T22:07:04.431528 #428793] INFO -- : This is free software; see the source for copying conditions. There is NO I, [2024-05-16T22:07:04.431532 #428793] INFO -- : warranty; not even for MERCHANTABILITY or FITNESS FOR A PARTICULAR PURPOSE. I, [2024-05-16T22:07:04.431536 #428793] INFO -- : I, [2024-05-16T22:07:04.433256 #428793] INFO -- : generating enc.mk I, [2024-05-16T22:07:04.551229 #428793] INFO -- : making enc I, [2024-05-16T22:07:04.568165 #428793] INFO -- : make[1]: Entering directory '/tmp/ruby/build/trunk' I, [2024-05-16T22:07:04.568187 #428793] INFO -- : make[1]: Nothing to be done for 'enc'. I, [2024-05-16T22:07:04.568193 #428793] INFO -- : make[1]: Leaving directory '/tmp/ruby/build/trunk' I, [2024-05-16T22:07:04.568979 #428793] INFO -- : making srcs under enc I, [2024-05-16T22:07:04.598838 #428793] INFO -- : make[1]: Entering directory '/tmp/ruby/build/trunk' I, [2024-05-16T22:07:04.598860 #428793] INFO -- : make[1]: Nothing to be done for 'srcs'. I, [2024-05-16T22:07:04.598868 #428793] INFO -- : make[1]: Leaving directory '/tmp/ruby/build/trunk' I, [2024-05-16T22:07:04.599834 #428793] INFO -- : generating transdb.h I, [2024-05-16T22:07:04.695895 #428793] INFO -- : transdb.h unchanged I, [2024-05-16T22:07:04.697458 #428793] INFO -- : making trans I, [2024-05-16T22:07:04.731137 #428793] INFO -- : make[1]: Entering directory '/tmp/ruby/build/trunk' I, [2024-05-16T22:07:04.731166 #428793] INFO -- : make[1]: Nothing to be done for 'trans'. I, [2024-05-16T22:07:04.731171 #428793] INFO -- : make[1]: Leaving directory '/tmp/ruby/build/trunk' I, [2024-05-16T22:07:04.731820 #428793] INFO -- : making encs I, [2024-05-16T22:07:04.769147 #428793] INFO -- : make[1]: Entering directory '/tmp/ruby/build/trunk' I, [2024-05-16T22:07:04.769168 #428793] INFO -- : make[1]: Nothing to be done for 'encs'. I, [2024-05-16T22:07:04.769174 #428793] INFO -- : make[1]: Leaving directory '/tmp/ruby/build/trunk' I, [2024-05-16T22:07:04.770982 #428793] INFO -- : generating makefiles ext/configure-ext.mk I, [2024-05-16T22:07:04.797525 #428793] INFO -- : ext/configure-ext.mk updated I, [2024-05-16T22:07:04.800074 #428793] INFO -- : make[1]: Entering directory '/tmp/ruby/build/trunk' I, [2024-05-16T22:07:06.162227 #428793] INFO -- : make[1]: Leaving directory '/tmp/ruby/build/trunk' I, [2024-05-16T22:07:06.162995 #428793] INFO -- : generating makefile exts.mk I, [2024-05-16T22:07:06.199842 #428793] INFO -- : exts.mk unchanged I, [2024-05-16T22:07:06.204254 #428793] INFO -- : make[1]: Entering directory '/tmp/ruby/build/trunk' I, [2024-05-16T22:07:06.512271 #428793] INFO -- : make[2]: Entering directory '/tmp/ruby/build/trunk/ext/coverage' I, [2024-05-16T22:07:06.515808 #428793] INFO -- : make[2]: Leaving directory '/tmp/ruby/build/trunk/ext/coverage' I, [2024-05-16T22:07:06.521678 #428793] INFO -- : make[2]: Entering directory '/tmp/ruby/build/trunk/ext/date' I, [2024-05-16T22:07:06.525654 #428793] INFO -- : make[2]: Leaving directory '/tmp/ruby/build/trunk/ext/date' I, [2024-05-16T22:07:06.529469 #428793] INFO -- : make[2]: Entering directory '/tmp/ruby/build/trunk/ext/digest' I, [2024-05-16T22:07:06.538344 #428793] INFO -- : make[2]: Leaving directory '/tmp/ruby/build/trunk/ext/digest' I, [2024-05-16T22:07:06.564807 #428793] INFO -- : make[2]: Entering directory '/tmp/ruby/build/trunk/ext/digest/sha2' I, [2024-05-16T22:07:06.569666 #428793] INFO -- : make[2]: Leaving directory '/tmp/ruby/build/trunk/ext/digest/sha2' I, [2024-05-16T22:07:06.590290 #428793] INFO -- : make[2]: Entering directory '/tmp/ruby/build/trunk/ext/fiddle' I, [2024-05-16T22:07:06.599394 #428793] INFO -- : make[2]: Leaving directory '/tmp/ruby/build/trunk/ext/fiddle' I, [2024-05-16T22:07:06.604274 #428793] INFO -- : make[2]: Entering directory '/tmp/ruby/build/trunk/ext/io/console' I, [2024-05-16T22:07:06.608378 #428793] INFO -- : make[2]: Leaving directory '/tmp/ruby/build/trunk/ext/io/console' I, [2024-05-16T22:07:06.621130 #428793] INFO -- : make[2]: Entering directory '/tmp/ruby/build/trunk/ext/json' I, [2024-05-16T22:07:06.631640 #428793] INFO -- : make[2]: Leaving directory '/tmp/ruby/build/trunk/ext/json' I, [2024-05-16T22:07:06.646659 #428793] INFO -- : make[2]: Entering directory '/tmp/ruby/build/trunk/ext/monitor' I, [2024-05-16T22:07:06.650757 #428793] INFO -- : make[2]: Leaving directory '/tmp/ruby/build/trunk/ext/monitor' I, [2024-05-16T22:07:06.657935 #428793] INFO -- : make[2]: Entering directory '/tmp/ruby/build/trunk/ext/objspace' I, [2024-05-16T22:07:06.664079 #428793] INFO -- : make[2]: Leaving directory '/tmp/ruby/build/trunk/ext/objspace' I, [2024-05-16T22:07:06.680561 #428793] INFO -- : make[2]: Entering directory '/tmp/ruby/build/trunk/ext/openssl' I, [2024-05-16T22:07:06.695269 #428793] INFO -- : make[2]: Leaving directory '/tmp/ruby/build/trunk/ext/openssl' I, [2024-05-16T22:07:06.698992 #428793] INFO -- : make[2]: Entering directory '/tmp/ruby/build/trunk/ext/pathname' I, [2024-05-16T22:07:06.702957 #428793] INFO -- : make[2]: Leaving directory '/tmp/ruby/build/trunk/ext/pathname' I, [2024-05-16T22:07:06.710360 #428793] INFO -- : make[2]: Entering directory '/tmp/ruby/build/trunk/ext/psych' I, [2024-05-16T22:07:06.733104 #428793] INFO -- : make[2]: Leaving directory '/tmp/ruby/build/trunk/ext/psych' I, [2024-05-16T22:07:06.738357 #428793] INFO -- : make[2]: Entering directory '/tmp/ruby/build/trunk/ext/pty' I, [2024-05-16T22:07:06.742454 #428793] INFO -- : make[2]: Leaving directory '/tmp/ruby/build/trunk/ext/pty' I, [2024-05-16T22:07:06.758832 #428793] INFO -- : make[2]: Entering directory '/tmp/ruby/build/trunk/ext/ripper' I, [2024-05-16T22:07:06.767159 #428793] INFO -- : make[2]: Leaving directory '/tmp/ruby/build/trunk/ext/ripper' I, [2024-05-16T22:07:06.769673 #428793] INFO -- : make[2]: Entering directory '/tmp/ruby/build/trunk/ext/rubyvm' I, [2024-05-16T22:07:06.772906 #428793] INFO -- : make[2]: Leaving directory '/tmp/ruby/build/trunk/ext/rubyvm' I, [2024-05-16T22:07:06.785613 #428793] INFO -- : make[2]: Entering directory '/tmp/ruby/build/trunk/ext/socket' I, [2024-05-16T22:07:06.792984 #428793] INFO -- : make[2]: Leaving directory '/tmp/ruby/build/trunk/ext/socket' I, [2024-05-16T22:07:06.805445 #428793] INFO -- : make[2]: Entering directory '/tmp/ruby/build/trunk/.bundle/gems/bigdecimal-3.1.8/ext/bigdecimal' I, [2024-05-16T22:07:06.832978 #428793] INFO -- : make[2]: Leaving directory '/tmp/ruby/build/trunk/.bundle/gems/bigdecimal-3.1.8/ext/bigdecimal' I, [2024-05-16T22:07:06.834959 #428793] INFO -- : make[2]: Entering directory '/tmp/ruby/build/trunk/.bundle/gems/debug-1.9.2/ext/debug' I, [2024-05-16T22:07:06.860241 #428793] INFO -- : make[2]: Leaving directory '/tmp/ruby/build/trunk/.bundle/gems/debug-1.9.2/ext/debug' I, [2024-05-16T22:07:06.862685 #428793] INFO -- : make[2]: Entering directory '/tmp/ruby/build/trunk/.bundle/gems/nkf-0.2.0/ext/nkf' I, [2024-05-16T22:07:06.889344 #428793] INFO -- : make[2]: Leaving directory '/tmp/ruby/build/trunk/.bundle/gems/nkf-0.2.0/ext/nkf' I, [2024-05-16T22:07:06.891227 #428793] INFO -- : make[2]: Entering directory '/tmp/ruby/build/trunk/.bundle/gems/racc-1.7.3/ext/racc/cparse' I, [2024-05-16T22:07:06.912358 #428793] INFO -- : make[2]: Leaving directory '/tmp/ruby/build/trunk/.bundle/gems/racc-1.7.3/ext/racc/cparse' I, [2024-05-16T22:07:06.914739 #428793] INFO -- : make[2]: Entering directory '/tmp/ruby/build/trunk/.bundle/gems/rbs-3.4.4/ext/rbs_extension' I, [2024-05-16T22:07:06.937184 #428793] INFO -- : make[2]: Leaving directory '/tmp/ruby/build/trunk/.bundle/gems/rbs-3.4.4/ext/rbs_extension' I, [2024-05-16T22:07:06.939214 #428793] INFO -- : make[2]: Entering directory '/tmp/ruby/build/trunk/.bundle/gems/syslog-0.1.2/ext/syslog' I, [2024-05-16T22:07:06.969477 #428793] INFO -- : make[2]: Leaving directory '/tmp/ruby/build/trunk/.bundle/gems/syslog-0.1.2/ext/syslog' I, [2024-05-16T22:07:06.992821 #428793] INFO -- : make[2]: Entering directory '/tmp/ruby/build/trunk' I, [2024-05-16T22:07:07.058405 #428793] INFO -- : make[2]: 'ruby' is up to date. I, [2024-05-16T22:07:07.058609 #428793] INFO -- : make[2]: Leaving directory '/tmp/ruby/build/trunk' I, [2024-05-16T22:07:07.058736 #428793] INFO -- : make[1]: Leaving directory '/tmp/ruby/build/trunk' I, [2024-05-16T22:07:07.062356 #428793] INFO -- : make[1]: Entering directory '/tmp/ruby/build/trunk' I, [2024-05-16T22:07:07.062405 #428793] INFO -- : make[1]: Nothing to be done for 'note'. I, [2024-05-16T22:07:07.062418 #428793] INFO -- : make[1]: Leaving directory '/tmp/ruby/build/trunk' I, [2024-05-16T22:07:07.137639 #428793] INFO -- : Run options: I, [2024-05-16T22:07:07.137731 #428793] INFO -- : --seed=37167 I, [2024-05-16T22:07:07.137746 #428793] INFO -- : "--ruby=./miniruby -I/tmp/ruby/src/trunk/lib -I. -I.ext/common /tmp/ruby/src/trunk/tool/runruby.rb --extout=.ext -- --disable-gems" I, [2024-05-16T22:07:07.137762 #428793] INFO -- : --excludes-dir=/tmp/ruby/src/trunk/test/.excludes I, [2024-05-16T22:07:07.137773 #428793] INFO -- : --name=!/memory_leak/ I, [2024-05-16T22:07:07.137783 #428793] INFO -- : --stderr-on-failure I, [2024-05-16T22:07:07.137793 #428793] INFO -- : -j20 I, [2024-05-16T22:07:07.137804 #428793] INFO -- : I, [2024-05-16T22:07:07.137816 #428793] INFO -- : # Running tests: I, [2024-05-16T22:07:07.137826 #428793] INFO -- : I, [2024-05-16T22:07:07.285773 #428793] INFO -- : [ 1/885] 470159=test_gem_resolver I, [2024-05-16T22:07:07.285846 #428793] INFO -- : [ 2/885] 470157=test_gem_resolver_composed_set I, [2024-05-16T22:07:07.285867 #428793] INFO -- : [ 3/885] 470158=test_safe_load I, [2024-05-16T22:07:07.285875 #428793] INFO -- : [ 4/885] 470160=test_gem_commands_dependency_command I, [2024-05-16T22:07:07.286788 #428793] INFO -- : [ 5/885] 470162=test_rdoc_markup_attribute_manager I, [2024-05-16T22:07:07.289708 #428793] INFO -- : [ 6/885] 470167=test_name_error I, [2024-05-16T22:07:07.289764 #428793] INFO -- : [ 7/885] 470175=test_flags I, [2024-05-16T22:07:07.289812 #428793] INFO -- : [ 8/885] 470173=test_inadvertent_creation I, [2024-05-16T22:07:07.289914 #428793] INFO -- : [ 9/885] 470176=test_enumerator I, [2024-05-16T22:07:07.290005 #428793] INFO -- : [ 10/885] 470161=test_http I, [2024-05-16T22:07:07.294509 #428793] INFO -- : [ 11/885] 470171=test_gem_commands_which_command I, [2024-05-16T22:07:07.316842 #428793] INFO -- : [ 12/885] 470161=test_shift_jis I, [2024-05-16T22:07:07.316906 #428793] INFO -- : [ 13/885] 470158=test_gem_commands_specification_command I, [2024-05-16T22:07:07.319369 #428793] INFO -- : [ 14/885] 470163=test_rdoc_text I, [2024-05-16T22:07:07.319663 #428793] INFO -- : [ 15/885] 470166=test_tcp I, [2024-05-16T22:07:07.320371 #428793] INFO -- : [ 16/885] 470165=test_iso_8859 I, [2024-05-16T22:07:07.320521 #428793] INFO -- : [ 17/885] 470168=test_require I, [2024-05-16T22:07:07.320656 #428793] INFO -- : [ 18/885] 470169=test_date_time I, [2024-05-16T22:07:07.320760 #428793] INFO -- : [ 19/885] 470170=test_rdoc_markup_to_joined_paragraph I, [2024-05-16T22:07:07.325549 #428793] INFO -- : [ 20/885] 470172=test_data I, [2024-05-16T22:07:07.327568 #428793] INFO -- : [ 21/885] 470168=index_write_test I, [2024-05-16T22:07:07.328008 #428793] INFO -- : [ 22/885] 470174=test_date_new I, [2024-05-16T22:07:07.351972 #428793] INFO -- : [ 23/885] 470172=test_syntax I, [2024-05-16T22:07:07.352374 #428793] INFO -- : [ 24/885] 470164=test_gem_safe_yaml I, [2024-05-16T22:07:07.353169 #428793] INFO -- : [ 25/885] 470161=test_rdoc_parser_ruby I, [2024-05-16T22:07:07.355755 #428793] INFO -- : [ 26/885] 470174=test_httpresponse I, [2024-05-16T22:07:07.365158 #428793] INFO -- : [ 27/885] 470165=test_open-uri I, [2024-05-16T22:07:07.372389 #428793] INFO -- : [ 28/885] 470169=test_nil2vtempty I, [2024-05-16T22:07:07.375507 #428793] INFO -- : [ 29/885] 470169=test_stream I, [2024-05-16T22:07:07.378913 #428793] INFO -- : [ 30/885] 470167=test_rdoc_context I, [2024-05-16T22:07:07.387521 #428793] INFO -- : [ 31/885] 470169=test_stringchar I, [2024-05-16T22:07:07.393944 #428793] INFO -- : [ 32/885] 470173=test_hash_create I, [2024-05-16T22:07:07.394278 #428793] INFO -- : [ 33/885] 470173=newline_test I, [2024-05-16T22:07:07.433889 #428793] INFO -- : [ 34/885] 470162=test_uncorrectable_name_check I, [2024-05-16T22:07:07.434195 #428793] INFO -- : [ 35/885] 470162=test_thread_fd_close I, [2024-05-16T22:07:07.434998 #428793] INFO -- : [ 36/885] 470168=test_passing_block I, [2024-05-16T22:07:07.440621 #428793] INFO -- : [ 37/885] 470162=test_logperiod I, [2024-05-16T22:07:07.440687 #428793] INFO -- : [ 38/885] 470168=test_c_union_entity I, [2024-05-16T22:07:07.444156 #428793] INFO -- : [ 39/885] 470162=test_rdoc_normal_module I, [2024-05-16T22:07:07.455093 #428793] INFO -- : [ 40/885] 470174=test_rdoc_markdown_test I, [2024-05-16T22:07:07.471438 #428793] INFO -- : [ 41/885] 470168=test_securerandom I, [2024-05-16T22:07:07.473480 #428793] INFO -- : [ 42/885] 470157=test_switch_hitter I, [2024-05-16T22:07:07.477845 #428793] INFO -- : [ 43/885] 470170=test_singleton I, [2024-05-16T22:07:07.485219 #428793] INFO -- : [ 44/885] 470166=test_flush I, [2024-05-16T22:07:07.490564 #428793] INFO -- : [ 45/885] 470169=test_io_console I, [2024-05-16T22:07:07.493951 #428793] INFO -- : [ 46/885] 470170=test_logdevice I, [2024-05-16T22:07:07.494261 #428793] INFO -- : [ 47/885] 470166=test_arity I, [2024-05-16T22:07:07.497643 #428793] INFO -- : [ 48/885] 470157=test_gem_ext_rake_builder I, [2024-05-16T22:07:07.500753 #428793] INFO -- : [ 49/885] 470166=test_x509cert I, [2024-05-16T22:07:07.501338 #428793] INFO -- : [ 50/885] 470171=test_gc I, [2024-05-16T22:07:07.523175 #428793] INFO -- : [ 51/885] 470163=test_gem_resolver_lock_specification I, [2024-05-16T22:07:07.529891 #428793] INFO -- : [ 52/885] 470162=test_err_in_callback I, [2024-05-16T22:07:07.532092 #428793] INFO -- : [ 53/885] 470162=test_pack I, [2024-05-16T22:07:07.546997 #428793] INFO -- : [ 54/885] 470168=test_last_thread I, [2024-05-16T22:07:07.574577 #428793] INFO -- : [ 55/885] 470173=test_process I, [2024-05-16T22:07:07.576748 #428793] INFO -- : [ 56/885] 470160=test_gem_source_local I, [2024-05-16T22:07:07.598303 #428793] INFO -- : [ 57/885] 470164=test_gem_security_policy I, [2024-05-16T22:07:07.610536 #428793] INFO -- : [ 58/885] 470158=test_ractor I, [2024-05-16T22:07:07.696526 #428793] INFO -- : [ 59/885] 470158=test_m17n_comb I, [2024-05-16T22:07:07.715440 #428793] INFO -- : [ 60/885] 470159=test_memory_view I, [2024-05-16T22:07:07.725846 #428793] INFO -- : [ 61/885] 470162=test_rdoc_markup_to_markdown I, [2024-05-16T22:07:07.752458 #428793] INFO -- : [ 62/885] 470163=test_json_tree I, [2024-05-16T22:07:07.758678 #428793] INFO -- : [ 63/885] 470163=test_ansi_with_terminfo I, [2024-05-16T22:07:07.766409 #428793] INFO -- : [ 64/885] 470162=test_rdoc_generator_pot_po I, [2024-05-16T22:07:07.768883 #428793] INFO -- : [ 65/885] 470162=test_parser_events I, [2024-05-16T22:07:07.784295 #428793] INFO -- : [ 66/885] 470166=test_reline I, [2024-05-16T22:07:07.814358 #428793] INFO -- : [ 67/885] 470163=test_case I, [2024-05-16T22:07:07.814425 #428793] INFO -- : [ 68/885] 470163=test_pkey I, [2024-05-16T22:07:07.818058 #428793] INFO -- : [ 69/885] 470159=test_grapheme_breaks I, [2024-05-16T22:07:07.826510 #428793] INFO -- : [ 70/885] 470161=test_gem_version_option I, [2024-05-16T22:07:07.837378 #428793] INFO -- : [ 71/885] 470162=test_gem_request_connection_pools I, [2024-05-16T22:07:07.848409 #428793] INFO -- : [ 72/885] 470159=test_cclass I, [2024-05-16T22:07:07.852429 #428793] INFO -- : [ 73/885] 470160=test_dot_dot I, [2024-05-16T22:07:07.853419 #428793] INFO -- : [ 74/885] 470160=test_c_struct_builder I, [2024-05-16T22:07:07.881350 #428793] INFO -- : [ 75/885] 470165=test_str2big I, [2024-05-16T22:07:07.885889 #428793] INFO -- : [ 76/885] 470165=test_literal I, [2024-05-16T22:07:07.904516 #428793] INFO -- : [ 77/885] 470163=test_objectspace I, [2024-05-16T22:07:07.923871 #428793] INFO -- : [ 78/885] 470164=test_thread I, [2024-05-16T22:07:07.929742 #428793] INFO -- : [ 79/885] 470160=test_socket I, [2024-05-16T22:07:07.982561 #428793] INFO -- : [ 80/885] 470159=test_rdoc_markup_to_table_of_contents I, [2024-05-16T22:07:08.056850 #428793] INFO -- : [ 81/885] 470167=test_gem_install_update_options I, [2024-05-16T22:07:08.097665 #428793] INFO -- : [ 82/885] 470161=parse_test I, [2024-05-16T22:07:08.127090 #428793] INFO -- : [ 83/885] 470159=test_require_lib I, [2024-05-16T22:07:08.149155 #428793] INFO -- : [ 84/885] 470164=test_ractor I, [2024-05-16T22:07:08.160107 #428793] INFO -- : [ 85/885] 470164=test_severity I, [2024-05-16T22:07:08.174515 #428793] INFO -- : [ 86/885] 470164=test_rdoc_generator_ri I, [2024-05-16T22:07:08.191016 #428793] INFO -- : [ 87/885] 470157=test_extlibs I, [2024-05-16T22:07:08.211553 #428793] INFO -- : [ 88/885] 470166=test_gem_stream_ui I, [2024-05-16T22:07:08.271781 #428793] INFO -- : [ 89/885] 470164=test_exception I, [2024-05-16T22:07:08.278326 #428793] INFO -- : [ 90/885] 470175=test_gem_package_tar_reader_entry I, [2024-05-16T22:07:08.284265 #428793] INFO -- : [ 91/885] 470170=test_gem_name_tuple I, [2024-05-16T22:07:08.286113 #428793] INFO -- : [ 92/885] 470167=test_rand I, [2024-05-16T22:07:08.407313 #428793] INFO -- : [ 93/885] 470174=test_bug_reporter I, [2024-05-16T22:07:08.461032 #428793] INFO -- : [ 94/885] 470166=test_gem_commands_info_command I, [2024-05-16T22:07:08.476961 #428793] INFO -- : [ 95/885] 470170=test_gem_dependency_installer I, [2024-05-16T22:07:08.481825 #428793] INFO -- : [ 96/885] 470167=test_scalar I, [2024-05-16T22:07:08.488670 #428793] INFO -- : [ 97/885] 470167=test_rdoc_cross_reference I, [2024-05-16T22:07:08.502824 #428793] INFO -- : [ 98/885] 470166=test_store I, [2024-05-16T22:07:08.520667 #428793] INFO -- : [ 99/885] 470175=test_case_options I, [2024-05-16T22:07:08.523303 #428793] INFO -- : [100/885] 470175=test_scan_args I, [2024-05-16T22:07:08.533907 #428793] INFO -- : [101/885] 470175=test_win32ole I, [2024-05-16T22:07:08.540474 #428793] INFO -- : [102/885] 470175=test_generic I, [2024-05-16T22:07:08.574314 #428793] INFO -- : [103/885] 470165=test_gem_text I, [2024-05-16T22:07:08.587650 #428793] INFO -- : [104/885] 470175=test_settracefunc I, [2024-05-16T22:07:08.613143 #428793] INFO -- : [105/885] 470168=test_enumerator_kw I, [2024-05-16T22:07:08.619912 #428793] INFO -- : [106/885] 470168=test_gem_commands_mirror I, [2024-05-16T22:07:08.682132 #428793] INFO -- : [107/885] 470176=test_gem_ext_cargo_builder_link_flag_converter I, [2024-05-16T22:07:08.697180 #428793] INFO -- : [108/885] 470166=test_sprintf_comb I, [2024-05-16T22:07:08.787643 #428793] INFO -- : [109/885] 470168=test_method_cache I, [2024-05-16T22:07:08.790956 #428793] INFO -- : [110/885] 470168=test_gem_request I, [2024-05-16T22:07:08.798869 #428793] INFO -- : Leaked thread: TestSocket#test_accept_loop: # I, [2024-05-16T22:07:08.811181 #428793] INFO -- : [111/885] 470163=test_date_parse I, [2024-05-16T22:07:08.813346 #428793] INFO -- : [112/885] 470165=test_pkey_ec I, [2024-05-16T22:07:08.832429 #428793] INFO -- : [113/885] 470166=test_trick I, [2024-05-16T22:07:08.832701 #428793] INFO -- : [114/885] 470174=test_thread I, [2024-05-16T22:07:08.835330 #428793] INFO -- : [115/885] 470174=test_pipe I, [2024-05-16T22:07:08.850978 #428793] INFO -- : [116/885] 470167=test_default_gems I, [2024-05-16T22:07:08.866381 #428793] INFO -- : [117/885] 470176=test_rdoc_markup_to_rdoc I, [2024-05-16T22:07:08.885476 #428793] INFO -- : .Finished thread: TestSocket#test_tcp_socket_v6_hostname_resolved_earlier: # I, [2024-05-16T22:07:08.889595 #428793] INFO -- : [118/885] 470167=test_rdoc_rd_inline_parser I, [2024-05-16T22:07:08.917136 #428793] INFO -- : [119/885] 470167=test_mul I, [2024-05-16T22:07:08.922652 #428793] INFO -- : [120/885] 470167=test_null I, [2024-05-16T22:07:08.928149 #428793] INFO -- : [121/885] 470165=test_win32ole_type I, [2024-05-16T22:07:08.928347 #428793] INFO -- : [122/885] 470167=test_rdoc_markup_attributes I, [2024-05-16T22:07:08.932199 #428793] INFO -- : [123/885] 470167=test_rdoc_rdoc I, [2024-05-16T22:07:08.932296 #428793] INFO -- : [124/885] 470165=test_windows_1251 I, [2024-05-16T22:07:08.937025 #428793] INFO -- : [125/885] 470165=test_time I, [2024-05-16T22:07:08.960290 #428793] INFO -- : [126/885] 470163=test_gb18030 I, [2024-05-16T22:07:08.961580 #428793] INFO -- : [127/885] 470163=test_buffering I, [2024-05-16T22:07:08.964940 #428793] INFO -- : [128/885] 470163=test_svcb_https I, [2024-05-16T22:07:08.967895 #428793] INFO -- : [129/885] 470168=test_gem_uninstaller I, [2024-05-16T22:07:08.985959 #428793] INFO -- : [130/885] 470174=test_rdoc_i18n_text I, [2024-05-16T22:07:08.986189 #428793] INFO -- : [131/885] 470163=test_io_buffer I, [2024-05-16T22:07:08.990385 #428793] INFO -- : [132/885] 470167=test_key_name_check I, [2024-05-16T22:07:08.995568 #428793] INFO -- : [133/885] 470174=test_defined I, [2024-05-16T22:07:09.006617 #428793] INFO -- : [134/885] 470167=test_backtrace I, [2024-05-16T22:07:09.009691 #428793] INFO -- : [135/885] 470167=test_gem_validator I, [2024-05-16T22:07:09.020493 #428793] INFO -- : [136/885] 470162=test_files_test_2 I, [2024-05-16T22:07:09.027945 #428793] INFO -- : [137/885] 470176=test_fnmatch I, [2024-05-16T22:07:09.029591 #428793] INFO -- : [138/885] 470167=test_rdoc_markup_parser I, [2024-05-16T22:07:09.033470 #428793] INFO -- : [139/885] 470163=test_require_path_check I, [2024-05-16T22:07:09.067104 #428793] INFO -- : [140/885] 470174=test_folderitem2_invokeverb I, [2024-05-16T22:07:09.070067 #428793] INFO -- : [141/885] 470167=test_date_conv I, [2024-05-16T22:07:09.070131 #428793] INFO -- : [142/885] 470174=test_optimization I, [2024-05-16T22:07:09.072568 #428793] INFO -- : [143/885] 470176=test_erb_m17n I, [2024-05-16T22:07:09.075762 #428793] INFO -- : [144/885] 470167=test_ole_methods I, [2024-05-16T22:07:09.081029 #428793] INFO -- : [145/885] 470167=test_egrep_cpp I, [2024-05-16T22:07:09.081533 #428793] INFO -- : [146/885] 470176=test_zlib I, [2024-05-16T22:07:09.095035 #428793] INFO -- : [147/885] 470165=test_cgi_tag_helper I, [2024-05-16T22:07:09.110663 #428793] INFO -- : [148/885] 470165=test_gem_package_old I, [2024-05-16T22:07:09.123207 #428793] INFO -- : [149/885] 470163=test_gem_resolver_index_set I, [2024-05-16T22:07:09.126844 #428793] INFO -- : [150/885] 470160=test_gc_compact I, [2024-05-16T22:07:09.144846 #428793] INFO -- : [151/885] 470163=test_proc I, [2024-05-16T22:07:09.160556 #428793] INFO -- : [152/885] 470165=test_string I, [2024-05-16T22:07:09.250143 #428793] INFO -- : [153/885] 470167=test_custom_command I, [2024-05-16T22:07:09.354060 #428793] INFO -- : [154/885] 470167=json_addition_test I, [2024-05-16T22:07:09.368182 #428793] INFO -- : [155/885] 470167=test_gem_dependency_resolution_error I, [2024-05-16T22:07:09.371734 #428793] INFO -- : [156/885] 470167=test_rdoc_parser I, [2024-05-16T22:07:09.392468 #428793] INFO -- : [157/885] 470167=test_qsort I, [2024-05-16T22:07:09.394700 #428793] INFO -- : [158/885] 470167=test_string I, [2024-05-16T22:07:09.405075 #428793] INFO -- : [159/885] 470167=test_rdoc_stats I, [2024-05-16T22:07:09.422995 #428793] INFO -- : [160/885] 470175=test_pattern_matching I, [2024-05-16T22:07:09.437432 #428793] INFO -- : [161/885] 470167=test_raise I, [2024-05-16T22:07:09.441462 #428793] INFO -- : [162/885] 470167=test_x509attr I, [2024-05-16T22:07:09.449636 #428793] INFO -- : [163/885] 470175=test_depth_first I, [2024-05-16T22:07:09.456562 #428793] INFO -- : [164/885] 470167=test_gem_request_set_lockfile_parser I, [2024-05-16T22:07:09.473585 #428793] INFO -- : [165/885] 470175=test_rdoc_store I, [2024-05-16T22:07:09.555802 #428793] INFO -- : [166/885] 470167=test_gem_commands_lock_command I, [2024-05-16T22:07:09.575591 #428793] INFO -- : [167/885] 470167=test_assignment I, [2024-05-16T22:07:09.848201 #428793] INFO -- : [168/885] 470168=test_ifunless I, [2024-05-16T22:07:09.853966 #428793] INFO -- : [169/885] 470168=test_numeric I, [2024-05-16T22:07:09.857402 #428793] INFO -- : [170/885] 470164=test_gem_spec_fetcher I, [2024-05-16T22:07:09.903213 #428793] INFO -- : [171/885] 470168=test_common I, [2024-05-16T22:07:09.977563 #428793] INFO -- : [172/885] 470163=test_key_actor_vi I, [2024-05-16T22:07:10.037832 #428793] INFO -- : [173/885] 470164=test_bug-3571 I, [2024-05-16T22:07:10.052742 #428793] INFO -- : [174/885] 470164=test_gem_command I, [2024-05-16T22:07:10.058871 #428793] INFO -- : [175/885] 470157=test_hmac I, [2024-05-16T22:07:10.076900 #428793] INFO -- : [176/885] 470163=test_rdoc_markup_to_tt_only I, [2024-05-16T22:07:10.079480 #428793] INFO -- : [177/885] 470157=test_rdoc_tom_doc I, [2024-05-16T22:07:10.101946 #428793] INFO -- : [178/885] 470163=test_frozen I, [2024-05-16T22:07:10.107904 #428793] INFO -- : [179/885] 470163=test_gem_ext_configure_builder I, [2024-05-16T22:07:10.110023 #428793] INFO -- : [180/885] 470168=test_pp I, [2024-05-16T22:07:10.126778 #428793] INFO -- : [181/885] 470164=test_macro I, [2024-05-16T22:07:10.150287 #428793] INFO -- : [182/885] 470168=test_rdoc_single_class I, [2024-05-16T22:07:10.152800 #428793] INFO -- : [183/885] 470163=test_num2int I, [2024-05-16T22:07:10.160528 #428793] INFO -- : [184/885] 470163=test_nil I, [2024-05-16T22:07:10.162752 #428793] INFO -- : [185/885] 470163=test_verbose I, [2024-05-16T22:07:10.182010 #428793] INFO -- : [186/885] 470163=test_iter_break I, [2024-05-16T22:07:10.185038 #428793] INFO -- : [187/885] 470163=test_zsh_completion I, [2024-05-16T22:07:10.188660 #428793] INFO -- : [188/885] 470163=test_exception I, [2024-05-16T22:07:10.195145 #428793] INFO -- : [189/885] 470163=test_address_resolve I, [2024-05-16T22:07:10.203351 #428793] INFO -- : [190/885] 470164=test_rdoc_token_stream I, [2024-05-16T22:07:10.211051 #428793] INFO -- : [191/885] 470164=test_config I, [2024-05-16T22:07:10.216598 #428793] INFO -- : [192/885] 470169=test_optarg I, [2024-05-16T22:07:10.240527 #428793] INFO -- : [193/885] 470164=test_yaml_special_cases I, [2024-05-16T22:07:10.244077 #428793] INFO -- : [194/885] 470157=test_gem_source_list I, [2024-05-16T22:07:10.254724 #428793] INFO -- : [195/885] 470164=test_kdf I, [2024-05-16T22:07:10.257442 #428793] INFO -- : [196/885] 470163=test_gem_doctor I, [2024-05-16T22:07:10.285258 #428793] INFO -- : [197/885] 470168=test_eval_history I, [2024-05-16T22:07:10.300355 #428793] INFO -- : [198/885] 470157=dispatcher_test I, [2024-05-16T22:07:10.306196 #428793] INFO -- : [199/885] 470163=test_kernel I, [2024-05-16T22:07:10.347837 #428793] INFO -- : [200/885] 470164=test_bug-5832 I, [2024-05-16T22:07:10.348872 #428793] INFO -- : [201/885] 470164=test_files_ext I, [2024-05-16T22:07:10.370960 #428793] INFO -- : [202/885] 470169=test_gem_silent_ui I, [2024-05-16T22:07:10.415647 #428793] INFO -- : [203/885] 470168=test_emitter I, [2024-05-16T22:07:10.416723 #428793] INFO -- : [204/885] 470157=test_object_create_start I, [2024-05-16T22:07:10.423163 #428793] INFO -- : [205/885] 470168=test_gem_ext_cargo_builder_unit I, [2024-05-16T22:07:10.429304 #428793] INFO -- : [206/885] 470175=test_gem_rdoc I, [2024-05-16T22:07:10.432844 #428793] INFO -- : [207/885] 470157=test_date I, [2024-05-16T22:07:10.445358 #428793] INFO -- : [208/885] 470157=test_at_exit I, [2024-05-16T22:07:10.448097 #428793] INFO -- : [209/885] 470164=test_command I, [2024-05-16T22:07:10.448576 #428793] INFO -- : [210/885] 470168=test_rdoc_markup_paragraph I, [2024-05-16T22:07:10.453504 #428793] INFO -- : [211/885] 470168=!Nothing_to_test I, [2024-05-16T22:07:10.455073 #428793] INFO -- : [212/885] 470168=test_enc_raise I, [2024-05-16T22:07:10.462963 #428793] INFO -- : [213/885] 470168=test_psych I, [2024-05-16T22:07:10.498346 #428793] INFO -- : [214/885] 470168=test_ubf_async_safe I, [2024-05-16T22:07:10.510646 #428793] INFO -- : [215/885] 470157=test_hash I, [2024-05-16T22:07:10.510717 #428793] INFO -- : [216/885] 470168=test_sorted_set I, [2024-05-16T22:07:10.529289 #428793] INFO -- : [217/885] 470175=test_win32ole_type_event I, [2024-05-16T22:07:10.535312 #428793] INFO -- : [218/885] 470175=test_emoji I, [2024-05-16T22:07:10.578829 #428793] INFO -- : [219/885] 470175=test_io I, [2024-05-16T22:07:10.625138 #428793] INFO -- : [220/885] 470169=test_gem_commands_uninstall_command I, [2024-05-16T22:07:10.659072 #428793] INFO -- : [221/885] 470158=test_gem_source_specific_file I, [2024-05-16T22:07:10.736931 #428793] INFO -- : [222/885] 470167=test_foreach I, [2024-05-16T22:07:10.755171 #428793] INFO -- : [223/885] 470158=test_condition I, [2024-05-16T22:07:10.756412 #428793] INFO -- : [224/885] 470167=test_cp949 I, [2024-05-16T22:07:10.765104 #428793] INFO -- : [225/885] 470158=test_win32ole_record I, [2024-05-16T22:07:10.770212 #428793] INFO -- : [226/885] 470167=test_gem_unsatisfiable_dependency_error I, [2024-05-16T22:07:10.772282 #428793] INFO -- : [227/885] 470158=test_type_completor I, [2024-05-16T22:07:10.773043 #428793] INFO -- : [228/885] 470168=test_summary I, [2024-05-16T22:07:10.774137 #428793] INFO -- : [229/885] 470158=test_console_attr I, [2024-05-16T22:07:10.775327 #428793] INFO -- : [230/885] 470158=test_date_attr I, [2024-05-16T22:07:10.779367 #428793] INFO -- : [231/885] 470158=test_ellipsize I, [2024-05-16T22:07:10.780172 #428793] INFO -- : [232/885] 470167=warnings_test I, [2024-05-16T22:07:10.791131 #428793] INFO -- : [233/885] 470158=test_kwargs I, [2024-05-16T22:07:10.795855 #428793] INFO -- : [234/885] 470158=test_io_wait I, [2024-05-16T22:07:10.797490 #428793] INFO -- : [235/885] 470170=test_gem_commands_exec_command I, [2024-05-16T22:07:10.815051 #428793] INFO -- : [236/885] 470164=test_ftp I, [2024-05-16T22:07:10.836324 #428793] INFO -- : [237/885] 470164=test_rdoc_context_section I, [2024-05-16T22:07:10.844534 #428793] INFO -- : [238/885] 470164=test_euc_kr I, [2024-05-16T22:07:10.847753 #428793] INFO -- : [239/885] 470164=test_gem_commands_query_command I, [2024-05-16T22:07:10.852843 #428793] INFO -- : [240/885] 470167=test_method I, [2024-05-16T22:07:10.879242 #428793] INFO -- : [241/885] 470175=test_rdoc_rubygems_hook I, [2024-05-16T22:07:10.906855 #428793] INFO -- : [242/885] 470163=test_pattern_key_name_check I, [2024-05-16T22:07:10.913016 #428793] INFO -- : [243/885] 470163=test_to_ruby I, [2024-05-16T22:07:10.923759 #428793] INFO -- : [244/885] 470163=test_array_create I, [2024-05-16T22:07:10.924409 #428793] INFO -- : [245/885] 470168=test_pack I, [2024-05-16T22:07:10.924849 #428793] INFO -- : [246/885] 470166=test_gem_impossible_dependencies_error I, [2024-05-16T22:07:10.928185 #428793] INFO -- : [247/885] 470163=test_set I, [2024-05-16T22:07:10.931951 #428793] INFO -- : [248/885] 470166=test_show_source I, [2024-05-16T22:07:10.935168 #428793] INFO -- : [249/885] 470163=test_remote_fetch_error I, [2024-05-16T22:07:10.951830 #428793] INFO -- : [250/885] 470163=test_have_library I, [2024-05-16T22:07:10.994490 #428793] INFO -- : [251/885] 470175=test_c_struct_entry I, [2024-05-16T22:07:11.006041 #428793] INFO -- : [252/885] 470166=test_lock_native_thread I, [2024-05-16T22:07:11.125693 #428793] INFO -- : [253/885] 470168=test_gem_commands_stale_command I, [2024-05-16T22:07:11.130270 #428793] INFO -- : [254/885] 470158=test_undef I, [2024-05-16T22:07:11.134107 #428793] INFO -- : [255/885] 470158=test_line_editor I, [2024-05-16T22:07:11.135000 #428793] INFO -- : [256/885] 470168=test_objspace I, [2024-05-16T22:07:11.141060 #428793] INFO -- : [257/885] 470176=ripper_test I, [2024-05-16T22:07:11.207174 #428793] INFO -- : [258/885] 470158=comments_test I, [2024-05-16T22:07:11.278844 #428793] INFO -- : [259/885] 470175=test_sprintf I, [2024-05-16T22:07:11.302802 #428793] INFO -- : [260/885] 470166=test_gem_requirement I, [2024-05-16T22:07:11.322318 #428793] INFO -- : [261/885] 470158=test_string_memory I, [2024-05-16T22:07:11.334492 #428793] INFO -- : [262/885] 470169=test_gem_security_trust_dir I, [2024-05-16T22:07:11.370812 #428793] INFO -- : [263/885] 470169=test_gem_commands_environment_command I, [2024-05-16T22:07:11.372052 #428793] INFO -- : [264/885] 470158=test_m17n I, [2024-05-16T22:07:11.421613 #428793] INFO -- : [265/885] 470158=test_ws I, [2024-05-16T22:07:11.421749 #428793] INFO -- : [266/885] 470169=test_yjit I, [2024-05-16T22:07:11.430942 #428793] INFO -- : [267/885] 470169=test_workspace I, [2024-05-16T22:07:11.442554 #428793] INFO -- : [268/885] 470158=test_weakmap I, [2024-05-16T22:07:11.443253 #428793] INFO -- : [269/885] 470164=test_kill_ring I, [2024-05-16T22:07:11.452696 #428793] INFO -- : [270/885] 470164=test_ns_spki I, [2024-05-16T22:07:11.467262 #428793] INFO -- : [271/885] 470166=test_framework I, [2024-05-16T22:07:11.473067 #428793] INFO -- : [272/885] 470164=test_argf I, [2024-05-16T22:07:11.482757 #428793] INFO -- : [273/885] 470161=test_protect I, [2024-05-16T22:07:11.489771 #428793] INFO -- : [274/885] 470161=test_win32ole_typelib I, [2024-05-16T22:07:11.494130 #428793] INFO -- : [275/885] 470161=test_gem_request_set_lockfile I, [2024-05-16T22:07:11.506165 #428793] INFO -- : [276/885] 470166=test_raise_exception I, [2024-05-16T22:07:11.565370 #428793] INFO -- : [277/885] 470175=test_postponed_job I, [2024-05-16T22:07:11.682324 #428793] INFO -- : [278/885] 470160=test_alias_and_anchor I, [2024-05-16T22:07:11.698562 #428793] INFO -- : [279/885] 470176=test_external_new I, [2024-05-16T22:07:11.700482 #428793] INFO -- : [280/885] 470160=test_tree_builder I, [2024-05-16T22:07:11.708316 #428793] INFO -- : [281/885] 470176=test_gem_resolver_dependency_request I, [2024-05-16T22:07:11.713940 #428793] INFO -- : [282/885] 470160=test_hash I, [2024-05-16T22:07:11.743936 #428793] INFO -- : [283/885] 470169=test_rdoc_require I, [2024-05-16T22:07:11.744167 #428793] INFO -- : [284/885] 470176=locals_test I, [2024-05-16T22:07:11.747798 #428793] INFO -- : [285/885] 470160=test_readpartial I, [2024-05-16T22:07:11.803452 #428793] INFO -- : [286/885] 470159=test_clone I, [2024-05-16T22:07:11.919951 #428793] INFO -- : [287/885] 470170=test_gem_commands_install_command I, [2024-05-16T22:07:11.927081 #428793] INFO -- : [288/885] 470175=test_rdoc_task I, [2024-05-16T22:07:11.930282 #428793] INFO -- : [289/885] 470175=test_gem_resolver_conflict I, [2024-05-16T22:07:11.942802 #428793] INFO -- : [290/885] 470169=test_backtrace I, [2024-05-16T22:07:11.951292 #428793] INFO -- : [291/885] 470175=test_pack I, [2024-05-16T22:07:11.970449 #428793] INFO -- : [292/885] 470175=ruby_parser_test I, [2024-05-16T22:07:12.000443 #428793] INFO -- : [293/885] 470159=test_io_buffer I, [2024-05-16T22:07:12.008749 #428793] INFO -- : [294/885] 470161=test_rdoc_markup_indented_paragraph I, [2024-05-16T22:07:12.013462 #428793] INFO -- : [295/885] 470161=test_files_sample I, [2024-05-16T22:07:12.037943 #428793] INFO -- : [296/885] 470175=test_stringscanner I, [2024-05-16T22:07:12.079249 #428793] INFO -- : [297/885] 470175=test_yield I, [2024-05-16T22:07:12.108850 #428793] INFO -- : [298/885] 470159=test_rdoc_alias I, [2024-05-16T22:07:12.117778 #428793] INFO -- : [299/885] 470163=parser_test I, [2024-05-16T22:07:12.122074 #428793] INFO -- : [300/885] 470161=test_convertible I, [2024-05-16T22:07:12.131989 #428793] INFO -- : [301/885] 470176=test_optparse I, [2024-05-16T22:07:12.157189 #428793] INFO -- : [302/885] 470160=test_array I, [2024-05-16T22:07:12.163939 #428793] INFO -- : [303/885] 470160=test_fstring I, [2024-05-16T22:07:12.165949 #428793] INFO -- : [304/885] 470159=encoding_test I, [2024-05-16T22:07:12.205845 #428793] INFO -- : [305/885] 470176=test_gem_resolver_best_set I, [2024-05-16T22:07:12.211490 #428793] INFO -- : [306/885] 470163=test_typeddata I, [2024-05-16T22:07:12.249523 #428793] INFO -- : [307/885] 470162=test_rdoc_markup_to_html_crossref I, [2024-05-16T22:07:12.269629 #428793] INFO -- : [308/885] 470176=test_webauthn_poller I, [2024-05-16T22:07:12.271512 #428793] INFO -- : [309/885] 470166=test_rdoc_markup_raw I, [2024-05-16T22:07:12.292029 #428793] INFO -- : [310/885] 470160=test_rat I, [2024-05-16T22:07:12.307488 #428793] INFO -- : [311/885] 470160=test_gem_resolver_activation_request I, [2024-05-16T22:07:12.318826 #428793] INFO -- : [312/885] 470160=test_getopts I, [2024-05-16T22:07:12.324455 #428793] INFO -- : [313/885] 470160=test_protocol I, [2024-05-16T22:07:12.334006 #428793] INFO -- : [314/885] 470159=test_ripper I, [2024-05-16T22:07:12.424346 #428793] INFO -- : [315/885] 470176=test_gem_config_file I, [2024-05-16T22:07:12.444728 #428793] INFO -- : [316/885] 470166=test_etc I, [2024-05-16T22:07:12.472358 #428793] INFO -- : [317/885] 470163=test_yjit_exit_locations I, [2024-05-16T22:07:12.474014 #428793] INFO -- : [318/885] 470163=test_pkcs12 I, [2024-05-16T22:07:12.508886 #428793] INFO -- : [319/885] 470162=test_system I, [2024-05-16T22:07:12.545524 #428793] INFO -- : [320/885] 470166=test_gem_util I, [2024-05-16T22:07:12.563314 #428793] INFO -- : [321/885] 470176=test_iseq_load I, [2024-05-16T22:07:12.634537 #428793] INFO -- : [322/885] 470160=test_gem_package_tar_header I, [2024-05-16T22:07:12.638670 #428793] INFO -- : [323/885] 470172=test_pkey_dh I, [2024-05-16T22:07:12.690545 #428793] INFO -- : [324/885] 470160=test_bigzero I, [2024-05-16T22:07:12.694993 #428793] INFO -- : [325/885] 470160=test_unicode_escape I, [2024-05-16T22:07:12.729561 #428793] INFO -- : [326/885] 470166=test_io I, [2024-05-16T22:07:12.746307 #428793] INFO -- : [327/885] 470172=test_utf16 I, [2024-05-16T22:07:12.765543 #428793] INFO -- : [328/885] 470172=test_autoload I, [2024-05-16T22:07:12.786557 #428793] INFO -- : [329/885] 470159=test_rendering I, [2024-05-16T22:07:12.787556 #428793] INFO -- : [330/885] 470160=test_face I, [2024-05-16T22:07:12.830718 #428793] INFO -- : [331/885] 470163=test_sizeof I, [2024-05-16T22:07:12.863408 #428793] INFO -- : [332/885] 470160=test_case I, [2024-05-16T22:07:12.888717 #428793] INFO -- : [333/885] 470159=test_yaml_tree I, [2024-05-16T22:07:12.896359 #428793] INFO -- : [334/885] 470160=test_config I, [2024-05-16T22:07:12.930959 #428793] INFO -- : [335/885] 470159=test_sleep I, [2024-05-16T22:07:12.942158 #428793] INFO -- : [336/885] 470160=test_math I, [2024-05-16T22:07:12.967628 #428793] INFO -- : [337/885] 470160=test_gem_commands_fetch_command I, [2024-05-16T22:07:13.070068 #428793] INFO -- : [338/885] 470160=test_gc I, [2024-05-16T22:07:13.080834 #428793] INFO -- : [339/885] 470160=test_libs I, [2024-05-16T22:07:13.112079 #428793] INFO -- : [340/885] 470160=test_ractor I, [2024-05-16T22:07:13.203640 #428793] INFO -- : [341/885] 470160=test_find I, [2024-05-16T22:07:13.213596 #428793] INFO -- : [342/885] 470160=test_fiddle I, [2024-05-16T22:07:13.246532 #428793] INFO -- : [343/885] 470169=test_wss I, [2024-05-16T22:07:13.263407 #428793] INFO -- : [344/885] 470160=test_gem_ext_cmake_builder I, [2024-05-16T22:07:13.271298 #428793] INFO -- : [345/885] 470169=test_gem_commands_contents_command I, [2024-05-16T22:07:13.276160 #428793] INFO -- : [346/885] 470160=test_cgi_util I, [2024-05-16T22:07:13.307178 #428793] INFO -- : [347/885] 470170=test_require I, [2024-05-16T22:07:13.363380 #428793] INFO -- : [348/885] 470169=test_marshalable I, [2024-05-16T22:07:13.372223 #428793] INFO -- : [349/885] 470169=test_digest I, [2024-05-16T22:07:13.471580 #428793] INFO -- : [350/885] 470176=test_gem_source_vendor I, [2024-05-16T22:07:13.477976 #428793] INFO -- : [351/885] 470176=test_gem_commands_owner_command I, [2024-05-16T22:07:13.488799 #428793] INFO -- : [352/885] 470160=test_recorder I, [2024-05-16T22:07:13.495219 #428793] INFO -- : [353/885] 470160=test_deprecate I, [2024-05-16T22:07:13.518394 #428793] INFO -- : [354/885] 470160=test_rdoc_constant I, [2024-05-16T22:07:13.535546 #428793] INFO -- : [355/885] 470162=test_bash_completion I, [2024-05-16T22:07:13.541444 #428793] INFO -- : [356/885] 470162=test_formatter I, [2024-05-16T22:07:13.543605 #428793] INFO -- : [357/885] 470162=test_rdoc_markdown I, [2024-05-16T22:07:13.656201 #428793] INFO -- : [358/885] 470171=test_gem_available_set I, [2024-05-16T22:07:13.762418 #428793] INFO -- : [359/885] 470160=test_rdoc_any_method I, [2024-05-16T22:07:13.772609 #428793] INFO -- : [360/885] 470171=test_modify_expand I, [2024-05-16T22:07:13.782643 #428793] INFO -- : [361/885] 470171=test_file I, [2024-05-16T22:07:13.805362 #428793] INFO -- : [362/885] 470171=test_rdoc_encoding I, [2024-05-16T22:07:13.805508 #428793] INFO -- : [363/885] 470158=test_coverage I, [2024-05-16T22:07:13.845321 #428793] INFO -- : [364/885] 470162=regexp_test I, [2024-05-16T22:07:13.934719 #428793] INFO -- : [365/885] 470162=test_gem_package_tar_reader I, [2024-05-16T22:07:13.982577 #428793] INFO -- : [366/885] 470162=test_complexrational I, [2024-05-16T22:07:13.990556 #428793] INFO -- : [367/885] 470162=test_init I, [2024-05-16T22:07:14.024471 #428793] INFO -- : [368/885] 470160=test_pathname I, [2024-05-16T22:07:14.034036 #428793] INFO -- : [369/885] 470171=test_bmethod I, [2024-05-16T22:07:14.039945 #428793] INFO -- : [370/885] 470171=test_ractor I, [2024-05-16T22:07:14.051866 #428793] INFO -- : [371/885] 470176=test_euc_tw I, [2024-05-16T22:07:14.056381 #428793] INFO -- : [372/885] 470176=test_gem_commands_sources_command I, [2024-05-16T22:07:14.057963 #428793] INFO -- : [373/885] 470171=test_ansi_without_terminfo I, [2024-05-16T22:07:14.132137 #428793] INFO -- : [374/885] 470171=test_nowrite I, [2024-05-16T22:07:14.168460 #428793] INFO -- : [375/885] 470171=test_thread_queue I, [2024-05-16T22:07:14.200986 #428793] INFO -- : [376/885] 470169=test_rdoc_markup_formatter I, [2024-05-16T22:07:14.206688 #428793] INFO -- : [377/885] 470176=test_yaml I, [2024-05-16T22:07:14.211242 #428793] INFO -- : [378/885] 470169=test_forwardable I, [2024-05-16T22:07:14.224528 #428793] INFO -- : [379/885] 470160=test_wait I, [2024-05-16T22:07:14.225671 #428793] INFO -- : [380/885] 470169=test_handle I, [2024-05-16T22:07:14.277545 #428793] INFO -- : [381/885] 470176=test_big2str I, [2024-05-16T22:07:14.280854 #428793] INFO -- : [382/885] 470176=test_pstore I, [2024-05-16T22:07:14.304751 #428793] INFO -- : [383/885] 470160=test_cstr I, [2024-05-16T22:07:14.322909 #428793] INFO -- : [384/885] 470176=test_profile_frames I, [2024-05-16T22:07:14.372070 #428793] INFO -- : [385/885] 470157=test_gbk I, [2024-05-16T22:07:14.373590 #428793] INFO -- : [386/885] 470157=test_class2name I, [2024-05-16T22:07:14.383552 #428793] INFO -- : [387/885] 470157=test_enc_str_buf_cat I, [2024-05-16T22:07:14.386864 #428793] INFO -- : [388/885] 470157=test_comparable I, [2024-05-16T22:07:14.394322 #428793] INFO -- : [389/885] 470157=test_rdoc_parser_c I, [2024-05-16T22:07:14.437893 #428793] INFO -- : [390/885] 470169=test_io_timeout I, [2024-05-16T22:07:14.441210 #428793] INFO -- : [391/885] 470169=test_shapes I, [2024-05-16T22:07:14.449947 #428793] INFO -- : [392/885] 470169=json_fixtures_test I, [2024-05-16T22:07:14.456900 #428793] INFO -- : [393/885] 470169=test_string_processing I, [2024-05-16T22:07:14.464616 #428793] INFO -- : [394/885] 470169=test_fileutils I, [2024-05-16T22:07:14.502898 #428793] INFO -- : [395/885] 470162=test_emitter I, [2024-05-16T22:07:14.503923 #428793] INFO -- : [396/885] 470170=test_resource I, [2024-05-16T22:07:14.510950 #428793] INFO -- : [397/885] 470176=test_gem_commands_signin_command I, [2024-05-16T22:07:14.523019 #428793] INFO -- : [398/885] 470170=test_ldap I, [2024-05-16T22:07:14.526590 #428793] INFO -- : [399/885] 470162=test_gem_version I, [2024-05-16T22:07:14.537201 #428793] INFO -- : [400/885] 470170=test_rdoc_options I, [2024-05-16T22:07:14.571088 #428793] INFO -- : [401/885] 470175=test_econv I, [2024-05-16T22:07:14.613749 #428793] INFO -- : [402/885] 470158=test_cesu8 I, [2024-05-16T22:07:14.617922 #428793] INFO -- : [403/885] 470176=test_too_many_dummy_encodings I, [2024-05-16T22:07:14.623059 #428793] INFO -- : [404/885] 470162=test_rdoc_include I, [2024-05-16T22:07:14.627896 #428793] INFO -- : [405/885] 470158=test_reqarg I, [2024-05-16T22:07:14.633174 #428793] INFO -- : [406/885] 470157=test_gem_commands_list_command I, [2024-05-16T22:07:14.647994 #428793] INFO -- : [407/885] 470157=test_stack I, [2024-05-16T22:07:14.664192 #428793] INFO -- : [408/885] 470162=test_scanner_events I, [2024-05-16T22:07:14.677948 #428793] INFO -- : [409/885] 470176=test_gem_resolver_installed_specification I, [2024-05-16T22:07:14.693207 #428793] INFO -- : [410/885] 470162=test_mdns I, [2024-05-16T22:07:14.695776 #428793] INFO -- : [411/885] 470176=test_parse I, [2024-05-16T22:07:14.708501 #428793] INFO -- : [412/885] 470162=test_gem_remote_fetcher I, [2024-05-16T22:07:14.776720 #428793] INFO -- : [413/885] 470170=test_inlinecache I, [2024-05-16T22:07:14.780627 #428793] INFO -- : [414/885] 470169=test_rdoc_markup_verbatim I, [2024-05-16T22:07:14.785099 #428793] INFO -- : [415/885] 470169=test_gem_resolver_specification I, [2024-05-16T22:07:14.806353 #428793] INFO -- : [416/885] 470160=test_gem_dependency I, [2024-05-16T22:07:14.811894 #428793] INFO -- : [417/885] 470169=test_path_to_class I, [2024-05-16T22:07:14.830211 #428793] INFO -- : [418/885] 470170=test_gem_ext_ext_conf_builder I, [2024-05-16T22:07:14.834975 #428793] INFO -- : [419/885] 470169=test_frozen_error I, [2024-05-16T22:07:14.839927 #428793] INFO -- : [420/885] 470169=test_gem_stub_specification I, [2024-05-16T22:07:14.912781 #428793] INFO -- : [421/885] 470160=test_method_cache I, [2024-05-16T22:07:14.921714 #428793] INFO -- : [422/885] 470160=test_gem_commands_search_command I, [2024-05-16T22:07:14.923849 #428793] INFO -- : [423/885] 470160=test_complex I, [2024-05-16T22:07:14.960338 #428793] INFO -- : [424/885] 470169=test_irb I, [2024-05-16T22:07:14.976031 #428793] INFO -- : [425/885] 470158=test_class I, [2024-05-16T22:07:14.976449 #428793] INFO -- : [426/885] 470159=test_rdoc_normal_class I, [2024-05-16T22:07:15.034363 #428793] INFO -- : [427/885] 470159=test_const I, [2024-05-16T22:07:15.035164 #428793] INFO -- : [428/885] 470160=json_string_matching_test I, [2024-05-16T22:07:15.037621 #428793] INFO -- : [429/885] 470159=test_load I, [2024-05-16T22:07:15.043073 #428793] INFO -- : [430/885] 470159=test_random I, [2024-05-16T22:07:15.051617 #428793] INFO -- : [431/885] 470160=test_asn1 I, [2024-05-16T22:07:15.054347 #428793] INFO -- : [432/885] 470159=test_yamlstore I, [2024-05-16T22:07:15.062950 #428793] INFO -- : [433/885] 470159=test_gem_installer I, [2024-05-16T22:07:15.078430 #428793] INFO -- : [434/885] 470160=test_date_strftime I, [2024-05-16T22:07:15.169231 #428793] INFO -- : [435/885] 470176=test_rdoc_parser_rd I, [2024-05-16T22:07:15.177549 #428793] INFO -- : [436/885] 470169=test_internal_ivar I, [2024-05-16T22:07:15.181010 #428793] INFO -- : [437/885] 470169=test_gem_resolver_index_specification I, [2024-05-16T22:07:15.201773 #428793] INFO -- : [438/885] 470167=test_utf32 I, [2024-05-16T22:07:15.207753 #428793] INFO -- : [439/885] 470167=test_basicsocket I, [2024-05-16T22:07:15.214145 #428793] INFO -- : [440/885] 470167=test_duplicate I, [2024-05-16T22:07:15.218905 #428793] INFO -- : [441/885] 470167=test_gem_commands_help_command I, [2024-05-16T22:07:15.227555 #428793] INFO -- : [442/885] 470176=test_rdoc_markup I, [2024-05-16T22:07:15.232309 #428793] INFO -- : [443/885] 470169=test_prettyprint I, [2024-05-16T22:07:15.235947 #428793] INFO -- : [444/885] 470176=test_tracepoint I, [2024-05-16T22:07:15.244118 #428793] INFO -- : [445/885] 470169=test_tempfile I, [2024-05-16T22:07:15.278109 #428793] INFO -- : [446/885] 470167=parse_comments_test I, [2024-05-16T22:07:15.281738 #428793] INFO -- : [447/885] 470167=test_noarg I, [2024-05-16T22:07:15.425878 #428793] INFO -- : [448/885] 470167=test_function I, [2024-05-16T22:07:15.488079 #428793] INFO -- : [449/885] 470176=test_queue I, [2024-05-16T22:07:15.490606 #428793] INFO -- : [450/885] 470176=test_load I, [2024-05-16T22:07:15.495527 #428793] INFO -- : [451/885] 470176=test_yamldbm I, [2024-05-16T22:07:15.507002 #428793] INFO -- : [452/885] 470176=test_gem_commands_rebuild_command I, [2024-05-16T22:07:15.524982 #428793] INFO -- : [453/885] 470169=test_rdoc_parser_simple I, [2024-05-16T22:07:15.535315 #428793] INFO -- : [454/885] 470169=test_provider I, [2024-05-16T22:07:15.538920 #428793] INFO -- : [455/885] 470176=test_abi I, [2024-05-16T22:07:15.602329 #428793] INFO -- : [456/885] 470164=test_evaluation I, [2024-05-16T22:07:15.610346 #428793] INFO -- : [457/885] 470164=test_gem_ext_builder I, [2024-05-16T22:07:15.657448 #428793] INFO -- : [458/885] 470167=test_https I, [2024-05-16T22:07:15.690451 #428793] INFO -- : [459/885] 470157=test_nesting_parser I, [2024-05-16T22:07:15.703026 #428793] INFO -- : [460/885] 470175=test_win32ole_method_event I, [2024-05-16T22:07:15.706945 #428793] INFO -- : [461/885] 470175=test_benchmark I, [2024-05-16T22:07:15.731835 #428793] INFO -- : [462/885] 470160=test_gem_dependency_list I, [2024-05-16T22:07:15.749589 #428793] INFO -- : [463/885] 470176=test_array I, [2024-05-16T22:07:15.810958 #428793] INFO -- : [464/885] 470157=test_helper_method I, [2024-05-16T22:07:15.819600 #428793] INFO -- : [465/885] 470157=test_gem_package_tar_writer I, [2024-05-16T22:07:15.824306 #428793] INFO -- : [466/885] 470160=test_gem_commands_outdated_command I, [2024-05-16T22:07:15.880491 #428793] INFO -- : [467/885] 470160=test_scalar_scanner I, [2024-05-16T22:07:15.893003 #428793] INFO -- : [468/885] 470160=test_gem_source I, [2024-05-16T22:07:15.897185 #428793] INFO -- : [469/885] 470163=test_rational2 I, [2024-05-16T22:07:15.903756 #428793] INFO -- : [470/885] 470169=test_rational I, [2024-05-16T22:07:15.909640 #428793] INFO -- : [471/885] 470163=test_spell_checker I, [2024-05-16T22:07:15.913156 #428793] INFO -- : [472/885] 470157=test_propertyputref I, [2024-05-16T22:07:15.916716 #428793] INFO -- : [473/885] 470157=attribute_write_test I, [2024-05-16T22:07:15.919174 #428793] INFO -- : [474/885] 470163=test_assembler I, [2024-05-16T22:07:15.920363 #428793] INFO -- : [475/885] 470157=test_gem_source_installed I, [2024-05-16T22:07:15.921128 #428793] INFO -- : [476/885] 470169=test_erb I, [2024-05-16T22:07:15.924873 #428793] INFO -- : [477/885] 470163=test_x509ext I, [2024-05-16T22:07:15.928954 #428793] INFO -- : [478/885] 470163=test_gem_commands_cert_command I, [2024-05-16T22:07:15.936065 #428793] INFO -- : [479/885] 470157=test_completion I, [2024-05-16T22:07:15.958934 #428793] INFO -- : [480/885] 470169=test_yield_block I, [2024-05-16T22:07:15.960913 #428793] INFO -- : [481/885] 470169=test_len I, [2024-05-16T22:07:15.964557 #428793] INFO -- : [482/885] 470169=test_parser I, [2024-05-16T22:07:15.986134 #428793] INFO -- : [483/885] 470169=test_method_name_check I, [2024-05-16T22:07:15.993283 #428793] INFO -- : [484/885] 470170=test_arith_seq_extract I, [2024-05-16T22:07:16.010933 #428793] INFO -- : [485/885] 470169=test_ssl I, [2024-05-16T22:07:16.101697 #428793] INFO -- : [486/885] 470167=test_gem_ext_cargo_builder I, [2024-05-16T22:07:16.118083 #428793] INFO -- : [487/885] 470167=constant_path_node_test I, [2024-05-16T22:07:16.150947 #428793] INFO -- : [488/885] 470167=test_gem_request_set I, [2024-05-16T22:07:16.164410 #428793] INFO -- : [489/885] 470170=test_module I, [2024-05-16T22:07:16.188837 #428793] INFO -- : [490/885] 470160=test_boolean I, [2024-05-16T22:07:16.196471 #428793] INFO -- : [491/885] 470160=test_stringify_symbols I, [2024-05-16T22:07:16.214316 #428793] INFO -- : [492/885] 470160=test_instrumentation_api I, [2024-05-16T22:07:16.538862 #428793] INFO -- : [493/885] 470167=integer_parse_test I, [2024-05-16T22:07:16.545880 #428793] INFO -- : [494/885] 470167=test_monitor I, [2024-05-16T22:07:16.612604 #428793] INFO -- : [495/885] 470162=test_buffered_io I, [2024-05-16T22:07:16.615146 #428793] INFO -- : [496/885] 470165=test_rubyvm I, [2024-05-16T22:07:16.618204 #428793] INFO -- : [497/885] 470165=test_configuration I, [2024-05-16T22:07:16.635226 #428793] INFO -- : [498/885] 470162=test_rdoc_generator_markup I, [2024-05-16T22:07:16.636476 #428793] INFO -- : [499/885] 470162=test_whileuntil I, [2024-05-16T22:07:16.640191 #428793] INFO -- : [500/885] 470162=test_cparser I, [2024-05-16T22:07:16.658897 #428793] INFO -- : [501/885] 470157=test_pkg_config I, [2024-05-16T22:07:16.667207 #428793] INFO -- : [502/885] 470164=test_variable I, [2024-05-16T22:07:16.696318 #428793] INFO -- : [503/885] 470157=fuzzer_test I, [2024-05-16T22:07:16.710530 #428793] INFO -- : [504/885] 470157=test_sexp I, [2024-05-16T22:07:16.718448 #428793] INFO -- : [505/885] 470165=test_rdoc_markup_include I, [2024-05-16T22:07:16.731825 #428793] INFO -- : [506/885] 470157=magic_comment_test I, [2024-05-16T22:07:16.734553 #428793] INFO -- : [507/885] 470157=test_rdoc_markup_to_html_snippet I, [2024-05-16T22:07:16.750527 #428793] INFO -- : [508/885] 470167=test_struct I, [2024-05-16T22:07:16.755223 #428793] INFO -- : [509/885] 470167=json_common_interface_test I, [2024-05-16T22:07:16.767292 #428793] INFO -- : [510/885] 470167=test_dln I, [2024-05-16T22:07:16.768802 #428793] INFO -- : [511/885] 470167=test_gem_source_subpath_problem I, [2024-05-16T22:07:16.771753 #428793] INFO -- : [512/885] 470164=test_win32ole_variant_outarg I, [2024-05-16T22:07:16.775557 #428793] INFO -- : [513/885] 470164=test_config I, [2024-05-16T22:07:16.798199 #428793] INFO -- : [514/885] 470157=test_nomethod_error I, [2024-05-16T22:07:16.806915 #428793] INFO -- : [515/885] 470157=json_parser_test I, [2024-05-16T22:07:16.814460 #428793] INFO -- : [516/885] 470164=memsize_test I, [2024-05-16T22:07:16.866469 #428793] INFO -- : [517/885] 470165=test_struct I, [2024-05-16T22:07:16.867056 #428793] INFO -- : [518/885] 470164=test_gem_path_support I, [2024-05-16T22:07:16.871641 #428793] INFO -- : [519/885] 470157=test_set I, [2024-05-16T22:07:16.899844 #428793] INFO -- : [520/885] 470157=test_files_test_1 I, [2024-05-16T22:07:16.907184 #428793] INFO -- : [521/885] 470164=test_rdoc_rd_inline I, [2024-05-16T22:07:16.916323 #428793] INFO -- : [522/885] 470164=test_mutex I, [2024-05-16T22:07:16.936171 #428793] INFO -- : [523/885] 470167=test_x509req I, [2024-05-16T22:07:16.983150 #428793] INFO -- : [524/885] 470175=test_key_error I, [2024-05-16T22:07:16.984696 #428793] INFO -- : [525/885] 470175=test_allocation I, [2024-05-16T22:07:17.141891 #428793] INFO -- : [526/885] 470167=test_div I, [2024-05-16T22:07:17.147266 #428793] INFO -- : [527/885] 470167=test_win32ole_variant_m I, [2024-05-16T22:07:17.148626 #428793] INFO -- : [528/885] 470167=test_engine I, [2024-05-16T22:07:17.151757 #428793] INFO -- : [529/885] 470167=test_color_printer I, [2024-05-16T22:07:17.163018 #428793] INFO -- : [530/885] 470167=test_deprecated I, [2024-05-16T22:07:17.167799 #428793] INFO -- : [531/885] 470167=test_insns_leaf I, [2024-05-16T22:07:17.168529 #428793] INFO -- : [532/885] 470167=test_serialize_subclasses I, [2024-05-16T22:07:17.175199 #428793] INFO -- : [533/885] 470167=test_x509crl I, [2024-05-16T22:07:17.179783 #428793] INFO -- : [534/885] 470161=test_fixnum I, [2024-05-16T22:07:17.191118 #428793] INFO -- : [535/885] 470161=test_signal I, [2024-05-16T22:07:17.215576 #428793] INFO -- : [536/885] 470174=test_rdoc_top_level I, [2024-05-16T22:07:17.293381 #428793] INFO -- : [537/885] 470158=test_metaclass I, [2024-05-16T22:07:17.299595 #428793] INFO -- : [538/885] 470158=test_rdoc_rd I, [2024-05-16T22:07:17.318180 #428793] INFO -- : [539/885] 470172=test_cgi_session I, [2024-05-16T22:07:17.337819 #428793] INFO -- : [540/885] 470172=test_input_method I, [2024-05-16T22:07:17.346934 #428793] INFO -- : [541/885] 470167=test_windows_1252 I, [2024-05-16T22:07:17.356112 #428793] INFO -- : [542/885] 470167=test_process I, [2024-05-16T22:07:17.377632 #428793] INFO -- : [543/885] 470162=test_require I, [2024-05-16T22:07:17.383250 #428793] INFO -- : [544/885] 470167=test_cgi_cookie I, [2024-05-16T22:07:17.386315 #428793] INFO -- : [545/885] 470165=test_float I, [2024-05-16T22:07:17.393981 #428793] INFO -- : [546/885] 470167=test_gem_resolver_installer_set I, [2024-05-16T22:07:17.469916 #428793] INFO -- : [547/885] 470158=test_dir_m17n I, [2024-05-16T22:07:17.534300 #428793] INFO -- : [548/885] 470174=test_gem_source_git I, [2024-05-16T22:07:17.582009 #428793] INFO -- : [549/885] 470167=test_regex_casefold I, [2024-05-16T22:07:17.613583 #428793] INFO -- : [550/885] 470172=test_refinement I, [2024-05-16T22:07:17.949873 #428793] INFO -- : [551/885] 470167=test_gem_commands_signout_command I, [2024-05-16T22:07:17.953498 #428793] INFO -- : [552/885] 470167=test_gem_security_signer I, [2024-05-16T22:07:18.027577 #428793] INFO -- : [553/885] 470167=test_cipher I, [2024-05-16T22:07:18.043152 #428793] INFO -- : [554/885] 470164=test_new I, [2024-05-16T22:07:18.046745 #428793] INFO -- : [555/885] 470164=test_storage I, [2024-05-16T22:07:18.050140 #428793] INFO -- : [556/885] 470164=test_gem_resolver_git_set I, [2024-05-16T22:07:18.065391 #428793] INFO -- : [557/885] 470167=test_omap I, [2024-05-16T22:07:18.070038 #428793] INFO -- : [558/885] 470167=test_iterator I, [2024-05-16T22:07:18.105213 #428793] INFO -- : [559/885] 470170=test_string I, [2024-05-16T22:07:18.114391 #428793] INFO -- : [560/885] 470170=test_digest_extend I, [2024-05-16T22:07:18.122324 #428793] INFO -- : [561/885] 470170=test_shellwords I, [2024-05-16T22:07:18.125935 #428793] INFO -- : [562/885] 470170=test_memory_view I, [2024-05-16T22:07:18.143922 #428793] INFO -- : [563/885] 470170=pattern_test I, [2024-05-16T22:07:18.145131 #428793] INFO -- : [564/885] 470167=test_debug I, [2024-05-16T22:07:18.154845 #428793] INFO -- : [565/885] 470167=test_rdoc_markup_pre_process I, [2024-05-16T22:07:18.160453 #428793] INFO -- : [566/885] 470174=test_printf I, [2024-05-16T22:07:18.174991 #428793] INFO -- : [567/885] 470174=test_stream I, [2024-05-16T22:07:18.200334 #428793] INFO -- : [568/885] 470174=test_to_ary_concat I, [2024-05-16T22:07:18.218693 #428793] INFO -- : [569/885] 470170=test_time I, [2024-05-16T22:07:18.274141 #428793] INFO -- : [570/885] 470167=test_webauthn_listener_response I, [2024-05-16T22:07:18.298643 #428793] INFO -- : [571/885] 470167=test_pinned I, [2024-05-16T22:07:18.342896 #428793] INFO -- : [572/885] 470170=test_within_pipe I, [2024-05-16T22:07:18.352243 #428793] INFO -- : [573/885] 470164=test_emoji_breaks I, [2024-05-16T22:07:18.358737 #428793] INFO -- : [574/885] 470164=test_gem_bundler_version_finder I, [2024-05-16T22:07:18.365651 #428793] INFO -- : [575/885] 470167=reflection_test I, [2024-05-16T22:07:18.372508 #428793] INFO -- : [576/885] 470167=test_beginendblock I, [2024-05-16T22:07:18.384794 #428793] INFO -- : [577/885] 470164=test_files_lib I, [2024-05-16T22:07:18.385913 #428793] INFO -- : [578/885] 470171=test_gem_commands_unpack_command I, [2024-05-16T22:07:18.391753 #428793] INFO -- : [579/885] 470164=test_help I, [2024-05-16T22:07:18.395757 #428793] INFO -- : [580/885] 470164=test_rdoc_markup_to_bs I, [2024-05-16T22:07:18.419110 #428793] INFO -- : [581/885] 470170=test_digest I, [2024-05-16T22:07:18.423199 #428793] INFO -- : [582/885] 470170=test_rdoc_servlet I, [2024-05-16T22:07:18.451345 #428793] INFO -- : [583/885] 470164=test_gem_security I, [2024-05-16T22:07:18.520912 #428793] INFO -- : [584/885] 470170=test_ractor I, [2024-05-16T22:07:18.564760 #428793] INFO -- : [585/885] 470170=test_open3 I, [2024-05-16T22:07:18.725309 #428793] INFO -- : [586/885] 470163=test_multi_irb_commands I, [2024-05-16T22:07:18.736567 #428793] INFO -- : [587/885] 470163=test_fiber I, [2024-05-16T22:07:18.759917 #428793] INFO -- : [588/885] 470171=test_bundled_ca I, [2024-05-16T22:07:18.792251 #428793] INFO -- : [589/885] 470165=test_closure I, [2024-05-16T22:07:18.832241 #428793] INFO -- : [590/885] 470167=test_popen_deadlock I, [2024-05-16T22:07:18.899150 #428793] INFO -- : [591/885] 470158=test_delegate I, [2024-05-16T22:07:18.908282 #428793] INFO -- : [592/885] 470158=test_mkmf I, [2024-05-16T22:07:18.951608 #428793] INFO -- : [593/885] 470158=test_date_marshal I, [2024-05-16T22:07:18.960322 #428793] INFO -- : [594/885] 470158=test_history I, [2024-05-16T22:07:19.012993 #428793] INFO -- : [595/885] 470158=test_recursion I, [2024-05-16T22:07:19.014761 #428793] INFO -- : [596/885] 470158=test_exit I, [2024-05-16T22:07:19.015804 #428793] INFO -- : [597/885] 470165=test_did_you_mean I, [2024-05-16T22:07:19.073553 #428793] INFO -- : [598/885] 470158=test_io_m17n I, [2024-05-16T22:07:19.156181 #428793] INFO -- : [599/885] 470165=test_variable_name_check I, [2024-05-16T22:07:19.180803 #428793] INFO -- : [600/885] 470160=test_gem_commands_server_command I, [2024-05-16T22:07:19.197635 #428793] INFO -- : [601/885] 470160=test_option I, [2024-05-16T22:07:19.198740 #428793] INFO -- : [602/885] 470165=test_append I, [2024-05-16T22:07:19.203365 #428793] INFO -- : [603/885] 470165=test_tracer I, [2024-05-16T22:07:19.298038 #428793] INFO -- : [604/885] 470174=test_cmethod I, [2024-05-16T22:07:19.299185 #428793] INFO -- : [605/885] 470174=test_gem_commands_build_command I, [2024-05-16T22:07:19.311378 #428793] INFO -- : [606/885] 470165=test_case_comprehensive I, [2024-05-16T22:07:19.330258 #428793] INFO -- : [607/885] 470161=test_interned_str I, [2024-05-16T22:07:19.335928 #428793] INFO -- : [608/885] 470161=test_ocsp I, [2024-05-16T22:07:19.350469 #428793] INFO -- : [609/885] 470160=test_class I, [2024-05-16T22:07:19.359041 #428793] INFO -- : [610/885] 470160=test_pkey_dsa I, [2024-05-16T22:07:19.441625 #428793] INFO -- : [611/885] 470157=test_scheduler I, [2024-05-16T22:07:19.485402 #428793] INFO -- : [612/885] 470167=test_exception_at_throwing I, [2024-05-16T22:07:19.541979 #428793] INFO -- : [613/885] 470167=test_iseq I, [2024-05-16T22:07:19.544342 #428793] INFO -- : [614/885] 470159=test_rdoc_markup_heading I, [2024-05-16T22:07:19.555780 #428793] INFO -- : [615/885] 470159=test_win32ole_param_event I, [2024-05-16T22:07:19.556112 #428793] INFO -- : [616/885] 470175=test_bn I, [2024-05-16T22:07:19.558855 #428793] INFO -- : [617/885] 470159=redundant_return_test I, [2024-05-16T22:07:19.562788 #428793] INFO -- : [618/885] 470159=test_case_mapping I, [2024-05-16T22:07:19.569486 #428793] INFO -- : [619/885] 470159=test_path I, [2024-05-16T22:07:19.578901 #428793] INFO -- : [620/885] 470159=test_tree_spell_checker I, [2024-05-16T22:07:19.593399 #428793] INFO -- : [621/885] 470157=test_http I, [2024-05-16T22:07:19.593942 #428793] INFO -- : [622/885] 470175=test_addrinfo I, [2024-05-16T22:07:19.613535 #428793] INFO -- : [623/885] 470159=test_bug-14834 I, [2024-05-16T22:07:19.619754 #428793] INFO -- : [624/885] 470174=test_rdoc_markup_to_html I, [2024-05-16T22:07:19.625236 #428793] INFO -- : [625/885] 470175=test_date_compat I, [2024-05-16T22:07:19.628145 #428793] INFO -- : [626/885] 470175=test_terminfo I, [2024-05-16T22:07:19.659194 #428793] INFO -- : [627/885] 470161=test_compile_prism I, [2024-05-16T22:07:19.682177 #428793] INFO -- : [628/885] 470159=test_ssl_session I, [2024-05-16T22:07:19.686613 #428793] INFO -- : [629/885] 470174=test_lexer I, [2024-05-16T22:07:19.693015 #428793] INFO -- : [630/885] 470175=test_thread_cv I, [2024-05-16T22:07:19.698508 #428793] INFO -- : [631/885] 470174=test_gem_resolver_vendor_specification I, [2024-05-16T22:07:19.720898 #428793] INFO -- : [632/885] 470174=test_gem_commands_update_command I, [2024-05-16T22:07:19.942184 #428793] INFO -- : [633/885] 470161=test_notimplement I, [2024-05-16T22:07:19.946582 #428793] INFO -- : [634/885] 470161=test_random I, [2024-05-16T22:07:19.950347 #428793] INFO -- : [635/885] 470160=test_gem_uri I, [2024-05-16T22:07:19.953439 #428793] INFO -- : [636/885] 470161=test_key_event_record I, [2024-05-16T22:07:19.965446 #428793] INFO -- : [637/885] 470160=test_rdoc_method_attr I, [2024-05-16T22:07:20.000807 #428793] INFO -- : [638/885] 470161=test_data I, [2024-05-16T22:07:20.005504 #428793] INFO -- : [639/885] 470161=static_literals_test I, [2024-05-16T22:07:20.006548 #428793] INFO -- : [640/885] 470161=test_filter I, [2024-05-16T22:07:20.027846 #428793] INFO -- : [641/885] 470161=test_gem_gem_runner I, [2024-05-16T22:07:20.045608 #428793] INFO -- : [642/885] 470160=test_rdoc_generator_pot I, [2024-05-16T22:07:20.048198 #428793] INFO -- : [643/885] 470160=test_unicode I, [2024-05-16T22:07:20.055993 #428793] INFO -- : [644/885] 470160=test_enumerator I, [2024-05-16T22:07:20.058426 #428793] INFO -- : [645/885] 470166=test_rdoc_parser_changelog I, [2024-05-16T22:07:20.064979 #428793] INFO -- : [646/885] 470160=parameters_signature_test I, [2024-05-16T22:07:20.074127 #428793] INFO -- : [647/885] 470161=test_koi8 I, [2024-05-16T22:07:20.078803 #428793] INFO -- : [648/885] 470161=test_acceptable I, [2024-05-16T22:07:20.110729 #428793] INFO -- : [649/885] 470167=test_rdoc_generator_pot_po_entry I, [2024-05-16T22:07:20.115487 #428793] INFO -- : [650/885] 470160=test_euc_jp I, [2024-05-16T22:07:20.134973 #428793] INFO -- : [651/885] 470160=test_document I, [2024-05-16T22:07:20.137557 #428793] INFO -- : [652/885] 470166=test_pair I, [2024-05-16T22:07:20.140642 #428793] INFO -- : [653/885] 470160=test_gem_commands_yank_command I, [2024-05-16T22:07:20.156858 #428793] INFO -- : [654/885] 470167=test_win32ole_param I, [2024-05-16T22:07:20.163100 #428793] INFO -- : [655/885] 470167=test_rdoc_i18n_locale I, [2024-05-16T22:07:20.172255 #428793] INFO -- : [656/885] 470167=test_chilled I, [2024-05-16T22:07:20.176036 #428793] INFO -- : [657/885] 470167=test_name_error_extension I, [2024-05-16T22:07:20.178087 #428793] INFO -- : [658/885] 470161=test_primitive I, [2024-05-16T22:07:20.183621 #428793] INFO -- : [659/885] 470167=test_human_typo I, [2024-05-16T22:07:20.188570 #428793] INFO -- : [660/885] 470161=test_rbconfig I, [2024-05-16T22:07:20.191554 #428793] INFO -- : [661/885] 470167=test_key_stroke I, [2024-05-16T22:07:20.196421 #428793] INFO -- : [662/885] 470161=json_encoding_test I, [2024-05-16T22:07:20.203621 #428793] INFO -- : [663/885] 470167=test_color I, [2024-05-16T22:07:20.205639 #428793] INFO -- : [664/885] 470161=test_rdoc_ri_driver I, [2024-05-16T22:07:20.243585 #428793] INFO -- : [665/885] 470167=test_gem_resolver_local_specification I, [2024-05-16T22:07:20.260386 #428793] INFO -- : [666/885] 470167=test_httpheader I, [2024-05-16T22:07:20.265371 #428793] INFO -- : [667/885] 470167=test_set_len I, [2024-05-16T22:07:20.268647 #428793] INFO -- : [668/885] 470167=test_httpresponses I, [2024-05-16T22:07:20.272255 #428793] INFO -- : [669/885] 470167=test_encoding I, [2024-05-16T22:07:20.273799 #428793] INFO -- : [670/885] 470171=test_sockopt I, [2024-05-16T22:07:20.276940 #428793] INFO -- : [671/885] 470172=test_rdoc_markup_to_label I, [2024-05-16T22:07:20.279957 #428793] INFO -- : [672/885] 470171=test_install I, [2024-05-16T22:07:20.283910 #428793] INFO -- : [673/885] 470167=test_key_actor_emacs I, [2024-05-16T22:07:20.324344 #428793] INFO -- : [674/885] 470175=test_gem_command_manager I, [2024-05-16T22:07:20.334219 #428793] INFO -- : [675/885] 470162=test_gem_gemcutter_utilities I, [2024-05-16T22:07:20.338225 #428793] INFO -- : [676/885] 470158=test_basicinstructions I, [2024-05-16T22:07:20.341039 #428793] INFO -- : [677/885] 470172=test_arithmetic_sequence I, [2024-05-16T22:07:20.356312 #428793] INFO -- : [678/885] 470172=test_cgi_header I, [2024-05-16T22:07:20.362886 #428793] INFO -- : [679/885] 470172=heredoc_dedent_test I, [2024-05-16T22:07:20.368877 #428793] INFO -- : [680/885] 470167=test_object I, [2024-05-16T22:07:20.372973 #428793] INFO -- : [681/885] 470167=version_test I, [2024-05-16T22:07:20.376351 #428793] INFO -- : [682/885] 470167=test_type I, [2024-05-16T22:07:20.382504 #428793] INFO -- : [683/885] 470167=test_ractor I, [2024-05-16T22:07:20.394956 #428793] INFO -- : [684/885] 470158=test_pointer I, [2024-05-16T22:07:20.423601 #428793] INFO -- : [685/885] 470172=test_func I, [2024-05-16T22:07:20.429298 #428793] INFO -- : [686/885] 470167=test_big5 I, [2024-05-16T22:07:20.433539 #428793] INFO -- : [687/885] 470167=test_rdoc_rd_block_parser I, [2024-05-16T22:07:20.453014 #428793] INFO -- : [688/885] 470161=test_tsort I, [2024-05-16T22:07:20.456439 #428793] INFO -- : [689/885] 470175=test_signedness I, [2024-05-16T22:07:20.458125 #428793] INFO -- : [690/885] 470161=compiler_test I, [2024-05-16T22:07:20.461792 #428793] INFO -- : [691/885] 470167=test_flip I, [2024-05-16T22:07:20.463593 #428793] INFO -- : [692/885] 470161=test_change_word I, [2024-05-16T22:07:20.466429 #428793] INFO -- : [693/885] 470161=test_ossl I, [2024-05-16T22:07:20.496653 #428793] INFO -- : [694/885] 470171=test_normalize I, [2024-05-16T22:07:20.497275 #428793] INFO -- : [695/885] 470171=test_timeout I, [2024-05-16T22:07:20.500125 #428793] INFO -- : [696/885] 470167=test_gem_local_remote_options I, [2024-05-16T22:07:20.507020 #428793] INFO -- : [697/885] 470171=test_date_arith I, [2024-05-16T22:07:20.511819 #428793] INFO -- : [698/885] 470171=test_ruby_lex I, [2024-05-16T22:07:20.552502 #428793] INFO -- : [699/885] 470167=test_object I, [2024-05-16T22:07:20.607504 #428793] INFO -- : [700/885] 470160=test_sleep I, [2024-05-16T22:07:20.655983 #428793] INFO -- : [701/885] 470171=test_delete I, [2024-05-16T22:07:20.658306 #428793] INFO -- : [702/885] 470159=test_win32ole_method I, [2024-05-16T22:07:20.658789 #428793] INFO -- : [703/885] 470159=test_continuation I, [2024-05-16T22:07:20.659334 #428793] INFO -- : [704/885] 470171=test_fd_setsize I, [2024-05-16T22:07:20.667232 #428793] INFO -- : [705/885] 470171=test_class_name_check I, [2024-05-16T22:07:20.672843 #428793] INFO -- : [706/885] 470159=test_keyword I, [2024-05-16T22:07:20.694781 #428793] INFO -- : [707/885] 470171=test_pkey_rsa I, [2024-05-16T22:07:20.704976 #428793] INFO -- : [708/885] 470162=test_numhash I, [2024-05-16T22:07:20.711965 #428793] INFO -- : [709/885] 470162=test_weakkeymap I, [2024-05-16T22:07:20.718742 #428793] INFO -- : [710/885] 470176=test_gem_commands_push_command I, [2024-05-16T22:07:20.781318 #428793] INFO -- : [711/885] 470158=test_rdoc_markup_hard_break I, [2024-05-16T22:07:20.786065 #428793] INFO -- : [712/885] 470158=test_date_strptime I, [2024-05-16T22:07:20.856177 #428793] INFO -- : [713/885] 470158=test_gem_package_task I, [2024-05-16T22:07:20.859175 #428793] INFO -- : [714/885] 470158=test_placearg I, [2024-05-16T22:07:20.921404 #428793] INFO -- : [715/885] 470158=test_gem_platform I, [2024-05-16T22:07:20.924291 #428793] INFO -- : [716/885] 470162=test_import I, [2024-05-16T22:07:20.953447 #428793] INFO -- : [717/885] 470171=test_gem_resolver_lock_set I, [2024-05-16T22:07:20.961929 #428793] INFO -- : [718/885] 470171=test_not I, [2024-05-16T22:07:20.967650 #428793] INFO -- : [719/885] 470171=test_rdoc_parser_markdown I, [2024-05-16T22:07:20.974207 #428793] INFO -- : [720/885] 470167=test_gem_update_suggestion I, [2024-05-16T22:07:20.987427 #428793] INFO -- : [721/885] 470174=test_files_test I, [2024-05-16T22:07:21.003942 #428793] INFO -- : [722/885] 470171=test_file_exhaustive I, [2024-05-16T22:07:21.008309 #428793] INFO -- : [723/885] 470158=test_logger I, [2024-05-16T22:07:21.023912 #428793] INFO -- : [724/885] 470158=test_transcode I, [2024-05-16T22:07:21.044973 #428793] INFO -- : [725/885] 470167=test_eval I, [2024-05-16T22:07:21.084467 #428793] INFO -- : [726/885] 470174=json_generator_test I, [2024-05-16T22:07:21.101069 #428793] INFO -- : [727/885] 470170=test_gem_resolver_vendor_set I, [2024-05-16T22:07:21.121782 #428793] INFO -- : [728/885] 470170=test_config I, [2024-05-16T22:07:21.151489 #428793] INFO -- : [729/885] 470174=test_enumerable I, [2024-05-16T22:07:21.160992 #428793] INFO -- : [730/885] 470174=test_gem_safe_marshal I, [2024-05-16T22:07:21.224246 #428793] INFO -- : [731/885] 470159=test_gem_resolver_api_set I, [2024-05-16T22:07:21.229325 #428793] INFO -- : [732/885] 470158=test_gem_request_set_gem_dependency_api I, [2024-05-16T22:07:21.263363 #428793] INFO -- : [733/885] 470176=test_ast I, [2024-05-16T22:07:21.286478 #428793] INFO -- : [734/885] 470159=test_lambda I, [2024-05-16T22:07:21.288957 #428793] INFO -- : [735/885] 470167=test_jaro_winkler I, [2024-05-16T22:07:21.294543 #428793] INFO -- : [736/885] 470167=test_random_formatter I, [2024-05-16T22:07:21.311593 #428793] INFO -- : [737/885] 470167=test_helper I, [2024-05-16T22:07:21.312187 #428793] INFO -- : [738/885] 470167=test_webauthn_listener I, [2024-05-16T22:07:21.357310 #428793] INFO -- : [739/885] 470167=test_rdoc_code_object I, [2024-05-16T22:07:21.365289 #428793] INFO -- : [740/885] 470159=test_x509store I, [2024-05-16T22:07:21.417602 #428793] INFO -- : [741/885] 470158=test_fips I, [2024-05-16T22:07:21.535080 #428793] INFO -- : [742/885] 470164=test_x509name I, [2024-05-16T22:07:21.537534 #428793] INFO -- : [743/885] 470170=test_update I, [2024-05-16T22:07:21.541018 #428793] INFO -- : [744/885] 470164=test_file I, [2024-05-16T22:07:21.544909 #428793] INFO -- : [745/885] 470170=test_force_exit I, [2024-05-16T22:07:21.601499 #428793] INFO -- : [746/885] 470170=test_ostruct I, [2024-05-16T22:07:21.632367 #428793] INFO -- : [747/885] 470174=unescape_test I, [2024-05-16T22:07:21.640794 #428793] INFO -- : [748/885] 470167=test_data_error I, [2024-05-16T22:07:21.646890 #428793] INFO -- : [749/885] 470162=bom_test I, [2024-05-16T22:07:21.650095 #428793] INFO -- : [750/885] 470162=test_udp I, [2024-05-16T22:07:21.653912 #428793] INFO -- : [751/885] 470162=static_inspect_test I, [2024-05-16T22:07:21.667155 #428793] INFO -- : [752/885] 470162=test_gem_commands_check_command I, [2024-05-16T22:07:21.675746 #428793] INFO -- : [753/885] 470162=test_regexp I, [2024-05-16T22:07:21.696391 #428793] INFO -- : [754/885] 470167=errors_test I, [2024-05-16T22:07:21.708036 #428793] INFO -- : [755/885] 470158=test_vm_dump I, [2024-05-16T22:07:21.710147 #428793] INFO -- : [756/885] 470158=test_rdoc_markup_document I, [2024-05-16T22:07:21.719091 #428793] INFO -- : [757/885] 470158=test_integer_comb I, [2024-05-16T22:07:21.765343 #428793] INFO -- : [758/885] 470167=test_tmpdir I, [2024-05-16T22:07:21.768190 #428793] INFO -- : [759/885] 470159=test_rdoc_ri_paths I, [2024-05-16T22:07:21.788105 #428793] INFO -- : [760/885] 470159=test_ts I, [2024-05-16T22:07:21.796352 #428793] INFO -- : [761/885] 470170=library_symbols_test I, [2024-05-16T22:07:21.796788 #428793] INFO -- : [762/885] 470170=test_locale I, [2024-05-16T22:07:21.824678 #428793] INFO -- : [763/885] 470170=test_addr I, [2024-05-16T22:07:21.832939 #428793] INFO -- : [764/885] 470170=test_ensured I, [2024-05-16T22:07:21.863215 #428793] INFO -- : [765/885] 470167=test_gem_uri_formatter I, [2024-05-16T22:07:21.885561 #428793] INFO -- : [766/885] 470167=test_encoding I, [2024-05-16T22:07:21.893038 #428793] INFO -- : [767/885] 470170=test_helper I, [2024-05-16T22:07:21.893096 #428793] INFO -- : [768/885] 470170=test_erb_command I, [2024-05-16T22:07:21.934776 #428793] INFO -- : [769/885] 470170=test_constant I, [2024-05-16T22:07:21.982511 #428793] INFO -- : [770/885] 470172=test_pty I, [2024-05-16T22:07:22.083175 #428793] INFO -- : [771/885] 470167=test_dup I, [2024-05-16T22:07:22.236258 #428793] INFO -- : [772/885] 470167=command_line_test I, [2024-05-16T22:07:22.242737 #428793] INFO -- : [773/885] 470167=test_project_sanity I, [2024-05-16T22:07:22.283209 #428793] INFO -- : [774/885] 470167=test_range I, [2024-05-16T22:07:22.334118 #428793] INFO -- : [775/885] 470159=test_gem I, [2024-05-16T22:07:22.382779 #428793] INFO -- : [776/885] 470168=test_gem_source_lock I, [2024-05-16T22:07:22.433629 #428793] INFO -- : [777/885] 470168=test_ractor I, [2024-05-16T22:07:22.464512 #428793] INFO -- : [778/885] 470168=test_gem_commands_open_command I, [2024-05-16T22:07:22.477497 #428793] INFO -- : [779/885] 470172=test_dns I, [2024-05-16T22:07:22.493493 #428793] INFO -- : [780/885] 470174=test_registry I, [2024-05-16T22:07:22.497105 #428793] INFO -- : [781/885] 470174=parse_stream_test I, [2024-05-16T22:07:22.500136 #428793] INFO -- : [782/885] 470174=test_parser I, [2024-05-16T22:07:22.518236 #428793] INFO -- : [783/885] 470174=test_cgi_core I, [2024-05-16T22:07:22.529869 #428793] INFO -- : [784/885] 470168=test_reline_key I, [2024-05-16T22:07:22.535611 #428793] INFO -- : [785/885] 470168=test_rb_str_dup I, [2024-05-16T22:07:22.538833 #428793] INFO -- : [786/885] 470174=test_ancdata I, [2024-05-16T22:07:22.540125 #428793] INFO -- : [787/885] 470168=test_singleton_function I, [2024-05-16T22:07:22.540464 #428793] INFO -- : [788/885] 470168=test_timeout I, [2024-05-16T22:07:22.542159 #428793] INFO -- : [789/885] 470174=test_alias I, [2024-05-16T22:07:22.562761 #428793] INFO -- : [790/885] 470175=test_weakref I, [2024-05-16T22:07:22.688099 #428793] INFO -- : [791/885] 470174=test_nonblock I, [2024-05-16T22:07:22.698861 #428793] INFO -- : [792/885] 470174=test_marshal I, [2024-05-16T22:07:22.757662 #428793] INFO -- : [793/885] 470175=test_unicode_normalize I, [2024-05-16T22:07:22.826093 #428793] INFO -- : [794/885] 470167=test_debugger_integration I, [2024-05-16T22:07:22.834234 #428793] INFO -- : [795/885] 470167=test_rendering I, [2024-05-16T22:07:22.852073 #428793] INFO -- : [796/885] 470167=test_my_integer I, [2024-05-16T22:07:22.860984 #428793] INFO -- : [797/885] 470167=json_ext_parser_test I, [2024-05-16T22:07:22.869860 #428793] INFO -- : [798/885] 470167=test_thread I, [2024-05-16T22:07:22.957451 #428793] INFO -- : [799/885] 470172=test_ractor I, [2024-05-16T22:07:23.186484 #428793] INFO -- : [800/885] 470174=test_ssl I, [2024-05-16T22:07:23.304041 #428793] INFO -- : [801/885] 470158=test_usrmarshal I, [2024-05-16T22:07:23.314001 #428793] INFO -- : [802/885] 470172=test_object_references I, [2024-05-16T22:07:23.328115 #428793] INFO -- : [803/885] 470172=test_gem_resolver_git_specification I, [2024-05-16T22:07:23.370949 #428793] INFO -- : [804/885] 470168=test_have_func I, [2024-05-16T22:07:23.428278 #428793] INFO -- : [805/885] 470158=test_stat I, [2024-05-16T22:07:23.431428 #428793] INFO -- : [806/885] 470158=test_gem_request_set_lockfile_tokenizer I, [2024-05-16T22:07:23.464932 #428793] INFO -- : [807/885] 470158=test_capacity I, [2024-05-16T22:07:23.471911 #428793] INFO -- : [808/885] 470158=test_nextafter I, [2024-05-16T22:07:23.539909 #428793] INFO -- : [809/885] 470158=test_rubygems I, [2024-05-16T22:07:23.588515 #428793] INFO -- : [810/885] 470166=test_call I, [2024-05-16T22:07:23.599637 #428793] INFO -- : [811/885] 470172=test_https_proxy I, [2024-05-16T22:07:23.601972 #428793] INFO -- : [812/885] 470174=test_rubyoptions I, [2024-05-16T22:07:23.647248 #428793] INFO -- : [813/885] 470172=test_super I, [2024-05-16T22:07:23.677219 #428793] INFO -- : [814/885] 470166=test_integer I, [2024-05-16T22:07:23.714854 #428793] INFO -- : [815/885] 470158=test_cgi_modruby I, [2024-05-16T22:07:23.753990 #428793] INFO -- : [816/885] 470158=test_gem_commands_setup_command I, [2024-05-16T22:07:23.767045 #428793] INFO -- : [817/885] 470173=test_dryrun I, [2024-05-16T22:07:23.793554 #428793] INFO -- : [818/885] 470173=test_integer I, [2024-05-16T22:07:23.833136 #428793] INFO -- : [819/885] 470173=desugar_compiler_test I, [2024-05-16T22:07:23.850374 #428793] INFO -- : [820/885] 470173=test_env I, [2024-05-16T22:07:24.000429 #428793] INFO -- : [821/885] 470159=test_rdoc_attr I, [2024-05-16T22:07:24.001782 #428793] INFO -- : [822/885] 470170=location_test I, [2024-05-16T22:07:24.008554 #428793] INFO -- : [823/885] 470159=test_symbol I, [2024-05-16T22:07:24.010509 #428793] INFO -- : [824/885] 470159=test_coderange I, [2024-05-16T22:07:24.015680 #428793] INFO -- : [825/885] 470159=test_mailto I, [2024-05-16T22:07:24.039470 #428793] INFO -- : [826/885] 470170=test_rdoc_comment I, [2024-05-16T22:07:24.041011 #428793] INFO -- : [827/885] 470159=test_resize I, [2024-05-16T22:07:24.055564 #428793] INFO -- : [828/885] 470159=test_error_highlight I, [2024-05-16T22:07:24.069492 #428793] INFO -- : [829/885] 470170=test_rdoc_generator_darkfish I, [2024-05-16T22:07:24.250988 #428793] INFO -- : [830/885] 470170=test_http_request I, [2024-05-16T22:07:24.258277 #428793] INFO -- : [831/885] 470169=json_generic_object_test I, [2024-05-16T22:07:24.266389 #428793] INFO -- : [832/885] 470169=test_gem_source_fetch_problem I, [2024-05-16T22:07:24.269492 #428793] INFO -- : [833/885] 470170=test_member I, [2024-05-16T22:07:24.272535 #428793] INFO -- : [834/885] 470170=test_numeric I, [2024-05-16T22:07:24.279557 #428793] INFO -- : [835/885] 470169=test_cgi_multipart I, [2024-05-16T22:07:24.281161 #428793] INFO -- : [836/885] 470170=test_word I, [2024-05-16T22:07:24.286753 #428793] INFO -- : [837/885] 470170=test_gem_commands_cleanup_command I, [2024-05-16T22:07:24.348803 #428793] INFO -- : [838/885] 470158=test_dir I, [2024-05-16T22:07:24.354479 #428793] INFO -- : [839/885] 470169=format_errors_test I, [2024-05-16T22:07:24.390751 #428793] INFO -- : [840/885] 470172=test_gem_console_ui I, [2024-05-16T22:07:24.394509 #428793] INFO -- : [841/885] 470169=test_date_ractor I, [2024-05-16T22:07:24.398293 #428793] INFO -- : [842/885] 470172=test_autoconf I, [2024-05-16T22:07:24.404510 #428793] INFO -- : [843/885] 470172=test_eval I, [2024-05-16T22:07:24.407447 #428793] INFO -- : [844/885] 470172=test_ractor_compatibility I, [2024-05-16T22:07:24.427098 #428793] INFO -- : [845/885] 470168=test_unix I, [2024-05-16T22:07:24.474297 #428793] INFO -- : [846/885] 470168=test_lazy_enumerator I, [2024-05-16T22:07:24.586224 #428793] INFO -- : [847/885] 470159=test_enc_associate I, [2024-05-16T22:07:24.601413 #428793] INFO -- : [848/885] 470169=test_find_executable I, [2024-05-16T22:07:24.617834 #428793] INFO -- : [849/885] 470158=ruby_api_test I, [2024-05-16T22:07:24.639358 #428793] INFO -- : [850/885] 470169=test_gem_commands_pristine_command I, [2024-05-16T22:07:24.645175 #428793] INFO -- : [851/885] 470163=test_context I, [2024-05-16T22:07:24.732473 #428793] INFO -- : [852/885] 470170=test_nofree I, [2024-05-16T22:07:24.732797 #428793] INFO -- : [853/885] 470172=test_coder I, [2024-05-16T22:07:24.734105 #428793] INFO -- : [854/885] 470170=test_symbol I, [2024-05-16T22:07:24.751772 #428793] INFO -- : [855/885] 470172=test_function_entry I, [2024-05-16T22:07:24.754566 #428793] INFO -- : [856/885] 470172=test_pkcs7 I, [2024-05-16T22:07:24.779121 #428793] INFO -- : [857/885] 470158=test_arith_seq_beg_len_step I, [2024-05-16T22:07:24.825068 #428793] INFO -- : [858/885] 470163=test_gem_resolver_requirement_list I, [2024-05-16T22:07:24.833713 #428793] INFO -- : [859/885] 470163=test_gem_specification I, [2024-05-16T22:07:24.847451 #428793] INFO -- : [860/885] 470158=test_enum I, [2024-05-16T22:07:24.914586 #428793] INFO -- : [861/885] 470168=test_threadgroup I, [2024-05-16T22:07:24.991373 #428793] INFO -- : [862/885] 470172=test_resolve_symbol I, [2024-05-16T22:07:25.071728 #428793] INFO -- : [863/885] 470159=test_complex2 I, [2024-05-16T22:07:25.079864 #428793] INFO -- : [864/885] 470172=test_gem_package I, [2024-05-16T22:07:25.087580 #428793] INFO -- : [865/885] 470159=test_have_macro I, [2024-05-16T22:07:25.522209 #428793] INFO -- : [866/885] 470166=ractor_test I, [2024-05-16T22:07:25.549542 #428793] INFO -- : [867/885] 470159=test_trace I, [2024-05-16T22:07:25.564240 #428793] INFO -- : [868/885] 470158=test_time_tz I, [2024-05-16T22:07:25.565636 #428793] INFO -- : [869/885] 470159=test_win32ole_event I, [2024-05-16T22:07:25.576064 #428793] INFO -- : [870/885] 470159=test_rdoc_generator_json_index I, [2024-05-16T22:07:25.600850 #428793] INFO -- : [871/885] 470159=test_bignum I, [2024-05-16T22:07:25.609090 #428793] INFO -- : [872/885] 470160=test_rdoc_class_module I, [2024-05-16T22:07:25.612052 #428793] INFO -- : [873/885] 470166=test_gem_ci_detector I, [2024-05-16T22:07:25.622241 #428793] INFO -- : [874/885] 470166=test_arity I, [2024-05-16T22:07:25.625278 #428793] INFO -- : [875/885] 470158=test_stringio I, [2024-05-16T22:07:25.628357 #428793] INFO -- : [876/885] 470166=test_io_wait_uncommon I, [2024-05-16T22:07:25.632359 #428793] INFO -- : [877/885] 470166=test_win32ole_variable I, [2024-05-16T22:07:25.636308 #428793] INFO -- : [878/885] 470166=test_win32ole_variant I, [2024-05-16T22:07:25.646329 #428793] INFO -- : [879/885] 470166=test_history I, [2024-05-16T22:07:25.658757 #428793] INFO -- : [880/885] 470166=test_mixed_unicode_escapes I, [2024-05-16T22:07:25.659032 #428793] INFO -- : [881/885] 470166=test_rdoc_markup_to_ansi I, [2024-05-16T22:07:25.688266 #428793] INFO -- : [882/885] 470166=test_ipaddr I, [2024-05-16T22:07:25.691252 #428793] INFO -- : [883/885] 470159=test_gem_resolver_api_specification I, [2024-05-16T22:07:25.707958 #428793] INFO -- : [884/885] 470166=test_merge_keys I, [2024-05-16T22:07:25.721094 #428793] INFO -- : [885/885] 470166=test_rdoc_extend I, [2024-05-16T22:07:44.528018 #428793] INFO -- : Finished tests in 37.395326s, 705.6229 tests/s, 250077.8844 assertions/s. I, [2024-05-16T22:07:44.528600 #428793] INFO -- : 26387 tests, 9351744 assertions, 0 failures, 0 errors, 304 skips I, [2024-05-16T22:07:44.528625 #428793] INFO -- : I, [2024-05-16T22:07:44.528632 #428793] INFO -- : ruby -v: ruby 3.4.0dev (2024-05-16T19:35:22Z master 854cbbd5a9) [x86_64-linux] I, [2024-05-16T22:07:44.530776 #428793] INFO -- : $$$[end] "make yes-test-all TESTOPTS='--stderr-on-failure' TESTS='-j20'" exit with 0. I, [2024-05-16T22:07:44.530900 #428793] INFO -- : $$$[beg] make yes-test-rubyspec MSPECOPT='--error-output stderr --debug -j' TESTS='-j20' I, [2024-05-16T22:07:44.619659 #428793] INFO -- : BASERUBY = /usr/bin/ruby --disable=gems I, [2024-05-16T22:07:44.619699 #428793] INFO -- : CC = gcc I, [2024-05-16T22:07:44.619704 #428793] INFO -- : LD = ld I, [2024-05-16T22:07:44.619709 #428793] INFO -- : LDSHARED = gcc -shared I, [2024-05-16T22:07:44.619714 #428793] INFO -- : CFLAGS = -O3 -fno-fast-math -ggdb3 -Wall -Wextra -Wdeprecated-declarations -Wdiv-by-zero -Wduplicated-cond -Wimplicit-function-declaration -Wimplicit-int -Wpointer-arith -Wwrite-strings -Wold-style-definition -Wimplicit-fallthrough=0 -Wmissing-noreturn -Wno-cast-function-type -Wno-constant-logical-operand -Wno-long-long -Wno-missing-field-initializers -Wno-overlength-strings -Wno-packed-bitfield-compat -Wno-parentheses-equality -Wno-self-assign -Wno-tautological-compare -Wno-unused-parameter -Wno-unused-value -Wsuggest-attribute=format -Wsuggest-attribute=noreturn -Wunused-variable -Wmisleading-indentation -Wundef -fPIC I, [2024-05-16T22:07:44.619719 #428793] INFO -- : XCFLAGS = -U_FORTIFY_SOURCE -D_FORTIFY_SOURCE=2 -fstack-protector-strong -fno-strict-overflow -fvisibility=hidden -fexcess-precision=standard -DRUBY_EXPORT -I. -I.ext/include/x86_64-linux -I/tmp/ruby/src/trunk/include -I/tmp/ruby/src/trunk -I/tmp/ruby/src/trunk/prism -I/tmp/ruby/src/trunk/enc/unicode/15.0.0 I, [2024-05-16T22:07:44.619730 #428793] INFO -- : CPPFLAGS = I, [2024-05-16T22:07:44.619734 #428793] INFO -- : DLDFLAGS = -Wl,--compress-debug-sections=zlib -Wl,-soname,libruby.so.3.4 -fstack-protector-strong I, [2024-05-16T22:07:44.619737 #428793] INFO -- : SOLIBS = -lz -lrt -lrt -lgmp -ldl -lcrypt -lm -lpthread I, [2024-05-16T22:07:44.619741 #428793] INFO -- : LANG = en_US.UTF-8 I, [2024-05-16T22:07:44.619745 #428793] INFO -- : LC_ALL = I, [2024-05-16T22:07:44.619748 #428793] INFO -- : LC_CTYPE = I, [2024-05-16T22:07:44.619752 #428793] INFO -- : MFLAGS = I, [2024-05-16T22:07:44.619755 #428793] INFO -- : RUSTC = no I, [2024-05-16T22:07:44.619759 #428793] INFO -- : YJIT_RUSTC_ARGS = --crate-name=yjit --crate-type=staticlib --edition=2021 -g -C lto=thin -C opt-level=3 -C overflow-checks=on '--out-dir=/tmp/ruby/build/trunk/yjit/target/release/' /tmp/ruby/src/trunk/yjit/src/lib.rs I, [2024-05-16T22:07:44.620469 #428793] INFO -- : gcc (Ubuntu 11.4.0-1ubuntu1~22.04) 11.4.0 I, [2024-05-16T22:07:44.620489 #428793] INFO -- : Copyright (C) 2021 Free Software Foundation, Inc. I, [2024-05-16T22:07:44.620495 #428793] INFO -- : This is free software; see the source for copying conditions. There is NO I, [2024-05-16T22:07:44.620499 #428793] INFO -- : warranty; not even for MERCHANTABILITY or FITNESS FOR A PARTICULAR PURPOSE. I, [2024-05-16T22:07:44.620503 #428793] INFO -- : I, [2024-05-16T22:07:44.622257 #428793] INFO -- : generating enc.mk I, [2024-05-16T22:07:44.739226 #428793] INFO -- : making enc I, [2024-05-16T22:07:44.756378 #428793] INFO -- : make[1]: Entering directory '/tmp/ruby/build/trunk' I, [2024-05-16T22:07:44.756402 #428793] INFO -- : make[1]: Nothing to be done for 'enc'. I, [2024-05-16T22:07:44.756408 #428793] INFO -- : make[1]: Leaving directory '/tmp/ruby/build/trunk' I, [2024-05-16T22:07:44.757150 #428793] INFO -- : making srcs under enc I, [2024-05-16T22:07:44.786570 #428793] INFO -- : make[1]: Entering directory '/tmp/ruby/build/trunk' I, [2024-05-16T22:07:44.786594 #428793] INFO -- : make[1]: Nothing to be done for 'srcs'. I, [2024-05-16T22:07:44.786601 #428793] INFO -- : make[1]: Leaving directory '/tmp/ruby/build/trunk' I, [2024-05-16T22:07:44.787617 #428793] INFO -- : generating transdb.h I, [2024-05-16T22:07:44.883761 #428793] INFO -- : transdb.h unchanged I, [2024-05-16T22:07:44.885059 #428793] INFO -- : making trans I, [2024-05-16T22:07:44.920188 #428793] INFO -- : make[1]: Entering directory '/tmp/ruby/build/trunk' I, [2024-05-16T22:07:44.920209 #428793] INFO -- : make[1]: Nothing to be done for 'trans'. I, [2024-05-16T22:07:44.920215 #428793] INFO -- : make[1]: Leaving directory '/tmp/ruby/build/trunk' I, [2024-05-16T22:07:44.920990 #428793] INFO -- : making encs I, [2024-05-16T22:07:44.959488 #428793] INFO -- : make[1]: Entering directory '/tmp/ruby/build/trunk' I, [2024-05-16T22:07:44.959514 #428793] INFO -- : make[1]: Nothing to be done for 'encs'. I, [2024-05-16T22:07:44.959522 #428793] INFO -- : make[1]: Leaving directory '/tmp/ruby/build/trunk' I, [2024-05-16T22:07:44.961221 #428793] INFO -- : generating makefiles ext/configure-ext.mk I, [2024-05-16T22:07:44.988032 #428793] INFO -- : ext/configure-ext.mk updated I, [2024-05-16T22:07:44.990583 #428793] INFO -- : make[1]: Entering directory '/tmp/ruby/build/trunk' I, [2024-05-16T22:07:46.341526 #428793] INFO -- : make[1]: Leaving directory '/tmp/ruby/build/trunk' I, [2024-05-16T22:07:46.342214 #428793] INFO -- : generating makefile exts.mk I, [2024-05-16T22:07:46.378910 #428793] INFO -- : exts.mk unchanged I, [2024-05-16T22:07:46.383133 #428793] INFO -- : make[1]: Entering directory '/tmp/ruby/build/trunk' I, [2024-05-16T22:07:46.722929 #428793] INFO -- : make[2]: Entering directory '/tmp/ruby/build/trunk/ext/coverage' I, [2024-05-16T22:07:46.727659 #428793] INFO -- : make[2]: Leaving directory '/tmp/ruby/build/trunk/ext/coverage' I, [2024-05-16T22:07:46.734086 #428793] INFO -- : make[2]: Entering directory '/tmp/ruby/build/trunk/ext/date' I, [2024-05-16T22:07:46.739181 #428793] INFO -- : make[2]: Leaving directory '/tmp/ruby/build/trunk/ext/date' I, [2024-05-16T22:07:46.742962 #428793] INFO -- : make[2]: Entering directory '/tmp/ruby/build/trunk/ext/digest' I, [2024-05-16T22:07:46.751822 #428793] INFO -- : make[2]: Leaving directory '/tmp/ruby/build/trunk/ext/digest' I, [2024-05-16T22:07:46.778092 #428793] INFO -- : make[2]: Entering directory '/tmp/ruby/build/trunk/ext/digest/sha2' I, [2024-05-16T22:07:46.782966 #428793] INFO -- : make[2]: Leaving directory '/tmp/ruby/build/trunk/ext/digest/sha2' I, [2024-05-16T22:07:46.804390 #428793] INFO -- : make[2]: Entering directory '/tmp/ruby/build/trunk/ext/fiddle' I, [2024-05-16T22:07:46.815018 #428793] INFO -- : make[2]: Leaving directory '/tmp/ruby/build/trunk/ext/fiddle' I, [2024-05-16T22:07:46.819963 #428793] INFO -- : make[2]: Entering directory '/tmp/ruby/build/trunk/ext/io/console' I, [2024-05-16T22:07:46.824090 #428793] INFO -- : make[2]: Leaving directory '/tmp/ruby/build/trunk/ext/io/console' I, [2024-05-16T22:07:46.837069 #428793] INFO -- : make[2]: Entering directory '/tmp/ruby/build/trunk/ext/json' I, [2024-05-16T22:07:46.847663 #428793] INFO -- : make[2]: Leaving directory '/tmp/ruby/build/trunk/ext/json' I, [2024-05-16T22:07:46.863370 #428793] INFO -- : make[2]: Entering directory '/tmp/ruby/build/trunk/ext/monitor' I, [2024-05-16T22:07:46.867399 #428793] INFO -- : make[2]: Leaving directory '/tmp/ruby/build/trunk/ext/monitor' I, [2024-05-16T22:07:46.874467 #428793] INFO -- : make[2]: Entering directory '/tmp/ruby/build/trunk/ext/objspace' I, [2024-05-16T22:07:46.880534 #428793] INFO -- : make[2]: Leaving directory '/tmp/ruby/build/trunk/ext/objspace' I, [2024-05-16T22:07:46.897047 #428793] INFO -- : make[2]: Entering directory '/tmp/ruby/build/trunk/ext/openssl' I, [2024-05-16T22:07:46.910786 #428793] INFO -- : make[2]: Leaving directory '/tmp/ruby/build/trunk/ext/openssl' I, [2024-05-16T22:07:46.915297 #428793] INFO -- : make[2]: Entering directory '/tmp/ruby/build/trunk/ext/pathname' I, [2024-05-16T22:07:46.919330 #428793] INFO -- : make[2]: Leaving directory '/tmp/ruby/build/trunk/ext/pathname' I, [2024-05-16T22:07:46.926488 #428793] INFO -- : make[2]: Entering directory '/tmp/ruby/build/trunk/ext/psych' I, [2024-05-16T22:07:46.949089 #428793] INFO -- : make[2]: Leaving directory '/tmp/ruby/build/trunk/ext/psych' I, [2024-05-16T22:07:46.952709 #428793] INFO -- : make[2]: Entering directory '/tmp/ruby/build/trunk/ext/pty' I, [2024-05-16T22:07:46.956602 #428793] INFO -- : make[2]: Leaving directory '/tmp/ruby/build/trunk/ext/pty' I, [2024-05-16T22:07:46.972680 #428793] INFO -- : make[2]: Entering directory '/tmp/ruby/build/trunk/ext/ripper' I, [2024-05-16T22:07:46.981072 #428793] INFO -- : make[2]: Leaving directory '/tmp/ruby/build/trunk/ext/ripper' I, [2024-05-16T22:07:46.983615 #428793] INFO -- : make[2]: Entering directory '/tmp/ruby/build/trunk/ext/rubyvm' I, [2024-05-16T22:07:46.986924 #428793] INFO -- : make[2]: Leaving directory '/tmp/ruby/build/trunk/ext/rubyvm' I, [2024-05-16T22:07:46.999591 #428793] INFO -- : make[2]: Entering directory '/tmp/ruby/build/trunk/ext/socket' I, [2024-05-16T22:07:47.007817 #428793] INFO -- : make[2]: Leaving directory '/tmp/ruby/build/trunk/ext/socket' I, [2024-05-16T22:07:47.022658 #428793] INFO -- : make[2]: Entering directory '/tmp/ruby/build/trunk/.bundle/gems/bigdecimal-3.1.8/ext/bigdecimal' I, [2024-05-16T22:07:47.049610 #428793] INFO -- : make[2]: Leaving directory '/tmp/ruby/build/trunk/.bundle/gems/bigdecimal-3.1.8/ext/bigdecimal' I, [2024-05-16T22:07:47.051550 #428793] INFO -- : make[2]: Entering directory '/tmp/ruby/build/trunk/.bundle/gems/debug-1.9.2/ext/debug' I, [2024-05-16T22:07:47.074476 #428793] INFO -- : make[2]: Leaving directory '/tmp/ruby/build/trunk/.bundle/gems/debug-1.9.2/ext/debug' I, [2024-05-16T22:07:47.076451 #428793] INFO -- : make[2]: Entering directory '/tmp/ruby/build/trunk/.bundle/gems/nkf-0.2.0/ext/nkf' I, [2024-05-16T22:07:47.099584 #428793] INFO -- : make[2]: Leaving directory '/tmp/ruby/build/trunk/.bundle/gems/nkf-0.2.0/ext/nkf' I, [2024-05-16T22:07:47.101518 #428793] INFO -- : make[2]: Entering directory '/tmp/ruby/build/trunk/.bundle/gems/racc-1.7.3/ext/racc/cparse' I, [2024-05-16T22:07:47.124799 #428793] INFO -- : make[2]: Leaving directory '/tmp/ruby/build/trunk/.bundle/gems/racc-1.7.3/ext/racc/cparse' I, [2024-05-16T22:07:47.128417 #428793] INFO -- : make[2]: Entering directory '/tmp/ruby/build/trunk/.bundle/gems/rbs-3.4.4/ext/rbs_extension' I, [2024-05-16T22:07:47.157469 #428793] INFO -- : make[2]: Leaving directory '/tmp/ruby/build/trunk/.bundle/gems/rbs-3.4.4/ext/rbs_extension' I, [2024-05-16T22:07:47.159467 #428793] INFO -- : make[2]: Entering directory '/tmp/ruby/build/trunk/.bundle/gems/syslog-0.1.2/ext/syslog' I, [2024-05-16T22:07:47.180844 #428793] INFO -- : make[2]: Leaving directory '/tmp/ruby/build/trunk/.bundle/gems/syslog-0.1.2/ext/syslog' I, [2024-05-16T22:07:47.204742 #428793] INFO -- : make[2]: Entering directory '/tmp/ruby/build/trunk' I, [2024-05-16T22:07:47.267826 #428793] INFO -- : make[2]: 'ruby' is up to date. I, [2024-05-16T22:07:47.267862 #428793] INFO -- : make[2]: Leaving directory '/tmp/ruby/build/trunk' I, [2024-05-16T22:07:47.268131 #428793] INFO -- : make[1]: Leaving directory '/tmp/ruby/build/trunk' I, [2024-05-16T22:07:47.271578 #428793] INFO -- : make[1]: Entering directory '/tmp/ruby/build/trunk' I, [2024-05-16T22:07:47.271598 #428793] INFO -- : make[1]: Nothing to be done for 'note'. I, [2024-05-16T22:07:47.271603 #428793] INFO -- : make[1]: Leaving directory '/tmp/ruby/build/trunk' E, [2024-05-16T22:07:47.328671 #428793] ERROR -- : $ /tmp/ruby/build/trunk/miniruby -I/tmp/ruby/src/trunk/lib /tmp/ruby/src/trunk/tool/runruby.rb --archdir=/tmp/ruby/build/trunk --extout=.ext -- /tmp/ruby/src/trunk/spec/mspec/bin/mspec-run -B /tmp/ruby/src/trunk/spec/default.mspec --error-output stderr --debug -fy -o /tmp/rubytest.2mttd0/1-mspec-multi-0 E, [2024-05-16T22:07:47.328896 #428793] ERROR -- : $ /tmp/ruby/build/trunk/miniruby -I/tmp/ruby/src/trunk/lib /tmp/ruby/src/trunk/tool/runruby.rb --archdir=/tmp/ruby/build/trunk --extout=.ext -- /tmp/ruby/src/trunk/spec/mspec/bin/mspec-run -B /tmp/ruby/src/trunk/spec/default.mspec --error-output stderr --debug -fy -o /tmp/rubytest.2mttd0/2-mspec-multi-1 E, [2024-05-16T22:07:47.329159 #428793] ERROR -- : $ /tmp/ruby/build/trunk/miniruby -I/tmp/ruby/src/trunk/lib /tmp/ruby/src/trunk/tool/runruby.rb --archdir=/tmp/ruby/build/trunk --extout=.ext -- /tmp/ruby/src/trunk/spec/mspec/bin/mspec-run -B /tmp/ruby/src/trunk/spec/default.mspec --error-output stderr --debug -fy -o /tmp/rubytest.2mttd0/3-mspec-multi-2 E, [2024-05-16T22:07:47.329432 #428793] ERROR -- : $ /tmp/ruby/build/trunk/miniruby -I/tmp/ruby/src/trunk/lib /tmp/ruby/src/trunk/tool/runruby.rb --archdir=/tmp/ruby/build/trunk --extout=.ext -- /tmp/ruby/src/trunk/spec/mspec/bin/mspec-run -B /tmp/ruby/src/trunk/spec/default.mspec --error-output stderr --debug -fy -o /tmp/rubytest.2mttd0/4-mspec-multi-3 E, [2024-05-16T22:07:47.329702 #428793] ERROR -- : $ /tmp/ruby/build/trunk/miniruby -I/tmp/ruby/src/trunk/lib /tmp/ruby/src/trunk/tool/runruby.rb --archdir=/tmp/ruby/build/trunk --extout=.ext -- /tmp/ruby/src/trunk/spec/mspec/bin/mspec-run -B /tmp/ruby/src/trunk/spec/default.mspec --error-output stderr --debug -fy -o /tmp/rubytest.2mttd0/5-mspec-multi-4 E, [2024-05-16T22:07:47.329823 #428793] ERROR -- : $ /tmp/ruby/build/trunk/miniruby -I/tmp/ruby/src/trunk/lib /tmp/ruby/src/trunk/tool/runruby.rb --archdir=/tmp/ruby/build/trunk --extout=.ext -- /tmp/ruby/src/trunk/spec/mspec/bin/mspec-run -B /tmp/ruby/src/trunk/spec/default.mspec --error-output stderr --debug -fy -o /tmp/rubytest.2mttd0/6-mspec-multi-5 E, [2024-05-16T22:07:47.330133 #428793] ERROR -- : $ /tmp/ruby/build/trunk/miniruby -I/tmp/ruby/src/trunk/lib /tmp/ruby/src/trunk/tool/runruby.rb --archdir=/tmp/ruby/build/trunk --extout=.ext -- /tmp/ruby/src/trunk/spec/mspec/bin/mspec-run -B /tmp/ruby/src/trunk/spec/default.mspec --error-output stderr --debug -fy -o /tmp/rubytest.2mttd0/7-mspec-multi-6 E, [2024-05-16T22:07:47.330342 #428793] ERROR -- : $ /tmp/ruby/build/trunk/miniruby -I/tmp/ruby/src/trunk/lib /tmp/ruby/src/trunk/tool/runruby.rb --archdir=/tmp/ruby/build/trunk --extout=.ext -- /tmp/ruby/src/trunk/spec/mspec/bin/mspec-run -B /tmp/ruby/src/trunk/spec/default.mspec --error-output stderr --debug -fy -o /tmp/rubytest.2mttd0/8-mspec-multi-7 E, [2024-05-16T22:07:47.330579 #428793] ERROR -- : $ /tmp/ruby/build/trunk/miniruby -I/tmp/ruby/src/trunk/lib /tmp/ruby/src/trunk/tool/runruby.rb --archdir=/tmp/ruby/build/trunk --extout=.ext -- /tmp/ruby/src/trunk/spec/mspec/bin/mspec-run -B /tmp/ruby/src/trunk/spec/default.mspec --error-output stderr --debug -fy -o /tmp/rubytest.2mttd0/9-mspec-multi-8 E, [2024-05-16T22:07:47.330780 #428793] ERROR -- : $ /tmp/ruby/build/trunk/miniruby -I/tmp/ruby/src/trunk/lib /tmp/ruby/src/trunk/tool/runruby.rb --archdir=/tmp/ruby/build/trunk --extout=.ext -- /tmp/ruby/src/trunk/spec/mspec/bin/mspec-run -B /tmp/ruby/src/trunk/spec/default.mspec --error-output stderr --debug -fy -o /tmp/rubytest.2mttd0/10-mspec-multi-9 E, [2024-05-16T22:07:47.330999 #428793] ERROR -- : $ /tmp/ruby/build/trunk/miniruby -I/tmp/ruby/src/trunk/lib /tmp/ruby/src/trunk/tool/runruby.rb --archdir=/tmp/ruby/build/trunk --extout=.ext -- /tmp/ruby/src/trunk/spec/mspec/bin/mspec-run -B /tmp/ruby/src/trunk/spec/default.mspec --error-output stderr --debug -fy -o /tmp/rubytest.2mttd0/11-mspec-multi-10 E, [2024-05-16T22:07:47.331296 #428793] ERROR -- : $ /tmp/ruby/build/trunk/miniruby -I/tmp/ruby/src/trunk/lib /tmp/ruby/src/trunk/tool/runruby.rb --archdir=/tmp/ruby/build/trunk --extout=.ext -- /tmp/ruby/src/trunk/spec/mspec/bin/mspec-run -B /tmp/ruby/src/trunk/spec/default.mspec --error-output stderr --debug -fy -o /tmp/rubytest.2mttd0/12-mspec-multi-11 E, [2024-05-16T22:07:47.331537 #428793] ERROR -- : $ /tmp/ruby/build/trunk/miniruby -I/tmp/ruby/src/trunk/lib /tmp/ruby/src/trunk/tool/runruby.rb --archdir=/tmp/ruby/build/trunk --extout=.ext -- /tmp/ruby/src/trunk/spec/mspec/bin/mspec-run -B /tmp/ruby/src/trunk/spec/default.mspec --error-output stderr --debug -fy -o /tmp/rubytest.2mttd0/13-mspec-multi-12 E, [2024-05-16T22:07:47.331829 #428793] ERROR -- : $ /tmp/ruby/build/trunk/miniruby -I/tmp/ruby/src/trunk/lib /tmp/ruby/src/trunk/tool/runruby.rb --archdir=/tmp/ruby/build/trunk --extout=.ext -- /tmp/ruby/src/trunk/spec/mspec/bin/mspec-run -B /tmp/ruby/src/trunk/spec/default.mspec --error-output stderr --debug -fy -o /tmp/rubytest.2mttd0/14-mspec-multi-13 E, [2024-05-16T22:07:47.332116 #428793] ERROR -- : $ /tmp/ruby/build/trunk/miniruby -I/tmp/ruby/src/trunk/lib /tmp/ruby/src/trunk/tool/runruby.rb --archdir=/tmp/ruby/build/trunk --extout=.ext -- /tmp/ruby/src/trunk/spec/mspec/bin/mspec-run -B /tmp/ruby/src/trunk/spec/default.mspec --error-output stderr --debug -fy -o /tmp/rubytest.2mttd0/15-mspec-multi-14 E, [2024-05-16T22:07:47.332430 #428793] ERROR -- : $ /tmp/ruby/build/trunk/miniruby -I/tmp/ruby/src/trunk/lib /tmp/ruby/src/trunk/tool/runruby.rb --archdir=/tmp/ruby/build/trunk --extout=.ext -- /tmp/ruby/src/trunk/spec/mspec/bin/mspec-run -B /tmp/ruby/src/trunk/spec/default.mspec --error-output stderr --debug -fy -o /tmp/rubytest.2mttd0/16-mspec-multi-15 E, [2024-05-16T22:07:47.332777 #428793] ERROR -- : $ /tmp/ruby/build/trunk/miniruby -I/tmp/ruby/src/trunk/lib /tmp/ruby/src/trunk/tool/runruby.rb --archdir=/tmp/ruby/build/trunk --extout=.ext -- /tmp/ruby/src/trunk/spec/mspec/bin/mspec-run -B /tmp/ruby/src/trunk/spec/default.mspec --error-output stderr --debug -fy -o /tmp/rubytest.2mttd0/17-mspec-multi-16 E, [2024-05-16T22:07:47.333154 #428793] ERROR -- : $ /tmp/ruby/build/trunk/miniruby -I/tmp/ruby/src/trunk/lib /tmp/ruby/src/trunk/tool/runruby.rb --archdir=/tmp/ruby/build/trunk --extout=.ext -- /tmp/ruby/src/trunk/spec/mspec/bin/mspec-run -B /tmp/ruby/src/trunk/spec/default.mspec --error-output stderr --debug -fy -o /tmp/rubytest.2mttd0/18-mspec-multi-17 E, [2024-05-16T22:07:47.336244 #428793] ERROR -- : $ /tmp/ruby/build/trunk/miniruby -I/tmp/ruby/src/trunk/lib /tmp/ruby/src/trunk/tool/runruby.rb --archdir=/tmp/ruby/build/trunk --extout=.ext -- /tmp/ruby/src/trunk/spec/mspec/bin/mspec-run -B /tmp/ruby/src/trunk/spec/default.mspec --error-output stderr --debug -fy -o /tmp/rubytest.2mttd0/19-mspec-multi-18 E, [2024-05-16T22:07:47.336607 #428793] ERROR -- : $ /tmp/ruby/build/trunk/miniruby -I/tmp/ruby/src/trunk/lib /tmp/ruby/src/trunk/tool/runruby.rb --archdir=/tmp/ruby/build/trunk --extout=.ext -- /tmp/ruby/src/trunk/spec/mspec/bin/mspec-run -B /tmp/ruby/src/trunk/spec/default.mspec --error-output stderr --debug -fy -o /tmp/rubytest.2mttd0/20-mspec-multi-19 I, [2024-05-16T22:07:47.495744 #428793] INFO -- : ruby 3.4.0dev (2024-05-16T19:35:22Z master 854cbbd5a9) [x86_64-linux] I, [2024-05-16T22:07:48.136484 #428793] INFO -- : 0 ......................................................................... I, [2024-05-16T22:07:48.489359 #428793] INFO -- : 73 ......................................................................... I, [2024-05-16T22:07:48.657633 #428793] INFO -- : 146 ......................................................................... I, [2024-05-16T22:07:48.698283 #428793] INFO -- : 219 ......................................................................... I, [2024-05-16T22:07:48.742825 #428793] INFO -- : 292 ......................................................................... I, [2024-05-16T22:07:48.793096 #428793] INFO -- : 365 ......................................................................... I, [2024-05-16T22:07:48.814245 #428793] INFO -- : 438 ......................................................................... I, [2024-05-16T22:07:48.831979 #428793] INFO -- : 511 ......................................................................... I, [2024-05-16T22:07:48.847548 #428793] INFO -- : 584 ......................................................................... I, [2024-05-16T22:07:48.900497 #428793] INFO -- : 657 ......................................................................... I, [2024-05-16T22:07:48.936209 #428793] INFO -- : 730 ......................................................................... I, [2024-05-16T22:07:48.966932 #428793] INFO -- : 803 ......................................................................... I, [2024-05-16T22:07:49.006178 #428793] INFO -- : 876 ......................................................................... I, [2024-05-16T22:07:49.064711 #428793] INFO -- : 949 ......................................................................... I, [2024-05-16T22:07:49.158013 #428793] INFO -- : 1022 ......................................................................... I, [2024-05-16T22:07:49.312326 #428793] INFO -- : 1095 ......................................................................... I, [2024-05-16T22:07:49.417279 #428793] INFO -- : 1168 ......................................................................... I, [2024-05-16T22:07:49.480275 #428793] INFO -- : 1241 ......................................................................... I, [2024-05-16T22:07:49.528284 #428793] INFO -- : 1314 ......................................................................... I, [2024-05-16T22:07:49.546833 #428793] INFO -- : 1387 ......................................................................... I, [2024-05-16T22:07:49.651540 #428793] INFO -- : 1460 ......................................................................... I, [2024-05-16T22:07:50.117851 #428793] INFO -- : 1533 ......................................................................... I, [2024-05-16T22:07:50.168043 #428793] INFO -- : 1606 ......................................................................... I, [2024-05-16T22:07:50.285176 #428793] INFO -- : 1679 ......................................................................... I, [2024-05-16T22:07:50.399157 #428793] INFO -- : 1752 ......................................................................... I, [2024-05-16T22:07:50.479735 #428793] INFO -- : 1825 ......................................................................... I, [2024-05-16T22:07:50.602661 #428793] INFO -- : 1898 ......................................................................... I, [2024-05-16T22:07:50.685791 #428793] INFO -- : 1971 ......................................................................... I, [2024-05-16T22:07:50.739588 #428793] INFO -- : 2044 ......................................................................... I, [2024-05-16T22:07:50.777861 #428793] INFO -- : 2117 ......................................................................... I, [2024-05-16T22:07:50.794543 #428793] INFO -- : 2190 ......................................................................... I, [2024-05-16T22:07:50.818080 #428793] INFO -- : 2263 ......................................................................... I, [2024-05-16T22:07:50.831790 #428793] INFO -- : 2336 ......................................................................... I, [2024-05-16T22:07:50.871045 #428793] INFO -- : 2409 ......................................................................... I, [2024-05-16T22:07:50.962707 #428793] INFO -- : 2482 ......................................................................... I, [2024-05-16T22:07:50.987116 #428793] INFO -- : 2555 ......................................................................... I, [2024-05-16T22:07:51.093026 #428793] INFO -- : 2628 ......................................................................... I, [2024-05-16T22:07:51.196680 #428793] INFO -- : 2701 ......................................................................... I, [2024-05-16T22:07:51.226536 #428793] INFO -- : 2774 ......................................................................... I, [2024-05-16T22:07:51.284841 #428793] INFO -- : 2847 ......................................................................... I, [2024-05-16T22:07:51.317683 #428793] INFO -- : 2920 ......................................................................... I, [2024-05-16T22:07:51.346073 #428793] INFO -- : 2993 ......................................................................... I, [2024-05-16T22:07:51.371252 #428793] INFO -- : 3066 ......................................................................... I, [2024-05-16T22:07:51.383947 #428793] INFO -- : 3139 ......................................................................... I, [2024-05-16T22:07:51.392033 #428793] INFO -- : 3212 ......................................................................... I, [2024-05-16T22:07:51.423881 #428793] INFO -- : 3285 ......................................................................... I, [2024-05-16T22:07:55.391940 #428793] INFO -- : 3358 ........................................................................ I, [2024-05-16T22:07:55.391996 #428793] INFO -- : I, [2024-05-16T22:07:55.392004 #428793] INFO -- : Finished in 8.062495 seconds I, [2024-05-16T22:07:55.392009 #428793] INFO -- : I, [2024-05-16T22:07:55.392014 #428793] INFO -- : 3429 files, 32611 examples, 190264 expectations, 0 failures, 0 errors, 0 tagged I, [2024-05-16T22:07:55.394247 #428793] INFO -- : $$$[end] "make yes-test-rubyspec MSPECOPT='--error-output stderr --debug -j' TESTS='-j20'" exit with 0.