# Logfile created on 2024-05-16 20:37:24 +0000 by logger.rb/v1.4.3 I, [2024-05-16T20:37:24.690127 #1989561] INFO -- : #, @formatter=nil, @logdev=#, @binmode=false, @mon_data=#, @mon_data_owner_object_id=860>>> I, [2024-05-16T20:37:24.690259 #1989561] INFO -- : $$$[beg] make update-unicode -j20 I, [2024-05-16T20:37:24.749210 #1989561] INFO -- : Downloading Unicode emoji 15.0 files... I, [2024-05-16T20:37:24.749376 #1989561] INFO -- : Downloading Unicode emoji 15.0 files... I, [2024-05-16T20:37:24.750083 #1989561] INFO -- : Downloading Unicode emoji 15.0 files... I, [2024-05-16T20:37:24.790814 #1989561] INFO -- : made symlink emoji/15.0/emoji-sequences.txt to /tmp/ruby/src/trunk/.downloaded-cache/emoji/15.0/emoji-sequences.txt I, [2024-05-16T20:37:24.791726 #1989561] INFO -- : downloading emoji/15.0/emoji-sequences.txt ... downloading emoji/15.0/emoji-test.txt ... /tmp/ruby/src/trunk/enc/unicode/data/emoji/15.0/emoji-sequences.txt already exists E, [2024-05-16T20:37:25.246944 #1989561] ERROR -- : /tmp/ruby/src/trunk/tool/downloader.rb:302:in `rescue in download': failed to download emoji/15.0/emoji-test.txt (RuntimeError) E, [2024-05-16T20:37:25.247094 #1989561] ERROR -- : OpenURI::HTTPError: 403 Forbidden: https://www.unicode.org/Public/emoji/15.0/emoji-test.txt E, [2024-05-16T20:37:25.247117 #1989561] ERROR -- : from /tmp/ruby/src/trunk/tool/downloader.rb:201:in `download' E, [2024-05-16T20:37:25.247133 #1989561] ERROR -- : from /tmp/ruby/src/trunk/tool/downloader.rb:136:in `download' E, [2024-05-16T20:37:25.247147 #1989561] ERROR -- : from /tmp/ruby/src/trunk/tool/downloader.rb:482:in `block in
' E, [2024-05-16T20:37:25.247162 #1989561] ERROR -- : from /tmp/ruby/src/trunk/tool/downloader.rb:465:in `each' E, [2024-05-16T20:37:25.247175 #1989561] ERROR -- : from /tmp/ruby/src/trunk/tool/downloader.rb:465:in `
' E, [2024-05-16T20:37:25.247188 #1989561] ERROR -- : /usr/lib/ruby/3.0.0/open-uri.rb:364:in `open_http': 403 Forbidden (OpenURI::HTTPError) E, [2024-05-16T20:37:25.247202 #1989561] ERROR -- : from /usr/lib/ruby/3.0.0/open-uri.rb:741:in `buffer_open' E, [2024-05-16T20:37:25.247219 #1989561] ERROR -- : from /usr/lib/ruby/3.0.0/open-uri.rb:212:in `block in open_loop' E, [2024-05-16T20:37:25.247233 #1989561] ERROR -- : from /usr/lib/ruby/3.0.0/open-uri.rb:210:in `catch' E, [2024-05-16T20:37:25.247246 #1989561] ERROR -- : from /usr/lib/ruby/3.0.0/open-uri.rb:210:in `open_loop' E, [2024-05-16T20:37:25.247260 #1989561] ERROR -- : from /usr/lib/ruby/3.0.0/open-uri.rb:151:in `open_uri' E, [2024-05-16T20:37:25.247271 #1989561] ERROR -- : from /usr/lib/ruby/3.0.0/open-uri.rb:721:in `open' E, [2024-05-16T20:37:25.247282 #1989561] ERROR -- : from /usr/lib/ruby/3.0.0/open-uri.rb:729:in `read' E, [2024-05-16T20:37:25.247294 #1989561] ERROR -- : from /tmp/ruby/src/trunk/tool/downloader.rb:247:in `block in download' E, [2024-05-16T20:37:25.247332 #1989561] ERROR -- : from /tmp/ruby/src/trunk/tool/downloader.rb:378:in `with_retry' E, [2024-05-16T20:37:25.247344 #1989561] ERROR -- : from /tmp/ruby/src/trunk/tool/downloader.rb:246:in `download' E, [2024-05-16T20:37:25.247360 #1989561] ERROR -- : from /tmp/ruby/src/trunk/tool/downloader.rb:136:in `download' E, [2024-05-16T20:37:25.247372 #1989561] ERROR -- : from /tmp/ruby/src/trunk/tool/downloader.rb:482:in `block in
' E, [2024-05-16T20:37:25.247383 #1989561] ERROR -- : from /tmp/ruby/src/trunk/tool/downloader.rb:465:in `each' E, [2024-05-16T20:37:25.247395 #1989561] ERROR -- : from /tmp/ruby/src/trunk/tool/downloader.rb:465:in `
' E, [2024-05-16T20:37:25.248800 #1989561] ERROR -- : /tmp/ruby/src/trunk/tool/downloader.rb:302:in `rescue in download': failed to download emoji/15.0/emoji-test.txt (RuntimeError) E, [2024-05-16T20:37:25.248876 #1989561] ERROR -- : OpenURI::HTTPError: 403 Forbidden: https://www.unicode.org/Public/emoji/15.0/emoji-test.txt E, [2024-05-16T20:37:25.248894 #1989561] ERROR -- : from /tmp/ruby/src/trunk/tool/downloader.rb:201:in `download' E, [2024-05-16T20:37:25.248918 #1989561] ERROR -- : from /tmp/ruby/src/trunk/tool/downloader.rb:136:in `download' E, [2024-05-16T20:37:25.248937 #1989561] ERROR -- : from /tmp/ruby/src/trunk/tool/downloader.rb:482:in `block in
' E, [2024-05-16T20:37:25.248948 #1989561] ERROR -- : from /tmp/ruby/src/trunk/tool/downloader.rb:465:in `each' E, [2024-05-16T20:37:25.248959 #1989561] ERROR -- : from /tmp/ruby/src/trunk/tool/downloader.rb:465:in `
' E, [2024-05-16T20:37:25.248969 #1989561] ERROR -- : /usr/lib/ruby/3.0.0/open-uri.rb:364:in `open_http': 403 Forbidden (OpenURI::HTTPError) E, [2024-05-16T20:37:25.248980 #1989561] ERROR -- : from /usr/lib/ruby/3.0.0/open-uri.rb:741:in `buffer_open' E, [2024-05-16T20:37:25.248991 #1989561] ERROR -- : from /usr/lib/ruby/3.0.0/open-uri.rb:212:in `block in open_loop' E, [2024-05-16T20:37:25.249001 #1989561] ERROR -- : from /usr/lib/ruby/3.0.0/open-uri.rb:210:in `catch' E, [2024-05-16T20:37:25.249016 #1989561] ERROR -- : from /usr/lib/ruby/3.0.0/open-uri.rb:210:in `open_loop' E, [2024-05-16T20:37:25.249027 #1989561] ERROR -- : from /usr/lib/ruby/3.0.0/open-uri.rb:151:in `open_uri' E, [2024-05-16T20:37:25.249037 #1989561] ERROR -- : from /usr/lib/ruby/3.0.0/open-uri.rb:721:in `open' E, [2024-05-16T20:37:25.249051 #1989561] ERROR -- : from /usr/lib/ruby/3.0.0/open-uri.rb:729:in `read' E, [2024-05-16T20:37:25.249061 #1989561] ERROR -- : from /tmp/ruby/src/trunk/tool/downloader.rb:247:in `block in download' E, [2024-05-16T20:37:25.249071 #1989561] ERROR -- : from /tmp/ruby/src/trunk/tool/downloader.rb:378:in `with_retry' E, [2024-05-16T20:37:25.249080 #1989561] ERROR -- : from /tmp/ruby/src/trunk/tool/downloader.rb:246:in `download' E, [2024-05-16T20:37:25.249090 #1989561] ERROR -- : from /tmp/ruby/src/trunk/tool/downloader.rb:136:in `download' E, [2024-05-16T20:37:25.249100 #1989561] ERROR -- : from /tmp/ruby/src/trunk/tool/downloader.rb:482:in `block in
' E, [2024-05-16T20:37:25.249112 #1989561] ERROR -- : from /tmp/ruby/src/trunk/tool/downloader.rb:465:in `each' E, [2024-05-16T20:37:25.249122 #1989561] ERROR -- : from /tmp/ruby/src/trunk/tool/downloader.rb:465:in `
' E, [2024-05-16T20:37:25.252870 #1989561] ERROR -- : make: *** [uncommon.mk:1765: /tmp/ruby/src/trunk/enc/unicode/data/emoji/15.0/emoji-zwj-sequences.txt] Error 1 E, [2024-05-16T20:37:25.252945 #1989561] ERROR -- : make: *** Waiting for unfinished jobs.... E, [2024-05-16T20:37:25.253181 #1989561] ERROR -- : make: *** [uncommon.mk:1765: /tmp/ruby/src/trunk/enc/unicode/data/emoji/15.0/emoji-test.txt] Error 1 E, [2024-05-16T20:37:25.693998 #1989561] ERROR -- : /tmp/ruby/src/trunk/tool/downloader.rb:302:in `rescue in download': failed to download emoji/15.0/emoji-sequences.txt (RuntimeError) E, [2024-05-16T20:37:25.694187 #1989561] ERROR -- : EOFError: end of file reached: https://www.unicode.org/Public/emoji/15.0/emoji-sequences.txt E, [2024-05-16T20:37:25.694236 #1989561] ERROR -- : from /tmp/ruby/src/trunk/tool/downloader.rb:201:in `download' E, [2024-05-16T20:37:25.694251 #1989561] ERROR -- : from /tmp/ruby/src/trunk/tool/downloader.rb:136:in `download' E, [2024-05-16T20:37:25.694265 #1989561] ERROR -- : from /tmp/ruby/src/trunk/tool/downloader.rb:482:in `block in
' E, [2024-05-16T20:37:25.694279 #1989561] ERROR -- : from /tmp/ruby/src/trunk/tool/downloader.rb:465:in `each' E, [2024-05-16T20:37:25.694292 #1989561] ERROR -- : from /tmp/ruby/src/trunk/tool/downloader.rb:465:in `
' E, [2024-05-16T20:37:25.694304 #1989561] ERROR -- : /usr/lib/ruby/3.0.0/net/protocol.rb:227:in `rbuf_fill': end of file reached (EOFError) E, [2024-05-16T20:37:25.694317 #1989561] ERROR -- : from /usr/lib/ruby/3.0.0/net/protocol.rb:193:in `readuntil' E, [2024-05-16T20:37:25.694334 #1989561] ERROR -- : from /usr/lib/ruby/3.0.0/net/protocol.rb:203:in `readline' E, [2024-05-16T20:37:25.694348 #1989561] ERROR -- : from /usr/lib/ruby/3.0.0/net/http/response.rb:42:in `read_status_line' E, [2024-05-16T20:37:25.694362 #1989561] ERROR -- : from /usr/lib/ruby/3.0.0/net/http/response.rb:31:in `read_new' E, [2024-05-16T20:37:25.694375 #1989561] ERROR -- : from /usr/lib/ruby/3.0.0/net/http.rb:1557:in `block in transport_request' E, [2024-05-16T20:37:25.694388 #1989561] ERROR -- : from /usr/lib/ruby/3.0.0/net/http.rb:1548:in `catch' E, [2024-05-16T20:37:25.694401 #1989561] ERROR -- : from /usr/lib/ruby/3.0.0/net/http.rb:1548:in `transport_request' E, [2024-05-16T20:37:25.694677 #1989561] ERROR -- : from /usr/lib/ruby/3.0.0/net/http.rb:1521:in `request' E, [2024-05-16T20:37:25.694692 #1989561] ERROR -- : from /usr/lib/ruby/3.0.0/open-uri.rb:329:in `block in open_http' E, [2024-05-16T20:37:25.694705 #1989561] ERROR -- : from /usr/lib/ruby/3.0.0/net/http.rb:960:in `start' E, [2024-05-16T20:37:25.694717 #1989561] ERROR -- : from /usr/lib/ruby/3.0.0/open-uri.rb:323:in `open_http' E, [2024-05-16T20:37:25.694730 #1989561] ERROR -- : from /usr/lib/ruby/3.0.0/open-uri.rb:741:in `buffer_open' E, [2024-05-16T20:37:25.694743 #1989561] ERROR -- : from /usr/lib/ruby/3.0.0/open-uri.rb:212:in `block in open_loop' E, [2024-05-16T20:37:25.694772 #1989561] ERROR -- : from /usr/lib/ruby/3.0.0/open-uri.rb:210:in `catch' E, [2024-05-16T20:37:25.694785 #1989561] ERROR -- : from /usr/lib/ruby/3.0.0/open-uri.rb:210:in `open_loop' E, [2024-05-16T20:37:25.694798 #1989561] ERROR -- : from /usr/lib/ruby/3.0.0/open-uri.rb:151:in `open_uri' E, [2024-05-16T20:37:25.694811 #1989561] ERROR -- : from /usr/lib/ruby/3.0.0/open-uri.rb:721:in `open' E, [2024-05-16T20:37:25.694824 #1989561] ERROR -- : from /usr/lib/ruby/3.0.0/open-uri.rb:729:in `read' E, [2024-05-16T20:37:25.694841 #1989561] ERROR -- : from /tmp/ruby/src/trunk/tool/downloader.rb:247:in `block in download' E, [2024-05-16T20:37:25.694854 #1989561] ERROR -- : from /tmp/ruby/src/trunk/tool/downloader.rb:378:in `with_retry' E, [2024-05-16T20:37:25.694867 #1989561] ERROR -- : from /tmp/ruby/src/trunk/tool/downloader.rb:246:in `download' E, [2024-05-16T20:37:25.694880 #1989561] ERROR -- : from /tmp/ruby/src/trunk/tool/downloader.rb:136:in `download' E, [2024-05-16T20:37:25.694895 #1989561] ERROR -- : from /tmp/ruby/src/trunk/tool/downloader.rb:482:in `block in
' E, [2024-05-16T20:37:25.694908 #1989561] ERROR -- : from /tmp/ruby/src/trunk/tool/downloader.rb:465:in `each' E, [2024-05-16T20:37:25.694921 #1989561] ERROR -- : from /tmp/ruby/src/trunk/tool/downloader.rb:465:in `
' E, [2024-05-16T20:37:25.699097 #1989561] ERROR -- : make: *** [uncommon.mk:1765: /tmp/ruby/src/trunk/enc/unicode/data/emoji/15.0/emoji-sequences.txt] Error 1 E, [2024-05-16T20:37:25.699165 #1989561] ERROR -- : make: *** Deleting file '/tmp/ruby/src/trunk/enc/unicode/data/emoji/15.0/emoji-sequences.txt' I, [2024-05-16T20:37:25.699230 #1989561] INFO -- : downloading emoji/15.0/emoji-test.txt ... I, [2024-05-16T20:37:25.700058 #1989561] INFO -- : $$$[end] "make update-unicode -j20" exit with 512. I, [2024-05-16T20:37:25.700151 #1989561] INFO -- : $$$[beg] make update-download -j20 I, [2024-05-16T20:37:25.808467 #1989561] INFO -- : tool/config.guess already exists I, [2024-05-16T20:37:25.808511 #1989561] INFO -- : tool/config.sub already exists I, [2024-05-16T20:37:25.810695 #1989561] INFO -- : Update minitest to ea9caafc0754b1d6236a490d59e624b53209734a I, [2024-05-16T20:37:25.810848 #1989561] INFO -- : Update power_assert to 84e85124c5014a139af39161d484156cfe87a9ed I, [2024-05-16T20:37:25.811591 #1989561] INFO -- : Update rbs to ba7872795d5de04adb8ff500c0e6afdc81a041dd I, [2024-05-16T20:37:25.811613 #1989561] INFO -- : Update typeprof to b19a6416da3a05d57fadd6ffdadb382b6d236ca5 I, [2024-05-16T20:37:25.811975 #1989561] INFO -- : echo ea9caafc0754b1d6236a490d59e624b53209734a | /bin/sh /tmp/ruby/src/trunk/tool/ifchange /tmp/ruby/src/trunk/.bundle/.timestamp/minitest.revision - I, [2024-05-16T20:37:25.812145 #1989561] INFO -- : echo 84e85124c5014a139af39161d484156cfe87a9ed | /bin/sh /tmp/ruby/src/trunk/tool/ifchange /tmp/ruby/src/trunk/.bundle/.timestamp/power_assert.revision - I, [2024-05-16T20:37:25.812576 #1989561] INFO -- : echo ba7872795d5de04adb8ff500c0e6afdc81a041dd | /bin/sh /tmp/ruby/src/trunk/tool/ifchange /tmp/ruby/src/trunk/.bundle/.timestamp/rbs.revision - I, [2024-05-16T20:37:25.812753 #1989561] INFO -- : echo b19a6416da3a05d57fadd6ffdadb382b6d236ca5 | /bin/sh /tmp/ruby/src/trunk/tool/ifchange /tmp/ruby/src/trunk/.bundle/.timestamp/typeprof.revision - I, [2024-05-16T20:37:25.813859 #1989561] INFO -- : /tmp/ruby/src/trunk/.bundle/.timestamp/minitest.revision unchanged I, [2024-05-16T20:37:25.814041 #1989561] INFO -- : /tmp/ruby/src/trunk/.bundle/.timestamp/power_assert.revision unchanged I, [2024-05-16T20:37:25.814179 #1989561] INFO -- : /tmp/ruby/src/trunk/.bundle/.timestamp/rbs.revision unchanged I, [2024-05-16T20:37:25.814373 #1989561] INFO -- : /tmp/ruby/src/trunk/.bundle/.timestamp/typeprof.revision unchanged I, [2024-05-16T20:37:25.814914 #1989561] INFO -- : Building power_assert@84e85124c5014a139af39161d484156cfe87a9ed to /tmp/ruby/src/trunk/gems/power_assert-2.0.3.gem I, [2024-05-16T20:37:25.884141 #1989561] INFO -- : Successfully built RubyGem I, [2024-05-16T20:37:25.884190 #1989561] INFO -- : Name: power_assert I, [2024-05-16T20:37:25.884203 #1989561] INFO -- : Version: 2.0.4dev I, [2024-05-16T20:37:25.884210 #1989561] INFO -- : File: power_assert-2.0.4dev.gem I, [2024-05-16T20:37:25.931651 #1989561] INFO -- : $$$[end] "make update-download -j20" exit with 0. I, [2024-05-16T20:37:25.931686 #1989561] INFO -- : $$$[beg] make update-rubyspec -j20 I, [2024-05-16T20:37:25.997102 #1989561] INFO -- : make: Nothing to be done for 'update-rubyspec'. I, [2024-05-16T20:37:25.997531 #1989561] INFO -- : $$$[end] "make update-rubyspec -j20" exit with 0. I, [2024-05-16T20:37:25.997574 #1989561] INFO -- : $$$[beg] make update-src -j20 I, [2024-05-16T20:37:26.534800 #1989561] INFO -- : Already up to date. I, [2024-05-16T20:37:26.552006 #1989561] INFO -- : Latest commit hash = 854cbbd5a9 I, [2024-05-16T20:37:26.553549 #1989561] INFO -- : $$$[end] "make update-src -j20" exit with 0. I, [2024-05-16T20:37:26.553608 #1989561] INFO -- : $$$[beg] make after-update -j20 I, [2024-05-16T20:37:26.638001 #1989561] INFO -- : generating /tmp/ruby/src/trunk/ext/ripper/eventids2table.c I, [2024-05-16T20:37:26.642387 #1989561] INFO -- : make[1]: Entering directory '/tmp/ruby/src/trunk/ext/ripper' I, [2024-05-16T20:37:26.642414 #1989561] INFO -- : make[1]: Nothing to be done for 'src'. I, [2024-05-16T20:37:26.642422 #1989561] INFO -- : make[1]: Leaving directory '/tmp/ruby/src/trunk/ext/ripper' I, [2024-05-16T20:37:26.658818 #1989561] INFO -- : /tmp/ruby/src/trunk/revision.h updated I, [2024-05-16T20:37:26.659953 #1989561] INFO -- : generating x86_64-linux-fake.rb I, [2024-05-16T20:37:26.710992 #1989561] INFO -- : x86_64-linux-fake.rb updated I, [2024-05-16T20:37:26.712294 #1989561] INFO -- : generating enc.mk I, [2024-05-16T20:37:26.831633 #1989561] INFO -- : making srcs under enc I, [2024-05-16T20:37:26.861054 #1989561] INFO -- : make[1]: Entering directory '/tmp/ruby/build/trunk' I, [2024-05-16T20:37:26.861085 #1989561] INFO -- : make[1]: Nothing to be done for 'srcs'. I, [2024-05-16T20:37:26.861091 #1989561] INFO -- : make[1]: Leaving directory '/tmp/ruby/build/trunk' I, [2024-05-16T20:37:26.906078 #1989561] INFO -- : Update minitest to ea9caafc0754b1d6236a490d59e624b53209734a I, [2024-05-16T20:37:26.906347 #1989561] INFO -- : Update power_assert to 84e85124c5014a139af39161d484156cfe87a9ed I, [2024-05-16T20:37:26.907046 #1989561] INFO -- : Update rbs to ba7872795d5de04adb8ff500c0e6afdc81a041dd I, [2024-05-16T20:37:26.907361 #1989561] INFO -- : Update typeprof to b19a6416da3a05d57fadd6ffdadb382b6d236ca5 I, [2024-05-16T20:37:26.908274 #1989561] INFO -- : echo ea9caafc0754b1d6236a490d59e624b53209734a | /bin/sh /tmp/ruby/src/trunk/tool/ifchange /tmp/ruby/src/trunk/.bundle/.timestamp/minitest.revision - I, [2024-05-16T20:37:26.908438 #1989561] INFO -- : echo 84e85124c5014a139af39161d484156cfe87a9ed | /bin/sh /tmp/ruby/src/trunk/tool/ifchange /tmp/ruby/src/trunk/.bundle/.timestamp/power_assert.revision - I, [2024-05-16T20:37:26.909906 #1989561] INFO -- : echo ba7872795d5de04adb8ff500c0e6afdc81a041dd | /bin/sh /tmp/ruby/src/trunk/tool/ifchange /tmp/ruby/src/trunk/.bundle/.timestamp/rbs.revision - I, [2024-05-16T20:37:26.910111 #1989561] INFO -- : echo b19a6416da3a05d57fadd6ffdadb382b6d236ca5 | /bin/sh /tmp/ruby/src/trunk/tool/ifchange /tmp/ruby/src/trunk/.bundle/.timestamp/typeprof.revision - I, [2024-05-16T20:37:26.910139 #1989561] INFO -- : /tmp/ruby/src/trunk/.bundle/.timestamp/minitest.revision unchanged I, [2024-05-16T20:37:26.910540 #1989561] INFO -- : /tmp/ruby/src/trunk/.bundle/.timestamp/power_assert.revision unchanged I, [2024-05-16T20:37:26.911612 #1989561] INFO -- : Building power_assert@84e85124c5014a139af39161d484156cfe87a9ed to /tmp/ruby/src/trunk/gems/power_assert-2.0.3.gem I, [2024-05-16T20:37:26.911650 #1989561] INFO -- : /tmp/ruby/src/trunk/.bundle/.timestamp/typeprof.revision unchanged I, [2024-05-16T20:37:26.911668 #1989561] INFO -- : /tmp/ruby/src/trunk/.bundle/.timestamp/rbs.revision unchanged I, [2024-05-16T20:37:26.980258 #1989561] INFO -- : Successfully built RubyGem I, [2024-05-16T20:37:26.980300 #1989561] INFO -- : Name: power_assert I, [2024-05-16T20:37:26.980307 #1989561] INFO -- : Version: 2.0.4dev I, [2024-05-16T20:37:26.980316 #1989561] INFO -- : File: power_assert-2.0.4dev.gem I, [2024-05-16T20:37:26.982378 #1989561] INFO -- : Extracting bundle gem power_assert-2.0.3... I, [2024-05-16T20:37:27.044737 #1989561] INFO -- : Try with hash version of bundled gems instead of gems/power_assert-2.0.3.gem. We don't use this gem with release version of Ruby. I, [2024-05-16T20:37:27.049697 #1989561] INFO -- : Unpacked gems/power_assert-2.0.4dev.gem I, [2024-05-16T20:37:27.051748 #1989561] INFO -- : $$$[end] "make after-update -j20" exit with 0. I, [2024-05-16T20:37:27.052037 #1989561] INFO -- : $$$[beg] make miniruby -j20 I, [2024-05-16T20:37:27.116387 #1989561] INFO -- : BASERUBY = /usr/bin/ruby --disable=gems I, [2024-05-16T20:37:27.116441 #1989561] INFO -- : CC = gcc I, [2024-05-16T20:37:27.116450 #1989561] INFO -- : LD = ld I, [2024-05-16T20:37:27.116457 #1989561] INFO -- : LDSHARED = gcc -shared I, [2024-05-16T20:37:27.116464 #1989561] INFO -- : CFLAGS = -O3 -fno-fast-math -ggdb3 -Wall -Wextra -Wdeprecated-declarations -Wdiv-by-zero -Wduplicated-cond -Wimplicit-function-declaration -Wimplicit-int -Wpointer-arith -Wwrite-strings -Wold-style-definition -Wimplicit-fallthrough=0 -Wmissing-noreturn -Wno-cast-function-type -Wno-constant-logical-operand -Wno-long-long -Wno-missing-field-initializers -Wno-overlength-strings -Wno-packed-bitfield-compat -Wno-parentheses-equality -Wno-self-assign -Wno-tautological-compare -Wno-unused-parameter -Wno-unused-value -Wsuggest-attribute=format -Wsuggest-attribute=noreturn -Wunused-variable -Wmisleading-indentation -Wundef -fPIC I, [2024-05-16T20:37:27.116472 #1989561] INFO -- : XCFLAGS = -U_FORTIFY_SOURCE -D_FORTIFY_SOURCE=2 -fstack-protector-strong -fno-strict-overflow -fvisibility=hidden -fexcess-precision=standard -DRUBY_EXPORT -I. -I.ext/include/x86_64-linux -I/tmp/ruby/src/trunk/include -I/tmp/ruby/src/trunk -I/tmp/ruby/src/trunk/prism -I/tmp/ruby/src/trunk/enc/unicode/15.0.0 I, [2024-05-16T20:37:27.116488 #1989561] INFO -- : CPPFLAGS = I, [2024-05-16T20:37:27.116495 #1989561] INFO -- : DLDFLAGS = -Wl,--compress-debug-sections=zlib -Wl,-soname,libruby.so.3.4 -fstack-protector-strong I, [2024-05-16T20:37:27.116502 #1989561] INFO -- : SOLIBS = -lz -lrt -lrt -lgmp -ldl -lcrypt -lm -lpthread I, [2024-05-16T20:37:27.116508 #1989561] INFO -- : LANG = en_US.UTF-8 I, [2024-05-16T20:37:27.116514 #1989561] INFO -- : LC_ALL = I, [2024-05-16T20:37:27.116520 #1989561] INFO -- : LC_CTYPE = I, [2024-05-16T20:37:27.116527 #1989561] INFO -- : MFLAGS = -j20 --jobserver-auth=4,5 I, [2024-05-16T20:37:27.116533 #1989561] INFO -- : RUSTC = no I, [2024-05-16T20:37:27.116539 #1989561] INFO -- : YJIT_RUSTC_ARGS = --crate-name=yjit --crate-type=staticlib --edition=2021 -g -C lto=thin -C opt-level=3 -C overflow-checks=on '--out-dir=/tmp/ruby/build/trunk/yjit/target/release/' /tmp/ruby/src/trunk/yjit/src/lib.rs I, [2024-05-16T20:37:27.118771 #1989561] INFO -- : gcc (Ubuntu 11.4.0-1ubuntu1~22.04) 11.4.0 I, [2024-05-16T20:37:27.118807 #1989561] INFO -- : Copyright (C) 2021 Free Software Foundation, Inc. I, [2024-05-16T20:37:27.118816 #1989561] INFO -- : This is free software; see the source for copying conditions. There is NO I, [2024-05-16T20:37:27.118823 #1989561] INFO -- : warranty; not even for MERCHANTABILITY or FITNESS FOR A PARTICULAR PURPOSE. I, [2024-05-16T20:37:27.118829 #1989561] INFO -- : I, [2024-05-16T20:37:27.141541 #1989561] INFO -- : compiling /tmp/ruby/src/trunk/version.c I, [2024-05-16T20:37:27.243749 #1989561] INFO -- : linking miniruby I, [2024-05-16T20:37:27.776015 #1989561] INFO -- : $$$[end] "make miniruby -j20" exit with 0. I, [2024-05-16T20:37:27.776115 #1989561] INFO -- : $$$[beg] make ruby -j20 I, [2024-05-16T20:37:27.835486 #1989561] INFO -- : BASERUBY = /usr/bin/ruby --disable=gems I, [2024-05-16T20:37:27.835518 #1989561] INFO -- : CC = gcc I, [2024-05-16T20:37:27.835524 #1989561] INFO -- : LD = ld I, [2024-05-16T20:37:27.835528 #1989561] INFO -- : LDSHARED = gcc -shared I, [2024-05-16T20:37:27.835535 #1989561] INFO -- : CFLAGS = -O3 -fno-fast-math -ggdb3 -Wall -Wextra -Wdeprecated-declarations -Wdiv-by-zero -Wduplicated-cond -Wimplicit-function-declaration -Wimplicit-int -Wpointer-arith -Wwrite-strings -Wold-style-definition -Wimplicit-fallthrough=0 -Wmissing-noreturn -Wno-cast-function-type -Wno-constant-logical-operand -Wno-long-long -Wno-missing-field-initializers -Wno-overlength-strings -Wno-packed-bitfield-compat -Wno-parentheses-equality -Wno-self-assign -Wno-tautological-compare -Wno-unused-parameter -Wno-unused-value -Wsuggest-attribute=format -Wsuggest-attribute=noreturn -Wunused-variable -Wmisleading-indentation -Wundef -fPIC I, [2024-05-16T20:37:27.835540 #1989561] INFO -- : XCFLAGS = -U_FORTIFY_SOURCE -D_FORTIFY_SOURCE=2 -fstack-protector-strong -fno-strict-overflow -fvisibility=hidden -fexcess-precision=standard -DRUBY_EXPORT -I. -I.ext/include/x86_64-linux -I/tmp/ruby/src/trunk/include -I/tmp/ruby/src/trunk -I/tmp/ruby/src/trunk/prism -I/tmp/ruby/src/trunk/enc/unicode/15.0.0 I, [2024-05-16T20:37:27.835544 #1989561] INFO -- : CPPFLAGS = I, [2024-05-16T20:37:27.835548 #1989561] INFO -- : DLDFLAGS = -Wl,--compress-debug-sections=zlib -Wl,-soname,libruby.so.3.4 -fstack-protector-strong I, [2024-05-16T20:37:27.835551 #1989561] INFO -- : SOLIBS = -lz -lrt -lrt -lgmp -ldl -lcrypt -lm -lpthread I, [2024-05-16T20:37:27.835555 #1989561] INFO -- : LANG = en_US.UTF-8 I, [2024-05-16T20:37:27.835559 #1989561] INFO -- : LC_ALL = I, [2024-05-16T20:37:27.835562 #1989561] INFO -- : LC_CTYPE = I, [2024-05-16T20:37:27.835566 #1989561] INFO -- : MFLAGS = -j20 --jobserver-auth=4,5 I, [2024-05-16T20:37:27.835570 #1989561] INFO -- : RUSTC = no I, [2024-05-16T20:37:27.835574 #1989561] INFO -- : YJIT_RUSTC_ARGS = --crate-name=yjit --crate-type=staticlib --edition=2021 -g -C lto=thin -C opt-level=3 -C overflow-checks=on '--out-dir=/tmp/ruby/build/trunk/yjit/target/release/' /tmp/ruby/src/trunk/yjit/src/lib.rs I, [2024-05-16T20:37:27.837062 #1989561] INFO -- : gcc (Ubuntu 11.4.0-1ubuntu1~22.04) 11.4.0 I, [2024-05-16T20:37:27.837091 #1989561] INFO -- : Copyright (C) 2021 Free Software Foundation, Inc. I, [2024-05-16T20:37:27.837098 #1989561] INFO -- : This is free software; see the source for copying conditions. There is NO I, [2024-05-16T20:37:27.837103 #1989561] INFO -- : warranty; not even for MERCHANTABILITY or FITNESS FOR A PARTICULAR PURPOSE. I, [2024-05-16T20:37:27.837107 #1989561] INFO -- : I, [2024-05-16T20:37:27.948407 #1989561] INFO -- : builtin_binary.inc updated I, [2024-05-16T20:37:27.953119 #1989561] INFO -- : c5234a9416e4f20f175185e840b25b0f08674d14078ed7083f37e655458e3ca9 builtin_binary.inc I, [2024-05-16T20:37:27.953841 #1989561] INFO -- : compiling /tmp/ruby/src/trunk/builtin.c I, [2024-05-16T20:37:28.136775 #1989561] INFO -- : linking static-library libruby-static.a I, [2024-05-16T20:37:28.452163 #1989561] INFO -- : linking shared-library libruby.so.3.4.0 I, [2024-05-16T20:37:29.993164 #1989561] INFO -- : linking ruby I, [2024-05-16T20:37:30.015596 #1989561] INFO -- : $$$[end] "make ruby -j20" exit with 0. I, [2024-05-16T20:37:30.015732 #1989561] INFO -- : $$$[beg] make all -j20 I, [2024-05-16T20:37:30.073741 #1989561] INFO -- : BASERUBY = /usr/bin/ruby --disable=gems I, [2024-05-16T20:37:30.073781 #1989561] INFO -- : CC = gcc I, [2024-05-16T20:37:30.073788 #1989561] INFO -- : LD = ld I, [2024-05-16T20:37:30.073793 #1989561] INFO -- : LDSHARED = gcc -shared I, [2024-05-16T20:37:30.073797 #1989561] INFO -- : CFLAGS = -O3 -fno-fast-math -ggdb3 -Wall -Wextra -Wdeprecated-declarations -Wdiv-by-zero -Wduplicated-cond -Wimplicit-function-declaration -Wimplicit-int -Wpointer-arith -Wwrite-strings -Wold-style-definition -Wimplicit-fallthrough=0 -Wmissing-noreturn -Wno-cast-function-type -Wno-constant-logical-operand -Wno-long-long -Wno-missing-field-initializers -Wno-overlength-strings -Wno-packed-bitfield-compat -Wno-parentheses-equality -Wno-self-assign -Wno-tautological-compare -Wno-unused-parameter -Wno-unused-value -Wsuggest-attribute=format -Wsuggest-attribute=noreturn -Wunused-variable -Wmisleading-indentation -Wundef -fPIC I, [2024-05-16T20:37:30.073809 #1989561] INFO -- : XCFLAGS = -U_FORTIFY_SOURCE -D_FORTIFY_SOURCE=2 -fstack-protector-strong -fno-strict-overflow -fvisibility=hidden -fexcess-precision=standard -DRUBY_EXPORT -I. -I.ext/include/x86_64-linux -I/tmp/ruby/src/trunk/include -I/tmp/ruby/src/trunk -I/tmp/ruby/src/trunk/prism -I/tmp/ruby/src/trunk/enc/unicode/15.0.0 I, [2024-05-16T20:37:30.073816 #1989561] INFO -- : CPPFLAGS = I, [2024-05-16T20:37:30.073821 #1989561] INFO -- : DLDFLAGS = -Wl,--compress-debug-sections=zlib -Wl,-soname,libruby.so.3.4 -fstack-protector-strong I, [2024-05-16T20:37:30.073825 #1989561] INFO -- : SOLIBS = -lz -lrt -lrt -lgmp -ldl -lcrypt -lm -lpthread I, [2024-05-16T20:37:30.073830 #1989561] INFO -- : LANG = en_US.UTF-8 I, [2024-05-16T20:37:30.073834 #1989561] INFO -- : LC_ALL = I, [2024-05-16T20:37:30.073838 #1989561] INFO -- : LC_CTYPE = I, [2024-05-16T20:37:30.073843 #1989561] INFO -- : MFLAGS = -j20 --jobserver-auth=4,5 I, [2024-05-16T20:37:30.073847 #1989561] INFO -- : RUSTC = no I, [2024-05-16T20:37:30.073853 #1989561] INFO -- : YJIT_RUSTC_ARGS = --crate-name=yjit --crate-type=staticlib --edition=2021 -g -C lto=thin -C opt-level=3 -C overflow-checks=on '--out-dir=/tmp/ruby/build/trunk/yjit/target/release/' /tmp/ruby/src/trunk/yjit/src/lib.rs I, [2024-05-16T20:37:30.075385 #1989561] INFO -- : gcc (Ubuntu 11.4.0-1ubuntu1~22.04) 11.4.0 I, [2024-05-16T20:37:30.075415 #1989561] INFO -- : Copyright (C) 2021 Free Software Foundation, Inc. I, [2024-05-16T20:37:30.075422 #1989561] INFO -- : This is free software; see the source for copying conditions. There is NO I, [2024-05-16T20:37:30.075428 #1989561] INFO -- : warranty; not even for MERCHANTABILITY or FITNESS FOR A PARTICULAR PURPOSE. I, [2024-05-16T20:37:30.075445 #1989561] INFO -- : I, [2024-05-16T20:37:30.109880 #1989561] INFO -- : generating enc.mk I, [2024-05-16T20:37:30.111669 #1989561] INFO -- : building spec/ruby/optional/capi/ext/array_spec.so I, [2024-05-16T20:37:30.111958 #1989561] INFO -- : building spec/ruby/optional/capi/ext/basic_object_spec.so I, [2024-05-16T20:37:30.112855 #1989561] INFO -- : building spec/ruby/optional/capi/ext/bignum_spec.so I, [2024-05-16T20:37:30.113863 #1989561] INFO -- : building spec/ruby/optional/capi/ext/binding_spec.so I, [2024-05-16T20:37:30.114464 #1989561] INFO -- : building spec/ruby/optional/capi/ext/boolean_spec.so I, [2024-05-16T20:37:30.114842 #1989561] INFO -- : building spec/ruby/optional/capi/ext/class_id_under_autoload_spec.so I, [2024-05-16T20:37:30.115715 #1989561] INFO -- : building spec/ruby/optional/capi/ext/class_spec.so I, [2024-05-16T20:37:30.116687 #1989561] INFO -- : building spec/ruby/optional/capi/ext/class_under_autoload_spec.so I, [2024-05-16T20:37:30.117386 #1989561] INFO -- : building spec/ruby/optional/capi/ext/complex_spec.so I, [2024-05-16T20:37:30.117713 #1989561] INFO -- : building spec/ruby/optional/capi/ext/constants_spec.so I, [2024-05-16T20:37:30.118672 #1989561] INFO -- : building spec/ruby/optional/capi/ext/data_spec.so I, [2024-05-16T20:37:30.119364 #1989561] INFO -- : building spec/ruby/optional/capi/ext/debug_spec.so I, [2024-05-16T20:37:30.119701 #1989561] INFO -- : building spec/ruby/optional/capi/ext/encoding_spec.so I, [2024-05-16T20:37:30.120400 #1989561] INFO -- : building spec/ruby/optional/capi/ext/enumerator_spec.so I, [2024-05-16T20:37:30.121045 #1989561] INFO -- : building spec/ruby/optional/capi/ext/exception_spec.so I, [2024-05-16T20:37:30.121313 #1989561] INFO -- : building spec/ruby/optional/capi/ext/fiber_spec.so I, [2024-05-16T20:37:30.121898 #1989561] INFO -- : building spec/ruby/optional/capi/ext/file_spec.so I, [2024-05-16T20:37:30.122149 #1989561] INFO -- : building spec/ruby/optional/capi/ext/fixnum_spec.so I, [2024-05-16T20:37:30.123305 #1989561] INFO -- : building spec/ruby/optional/capi/ext/float_spec.so I, [2024-05-16T20:37:30.236066 #1989561] INFO -- : building spec/ruby/optional/capi/ext/gc_spec.so I, [2024-05-16T20:37:30.252013 #1989561] INFO -- : building spec/ruby/optional/capi/ext/globals_spec.so I, [2024-05-16T20:37:30.260192 #1989561] INFO -- : building spec/ruby/optional/capi/ext/hash_spec.so I, [2024-05-16T20:37:30.262481 #1989561] INFO -- : building spec/ruby/optional/capi/ext/integer_spec.so I, [2024-05-16T20:37:30.263863 #1989561] INFO -- : building spec/ruby/optional/capi/ext/io_spec.so I, [2024-05-16T20:37:30.264825 #1989561] INFO -- : building spec/ruby/optional/capi/ext/kernel_spec.so I, [2024-05-16T20:37:30.270177 #1989561] INFO -- : building spec/ruby/optional/capi/ext/language_spec.so I, [2024-05-16T20:37:30.282390 #1989561] INFO -- : building spec/ruby/optional/capi/ext/marshal_spec.so I, [2024-05-16T20:37:30.282923 #1989561] INFO -- : building spec/ruby/optional/capi/ext/module_spec.so I, [2024-05-16T20:37:30.287291 #1989561] INFO -- : building spec/ruby/optional/capi/ext/module_under_autoload_spec.so I, [2024-05-16T20:37:30.290625 #1989561] INFO -- : building spec/ruby/optional/capi/ext/mutex_spec.so I, [2024-05-16T20:37:30.298299 #1989561] INFO -- : building spec/ruby/optional/capi/ext/numeric_spec.so I, [2024-05-16T20:37:30.304812 #1989561] INFO -- : building spec/ruby/optional/capi/ext/object_spec.so I, [2024-05-16T20:37:30.313606 #1989561] INFO -- : building spec/ruby/optional/capi/ext/proc_spec.so I, [2024-05-16T20:37:30.314620 #1989561] INFO -- : building spec/ruby/optional/capi/ext/range_spec.so I, [2024-05-16T20:37:30.333238 #1989561] INFO -- : building spec/ruby/optional/capi/ext/rational_spec.so I, [2024-05-16T20:37:30.356403 #1989561] INFO -- : building spec/ruby/optional/capi/ext/rbasic_spec.so I, [2024-05-16T20:37:30.370400 #1989561] INFO -- : building spec/ruby/optional/capi/ext/regexp_spec.so I, [2024-05-16T20:37:30.392436 #1989561] INFO -- : building spec/ruby/optional/capi/ext/string_spec.so I, [2024-05-16T20:37:30.411669 #1989561] INFO -- : building spec/ruby/optional/capi/ext/struct_spec.so I, [2024-05-16T20:37:30.422150 #1989561] INFO -- : building spec/ruby/optional/capi/ext/st_spec.so I, [2024-05-16T20:37:30.430661 #1989561] INFO -- : building spec/ruby/optional/capi/ext/symbol_spec.so I, [2024-05-16T20:37:30.435023 #1989561] INFO -- : building spec/ruby/optional/capi/ext/thread_spec.so I, [2024-05-16T20:37:30.441150 #1989561] INFO -- : building spec/ruby/optional/capi/ext/time_spec.so I, [2024-05-16T20:37:30.445467 #1989561] INFO -- : building spec/ruby/optional/capi/ext/tracepoint_spec.so I, [2024-05-16T20:37:30.452714 #1989561] INFO -- : building spec/ruby/optional/capi/ext/typed_data_spec.so I, [2024-05-16T20:37:30.455874 #1989561] INFO -- : building spec/ruby/optional/capi/ext/util_spec.so I, [2024-05-16T20:37:30.494328 #1989561] INFO -- : making enc I, [2024-05-16T20:37:30.495254 #1989561] INFO -- : making srcs under enc I, [2024-05-16T20:37:30.520599 #1989561] INFO -- : make[1]: Entering directory '/tmp/ruby/build/trunk' I, [2024-05-16T20:37:30.520667 #1989561] INFO -- : make[1]: Nothing to be done for 'enc'. I, [2024-05-16T20:37:30.520682 #1989561] INFO -- : make[1]: Leaving directory '/tmp/ruby/build/trunk' I, [2024-05-16T20:37:30.542314 #1989561] INFO -- : make[1]: Entering directory '/tmp/ruby/build/trunk' I, [2024-05-16T20:37:30.542363 #1989561] INFO -- : make[1]: Nothing to be done for 'srcs'. I, [2024-05-16T20:37:30.542368 #1989561] INFO -- : make[1]: Leaving directory '/tmp/ruby/build/trunk' I, [2024-05-16T20:37:30.542992 #1989561] INFO -- : generating transdb.h I, [2024-05-16T20:37:30.639901 #1989561] INFO -- : transdb.h unchanged I, [2024-05-16T20:37:30.641496 #1989561] INFO -- : generating makefiles ext/configure-ext.mk I, [2024-05-16T20:37:30.641795 #1989561] INFO -- : making trans I, [2024-05-16T20:37:30.667832 #1989561] INFO -- : ext/configure-ext.mk updated I, [2024-05-16T20:37:30.670390 #1989561] INFO -- : make[1]: Entering directory '/tmp/ruby/build/trunk' I, [2024-05-16T20:37:30.676531 #1989561] INFO -- : make[1]: Entering directory '/tmp/ruby/build/trunk' I, [2024-05-16T20:37:30.676634 #1989561] INFO -- : make[1]: Nothing to be done for 'trans'. I, [2024-05-16T20:37:30.677853 #1989561] INFO -- : make[1]: Leaving directory '/tmp/ruby/build/trunk' I, [2024-05-16T20:37:30.677877 #1989561] INFO -- : making encs I, [2024-05-16T20:37:30.733465 #1989561] INFO -- : make[1]: Entering directory '/tmp/ruby/build/trunk' I, [2024-05-16T20:37:30.733541 #1989561] INFO -- : make[1]: Nothing to be done for 'encs'. I, [2024-05-16T20:37:30.733569 #1989561] INFO -- : make[1]: Leaving directory '/tmp/ruby/build/trunk' I, [2024-05-16T20:37:30.824138 #1989561] INFO -- : make[1]: Leaving directory '/tmp/ruby/build/trunk' I, [2024-05-16T20:37:30.825030 #1989561] INFO -- : generating makefile exts.mk I, [2024-05-16T20:37:30.863291 #1989561] INFO -- : exts.mk unchanged I, [2024-05-16T20:37:30.867790 #1989561] INFO -- : make[1]: Entering directory '/tmp/ruby/build/trunk' I, [2024-05-16T20:37:30.890401 #1989561] INFO -- : make[2]: Entering directory '/tmp/ruby/build/trunk/ext/digest' I, [2024-05-16T20:37:30.891809 #1989561] INFO -- : make[2]: Entering directory '/tmp/ruby/build/trunk/ext/coverage' I, [2024-05-16T20:37:30.891956 #1989561] INFO -- : make[2]: Entering directory '/tmp/ruby/build/trunk/ext/json' I, [2024-05-16T20:37:30.892373 #1989561] INFO -- : make[2]: Entering directory '/tmp/ruby/build/trunk/ext/date' I, [2024-05-16T20:37:30.893325 #1989561] INFO -- : make[2]: Entering directory '/tmp/ruby/build/trunk/ext/io/console' I, [2024-05-16T20:37:30.894325 #1989561] INFO -- : make[2]: Leaving directory '/tmp/ruby/build/trunk/ext/digest' I, [2024-05-16T20:37:30.894349 #1989561] INFO -- : make[2]: Entering directory '/tmp/ruby/build/trunk/ext/monitor' I, [2024-05-16T20:37:30.894452 #1989561] INFO -- : make[2]: Entering directory '/tmp/ruby/build/trunk/ext/rubyvm' I, [2024-05-16T20:37:30.894922 #1989561] INFO -- : make[2]: Entering directory '/tmp/ruby/build/trunk/ext/fiddle' I, [2024-05-16T20:37:30.895239 #1989561] INFO -- : make[2]: Entering directory '/tmp/ruby/build/trunk/ext/pathname' I, [2024-05-16T20:37:30.895565 #1989561] INFO -- : make[2]: Leaving directory '/tmp/ruby/build/trunk/ext/coverage' I, [2024-05-16T20:37:30.895588 #1989561] INFO -- : make[2]: Entering directory '/tmp/ruby/build/trunk/ext/pty' I, [2024-05-16T20:37:30.895963 #1989561] INFO -- : make[2]: Leaving directory '/tmp/ruby/build/trunk/ext/date' I, [2024-05-16T20:37:30.896103 #1989561] INFO -- : make[2]: Entering directory '/tmp/ruby/build/trunk/ext/objspace' I, [2024-05-16T20:37:30.896513 #1989561] INFO -- : make[2]: Leaving directory '/tmp/ruby/build/trunk/ext/rubyvm' I, [2024-05-16T20:37:30.896749 #1989561] INFO -- : make[2]: Leaving directory '/tmp/ruby/build/trunk/ext/io/console' I, [2024-05-16T20:37:30.897437 #1989561] INFO -- : make[2]: Entering directory '/tmp/ruby/build/trunk/ext/psych' I, [2024-05-16T20:37:30.898174 #1989561] INFO -- : make[2]: Leaving directory '/tmp/ruby/build/trunk/ext/pty' I, [2024-05-16T20:37:30.898722 #1989561] INFO -- : make[2]: Leaving directory '/tmp/ruby/build/trunk/ext/pathname' I, [2024-05-16T20:37:30.898979 #1989561] INFO -- : make[2]: Entering directory '/tmp/ruby/build/trunk/ext/ripper' I, [2024-05-16T20:37:30.899819 #1989561] INFO -- : make[2]: Leaving directory '/tmp/ruby/build/trunk/ext/fiddle' I, [2024-05-16T20:37:30.900113 #1989561] INFO -- : make[2]: Leaving directory '/tmp/ruby/build/trunk/ext/objspace' I, [2024-05-16T20:37:30.900417 #1989561] INFO -- : make[2]: Entering directory '/tmp/ruby/build/trunk/.bundle/gems/bigdecimal-3.1.8/ext/bigdecimal' I, [2024-05-16T20:37:30.900767 #1989561] INFO -- : make[2]: Entering directory '/tmp/ruby/build/trunk/.bundle/gems/debug-1.9.2/ext/debug' I, [2024-05-16T20:37:30.901209 #1989561] INFO -- : make[2]: Leaving directory '/tmp/ruby/build/trunk/ext/json' I, [2024-05-16T20:37:30.902410 #1989561] INFO -- : make[2]: Entering directory '/tmp/ruby/build/trunk/.bundle/gems/nkf-0.2.0/ext/nkf' I, [2024-05-16T20:37:30.902625 #1989561] INFO -- : make[2]: Entering directory '/tmp/ruby/build/trunk/.bundle/gems/racc-1.7.3/ext/racc/cparse' I, [2024-05-16T20:37:30.903103 #1989561] INFO -- : make[2]: Entering directory '/tmp/ruby/build/trunk/.bundle/gems/syslog-0.1.2/ext/syslog' I, [2024-05-16T20:37:30.903195 #1989561] INFO -- : make[2]: Leaving directory '/tmp/ruby/build/trunk/ext/ripper' I, [2024-05-16T20:37:30.903385 #1989561] INFO -- : make[2]: Entering directory '/tmp/ruby/build/trunk/.bundle/gems/rbs-3.4.4/ext/rbs_extension' I, [2024-05-16T20:37:30.904355 #1989561] INFO -- : make[2]: Entering directory '/tmp/ruby/build/trunk/ext/socket' I, [2024-05-16T20:37:30.905944 #1989561] INFO -- : make[2]: Entering directory '/tmp/ruby/build/trunk/ext/digest/sha2' I, [2024-05-16T20:37:30.906801 #1989561] INFO -- : make[2]: Entering directory '/tmp/ruby/build/trunk/ext/openssl' I, [2024-05-16T20:37:30.906828 #1989561] INFO -- : make[2]: Leaving directory '/tmp/ruby/build/trunk/ext/monitor' I, [2024-05-16T20:37:30.907297 #1989561] INFO -- : make[2]: Leaving directory '/tmp/ruby/build/trunk/ext/psych' I, [2024-05-16T20:37:30.909124 #1989561] INFO -- : make[2]: Leaving directory '/tmp/ruby/build/trunk/ext/digest/sha2' I, [2024-05-16T20:37:30.912581 #1989561] INFO -- : make[2]: Leaving directory '/tmp/ruby/build/trunk/ext/socket' I, [2024-05-16T20:37:30.918037 #1989561] INFO -- : make[2]: Leaving directory '/tmp/ruby/build/trunk/ext/openssl' I, [2024-05-16T20:37:30.923936 #1989561] INFO -- : make[2]: Leaving directory '/tmp/ruby/build/trunk/.bundle/gems/bigdecimal-3.1.8/ext/bigdecimal' I, [2024-05-16T20:37:30.924000 #1989561] INFO -- : make[2]: Leaving directory '/tmp/ruby/build/trunk/.bundle/gems/debug-1.9.2/ext/debug' I, [2024-05-16T20:37:30.925179 #1989561] INFO -- : make[2]: Leaving directory '/tmp/ruby/build/trunk/.bundle/gems/syslog-0.1.2/ext/syslog' I, [2024-05-16T20:37:30.925253 #1989561] INFO -- : make[2]: Leaving directory '/tmp/ruby/build/trunk/.bundle/gems/racc-1.7.3/ext/racc/cparse' I, [2024-05-16T20:37:30.931867 #1989561] INFO -- : make[2]: Leaving directory '/tmp/ruby/build/trunk/.bundle/gems/rbs-3.4.4/ext/rbs_extension' I, [2024-05-16T20:37:30.932064 #1989561] INFO -- : make[2]: Leaving directory '/tmp/ruby/build/trunk/.bundle/gems/nkf-0.2.0/ext/nkf' I, [2024-05-16T20:37:30.956043 #1989561] INFO -- : make[2]: Entering directory '/tmp/ruby/build/trunk' I, [2024-05-16T20:37:31.028534 #1989561] INFO -- : linking ruby I, [2024-05-16T20:37:31.051066 #1989561] INFO -- : make[2]: Leaving directory '/tmp/ruby/build/trunk' I, [2024-05-16T20:37:31.051430 #1989561] INFO -- : make[1]: Leaving directory '/tmp/ruby/build/trunk' I, [2024-05-16T20:37:31.055307 #1989561] INFO -- : make[1]: Entering directory '/tmp/ruby/build/trunk' I, [2024-05-16T20:37:31.055329 #1989561] INFO -- : make[1]: Nothing to be done for 'note'. I, [2024-05-16T20:37:31.055334 #1989561] INFO -- : make[1]: Leaving directory '/tmp/ruby/build/trunk' I, [2024-05-16T20:37:31.056012 #1989561] INFO -- : $$$[end] "make all -j20" exit with 0. I, [2024-05-16T20:37:31.056172 #1989561] INFO -- : $$$[beg] make install -j20 I, [2024-05-16T20:37:31.129131 #1989561] INFO -- : Update minitest to ea9caafc0754b1d6236a490d59e624b53209734a I, [2024-05-16T20:37:31.129461 #1989561] INFO -- : Update power_assert to 84e85124c5014a139af39161d484156cfe87a9ed I, [2024-05-16T20:37:31.130229 #1989561] INFO -- : Update rbs to ba7872795d5de04adb8ff500c0e6afdc81a041dd I, [2024-05-16T20:37:31.130501 #1989561] INFO -- : Update typeprof to b19a6416da3a05d57fadd6ffdadb382b6d236ca5 I, [2024-05-16T20:37:31.131339 #1989561] INFO -- : echo ea9caafc0754b1d6236a490d59e624b53209734a | /bin/sh /tmp/ruby/src/trunk/tool/ifchange /tmp/ruby/src/trunk/.bundle/.timestamp/minitest.revision - I, [2024-05-16T20:37:31.131473 #1989561] INFO -- : echo 84e85124c5014a139af39161d484156cfe87a9ed | /bin/sh /tmp/ruby/src/trunk/tool/ifchange /tmp/ruby/src/trunk/.bundle/.timestamp/power_assert.revision - I, [2024-05-16T20:37:31.132610 #1989561] INFO -- : BASERUBY = /usr/bin/ruby --disable=gems I, [2024-05-16T20:37:31.132646 #1989561] INFO -- : CC = gcc I, [2024-05-16T20:37:31.132656 #1989561] INFO -- : LD = ld I, [2024-05-16T20:37:31.132665 #1989561] INFO -- : LDSHARED = gcc -shared I, [2024-05-16T20:37:31.132673 #1989561] INFO -- : CFLAGS = -O3 -fno-fast-math -ggdb3 -Wall -Wextra -Wdeprecated-declarations -Wdiv-by-zero -Wduplicated-cond -Wimplicit-function-declaration -Wimplicit-int -Wpointer-arith -Wwrite-strings -Wold-style-definition -Wimplicit-fallthrough=0 -Wmissing-noreturn -Wno-cast-function-type -Wno-constant-logical-operand -Wno-long-long -Wno-missing-field-initializers -Wno-overlength-strings -Wno-packed-bitfield-compat -Wno-parentheses-equality -Wno-self-assign -Wno-tautological-compare -Wno-unused-parameter -Wno-unused-value -Wsuggest-attribute=format -Wsuggest-attribute=noreturn -Wunused-variable -Wmisleading-indentation -Wundef -fPIC I, [2024-05-16T20:37:31.132683 #1989561] INFO -- : XCFLAGS = -U_FORTIFY_SOURCE -D_FORTIFY_SOURCE=2 -fstack-protector-strong -fno-strict-overflow -fvisibility=hidden -fexcess-precision=standard -DRUBY_EXPORT -I. -I.ext/include/x86_64-linux -I/tmp/ruby/src/trunk/include -I/tmp/ruby/src/trunk -I/tmp/ruby/src/trunk/prism -I/tmp/ruby/src/trunk/enc/unicode/15.0.0 I, [2024-05-16T20:37:31.132691 #1989561] INFO -- : CPPFLAGS = I, [2024-05-16T20:37:31.132699 #1989561] INFO -- : DLDFLAGS = -Wl,--compress-debug-sections=zlib -Wl,-soname,libruby.so.3.4 -fstack-protector-strong I, [2024-05-16T20:37:31.132708 #1989561] INFO -- : SOLIBS = -lz -lrt -lrt -lgmp -ldl -lcrypt -lm -lpthread I, [2024-05-16T20:37:31.132715 #1989561] INFO -- : LANG = en_US.UTF-8 I, [2024-05-16T20:37:31.132723 #1989561] INFO -- : LC_ALL = I, [2024-05-16T20:37:31.132731 #1989561] INFO -- : LC_CTYPE = I, [2024-05-16T20:37:31.132742 #1989561] INFO -- : MFLAGS = -j20 --jobserver-auth=4,5 I, [2024-05-16T20:37:31.132749 #1989561] INFO -- : RUSTC = no I, [2024-05-16T20:37:31.132766 #1989561] INFO -- : YJIT_RUSTC_ARGS = --crate-name=yjit --crate-type=staticlib --edition=2021 -g -C lto=thin -C opt-level=3 -C overflow-checks=on '--out-dir=/tmp/ruby/build/trunk/yjit/target/release/' /tmp/ruby/src/trunk/yjit/src/lib.rs I, [2024-05-16T20:37:31.134172 #1989561] INFO -- : /tmp/ruby/src/trunk/.bundle/.timestamp/minitest.revision unchanged I, [2024-05-16T20:37:31.134198 #1989561] INFO -- : /tmp/ruby/src/trunk/.bundle/.timestamp/power_assert.revision unchanged I, [2024-05-16T20:37:31.165820 #1989561] INFO -- : echo ba7872795d5de04adb8ff500c0e6afdc81a041dd | /bin/sh /tmp/ruby/src/trunk/tool/ifchange /tmp/ruby/src/trunk/.bundle/.timestamp/rbs.revision - I, [2024-05-16T20:37:31.165972 #1989561] INFO -- : echo b19a6416da3a05d57fadd6ffdadb382b6d236ca5 | /bin/sh /tmp/ruby/src/trunk/tool/ifchange /tmp/ruby/src/trunk/.bundle/.timestamp/typeprof.revision - I, [2024-05-16T20:37:31.166611 #1989561] INFO -- : generating enc.mk I, [2024-05-16T20:37:31.166690 #1989561] INFO -- : gcc (Ubuntu 11.4.0-1ubuntu1~22.04) 11.4.0 I, [2024-05-16T20:37:31.166701 #1989561] INFO -- : Copyright (C) 2021 Free Software Foundation, Inc. I, [2024-05-16T20:37:31.166708 #1989561] INFO -- : This is free software; see the source for copying conditions. There is NO I, [2024-05-16T20:37:31.166714 #1989561] INFO -- : warranty; not even for MERCHANTABILITY or FITNESS FOR A PARTICULAR PURPOSE. I, [2024-05-16T20:37:31.166720 #1989561] INFO -- : I, [2024-05-16T20:37:31.167715 #1989561] INFO -- : /tmp/ruby/src/trunk/.bundle/.timestamp/rbs.revision unchanged I, [2024-05-16T20:37:31.167737 #1989561] INFO -- : /tmp/ruby/src/trunk/.bundle/.timestamp/typeprof.revision unchanged I, [2024-05-16T20:37:31.288976 #1989561] INFO -- : Building power_assert@84e85124c5014a139af39161d484156cfe87a9ed to /tmp/ruby/src/trunk/gems/power_assert-2.0.3.gem I, [2024-05-16T20:37:31.289581 #1989561] INFO -- : making srcs under enc I, [2024-05-16T20:37:31.289828 #1989561] INFO -- : making enc I, [2024-05-16T20:37:31.306668 #1989561] INFO -- : make[1]: Entering directory '/tmp/ruby/build/trunk' I, [2024-05-16T20:37:31.306708 #1989561] INFO -- : make[1]: Nothing to be done for 'enc'. I, [2024-05-16T20:37:31.306717 #1989561] INFO -- : make[1]: Leaving directory '/tmp/ruby/build/trunk' I, [2024-05-16T20:37:31.319089 #1989561] INFO -- : make[1]: Entering directory '/tmp/ruby/build/trunk' I, [2024-05-16T20:37:31.319116 #1989561] INFO -- : make[1]: Nothing to be done for 'srcs'. I, [2024-05-16T20:37:31.319125 #1989561] INFO -- : make[1]: Leaving directory '/tmp/ruby/build/trunk' I, [2024-05-16T20:37:31.319868 #1989561] INFO -- : generating transdb.h I, [2024-05-16T20:37:31.357952 #1989561] INFO -- : Successfully built RubyGem I, [2024-05-16T20:37:31.358005 #1989561] INFO -- : Name: power_assert I, [2024-05-16T20:37:31.358013 #1989561] INFO -- : Version: 2.0.4dev I, [2024-05-16T20:37:31.358018 #1989561] INFO -- : File: power_assert-2.0.4dev.gem I, [2024-05-16T20:37:31.360234 #1989561] INFO -- : Extracting bundle gem power_assert-2.0.3... I, [2024-05-16T20:37:31.417334 #1989561] INFO -- : transdb.h unchanged I, [2024-05-16T20:37:31.418947 #1989561] INFO -- : generating makefiles ext/configure-ext.mk I, [2024-05-16T20:37:31.419102 #1989561] INFO -- : making trans I, [2024-05-16T20:37:31.423182 #1989561] INFO -- : Try with hash version of bundled gems instead of gems/power_assert-2.0.3.gem. We don't use this gem with release version of Ruby. I, [2024-05-16T20:37:31.428186 #1989561] INFO -- : Unpacked gems/power_assert-2.0.4dev.gem I, [2024-05-16T20:37:31.445775 #1989561] INFO -- : ext/configure-ext.mk unchanged I, [2024-05-16T20:37:31.448092 #1989561] INFO -- : make[1]: Entering directory '/tmp/ruby/build/trunk' I, [2024-05-16T20:37:31.454927 #1989561] INFO -- : make[1]: Entering directory '/tmp/ruby/build/trunk' I, [2024-05-16T20:37:31.455014 #1989561] INFO -- : make[1]: Nothing to be done for 'trans'. I, [2024-05-16T20:37:31.455026 #1989561] INFO -- : make[1]: Leaving directory '/tmp/ruby/build/trunk' I, [2024-05-16T20:37:31.530497 #1989561] INFO -- : making encs I, [2024-05-16T20:37:31.590000 #1989561] INFO -- : make[1]: Entering directory '/tmp/ruby/build/trunk' I, [2024-05-16T20:37:31.590060 #1989561] INFO -- : make[1]: Nothing to be done for 'encs'. I, [2024-05-16T20:37:31.590068 #1989561] INFO -- : make[1]: Leaving directory '/tmp/ruby/build/trunk' I, [2024-05-16T20:37:31.593913 #1989561] INFO -- : make[1]: Leaving directory '/tmp/ruby/build/trunk' I, [2024-05-16T20:37:31.594707 #1989561] INFO -- : generating makefile exts.mk I, [2024-05-16T20:37:31.631364 #1989561] INFO -- : exts.mk unchanged I, [2024-05-16T20:37:31.635779 #1989561] INFO -- : make[1]: Entering directory '/tmp/ruby/build/trunk' I, [2024-05-16T20:37:31.655463 #1989561] INFO -- : make[2]: Entering directory '/tmp/ruby/build/trunk/ext/digest' I, [2024-05-16T20:37:31.655921 #1989561] INFO -- : make[2]: Entering directory '/tmp/ruby/build/trunk/ext/json' I, [2024-05-16T20:37:31.656938 #1989561] INFO -- : make[2]: Entering directory '/tmp/ruby/build/trunk/ext/coverage' I, [2024-05-16T20:37:31.656999 #1989561] INFO -- : make[2]: Entering directory '/tmp/ruby/build/trunk/ext/io/console' I, [2024-05-16T20:37:31.657526 #1989561] INFO -- : make[2]: Entering directory '/tmp/ruby/build/trunk/ext/date' I, [2024-05-16T20:37:31.658191 #1989561] INFO -- : make[2]: Entering directory '/tmp/ruby/build/trunk/ext/rubyvm' I, [2024-05-16T20:37:31.658343 #1989561] INFO -- : make[2]: Entering directory '/tmp/ruby/build/trunk/ext/monitor' I, [2024-05-16T20:37:31.659669 #1989561] INFO -- : make[2]: Entering directory '/tmp/ruby/build/trunk/ext/pathname' I, [2024-05-16T20:37:31.659927 #1989561] INFO -- : make[2]: Entering directory '/tmp/ruby/build/trunk/ext/pty' I, [2024-05-16T20:37:31.660147 #1989561] INFO -- : make[2]: Entering directory '/tmp/ruby/build/trunk/ext/fiddle' I, [2024-05-16T20:37:31.660382 #1989561] INFO -- : make[2]: Leaving directory '/tmp/ruby/build/trunk/ext/io/console' I, [2024-05-16T20:37:31.660880 #1989561] INFO -- : make[2]: Leaving directory '/tmp/ruby/build/trunk/ext/coverage' I, [2024-05-16T20:37:31.660895 #1989561] INFO -- : make[2]: Entering directory '/tmp/ruby/build/trunk/ext/objspace' I, [2024-05-16T20:37:31.661020 #1989561] INFO -- : make[2]: Leaving directory '/tmp/ruby/build/trunk/ext/rubyvm' I, [2024-05-16T20:37:31.661577 #1989561] INFO -- : make[2]: Leaving directory '/tmp/ruby/build/trunk/ext/monitor' I, [2024-05-16T20:37:31.661791 #1989561] INFO -- : make[2]: Entering directory '/tmp/ruby/build/trunk/ext/psych' I, [2024-05-16T20:37:31.661801 #1989561] INFO -- : make[2]: Leaving directory '/tmp/ruby/build/trunk/ext/json' I, [2024-05-16T20:37:31.662309 #1989561] INFO -- : make[2]: Leaving directory '/tmp/ruby/build/trunk/ext/date' I, [2024-05-16T20:37:31.662330 #1989561] INFO -- : make[2]: Leaving directory '/tmp/ruby/build/trunk/ext/digest' I, [2024-05-16T20:37:31.662404 #1989561] INFO -- : make[2]: Leaving directory '/tmp/ruby/build/trunk/ext/pathname' I, [2024-05-16T20:37:31.662607 #1989561] INFO -- : make[2]: Leaving directory '/tmp/ruby/build/trunk/ext/pty' I, [2024-05-16T20:37:31.663259 #1989561] INFO -- : make[2]: Entering directory '/tmp/ruby/build/trunk/.bundle/gems/bigdecimal-3.1.8/ext/bigdecimal' I, [2024-05-16T20:37:31.663428 #1989561] INFO -- : make[2]: Entering directory '/tmp/ruby/build/trunk/ext/ripper' I, [2024-05-16T20:37:31.664169 #1989561] INFO -- : make[2]: Leaving directory '/tmp/ruby/build/trunk/ext/objspace' I, [2024-05-16T20:37:31.664287 #1989561] INFO -- : make[2]: Entering directory '/tmp/ruby/build/trunk/.bundle/gems/debug-1.9.2/ext/debug' I, [2024-05-16T20:37:31.664337 #1989561] INFO -- : make[2]: Entering directory '/tmp/ruby/build/trunk/.bundle/gems/nkf-0.2.0/ext/nkf' I, [2024-05-16T20:37:31.664543 #1989561] INFO -- : make[2]: Entering directory '/tmp/ruby/build/trunk/.bundle/gems/racc-1.7.3/ext/racc/cparse' I, [2024-05-16T20:37:31.665179 #1989561] INFO -- : make[2]: Entering directory '/tmp/ruby/build/trunk/.bundle/gems/rbs-3.4.4/ext/rbs_extension' I, [2024-05-16T20:37:31.665543 #1989561] INFO -- : make[2]: Entering directory '/tmp/ruby/build/trunk/.bundle/gems/syslog-0.1.2/ext/syslog' I, [2024-05-16T20:37:31.667570 #1989561] INFO -- : make[2]: Leaving directory '/tmp/ruby/build/trunk/ext/fiddle' I, [2024-05-16T20:37:31.668604 #1989561] INFO -- : make[2]: Leaving directory '/tmp/ruby/build/trunk/ext/ripper' I, [2024-05-16T20:37:31.669591 #1989561] INFO -- : make[2]: Entering directory '/tmp/ruby/build/trunk/ext/socket' I, [2024-05-16T20:37:31.670310 #1989561] INFO -- : make[2]: Leaving directory '/tmp/ruby/build/trunk/ext/psych' I, [2024-05-16T20:37:31.672380 #1989561] INFO -- : make[2]: Entering directory '/tmp/ruby/build/trunk/ext/digest/sha2' I, [2024-05-16T20:37:31.673100 #1989561] INFO -- : make[2]: Entering directory '/tmp/ruby/build/trunk/ext/openssl' I, [2024-05-16T20:37:31.674741 #1989561] INFO -- : make[2]: Leaving directory '/tmp/ruby/build/trunk/ext/digest/sha2' I, [2024-05-16T20:37:31.678268 #1989561] INFO -- : make[2]: Leaving directory '/tmp/ruby/build/trunk/ext/socket' I, [2024-05-16T20:37:31.684323 #1989561] INFO -- : make[2]: Leaving directory '/tmp/ruby/build/trunk/ext/openssl' I, [2024-05-16T20:37:31.685413 #1989561] INFO -- : make[2]: Leaving directory '/tmp/ruby/build/trunk/.bundle/gems/bigdecimal-3.1.8/ext/bigdecimal' I, [2024-05-16T20:37:31.686551 #1989561] INFO -- : make[2]: Leaving directory '/tmp/ruby/build/trunk/.bundle/gems/debug-1.9.2/ext/debug' I, [2024-05-16T20:37:31.689400 #1989561] INFO -- : make[2]: Leaving directory '/tmp/ruby/build/trunk/.bundle/gems/syslog-0.1.2/ext/syslog' I, [2024-05-16T20:37:31.693334 #1989561] INFO -- : make[2]: Leaving directory '/tmp/ruby/build/trunk/.bundle/gems/nkf-0.2.0/ext/nkf' I, [2024-05-16T20:37:31.695971 #1989561] INFO -- : make[2]: Leaving directory '/tmp/ruby/build/trunk/.bundle/gems/rbs-3.4.4/ext/rbs_extension' I, [2024-05-16T20:37:31.696039 #1989561] INFO -- : make[2]: Leaving directory '/tmp/ruby/build/trunk/.bundle/gems/racc-1.7.3/ext/racc/cparse' I, [2024-05-16T20:37:31.720610 #1989561] INFO -- : make[2]: Entering directory '/tmp/ruby/build/trunk' I, [2024-05-16T20:37:31.790404 #1989561] INFO -- : make[2]: 'ruby' is up to date. I, [2024-05-16T20:37:31.790475 #1989561] INFO -- : make[2]: Leaving directory '/tmp/ruby/build/trunk' I, [2024-05-16T20:37:31.790876 #1989561] INFO -- : make[1]: Leaving directory '/tmp/ruby/build/trunk' I, [2024-05-16T20:37:31.794787 #1989561] INFO -- : make[1]: Entering directory '/tmp/ruby/build/trunk' I, [2024-05-16T20:37:31.794848 #1989561] INFO -- : make[1]: Nothing to be done for 'note'. I, [2024-05-16T20:37:31.794866 #1989561] INFO -- : make[1]: Leaving directory '/tmp/ruby/build/trunk' I, [2024-05-16T20:37:31.795061 #1989561] INFO -- : ./miniruby -I/tmp/ruby/src/trunk/lib -I. -I.ext/common /tmp/ruby/src/trunk/tool/runruby.rb --extout=.ext -- --disable-gems -r./x86_64-linux-fake /tmp/ruby/src/trunk/tool/rbinstall.rb --make="make" --dest-dir="" --extout=".ext" --ext-build-dir="./ext" --mflags="-j20 --jobserver-auth=4,5" --make-flags=" -j20 --jobserver-auth=4,5" --data-mode=0644 --prog-mode=0755 --installed-list .installed.list --mantype="doc" --gnumake --install=all --exclude=doc I, [2024-05-16T20:37:31.892588 #1989561] INFO -- : Installing to I, [2024-05-16T20:37:31.892670 #1989561] INFO -- : installing binary commands: /tmp/ruby/install/trunk/bin I, [2024-05-16T20:37:31.892684 #1989561] INFO -- : installing base libraries: /tmp/ruby/install/trunk/lib I, [2024-05-16T20:37:31.899895 #1989561] INFO -- : installing arch files: /tmp/ruby/install/trunk/lib/ruby/3.4.0+0/x86_64-linux I, [2024-05-16T20:37:31.899955 #1989561] INFO -- : installing pkgconfig data: /tmp/ruby/install/trunk/lib/pkgconfig I, [2024-05-16T20:37:31.899969 #1989561] INFO -- : installing extension objects: /tmp/ruby/install/trunk/lib/ruby/3.4.0+0/x86_64-linux I, [2024-05-16T20:37:31.909321 #1989561] INFO -- : installing extension objects: /tmp/ruby/install/trunk/lib/ruby/site_ruby/3.4.0+0/x86_64-linux I, [2024-05-16T20:37:31.909391 #1989561] INFO -- : installing extension objects: /tmp/ruby/install/trunk/lib/ruby/vendor_ruby/3.4.0+0/x86_64-linux I, [2024-05-16T20:37:31.909405 #1989561] INFO -- : installing extension headers: /tmp/ruby/install/trunk/include/ruby-3.4.0+0/x86_64-linux I, [2024-05-16T20:37:31.909418 #1989561] INFO -- : installing extension scripts: /tmp/ruby/install/trunk/lib/ruby/3.4.0+0 I, [2024-05-16T20:37:31.912213 #1989561] INFO -- : installing extension scripts: /tmp/ruby/install/trunk/lib/ruby/site_ruby/3.4.0+0 I, [2024-05-16T20:37:31.912273 #1989561] INFO -- : installing extension scripts: /tmp/ruby/install/trunk/lib/ruby/vendor_ruby/3.4.0+0 I, [2024-05-16T20:37:31.912293 #1989561] INFO -- : installing extension headers: /tmp/ruby/install/trunk/include/ruby-3.4.0+0/ruby I, [2024-05-16T20:37:31.912304 #1989561] INFO -- : installing command scripts: /tmp/ruby/install/trunk/bin I, [2024-05-16T20:37:31.912317 #1989561] INFO -- : installing library scripts: /tmp/ruby/install/trunk/lib/ruby/3.4.0+0 I, [2024-05-16T20:37:31.945078 #1989561] INFO -- : installing common headers: /tmp/ruby/install/trunk/include/ruby-3.4.0+0 I, [2024-05-16T20:37:31.951231 #1989561] INFO -- : installing manpages: /tmp/ruby/install/trunk/share/man/man1 I, [2024-05-16T20:37:31.951298 #1989561] INFO -- : installing default gems from lib: /tmp/ruby/install/trunk/lib/ruby/gems/3.4.0+0 I, [2024-05-16T20:37:31.974139 #1989561] INFO -- : benchmark 0.3.0 I, [2024-05-16T20:37:31.975992 #1989561] INFO -- : bundler 2.6.0.dev I, [2024-05-16T20:37:31.978083 #1989561] INFO -- : cgi 0.4.1 I, [2024-05-16T20:37:31.978638 #1989561] INFO -- : delegate 0.3.1 I, [2024-05-16T20:37:31.979075 #1989561] INFO -- : did_you_mean 1.6.3 I, [2024-05-16T20:37:31.979605 #1989561] INFO -- : english 0.8.0 I, [2024-05-16T20:37:31.980055 #1989561] INFO -- : erb 4.0.4 I, [2024-05-16T20:37:31.981077 #1989561] INFO -- : error_highlight 0.6.0 I, [2024-05-16T20:37:31.981864 #1989561] INFO -- : fileutils 1.7.2 I, [2024-05-16T20:37:31.982625 #1989561] INFO -- : find 0.2.0 I, [2024-05-16T20:37:31.983512 #1989561] INFO -- : forwardable 1.3.3 I, [2024-05-16T20:37:31.984621 #1989561] INFO -- : ipaddr 1.2.6 I, [2024-05-16T20:37:31.985141 #1989561] INFO -- : irb 1.13.1 I, [2024-05-16T20:37:31.985912 #1989561] INFO -- : logger 1.6.0 I, [2024-05-16T20:37:31.986406 #1989561] INFO -- : net-http 0.4.1 I, [2024-05-16T20:37:31.986883 #1989561] INFO -- : net-protocol 0.2.2 I, [2024-05-16T20:37:31.987376 #1989561] INFO -- : open-uri 0.4.1 I, [2024-05-16T20:37:31.987918 #1989561] INFO -- : open3 0.2.1 I, [2024-05-16T20:37:31.988377 #1989561] INFO -- : optparse 0.5.0 I, [2024-05-16T20:37:31.988790 #1989561] INFO -- : ostruct 0.6.0 I, [2024-05-16T20:37:31.989222 #1989561] INFO -- : pp 0.5.0 I, [2024-05-16T20:37:31.989792 #1989561] INFO -- : prettyprint 0.2.0 I, [2024-05-16T20:37:31.990168 #1989561] INFO -- : prism 0.29.0 I, [2024-05-16T20:37:31.990745 #1989561] INFO -- : pstore 0.1.3 I, [2024-05-16T20:37:31.991159 #1989561] INFO -- : rdoc 6.6.3.1 I, [2024-05-16T20:37:31.992194 #1989561] INFO -- : readline 0.0.4 I, [2024-05-16T20:37:31.992719 #1989561] INFO -- : reline 0.5.7 I, [2024-05-16T20:37:31.993160 #1989561] INFO -- : resolv 0.4.0 I, [2024-05-16T20:37:31.993705 #1989561] INFO -- : ruby2_keywords 0.0.5 I, [2024-05-16T20:37:31.994201 #1989561] INFO -- : securerandom 0.3.1 I, [2024-05-16T20:37:31.995186 #1989561] INFO -- : set 1.1.0 I, [2024-05-16T20:37:31.995887 #1989561] INFO -- : shellwords 0.2.0 I, [2024-05-16T20:37:31.996424 #1989561] INFO -- : singleton 0.2.0 I, [2024-05-16T20:37:31.996865 #1989561] INFO -- : syntax_suggest 2.0.0 I, [2024-05-16T20:37:31.997540 #1989561] INFO -- : tempfile 0.2.1 I, [2024-05-16T20:37:31.998012 #1989561] INFO -- : time 0.3.0 I, [2024-05-16T20:37:31.998502 #1989561] INFO -- : timeout 0.4.1 I, [2024-05-16T20:37:31.998961 #1989561] INFO -- : tmpdir 0.2.0 I, [2024-05-16T20:37:31.999421 #1989561] INFO -- : tsort 0.2.0 I, [2024-05-16T20:37:31.999786 #1989561] INFO -- : un 0.3.0 I, [2024-05-16T20:37:32.000377 #1989561] INFO -- : uri 0.13.0 I, [2024-05-16T20:37:32.000868 #1989561] INFO -- : weakref 0.1.3 I, [2024-05-16T20:37:32.001335 #1989561] INFO -- : yaml 0.3.0 I, [2024-05-16T20:37:32.001634 #1989561] INFO -- : installing default gems from ext: /tmp/ruby/install/trunk/lib/ruby/gems/3.4.0+0 I, [2024-05-16T20:37:32.008213 #1989561] INFO -- : date 3.3.4 I, [2024-05-16T20:37:32.008720 #1989561] INFO -- : digest 3.1.1 I, [2024-05-16T20:37:32.009219 #1989561] INFO -- : etc 1.4.3 I, [2024-05-16T20:37:32.009643 #1989561] INFO -- : fcntl 1.1.0 I, [2024-05-16T20:37:32.010189 #1989561] INFO -- : fiddle 1.1.3 I, [2024-05-16T20:37:32.010653 #1989561] INFO -- : io-console 0.7.2 I, [2024-05-16T20:37:32.011132 #1989561] INFO -- : io-nonblock 0.3.0 I, [2024-05-16T20:37:32.011515 #1989561] INFO -- : io-wait 0.3.1 I, [2024-05-16T20:37:32.012322 #1989561] INFO -- : json 2.7.2 I, [2024-05-16T20:37:32.012908 #1989561] INFO -- : openssl 3.2.0 I, [2024-05-16T20:37:32.013422 #1989561] INFO -- : pathname 0.3.0 I, [2024-05-16T20:37:32.013809 #1989561] INFO -- : psych 5.1.2 I, [2024-05-16T20:37:32.014437 #1989561] INFO -- : stringio 3.1.1 I, [2024-05-16T20:37:32.014865 #1989561] INFO -- : strscan 3.1.1 I, [2024-05-16T20:37:32.015315 #1989561] INFO -- : zlib 3.1.0 I, [2024-05-16T20:37:32.015780 #1989561] INFO -- : installing bundled gems: /tmp/ruby/install/trunk/lib/ruby/gems/3.4.0+0 I, [2024-05-16T20:37:32.016066 #1989561] INFO -- : minitest 5.22.3 I, [2024-05-16T20:37:32.023543 #1989561] INFO -- : rake 13.2.1 I, [2024-05-16T20:37:32.026964 #1989561] INFO -- : test-unit 3.6.2 I, [2024-05-16T20:37:32.031715 #1989561] INFO -- : rexml 3.2.6 I, [2024-05-16T20:37:32.035311 #1989561] INFO -- : rss 0.3.0 I, [2024-05-16T20:37:32.038035 #1989561] INFO -- : net-ftp 0.3.4 I, [2024-05-16T20:37:32.039622 #1989561] INFO -- : net-imap 0.4.11 I, [2024-05-16T20:37:32.043289 #1989561] INFO -- : net-pop 0.1.2 I, [2024-05-16T20:37:32.044523 #1989561] INFO -- : net-smtp 0.5.0 I, [2024-05-16T20:37:32.045691 #1989561] INFO -- : matrix 0.4.2 I, [2024-05-16T20:37:32.048988 #1989561] INFO -- : prime 0.1.2 I, [2024-05-16T20:37:32.053805 #1989561] INFO -- : rbs 3.4.4 I, [2024-05-16T20:37:32.075788 #1989561] INFO -- : typeprof 0.21.11 I, [2024-05-16T20:37:32.078458 #1989561] INFO -- : debug 1.9.2 I, [2024-05-16T20:37:32.081487 #1989561] INFO -- : racc 1.7.3 I, [2024-05-16T20:37:32.084415 #1989561] INFO -- : mutex_m 0.2.0 I, [2024-05-16T20:37:32.085692 #1989561] INFO -- : getoptlong 0.2.1 I, [2024-05-16T20:37:32.087111 #1989561] INFO -- : base64 0.2.0 I, [2024-05-16T20:37:32.088224 #1989561] INFO -- : bigdecimal 3.1.8 I, [2024-05-16T20:37:32.090281 #1989561] INFO -- : observer 0.1.2 I, [2024-05-16T20:37:32.091428 #1989561] INFO -- : abbrev 0.1.2 I, [2024-05-16T20:37:32.093148 #1989561] INFO -- : resolv-replace 0.1.1 I, [2024-05-16T20:37:32.094392 #1989561] INFO -- : rinda 0.2.0 I, [2024-05-16T20:37:32.095908 #1989561] INFO -- : drb 2.2.1 I, [2024-05-16T20:37:32.097578 #1989561] INFO -- : nkf 0.2.0 I, [2024-05-16T20:37:32.100153 #1989561] INFO -- : syslog 0.1.2 I, [2024-05-16T20:37:32.101816 #1989561] INFO -- : csv 3.3.0 I, [2024-05-16T20:37:32.104717 #1989561] INFO -- : installing bundled gem cache: /tmp/ruby/install/trunk/lib/ruby/gems/3.4.0+0/cache I, [2024-05-16T20:37:32.106063 #1989561] INFO -- : skipped bundled gems: I, [2024-05-16T20:37:32.106083 #1989561] INFO -- : power_assert-2.0.4dev.gem not found in bundled_gems I, [2024-05-16T20:37:32.109399 #1989561] INFO -- : $$$[end] "make install -j20" exit with 0. I, [2024-05-16T20:37:32.109513 #1989561] INFO -- : $$$[beg] make yes-btest TESTOPTS='-q -j20' I, [2024-05-16T20:37:38.169021 #1989561] INFO -- : PASS all 1936 tests E, [2024-05-16T20:37:38.174833 #1989561] ERROR -- : I, [2024-05-16T20:37:38.174943 #1989561] INFO -- : $$$[end] "make yes-btest TESTOPTS='-q -j20'" exit with 0. I, [2024-05-16T20:37:38.175035 #1989561] INFO -- : $$$[beg] make yes-test-basic TESTS='-j20' I, [2024-05-16T20:37:38.235985 #1989561] INFO -- : BASERUBY = /usr/bin/ruby --disable=gems I, [2024-05-16T20:37:38.236013 #1989561] INFO -- : CC = gcc I, [2024-05-16T20:37:38.236018 #1989561] INFO -- : LD = ld I, [2024-05-16T20:37:38.236022 #1989561] INFO -- : LDSHARED = gcc -shared I, [2024-05-16T20:37:38.236026 #1989561] INFO -- : CFLAGS = -O3 -fno-fast-math -ggdb3 -Wall -Wextra -Wdeprecated-declarations -Wdiv-by-zero -Wduplicated-cond -Wimplicit-function-declaration -Wimplicit-int -Wpointer-arith -Wwrite-strings -Wold-style-definition -Wimplicit-fallthrough=0 -Wmissing-noreturn -Wno-cast-function-type -Wno-constant-logical-operand -Wno-long-long -Wno-missing-field-initializers -Wno-overlength-strings -Wno-packed-bitfield-compat -Wno-parentheses-equality -Wno-self-assign -Wno-tautological-compare -Wno-unused-parameter -Wno-unused-value -Wsuggest-attribute=format -Wsuggest-attribute=noreturn -Wunused-variable -Wmisleading-indentation -Wundef -fPIC I, [2024-05-16T20:37:38.236031 #1989561] INFO -- : XCFLAGS = -U_FORTIFY_SOURCE -D_FORTIFY_SOURCE=2 -fstack-protector-strong -fno-strict-overflow -fvisibility=hidden -fexcess-precision=standard -DRUBY_EXPORT -I. -I.ext/include/x86_64-linux -I/tmp/ruby/src/trunk/include -I/tmp/ruby/src/trunk -I/tmp/ruby/src/trunk/prism -I/tmp/ruby/src/trunk/enc/unicode/15.0.0 I, [2024-05-16T20:37:38.236090 #1989561] INFO -- : CPPFLAGS = I, [2024-05-16T20:37:38.236094 #1989561] INFO -- : DLDFLAGS = -Wl,--compress-debug-sections=zlib -Wl,-soname,libruby.so.3.4 -fstack-protector-strong I, [2024-05-16T20:37:38.236098 #1989561] INFO -- : SOLIBS = -lz -lrt -lrt -lgmp -ldl -lcrypt -lm -lpthread I, [2024-05-16T20:37:38.236101 #1989561] INFO -- : LANG = en_US.UTF-8 I, [2024-05-16T20:37:38.236105 #1989561] INFO -- : LC_ALL = I, [2024-05-16T20:37:38.236108 #1989561] INFO -- : LC_CTYPE = I, [2024-05-16T20:37:38.236112 #1989561] INFO -- : MFLAGS = I, [2024-05-16T20:37:38.236115 #1989561] INFO -- : RUSTC = no I, [2024-05-16T20:37:38.236119 #1989561] INFO -- : YJIT_RUSTC_ARGS = --crate-name=yjit --crate-type=staticlib --edition=2021 -g -C lto=thin -C opt-level=3 -C overflow-checks=on '--out-dir=/tmp/ruby/build/trunk/yjit/target/release/' /tmp/ruby/src/trunk/yjit/src/lib.rs I, [2024-05-16T20:37:38.236783 #1989561] INFO -- : gcc (Ubuntu 11.4.0-1ubuntu1~22.04) 11.4.0 I, [2024-05-16T20:37:38.236804 #1989561] INFO -- : Copyright (C) 2021 Free Software Foundation, Inc. I, [2024-05-16T20:37:38.236810 #1989561] INFO -- : This is free software; see the source for copying conditions. There is NO I, [2024-05-16T20:37:38.236820 #1989561] INFO -- : warranty; not even for MERCHANTABILITY or FITNESS FOR A PARTICULAR PURPOSE. I, [2024-05-16T20:37:38.236824 #1989561] INFO -- : I, [2024-05-16T20:37:38.343487 #1989561] INFO -- : Checking leaked global symbols...none I, [2024-05-16T20:37:38.383902 #1989561] INFO -- : /tmp/ruby/src/trunk/basictest/test.rb:assignment ....................................................................................................................................................................................................................................................................................................................................................................................OK 372 I, [2024-05-16T20:37:38.383957 #1989561] INFO -- : /tmp/ruby/src/trunk/basictest/test.rb:condition ..OK 2 I, [2024-05-16T20:37:38.383965 #1989561] INFO -- : /tmp/ruby/src/trunk/basictest/test.rb:if/unless ...OK 3 I, [2024-05-16T20:37:38.383978 #1989561] INFO -- : /tmp/ruby/src/trunk/basictest/test.rb:case .....OK 5 I, [2024-05-16T20:37:38.384197 #1989561] INFO -- : /tmp/ruby/src/trunk/basictest/test.rb:while/until ........OK 8 I, [2024-05-16T20:37:38.384249 #1989561] INFO -- : /tmp/ruby/src/trunk/basictest/test.rb:exception ..........OK 10 I, [2024-05-16T20:37:38.384517 #1989561] INFO -- : /tmp/ruby/src/trunk/basictest/test.rb:array .......................................OK 39 I, [2024-05-16T20:37:38.384619 #1989561] INFO -- : /tmp/ruby/src/trunk/basictest/test.rb:hash ...........................OK 27 I, [2024-05-16T20:37:38.385336 #1989561] INFO -- : /tmp/ruby/src/trunk/basictest/test.rb:iterator ...........................................................................................................OK 107 I, [2024-05-16T20:37:38.385614 #1989561] INFO -- : /tmp/ruby/src/trunk/basictest/test.rb:float ................................................................................OK 80 I, [2024-05-16T20:37:38.386637 #1989561] INFO -- : /tmp/ruby/src/trunk/basictest/test.rb:bignum ...............................OK 31 I, [2024-05-16T20:37:38.387407 #1989561] INFO -- : /tmp/ruby/src/trunk/basictest/test.rb:string & char ..............................................................OK 62 I, [2024-05-16T20:37:38.387438 #1989561] INFO -- : /tmp/ruby/src/trunk/basictest/test.rb:assignment ..........OK 10 I, [2024-05-16T20:37:38.387465 #1989561] INFO -- : /tmp/ruby/src/trunk/basictest/test.rb:call ......OK 6 I, [2024-05-16T20:37:38.387518 #1989561] INFO -- : /tmp/ruby/src/trunk/basictest/test.rb:proc .........OK 9 I, [2024-05-16T20:37:38.488206 #1989561] INFO -- : /tmp/ruby/src/trunk/basictest/test.rb:signal ..OK 2 I, [2024-05-16T20:37:38.490747 #1989561] INFO -- : /tmp/ruby/src/trunk/basictest/test.rb:eval ...........................OK 27 I, [2024-05-16T20:37:38.605781 #1989561] INFO -- : /tmp/ruby/src/trunk/basictest/test.rb:system ........OK 8 I, [2024-05-16T20:37:38.605861 #1989561] INFO -- : /tmp/ruby/src/trunk/basictest/test.rb:const .....OK 5 I, [2024-05-16T20:37:38.605869 #1989561] INFO -- : /tmp/ruby/src/trunk/basictest/test.rb:clone .....OK 5 I, [2024-05-16T20:37:38.605962 #1989561] INFO -- : /tmp/ruby/src/trunk/basictest/test.rb:marshal ....OK 4 I, [2024-05-16T20:37:38.607291 #1989561] INFO -- : /tmp/ruby/src/trunk/basictest/test.rb:pack ....OK 4 I, [2024-05-16T20:37:38.607300 #1989561] INFO -- : /tmp/ruby/src/trunk/basictest/test.rb:math ..OK 2 I, [2024-05-16T20:37:38.607304 #1989561] INFO -- : /tmp/ruby/src/trunk/basictest/test.rb:struct ......OK 6 I, [2024-05-16T20:37:38.607308 #1989561] INFO -- : /tmp/ruby/src/trunk/basictest/test.rb:variable ............OK 12 I, [2024-05-16T20:37:38.607311 #1989561] INFO -- : /tmp/ruby/src/trunk/basictest/test.rb:trace ...OK 3 I, [2024-05-16T20:37:38.607315 #1989561] INFO -- : /tmp/ruby/src/trunk/basictest/test.rb:defined? ............OK 12 I, [2024-05-16T20:37:38.607323 #1989561] INFO -- : /tmp/ruby/src/trunk/basictest/test.rb:alias ......OK 6 I, [2024-05-16T20:37:38.607328 #1989561] INFO -- : /tmp/ruby/src/trunk/basictest/test.rb:path .......................OK 23 I, [2024-05-16T20:37:38.639786 #1989561] INFO -- : /tmp/ruby/src/trunk/basictest/test.rb:gc ....OK 4 I, [2024-05-16T20:37:38.642030 #1989561] INFO -- : I, [2024-05-16T20:37:38.642053 #1989561] INFO -- : test succeeded I, [2024-05-16T20:37:38.643616 #1989561] INFO -- : $$$[end] "make yes-test-basic TESTS='-j20'" exit with 0. I, [2024-05-16T20:37:38.643754 #1989561] INFO -- : $$$[beg] make yes-test-all TESTOPTS='--stderr-on-failure' TESTS='-j20' I, [2024-05-16T20:37:38.731183 #1989561] INFO -- : BASERUBY = /usr/bin/ruby --disable=gems I, [2024-05-16T20:37:38.731233 #1989561] INFO -- : CC = gcc I, [2024-05-16T20:37:38.731246 #1989561] INFO -- : LD = ld I, [2024-05-16T20:37:38.731256 #1989561] INFO -- : LDSHARED = gcc -shared I, [2024-05-16T20:37:38.731267 #1989561] INFO -- : CFLAGS = -O3 -fno-fast-math -ggdb3 -Wall -Wextra -Wdeprecated-declarations -Wdiv-by-zero -Wduplicated-cond -Wimplicit-function-declaration -Wimplicit-int -Wpointer-arith -Wwrite-strings -Wold-style-definition -Wimplicit-fallthrough=0 -Wmissing-noreturn -Wno-cast-function-type -Wno-constant-logical-operand -Wno-long-long -Wno-missing-field-initializers -Wno-overlength-strings -Wno-packed-bitfield-compat -Wno-parentheses-equality -Wno-self-assign -Wno-tautological-compare -Wno-unused-parameter -Wno-unused-value -Wsuggest-attribute=format -Wsuggest-attribute=noreturn -Wunused-variable -Wmisleading-indentation -Wundef -fPIC I, [2024-05-16T20:37:38.731278 #1989561] INFO -- : XCFLAGS = -U_FORTIFY_SOURCE -D_FORTIFY_SOURCE=2 -fstack-protector-strong -fno-strict-overflow -fvisibility=hidden -fexcess-precision=standard -DRUBY_EXPORT -I. -I.ext/include/x86_64-linux -I/tmp/ruby/src/trunk/include -I/tmp/ruby/src/trunk -I/tmp/ruby/src/trunk/prism -I/tmp/ruby/src/trunk/enc/unicode/15.0.0 I, [2024-05-16T20:37:38.731288 #1989561] INFO -- : CPPFLAGS = I, [2024-05-16T20:37:38.731298 #1989561] INFO -- : DLDFLAGS = -Wl,--compress-debug-sections=zlib -Wl,-soname,libruby.so.3.4 -fstack-protector-strong I, [2024-05-16T20:37:38.731308 #1989561] INFO -- : SOLIBS = -lz -lrt -lrt -lgmp -ldl -lcrypt -lm -lpthread I, [2024-05-16T20:37:38.731318 #1989561] INFO -- : LANG = en_US.UTF-8 I, [2024-05-16T20:37:38.731327 #1989561] INFO -- : LC_ALL = I, [2024-05-16T20:37:38.731337 #1989561] INFO -- : LC_CTYPE = I, [2024-05-16T20:37:38.731347 #1989561] INFO -- : MFLAGS = I, [2024-05-16T20:37:38.731360 #1989561] INFO -- : RUSTC = no I, [2024-05-16T20:37:38.731370 #1989561] INFO -- : YJIT_RUSTC_ARGS = --crate-name=yjit --crate-type=staticlib --edition=2021 -g -C lto=thin -C opt-level=3 -C overflow-checks=on '--out-dir=/tmp/ruby/build/trunk/yjit/target/release/' /tmp/ruby/src/trunk/yjit/src/lib.rs I, [2024-05-16T20:37:38.731831 #1989561] INFO -- : gcc (Ubuntu 11.4.0-1ubuntu1~22.04) 11.4.0 I, [2024-05-16T20:37:38.731883 #1989561] INFO -- : Copyright (C) 2021 Free Software Foundation, Inc. I, [2024-05-16T20:37:38.731896 #1989561] INFO -- : This is free software; see the source for copying conditions. There is NO I, [2024-05-16T20:37:38.731907 #1989561] INFO -- : warranty; not even for MERCHANTABILITY or FITNESS FOR A PARTICULAR PURPOSE. I, [2024-05-16T20:37:38.731917 #1989561] INFO -- : I, [2024-05-16T20:37:38.733507 #1989561] INFO -- : generating enc.mk I, [2024-05-16T20:37:38.851117 #1989561] INFO -- : making enc I, [2024-05-16T20:37:38.868287 #1989561] INFO -- : make[1]: Entering directory '/tmp/ruby/build/trunk' I, [2024-05-16T20:37:38.868343 #1989561] INFO -- : make[1]: Nothing to be done for 'enc'. I, [2024-05-16T20:37:38.868358 #1989561] INFO -- : make[1]: Leaving directory '/tmp/ruby/build/trunk' I, [2024-05-16T20:37:38.869000 #1989561] INFO -- : making srcs under enc I, [2024-05-16T20:37:38.899019 #1989561] INFO -- : make[1]: Entering directory '/tmp/ruby/build/trunk' I, [2024-05-16T20:37:38.899083 #1989561] INFO -- : make[1]: Nothing to be done for 'srcs'. I, [2024-05-16T20:37:38.899097 #1989561] INFO -- : make[1]: Leaving directory '/tmp/ruby/build/trunk' I, [2024-05-16T20:37:38.899939 #1989561] INFO -- : generating transdb.h I, [2024-05-16T20:37:38.996055 #1989561] INFO -- : transdb.h unchanged I, [2024-05-16T20:37:38.997442 #1989561] INFO -- : making trans I, [2024-05-16T20:37:39.030712 #1989561] INFO -- : make[1]: Entering directory '/tmp/ruby/build/trunk' I, [2024-05-16T20:37:39.030782 #1989561] INFO -- : make[1]: Nothing to be done for 'trans'. I, [2024-05-16T20:37:39.030796 #1989561] INFO -- : make[1]: Leaving directory '/tmp/ruby/build/trunk' I, [2024-05-16T20:37:39.031410 #1989561] INFO -- : making encs I, [2024-05-16T20:37:39.068088 #1989561] INFO -- : make[1]: Entering directory '/tmp/ruby/build/trunk' I, [2024-05-16T20:37:39.068158 #1989561] INFO -- : make[1]: Nothing to be done for 'encs'. I, [2024-05-16T20:37:39.068172 #1989561] INFO -- : make[1]: Leaving directory '/tmp/ruby/build/trunk' I, [2024-05-16T20:37:39.069864 #1989561] INFO -- : generating makefiles ext/configure-ext.mk I, [2024-05-16T20:37:39.096413 #1989561] INFO -- : ext/configure-ext.mk updated I, [2024-05-16T20:37:39.098909 #1989561] INFO -- : make[1]: Entering directory '/tmp/ruby/build/trunk' I, [2024-05-16T20:37:40.445062 #1989561] INFO -- : make[1]: Leaving directory '/tmp/ruby/build/trunk' I, [2024-05-16T20:37:40.445853 #1989561] INFO -- : generating makefile exts.mk I, [2024-05-16T20:37:40.482217 #1989561] INFO -- : exts.mk unchanged I, [2024-05-16T20:37:40.486527 #1989561] INFO -- : make[1]: Entering directory '/tmp/ruby/build/trunk' I, [2024-05-16T20:37:40.803309 #1989561] INFO -- : make[2]: Entering directory '/tmp/ruby/build/trunk/ext/coverage' I, [2024-05-16T20:37:40.807942 #1989561] INFO -- : make[2]: Leaving directory '/tmp/ruby/build/trunk/ext/coverage' I, [2024-05-16T20:37:40.814224 #1989561] INFO -- : make[2]: Entering directory '/tmp/ruby/build/trunk/ext/date' I, [2024-05-16T20:37:40.818638 #1989561] INFO -- : make[2]: Leaving directory '/tmp/ruby/build/trunk/ext/date' I, [2024-05-16T20:37:40.822463 #1989561] INFO -- : make[2]: Entering directory '/tmp/ruby/build/trunk/ext/digest' I, [2024-05-16T20:37:40.831395 #1989561] INFO -- : make[2]: Leaving directory '/tmp/ruby/build/trunk/ext/digest' I, [2024-05-16T20:37:40.858032 #1989561] INFO -- : make[2]: Entering directory '/tmp/ruby/build/trunk/ext/digest/sha2' I, [2024-05-16T20:37:40.862522 #1989561] INFO -- : make[2]: Leaving directory '/tmp/ruby/build/trunk/ext/digest/sha2' I, [2024-05-16T20:37:40.884540 #1989561] INFO -- : make[2]: Entering directory '/tmp/ruby/build/trunk/ext/fiddle' I, [2024-05-16T20:37:40.895383 #1989561] INFO -- : make[2]: Leaving directory '/tmp/ruby/build/trunk/ext/fiddle' I, [2024-05-16T20:37:40.900501 #1989561] INFO -- : make[2]: Entering directory '/tmp/ruby/build/trunk/ext/io/console' I, [2024-05-16T20:37:40.904615 #1989561] INFO -- : make[2]: Leaving directory '/tmp/ruby/build/trunk/ext/io/console' I, [2024-05-16T20:37:40.917566 #1989561] INFO -- : make[2]: Entering directory '/tmp/ruby/build/trunk/ext/json' I, [2024-05-16T20:37:40.928173 #1989561] INFO -- : make[2]: Leaving directory '/tmp/ruby/build/trunk/ext/json' I, [2024-05-16T20:37:40.943639 #1989561] INFO -- : make[2]: Entering directory '/tmp/ruby/build/trunk/ext/monitor' I, [2024-05-16T20:37:40.947479 #1989561] INFO -- : make[2]: Leaving directory '/tmp/ruby/build/trunk/ext/monitor' I, [2024-05-16T20:37:40.954576 #1989561] INFO -- : make[2]: Entering directory '/tmp/ruby/build/trunk/ext/objspace' I, [2024-05-16T20:37:40.960726 #1989561] INFO -- : make[2]: Leaving directory '/tmp/ruby/build/trunk/ext/objspace' I, [2024-05-16T20:37:40.978868 #1989561] INFO -- : make[2]: Entering directory '/tmp/ruby/build/trunk/ext/openssl' I, [2024-05-16T20:37:40.997795 #1989561] INFO -- : make[2]: Leaving directory '/tmp/ruby/build/trunk/ext/openssl' I, [2024-05-16T20:37:41.001654 #1989561] INFO -- : make[2]: Entering directory '/tmp/ruby/build/trunk/ext/pathname' I, [2024-05-16T20:37:41.005614 #1989561] INFO -- : make[2]: Leaving directory '/tmp/ruby/build/trunk/ext/pathname' I, [2024-05-16T20:37:41.012538 #1989561] INFO -- : make[2]: Entering directory '/tmp/ruby/build/trunk/ext/psych' I, [2024-05-16T20:37:41.029542 #1989561] INFO -- : make[2]: Leaving directory '/tmp/ruby/build/trunk/ext/psych' I, [2024-05-16T20:37:41.032717 #1989561] INFO -- : make[2]: Entering directory '/tmp/ruby/build/trunk/ext/pty' I, [2024-05-16T20:37:41.035286 #1989561] INFO -- : make[2]: Leaving directory '/tmp/ruby/build/trunk/ext/pty' I, [2024-05-16T20:37:41.044830 #1989561] INFO -- : make[2]: Entering directory '/tmp/ruby/build/trunk/ext/ripper' I, [2024-05-16T20:37:41.049877 #1989561] INFO -- : make[2]: Leaving directory '/tmp/ruby/build/trunk/ext/ripper' I, [2024-05-16T20:37:41.051361 #1989561] INFO -- : make[2]: Entering directory '/tmp/ruby/build/trunk/ext/rubyvm' I, [2024-05-16T20:37:41.053395 #1989561] INFO -- : make[2]: Leaving directory '/tmp/ruby/build/trunk/ext/rubyvm' I, [2024-05-16T20:37:41.063193 #1989561] INFO -- : make[2]: Entering directory '/tmp/ruby/build/trunk/ext/socket' I, [2024-05-16T20:37:41.072649 #1989561] INFO -- : make[2]: Leaving directory '/tmp/ruby/build/trunk/ext/socket' I, [2024-05-16T20:37:41.091133 #1989561] INFO -- : make[2]: Entering directory '/tmp/ruby/build/trunk/.bundle/gems/bigdecimal-3.1.8/ext/bigdecimal' I, [2024-05-16T20:37:41.122400 #1989561] INFO -- : make[2]: Leaving directory '/tmp/ruby/build/trunk/.bundle/gems/bigdecimal-3.1.8/ext/bigdecimal' I, [2024-05-16T20:37:41.124518 #1989561] INFO -- : make[2]: Entering directory '/tmp/ruby/build/trunk/.bundle/gems/debug-1.9.2/ext/debug' I, [2024-05-16T20:37:41.146474 #1989561] INFO -- : make[2]: Leaving directory '/tmp/ruby/build/trunk/.bundle/gems/debug-1.9.2/ext/debug' I, [2024-05-16T20:37:41.148437 #1989561] INFO -- : make[2]: Entering directory '/tmp/ruby/build/trunk/.bundle/gems/nkf-0.2.0/ext/nkf' I, [2024-05-16T20:37:41.170180 #1989561] INFO -- : make[2]: Leaving directory '/tmp/ruby/build/trunk/.bundle/gems/nkf-0.2.0/ext/nkf' I, [2024-05-16T20:37:41.172385 #1989561] INFO -- : make[2]: Entering directory '/tmp/ruby/build/trunk/.bundle/gems/racc-1.7.3/ext/racc/cparse' I, [2024-05-16T20:37:41.200554 #1989561] INFO -- : make[2]: Leaving directory '/tmp/ruby/build/trunk/.bundle/gems/racc-1.7.3/ext/racc/cparse' I, [2024-05-16T20:37:41.202947 #1989561] INFO -- : make[2]: Entering directory '/tmp/ruby/build/trunk/.bundle/gems/rbs-3.4.4/ext/rbs_extension' I, [2024-05-16T20:37:41.224416 #1989561] INFO -- : make[2]: Leaving directory '/tmp/ruby/build/trunk/.bundle/gems/rbs-3.4.4/ext/rbs_extension' I, [2024-05-16T20:37:41.226509 #1989561] INFO -- : make[2]: Entering directory '/tmp/ruby/build/trunk/.bundle/gems/syslog-0.1.2/ext/syslog' I, [2024-05-16T20:37:41.248228 #1989561] INFO -- : make[2]: Leaving directory '/tmp/ruby/build/trunk/.bundle/gems/syslog-0.1.2/ext/syslog' I, [2024-05-16T20:37:41.271982 #1989561] INFO -- : make[2]: Entering directory '/tmp/ruby/build/trunk' I, [2024-05-16T20:37:41.336577 #1989561] INFO -- : make[2]: 'ruby' is up to date. I, [2024-05-16T20:37:41.336617 #1989561] INFO -- : make[2]: Leaving directory '/tmp/ruby/build/trunk' I, [2024-05-16T20:37:41.337049 #1989561] INFO -- : make[1]: Leaving directory '/tmp/ruby/build/trunk' I, [2024-05-16T20:37:41.340689 #1989561] INFO -- : make[1]: Entering directory '/tmp/ruby/build/trunk' I, [2024-05-16T20:37:41.340710 #1989561] INFO -- : make[1]: Nothing to be done for 'note'. I, [2024-05-16T20:37:41.340715 #1989561] INFO -- : make[1]: Leaving directory '/tmp/ruby/build/trunk' I, [2024-05-16T20:37:41.415732 #1989561] INFO -- : Run options: I, [2024-05-16T20:37:41.415794 #1989561] INFO -- : --seed=40887 I, [2024-05-16T20:37:41.415804 #1989561] INFO -- : "--ruby=./miniruby -I/tmp/ruby/src/trunk/lib -I. -I.ext/common /tmp/ruby/src/trunk/tool/runruby.rb --extout=.ext -- --disable-gems" I, [2024-05-16T20:37:41.415810 #1989561] INFO -- : --excludes-dir=/tmp/ruby/src/trunk/test/.excludes I, [2024-05-16T20:37:41.415814 #1989561] INFO -- : --name=!/memory_leak/ I, [2024-05-16T20:37:41.415818 #1989561] INFO -- : --stderr-on-failure I, [2024-05-16T20:37:41.415822 #1989561] INFO -- : -j20 I, [2024-05-16T20:37:41.415826 #1989561] INFO -- : I, [2024-05-16T20:37:41.415829 #1989561] INFO -- : # Running tests: I, [2024-05-16T20:37:41.415833 #1989561] INFO -- : I, [2024-05-16T20:37:41.563274 #1989561] INFO -- : [ 1/885] 2030920=test_pkcs12 I, [2024-05-16T20:37:41.563338 #1989561] INFO -- : [ 2/885] 2030921=test_system I, [2024-05-16T20:37:41.563438 #1989561] INFO -- : [ 3/885] 2030925=test_bigzero I, [2024-05-16T20:37:41.563533 #1989561] INFO -- : [ 4/885] 2030922=test_pkey_dh I, [2024-05-16T20:37:41.564008 #1989561] INFO -- : [ 5/885] 2030923=test_iseq_load I, [2024-05-16T20:37:41.567201 #1989561] INFO -- : [ 6/885] 2030924=test_gem_util I, [2024-05-16T20:37:41.567927 #1989561] INFO -- : [ 7/885] 2030939=test_gem_package_tar_header I, [2024-05-16T20:37:41.567948 #1989561] INFO -- : [ 8/885] 2030935=test_ripper I, [2024-05-16T20:37:41.567955 #1989561] INFO -- : [ 9/885] 2030936=test_gem_config_file I, [2024-05-16T20:37:41.567962 #1989561] INFO -- : [ 10/885] 2030937=test_gem_resolver_activation_request I, [2024-05-16T20:37:41.567968 #1989561] INFO -- : [ 11/885] 2030938=test_protocol I, [2024-05-16T20:37:41.570635 #1989561] INFO -- : [ 12/885] 2030925=test_getopts I, [2024-05-16T20:37:41.576920 #1989561] INFO -- : [ 13/885] 2030925=test_yjit_exit_locations I, [2024-05-16T20:37:41.578322 #1989561] INFO -- : [ 14/885] 2030925=test_etc I, [2024-05-16T20:37:41.597861 #1989561] INFO -- : [ 15/885] 2030928=test_yaml_tree I, [2024-05-16T20:37:41.597924 #1989561] INFO -- : [ 16/885] 2030930=test_gc I, [2024-05-16T20:37:41.598085 #1989561] INFO -- : [ 17/885] 2030931=test_gem_commands_fetch_command I, [2024-05-16T20:37:41.598436 #1989561] INFO -- : [ 18/885] 2030933=test_math I, [2024-05-16T20:37:41.598989 #1989561] INFO -- : [ 19/885] 2030932=test_libs I, [2024-05-16T20:37:41.600422 #1989561] INFO -- : [ 20/885] 2030926=test_config I, [2024-05-16T20:37:41.601579 #1989561] INFO -- : [ 21/885] 2030934=test_sleep I, [2024-05-16T20:37:41.604594 #1989561] INFO -- : [ 22/885] 2030930=test_autoload I, [2024-05-16T20:37:41.611906 #1989561] INFO -- : [ 23/885] 2030929=test_utf16 I, [2024-05-16T20:37:41.626196 #1989561] INFO -- : [ 24/885] 2030929=test_unicode_escape I, [2024-05-16T20:37:41.630720 #1989561] INFO -- : [ 25/885] 2030933=test_io I, [2024-05-16T20:37:41.634937 #1989561] INFO -- : [ 26/885] 2030932=test_face I, [2024-05-16T20:37:41.636270 #1989561] INFO -- : [ 27/885] 2030925=test_case I, [2024-05-16T20:37:41.638266 #1989561] INFO -- : [ 28/885] 2030927=test_sizeof I, [2024-05-16T20:37:41.656249 #1989561] INFO -- : [ 29/885] 2030928=test_rendering I, [2024-05-16T20:37:41.673626 #1989561] INFO -- : [ 30/885] 2030925=test_io_buffer I, [2024-05-16T20:37:41.684091 #1989561] INFO -- : [ 31/885] 2030932=ruby_parser_test I, [2024-05-16T20:37:41.715278 #1989561] INFO -- : [ 32/885] 2030929=test_backtrace I, [2024-05-16T20:37:41.717900 #1989561] INFO -- : [ 33/885] 2030937=test_pack I, [2024-05-16T20:37:41.724367 #1989561] INFO -- : [ 34/885] 2030922=test_rdoc_task I, [2024-05-16T20:37:41.727442 #1989561] INFO -- : [ 35/885] 2030937=test_gem_resolver_conflict I, [2024-05-16T20:37:41.728005 #1989561] INFO -- : [ 36/885] 2030932=test_rdoc_markup_indented_paragraph I, [2024-05-16T20:37:41.732286 #1989561] INFO -- : [ 37/885] 2030937=locals_test I, [2024-05-16T20:37:41.749967 #1989561] INFO -- : [ 38/885] 2030922=test_rdoc_require I, [2024-05-16T20:37:41.761165 #1989561] INFO -- : [ 39/885] 2030939=test_gem_commands_install_command I, [2024-05-16T20:37:41.776178 #1989561] INFO -- : [ 40/885] 2030925=test_clone I, [2024-05-16T20:37:41.780941 #1989561] INFO -- : [ 41/885] 2030926=test_readpartial I, [2024-05-16T20:37:41.783247 #1989561] INFO -- : [ 42/885] 2030928=test_fstring I, [2024-05-16T20:37:41.817430 #1989561] INFO -- : [ 43/885] 2030932=test_array I, [2024-05-16T20:37:41.834217 #1989561] INFO -- : [ 44/885] 2030932=test_optparse I, [2024-05-16T20:37:41.835328 #1989561] INFO -- : [ 45/885] 2030936=test_rdoc_markup_raw I, [2024-05-16T20:37:41.843261 #1989561] INFO -- : [ 46/885] 2030920=test_webauthn_poller I, [2024-05-16T20:37:41.845462 #1989561] INFO -- : [ 47/885] 2030924=test_rat I, [2024-05-16T20:37:41.849694 #1989561] INFO -- : [ 48/885] 2030924=test_typeddata I, [2024-05-16T20:37:41.888279 #1989561] INFO -- : [ 49/885] 2030938=test_gem_resolver_best_set I, [2024-05-16T20:37:41.891256 #1989561] INFO -- : [ 50/885] 2030932=encoding_test I, [2024-05-16T20:37:41.924883 #1989561] INFO -- : [ 51/885] 2030928=test_rdoc_markup_to_html_crossref I, [2024-05-16T20:37:41.952645 #1989561] INFO -- : [ 52/885] 2030922=test_files_sample I, [2024-05-16T20:37:41.959885 #1989561] INFO -- : [ 53/885] 2030936=test_stringscanner I, [2024-05-16T20:37:41.967333 #1989561] INFO -- : [ 54/885] 2030932=test_convertible I, [2024-05-16T20:37:41.967901 #1989561] INFO -- : [ 55/885] 2030935=parser_test I, [2024-05-16T20:37:41.976457 #1989561] INFO -- : [ 56/885] 2030925=test_yield I, [2024-05-16T20:37:41.980294 #1989561] INFO -- : [ 57/885] 2030931=test_rdoc_alias I, [2024-05-16T20:37:42.000717 #1989561] INFO -- : [ 58/885] 2030936=test_undef I, [2024-05-16T20:37:42.003761 #1989561] INFO -- : [ 59/885] 2030936=ripper_test I, [2024-05-16T20:37:42.011135 #1989561] INFO -- : [ 60/885] 2030937=test_objspace I, [2024-05-16T20:37:42.032714 #1989561] INFO -- : [ 61/885] 2030935=test_line_editor I, [2024-05-16T20:37:42.063957 #1989561] INFO -- : [ 62/885] 2030938=test_gem_security_trust_dir I, [2024-05-16T20:37:42.073670 #1989561] INFO -- : [ 63/885] 2030935=test_gem_requirement I, [2024-05-16T20:37:42.074004 #1989561] INFO -- : [ 64/885] 2030922=test_sprintf I, [2024-05-16T20:37:42.077759 #1989561] INFO -- : [ 65/885] 2030924=comments_test I, [2024-05-16T20:37:42.083835 #1989561] INFO -- : [ 66/885] 2030920=test_string_memory I, [2024-05-16T20:37:42.097992 #1989561] INFO -- : [ 67/885] 2030938=test_set I, [2024-05-16T20:37:42.115322 #1989561] INFO -- : [ 68/885] 2030938=test_show_source I, [2024-05-16T20:37:42.121560 #1989561] INFO -- : [ 69/885] 2030931=test_remote_fetch_error I, [2024-05-16T20:37:42.121853 #1989561] INFO -- : [ 70/885] 2030920=test_have_library I, [2024-05-16T20:37:42.137881 #1989561] INFO -- : [ 71/885] 2030931=test_gem_commands_stale_command I, [2024-05-16T20:37:42.143231 #1989561] INFO -- : [ 72/885] 2030931=test_c_struct_entry I, [2024-05-16T20:37:42.157039 #1989561] INFO -- : [ 73/885] 2030924=test_lock_native_thread I, [2024-05-16T20:37:42.185211 #1989561] INFO -- : [ 74/885] 2030926=test_external_new I, [2024-05-16T20:37:42.190734 #1989561] INFO -- : [ 75/885] 2030926=test_postponed_job I, [2024-05-16T20:37:42.232528 #1989561] INFO -- : [ 76/885] 2030938=test_alias_and_anchor I, [2024-05-16T20:37:42.241088 #1989561] INFO -- : [ 77/885] 2030938=test_hash I, [2024-05-16T20:37:42.257754 #1989561] INFO -- : [ 78/885] 2030938=test_gem_resolver_dependency_request I, [2024-05-16T20:37:42.270479 #1989561] INFO -- : [ 79/885] 2030931=test_tree_builder I, [2024-05-16T20:37:42.277584 #1989561] INFO -- : [ 80/885] 2030938=test_win32ole_typelib I, [2024-05-16T20:37:42.278586 #1989561] INFO -- : [ 81/885] 2030931=test_protect I, [2024-05-16T20:37:42.282290 #1989561] INFO -- : [ 82/885] 2030931=test_raise_exception I, [2024-05-16T20:37:42.283821 #1989561] INFO -- : [ 83/885] 2030938=test_gem_request_set_lockfile I, [2024-05-16T20:37:42.322268 #1989561] INFO -- : [ 84/885] 2030935=test_yjit I, [2024-05-16T20:37:42.327971 #1989561] INFO -- : [ 85/885] 2030935=test_workspace I, [2024-05-16T20:37:42.343566 #1989561] INFO -- : [ 86/885] 2030928=test_weakmap I, [2024-05-16T20:37:42.355091 #1989561] INFO -- : [ 87/885] 2030922=test_m17n I, [2024-05-16T20:37:42.419229 #1989561] INFO -- : [ 88/885] 2030922=test_gem_commands_environment_command I, [2024-05-16T20:37:42.420192 #1989561] INFO -- : [ 89/885] 2030924=test_ws I, [2024-05-16T20:37:42.439726 #1989561] INFO -- : [ 90/885] 2030924=test_argf I, [2024-05-16T20:37:42.472423 #1989561] INFO -- : [ 91/885] 2030935=test_framework I, [2024-05-16T20:37:42.504139 #1989561] INFO -- : [ 92/885] 2030935=test_ns_spki I, [2024-05-16T20:37:42.543587 #1989561] INFO -- : [ 93/885] 2030935=test_kill_ring I, [2024-05-16T20:37:42.551010 #1989561] INFO -- : [ 94/885] 2030935=test_summary I, [2024-05-16T20:37:42.581599 #1989561] INFO -- : [ 95/885] 2030938=test_console_attr I, [2024-05-16T20:37:42.585134 #1989561] INFO -- : [ 96/885] 2030938=test_type_completor I, [2024-05-16T20:37:42.589136 #1989561] INFO -- : [ 97/885] 2030938=warnings_test I, [2024-05-16T20:37:42.601769 #1989561] INFO -- : [ 98/885] 2030926=test_kwargs I, [2024-05-16T20:37:42.603117 #1989561] INFO -- : [ 99/885] 2030926=test_gem_commands_exec_command I, [2024-05-16T20:37:42.645600 #1989561] INFO -- : [100/885] 2030936=test_io_wait I, [2024-05-16T20:37:42.662651 #1989561] INFO -- : [101/885] 2030922=test_date_attr I, [2024-05-16T20:37:42.667437 #1989561] INFO -- : [102/885] 2030922=test_ellipsize I, [2024-05-16T20:37:42.670112 #1989561] INFO -- : [103/885] 2030921=test_io I, [2024-05-16T20:37:42.673494 #1989561] INFO -- : [104/885] 2030922=test_hash I, [2024-05-16T20:37:42.679812 #1989561] INFO -- : [105/885] 2030938=test_ubf_async_safe I, [2024-05-16T20:37:42.685811 #1989561] INFO -- : [106/885] 2030938=test_emoji I, [2024-05-16T20:37:42.688014 #1989561] INFO -- : [107/885] 2030935=test_win32ole_type_event I, [2024-05-16T20:37:42.690336 #1989561] INFO -- : [108/885] 2030935=test_sorted_set I, [2024-05-16T20:37:42.711789 #1989561] INFO -- : [109/885] 2030938=test_win32ole_record I, [2024-05-16T20:37:42.718613 #1989561] INFO -- : [110/885] 2030938=test_gem_unsatisfiable_dependency_error I, [2024-05-16T20:37:42.730713 #1989561] INFO -- : [111/885] 2030938=test_condition I, [2024-05-16T20:37:42.734567 #1989561] INFO -- : [112/885] 2030938=test_gem_source_specific_file I, [2024-05-16T20:37:42.812791 #1989561] INFO -- : [113/885] 2030938=test_foreach I, [2024-05-16T20:37:42.823500 #1989561] INFO -- : [114/885] 2030938=test_gem_commands_uninstall_command I, [2024-05-16T20:37:42.825796 #1989561] INFO -- : [115/885] 2030923=test_cp949 I, [2024-05-16T20:37:42.834164 #1989561] INFO -- : [116/885] 2030923=test_rdoc_rubygems_hook I, [2024-05-16T20:37:42.897201 #1989561] INFO -- : [117/885] 2030935=test_method I, [2024-05-16T20:37:42.924826 #1989561] INFO -- : [118/885] 2030921=test_gem_commands_query_command I, [2024-05-16T20:37:42.951666 #1989561] INFO -- : [119/885] 2030929=test_pack I, [2024-05-16T20:37:42.978204 #1989561] INFO -- : [120/885] 2030936=test_array_create I, [2024-05-16T20:37:42.981799 #1989561] INFO -- : [121/885] 2030931=test_gem_impossible_dependencies_error I, [2024-05-16T20:37:42.982893 #1989561] INFO -- : [122/885] 2030936=test_pattern_key_name_check I, [2024-05-16T20:37:42.990246 #1989561] INFO -- : [123/885] 2030931=test_to_ruby I, [2024-05-16T20:37:42.992652 #1989561] INFO -- : [124/885] 2030936=test_ftp I, [2024-05-16T20:37:43.003788 #1989561] INFO -- : [125/885] 2030931=test_euc_kr I, [2024-05-16T20:37:43.007931 #1989561] INFO -- : [126/885] 2030931=test_rdoc_context_section I, [2024-05-16T20:37:43.010600 #1989561] INFO -- : [127/885] 2030931=test_gem_installer I, [2024-05-16T20:37:43.011769 #1989561] INFO -- : [128/885] 2030936=test_yamlstore I, [2024-05-16T20:37:43.025902 #1989561] INFO -- : [129/885] 2030939=test_rdoc_parser_rd I, [2024-05-16T20:37:43.049608 #1989561] INFO -- : [130/885] 2030936=test_date_strftime I, [2024-05-16T20:37:43.060602 #1989561] INFO -- : [131/885] 2030923=test_irb I, [2024-05-16T20:37:43.073456 #1989561] INFO -- : [132/885] 2030939=test_random I, [2024-05-16T20:37:43.104235 #1989561] INFO -- : [133/885] 2030939=test_asn1 I, [2024-05-16T20:37:43.119548 #1989561] INFO -- : [134/885] 2030939=test_const I, [2024-05-16T20:37:43.120974 #1989561] INFO -- : [135/885] 2030939=test_class I, [2024-05-16T20:37:43.179417 #1989561] INFO -- : [136/885] 2030929=test_rdoc_normal_class I, [2024-05-16T20:37:43.289347 #1989561] INFO -- : [137/885] 2030920=test_load I, [2024-05-16T20:37:43.300181 #1989561] INFO -- : [138/885] 2030920=json_string_matching_test I, [2024-05-16T20:37:43.313612 #1989561] INFO -- : [139/885] 2030920=parse_comments_test I, [2024-05-16T20:37:43.383113 #1989561] INFO -- : [140/885] 2030929=test_noarg I, [2024-05-16T20:37:43.384841 #1989561] INFO -- : [141/885] 2030920=test_tempfile I, [2024-05-16T20:37:43.421388 #1989561] INFO -- : [142/885] 2030926=test_queue I, [2024-05-16T20:37:43.423336 #1989561] INFO -- : [143/885] 2030923=test_function I, [2024-05-16T20:37:43.432594 #1989561] INFO -- : [144/885] 2030926=test_gem_resolver_index_specification I, [2024-05-16T20:37:43.461985 #1989561] INFO -- : [145/885] 2030926=test_internal_ivar I, [2024-05-16T20:37:43.476698 #1989561] INFO -- : [146/885] 2030926=test_rdoc_markup I, [2024-05-16T20:37:43.539156 #1989561] INFO -- : [147/885] 2030921=test_gem_commands_help_command I, [2024-05-16T20:37:43.587161 #1989561] INFO -- : [148/885] 2030929=test_tracepoint I, [2024-05-16T20:37:43.592619 #1989561] INFO -- : [149/885] 2030926=test_prettyprint I, [2024-05-16T20:37:43.604305 #1989561] INFO -- : [150/885] 2030926=test_basicsocket I, [2024-05-16T20:37:43.605473 #1989561] INFO -- : [151/885] 2030921=test_utf32 I, [2024-05-16T20:37:43.611343 #1989561] INFO -- : [152/885] 2030926=test_duplicate I, [2024-05-16T20:37:43.613958 #1989561] INFO -- : [153/885] 2030921=test_too_many_dummy_encodings I, [2024-05-16T20:37:43.624113 #1989561] INFO -- : [154/885] 2030926=test_stack I, [2024-05-16T20:37:43.636771 #1989561] INFO -- : [155/885] 2030938=test_gem_commands_list_command I, [2024-05-16T20:37:43.647994 #1989561] INFO -- : [156/885] 2030938=test_reqarg I, [2024-05-16T20:37:43.657859 #1989561] INFO -- : [157/885] 2030923=test_rdoc_include I, [2024-05-16T20:37:43.660616 #1989561] INFO -- : [158/885] 2030934=test_resource I, [2024-05-16T20:37:43.690054 #1989561] INFO -- : [159/885] 2030934=test_gem_commands_signin_command I, [2024-05-16T20:37:43.695709 #1989561] INFO -- : [160/885] 2030921=test_emitter I, [2024-05-16T20:37:43.698403 #1989561] INFO -- : [161/885] 2030920=test_ldap I, [2024-05-16T20:37:43.705302 #1989561] INFO -- : [162/885] 2030921=test_fileutils I, [2024-05-16T20:37:43.710523 #1989561] INFO -- : [163/885] 2030923=test_string_processing I, [2024-05-16T20:37:43.715096 #1989561] INFO -- : [164/885] 2030923=test_rdoc_options I, [2024-05-16T20:37:43.721214 #1989561] INFO -- : [165/885] 2030920=test_cesu8 I, [2024-05-16T20:37:43.722658 #1989561] INFO -- : [166/885] 2030936=test_econv I, [2024-05-16T20:37:43.723943 #1989561] INFO -- : [167/885] 2030920=test_gem_version I, [2024-05-16T20:37:43.810359 #1989561] INFO -- : [168/885] 2030920=test_gem_dependency I, [2024-05-16T20:37:43.824171 #1989561] INFO -- : [169/885] 2030929=test_gem_resolver_specification I, [2024-05-16T20:37:43.955297 #1989561] INFO -- : [170/885] 2030934=test_path_to_class I, [2024-05-16T20:37:43.956979 #1989561] INFO -- : [171/885] 2030920=test_rdoc_markup_verbatim I, [2024-05-16T20:37:43.958809 #1989561] INFO -- : [172/885] 2030934=test_inlinecache I, [2024-05-16T20:37:43.969435 #1989561] INFO -- : [173/885] 2030923=test_gem_commands_search_command I, [2024-05-16T20:37:44.009708 #1989561] INFO -- : [174/885] 2030934=test_complex I, [2024-05-16T20:37:44.034533 #1989561] INFO -- : [175/885] 2030929=test_gem_ext_ext_conf_builder I, [2024-05-16T20:37:44.066208 #1989561] INFO -- : [176/885] 2030938=test_method_cache I, [2024-05-16T20:37:44.069951 #1989561] INFO -- : [177/885] 2030938=test_gem_stub_specification I, [2024-05-16T20:37:44.095192 #1989561] INFO -- : [178/885] 2030920=test_frozen_error I, [2024-05-16T20:37:44.099651 #1989561] INFO -- : [179/885] 2030920=test_gem_resolver_installed_specification I, [2024-05-16T20:37:44.143233 #1989561] INFO -- : [180/885] 2030934=test_scanner_events I, [2024-05-16T20:37:44.144358 #1989561] INFO -- : [181/885] 2030920=test_gem_remote_fetcher I, [2024-05-16T20:37:44.167024 #1989561] INFO -- : [182/885] 2030921=test_mdns I, [2024-05-16T20:37:44.176999 #1989561] INFO -- : [183/885] 2030921=test_parse I, [2024-05-16T20:37:44.180839 #1989561] INFO -- : [184/885] 2030923=test_handle I, [2024-05-16T20:37:44.190968 #1989561] INFO -- : [185/885] 2030925=test_wait I, [2024-05-16T20:37:44.227890 #1989561] INFO -- : [186/885] 2030934=test_yaml I, [2024-05-16T20:37:44.233762 #1989561] INFO -- : [187/885] 2030938=test_forwardable I, [2024-05-16T20:37:44.245460 #1989561] INFO -- : [188/885] 2030925=test_big2str I, [2024-05-16T20:37:44.251667 #1989561] INFO -- : [189/885] 2030925=test_ansi_without_terminfo I, [2024-05-16T20:37:44.258351 #1989561] INFO -- : [190/885] 2030938=test_gem_commands_sources_command I, [2024-05-16T20:37:44.340878 #1989561] INFO -- : [191/885] 2030925=test_bmethod I, [2024-05-16T20:37:44.345092 #1989561] INFO -- : [192/885] 2030925=test_euc_tw I, [2024-05-16T20:37:44.348701 #1989561] INFO -- : [193/885] 2030925=test_ractor I, [2024-05-16T20:37:44.350144 #1989561] INFO -- : [194/885] 2030934=test_rdoc_markup_formatter I, [2024-05-16T20:37:44.369090 #1989561] INFO -- : [195/885] 2030925=test_nowrite I, [2024-05-16T20:37:44.382187 #1989561] INFO -- : [196/885] 2030925=test_thread_queue I, [2024-05-16T20:37:44.384864 #1989561] INFO -- : [197/885] 2030928=test_rdoc_parser_c I, [2024-05-16T20:37:44.452090 #1989561] INFO -- : [198/885] 2030938=test_comparable I, [2024-05-16T20:37:44.459460 #1989561] INFO -- : [199/885] 2030938=json_fixtures_test I, [2024-05-16T20:37:44.469633 #1989561] INFO -- : [200/885] 2030934=test_shapes I, [2024-05-16T20:37:44.478693 #1989561] INFO -- : [201/885] 2030938=test_io_timeout I, [2024-05-16T20:37:44.483191 #1989561] INFO -- : [202/885] 2030938=test_profile_frames I, [2024-05-16T20:37:44.483424 #1989561] INFO -- : [203/885] 2030934=test_cstr I, [2024-05-16T20:37:44.487082 #1989561] INFO -- : [204/885] 2030923=test_pstore I, [2024-05-16T20:37:44.537156 #1989561] INFO -- : [205/885] 2030923=test_enc_str_buf_cat I, [2024-05-16T20:37:44.539474 #1989561] INFO -- : [206/885] 2030928=test_gbk I, [2024-05-16T20:37:44.540311 #1989561] INFO -- : [207/885] 2030928=test_class2name I, [2024-05-16T20:37:44.543782 #1989561] INFO -- : [208/885] 2030923=test_cgi_util I, [2024-05-16T20:37:44.548821 #1989561] INFO -- : [209/885] 2030928=test_require I, [2024-05-16T20:37:44.557843 #1989561] INFO -- : [210/885] 2030926=test_gem_ext_cmake_builder I, [2024-05-16T20:37:44.565756 #1989561] INFO -- : [211/885] 2030926=test_gem_commands_contents_command I, [2024-05-16T20:37:44.637264 #1989561] INFO -- : [212/885] 2030926=test_digest I, [2024-05-16T20:37:44.675169 #1989561] INFO -- : [213/885] 2030938=test_marshalable I, [2024-05-16T20:37:44.681908 #1989561] INFO -- : [214/885] 2030938=test_find I, [2024-05-16T20:37:44.706727 #1989561] INFO -- : [215/885] 2030938=test_ractor I, [2024-05-16T20:37:44.729024 #1989561] INFO -- : [216/885] 2030921=test_wss I, [2024-05-16T20:37:44.747852 #1989561] INFO -- : [217/885] 2030921=test_fiddle I, [2024-05-16T20:37:44.748463 #1989561] INFO -- : [218/885] 2030927=test_file I, [2024-05-16T20:37:44.753367 #1989561] INFO -- : [219/885] 2030923=test_gem_available_set I, [2024-05-16T20:37:44.767258 #1989561] INFO -- : [220/885] 2030927=test_rdoc_markdown I, [2024-05-16T20:37:44.797214 #1989561] INFO -- : [221/885] 2030938=test_modify_expand I, [2024-05-16T20:37:44.797873 #1989561] INFO -- : [222/885] 2030938=test_rdoc_any_method I, [2024-05-16T20:37:44.799772 #1989561] INFO -- : [223/885] 2030921=test_init I, [2024-05-16T20:37:44.853360 #1989561] INFO -- : [224/885] 2030936=test_complexrational I, [2024-05-16T20:37:44.858433 #1989561] INFO -- : [225/885] 2030936=test_pathname I, [2024-05-16T20:37:44.870058 #1989561] INFO -- : [226/885] 2030923=test_coverage I, [2024-05-16T20:37:45.022675 #1989561] INFO -- : [227/885] 2030934=test_rdoc_encoding I, [2024-05-16T20:37:45.042825 #1989561] INFO -- : [228/885] 2030927=test_gem_package_tar_reader I, [2024-05-16T20:37:45.053684 #1989561] INFO -- : [229/885] 2030934=regexp_test I, [2024-05-16T20:37:45.104129 #1989561] INFO -- : [230/885] 2030936=test_gem_commands_owner_command I, [2024-05-16T20:37:45.151279 #1989561] INFO -- : [231/885] 2030934=test_gem_source_vendor I, [2024-05-16T20:37:45.157521 #1989561] INFO -- : [232/885] 2030934=test_recorder I, [2024-05-16T20:37:45.160773 #1989561] INFO -- : [233/885] 2030939=test_formatter I, [2024-05-16T20:37:45.161200 #1989561] INFO -- : [234/885] 2030934=test_bash_completion I, [2024-05-16T20:37:45.165460 #1989561] INFO -- : [235/885] 2030939=test_rdoc_constant I, [2024-05-16T20:37:45.174626 #1989561] INFO -- : [236/885] 2030934=test_deprecate I, [2024-05-16T20:37:45.206032 #1989561] INFO -- : [237/885] 2030934=test_rdoc_cross_reference I, [2024-05-16T20:37:45.211390 #1989561] INFO -- : [238/885] 2030927=test_gem_commands_info_command I, [2024-05-16T20:37:45.234757 #1989561] INFO -- : [239/885] 2030921=test_gem_dependency_installer I, [2024-05-16T20:37:45.241213 #1989561] INFO -- : [240/885] 2030927=test_scalar I, [2024-05-16T20:37:45.243581 #1989561] INFO -- : [241/885] 2030927=test_case_options I, [2024-05-16T20:37:45.245239 #1989561] INFO -- : [242/885] 2030939=test_store I, [2024-05-16T20:37:45.248654 #1989561] INFO -- : [243/885] 2030927=test_exception I, [2024-05-16T20:37:45.296676 #1989561] INFO -- : [244/885] 2030929=test_bug_reporter I, [2024-05-16T20:37:45.342538 #1989561] INFO -- : [245/885] 2030939=test_gem_name_tuple I, [2024-05-16T20:37:45.358025 #1989561] INFO -- : [246/885] 2030939=test_gem_package_tar_reader_entry I, [2024-05-16T20:37:45.376253 #1989561] INFO -- : [247/885] 2030938=test_rand I, [2024-05-16T20:37:45.379455 #1989561] INFO -- : [248/885] 2030926=test_gem_ext_cargo_builder_link_flag_converter I, [2024-05-16T20:37:45.430081 #1989561] INFO -- : [249/885] 2030926=test_gem_commands_mirror I, [2024-05-16T20:37:45.439988 #1989561] INFO -- : [250/885] 2030926=test_gem_request I, [2024-05-16T20:37:45.509863 #1989561] INFO -- : [251/885] 2030939=test_method_cache I, [2024-05-16T20:37:45.511982 #1989561] INFO -- : [252/885] 2030939=test_sprintf_comb I, [2024-05-16T20:37:45.634191 #1989561] INFO -- : [253/885] 2030923=test_win32ole I, [2024-05-16T20:37:45.634967 #1989561] INFO -- : [254/885] 2030929=test_generic I, [2024-05-16T20:37:45.636779 #1989561] INFO -- : [255/885] 2030926=test_scan_args I, [2024-05-16T20:37:45.644627 #1989561] INFO -- : [256/885] 2030938=test_enumerator_kw I, [2024-05-16T20:37:45.648056 #1989561] INFO -- : [257/885] 2030938=test_settracefunc I, [2024-05-16T20:37:45.650351 #1989561] INFO -- : [258/885] 2030926=test_gem_text I, [2024-05-16T20:37:45.650411 #1989561] INFO -- : [259/885] 2030923=test_pkey I, [2024-05-16T20:37:45.685190 #1989561] INFO -- : [260/885] 2030939=test_case I, [2024-05-16T20:37:45.685891 #1989561] INFO -- : [261/885] 2030939=test_reline I, [2024-05-16T20:37:45.693320 #1989561] INFO -- : [262/885] 2030936=test_parser_events I, [2024-05-16T20:37:45.693873 #1989561] INFO -- : [263/885] 2030929=test_cclass I, [2024-05-16T20:37:45.701924 #1989561] INFO -- : [264/885] 2030923=test_grapheme_breaks I, [2024-05-16T20:37:45.704204 #1989561] INFO -- : [265/885] 2030926=test_gem_version_option I, [2024-05-16T20:37:45.725412 #1989561] INFO -- : [266/885] 2030923=test_gem_request_connection_pools I, [2024-05-16T20:37:45.749685 #1989561] INFO -- : [267/885] 2030926=test_memory_view I, [2024-05-16T20:37:45.762814 #1989561] INFO -- : [268/885] 2030929=test_m17n_comb I, [2024-05-16T20:37:45.780547 #1989561] INFO -- : [269/885] 2030934=test_ractor I, [2024-05-16T20:37:45.792010 #1989561] INFO -- : [270/885] 2030936=test_ansi_with_terminfo I, [2024-05-16T20:37:45.848558 #1989561] INFO -- : [271/885] 2030936=test_rdoc_generator_pot_po I, [2024-05-16T20:37:45.855805 #1989561] INFO -- : [272/885] 2030936=test_rdoc_markup_to_markdown I, [2024-05-16T20:37:45.860457 #1989561] INFO -- : [273/885] 2030934=test_json_tree I, [2024-05-16T20:37:45.865645 #1989561] INFO -- : [274/885] 2030934=test_severity I, [2024-05-16T20:37:45.875480 #1989561] INFO -- : [275/885] 2030934=test_ractor I, [2024-05-16T20:37:45.891010 #1989561] INFO -- : [276/885] 2030934=parse_test I, [2024-05-16T20:37:45.903500 #1989561] INFO -- : [277/885] 2030926=test_gem_install_update_options I, [2024-05-16T20:37:45.906529 #1989561] INFO -- : [278/885] 2030936=test_require_lib I, [2024-05-16T20:37:45.957190 #1989561] INFO -- : [279/885] 2030939=test_rdoc_generator_ri I, [2024-05-16T20:37:45.962696 #1989561] INFO -- : [280/885] 2030939=test_extlibs I, [2024-05-16T20:37:45.996650 #1989561] INFO -- : [281/885] 2030928=test_gem_stream_ui I, [2024-05-16T20:37:46.025843 #1989561] INFO -- : [282/885] 2030926=test_literal I, [2024-05-16T20:37:46.059041 #1989561] INFO -- : [283/885] 2030928=test_c_struct_builder I, [2024-05-16T20:37:46.134556 #1989561] INFO -- : [284/885] 2030920=test_dot_dot I, [2024-05-16T20:37:46.137221 #1989561] INFO -- : [285/885] 2030920=test_str2big I, [2024-05-16T20:37:46.140255 #1989561] INFO -- : [286/885] 2030928=test_rdoc_markup_to_table_of_contents I, [2024-05-16T20:37:46.142543 #1989561] INFO -- : [287/885] 2030920=test_objectspace I, [2024-05-16T20:37:46.152788 #1989561] INFO -- : [288/885] 2030922=test_socket I, [2024-05-16T20:37:46.160620 #1989561] INFO -- : [289/885] 2030928=test_thread I, [2024-05-16T20:37:46.301572 #1989561] INFO -- : [290/885] 2030924=test_securerandom I, [2024-05-16T20:37:46.349854 #1989561] INFO -- : [291/885] 2030924=test_logperiod I, [2024-05-16T20:37:46.364516 #1989561] INFO -- : [292/885] 2030924=test_rdoc_markdown_test I, [2024-05-16T20:37:46.384876 #1989561] INFO -- : [293/885] 2030928=test_rdoc_normal_module I, [2024-05-16T20:37:46.409304 #1989561] INFO -- : [294/885] 2030935=test_c_union_entity I, [2024-05-16T20:37:46.417381 #1989561] INFO -- : [295/885] 2030928=test_io_console I, [2024-05-16T20:37:46.436815 #1989561] INFO -- : [296/885] 2030930=test_singleton I, [2024-05-16T20:37:46.443107 #1989561] INFO -- : [297/885] 2030930=test_flush I, [2024-05-16T20:37:46.443962 #1989561] INFO -- : [298/885] 2030930=test_switch_hitter I, [2024-05-16T20:37:46.457697 #1989561] INFO -- : [299/885] 2030935=newline_test I, [2024-05-16T20:37:46.459489 #1989561] INFO -- : [300/885] 2030926=test_uncorrectable_name_check I, [2024-05-16T20:37:46.462314 #1989561] INFO -- : [301/885] 2030930=test_stringchar I, [2024-05-16T20:37:46.465442 #1989561] INFO -- : [302/885] 2030932=test_hash_create I, [2024-05-16T20:37:46.471849 #1989561] INFO -- : [303/885] 2030932=test_passing_block I, [2024-05-16T20:37:46.474691 #1989561] INFO -- : [304/885] 2030932=test_thread_fd_close I, [2024-05-16T20:37:46.477395 #1989561] INFO -- : [305/885] 2030932=test_process I, [2024-05-16T20:37:46.481319 #1989561] INFO -- : [306/885] 2030926=test_last_thread I, [2024-05-16T20:37:46.502068 #1989561] INFO -- : [307/885] 2030935=test_pack I, [2024-05-16T20:37:46.538281 #1989561] INFO -- : [308/885] 2030930=test_gem_security_policy I, [2024-05-16T20:37:46.559096 #1989561] INFO -- : [309/885] 2030938=test_gem_source_local I, [2024-05-16T20:37:46.650141 #1989561] INFO -- : [310/885] 2030935=test_gem_ext_rake_builder I, [2024-05-16T20:37:46.754848 #1989561] INFO -- : [311/885] 2030923=test_arity I, [2024-05-16T20:37:46.758137 #1989561] INFO -- : [312/885] 2030923=test_logdevice I, [2024-05-16T20:37:46.809750 #1989561] INFO -- : [313/885] 2030938=test_gem_resolver_lock_specification I, [2024-05-16T20:37:46.848663 #1989561] INFO -- : [314/885] 2030938=test_err_in_callback I, [2024-05-16T20:37:46.854893 #1989561] INFO -- : [315/885] 2030938=test_x509cert I, [2024-05-16T20:37:46.907775 #1989561] INFO -- : [316/885] 2030930=test_gc I, [2024-05-16T20:37:46.962218 #1989561] INFO -- : [317/885] 2030920=test_http I, [2024-05-16T20:37:46.969584 #1989561] INFO -- : [318/885] 2030920=test_shift_jis I, [2024-05-16T20:37:46.973356 #1989561] INFO -- : [319/885] 2030920=test_gem_commands_which_command I, [2024-05-16T20:37:46.998175 #1989561] INFO -- : [320/885] 2030920=test_inadvertent_creation I, [2024-05-16T20:37:47.023244 #1989561] INFO -- : [321/885] 2030927=test_flags I, [2024-05-16T20:37:47.112272 #1989561] INFO -- : [322/885] 2030938=test_enumerator I, [2024-05-16T20:37:47.129617 #1989561] INFO -- : [323/885] 2030920=test_gem_commands_specification_command I, [2024-05-16T20:37:47.260728 #1989561] INFO -- : [324/885] 2030920=test_gem_commands_dependency_command I, [2024-05-16T20:37:47.303054 #1989561] INFO -- : [325/885] 2030921=test_gem_resolver I, [2024-05-16T20:37:47.304116 #1989561] INFO -- : [326/885] 2030929=test_gem_resolver_composed_set I, [2024-05-16T20:37:47.311286 #1989561] INFO -- : [327/885] 2030935=test_safe_load I, [2024-05-16T20:37:47.312339 #1989561] INFO -- : [328/885] 2030929=test_name_error I, [2024-05-16T20:37:47.322532 #1989561] INFO -- : [329/885] 2030935=test_rdoc_markup_attribute_manager I, [2024-05-16T20:37:47.348191 #1989561] INFO -- : [330/885] 2030920=test_open-uri I, [2024-05-16T20:37:47.348525 #1989561] INFO -- : [331/885] 2030922=test_httpresponse I, [2024-05-16T20:37:47.375894 #1989561] INFO -- : [332/885] 2030929=test_rdoc_parser_ruby I, [2024-05-16T20:37:47.382496 #1989561] INFO -- : [333/885] 2030924=test_rdoc_context I, [2024-05-16T20:37:47.433600 #1989561] INFO -- : [334/885] 2030922=test_nil2vtempty I, [2024-05-16T20:37:47.436562 #1989561] INFO -- : [335/885] 2030922=test_stream I, [2024-05-16T20:37:47.464250 #1989561] INFO -- : [336/885] 2030922=test_tcp I, [2024-05-16T20:37:47.478680 #1989561] INFO -- : [337/885] 2030921=test_iso_8859 I, [2024-05-16T20:37:47.507227 #1989561] INFO -- : [338/885] 2030922=test_rdoc_text I, [2024-05-16T20:37:47.512979 #1989561] INFO -- : [339/885] 2030921=test_syntax I, [2024-05-16T20:37:47.524588 #1989561] INFO -- : [340/885] 2030926=test_gem_safe_yaml I, [2024-05-16T20:37:47.532674 #1989561] INFO -- : [341/885] 2030926=test_rdoc_markup_to_joined_paragraph I, [2024-05-16T20:37:47.534828 #1989561] INFO -- : [342/885] 2030926=test_date_time I, [2024-05-16T20:37:47.536466 #1989561] INFO -- : [343/885] 2030923=test_require I, [2024-05-16T20:37:47.539425 #1989561] INFO -- : [344/885] 2030931=test_date_new I, [2024-05-16T20:37:47.539484 #1989561] INFO -- : [345/885] 2030923=index_write_test I, [2024-05-16T20:37:47.542889 #1989561] INFO -- : [346/885] 2030935=test_data I, [2024-05-16T20:37:47.545303 #1989561] INFO -- : [347/885] 2030926=test_bug-5832 I, [2024-05-16T20:37:47.550663 #1989561] INFO -- : [348/885] 2030926=test_files_ext I, [2024-05-16T20:37:47.552350 #1989561] INFO -- : [349/885] 2030931=test_emitter I, [2024-05-16T20:37:47.553243 #1989561] INFO -- : [350/885] 2030935=test_gem_silent_ui I, [2024-05-16T20:37:47.555926 #1989561] INFO -- : [351/885] 2030922=test_kdf I, [2024-05-16T20:37:47.560160 #1989561] INFO -- : [352/885] 2030931=test_gem_doctor I, [2024-05-16T20:37:47.584603 #1989561] INFO -- : [353/885] 2030935=test_kernel I, [2024-05-16T20:37:47.588079 #1989561] INFO -- : [354/885] 2030931=dispatcher_test I, [2024-05-16T20:37:47.632250 #1989561] INFO -- : [355/885] 2030922=test_eval_history I, [2024-05-16T20:37:47.637165 #1989561] INFO -- : [356/885] 2030923=!Nothing_to_test I, [2024-05-16T20:37:47.639820 #1989561] INFO -- : [357/885] 2030923=test_psych I, [2024-05-16T20:37:47.667720 #1989561] INFO -- : [358/885] 2030931=test_enc_raise I, [2024-05-16T20:37:47.674332 #1989561] INFO -- : [359/885] 2030923=test_rdoc_markup_paragraph I, [2024-05-16T20:37:47.676620 #1989561] INFO -- : [360/885] 2030931=test_object_create_start I, [2024-05-16T20:37:47.677403 #1989561] INFO -- : [361/885] 2030923=test_date I, [2024-05-16T20:37:47.679447 #1989561] INFO -- : [362/885] 2030926=test_gem_rdoc I, [2024-05-16T20:37:47.679505 #1989561] INFO -- : [363/885] 2030931=test_gem_ext_cargo_builder_unit I, [2024-05-16T20:37:47.689490 #1989561] INFO -- : [364/885] 2030923=test_command I, [2024-05-16T20:37:47.704739 #1989561] INFO -- : [365/885] 2030931=test_at_exit I, [2024-05-16T20:37:47.721545 #1989561] INFO -- : [366/885] 2030931=test_rdoc_markup_to_tt_only I, [2024-05-16T20:37:47.750958 #1989561] INFO -- : [367/885] 2030931=test_hmac I, [2024-05-16T20:37:47.755317 #1989561] INFO -- : [368/885] 2030920=test_rdoc_tom_doc I, [2024-05-16T20:37:47.761059 #1989561] INFO -- : [369/885] 2030931=test_numeric I, [2024-05-16T20:37:47.762979 #1989561] INFO -- : [370/885] 2030922=test_gem_commands_lock_command I, [2024-05-16T20:37:47.768455 #1989561] INFO -- : [371/885] 2030939=test_ifunless I, [2024-05-16T20:37:47.770942 #1989561] INFO -- : [372/885] 2030939=test_assignment I, [2024-05-16T20:37:47.774323 #1989561] INFO -- : [373/885] 2030920=test_key_actor_vi I, [2024-05-16T20:37:47.786503 #1989561] INFO -- : [374/885] 2030922=test_bug-3571 I, [2024-05-16T20:37:47.797461 #1989561] INFO -- : [375/885] 2030922=test_gem_command I, [2024-05-16T20:37:47.810678 #1989561] INFO -- : [376/885] 2030926=test_gem_spec_fetcher I, [2024-05-16T20:37:47.828273 #1989561] INFO -- : [377/885] 2030933=test_common I, [2024-05-16T20:37:47.831098 #1989561] INFO -- : [378/885] 2030931=test_rdoc_token_stream I, [2024-05-16T20:37:47.835629 #1989561] INFO -- : [379/885] 2030931=test_address_resolve I, [2024-05-16T20:37:47.852510 #1989561] INFO -- : [380/885] 2030931=test_gem_source_list I, [2024-05-16T20:37:47.860800 #1989561] INFO -- : [381/885] 2030922=test_yaml_special_cases I, [2024-05-16T20:37:47.868308 #1989561] INFO -- : [382/885] 2030922=test_optarg I, [2024-05-16T20:37:47.893237 #1989561] INFO -- : [383/885] 2030931=test_config I, [2024-05-16T20:37:47.919246 #1989561] INFO -- : [384/885] 2030920=test_num2int I, [2024-05-16T20:37:47.928653 #1989561] INFO -- : [385/885] 2030920=test_nil I, [2024-05-16T20:37:47.928720 #1989561] INFO -- : [386/885] 2030929=test_rdoc_single_class I, [2024-05-16T20:37:47.933171 #1989561] INFO -- : [387/885] 2030929=test_verbose I, [2024-05-16T20:37:47.935757 #1989561] INFO -- : [388/885] 2030920=test_pp I, [2024-05-16T20:37:47.953926 #1989561] INFO -- : [389/885] 2030929=test_gem_ext_configure_builder I, [2024-05-16T20:37:47.963109 #1989561] INFO -- : [390/885] 2030923=test_frozen I, [2024-05-16T20:37:47.965917 #1989561] INFO -- : [391/885] 2030931=test_macro I, [2024-05-16T20:37:47.966508 #1989561] INFO -- : [392/885] 2030923=test_iter_break I, [2024-05-16T20:37:47.967765 #1989561] INFO -- : [393/885] 2030924=test_exception I, [2024-05-16T20:37:47.968834 #1989561] INFO -- : [394/885] 2030931=test_zsh_completion I, [2024-05-16T20:37:47.970060 #1989561] INFO -- : [395/885] 2030923=test_egrep_cpp I, [2024-05-16T20:37:47.972239 #1989561] INFO -- : [396/885] 2030931=test_cgi_tag_helper I, [2024-05-16T20:37:47.977263 #1989561] INFO -- : [397/885] 2030920=test_zlib I, [2024-05-16T20:37:47.985741 #1989561] INFO -- : [398/885] 2030926=test_optimization I, [2024-05-16T20:37:47.988544 #1989561] INFO -- : [399/885] 2030924=test_date_conv I, [2024-05-16T20:37:47.994754 #1989561] INFO -- : [400/885] 2030929=test_ole_methods I, [2024-05-16T20:37:47.994828 #1989561] INFO -- : [401/885] 2030929=test_erb_m17n I, [2024-05-16T20:37:47.996740 #1989561] INFO -- : [402/885] 2030931=test_proc I, [2024-05-16T20:37:47.998158 #1989561] INFO -- : [403/885] 2030924=test_string I, [2024-05-16T20:37:48.000492 #1989561] INFO -- : [404/885] 2030922=test_gc_compact I, [2024-05-16T20:37:48.001786 #1989561] INFO -- : [405/885] 2030929=test_gem_package_old I, [2024-05-16T20:37:48.021377 #1989561] INFO -- : [406/885] 2030933=test_gem_resolver_index_set I, [2024-05-16T20:37:48.036457 #1989561] INFO -- : [407/885] 2030929=test_gem_validator I, [2024-05-16T20:37:48.039330 #1989561] INFO -- : [408/885] 2030927=test_folderitem2_invokeverb I, [2024-05-16T20:37:48.044132 #1989561] INFO -- : [409/885] 2030927=test_require_path_check I, [2024-05-16T20:37:48.054437 #1989561] INFO -- : [410/885] 2030929=test_rdoc_markup_parser I, [2024-05-16T20:37:48.086895 #1989561] INFO -- : [411/885] 2030935=test_files_test_2 I, [2024-05-16T20:37:48.089880 #1989561] INFO -- : [412/885] 2030929=test_fnmatch I, [2024-05-16T20:37:48.102741 #1989561] INFO -- : [413/885] 2030927=test_pattern_matching I, [2024-05-16T20:37:48.127845 #1989561] INFO -- : [414/885] 2030927=test_rdoc_stats I, [2024-05-16T20:37:48.128988 #1989561] INFO -- : [415/885] 2030929=test_string I, [2024-05-16T20:37:48.144719 #1989561] INFO -- : [416/885] 2030929=test_rdoc_store I, [2024-05-16T20:37:48.150442 #1989561] INFO -- : [417/885] 2030923=test_raise I, [2024-05-16T20:37:48.154735 #1989561] INFO -- : [418/885] 2030923=test_x509attr I, [2024-05-16T20:37:48.158244 #1989561] INFO -- : [419/885] 2030923=test_gem_request_set_lockfile_parser I, [2024-05-16T20:37:48.186592 #1989561] INFO -- : [420/885] 2030927=test_depth_first I, [2024-05-16T20:37:48.189922 #1989561] INFO -- : [421/885] 2030933=json_addition_test I, [2024-05-16T20:37:48.192994 #1989561] INFO -- : [422/885] 2030927=test_custom_command I, [2024-05-16T20:37:48.223328 #1989561] INFO -- : [423/885] 2030933=test_rdoc_parser I, [2024-05-16T20:37:48.246110 #1989561] INFO -- : [424/885] 2030923=test_qsort I, [2024-05-16T20:37:48.252032 #1989561] INFO -- : [425/885] 2030923=test_gem_dependency_resolution_error I, [2024-05-16T20:37:48.260267 #1989561] INFO -- : [426/885] 2030923=test_mul I, [2024-05-16T20:37:48.267393 #1989561] INFO -- : [427/885] 2030923=test_win32ole_type I, [2024-05-16T20:37:48.268521 #1989561] INFO -- : [428/885] 2030923=test_null I, [2024-05-16T20:37:48.272522 #1989561] INFO -- : [429/885] 2030923=test_default_gems I, [2024-05-16T20:37:48.285236 #1989561] INFO -- : [430/885] 2030927=test_rdoc_rd_inline_parser I, [2024-05-16T20:37:48.318686 #1989561] INFO -- : [431/885] 2030927=test_rdoc_markup_to_rdoc I, [2024-05-16T20:37:48.320435 #1989561] INFO -- : [432/885] 2030923=test_rdoc_markup_attributes I, [2024-05-16T20:37:48.326152 #1989561] INFO -- : [433/885] 2030923=test_date_parse I, [2024-05-16T20:37:48.353536 #1989561] INFO -- : [434/885] 2030927=test_pipe I, [2024-05-16T20:37:48.435169 #1989561] INFO -- : [435/885] 2030923=test_trick I, [2024-05-16T20:37:48.467523 #1989561] INFO -- : [436/885] 2030933=test_thread I, [2024-05-16T20:37:48.470051 #1989561] INFO -- : [437/885] 2030933=test_pkey_ec I, [2024-05-16T20:37:48.480027 #1989561] INFO -- : [438/885] 2030927=test_defined I, [2024-05-16T20:37:48.555563 #1989561] INFO -- : [439/885] 2030933=test_backtrace I, [2024-05-16T20:37:48.559992 #1989561] INFO -- : [440/885] 2030933=test_key_name_check I, [2024-05-16T20:37:48.569652 #1989561] INFO -- : [441/885] 2030927=test_io_buffer I, [2024-05-16T20:37:48.571077 #1989561] INFO -- : [442/885] 2030933=test_rdoc_i18n_text I, [2024-05-16T20:37:48.580361 #1989561] INFO -- : [443/885] 2030933=test_windows_1251 I, [2024-05-16T20:37:48.583852 #1989561] INFO -- : [444/885] 2030933=test_time I, [2024-05-16T20:37:48.615865 #1989561] INFO -- : [445/885] 2030927=test_rdoc_rdoc I, [2024-05-16T20:37:48.654216 #1989561] INFO -- : [446/885] 2030929=test_gem_uninstaller I, [2024-05-16T20:37:48.685904 #1989561] INFO -- : [447/885] 2030934=test_gb18030 I, [2024-05-16T20:37:48.689620 #1989561] INFO -- : [448/885] 2030927=test_svcb_https I, [2024-05-16T20:37:48.698709 #1989561] INFO -- : [449/885] 2030934=test_buffering I, [2024-05-16T20:37:48.700212 #1989561] INFO -- : [450/885] 2030925=test_regexp I, [2024-05-16T20:37:48.707561 #1989561] INFO -- : [451/885] 2030934=test_gem_commands_check_command I, [2024-05-16T20:37:48.713191 #1989561] INFO -- : [452/885] 2030927=errors_test I, [2024-05-16T20:37:48.713765 #1989561] INFO -- : [453/885] 2030933=test_tmpdir I, [2024-05-16T20:37:48.724237 #1989561] INFO -- : [454/885] 2030934=test_rdoc_markup_document I, [2024-05-16T20:37:48.733141 #1989561] INFO -- : [455/885] 2030934=test_integer_comb I, [2024-05-16T20:37:48.816069 #1989561] INFO -- : [456/885] 2030933=test_vm_dump I, [2024-05-16T20:37:48.817243 #1989561] INFO -- : [457/885] 2030933=test_udp I, [2024-05-16T20:37:48.821325 #1989561] INFO -- : [458/885] 2030933=test_force_exit I, [2024-05-16T20:37:48.835270 #1989561] INFO -- : [459/885] 2030927=test_file I, [2024-05-16T20:37:48.929228 #1989561] INFO -- : [460/885] 2030931=unescape_test I, [2024-05-16T20:37:48.932216 #1989561] INFO -- : [461/885] 2030933=test_ostruct I, [2024-05-16T20:37:49.109935 #1989561] INFO -- : [462/885] 2030928=bom_test I, [2024-05-16T20:37:49.127116 #1989561] INFO -- : [463/885] 2030936=test_data_error I, [2024-05-16T20:37:49.155344 #1989561] INFO -- : [464/885] 2030933=static_inspect_test I, [2024-05-16T20:37:49.155790 #1989561] INFO -- : [465/885] 2030928=test_encoding I, [2024-05-16T20:37:49.183720 #1989561] INFO -- : [466/885] 2030936=test_erb_command I, [2024-05-16T20:37:49.220588 #1989561] INFO -- : [467/885] 2030933=test_helper I, [2024-05-16T20:37:49.225244 #1989561] INFO -- : [468/885] 2030933=test_gem_uri_formatter I, [2024-05-16T20:37:49.229779 #1989561] INFO -- : [469/885] 2030936=command_line_test I, [2024-05-16T20:37:49.232491 #1989561] INFO -- : [470/885] 2030936=test_pty I, [2024-05-16T20:37:49.238769 #1989561] INFO -- : [471/885] 2030933=test_dup I, [2024-05-16T20:37:49.381813 #1989561] INFO -- : [472/885] 2030928=test_constant I, [2024-05-16T20:37:49.472896 #1989561] INFO -- : [473/885] 2030933=test_project_sanity I, [2024-05-16T20:37:49.526874 #1989561] INFO -- : [474/885] 2030939=test_range I, [2024-05-16T20:37:49.534415 #1989561] INFO -- : [475/885] 2030933=test_rdoc_ri_paths I, [2024-05-16T20:37:49.567374 #1989561] INFO -- : [476/885] 2030933=test_addr I, [2024-05-16T20:37:49.585224 #1989561] INFO -- : [477/885] 2030929=test_locale I, [2024-05-16T20:37:49.590255 #1989561] INFO -- : [478/885] 2030933=library_symbols_test I, [2024-05-16T20:37:49.592070 #1989561] INFO -- : [479/885] 2030933=test_ensured I, [2024-05-16T20:37:49.674198 #1989561] INFO -- : [480/885] 2030933=test_ts I, [2024-05-16T20:37:49.704746 #1989561] INFO -- : [481/885] 2030929=test_enumerable I, [2024-05-16T20:37:49.709463 #1989561] INFO -- : [482/885] 2030929=test_gem_resolver_vendor_set I, [2024-05-16T20:37:49.727625 #1989561] INFO -- : [483/885] 2030929=test_config I, [2024-05-16T20:37:49.782886 #1989561] INFO -- : [484/885] 2030936=test_gem_resolver_api_set I, [2024-05-16T20:37:49.886971 #1989561] INFO -- : [485/885] 2030936=test_gem_safe_marshal I, [2024-05-16T20:37:50.113274 #1989561] INFO -- : [486/885] 2030931=test_transcode I, [2024-05-16T20:37:50.164790 #1989561] INFO -- : [487/885] 2030933=json_generator_test I, [2024-05-16T20:37:50.225770 #1989561] INFO -- : [488/885] 2030929=test_eval I, [2024-05-16T20:37:50.256700 #1989561] INFO -- : [489/885] 2030933=test_x509store I, [2024-05-16T20:37:50.291943 #1989561] INFO -- : [490/885] 2030931=test_rdoc_code_object I, [2024-05-16T20:37:50.395354 #1989561] INFO -- : [491/885] 2030939=test_x509name I, [2024-05-16T20:37:50.410080 #1989561] INFO -- : [492/885] 2030939=test_fips I, [2024-05-16T20:37:50.503169 #1989561] INFO -- : [493/885] 2030933=test_update I, [2024-05-16T20:37:50.508526 #1989561] INFO -- : [494/885] 2030933=test_jaro_winkler I, [2024-05-16T20:37:50.511481 #1989561] INFO -- : [495/885] 2030933=test_helper I, [2024-05-16T20:37:50.514102 #1989561] INFO -- : [496/885] 2030933=test_random_formatter I, [2024-05-16T20:37:50.538304 #1989561] INFO -- : [497/885] 2030933=test_lambda I, [2024-05-16T20:37:50.554381 #1989561] INFO -- : [498/885] 2030929=test_ast I, [2024-05-16T20:37:50.567140 #1989561] INFO -- : [499/885] 2030936=test_gem_request_set_gem_dependency_api I, [2024-05-16T20:37:50.608289 #1989561] INFO -- : [500/885] 2030933=test_webauthn_listener I, [2024-05-16T20:37:50.627670 #1989561] INFO -- : Leaked file descriptor: WebauthnListenerTest#test_wait_for_otp_code_options_request: 9 : # I, [2024-05-16T20:37:50.640202 #1989561] INFO -- : [501/885] 2030931=test_numhash I, [2024-05-16T20:37:50.646197 #1989561] INFO -- : [502/885] 2030931=test_weakkeymap I, [2024-05-16T20:37:50.687720 #1989561] INFO -- : COMMAND PID USER FD TYPE DEVICE SIZE/OFF NODE NAME I, [2024-05-16T20:37:50.687787 #1989561] INFO -- : ruby 2030933 ko1 9u IPv4 220760970 0t0 TCP localhost:33503->localhost:41542 (CLOSE_WAIT) I, [2024-05-16T20:37:50.703517 #1989561] INFO -- : [503/885] 2030939=test_gem_commands_push_command I, [2024-05-16T20:37:50.747268 #1989561] INFO -- : Closed file descriptor: WebauthnListenerTest#test_wait_for_otp_code_get_follows_options: 9 I, [2024-05-16T20:37:50.773793 #1989561] INFO -- : [504/885] 2030922=test_pkey_rsa I, [2024-05-16T20:37:50.798204 #1989561] INFO -- : [505/885] 2030933=test_gem_platform I, [2024-05-16T20:37:50.824624 #1989561] INFO -- : [506/885] 2030936=test_rdoc_markup_hard_break I, [2024-05-16T20:37:50.827271 #1989561] INFO -- : [507/885] 2030936=test_placearg I, [2024-05-16T20:37:50.879672 #1989561] INFO -- : [508/885] 2030933=test_date_strptime I, [2024-05-16T20:37:50.949925 #1989561] INFO -- : [509/885] 2030923=test_gem_package_task I, [2024-05-16T20:37:50.955080 #1989561] INFO -- : [510/885] 2030923=test_win32ole_method I, [2024-05-16T20:37:50.957830 #1989561] INFO -- : [511/885] 2030923=test_delete I, [2024-05-16T20:37:50.970362 #1989561] INFO -- : [512/885] 2030923=test_keyword I, [2024-05-16T20:37:50.971872 #1989561] INFO -- : [513/885] 2030931=test_class_name_check I, [2024-05-16T20:37:50.985695 #1989561] INFO -- : [514/885] 2030933=test_continuation I, [2024-05-16T20:37:50.990252 #1989561] INFO -- : [515/885] 2030936=test_fd_setsize I, [2024-05-16T20:37:50.990326 #1989561] INFO -- : [516/885] 2030933=test_files_test I, [2024-05-16T20:37:50.994327 #1989561] INFO -- : [517/885] 2030936=test_gem_update_suggestion I, [2024-05-16T20:37:51.011999 #1989561] INFO -- : [518/885] 2030931=test_file_exhaustive I, [2024-05-16T20:37:51.012974 #1989561] INFO -- : [519/885] 2030922=test_logger I, [2024-05-16T20:37:51.028333 #1989561] INFO -- : [520/885] 2030922=test_not I, [2024-05-16T20:37:51.034250 #1989561] INFO -- : [521/885] 2030922=test_gem_resolver_lock_set I, [2024-05-16T20:37:51.053488 #1989561] INFO -- : [522/885] 2030922=test_import I, [2024-05-16T20:37:51.064283 #1989561] INFO -- : [523/885] 2030933=test_rdoc_parser_markdown I, [2024-05-16T20:37:51.068342 #1989561] INFO -- : [524/885] 2030936=test_object I, [2024-05-16T20:37:51.076729 #1989561] INFO -- : [525/885] 2030936=heredoc_dedent_test I, [2024-05-16T20:37:51.081906 #1989561] INFO -- : [526/885] 2030936=test_cgi_header I, [2024-05-16T20:37:51.095156 #1989561] INFO -- : [527/885] 2030936=version_test I, [2024-05-16T20:37:51.096935 #1989561] INFO -- : [528/885] 2030933=test_gem_command_manager I, [2024-05-16T20:37:51.110899 #1989561] INFO -- : [529/885] 2030936=test_gem_gemcutter_utilities I, [2024-05-16T20:37:51.151777 #1989561] INFO -- : [530/885] 2030934=test_basicinstructions I, [2024-05-16T20:37:51.204874 #1989561] INFO -- : [531/885] 2030934=test_key_actor_emacs I, [2024-05-16T20:37:51.244040 #1989561] INFO -- : [532/885] 2030933=test_arithmetic_sequence I, [2024-05-16T20:37:51.259896 #1989561] INFO -- : [533/885] 2030933=test_normalize I, [2024-05-16T20:37:51.259957 #1989561] INFO -- : [534/885] 2030933=test_ossl I, [2024-05-16T20:37:51.291013 #1989561] INFO -- : [535/885] 2030939=test_timeout I, [2024-05-16T20:37:51.296623 #1989561] INFO -- : [536/885] 2030939=compiler_test I, [2024-05-16T20:37:51.398837 #1989561] INFO -- : [537/885] 2030934=test_flip I, [2024-05-16T20:37:51.421916 #1989561] INFO -- : [538/885] 2030939=test_change_word I, [2024-05-16T20:37:51.427395 #1989561] INFO -- : [539/885] 2030934=test_sleep I, [2024-05-16T20:37:51.429301 #1989561] INFO -- : [540/885] 2030939=test_gem_local_remote_options I, [2024-05-16T20:37:51.437710 #1989561] INFO -- : [541/885] 2030923=test_object I, [2024-05-16T20:37:51.457639 #1989561] INFO -- : [542/885] 2030936=test_ruby_lex I, [2024-05-16T20:37:51.475466 #1989561] INFO -- : [543/885] 2030939=test_date_arith I, [2024-05-16T20:37:51.485597 #1989561] INFO -- : [544/885] 2030939=test_big5 I, [2024-05-16T20:37:51.490786 #1989561] INFO -- : [545/885] 2030939=test_func I, [2024-05-16T20:37:51.623652 #1989561] INFO -- : [546/885] 2030936=test_pointer I, [2024-05-16T20:37:51.782770 #1989561] INFO -- : [547/885] 2030923=test_type I, [2024-05-16T20:37:51.790119 #1989561] INFO -- : [548/885] 2030923=test_ractor I, [2024-05-16T20:37:51.852178 #1989561] INFO -- : [549/885] 2030922=test_tsort I, [2024-05-16T20:37:51.866433 #1989561] INFO -- : [550/885] 2030922=test_signedness I, [2024-05-16T20:37:51.872858 #1989561] INFO -- : [551/885] 2030923=test_rdoc_rd_block_parser I, [2024-05-16T20:37:51.914489 #1989561] INFO -- : [552/885] 2030923=test_time_tz I, [2024-05-16T20:37:51.914774 #1989561] INFO -- : [553/885] 2030935=test_win32ole_event I, [2024-05-16T20:37:51.922713 #1989561] INFO -- : [554/885] 2030935=test_rdoc_generator_json_index I, [2024-05-16T20:37:51.961717 #1989561] INFO -- : [555/885] 2030923=test_trace I, [2024-05-16T20:37:51.969853 #1989561] INFO -- : [556/885] 2030923=ractor_test I, [2024-05-16T20:37:51.994470 #1989561] INFO -- : [557/885] 2030935=test_io_wait_uncommon I, [2024-05-16T20:37:51.996881 #1989561] INFO -- : [558/885] 2030935=test_stringio I, [2024-05-16T20:37:52.041842 #1989561] INFO -- : [559/885] 2030923=test_arity I, [2024-05-16T20:37:52.044013 #1989561] INFO -- : [560/885] 2030923=test_win32ole_variable I, [2024-05-16T20:37:52.047216 #1989561] INFO -- : [561/885] 2030923=test_gem_ci_detector I, [2024-05-16T20:37:52.059026 #1989561] INFO -- : [562/885] 2030923=test_rdoc_class_module I, [2024-05-16T20:37:52.069834 #1989561] INFO -- : [563/885] 2030928=test_bignum I, [2024-05-16T20:37:52.098703 #1989561] INFO -- : [564/885] 2030936=test_threadgroup I, [2024-05-16T20:37:52.140835 #1989561] INFO -- : [565/885] 2030935=test_enum I, [2024-05-16T20:37:52.147761 #1989561] INFO -- : [566/885] 2030928=test_gem_specification I, [2024-05-16T20:37:52.297440 #1989561] INFO -- : [567/885] 2030920=test_gem_package I, [2024-05-16T20:37:52.479556 #1989561] INFO -- : [568/885] 2030923=test_complex2 I, [2024-05-16T20:37:52.488614 #1989561] INFO -- : [569/885] 2030923=test_resolve_symbol I, [2024-05-16T20:37:52.568947 #1989561] INFO -- : [570/885] 2030923=test_have_macro I, [2024-05-16T20:37:52.935508 #1989561] INFO -- : [571/885] 2030923=test_merge_keys I, [2024-05-16T20:37:52.940983 #1989561] INFO -- : [572/885] 2030923=test_rdoc_extend I, [2024-05-16T20:37:52.956599 #1989561] INFO -- : [573/885] 2030923=test_rdoc_markup_to_ansi I, [2024-05-16T20:37:52.992576 #1989561] INFO -- : [574/885] 2030923=test_mixed_unicode_escapes I, [2024-05-16T20:37:52.994885 #1989561] INFO -- : [575/885] 2030923=test_history I, [2024-05-16T20:37:53.007267 #1989561] INFO -- : [576/885] 2030923=test_ipaddr I, [2024-05-16T20:37:53.013387 #1989561] INFO -- : [577/885] 2030920=test_win32ole_variant I, [2024-05-16T20:37:53.018348 #1989561] INFO -- : [578/885] 2030920=test_gem_resolver_api_specification I, [2024-05-16T20:37:53.040838 #1989561] INFO -- : [579/885] 2030923=test_gem_commands_cleanup_command I, [2024-05-16T20:37:53.070392 #1989561] INFO -- : [580/885] 2030920=test_word I, [2024-05-16T20:37:53.080457 #1989561] INFO -- : [581/885] 2030920=test_cgi_multipart I, [2024-05-16T20:37:53.102530 #1989561] INFO -- : [582/885] 2030936=test_member I, [2024-05-16T20:37:53.106942 #1989561] INFO -- : [583/885] 2030936=test_numeric I, [2024-05-16T20:37:53.114213 #1989561] INFO -- : [584/885] 2030936=test_autoconf I, [2024-05-16T20:37:53.118664 #1989561] INFO -- : [585/885] 2030936=test_eval I, [2024-05-16T20:37:53.123765 #1989561] INFO -- : [586/885] 2030936=test_date_ractor I, [2024-05-16T20:37:53.147174 #1989561] INFO -- : [587/885] 2030920=test_gem_console_ui I, [2024-05-16T20:37:53.155643 #1989561] INFO -- : [588/885] 2030920=test_dir I, [2024-05-16T20:37:53.161685 #1989561] INFO -- : [589/885] 2030935=format_errors_test I, [2024-05-16T20:37:53.166130 #1989561] INFO -- : [590/885] 2030935=test_ractor_compatibility I, [2024-05-16T20:37:53.472820 #1989561] INFO -- : [591/885] 2030936=test_mailto I, [2024-05-16T20:37:53.479643 #1989561] INFO -- : [592/885] 2030920=test_symbol I, [2024-05-16T20:37:53.482489 #1989561] INFO -- : [593/885] 2030936=location_test I, [2024-05-16T20:37:53.487884 #1989561] INFO -- : [594/885] 2030920=test_coderange I, [2024-05-16T20:37:53.490741 #1989561] INFO -- : [595/885] 2030920=test_gem_source_fetch_problem I, [2024-05-16T20:37:53.497973 #1989561] INFO -- : [596/885] 2030920=json_generic_object_test I, [2024-05-16T20:37:53.498980 #1989561] INFO -- : [597/885] 2030923=test_http_request I, [2024-05-16T20:37:53.506408 #1989561] INFO -- : [598/885] 2030920=test_error_highlight I, [2024-05-16T20:37:53.541459 #1989561] INFO -- : [599/885] 2030923=test_resize I, [2024-05-16T20:37:53.548982 #1989561] INFO -- : [600/885] 2030923=test_rdoc_comment I, [2024-05-16T20:37:53.551244 #1989561] INFO -- : [601/885] 2030936=test_rdoc_generator_darkfish I, [2024-05-16T20:37:53.568725 #1989561] INFO -- : [602/885] 2030923=test_function_entry I, [2024-05-16T20:37:53.573583 #1989561] INFO -- : [603/885] 2030923=test_arith_seq_beg_len_step I, [2024-05-16T20:37:53.592470 #1989561] INFO -- : [604/885] 2030935=test_gem_resolver_requirement_list I, [2024-05-16T20:37:53.615468 #1989561] INFO -- : [605/885] 2030923=test_pkcs7 I, [2024-05-16T20:37:53.648333 #1989561] INFO -- : [606/885] 2030935=test_enc_associate I, [2024-05-16T20:37:53.773684 #1989561] INFO -- : [607/885] 2030939=test_lazy_enumerator I, [2024-05-16T20:37:53.778829 #1989561] INFO -- : [608/885] 2030923=test_unix I, [2024-05-16T20:37:53.814228 #1989561] INFO -- : [609/885] 2030923=test_nofree I, [2024-05-16T20:37:53.821270 #1989561] INFO -- : [610/885] 2030923=test_gem_commands_pristine_command I, [2024-05-16T20:37:53.905583 #1989561] INFO -- : [611/885] 2030920=test_context I, [2024-05-16T20:37:53.943024 #1989561] INFO -- : [612/885] 2030928=test_symbol I, [2024-05-16T20:37:53.953922 #1989561] INFO -- : [613/885] 2030937=test_coder I, [2024-05-16T20:37:53.994374 #1989561] INFO -- : [614/885] 2030937=test_find_executable I, [2024-05-16T20:37:54.000714 #1989561] INFO -- : [615/885] 2030936=ruby_api_test I, [2024-05-16T20:37:54.031815 #1989561] INFO -- : [616/885] 2030937=test_rubygems I, [2024-05-16T20:37:54.071850 #1989561] INFO -- : [617/885] 2030920=test_https_proxy I, [2024-05-16T20:37:54.076871 #1989561] INFO -- : [618/885] 2030920=test_call I, [2024-05-16T20:37:54.081281 #1989561] INFO -- : [619/885] 2030930=test_integer I, [2024-05-16T20:37:54.089728 #1989561] INFO -- : [620/885] 2030922=test_cgi_modruby I, [2024-05-16T20:37:54.099275 #1989561] INFO -- : [621/885] 2030922=test_rubyoptions I, [2024-05-16T20:37:54.171122 #1989561] INFO -- : [622/885] 2030937=test_super I, [2024-05-16T20:37:54.174358 #1989561] INFO -- : [623/885] 2030936=test_gem_resolver_git_specification I, [2024-05-16T20:37:54.223599 #1989561] INFO -- : [624/885] 2030920=test_usrmarshal I, [2024-05-16T20:37:54.283599 #1989561] INFO -- : [625/885] 2030935=test_object_references I, [2024-05-16T20:37:54.287192 #1989561] INFO -- : [626/885] 2030935=test_capacity I, [2024-05-16T20:37:54.298515 #1989561] INFO -- : [627/885] 2030935=test_nextafter I, [2024-05-16T20:37:54.359939 #1989561] INFO -- : [628/885] 2030935=test_have_func I, [2024-05-16T20:37:54.372491 #1989561] INFO -- : [629/885] 2030939=test_gem_request_set_lockfile_tokenizer I, [2024-05-16T20:37:54.377756 #1989561] INFO -- : [630/885] 2030936=test_stat I, [2024-05-16T20:37:54.383127 #1989561] INFO -- : [631/885] 2030936=desugar_compiler_test I, [2024-05-16T20:37:54.394081 #1989561] INFO -- : [632/885] 2030936=test_integer I, [2024-05-16T20:37:54.416385 #1989561] INFO -- : [633/885] 2030939=test_dryrun I, [2024-05-16T20:37:54.426769 #1989561] INFO -- : [634/885] 2030939=test_rdoc_attr I, [2024-05-16T20:37:54.440220 #1989561] INFO -- : [635/885] 2030939=test_env I, [2024-05-16T20:37:54.458072 #1989561] INFO -- : [636/885] 2030936=test_gem_commands_setup_command I, [2024-05-16T20:37:54.471286 #1989561] INFO -- : [637/885] 2030920=test_parser I, [2024-05-16T20:37:54.488224 #1989561] INFO -- : [638/885] 2030920=test_cgi_core I, [2024-05-16T20:37:54.499028 #1989561] INFO -- : [639/885] 2030920=test_dns I, [2024-05-16T20:37:54.645052 #1989561] INFO -- : [640/885] 2030926=test_gem_commands_open_command I, [2024-05-16T20:37:54.747410 #1989561] INFO -- : [641/885] 2030926=test_ractor I, [2024-05-16T20:37:54.771107 #1989561] INFO -- : [642/885] 2030926=test_gem I, [2024-05-16T20:37:54.836432 #1989561] INFO -- : [643/885] 2030937=test_gem_source_lock I, [2024-05-16T20:37:54.894517 #1989561] INFO -- : [644/885] 2030937=test_registry I, [2024-05-16T20:37:54.896117 #1989561] INFO -- : [645/885] 2030937=parse_stream_test I, [2024-05-16T20:37:54.901500 #1989561] INFO -- : [646/885] 2030937=test_ractor I, [2024-05-16T20:37:54.903445 #1989561] INFO -- : [647/885] 2030927=test_rendering I, [2024-05-16T20:37:54.918805 #1989561] INFO -- : [648/885] 2030927=test_debugger_integration I, [2024-05-16T20:37:54.936840 #1989561] INFO -- : [649/885] 2030927=test_thread I, [2024-05-16T20:37:54.946409 #1989561] INFO -- : [650/885] 2030920=json_ext_parser_test I, [2024-05-16T20:37:54.952459 #1989561] INFO -- : [651/885] 2030920=test_my_integer I, [2024-05-16T20:37:54.954178 #1989561] INFO -- : [652/885] 2030920=test_ssl I, [2024-05-16T20:37:54.990918 #1989561] INFO -- : [653/885] 2030921=test_singleton_function I, [2024-05-16T20:37:54.990996 #1989561] INFO -- : [654/885] 2030921=test_ancdata I, [2024-05-16T20:37:54.995372 #1989561] INFO -- : [655/885] 2030921=test_reline_key I, [2024-05-16T20:37:54.997075 #1989561] INFO -- : [656/885] 2030936=test_rb_str_dup I, [2024-05-16T20:37:55.002221 #1989561] INFO -- : [657/885] 2030921=test_weakref I, [2024-05-16T20:37:55.004707 #1989561] INFO -- : [658/885] 2030936=test_nonblock I, [2024-05-16T20:37:55.026950 #1989561] INFO -- : [659/885] 2030936=test_unicode_normalize I, [2024-05-16T20:37:55.170648 #1989561] INFO -- : [660/885] 2030923=test_marshal I, [2024-05-16T20:37:55.199086 #1989561] INFO -- : [661/885] 2030921=test_timeout I, [2024-05-16T20:37:55.385098 #1989561] INFO -- : [662/885] 2030937=test_alias I, [2024-05-16T20:37:55.385449 #1989561] INFO -- : [663/885] 2030920=test_cgi_cookie I, [2024-05-16T20:37:55.401426 #1989561] INFO -- : [664/885] 2030920=test_require I, [2024-05-16T20:37:55.580541 #1989561] INFO -- : [665/885] 2030937=test_float I, [2024-05-16T20:37:55.786640 #1989561] INFO -- : [666/885] 2030935=test_gem_source_git I, [2024-05-16T20:37:55.962244 #1989561] INFO -- : [667/885] 2030924=test_refinement I, [2024-05-16T20:37:56.028563 #1989561] INFO -- : [668/885] 2030921=test_gem_commands_signout_command I, [2024-05-16T20:37:56.041911 #1989561] INFO -- : [669/885] 2030921=test_regex_casefold I, [2024-05-16T20:37:56.061807 #1989561] INFO -- : [670/885] 2030923=test_gem_resolver_installer_set I, [2024-05-16T20:37:56.256787 #1989561] INFO -- : [671/885] 2030930=test_dir_m17n I, [2024-05-16T20:37:56.309301 #1989561] INFO -- : [672/885] 2030923=test_metaclass I, [2024-05-16T20:37:56.310849 #1989561] INFO -- : [673/885] 2030935=test_rdoc_top_level I, [2024-05-16T20:37:56.315209 #1989561] INFO -- : [674/885] 2030923=test_cgi_session I, [2024-05-16T20:37:56.329950 #1989561] INFO -- : [675/885] 2030923=test_rdoc_rd I, [2024-05-16T20:37:56.330554 #1989561] INFO -- : [676/885] 2030921=test_x509crl I, [2024-05-16T20:37:56.337130 #1989561] INFO -- : [677/885] 2030923=test_signal I, [2024-05-16T20:37:56.433365 #1989561] INFO -- : [678/885] 2030934=test_fixnum I, [2024-05-16T20:37:56.441358 #1989561] INFO -- : [679/885] 2030934=test_process I, [2024-05-16T20:37:56.447659 #1989561] INFO -- : [680/885] 2030921=test_windows_1252 I, [2024-05-16T20:37:56.453065 #1989561] INFO -- : [681/885] 2030921=test_input_method I, [2024-05-16T20:37:56.472443 #1989561] INFO -- : [682/885] 2030934=test_digest_extend I, [2024-05-16T20:37:56.501077 #1989561] INFO -- : [683/885] 2030934=test_omap I, [2024-05-16T20:37:56.509676 #1989561] INFO -- : [684/885] 2030934=test_string I, [2024-05-16T20:37:56.514524 #1989561] INFO -- : [685/885] 2030934=test_iterator I, [2024-05-16T20:37:56.545179 #1989561] INFO -- : [686/885] 2030935=pattern_test I, [2024-05-16T20:37:56.559071 #1989561] INFO -- : [687/885] 2030935=test_memory_view I, [2024-05-16T20:37:56.571851 #1989561] INFO -- : [688/885] 2030935=test_debug I, [2024-05-16T20:37:56.575271 #1989561] INFO -- : [689/885] 2030935=test_shellwords I, [2024-05-16T20:37:56.581355 #1989561] INFO -- : [690/885] 2030935=test_new I, [2024-05-16T20:37:56.587714 #1989561] INFO -- : [691/885] 2030935=test_gem_security_signer I, [2024-05-16T20:37:56.595569 #1989561] INFO -- : [692/885] 2030934=test_cipher I, [2024-05-16T20:37:56.633946 #1989561] INFO -- : [693/885] 2030934=test_gem_resolver_git_set I, [2024-05-16T20:37:56.653275 #1989561] INFO -- : [694/885] 2030935=test_storage I, [2024-05-16T20:37:56.656869 #1989561] INFO -- : [695/885] 2030935=test_win32ole_variant_outarg I, [2024-05-16T20:37:56.658589 #1989561] INFO -- : [696/885] 2030935=json_common_interface_test I, [2024-05-16T20:37:56.670123 #1989561] INFO -- : [697/885] 2030935=test_gem_source_subpath_problem I, [2024-05-16T20:37:56.673102 #1989561] INFO -- : [698/885] 2030921=test_dln I, [2024-05-16T20:37:56.674808 #1989561] INFO -- : [699/885] 2030921=memsize_test I, [2024-05-16T20:37:56.772436 #1989561] INFO -- : [700/885] 2030921=json_parser_test I, [2024-05-16T20:37:56.780944 #1989561] INFO -- : [701/885] 2030935=test_nomethod_error I, [2024-05-16T20:37:56.785741 #1989561] INFO -- : [702/885] 2030935=test_config I, [2024-05-16T20:37:56.815700 #1989561] INFO -- : [703/885] 2030935=test_pkg_config I, [2024-05-16T20:37:56.819908 #1989561] INFO -- : [704/885] 2030921=test_cparser I, [2024-05-16T20:37:56.830367 #1989561] INFO -- : [705/885] 2030935=test_rdoc_markup_to_html_snippet I, [2024-05-16T20:37:56.836160 #1989561] INFO -- : [706/885] 2030928=magic_comment_test I, [2024-05-16T20:37:56.843613 #1989561] INFO -- : [707/885] 2030928=test_struct I, [2024-05-16T20:37:56.847841 #1989561] INFO -- : [708/885] 2030928=test_variable I, [2024-05-16T20:37:56.872434 #1989561] INFO -- : [709/885] 2030926=test_rdoc_markup_include I, [2024-05-16T20:37:56.875952 #1989561] INFO -- : [710/885] 2030926=test_sexp I, [2024-05-16T20:37:56.892421 #1989561] INFO -- : [711/885] 2030926=fuzzer_test I, [2024-05-16T20:37:56.902855 #1989561] INFO -- : [712/885] 2030935=test_win32ole_variant_m I, [2024-05-16T20:37:56.908047 #1989561] INFO -- : [713/885] 2030935=test_engine I, [2024-05-16T20:37:56.909321 #1989561] INFO -- : [714/885] 2030935=test_allocation I, [2024-05-16T20:37:56.940262 #1989561] INFO -- : [715/885] 2030931=test_div I, [2024-05-16T20:37:56.943119 #1989561] INFO -- : [716/885] 2030931=test_key_error I, [2024-05-16T20:37:56.945890 #1989561] INFO -- : [717/885] 2030926=test_serialize_subclasses I, [2024-05-16T20:37:56.946326 #1989561] INFO -- : [718/885] 2030928=test_insns_leaf I, [2024-05-16T20:37:56.949010 #1989561] INFO -- : [719/885] 2030931=test_deprecated I, [2024-05-16T20:37:56.951802 #1989561] INFO -- : [720/885] 2030926=test_color_printer I, [2024-05-16T20:37:56.953647 #1989561] INFO -- : [721/885] 2030928=test_files_test_1 I, [2024-05-16T20:37:56.957149 #1989561] INFO -- : [722/885] 2030931=test_gem_path_support I, [2024-05-16T20:37:56.977918 #1989561] INFO -- : [723/885] 2030931=test_struct I, [2024-05-16T20:37:57.028384 #1989561] INFO -- : [724/885] 2030937=test_set I, [2024-05-16T20:37:57.035967 #1989561] INFO -- : [725/885] 2030926=test_x509req I, [2024-05-16T20:37:57.058195 #1989561] INFO -- : [726/885] 2030937=test_mutex I, [2024-05-16T20:37:57.091032 #1989561] INFO -- : [727/885] 2030934=test_rdoc_rd_inline I, [2024-05-16T20:37:57.094092 #1989561] INFO -- : [728/885] 2030934=constant_path_node_test I, [2024-05-16T20:37:57.101251 #1989561] INFO -- : [729/885] 2030934=test_gem_ext_cargo_builder I, [2024-05-16T20:37:57.114613 #1989561] INFO -- : [730/885] 2030934=test_ssl I, [2024-05-16T20:37:57.252493 #1989561] INFO -- : [731/885] 2030926=test_module I, [2024-05-16T20:37:57.443179 #1989561] INFO -- : [732/885] 2030921=test_gem_request_set I, [2024-05-16T20:37:57.451834 #1989561] INFO -- : [733/885] 2030931=test_arith_seq_extract I, [2024-05-16T20:37:57.485230 #1989561] INFO -- : [734/885] 2030939=test_method_name_check I, [2024-05-16T20:37:57.511869 #1989561] INFO -- : [735/885] 2030939=test_parser I, [2024-05-16T20:37:57.523594 #1989561] INFO -- : [736/885] 2030925=test_rubyvm I, [2024-05-16T20:37:57.528089 #1989561] INFO -- : [737/885] 2030925=test_configuration I, [2024-05-16T20:37:57.558645 #1989561] INFO -- : [738/885] 2030939=test_buffered_io I, [2024-05-16T20:37:57.616654 #1989561] INFO -- : [739/885] 2030925=test_monitor I, [2024-05-16T20:37:57.625830 #1989561] INFO -- : [740/885] 2030931=test_whileuntil I, [2024-05-16T20:37:57.635519 #1989561] INFO -- : [741/885] 2030931=test_rdoc_generator_markup I, [2024-05-16T20:37:57.635796 #1989561] INFO -- : [742/885] 2030939=test_boolean I, [2024-05-16T20:37:57.638106 #1989561] INFO -- : [743/885] 2030931=integer_parse_test I, [2024-05-16T20:37:57.645412 #1989561] INFO -- : [744/885] 2030931=test_instrumentation_api I, [2024-05-16T20:37:57.650033 #1989561] INFO -- : [745/885] 2030939=test_stringify_symbols I, [2024-05-16T20:37:57.668843 #1989561] INFO -- : [746/885] 2030939=test_benchmark I, [2024-05-16T20:37:57.743525 #1989561] INFO -- : [747/885] 2030938=test_gem_dependency_list I, [2024-05-16T20:37:57.783125 #1989561] INFO -- : [748/885] 2030938=test_nesting_parser I, [2024-05-16T20:37:57.796065 #1989561] INFO -- : [749/885] 2030938=test_win32ole_method_event I, [2024-05-16T20:37:57.799516 #1989561] INFO -- : [750/885] 2030938=test_scalar_scanner I, [2024-05-16T20:37:57.801384 #1989561] INFO -- : [751/885] 2030921=test_gem_source I, [2024-05-16T20:37:57.803219 #1989561] INFO -- : [752/885] 2030930=test_gem_package_tar_writer I, [2024-05-16T20:37:57.805343 #1989561] INFO -- : [753/885] 2030938=test_helper_method I, [2024-05-16T20:37:57.813940 #1989561] INFO -- : [754/885] 2030938=test_array I, [2024-05-16T20:37:57.824844 #1989561] INFO -- : [755/885] 2030925=test_gem_commands_outdated_command I, [2024-05-16T20:37:57.860033 #1989561] INFO -- : [756/885] 2030933=test_provider I, [2024-05-16T20:37:57.952910 #1989561] INFO -- : [757/885] 2030930=test_abi I, [2024-05-16T20:37:58.045156 #1989561] INFO -- : [758/885] 2030925=test_gem_commands_rebuild_command I, [2024-05-16T20:37:58.073110 #1989561] INFO -- : [759/885] 2030921=test_yamldbm I, [2024-05-16T20:37:58.077879 #1989561] INFO -- : [760/885] 2030925=test_load I, [2024-05-16T20:37:58.079913 #1989561] INFO -- : [761/885] 2030921=test_rdoc_parser_simple I, [2024-05-16T20:37:58.081309 #1989561] INFO -- : [762/885] 2030925=test_gem_ext_builder I, [2024-05-16T20:37:58.121286 #1989561] INFO -- : [763/885] 2030930=test_https I, [2024-05-16T20:37:58.131266 #1989561] INFO -- : [764/885] 2030920=test_evaluation I, [2024-05-16T20:37:58.137123 #1989561] INFO -- : [765/885] 2030920=test_gem_source_installed I, [2024-05-16T20:37:58.139523 #1989561] INFO -- : [766/885] 2030921=test_x509ext I, [2024-05-16T20:37:58.144698 #1989561] INFO -- : [767/885] 2030921=test_erb I, [2024-05-16T20:37:58.149681 #1989561] INFO -- : [768/885] 2030920=test_yield_block I, [2024-05-16T20:37:58.155981 #1989561] INFO -- : [769/885] 2030920=test_len I, [2024-05-16T20:37:58.160967 #1989561] INFO -- : [770/885] 2030920=test_completion I, [2024-05-16T20:37:58.204164 #1989561] INFO -- : [771/885] 2030933=test_gem_commands_cert_command I, [2024-05-16T20:37:58.204235 #1989561] INFO -- : [772/885] 2030937=test_rational I, [2024-05-16T20:37:58.210846 #1989561] INFO -- : [773/885] 2030921=test_rational2 I, [2024-05-16T20:37:58.222422 #1989561] INFO -- : [774/885] 2030937=test_spell_checker I, [2024-05-16T20:37:58.230284 #1989561] INFO -- : [775/885] 2030921=attribute_write_test I, [2024-05-16T20:37:58.231279 #1989561] INFO -- : [776/885] 2030921=test_propertyputref I, [2024-05-16T20:37:58.233383 #1989561] INFO -- : [777/885] 2030937=test_assembler I, [2024-05-16T20:37:58.235215 #1989561] INFO -- : [778/885] 2030921=test_human_typo I, [2024-05-16T20:37:58.238192 #1989561] INFO -- : [779/885] 2030937=test_primitive I, [2024-05-16T20:37:58.238804 #1989561] INFO -- : [780/885] 2030921=test_rbconfig I, [2024-05-16T20:37:58.243656 #1989561] INFO -- : [781/885] 2030921=test_win32ole_param I, [2024-05-16T20:37:58.245703 #1989561] INFO -- : [782/885] 2030937=test_gem_commands_yank_command I, [2024-05-16T20:37:58.247486 #1989561] INFO -- : [783/885] 2030921=test_pair I, [2024-05-16T20:37:58.530118 #1989561] INFO -- : [784/885] 2030923=test_euc_jp I, [2024-05-16T20:37:58.530401 #1989561] INFO -- : [785/885] 2030930=test_rdoc_generator_pot_po_entry I, [2024-05-16T20:37:58.533709 #1989561] INFO -- : [786/885] 2030923=test_acceptable I, [2024-05-16T20:37:58.657594 #1989561] INFO -- : [787/885] 2030923=test_document I, [2024-05-16T20:37:58.663205 #1989561] INFO -- : [788/885] 2030923=test_rdoc_i18n_locale I, [2024-05-16T20:37:58.674195 #1989561] INFO -- : [789/885] 2030923=test_name_error_extension I, [2024-05-16T20:37:58.681201 #1989561] INFO -- : [790/885] 2030923=test_chilled I, [2024-05-16T20:37:58.687638 #1989561] INFO -- : [791/885] 2030923=test_encoding I, [2024-05-16T20:37:58.694462 #1989561] INFO -- : [792/885] 2030920=test_httpresponses I, [2024-05-16T20:37:58.699178 #1989561] INFO -- : [793/885] 2030920=test_set_len I, [2024-05-16T20:37:58.702824 #1989561] INFO -- : [794/885] 2030923=test_rdoc_ri_driver I, [2024-05-16T20:37:58.706935 #1989561] INFO -- : [795/885] 2030920=test_httpheader I, [2024-05-16T20:37:58.715504 #1989561] INFO -- : [796/885] 2030930=test_gem_resolver_local_specification I, [2024-05-16T20:37:58.718651 #1989561] INFO -- : [797/885] 2030920=test_rdoc_markup_to_label I, [2024-05-16T20:37:58.725515 #1989561] INFO -- : [798/885] 2030937=test_install I, [2024-05-16T20:37:58.754337 #1989561] INFO -- : [799/885] 2030920=test_sockopt I, [2024-05-16T20:37:58.758080 #1989561] INFO -- : [800/885] 2030930=test_color I, [2024-05-16T20:37:58.763843 #1989561] INFO -- : [801/885] 2030920=json_encoding_test I, [2024-05-16T20:37:58.769999 #1989561] INFO -- : [802/885] 2030920=test_key_stroke I, [2024-05-16T20:37:58.775800 #1989561] INFO -- : [803/885] 2030920=test_rdoc_markup_to_html I, [2024-05-16T20:37:58.841209 #1989561] INFO -- : [804/885] 2030924=test_date_compat I, [2024-05-16T20:37:58.859560 #1989561] INFO -- : [805/885] 2030924=test_bug-14834 I, [2024-05-16T20:37:58.868902 #1989561] INFO -- : [806/885] 2030920=test_compile_prism I, [2024-05-16T20:37:58.892969 #1989561] INFO -- : [807/885] 2030930=test_terminfo I, [2024-05-16T20:37:58.895535 #1989561] INFO -- : [808/885] 2030930=test_case_mapping I, [2024-05-16T20:37:58.908870 #1989561] INFO -- : [809/885] 2030930=redundant_return_test I, [2024-05-16T20:37:58.946999 #1989561] INFO -- : [810/885] 2030924=test_path I, [2024-05-16T20:37:58.956560 #1989561] INFO -- : [811/885] 2030924=test_win32ole_param_event I, [2024-05-16T20:37:58.958439 #1989561] INFO -- : [812/885] 2030924=test_bn I, [2024-05-16T20:37:58.970390 #1989561] INFO -- : [813/885] 2030937=test_http I, [2024-05-16T20:37:58.977978 #1989561] INFO -- : [814/885] 2030924=test_addrinfo I, [2024-05-16T20:37:58.980000 #1989561] INFO -- : [815/885] 2030930=test_tree_spell_checker I, [2024-05-16T20:37:59.010260 #1989561] INFO -- : [816/885] 2030939=test_data I, [2024-05-16T20:37:59.010857 #1989561] INFO -- : [817/885] 2030924=static_literals_test I, [2024-05-16T20:37:59.014466 #1989561] INFO -- : [818/885] 2030939=test_gem_gem_runner I, [2024-05-16T20:37:59.014883 #1989561] INFO -- : [819/885] 2030924=test_filter I, [2024-05-16T20:37:59.021746 #1989561] INFO -- : [820/885] 2030930=test_rdoc_method_attr I, [2024-05-16T20:37:59.036722 #1989561] INFO -- : [821/885] 2030924=test_unicode I, [2024-05-16T20:37:59.059595 #1989561] INFO -- : [822/885] 2030923=parameters_signature_test I, [2024-05-16T20:37:59.065251 #1989561] INFO -- : [823/885] 2030939=test_koi8 I, [2024-05-16T20:37:59.066873 #1989561] INFO -- : [824/885] 2030923=test_enumerator I, [2024-05-16T20:37:59.076148 #1989561] INFO -- : [825/885] 2030923=test_rdoc_parser_changelog I, [2024-05-16T20:37:59.077075 #1989561] INFO -- : [826/885] 2030939=test_rdoc_generator_pot I, [2024-05-16T20:37:59.077608 #1989561] INFO -- : [827/885] 2030924=test_thread_cv I, [2024-05-16T20:37:59.081274 #1989561] INFO -- : [828/885] 2030939=test_lexer I, [2024-05-16T20:37:59.091857 #1989561] INFO -- : [829/885] 2030939=test_ssl_session I, [2024-05-16T20:37:59.128344 #1989561] INFO -- : [830/885] 2030923=test_random I, [2024-05-16T20:37:59.132569 #1989561] INFO -- : [831/885] 2030920=test_notimplement I, [2024-05-16T20:37:59.135567 #1989561] INFO -- : [832/885] 2030923=test_key_event_record I, [2024-05-16T20:37:59.136003 #1989561] INFO -- : [833/885] 2030923=test_gem_uri I, [2024-05-16T20:37:59.138934 #1989561] INFO -- : [834/885] 2030925=test_gem_commands_update_command I, [2024-05-16T20:37:59.142703 #1989561] INFO -- : [835/885] 2030920=test_gem_resolver_vendor_specification I, [2024-05-16T20:37:59.161363 #1989561] INFO -- : [836/885] 2030920=test_gem_commands_build_command I, [2024-05-16T20:37:59.168718 #1989561] INFO -- : [837/885] 2030923=test_case_comprehensive I, [2024-05-16T20:37:59.196432 #1989561] INFO -- : [838/885] 2030930=test_interned_str I, [2024-05-16T20:37:59.199715 #1989561] INFO -- : [839/885] 2030930=test_gem_commands_server_command I, [2024-05-16T20:37:59.212967 #1989561] INFO -- : [840/885] 2030930=test_did_you_mean I, [2024-05-16T20:37:59.342848 #1989561] INFO -- : [841/885] 2030926=test_variable_name_check I, [2024-05-16T20:37:59.345025 #1989561] INFO -- : [842/885] 2030930=test_io_m17n I, [2024-05-16T20:37:59.390520 #1989561] INFO -- : [843/885] 2030920=test_tracer I, [2024-05-16T20:37:59.393166 #1989561] INFO -- : [844/885] 2030920=test_cmethod I, [2024-05-16T20:37:59.393800 #1989561] INFO -- : [845/885] 2030920=test_option I, [2024-05-16T20:37:59.408413 #1989561] INFO -- : [846/885] 2030926=test_append I, [2024-05-16T20:37:59.419331 #1989561] INFO -- : [847/885] 2030926=test_rdoc_markup_heading I, [2024-05-16T20:37:59.427888 #1989561] INFO -- : [848/885] 2030926=test_iseq I, [2024-05-16T20:37:59.529180 #1989561] INFO -- : [849/885] 2030935=test_exception_at_throwing I, [2024-05-16T20:37:59.544445 #1989561] INFO -- : [850/885] 2030920=test_pkey_dsa I, [2024-05-16T20:37:59.597368 #1989561] INFO -- : [851/885] 2030935=test_class I, [2024-05-16T20:37:59.600142 #1989561] INFO -- : [852/885] 2030935=test_ocsp I, [2024-05-16T20:37:59.703019 #1989561] INFO -- : [853/885] 2030933=test_scheduler I, [2024-05-16T20:37:59.717167 #1989561] INFO -- : [854/885] 2030924=reflection_test I, [2024-05-16T20:37:59.728358 #1989561] INFO -- : [855/885] 2030924=test_within_pipe I, [2024-05-16T20:37:59.754256 #1989561] INFO -- : [856/885] 2030924=test_gem_bundler_version_finder I, [2024-05-16T20:37:59.784441 #1989561] INFO -- : [857/885] 2030924=test_emoji_breaks I, [2024-05-16T20:37:59.811861 #1989561] INFO -- : [858/885] 2030924=test_rdoc_markup_to_bs I, [2024-05-16T20:37:59.843085 #1989561] INFO -- : [859/885] 2030924=test_help I, [2024-05-16T20:37:59.855331 #1989561] INFO -- : [860/885] 2030933=test_beginendblock I, [2024-05-16T20:37:59.855390 #1989561] INFO -- : [861/885] 2030924=test_gem_commands_unpack_command I, [2024-05-16T20:37:59.888424 #1989561] INFO -- : [862/885] 2030935=test_files_lib I, [2024-05-16T20:37:59.894096 #1989561] INFO -- : [863/885] 2030935=test_stream I, [2024-05-16T20:37:59.906063 #1989561] INFO -- : [864/885] 2030935=test_time I, [2024-05-16T20:38:00.044497 #1989561] INFO -- : [865/885] 2030936=test_webauthn_listener_response I, [2024-05-16T20:38:00.046690 #1989561] INFO -- : [866/885] 2030926=test_to_ary_concat I, [2024-05-16T20:38:00.057555 #1989561] INFO -- : [867/885] 2030936=test_rdoc_markup_pre_process I, [2024-05-16T20:38:00.100447 #1989561] INFO -- : [868/885] 2030928=test_printf I, [2024-05-16T20:38:00.102588 #1989561] INFO -- : [869/885] 2030935=test_pinned I, [2024-05-16T20:38:00.114238 #1989561] INFO -- : [870/885] 2030939=test_date_marshal I, [2024-05-16T20:38:00.121231 #1989561] INFO -- : [871/885] 2030939=test_mkmf I, [2024-05-16T20:38:00.128005 #1989561] INFO -- : [872/885] 2030928=test_history I, [2024-05-16T20:38:00.150724 #1989561] INFO -- : [873/885] 2030935=test_popen_deadlock I, [2024-05-16T20:38:00.151789 #1989561] INFO -- : [874/885] 2030924=test_delegate I, [2024-05-16T20:38:00.158698 #1989561] INFO -- : [875/885] 2030928=test_exit I, [2024-05-16T20:38:00.163072 #1989561] INFO -- : [876/885] 2030939=test_recursion I, [2024-05-16T20:38:00.163719 #1989561] INFO -- : [877/885] 2030924=test_gem_security I, [2024-05-16T20:38:00.170243 #1989561] INFO -- : [878/885] 2030939=test_rdoc_servlet I, [2024-05-16T20:38:00.236271 #1989561] INFO -- : [879/885] 2030928=test_ractor I, [2024-05-16T20:38:00.236542 #1989561] INFO -- : [880/885] 2030936=test_digest I, [2024-05-16T20:38:00.257794 #1989561] INFO -- : [881/885] 2030933=test_closure I, [2024-05-16T20:38:00.260625 #1989561] INFO -- : [882/885] 2030936=test_bundled_ca I, [2024-05-16T20:38:00.281746 #1989561] INFO -- : [883/885] 2030939=test_open3 I, [2024-05-16T20:38:00.301454 #1989561] INFO -- : [884/885] 2030928=test_fiber I, [2024-05-16T20:38:00.490041 #1989561] INFO -- : [885/885] 2030920=test_multi_irb_commands I, [2024-05-16T20:38:15.365006 #1989561] INFO -- : Finished tests in 33.954176s, 777.1356 tests/s, 275461.7592 assertions/s. I, [2024-05-16T20:38:15.365689 #1989561] INFO -- : 26387 tests, 9353077 assertions, 0 failures, 0 errors, 306 skips I, [2024-05-16T20:38:15.365710 #1989561] INFO -- : I, [2024-05-16T20:38:15.365716 #1989561] INFO -- : ruby -v: ruby 3.4.0dev (2024-05-16T19:35:22Z master 854cbbd5a9) [x86_64-linux] I, [2024-05-16T20:38:15.367986 #1989561] INFO -- : $$$[end] "make yes-test-all TESTOPTS='--stderr-on-failure' TESTS='-j20'" exit with 0. I, [2024-05-16T20:38:15.368137 #1989561] INFO -- : $$$[beg] make yes-test-rubyspec MSPECOPT='--error-output stderr --debug -j' TESTS='-j20' I, [2024-05-16T20:38:15.461067 #1989561] INFO -- : BASERUBY = /usr/bin/ruby --disable=gems I, [2024-05-16T20:38:15.461104 #1989561] INFO -- : CC = gcc I, [2024-05-16T20:38:15.461109 #1989561] INFO -- : LD = ld I, [2024-05-16T20:38:15.461113 #1989561] INFO -- : LDSHARED = gcc -shared I, [2024-05-16T20:38:15.461117 #1989561] INFO -- : CFLAGS = -O3 -fno-fast-math -ggdb3 -Wall -Wextra -Wdeprecated-declarations -Wdiv-by-zero -Wduplicated-cond -Wimplicit-function-declaration -Wimplicit-int -Wpointer-arith -Wwrite-strings -Wold-style-definition -Wimplicit-fallthrough=0 -Wmissing-noreturn -Wno-cast-function-type -Wno-constant-logical-operand -Wno-long-long -Wno-missing-field-initializers -Wno-overlength-strings -Wno-packed-bitfield-compat -Wno-parentheses-equality -Wno-self-assign -Wno-tautological-compare -Wno-unused-parameter -Wno-unused-value -Wsuggest-attribute=format -Wsuggest-attribute=noreturn -Wunused-variable -Wmisleading-indentation -Wundef -fPIC I, [2024-05-16T20:38:15.461122 #1989561] INFO -- : XCFLAGS = -U_FORTIFY_SOURCE -D_FORTIFY_SOURCE=2 -fstack-protector-strong -fno-strict-overflow -fvisibility=hidden -fexcess-precision=standard -DRUBY_EXPORT -I. -I.ext/include/x86_64-linux -I/tmp/ruby/src/trunk/include -I/tmp/ruby/src/trunk -I/tmp/ruby/src/trunk/prism -I/tmp/ruby/src/trunk/enc/unicode/15.0.0 I, [2024-05-16T20:38:15.461133 #1989561] INFO -- : CPPFLAGS = I, [2024-05-16T20:38:15.461138 #1989561] INFO -- : DLDFLAGS = -Wl,--compress-debug-sections=zlib -Wl,-soname,libruby.so.3.4 -fstack-protector-strong I, [2024-05-16T20:38:15.461142 #1989561] INFO -- : SOLIBS = -lz -lrt -lrt -lgmp -ldl -lcrypt -lm -lpthread I, [2024-05-16T20:38:15.461145 #1989561] INFO -- : LANG = en_US.UTF-8 I, [2024-05-16T20:38:15.461149 #1989561] INFO -- : LC_ALL = I, [2024-05-16T20:38:15.461152 #1989561] INFO -- : LC_CTYPE = I, [2024-05-16T20:38:15.461156 #1989561] INFO -- : MFLAGS = I, [2024-05-16T20:38:15.461159 #1989561] INFO -- : RUSTC = no I, [2024-05-16T20:38:15.461163 #1989561] INFO -- : YJIT_RUSTC_ARGS = --crate-name=yjit --crate-type=staticlib --edition=2021 -g -C lto=thin -C opt-level=3 -C overflow-checks=on '--out-dir=/tmp/ruby/build/trunk/yjit/target/release/' /tmp/ruby/src/trunk/yjit/src/lib.rs I, [2024-05-16T20:38:15.461726 #1989561] INFO -- : gcc (Ubuntu 11.4.0-1ubuntu1~22.04) 11.4.0 I, [2024-05-16T20:38:15.461746 #1989561] INFO -- : Copyright (C) 2021 Free Software Foundation, Inc. I, [2024-05-16T20:38:15.461752 #1989561] INFO -- : This is free software; see the source for copying conditions. There is NO I, [2024-05-16T20:38:15.461756 #1989561] INFO -- : warranty; not even for MERCHANTABILITY or FITNESS FOR A PARTICULAR PURPOSE. I, [2024-05-16T20:38:15.461761 #1989561] INFO -- : I, [2024-05-16T20:38:15.463356 #1989561] INFO -- : generating enc.mk I, [2024-05-16T20:38:15.579763 #1989561] INFO -- : making enc I, [2024-05-16T20:38:15.597793 #1989561] INFO -- : make[1]: Entering directory '/tmp/ruby/build/trunk' I, [2024-05-16T20:38:15.597831 #1989561] INFO -- : make[1]: Nothing to be done for 'enc'. I, [2024-05-16T20:38:15.597839 #1989561] INFO -- : make[1]: Leaving directory '/tmp/ruby/build/trunk' I, [2024-05-16T20:38:15.598602 #1989561] INFO -- : making srcs under enc I, [2024-05-16T20:38:15.630161 #1989561] INFO -- : make[1]: Entering directory '/tmp/ruby/build/trunk' I, [2024-05-16T20:38:15.630184 #1989561] INFO -- : make[1]: Nothing to be done for 'srcs'. I, [2024-05-16T20:38:15.630190 #1989561] INFO -- : make[1]: Leaving directory '/tmp/ruby/build/trunk' I, [2024-05-16T20:38:15.631104 #1989561] INFO -- : generating transdb.h I, [2024-05-16T20:38:15.726934 #1989561] INFO -- : transdb.h unchanged I, [2024-05-16T20:38:15.728232 #1989561] INFO -- : making trans I, [2024-05-16T20:38:15.761945 #1989561] INFO -- : make[1]: Entering directory '/tmp/ruby/build/trunk' I, [2024-05-16T20:38:15.761965 #1989561] INFO -- : make[1]: Nothing to be done for 'trans'. I, [2024-05-16T20:38:15.761971 #1989561] INFO -- : make[1]: Leaving directory '/tmp/ruby/build/trunk' I, [2024-05-16T20:38:15.762663 #1989561] INFO -- : making encs I, [2024-05-16T20:38:15.800552 #1989561] INFO -- : make[1]: Entering directory '/tmp/ruby/build/trunk' I, [2024-05-16T20:38:15.800574 #1989561] INFO -- : make[1]: Nothing to be done for 'encs'. I, [2024-05-16T20:38:15.800580 #1989561] INFO -- : make[1]: Leaving directory '/tmp/ruby/build/trunk' I, [2024-05-16T20:38:15.802367 #1989561] INFO -- : generating makefiles ext/configure-ext.mk I, [2024-05-16T20:38:15.829566 #1989561] INFO -- : ext/configure-ext.mk updated I, [2024-05-16T20:38:15.831907 #1989561] INFO -- : make[1]: Entering directory '/tmp/ruby/build/trunk' I, [2024-05-16T20:38:17.185940 #1989561] INFO -- : make[1]: Leaving directory '/tmp/ruby/build/trunk' I, [2024-05-16T20:38:17.186589 #1989561] INFO -- : generating makefile exts.mk I, [2024-05-16T20:38:17.222863 #1989561] INFO -- : exts.mk unchanged I, [2024-05-16T20:38:17.227221 #1989561] INFO -- : make[1]: Entering directory '/tmp/ruby/build/trunk' I, [2024-05-16T20:38:17.559902 #1989561] INFO -- : make[2]: Entering directory '/tmp/ruby/build/trunk/ext/coverage' I, [2024-05-16T20:38:17.563469 #1989561] INFO -- : make[2]: Leaving directory '/tmp/ruby/build/trunk/ext/coverage' I, [2024-05-16T20:38:17.569871 #1989561] INFO -- : make[2]: Entering directory '/tmp/ruby/build/trunk/ext/date' I, [2024-05-16T20:38:17.575221 #1989561] INFO -- : make[2]: Leaving directory '/tmp/ruby/build/trunk/ext/date' I, [2024-05-16T20:38:17.579126 #1989561] INFO -- : make[2]: Entering directory '/tmp/ruby/build/trunk/ext/digest' I, [2024-05-16T20:38:17.587913 #1989561] INFO -- : make[2]: Leaving directory '/tmp/ruby/build/trunk/ext/digest' I, [2024-05-16T20:38:17.614245 #1989561] INFO -- : make[2]: Entering directory '/tmp/ruby/build/trunk/ext/digest/sha2' I, [2024-05-16T20:38:17.619354 #1989561] INFO -- : make[2]: Leaving directory '/tmp/ruby/build/trunk/ext/digest/sha2' I, [2024-05-16T20:38:17.640740 #1989561] INFO -- : make[2]: Entering directory '/tmp/ruby/build/trunk/ext/fiddle' I, [2024-05-16T20:38:17.650526 #1989561] INFO -- : make[2]: Leaving directory '/tmp/ruby/build/trunk/ext/fiddle' I, [2024-05-16T20:38:17.654559 #1989561] INFO -- : make[2]: Entering directory '/tmp/ruby/build/trunk/ext/io/console' I, [2024-05-16T20:38:17.657731 #1989561] INFO -- : make[2]: Leaving directory '/tmp/ruby/build/trunk/ext/io/console' I, [2024-05-16T20:38:17.669366 #1989561] INFO -- : make[2]: Entering directory '/tmp/ruby/build/trunk/ext/json' I, [2024-05-16T20:38:17.677448 #1989561] INFO -- : make[2]: Leaving directory '/tmp/ruby/build/trunk/ext/json' I, [2024-05-16T20:38:17.692367 #1989561] INFO -- : make[2]: Entering directory '/tmp/ruby/build/trunk/ext/monitor' I, [2024-05-16T20:38:17.696452 #1989561] INFO -- : make[2]: Leaving directory '/tmp/ruby/build/trunk/ext/monitor' I, [2024-05-16T20:38:17.703516 #1989561] INFO -- : make[2]: Entering directory '/tmp/ruby/build/trunk/ext/objspace' I, [2024-05-16T20:38:17.708851 #1989561] INFO -- : make[2]: Leaving directory '/tmp/ruby/build/trunk/ext/objspace' I, [2024-05-16T20:38:17.729251 #1989561] INFO -- : make[2]: Entering directory '/tmp/ruby/build/trunk/ext/openssl' I, [2024-05-16T20:38:17.748242 #1989561] INFO -- : make[2]: Leaving directory '/tmp/ruby/build/trunk/ext/openssl' I, [2024-05-16T20:38:17.751204 #1989561] INFO -- : make[2]: Entering directory '/tmp/ruby/build/trunk/ext/pathname' I, [2024-05-16T20:38:17.753867 #1989561] INFO -- : make[2]: Leaving directory '/tmp/ruby/build/trunk/ext/pathname' I, [2024-05-16T20:38:17.760149 #1989561] INFO -- : make[2]: Entering directory '/tmp/ruby/build/trunk/ext/psych' I, [2024-05-16T20:38:17.781375 #1989561] INFO -- : make[2]: Leaving directory '/tmp/ruby/build/trunk/ext/psych' I, [2024-05-16T20:38:17.786153 #1989561] INFO -- : make[2]: Entering directory '/tmp/ruby/build/trunk/ext/pty' I, [2024-05-16T20:38:17.790223 #1989561] INFO -- : make[2]: Leaving directory '/tmp/ruby/build/trunk/ext/pty' I, [2024-05-16T20:38:17.806565 #1989561] INFO -- : make[2]: Entering directory '/tmp/ruby/build/trunk/ext/ripper' I, [2024-05-16T20:38:17.815020 #1989561] INFO -- : make[2]: Leaving directory '/tmp/ruby/build/trunk/ext/ripper' I, [2024-05-16T20:38:17.817568 #1989561] INFO -- : make[2]: Entering directory '/tmp/ruby/build/trunk/ext/rubyvm' I, [2024-05-16T20:38:17.820712 #1989561] INFO -- : make[2]: Leaving directory '/tmp/ruby/build/trunk/ext/rubyvm' I, [2024-05-16T20:38:17.833036 #1989561] INFO -- : make[2]: Entering directory '/tmp/ruby/build/trunk/ext/socket' I, [2024-05-16T20:38:17.841067 #1989561] INFO -- : make[2]: Leaving directory '/tmp/ruby/build/trunk/ext/socket' I, [2024-05-16T20:38:17.859287 #1989561] INFO -- : make[2]: Entering directory '/tmp/ruby/build/trunk/.bundle/gems/bigdecimal-3.1.8/ext/bigdecimal' I, [2024-05-16T20:38:17.886806 #1989561] INFO -- : make[2]: Leaving directory '/tmp/ruby/build/trunk/.bundle/gems/bigdecimal-3.1.8/ext/bigdecimal' I, [2024-05-16T20:38:17.888801 #1989561] INFO -- : make[2]: Entering directory '/tmp/ruby/build/trunk/.bundle/gems/debug-1.9.2/ext/debug' I, [2024-05-16T20:38:17.914526 #1989561] INFO -- : make[2]: Leaving directory '/tmp/ruby/build/trunk/.bundle/gems/debug-1.9.2/ext/debug' I, [2024-05-16T20:38:17.917007 #1989561] INFO -- : make[2]: Entering directory '/tmp/ruby/build/trunk/.bundle/gems/nkf-0.2.0/ext/nkf' I, [2024-05-16T20:38:17.941695 #1989561] INFO -- : make[2]: Leaving directory '/tmp/ruby/build/trunk/.bundle/gems/nkf-0.2.0/ext/nkf' I, [2024-05-16T20:38:17.943609 #1989561] INFO -- : make[2]: Entering directory '/tmp/ruby/build/trunk/.bundle/gems/racc-1.7.3/ext/racc/cparse' I, [2024-05-16T20:38:17.964747 #1989561] INFO -- : make[2]: Leaving directory '/tmp/ruby/build/trunk/.bundle/gems/racc-1.7.3/ext/racc/cparse' I, [2024-05-16T20:38:17.967127 #1989561] INFO -- : make[2]: Entering directory '/tmp/ruby/build/trunk/.bundle/gems/rbs-3.4.4/ext/rbs_extension' I, [2024-05-16T20:38:17.988774 #1989561] INFO -- : make[2]: Leaving directory '/tmp/ruby/build/trunk/.bundle/gems/rbs-3.4.4/ext/rbs_extension' I, [2024-05-16T20:38:17.990972 #1989561] INFO -- : make[2]: Entering directory '/tmp/ruby/build/trunk/.bundle/gems/syslog-0.1.2/ext/syslog' I, [2024-05-16T20:38:18.012763 #1989561] INFO -- : make[2]: Leaving directory '/tmp/ruby/build/trunk/.bundle/gems/syslog-0.1.2/ext/syslog' I, [2024-05-16T20:38:18.040231 #1989561] INFO -- : make[2]: Entering directory '/tmp/ruby/build/trunk' I, [2024-05-16T20:38:18.105625 #1989561] INFO -- : make[2]: 'ruby' is up to date. I, [2024-05-16T20:38:18.105666 #1989561] INFO -- : make[2]: Leaving directory '/tmp/ruby/build/trunk' I, [2024-05-16T20:38:18.106090 #1989561] INFO -- : make[1]: Leaving directory '/tmp/ruby/build/trunk' I, [2024-05-16T20:38:18.109670 #1989561] INFO -- : make[1]: Entering directory '/tmp/ruby/build/trunk' I, [2024-05-16T20:38:18.109693 #1989561] INFO -- : make[1]: Nothing to be done for 'note'. I, [2024-05-16T20:38:18.109700 #1989561] INFO -- : make[1]: Leaving directory '/tmp/ruby/build/trunk' E, [2024-05-16T20:38:18.165876 #1989561] ERROR -- : $ /tmp/ruby/build/trunk/miniruby -I/tmp/ruby/src/trunk/lib /tmp/ruby/src/trunk/tool/runruby.rb --archdir=/tmp/ruby/build/trunk --extout=.ext -- /tmp/ruby/src/trunk/spec/mspec/bin/mspec-run -B /tmp/ruby/src/trunk/spec/default.mspec --error-output stderr --debug -fy -o /tmp/rubytest.s9s5q4/1-mspec-multi-0 E, [2024-05-16T20:38:18.166115 #1989561] ERROR -- : $ /tmp/ruby/build/trunk/miniruby -I/tmp/ruby/src/trunk/lib /tmp/ruby/src/trunk/tool/runruby.rb --archdir=/tmp/ruby/build/trunk --extout=.ext -- /tmp/ruby/src/trunk/spec/mspec/bin/mspec-run -B /tmp/ruby/src/trunk/spec/default.mspec --error-output stderr --debug -fy -o /tmp/rubytest.s9s5q4/2-mspec-multi-1 E, [2024-05-16T20:38:18.166384 #1989561] ERROR -- : $ /tmp/ruby/build/trunk/miniruby -I/tmp/ruby/src/trunk/lib /tmp/ruby/src/trunk/tool/runruby.rb --archdir=/tmp/ruby/build/trunk --extout=.ext -- /tmp/ruby/src/trunk/spec/mspec/bin/mspec-run -B /tmp/ruby/src/trunk/spec/default.mspec --error-output stderr --debug -fy -o /tmp/rubytest.s9s5q4/3-mspec-multi-2 E, [2024-05-16T20:38:18.166655 #1989561] ERROR -- : $ /tmp/ruby/build/trunk/miniruby -I/tmp/ruby/src/trunk/lib /tmp/ruby/src/trunk/tool/runruby.rb --archdir=/tmp/ruby/build/trunk --extout=.ext -- /tmp/ruby/src/trunk/spec/mspec/bin/mspec-run -B /tmp/ruby/src/trunk/spec/default.mspec --error-output stderr --debug -fy -o /tmp/rubytest.s9s5q4/4-mspec-multi-3 E, [2024-05-16T20:38:18.166941 #1989561] ERROR -- : $ /tmp/ruby/build/trunk/miniruby -I/tmp/ruby/src/trunk/lib /tmp/ruby/src/trunk/tool/runruby.rb --archdir=/tmp/ruby/build/trunk --extout=.ext -- /tmp/ruby/src/trunk/spec/mspec/bin/mspec-run -B /tmp/ruby/src/trunk/spec/default.mspec --error-output stderr --debug -fy -o /tmp/rubytest.s9s5q4/5-mspec-multi-4 E, [2024-05-16T20:38:18.167057 #1989561] ERROR -- : $ /tmp/ruby/build/trunk/miniruby -I/tmp/ruby/src/trunk/lib /tmp/ruby/src/trunk/tool/runruby.rb --archdir=/tmp/ruby/build/trunk --extout=.ext -- /tmp/ruby/src/trunk/spec/mspec/bin/mspec-run -B /tmp/ruby/src/trunk/spec/default.mspec --error-output stderr --debug -fy -o /tmp/rubytest.s9s5q4/6-mspec-multi-5 E, [2024-05-16T20:38:18.167335 #1989561] ERROR -- : $ /tmp/ruby/build/trunk/miniruby -I/tmp/ruby/src/trunk/lib /tmp/ruby/src/trunk/tool/runruby.rb --archdir=/tmp/ruby/build/trunk --extout=.ext -- /tmp/ruby/src/trunk/spec/mspec/bin/mspec-run -B /tmp/ruby/src/trunk/spec/default.mspec --error-output stderr --debug -fy -o /tmp/rubytest.s9s5q4/7-mspec-multi-6 E, [2024-05-16T20:38:18.167536 #1989561] ERROR -- : $ /tmp/ruby/build/trunk/miniruby -I/tmp/ruby/src/trunk/lib /tmp/ruby/src/trunk/tool/runruby.rb --archdir=/tmp/ruby/build/trunk --extout=.ext -- /tmp/ruby/src/trunk/spec/mspec/bin/mspec-run -B /tmp/ruby/src/trunk/spec/default.mspec --error-output stderr --debug -fy -o /tmp/rubytest.s9s5q4/8-mspec-multi-7 E, [2024-05-16T20:38:18.167754 #1989561] ERROR -- : $ /tmp/ruby/build/trunk/miniruby -I/tmp/ruby/src/trunk/lib /tmp/ruby/src/trunk/tool/runruby.rb --archdir=/tmp/ruby/build/trunk --extout=.ext -- /tmp/ruby/src/trunk/spec/mspec/bin/mspec-run -B /tmp/ruby/src/trunk/spec/default.mspec --error-output stderr --debug -fy -o /tmp/rubytest.s9s5q4/9-mspec-multi-8 E, [2024-05-16T20:38:18.167966 #1989561] ERROR -- : $ /tmp/ruby/build/trunk/miniruby -I/tmp/ruby/src/trunk/lib /tmp/ruby/src/trunk/tool/runruby.rb --archdir=/tmp/ruby/build/trunk --extout=.ext -- /tmp/ruby/src/trunk/spec/mspec/bin/mspec-run -B /tmp/ruby/src/trunk/spec/default.mspec --error-output stderr --debug -fy -o /tmp/rubytest.s9s5q4/10-mspec-multi-9 E, [2024-05-16T20:38:18.168157 #1989561] ERROR -- : $ /tmp/ruby/build/trunk/miniruby -I/tmp/ruby/src/trunk/lib /tmp/ruby/src/trunk/tool/runruby.rb --archdir=/tmp/ruby/build/trunk --extout=.ext -- /tmp/ruby/src/trunk/spec/mspec/bin/mspec-run -B /tmp/ruby/src/trunk/spec/default.mspec --error-output stderr --debug -fy -o /tmp/rubytest.s9s5q4/11-mspec-multi-10 E, [2024-05-16T20:38:18.168475 #1989561] ERROR -- : $ /tmp/ruby/build/trunk/miniruby -I/tmp/ruby/src/trunk/lib /tmp/ruby/src/trunk/tool/runruby.rb --archdir=/tmp/ruby/build/trunk --extout=.ext -- /tmp/ruby/src/trunk/spec/mspec/bin/mspec-run -B /tmp/ruby/src/trunk/spec/default.mspec --error-output stderr --debug -fy -o /tmp/rubytest.s9s5q4/12-mspec-multi-11 E, [2024-05-16T20:38:18.168665 #1989561] ERROR -- : $ /tmp/ruby/build/trunk/miniruby -I/tmp/ruby/src/trunk/lib /tmp/ruby/src/trunk/tool/runruby.rb --archdir=/tmp/ruby/build/trunk --extout=.ext -- /tmp/ruby/src/trunk/spec/mspec/bin/mspec-run -B /tmp/ruby/src/trunk/spec/default.mspec --error-output stderr --debug -fy -o /tmp/rubytest.s9s5q4/13-mspec-multi-12 E, [2024-05-16T20:38:18.168862 #1989561] ERROR -- : $ /tmp/ruby/build/trunk/miniruby -I/tmp/ruby/src/trunk/lib /tmp/ruby/src/trunk/tool/runruby.rb --archdir=/tmp/ruby/build/trunk --extout=.ext -- /tmp/ruby/src/trunk/spec/mspec/bin/mspec-run -B /tmp/ruby/src/trunk/spec/default.mspec --error-output stderr --debug -fy -o /tmp/rubytest.s9s5q4/14-mspec-multi-13 E, [2024-05-16T20:38:18.169037 #1989561] ERROR -- : $ /tmp/ruby/build/trunk/miniruby -I/tmp/ruby/src/trunk/lib /tmp/ruby/src/trunk/tool/runruby.rb --archdir=/tmp/ruby/build/trunk --extout=.ext -- /tmp/ruby/src/trunk/spec/mspec/bin/mspec-run -B /tmp/ruby/src/trunk/spec/default.mspec --error-output stderr --debug -fy -o /tmp/rubytest.s9s5q4/15-mspec-multi-14 E, [2024-05-16T20:38:18.169234 #1989561] ERROR -- : $ /tmp/ruby/build/trunk/miniruby -I/tmp/ruby/src/trunk/lib /tmp/ruby/src/trunk/tool/runruby.rb --archdir=/tmp/ruby/build/trunk --extout=.ext -- /tmp/ruby/src/trunk/spec/mspec/bin/mspec-run -B /tmp/ruby/src/trunk/spec/default.mspec --error-output stderr --debug -fy -o /tmp/rubytest.s9s5q4/16-mspec-multi-15 E, [2024-05-16T20:38:18.169430 #1989561] ERROR -- : $ /tmp/ruby/build/trunk/miniruby -I/tmp/ruby/src/trunk/lib /tmp/ruby/src/trunk/tool/runruby.rb --archdir=/tmp/ruby/build/trunk --extout=.ext -- /tmp/ruby/src/trunk/spec/mspec/bin/mspec-run -B /tmp/ruby/src/trunk/spec/default.mspec --error-output stderr --debug -fy -o /tmp/rubytest.s9s5q4/17-mspec-multi-16 E, [2024-05-16T20:38:18.169623 #1989561] ERROR -- : $ /tmp/ruby/build/trunk/miniruby -I/tmp/ruby/src/trunk/lib /tmp/ruby/src/trunk/tool/runruby.rb --archdir=/tmp/ruby/build/trunk --extout=.ext -- /tmp/ruby/src/trunk/spec/mspec/bin/mspec-run -B /tmp/ruby/src/trunk/spec/default.mspec --error-output stderr --debug -fy -o /tmp/rubytest.s9s5q4/18-mspec-multi-17 E, [2024-05-16T20:38:18.171843 #1989561] ERROR -- : $ /tmp/ruby/build/trunk/miniruby -I/tmp/ruby/src/trunk/lib /tmp/ruby/src/trunk/tool/runruby.rb --archdir=/tmp/ruby/build/trunk --extout=.ext -- /tmp/ruby/src/trunk/spec/mspec/bin/mspec-run -B /tmp/ruby/src/trunk/spec/default.mspec --error-output stderr --debug -fy -o /tmp/rubytest.s9s5q4/19-mspec-multi-18 E, [2024-05-16T20:38:18.172072 #1989561] ERROR -- : $ /tmp/ruby/build/trunk/miniruby -I/tmp/ruby/src/trunk/lib /tmp/ruby/src/trunk/tool/runruby.rb --archdir=/tmp/ruby/build/trunk --extout=.ext -- /tmp/ruby/src/trunk/spec/mspec/bin/mspec-run -B /tmp/ruby/src/trunk/spec/default.mspec --error-output stderr --debug -fy -o /tmp/rubytest.s9s5q4/20-mspec-multi-19 I, [2024-05-16T20:38:18.336151 #1989561] INFO -- : ruby 3.4.0dev (2024-05-16T19:35:22Z master 854cbbd5a9) [x86_64-linux] I, [2024-05-16T20:38:18.942604 #1989561] INFO -- : 0 ......................................................................... I, [2024-05-16T20:38:19.329600 #1989561] INFO -- : 73 ......................................................................... I, [2024-05-16T20:38:19.471772 #1989561] INFO -- : 146 ......................................................................... I, [2024-05-16T20:38:19.534367 #1989561] INFO -- : 219 ......................................................................... I, [2024-05-16T20:38:19.607059 #1989561] INFO -- : 292 ......................................................................... I, [2024-05-16T20:38:19.647063 #1989561] INFO -- : 365 ......................................................................... I, [2024-05-16T20:38:19.666042 #1989561] INFO -- : 438 ......................................................................... I, [2024-05-16T20:38:19.684113 #1989561] INFO -- : 511 ......................................................................... I, [2024-05-16T20:38:19.701292 #1989561] INFO -- : 584 ......................................................................... I, [2024-05-16T20:38:19.748902 #1989561] INFO -- : 657 ......................................................................... I, [2024-05-16T20:38:19.776470 #1989561] INFO -- : 730 ......................................................................... I, [2024-05-16T20:38:19.797464 #1989561] INFO -- : 803 ......................................................................... I, [2024-05-16T20:38:19.825754 #1989561] INFO -- : 876 ......................................................................... I, [2024-05-16T20:38:19.877661 #1989561] INFO -- : 949 ......................................................................... I, [2024-05-16T20:38:19.979499 #1989561] INFO -- : 1022 ......................................................................... I, [2024-05-16T20:38:20.135121 #1989561] INFO -- : 1095 ......................................................................... I, [2024-05-16T20:38:20.260266 #1989561] INFO -- : 1168 ......................................................................... I, [2024-05-16T20:38:20.312868 #1989561] INFO -- : 1241 ......................................................................... I, [2024-05-16T20:38:20.354596 #1989561] INFO -- : 1314 ......................................................................... I, [2024-05-16T20:38:20.372536 #1989561] INFO -- : 1387 ......................................................................... I, [2024-05-16T20:38:20.485344 #1989561] INFO -- : 1460 ......................................................................... I, [2024-05-16T20:38:20.955214 #1989561] INFO -- : 1533 ......................................................................... I, [2024-05-16T20:38:21.006830 #1989561] INFO -- : 1606 ......................................................................... I, [2024-05-16T20:38:21.107521 #1989561] INFO -- : 1679 ......................................................................... I, [2024-05-16T20:38:21.214125 #1989561] INFO -- : 1752 ......................................................................... I, [2024-05-16T20:38:21.299645 #1989561] INFO -- : 1825 ......................................................................... I, [2024-05-16T20:38:21.406357 #1989561] INFO -- : 1898 ......................................................................... I, [2024-05-16T20:38:21.481452 #1989561] INFO -- : 1971 ......................................................................... I, [2024-05-16T20:38:21.559940 #1989561] INFO -- : 2044 ......................................................................... I, [2024-05-16T20:38:21.604937 #1989561] INFO -- : 2117 ......................................................................... I, [2024-05-16T20:38:21.624731 #1989561] INFO -- : 2190 ......................................................................... I, [2024-05-16T20:38:21.644781 #1989561] INFO -- : 2263 ......................................................................... I, [2024-05-16T20:38:21.660310 #1989561] INFO -- : 2336 ......................................................................... I, [2024-05-16T20:38:21.697277 #1989561] INFO -- : 2409 ......................................................................... I, [2024-05-16T20:38:21.801384 #1989561] INFO -- : 2482 ......................................................................... I, [2024-05-16T20:38:21.822804 #1989561] INFO -- : 2555 ......................................................................... I, [2024-05-16T20:38:21.917279 #1989561] INFO -- : 2628 ......................................................................... I, [2024-05-16T20:38:22.011154 #1989561] INFO -- : 2701 ......................................................................... I, [2024-05-16T20:38:22.048072 #1989561] INFO -- : 2774 ......................................................................... I, [2024-05-16T20:38:22.105757 #1989561] INFO -- : 2847 ......................................................................... I, [2024-05-16T20:38:22.139978 #1989561] INFO -- : 2920 ......................................................................... I, [2024-05-16T20:38:22.162790 #1989561] INFO -- : 2993 ......................................................................... I, [2024-05-16T20:38:22.184192 #1989561] INFO -- : 3066 ......................................................................... I, [2024-05-16T20:38:22.198120 #1989561] INFO -- : 3139 ......................................................................... I, [2024-05-16T20:38:22.207274 #1989561] INFO -- : 3212 ......................................................................... I, [2024-05-16T20:38:22.239496 #1989561] INFO -- : 3285 ......................................................................... I, [2024-05-16T20:38:26.209031 #1989561] INFO -- : 3358 ........................................................................ I, [2024-05-16T20:38:26.209118 #1989561] INFO -- : I, [2024-05-16T20:38:26.209137 #1989561] INFO -- : Finished in 8.042309 seconds I, [2024-05-16T20:38:26.209152 #1989561] INFO -- : I, [2024-05-16T20:38:26.209166 #1989561] INFO -- : 3429 files, 32611 examples, 192392 expectations, 0 failures, 0 errors, 0 tagged I, [2024-05-16T20:38:26.211422 #1989561] INFO -- : $$$[end] "make yes-test-rubyspec MSPECOPT='--error-output stderr --debug -j' TESTS='-j20'" exit with 0.