# Logfile created on 2024-05-15 13:53:46 +0000 by logger.rb/v1.4.3 I, [2024-05-15T13:53:46.254892 #2919491] INFO -- : #, @formatter=nil, @logdev=#, @binmode=false, @mon_data=#, @mon_data_owner_object_id=860>>> I, [2024-05-15T13:53:46.255013 #2919491] INFO -- : $$$[beg] make update-unicode -j20 I, [2024-05-15T13:53:46.314084 #2919491] INFO -- : Downloading Unicode emoji 15.0 files... I, [2024-05-15T13:53:46.314282 #2919491] INFO -- : Downloading Unicode emoji 15.0 files... I, [2024-05-15T13:53:46.314927 #2919491] INFO -- : Downloading Unicode emoji 15.0 files... I, [2024-05-15T13:53:46.357377 #2919491] INFO -- : made symlink emoji/15.0/emoji-sequences.txt to /tmp/ruby/src/trunk/.downloaded-cache/emoji/15.0/emoji-sequences.txt I, [2024-05-15T13:53:46.357670 #2919491] INFO -- : downloading emoji/15.0/emoji-sequences.txt ... downloading emoji/15.0/emoji-test.txt ... /tmp/ruby/src/trunk/enc/unicode/data/emoji/15.0/emoji-sequences.txt already exists E, [2024-05-15T13:53:46.810358 #2919491] ERROR -- : /tmp/ruby/src/trunk/tool/downloader.rb:302:in `rescue in download': failed to download emoji/15.0/emoji-test.txt (RuntimeError) E, [2024-05-15T13:53:46.810483 #2919491] ERROR -- : OpenURI::HTTPError: 403 Forbidden: https://www.unicode.org/Public/emoji/15.0/emoji-test.txt E, [2024-05-15T13:53:46.810502 #2919491] ERROR -- : from /tmp/ruby/src/trunk/tool/downloader.rb:201:in `download' E, [2024-05-15T13:53:46.810514 #2919491] ERROR -- : from /tmp/ruby/src/trunk/tool/downloader.rb:136:in `download' E, [2024-05-15T13:53:46.810526 #2919491] ERROR -- : from /tmp/ruby/src/trunk/tool/downloader.rb:482:in `block in
' E, [2024-05-15T13:53:46.810538 #2919491] ERROR -- : from /tmp/ruby/src/trunk/tool/downloader.rb:465:in `each' E, [2024-05-15T13:53:46.810549 #2919491] ERROR -- : from /tmp/ruby/src/trunk/tool/downloader.rb:465:in `
' E, [2024-05-15T13:53:46.810559 #2919491] ERROR -- : /usr/lib/ruby/3.0.0/open-uri.rb:364:in `open_http': 403 Forbidden (OpenURI::HTTPError) E, [2024-05-15T13:53:46.810570 #2919491] ERROR -- : from /usr/lib/ruby/3.0.0/open-uri.rb:741:in `buffer_open' E, [2024-05-15T13:53:46.810584 #2919491] ERROR -- : from /usr/lib/ruby/3.0.0/open-uri.rb:212:in `block in open_loop' E, [2024-05-15T13:53:46.810595 #2919491] ERROR -- : from /usr/lib/ruby/3.0.0/open-uri.rb:210:in `catch' E, [2024-05-15T13:53:46.810606 #2919491] ERROR -- : from /usr/lib/ruby/3.0.0/open-uri.rb:210:in `open_loop' E, [2024-05-15T13:53:46.810617 #2919491] ERROR -- : from /usr/lib/ruby/3.0.0/open-uri.rb:151:in `open_uri' E, [2024-05-15T13:53:46.810627 #2919491] ERROR -- : from /usr/lib/ruby/3.0.0/open-uri.rb:721:in `open' E, [2024-05-15T13:53:46.810637 #2919491] ERROR -- : from /usr/lib/ruby/3.0.0/open-uri.rb:729:in `read' E, [2024-05-15T13:53:46.810648 #2919491] ERROR -- : from /tmp/ruby/src/trunk/tool/downloader.rb:247:in `block in download' E, [2024-05-15T13:53:46.810675 #2919491] ERROR -- : from /tmp/ruby/src/trunk/tool/downloader.rb:378:in `with_retry' E, [2024-05-15T13:53:46.810689 #2919491] ERROR -- : from /tmp/ruby/src/trunk/tool/downloader.rb:246:in `download' E, [2024-05-15T13:53:46.810700 #2919491] ERROR -- : from /tmp/ruby/src/trunk/tool/downloader.rb:136:in `download' E, [2024-05-15T13:53:46.810711 #2919491] ERROR -- : from /tmp/ruby/src/trunk/tool/downloader.rb:482:in `block in
' E, [2024-05-15T13:53:46.810722 #2919491] ERROR -- : from /tmp/ruby/src/trunk/tool/downloader.rb:465:in `each' E, [2024-05-15T13:53:46.810733 #2919491] ERROR -- : from /tmp/ruby/src/trunk/tool/downloader.rb:465:in `
' E, [2024-05-15T13:53:46.814536 #2919491] ERROR -- : make: *** [uncommon.mk:1765: /tmp/ruby/src/trunk/enc/unicode/data/emoji/15.0/emoji-zwj-sequences.txt] Error 1 E, [2024-05-15T13:53:46.814588 #2919491] ERROR -- : make: *** Waiting for unfinished jobs.... E, [2024-05-15T13:53:46.814603 #2919491] ERROR -- : /tmp/ruby/src/trunk/tool/downloader.rb:302:in `rescue in download': failed to download emoji/15.0/emoji-test.txt (RuntimeError) E, [2024-05-15T13:53:46.814620 #2919491] ERROR -- : OpenURI::HTTPError: 403 Forbidden: https://www.unicode.org/Public/emoji/15.0/emoji-test.txt E, [2024-05-15T13:53:46.814629 #2919491] ERROR -- : from /tmp/ruby/src/trunk/tool/downloader.rb:201:in `download' E, [2024-05-15T13:53:46.814637 #2919491] ERROR -- : from /tmp/ruby/src/trunk/tool/downloader.rb:136:in `download' E, [2024-05-15T13:53:46.814645 #2919491] ERROR -- : from /tmp/ruby/src/trunk/tool/downloader.rb:482:in `block in
' E, [2024-05-15T13:53:46.814653 #2919491] ERROR -- : from /tmp/ruby/src/trunk/tool/downloader.rb:465:in `each' E, [2024-05-15T13:53:46.814661 #2919491] ERROR -- : from /tmp/ruby/src/trunk/tool/downloader.rb:465:in `
' E, [2024-05-15T13:53:46.814669 #2919491] ERROR -- : /usr/lib/ruby/3.0.0/open-uri.rb:364:in `open_http': 403 Forbidden (OpenURI::HTTPError) E, [2024-05-15T13:53:46.814685 #2919491] ERROR -- : from /usr/lib/ruby/3.0.0/open-uri.rb:741:in `buffer_open' E, [2024-05-15T13:53:46.814698 #2919491] ERROR -- : from /usr/lib/ruby/3.0.0/open-uri.rb:212:in `block in open_loop' E, [2024-05-15T13:53:46.814706 #2919491] ERROR -- : from /usr/lib/ruby/3.0.0/open-uri.rb:210:in `catch' E, [2024-05-15T13:53:46.814714 #2919491] ERROR -- : from /usr/lib/ruby/3.0.0/open-uri.rb:210:in `open_loop' E, [2024-05-15T13:53:46.814722 #2919491] ERROR -- : from /usr/lib/ruby/3.0.0/open-uri.rb:151:in `open_uri' E, [2024-05-15T13:53:46.814730 #2919491] ERROR -- : from /usr/lib/ruby/3.0.0/open-uri.rb:721:in `open' E, [2024-05-15T13:53:46.814738 #2919491] ERROR -- : from /usr/lib/ruby/3.0.0/open-uri.rb:729:in `read' E, [2024-05-15T13:53:46.814746 #2919491] ERROR -- : from /tmp/ruby/src/trunk/tool/downloader.rb:247:in `block in download' E, [2024-05-15T13:53:46.814754 #2919491] ERROR -- : from /tmp/ruby/src/trunk/tool/downloader.rb:378:in `with_retry' E, [2024-05-15T13:53:46.814764 #2919491] ERROR -- : from /tmp/ruby/src/trunk/tool/downloader.rb:246:in `download' E, [2024-05-15T13:53:46.814772 #2919491] ERROR -- : from /tmp/ruby/src/trunk/tool/downloader.rb:136:in `download' E, [2024-05-15T13:53:46.814780 #2919491] ERROR -- : from /tmp/ruby/src/trunk/tool/downloader.rb:482:in `block in
' E, [2024-05-15T13:53:46.814789 #2919491] ERROR -- : from /tmp/ruby/src/trunk/tool/downloader.rb:465:in `each' E, [2024-05-15T13:53:46.814796 #2919491] ERROR -- : from /tmp/ruby/src/trunk/tool/downloader.rb:465:in `
' E, [2024-05-15T13:53:46.818398 #2919491] ERROR -- : make: *** [uncommon.mk:1765: /tmp/ruby/src/trunk/enc/unicode/data/emoji/15.0/emoji-sequences.txt] Error 1 E, [2024-05-15T13:53:46.818449 #2919491] ERROR -- : make: *** Deleting file '/tmp/ruby/src/trunk/enc/unicode/data/emoji/15.0/emoji-sequences.txt' E, [2024-05-15T13:53:47.245734 #2919491] ERROR -- : /tmp/ruby/src/trunk/tool/downloader.rb:302:in `rescue in download': failed to download emoji/15.0/emoji-sequences.txt (RuntimeError) E, [2024-05-15T13:53:47.245892 #2919491] ERROR -- : EOFError: end of file reached: https://www.unicode.org/Public/emoji/15.0/emoji-sequences.txt E, [2024-05-15T13:53:47.245915 #2919491] ERROR -- : from /tmp/ruby/src/trunk/tool/downloader.rb:201:in `download' E, [2024-05-15T13:53:47.245929 #2919491] ERROR -- : from /tmp/ruby/src/trunk/tool/downloader.rb:136:in `download' E, [2024-05-15T13:53:47.245942 #2919491] ERROR -- : from /tmp/ruby/src/trunk/tool/downloader.rb:482:in `block in
' E, [2024-05-15T13:53:47.245955 #2919491] ERROR -- : from /tmp/ruby/src/trunk/tool/downloader.rb:465:in `each' E, [2024-05-15T13:53:47.245968 #2919491] ERROR -- : from /tmp/ruby/src/trunk/tool/downloader.rb:465:in `
' E, [2024-05-15T13:53:47.245982 #2919491] ERROR -- : /usr/lib/ruby/3.0.0/net/protocol.rb:227:in `rbuf_fill': end of file reached (EOFError) E, [2024-05-15T13:53:47.246000 #2919491] ERROR -- : from /usr/lib/ruby/3.0.0/net/protocol.rb:193:in `readuntil' E, [2024-05-15T13:53:47.246013 #2919491] ERROR -- : from /usr/lib/ruby/3.0.0/net/protocol.rb:203:in `readline' E, [2024-05-15T13:53:47.246026 #2919491] ERROR -- : from /usr/lib/ruby/3.0.0/net/http/response.rb:42:in `read_status_line' E, [2024-05-15T13:53:47.246039 #2919491] ERROR -- : from /usr/lib/ruby/3.0.0/net/http/response.rb:31:in `read_new' E, [2024-05-15T13:53:47.246052 #2919491] ERROR -- : from /usr/lib/ruby/3.0.0/net/http.rb:1557:in `block in transport_request' E, [2024-05-15T13:53:47.246065 #2919491] ERROR -- : from /usr/lib/ruby/3.0.0/net/http.rb:1548:in `catch' E, [2024-05-15T13:53:47.246321 #2919491] ERROR -- : from /usr/lib/ruby/3.0.0/net/http.rb:1548:in `transport_request' E, [2024-05-15T13:53:47.246337 #2919491] ERROR -- : from /usr/lib/ruby/3.0.0/net/http.rb:1521:in `request' E, [2024-05-15T13:53:47.246349 #2919491] ERROR -- : from /usr/lib/ruby/3.0.0/open-uri.rb:329:in `block in open_http' E, [2024-05-15T13:53:47.246362 #2919491] ERROR -- : from /usr/lib/ruby/3.0.0/net/http.rb:960:in `start' E, [2024-05-15T13:53:47.246375 #2919491] ERROR -- : from /usr/lib/ruby/3.0.0/open-uri.rb:323:in `open_http' E, [2024-05-15T13:53:47.246391 #2919491] ERROR -- : from /usr/lib/ruby/3.0.0/open-uri.rb:741:in `buffer_open' E, [2024-05-15T13:53:47.246405 #2919491] ERROR -- : from /usr/lib/ruby/3.0.0/open-uri.rb:212:in `block in open_loop' E, [2024-05-15T13:53:47.246418 #2919491] ERROR -- : from /usr/lib/ruby/3.0.0/open-uri.rb:210:in `catch' E, [2024-05-15T13:53:47.246430 #2919491] ERROR -- : from /usr/lib/ruby/3.0.0/open-uri.rb:210:in `open_loop' E, [2024-05-15T13:53:47.246443 #2919491] ERROR -- : from /usr/lib/ruby/3.0.0/open-uri.rb:151:in `open_uri' E, [2024-05-15T13:53:47.246455 #2919491] ERROR -- : from /usr/lib/ruby/3.0.0/open-uri.rb:721:in `open' E, [2024-05-15T13:53:47.246468 #2919491] ERROR -- : from /usr/lib/ruby/3.0.0/open-uri.rb:729:in `read' E, [2024-05-15T13:53:47.246485 #2919491] ERROR -- : from /tmp/ruby/src/trunk/tool/downloader.rb:247:in `block in download' E, [2024-05-15T13:53:47.246498 #2919491] ERROR -- : from /tmp/ruby/src/trunk/tool/downloader.rb:378:in `with_retry' E, [2024-05-15T13:53:47.246514 #2919491] ERROR -- : from /tmp/ruby/src/trunk/tool/downloader.rb:246:in `download' E, [2024-05-15T13:53:47.246527 #2919491] ERROR -- : from /tmp/ruby/src/trunk/tool/downloader.rb:136:in `download' E, [2024-05-15T13:53:47.246539 #2919491] ERROR -- : from /tmp/ruby/src/trunk/tool/downloader.rb:482:in `block in
' E, [2024-05-15T13:53:47.246551 #2919491] ERROR -- : from /tmp/ruby/src/trunk/tool/downloader.rb:465:in `each' E, [2024-05-15T13:53:47.246563 #2919491] ERROR -- : from /tmp/ruby/src/trunk/tool/downloader.rb:465:in `
' E, [2024-05-15T13:53:47.250640 #2919491] ERROR -- : make: *** [uncommon.mk:1765: /tmp/ruby/src/trunk/enc/unicode/data/emoji/15.0/emoji-test.txt] Error 1 I, [2024-05-15T13:53:47.250736 #2919491] INFO -- : downloading emoji/15.0/emoji-test.txt ... I, [2024-05-15T13:53:47.251426 #2919491] INFO -- : $$$[end] "make update-unicode -j20" exit with 512. I, [2024-05-15T13:53:47.251492 #2919491] INFO -- : $$$[beg] make update-download -j20 I, [2024-05-15T13:53:47.365263 #2919491] INFO -- : tool/config.guess already exists I, [2024-05-15T13:53:47.365319 #2919491] INFO -- : tool/config.sub already exists I, [2024-05-15T13:53:47.367658 #2919491] INFO -- : Update minitest to ea9caafc0754b1d6236a490d59e624b53209734a I, [2024-05-15T13:53:47.367899 #2919491] INFO -- : Update power_assert to 84e85124c5014a139af39161d484156cfe87a9ed I, [2024-05-15T13:53:47.368033 #2919491] INFO -- : Update rbs to ba7872795d5de04adb8ff500c0e6afdc81a041dd I, [2024-05-15T13:53:47.368977 #2919491] INFO -- : Update typeprof to b19a6416da3a05d57fadd6ffdadb382b6d236ca5 I, [2024-05-15T13:53:47.369152 #2919491] INFO -- : echo ea9caafc0754b1d6236a490d59e624b53209734a | /bin/sh /tmp/ruby/src/trunk/tool/ifchange /tmp/ruby/src/trunk/.bundle/.timestamp/minitest.revision - I, [2024-05-15T13:53:47.369422 #2919491] INFO -- : echo 84e85124c5014a139af39161d484156cfe87a9ed | /bin/sh /tmp/ruby/src/trunk/tool/ifchange /tmp/ruby/src/trunk/.bundle/.timestamp/power_assert.revision - I, [2024-05-15T13:53:47.369630 #2919491] INFO -- : echo ba7872795d5de04adb8ff500c0e6afdc81a041dd | /bin/sh /tmp/ruby/src/trunk/tool/ifchange /tmp/ruby/src/trunk/.bundle/.timestamp/rbs.revision - I, [2024-05-15T13:53:47.370895 #2919491] INFO -- : echo b19a6416da3a05d57fadd6ffdadb382b6d236ca5 | /bin/sh /tmp/ruby/src/trunk/tool/ifchange /tmp/ruby/src/trunk/.bundle/.timestamp/typeprof.revision - I, [2024-05-15T13:53:47.371242 #2919491] INFO -- : /tmp/ruby/src/trunk/.bundle/.timestamp/minitest.revision unchanged I, [2024-05-15T13:53:47.371274 #2919491] INFO -- : /tmp/ruby/src/trunk/.bundle/.timestamp/power_assert.revision unchanged I, [2024-05-15T13:53:47.371512 #2919491] INFO -- : /tmp/ruby/src/trunk/.bundle/.timestamp/rbs.revision unchanged I, [2024-05-15T13:53:47.372280 #2919491] INFO -- : Building power_assert@84e85124c5014a139af39161d484156cfe87a9ed to /tmp/ruby/src/trunk/gems/power_assert-2.0.3.gem I, [2024-05-15T13:53:47.372969 #2919491] INFO -- : /tmp/ruby/src/trunk/.bundle/.timestamp/typeprof.revision unchanged I, [2024-05-15T13:53:47.441065 #2919491] INFO -- : Successfully built RubyGem I, [2024-05-15T13:53:47.441106 #2919491] INFO -- : Name: power_assert I, [2024-05-15T13:53:47.441116 #2919491] INFO -- : Version: 2.0.4dev I, [2024-05-15T13:53:47.441120 #2919491] INFO -- : File: power_assert-2.0.4dev.gem I, [2024-05-15T13:53:47.486401 #2919491] INFO -- : $$$[end] "make update-download -j20" exit with 0. I, [2024-05-15T13:53:47.486436 #2919491] INFO -- : $$$[beg] make update-rubyspec -j20 I, [2024-05-15T13:53:47.548371 #2919491] INFO -- : make: Nothing to be done for 'update-rubyspec'. I, [2024-05-15T13:53:47.548892 #2919491] INFO -- : $$$[end] "make update-rubyspec -j20" exit with 0. I, [2024-05-15T13:53:47.548937 #2919491] INFO -- : $$$[beg] make update-src -j20 I, [2024-05-15T13:53:48.129797 #2919491] INFO -- : Already up to date. I, [2024-05-15T13:53:48.147331 #2919491] INFO -- : Latest commit hash = e73f6618d5 I, [2024-05-15T13:53:48.148788 #2919491] INFO -- : $$$[end] "make update-src -j20" exit with 0. I, [2024-05-15T13:53:48.148832 #2919491] INFO -- : $$$[beg] make after-update -j20 I, [2024-05-15T13:53:48.233655 #2919491] INFO -- : generating /tmp/ruby/src/trunk/ext/ripper/eventids2table.c I, [2024-05-15T13:53:48.237957 #2919491] INFO -- : make[1]: Entering directory '/tmp/ruby/src/trunk/ext/ripper' I, [2024-05-15T13:53:48.237979 #2919491] INFO -- : make[1]: Nothing to be done for 'src'. I, [2024-05-15T13:53:48.237985 #2919491] INFO -- : make[1]: Leaving directory '/tmp/ruby/src/trunk/ext/ripper' I, [2024-05-15T13:53:48.254748 #2919491] INFO -- : /tmp/ruby/src/trunk/revision.h updated I, [2024-05-15T13:53:48.256074 #2919491] INFO -- : generating x86_64-linux-fake.rb I, [2024-05-15T13:53:48.309211 #2919491] INFO -- : x86_64-linux-fake.rb updated I, [2024-05-15T13:53:48.310581 #2919491] INFO -- : generating enc.mk I, [2024-05-15T13:53:48.430440 #2919491] INFO -- : making srcs under enc I, [2024-05-15T13:53:48.459902 #2919491] INFO -- : make[1]: Entering directory '/tmp/ruby/build/trunk' I, [2024-05-15T13:53:48.459936 #2919491] INFO -- : make[1]: Nothing to be done for 'srcs'. I, [2024-05-15T13:53:48.459942 #2919491] INFO -- : make[1]: Leaving directory '/tmp/ruby/build/trunk' I, [2024-05-15T13:53:48.508439 #2919491] INFO -- : Update minitest to ea9caafc0754b1d6236a490d59e624b53209734a I, [2024-05-15T13:53:48.508692 #2919491] INFO -- : Update power_assert to 84e85124c5014a139af39161d484156cfe87a9ed I, [2024-05-15T13:53:48.509399 #2919491] INFO -- : Update rbs to ba7872795d5de04adb8ff500c0e6afdc81a041dd I, [2024-05-15T13:53:48.509638 #2919491] INFO -- : Update typeprof to b19a6416da3a05d57fadd6ffdadb382b6d236ca5 I, [2024-05-15T13:53:48.510145 #2919491] INFO -- : echo ea9caafc0754b1d6236a490d59e624b53209734a | /bin/sh /tmp/ruby/src/trunk/tool/ifchange /tmp/ruby/src/trunk/.bundle/.timestamp/minitest.revision - I, [2024-05-15T13:53:48.510288 #2919491] INFO -- : echo 84e85124c5014a139af39161d484156cfe87a9ed | /bin/sh /tmp/ruby/src/trunk/tool/ifchange /tmp/ruby/src/trunk/.bundle/.timestamp/power_assert.revision - I, [2024-05-15T13:53:48.511659 #2919491] INFO -- : echo ba7872795d5de04adb8ff500c0e6afdc81a041dd | /bin/sh /tmp/ruby/src/trunk/tool/ifchange /tmp/ruby/src/trunk/.bundle/.timestamp/rbs.revision - I, [2024-05-15T13:53:48.511767 #2919491] INFO -- : /tmp/ruby/src/trunk/.bundle/.timestamp/minitest.revision unchanged I, [2024-05-15T13:53:48.511929 #2919491] INFO -- : echo b19a6416da3a05d57fadd6ffdadb382b6d236ca5 | /bin/sh /tmp/ruby/src/trunk/tool/ifchange /tmp/ruby/src/trunk/.bundle/.timestamp/typeprof.revision - I, [2024-05-15T13:53:48.512056 #2919491] INFO -- : /tmp/ruby/src/trunk/.bundle/.timestamp/power_assert.revision unchanged I, [2024-05-15T13:53:48.513320 #2919491] INFO -- : Building power_assert@84e85124c5014a139af39161d484156cfe87a9ed to /tmp/ruby/src/trunk/gems/power_assert-2.0.3.gem I, [2024-05-15T13:53:48.513531 #2919491] INFO -- : /tmp/ruby/src/trunk/.bundle/.timestamp/typeprof.revision unchanged I, [2024-05-15T13:53:48.513574 #2919491] INFO -- : /tmp/ruby/src/trunk/.bundle/.timestamp/rbs.revision unchanged I, [2024-05-15T13:53:48.582688 #2919491] INFO -- : Successfully built RubyGem I, [2024-05-15T13:53:48.582752 #2919491] INFO -- : Name: power_assert I, [2024-05-15T13:53:48.582768 #2919491] INFO -- : Version: 2.0.4dev I, [2024-05-15T13:53:48.582788 #2919491] INFO -- : File: power_assert-2.0.4dev.gem I, [2024-05-15T13:53:48.584803 #2919491] INFO -- : Extracting bundle gem power_assert-2.0.3... I, [2024-05-15T13:53:48.645249 #2919491] INFO -- : Try with hash version of bundled gems instead of gems/power_assert-2.0.3.gem. We don't use this gem with release version of Ruby. I, [2024-05-15T13:53:48.650177 #2919491] INFO -- : Unpacked gems/power_assert-2.0.4dev.gem I, [2024-05-15T13:53:48.652110 #2919491] INFO -- : $$$[end] "make after-update -j20" exit with 0. I, [2024-05-15T13:53:48.652290 #2919491] INFO -- : $$$[beg] make miniruby -j20 I, [2024-05-15T13:53:48.708851 #2919491] INFO -- : BASERUBY = /usr/bin/ruby --disable=gems I, [2024-05-15T13:53:48.708879 #2919491] INFO -- : CC = gcc I, [2024-05-15T13:53:48.708885 #2919491] INFO -- : LD = ld I, [2024-05-15T13:53:48.708889 #2919491] INFO -- : LDSHARED = gcc -shared I, [2024-05-15T13:53:48.708893 #2919491] INFO -- : CFLAGS = -O3 -fno-fast-math -ggdb3 -Wall -Wextra -Wdeprecated-declarations -Wdiv-by-zero -Wduplicated-cond -Wimplicit-function-declaration -Wimplicit-int -Wpointer-arith -Wwrite-strings -Wold-style-definition -Wimplicit-fallthrough=0 -Wmissing-noreturn -Wno-cast-function-type -Wno-constant-logical-operand -Wno-long-long -Wno-missing-field-initializers -Wno-overlength-strings -Wno-packed-bitfield-compat -Wno-parentheses-equality -Wno-self-assign -Wno-tautological-compare -Wno-unused-parameter -Wno-unused-value -Wsuggest-attribute=format -Wsuggest-attribute=noreturn -Wunused-variable -Wmisleading-indentation -Wundef -fPIC I, [2024-05-15T13:53:48.708898 #2919491] INFO -- : XCFLAGS = -U_FORTIFY_SOURCE -D_FORTIFY_SOURCE=2 -fstack-protector-strong -fno-strict-overflow -fvisibility=hidden -fexcess-precision=standard -DRUBY_EXPORT -I. -I.ext/include/x86_64-linux -I/tmp/ruby/src/trunk/include -I/tmp/ruby/src/trunk -I/tmp/ruby/src/trunk/prism -I/tmp/ruby/src/trunk/enc/unicode/15.0.0 I, [2024-05-15T13:53:48.708908 #2919491] INFO -- : CPPFLAGS = I, [2024-05-15T13:53:48.708911 #2919491] INFO -- : DLDFLAGS = -Wl,--compress-debug-sections=zlib -Wl,-soname,libruby.so.3.4 -fstack-protector-strong I, [2024-05-15T13:53:48.708916 #2919491] INFO -- : SOLIBS = -lz -lrt -lrt -lgmp -ldl -lcrypt -lm -lpthread I, [2024-05-15T13:53:48.708919 #2919491] INFO -- : LANG = en_US.UTF-8 I, [2024-05-15T13:53:48.708923 #2919491] INFO -- : LC_ALL = I, [2024-05-15T13:53:48.708926 #2919491] INFO -- : LC_CTYPE = I, [2024-05-15T13:53:48.708930 #2919491] INFO -- : MFLAGS = -j20 --jobserver-auth=4,5 I, [2024-05-15T13:53:48.708933 #2919491] INFO -- : RUSTC = no I, [2024-05-15T13:53:48.708937 #2919491] INFO -- : YJIT_RUSTC_ARGS = --crate-name=yjit --crate-type=staticlib --edition=2021 -g -C lto=thin -C opt-level=3 -C overflow-checks=on '--out-dir=/tmp/ruby/build/trunk/yjit/target/release/' /tmp/ruby/src/trunk/yjit/src/lib.rs I, [2024-05-15T13:53:48.710290 #2919491] INFO -- : gcc (Ubuntu 11.4.0-1ubuntu1~22.04) 11.4.0 I, [2024-05-15T13:53:48.710311 #2919491] INFO -- : Copyright (C) 2021 Free Software Foundation, Inc. I, [2024-05-15T13:53:48.710317 #2919491] INFO -- : This is free software; see the source for copying conditions. There is NO I, [2024-05-15T13:53:48.710321 #2919491] INFO -- : warranty; not even for MERCHANTABILITY or FITNESS FOR A PARTICULAR PURPOSE. I, [2024-05-15T13:53:48.710324 #2919491] INFO -- : I, [2024-05-15T13:53:48.730684 #2919491] INFO -- : compiling /tmp/ruby/src/trunk/version.c I, [2024-05-15T13:53:48.832634 #2919491] INFO -- : linking miniruby I, [2024-05-15T13:53:49.391481 #2919491] INFO -- : $$$[end] "make miniruby -j20" exit with 0. I, [2024-05-15T13:53:49.391607 #2919491] INFO -- : $$$[beg] make ruby -j20 I, [2024-05-15T13:53:49.448561 #2919491] INFO -- : BASERUBY = /usr/bin/ruby --disable=gems I, [2024-05-15T13:53:49.448604 #2919491] INFO -- : CC = gcc I, [2024-05-15T13:53:49.448616 #2919491] INFO -- : LD = ld I, [2024-05-15T13:53:49.448627 #2919491] INFO -- : LDSHARED = gcc -shared I, [2024-05-15T13:53:49.448643 #2919491] INFO -- : CFLAGS = -O3 -fno-fast-math -ggdb3 -Wall -Wextra -Wdeprecated-declarations -Wdiv-by-zero -Wduplicated-cond -Wimplicit-function-declaration -Wimplicit-int -Wpointer-arith -Wwrite-strings -Wold-style-definition -Wimplicit-fallthrough=0 -Wmissing-noreturn -Wno-cast-function-type -Wno-constant-logical-operand -Wno-long-long -Wno-missing-field-initializers -Wno-overlength-strings -Wno-packed-bitfield-compat -Wno-parentheses-equality -Wno-self-assign -Wno-tautological-compare -Wno-unused-parameter -Wno-unused-value -Wsuggest-attribute=format -Wsuggest-attribute=noreturn -Wunused-variable -Wmisleading-indentation -Wundef -fPIC I, [2024-05-15T13:53:49.448655 #2919491] INFO -- : XCFLAGS = -U_FORTIFY_SOURCE -D_FORTIFY_SOURCE=2 -fstack-protector-strong -fno-strict-overflow -fvisibility=hidden -fexcess-precision=standard -DRUBY_EXPORT -I. -I.ext/include/x86_64-linux -I/tmp/ruby/src/trunk/include -I/tmp/ruby/src/trunk -I/tmp/ruby/src/trunk/prism -I/tmp/ruby/src/trunk/enc/unicode/15.0.0 I, [2024-05-15T13:53:49.448665 #2919491] INFO -- : CPPFLAGS = I, [2024-05-15T13:53:49.448675 #2919491] INFO -- : DLDFLAGS = -Wl,--compress-debug-sections=zlib -Wl,-soname,libruby.so.3.4 -fstack-protector-strong I, [2024-05-15T13:53:49.448686 #2919491] INFO -- : SOLIBS = -lz -lrt -lrt -lgmp -ldl -lcrypt -lm -lpthread I, [2024-05-15T13:53:49.448695 #2919491] INFO -- : LANG = en_US.UTF-8 I, [2024-05-15T13:53:49.448705 #2919491] INFO -- : LC_ALL = I, [2024-05-15T13:53:49.448715 #2919491] INFO -- : LC_CTYPE = I, [2024-05-15T13:53:49.448725 #2919491] INFO -- : MFLAGS = -j20 --jobserver-auth=4,5 I, [2024-05-15T13:53:49.448735 #2919491] INFO -- : RUSTC = no I, [2024-05-15T13:53:49.448745 #2919491] INFO -- : YJIT_RUSTC_ARGS = --crate-name=yjit --crate-type=staticlib --edition=2021 -g -C lto=thin -C opt-level=3 -C overflow-checks=on '--out-dir=/tmp/ruby/build/trunk/yjit/target/release/' /tmp/ruby/src/trunk/yjit/src/lib.rs I, [2024-05-15T13:53:49.450171 #2919491] INFO -- : gcc (Ubuntu 11.4.0-1ubuntu1~22.04) 11.4.0 I, [2024-05-15T13:53:49.450218 #2919491] INFO -- : Copyright (C) 2021 Free Software Foundation, Inc. I, [2024-05-15T13:53:49.450231 #2919491] INFO -- : This is free software; see the source for copying conditions. There is NO I, [2024-05-15T13:53:49.450242 #2919491] INFO -- : warranty; not even for MERCHANTABILITY or FITNESS FOR A PARTICULAR PURPOSE. I, [2024-05-15T13:53:49.450252 #2919491] INFO -- : I, [2024-05-15T13:53:49.556660 #2919491] INFO -- : builtin_binary.inc updated I, [2024-05-15T13:53:49.561257 #2919491] INFO -- : c5234a9416e4f20f175185e840b25b0f08674d14078ed7083f37e655458e3ca9 builtin_binary.inc I, [2024-05-15T13:53:49.561960 #2919491] INFO -- : compiling /tmp/ruby/src/trunk/builtin.c I, [2024-05-15T13:53:49.744296 #2919491] INFO -- : linking static-library libruby-static.a I, [2024-05-15T13:53:50.054960 #2919491] INFO -- : linking shared-library libruby.so.3.4.0 I, [2024-05-15T13:53:51.614474 #2919491] INFO -- : linking ruby I, [2024-05-15T13:53:51.640347 #2919491] INFO -- : $$$[end] "make ruby -j20" exit with 0. I, [2024-05-15T13:53:51.640480 #2919491] INFO -- : $$$[beg] make all -j20 I, [2024-05-15T13:53:51.702951 #2919491] INFO -- : BASERUBY = /usr/bin/ruby --disable=gems I, [2024-05-15T13:53:51.702981 #2919491] INFO -- : CC = gcc I, [2024-05-15T13:53:51.702986 #2919491] INFO -- : LD = ld I, [2024-05-15T13:53:51.702990 #2919491] INFO -- : LDSHARED = gcc -shared I, [2024-05-15T13:53:51.702993 #2919491] INFO -- : CFLAGS = -O3 -fno-fast-math -ggdb3 -Wall -Wextra -Wdeprecated-declarations -Wdiv-by-zero -Wduplicated-cond -Wimplicit-function-declaration -Wimplicit-int -Wpointer-arith -Wwrite-strings -Wold-style-definition -Wimplicit-fallthrough=0 -Wmissing-noreturn -Wno-cast-function-type -Wno-constant-logical-operand -Wno-long-long -Wno-missing-field-initializers -Wno-overlength-strings -Wno-packed-bitfield-compat -Wno-parentheses-equality -Wno-self-assign -Wno-tautological-compare -Wno-unused-parameter -Wno-unused-value -Wsuggest-attribute=format -Wsuggest-attribute=noreturn -Wunused-variable -Wmisleading-indentation -Wundef -fPIC I, [2024-05-15T13:53:51.702999 #2919491] INFO -- : XCFLAGS = -U_FORTIFY_SOURCE -D_FORTIFY_SOURCE=2 -fstack-protector-strong -fno-strict-overflow -fvisibility=hidden -fexcess-precision=standard -DRUBY_EXPORT -I. -I.ext/include/x86_64-linux -I/tmp/ruby/src/trunk/include -I/tmp/ruby/src/trunk -I/tmp/ruby/src/trunk/prism -I/tmp/ruby/src/trunk/enc/unicode/15.0.0 I, [2024-05-15T13:53:51.703002 #2919491] INFO -- : CPPFLAGS = I, [2024-05-15T13:53:51.703006 #2919491] INFO -- : DLDFLAGS = -Wl,--compress-debug-sections=zlib -Wl,-soname,libruby.so.3.4 -fstack-protector-strong I, [2024-05-15T13:53:51.703010 #2919491] INFO -- : SOLIBS = -lz -lrt -lrt -lgmp -ldl -lcrypt -lm -lpthread I, [2024-05-15T13:53:51.703013 #2919491] INFO -- : LANG = en_US.UTF-8 I, [2024-05-15T13:53:51.703016 #2919491] INFO -- : LC_ALL = I, [2024-05-15T13:53:51.703020 #2919491] INFO -- : LC_CTYPE = I, [2024-05-15T13:53:51.703023 #2919491] INFO -- : MFLAGS = -j20 --jobserver-auth=4,5 I, [2024-05-15T13:53:51.703027 #2919491] INFO -- : RUSTC = no I, [2024-05-15T13:53:51.703031 #2919491] INFO -- : YJIT_RUSTC_ARGS = --crate-name=yjit --crate-type=staticlib --edition=2021 -g -C lto=thin -C opt-level=3 -C overflow-checks=on '--out-dir=/tmp/ruby/build/trunk/yjit/target/release/' /tmp/ruby/src/trunk/yjit/src/lib.rs I, [2024-05-15T13:53:51.704275 #2919491] INFO -- : gcc (Ubuntu 11.4.0-1ubuntu1~22.04) 11.4.0 I, [2024-05-15T13:53:51.704296 #2919491] INFO -- : Copyright (C) 2021 Free Software Foundation, Inc. I, [2024-05-15T13:53:51.704301 #2919491] INFO -- : This is free software; see the source for copying conditions. There is NO I, [2024-05-15T13:53:51.704305 #2919491] INFO -- : warranty; not even for MERCHANTABILITY or FITNESS FOR A PARTICULAR PURPOSE. I, [2024-05-15T13:53:51.704314 #2919491] INFO -- : I, [2024-05-15T13:53:51.734869 #2919491] INFO -- : generating enc.mk I, [2024-05-15T13:53:51.736730 #2919491] INFO -- : building spec/ruby/optional/capi/ext/array_spec.so I, [2024-05-15T13:53:51.737140 #2919491] INFO -- : building spec/ruby/optional/capi/ext/basic_object_spec.so I, [2024-05-15T13:53:51.737712 #2919491] INFO -- : building spec/ruby/optional/capi/ext/bignum_spec.so I, [2024-05-15T13:53:51.738364 #2919491] INFO -- : building spec/ruby/optional/capi/ext/binding_spec.so I, [2024-05-15T13:53:51.738477 #2919491] INFO -- : building spec/ruby/optional/capi/ext/boolean_spec.so I, [2024-05-15T13:53:51.739127 #2919491] INFO -- : building spec/ruby/optional/capi/ext/class_id_under_autoload_spec.so I, [2024-05-15T13:53:51.739895 #2919491] INFO -- : building spec/ruby/optional/capi/ext/class_spec.so I, [2024-05-15T13:53:51.740389 #2919491] INFO -- : building spec/ruby/optional/capi/ext/class_under_autoload_spec.so I, [2024-05-15T13:53:51.740996 #2919491] INFO -- : building spec/ruby/optional/capi/ext/complex_spec.so I, [2024-05-15T13:53:51.741706 #2919491] INFO -- : building spec/ruby/optional/capi/ext/constants_spec.so I, [2024-05-15T13:53:51.742012 #2919491] INFO -- : building spec/ruby/optional/capi/ext/data_spec.so I, [2024-05-15T13:53:51.742695 #2919491] INFO -- : building spec/ruby/optional/capi/ext/debug_spec.so I, [2024-05-15T13:53:51.743486 #2919491] INFO -- : building spec/ruby/optional/capi/ext/encoding_spec.so I, [2024-05-15T13:53:51.743790 #2919491] INFO -- : building spec/ruby/optional/capi/ext/enumerator_spec.so I, [2024-05-15T13:53:51.744354 #2919491] INFO -- : building spec/ruby/optional/capi/ext/exception_spec.so I, [2024-05-15T13:53:51.744993 #2919491] INFO -- : building spec/ruby/optional/capi/ext/fiber_spec.so I, [2024-05-15T13:53:51.745211 #2919491] INFO -- : building spec/ruby/optional/capi/ext/file_spec.so I, [2024-05-15T13:53:51.745729 #2919491] INFO -- : building spec/ruby/optional/capi/ext/fixnum_spec.so I, [2024-05-15T13:53:51.760510 #2919491] INFO -- : building spec/ruby/optional/capi/ext/float_spec.so I, [2024-05-15T13:53:51.862771 #2919491] INFO -- : building spec/ruby/optional/capi/ext/gc_spec.so I, [2024-05-15T13:53:51.876242 #2919491] INFO -- : building spec/ruby/optional/capi/ext/globals_spec.so I, [2024-05-15T13:53:51.882748 #2919491] INFO -- : building spec/ruby/optional/capi/ext/hash_spec.so I, [2024-05-15T13:53:51.883709 #2919491] INFO -- : building spec/ruby/optional/capi/ext/integer_spec.so I, [2024-05-15T13:53:51.896331 #2919491] INFO -- : building spec/ruby/optional/capi/ext/io_spec.so I, [2024-05-15T13:53:51.896757 #2919491] INFO -- : building spec/ruby/optional/capi/ext/kernel_spec.so I, [2024-05-15T13:53:51.898903 #2919491] INFO -- : building spec/ruby/optional/capi/ext/language_spec.so I, [2024-05-15T13:53:51.903246 #2919491] INFO -- : building spec/ruby/optional/capi/ext/marshal_spec.so I, [2024-05-15T13:53:51.912867 #2919491] INFO -- : building spec/ruby/optional/capi/ext/module_spec.so I, [2024-05-15T13:53:51.914988 #2919491] INFO -- : building spec/ruby/optional/capi/ext/module_under_autoload_spec.so I, [2024-05-15T13:53:51.915526 #2919491] INFO -- : building spec/ruby/optional/capi/ext/mutex_spec.so I, [2024-05-15T13:53:51.919355 #2919491] INFO -- : building spec/ruby/optional/capi/ext/numeric_spec.so I, [2024-05-15T13:53:51.920366 #2919491] INFO -- : building spec/ruby/optional/capi/ext/object_spec.so I, [2024-05-15T13:53:51.937191 #2919491] INFO -- : building spec/ruby/optional/capi/ext/proc_spec.so I, [2024-05-15T13:53:51.938892 #2919491] INFO -- : building spec/ruby/optional/capi/ext/range_spec.so I, [2024-05-15T13:53:51.953257 #2919491] INFO -- : building spec/ruby/optional/capi/ext/rational_spec.so I, [2024-05-15T13:53:51.981370 #2919491] INFO -- : building spec/ruby/optional/capi/ext/rbasic_spec.so I, [2024-05-15T13:53:52.007139 #2919491] INFO -- : building spec/ruby/optional/capi/ext/regexp_spec.so I, [2024-05-15T13:53:52.031923 #2919491] INFO -- : building spec/ruby/optional/capi/ext/struct_spec.so I, [2024-05-15T13:53:52.032101 #2919491] INFO -- : building spec/ruby/optional/capi/ext/string_spec.so I, [2024-05-15T13:53:52.049575 #2919491] INFO -- : building spec/ruby/optional/capi/ext/st_spec.so I, [2024-05-15T13:53:52.051060 #2919491] INFO -- : building spec/ruby/optional/capi/ext/symbol_spec.so I, [2024-05-15T13:53:52.058160 #2919491] INFO -- : building spec/ruby/optional/capi/ext/thread_spec.so I, [2024-05-15T13:53:52.063001 #2919491] INFO -- : building spec/ruby/optional/capi/ext/time_spec.so I, [2024-05-15T13:53:52.068480 #2919491] INFO -- : building spec/ruby/optional/capi/ext/tracepoint_spec.so I, [2024-05-15T13:53:52.070470 #2919491] INFO -- : building spec/ruby/optional/capi/ext/typed_data_spec.so I, [2024-05-15T13:53:52.070765 #2919491] INFO -- : building spec/ruby/optional/capi/ext/util_spec.so I, [2024-05-15T13:53:52.082879 #2919491] INFO -- : making enc I, [2024-05-15T13:53:52.092756 #2919491] INFO -- : making srcs under enc I, [2024-05-15T13:53:52.113767 #2919491] INFO -- : make[1]: Entering directory '/tmp/ruby/build/trunk' I, [2024-05-15T13:53:52.113835 #2919491] INFO -- : make[1]: Nothing to be done for 'enc'. I, [2024-05-15T13:53:52.113846 #2919491] INFO -- : make[1]: Leaving directory '/tmp/ruby/build/trunk' I, [2024-05-15T13:53:52.136274 #2919491] INFO -- : make[1]: Entering directory '/tmp/ruby/build/trunk' I, [2024-05-15T13:53:52.136331 #2919491] INFO -- : make[1]: Nothing to be done for 'srcs'. I, [2024-05-15T13:53:52.136339 #2919491] INFO -- : make[1]: Leaving directory '/tmp/ruby/build/trunk' I, [2024-05-15T13:53:52.137001 #2919491] INFO -- : generating transdb.h I, [2024-05-15T13:53:52.248430 #2919491] INFO -- : transdb.h unchanged I, [2024-05-15T13:53:52.249885 #2919491] INFO -- : generating makefiles ext/configure-ext.mk I, [2024-05-15T13:53:52.250168 #2919491] INFO -- : making trans I, [2024-05-15T13:53:52.276480 #2919491] INFO -- : ext/configure-ext.mk updated I, [2024-05-15T13:53:52.279328 #2919491] INFO -- : make[1]: Entering directory '/tmp/ruby/build/trunk' I, [2024-05-15T13:53:52.284626 #2919491] INFO -- : make[1]: Entering directory '/tmp/ruby/build/trunk' I, [2024-05-15T13:53:52.286162 #2919491] INFO -- : make[1]: Nothing to be done for 'trans'. I, [2024-05-15T13:53:52.286241 #2919491] INFO -- : make[1]: Leaving directory '/tmp/ruby/build/trunk' I, [2024-05-15T13:53:52.286254 #2919491] INFO -- : making encs I, [2024-05-15T13:53:52.343648 #2919491] INFO -- : make[1]: Entering directory '/tmp/ruby/build/trunk' I, [2024-05-15T13:53:52.343728 #2919491] INFO -- : make[1]: Nothing to be done for 'encs'. I, [2024-05-15T13:53:52.343755 #2919491] INFO -- : make[1]: Leaving directory '/tmp/ruby/build/trunk' I, [2024-05-15T13:53:52.435250 #2919491] INFO -- : make[1]: Leaving directory '/tmp/ruby/build/trunk' I, [2024-05-15T13:53:52.435961 #2919491] INFO -- : generating makefile exts.mk I, [2024-05-15T13:53:52.472876 #2919491] INFO -- : exts.mk unchanged I, [2024-05-15T13:53:52.478135 #2919491] INFO -- : make[1]: Entering directory '/tmp/ruby/build/trunk' I, [2024-05-15T13:53:52.498312 #2919491] INFO -- : make[2]: Entering directory '/tmp/ruby/build/trunk/ext/digest' I, [2024-05-15T13:53:52.499492 #2919491] INFO -- : make[2]: Entering directory '/tmp/ruby/build/trunk/ext/json' I, [2024-05-15T13:53:52.499890 #2919491] INFO -- : make[2]: Entering directory '/tmp/ruby/build/trunk/ext/coverage' I, [2024-05-15T13:53:52.500909 #2919491] INFO -- : make[2]: Entering directory '/tmp/ruby/build/trunk/ext/date' I, [2024-05-15T13:53:52.500993 #2919491] INFO -- : make[2]: Entering directory '/tmp/ruby/build/trunk/ext/rubyvm' I, [2024-05-15T13:53:52.501187 #2919491] INFO -- : make[2]: Entering directory '/tmp/ruby/build/trunk/ext/io/console' I, [2024-05-15T13:53:52.501952 #2919491] INFO -- : make[2]: Entering directory '/tmp/ruby/build/trunk/ext/monitor' I, [2024-05-15T13:53:52.502435 #2919491] INFO -- : make[2]: Entering directory '/tmp/ruby/build/trunk/ext/pathname' I, [2024-05-15T13:53:52.502600 #2919491] INFO -- : make[2]: Entering directory '/tmp/ruby/build/trunk/ext/pty' I, [2024-05-15T13:53:52.502625 #2919491] INFO -- : make[2]: Entering directory '/tmp/ruby/build/trunk/ext/fiddle' I, [2024-05-15T13:53:52.502891 #2919491] INFO -- : make[2]: Leaving directory '/tmp/ruby/build/trunk/ext/coverage' I, [2024-05-15T13:53:52.502918 #2919491] INFO -- : make[2]: Leaving directory '/tmp/ruby/build/trunk/ext/rubyvm' I, [2024-05-15T13:53:52.504050 #2919491] INFO -- : make[2]: Leaving directory '/tmp/ruby/build/trunk/ext/io/console' I, [2024-05-15T13:53:52.504172 #2919491] INFO -- : make[2]: Entering directory '/tmp/ruby/build/trunk/ext/objspace' I, [2024-05-15T13:53:52.504494 #2919491] INFO -- : make[2]: Leaving directory '/tmp/ruby/build/trunk/ext/monitor' I, [2024-05-15T13:53:52.504586 #2919491] INFO -- : make[2]: Entering directory '/tmp/ruby/build/trunk/ext/psych' I, [2024-05-15T13:53:52.504644 #2919491] INFO -- : make[2]: Leaving directory '/tmp/ruby/build/trunk/ext/date' I, [2024-05-15T13:53:52.505163 #2919491] INFO -- : make[2]: Leaving directory '/tmp/ruby/build/trunk/ext/pathname' I, [2024-05-15T13:53:52.505352 #2919491] INFO -- : make[2]: Leaving directory '/tmp/ruby/build/trunk/ext/pty' I, [2024-05-15T13:53:52.505535 #2919491] INFO -- : make[2]: Entering directory '/tmp/ruby/build/trunk/.bundle/gems/bigdecimal-3.1.8/ext/bigdecimal' I, [2024-05-15T13:53:52.505950 #2919491] INFO -- : make[2]: Entering directory '/tmp/ruby/build/trunk/.bundle/gems/debug-1.9.2/ext/debug' I, [2024-05-15T13:53:52.506366 #2919491] INFO -- : make[2]: Entering directory '/tmp/ruby/build/trunk/.bundle/gems/racc-1.7.3/ext/racc/cparse' I, [2024-05-15T13:53:52.506789 #2919491] INFO -- : make[2]: Entering directory '/tmp/ruby/build/trunk/.bundle/gems/nkf-0.2.0/ext/nkf' I, [2024-05-15T13:53:52.507048 #2919491] INFO -- : make[2]: Leaving directory '/tmp/ruby/build/trunk/ext/digest' I, [2024-05-15T13:53:52.507247 #2919491] INFO -- : make[2]: Entering directory '/tmp/ruby/build/trunk/ext/ripper' I, [2024-05-15T13:53:52.508590 #2919491] INFO -- : make[2]: Leaving directory '/tmp/ruby/build/trunk/ext/fiddle' I, [2024-05-15T13:53:52.508885 #2919491] INFO -- : make[2]: Leaving directory '/tmp/ruby/build/trunk/ext/objspace' I, [2024-05-15T13:53:52.508937 #2919491] INFO -- : make[2]: Leaving directory '/tmp/ruby/build/trunk/ext/json' I, [2024-05-15T13:53:52.509016 #2919491] INFO -- : make[2]: Entering directory '/tmp/ruby/build/trunk/.bundle/gems/syslog-0.1.2/ext/syslog' I, [2024-05-15T13:53:52.509901 #2919491] INFO -- : make[2]: Entering directory '/tmp/ruby/build/trunk/.bundle/gems/rbs-3.4.4/ext/rbs_extension' I, [2024-05-15T13:53:52.510882 #2919491] INFO -- : make[2]: Entering directory '/tmp/ruby/build/trunk/ext/socket' I, [2024-05-15T13:53:52.512218 #2919491] INFO -- : make[2]: Entering directory '/tmp/ruby/build/trunk/ext/digest/sha2' I, [2024-05-15T13:53:52.512292 #2919491] INFO -- : make[2]: Leaving directory '/tmp/ruby/build/trunk/ext/ripper' I, [2024-05-15T13:53:52.514457 #2919491] INFO -- : make[2]: Leaving directory '/tmp/ruby/build/trunk/ext/digest/sha2' I, [2024-05-15T13:53:52.514577 #2919491] INFO -- : make[2]: Entering directory '/tmp/ruby/build/trunk/ext/openssl' I, [2024-05-15T13:53:52.518243 #2919491] INFO -- : make[2]: Leaving directory '/tmp/ruby/build/trunk/ext/socket' I, [2024-05-15T13:53:52.523891 #2919491] INFO -- : make[2]: Leaving directory '/tmp/ruby/build/trunk/ext/psych' I, [2024-05-15T13:53:52.525530 #2919491] INFO -- : make[2]: Leaving directory '/tmp/ruby/build/trunk/ext/openssl' I, [2024-05-15T13:53:52.529023 #2919491] INFO -- : make[2]: Leaving directory '/tmp/ruby/build/trunk/.bundle/gems/racc-1.7.3/ext/racc/cparse' I, [2024-05-15T13:53:52.529537 #2919491] INFO -- : make[2]: Leaving directory '/tmp/ruby/build/trunk/.bundle/gems/nkf-0.2.0/ext/nkf' I, [2024-05-15T13:53:52.530685 #2919491] INFO -- : make[2]: Leaving directory '/tmp/ruby/build/trunk/.bundle/gems/syslog-0.1.2/ext/syslog' I, [2024-05-15T13:53:52.533292 #2919491] INFO -- : make[2]: Leaving directory '/tmp/ruby/build/trunk/.bundle/gems/debug-1.9.2/ext/debug' I, [2024-05-15T13:53:52.537789 #2919491] INFO -- : make[2]: Leaving directory '/tmp/ruby/build/trunk/.bundle/gems/bigdecimal-3.1.8/ext/bigdecimal' I, [2024-05-15T13:53:52.540127 #2919491] INFO -- : make[2]: Leaving directory '/tmp/ruby/build/trunk/.bundle/gems/rbs-3.4.4/ext/rbs_extension' I, [2024-05-15T13:53:52.564911 #2919491] INFO -- : make[2]: Entering directory '/tmp/ruby/build/trunk' I, [2024-05-15T13:53:52.634322 #2919491] INFO -- : linking ruby I, [2024-05-15T13:53:52.657961 #2919491] INFO -- : make[2]: Leaving directory '/tmp/ruby/build/trunk' I, [2024-05-15T13:53:52.658511 #2919491] INFO -- : make[1]: Leaving directory '/tmp/ruby/build/trunk' I, [2024-05-15T13:53:52.662135 #2919491] INFO -- : make[1]: Entering directory '/tmp/ruby/build/trunk' I, [2024-05-15T13:53:52.662158 #2919491] INFO -- : make[1]: Nothing to be done for 'note'. I, [2024-05-15T13:53:52.662164 #2919491] INFO -- : make[1]: Leaving directory '/tmp/ruby/build/trunk' I, [2024-05-15T13:53:52.663069 #2919491] INFO -- : $$$[end] "make all -j20" exit with 0. I, [2024-05-15T13:53:52.663198 #2919491] INFO -- : $$$[beg] make install -j20 I, [2024-05-15T13:53:52.727871 #2919491] INFO -- : Update minitest to ea9caafc0754b1d6236a490d59e624b53209734a I, [2024-05-15T13:53:52.727923 #2919491] INFO -- : Update power_assert to 84e85124c5014a139af39161d484156cfe87a9ed I, [2024-05-15T13:53:52.728659 #2919491] INFO -- : Update rbs to ba7872795d5de04adb8ff500c0e6afdc81a041dd I, [2024-05-15T13:53:52.728712 #2919491] INFO -- : Update typeprof to b19a6416da3a05d57fadd6ffdadb382b6d236ca5 I, [2024-05-15T13:53:52.729401 #2919491] INFO -- : echo ea9caafc0754b1d6236a490d59e624b53209734a | /bin/sh /tmp/ruby/src/trunk/tool/ifchange /tmp/ruby/src/trunk/.bundle/.timestamp/minitest.revision - I, [2024-05-15T13:53:52.729586 #2919491] INFO -- : echo 84e85124c5014a139af39161d484156cfe87a9ed | /bin/sh /tmp/ruby/src/trunk/tool/ifchange /tmp/ruby/src/trunk/.bundle/.timestamp/power_assert.revision - I, [2024-05-15T13:53:52.730438 #2919491] INFO -- : BASERUBY = /usr/bin/ruby --disable=gems I, [2024-05-15T13:53:52.730462 #2919491] INFO -- : CC = gcc I, [2024-05-15T13:53:52.730470 #2919491] INFO -- : LD = ld I, [2024-05-15T13:53:52.730476 #2919491] INFO -- : LDSHARED = gcc -shared I, [2024-05-15T13:53:52.730482 #2919491] INFO -- : CFLAGS = -O3 -fno-fast-math -ggdb3 -Wall -Wextra -Wdeprecated-declarations -Wdiv-by-zero -Wduplicated-cond -Wimplicit-function-declaration -Wimplicit-int -Wpointer-arith -Wwrite-strings -Wold-style-definition -Wimplicit-fallthrough=0 -Wmissing-noreturn -Wno-cast-function-type -Wno-constant-logical-operand -Wno-long-long -Wno-missing-field-initializers -Wno-overlength-strings -Wno-packed-bitfield-compat -Wno-parentheses-equality -Wno-self-assign -Wno-tautological-compare -Wno-unused-parameter -Wno-unused-value -Wsuggest-attribute=format -Wsuggest-attribute=noreturn -Wunused-variable -Wmisleading-indentation -Wundef -fPIC I, [2024-05-15T13:53:52.730490 #2919491] INFO -- : XCFLAGS = -U_FORTIFY_SOURCE -D_FORTIFY_SOURCE=2 -fstack-protector-strong -fno-strict-overflow -fvisibility=hidden -fexcess-precision=standard -DRUBY_EXPORT -I. -I.ext/include/x86_64-linux -I/tmp/ruby/src/trunk/include -I/tmp/ruby/src/trunk -I/tmp/ruby/src/trunk/prism -I/tmp/ruby/src/trunk/enc/unicode/15.0.0 I, [2024-05-15T13:53:52.730496 #2919491] INFO -- : CPPFLAGS = I, [2024-05-15T13:53:52.730500 #2919491] INFO -- : DLDFLAGS = -Wl,--compress-debug-sections=zlib -Wl,-soname,libruby.so.3.4 -fstack-protector-strong I, [2024-05-15T13:53:52.730504 #2919491] INFO -- : SOLIBS = -lz -lrt -lrt -lgmp -ldl -lcrypt -lm -lpthread I, [2024-05-15T13:53:52.730508 #2919491] INFO -- : LANG = en_US.UTF-8 I, [2024-05-15T13:53:52.730511 #2919491] INFO -- : LC_ALL = I, [2024-05-15T13:53:52.730515 #2919491] INFO -- : LC_CTYPE = I, [2024-05-15T13:53:52.730521 #2919491] INFO -- : MFLAGS = -j20 --jobserver-auth=4,5 I, [2024-05-15T13:53:52.730524 #2919491] INFO -- : RUSTC = no I, [2024-05-15T13:53:52.730534 #2919491] INFO -- : YJIT_RUSTC_ARGS = --crate-name=yjit --crate-type=staticlib --edition=2021 -g -C lto=thin -C opt-level=3 -C overflow-checks=on '--out-dir=/tmp/ruby/build/trunk/yjit/target/release/' /tmp/ruby/src/trunk/yjit/src/lib.rs I, [2024-05-15T13:53:52.731519 #2919491] INFO -- : /tmp/ruby/src/trunk/.bundle/.timestamp/power_assert.revision unchanged I, [2024-05-15T13:53:52.731568 #2919491] INFO -- : /tmp/ruby/src/trunk/.bundle/.timestamp/minitest.revision unchanged I, [2024-05-15T13:53:52.756000 #2919491] INFO -- : echo ba7872795d5de04adb8ff500c0e6afdc81a041dd | /bin/sh /tmp/ruby/src/trunk/tool/ifchange /tmp/ruby/src/trunk/.bundle/.timestamp/rbs.revision - I, [2024-05-15T13:53:52.756173 #2919491] INFO -- : echo b19a6416da3a05d57fadd6ffdadb382b6d236ca5 | /bin/sh /tmp/ruby/src/trunk/tool/ifchange /tmp/ruby/src/trunk/.bundle/.timestamp/typeprof.revision - I, [2024-05-15T13:53:52.756986 #2919491] INFO -- : gcc (Ubuntu 11.4.0-1ubuntu1~22.04) 11.4.0 I, [2024-05-15T13:53:52.757006 #2919491] INFO -- : Copyright (C) 2021 Free Software Foundation, Inc. I, [2024-05-15T13:53:52.757012 #2919491] INFO -- : This is free software; see the source for copying conditions. There is NO I, [2024-05-15T13:53:52.757016 #2919491] INFO -- : warranty; not even for MERCHANTABILITY or FITNESS FOR A PARTICULAR PURPOSE. I, [2024-05-15T13:53:52.757020 #2919491] INFO -- : I, [2024-05-15T13:53:52.757023 #2919491] INFO -- : generating enc.mk I, [2024-05-15T13:53:52.758210 #2919491] INFO -- : /tmp/ruby/src/trunk/.bundle/.timestamp/rbs.revision unchanged I, [2024-05-15T13:53:52.758357 #2919491] INFO -- : /tmp/ruby/src/trunk/.bundle/.timestamp/typeprof.revision unchanged I, [2024-05-15T13:53:52.877395 #2919491] INFO -- : Building power_assert@84e85124c5014a139af39161d484156cfe87a9ed to /tmp/ruby/src/trunk/gems/power_assert-2.0.3.gem I, [2024-05-15T13:53:52.878087 #2919491] INFO -- : making srcs under enc I, [2024-05-15T13:53:52.878313 #2919491] INFO -- : making enc I, [2024-05-15T13:53:52.895672 #2919491] INFO -- : make[1]: Entering directory '/tmp/ruby/build/trunk' I, [2024-05-15T13:53:52.895706 #2919491] INFO -- : make[1]: Nothing to be done for 'enc'. I, [2024-05-15T13:53:52.895711 #2919491] INFO -- : make[1]: Leaving directory '/tmp/ruby/build/trunk' I, [2024-05-15T13:53:52.907503 #2919491] INFO -- : make[1]: Entering directory '/tmp/ruby/build/trunk' I, [2024-05-15T13:53:52.907525 #2919491] INFO -- : make[1]: Nothing to be done for 'srcs'. I, [2024-05-15T13:53:52.907531 #2919491] INFO -- : make[1]: Leaving directory '/tmp/ruby/build/trunk' I, [2024-05-15T13:53:52.908442 #2919491] INFO -- : generating transdb.h I, [2024-05-15T13:53:52.946065 #2919491] INFO -- : Successfully built RubyGem I, [2024-05-15T13:53:52.946106 #2919491] INFO -- : Name: power_assert I, [2024-05-15T13:53:52.946112 #2919491] INFO -- : Version: 2.0.4dev I, [2024-05-15T13:53:52.946116 #2919491] INFO -- : File: power_assert-2.0.4dev.gem I, [2024-05-15T13:53:52.948237 #2919491] INFO -- : Extracting bundle gem power_assert-2.0.3... I, [2024-05-15T13:53:53.005046 #2919491] INFO -- : transdb.h unchanged I, [2024-05-15T13:53:53.006782 #2919491] INFO -- : generating makefiles ext/configure-ext.mk I, [2024-05-15T13:53:53.007056 #2919491] INFO -- : making trans I, [2024-05-15T13:53:53.010215 #2919491] INFO -- : Try with hash version of bundled gems instead of gems/power_assert-2.0.3.gem. We don't use this gem with release version of Ruby. I, [2024-05-15T13:53:53.015216 #2919491] INFO -- : Unpacked gems/power_assert-2.0.4dev.gem I, [2024-05-15T13:53:53.033631 #2919491] INFO -- : ext/configure-ext.mk unchanged I, [2024-05-15T13:53:53.035927 #2919491] INFO -- : make[1]: Entering directory '/tmp/ruby/build/trunk' I, [2024-05-15T13:53:53.041838 #2919491] INFO -- : make[1]: Entering directory '/tmp/ruby/build/trunk' I, [2024-05-15T13:53:53.041928 #2919491] INFO -- : make[1]: Nothing to be done for 'trans'. I, [2024-05-15T13:53:53.041938 #2919491] INFO -- : make[1]: Leaving directory '/tmp/ruby/build/trunk' I, [2024-05-15T13:53:53.042847 #2919491] INFO -- : making encs I, [2024-05-15T13:53:53.100965 #2919491] INFO -- : make[1]: Entering directory '/tmp/ruby/build/trunk' I, [2024-05-15T13:53:53.101038 #2919491] INFO -- : make[1]: Nothing to be done for 'encs'. I, [2024-05-15T13:53:53.101066 #2919491] INFO -- : make[1]: Leaving directory '/tmp/ruby/build/trunk' I, [2024-05-15T13:53:53.184374 #2919491] INFO -- : make[1]: Leaving directory '/tmp/ruby/build/trunk' I, [2024-05-15T13:53:53.185101 #2919491] INFO -- : generating makefile exts.mk I, [2024-05-15T13:53:53.222147 #2919491] INFO -- : exts.mk unchanged I, [2024-05-15T13:53:53.226778 #2919491] INFO -- : make[1]: Entering directory '/tmp/ruby/build/trunk' I, [2024-05-15T13:53:53.244649 #2919491] INFO -- : make[2]: Entering directory '/tmp/ruby/build/trunk/ext/digest' I, [2024-05-15T13:53:53.245753 #2919491] INFO -- : make[2]: Entering directory '/tmp/ruby/build/trunk/ext/json' I, [2024-05-15T13:53:53.246054 #2919491] INFO -- : make[2]: Entering directory '/tmp/ruby/build/trunk/ext/coverage' I, [2024-05-15T13:53:53.246963 #2919491] INFO -- : make[2]: Entering directory '/tmp/ruby/build/trunk/ext/io/console' I, [2024-05-15T13:53:53.246996 #2919491] INFO -- : make[2]: Entering directory '/tmp/ruby/build/trunk/ext/date' I, [2024-05-15T13:53:53.247305 #2919491] INFO -- : make[2]: Entering directory '/tmp/ruby/build/trunk/ext/rubyvm' I, [2024-05-15T13:53:53.247572 #2919491] INFO -- : make[2]: Entering directory '/tmp/ruby/build/trunk/ext/monitor' I, [2024-05-15T13:53:53.248631 #2919491] INFO -- : make[2]: Entering directory '/tmp/ruby/build/trunk/ext/pathname' I, [2024-05-15T13:53:53.249175 #2919491] INFO -- : make[2]: Entering directory '/tmp/ruby/build/trunk/ext/pty' I, [2024-05-15T13:53:53.249772 #2919491] INFO -- : make[2]: Leaving directory '/tmp/ruby/build/trunk/ext/coverage' I, [2024-05-15T13:53:53.249797 #2919491] INFO -- : make[2]: Leaving directory '/tmp/ruby/build/trunk/ext/rubyvm' I, [2024-05-15T13:53:53.249979 #2919491] INFO -- : make[2]: Entering directory '/tmp/ruby/build/trunk/ext/fiddle' I, [2024-05-15T13:53:53.250232 #2919491] INFO -- : make[2]: Entering directory '/tmp/ruby/build/trunk/ext/objspace' I, [2024-05-15T13:53:53.250390 #2919491] INFO -- : make[2]: Leaving directory '/tmp/ruby/build/trunk/ext/io/console' I, [2024-05-15T13:53:53.250599 #2919491] INFO -- : make[2]: Leaving directory '/tmp/ruby/build/trunk/ext/monitor' I, [2024-05-15T13:53:53.250908 #2919491] INFO -- : make[2]: Entering directory '/tmp/ruby/build/trunk/ext/psych' I, [2024-05-15T13:53:53.251164 #2919491] INFO -- : make[2]: Leaving directory '/tmp/ruby/build/trunk/ext/date' I, [2024-05-15T13:53:53.251805 #2919491] INFO -- : make[2]: Leaving directory '/tmp/ruby/build/trunk/ext/digest' I, [2024-05-15T13:53:53.251933 #2919491] INFO -- : make[2]: Leaving directory '/tmp/ruby/build/trunk/ext/pathname' I, [2024-05-15T13:53:53.252038 #2919491] INFO -- : make[2]: Leaving directory '/tmp/ruby/build/trunk/ext/pty' I, [2024-05-15T13:53:53.252737 #2919491] INFO -- : make[2]: Entering directory '/tmp/ruby/build/trunk/.bundle/gems/debug-1.9.2/ext/debug' I, [2024-05-15T13:53:53.252779 #2919491] INFO -- : make[2]: Entering directory '/tmp/ruby/build/trunk/.bundle/gems/bigdecimal-3.1.8/ext/bigdecimal' I, [2024-05-15T13:53:53.252849 #2919491] INFO -- : make[2]: Entering directory '/tmp/ruby/build/trunk/.bundle/gems/nkf-0.2.0/ext/nkf' I, [2024-05-15T13:53:53.253301 #2919491] INFO -- : make[2]: Entering directory '/tmp/ruby/build/trunk/ext/ripper' I, [2024-05-15T13:53:53.253596 #2919491] INFO -- : make[2]: Entering directory '/tmp/ruby/build/trunk/.bundle/gems/racc-1.7.3/ext/racc/cparse' I, [2024-05-15T13:53:53.254152 #2919491] INFO -- : make[2]: Entering directory '/tmp/ruby/build/trunk/.bundle/gems/syslog-0.1.2/ext/syslog' I, [2024-05-15T13:53:53.254280 #2919491] INFO -- : make[2]: Entering directory '/tmp/ruby/build/trunk/.bundle/gems/rbs-3.4.4/ext/rbs_extension' I, [2024-05-15T13:53:53.254606 #2919491] INFO -- : make[2]: Leaving directory '/tmp/ruby/build/trunk/ext/json' I, [2024-05-15T13:53:53.255318 #2919491] INFO -- : make[2]: Leaving directory '/tmp/ruby/build/trunk/ext/objspace' I, [2024-05-15T13:53:53.256987 #2919491] INFO -- : make[2]: Leaving directory '/tmp/ruby/build/trunk/ext/fiddle' I, [2024-05-15T13:53:53.257123 #2919491] INFO -- : make[2]: Entering directory '/tmp/ruby/build/trunk/ext/digest/sha2' I, [2024-05-15T13:53:53.257747 #2919491] INFO -- : make[2]: Entering directory '/tmp/ruby/build/trunk/ext/socket' I, [2024-05-15T13:53:53.258095 #2919491] INFO -- : make[2]: Leaving directory '/tmp/ruby/build/trunk/ext/ripper' I, [2024-05-15T13:53:53.259528 #2919491] INFO -- : make[2]: Leaving directory '/tmp/ruby/build/trunk/ext/digest/sha2' I, [2024-05-15T13:53:53.260695 #2919491] INFO -- : make[2]: Entering directory '/tmp/ruby/build/trunk/ext/openssl' I, [2024-05-15T13:53:53.261047 #2919491] INFO -- : make[2]: Leaving directory '/tmp/ruby/build/trunk/ext/psych' I, [2024-05-15T13:53:53.263713 #2919491] INFO -- : make[2]: Leaving directory '/tmp/ruby/build/trunk/ext/socket' I, [2024-05-15T13:53:53.271967 #2919491] INFO -- : make[2]: Leaving directory '/tmp/ruby/build/trunk/ext/openssl' I, [2024-05-15T13:53:53.278515 #2919491] INFO -- : make[2]: Leaving directory '/tmp/ruby/build/trunk/.bundle/gems/rbs-3.4.4/ext/rbs_extension' I, [2024-05-15T13:53:53.281641 #2919491] INFO -- : make[2]: Leaving directory '/tmp/ruby/build/trunk/.bundle/gems/syslog-0.1.2/ext/syslog' I, [2024-05-15T13:53:53.282318 #2919491] INFO -- : make[2]: Leaving directory '/tmp/ruby/build/trunk/.bundle/gems/debug-1.9.2/ext/debug' I, [2024-05-15T13:53:53.282560 #2919491] INFO -- : make[2]: Leaving directory '/tmp/ruby/build/trunk/.bundle/gems/bigdecimal-3.1.8/ext/bigdecimal' I, [2024-05-15T13:53:53.287097 #2919491] INFO -- : make[2]: Leaving directory '/tmp/ruby/build/trunk/.bundle/gems/nkf-0.2.0/ext/nkf' I, [2024-05-15T13:53:53.287275 #2919491] INFO -- : make[2]: Leaving directory '/tmp/ruby/build/trunk/.bundle/gems/racc-1.7.3/ext/racc/cparse' I, [2024-05-15T13:53:53.310667 #2919491] INFO -- : make[2]: Entering directory '/tmp/ruby/build/trunk' I, [2024-05-15T13:53:53.375339 #2919491] INFO -- : make[2]: 'ruby' is up to date. I, [2024-05-15T13:53:53.375385 #2919491] INFO -- : make[2]: Leaving directory '/tmp/ruby/build/trunk' I, [2024-05-15T13:53:53.375736 #2919491] INFO -- : make[1]: Leaving directory '/tmp/ruby/build/trunk' I, [2024-05-15T13:53:53.379371 #2919491] INFO -- : make[1]: Entering directory '/tmp/ruby/build/trunk' I, [2024-05-15T13:53:53.379392 #2919491] INFO -- : make[1]: Nothing to be done for 'note'. I, [2024-05-15T13:53:53.379399 #2919491] INFO -- : make[1]: Leaving directory '/tmp/ruby/build/trunk' I, [2024-05-15T13:53:53.379547 #2919491] INFO -- : ./miniruby -I/tmp/ruby/src/trunk/lib -I. -I.ext/common /tmp/ruby/src/trunk/tool/runruby.rb --extout=.ext -- --disable-gems -r./x86_64-linux-fake /tmp/ruby/src/trunk/tool/rbinstall.rb --make="make" --dest-dir="" --extout=".ext" --ext-build-dir="./ext" --mflags="-j20 --jobserver-auth=4,5" --make-flags=" -j20 --jobserver-auth=4,5" --data-mode=0644 --prog-mode=0755 --installed-list .installed.list --mantype="doc" --gnumake --install=all --exclude=doc I, [2024-05-15T13:53:53.474972 #2919491] INFO -- : Installing to I, [2024-05-15T13:53:53.475035 #2919491] INFO -- : installing binary commands: /tmp/ruby/install/trunk/bin I, [2024-05-15T13:53:53.475123 #2919491] INFO -- : installing base libraries: /tmp/ruby/install/trunk/lib I, [2024-05-15T13:53:53.482372 #2919491] INFO -- : installing arch files: /tmp/ruby/install/trunk/lib/ruby/3.4.0+0/x86_64-linux I, [2024-05-15T13:53:53.482396 #2919491] INFO -- : installing pkgconfig data: /tmp/ruby/install/trunk/lib/pkgconfig I, [2024-05-15T13:53:53.482403 #2919491] INFO -- : installing extension objects: /tmp/ruby/install/trunk/lib/ruby/3.4.0+0/x86_64-linux I, [2024-05-15T13:53:53.492055 #2919491] INFO -- : installing extension objects: /tmp/ruby/install/trunk/lib/ruby/site_ruby/3.4.0+0/x86_64-linux I, [2024-05-15T13:53:53.492085 #2919491] INFO -- : installing extension objects: /tmp/ruby/install/trunk/lib/ruby/vendor_ruby/3.4.0+0/x86_64-linux I, [2024-05-15T13:53:53.492092 #2919491] INFO -- : installing extension headers: /tmp/ruby/install/trunk/include/ruby-3.4.0+0/x86_64-linux I, [2024-05-15T13:53:53.492233 #2919491] INFO -- : installing extension scripts: /tmp/ruby/install/trunk/lib/ruby/3.4.0+0 I, [2024-05-15T13:53:53.496816 #2919491] INFO -- : installing extension scripts: /tmp/ruby/install/trunk/lib/ruby/site_ruby/3.4.0+0 I, [2024-05-15T13:53:53.496842 #2919491] INFO -- : installing extension scripts: /tmp/ruby/install/trunk/lib/ruby/vendor_ruby/3.4.0+0 I, [2024-05-15T13:53:53.496852 #2919491] INFO -- : installing extension headers: /tmp/ruby/install/trunk/include/ruby-3.4.0+0/ruby I, [2024-05-15T13:53:53.496856 #2919491] INFO -- : installing command scripts: /tmp/ruby/install/trunk/bin I, [2024-05-15T13:53:53.496860 #2919491] INFO -- : installing library scripts: /tmp/ruby/install/trunk/lib/ruby/3.4.0+0 I, [2024-05-15T13:53:53.528776 #2919491] INFO -- : installing common headers: /tmp/ruby/install/trunk/include/ruby-3.4.0+0 I, [2024-05-15T13:53:53.533811 #2919491] INFO -- : installing manpages: /tmp/ruby/install/trunk/share/man/man1 I, [2024-05-15T13:53:53.533841 #2919491] INFO -- : installing default gems from lib: /tmp/ruby/install/trunk/lib/ruby/gems/3.4.0+0 I, [2024-05-15T13:53:53.556544 #2919491] INFO -- : benchmark 0.3.0 I, [2024-05-15T13:53:53.563765 #2919491] INFO -- : bundler 2.6.0.dev I, [2024-05-15T13:53:53.565209 #2919491] INFO -- : cgi 0.4.1 I, [2024-05-15T13:53:53.565735 #2919491] INFO -- : delegate 0.3.1 I, [2024-05-15T13:53:53.566616 #2919491] INFO -- : did_you_mean 1.6.3 I, [2024-05-15T13:53:53.567272 #2919491] INFO -- : english 0.8.0 I, [2024-05-15T13:53:53.568323 #2919491] INFO -- : erb 4.0.4 I, [2024-05-15T13:53:53.570110 #2919491] INFO -- : error_highlight 0.6.0 I, [2024-05-15T13:53:53.570617 #2919491] INFO -- : fileutils 1.7.2 I, [2024-05-15T13:53:53.571104 #2919491] INFO -- : find 0.2.0 I, [2024-05-15T13:53:53.571575 #2919491] INFO -- : forwardable 1.3.3 I, [2024-05-15T13:53:53.572046 #2919491] INFO -- : ipaddr 1.2.6 I, [2024-05-15T13:53:53.572482 #2919491] INFO -- : irb 1.13.1 I, [2024-05-15T13:53:53.573219 #2919491] INFO -- : logger 1.6.0 I, [2024-05-15T13:53:53.573696 #2919491] INFO -- : net-http 0.4.1 I, [2024-05-15T13:53:53.574128 #2919491] INFO -- : net-protocol 0.2.2 I, [2024-05-15T13:53:53.574604 #2919491] INFO -- : open-uri 0.4.1 I, [2024-05-15T13:53:53.575173 #2919491] INFO -- : open3 0.2.1 I, [2024-05-15T13:53:53.576108 #2919491] INFO -- : optparse 0.5.0 I, [2024-05-15T13:53:53.576805 #2919491] INFO -- : ostruct 0.6.0 I, [2024-05-15T13:53:53.577263 #2919491] INFO -- : pp 0.5.0 I, [2024-05-15T13:53:53.577749 #2919491] INFO -- : prettyprint 0.2.0 I, [2024-05-15T13:53:53.578210 #2919491] INFO -- : prism 0.29.0 I, [2024-05-15T13:53:53.578722 #2919491] INFO -- : pstore 0.1.3 I, [2024-05-15T13:53:53.579163 #2919491] INFO -- : rdoc 6.6.3.1 I, [2024-05-15T13:53:53.580184 #2919491] INFO -- : readline 0.0.4 I, [2024-05-15T13:53:53.580582 #2919491] INFO -- : reline 0.5.7 I, [2024-05-15T13:53:53.581085 #2919491] INFO -- : resolv 0.4.0 I, [2024-05-15T13:53:53.581637 #2919491] INFO -- : ruby2_keywords 0.0.5 I, [2024-05-15T13:53:53.582570 #2919491] INFO -- : securerandom 0.3.1 I, [2024-05-15T13:53:53.583217 #2919491] INFO -- : set 1.1.0 I, [2024-05-15T13:53:53.583710 #2919491] INFO -- : shellwords 0.2.0 I, [2024-05-15T13:53:53.584193 #2919491] INFO -- : singleton 0.2.0 I, [2024-05-15T13:53:53.584634 #2919491] INFO -- : syntax_suggest 2.0.0 I, [2024-05-15T13:53:53.585336 #2919491] INFO -- : tempfile 0.2.1 I, [2024-05-15T13:53:53.585824 #2919491] INFO -- : time 0.3.0 I, [2024-05-15T13:53:53.586237 #2919491] INFO -- : timeout 0.4.1 I, [2024-05-15T13:53:53.586802 #2919491] INFO -- : tmpdir 0.2.0 I, [2024-05-15T13:53:53.587212 #2919491] INFO -- : tsort 0.2.0 I, [2024-05-15T13:53:53.587749 #2919491] INFO -- : un 0.3.0 I, [2024-05-15T13:53:53.588292 #2919491] INFO -- : uri 0.13.0 I, [2024-05-15T13:53:53.589314 #2919491] INFO -- : weakref 0.1.3 I, [2024-05-15T13:53:53.589823 #2919491] INFO -- : yaml 0.3.0 I, [2024-05-15T13:53:53.590162 #2919491] INFO -- : installing default gems from ext: /tmp/ruby/install/trunk/lib/ruby/gems/3.4.0+0 I, [2024-05-15T13:53:53.596141 #2919491] INFO -- : date 3.3.4 I, [2024-05-15T13:53:53.596660 #2919491] INFO -- : digest 3.1.1 I, [2024-05-15T13:53:53.597757 #2919491] INFO -- : etc 1.4.3 I, [2024-05-15T13:53:53.598268 #2919491] INFO -- : fcntl 1.1.0 I, [2024-05-15T13:53:53.598745 #2919491] INFO -- : fiddle 1.1.3 I, [2024-05-15T13:53:53.599204 #2919491] INFO -- : io-console 0.7.2 I, [2024-05-15T13:53:53.599957 #2919491] INFO -- : io-nonblock 0.3.0 I, [2024-05-15T13:53:53.600793 #2919491] INFO -- : io-wait 0.3.1 I, [2024-05-15T13:53:53.601371 #2919491] INFO -- : json 2.7.2 I, [2024-05-15T13:53:53.602282 #2919491] INFO -- : openssl 3.2.0 I, [2024-05-15T13:53:53.603049 #2919491] INFO -- : pathname 0.3.0 I, [2024-05-15T13:53:53.604077 #2919491] INFO -- : psych 5.1.2 I, [2024-05-15T13:53:53.604916 #2919491] INFO -- : stringio 3.1.1 I, [2024-05-15T13:53:53.605468 #2919491] INFO -- : strscan 3.1.1 I, [2024-05-15T13:53:53.605905 #2919491] INFO -- : zlib 3.1.0 I, [2024-05-15T13:53:53.606253 #2919491] INFO -- : installing bundled gems: /tmp/ruby/install/trunk/lib/ruby/gems/3.4.0+0 I, [2024-05-15T13:53:53.606556 #2919491] INFO -- : minitest 5.22.3 I, [2024-05-15T13:53:53.613860 #2919491] INFO -- : rake 13.2.1 I, [2024-05-15T13:53:53.617554 #2919491] INFO -- : test-unit 3.6.2 I, [2024-05-15T13:53:53.621010 #2919491] INFO -- : rexml 3.2.6 I, [2024-05-15T13:53:53.624974 #2919491] INFO -- : rss 0.3.0 I, [2024-05-15T13:53:53.627379 #2919491] INFO -- : net-ftp 0.3.4 I, [2024-05-15T13:53:53.628897 #2919491] INFO -- : net-imap 0.4.11 I, [2024-05-15T13:53:53.632130 #2919491] INFO -- : net-pop 0.1.2 I, [2024-05-15T13:53:53.633154 #2919491] INFO -- : net-smtp 0.5.0 I, [2024-05-15T13:53:53.634202 #2919491] INFO -- : matrix 0.4.2 I, [2024-05-15T13:53:53.637927 #2919491] INFO -- : prime 0.1.2 I, [2024-05-15T13:53:53.642381 #2919491] INFO -- : rbs 3.4.4 I, [2024-05-15T13:53:53.664716 #2919491] INFO -- : typeprof 0.21.11 I, [2024-05-15T13:53:53.666871 #2919491] INFO -- : debug 1.9.2 I, [2024-05-15T13:53:53.670248 #2919491] INFO -- : racc 1.7.3 I, [2024-05-15T13:53:53.672871 #2919491] INFO -- : mutex_m 0.2.0 I, [2024-05-15T13:53:53.674000 #2919491] INFO -- : getoptlong 0.2.1 I, [2024-05-15T13:53:53.675280 #2919491] INFO -- : base64 0.2.0 I, [2024-05-15T13:53:53.676459 #2919491] INFO -- : bigdecimal 3.1.8 I, [2024-05-15T13:53:53.678367 #2919491] INFO -- : observer 0.1.2 I, [2024-05-15T13:53:53.679436 #2919491] INFO -- : abbrev 0.1.2 I, [2024-05-15T13:53:53.680447 #2919491] INFO -- : resolv-replace 0.1.1 I, [2024-05-15T13:53:53.681981 #2919491] INFO -- : rinda 0.2.0 I, [2024-05-15T13:53:53.683216 #2919491] INFO -- : drb 2.2.1 I, [2024-05-15T13:53:53.685028 #2919491] INFO -- : nkf 0.2.0 I, [2024-05-15T13:53:53.687343 #2919491] INFO -- : syslog 0.1.2 I, [2024-05-15T13:53:53.688993 #2919491] INFO -- : csv 3.3.0 I, [2024-05-15T13:53:53.691031 #2919491] INFO -- : installing bundled gem cache: /tmp/ruby/install/trunk/lib/ruby/gems/3.4.0+0/cache I, [2024-05-15T13:53:53.692591 #2919491] INFO -- : skipped bundled gems: I, [2024-05-15T13:53:53.692612 #2919491] INFO -- : power_assert-2.0.4dev.gem not found in bundled_gems I, [2024-05-15T13:53:53.695629 #2919491] INFO -- : $$$[end] "make install -j20" exit with 0. I, [2024-05-15T13:53:53.695733 #2919491] INFO -- : $$$[beg] make yes-btest TESTOPTS='-q -j20' I, [2024-05-15T13:53:59.167433 #2919491] INFO -- : PASS all 1936 tests E, [2024-05-15T13:53:59.172649 #2919491] ERROR -- : I, [2024-05-15T13:53:59.172961 #2919491] INFO -- : $$$[end] "make yes-btest TESTOPTS='-q -j20'" exit with 0. I, [2024-05-15T13:53:59.173053 #2919491] INFO -- : $$$[beg] make yes-test-basic TESTS='-j20' I, [2024-05-15T13:53:59.237598 #2919491] INFO -- : BASERUBY = /usr/bin/ruby --disable=gems I, [2024-05-15T13:53:59.237642 #2919491] INFO -- : CC = gcc I, [2024-05-15T13:53:59.237651 #2919491] INFO -- : LD = ld I, [2024-05-15T13:53:59.237657 #2919491] INFO -- : LDSHARED = gcc -shared I, [2024-05-15T13:53:59.237664 #2919491] INFO -- : CFLAGS = -O3 -fno-fast-math -ggdb3 -Wall -Wextra -Wdeprecated-declarations -Wdiv-by-zero -Wduplicated-cond -Wimplicit-function-declaration -Wimplicit-int -Wpointer-arith -Wwrite-strings -Wold-style-definition -Wimplicit-fallthrough=0 -Wmissing-noreturn -Wno-cast-function-type -Wno-constant-logical-operand -Wno-long-long -Wno-missing-field-initializers -Wno-overlength-strings -Wno-packed-bitfield-compat -Wno-parentheses-equality -Wno-self-assign -Wno-tautological-compare -Wno-unused-parameter -Wno-unused-value -Wsuggest-attribute=format -Wsuggest-attribute=noreturn -Wunused-variable -Wmisleading-indentation -Wundef -fPIC I, [2024-05-15T13:53:59.237670 #2919491] INFO -- : XCFLAGS = -U_FORTIFY_SOURCE -D_FORTIFY_SOURCE=2 -fstack-protector-strong -fno-strict-overflow -fvisibility=hidden -fexcess-precision=standard -DRUBY_EXPORT -I. -I.ext/include/x86_64-linux -I/tmp/ruby/src/trunk/include -I/tmp/ruby/src/trunk -I/tmp/ruby/src/trunk/prism -I/tmp/ruby/src/trunk/enc/unicode/15.0.0 I, [2024-05-15T13:53:59.237688 #2919491] INFO -- : CPPFLAGS = I, [2024-05-15T13:53:59.237694 #2919491] INFO -- : DLDFLAGS = -Wl,--compress-debug-sections=zlib -Wl,-soname,libruby.so.3.4 -fstack-protector-strong I, [2024-05-15T13:53:59.237699 #2919491] INFO -- : SOLIBS = -lz -lrt -lrt -lgmp -ldl -lcrypt -lm -lpthread I, [2024-05-15T13:53:59.237704 #2919491] INFO -- : LANG = en_US.UTF-8 I, [2024-05-15T13:53:59.237710 #2919491] INFO -- : LC_ALL = I, [2024-05-15T13:53:59.237715 #2919491] INFO -- : LC_CTYPE = I, [2024-05-15T13:53:59.237720 #2919491] INFO -- : MFLAGS = I, [2024-05-15T13:53:59.237725 #2919491] INFO -- : RUSTC = no I, [2024-05-15T13:53:59.237731 #2919491] INFO -- : YJIT_RUSTC_ARGS = --crate-name=yjit --crate-type=staticlib --edition=2021 -g -C lto=thin -C opt-level=3 -C overflow-checks=on '--out-dir=/tmp/ruby/build/trunk/yjit/target/release/' /tmp/ruby/src/trunk/yjit/src/lib.rs I, [2024-05-15T13:53:59.238614 #2919491] INFO -- : gcc (Ubuntu 11.4.0-1ubuntu1~22.04) 11.4.0 I, [2024-05-15T13:53:59.238648 #2919491] INFO -- : Copyright (C) 2021 Free Software Foundation, Inc. I, [2024-05-15T13:53:59.238657 #2919491] INFO -- : This is free software; see the source for copying conditions. There is NO I, [2024-05-15T13:53:59.238664 #2919491] INFO -- : warranty; not even for MERCHANTABILITY or FITNESS FOR A PARTICULAR PURPOSE. I, [2024-05-15T13:53:59.238680 #2919491] INFO -- : I, [2024-05-15T13:53:59.351766 #2919491] INFO -- : Checking leaked global symbols...none I, [2024-05-15T13:53:59.392578 #2919491] INFO -- : /tmp/ruby/src/trunk/basictest/test.rb:assignment ....................................................................................................................................................................................................................................................................................................................................................................................OK 372 I, [2024-05-15T13:53:59.392637 #2919491] INFO -- : /tmp/ruby/src/trunk/basictest/test.rb:condition ..OK 2 I, [2024-05-15T13:53:59.392644 #2919491] INFO -- : /tmp/ruby/src/trunk/basictest/test.rb:if/unless ...OK 3 I, [2024-05-15T13:53:59.392656 #2919491] INFO -- : /tmp/ruby/src/trunk/basictest/test.rb:case .....OK 5 I, [2024-05-15T13:53:59.392858 #2919491] INFO -- : /tmp/ruby/src/trunk/basictest/test.rb:while/until ........OK 8 I, [2024-05-15T13:53:59.392919 #2919491] INFO -- : /tmp/ruby/src/trunk/basictest/test.rb:exception ..........OK 10 I, [2024-05-15T13:53:59.393195 #2919491] INFO -- : /tmp/ruby/src/trunk/basictest/test.rb:array .......................................OK 39 I, [2024-05-15T13:53:59.393295 #2919491] INFO -- : /tmp/ruby/src/trunk/basictest/test.rb:hash ...........................OK 27 I, [2024-05-15T13:53:59.394022 #2919491] INFO -- : /tmp/ruby/src/trunk/basictest/test.rb:iterator ...........................................................................................................OK 107 I, [2024-05-15T13:53:59.394304 #2919491] INFO -- : /tmp/ruby/src/trunk/basictest/test.rb:float ................................................................................OK 80 I, [2024-05-15T13:53:59.395312 #2919491] INFO -- : /tmp/ruby/src/trunk/basictest/test.rb:bignum ...............................OK 31 I, [2024-05-15T13:53:59.396154 #2919491] INFO -- : /tmp/ruby/src/trunk/basictest/test.rb:string & char ..............................................................OK 62 I, [2024-05-15T13:53:59.396193 #2919491] INFO -- : /tmp/ruby/src/trunk/basictest/test.rb:assignment ..........OK 10 I, [2024-05-15T13:53:59.396225 #2919491] INFO -- : /tmp/ruby/src/trunk/basictest/test.rb:call ......OK 6 I, [2024-05-15T13:53:59.396284 #2919491] INFO -- : /tmp/ruby/src/trunk/basictest/test.rb:proc .........OK 9 I, [2024-05-15T13:53:59.496955 #2919491] INFO -- : /tmp/ruby/src/trunk/basictest/test.rb:signal ..OK 2 I, [2024-05-15T13:53:59.499673 #2919491] INFO -- : /tmp/ruby/src/trunk/basictest/test.rb:eval ...........................OK 27 I, [2024-05-15T13:53:59.608860 #2919491] INFO -- : /tmp/ruby/src/trunk/basictest/test.rb:system ........OK 8 I, [2024-05-15T13:53:59.608924 #2919491] INFO -- : /tmp/ruby/src/trunk/basictest/test.rb:const .....OK 5 I, [2024-05-15T13:53:59.608938 #2919491] INFO -- : /tmp/ruby/src/trunk/basictest/test.rb:clone .....OK 5 I, [2024-05-15T13:53:59.609052 #2919491] INFO -- : /tmp/ruby/src/trunk/basictest/test.rb:marshal ....OK 4 I, [2024-05-15T13:53:59.609172 #2919491] INFO -- : /tmp/ruby/src/trunk/basictest/test.rb:pack ....OK 4 I, [2024-05-15T13:53:59.609192 #2919491] INFO -- : /tmp/ruby/src/trunk/basictest/test.rb:math ..OK 2 I, [2024-05-15T13:53:59.609199 #2919491] INFO -- : /tmp/ruby/src/trunk/basictest/test.rb:struct ......OK 6 I, [2024-05-15T13:53:59.609301 #2919491] INFO -- : /tmp/ruby/src/trunk/basictest/test.rb:variable ............OK 12 I, [2024-05-15T13:53:59.609322 #2919491] INFO -- : /tmp/ruby/src/trunk/basictest/test.rb:trace ...OK 3 I, [2024-05-15T13:53:59.609386 #2919491] INFO -- : /tmp/ruby/src/trunk/basictest/test.rb:defined? ............OK 12 I, [2024-05-15T13:53:59.609425 #2919491] INFO -- : /tmp/ruby/src/trunk/basictest/test.rb:alias ......OK 6 I, [2024-05-15T13:53:59.609751 #2919491] INFO -- : /tmp/ruby/src/trunk/basictest/test.rb:path .......................OK 23 I, [2024-05-15T13:53:59.642895 #2919491] INFO -- : /tmp/ruby/src/trunk/basictest/test.rb:gc ....OK 4 I, [2024-05-15T13:53:59.645429 #2919491] INFO -- : I, [2024-05-15T13:53:59.645444 #2919491] INFO -- : test succeeded I, [2024-05-15T13:53:59.647251 #2919491] INFO -- : $$$[end] "make yes-test-basic TESTS='-j20'" exit with 0. I, [2024-05-15T13:53:59.647352 #2919491] INFO -- : $$$[beg] make yes-test-all TESTOPTS='--stderr-on-failure' TESTS='-j20' I, [2024-05-15T13:53:59.742857 #2919491] INFO -- : BASERUBY = /usr/bin/ruby --disable=gems I, [2024-05-15T13:53:59.742898 #2919491] INFO -- : CC = gcc I, [2024-05-15T13:53:59.742904 #2919491] INFO -- : LD = ld I, [2024-05-15T13:53:59.742907 #2919491] INFO -- : LDSHARED = gcc -shared I, [2024-05-15T13:53:59.742912 #2919491] INFO -- : CFLAGS = -O3 -fno-fast-math -ggdb3 -Wall -Wextra -Wdeprecated-declarations -Wdiv-by-zero -Wduplicated-cond -Wimplicit-function-declaration -Wimplicit-int -Wpointer-arith -Wwrite-strings -Wold-style-definition -Wimplicit-fallthrough=0 -Wmissing-noreturn -Wno-cast-function-type -Wno-constant-logical-operand -Wno-long-long -Wno-missing-field-initializers -Wno-overlength-strings -Wno-packed-bitfield-compat -Wno-parentheses-equality -Wno-self-assign -Wno-tautological-compare -Wno-unused-parameter -Wno-unused-value -Wsuggest-attribute=format -Wsuggest-attribute=noreturn -Wunused-variable -Wmisleading-indentation -Wundef -fPIC I, [2024-05-15T13:53:59.742917 #2919491] INFO -- : XCFLAGS = -U_FORTIFY_SOURCE -D_FORTIFY_SOURCE=2 -fstack-protector-strong -fno-strict-overflow -fvisibility=hidden -fexcess-precision=standard -DRUBY_EXPORT -I. -I.ext/include/x86_64-linux -I/tmp/ruby/src/trunk/include -I/tmp/ruby/src/trunk -I/tmp/ruby/src/trunk/prism -I/tmp/ruby/src/trunk/enc/unicode/15.0.0 I, [2024-05-15T13:53:59.742920 #2919491] INFO -- : CPPFLAGS = I, [2024-05-15T13:53:59.742925 #2919491] INFO -- : DLDFLAGS = -Wl,--compress-debug-sections=zlib -Wl,-soname,libruby.so.3.4 -fstack-protector-strong I, [2024-05-15T13:53:59.742928 #2919491] INFO -- : SOLIBS = -lz -lrt -lrt -lgmp -ldl -lcrypt -lm -lpthread I, [2024-05-15T13:53:59.742932 #2919491] INFO -- : LANG = en_US.UTF-8 I, [2024-05-15T13:53:59.742935 #2919491] INFO -- : LC_ALL = I, [2024-05-15T13:53:59.742938 #2919491] INFO -- : LC_CTYPE = I, [2024-05-15T13:53:59.742942 #2919491] INFO -- : MFLAGS = I, [2024-05-15T13:53:59.742946 #2919491] INFO -- : RUSTC = no I, [2024-05-15T13:53:59.742950 #2919491] INFO -- : YJIT_RUSTC_ARGS = --crate-name=yjit --crate-type=staticlib --edition=2021 -g -C lto=thin -C opt-level=3 -C overflow-checks=on '--out-dir=/tmp/ruby/build/trunk/yjit/target/release/' /tmp/ruby/src/trunk/yjit/src/lib.rs I, [2024-05-15T13:53:59.743487 #2919491] INFO -- : gcc (Ubuntu 11.4.0-1ubuntu1~22.04) 11.4.0 I, [2024-05-15T13:53:59.743497 #2919491] INFO -- : Copyright (C) 2021 Free Software Foundation, Inc. I, [2024-05-15T13:53:59.743501 #2919491] INFO -- : This is free software; see the source for copying conditions. There is NO I, [2024-05-15T13:53:59.743505 #2919491] INFO -- : warranty; not even for MERCHANTABILITY or FITNESS FOR A PARTICULAR PURPOSE. I, [2024-05-15T13:53:59.743508 #2919491] INFO -- : I, [2024-05-15T13:53:59.745277 #2919491] INFO -- : generating enc.mk I, [2024-05-15T13:53:59.862608 #2919491] INFO -- : making enc I, [2024-05-15T13:53:59.879780 #2919491] INFO -- : make[1]: Entering directory '/tmp/ruby/build/trunk' I, [2024-05-15T13:53:59.879802 #2919491] INFO -- : make[1]: Nothing to be done for 'enc'. I, [2024-05-15T13:53:59.879808 #2919491] INFO -- : make[1]: Leaving directory '/tmp/ruby/build/trunk' I, [2024-05-15T13:53:59.880346 #2919491] INFO -- : making srcs under enc I, [2024-05-15T13:53:59.910554 #2919491] INFO -- : make[1]: Entering directory '/tmp/ruby/build/trunk' I, [2024-05-15T13:53:59.910576 #2919491] INFO -- : make[1]: Nothing to be done for 'srcs'. I, [2024-05-15T13:53:59.910581 #2919491] INFO -- : make[1]: Leaving directory '/tmp/ruby/build/trunk' I, [2024-05-15T13:53:59.911399 #2919491] INFO -- : generating transdb.h I, [2024-05-15T13:54:00.007789 #2919491] INFO -- : transdb.h unchanged I, [2024-05-15T13:54:00.009188 #2919491] INFO -- : making trans I, [2024-05-15T13:54:00.043083 #2919491] INFO -- : make[1]: Entering directory '/tmp/ruby/build/trunk' I, [2024-05-15T13:54:00.043104 #2919491] INFO -- : make[1]: Nothing to be done for 'trans'. I, [2024-05-15T13:54:00.043110 #2919491] INFO -- : make[1]: Leaving directory '/tmp/ruby/build/trunk' I, [2024-05-15T13:54:00.043815 #2919491] INFO -- : making encs I, [2024-05-15T13:54:00.082161 #2919491] INFO -- : make[1]: Entering directory '/tmp/ruby/build/trunk' I, [2024-05-15T13:54:00.082185 #2919491] INFO -- : make[1]: Nothing to be done for 'encs'. I, [2024-05-15T13:54:00.082191 #2919491] INFO -- : make[1]: Leaving directory '/tmp/ruby/build/trunk' I, [2024-05-15T13:54:00.083965 #2919491] INFO -- : generating makefiles ext/configure-ext.mk I, [2024-05-15T13:54:00.110600 #2919491] INFO -- : ext/configure-ext.mk updated I, [2024-05-15T13:54:00.113057 #2919491] INFO -- : make[1]: Entering directory '/tmp/ruby/build/trunk' I, [2024-05-15T13:54:01.458090 #2919491] INFO -- : make[1]: Leaving directory '/tmp/ruby/build/trunk' I, [2024-05-15T13:54:01.458963 #2919491] INFO -- : generating makefile exts.mk I, [2024-05-15T13:54:01.495419 #2919491] INFO -- : exts.mk unchanged I, [2024-05-15T13:54:01.499516 #2919491] INFO -- : make[1]: Entering directory '/tmp/ruby/build/trunk' I, [2024-05-15T13:54:01.818155 #2919491] INFO -- : make[2]: Entering directory '/tmp/ruby/build/trunk/ext/coverage' I, [2024-05-15T13:54:01.822785 #2919491] INFO -- : make[2]: Leaving directory '/tmp/ruby/build/trunk/ext/coverage' I, [2024-05-15T13:54:01.829267 #2919491] INFO -- : make[2]: Entering directory '/tmp/ruby/build/trunk/ext/date' I, [2024-05-15T13:54:01.834330 #2919491] INFO -- : make[2]: Leaving directory '/tmp/ruby/build/trunk/ext/date' I, [2024-05-15T13:54:01.838139 #2919491] INFO -- : make[2]: Entering directory '/tmp/ruby/build/trunk/ext/digest' I, [2024-05-15T13:54:01.846988 #2919491] INFO -- : make[2]: Leaving directory '/tmp/ruby/build/trunk/ext/digest' I, [2024-05-15T13:54:01.872978 #2919491] INFO -- : make[2]: Entering directory '/tmp/ruby/build/trunk/ext/digest/sha2' I, [2024-05-15T13:54:01.877844 #2919491] INFO -- : make[2]: Leaving directory '/tmp/ruby/build/trunk/ext/digest/sha2' I, [2024-05-15T13:54:01.899076 #2919491] INFO -- : make[2]: Entering directory '/tmp/ruby/build/trunk/ext/fiddle' I, [2024-05-15T13:54:01.909684 #2919491] INFO -- : make[2]: Leaving directory '/tmp/ruby/build/trunk/ext/fiddle' I, [2024-05-15T13:54:01.914701 #2919491] INFO -- : make[2]: Entering directory '/tmp/ruby/build/trunk/ext/io/console' I, [2024-05-15T13:54:01.918908 #2919491] INFO -- : make[2]: Leaving directory '/tmp/ruby/build/trunk/ext/io/console' I, [2024-05-15T13:54:01.931599 #2919491] INFO -- : make[2]: Entering directory '/tmp/ruby/build/trunk/ext/json' I, [2024-05-15T13:54:01.941914 #2919491] INFO -- : make[2]: Leaving directory '/tmp/ruby/build/trunk/ext/json' I, [2024-05-15T13:54:01.956969 #2919491] INFO -- : make[2]: Entering directory '/tmp/ruby/build/trunk/ext/monitor' I, [2024-05-15T13:54:01.960878 #2919491] INFO -- : make[2]: Leaving directory '/tmp/ruby/build/trunk/ext/monitor' I, [2024-05-15T13:54:01.968045 #2919491] INFO -- : make[2]: Entering directory '/tmp/ruby/build/trunk/ext/objspace' I, [2024-05-15T13:54:01.973125 #2919491] INFO -- : make[2]: Leaving directory '/tmp/ruby/build/trunk/ext/objspace' I, [2024-05-15T13:54:01.989364 #2919491] INFO -- : make[2]: Entering directory '/tmp/ruby/build/trunk/ext/openssl' I, [2024-05-15T13:54:02.003427 #2919491] INFO -- : make[2]: Leaving directory '/tmp/ruby/build/trunk/ext/openssl' I, [2024-05-15T13:54:02.006536 #2919491] INFO -- : make[2]: Entering directory '/tmp/ruby/build/trunk/ext/pathname' I, [2024-05-15T13:54:02.009812 #2919491] INFO -- : make[2]: Leaving directory '/tmp/ruby/build/trunk/ext/pathname' I, [2024-05-15T13:54:02.016653 #2919491] INFO -- : make[2]: Entering directory '/tmp/ruby/build/trunk/ext/psych' I, [2024-05-15T13:54:02.037061 #2919491] INFO -- : make[2]: Leaving directory '/tmp/ruby/build/trunk/ext/psych' I, [2024-05-15T13:54:02.041707 #2919491] INFO -- : make[2]: Entering directory '/tmp/ruby/build/trunk/ext/pty' I, [2024-05-15T13:54:02.045262 #2919491] INFO -- : make[2]: Leaving directory '/tmp/ruby/build/trunk/ext/pty' I, [2024-05-15T13:54:02.059811 #2919491] INFO -- : make[2]: Entering directory '/tmp/ruby/build/trunk/ext/ripper' I, [2024-05-15T13:54:02.066627 #2919491] INFO -- : make[2]: Leaving directory '/tmp/ruby/build/trunk/ext/ripper' I, [2024-05-15T13:54:02.068771 #2919491] INFO -- : make[2]: Entering directory '/tmp/ruby/build/trunk/ext/rubyvm' I, [2024-05-15T13:54:02.071999 #2919491] INFO -- : make[2]: Leaving directory '/tmp/ruby/build/trunk/ext/rubyvm' I, [2024-05-15T13:54:02.084925 #2919491] INFO -- : make[2]: Entering directory '/tmp/ruby/build/trunk/ext/socket' I, [2024-05-15T13:54:02.094694 #2919491] INFO -- : make[2]: Leaving directory '/tmp/ruby/build/trunk/ext/socket' I, [2024-05-15T13:54:02.112652 #2919491] INFO -- : make[2]: Entering directory '/tmp/ruby/build/trunk/.bundle/gems/bigdecimal-3.1.8/ext/bigdecimal' I, [2024-05-15T13:54:02.140918 #2919491] INFO -- : make[2]: Leaving directory '/tmp/ruby/build/trunk/.bundle/gems/bigdecimal-3.1.8/ext/bigdecimal' I, [2024-05-15T13:54:02.142835 #2919491] INFO -- : make[2]: Entering directory '/tmp/ruby/build/trunk/.bundle/gems/debug-1.9.2/ext/debug' I, [2024-05-15T13:54:02.166130 #2919491] INFO -- : make[2]: Leaving directory '/tmp/ruby/build/trunk/.bundle/gems/debug-1.9.2/ext/debug' I, [2024-05-15T13:54:02.167986 #2919491] INFO -- : make[2]: Entering directory '/tmp/ruby/build/trunk/.bundle/gems/nkf-0.2.0/ext/nkf' I, [2024-05-15T13:54:02.189080 #2919491] INFO -- : make[2]: Leaving directory '/tmp/ruby/build/trunk/.bundle/gems/nkf-0.2.0/ext/nkf' I, [2024-05-15T13:54:02.191283 #2919491] INFO -- : make[2]: Entering directory '/tmp/ruby/build/trunk/.bundle/gems/racc-1.7.3/ext/racc/cparse' I, [2024-05-15T13:54:02.212584 #2919491] INFO -- : make[2]: Leaving directory '/tmp/ruby/build/trunk/.bundle/gems/racc-1.7.3/ext/racc/cparse' I, [2024-05-15T13:54:02.214759 #2919491] INFO -- : make[2]: Entering directory '/tmp/ruby/build/trunk/.bundle/gems/rbs-3.4.4/ext/rbs_extension' I, [2024-05-15T13:54:02.238833 #2919491] INFO -- : make[2]: Leaving directory '/tmp/ruby/build/trunk/.bundle/gems/rbs-3.4.4/ext/rbs_extension' I, [2024-05-15T13:54:02.240922 #2919491] INFO -- : make[2]: Entering directory '/tmp/ruby/build/trunk/.bundle/gems/syslog-0.1.2/ext/syslog' I, [2024-05-15T13:54:02.263540 #2919491] INFO -- : make[2]: Leaving directory '/tmp/ruby/build/trunk/.bundle/gems/syslog-0.1.2/ext/syslog' I, [2024-05-15T13:54:02.287718 #2919491] INFO -- : make[2]: Entering directory '/tmp/ruby/build/trunk' I, [2024-05-15T13:54:02.351831 #2919491] INFO -- : make[2]: 'ruby' is up to date. I, [2024-05-15T13:54:02.351868 #2919491] INFO -- : make[2]: Leaving directory '/tmp/ruby/build/trunk' I, [2024-05-15T13:54:02.352067 #2919491] INFO -- : make[1]: Leaving directory '/tmp/ruby/build/trunk' I, [2024-05-15T13:54:02.355542 #2919491] INFO -- : make[1]: Entering directory '/tmp/ruby/build/trunk' I, [2024-05-15T13:54:02.355554 #2919491] INFO -- : make[1]: Nothing to be done for 'note'. I, [2024-05-15T13:54:02.355561 #2919491] INFO -- : make[1]: Leaving directory '/tmp/ruby/build/trunk' I, [2024-05-15T13:54:02.431823 #2919491] INFO -- : Run options: I, [2024-05-15T13:54:02.431879 #2919491] INFO -- : --seed=12758 I, [2024-05-15T13:54:02.431885 #2919491] INFO -- : "--ruby=./miniruby -I/tmp/ruby/src/trunk/lib -I. -I.ext/common /tmp/ruby/src/trunk/tool/runruby.rb --extout=.ext -- --disable-gems" I, [2024-05-15T13:54:02.431889 #2919491] INFO -- : --excludes-dir=/tmp/ruby/src/trunk/test/.excludes I, [2024-05-15T13:54:02.431892 #2919491] INFO -- : --name=!/memory_leak/ I, [2024-05-15T13:54:02.431896 #2919491] INFO -- : --stderr-on-failure I, [2024-05-15T13:54:02.431899 #2919491] INFO -- : -j20 I, [2024-05-15T13:54:02.431903 #2919491] INFO -- : I, [2024-05-15T13:54:02.431907 #2919491] INFO -- : # Running tests: I, [2024-05-15T13:54:02.431910 #2919491] INFO -- : I, [2024-05-15T13:54:02.580402 #2919491] INFO -- : [ 1/885] 2960869=test_rdoc_markup_to_markdown I, [2024-05-15T13:54:02.580579 #2919491] INFO -- : [ 2/885] 2960853=test_json_tree I, [2024-05-15T13:54:02.580682 #2919491] INFO -- : [ 3/885] 2960854=test_ansi_with_terminfo I, [2024-05-15T13:54:02.581296 #2919491] INFO -- : [ 4/885] 2960856=test_rdoc_generator_pot_po I, [2024-05-15T13:54:02.583287 #2919491] INFO -- : [ 5/885] 2960852=test_ractor I, [2024-05-15T13:54:02.584430 #2919491] INFO -- : [ 6/885] 2960851=test_memory_view I, [2024-05-15T13:54:02.584523 #2919491] INFO -- : [ 7/885] 2960868=test_m17n_comb I, [2024-05-15T13:54:02.584601 #2919491] INFO -- : [ 8/885] 2960866=test_grapheme_breaks I, [2024-05-15T13:54:02.584691 #2919491] INFO -- : [ 9/885] 2960867=test_gem_version_option I, [2024-05-15T13:54:02.595041 #2919491] INFO -- : [ 10/885] 2960870=test_gem_request_connection_pools I, [2024-05-15T13:54:02.600788 #2919491] INFO -- : [ 11/885] 2960865=test_cclass I, [2024-05-15T13:54:02.605112 #2919491] INFO -- : [ 12/885] 2960853=test_parser_events I, [2024-05-15T13:54:02.606761 #2919491] INFO -- : [ 13/885] 2960855=test_reline I, [2024-05-15T13:54:02.611955 #2919491] INFO -- : [ 14/885] 2960866=test_case I, [2024-05-15T13:54:02.615297 #2919491] INFO -- : [ 15/885] 2960863=test_pkey I, [2024-05-15T13:54:02.615409 #2919491] INFO -- : [ 16/885] 2960862=test_objectspace I, [2024-05-15T13:54:02.615506 #2919491] INFO -- : [ 17/885] 2960859=test_thread I, [2024-05-15T13:54:02.615606 #2919491] INFO -- : [ 18/885] 2960861=test_socket I, [2024-05-15T13:54:02.615844 #2919491] INFO -- : [ 19/885] 2960864=test_rdoc_markup_to_table_of_contents I, [2024-05-15T13:54:02.616287 #2919491] INFO -- : [ 20/885] 2960857=test_dot_dot I, [2024-05-15T13:54:02.616405 #2919491] INFO -- : [ 21/885] 2960858=test_c_struct_builder I, [2024-05-15T13:54:02.616824 #2919491] INFO -- : [ 22/885] 2960860=test_str2big I, [2024-05-15T13:54:02.617219 #2919491] INFO -- : [ 23/885] 2960866=test_literal I, [2024-05-15T13:54:02.619311 #2919491] INFO -- : [ 24/885] 2960851=test_rdoc_generator_ri I, [2024-05-15T13:54:02.620473 #2919491] INFO -- : [ 25/885] 2960857=test_extlibs I, [2024-05-15T13:54:02.628367 #2919491] INFO -- : [ 26/885] 2960860=test_gem_stream_ui I, [2024-05-15T13:54:02.636926 #2919491] INFO -- : [ 27/885] 2960854=test_gem_install_update_options I, [2024-05-15T13:54:02.643888 #2919491] INFO -- : [ 28/885] 2960852=parse_test I, [2024-05-15T13:54:02.661486 #2919491] INFO -- : [ 29/885] 2960853=test_require_lib I, [2024-05-15T13:54:02.667625 #2919491] INFO -- : [ 30/885] 2960858=test_ractor I, [2024-05-15T13:54:02.678193 #2919491] INFO -- : [ 31/885] 2960858=test_severity I, [2024-05-15T13:54:02.685013 #2919491] INFO -- : [ 32/885] 2960858=test_gem_package_tar_reader_entry I, [2024-05-15T13:54:02.695600 #2919491] INFO -- : [ 33/885] 2960869=test_gem_name_tuple I, [2024-05-15T13:54:02.722848 #2919491] INFO -- : [ 34/885] 2960863=test_rand I, [2024-05-15T13:54:02.736072 #2919491] INFO -- : [ 35/885] 2960865=test_bug_reporter I, [2024-05-15T13:54:02.743093 #2919491] INFO -- : [ 36/885] 2960856=test_exception I, [2024-05-15T13:54:02.745270 #2919491] INFO -- : [ 37/885] 2960864=test_store I, [2024-05-15T13:54:02.764212 #2919491] INFO -- : [ 38/885] 2960851=test_case_options I, [2024-05-15T13:54:02.767300 #2919491] INFO -- : [ 39/885] 2960851=test_gem_commands_info_command I, [2024-05-15T13:54:02.787222 #2919491] INFO -- : [ 40/885] 2960867=test_gem_dependency_installer I, [2024-05-15T13:54:02.846926 #2919491] INFO -- : [ 41/885] 2960859=test_scalar I, [2024-05-15T13:54:02.872799 #2919491] INFO -- : [ 42/885] 2960859=test_rdoc_cross_reference I, [2024-05-15T13:54:02.874671 #2919491] INFO -- : [ 43/885] 2960863=test_gem_text I, [2024-05-15T13:54:02.882768 #2919491] INFO -- : [ 44/885] 2960855=test_settracefunc I, [2024-05-15T13:54:02.888160 #2919491] INFO -- : [ 45/885] 2960864=test_enumerator_kw I, [2024-05-15T13:54:02.893490 #2919491] INFO -- : [ 46/885] 2960864=test_scan_args I, [2024-05-15T13:54:02.901219 #2919491] INFO -- : [ 47/885] 2960864=test_win32ole I, [2024-05-15T13:54:02.905345 #2919491] INFO -- : [ 48/885] 2960864=test_generic I, [2024-05-15T13:54:02.913116 #2919491] INFO -- : [ 49/885] 2960860=test_sprintf_comb I, [2024-05-15T13:54:02.916564 #2919491] INFO -- : [ 50/885] 2960869=test_method_cache I, [2024-05-15T13:54:02.920477 #2919491] INFO -- : [ 51/885] 2960869=test_gem_request I, [2024-05-15T13:54:02.942787 #2919491] INFO -- : [ 52/885] 2960864=test_gem_ext_cargo_builder_link_flag_converter I, [2024-05-15T13:54:02.976281 #2919491] INFO -- : [ 53/885] 2960851=test_gem_commands_mirror I, [2024-05-15T13:54:02.981922 #2919491] INFO -- : [ 54/885] 2960851=test_rdoc_markup_attribute_manager I, [2024-05-15T13:54:02.995638 #2919491] INFO -- : [ 55/885] 2960858=test_name_error I, [2024-05-15T13:54:03.009735 #2919491] INFO -- : [ 56/885] 2960851=test_gem_resolver I, [2024-05-15T13:54:03.024945 #2919491] INFO -- : [ 57/885] 2960854=test_gem_resolver_composed_set I, [2024-05-15T13:54:03.037602 #2919491] INFO -- : [ 58/885] 2960854=test_safe_load I, [2024-05-15T13:54:03.051747 #2919491] INFO -- : [ 59/885] 2960863=test_gem_commands_dependency_command I, [2024-05-15T13:54:03.054606 #2919491] INFO -- : [ 60/885] 2960854=test_gem_commands_specification_command I, [2024-05-15T13:54:03.064233 #2919491] INFO -- : [ 61/885] 2960860=test_flags I, [2024-05-15T13:54:03.111112 #2919491] INFO -- : [ 62/885] 2960869=test_inadvertent_creation I, [2024-05-15T13:54:03.115398 #2919491] INFO -- : [ 63/885] 2960864=test_enumerator I, [2024-05-15T13:54:03.121518 #2919491] INFO -- : [ 64/885] 2960858=test_http I, [2024-05-15T13:54:03.143744 #2919491] INFO -- : [ 65/885] 2960858=test_gem_commands_which_command I, [2024-05-15T13:54:03.149678 #2919491] INFO -- : [ 66/885] 2960863=test_shift_jis I, [2024-05-15T13:54:03.155341 #2919491] INFO -- : [ 67/885] 2960863=test_require I, [2024-05-15T13:54:03.158543 #2919491] INFO -- : [ 68/885] 2960863=test_date_time I, [2024-05-15T13:54:03.161402 #2919491] INFO -- : [ 69/885] 2960865=test_rdoc_markup_to_joined_paragraph I, [2024-05-15T13:54:03.167674 #2919491] INFO -- : [ 70/885] 2960863=test_data I, [2024-05-15T13:54:03.177001 #2919491] INFO -- : [ 71/885] 2960863=test_date_new I, [2024-05-15T13:54:03.183384 #2919491] INFO -- : [ 72/885] 2960863=index_write_test I, [2024-05-15T13:54:03.190265 #2919491] INFO -- : [ 73/885] 2960854=test_syntax I, [2024-05-15T13:54:03.194034 #2919491] INFO -- : [ 74/885] 2960858=test_gem_safe_yaml I, [2024-05-15T13:54:03.220231 #2919491] INFO -- : [ 75/885] 2960858=test_rdoc_text I, [2024-05-15T13:54:03.229818 #2919491] INFO -- : [ 76/885] 2960851=test_tcp I, [2024-05-15T13:54:03.248555 #2919491] INFO -- : [ 77/885] 2960869=test_iso_8859 I, [2024-05-15T13:54:03.253332 #2919491] INFO -- : [ 78/885] 2960863=test_nil2vtempty I, [2024-05-15T13:54:03.258973 #2919491] INFO -- : [ 79/885] 2960863=test_stream I, [2024-05-15T13:54:03.267594 #2919491] INFO -- : [ 80/885] 2960863=test_rdoc_context I, [2024-05-15T13:54:03.271990 #2919491] INFO -- : [ 81/885] 2960869=test_rdoc_parser_ruby I, [2024-05-15T13:54:03.309313 #2919491] INFO -- : [ 82/885] 2960851=test_open-uri I, [2024-05-15T13:54:03.321382 #2919491] INFO -- : [ 83/885] 2960865=test_httpresponse I, [2024-05-15T13:54:03.322613 #2919491] INFO -- : [ 84/885] 2960866=test_thread_fd_close I, [2024-05-15T13:54:03.329951 #2919491] INFO -- : [ 85/885] 2960866=test_passing_block I, [2024-05-15T13:54:03.332850 #2919491] INFO -- : [ 86/885] 2960866=test_stringchar I, [2024-05-15T13:54:03.345256 #2919491] INFO -- : [ 87/885] 2960859=test_hash_create I, [2024-05-15T13:54:03.347680 #2919491] INFO -- : [ 88/885] 2960859=newline_test I, [2024-05-15T13:54:03.401245 #2919491] INFO -- : [ 89/885] 2960866=test_uncorrectable_name_check I, [2024-05-15T13:54:03.409370 #2919491] INFO -- : [ 90/885] 2960866=test_switch_hitter I, [2024-05-15T13:54:03.420681 #2919491] INFO -- : [ 91/885] 2960865=test_singleton I, [2024-05-15T13:54:03.427533 #2919491] INFO -- : [ 92/885] 2960866=test_flush I, [2024-05-15T13:54:03.428067 #2919491] INFO -- : [ 93/885] 2960865=test_io_console I, [2024-05-15T13:54:03.431001 #2919491] INFO -- : [ 94/885] 2960866=test_logperiod I, [2024-05-15T13:54:03.440466 #2919491] INFO -- : [ 95/885] 2960866=test_rdoc_markdown_test I, [2024-05-15T13:54:03.482987 #2919491] INFO -- : [ 96/885] 2960858=test_rdoc_normal_module I, [2024-05-15T13:54:03.497440 #2919491] INFO -- : [ 97/885] 2960859=test_c_union_entity I, [2024-05-15T13:54:03.532008 #2919491] INFO -- : [ 98/885] 2960859=test_securerandom I, [2024-05-15T13:54:03.534957 #2919491] INFO -- : [ 99/885] 2960862=test_x509cert I, [2024-05-15T13:54:03.585066 #2919491] INFO -- : [100/885] 2960859=test_gc I, [2024-05-15T13:54:03.601652 #2919491] INFO -- : [101/885] 2960858=test_gem_resolver_lock_specification I, [2024-05-15T13:54:03.660780 #2919491] INFO -- : [102/885] 2960858=test_err_in_callback I, [2024-05-15T13:54:03.665943 #2919491] INFO -- : [103/885] 2960858=test_logdevice I, [2024-05-15T13:54:03.732326 #2919491] INFO -- : [104/885] 2960851=test_arity I, [2024-05-15T13:54:03.738336 #2919491] INFO -- : [105/885] 2960851=test_gem_ext_rake_builder I, [2024-05-15T13:54:03.805047 #2919491] INFO -- : [106/885] 2960870=test_gem_source_local I, [2024-05-15T13:54:03.818367 #2919491] INFO -- : [107/885] 2960869=test_gem_security_policy I, [2024-05-15T13:54:03.868029 #2919491] INFO -- : [108/885] 2960855=test_pack I, [2024-05-15T13:54:03.869904 #2919491] INFO -- : [109/885] 2960862=test_last_thread I, [2024-05-15T13:54:03.924268 #2919491] INFO -- : [110/885] 2960861=test_process I, [2024-05-15T13:54:04.037624 #2919491] INFO -- : [111/885] 2960870=test_gem_spec_fetcher I, [2024-05-15T13:54:04.079457 #2919491] INFO -- : [112/885] 2960855=test_common I, [2024-05-15T13:54:04.106127 #2919491] INFO -- : [113/885] 2960860=test_key_actor_vi I, [2024-05-15T13:54:04.163200 #2919491] INFO -- : [114/885] 2960869=test_bug-3571 I, [2024-05-15T13:54:04.175617 #2919491] INFO -- : [115/885] 2960870=test_gem_command I, [2024-05-15T13:54:04.177975 #2919491] INFO -- : [116/885] 2960869=test_gem_commands_lock_command I, [2024-05-15T13:54:04.196815 #2919491] INFO -- : [117/885] 2960869=test_assignment I, [2024-05-15T13:54:04.209411 #2919491] INFO -- : [118/885] 2960856=test_ifunless I, [2024-05-15T13:54:04.212313 #2919491] INFO -- : [119/885] 2960856=test_numeric I, [2024-05-15T13:54:04.247900 #2919491] INFO -- : [120/885] 2960870=test_rdoc_tom_doc I, [2024-05-15T13:54:04.278154 #2919491] INFO -- : [121/885] 2960860=test_hmac I, [2024-05-15T13:54:04.292595 #2919491] INFO -- : [122/885] 2960856=test_rdoc_markup_to_tt_only I, [2024-05-15T13:54:04.299007 #2919491] INFO -- : [123/885] 2960860=test_iter_break I, [2024-05-15T13:54:04.301160 #2919491] INFO -- : [124/885] 2960860=test_zsh_completion I, [2024-05-15T13:54:04.301378 #2919491] INFO -- : [125/885] 2960855=test_exception I, [2024-05-15T13:54:04.304480 #2919491] INFO -- : [126/885] 2960860=test_frozen I, [2024-05-15T13:54:04.308613 #2919491] INFO -- : [127/885] 2960860=test_gem_ext_configure_builder I, [2024-05-15T13:54:04.322821 #2919491] INFO -- : [128/885] 2960855=test_pp I, [2024-05-15T13:54:04.327467 #2919491] INFO -- : [129/885] 2960856=test_macro I, [2024-05-15T13:54:04.345583 #2919491] INFO -- : [130/885] 2960863=test_num2int I, [2024-05-15T13:54:04.347883 #2919491] INFO -- : [131/885] 2960860=test_nil I, [2024-05-15T13:54:04.358716 #2919491] INFO -- : [132/885] 2960863=test_rdoc_single_class I, [2024-05-15T13:54:04.360061 #2919491] INFO -- : [133/885] 2960855=test_verbose I, [2024-05-15T13:54:04.362598 #2919491] INFO -- : [134/885] 2960863=test_config I, [2024-05-15T13:54:04.372340 #2919491] INFO -- : [135/885] 2960860=test_yaml_special_cases I, [2024-05-15T13:54:04.375496 #2919491] INFO -- : [136/885] 2960860=test_optarg I, [2024-05-15T13:54:04.384007 #2919491] INFO -- : [137/885] 2960855=test_gem_source_list I, [2024-05-15T13:54:04.400252 #2919491] INFO -- : [138/885] 2960856=test_address_resolve I, [2024-05-15T13:54:04.408630 #2919491] INFO -- : [139/885] 2960851=test_rdoc_token_stream I, [2024-05-15T13:54:04.413671 #2919491] INFO -- : [140/885] 2960856=test_eval_history I, [2024-05-15T13:54:04.417364 #2919491] INFO -- : [141/885] 2960851=dispatcher_test I, [2024-05-15T13:54:04.443427 #2919491] INFO -- : [142/885] 2960866=test_kernel I, [2024-05-15T13:54:04.453632 #2919491] INFO -- : [143/885] 2960863=test_kdf I, [2024-05-15T13:54:04.468070 #2919491] INFO -- : [144/885] 2960870=test_gem_doctor I, [2024-05-15T13:54:04.476095 #2919491] INFO -- : [145/885] 2960856=test_gem_silent_ui I, [2024-05-15T13:54:04.500701 #2919491] INFO -- : [146/885] 2960858=test_emitter I, [2024-05-15T13:54:04.504255 #2919491] INFO -- : [147/885] 2960851=test_bug-5832 I, [2024-05-15T13:54:04.506718 #2919491] INFO -- : [148/885] 2960851=test_files_ext I, [2024-05-15T13:54:04.507488 #2919491] INFO -- : [149/885] 2960858=test_gem_ext_cargo_builder_unit I, [2024-05-15T13:54:04.509334 #2919491] INFO -- : [150/885] 2960860=test_gem_rdoc I, [2024-05-15T13:54:04.518053 #2919491] INFO -- : [151/885] 2960863=test_date I, [2024-05-15T13:54:04.518931 #2919491] INFO -- : [152/885] 2960870=test_at_exit I, [2024-05-15T13:54:04.521559 #2919491] INFO -- : [153/885] 2960863=test_command I, [2024-05-15T13:54:04.528476 #2919491] INFO -- : [154/885] 2960868=test_object_create_start I, [2024-05-15T13:54:04.531071 #2919491] INFO -- : [155/885] 2960868=test_rdoc_markup_paragraph I, [2024-05-15T13:54:04.536895 #2919491] INFO -- : [156/885] 2960870=!Nothing_to_test I, [2024-05-15T13:54:04.540793 #2919491] INFO -- : [157/885] 2960870=test_enc_raise I, [2024-05-15T13:54:04.545571 #2919491] INFO -- : [158/885] 2960858=test_psych I, [2024-05-15T13:54:04.554440 #2919491] INFO -- : [159/885] 2960870=test_pkey_ec I, [2024-05-15T13:54:04.566073 #2919491] INFO -- : [160/885] 2960857=test_trick I, [2024-05-15T13:54:04.568978 #2919491] INFO -- : [161/885] 2960858=test_thread I, [2024-05-15T13:54:04.572717 #2919491] INFO -- : [162/885] 2960858=test_pipe I, [2024-05-15T13:54:04.605682 #2919491] INFO -- : [163/885] 2960855=test_date_parse I, [2024-05-15T13:54:04.628739 #2919491] INFO -- : [164/885] 2960870=test_rdoc_markup_attributes I, [2024-05-15T13:54:04.635364 #2919491] INFO -- : [165/885] 2960870=test_default_gems I, [2024-05-15T13:54:04.638659 #2919491] INFO -- : [166/885] 2960868=test_rdoc_markup_to_rdoc I, [2024-05-15T13:54:04.642841 #2919491] INFO -- : [167/885] 2960856=test_rdoc_rd_inline_parser I, [2024-05-15T13:54:04.666955 #2919491] INFO -- : [168/885] 2960856=test_mul I, [2024-05-15T13:54:04.675713 #2919491] INFO -- : [169/885] 2960856=test_null I, [2024-05-15T13:54:04.679929 #2919491] INFO -- : [170/885] 2960868=test_win32ole_type I, [2024-05-15T13:54:04.681254 #2919491] INFO -- : [171/885] 2960851=test_gb18030 I, [2024-05-15T13:54:04.684249 #2919491] INFO -- : [172/885] 2960868=test_buffering I, [2024-05-15T13:54:04.687567 #2919491] INFO -- : [173/885] 2960851=test_svcb_https I, [2024-05-15T13:54:04.692092 #2919491] INFO -- : [174/885] 2960856=test_gem_uninstaller I, [2024-05-15T13:54:04.695970 #2919491] INFO -- : [175/885] 2960851=test_rdoc_rdoc I, [2024-05-15T13:54:04.706585 #2919491] INFO -- : [176/885] 2960870=test_windows_1251 I, [2024-05-15T13:54:04.715282 #2919491] INFO -- : [177/885] 2960858=test_time I, [2024-05-15T13:54:04.716269 #2919491] INFO -- : [178/885] 2960870=test_rdoc_i18n_text I, [2024-05-15T13:54:04.716992 #2919491] INFO -- : [179/885] 2960855=test_io_buffer I, [2024-05-15T13:54:04.722982 #2919491] INFO -- : [180/885] 2960870=test_key_name_check I, [2024-05-15T13:54:04.724656 #2919491] INFO -- : [181/885] 2960868=test_defined I, [2024-05-15T13:54:04.733956 #2919491] INFO -- : [182/885] 2960870=test_backtrace I, [2024-05-15T13:54:04.737929 #2919491] INFO -- : [183/885] 2960870=test_files_test_2 I, [2024-05-15T13:54:04.747468 #2919491] INFO -- : [184/885] 2960855=test_fnmatch I, [2024-05-15T13:54:04.788656 #2919491] INFO -- : [185/885] 2960855=test_rdoc_markup_parser I, [2024-05-15T13:54:04.799370 #2919491] INFO -- : [186/885] 2960860=test_require_path_check I, [2024-05-15T13:54:04.819550 #2919491] INFO -- : [187/885] 2960868=test_folderitem2_invokeverb I, [2024-05-15T13:54:04.824431 #2919491] INFO -- : [188/885] 2960868=test_gem_validator I, [2024-05-15T13:54:04.847799 #2919491] INFO -- : [189/885] 2960858=test_gem_package_old I, [2024-05-15T13:54:04.857818 #2919491] INFO -- : [190/885] 2960851=test_gem_resolver_index_set I, [2024-05-15T13:54:04.865056 #2919491] INFO -- : [191/885] 2960863=test_gc_compact I, [2024-05-15T13:54:04.879927 #2919491] INFO -- : [192/885] 2960858=test_proc I, [2024-05-15T13:54:04.892465 #2919491] INFO -- : [193/885] 2960860=test_string I, [2024-05-15T13:54:04.893228 #2919491] INFO -- : [194/885] 2960851=test_date_conv I, [2024-05-15T13:54:04.904281 #2919491] INFO -- : [195/885] 2960851=test_optimization I, [2024-05-15T13:54:04.941391 #2919491] INFO -- : [196/885] 2960867=test_ole_methods I, [2024-05-15T13:54:04.944141 #2919491] INFO -- : [197/885] 2960862=test_erb_m17n I, [2024-05-15T13:54:04.944546 #2919491] INFO -- : [198/885] 2960867=test_egrep_cpp I, [2024-05-15T13:54:04.966495 #2919491] INFO -- : [199/885] 2960862=test_zlib I, [2024-05-15T13:54:04.972263 #2919491] INFO -- : [200/885] 2960855=test_cgi_tag_helper I, [2024-05-15T13:54:04.986700 #2919491] INFO -- : [201/885] 2960855=test_gem_dependency_resolution_error I, [2024-05-15T13:54:04.989811 #2919491] INFO -- : [202/885] 2960855=test_rdoc_parser I, [2024-05-15T13:54:05.031503 #2919491] INFO -- : [203/885] 2960855=test_qsort I, [2024-05-15T13:54:05.035482 #2919491] INFO -- : [204/885] 2960855=test_custom_command I, [2024-05-15T13:54:05.064442 #2919491] INFO -- : [205/885] 2960868=json_addition_test I, [2024-05-15T13:54:05.106264 #2919491] INFO -- : [206/885] 2960855=test_raise I, [2024-05-15T13:54:05.109403 #2919491] INFO -- : [207/885] 2960868=test_x509attr I, [2024-05-15T13:54:05.110959 #2919491] INFO -- : [208/885] 2960855=test_depth_first I, [2024-05-15T13:54:05.111385 #2919491] INFO -- : [209/885] 2960868=test_gem_request_set_lockfile_parser I, [2024-05-15T13:54:05.114022 #2919491] INFO -- : [210/885] 2960855=test_rdoc_store I, [2024-05-15T13:54:05.129164 #2919491] INFO -- : [211/885] 2960867=test_string I, [2024-05-15T13:54:05.151190 #2919491] INFO -- : [212/885] 2960867=test_rdoc_stats I, [2024-05-15T13:54:05.151842 #2919491] INFO -- : [213/885] 2960866=test_pattern_matching I, [2024-05-15T13:54:05.190204 #2919491] INFO -- : [214/885] 2960866=test_readpartial I, [2024-05-15T13:54:05.221244 #2919491] INFO -- : [215/885] 2960868=test_gem_commands_install_command I, [2024-05-15T13:54:05.229448 #2919491] INFO -- : [216/885] 2960852=test_clone I, [2024-05-15T13:54:05.374799 #2919491] INFO -- : [217/885] 2960869=test_rdoc_require I, [2024-05-15T13:54:05.385643 #2919491] INFO -- : [218/885] 2960869=locals_test I, [2024-05-15T13:54:05.392492 #2919491] INFO -- : [219/885] 2960852=test_rdoc_markup_indented_paragraph I, [2024-05-15T13:54:05.418222 #2919491] INFO -- : [220/885] 2960867=test_rdoc_task I, [2024-05-15T13:54:05.418808 #2919491] INFO -- : [221/885] 2960867=test_gem_resolver_conflict I, [2024-05-15T13:54:05.433108 #2919491] INFO -- : [222/885] 2960867=test_backtrace I, [2024-05-15T13:54:05.536761 #2919491] INFO -- : [223/885] 2960852=test_pack I, [2024-05-15T13:54:05.565096 #2919491] INFO -- : [224/885] 2960852=ruby_parser_test I, [2024-05-15T13:54:05.567340 #2919491] INFO -- : [225/885] 2960852=test_io_buffer I, [2024-05-15T13:54:05.578770 #2919491] INFO -- : [226/885] 2960856=test_yield I, [2024-05-15T13:54:05.595891 #2919491] INFO -- : [227/885] 2960866=test_rdoc_alias I, [2024-05-15T13:54:05.637590 #2919491] INFO -- : [228/885] 2960866=parser_test I, [2024-05-15T13:54:05.660545 #2919491] INFO -- : [229/885] 2960869=test_convertible I, [2024-05-15T13:54:05.682975 #2919491] INFO -- : [230/885] 2960852=test_files_sample I, [2024-05-15T13:54:05.687057 #2919491] INFO -- : [231/885] 2960858=test_stringscanner I, [2024-05-15T13:54:05.712084 #2919491] INFO -- : [232/885] 2960858=encoding_test I, [2024-05-15T13:54:05.715427 #2919491] INFO -- : [233/885] 2960866=test_gem_resolver_best_set I, [2024-05-15T13:54:05.746949 #2919491] INFO -- : [234/885] 2960855=test_typeddata I, [2024-05-15T13:54:05.780315 #2919491] INFO -- : [235/885] 2960866=test_rdoc_markup_to_html_crossref I, [2024-05-15T13:54:05.787494 #2919491] INFO -- : [236/885] 2960852=test_rdoc_markup_raw I, [2024-05-15T13:54:05.793993 #2919491] INFO -- : [237/885] 2960852=test_webauthn_poller I, [2024-05-15T13:54:05.817489 #2919491] INFO -- : [238/885] 2960858=test_rat I, [2024-05-15T13:54:05.827135 #2919491] INFO -- : [239/885] 2960858=test_optparse I, [2024-05-15T13:54:05.866549 #2919491] INFO -- : [240/885] 2960858=test_array I, [2024-05-15T13:54:05.878190 #2919491] INFO -- : [241/885] 2960858=test_fstring I, [2024-05-15T13:54:05.984568 #2919491] INFO -- : [242/885] 2960858=test_etc I, [2024-05-15T13:54:05.995459 #2919491] INFO -- : [243/885] 2960855=test_yjit_exit_locations I, [2024-05-15T13:54:05.999351 #2919491] INFO -- : [244/885] 2960855=test_gem_resolver_activation_request I, [2024-05-15T13:54:06.008382 #2919491] INFO -- : [245/885] 2960855=test_getopts I, [2024-05-15T13:54:06.015870 #2919491] INFO -- : [246/885] 2960855=test_protocol I, [2024-05-15T13:54:06.025746 #2919491] INFO -- : [247/885] 2960853=test_ripper I, [2024-05-15T13:54:06.059845 #2919491] INFO -- : [248/885] 2960865=test_gem_config_file I, [2024-05-15T13:54:06.063071 #2919491] INFO -- : [249/885] 2960866=test_gem_util I, [2024-05-15T13:54:06.091816 #2919491] INFO -- : [250/885] 2960858=test_iseq_load I, [2024-05-15T13:54:06.139117 #2919491] INFO -- : [251/885] 2960852=test_gem_package_tar_header I, [2024-05-15T13:54:06.190170 #2919491] INFO -- : [252/885] 2960852=test_pkey_dh I, [2024-05-15T13:54:06.240240 #2919491] INFO -- : [253/885] 2960866=test_bigzero I, [2024-05-15T13:54:06.251059 #2919491] INFO -- : [254/885] 2960866=test_pkcs12 I, [2024-05-15T13:54:06.255902 #2919491] INFO -- : [255/885] 2960852=test_system I, [2024-05-15T13:54:06.276365 #2919491] INFO -- : [256/885] 2960853=test_rendering I, [2024-05-15T13:54:06.321848 #2919491] INFO -- : [257/885] 2960855=test_face I, [2024-05-15T13:54:06.337510 #2919491] INFO -- : [258/885] 2960855=test_sizeof I, [2024-05-15T13:54:06.374072 #2919491] INFO -- : [259/885] 2960853=test_case I, [2024-05-15T13:54:06.384476 #2919491] INFO -- : [260/885] 2960865=test_unicode_escape I, [2024-05-15T13:54:06.428424 #2919491] INFO -- : [261/885] 2960853=test_io I, [2024-05-15T13:54:06.438754 #2919491] INFO -- : [262/885] 2960868=test_utf16 I, [2024-05-15T13:54:06.446233 #2919491] INFO -- : [263/885] 2960868=test_autoload I, [2024-05-15T13:54:06.455729 #2919491] INFO -- : [264/885] 2960865=test_config I, [2024-05-15T13:54:06.465404 #2919491] INFO -- : [265/885] 2960857=test_sleep I, [2024-05-15T13:54:06.507499 #2919491] INFO -- : [266/885] 2960865=test_gem_commands_fetch_command I, [2024-05-15T13:54:06.634159 #2919491] INFO -- : [267/885] 2960866=test_math I, [2024-05-15T13:54:06.637406 #2919491] INFO -- : [268/885] 2960865=test_gc I, [2024-05-15T13:54:06.639345 #2919491] INFO -- : [269/885] 2960865=test_libs I, [2024-05-15T13:54:06.651705 #2919491] INFO -- : [270/885] 2960866=test_yaml_tree I, [2024-05-15T13:54:06.663785 #2919491] INFO -- : [271/885] 2960865=test_gem_commands_uninstall_command I, [2024-05-15T13:54:06.675163 #2919491] INFO -- : [272/885] 2960866=test_gem_source_specific_file I, [2024-05-15T13:54:06.715316 #2919491] INFO -- : [273/885] 2960862=test_foreach I, [2024-05-15T13:54:06.719411 #2919491] INFO -- : [274/885] 2960862=test_condition I, [2024-05-15T13:54:06.721404 #2919491] INFO -- : [275/885] 2960862=test_cp949 I, [2024-05-15T13:54:06.725853 #2919491] INFO -- : [276/885] 2960862=test_win32ole_record I, [2024-05-15T13:54:06.726515 #2919491] INFO -- : [277/885] 2960867=test_gem_unsatisfiable_dependency_error I, [2024-05-15T13:54:06.730854 #2919491] INFO -- : [278/885] 2960862=test_ubf_async_safe I, [2024-05-15T13:54:06.733231 #2919491] INFO -- : [279/885] 2960862=test_hash I, [2024-05-15T13:54:06.744590 #2919491] INFO -- : [280/885] 2960867=test_sorted_set I, [2024-05-15T13:54:06.753651 #2919491] INFO -- : [281/885] 2960858=test_win32ole_type_event I, [2024-05-15T13:54:06.753724 #2919491] INFO -- : [282/885] 2960858=test_emoji I, [2024-05-15T13:54:06.754304 #2919491] INFO -- : [283/885] 2960866=test_io I, [2024-05-15T13:54:06.786812 #2919491] INFO -- : [284/885] 2960858=test_date_attr I, [2024-05-15T13:54:06.792023 #2919491] INFO -- : [285/885] 2960858=test_ellipsize I, [2024-05-15T13:54:06.805132 #2919491] INFO -- : [286/885] 2960858=warnings_test I, [2024-05-15T13:54:06.819200 #2919491] INFO -- : [287/885] 2960858=test_kwargs I, [2024-05-15T13:54:06.824793 #2919491] INFO -- : [288/885] 2960858=test_io_wait I, [2024-05-15T13:54:07.038727 #2919491] INFO -- : [289/885] 2960867=test_gem_commands_exec_command I, [2024-05-15T13:54:07.042976 #2919491] INFO -- : [290/885] 2960866=test_type_completor I, [2024-05-15T13:54:07.051407 #2919491] INFO -- : [291/885] 2960866=test_summary I, [2024-05-15T13:54:07.157947 #2919491] INFO -- : [292/885] 2960858=test_console_attr I, [2024-05-15T13:54:07.161012 #2919491] INFO -- : [293/885] 2960858=test_rdoc_context_section I, [2024-05-15T13:54:07.169693 #2919491] INFO -- : [294/885] 2960858=test_euc_kr I, [2024-05-15T13:54:07.174384 #2919491] INFO -- : [295/885] 2960858=test_ftp I, [2024-05-15T13:54:07.182680 #2919491] INFO -- : [296/885] 2960858=test_pattern_key_name_check I, [2024-05-15T13:54:07.187273 #2919491] INFO -- : [297/885] 2960858=test_to_ruby I, [2024-05-15T13:54:07.197295 #2919491] INFO -- : [298/885] 2960858=test_array_create I, [2024-05-15T13:54:07.203990 #2919491] INFO -- : [299/885] 2960858=test_pack I, [2024-05-15T13:54:07.208331 #2919491] INFO -- : [300/885] 2960866=test_gem_impossible_dependencies_error I, [2024-05-15T13:54:07.212817 #2919491] INFO -- : [301/885] 2960866=test_gem_commands_query_command I, [2024-05-15T13:54:07.222265 #2919491] INFO -- : [302/885] 2960852=test_method I, [2024-05-15T13:54:07.333095 #2919491] INFO -- : [303/885] 2960865=test_rdoc_rubygems_hook I, [2024-05-15T13:54:07.454135 #2919491] INFO -- : [304/885] 2960865=test_remote_fetch_error I, [2024-05-15T13:54:07.457573 #2919491] INFO -- : [305/885] 2960858=test_have_library I, [2024-05-15T13:54:07.465346 #2919491] INFO -- : [306/885] 2960865=test_lock_native_thread I, [2024-05-15T13:54:07.687961 #2919491] INFO -- : [307/885] 2960863=test_c_struct_entry I, [2024-05-15T13:54:07.735684 #2919491] INFO -- : [308/885] 2960865=test_gem_commands_stale_command I, [2024-05-15T13:54:07.752938 #2919491] INFO -- : [309/885] 2960865=test_set I, [2024-05-15T13:54:07.755174 #2919491] INFO -- : [310/885] 2960865=test_show_source I, [2024-05-15T13:54:07.781674 #2919491] INFO -- : [311/885] 2960866=comments_test I, [2024-05-15T13:54:07.794199 #2919491] INFO -- : [312/885] 2960866=test_sprintf I, [2024-05-15T13:54:07.878786 #2919491] INFO -- : [313/885] 2960865=test_gem_requirement I, [2024-05-15T13:54:07.907407 #2919491] INFO -- : [314/885] 2960867=test_string_memory I, [2024-05-15T13:54:07.962853 #2919491] INFO -- : [315/885] 2960867=test_gem_security_trust_dir I, [2024-05-15T13:54:07.993123 #2919491] INFO -- : [316/885] 2960867=test_undef I, [2024-05-15T13:54:08.002059 #2919491] INFO -- : [317/885] 2960867=test_line_editor I, [2024-05-15T13:54:08.002783 #2919491] INFO -- : [318/885] 2960863=ripper_test I, [2024-05-15T13:54:08.019395 #2919491] INFO -- : [319/885] 2960870=test_objspace I, [2024-05-15T13:54:08.033845 #2919491] INFO -- : [320/885] 2960865=test_kill_ring I, [2024-05-15T13:54:08.055406 #2919491] INFO -- : [321/885] 2960865=test_ns_spki I, [2024-05-15T13:54:08.055821 #2919491] INFO -- : [322/885] 2960867=test_framework I, [2024-05-15T13:54:08.057338 #2919491] INFO -- : [323/885] 2960867=test_argf I, [2024-05-15T13:54:08.073203 #2919491] INFO -- : [324/885] 2960865=test_gem_commands_environment_command I, [2024-05-15T13:54:08.097714 #2919491] INFO -- : [325/885] 2960866=test_m17n I, [2024-05-15T13:54:08.126362 #2919491] INFO -- : [326/885] 2960865=test_ws I, [2024-05-15T13:54:08.133278 #2919491] INFO -- : [327/885] 2960865=test_yjit I, [2024-05-15T13:54:08.139670 #2919491] INFO -- : [328/885] 2960865=test_workspace I, [2024-05-15T13:54:08.155403 #2919491] INFO -- : [329/885] 2960864=test_weakmap I, [2024-05-15T13:54:08.183656 #2919491] INFO -- : [330/885] 2960866=test_protect I, [2024-05-15T13:54:08.192658 #2919491] INFO -- : [331/885] 2960866=test_win32ole_typelib I, [2024-05-15T13:54:08.196776 #2919491] INFO -- : [332/885] 2960866=test_gem_request_set_lockfile I, [2024-05-15T13:54:08.305256 #2919491] INFO -- : [333/885] 2960865=test_raise_exception I, [2024-05-15T13:54:08.513859 #2919491] INFO -- : [334/885] 2960857=test_postponed_job I, [2024-05-15T13:54:08.515760 #2919491] INFO -- : [335/885] 2960866=test_alias_and_anchor I, [2024-05-15T13:54:08.543229 #2919491] INFO -- : [336/885] 2960866=test_external_new I, [2024-05-15T13:54:08.551744 #2919491] INFO -- : [337/885] 2960866=test_tree_builder I, [2024-05-15T13:54:08.558212 #2919491] INFO -- : [338/885] 2960866=test_gem_resolver_dependency_request I, [2024-05-15T13:54:08.588463 #2919491] INFO -- : [339/885] 2960866=test_hash I, [2024-05-15T13:54:08.607459 #2919491] INFO -- : [340/885] 2960866=test_gem_version I, [2024-05-15T13:54:08.642887 #2919491] INFO -- : [341/885] 2960863=test_rdoc_options I, [2024-05-15T13:54:08.654293 #2919491] INFO -- : [342/885] 2960856=test_econv I, [2024-05-15T13:54:08.702753 #2919491] INFO -- : [343/885] 2960858=test_cesu8 I, [2024-05-15T13:54:08.709547 #2919491] INFO -- : [344/885] 2960866=test_string_processing I, [2024-05-15T13:54:08.716344 #2919491] INFO -- : [345/885] 2960858=test_fileutils I, [2024-05-15T13:54:08.772216 #2919491] INFO -- : [346/885] 2960866=test_emitter I, [2024-05-15T13:54:08.780016 #2919491] INFO -- : [347/885] 2960866=test_resource I, [2024-05-15T13:54:08.808373 #2919491] INFO -- : [348/885] 2960866=test_gem_commands_signin_command I, [2024-05-15T13:54:08.865257 #2919491] INFO -- : [349/885] 2960863=test_ldap I, [2024-05-15T13:54:08.883363 #2919491] INFO -- : [350/885] 2960863=test_reqarg I, [2024-05-15T13:54:08.887370 #2919491] INFO -- : [351/885] 2960857=test_rdoc_include I, [2024-05-15T13:54:08.920137 #2919491] INFO -- : [352/885] 2960866=test_stack I, [2024-05-15T13:54:08.934161 #2919491] INFO -- : [353/885] 2960865=test_gem_commands_list_command I, [2024-05-15T13:54:08.951728 #2919491] INFO -- : [354/885] 2960865=test_too_many_dummy_encodings I, [2024-05-15T13:54:09.045145 #2919491] INFO -- : [355/885] 2960865=test_mdns I, [2024-05-15T13:54:09.050589 #2919491] INFO -- : [356/885] 2960865=test_parse I, [2024-05-15T13:54:09.076210 #2919491] INFO -- : [357/885] 2960857=test_gem_remote_fetcher I, [2024-05-15T13:54:09.223876 #2919491] INFO -- : [358/885] 2960858=test_scanner_events I, [2024-05-15T13:54:09.259743 #2919491] INFO -- : [359/885] 2960858=test_gem_resolver_installed_specification I, [2024-05-15T13:54:09.281432 #2919491] INFO -- : [360/885] 2960858=test_gem_ext_ext_conf_builder I, [2024-05-15T13:54:09.328962 #2919491] INFO -- : [361/885] 2960863=test_method_cache I, [2024-05-15T13:54:09.334214 #2919491] INFO -- : [362/885] 2960863=test_gem_stub_specification I, [2024-05-15T13:54:09.455196 #2919491] INFO -- : [363/885] 2960854=test_frozen_error I, [2024-05-15T13:54:09.458388 #2919491] INFO -- : [364/885] 2960854=test_gem_commands_search_command I, [2024-05-15T13:54:09.466532 #2919491] INFO -- : [365/885] 2960854=test_complex I, [2024-05-15T13:54:09.469942 #2919491] INFO -- : [366/885] 2960863=test_inlinecache I, [2024-05-15T13:54:09.517662 #2919491] INFO -- : [367/885] 2960863=test_rdoc_markup_verbatim I, [2024-05-15T13:54:09.524517 #2919491] INFO -- : [368/885] 2960863=test_gem_resolver_specification I, [2024-05-15T13:54:09.555812 #2919491] INFO -- : [369/885] 2960863=test_gem_dependency I, [2024-05-15T13:54:09.589273 #2919491] INFO -- : [370/885] 2960865=test_path_to_class I, [2024-05-15T13:54:09.595793 #2919491] INFO -- : [371/885] 2960865=test_class I, [2024-05-15T13:54:09.597568 #2919491] INFO -- : [372/885] 2960854=test_rdoc_normal_class I, [2024-05-15T13:54:09.672173 #2919491] INFO -- : [373/885] 2960855=test_const I, [2024-05-15T13:54:09.675650 #2919491] INFO -- : [374/885] 2960855=json_string_matching_test I, [2024-05-15T13:54:09.691717 #2919491] INFO -- : [375/885] 2960855=test_load I, [2024-05-15T13:54:09.700593 #2919491] INFO -- : [376/885] 2960855=test_random I, [2024-05-15T13:54:09.713209 #2919491] INFO -- : [377/885] 2960863=test_asn1 I, [2024-05-15T13:54:09.718180 #2919491] INFO -- : [378/885] 2960855=test_irb I, [2024-05-15T13:54:09.735842 #2919491] INFO -- : [379/885] 2960863=test_rdoc_parser_rd I, [2024-05-15T13:54:09.743271 #2919491] INFO -- : [380/885] 2960856=test_date_strftime I, [2024-05-15T13:54:09.765908 #2919491] INFO -- : [381/885] 2960863=test_yamlstore I, [2024-05-15T13:54:09.784599 #2919491] INFO -- : [382/885] 2960863=test_gem_installer I, [2024-05-15T13:54:09.827976 #2919491] INFO -- : [383/885] 2960854=test_utf32 I, [2024-05-15T13:54:09.829964 #2919491] INFO -- : [384/885] 2960854=test_basicsocket I, [2024-05-15T13:54:09.841096 #2919491] INFO -- : [385/885] 2960854=test_duplicate I, [2024-05-15T13:54:09.844451 #2919491] INFO -- : [386/885] 2960854=test_gem_commands_help_command I, [2024-05-15T13:54:09.885235 #2919491] INFO -- : [387/885] 2960866=test_rdoc_markup I, [2024-05-15T13:54:09.893173 #2919491] INFO -- : [388/885] 2960866=test_tracepoint I, [2024-05-15T13:54:09.920441 #2919491] INFO -- : [389/885] 2960854=test_prettyprint I, [2024-05-15T13:54:09.943030 #2919491] INFO -- : [390/885] 2960854=test_internal_ivar I, [2024-05-15T13:54:09.944525 #2919491] INFO -- : [391/885] 2960854=test_gem_resolver_index_specification I, [2024-05-15T13:54:09.983849 #2919491] INFO -- : [392/885] 2960855=test_function I, [2024-05-15T13:54:09.987834 #2919491] INFO -- : [393/885] 2960854=test_queue I, [2024-05-15T13:54:09.996965 #2919491] INFO -- : [394/885] 2960854=test_tempfile I, [2024-05-15T13:54:10.117338 #2919491] INFO -- : [395/885] 2960866=parse_comments_test I, [2024-05-15T13:54:10.123172 #2919491] INFO -- : [396/885] 2960866=test_noarg I, [2024-05-15T13:54:10.147710 #2919491] INFO -- : [397/885] 2960856=test_fiddle I, [2024-05-15T13:54:10.215772 #2919491] INFO -- : [398/885] 2960856=test_wss I, [2024-05-15T13:54:10.229118 #2919491] INFO -- : [399/885] 2960856=test_ractor I, [2024-05-15T13:54:10.241138 #2919491] INFO -- : [400/885] 2960864=test_find I, [2024-05-15T13:54:10.243859 #2919491] INFO -- : [401/885] 2960855=test_marshalable I, [2024-05-15T13:54:10.244655 #2919491] INFO -- : [402/885] 2960855=test_digest I, [2024-05-15T13:54:10.251777 #2919491] INFO -- : [403/885] 2960864=test_gem_ext_cmake_builder I, [2024-05-15T13:54:10.263160 #2919491] INFO -- : [404/885] 2960866=test_gem_commands_contents_command I, [2024-05-15T13:54:10.268174 #2919491] INFO -- : [405/885] 2960854=test_cgi_util I, [2024-05-15T13:54:10.275562 #2919491] INFO -- : [406/885] 2960864=test_require I, [2024-05-15T13:54:10.329586 #2919491] INFO -- : [407/885] 2960856=test_deprecate I, [2024-05-15T13:54:10.347016 #2919491] INFO -- : [408/885] 2960862=test_rdoc_constant I, [2024-05-15T13:54:10.361845 #2919491] INFO -- : [409/885] 2960856=test_formatter I, [2024-05-15T13:54:10.363635 #2919491] INFO -- : [410/885] 2960866=test_bash_completion I, [2024-05-15T13:54:10.369826 #2919491] INFO -- : [411/885] 2960856=test_gem_source_vendor I, [2024-05-15T13:54:10.376180 #2919491] INFO -- : [412/885] 2960866=test_gem_commands_owner_command I, [2024-05-15T13:54:10.381295 #2919491] INFO -- : [413/885] 2960856=test_recorder I, [2024-05-15T13:54:10.386745 #2919491] INFO -- : [414/885] 2960856=test_rdoc_encoding I, [2024-05-15T13:54:10.410844 #2919491] INFO -- : [415/885] 2960856=test_coverage I, [2024-05-15T13:54:10.505387 #2919491] INFO -- : [416/885] 2960854=regexp_test I, [2024-05-15T13:54:10.522769 #2919491] INFO -- : [417/885] 2960858=test_gem_package_tar_reader I, [2024-05-15T13:54:10.552921 #2919491] INFO -- : [418/885] 2960862=test_complexrational I, [2024-05-15T13:54:10.554154 #2919491] INFO -- : [419/885] 2960862=test_init I, [2024-05-15T13:54:10.568412 #2919491] INFO -- : [420/885] 2960858=test_pathname I, [2024-05-15T13:54:10.577896 #2919491] INFO -- : [421/885] 2960852=test_rdoc_markdown I, [2024-05-15T13:54:10.590153 #2919491] INFO -- : [422/885] 2960854=test_gem_available_set I, [2024-05-15T13:54:10.693774 #2919491] INFO -- : [423/885] 2960869=test_rdoc_any_method I, [2024-05-15T13:54:10.715389 #2919491] INFO -- : [424/885] 2960854=test_modify_expand I, [2024-05-15T13:54:10.720758 #2919491] INFO -- : [425/885] 2960854=test_file I, [2024-05-15T13:54:10.739497 #2919491] INFO -- : [426/885] 2960854=test_nowrite I, [2024-05-15T13:54:10.768837 #2919491] INFO -- : [427/885] 2960858=test_thread_queue I, [2024-05-15T13:54:10.771314 #2919491] INFO -- : [428/885] 2960854=test_rdoc_markup_formatter I, [2024-05-15T13:54:10.785006 #2919491] INFO -- : [429/885] 2960854=test_bmethod I, [2024-05-15T13:54:10.791658 #2919491] INFO -- : [430/885] 2960854=test_euc_tw I, [2024-05-15T13:54:10.796066 #2919491] INFO -- : [431/885] 2960854=test_ractor I, [2024-05-15T13:54:10.817257 #2919491] INFO -- : [432/885] 2960852=test_gem_commands_sources_command I, [2024-05-15T13:54:10.825653 #2919491] INFO -- : [433/885] 2960854=test_ansi_without_terminfo I, [2024-05-15T13:54:10.836205 #2919491] INFO -- : [434/885] 2960854=test_big2str I, [2024-05-15T13:54:10.841718 #2919491] INFO -- : [435/885] 2960854=test_yaml I, [2024-05-15T13:54:10.900648 #2919491] INFO -- : [436/885] 2960862=test_forwardable I, [2024-05-15T13:54:10.910931 #2919491] INFO -- : [437/885] 2960862=test_wait I, [2024-05-15T13:54:10.942353 #2919491] INFO -- : [438/885] 2960866=test_handle I, [2024-05-15T13:54:10.962634 #2919491] INFO -- : [439/885] 2960854=test_gbk I, [2024-05-15T13:54:10.965387 #2919491] INFO -- : [440/885] 2960854=test_class2name I, [2024-05-15T13:54:10.970548 #2919491] INFO -- : [441/885] 2960854=test_enc_str_buf_cat I, [2024-05-15T13:54:10.980053 #2919491] INFO -- : [442/885] 2960854=test_pstore I, [2024-05-15T13:54:10.985331 #2919491] INFO -- : [443/885] 2960862=test_cstr I, [2024-05-15T13:54:11.020874 #2919491] INFO -- : [444/885] 2960854=test_profile_frames I, [2024-05-15T13:54:11.034514 #2919491] INFO -- : [445/885] 2960852=test_io_timeout I, [2024-05-15T13:54:11.046866 #2919491] INFO -- : [446/885] 2960852=test_shapes I, [2024-05-15T13:54:11.047382 #2919491] INFO -- : [447/885] 2960852=json_fixtures_test I, [2024-05-15T13:54:11.063254 #2919491] INFO -- : [448/885] 2960852=test_comparable I, [2024-05-15T13:54:11.066354 #2919491] INFO -- : [449/885] 2960855=test_rdoc_parser_c I, [2024-05-15T13:54:11.073867 #2919491] INFO -- : [450/885] 2960852=test_variable I, [2024-05-15T13:54:11.150265 #2919491] INFO -- : [451/885] 2960869=fuzzer_test I, [2024-05-15T13:54:11.153651 #2919491] INFO -- : [452/885] 2960869=test_rdoc_markup_include I, [2024-05-15T13:54:11.157990 #2919491] INFO -- : [453/885] 2960869=test_sexp I, [2024-05-15T13:54:11.176119 #2919491] INFO -- : [454/885] 2960869=magic_comment_test I, [2024-05-15T13:54:11.181748 #2919491] INFO -- : [455/885] 2960869=test_rdoc_markup_to_html_snippet I, [2024-05-15T13:54:11.189986 #2919491] INFO -- : [456/885] 2960854=test_struct I, [2024-05-15T13:54:11.190883 #2919491] INFO -- : [457/885] 2960852=test_cparser I, [2024-05-15T13:54:11.202420 #2919491] INFO -- : [458/885] 2960854=test_pkg_config I, [2024-05-15T13:54:11.212045 #2919491] INFO -- : [459/885] 2960856=test_config I, [2024-05-15T13:54:11.237411 #2919491] INFO -- : [460/885] 2960851=json_parser_test I, [2024-05-15T13:54:11.238043 #2919491] INFO -- : [461/885] 2960869=test_nomethod_error I, [2024-05-15T13:54:11.249811 #2919491] INFO -- : [462/885] 2960869=memsize_test I, [2024-05-15T13:54:11.251665 #2919491] INFO -- : [463/885] 2960854=json_common_interface_test I, [2024-05-15T13:54:11.251828 #2919491] INFO -- : [464/885] 2960869=test_gem_source_subpath_problem I, [2024-05-15T13:54:11.271117 #2919491] INFO -- : [465/885] 2960856=test_dln I, [2024-05-15T13:54:11.271189 #2919491] INFO -- : [466/885] 2960856=test_win32ole_variant_outarg I, [2024-05-15T13:54:11.274283 #2919491] INFO -- : [467/885] 2960854=test_rdoc_rd_inline I, [2024-05-15T13:54:11.276691 #2919491] INFO -- : [468/885] 2960856=test_mutex I, [2024-05-15T13:54:11.281663 #2919491] INFO -- : [469/885] 2960854=test_x509req I, [2024-05-15T13:54:11.293146 #2919491] INFO -- : [470/885] 2960851=test_struct I, [2024-05-15T13:54:11.295971 #2919491] INFO -- : [471/885] 2960855=test_gem_path_support I, [2024-05-15T13:54:11.320867 #2919491] INFO -- : [472/885] 2960855=test_set I, [2024-05-15T13:54:11.326174 #2919491] INFO -- : [473/885] 2960868=test_files_test_1 I, [2024-05-15T13:54:11.338493 #2919491] INFO -- : [474/885] 2960855=test_deprecated I, [2024-05-15T13:54:11.343022 #2919491] INFO -- : [475/885] 2960855=test_color_printer I, [2024-05-15T13:54:11.344625 #2919491] INFO -- : [476/885] 2960862=test_insns_leaf I, [2024-05-15T13:54:11.345014 #2919491] INFO -- : [477/885] 2960855=test_serialize_subclasses I, [2024-05-15T13:54:11.348013 #2919491] INFO -- : [478/885] 2960855=test_key_error I, [2024-05-15T13:54:11.349167 #2919491] INFO -- : [479/885] 2960862=test_allocation I, [2024-05-15T13:54:11.351944 #2919491] INFO -- : [480/885] 2960855=test_div I, [2024-05-15T13:54:11.355419 #2919491] INFO -- : [481/885] 2960855=test_win32ole_variant_m I, [2024-05-15T13:54:11.355487 #2919491] INFO -- : [482/885] 2960855=test_engine I, [2024-05-15T13:54:11.358275 #2919491] INFO -- : [483/885] 2960855=test_input_method I, [2024-05-15T13:54:11.388124 #2919491] INFO -- : [484/885] 2960855=test_windows_1252 I, [2024-05-15T13:54:11.389012 #2919491] INFO -- : [485/885] 2960855=test_process I, [2024-05-15T13:54:11.389273 #2919491] INFO -- : [486/885] 2960857=test_x509crl I, [2024-05-15T13:54:11.404629 #2919491] INFO -- : [487/885] 2960869=test_fixnum I, [2024-05-15T13:54:11.410696 #2919491] INFO -- : [488/885] 2960869=test_signal I, [2024-05-15T13:54:11.414384 #2919491] INFO -- : [489/885] 2960855=test_rdoc_top_level I, [2024-05-15T13:54:11.439093 #2919491] INFO -- : [490/885] 2960866=test_metaclass I, [2024-05-15T13:54:11.445683 #2919491] INFO -- : [491/885] 2960866=test_rdoc_rd I, [2024-05-15T13:54:11.471674 #2919491] INFO -- : [492/885] 2960866=test_cgi_session I, [2024-05-15T13:54:11.478196 #2919491] INFO -- : [493/885] 2960854=test_gem_resolver_installer_set I, [2024-05-15T13:54:11.488837 #2919491] INFO -- : [494/885] 2960859=test_dir_m17n I, [2024-05-15T13:54:11.490817 #2919491] INFO -- : [495/885] 2960866=test_gem_source_git I, [2024-05-15T13:54:11.493218 #2919491] INFO -- : [496/885] 2960864=test_regex_casefold I, [2024-05-15T13:54:11.559967 #2919491] INFO -- : [497/885] 2960857=test_refinement I, [2024-05-15T13:54:11.631923 #2919491] INFO -- : [498/885] 2960855=test_gem_commands_signout_command I, [2024-05-15T13:54:11.648714 #2919491] INFO -- : [499/885] 2960854=test_require I, [2024-05-15T13:54:11.650919 #2919491] INFO -- : [500/885] 2960855=test_cgi_cookie I, [2024-05-15T13:54:11.655546 #2919491] INFO -- : [501/885] 2960855=test_float I, [2024-05-15T13:54:11.845198 #2919491] INFO -- : [502/885] 2960864=test_gem_resolver_git_set I, [2024-05-15T13:54:11.888714 #2919491] INFO -- : [503/885] 2960851=test_storage I, [2024-05-15T13:54:11.890664 #2919491] INFO -- : [504/885] 2960851=test_gem_security_signer I, [2024-05-15T13:54:11.914660 #2919491] INFO -- : [505/885] 2960865=test_cipher I, [2024-05-15T13:54:11.958658 #2919491] INFO -- : [506/885] 2960865=test_new I, [2024-05-15T13:54:11.964775 #2919491] INFO -- : [507/885] 2960865=test_shellwords I, [2024-05-15T13:54:11.968720 #2919491] INFO -- : [508/885] 2960865=pattern_test I, [2024-05-15T13:54:11.973672 #2919491] INFO -- : [509/885] 2960851=test_memory_view I, [2024-05-15T13:54:11.991921 #2919491] INFO -- : [510/885] 2960851=test_debug I, [2024-05-15T13:54:11.996809 #2919491] INFO -- : [511/885] 2960851=test_omap I, [2024-05-15T13:54:12.006643 #2919491] INFO -- : [512/885] 2960851=test_iterator I, [2024-05-15T13:54:12.017830 #2919491] INFO -- : [513/885] 2960866=test_string I, [2024-05-15T13:54:12.020297 #2919491] INFO -- : [514/885] 2960866=test_digest_extend I, [2024-05-15T13:54:12.036386 #2919491] INFO -- : [515/885] 2960866=test_evaluation I, [2024-05-15T13:54:12.048215 #2919491] INFO -- : [516/885] 2960866=test_gem_ext_builder I, [2024-05-15T13:54:12.070462 #2919491] INFO -- : [517/885] 2960865=test_https I, [2024-05-15T13:54:12.081305 #2919491] INFO -- : [518/885] 2960851=test_load I, [2024-05-15T13:54:12.081896 #2919491] INFO -- : [519/885] 2960851=test_yamldbm I, [2024-05-15T13:54:12.092714 #2919491] INFO -- : [520/885] 2960851=test_gem_commands_rebuild_command I, [2024-05-15T13:54:12.132334 #2919491] INFO -- : [521/885] 2960852=test_rdoc_parser_simple I, [2024-05-15T13:54:12.147754 #2919491] INFO -- : [522/885] 2960851=test_provider I, [2024-05-15T13:54:12.149789 #2919491] INFO -- : [523/885] 2960864=test_abi I, [2024-05-15T13:54:12.186495 #2919491] INFO -- : [524/885] 2960852=test_array I, [2024-05-15T13:54:12.304507 #2919491] INFO -- : [525/885] 2960864=test_helper_method I, [2024-05-15T13:54:12.402222 #2919491] INFO -- : [526/885] 2960867=test_gem_package_tar_writer I, [2024-05-15T13:54:12.407937 #2919491] INFO -- : [527/885] 2960856=test_gem_commands_outdated_command I, [2024-05-15T13:54:12.413574 #2919491] INFO -- : [528/885] 2960865=test_scalar_scanner I, [2024-05-15T13:54:12.430437 #2919491] INFO -- : [529/885] 2960865=test_gem_source I, [2024-05-15T13:54:12.445451 #2919491] INFO -- : [530/885] 2960864=test_nesting_parser I, [2024-05-15T13:54:12.454458 #2919491] INFO -- : [531/885] 2960856=test_win32ole_method_event I, [2024-05-15T13:54:12.461390 #2919491] INFO -- : [532/885] 2960864=test_benchmark I, [2024-05-15T13:54:12.463064 #2919491] INFO -- : [533/885] 2960856=test_gem_dependency_list I, [2024-05-15T13:54:12.506708 #2919491] INFO -- : [534/885] 2960851=test_spell_checker I, [2024-05-15T13:54:12.515442 #2919491] INFO -- : [535/885] 2960867=attribute_write_test I, [2024-05-15T13:54:12.518613 #2919491] INFO -- : [536/885] 2960851=test_propertyputref I, [2024-05-15T13:54:12.522439 #2919491] INFO -- : [537/885] 2960851=test_assembler I, [2024-05-15T13:54:12.523114 #2919491] INFO -- : [538/885] 2960856=test_rational2 I, [2024-05-15T13:54:12.526318 #2919491] INFO -- : [539/885] 2960851=test_rational I, [2024-05-15T13:54:12.532044 #2919491] INFO -- : [540/885] 2960856=test_gem_commands_cert_command I, [2024-05-15T13:54:12.545042 #2919491] INFO -- : [541/885] 2960851=test_completion I, [2024-05-15T13:54:12.590291 #2919491] INFO -- : [542/885] 2960867=test_yield_block I, [2024-05-15T13:54:12.594963 #2919491] INFO -- : [543/885] 2960867=test_len I, [2024-05-15T13:54:12.597149 #2919491] INFO -- : [544/885] 2960867=test_gem_source_installed I, [2024-05-15T13:54:12.601610 #2919491] INFO -- : [545/885] 2960865=test_erb I, [2024-05-15T13:54:12.604163 #2919491] INFO -- : [546/885] 2960867=test_x509ext I, [2024-05-15T13:54:12.621043 #2919491] INFO -- : [547/885] 2960867=test_parser I, [2024-05-15T13:54:12.637717 #2919491] INFO -- : [548/885] 2960865=test_method_name_check I, [2024-05-15T13:54:12.654921 #2919491] INFO -- : [549/885] 2960865=test_arith_seq_extract I, [2024-05-15T13:54:12.663125 #2919491] INFO -- : [550/885] 2960867=test_gem_request_set I, [2024-05-15T13:54:12.805591 #2919491] INFO -- : [551/885] 2960865=test_module I, [2024-05-15T13:54:12.815807 #2919491] INFO -- : [552/885] 2960859=test_ssl I, [2024-05-15T13:54:12.931220 #2919491] INFO -- : [553/885] 2960867=test_gem_ext_cargo_builder I, [2024-05-15T13:54:12.946279 #2919491] INFO -- : [554/885] 2960867=constant_path_node_test I, [2024-05-15T13:54:12.952370 #2919491] INFO -- : [555/885] 2960867=test_stringify_symbols I, [2024-05-15T13:54:12.963167 #2919491] INFO -- : [556/885] 2960867=integer_parse_test I, [2024-05-15T13:54:12.965883 #2919491] INFO -- : [557/885] 2960867=test_instrumentation_api I, [2024-05-15T13:54:13.092756 #2919491] INFO -- : [558/885] 2960855=test_boolean I, [2024-05-15T13:54:13.097329 #2919491] INFO -- : [559/885] 2960855=test_rdoc_generator_markup I, [2024-05-15T13:54:13.101710 #2919491] INFO -- : [560/885] 2960851=test_whileuntil I, [2024-05-15T13:54:13.104094 #2919491] INFO -- : [561/885] 2960855=test_monitor I, [2024-05-15T13:54:13.106210 #2919491] INFO -- : [562/885] 2960851=test_buffered_io I, [2024-05-15T13:54:13.106971 #2919491] INFO -- : [563/885] 2960866=test_rubyvm I, [2024-05-15T13:54:13.111521 #2919491] INFO -- : [564/885] 2960851=test_configuration I, [2024-05-15T13:54:13.116498 #2919491] INFO -- : [565/885] 2960866=test_tree_spell_checker I, [2024-05-15T13:54:13.131722 #2919491] INFO -- : [566/885] 2960866=test_http I, [2024-05-15T13:54:13.198209 #2919491] INFO -- : [567/885] 2960851=test_addrinfo I, [2024-05-15T13:54:13.220090 #2919491] INFO -- : [568/885] 2960851=test_win32ole_param_event I, [2024-05-15T13:54:13.223632 #2919491] INFO -- : [569/885] 2960851=test_bn I, [2024-05-15T13:54:13.234092 #2919491] INFO -- : [570/885] 2960851=redundant_return_test I, [2024-05-15T13:54:13.241345 #2919491] INFO -- : [571/885] 2960851=test_case_mapping I, [2024-05-15T13:54:13.255954 #2919491] INFO -- : [572/885] 2960851=test_path I, [2024-05-15T13:54:13.267051 #2919491] INFO -- : [573/885] 2960851=test_terminfo I, [2024-05-15T13:54:13.285011 #2919491] INFO -- : [574/885] 2960851=test_compile_prism I, [2024-05-15T13:54:13.315566 #2919491] INFO -- : [575/885] 2960855=test_bug-14834 I, [2024-05-15T13:54:13.384095 #2919491] INFO -- : [576/885] 2960853=test_rdoc_markup_to_html I, [2024-05-15T13:54:13.384288 #2919491] INFO -- : [577/885] 2960855=test_date_compat I, [2024-05-15T13:54:13.392435 #2919491] INFO -- : [578/885] 2960855=test_gem_resolver_vendor_specification I, [2024-05-15T13:54:13.414199 #2919491] INFO -- : [579/885] 2960855=test_gem_commands_update_command I, [2024-05-15T13:54:13.505943 #2919491] INFO -- : [580/885] 2960869=test_notimplement I, [2024-05-15T13:54:13.511423 #2919491] INFO -- : [581/885] 2960869=test_random I, [2024-05-15T13:54:13.521604 #2919491] INFO -- : [582/885] 2960869=test_gem_uri I, [2024-05-15T13:54:13.542044 #2919491] INFO -- : [583/885] 2960856=test_key_event_record I, [2024-05-15T13:54:13.543821 #2919491] INFO -- : [584/885] 2960856=test_ssl_session I, [2024-05-15T13:54:13.550361 #2919491] INFO -- : [585/885] 2960869=test_lexer I, [2024-05-15T13:54:13.565041 #2919491] INFO -- : [586/885] 2960869=test_thread_cv I, [2024-05-15T13:54:13.577563 #2919491] INFO -- : [587/885] 2960851=test_rdoc_generator_pot I, [2024-05-15T13:54:13.584150 #2919491] INFO -- : [588/885] 2960851=test_unicode I, [2024-05-15T13:54:13.599559 #2919491] INFO -- : [589/885] 2960851=test_enumerator I, [2024-05-15T13:54:13.607859 #2919491] INFO -- : [590/885] 2960851=test_rdoc_parser_changelog I, [2024-05-15T13:54:13.648667 #2919491] INFO -- : [591/885] 2960853=parameters_signature_test I, [2024-05-15T13:54:13.676444 #2919491] INFO -- : [592/885] 2960851=test_koi8 I, [2024-05-15T13:54:13.684923 #2919491] INFO -- : [593/885] 2960851=test_rdoc_method_attr I, [2024-05-15T13:54:13.702200 #2919491] INFO -- : [594/885] 2960853=test_data I, [2024-05-15T13:54:13.704551 #2919491] INFO -- : [595/885] 2960864=static_literals_test I, [2024-05-15T13:54:13.705392 #2919491] INFO -- : [596/885] 2960853=test_filter I, [2024-05-15T13:54:13.742888 #2919491] INFO -- : [597/885] 2960853=test_gem_gem_runner I, [2024-05-15T13:54:13.776181 #2919491] INFO -- : [598/885] 2960864=test_rdoc_i18n_locale I, [2024-05-15T13:54:13.783552 #2919491] INFO -- : [599/885] 2960864=test_chilled I, [2024-05-15T13:54:13.789046 #2919491] INFO -- : [600/885] 2960864=test_name_error_extension I, [2024-05-15T13:54:13.798633 #2919491] INFO -- : [601/885] 2960864=test_acceptable I, [2024-05-15T13:54:13.833508 #2919491] INFO -- : [602/885] 2960851=test_euc_jp I, [2024-05-15T13:54:13.840351 #2919491] INFO -- : [603/885] 2960851=test_rdoc_generator_pot_po_entry I, [2024-05-15T13:54:13.842112 #2919491] INFO -- : [604/885] 2960868=test_document I, [2024-05-15T13:54:13.846446 #2919491] INFO -- : [605/885] 2960851=test_pair I, [2024-05-15T13:54:13.849049 #2919491] INFO -- : [606/885] 2960868=test_win32ole_param I, [2024-05-15T13:54:13.851086 #2919491] INFO -- : [607/885] 2960868=test_gem_commands_yank_command I, [2024-05-15T13:54:13.914864 #2919491] INFO -- : [608/885] 2960864=test_rbconfig I, [2024-05-15T13:54:13.918458 #2919491] INFO -- : [609/885] 2960864=test_primitive I, [2024-05-15T13:54:13.923879 #2919491] INFO -- : [610/885] 2960864=test_human_typo I, [2024-05-15T13:54:13.927056 #2919491] INFO -- : [611/885] 2960864=test_key_stroke I, [2024-05-15T13:54:13.933369 #2919491] INFO -- : [612/885] 2960864=json_encoding_test I, [2024-05-15T13:54:13.947097 #2919491] INFO -- : [613/885] 2960864=test_color I, [2024-05-15T13:54:13.967977 #2919491] INFO -- : [614/885] 2960853=test_sockopt I, [2024-05-15T13:54:13.972282 #2919491] INFO -- : [615/885] 2960853=test_rdoc_markup_to_label I, [2024-05-15T13:54:13.987849 #2919491] INFO -- : [616/885] 2960864=test_install I, [2024-05-15T13:54:14.000947 #2919491] INFO -- : [617/885] 2960862=test_rdoc_ri_driver I, [2024-05-15T13:54:14.011498 #2919491] INFO -- : [618/885] 2960853=test_httpheader I, [2024-05-15T13:54:14.078632 #2919491] INFO -- : [619/885] 2960853=test_gem_resolver_local_specification I, [2024-05-15T13:54:14.130248 #2919491] INFO -- : [620/885] 2960853=test_set_len I, [2024-05-15T13:54:14.136910 #2919491] INFO -- : [621/885] 2960853=test_httpresponses I, [2024-05-15T13:54:14.138835 #2919491] INFO -- : [622/885] 2960853=test_encoding I, [2024-05-15T13:54:14.146645 #2919491] INFO -- : [623/885] 2960864=test_pinned I, [2024-05-15T13:54:14.156969 #2919491] INFO -- : [624/885] 2960853=test_rdoc_markup_pre_process I, [2024-05-15T13:54:14.196437 #2919491] INFO -- : [625/885] 2960864=test_printf I, [2024-05-15T13:54:14.202461 #2919491] INFO -- : [626/885] 2960869=test_stream I, [2024-05-15T13:54:14.205542 #2919491] INFO -- : [627/885] 2960860=test_to_ary_concat I, [2024-05-15T13:54:14.210305 #2919491] INFO -- : [628/885] 2960869=test_time I, [2024-05-15T13:54:14.213073 #2919491] INFO -- : [629/885] 2960864=test_webauthn_listener_response I, [2024-05-15T13:54:14.225027 #2919491] INFO -- : [630/885] 2960854=test_beginendblock I, [2024-05-15T13:54:14.233420 #2919491] INFO -- : [631/885] 2960864=test_files_lib I, [2024-05-15T13:54:14.236674 #2919491] INFO -- : [632/885] 2960862=test_gem_commands_unpack_command I, [2024-05-15T13:54:14.254678 #2919491] INFO -- : [633/885] 2960853=test_help I, [2024-05-15T13:54:14.258165 #2919491] INFO -- : [634/885] 2960857=test_rdoc_markup_to_bs I, [2024-05-15T13:54:14.264864 #2919491] INFO -- : [635/885] 2960853=test_within_pipe I, [2024-05-15T13:54:14.281795 #2919491] INFO -- : [636/885] 2960853=test_emoji_breaks I, [2024-05-15T13:54:14.286405 #2919491] INFO -- : [637/885] 2960853=test_gem_bundler_version_finder I, [2024-05-15T13:54:14.306028 #2919491] INFO -- : [638/885] 2960853=reflection_test I, [2024-05-15T13:54:14.314243 #2919491] INFO -- : [639/885] 2960857=test_open3 I, [2024-05-15T13:54:14.314918 #2919491] INFO -- : [640/885] 2960868=test_multi_irb_commands I, [2024-05-15T13:54:14.321054 #2919491] INFO -- : [641/885] 2960853=test_fiber I, [2024-05-15T13:54:14.323090 #2919491] INFO -- : [642/885] 2960868=test_closure I, [2024-05-15T13:54:14.393288 #2919491] INFO -- : [643/885] 2960869=test_bundled_ca I, [2024-05-15T13:54:14.398593 #2919491] INFO -- : [644/885] 2960863=test_digest I, [2024-05-15T13:54:14.403740 #2919491] INFO -- : [645/885] 2960863=test_rdoc_servlet I, [2024-05-15T13:54:14.486435 #2919491] INFO -- : [646/885] 2960856=test_gem_security I, [2024-05-15T13:54:14.528510 #2919491] INFO -- : [647/885] 2960863=test_ractor I, [2024-05-15T13:54:14.573227 #2919491] INFO -- : [648/885] 2960863=test_recursion I, [2024-05-15T13:54:14.574331 #2919491] INFO -- : [649/885] 2960863=test_exit I, [2024-05-15T13:54:14.589155 #2919491] INFO -- : [650/885] 2960855=test_popen_deadlock I, [2024-05-15T13:54:14.621974 #2919491] INFO -- : [651/885] 2960854=test_delegate I, [2024-05-15T13:54:14.634958 #2919491] INFO -- : [652/885] 2960854=test_mkmf I, [2024-05-15T13:54:14.637496 #2919491] INFO -- : [653/885] 2960863=test_date_marshal I, [2024-05-15T13:54:14.641957 #2919491] INFO -- : [654/885] 2960863=test_history I, [2024-05-15T13:54:14.648618 #2919491] INFO -- : [655/885] 2960868=test_option I, [2024-05-15T13:54:14.653817 #2919491] INFO -- : [656/885] 2960863=test_append I, [2024-05-15T13:54:14.657177 #2919491] INFO -- : [657/885] 2960863=test_tracer I, [2024-05-15T13:54:14.660862 #2919491] INFO -- : [658/885] 2960862=test_cmethod I, [2024-05-15T13:54:14.661615 #2919491] INFO -- : [659/885] 2960863=test_did_you_mean I, [2024-05-15T13:54:14.663454 #2919491] INFO -- : [660/885] 2960862=test_io_m17n I, [2024-05-15T13:54:14.671991 #2919491] INFO -- : [661/885] 2960854=test_variable_name_check I, [2024-05-15T13:54:14.713253 #2919491] INFO -- : [662/885] 2960863=test_gem_commands_server_command I, [2024-05-15T13:54:14.719363 #2919491] INFO -- : [663/885] 2960854=test_case_comprehensive I, [2024-05-15T13:54:14.724130 #2919491] INFO -- : [664/885] 2960863=test_interned_str I, [2024-05-15T13:54:14.734867 #2919491] INFO -- : [665/885] 2960863=test_gem_commands_build_command I, [2024-05-15T13:54:14.769970 #2919491] INFO -- : [666/885] 2960868=test_scheduler I, [2024-05-15T13:54:14.915364 #2919491] INFO -- : [667/885] 2960868=test_ocsp I, [2024-05-15T13:54:14.957342 #2919491] INFO -- : [668/885] 2960863=test_class I, [2024-05-15T13:54:14.960283 #2919491] INFO -- : [669/885] 2960863=test_pkey_dsa I, [2024-05-15T13:54:14.979035 #2919491] INFO -- : [670/885] 2960865=test_exception_at_throwing I, [2024-05-15T13:54:14.999085 #2919491] INFO -- : [671/885] 2960858=test_iseq I, [2024-05-15T13:54:15.035130 #2919491] INFO -- : [672/885] 2960865=test_rdoc_markup_heading I, [2024-05-15T13:54:15.046374 #2919491] INFO -- : [673/885] 2960865=test_eval I, [2024-05-15T13:54:15.209153 #2919491] INFO -- : [674/885] 2960855=json_generator_test I, [2024-05-15T13:54:15.211923 #2919491] INFO -- : [675/885] 2960868=test_transcode I, [2024-05-15T13:54:15.290706 #2919491] INFO -- : [676/885] 2960855=test_gem_safe_marshal I, [2024-05-15T13:54:15.290772 #2919491] INFO -- : [677/885] 2960860=test_gem_resolver_api_set I, [2024-05-15T13:54:15.296525 #2919491] INFO -- : [678/885] 2960865=test_gem_resolver_vendor_set I, [2024-05-15T13:54:15.321866 #2919491] INFO -- : [679/885] 2960865=test_config I, [2024-05-15T13:54:15.348836 #2919491] INFO -- : [680/885] 2960860=test_enumerable I, [2024-05-15T13:54:15.351140 #2919491] INFO -- : [681/885] 2960860=test_webauthn_listener I, [2024-05-15T13:54:15.402252 #2919491] INFO -- : [682/885] 2960860=test_ast I, [2024-05-15T13:54:15.406194 #2919491] INFO -- : [683/885] 2960868=test_gem_request_set_gem_dependency_api I, [2024-05-15T13:54:15.559541 #2919491] INFO -- : [684/885] 2960858=test_lambda I, [2024-05-15T13:54:15.624841 #2919491] INFO -- : [685/885] 2960868=test_jaro_winkler I, [2024-05-15T13:54:15.633207 #2919491] INFO -- : [686/885] 2960868=test_random_formatter I, [2024-05-15T13:54:15.636015 #2919491] INFO -- : [687/885] 2960858=test_helper I, [2024-05-15T13:54:15.636678 #2919491] INFO -- : [688/885] 2960858=test_fips I, [2024-05-15T13:54:15.653800 #2919491] INFO -- : [689/885] 2960868=test_x509name I, [2024-05-15T13:54:15.661876 #2919491] INFO -- : [690/885] 2960868=test_update I, [2024-05-15T13:54:15.665431 #2919491] INFO -- : [691/885] 2960868=test_rdoc_code_object I, [2024-05-15T13:54:15.718411 #2919491] INFO -- : [692/885] 2960865=test_x509store I, [2024-05-15T13:54:15.742206 #2919491] INFO -- : [693/885] 2960855=static_inspect_test I, [2024-05-15T13:54:15.771871 #2919491] INFO -- : [694/885] 2960855=test_force_exit I, [2024-05-15T13:54:15.774260 #2919491] INFO -- : [695/885] 2960855=test_file I, [2024-05-15T13:54:15.892432 #2919491] INFO -- : [696/885] 2960862=unescape_test I, [2024-05-15T13:54:15.901166 #2919491] INFO -- : [697/885] 2960868=test_ostruct I, [2024-05-15T13:54:15.932144 #2919491] INFO -- : [698/885] 2960867=test_data_error I, [2024-05-15T13:54:15.947219 #2919491] INFO -- : [699/885] 2960858=bom_test I, [2024-05-15T13:54:15.984071 #2919491] INFO -- : [700/885] 2960865=test_udp I, [2024-05-15T13:54:15.989377 #2919491] INFO -- : [701/885] 2960858=test_vm_dump I, [2024-05-15T13:54:15.989441 #2919491] INFO -- : [702/885] 2960858=test_rdoc_markup_document I, [2024-05-15T13:54:16.003719 #2919491] INFO -- : [703/885] 2960865=test_integer_comb I, [2024-05-15T13:54:16.003788 #2919491] INFO -- : [704/885] 2960867=test_tmpdir I, [2024-05-15T13:54:16.005195 #2919491] INFO -- : [705/885] 2960858=test_gem_commands_check_command I, [2024-05-15T13:54:16.020740 #2919491] INFO -- : [706/885] 2960858=test_regexp I, [2024-05-15T13:54:16.075648 #2919491] INFO -- : [707/885] 2960868=errors_test I, [2024-05-15T13:54:16.091946 #2919491] INFO -- : [708/885] 2960867=test_ts I, [2024-05-15T13:54:16.141114 #2919491] INFO -- : [709/885] 2960869=library_symbols_test I, [2024-05-15T13:54:16.142379 #2919491] INFO -- : [710/885] 2960869=test_locale I, [2024-05-15T13:54:16.181308 #2919491] INFO -- : [711/885] 2960868=test_addr I, [2024-05-15T13:54:16.196131 #2919491] INFO -- : [712/885] 2960868=test_ensured I, [2024-05-15T13:54:16.249921 #2919491] INFO -- : [713/885] 2960868=test_rdoc_ri_paths I, [2024-05-15T13:54:16.266243 #2919491] INFO -- : [714/885] 2960869=test_constant I, [2024-05-15T13:54:16.276506 #2919491] INFO -- : [715/885] 2960868=test_pty I, [2024-05-15T13:54:16.470643 #2919491] INFO -- : [716/885] 2960857=test_dup I, [2024-05-15T13:54:16.628874 #2919491] INFO -- : [717/885] 2960857=command_line_test I, [2024-05-15T13:54:16.639148 #2919491] INFO -- : [718/885] 2960867=test_project_sanity I, [2024-05-15T13:54:16.676782 #2919491] INFO -- : [719/885] 2960852=test_range I, [2024-05-15T13:54:16.698668 #2919491] INFO -- : [720/885] 2960857=test_gem_uri_formatter I, [2024-05-15T13:54:16.704415 #2919491] INFO -- : [721/885] 2960867=test_encoding I, [2024-05-15T13:54:16.704472 #2919491] INFO -- : [722/885] 2960857=test_erb_command I, [2024-05-15T13:54:16.735581 #2919491] INFO -- : [723/885] 2960857=test_helper I, [2024-05-15T13:54:16.737414 #2919491] INFO -- : [724/885] 2960857=test_arithmetic_sequence I, [2024-05-15T13:54:16.744771 #2919491] INFO -- : [725/885] 2960868=test_key_actor_emacs I, [2024-05-15T13:54:16.747348 #2919491] INFO -- : [726/885] 2960862=test_gem_command_manager I, [2024-05-15T13:54:16.756039 #2919491] INFO -- : [727/885] 2960857=test_gem_gemcutter_utilities I, [2024-05-15T13:54:16.758173 #2919491] INFO -- : [728/885] 2960863=test_basicinstructions I, [2024-05-15T13:54:16.840119 #2919491] INFO -- : [729/885] 2960863=version_test I, [2024-05-15T13:54:16.843347 #2919491] INFO -- : [730/885] 2960862=test_cgi_header I, [2024-05-15T13:54:16.847034 #2919491] INFO -- : [731/885] 2960863=heredoc_dedent_test I, [2024-05-15T13:54:16.850010 #2919491] INFO -- : [732/885] 2960863=test_object I, [2024-05-15T13:54:16.850736 #2919491] INFO -- : [733/885] 2960862=test_rdoc_rd_block_parser I, [2024-05-15T13:54:16.853936 #2919491] INFO -- : [734/885] 2960863=test_tsort I, [2024-05-15T13:54:16.858508 #2919491] INFO -- : [735/885] 2960863=test_signedness I, [2024-05-15T13:54:16.881066 #2919491] INFO -- : [736/885] 2960862=test_type I, [2024-05-15T13:54:16.884045 #2919491] INFO -- : [737/885] 2960868=test_ractor I, [2024-05-15T13:54:16.887015 #2919491] INFO -- : [738/885] 2960862=test_pointer I, [2024-05-15T13:54:16.915204 #2919491] INFO -- : [739/885] 2960867=test_big5 I, [2024-05-15T13:54:16.922323 #2919491] INFO -- : [740/885] 2960867=test_func I, [2024-05-15T13:54:16.937717 #2919491] INFO -- : [741/885] 2960868=test_gem_local_remote_options I, [2024-05-15T13:54:16.980407 #2919491] INFO -- : [742/885] 2960868=test_date_arith I, [2024-05-15T13:54:16.988063 #2919491] INFO -- : [743/885] 2960868=test_ruby_lex I, [2024-05-15T13:54:17.119468 #2919491] INFO -- : [744/885] 2960857=test_object I, [2024-05-15T13:54:17.121477 #2919491] INFO -- : [745/885] 2960864=test_sleep I, [2024-05-15T13:54:17.161893 #2919491] INFO -- : [746/885] 2960851=compiler_test I, [2024-05-15T13:54:17.180961 #2919491] INFO -- : [747/885] 2960851=test_flip I, [2024-05-15T13:54:17.186175 #2919491] INFO -- : [748/885] 2960868=test_change_word I, [2024-05-15T13:54:17.192817 #2919491] INFO -- : [749/885] 2960868=test_normalize I, [2024-05-15T13:54:17.201253 #2919491] INFO -- : [750/885] 2960868=test_ossl I, [2024-05-15T13:54:17.202968 #2919491] INFO -- : [751/885] 2960851=test_timeout I, [2024-05-15T13:54:17.205939 #2919491] INFO -- : [752/885] 2960852=test_continuation I, [2024-05-15T13:54:17.208740 #2919491] INFO -- : [753/885] 2960851=test_fd_setsize I, [2024-05-15T13:54:17.209211 #2919491] INFO -- : [754/885] 2960851=test_class_name_check I, [2024-05-15T13:54:17.212699 #2919491] INFO -- : [755/885] 2960852=test_keyword I, [2024-05-15T13:54:17.258115 #2919491] INFO -- : [756/885] 2960862=test_delete I, [2024-05-15T13:54:17.263190 #2919491] INFO -- : [757/885] 2960862=test_win32ole_method I, [2024-05-15T13:54:17.265329 #2919491] INFO -- : [758/885] 2960862=test_rdoc_markup_hard_break I, [2024-05-15T13:54:17.265892 #2919491] INFO -- : [759/885] 2960862=test_date_strptime I, [2024-05-15T13:54:17.269392 #2919491] INFO -- : [760/885] 2960851=test_gem_package_task I, [2024-05-15T13:54:17.270065 #2919491] INFO -- : [761/885] 2960851=test_placearg I, [2024-05-15T13:54:17.329447 #2919491] INFO -- : [762/885] 2960862=test_gem_platform I, [2024-05-15T13:54:17.374061 #2919491] INFO -- : [763/885] 2960862=test_pkey_rsa I, [2024-05-15T13:54:17.404495 #2919491] INFO -- : [764/885] 2960851=test_numhash I, [2024-05-15T13:54:17.412807 #2919491] INFO -- : [765/885] 2960851=test_weakkeymap I, [2024-05-15T13:54:17.554316 #2919491] INFO -- : [766/885] 2960862=test_gem_commands_push_command I, [2024-05-15T13:54:17.557746 #2919491] INFO -- : [767/885] 2960857=test_rdoc_parser_markdown I, [2024-05-15T13:54:17.570543 #2919491] INFO -- : [768/885] 2960857=test_import I, [2024-05-15T13:54:17.577259 #2919491] INFO -- : [769/885] 2960852=test_gem_resolver_lock_set I, [2024-05-15T13:54:17.587354 #2919491] INFO -- : [770/885] 2960852=test_not I, [2024-05-15T13:54:17.597422 #2919491] INFO -- : [771/885] 2960852=test_logger I, [2024-05-15T13:54:17.612009 #2919491] INFO -- : [772/885] 2960852=test_gem_update_suggestion I, [2024-05-15T13:54:17.657052 #2919491] INFO -- : [773/885] 2960852=test_files_test I, [2024-05-15T13:54:17.658440 #2919491] INFO -- : [774/885] 2960852=test_file_exhaustive I, [2024-05-15T13:54:17.707379 #2919491] INFO -- : [775/885] 2960865=test_rdoc_comment I, [2024-05-15T13:54:17.744695 #2919491] INFO -- : [776/885] 2960865=test_resize I, [2024-05-15T13:54:17.753935 #2919491] INFO -- : [777/885] 2960865=test_error_highlight I, [2024-05-15T13:54:17.816703 #2919491] INFO -- : [778/885] 2960851=test_rdoc_generator_darkfish I, [2024-05-15T13:54:17.964368 #2919491] INFO -- : [779/885] 2960862=test_http_request I, [2024-05-15T13:54:18.003508 #2919491] INFO -- : [780/885] 2960862=test_gem_source_fetch_problem I, [2024-05-15T13:54:18.012395 #2919491] INFO -- : [781/885] 2960862=json_generic_object_test I, [2024-05-15T13:54:18.019951 #2919491] INFO -- : [782/885] 2960862=location_test I, [2024-05-15T13:54:18.053821 #2919491] INFO -- : [783/885] 2960862=test_symbol I, [2024-05-15T13:54:18.062266 #2919491] INFO -- : [784/885] 2960862=test_coderange I, [2024-05-15T13:54:18.066493 #2919491] INFO -- : [785/885] 2960862=test_mailto I, [2024-05-15T13:54:18.075114 #2919491] INFO -- : [786/885] 2960862=test_dir I, [2024-05-15T13:54:18.091578 #2919491] INFO -- : [787/885] 2960865=format_errors_test I, [2024-05-15T13:54:18.101193 #2919491] INFO -- : [788/885] 2960865=test_date_ractor I, [2024-05-15T13:54:18.133186 #2919491] INFO -- : [789/885] 2960869=test_gem_console_ui I, [2024-05-15T13:54:18.137357 #2919491] INFO -- : [790/885] 2960869=test_autoconf I, [2024-05-15T13:54:18.140221 #2919491] INFO -- : [791/885] 2960869=test_eval I, [2024-05-15T13:54:18.144667 #2919491] INFO -- : [792/885] 2960869=test_ractor_compatibility I, [2024-05-15T13:54:18.173981 #2919491] INFO -- : [793/885] 2960851=test_member I, [2024-05-15T13:54:18.185790 #2919491] INFO -- : [794/885] 2960851=test_numeric I, [2024-05-15T13:54:18.190030 #2919491] INFO -- : [795/885] 2960851=test_cgi_multipart I, [2024-05-15T13:54:18.288646 #2919491] INFO -- : [796/885] 2960865=test_word I, [2024-05-15T13:54:18.289811 #2919491] INFO -- : [797/885] 2960865=test_gem_commands_cleanup_command I, [2024-05-15T13:54:18.303316 #2919491] INFO -- : [798/885] 2960862=test_find_executable I, [2024-05-15T13:54:18.334473 #2919491] INFO -- : [799/885] 2960862=ruby_api_test I, [2024-05-15T13:54:18.358812 #2919491] INFO -- : [800/885] 2960851=test_gem_commands_pristine_command I, [2024-05-15T13:54:18.508069 #2919491] INFO -- : [801/885] 2960862=test_context I, [2024-05-15T13:54:18.559018 #2919491] INFO -- : [802/885] 2960869=test_nofree I, [2024-05-15T13:54:18.562495 #2919491] INFO -- : [803/885] 2960869=test_coder I, [2024-05-15T13:54:18.564677 #2919491] INFO -- : [804/885] 2960857=test_symbol I, [2024-05-15T13:54:18.570013 #2919491] INFO -- : [805/885] 2960869=test_unix I, [2024-05-15T13:54:18.606524 #2919491] INFO -- : [806/885] 2960869=test_enc_associate I, [2024-05-15T13:54:18.656689 #2919491] INFO -- : [807/885] 2960862=test_lazy_enumerator I, [2024-05-15T13:54:18.674222 #2919491] INFO -- : [808/885] 2960865=test_pkcs7 I, [2024-05-15T13:54:18.733141 #2919491] INFO -- : [809/885] 2960867=test_arith_seq_beg_len_step I, [2024-05-15T13:54:18.775741 #2919491] INFO -- : [810/885] 2960867=test_gem_resolver_requirement_list I, [2024-05-15T13:54:18.778264 #2919491] INFO -- : [811/885] 2960867=test_function_entry I, [2024-05-15T13:54:18.778562 #2919491] INFO -- : [812/885] 2960867=test_complex2 I, [2024-05-15T13:54:18.786414 #2919491] INFO -- : [813/885] 2960867=test_resolve_symbol I, [2024-05-15T13:54:18.808429 #2919491] INFO -- : [814/885] 2960865=test_gem_package I, [2024-05-15T13:54:18.829593 #2919491] INFO -- : [815/885] 2960867=test_have_macro I, [2024-05-15T13:54:19.139865 #2919491] INFO -- : [816/885] 2960862=test_gem_specification I, [2024-05-15T13:54:19.161665 #2919491] INFO -- : [817/885] 2960869=test_enum I, [2024-05-15T13:54:19.230894 #2919491] INFO -- : [818/885] 2960863=test_threadgroup I, [2024-05-15T13:54:19.256622 #2919491] INFO -- : [819/885] 2960867=test_bignum I, [2024-05-15T13:54:19.399548 #2919491] INFO -- : [820/885] 2960867=test_rdoc_class_module I, [2024-05-15T13:54:19.409095 #2919491] INFO -- : [821/885] 2960865=test_gem_ci_detector I, [2024-05-15T13:54:19.421033 #2919491] INFO -- : [822/885] 2960865=test_arity I, [2024-05-15T13:54:19.428755 #2919491] INFO -- : [823/885] 2960851=test_stringio I, [2024-05-15T13:54:19.434366 #2919491] INFO -- : [824/885] 2960865=test_io_wait_uncommon I, [2024-05-15T13:54:19.437522 #2919491] INFO -- : [825/885] 2960865=test_win32ole_variable I, [2024-05-15T13:54:19.447131 #2919491] INFO -- : [826/885] 2960865=ractor_test I, [2024-05-15T13:54:19.515273 #2919491] INFO -- : [827/885] 2960851=test_trace I, [2024-05-15T13:54:19.526031 #2919491] INFO -- : [828/885] 2960851=test_time_tz I, [2024-05-15T13:54:19.530236 #2919491] INFO -- : [829/885] 2960865=test_win32ole_event I, [2024-05-15T13:54:19.532596 #2919491] INFO -- : [830/885] 2960865=test_rdoc_generator_json_index I, [2024-05-15T13:54:19.563069 #2919491] INFO -- : [831/885] 2960865=test_gem_resolver_api_specification I, [2024-05-15T13:54:19.606941 #2919491] INFO -- : [832/885] 2960865=test_win32ole_variant I, [2024-05-15T13:54:19.616245 #2919491] INFO -- : [833/885] 2960851=test_history I, [2024-05-15T13:54:19.616811 #2919491] INFO -- : [834/885] 2960865=test_mixed_unicode_escapes I, [2024-05-15T13:54:19.620717 #2919491] INFO -- : [835/885] 2960865=test_rdoc_markup_to_ansi I, [2024-05-15T13:54:19.626475 #2919491] INFO -- : [836/885] 2960851=test_ipaddr I, [2024-05-15T13:54:19.650180 #2919491] INFO -- : [837/885] 2960851=test_rdoc_extend I, [2024-05-15T13:54:19.663584 #2919491] INFO -- : [838/885] 2960865=test_merge_keys I, [2024-05-15T13:54:19.674356 #2919491] INFO -- : [839/885] 2960865=test_registry I, [2024-05-15T13:54:19.676008 #2919491] INFO -- : [840/885] 2960865=parse_stream_test I, [2024-05-15T13:54:19.681138 #2919491] INFO -- : [841/885] 2960851=test_gem I, [2024-05-15T13:54:19.686669 #2919491] INFO -- : [842/885] 2960865=test_gem_source_lock I, [2024-05-15T13:54:19.739997 #2919491] INFO -- : [843/885] 2960865=test_ractor I, [2024-05-15T13:54:19.747954 #2919491] INFO -- : [844/885] 2960861=test_gem_commands_open_command I, [2024-05-15T13:54:19.752097 #2919491] INFO -- : [845/885] 2960865=test_dns I, [2024-05-15T13:54:19.780153 #2919491] INFO -- : [846/885] 2960867=test_cgi_core I, [2024-05-15T13:54:19.799525 #2919491] INFO -- : [847/885] 2960867=test_parser I, [2024-05-15T13:54:19.812382 #2919491] INFO -- : [848/885] 2960867=test_timeout I, [2024-05-15T13:54:19.975434 #2919491] INFO -- : [849/885] 2960861=test_alias I, [2024-05-15T13:54:20.005782 #2919491] INFO -- : [850/885] 2960869=test_weakref I, [2024-05-15T13:54:20.114643 #2919491] INFO -- : [851/885] 2960861=test_nonblock I, [2024-05-15T13:54:20.124764 #2919491] INFO -- : [852/885] 2960861=test_marshal I, [2024-05-15T13:54:20.147127 #2919491] INFO -- : [853/885] 2960869=test_unicode_normalize I, [2024-05-15T13:54:20.222260 #2919491] INFO -- : [854/885] 2960865=test_reline_key I, [2024-05-15T13:54:20.227240 #2919491] INFO -- : [855/885] 2960865=test_rb_str_dup I, [2024-05-15T13:54:20.229642 #2919491] INFO -- : [856/885] 2960865=test_singleton_function I, [2024-05-15T13:54:20.231239 #2919491] INFO -- : [857/885] 2960865=test_ancdata I, [2024-05-15T13:54:20.234004 #2919491] INFO -- : [858/885] 2960863=test_ssl I, [2024-05-15T13:54:20.235325 #2919491] INFO -- : [859/885] 2960865=test_debugger_integration I, [2024-05-15T13:54:20.255015 #2919491] INFO -- : [860/885] 2960865=test_rendering I, [2024-05-15T13:54:20.262016 #2919491] INFO -- : [861/885] 2960865=test_my_integer I, [2024-05-15T13:54:20.267289 #2919491] INFO -- : [862/885] 2960865=test_thread I, [2024-05-15T13:54:20.267613 #2919491] INFO -- : [863/885] 2960853=json_ext_parser_test I, [2024-05-15T13:54:20.280061 #2919491] INFO -- : [864/885] 2960853=test_ractor I, [2024-05-15T13:54:20.376074 #2919491] INFO -- : [865/885] 2960861=test_have_func I, [2024-05-15T13:54:20.383561 #2919491] INFO -- : [866/885] 2960857=test_stat I, [2024-05-15T13:54:20.387877 #2919491] INFO -- : [867/885] 2960857=test_gem_request_set_lockfile_tokenizer I, [2024-05-15T13:54:20.450595 #2919491] INFO -- : [868/885] 2960857=test_capacity I, [2024-05-15T13:54:20.453453 #2919491] INFO -- : [869/885] 2960857=test_nextafter I, [2024-05-15T13:54:20.522894 #2919491] INFO -- : [870/885] 2960857=test_usrmarshal I, [2024-05-15T13:54:20.598358 #2919491] INFO -- : [871/885] 2960853=test_object_references I, [2024-05-15T13:54:20.605636 #2919491] INFO -- : [872/885] 2960853=test_gem_resolver_git_specification I, [2024-05-15T13:54:20.646662 #2919491] INFO -- : [873/885] 2960859=test_rubyoptions I, [2024-05-15T13:54:20.706589 #2919491] INFO -- : [874/885] 2960863=test_super I, [2024-05-15T13:54:20.761977 #2919491] INFO -- : [875/885] 2960857=test_integer I, [2024-05-15T13:54:20.820679 #2919491] INFO -- : [876/885] 2960867=test_cgi_modruby I, [2024-05-15T13:54:20.822808 #2919491] INFO -- : [877/885] 2960867=test_rubygems I, [2024-05-15T13:54:20.854077 #2919491] INFO -- : [878/885] 2960853=test_call I, [2024-05-15T13:54:20.937252 #2919491] INFO -- : [879/885] 2960867=test_https_proxy I, [2024-05-15T13:54:20.976910 #2919491] INFO -- : [880/885] 2960853=test_gem_commands_setup_command I, [2024-05-15T13:54:20.977468 #2919491] INFO -- : [881/885] 2960867=test_env I, [2024-05-15T13:54:21.050399 #2919491] INFO -- : [882/885] 2960870=test_rdoc_attr I, [2024-05-15T13:54:21.062019 #2919491] INFO -- : [883/885] 2960870=test_dryrun I, [2024-05-15T13:54:21.083972 #2919491] INFO -- : [884/885] 2960870=test_integer I, [2024-05-15T13:54:21.127456 #2919491] INFO -- : [885/885] 2960862=desugar_compiler_test I, [2024-05-15T13:54:38.291678 #2919491] INFO -- : Finished tests in 35.864815s, 735.9302 tests/s, 260748.9506 assertions/s. E, [2024-05-15T13:54:38.291815 #2919491] ERROR -- : Children under /tmp/rubytest.rwgx4h: E, [2024-05-15T13:54:38.291915 #2919491] ERROR -- : * drwx------ 4 80 2024-05-15 13:54:12 +0000 gem_rebuild20240515-2960851-g5bq9y/ E, [2024-05-15T13:54:38.291944 #2919491] ERROR -- : * drwxrwxr-x 2 60 2024-05-15 13:54:12 +0000 new/ E, [2024-05-15T13:54:38.291968 #2919491] ERROR -- : * -rw-rw-r-- 1 4096 2024-05-15 13:54:12 +0000 rebuild_test_gem-1.0.0.gem E, [2024-05-15T13:54:38.291993 #2919491] ERROR -- : * drwxrwxr-x 2 60 2024-05-15 13:54:12 +0000 old/ E, [2024-05-15T13:54:38.292011 #2919491] ERROR -- : * -rw-rw-r-- 1 4096 2024-05-15 13:54:12 +0000 rebuild_test_gem-1.0.0.gem I, [2024-05-15T13:54:38.293123 #2919491] INFO -- : 26394 tests, 9351713 assertions, 0 failures, 0 errors, 304 skips I, [2024-05-15T13:54:38.293141 #2919491] INFO -- : I, [2024-05-15T13:54:38.293148 #2919491] INFO -- : ruby -v: ruby 3.4.0dev (2024-05-15T09:11:55Z master e73f6618d5) [x86_64-linux] I, [2024-05-15T13:54:38.295096 #2919491] INFO -- : $$$[end] "make yes-test-all TESTOPTS='--stderr-on-failure' TESTS='-j20'" exit with 0. I, [2024-05-15T13:54:38.295232 #2919491] INFO -- : $$$[beg] make yes-test-rubyspec MSPECOPT='--error-output stderr --debug -j' TESTS='-j20' I, [2024-05-15T13:54:38.382587 #2919491] INFO -- : BASERUBY = /usr/bin/ruby --disable=gems I, [2024-05-15T13:54:38.382625 #2919491] INFO -- : CC = gcc I, [2024-05-15T13:54:38.382631 #2919491] INFO -- : LD = ld I, [2024-05-15T13:54:38.382636 #2919491] INFO -- : LDSHARED = gcc -shared I, [2024-05-15T13:54:38.382641 #2919491] INFO -- : CFLAGS = -O3 -fno-fast-math -ggdb3 -Wall -Wextra -Wdeprecated-declarations -Wdiv-by-zero -Wduplicated-cond -Wimplicit-function-declaration -Wimplicit-int -Wpointer-arith -Wwrite-strings -Wold-style-definition -Wimplicit-fallthrough=0 -Wmissing-noreturn -Wno-cast-function-type -Wno-constant-logical-operand -Wno-long-long -Wno-missing-field-initializers -Wno-overlength-strings -Wno-packed-bitfield-compat -Wno-parentheses-equality -Wno-self-assign -Wno-tautological-compare -Wno-unused-parameter -Wno-unused-value -Wsuggest-attribute=format -Wsuggest-attribute=noreturn -Wunused-variable -Wmisleading-indentation -Wundef -fPIC I, [2024-05-15T13:54:38.382646 #2919491] INFO -- : XCFLAGS = -U_FORTIFY_SOURCE -D_FORTIFY_SOURCE=2 -fstack-protector-strong -fno-strict-overflow -fvisibility=hidden -fexcess-precision=standard -DRUBY_EXPORT -I. -I.ext/include/x86_64-linux -I/tmp/ruby/src/trunk/include -I/tmp/ruby/src/trunk -I/tmp/ruby/src/trunk/prism -I/tmp/ruby/src/trunk/enc/unicode/15.0.0 I, [2024-05-15T13:54:38.382659 #2919491] INFO -- : CPPFLAGS = I, [2024-05-15T13:54:38.382663 #2919491] INFO -- : DLDFLAGS = -Wl,--compress-debug-sections=zlib -Wl,-soname,libruby.so.3.4 -fstack-protector-strong I, [2024-05-15T13:54:38.382667 #2919491] INFO -- : SOLIBS = -lz -lrt -lrt -lgmp -ldl -lcrypt -lm -lpthread I, [2024-05-15T13:54:38.382670 #2919491] INFO -- : LANG = en_US.UTF-8 I, [2024-05-15T13:54:38.382674 #2919491] INFO -- : LC_ALL = I, [2024-05-15T13:54:38.382677 #2919491] INFO -- : LC_CTYPE = I, [2024-05-15T13:54:38.382681 #2919491] INFO -- : MFLAGS = I, [2024-05-15T13:54:38.382684 #2919491] INFO -- : RUSTC = no I, [2024-05-15T13:54:38.382688 #2919491] INFO -- : YJIT_RUSTC_ARGS = --crate-name=yjit --crate-type=staticlib --edition=2021 -g -C lto=thin -C opt-level=3 -C overflow-checks=on '--out-dir=/tmp/ruby/build/trunk/yjit/target/release/' /tmp/ruby/src/trunk/yjit/src/lib.rs I, [2024-05-15T13:54:38.383241 #2919491] INFO -- : gcc (Ubuntu 11.4.0-1ubuntu1~22.04) 11.4.0 I, [2024-05-15T13:54:38.383245 #2919491] INFO -- : Copyright (C) 2021 Free Software Foundation, Inc. I, [2024-05-15T13:54:38.383249 #2919491] INFO -- : This is free software; see the source for copying conditions. There is NO I, [2024-05-15T13:54:38.383253 #2919491] INFO -- : warranty; not even for MERCHANTABILITY or FITNESS FOR A PARTICULAR PURPOSE. I, [2024-05-15T13:54:38.383257 #2919491] INFO -- : I, [2024-05-15T13:54:38.385078 #2919491] INFO -- : generating enc.mk I, [2024-05-15T13:54:38.507943 #2919491] INFO -- : making enc I, [2024-05-15T13:54:38.525054 #2919491] INFO -- : make[1]: Entering directory '/tmp/ruby/build/trunk' I, [2024-05-15T13:54:38.525078 #2919491] INFO -- : make[1]: Nothing to be done for 'enc'. I, [2024-05-15T13:54:38.525084 #2919491] INFO -- : make[1]: Leaving directory '/tmp/ruby/build/trunk' I, [2024-05-15T13:54:38.525830 #2919491] INFO -- : making srcs under enc I, [2024-05-15T13:54:38.556613 #2919491] INFO -- : make[1]: Entering directory '/tmp/ruby/build/trunk' I, [2024-05-15T13:54:38.556637 #2919491] INFO -- : make[1]: Nothing to be done for 'srcs'. I, [2024-05-15T13:54:38.556645 #2919491] INFO -- : make[1]: Leaving directory '/tmp/ruby/build/trunk' I, [2024-05-15T13:54:38.557723 #2919491] INFO -- : generating transdb.h I, [2024-05-15T13:54:38.658195 #2919491] INFO -- : transdb.h unchanged I, [2024-05-15T13:54:38.659447 #2919491] INFO -- : making trans I, [2024-05-15T13:54:38.693169 #2919491] INFO -- : make[1]: Entering directory '/tmp/ruby/build/trunk' I, [2024-05-15T13:54:38.693190 #2919491] INFO -- : make[1]: Nothing to be done for 'trans'. I, [2024-05-15T13:54:38.693196 #2919491] INFO -- : make[1]: Leaving directory '/tmp/ruby/build/trunk' I, [2024-05-15T13:54:38.693918 #2919491] INFO -- : making encs I, [2024-05-15T13:54:38.732032 #2919491] INFO -- : make[1]: Entering directory '/tmp/ruby/build/trunk' I, [2024-05-15T13:54:38.732053 #2919491] INFO -- : make[1]: Nothing to be done for 'encs'. I, [2024-05-15T13:54:38.732059 #2919491] INFO -- : make[1]: Leaving directory '/tmp/ruby/build/trunk' I, [2024-05-15T13:54:38.733900 #2919491] INFO -- : generating makefiles ext/configure-ext.mk I, [2024-05-15T13:54:38.760420 #2919491] INFO -- : ext/configure-ext.mk updated I, [2024-05-15T13:54:38.762731 #2919491] INFO -- : make[1]: Entering directory '/tmp/ruby/build/trunk' I, [2024-05-15T13:54:40.111149 #2919491] INFO -- : make[1]: Leaving directory '/tmp/ruby/build/trunk' I, [2024-05-15T13:54:40.111877 #2919491] INFO -- : generating makefile exts.mk I, [2024-05-15T13:54:40.148583 #2919491] INFO -- : exts.mk unchanged I, [2024-05-15T13:54:40.153389 #2919491] INFO -- : make[1]: Entering directory '/tmp/ruby/build/trunk' I, [2024-05-15T13:54:40.450129 #2919491] INFO -- : make[2]: Entering directory '/tmp/ruby/build/trunk/ext/coverage' I, [2024-05-15T13:54:40.454853 #2919491] INFO -- : make[2]: Leaving directory '/tmp/ruby/build/trunk/ext/coverage' I, [2024-05-15T13:54:40.461355 #2919491] INFO -- : make[2]: Entering directory '/tmp/ruby/build/trunk/ext/date' I, [2024-05-15T13:54:40.466475 #2919491] INFO -- : make[2]: Leaving directory '/tmp/ruby/build/trunk/ext/date' I, [2024-05-15T13:54:40.470149 #2919491] INFO -- : make[2]: Entering directory '/tmp/ruby/build/trunk/ext/digest' I, [2024-05-15T13:54:40.479082 #2919491] INFO -- : make[2]: Leaving directory '/tmp/ruby/build/trunk/ext/digest' I, [2024-05-15T13:54:40.505704 #2919491] INFO -- : make[2]: Entering directory '/tmp/ruby/build/trunk/ext/digest/sha2' I, [2024-05-15T13:54:40.510565 #2919491] INFO -- : make[2]: Leaving directory '/tmp/ruby/build/trunk/ext/digest/sha2' I, [2024-05-15T13:54:40.531787 #2919491] INFO -- : make[2]: Entering directory '/tmp/ruby/build/trunk/ext/fiddle' I, [2024-05-15T13:54:40.539836 #2919491] INFO -- : make[2]: Leaving directory '/tmp/ruby/build/trunk/ext/fiddle' I, [2024-05-15T13:54:40.542671 #2919491] INFO -- : make[2]: Entering directory '/tmp/ruby/build/trunk/ext/io/console' I, [2024-05-15T13:54:40.545331 #2919491] INFO -- : make[2]: Leaving directory '/tmp/ruby/build/trunk/ext/io/console' I, [2024-05-15T13:54:40.553737 #2919491] INFO -- : make[2]: Entering directory '/tmp/ruby/build/trunk/ext/json' I, [2024-05-15T13:54:40.562510 #2919491] INFO -- : make[2]: Leaving directory '/tmp/ruby/build/trunk/ext/json' I, [2024-05-15T13:54:40.577654 #2919491] INFO -- : make[2]: Entering directory '/tmp/ruby/build/trunk/ext/monitor' I, [2024-05-15T13:54:40.581710 #2919491] INFO -- : make[2]: Leaving directory '/tmp/ruby/build/trunk/ext/monitor' I, [2024-05-15T13:54:40.588623 #2919491] INFO -- : make[2]: Entering directory '/tmp/ruby/build/trunk/ext/objspace' I, [2024-05-15T13:54:40.594858 #2919491] INFO -- : make[2]: Leaving directory '/tmp/ruby/build/trunk/ext/objspace' I, [2024-05-15T13:54:40.612638 #2919491] INFO -- : make[2]: Entering directory '/tmp/ruby/build/trunk/ext/openssl' I, [2024-05-15T13:54:40.628058 #2919491] INFO -- : make[2]: Leaving directory '/tmp/ruby/build/trunk/ext/openssl' I, [2024-05-15T13:54:40.631686 #2919491] INFO -- : make[2]: Entering directory '/tmp/ruby/build/trunk/ext/pathname' I, [2024-05-15T13:54:40.634408 #2919491] INFO -- : make[2]: Leaving directory '/tmp/ruby/build/trunk/ext/pathname' I, [2024-05-15T13:54:40.640245 #2919491] INFO -- : make[2]: Entering directory '/tmp/ruby/build/trunk/ext/psych' I, [2024-05-15T13:54:40.664934 #2919491] INFO -- : make[2]: Leaving directory '/tmp/ruby/build/trunk/ext/psych' I, [2024-05-15T13:54:40.669919 #2919491] INFO -- : make[2]: Entering directory '/tmp/ruby/build/trunk/ext/pty' I, [2024-05-15T13:54:40.674026 #2919491] INFO -- : make[2]: Leaving directory '/tmp/ruby/build/trunk/ext/pty' I, [2024-05-15T13:54:40.688422 #2919491] INFO -- : make[2]: Entering directory '/tmp/ruby/build/trunk/ext/ripper' I, [2024-05-15T13:54:40.696674 #2919491] INFO -- : make[2]: Leaving directory '/tmp/ruby/build/trunk/ext/ripper' I, [2024-05-15T13:54:40.699076 #2919491] INFO -- : make[2]: Entering directory '/tmp/ruby/build/trunk/ext/rubyvm' I, [2024-05-15T13:54:40.702351 #2919491] INFO -- : make[2]: Leaving directory '/tmp/ruby/build/trunk/ext/rubyvm' I, [2024-05-15T13:54:40.715756 #2919491] INFO -- : make[2]: Entering directory '/tmp/ruby/build/trunk/ext/socket' I, [2024-05-15T13:54:40.726542 #2919491] INFO -- : make[2]: Leaving directory '/tmp/ruby/build/trunk/ext/socket' I, [2024-05-15T13:54:40.744783 #2919491] INFO -- : make[2]: Entering directory '/tmp/ruby/build/trunk/.bundle/gems/bigdecimal-3.1.8/ext/bigdecimal' I, [2024-05-15T13:54:40.770267 #2919491] INFO -- : make[2]: Leaving directory '/tmp/ruby/build/trunk/.bundle/gems/bigdecimal-3.1.8/ext/bigdecimal' I, [2024-05-15T13:54:40.772214 #2919491] INFO -- : make[2]: Entering directory '/tmp/ruby/build/trunk/.bundle/gems/debug-1.9.2/ext/debug' I, [2024-05-15T13:54:40.794214 #2919491] INFO -- : make[2]: Leaving directory '/tmp/ruby/build/trunk/.bundle/gems/debug-1.9.2/ext/debug' I, [2024-05-15T13:54:40.796039 #2919491] INFO -- : make[2]: Entering directory '/tmp/ruby/build/trunk/.bundle/gems/nkf-0.2.0/ext/nkf' I, [2024-05-15T13:54:40.820221 #2919491] INFO -- : make[2]: Leaving directory '/tmp/ruby/build/trunk/.bundle/gems/nkf-0.2.0/ext/nkf' I, [2024-05-15T13:54:40.823126 #2919491] INFO -- : make[2]: Entering directory '/tmp/ruby/build/trunk/.bundle/gems/racc-1.7.3/ext/racc/cparse' I, [2024-05-15T13:54:40.851316 #2919491] INFO -- : make[2]: Leaving directory '/tmp/ruby/build/trunk/.bundle/gems/racc-1.7.3/ext/racc/cparse' I, [2024-05-15T13:54:40.853510 #2919491] INFO -- : make[2]: Entering directory '/tmp/ruby/build/trunk/.bundle/gems/rbs-3.4.4/ext/rbs_extension' I, [2024-05-15T13:54:40.877071 #2919491] INFO -- : make[2]: Leaving directory '/tmp/ruby/build/trunk/.bundle/gems/rbs-3.4.4/ext/rbs_extension' I, [2024-05-15T13:54:40.880074 #2919491] INFO -- : make[2]: Entering directory '/tmp/ruby/build/trunk/.bundle/gems/syslog-0.1.2/ext/syslog' I, [2024-05-15T13:54:40.909436 #2919491] INFO -- : make[2]: Leaving directory '/tmp/ruby/build/trunk/.bundle/gems/syslog-0.1.2/ext/syslog' I, [2024-05-15T13:54:40.932811 #2919491] INFO -- : make[2]: Entering directory '/tmp/ruby/build/trunk' I, [2024-05-15T13:54:40.995676 #2919491] INFO -- : make[2]: 'ruby' is up to date. I, [2024-05-15T13:54:40.995724 #2919491] INFO -- : make[2]: Leaving directory '/tmp/ruby/build/trunk' I, [2024-05-15T13:54:40.995996 #2919491] INFO -- : make[1]: Leaving directory '/tmp/ruby/build/trunk' I, [2024-05-15T13:54:40.999523 #2919491] INFO -- : make[1]: Entering directory '/tmp/ruby/build/trunk' I, [2024-05-15T13:54:40.999547 #2919491] INFO -- : make[1]: Nothing to be done for 'note'. I, [2024-05-15T13:54:40.999556 #2919491] INFO -- : make[1]: Leaving directory '/tmp/ruby/build/trunk' E, [2024-05-15T13:54:41.056679 #2919491] ERROR -- : $ /tmp/ruby/build/trunk/miniruby -I/tmp/ruby/src/trunk/lib /tmp/ruby/src/trunk/tool/runruby.rb --archdir=/tmp/ruby/build/trunk --extout=.ext -- /tmp/ruby/src/trunk/spec/mspec/bin/mspec-run -B /tmp/ruby/src/trunk/spec/default.mspec --error-output stderr --debug -fy -o /tmp/rubytest.uvtfzq/1-mspec-multi-0 E, [2024-05-15T13:54:41.056872 #2919491] ERROR -- : $ /tmp/ruby/build/trunk/miniruby -I/tmp/ruby/src/trunk/lib /tmp/ruby/src/trunk/tool/runruby.rb --archdir=/tmp/ruby/build/trunk --extout=.ext -- /tmp/ruby/src/trunk/spec/mspec/bin/mspec-run -B /tmp/ruby/src/trunk/spec/default.mspec --error-output stderr --debug -fy -o /tmp/rubytest.uvtfzq/2-mspec-multi-1 E, [2024-05-15T13:54:41.057126 #2919491] ERROR -- : $ /tmp/ruby/build/trunk/miniruby -I/tmp/ruby/src/trunk/lib /tmp/ruby/src/trunk/tool/runruby.rb --archdir=/tmp/ruby/build/trunk --extout=.ext -- /tmp/ruby/src/trunk/spec/mspec/bin/mspec-run -B /tmp/ruby/src/trunk/spec/default.mspec --error-output stderr --debug -fy -o /tmp/rubytest.uvtfzq/3-mspec-multi-2 E, [2024-05-15T13:54:41.057397 #2919491] ERROR -- : $ /tmp/ruby/build/trunk/miniruby -I/tmp/ruby/src/trunk/lib /tmp/ruby/src/trunk/tool/runruby.rb --archdir=/tmp/ruby/build/trunk --extout=.ext -- /tmp/ruby/src/trunk/spec/mspec/bin/mspec-run -B /tmp/ruby/src/trunk/spec/default.mspec --error-output stderr --debug -fy -o /tmp/rubytest.uvtfzq/4-mspec-multi-3 E, [2024-05-15T13:54:41.057679 #2919491] ERROR -- : $ /tmp/ruby/build/trunk/miniruby -I/tmp/ruby/src/trunk/lib /tmp/ruby/src/trunk/tool/runruby.rb --archdir=/tmp/ruby/build/trunk --extout=.ext -- /tmp/ruby/src/trunk/spec/mspec/bin/mspec-run -B /tmp/ruby/src/trunk/spec/default.mspec --error-output stderr --debug -fy -o /tmp/rubytest.uvtfzq/5-mspec-multi-4 E, [2024-05-15T13:54:41.057817 #2919491] ERROR -- : $ /tmp/ruby/build/trunk/miniruby -I/tmp/ruby/src/trunk/lib /tmp/ruby/src/trunk/tool/runruby.rb --archdir=/tmp/ruby/build/trunk --extout=.ext -- /tmp/ruby/src/trunk/spec/mspec/bin/mspec-run -B /tmp/ruby/src/trunk/spec/default.mspec --error-output stderr --debug -fy -o /tmp/rubytest.uvtfzq/6-mspec-multi-5 E, [2024-05-15T13:54:41.058182 #2919491] ERROR -- : $ /tmp/ruby/build/trunk/miniruby -I/tmp/ruby/src/trunk/lib /tmp/ruby/src/trunk/tool/runruby.rb --archdir=/tmp/ruby/build/trunk --extout=.ext -- /tmp/ruby/src/trunk/spec/mspec/bin/mspec-run -B /tmp/ruby/src/trunk/spec/default.mspec --error-output stderr --debug -fy -o /tmp/rubytest.uvtfzq/7-mspec-multi-6 E, [2024-05-15T13:54:41.058357 #2919491] ERROR -- : $ /tmp/ruby/build/trunk/miniruby -I/tmp/ruby/src/trunk/lib /tmp/ruby/src/trunk/tool/runruby.rb --archdir=/tmp/ruby/build/trunk --extout=.ext -- /tmp/ruby/src/trunk/spec/mspec/bin/mspec-run -B /tmp/ruby/src/trunk/spec/default.mspec --error-output stderr --debug -fy -o /tmp/rubytest.uvtfzq/8-mspec-multi-7 E, [2024-05-15T13:54:41.058565 #2919491] ERROR -- : $ /tmp/ruby/build/trunk/miniruby -I/tmp/ruby/src/trunk/lib /tmp/ruby/src/trunk/tool/runruby.rb --archdir=/tmp/ruby/build/trunk --extout=.ext -- /tmp/ruby/src/trunk/spec/mspec/bin/mspec-run -B /tmp/ruby/src/trunk/spec/default.mspec --error-output stderr --debug -fy -o /tmp/rubytest.uvtfzq/9-mspec-multi-8 E, [2024-05-15T13:54:41.058765 #2919491] ERROR -- : $ /tmp/ruby/build/trunk/miniruby -I/tmp/ruby/src/trunk/lib /tmp/ruby/src/trunk/tool/runruby.rb --archdir=/tmp/ruby/build/trunk --extout=.ext -- /tmp/ruby/src/trunk/spec/mspec/bin/mspec-run -B /tmp/ruby/src/trunk/spec/default.mspec --error-output stderr --debug -fy -o /tmp/rubytest.uvtfzq/10-mspec-multi-9 E, [2024-05-15T13:54:41.059091 #2919491] ERROR -- : $ /tmp/ruby/build/trunk/miniruby -I/tmp/ruby/src/trunk/lib /tmp/ruby/src/trunk/tool/runruby.rb --archdir=/tmp/ruby/build/trunk --extout=.ext -- /tmp/ruby/src/trunk/spec/mspec/bin/mspec-run -B /tmp/ruby/src/trunk/spec/default.mspec --error-output stderr --debug -fy -o /tmp/rubytest.uvtfzq/11-mspec-multi-10 E, [2024-05-15T13:54:41.059426 #2919491] ERROR -- : $ /tmp/ruby/build/trunk/miniruby -I/tmp/ruby/src/trunk/lib /tmp/ruby/src/trunk/tool/runruby.rb --archdir=/tmp/ruby/build/trunk --extout=.ext -- /tmp/ruby/src/trunk/spec/mspec/bin/mspec-run -B /tmp/ruby/src/trunk/spec/default.mspec --error-output stderr --debug -fy -o /tmp/rubytest.uvtfzq/12-mspec-multi-11 E, [2024-05-15T13:54:41.059791 #2919491] ERROR -- : $ /tmp/ruby/build/trunk/miniruby -I/tmp/ruby/src/trunk/lib /tmp/ruby/src/trunk/tool/runruby.rb --archdir=/tmp/ruby/build/trunk --extout=.ext -- /tmp/ruby/src/trunk/spec/mspec/bin/mspec-run -B /tmp/ruby/src/trunk/spec/default.mspec --error-output stderr --debug -fy -o /tmp/rubytest.uvtfzq/13-mspec-multi-12 E, [2024-05-15T13:54:41.059946 #2919491] ERROR -- : $ /tmp/ruby/build/trunk/miniruby -I/tmp/ruby/src/trunk/lib /tmp/ruby/src/trunk/tool/runruby.rb --archdir=/tmp/ruby/build/trunk --extout=.ext -- /tmp/ruby/src/trunk/spec/mspec/bin/mspec-run -B /tmp/ruby/src/trunk/spec/default.mspec --error-output stderr --debug -fy -o /tmp/rubytest.uvtfzq/14-mspec-multi-13 E, [2024-05-15T13:54:41.060162 #2919491] ERROR -- : $ /tmp/ruby/build/trunk/miniruby -I/tmp/ruby/src/trunk/lib /tmp/ruby/src/trunk/tool/runruby.rb --archdir=/tmp/ruby/build/trunk --extout=.ext -- /tmp/ruby/src/trunk/spec/mspec/bin/mspec-run -B /tmp/ruby/src/trunk/spec/default.mspec --error-output stderr --debug -fy -o /tmp/rubytest.uvtfzq/15-mspec-multi-14 E, [2024-05-15T13:54:41.060333 #2919491] ERROR -- : $ /tmp/ruby/build/trunk/miniruby -I/tmp/ruby/src/trunk/lib /tmp/ruby/src/trunk/tool/runruby.rb --archdir=/tmp/ruby/build/trunk --extout=.ext -- /tmp/ruby/src/trunk/spec/mspec/bin/mspec-run -B /tmp/ruby/src/trunk/spec/default.mspec --error-output stderr --debug -fy -o /tmp/rubytest.uvtfzq/16-mspec-multi-15 E, [2024-05-15T13:54:41.060568 #2919491] ERROR -- : $ /tmp/ruby/build/trunk/miniruby -I/tmp/ruby/src/trunk/lib /tmp/ruby/src/trunk/tool/runruby.rb --archdir=/tmp/ruby/build/trunk --extout=.ext -- /tmp/ruby/src/trunk/spec/mspec/bin/mspec-run -B /tmp/ruby/src/trunk/spec/default.mspec --error-output stderr --debug -fy -o /tmp/rubytest.uvtfzq/17-mspec-multi-16 E, [2024-05-15T13:54:41.060893 #2919491] ERROR -- : $ /tmp/ruby/build/trunk/miniruby -I/tmp/ruby/src/trunk/lib /tmp/ruby/src/trunk/tool/runruby.rb --archdir=/tmp/ruby/build/trunk --extout=.ext -- /tmp/ruby/src/trunk/spec/mspec/bin/mspec-run -B /tmp/ruby/src/trunk/spec/default.mspec --error-output stderr --debug -fy -o /tmp/rubytest.uvtfzq/18-mspec-multi-17 E, [2024-05-15T13:54:41.063784 #2919491] ERROR -- : $ /tmp/ruby/build/trunk/miniruby -I/tmp/ruby/src/trunk/lib /tmp/ruby/src/trunk/tool/runruby.rb --archdir=/tmp/ruby/build/trunk --extout=.ext -- /tmp/ruby/src/trunk/spec/mspec/bin/mspec-run -B /tmp/ruby/src/trunk/spec/default.mspec --error-output stderr --debug -fy -o /tmp/rubytest.uvtfzq/19-mspec-multi-18 E, [2024-05-15T13:54:41.064175 #2919491] ERROR -- : $ /tmp/ruby/build/trunk/miniruby -I/tmp/ruby/src/trunk/lib /tmp/ruby/src/trunk/tool/runruby.rb --archdir=/tmp/ruby/build/trunk --extout=.ext -- /tmp/ruby/src/trunk/spec/mspec/bin/mspec-run -B /tmp/ruby/src/trunk/spec/default.mspec --error-output stderr --debug -fy -o /tmp/rubytest.uvtfzq/20-mspec-multi-19 I, [2024-05-15T13:54:41.226822 #2919491] INFO -- : ruby 3.4.0dev (2024-05-15T09:11:55Z master e73f6618d5) [x86_64-linux] I, [2024-05-15T13:54:41.809908 #2919491] INFO -- : 0 ......................................................................... I, [2024-05-15T13:54:42.242114 #2919491] INFO -- : 73 ......................................................................... I, [2024-05-15T13:54:42.386947 #2919491] INFO -- : 146 ......................................................................... I, [2024-05-15T13:54:42.441795 #2919491] INFO -- : 219 ......................................................................... I, [2024-05-15T13:54:42.499590 #2919491] INFO -- : 292 ......................................................................... I, [2024-05-15T13:54:42.541565 #2919491] INFO -- : 365 ......................................................................... I, [2024-05-15T13:54:42.561631 #2919491] INFO -- : 438 ......................................................................... I, [2024-05-15T13:54:42.580584 #2919491] INFO -- : 511 ......................................................................... I, [2024-05-15T13:54:42.598584 #2919491] INFO -- : 584 ......................................................................... I, [2024-05-15T13:54:42.657951 #2919491] INFO -- : 657 ......................................................................... I, [2024-05-15T13:54:42.682588 #2919491] INFO -- : 730 ......................................................................... I, [2024-05-15T13:54:42.701313 #2919491] INFO -- : 803 ......................................................................... I, [2024-05-15T13:54:42.729240 #2919491] INFO -- : 876 ......................................................................... I, [2024-05-15T13:54:42.778553 #2919491] INFO -- : 949 ......................................................................... I, [2024-05-15T13:54:42.873405 #2919491] INFO -- : 1022 ......................................................................... I, [2024-05-15T13:54:43.045160 #2919491] INFO -- : 1095 ......................................................................... I, [2024-05-15T13:54:43.157601 #2919491] INFO -- : 1168 ......................................................................... I, [2024-05-15T13:54:43.220505 #2919491] INFO -- : 1241 ......................................................................... I, [2024-05-15T13:54:43.271636 #2919491] INFO -- : 1314 ......................................................................... I, [2024-05-15T13:54:43.288615 #2919491] INFO -- : 1387 ......................................................................... I, [2024-05-15T13:54:43.380190 #2919491] INFO -- : 1460 ......................................................................... I, [2024-05-15T13:54:43.879362 #2919491] INFO -- : 1533 ......................................................................... I, [2024-05-15T13:54:43.935563 #2919491] INFO -- : 1606 ......................................................................... I, [2024-05-15T13:54:44.018670 #2919491] INFO -- : 1679 ......................................................................... I, [2024-05-15T13:54:44.128177 #2919491] INFO -- : 1752 ......................................................................... I, [2024-05-15T13:54:44.216273 #2919491] INFO -- : 1825 ......................................................................... I, [2024-05-15T13:54:44.340699 #2919491] INFO -- : 1898 ......................................................................... I, [2024-05-15T13:54:44.407700 #2919491] INFO -- : 1971 ......................................................................... I, [2024-05-15T13:54:44.474391 #2919491] INFO -- : 2044 ......................................................................... I, [2024-05-15T13:54:44.504889 #2919491] INFO -- : 2117 ......................................................................... I, [2024-05-15T13:54:44.518599 #2919491] INFO -- : 2190 ......................................................................... I, [2024-05-15T13:54:44.538618 #2919491] INFO -- : 2263 ......................................................................... I, [2024-05-15T13:54:44.551520 #2919491] INFO -- : 2336 ......................................................................... I, [2024-05-15T13:54:44.587966 #2919491] INFO -- : 2409 ......................................................................... I, [2024-05-15T13:54:44.692363 #2919491] INFO -- : 2482 ......................................................................... I, [2024-05-15T13:54:44.714293 #2919491] INFO -- : 2555 ......................................................................... I, [2024-05-15T13:54:44.834360 #2919491] INFO -- : 2628 ......................................................................... I, [2024-05-15T13:54:44.968153 #2919491] INFO -- : 2701 ......................................................................... I, [2024-05-15T13:54:45.006749 #2919491] INFO -- : 2774 ......................................................................... I, [2024-05-15T13:54:45.065847 #2919491] INFO -- : 2847 ......................................................................... I, [2024-05-15T13:54:45.097454 #2919491] INFO -- : 2920 ......................................................................... I, [2024-05-15T13:54:45.118211 #2919491] INFO -- : 2993 ......................................................................... I, [2024-05-15T13:54:45.138891 #2919491] INFO -- : 3066 ......................................................................... I, [2024-05-15T13:54:45.152910 #2919491] INFO -- : 3139 ......................................................................... I, [2024-05-15T13:54:45.162625 #2919491] INFO -- : 3212 ......................................................................... I, [2024-05-15T13:54:45.188194 #2919491] INFO -- : 3285 ......................................................................... I, [2024-05-15T13:54:49.163091 #2919491] INFO -- : 3358 ........................................................................ I, [2024-05-15T13:54:49.163173 #2919491] INFO -- : I, [2024-05-15T13:54:49.163187 #2919491] INFO -- : Finished in 8.105618 seconds I, [2024-05-15T13:54:49.163199 #2919491] INFO -- : I, [2024-05-15T13:54:49.163210 #2919491] INFO -- : 3429 files, 32611 examples, 171430 expectations, 0 failures, 0 errors, 0 tagged I, [2024-05-15T13:54:49.165283 #2919491] INFO -- : $$$[end] "make yes-test-rubyspec MSPECOPT='--error-output stderr --debug -j' TESTS='-j20'" exit with 0.