# Logfile created on 2024-05-15 06:09:21 +0000 by logger.rb/v1.4.3 I, [2024-05-15T06:09:21.198980 #2385316] INFO -- : #, @formatter=nil, @logdev=#, @binmode=false, @mon_data=#, @mon_data_owner_object_id=860>>> I, [2024-05-15T06:09:21.199103 #2385316] INFO -- : $$$[beg] make update-unicode -j20 I, [2024-05-15T06:09:21.258156 #2385316] INFO -- : Downloading Unicode emoji 15.0 files... I, [2024-05-15T06:09:21.258458 #2385316] INFO -- : Downloading Unicode emoji 15.0 files... I, [2024-05-15T06:09:21.259001 #2385316] INFO -- : Downloading Unicode emoji 15.0 files... I, [2024-05-15T06:09:21.301055 #2385316] INFO -- : made symlink emoji/15.0/emoji-sequences.txt to /tmp/ruby/src/trunk/.downloaded-cache/emoji/15.0/emoji-sequences.txt I, [2024-05-15T06:09:21.301088 #2385316] INFO -- : /tmp/ruby/src/trunk/enc/unicode/data/emoji/15.0/emoji-sequences.txt already exists I, [2024-05-15T06:09:21.301576 #2385316] INFO -- : downloading emoji/15.0/emoji-test.txt ... downloading emoji/15.0/emoji-test.txt ... /tmp/ruby/src/trunk/enc/unicode/data/emoji/15.0/emoji-sequences.txt already exists E, [2024-05-15T06:09:21.759226 #2385316] ERROR -- : /tmp/ruby/src/trunk/tool/downloader.rb:302:in `rescue in download': failed to download emoji/15.0/emoji-test.txt (RuntimeError) E, [2024-05-15T06:09:21.759381 #2385316] ERROR -- : OpenURI::HTTPError: 403 Forbidden: https://www.unicode.org/Public/emoji/15.0/emoji-test.txt E, [2024-05-15T06:09:21.759406 #2385316] ERROR -- : from /tmp/ruby/src/trunk/tool/downloader.rb:201:in `download' E, [2024-05-15T06:09:21.759424 #2385316] ERROR -- : from /tmp/ruby/src/trunk/tool/downloader.rb:136:in `download' E, [2024-05-15T06:09:21.759440 #2385316] ERROR -- : from /tmp/ruby/src/trunk/tool/downloader.rb:482:in `block in
' E, [2024-05-15T06:09:21.759454 #2385316] ERROR -- : from /tmp/ruby/src/trunk/tool/downloader.rb:465:in `each' E, [2024-05-15T06:09:21.759467 #2385316] ERROR -- : from /tmp/ruby/src/trunk/tool/downloader.rb:465:in `
' E, [2024-05-15T06:09:21.759480 #2385316] ERROR -- : /usr/lib/ruby/3.0.0/open-uri.rb:364:in `open_http': 403 Forbidden (OpenURI::HTTPError) E, [2024-05-15T06:09:21.759494 #2385316] ERROR -- : from /usr/lib/ruby/3.0.0/open-uri.rb:741:in `buffer_open' E, [2024-05-15T06:09:21.759511 #2385316] ERROR -- : from /usr/lib/ruby/3.0.0/open-uri.rb:212:in `block in open_loop' E, [2024-05-15T06:09:21.759525 #2385316] ERROR -- : from /usr/lib/ruby/3.0.0/open-uri.rb:210:in `catch' E, [2024-05-15T06:09:21.759538 #2385316] ERROR -- : from /usr/lib/ruby/3.0.0/open-uri.rb:210:in `open_loop' E, [2024-05-15T06:09:21.759551 #2385316] ERROR -- : from /usr/lib/ruby/3.0.0/open-uri.rb:151:in `open_uri' E, [2024-05-15T06:09:21.759563 #2385316] ERROR -- : from /usr/lib/ruby/3.0.0/open-uri.rb:721:in `open' E, [2024-05-15T06:09:21.759576 #2385316] ERROR -- : from /usr/lib/ruby/3.0.0/open-uri.rb:729:in `read' E, [2024-05-15T06:09:21.759611 #2385316] ERROR -- : from /tmp/ruby/src/trunk/tool/downloader.rb:247:in `block in download' E, [2024-05-15T06:09:21.759633 #2385316] ERROR -- : from /tmp/ruby/src/trunk/tool/downloader.rb:378:in `with_retry' E, [2024-05-15T06:09:21.759646 #2385316] ERROR -- : from /tmp/ruby/src/trunk/tool/downloader.rb:246:in `download' E, [2024-05-15T06:09:21.759662 #2385316] ERROR -- : from /tmp/ruby/src/trunk/tool/downloader.rb:136:in `download' E, [2024-05-15T06:09:21.759675 #2385316] ERROR -- : from /tmp/ruby/src/trunk/tool/downloader.rb:482:in `block in
' E, [2024-05-15T06:09:21.759714 #2385316] ERROR -- : from /tmp/ruby/src/trunk/tool/downloader.rb:465:in `each' E, [2024-05-15T06:09:21.759729 #2385316] ERROR -- : from /tmp/ruby/src/trunk/tool/downloader.rb:465:in `
' E, [2024-05-15T06:09:21.760604 #2385316] ERROR -- : /tmp/ruby/src/trunk/tool/downloader.rb:302:in `rescue in download': failed to download emoji/15.0/emoji-test.txt (RuntimeError) E, [2024-05-15T06:09:21.760691 #2385316] ERROR -- : OpenURI::HTTPError: 403 Forbidden: https://www.unicode.org/Public/emoji/15.0/emoji-test.txt E, [2024-05-15T06:09:21.760719 #2385316] ERROR -- : from /tmp/ruby/src/trunk/tool/downloader.rb:201:in `download' E, [2024-05-15T06:09:21.760747 #2385316] ERROR -- : from /tmp/ruby/src/trunk/tool/downloader.rb:136:in `download' E, [2024-05-15T06:09:21.760760 #2385316] ERROR -- : from /tmp/ruby/src/trunk/tool/downloader.rb:482:in `block in
' E, [2024-05-15T06:09:21.760772 #2385316] ERROR -- : from /tmp/ruby/src/trunk/tool/downloader.rb:465:in `each' E, [2024-05-15T06:09:21.760783 #2385316] ERROR -- : from /tmp/ruby/src/trunk/tool/downloader.rb:465:in `
' E, [2024-05-15T06:09:21.760795 #2385316] ERROR -- : /usr/lib/ruby/3.0.0/open-uri.rb:364:in `open_http': 403 Forbidden (OpenURI::HTTPError) E, [2024-05-15T06:09:21.760807 #2385316] ERROR -- : from /usr/lib/ruby/3.0.0/open-uri.rb:741:in `buffer_open' E, [2024-05-15T06:09:21.760820 #2385316] ERROR -- : from /usr/lib/ruby/3.0.0/open-uri.rb:212:in `block in open_loop' E, [2024-05-15T06:09:21.760831 #2385316] ERROR -- : from /usr/lib/ruby/3.0.0/open-uri.rb:210:in `catch' E, [2024-05-15T06:09:21.760846 #2385316] ERROR -- : from /usr/lib/ruby/3.0.0/open-uri.rb:210:in `open_loop' E, [2024-05-15T06:09:21.760858 #2385316] ERROR -- : from /usr/lib/ruby/3.0.0/open-uri.rb:151:in `open_uri' E, [2024-05-15T06:09:21.760869 #2385316] ERROR -- : from /usr/lib/ruby/3.0.0/open-uri.rb:721:in `open' E, [2024-05-15T06:09:21.760881 #2385316] ERROR -- : from /usr/lib/ruby/3.0.0/open-uri.rb:729:in `read' E, [2024-05-15T06:09:21.760892 #2385316] ERROR -- : from /tmp/ruby/src/trunk/tool/downloader.rb:247:in `block in download' E, [2024-05-15T06:09:21.760905 #2385316] ERROR -- : from /tmp/ruby/src/trunk/tool/downloader.rb:378:in `with_retry' E, [2024-05-15T06:09:21.760916 #2385316] ERROR -- : from /tmp/ruby/src/trunk/tool/downloader.rb:246:in `download' E, [2024-05-15T06:09:21.760927 #2385316] ERROR -- : from /tmp/ruby/src/trunk/tool/downloader.rb:136:in `download' E, [2024-05-15T06:09:21.760939 #2385316] ERROR -- : from /tmp/ruby/src/trunk/tool/downloader.rb:482:in `block in
' E, [2024-05-15T06:09:21.760954 #2385316] ERROR -- : from /tmp/ruby/src/trunk/tool/downloader.rb:465:in `each' E, [2024-05-15T06:09:21.760965 #2385316] ERROR -- : from /tmp/ruby/src/trunk/tool/downloader.rb:465:in `
' E, [2024-05-15T06:09:21.760980 #2385316] ERROR -- : /tmp/ruby/src/trunk/tool/downloader.rb:302:in `rescue in download': failed to download emoji/15.0/emoji-test.txt (RuntimeError) E, [2024-05-15T06:09:21.760992 #2385316] ERROR -- : OpenURI::HTTPError: 403 Forbidden: https://www.unicode.org/Public/emoji/15.0/emoji-test.txt E, [2024-05-15T06:09:21.761004 #2385316] ERROR -- : from /tmp/ruby/src/trunk/tool/downloader.rb:201:in `download' E, [2024-05-15T06:09:21.761015 #2385316] ERROR -- : from /tmp/ruby/src/trunk/tool/downloader.rb:136:in `download' E, [2024-05-15T06:09:21.761027 #2385316] ERROR -- : from /tmp/ruby/src/trunk/tool/downloader.rb:482:in `block in
' E, [2024-05-15T06:09:21.761056 #2385316] ERROR -- : from /tmp/ruby/src/trunk/tool/downloader.rb:465:in `each' E, [2024-05-15T06:09:21.761068 #2385316] ERROR -- : from /tmp/ruby/src/trunk/tool/downloader.rb:465:in `
' E, [2024-05-15T06:09:21.761080 #2385316] ERROR -- : /usr/lib/ruby/3.0.0/open-uri.rb:364:in `open_http': 403 Forbidden (OpenURI::HTTPError) E, [2024-05-15T06:09:21.761091 #2385316] ERROR -- : from /usr/lib/ruby/3.0.0/open-uri.rb:741:in `buffer_open' E, [2024-05-15T06:09:21.761103 #2385316] ERROR -- : from /usr/lib/ruby/3.0.0/open-uri.rb:212:in `block in open_loop' E, [2024-05-15T06:09:21.761114 #2385316] ERROR -- : from /usr/lib/ruby/3.0.0/open-uri.rb:210:in `catch' E, [2024-05-15T06:09:21.761126 #2385316] ERROR -- : from /usr/lib/ruby/3.0.0/open-uri.rb:210:in `open_loop' E, [2024-05-15T06:09:21.761137 #2385316] ERROR -- : from /usr/lib/ruby/3.0.0/open-uri.rb:151:in `open_uri' E, [2024-05-15T06:09:21.761160 #2385316] ERROR -- : from /usr/lib/ruby/3.0.0/open-uri.rb:721:in `open' E, [2024-05-15T06:09:21.761172 #2385316] ERROR -- : from /usr/lib/ruby/3.0.0/open-uri.rb:729:in `read' E, [2024-05-15T06:09:21.761183 #2385316] ERROR -- : from /tmp/ruby/src/trunk/tool/downloader.rb:247:in `block in download' E, [2024-05-15T06:09:21.761402 #2385316] ERROR -- : from /tmp/ruby/src/trunk/tool/downloader.rb:378:in `with_retry' E, [2024-05-15T06:09:21.761414 #2385316] ERROR -- : from /tmp/ruby/src/trunk/tool/downloader.rb:246:in `download' E, [2024-05-15T06:09:21.761424 #2385316] ERROR -- : from /tmp/ruby/src/trunk/tool/downloader.rb:136:in `download' E, [2024-05-15T06:09:21.761434 #2385316] ERROR -- : from /tmp/ruby/src/trunk/tool/downloader.rb:482:in `block in
' E, [2024-05-15T06:09:21.761446 #2385316] ERROR -- : from /tmp/ruby/src/trunk/tool/downloader.rb:465:in `each' E, [2024-05-15T06:09:21.761456 #2385316] ERROR -- : from /tmp/ruby/src/trunk/tool/downloader.rb:465:in `
' E, [2024-05-15T06:09:21.764141 #2385316] ERROR -- : make: *** [uncommon.mk:1765: /tmp/ruby/src/trunk/enc/unicode/data/emoji/15.0/emoji-zwj-sequences.txt] Error 1 E, [2024-05-15T06:09:21.764204 #2385316] ERROR -- : make: *** Waiting for unfinished jobs.... E, [2024-05-15T06:09:21.764970 #2385316] ERROR -- : make: *** [uncommon.mk:1765: /tmp/ruby/src/trunk/enc/unicode/data/emoji/15.0/emoji-test.txt] Error 1 I, [2024-05-15T06:09:21.765631 #2385316] INFO -- : downloading emoji/15.0/emoji-test.txt ... E, [2024-05-15T06:09:21.765718 #2385316] ERROR -- : make: *** [uncommon.mk:1765: /tmp/ruby/src/trunk/enc/unicode/data/emoji/15.0/emoji-sequences.txt] Error 1 E, [2024-05-15T06:09:21.765736 #2385316] ERROR -- : make: *** Deleting file '/tmp/ruby/src/trunk/enc/unicode/data/emoji/15.0/emoji-sequences.txt' I, [2024-05-15T06:09:21.766193 #2385316] INFO -- : $$$[end] "make update-unicode -j20" exit with 512. I, [2024-05-15T06:09:21.766262 #2385316] INFO -- : $$$[beg] make update-download -j20 I, [2024-05-15T06:09:21.875296 #2385316] INFO -- : tool/config.guess already exists I, [2024-05-15T06:09:21.875351 #2385316] INFO -- : tool/config.sub already exists I, [2024-05-15T06:09:21.877663 #2385316] INFO -- : Update minitest to ea9caafc0754b1d6236a490d59e624b53209734a I, [2024-05-15T06:09:21.877993 #2385316] INFO -- : Update power_assert to 84e85124c5014a139af39161d484156cfe87a9ed I, [2024-05-15T06:09:21.878730 #2385316] INFO -- : Update rbs to ba7872795d5de04adb8ff500c0e6afdc81a041dd I, [2024-05-15T06:09:21.878905 #2385316] INFO -- : Update typeprof to b19a6416da3a05d57fadd6ffdadb382b6d236ca5 I, [2024-05-15T06:09:21.879172 #2385316] INFO -- : echo ea9caafc0754b1d6236a490d59e624b53209734a | /bin/sh /tmp/ruby/src/trunk/tool/ifchange /tmp/ruby/src/trunk/.bundle/.timestamp/minitest.revision - I, [2024-05-15T06:09:21.879234 #2385316] INFO -- : echo 84e85124c5014a139af39161d484156cfe87a9ed | /bin/sh /tmp/ruby/src/trunk/tool/ifchange /tmp/ruby/src/trunk/.bundle/.timestamp/power_assert.revision - I, [2024-05-15T06:09:21.879932 #2385316] INFO -- : echo ba7872795d5de04adb8ff500c0e6afdc81a041dd | /bin/sh /tmp/ruby/src/trunk/tool/ifchange /tmp/ruby/src/trunk/.bundle/.timestamp/rbs.revision - I, [2024-05-15T06:09:21.880073 #2385316] INFO -- : echo b19a6416da3a05d57fadd6ffdadb382b6d236ca5 | /bin/sh /tmp/ruby/src/trunk/tool/ifchange /tmp/ruby/src/trunk/.bundle/.timestamp/typeprof.revision - I, [2024-05-15T06:09:21.881365 #2385316] INFO -- : /tmp/ruby/src/trunk/.bundle/.timestamp/minitest.revision unchanged I, [2024-05-15T06:09:21.881519 #2385316] INFO -- : /tmp/ruby/src/trunk/.bundle/.timestamp/power_assert.revision unchanged I, [2024-05-15T06:09:21.881806 #2385316] INFO -- : /tmp/ruby/src/trunk/.bundle/.timestamp/rbs.revision unchanged I, [2024-05-15T06:09:21.882059 #2385316] INFO -- : /tmp/ruby/src/trunk/.bundle/.timestamp/typeprof.revision unchanged I, [2024-05-15T06:09:21.882665 #2385316] INFO -- : Building power_assert@84e85124c5014a139af39161d484156cfe87a9ed to /tmp/ruby/src/trunk/gems/power_assert-2.0.3.gem I, [2024-05-15T06:09:21.952523 #2385316] INFO -- : Successfully built RubyGem I, [2024-05-15T06:09:21.952567 #2385316] INFO -- : Name: power_assert I, [2024-05-15T06:09:21.952578 #2385316] INFO -- : Version: 2.0.4dev I, [2024-05-15T06:09:21.952582 #2385316] INFO -- : File: power_assert-2.0.4dev.gem I, [2024-05-15T06:09:21.998719 #2385316] INFO -- : $$$[end] "make update-download -j20" exit with 0. I, [2024-05-15T06:09:21.998759 #2385316] INFO -- : $$$[beg] make update-rubyspec -j20 I, [2024-05-15T06:09:22.056546 #2385316] INFO -- : make: Nothing to be done for 'update-rubyspec'. I, [2024-05-15T06:09:22.056823 #2385316] INFO -- : $$$[end] "make update-rubyspec -j20" exit with 0. I, [2024-05-15T06:09:22.056848 #2385316] INFO -- : $$$[beg] make update-src -j20 I, [2024-05-15T06:09:22.944519 #2385316] INFO -- : Already up to date. I, [2024-05-15T06:09:22.961755 #2385316] INFO -- : Latest commit hash = e3e1e53098 I, [2024-05-15T06:09:22.963300 #2385316] INFO -- : $$$[end] "make update-src -j20" exit with 0. I, [2024-05-15T06:09:22.963347 #2385316] INFO -- : $$$[beg] make after-update -j20 I, [2024-05-15T06:09:23.041699 #2385316] INFO -- : generating /tmp/ruby/src/trunk/ext/ripper/eventids2table.c I, [2024-05-15T06:09:23.045856 #2385316] INFO -- : make[1]: Entering directory '/tmp/ruby/src/trunk/ext/ripper' I, [2024-05-15T06:09:23.045877 #2385316] INFO -- : make[1]: Nothing to be done for 'src'. I, [2024-05-15T06:09:23.045883 #2385316] INFO -- : make[1]: Leaving directory '/tmp/ruby/src/trunk/ext/ripper' I, [2024-05-15T06:09:23.062476 #2385316] INFO -- : /tmp/ruby/src/trunk/revision.h updated I, [2024-05-15T06:09:23.063678 #2385316] INFO -- : generating x86_64-linux-fake.rb I, [2024-05-15T06:09:23.114303 #2385316] INFO -- : x86_64-linux-fake.rb updated I, [2024-05-15T06:09:23.115818 #2385316] INFO -- : generating enc.mk I, [2024-05-15T06:09:23.235258 #2385316] INFO -- : making srcs under enc I, [2024-05-15T06:09:23.264394 #2385316] INFO -- : make[1]: Entering directory '/tmp/ruby/build/trunk' I, [2024-05-15T06:09:23.264417 #2385316] INFO -- : make[1]: Nothing to be done for 'srcs'. I, [2024-05-15T06:09:23.264422 #2385316] INFO -- : make[1]: Leaving directory '/tmp/ruby/build/trunk' I, [2024-05-15T06:09:23.309448 #2385316] INFO -- : Update minitest to ea9caafc0754b1d6236a490d59e624b53209734a I, [2024-05-15T06:09:23.309604 #2385316] INFO -- : Update power_assert to 84e85124c5014a139af39161d484156cfe87a9ed I, [2024-05-15T06:09:23.310322 #2385316] INFO -- : Update rbs to ba7872795d5de04adb8ff500c0e6afdc81a041dd I, [2024-05-15T06:09:23.310462 #2385316] INFO -- : Update typeprof to b19a6416da3a05d57fadd6ffdadb382b6d236ca5 I, [2024-05-15T06:09:23.310911 #2385316] INFO -- : echo ea9caafc0754b1d6236a490d59e624b53209734a | /bin/sh /tmp/ruby/src/trunk/tool/ifchange /tmp/ruby/src/trunk/.bundle/.timestamp/minitest.revision - I, [2024-05-15T06:09:23.310988 #2385316] INFO -- : echo 84e85124c5014a139af39161d484156cfe87a9ed | /bin/sh /tmp/ruby/src/trunk/tool/ifchange /tmp/ruby/src/trunk/.bundle/.timestamp/power_assert.revision - I, [2024-05-15T06:09:23.312011 #2385316] INFO -- : echo ba7872795d5de04adb8ff500c0e6afdc81a041dd | /bin/sh /tmp/ruby/src/trunk/tool/ifchange /tmp/ruby/src/trunk/.bundle/.timestamp/rbs.revision - I, [2024-05-15T06:09:23.312284 #2385316] INFO -- : echo b19a6416da3a05d57fadd6ffdadb382b6d236ca5 | /bin/sh /tmp/ruby/src/trunk/tool/ifchange /tmp/ruby/src/trunk/.bundle/.timestamp/typeprof.revision - I, [2024-05-15T06:09:23.312796 #2385316] INFO -- : /tmp/ruby/src/trunk/.bundle/.timestamp/power_assert.revision unchanged I, [2024-05-15T06:09:23.312962 #2385316] INFO -- : /tmp/ruby/src/trunk/.bundle/.timestamp/minitest.revision unchanged I, [2024-05-15T06:09:23.313690 #2385316] INFO -- : /tmp/ruby/src/trunk/.bundle/.timestamp/rbs.revision unchanged I, [2024-05-15T06:09:23.313838 #2385316] INFO -- : Building power_assert@84e85124c5014a139af39161d484156cfe87a9ed to /tmp/ruby/src/trunk/gems/power_assert-2.0.3.gem I, [2024-05-15T06:09:23.314343 #2385316] INFO -- : /tmp/ruby/src/trunk/.bundle/.timestamp/typeprof.revision unchanged I, [2024-05-15T06:09:23.385022 #2385316] INFO -- : Successfully built RubyGem I, [2024-05-15T06:09:23.385078 #2385316] INFO -- : Name: power_assert I, [2024-05-15T06:09:23.385098 #2385316] INFO -- : Version: 2.0.4dev I, [2024-05-15T06:09:23.385109 #2385316] INFO -- : File: power_assert-2.0.4dev.gem I, [2024-05-15T06:09:23.387380 #2385316] INFO -- : Extracting bundle gem power_assert-2.0.3... I, [2024-05-15T06:09:23.447781 #2385316] INFO -- : Try with hash version of bundled gems instead of gems/power_assert-2.0.3.gem. We don't use this gem with release version of Ruby. I, [2024-05-15T06:09:23.452705 #2385316] INFO -- : Unpacked gems/power_assert-2.0.4dev.gem I, [2024-05-15T06:09:23.454935 #2385316] INFO -- : $$$[end] "make after-update -j20" exit with 0. I, [2024-05-15T06:09:23.455091 #2385316] INFO -- : $$$[beg] make miniruby -j20 I, [2024-05-15T06:09:23.512103 #2385316] INFO -- : BASERUBY = /usr/bin/ruby --disable=gems I, [2024-05-15T06:09:23.512139 #2385316] INFO -- : CC = gcc I, [2024-05-15T06:09:23.512147 #2385316] INFO -- : LD = ld I, [2024-05-15T06:09:23.512151 #2385316] INFO -- : LDSHARED = gcc -shared I, [2024-05-15T06:09:23.512155 #2385316] INFO -- : CFLAGS = -O3 -fno-fast-math -ggdb3 -Wall -Wextra -Wdeprecated-declarations -Wdiv-by-zero -Wduplicated-cond -Wimplicit-function-declaration -Wimplicit-int -Wpointer-arith -Wwrite-strings -Wold-style-definition -Wimplicit-fallthrough=0 -Wmissing-noreturn -Wno-cast-function-type -Wno-constant-logical-operand -Wno-long-long -Wno-missing-field-initializers -Wno-overlength-strings -Wno-packed-bitfield-compat -Wno-parentheses-equality -Wno-self-assign -Wno-tautological-compare -Wno-unused-parameter -Wno-unused-value -Wsuggest-attribute=format -Wsuggest-attribute=noreturn -Wunused-variable -Wmisleading-indentation -Wundef -fPIC I, [2024-05-15T06:09:23.512161 #2385316] INFO -- : XCFLAGS = -U_FORTIFY_SOURCE -D_FORTIFY_SOURCE=2 -fstack-protector-strong -fno-strict-overflow -fvisibility=hidden -fexcess-precision=standard -DRUBY_EXPORT -I. -I.ext/include/x86_64-linux -I/tmp/ruby/src/trunk/include -I/tmp/ruby/src/trunk -I/tmp/ruby/src/trunk/prism -I/tmp/ruby/src/trunk/enc/unicode/15.0.0 I, [2024-05-15T06:09:23.512165 #2385316] INFO -- : CPPFLAGS = I, [2024-05-15T06:09:23.512168 #2385316] INFO -- : DLDFLAGS = -Wl,--compress-debug-sections=zlib -Wl,-soname,libruby.so.3.4 -fstack-protector-strong I, [2024-05-15T06:09:23.512172 #2385316] INFO -- : SOLIBS = -lz -lrt -lrt -lgmp -ldl -lcrypt -lm -lpthread I, [2024-05-15T06:09:23.512176 #2385316] INFO -- : LANG = en_US.UTF-8 I, [2024-05-15T06:09:23.512180 #2385316] INFO -- : LC_ALL = I, [2024-05-15T06:09:23.512183 #2385316] INFO -- : LC_CTYPE = I, [2024-05-15T06:09:23.512187 #2385316] INFO -- : MFLAGS = -j20 --jobserver-auth=4,5 I, [2024-05-15T06:09:23.512190 #2385316] INFO -- : RUSTC = no I, [2024-05-15T06:09:23.512194 #2385316] INFO -- : YJIT_RUSTC_ARGS = --crate-name=yjit --crate-type=staticlib --edition=2021 -g -C lto=thin -C opt-level=3 -C overflow-checks=on '--out-dir=/tmp/ruby/build/trunk/yjit/target/release/' /tmp/ruby/src/trunk/yjit/src/lib.rs I, [2024-05-15T06:09:23.513808 #2385316] INFO -- : gcc (Ubuntu 11.4.0-1ubuntu1~22.04) 11.4.0 I, [2024-05-15T06:09:23.513835 #2385316] INFO -- : Copyright (C) 2021 Free Software Foundation, Inc. I, [2024-05-15T06:09:23.513842 #2385316] INFO -- : This is free software; see the source for copying conditions. There is NO I, [2024-05-15T06:09:23.513847 #2385316] INFO -- : warranty; not even for MERCHANTABILITY or FITNESS FOR A PARTICULAR PURPOSE. I, [2024-05-15T06:09:23.513852 #2385316] INFO -- : I, [2024-05-15T06:09:23.539478 #2385316] INFO -- : compiling /tmp/ruby/src/trunk/version.c I, [2024-05-15T06:09:23.641464 #2385316] INFO -- : linking miniruby I, [2024-05-15T06:09:24.197351 #2385316] INFO -- : $$$[end] "make miniruby -j20" exit with 0. I, [2024-05-15T06:09:24.197456 #2385316] INFO -- : $$$[beg] make ruby -j20 I, [2024-05-15T06:09:24.255820 #2385316] INFO -- : BASERUBY = /usr/bin/ruby --disable=gems I, [2024-05-15T06:09:24.255849 #2385316] INFO -- : CC = gcc I, [2024-05-15T06:09:24.255854 #2385316] INFO -- : LD = ld I, [2024-05-15T06:09:24.255862 #2385316] INFO -- : LDSHARED = gcc -shared I, [2024-05-15T06:09:24.255866 #2385316] INFO -- : CFLAGS = -O3 -fno-fast-math -ggdb3 -Wall -Wextra -Wdeprecated-declarations -Wdiv-by-zero -Wduplicated-cond -Wimplicit-function-declaration -Wimplicit-int -Wpointer-arith -Wwrite-strings -Wold-style-definition -Wimplicit-fallthrough=0 -Wmissing-noreturn -Wno-cast-function-type -Wno-constant-logical-operand -Wno-long-long -Wno-missing-field-initializers -Wno-overlength-strings -Wno-packed-bitfield-compat -Wno-parentheses-equality -Wno-self-assign -Wno-tautological-compare -Wno-unused-parameter -Wno-unused-value -Wsuggest-attribute=format -Wsuggest-attribute=noreturn -Wunused-variable -Wmisleading-indentation -Wundef -fPIC I, [2024-05-15T06:09:24.255870 #2385316] INFO -- : XCFLAGS = -U_FORTIFY_SOURCE -D_FORTIFY_SOURCE=2 -fstack-protector-strong -fno-strict-overflow -fvisibility=hidden -fexcess-precision=standard -DRUBY_EXPORT -I. -I.ext/include/x86_64-linux -I/tmp/ruby/src/trunk/include -I/tmp/ruby/src/trunk -I/tmp/ruby/src/trunk/prism -I/tmp/ruby/src/trunk/enc/unicode/15.0.0 I, [2024-05-15T06:09:24.255874 #2385316] INFO -- : CPPFLAGS = I, [2024-05-15T06:09:24.255877 #2385316] INFO -- : DLDFLAGS = -Wl,--compress-debug-sections=zlib -Wl,-soname,libruby.so.3.4 -fstack-protector-strong I, [2024-05-15T06:09:24.255881 #2385316] INFO -- : SOLIBS = -lz -lrt -lrt -lgmp -ldl -lcrypt -lm -lpthread I, [2024-05-15T06:09:24.255884 #2385316] INFO -- : LANG = en_US.UTF-8 I, [2024-05-15T06:09:24.255888 #2385316] INFO -- : LC_ALL = I, [2024-05-15T06:09:24.255891 #2385316] INFO -- : LC_CTYPE = I, [2024-05-15T06:09:24.255895 #2385316] INFO -- : MFLAGS = -j20 --jobserver-auth=4,5 I, [2024-05-15T06:09:24.255899 #2385316] INFO -- : RUSTC = no I, [2024-05-15T06:09:24.255903 #2385316] INFO -- : YJIT_RUSTC_ARGS = --crate-name=yjit --crate-type=staticlib --edition=2021 -g -C lto=thin -C opt-level=3 -C overflow-checks=on '--out-dir=/tmp/ruby/build/trunk/yjit/target/release/' /tmp/ruby/src/trunk/yjit/src/lib.rs I, [2024-05-15T06:09:24.257300 #2385316] INFO -- : gcc (Ubuntu 11.4.0-1ubuntu1~22.04) 11.4.0 I, [2024-05-15T06:09:24.257320 #2385316] INFO -- : Copyright (C) 2021 Free Software Foundation, Inc. I, [2024-05-15T06:09:24.257326 #2385316] INFO -- : This is free software; see the source for copying conditions. There is NO I, [2024-05-15T06:09:24.257330 #2385316] INFO -- : warranty; not even for MERCHANTABILITY or FITNESS FOR A PARTICULAR PURPOSE. I, [2024-05-15T06:09:24.257334 #2385316] INFO -- : I, [2024-05-15T06:09:24.363470 #2385316] INFO -- : builtin_binary.inc updated I, [2024-05-15T06:09:24.367810 #2385316] INFO -- : c5234a9416e4f20f175185e840b25b0f08674d14078ed7083f37e655458e3ca9 builtin_binary.inc I, [2024-05-15T06:09:24.368476 #2385316] INFO -- : compiling /tmp/ruby/src/trunk/builtin.c I, [2024-05-15T06:09:24.550831 #2385316] INFO -- : linking static-library libruby-static.a I, [2024-05-15T06:09:24.863432 #2385316] INFO -- : linking shared-library libruby.so.3.4.0 I, [2024-05-15T06:09:26.447626 #2385316] INFO -- : linking ruby I, [2024-05-15T06:09:26.471592 #2385316] INFO -- : $$$[end] "make ruby -j20" exit with 0. I, [2024-05-15T06:09:26.471751 #2385316] INFO -- : $$$[beg] make all -j20 I, [2024-05-15T06:09:26.535740 #2385316] INFO -- : BASERUBY = /usr/bin/ruby --disable=gems I, [2024-05-15T06:09:26.535836 #2385316] INFO -- : CC = gcc I, [2024-05-15T06:09:26.535845 #2385316] INFO -- : LD = ld I, [2024-05-15T06:09:26.535852 #2385316] INFO -- : LDSHARED = gcc -shared I, [2024-05-15T06:09:26.535859 #2385316] INFO -- : CFLAGS = -O3 -fno-fast-math -ggdb3 -Wall -Wextra -Wdeprecated-declarations -Wdiv-by-zero -Wduplicated-cond -Wimplicit-function-declaration -Wimplicit-int -Wpointer-arith -Wwrite-strings -Wold-style-definition -Wimplicit-fallthrough=0 -Wmissing-noreturn -Wno-cast-function-type -Wno-constant-logical-operand -Wno-long-long -Wno-missing-field-initializers -Wno-overlength-strings -Wno-packed-bitfield-compat -Wno-parentheses-equality -Wno-self-assign -Wno-tautological-compare -Wno-unused-parameter -Wno-unused-value -Wsuggest-attribute=format -Wsuggest-attribute=noreturn -Wunused-variable -Wmisleading-indentation -Wundef -fPIC I, [2024-05-15T06:09:26.535874 #2385316] INFO -- : XCFLAGS = -U_FORTIFY_SOURCE -D_FORTIFY_SOURCE=2 -fstack-protector-strong -fno-strict-overflow -fvisibility=hidden -fexcess-precision=standard -DRUBY_EXPORT -I. -I.ext/include/x86_64-linux -I/tmp/ruby/src/trunk/include -I/tmp/ruby/src/trunk -I/tmp/ruby/src/trunk/prism -I/tmp/ruby/src/trunk/enc/unicode/15.0.0 I, [2024-05-15T06:09:26.535880 #2385316] INFO -- : CPPFLAGS = I, [2024-05-15T06:09:26.535886 #2385316] INFO -- : DLDFLAGS = -Wl,--compress-debug-sections=zlib -Wl,-soname,libruby.so.3.4 -fstack-protector-strong I, [2024-05-15T06:09:26.535893 #2385316] INFO -- : SOLIBS = -lz -lrt -lrt -lgmp -ldl -lcrypt -lm -lpthread I, [2024-05-15T06:09:26.535899 #2385316] INFO -- : LANG = en_US.UTF-8 I, [2024-05-15T06:09:26.535905 #2385316] INFO -- : LC_ALL = I, [2024-05-15T06:09:26.535911 #2385316] INFO -- : LC_CTYPE = I, [2024-05-15T06:09:26.535917 #2385316] INFO -- : MFLAGS = -j20 --jobserver-auth=4,5 I, [2024-05-15T06:09:26.535923 #2385316] INFO -- : RUSTC = no I, [2024-05-15T06:09:26.535931 #2385316] INFO -- : YJIT_RUSTC_ARGS = --crate-name=yjit --crate-type=staticlib --edition=2021 -g -C lto=thin -C opt-level=3 -C overflow-checks=on '--out-dir=/tmp/ruby/build/trunk/yjit/target/release/' /tmp/ruby/src/trunk/yjit/src/lib.rs I, [2024-05-15T06:09:26.537894 #2385316] INFO -- : gcc (Ubuntu 11.4.0-1ubuntu1~22.04) 11.4.0 I, [2024-05-15T06:09:26.537930 #2385316] INFO -- : Copyright (C) 2021 Free Software Foundation, Inc. I, [2024-05-15T06:09:26.537944 #2385316] INFO -- : This is free software; see the source for copying conditions. There is NO I, [2024-05-15T06:09:26.537951 #2385316] INFO -- : warranty; not even for MERCHANTABILITY or FITNESS FOR A PARTICULAR PURPOSE. I, [2024-05-15T06:09:26.537958 #2385316] INFO -- : I, [2024-05-15T06:09:26.570030 #2385316] INFO -- : generating enc.mk I, [2024-05-15T06:09:26.572064 #2385316] INFO -- : building spec/ruby/optional/capi/ext/array_spec.so I, [2024-05-15T06:09:26.572103 #2385316] INFO -- : building spec/ruby/optional/capi/ext/basic_object_spec.so I, [2024-05-15T06:09:26.572939 #2385316] INFO -- : building spec/ruby/optional/capi/ext/bignum_spec.so I, [2024-05-15T06:09:26.573865 #2385316] INFO -- : building spec/ruby/optional/capi/ext/binding_spec.so I, [2024-05-15T06:09:26.574027 #2385316] INFO -- : building spec/ruby/optional/capi/ext/boolean_spec.so I, [2024-05-15T06:09:26.574641 #2385316] INFO -- : building spec/ruby/optional/capi/ext/class_id_under_autoload_spec.so I, [2024-05-15T06:09:26.575353 #2385316] INFO -- : building spec/ruby/optional/capi/ext/class_spec.so I, [2024-05-15T06:09:26.575749 #2385316] INFO -- : building spec/ruby/optional/capi/ext/class_under_autoload_spec.so I, [2024-05-15T06:09:26.576079 #2385316] INFO -- : building spec/ruby/optional/capi/ext/complex_spec.so I, [2024-05-15T06:09:26.577320 #2385316] INFO -- : building spec/ruby/optional/capi/ext/constants_spec.so I, [2024-05-15T06:09:26.577658 #2385316] INFO -- : building spec/ruby/optional/capi/ext/data_spec.so I, [2024-05-15T06:09:26.578423 #2385316] INFO -- : building spec/ruby/optional/capi/ext/debug_spec.so I, [2024-05-15T06:09:26.579372 #2385316] INFO -- : building spec/ruby/optional/capi/ext/encoding_spec.so I, [2024-05-15T06:09:26.579646 #2385316] INFO -- : building spec/ruby/optional/capi/ext/enumerator_spec.so I, [2024-05-15T06:09:26.580285 #2385316] INFO -- : building spec/ruby/optional/capi/ext/exception_spec.so I, [2024-05-15T06:09:26.580652 #2385316] INFO -- : building spec/ruby/optional/capi/ext/fiber_spec.so I, [2024-05-15T06:09:26.581301 #2385316] INFO -- : building spec/ruby/optional/capi/ext/file_spec.so I, [2024-05-15T06:09:26.581574 #2385316] INFO -- : building spec/ruby/optional/capi/ext/fixnum_spec.so I, [2024-05-15T06:09:26.582556 #2385316] INFO -- : building spec/ruby/optional/capi/ext/float_spec.so I, [2024-05-15T06:09:26.707580 #2385316] INFO -- : building spec/ruby/optional/capi/ext/gc_spec.so I, [2024-05-15T06:09:26.720792 #2385316] INFO -- : building spec/ruby/optional/capi/ext/globals_spec.so I, [2024-05-15T06:09:26.722572 #2385316] INFO -- : building spec/ruby/optional/capi/ext/hash_spec.so I, [2024-05-15T06:09:26.729547 #2385316] INFO -- : building spec/ruby/optional/capi/ext/integer_spec.so I, [2024-05-15T06:09:26.731215 #2385316] INFO -- : building spec/ruby/optional/capi/ext/io_spec.so I, [2024-05-15T06:09:26.732711 #2385316] INFO -- : building spec/ruby/optional/capi/ext/kernel_spec.so I, [2024-05-15T06:09:26.738383 #2385316] INFO -- : building spec/ruby/optional/capi/ext/marshal_spec.so I, [2024-05-15T06:09:26.738456 #2385316] INFO -- : building spec/ruby/optional/capi/ext/language_spec.so I, [2024-05-15T06:09:26.739964 #2385316] INFO -- : building spec/ruby/optional/capi/ext/module_spec.so I, [2024-05-15T06:09:26.744400 #2385316] INFO -- : building spec/ruby/optional/capi/ext/module_under_autoload_spec.so I, [2024-05-15T06:09:26.749592 #2385316] INFO -- : building spec/ruby/optional/capi/ext/mutex_spec.so I, [2024-05-15T06:09:26.750381 #2385316] INFO -- : building spec/ruby/optional/capi/ext/numeric_spec.so I, [2024-05-15T06:09:26.751620 #2385316] INFO -- : building spec/ruby/optional/capi/ext/object_spec.so I, [2024-05-15T06:09:26.758461 #2385316] INFO -- : building spec/ruby/optional/capi/ext/proc_spec.so I, [2024-05-15T06:09:26.773989 #2385316] INFO -- : building spec/ruby/optional/capi/ext/range_spec.so I, [2024-05-15T06:09:26.776487 #2385316] INFO -- : building spec/ruby/optional/capi/ext/rational_spec.so I, [2024-05-15T06:09:26.818474 #2385316] INFO -- : building spec/ruby/optional/capi/ext/rbasic_spec.so I, [2024-05-15T06:09:26.830735 #2385316] INFO -- : building spec/ruby/optional/capi/ext/regexp_spec.so I, [2024-05-15T06:09:26.881555 #2385316] INFO -- : building spec/ruby/optional/capi/ext/string_spec.so I, [2024-05-15T06:09:26.884378 #2385316] INFO -- : building spec/ruby/optional/capi/ext/struct_spec.so I, [2024-05-15T06:09:26.885173 #2385316] INFO -- : building spec/ruby/optional/capi/ext/st_spec.so I, [2024-05-15T06:09:26.899968 #2385316] INFO -- : building spec/ruby/optional/capi/ext/symbol_spec.so I, [2024-05-15T06:09:26.901075 #2385316] INFO -- : building spec/ruby/optional/capi/ext/thread_spec.so I, [2024-05-15T06:09:26.901557 #2385316] INFO -- : building spec/ruby/optional/capi/ext/time_spec.so I, [2024-05-15T06:09:26.902063 #2385316] INFO -- : building spec/ruby/optional/capi/ext/tracepoint_spec.so I, [2024-05-15T06:09:26.905688 #2385316] INFO -- : building spec/ruby/optional/capi/ext/typed_data_spec.so I, [2024-05-15T06:09:26.912619 #2385316] INFO -- : building spec/ruby/optional/capi/ext/util_spec.so I, [2024-05-15T06:09:26.939050 #2385316] INFO -- : making enc I, [2024-05-15T06:09:26.940249 #2385316] INFO -- : making srcs under enc I, [2024-05-15T06:09:26.966019 #2385316] INFO -- : make[1]: Entering directory '/tmp/ruby/build/trunk' I, [2024-05-15T06:09:26.966091 #2385316] INFO -- : make[1]: Nothing to be done for 'enc'. I, [2024-05-15T06:09:26.966104 #2385316] INFO -- : make[1]: Leaving directory '/tmp/ruby/build/trunk' I, [2024-05-15T06:09:26.986671 #2385316] INFO -- : make[1]: Entering directory '/tmp/ruby/build/trunk' I, [2024-05-15T06:09:26.986729 #2385316] INFO -- : make[1]: Nothing to be done for 'srcs'. I, [2024-05-15T06:09:26.986739 #2385316] INFO -- : make[1]: Leaving directory '/tmp/ruby/build/trunk' I, [2024-05-15T06:09:26.987324 #2385316] INFO -- : generating transdb.h I, [2024-05-15T06:09:27.085024 #2385316] INFO -- : transdb.h unchanged I, [2024-05-15T06:09:27.086397 #2385316] INFO -- : generating makefiles ext/configure-ext.mk I, [2024-05-15T06:09:27.086627 #2385316] INFO -- : making trans I, [2024-05-15T06:09:27.112833 #2385316] INFO -- : ext/configure-ext.mk updated I, [2024-05-15T06:09:27.115281 #2385316] INFO -- : make[1]: Entering directory '/tmp/ruby/build/trunk' I, [2024-05-15T06:09:27.122413 #2385316] INFO -- : make[1]: Entering directory '/tmp/ruby/build/trunk' I, [2024-05-15T06:09:27.122486 #2385316] INFO -- : make[1]: Nothing to be done for 'trans'. I, [2024-05-15T06:09:27.122495 #2385316] INFO -- : make[1]: Leaving directory '/tmp/ruby/build/trunk' I, [2024-05-15T06:09:27.123229 #2385316] INFO -- : making encs I, [2024-05-15T06:09:27.181561 #2385316] INFO -- : make[1]: Entering directory '/tmp/ruby/build/trunk' I, [2024-05-15T06:09:27.181633 #2385316] INFO -- : make[1]: Nothing to be done for 'encs'. I, [2024-05-15T06:09:27.181660 #2385316] INFO -- : make[1]: Leaving directory '/tmp/ruby/build/trunk' I, [2024-05-15T06:09:27.267017 #2385316] INFO -- : make[1]: Leaving directory '/tmp/ruby/build/trunk' I, [2024-05-15T06:09:27.267547 #2385316] INFO -- : generating makefile exts.mk I, [2024-05-15T06:09:27.305135 #2385316] INFO -- : exts.mk unchanged I, [2024-05-15T06:09:27.310028 #2385316] INFO -- : make[1]: Entering directory '/tmp/ruby/build/trunk' I, [2024-05-15T06:09:27.328083 #2385316] INFO -- : make[2]: Entering directory '/tmp/ruby/build/trunk/ext/digest' I, [2024-05-15T06:09:27.329405 #2385316] INFO -- : make[2]: Entering directory '/tmp/ruby/build/trunk/ext/coverage' I, [2024-05-15T06:09:27.329955 #2385316] INFO -- : make[2]: Entering directory '/tmp/ruby/build/trunk/ext/json' I, [2024-05-15T06:09:27.330540 #2385316] INFO -- : make[2]: Entering directory '/tmp/ruby/build/trunk/ext/date' I, [2024-05-15T06:09:27.331002 #2385316] INFO -- : make[2]: Entering directory '/tmp/ruby/build/trunk/ext/io/console' I, [2024-05-15T06:09:27.331827 #2385316] INFO -- : make[2]: Leaving directory '/tmp/ruby/build/trunk/ext/digest' I, [2024-05-15T06:09:27.332060 #2385316] INFO -- : make[2]: Entering directory '/tmp/ruby/build/trunk/ext/monitor' I, [2024-05-15T06:09:27.332134 #2385316] INFO -- : make[2]: Entering directory '/tmp/ruby/build/trunk/ext/rubyvm' I, [2024-05-15T06:09:27.332631 #2385316] INFO -- : make[2]: Entering directory '/tmp/ruby/build/trunk/ext/pathname' I, [2024-05-15T06:09:27.332815 #2385316] INFO -- : make[2]: Entering directory '/tmp/ruby/build/trunk/ext/fiddle' I, [2024-05-15T06:09:27.333082 #2385316] INFO -- : make[2]: Leaving directory '/tmp/ruby/build/trunk/ext/coverage' I, [2024-05-15T06:09:27.333140 #2385316] INFO -- : make[2]: Entering directory '/tmp/ruby/build/trunk/ext/pty' I, [2024-05-15T06:09:27.333441 #2385316] INFO -- : make[2]: Leaving directory '/tmp/ruby/build/trunk/ext/io/console' I, [2024-05-15T06:09:27.333609 #2385316] INFO -- : make[2]: Entering directory '/tmp/ruby/build/trunk/ext/objspace' I, [2024-05-15T06:09:27.334051 #2385316] INFO -- : make[2]: Leaving directory '/tmp/ruby/build/trunk/ext/date' I, [2024-05-15T06:09:27.334103 #2385316] INFO -- : make[2]: Leaving directory '/tmp/ruby/build/trunk/ext/rubyvm' I, [2024-05-15T06:09:27.334120 #2385316] INFO -- : make[2]: Leaving directory '/tmp/ruby/build/trunk/ext/monitor' I, [2024-05-15T06:09:27.334713 #2385316] INFO -- : make[2]: Entering directory '/tmp/ruby/build/trunk/ext/psych' I, [2024-05-15T06:09:27.334880 #2385316] INFO -- : make[2]: Leaving directory '/tmp/ruby/build/trunk/ext/pathname' I, [2024-05-15T06:09:27.335539 #2385316] INFO -- : make[2]: Leaving directory '/tmp/ruby/build/trunk/ext/json' I, [2024-05-15T06:09:27.335827 #2385316] INFO -- : make[2]: Leaving directory '/tmp/ruby/build/trunk/ext/pty' I, [2024-05-15T06:09:27.336416 #2385316] INFO -- : make[2]: Leaving directory '/tmp/ruby/build/trunk/ext/objspace' I, [2024-05-15T06:09:27.337714 #2385316] INFO -- : make[2]: Entering directory '/tmp/ruby/build/trunk/.bundle/gems/nkf-0.2.0/ext/nkf' I, [2024-05-15T06:09:27.337843 #2385316] INFO -- : make[2]: Entering directory '/tmp/ruby/build/trunk/.bundle/gems/bigdecimal-3.1.8/ext/bigdecimal' I, [2024-05-15T06:09:27.337959 #2385316] INFO -- : make[2]: Entering directory '/tmp/ruby/build/trunk/.bundle/gems/debug-1.9.2/ext/debug' I, [2024-05-15T06:09:27.338023 #2385316] INFO -- : make[2]: Entering directory '/tmp/ruby/build/trunk/.bundle/gems/racc-1.7.3/ext/racc/cparse' I, [2024-05-15T06:09:27.338389 #2385316] INFO -- : make[2]: Entering directory '/tmp/ruby/build/trunk/.bundle/gems/syslog-0.1.2/ext/syslog' I, [2024-05-15T06:09:27.338580 #2385316] INFO -- : make[2]: Entering directory '/tmp/ruby/build/trunk/ext/ripper' I, [2024-05-15T06:09:27.338672 #2385316] INFO -- : make[2]: Entering directory '/tmp/ruby/build/trunk/.bundle/gems/rbs-3.4.4/ext/rbs_extension' I, [2024-05-15T06:09:27.339141 #2385316] INFO -- : make[2]: Leaving directory '/tmp/ruby/build/trunk/ext/fiddle' I, [2024-05-15T06:09:27.341647 #2385316] INFO -- : make[2]: Entering directory '/tmp/ruby/build/trunk/ext/digest/sha2' I, [2024-05-15T06:09:27.344403 #2385316] INFO -- : make[2]: Leaving directory '/tmp/ruby/build/trunk/ext/ripper' I, [2024-05-15T06:09:27.344531 #2385316] INFO -- : make[2]: Leaving directory '/tmp/ruby/build/trunk/ext/psych' I, [2024-05-15T06:09:27.345055 #2385316] INFO -- : make[2]: Leaving directory '/tmp/ruby/build/trunk/ext/digest/sha2' I, [2024-05-15T06:09:27.346359 #2385316] INFO -- : make[2]: Entering directory '/tmp/ruby/build/trunk/ext/openssl' I, [2024-05-15T06:09:27.350771 #2385316] INFO -- : make[2]: Entering directory '/tmp/ruby/build/trunk/ext/socket' I, [2024-05-15T06:09:27.356910 #2385316] INFO -- : make[2]: Leaving directory '/tmp/ruby/build/trunk/ext/socket' I, [2024-05-15T06:09:27.357556 #2385316] INFO -- : make[2]: Leaving directory '/tmp/ruby/build/trunk/ext/openssl' I, [2024-05-15T06:09:27.360881 #2385316] INFO -- : make[2]: Leaving directory '/tmp/ruby/build/trunk/.bundle/gems/rbs-3.4.4/ext/rbs_extension' I, [2024-05-15T06:09:27.361378 #2385316] INFO -- : make[2]: Leaving directory '/tmp/ruby/build/trunk/.bundle/gems/nkf-0.2.0/ext/nkf' I, [2024-05-15T06:09:27.362239 #2385316] INFO -- : make[2]: Leaving directory '/tmp/ruby/build/trunk/.bundle/gems/syslog-0.1.2/ext/syslog' I, [2024-05-15T06:09:27.363412 #2385316] INFO -- : make[2]: Leaving directory '/tmp/ruby/build/trunk/.bundle/gems/bigdecimal-3.1.8/ext/bigdecimal' I, [2024-05-15T06:09:27.368702 #2385316] INFO -- : make[2]: Leaving directory '/tmp/ruby/build/trunk/.bundle/gems/racc-1.7.3/ext/racc/cparse' I, [2024-05-15T06:09:27.369020 #2385316] INFO -- : make[2]: Leaving directory '/tmp/ruby/build/trunk/.bundle/gems/debug-1.9.2/ext/debug' I, [2024-05-15T06:09:27.392844 #2385316] INFO -- : make[2]: Entering directory '/tmp/ruby/build/trunk' I, [2024-05-15T06:09:27.461652 #2385316] INFO -- : linking ruby I, [2024-05-15T06:09:27.483779 #2385316] INFO -- : make[2]: Leaving directory '/tmp/ruby/build/trunk' I, [2024-05-15T06:09:27.484434 #2385316] INFO -- : make[1]: Leaving directory '/tmp/ruby/build/trunk' I, [2024-05-15T06:09:27.488019 #2385316] INFO -- : make[1]: Entering directory '/tmp/ruby/build/trunk' I, [2024-05-15T06:09:27.488042 #2385316] INFO -- : make[1]: Nothing to be done for 'note'. I, [2024-05-15T06:09:27.488047 #2385316] INFO -- : make[1]: Leaving directory '/tmp/ruby/build/trunk' I, [2024-05-15T06:09:27.488857 #2385316] INFO -- : $$$[end] "make all -j20" exit with 0. I, [2024-05-15T06:09:27.488991 #2385316] INFO -- : $$$[beg] make install -j20 I, [2024-05-15T06:09:27.559913 #2385316] INFO -- : Update minitest to ea9caafc0754b1d6236a490d59e624b53209734a I, [2024-05-15T06:09:27.560112 #2385316] INFO -- : Update power_assert to 84e85124c5014a139af39161d484156cfe87a9ed I, [2024-05-15T06:09:27.560282 #2385316] INFO -- : Update rbs to ba7872795d5de04adb8ff500c0e6afdc81a041dd I, [2024-05-15T06:09:27.561282 #2385316] INFO -- : Update typeprof to b19a6416da3a05d57fadd6ffdadb382b6d236ca5 I, [2024-05-15T06:09:27.562227 #2385316] INFO -- : echo ea9caafc0754b1d6236a490d59e624b53209734a | /bin/sh /tmp/ruby/src/trunk/tool/ifchange /tmp/ruby/src/trunk/.bundle/.timestamp/minitest.revision - I, [2024-05-15T06:09:27.562463 #2385316] INFO -- : echo 84e85124c5014a139af39161d484156cfe87a9ed | /bin/sh /tmp/ruby/src/trunk/tool/ifchange /tmp/ruby/src/trunk/.bundle/.timestamp/power_assert.revision - I, [2024-05-15T06:09:27.562837 #2385316] INFO -- : echo ba7872795d5de04adb8ff500c0e6afdc81a041dd | /bin/sh /tmp/ruby/src/trunk/tool/ifchange /tmp/ruby/src/trunk/.bundle/.timestamp/rbs.revision - I, [2024-05-15T06:09:27.563518 #2385316] INFO -- : BASERUBY = /usr/bin/ruby --disable=gems I, [2024-05-15T06:09:27.563546 #2385316] INFO -- : CC = gcc I, [2024-05-15T06:09:27.563554 #2385316] INFO -- : LD = ld I, [2024-05-15T06:09:27.563561 #2385316] INFO -- : LDSHARED = gcc -shared I, [2024-05-15T06:09:27.563566 #2385316] INFO -- : CFLAGS = -O3 -fno-fast-math -ggdb3 -Wall -Wextra -Wdeprecated-declarations -Wdiv-by-zero -Wduplicated-cond -Wimplicit-function-declaration -Wimplicit-int -Wpointer-arith -Wwrite-strings -Wold-style-definition -Wimplicit-fallthrough=0 -Wmissing-noreturn -Wno-cast-function-type -Wno-constant-logical-operand -Wno-long-long -Wno-missing-field-initializers -Wno-overlength-strings -Wno-packed-bitfield-compat -Wno-parentheses-equality -Wno-self-assign -Wno-tautological-compare -Wno-unused-parameter -Wno-unused-value -Wsuggest-attribute=format -Wsuggest-attribute=noreturn -Wunused-variable -Wmisleading-indentation -Wundef -fPIC I, [2024-05-15T06:09:27.563572 #2385316] INFO -- : XCFLAGS = -U_FORTIFY_SOURCE -D_FORTIFY_SOURCE=2 -fstack-protector-strong -fno-strict-overflow -fvisibility=hidden -fexcess-precision=standard -DRUBY_EXPORT -I. -I.ext/include/x86_64-linux -I/tmp/ruby/src/trunk/include -I/tmp/ruby/src/trunk -I/tmp/ruby/src/trunk/prism -I/tmp/ruby/src/trunk/enc/unicode/15.0.0 I, [2024-05-15T06:09:27.563577 #2385316] INFO -- : CPPFLAGS = I, [2024-05-15T06:09:27.563583 #2385316] INFO -- : DLDFLAGS = -Wl,--compress-debug-sections=zlib -Wl,-soname,libruby.so.3.4 -fstack-protector-strong I, [2024-05-15T06:09:27.563588 #2385316] INFO -- : SOLIBS = -lz -lrt -lrt -lgmp -ldl -lcrypt -lm -lpthread I, [2024-05-15T06:09:27.563593 #2385316] INFO -- : LANG = en_US.UTF-8 I, [2024-05-15T06:09:27.563599 #2385316] INFO -- : LC_ALL = I, [2024-05-15T06:09:27.563604 #2385316] INFO -- : LC_CTYPE = I, [2024-05-15T06:09:27.563609 #2385316] INFO -- : MFLAGS = -j20 --jobserver-auth=4,5 I, [2024-05-15T06:09:27.563613 #2385316] INFO -- : RUSTC = no I, [2024-05-15T06:09:27.563618 #2385316] INFO -- : YJIT_RUSTC_ARGS = --crate-name=yjit --crate-type=staticlib --edition=2021 -g -C lto=thin -C opt-level=3 -C overflow-checks=on '--out-dir=/tmp/ruby/build/trunk/yjit/target/release/' /tmp/ruby/src/trunk/yjit/src/lib.rs I, [2024-05-15T06:09:27.564716 #2385316] INFO -- : /tmp/ruby/src/trunk/.bundle/.timestamp/minitest.revision unchanged I, [2024-05-15T06:09:27.565065 #2385316] INFO -- : /tmp/ruby/src/trunk/.bundle/.timestamp/power_assert.revision unchanged I, [2024-05-15T06:09:27.565094 #2385316] INFO -- : /tmp/ruby/src/trunk/.bundle/.timestamp/rbs.revision unchanged I, [2024-05-15T06:09:27.595149 #2385316] INFO -- : echo b19a6416da3a05d57fadd6ffdadb382b6d236ca5 | /bin/sh /tmp/ruby/src/trunk/tool/ifchange /tmp/ruby/src/trunk/.bundle/.timestamp/typeprof.revision - I, [2024-05-15T06:09:27.595812 #2385316] INFO -- : generating enc.mk I, [2024-05-15T06:09:27.595842 #2385316] INFO -- : gcc (Ubuntu 11.4.0-1ubuntu1~22.04) 11.4.0 I, [2024-05-15T06:09:27.595848 #2385316] INFO -- : Copyright (C) 2021 Free Software Foundation, Inc. I, [2024-05-15T06:09:27.595852 #2385316] INFO -- : This is free software; see the source for copying conditions. There is NO I, [2024-05-15T06:09:27.595856 #2385316] INFO -- : warranty; not even for MERCHANTABILITY or FITNESS FOR A PARTICULAR PURPOSE. I, [2024-05-15T06:09:27.595860 #2385316] INFO -- : I, [2024-05-15T06:09:27.597192 #2385316] INFO -- : /tmp/ruby/src/trunk/.bundle/.timestamp/typeprof.revision unchanged I, [2024-05-15T06:09:27.717029 #2385316] INFO -- : Building power_assert@84e85124c5014a139af39161d484156cfe87a9ed to /tmp/ruby/src/trunk/gems/power_assert-2.0.3.gem I, [2024-05-15T06:09:27.717669 #2385316] INFO -- : making srcs under enc I, [2024-05-15T06:09:27.718048 #2385316] INFO -- : making enc I, [2024-05-15T06:09:27.734684 #2385316] INFO -- : make[1]: Entering directory '/tmp/ruby/build/trunk' I, [2024-05-15T06:09:27.734722 #2385316] INFO -- : make[1]: Nothing to be done for 'enc'. I, [2024-05-15T06:09:27.734734 #2385316] INFO -- : make[1]: Leaving directory '/tmp/ruby/build/trunk' I, [2024-05-15T06:09:27.747322 #2385316] INFO -- : make[1]: Entering directory '/tmp/ruby/build/trunk' I, [2024-05-15T06:09:27.747367 #2385316] INFO -- : make[1]: Nothing to be done for 'srcs'. I, [2024-05-15T06:09:27.747380 #2385316] INFO -- : make[1]: Leaving directory '/tmp/ruby/build/trunk' I, [2024-05-15T06:09:27.748105 #2385316] INFO -- : generating transdb.h I, [2024-05-15T06:09:27.785504 #2385316] INFO -- : Successfully built RubyGem I, [2024-05-15T06:09:27.785558 #2385316] INFO -- : Name: power_assert I, [2024-05-15T06:09:27.785574 #2385316] INFO -- : Version: 2.0.4dev I, [2024-05-15T06:09:27.785588 #2385316] INFO -- : File: power_assert-2.0.4dev.gem I, [2024-05-15T06:09:27.787517 #2385316] INFO -- : Extracting bundle gem power_assert-2.0.3... I, [2024-05-15T06:09:27.846169 #2385316] INFO -- : transdb.h unchanged I, [2024-05-15T06:09:27.847773 #2385316] INFO -- : generating makefiles ext/configure-ext.mk I, [2024-05-15T06:09:27.847912 #2385316] INFO -- : making trans I, [2024-05-15T06:09:27.848222 #2385316] INFO -- : Try with hash version of bundled gems instead of gems/power_assert-2.0.3.gem. We don't use this gem with release version of Ruby. I, [2024-05-15T06:09:27.853326 #2385316] INFO -- : Unpacked gems/power_assert-2.0.4dev.gem I, [2024-05-15T06:09:27.874336 #2385316] INFO -- : ext/configure-ext.mk unchanged I, [2024-05-15T06:09:27.876633 #2385316] INFO -- : make[1]: Entering directory '/tmp/ruby/build/trunk' I, [2024-05-15T06:09:27.884053 #2385316] INFO -- : make[1]: Entering directory '/tmp/ruby/build/trunk' I, [2024-05-15T06:09:27.884151 #2385316] INFO -- : make[1]: Nothing to be done for 'trans'. I, [2024-05-15T06:09:27.884184 #2385316] INFO -- : make[1]: Leaving directory '/tmp/ruby/build/trunk' I, [2024-05-15T06:09:27.957989 #2385316] INFO -- : making encs I, [2024-05-15T06:09:28.017306 #2385316] INFO -- : make[1]: Entering directory '/tmp/ruby/build/trunk' I, [2024-05-15T06:09:28.017371 #2385316] INFO -- : make[1]: Nothing to be done for 'encs'. I, [2024-05-15T06:09:28.017387 #2385316] INFO -- : make[1]: Leaving directory '/tmp/ruby/build/trunk' I, [2024-05-15T06:09:28.025937 #2385316] INFO -- : make[1]: Leaving directory '/tmp/ruby/build/trunk' I, [2024-05-15T06:09:28.026628 #2385316] INFO -- : generating makefile exts.mk I, [2024-05-15T06:09:28.063913 #2385316] INFO -- : exts.mk unchanged I, [2024-05-15T06:09:28.068473 #2385316] INFO -- : make[1]: Entering directory '/tmp/ruby/build/trunk' I, [2024-05-15T06:09:28.086918 #2385316] INFO -- : make[2]: Entering directory '/tmp/ruby/build/trunk/ext/digest' I, [2024-05-15T06:09:28.087983 #2385316] INFO -- : make[2]: Entering directory '/tmp/ruby/build/trunk/ext/json' I, [2024-05-15T06:09:28.088710 #2385316] INFO -- : make[2]: Entering directory '/tmp/ruby/build/trunk/ext/coverage' I, [2024-05-15T06:09:28.088999 #2385316] INFO -- : make[2]: Entering directory '/tmp/ruby/build/trunk/ext/io/console' I, [2024-05-15T06:09:28.089338 #2385316] INFO -- : make[2]: Entering directory '/tmp/ruby/build/trunk/ext/date' I, [2024-05-15T06:09:28.090359 #2385316] INFO -- : make[2]: Entering directory '/tmp/ruby/build/trunk/ext/rubyvm' I, [2024-05-15T06:09:28.090385 #2385316] INFO -- : make[2]: Entering directory '/tmp/ruby/build/trunk/ext/monitor' I, [2024-05-15T06:09:28.091055 #2385316] INFO -- : make[2]: Entering directory '/tmp/ruby/build/trunk/ext/pathname' I, [2024-05-15T06:09:28.091401 #2385316] INFO -- : make[2]: Entering directory '/tmp/ruby/build/trunk/ext/fiddle' I, [2024-05-15T06:09:28.091818 #2385316] INFO -- : make[2]: Entering directory '/tmp/ruby/build/trunk/ext/pty' I, [2024-05-15T06:09:28.092398 #2385316] INFO -- : make[2]: Leaving directory '/tmp/ruby/build/trunk/ext/io/console' I, [2024-05-15T06:09:28.092557 #2385316] INFO -- : make[2]: Entering directory '/tmp/ruby/build/trunk/ext/objspace' I, [2024-05-15T06:09:28.092951 #2385316] INFO -- : make[2]: Leaving directory '/tmp/ruby/build/trunk/ext/monitor' I, [2024-05-15T06:09:28.093266 #2385316] INFO -- : make[2]: Leaving directory '/tmp/ruby/build/trunk/ext/digest' I, [2024-05-15T06:09:28.093290 #2385316] INFO -- : make[2]: Entering directory '/tmp/ruby/build/trunk/ext/psych' I, [2024-05-15T06:09:28.093335 #2385316] INFO -- : make[2]: Leaving directory '/tmp/ruby/build/trunk/ext/json' I, [2024-05-15T06:09:28.093487 #2385316] INFO -- : make[2]: Leaving directory '/tmp/ruby/build/trunk/ext/date' I, [2024-05-15T06:09:28.093535 #2385316] INFO -- : make[2]: Leaving directory '/tmp/ruby/build/trunk/ext/pathname' I, [2024-05-15T06:09:28.094318 #2385316] INFO -- : make[2]: Leaving directory '/tmp/ruby/build/trunk/ext/rubyvm' I, [2024-05-15T06:09:28.094494 #2385316] INFO -- : make[2]: Leaving directory '/tmp/ruby/build/trunk/ext/pty' I, [2024-05-15T06:09:28.094658 #2385316] INFO -- : make[2]: Leaving directory '/tmp/ruby/build/trunk/ext/coverage' I, [2024-05-15T06:09:28.095166 #2385316] INFO -- : make[2]: Entering directory '/tmp/ruby/build/trunk/.bundle/gems/bigdecimal-3.1.8/ext/bigdecimal' I, [2024-05-15T06:09:28.095225 #2385316] INFO -- : make[2]: Entering directory '/tmp/ruby/build/trunk/.bundle/gems/debug-1.9.2/ext/debug' I, [2024-05-15T06:09:28.095322 #2385316] INFO -- : make[2]: Entering directory '/tmp/ruby/build/trunk/.bundle/gems/nkf-0.2.0/ext/nkf' I, [2024-05-15T06:09:28.095834 #2385316] INFO -- : make[2]: Entering directory '/tmp/ruby/build/trunk/.bundle/gems/racc-1.7.3/ext/racc/cparse' I, [2024-05-15T06:09:28.095960 #2385316] INFO -- : make[2]: Entering directory '/tmp/ruby/build/trunk/.bundle/gems/syslog-0.1.2/ext/syslog' I, [2024-05-15T06:09:28.096041 #2385316] INFO -- : make[2]: Entering directory '/tmp/ruby/build/trunk/ext/ripper' I, [2024-05-15T06:09:28.096368 #2385316] INFO -- : make[2]: Entering directory '/tmp/ruby/build/trunk/.bundle/gems/rbs-3.4.4/ext/rbs_extension' I, [2024-05-15T06:09:28.097548 #2385316] INFO -- : make[2]: Leaving directory '/tmp/ruby/build/trunk/ext/objspace' I, [2024-05-15T06:09:28.098127 #2385316] INFO -- : make[2]: Leaving directory '/tmp/ruby/build/trunk/ext/fiddle' I, [2024-05-15T06:09:28.098778 #2385316] INFO -- : make[2]: Entering directory '/tmp/ruby/build/trunk/ext/digest/sha2' I, [2024-05-15T06:09:28.101439 #2385316] INFO -- : make[2]: Entering directory '/tmp/ruby/build/trunk/ext/socket' I, [2024-05-15T06:09:28.102031 #2385316] INFO -- : make[2]: Leaving directory '/tmp/ruby/build/trunk/ext/ripper' I, [2024-05-15T06:09:28.102058 #2385316] INFO -- : make[2]: Leaving directory '/tmp/ruby/build/trunk/ext/digest/sha2' I, [2024-05-15T06:09:28.105182 #2385316] INFO -- : make[2]: Leaving directory '/tmp/ruby/build/trunk/ext/psych' I, [2024-05-15T06:09:28.105655 #2385316] INFO -- : make[2]: Entering directory '/tmp/ruby/build/trunk/ext/openssl' I, [2024-05-15T06:09:28.107458 #2385316] INFO -- : make[2]: Leaving directory '/tmp/ruby/build/trunk/ext/socket' I, [2024-05-15T06:09:28.117034 #2385316] INFO -- : make[2]: Leaving directory '/tmp/ruby/build/trunk/ext/openssl' I, [2024-05-15T06:09:28.119587 #2385316] INFO -- : make[2]: Leaving directory '/tmp/ruby/build/trunk/.bundle/gems/syslog-0.1.2/ext/syslog' I, [2024-05-15T06:09:28.120414 #2385316] INFO -- : make[2]: Leaving directory '/tmp/ruby/build/trunk/.bundle/gems/nkf-0.2.0/ext/nkf' I, [2024-05-15T06:09:28.126144 #2385316] INFO -- : make[2]: Leaving directory '/tmp/ruby/build/trunk/.bundle/gems/debug-1.9.2/ext/debug' I, [2024-05-15T06:09:28.127952 #2385316] INFO -- : make[2]: Leaving directory '/tmp/ruby/build/trunk/.bundle/gems/racc-1.7.3/ext/racc/cparse' I, [2024-05-15T06:09:28.127977 #2385316] INFO -- : make[2]: Leaving directory '/tmp/ruby/build/trunk/.bundle/gems/rbs-3.4.4/ext/rbs_extension' I, [2024-05-15T06:09:28.130589 #2385316] INFO -- : make[2]: Leaving directory '/tmp/ruby/build/trunk/.bundle/gems/bigdecimal-3.1.8/ext/bigdecimal' I, [2024-05-15T06:09:28.155728 #2385316] INFO -- : make[2]: Entering directory '/tmp/ruby/build/trunk' I, [2024-05-15T06:09:28.222935 #2385316] INFO -- : make[2]: 'ruby' is up to date. I, [2024-05-15T06:09:28.222971 #2385316] INFO -- : make[2]: Leaving directory '/tmp/ruby/build/trunk' I, [2024-05-15T06:09:28.223411 #2385316] INFO -- : make[1]: Leaving directory '/tmp/ruby/build/trunk' I, [2024-05-15T06:09:28.226975 #2385316] INFO -- : make[1]: Entering directory '/tmp/ruby/build/trunk' I, [2024-05-15T06:09:28.227001 #2385316] INFO -- : make[1]: Nothing to be done for 'note'. I, [2024-05-15T06:09:28.227007 #2385316] INFO -- : make[1]: Leaving directory '/tmp/ruby/build/trunk' I, [2024-05-15T06:09:28.227248 #2385316] INFO -- : ./miniruby -I/tmp/ruby/src/trunk/lib -I. -I.ext/common /tmp/ruby/src/trunk/tool/runruby.rb --extout=.ext -- --disable-gems -r./x86_64-linux-fake /tmp/ruby/src/trunk/tool/rbinstall.rb --make="make" --dest-dir="" --extout=".ext" --ext-build-dir="./ext" --mflags="-j20 --jobserver-auth=4,5" --make-flags=" -j20 --jobserver-auth=4,5" --data-mode=0644 --prog-mode=0755 --installed-list .installed.list --mantype="doc" --gnumake --install=all --exclude=doc I, [2024-05-15T06:09:28.322797 #2385316] INFO -- : Installing to I, [2024-05-15T06:09:28.322856 #2385316] INFO -- : installing binary commands: /tmp/ruby/install/trunk/bin I, [2024-05-15T06:09:28.322947 #2385316] INFO -- : installing base libraries: /tmp/ruby/install/trunk/lib I, [2024-05-15T06:09:28.330196 #2385316] INFO -- : installing arch files: /tmp/ruby/install/trunk/lib/ruby/3.4.0+0/x86_64-linux I, [2024-05-15T06:09:28.330221 #2385316] INFO -- : installing pkgconfig data: /tmp/ruby/install/trunk/lib/pkgconfig I, [2024-05-15T06:09:28.330232 #2385316] INFO -- : installing extension objects: /tmp/ruby/install/trunk/lib/ruby/3.4.0+0/x86_64-linux I, [2024-05-15T06:09:28.339862 #2385316] INFO -- : installing extension objects: /tmp/ruby/install/trunk/lib/ruby/site_ruby/3.4.0+0/x86_64-linux I, [2024-05-15T06:09:28.339889 #2385316] INFO -- : installing extension objects: /tmp/ruby/install/trunk/lib/ruby/vendor_ruby/3.4.0+0/x86_64-linux I, [2024-05-15T06:09:28.339895 #2385316] INFO -- : installing extension headers: /tmp/ruby/install/trunk/include/ruby-3.4.0+0/x86_64-linux I, [2024-05-15T06:09:28.340044 #2385316] INFO -- : installing extension scripts: /tmp/ruby/install/trunk/lib/ruby/3.4.0+0 I, [2024-05-15T06:09:28.344722 #2385316] INFO -- : installing extension scripts: /tmp/ruby/install/trunk/lib/ruby/site_ruby/3.4.0+0 I, [2024-05-15T06:09:28.344743 #2385316] INFO -- : installing extension scripts: /tmp/ruby/install/trunk/lib/ruby/vendor_ruby/3.4.0+0 I, [2024-05-15T06:09:28.344752 #2385316] INFO -- : installing extension headers: /tmp/ruby/install/trunk/include/ruby-3.4.0+0/ruby I, [2024-05-15T06:09:28.344756 #2385316] INFO -- : installing command scripts: /tmp/ruby/install/trunk/bin I, [2024-05-15T06:09:28.344761 #2385316] INFO -- : installing library scripts: /tmp/ruby/install/trunk/lib/ruby/3.4.0+0 I, [2024-05-15T06:09:28.376591 #2385316] INFO -- : installing common headers: /tmp/ruby/install/trunk/include/ruby-3.4.0+0 I, [2024-05-15T06:09:28.381541 #2385316] INFO -- : installing manpages: /tmp/ruby/install/trunk/share/man/man1 I, [2024-05-15T06:09:28.381564 #2385316] INFO -- : installing default gems from lib: /tmp/ruby/install/trunk/lib/ruby/gems/3.4.0+0 I, [2024-05-15T06:09:28.404433 #2385316] INFO -- : benchmark 0.3.0 I, [2024-05-15T06:09:28.411676 #2385316] INFO -- : bundler 2.6.0.dev I, [2024-05-15T06:09:28.413104 #2385316] INFO -- : cgi 0.4.1 I, [2024-05-15T06:09:28.413636 #2385316] INFO -- : delegate 0.3.1 I, [2024-05-15T06:09:28.414396 #2385316] INFO -- : did_you_mean 1.6.3 I, [2024-05-15T06:09:28.415071 #2385316] INFO -- : english 0.8.0 I, [2024-05-15T06:09:28.416315 #2385316] INFO -- : erb 4.0.4 I, [2024-05-15T06:09:28.417863 #2385316] INFO -- : error_highlight 0.6.0 I, [2024-05-15T06:09:28.418543 #2385316] INFO -- : fileutils 1.7.2 I, [2024-05-15T06:09:28.419022 #2385316] INFO -- : find 0.2.0 I, [2024-05-15T06:09:28.419501 #2385316] INFO -- : forwardable 1.3.3 I, [2024-05-15T06:09:28.419954 #2385316] INFO -- : ipaddr 1.2.6 I, [2024-05-15T06:09:28.420399 #2385316] INFO -- : irb 1.13.1 I, [2024-05-15T06:09:28.421139 #2385316] INFO -- : logger 1.6.0 I, [2024-05-15T06:09:28.421617 #2385316] INFO -- : net-http 0.4.1 I, [2024-05-15T06:09:28.422104 #2385316] INFO -- : net-protocol 0.2.2 I, [2024-05-15T06:09:28.422500 #2385316] INFO -- : open-uri 0.4.1 I, [2024-05-15T06:09:28.423003 #2385316] INFO -- : open3 0.2.1 I, [2024-05-15T06:09:28.423542 #2385316] INFO -- : optparse 0.5.0 I, [2024-05-15T06:09:28.424715 #2385316] INFO -- : ostruct 0.6.0 I, [2024-05-15T06:09:28.425207 #2385316] INFO -- : pp 0.5.0 I, [2024-05-15T06:09:28.425698 #2385316] INFO -- : prettyprint 0.2.0 I, [2024-05-15T06:09:28.426159 #2385316] INFO -- : prism 0.29.0 I, [2024-05-15T06:09:28.426648 #2385316] INFO -- : pstore 0.1.3 I, [2024-05-15T06:09:28.427116 #2385316] INFO -- : rdoc 6.6.3.1 I, [2024-05-15T06:09:28.428036 #2385316] INFO -- : readline 0.0.4 I, [2024-05-15T06:09:28.428569 #2385316] INFO -- : reline 0.5.7 I, [2024-05-15T06:09:28.429073 #2385316] INFO -- : resolv 0.4.0 I, [2024-05-15T06:09:28.429532 #2385316] INFO -- : ruby2_keywords 0.0.5 I, [2024-05-15T06:09:28.430008 #2385316] INFO -- : securerandom 0.3.1 I, [2024-05-15T06:09:28.431069 #2385316] INFO -- : set 1.1.0 I, [2024-05-15T06:09:28.431566 #2385316] INFO -- : shellwords 0.2.0 I, [2024-05-15T06:09:28.432078 #2385316] INFO -- : singleton 0.2.0 I, [2024-05-15T06:09:28.432480 #2385316] INFO -- : syntax_suggest 2.0.0 I, [2024-05-15T06:09:28.433235 #2385316] INFO -- : tempfile 0.2.1 I, [2024-05-15T06:09:28.433727 #2385316] INFO -- : time 0.3.0 I, [2024-05-15T06:09:28.434169 #2385316] INFO -- : timeout 0.4.1 I, [2024-05-15T06:09:28.434681 #2385316] INFO -- : tmpdir 0.2.0 I, [2024-05-15T06:09:28.435168 #2385316] INFO -- : tsort 0.2.0 I, [2024-05-15T06:09:28.435633 #2385316] INFO -- : un 0.3.0 I, [2024-05-15T06:09:28.436099 #2385316] INFO -- : uri 0.13.0 I, [2024-05-15T06:09:28.437119 #2385316] INFO -- : weakref 0.1.3 I, [2024-05-15T06:09:28.437634 #2385316] INFO -- : yaml 0.3.0 I, [2024-05-15T06:09:28.437989 #2385316] INFO -- : installing default gems from ext: /tmp/ruby/install/trunk/lib/ruby/gems/3.4.0+0 I, [2024-05-15T06:09:28.443884 #2385316] INFO -- : date 3.3.4 I, [2024-05-15T06:09:28.444387 #2385316] INFO -- : digest 3.1.1 I, [2024-05-15T06:09:28.445313 #2385316] INFO -- : etc 1.4.3 I, [2024-05-15T06:09:28.445997 #2385316] INFO -- : fcntl 1.1.0 I, [2024-05-15T06:09:28.446502 #2385316] INFO -- : fiddle 1.1.3 I, [2024-05-15T06:09:28.446981 #2385316] INFO -- : io-console 0.7.2 I, [2024-05-15T06:09:28.447444 #2385316] INFO -- : io-nonblock 0.3.0 I, [2024-05-15T06:09:28.447926 #2385316] INFO -- : io-wait 0.3.1 I, [2024-05-15T06:09:28.448725 #2385316] INFO -- : json 2.7.2 I, [2024-05-15T06:09:28.449631 #2385316] INFO -- : openssl 3.2.0 I, [2024-05-15T06:09:28.450547 #2385316] INFO -- : pathname 0.3.0 I, [2024-05-15T06:09:28.451307 #2385316] INFO -- : psych 5.1.2 I, [2024-05-15T06:09:28.452487 #2385316] INFO -- : stringio 3.1.1 I, [2024-05-15T06:09:28.453164 #2385316] INFO -- : strscan 3.1.1 I, [2024-05-15T06:09:28.453649 #2385316] INFO -- : zlib 3.1.0 I, [2024-05-15T06:09:28.454054 #2385316] INFO -- : installing bundled gems: /tmp/ruby/install/trunk/lib/ruby/gems/3.4.0+0 I, [2024-05-15T06:09:28.454337 #2385316] INFO -- : minitest 5.22.3 I, [2024-05-15T06:09:28.461882 #2385316] INFO -- : rake 13.2.1 I, [2024-05-15T06:09:28.465303 #2385316] INFO -- : test-unit 3.6.2 I, [2024-05-15T06:09:28.468726 #2385316] INFO -- : rexml 3.2.6 I, [2024-05-15T06:09:28.472624 #2385316] INFO -- : rss 0.3.0 I, [2024-05-15T06:09:28.475164 #2385316] INFO -- : net-ftp 0.3.4 I, [2024-05-15T06:09:28.476624 #2385316] INFO -- : net-imap 0.4.11 I, [2024-05-15T06:09:28.479935 #2385316] INFO -- : net-pop 0.1.2 I, [2024-05-15T06:09:28.480852 #2385316] INFO -- : net-smtp 0.5.0 I, [2024-05-15T06:09:28.482040 #2385316] INFO -- : matrix 0.4.2 I, [2024-05-15T06:09:28.485570 #2385316] INFO -- : prime 0.1.2 I, [2024-05-15T06:09:28.490327 #2385316] INFO -- : rbs 3.4.4 I, [2024-05-15T06:09:28.512748 #2385316] INFO -- : typeprof 0.21.11 I, [2024-05-15T06:09:28.514906 #2385316] INFO -- : debug 1.9.2 I, [2024-05-15T06:09:28.517909 #2385316] INFO -- : racc 1.7.3 I, [2024-05-15T06:09:28.520754 #2385316] INFO -- : mutex_m 0.2.0 I, [2024-05-15T06:09:28.521881 #2385316] INFO -- : getoptlong 0.2.1 I, [2024-05-15T06:09:28.523150 #2385316] INFO -- : base64 0.2.0 I, [2024-05-15T06:09:28.524152 #2385316] INFO -- : bigdecimal 3.1.8 I, [2024-05-15T06:09:28.526052 #2385316] INFO -- : observer 0.1.2 I, [2024-05-15T06:09:28.527150 #2385316] INFO -- : abbrev 0.1.2 I, [2024-05-15T06:09:28.528322 #2385316] INFO -- : resolv-replace 0.1.1 I, [2024-05-15T06:09:28.529841 #2385316] INFO -- : rinda 0.2.0 I, [2024-05-15T06:09:28.531074 #2385316] INFO -- : drb 2.2.1 I, [2024-05-15T06:09:28.532549 #2385316] INFO -- : nkf 0.2.0 I, [2024-05-15T06:09:28.535043 #2385316] INFO -- : syslog 0.1.2 I, [2024-05-15T06:09:28.536867 #2385316] INFO -- : csv 3.3.0 I, [2024-05-15T06:09:28.538915 #2385316] INFO -- : installing bundled gem cache: /tmp/ruby/install/trunk/lib/ruby/gems/3.4.0+0/cache I, [2024-05-15T06:09:28.540298 #2385316] INFO -- : skipped bundled gems: I, [2024-05-15T06:09:28.540318 #2385316] INFO -- : power_assert-2.0.4dev.gem not found in bundled_gems I, [2024-05-15T06:09:28.543225 #2385316] INFO -- : $$$[end] "make install -j20" exit with 0. I, [2024-05-15T06:09:28.543339 #2385316] INFO -- : $$$[beg] make yes-btest TESTOPTS='-q -j20' I, [2024-05-15T06:09:34.728558 #2385316] INFO -- : PASS all 1936 tests E, [2024-05-15T06:09:34.733911 #2385316] ERROR -- : I, [2024-05-15T06:09:34.734278 #2385316] INFO -- : $$$[end] "make yes-btest TESTOPTS='-q -j20'" exit with 0. I, [2024-05-15T06:09:34.734359 #2385316] INFO -- : $$$[beg] make yes-test-basic TESTS='-j20' I, [2024-05-15T06:09:34.795433 #2385316] INFO -- : BASERUBY = /usr/bin/ruby --disable=gems I, [2024-05-15T06:09:34.795477 #2385316] INFO -- : CC = gcc I, [2024-05-15T06:09:34.795490 #2385316] INFO -- : LD = ld I, [2024-05-15T06:09:34.795501 #2385316] INFO -- : LDSHARED = gcc -shared I, [2024-05-15T06:09:34.795512 #2385316] INFO -- : CFLAGS = -O3 -fno-fast-math -ggdb3 -Wall -Wextra -Wdeprecated-declarations -Wdiv-by-zero -Wduplicated-cond -Wimplicit-function-declaration -Wimplicit-int -Wpointer-arith -Wwrite-strings -Wold-style-definition -Wimplicit-fallthrough=0 -Wmissing-noreturn -Wno-cast-function-type -Wno-constant-logical-operand -Wno-long-long -Wno-missing-field-initializers -Wno-overlength-strings -Wno-packed-bitfield-compat -Wno-parentheses-equality -Wno-self-assign -Wno-tautological-compare -Wno-unused-parameter -Wno-unused-value -Wsuggest-attribute=format -Wsuggest-attribute=noreturn -Wunused-variable -Wmisleading-indentation -Wundef -fPIC I, [2024-05-15T06:09:34.795529 #2385316] INFO -- : XCFLAGS = -U_FORTIFY_SOURCE -D_FORTIFY_SOURCE=2 -fstack-protector-strong -fno-strict-overflow -fvisibility=hidden -fexcess-precision=standard -DRUBY_EXPORT -I. -I.ext/include/x86_64-linux -I/tmp/ruby/src/trunk/include -I/tmp/ruby/src/trunk -I/tmp/ruby/src/trunk/prism -I/tmp/ruby/src/trunk/enc/unicode/15.0.0 I, [2024-05-15T06:09:34.795540 #2385316] INFO -- : CPPFLAGS = I, [2024-05-15T06:09:34.795550 #2385316] INFO -- : DLDFLAGS = -Wl,--compress-debug-sections=zlib -Wl,-soname,libruby.so.3.4 -fstack-protector-strong I, [2024-05-15T06:09:34.795561 #2385316] INFO -- : SOLIBS = -lz -lrt -lrt -lgmp -ldl -lcrypt -lm -lpthread I, [2024-05-15T06:09:34.795571 #2385316] INFO -- : LANG = en_US.UTF-8 I, [2024-05-15T06:09:34.795581 #2385316] INFO -- : LC_ALL = I, [2024-05-15T06:09:34.795591 #2385316] INFO -- : LC_CTYPE = I, [2024-05-15T06:09:34.795601 #2385316] INFO -- : MFLAGS = I, [2024-05-15T06:09:34.795611 #2385316] INFO -- : RUSTC = no I, [2024-05-15T06:09:34.795620 #2385316] INFO -- : YJIT_RUSTC_ARGS = --crate-name=yjit --crate-type=staticlib --edition=2021 -g -C lto=thin -C opt-level=3 -C overflow-checks=on '--out-dir=/tmp/ruby/build/trunk/yjit/target/release/' /tmp/ruby/src/trunk/yjit/src/lib.rs I, [2024-05-15T06:09:34.796089 #2385316] INFO -- : gcc (Ubuntu 11.4.0-1ubuntu1~22.04) 11.4.0 I, [2024-05-15T06:09:34.796134 #2385316] INFO -- : Copyright (C) 2021 Free Software Foundation, Inc. I, [2024-05-15T06:09:34.796148 #2385316] INFO -- : This is free software; see the source for copying conditions. There is NO I, [2024-05-15T06:09:34.796159 #2385316] INFO -- : warranty; not even for MERCHANTABILITY or FITNESS FOR A PARTICULAR PURPOSE. I, [2024-05-15T06:09:34.796179 #2385316] INFO -- : I, [2024-05-15T06:09:34.906366 #2385316] INFO -- : Checking leaked global symbols...none I, [2024-05-15T06:09:34.951712 #2385316] INFO -- : /tmp/ruby/src/trunk/basictest/test.rb:assignment ....................................................................................................................................................................................................................................................................................................................................................................................OK 372 I, [2024-05-15T06:09:34.951794 #2385316] INFO -- : /tmp/ruby/src/trunk/basictest/test.rb:condition ..OK 2 I, [2024-05-15T06:09:34.951809 #2385316] INFO -- : /tmp/ruby/src/trunk/basictest/test.rb:if/unless ...OK 3 I, [2024-05-15T06:09:34.951821 #2385316] INFO -- : /tmp/ruby/src/trunk/basictest/test.rb:case .....OK 5 I, [2024-05-15T06:09:34.951981 #2385316] INFO -- : /tmp/ruby/src/trunk/basictest/test.rb:while/until ........OK 8 I, [2024-05-15T06:09:34.952041 #2385316] INFO -- : /tmp/ruby/src/trunk/basictest/test.rb:exception ..........OK 10 I, [2024-05-15T06:09:34.952303 #2385316] INFO -- : /tmp/ruby/src/trunk/basictest/test.rb:array .......................................OK 39 I, [2024-05-15T06:09:34.952401 #2385316] INFO -- : /tmp/ruby/src/trunk/basictest/test.rb:hash ...........................OK 27 I, [2024-05-15T06:09:34.953120 #2385316] INFO -- : /tmp/ruby/src/trunk/basictest/test.rb:iterator ...........................................................................................................OK 107 I, [2024-05-15T06:09:34.953396 #2385316] INFO -- : /tmp/ruby/src/trunk/basictest/test.rb:float ................................................................................OK 80 I, [2024-05-15T06:09:34.954401 #2385316] INFO -- : /tmp/ruby/src/trunk/basictest/test.rb:bignum ...............................OK 31 I, [2024-05-15T06:09:34.955195 #2385316] INFO -- : /tmp/ruby/src/trunk/basictest/test.rb:string & char ..............................................................OK 62 I, [2024-05-15T06:09:34.955219 #2385316] INFO -- : /tmp/ruby/src/trunk/basictest/test.rb:assignment ..........OK 10 I, [2024-05-15T06:09:34.955233 #2385316] INFO -- : /tmp/ruby/src/trunk/basictest/test.rb:call ......OK 6 I, [2024-05-15T06:09:34.955276 #2385316] INFO -- : /tmp/ruby/src/trunk/basictest/test.rb:proc .........OK 9 I, [2024-05-15T06:09:35.055826 #2385316] INFO -- : /tmp/ruby/src/trunk/basictest/test.rb:signal ..OK 2 I, [2024-05-15T06:09:35.057072 #2385316] INFO -- : /tmp/ruby/src/trunk/basictest/test.rb:eval ...........................OK 27 I, [2024-05-15T06:09:35.181884 #2385316] INFO -- : /tmp/ruby/src/trunk/basictest/test.rb:system ........OK 8 I, [2024-05-15T06:09:35.181973 #2385316] INFO -- : /tmp/ruby/src/trunk/basictest/test.rb:const .....OK 5 I, [2024-05-15T06:09:35.181989 #2385316] INFO -- : /tmp/ruby/src/trunk/basictest/test.rb:clone .....OK 5 I, [2024-05-15T06:09:35.182002 #2385316] INFO -- : /tmp/ruby/src/trunk/basictest/test.rb:marshal ....OK 4 I, [2024-05-15T06:09:35.182044 #2385316] INFO -- : /tmp/ruby/src/trunk/basictest/test.rb:pack ....OK 4 I, [2024-05-15T06:09:35.182071 #2385316] INFO -- : /tmp/ruby/src/trunk/basictest/test.rb:math ..OK 2 I, [2024-05-15T06:09:35.182116 #2385316] INFO -- : /tmp/ruby/src/trunk/basictest/test.rb:struct ......OK 6 I, [2024-05-15T06:09:35.182212 #2385316] INFO -- : /tmp/ruby/src/trunk/basictest/test.rb:variable ............OK 12 I, [2024-05-15T06:09:35.182248 #2385316] INFO -- : /tmp/ruby/src/trunk/basictest/test.rb:trace ...OK 3 I, [2024-05-15T06:09:35.182274 #2385316] INFO -- : /tmp/ruby/src/trunk/basictest/test.rb:defined? ............OK 12 I, [2024-05-15T06:09:35.182317 #2385316] INFO -- : /tmp/ruby/src/trunk/basictest/test.rb:alias ......OK 6 I, [2024-05-15T06:09:35.182698 #2385316] INFO -- : /tmp/ruby/src/trunk/basictest/test.rb:path .......................OK 23 I, [2024-05-15T06:09:35.218191 #2385316] INFO -- : /tmp/ruby/src/trunk/basictest/test.rb:gc ....OK 4 I, [2024-05-15T06:09:35.220582 #2385316] INFO -- : I, [2024-05-15T06:09:35.220646 #2385316] INFO -- : test succeeded I, [2024-05-15T06:09:35.222128 #2385316] INFO -- : $$$[end] "make yes-test-basic TESTS='-j20'" exit with 0. I, [2024-05-15T06:09:35.222239 #2385316] INFO -- : $$$[beg] make yes-test-all TESTOPTS='--stderr-on-failure' TESTS='-j20' I, [2024-05-15T06:09:35.309241 #2385316] INFO -- : BASERUBY = /usr/bin/ruby --disable=gems I, [2024-05-15T06:09:35.309300 #2385316] INFO -- : CC = gcc I, [2024-05-15T06:09:35.309318 #2385316] INFO -- : LD = ld I, [2024-05-15T06:09:35.309329 #2385316] INFO -- : LDSHARED = gcc -shared I, [2024-05-15T06:09:35.309340 #2385316] INFO -- : CFLAGS = -O3 -fno-fast-math -ggdb3 -Wall -Wextra -Wdeprecated-declarations -Wdiv-by-zero -Wduplicated-cond -Wimplicit-function-declaration -Wimplicit-int -Wpointer-arith -Wwrite-strings -Wold-style-definition -Wimplicit-fallthrough=0 -Wmissing-noreturn -Wno-cast-function-type -Wno-constant-logical-operand -Wno-long-long -Wno-missing-field-initializers -Wno-overlength-strings -Wno-packed-bitfield-compat -Wno-parentheses-equality -Wno-self-assign -Wno-tautological-compare -Wno-unused-parameter -Wno-unused-value -Wsuggest-attribute=format -Wsuggest-attribute=noreturn -Wunused-variable -Wmisleading-indentation -Wundef -fPIC I, [2024-05-15T06:09:35.309351 #2385316] INFO -- : XCFLAGS = -U_FORTIFY_SOURCE -D_FORTIFY_SOURCE=2 -fstack-protector-strong -fno-strict-overflow -fvisibility=hidden -fexcess-precision=standard -DRUBY_EXPORT -I. -I.ext/include/x86_64-linux -I/tmp/ruby/src/trunk/include -I/tmp/ruby/src/trunk -I/tmp/ruby/src/trunk/prism -I/tmp/ruby/src/trunk/enc/unicode/15.0.0 I, [2024-05-15T06:09:35.309362 #2385316] INFO -- : CPPFLAGS = I, [2024-05-15T06:09:35.309372 #2385316] INFO -- : DLDFLAGS = -Wl,--compress-debug-sections=zlib -Wl,-soname,libruby.so.3.4 -fstack-protector-strong I, [2024-05-15T06:09:35.309386 #2385316] INFO -- : SOLIBS = -lz -lrt -lrt -lgmp -ldl -lcrypt -lm -lpthread I, [2024-05-15T06:09:35.309396 #2385316] INFO -- : LANG = en_US.UTF-8 I, [2024-05-15T06:09:35.309406 #2385316] INFO -- : LC_ALL = I, [2024-05-15T06:09:35.309416 #2385316] INFO -- : LC_CTYPE = I, [2024-05-15T06:09:35.309426 #2385316] INFO -- : MFLAGS = I, [2024-05-15T06:09:35.309438 #2385316] INFO -- : RUSTC = no I, [2024-05-15T06:09:35.309451 #2385316] INFO -- : YJIT_RUSTC_ARGS = --crate-name=yjit --crate-type=staticlib --edition=2021 -g -C lto=thin -C opt-level=3 -C overflow-checks=on '--out-dir=/tmp/ruby/build/trunk/yjit/target/release/' /tmp/ruby/src/trunk/yjit/src/lib.rs I, [2024-05-15T06:09:35.309938 #2385316] INFO -- : gcc (Ubuntu 11.4.0-1ubuntu1~22.04) 11.4.0 I, [2024-05-15T06:09:35.309992 #2385316] INFO -- : Copyright (C) 2021 Free Software Foundation, Inc. I, [2024-05-15T06:09:35.310005 #2385316] INFO -- : This is free software; see the source for copying conditions. There is NO I, [2024-05-15T06:09:35.310016 #2385316] INFO -- : warranty; not even for MERCHANTABILITY or FITNESS FOR A PARTICULAR PURPOSE. I, [2024-05-15T06:09:35.310027 #2385316] INFO -- : I, [2024-05-15T06:09:35.311788 #2385316] INFO -- : generating enc.mk I, [2024-05-15T06:09:35.429958 #2385316] INFO -- : making enc I, [2024-05-15T06:09:35.447015 #2385316] INFO -- : make[1]: Entering directory '/tmp/ruby/build/trunk' I, [2024-05-15T06:09:35.447038 #2385316] INFO -- : make[1]: Nothing to be done for 'enc'. I, [2024-05-15T06:09:35.447043 #2385316] INFO -- : make[1]: Leaving directory '/tmp/ruby/build/trunk' I, [2024-05-15T06:09:35.447731 #2385316] INFO -- : making srcs under enc I, [2024-05-15T06:09:35.476713 #2385316] INFO -- : make[1]: Entering directory '/tmp/ruby/build/trunk' I, [2024-05-15T06:09:35.476733 #2385316] INFO -- : make[1]: Nothing to be done for 'srcs'. I, [2024-05-15T06:09:35.476738 #2385316] INFO -- : make[1]: Leaving directory '/tmp/ruby/build/trunk' I, [2024-05-15T06:09:35.477654 #2385316] INFO -- : generating transdb.h I, [2024-05-15T06:09:35.573875 #2385316] INFO -- : transdb.h unchanged I, [2024-05-15T06:09:35.575272 #2385316] INFO -- : making trans I, [2024-05-15T06:09:35.609094 #2385316] INFO -- : make[1]: Entering directory '/tmp/ruby/build/trunk' I, [2024-05-15T06:09:35.609123 #2385316] INFO -- : make[1]: Nothing to be done for 'trans'. I, [2024-05-15T06:09:35.609130 #2385316] INFO -- : make[1]: Leaving directory '/tmp/ruby/build/trunk' I, [2024-05-15T06:09:35.609942 #2385316] INFO -- : making encs I, [2024-05-15T06:09:35.647379 #2385316] INFO -- : make[1]: Entering directory '/tmp/ruby/build/trunk' I, [2024-05-15T06:09:35.647399 #2385316] INFO -- : make[1]: Nothing to be done for 'encs'. I, [2024-05-15T06:09:35.647405 #2385316] INFO -- : make[1]: Leaving directory '/tmp/ruby/build/trunk' I, [2024-05-15T06:09:35.649343 #2385316] INFO -- : generating makefiles ext/configure-ext.mk I, [2024-05-15T06:09:35.675834 #2385316] INFO -- : ext/configure-ext.mk updated I, [2024-05-15T06:09:35.678436 #2385316] INFO -- : make[1]: Entering directory '/tmp/ruby/build/trunk' I, [2024-05-15T06:09:37.029725 #2385316] INFO -- : make[1]: Leaving directory '/tmp/ruby/build/trunk' I, [2024-05-15T06:09:37.030392 #2385316] INFO -- : generating makefile exts.mk I, [2024-05-15T06:09:37.066724 #2385316] INFO -- : exts.mk unchanged I, [2024-05-15T06:09:37.071074 #2385316] INFO -- : make[1]: Entering directory '/tmp/ruby/build/trunk' I, [2024-05-15T06:09:37.345652 #2385316] INFO -- : make[2]: Entering directory '/tmp/ruby/build/trunk/ext/coverage' I, [2024-05-15T06:09:37.348560 #2385316] INFO -- : make[2]: Leaving directory '/tmp/ruby/build/trunk/ext/coverage' I, [2024-05-15T06:09:37.353309 #2385316] INFO -- : make[2]: Entering directory '/tmp/ruby/build/trunk/ext/date' I, [2024-05-15T06:09:37.357978 #2385316] INFO -- : make[2]: Leaving directory '/tmp/ruby/build/trunk/ext/date' I, [2024-05-15T06:09:37.361237 #2385316] INFO -- : make[2]: Entering directory '/tmp/ruby/build/trunk/ext/digest' I, [2024-05-15T06:09:37.369930 #2385316] INFO -- : make[2]: Leaving directory '/tmp/ruby/build/trunk/ext/digest' I, [2024-05-15T06:09:37.396114 #2385316] INFO -- : make[2]: Entering directory '/tmp/ruby/build/trunk/ext/digest/sha2' I, [2024-05-15T06:09:37.400934 #2385316] INFO -- : make[2]: Leaving directory '/tmp/ruby/build/trunk/ext/digest/sha2' I, [2024-05-15T06:09:37.422184 #2385316] INFO -- : make[2]: Entering directory '/tmp/ruby/build/trunk/ext/fiddle' I, [2024-05-15T06:09:37.432904 #2385316] INFO -- : make[2]: Leaving directory '/tmp/ruby/build/trunk/ext/fiddle' I, [2024-05-15T06:09:37.437793 #2385316] INFO -- : make[2]: Entering directory '/tmp/ruby/build/trunk/ext/io/console' I, [2024-05-15T06:09:37.441451 #2385316] INFO -- : make[2]: Leaving directory '/tmp/ruby/build/trunk/ext/io/console' I, [2024-05-15T06:09:37.454229 #2385316] INFO -- : make[2]: Entering directory '/tmp/ruby/build/trunk/ext/json' I, [2024-05-15T06:09:37.464876 #2385316] INFO -- : make[2]: Leaving directory '/tmp/ruby/build/trunk/ext/json' I, [2024-05-15T06:09:37.480186 #2385316] INFO -- : make[2]: Entering directory '/tmp/ruby/build/trunk/ext/monitor' I, [2024-05-15T06:09:37.484083 #2385316] INFO -- : make[2]: Leaving directory '/tmp/ruby/build/trunk/ext/monitor' I, [2024-05-15T06:09:37.491140 #2385316] INFO -- : make[2]: Entering directory '/tmp/ruby/build/trunk/ext/objspace' I, [2024-05-15T06:09:37.496541 #2385316] INFO -- : make[2]: Leaving directory '/tmp/ruby/build/trunk/ext/objspace' I, [2024-05-15T06:09:37.514412 #2385316] INFO -- : make[2]: Entering directory '/tmp/ruby/build/trunk/ext/openssl' I, [2024-05-15T06:09:37.531029 #2385316] INFO -- : make[2]: Leaving directory '/tmp/ruby/build/trunk/ext/openssl' I, [2024-05-15T06:09:37.535472 #2385316] INFO -- : make[2]: Entering directory '/tmp/ruby/build/trunk/ext/pathname' I, [2024-05-15T06:09:37.539491 #2385316] INFO -- : make[2]: Leaving directory '/tmp/ruby/build/trunk/ext/pathname' I, [2024-05-15T06:09:37.546447 #2385316] INFO -- : make[2]: Entering directory '/tmp/ruby/build/trunk/ext/psych' I, [2024-05-15T06:09:37.567254 #2385316] INFO -- : make[2]: Leaving directory '/tmp/ruby/build/trunk/ext/psych' I, [2024-05-15T06:09:37.571967 #2385316] INFO -- : make[2]: Entering directory '/tmp/ruby/build/trunk/ext/pty' I, [2024-05-15T06:09:37.576033 #2385316] INFO -- : make[2]: Leaving directory '/tmp/ruby/build/trunk/ext/pty' I, [2024-05-15T06:09:37.591663 #2385316] INFO -- : make[2]: Entering directory '/tmp/ruby/build/trunk/ext/ripper' I, [2024-05-15T06:09:37.598747 #2385316] INFO -- : make[2]: Leaving directory '/tmp/ruby/build/trunk/ext/ripper' I, [2024-05-15T06:09:37.601021 #2385316] INFO -- : make[2]: Entering directory '/tmp/ruby/build/trunk/ext/rubyvm' I, [2024-05-15T06:09:37.604352 #2385316] INFO -- : make[2]: Leaving directory '/tmp/ruby/build/trunk/ext/rubyvm' I, [2024-05-15T06:09:37.616851 #2385316] INFO -- : make[2]: Entering directory '/tmp/ruby/build/trunk/ext/socket' I, [2024-05-15T06:09:37.624801 #2385316] INFO -- : make[2]: Leaving directory '/tmp/ruby/build/trunk/ext/socket' I, [2024-05-15T06:09:37.642842 #2385316] INFO -- : make[2]: Entering directory '/tmp/ruby/build/trunk/.bundle/gems/bigdecimal-3.1.8/ext/bigdecimal' I, [2024-05-15T06:09:37.667656 #2385316] INFO -- : make[2]: Leaving directory '/tmp/ruby/build/trunk/.bundle/gems/bigdecimal-3.1.8/ext/bigdecimal' I, [2024-05-15T06:09:37.669538 #2385316] INFO -- : make[2]: Entering directory '/tmp/ruby/build/trunk/.bundle/gems/debug-1.9.2/ext/debug' I, [2024-05-15T06:09:37.692698 #2385316] INFO -- : make[2]: Leaving directory '/tmp/ruby/build/trunk/.bundle/gems/debug-1.9.2/ext/debug' I, [2024-05-15T06:09:37.694599 #2385316] INFO -- : make[2]: Entering directory '/tmp/ruby/build/trunk/.bundle/gems/nkf-0.2.0/ext/nkf' I, [2024-05-15T06:09:37.715788 #2385316] INFO -- : make[2]: Leaving directory '/tmp/ruby/build/trunk/.bundle/gems/nkf-0.2.0/ext/nkf' I, [2024-05-15T06:09:37.717954 #2385316] INFO -- : make[2]: Entering directory '/tmp/ruby/build/trunk/.bundle/gems/racc-1.7.3/ext/racc/cparse' I, [2024-05-15T06:09:37.739249 #2385316] INFO -- : make[2]: Leaving directory '/tmp/ruby/build/trunk/.bundle/gems/racc-1.7.3/ext/racc/cparse' I, [2024-05-15T06:09:37.741556 #2385316] INFO -- : make[2]: Entering directory '/tmp/ruby/build/trunk/.bundle/gems/rbs-3.4.4/ext/rbs_extension' I, [2024-05-15T06:09:37.762800 #2385316] INFO -- : make[2]: Leaving directory '/tmp/ruby/build/trunk/.bundle/gems/rbs-3.4.4/ext/rbs_extension' I, [2024-05-15T06:09:37.764804 #2385316] INFO -- : make[2]: Entering directory '/tmp/ruby/build/trunk/.bundle/gems/syslog-0.1.2/ext/syslog' I, [2024-05-15T06:09:37.786642 #2385316] INFO -- : make[2]: Leaving directory '/tmp/ruby/build/trunk/.bundle/gems/syslog-0.1.2/ext/syslog' I, [2024-05-15T06:09:37.811848 #2385316] INFO -- : make[2]: Entering directory '/tmp/ruby/build/trunk' I, [2024-05-15T06:09:37.876079 #2385316] INFO -- : make[2]: 'ruby' is up to date. I, [2024-05-15T06:09:37.876118 #2385316] INFO -- : make[2]: Leaving directory '/tmp/ruby/build/trunk' I, [2024-05-15T06:09:37.876603 #2385316] INFO -- : make[1]: Leaving directory '/tmp/ruby/build/trunk' I, [2024-05-15T06:09:37.880144 #2385316] INFO -- : make[1]: Entering directory '/tmp/ruby/build/trunk' I, [2024-05-15T06:09:37.880186 #2385316] INFO -- : make[1]: Nothing to be done for 'note'. I, [2024-05-15T06:09:37.880192 #2385316] INFO -- : make[1]: Leaving directory '/tmp/ruby/build/trunk' I, [2024-05-15T06:09:37.954728 #2385316] INFO -- : Run options: I, [2024-05-15T06:09:37.954803 #2385316] INFO -- : --seed=60117 I, [2024-05-15T06:09:37.954810 #2385316] INFO -- : "--ruby=./miniruby -I/tmp/ruby/src/trunk/lib -I. -I.ext/common /tmp/ruby/src/trunk/tool/runruby.rb --extout=.ext -- --disable-gems" I, [2024-05-15T06:09:37.954825 #2385316] INFO -- : --excludes-dir=/tmp/ruby/src/trunk/test/.excludes I, [2024-05-15T06:09:37.954830 #2385316] INFO -- : --name=!/memory_leak/ I, [2024-05-15T06:09:37.954835 #2385316] INFO -- : --stderr-on-failure I, [2024-05-15T06:09:37.954839 #2385316] INFO -- : -j20 I, [2024-05-15T06:09:37.954843 #2385316] INFO -- : I, [2024-05-15T06:09:37.954848 #2385316] INFO -- : # Running tests: I, [2024-05-15T06:09:37.954853 #2385316] INFO -- : I, [2024-05-15T06:09:38.101979 #2385316] INFO -- : [ 1/885] 2426678=heredoc_dedent_test I, [2024-05-15T06:09:38.102882 #2385316] INFO -- : [ 2/885] 2426679=test_cgi_header I, [2024-05-15T06:09:38.103137 #2385316] INFO -- : [ 3/885] 2426682=test_object I, [2024-05-15T06:09:38.103435 #2385316] INFO -- : [ 4/885] 2426677=version_test I, [2024-05-15T06:09:38.103543 #2385316] INFO -- : [ 5/885] 2426680=test_key_actor_emacs I, [2024-05-15T06:09:38.106502 #2385316] INFO -- : [ 6/885] 2426681=test_gem_command_manager I, [2024-05-15T06:09:38.106597 #2385316] INFO -- : [ 7/885] 2426695=test_basicinstructions I, [2024-05-15T06:09:38.106674 #2385316] INFO -- : [ 8/885] 2426691=test_gem_gemcutter_utilities I, [2024-05-15T06:09:38.106890 #2385316] INFO -- : [ 9/885] 2426694=test_arithmetic_sequence I, [2024-05-15T06:09:38.108836 #2385316] INFO -- : [ 10/885] 2426696=test_flip I, [2024-05-15T06:09:38.113621 #2385316] INFO -- : [ 11/885] 2426693=compiler_test I, [2024-05-15T06:09:38.118138 #2385316] INFO -- : [ 12/885] 2426679=test_change_word I, [2024-05-15T06:09:38.121596 #2385316] INFO -- : [ 13/885] 2426694=test_ossl I, [2024-05-15T06:09:38.123489 #2385316] INFO -- : [ 14/885] 2426683=test_normalize I, [2024-05-15T06:09:38.127319 #2385316] INFO -- : [ 15/885] 2426683=test_timeout I, [2024-05-15T06:09:38.135922 #2385316] INFO -- : [ 16/885] 2426679=test_gem_local_remote_options I, [2024-05-15T06:09:38.135972 #2385316] INFO -- : [ 17/885] 2426692=test_ruby_lex I, [2024-05-15T06:09:38.136334 #2385316] INFO -- : [ 18/885] 2426696=test_object I, [2024-05-15T06:09:38.139911 #2385316] INFO -- : [ 19/885] 2426682=test_date_arith I, [2024-05-15T06:09:38.139977 #2385316] INFO -- : [ 20/885] 2426684=test_sleep I, [2024-05-15T06:09:38.140085 #2385316] INFO -- : [ 21/885] 2426685=test_type I, [2024-05-15T06:09:38.140129 #2385316] INFO -- : [ 22/885] 2426686=test_ractor I, [2024-05-15T06:09:38.140254 #2385316] INFO -- : [ 23/885] 2426687=test_pointer I, [2024-05-15T06:09:38.140280 #2385316] INFO -- : [ 24/885] 2426688=test_func I, [2024-05-15T06:09:38.140348 #2385316] INFO -- : [ 25/885] 2426689=test_big5 I, [2024-05-15T06:09:38.142097 #2385316] INFO -- : [ 26/885] 2426690=test_rdoc_rd_block_parser I, [2024-05-15T06:09:38.143007 #2385316] INFO -- : [ 27/885] 2426683=test_tsort I, [2024-05-15T06:09:38.145820 #2385316] INFO -- : [ 28/885] 2426689=test_signedness I, [2024-05-15T06:09:38.147444 #2385316] INFO -- : [ 29/885] 2426683=test_pkey_rsa I, [2024-05-15T06:09:38.150135 #2385316] INFO -- : [ 30/885] 2426685=test_numhash I, [2024-05-15T06:09:38.152699 #2385316] INFO -- : [ 31/885] 2426682=test_gem_commands_push_command I, [2024-05-15T06:09:38.155846 #2385316] INFO -- : [ 32/885] 2426685=test_weakkeymap I, [2024-05-15T06:09:38.169085 #2385316] INFO -- : [ 33/885] 2426678=test_rdoc_markup_hard_break I, [2024-05-15T06:09:38.182498 #2385316] INFO -- : [ 34/885] 2426695=test_placearg I, [2024-05-15T06:09:38.191560 #2385316] INFO -- : [ 35/885] 2426693=test_gem_package_task I, [2024-05-15T06:09:38.195011 #2385316] INFO -- : [ 36/885] 2426677=test_date_strptime I, [2024-05-15T06:09:38.225585 #2385316] INFO -- : [ 37/885] 2426686=test_gem_platform I, [2024-05-15T06:09:38.242749 #2385316] INFO -- : [ 38/885] 2426685=test_delete I, [2024-05-15T06:09:38.247297 #2385316] INFO -- : [ 39/885] 2426685=test_win32ole_method I, [2024-05-15T06:09:38.251936 #2385316] INFO -- : [ 40/885] 2426685=test_continuation I, [2024-05-15T06:09:38.254699 #2385316] INFO -- : [ 41/885] 2426680=test_fd_setsize I, [2024-05-15T06:09:38.255757 #2385316] INFO -- : [ 42/885] 2426680=test_class_name_check I, [2024-05-15T06:09:38.258286 #2385316] INFO -- : [ 43/885] 2426685=test_keyword I, [2024-05-15T06:09:38.274091 #2385316] INFO -- : [ 44/885] 2426680=test_gem_update_suggestion I, [2024-05-15T06:09:38.297096 #2385316] INFO -- : [ 45/885] 2426677=test_files_test I, [2024-05-15T06:09:38.304989 #2385316] INFO -- : [ 46/885] 2426695=test_file_exhaustive I, [2024-05-15T06:09:38.311201 #2385316] INFO -- : [ 47/885] 2426679=test_logger I, [2024-05-15T06:09:38.313782 #2385316] INFO -- : [ 48/885] 2426690=test_import I, [2024-05-15T06:09:38.328958 #2385316] INFO -- : [ 49/885] 2426678=test_not I, [2024-05-15T06:09:38.329644 #2385316] INFO -- : [ 50/885] 2426679=test_gem_resolver_lock_set I, [2024-05-15T06:09:38.331000 #2385316] INFO -- : [ 51/885] 2426678=test_rdoc_parser_markdown I, [2024-05-15T06:09:38.346041 #2385316] INFO -- : [ 52/885] 2426687=test_gem_resolver_vendor_set I, [2024-05-15T06:09:38.347916 #2385316] INFO -- : [ 53/885] 2426693=test_config I, [2024-05-15T06:09:38.366415 #2385316] INFO -- : [ 54/885] 2426679=test_enumerable I, [2024-05-15T06:09:38.371083 #2385316] INFO -- : [ 55/885] 2426679=test_gem_safe_marshal I, [2024-05-15T06:09:38.372727 #2385316] INFO -- : [ 56/885] 2426681=test_gem_resolver_api_set I, [2024-05-15T06:09:38.380688 #2385316] INFO -- : [ 57/885] 2426677=test_transcode I, [2024-05-15T06:09:38.382516 #2385316] INFO -- : [ 58/885] 2426678=test_eval I, [2024-05-15T06:09:38.416351 #2385316] INFO -- : [ 59/885] 2426688=json_generator_test I, [2024-05-15T06:09:38.419167 #2385316] INFO -- : [ 60/885] 2426692=test_rdoc_code_object I, [2024-05-15T06:09:38.424349 #2385316] INFO -- : [ 61/885] 2426681=test_x509store I, [2024-05-15T06:09:38.424732 #2385316] INFO -- : [ 62/885] 2426686=test_x509name I, [2024-05-15T06:09:38.440387 #2385316] INFO -- : [ 63/885] 2426686=test_fips I, [2024-05-15T06:09:38.491909 #2385316] INFO -- : [ 64/885] 2426680=test_update I, [2024-05-15T06:09:38.494174 #2385316] INFO -- : [ 65/885] 2426683=test_gem_request_set_gem_dependency_api I, [2024-05-15T06:09:38.494497 #2385316] INFO -- : [ 66/885] 2426680=test_ast I, [2024-05-15T06:09:38.500921 #2385316] INFO -- : [ 67/885] 2426688=test_lambda I, [2024-05-15T06:09:38.543503 #2385316] INFO -- : [ 68/885] 2426696=test_jaro_winkler I, [2024-05-15T06:09:38.549613 #2385316] INFO -- : [ 69/885] 2426696=test_helper I, [2024-05-15T06:09:38.559996 #2385316] INFO -- : [ 70/885] 2426687=test_random_formatter I, [2024-05-15T06:09:38.568270 #2385316] INFO -- : [ 71/885] 2426688=test_webauthn_listener I, [2024-05-15T06:09:38.577139 #2385316] INFO -- : [ 72/885] 2426677=test_gem_commands_check_command I, [2024-05-15T06:09:38.582551 #2385316] INFO -- : [ 73/885] 2426690=test_regexp I, [2024-05-15T06:09:38.584209 #2385316] INFO -- : [ 74/885] 2426687=errors_test I, [2024-05-15T06:09:38.606759 #2385316] INFO -- : [ 75/885] 2426678=test_vm_dump I, [2024-05-15T06:09:38.608386 #2385316] INFO -- : [ 76/885] 2426678=test_integer_comb I, [2024-05-15T06:09:38.619020 #2385316] INFO -- : [ 77/885] 2426691=test_rdoc_markup_document I, [2024-05-15T06:09:38.630517 #2385316] INFO -- : [ 78/885] 2426696=test_tmpdir I, [2024-05-15T06:09:38.655236 #2385316] INFO -- : [ 79/885] 2426686=unescape_test I, [2024-05-15T06:09:38.675859 #2385316] INFO -- : [ 80/885] 2426681=test_ostruct I, [2024-05-15T06:09:38.701588 #2385316] INFO -- : [ 81/885] 2426696=test_file I, [2024-05-15T06:09:38.741364 #2385316] INFO -- : [ 82/885] 2426687=test_force_exit I, [2024-05-15T06:09:38.749578 #2385316] INFO -- : [ 83/885] 2426691=bom_test I, [2024-05-15T06:09:38.772438 #2385316] INFO -- : [ 84/885] 2426677=test_data_error I, [2024-05-15T06:09:38.826970 #2385316] INFO -- : [ 85/885] 2426688=test_udp I, [2024-05-15T06:09:38.829521 #2385316] INFO -- : [ 86/885] 2426688=static_inspect_test I, [2024-05-15T06:09:38.831336 #2385316] INFO -- : [ 87/885] 2426691=test_gem_uri_formatter I, [2024-05-15T06:09:38.843145 #2385316] INFO -- : [ 88/885] 2426677=test_encoding I, [2024-05-15T06:09:38.846948 #2385316] INFO -- : [ 89/885] 2426693=test_helper I, [2024-05-15T06:09:38.848182 #2385316] INFO -- : [ 90/885] 2426679=test_erb_command I, [2024-05-15T06:09:38.853310 #2385316] INFO -- : [ 91/885] 2426691=command_line_test I, [2024-05-15T06:09:38.853896 #2385316] INFO -- : [ 92/885] 2426693=test_constant I, [2024-05-15T06:09:38.855118 #2385316] INFO -- : [ 93/885] 2426685=test_dup I, [2024-05-15T06:09:38.855770 #2385316] INFO -- : [ 94/885] 2426687=test_pty I, [2024-05-15T06:09:38.857750 #2385316] INFO -- : [ 95/885] 2426682=test_range I, [2024-05-15T06:09:38.862502 #2385316] INFO -- : [ 96/885] 2426691=test_project_sanity I, [2024-05-15T06:09:38.894016 #2385316] INFO -- : [ 97/885] 2426679=test_rdoc_ri_paths I, [2024-05-15T06:09:38.903330 #2385316] INFO -- : [ 98/885] 2426683=test_ts I, [2024-05-15T06:09:38.909037 #2385316] INFO -- : [ 99/885] 2426681=test_locale I, [2024-05-15T06:09:38.912378 #2385316] INFO -- : [100/885] 2426688=test_addr I, [2024-05-15T06:09:38.933241 #2385316] INFO -- : [101/885] 2426691=library_symbols_test I, [2024-05-15T06:09:38.934208 #2385316] INFO -- : [102/885] 2426688=test_ensured I, [2024-05-15T06:09:38.936730 #2385316] INFO -- : [103/885] 2426691=test_parser I, [2024-05-15T06:09:38.978482 #2385316] INFO -- : [104/885] 2426688=test_cgi_core I, [2024-05-15T06:09:38.990051 #2385316] INFO -- : [105/885] 2426688=test_gem I, [2024-05-15T06:09:39.000592 #2385316] INFO -- : [106/885] 2426691=test_gem_source_lock I, [2024-05-15T06:09:39.009601 #2385316] INFO -- : [107/885] 2426681=test_gem_commands_open_command I, [2024-05-15T06:09:39.023222 #2385316] INFO -- : [108/885] 2426692=test_dns I, [2024-05-15T06:09:39.024078 #2385316] INFO -- : [109/885] 2426677=test_ractor I, [2024-05-15T06:09:39.040906 #2385316] INFO -- : [110/885] 2426677=test_registry I, [2024-05-15T06:09:39.042820 #2385316] INFO -- : [111/885] 2426677=parse_stream_test I, [2024-05-15T06:09:39.044065 #2385316] INFO -- : [112/885] 2426691=test_debugger_integration I, [2024-05-15T06:09:39.049115 #2385316] INFO -- : [113/885] 2426677=test_rendering I, [2024-05-15T06:09:39.052786 #2385316] INFO -- : [114/885] 2426691=json_ext_parser_test I, [2024-05-15T06:09:39.055994 #2385316] INFO -- : [115/885] 2426685=test_thread I, [2024-05-15T06:09:39.067618 #2385316] INFO -- : [116/885] 2426691=test_my_integer I, [2024-05-15T06:09:39.069622 #2385316] INFO -- : [117/885] 2426691=test_ractor I, [2024-05-15T06:09:39.070039 #2385316] INFO -- : [118/885] 2426679=test_ssl I, [2024-05-15T06:09:39.099207 #2385316] INFO -- : [119/885] 2426677=test_reline_key I, [2024-05-15T06:09:39.104495 #2385316] INFO -- : [120/885] 2426677=test_rb_str_dup I, [2024-05-15T06:09:39.106582 #2385316] INFO -- : [121/885] 2426677=test_ancdata I, [2024-05-15T06:09:39.109594 #2385316] INFO -- : [122/885] 2426677=test_singleton_function I, [2024-05-15T06:09:39.112244 #2385316] INFO -- : [123/885] 2426677=test_timeout I, [2024-05-15T06:09:39.115797 #2385316] INFO -- : [124/885] 2426681=test_alias I, [2024-05-15T06:09:39.283391 #2385316] INFO -- : [125/885] 2426681=test_nonblock I, [2024-05-15T06:09:39.293057 #2385316] INFO -- : [126/885] 2426681=test_weakref I, [2024-05-15T06:09:39.373644 #2385316] INFO -- : [127/885] 2426687=test_unicode_normalize I, [2024-05-15T06:09:39.435435 #2385316] INFO -- : [128/885] 2426681=test_marshal I, [2024-05-15T06:09:39.458120 #2385316] INFO -- : [129/885] 2426683=test_rubygems I, [2024-05-15T06:09:39.510113 #2385316] INFO -- : [130/885] 2426691=test_https_proxy I, [2024-05-15T06:09:39.519527 #2385316] INFO -- : [131/885] 2426692=test_call I, [2024-05-15T06:09:39.566814 #2385316] INFO -- : [132/885] 2426691=test_rubyoptions I, [2024-05-15T06:09:39.577051 #2385316] INFO -- : [133/885] 2426679=test_super I, [2024-05-15T06:09:39.610429 #2385316] INFO -- : [134/885] 2426682=test_integer I, [2024-05-15T06:09:39.613000 #2385316] INFO -- : [135/885] 2426683=test_cgi_modruby I, [2024-05-15T06:09:39.628587 #2385316] INFO -- : [136/885] 2426683=test_usrmarshal I, [2024-05-15T06:09:39.634822 #2385316] INFO -- : [137/885] 2426686=test_object_references I, [2024-05-15T06:09:39.649165 #2385316] INFO -- : [138/885] 2426692=test_gem_resolver_git_specification I, [2024-05-15T06:09:39.669584 #2385316] INFO -- : [139/885] 2426686=test_have_func I, [2024-05-15T06:09:39.797096 #2385316] INFO -- : [140/885] 2426683=test_stat I, [2024-05-15T06:09:39.802396 #2385316] INFO -- : [141/885] 2426683=test_gem_request_set_lockfile_tokenizer I, [2024-05-15T06:09:39.833901 #2385316] INFO -- : [142/885] 2426681=test_capacity I, [2024-05-15T06:09:39.841148 #2385316] INFO -- : [143/885] 2426681=test_nextafter I, [2024-05-15T06:09:39.844909 #2385316] INFO -- : [144/885] 2426683=test_dryrun I, [2024-05-15T06:09:39.858915 #2385316] INFO -- : [145/885] 2426683=desugar_compiler_test I, [2024-05-15T06:09:39.905134 #2385316] INFO -- : [146/885] 2426681=test_integer I, [2024-05-15T06:09:39.927873 #2385316] INFO -- : [147/885] 2426677=test_env I, [2024-05-15T06:09:39.935189 #2385316] INFO -- : [148/885] 2426683=test_rdoc_attr I, [2024-05-15T06:09:39.982653 #2385316] INFO -- : [149/885] 2426681=test_gem_commands_setup_command I, [2024-05-15T06:09:40.071731 #2385316] INFO -- : [150/885] 2426683=test_member I, [2024-05-15T06:09:40.079255 #2385316] INFO -- : [151/885] 2426683=test_numeric I, [2024-05-15T06:09:40.080224 #2385316] INFO -- : [152/885] 2426692=test_word I, [2024-05-15T06:09:40.096164 #2385316] INFO -- : [153/885] 2426692=test_gem_commands_cleanup_command I, [2024-05-15T06:09:40.101728 #2385316] INFO -- : [154/885] 2426683=test_cgi_multipart I, [2024-05-15T06:09:40.221783 #2385316] INFO -- : [155/885] 2426679=test_eval I, [2024-05-15T06:09:40.230725 #2385316] INFO -- : [156/885] 2426679=test_autoconf I, [2024-05-15T06:09:40.234413 #2385316] INFO -- : [157/885] 2426679=format_errors_test I, [2024-05-15T06:09:40.244890 #2385316] INFO -- : [158/885] 2426683=test_dir I, [2024-05-15T06:09:40.321684 #2385316] INFO -- : [159/885] 2426679=test_date_ractor I, [2024-05-15T06:09:40.340864 #2385316] INFO -- : [160/885] 2426681=test_gem_console_ui I, [2024-05-15T06:09:40.348147 #2385316] INFO -- : [161/885] 2426681=test_ractor_compatibility I, [2024-05-15T06:09:40.388626 #2385316] INFO -- : Environment variable changed: TestGem#test_self_clear_paths : "GEM_PRIVATE_KEY_PASSPHRASE" added I, [2024-05-15T06:09:40.388691 #2385316] INFO -- : Environment variable changed: TestGem#test_self_clear_paths : "GEM_SPEC_CACHE" added I, [2024-05-15T06:09:40.388712 #2385316] INFO -- : Environment variable changed: TestGem#test_self_clear_paths : "HOME" changed : "/home/ko1" -> "/tmp/rubytest.v0gza1/test_rubygems_20240515-2426688-sg9024/userhome" I, [2024-05-15T06:09:40.394377 #2385316] INFO -- : [162/885] 2426678=test_symbol I, [2024-05-15T06:09:40.396838 #2385316] INFO -- : Environment variable changed: TestGem#test_self_clear_paths : "RUBYGEMS_PREVENT_UPDATE_SUGGESTION" added I, [2024-05-15T06:09:40.408150 #2385316] INFO -- : [163/885] 2426678=location_test I, [2024-05-15T06:09:40.448170 #2385316] INFO -- : [164/885] 2426678=test_coderange I, [2024-05-15T06:09:40.450104 #2385316] INFO -- : [165/885] 2426678=test_mailto I, [2024-05-15T06:09:40.450932 #2385316] INFO -- : [166/885] 2426689=test_resize I, [2024-05-15T06:09:40.454197 #2385316] INFO -- : [167/885] 2426689=test_error_highlight I, [2024-05-15T06:09:40.469827 #2385316] INFO -- : [168/885] 2426678=test_rdoc_comment I, [2024-05-15T06:09:40.488266 #2385316] INFO -- : [169/885] 2426683=test_rdoc_generator_darkfish I, [2024-05-15T06:09:40.506453 #2385316] INFO -- : [170/885] 2426678=test_gem_source_fetch_problem I, [2024-05-15T06:09:40.559540 #2385316] INFO -- : [171/885] 2426679=json_generic_object_test I, [2024-05-15T06:09:40.580309 #2385316] INFO -- : [172/885] 2426679=test_http_request I, [2024-05-15T06:09:40.583459 #2385316] INFO -- : [173/885] 2426679=test_function_entry I, [2024-05-15T06:09:40.586756 #2385316] INFO -- : [174/885] 2426679=test_pkcs7 I, [2024-05-15T06:09:40.635508 #2385316] INFO -- : [175/885] 2426678=test_arith_seq_beg_len_step I, [2024-05-15T06:09:40.672020 #2385316] INFO -- : [176/885] 2426692=test_gem_resolver_requirement_list I, [2024-05-15T06:09:40.675669 #2385316] INFO -- : [177/885] 2426692=test_unix I, [2024-05-15T06:09:40.681136 #2385316] INFO -- : [178/885] 2426678=test_lazy_enumerator I, [2024-05-15T06:09:40.709622 #2385316] INFO -- : [179/885] 2426692=test_enc_associate I, [2024-05-15T06:09:40.747605 #2385316] INFO -- : [180/885] 2426679=test_find_executable I, [2024-05-15T06:09:40.778344 #2385316] INFO -- : [181/885] 2426679=ruby_api_test I, [2024-05-15T06:09:40.795031 #2385316] INFO -- : [182/885] 2426681=test_nofree I, [2024-05-15T06:09:40.796958 #2385316] INFO -- : [183/885] 2426681=test_context I, [2024-05-15T06:09:40.809978 #2385316] INFO -- : [184/885] 2426683=test_gem_commands_pristine_command I, [2024-05-15T06:09:40.852234 #2385316] INFO -- : [185/885] 2426689=test_symbol I, [2024-05-15T06:09:40.874006 #2385316] INFO -- : [186/885] 2426688=test_coder I, [2024-05-15T06:09:40.876716 #2385316] INFO -- : [187/885] 2426681=ractor_test I, [2024-05-15T06:09:40.893478 #2385316] INFO -- : [188/885] 2426688=test_trace I, [2024-05-15T06:09:40.898314 #2385316] INFO -- : [189/885] 2426679=test_win32ole_event I, [2024-05-15T06:09:40.905279 #2385316] INFO -- : [190/885] 2426679=test_time_tz I, [2024-05-15T06:09:40.913218 #2385316] INFO -- : [191/885] 2426688=test_rdoc_generator_json_index I, [2024-05-15T06:09:40.917806 #2385316] INFO -- : [192/885] 2426686=test_gem_ci_detector I, [2024-05-15T06:09:40.925341 #2385316] INFO -- : Environment variable changed: TestCiDetector#test_ci? : "GEM_PRIVATE_KEY_PASSPHRASE" added I, [2024-05-15T06:09:40.925405 #2385316] INFO -- : Environment variable changed: TestCiDetector#test_ci? : "GEM_SPEC_CACHE" added I, [2024-05-15T06:09:40.925415 #2385316] INFO -- : Environment variable changed: TestCiDetector#test_ci? : "HOME" changed : "/home/ko1" -> "/tmp/rubytest.v0gza1/test_rubygems_20240515-2426686-u2lgzu/userhome" I, [2024-05-15T06:09:40.933998 #2385316] INFO -- : Environment variable changed: TestCiDetector#test_ci? : "RUBYGEMS_PREVENT_UPDATE_SUGGESTION" added I, [2024-05-15T06:09:40.937501 #2385316] INFO -- : Environment variable changed: TestCiDetector#test_ci_strings : "GEM_SPEC_CACHE" changed : "/tmp/rubytest.v0gza1/test_rubygems_20240515-2426686-u2lgzu/spec_cache" -> "/tmp/rubytest.v0gza1/test_rubygems_20240515-2426686-5fla9i/spec_cache" I, [2024-05-15T06:09:40.944663 #2385316] INFO -- : [193/885] 2426679=test_bignum I, [2024-05-15T06:09:40.945417 #2385316] INFO -- : [194/885] 2426681=test_rdoc_class_moduleEnvironment variable changed: TestCiDetector#test_ci_strings : "HOME" changed : "/tmp/rubytest.v0gza1/test_rubygems_20240515-2426686-u2lgzu/userhome" -> "/tmp/rubytest.v0gza1/test_rubygems_20240515-2426686-5fla9i/userhome" I, [2024-05-15T06:09:40.945510 #2385316] INFO -- : I, [2024-05-15T06:09:40.947585 #2385316] INFO -- : [195/885] 2426686=test_io_wait_uncommon I, [2024-05-15T06:09:40.949213 #2385316] INFO -- : [196/885] 2426686=test_arity I, [2024-05-15T06:09:40.952103 #2385316] INFO -- : [197/885] 2426686=test_stringio I, [2024-05-15T06:09:40.969323 #2385316] INFO -- : [198/885] 2426693=test_win32ole_variable I, [2024-05-15T06:09:40.969679 #2385316] INFO -- : [199/885] 2426693=test_gem_specification I, [2024-05-15T06:09:41.003984 #2385316] INFO -- : [200/885] 2426678=test_enum I, [2024-05-15T06:09:41.030185 #2385316] INFO -- : [201/885] 2426686=test_threadgroup I, [2024-05-15T06:09:41.033185 #2385316] INFO -- : [202/885] 2426679=test_resolve_symbol I, [2024-05-15T06:09:41.077980 #2385316] INFO -- : [203/885] 2426679=test_complex2 I, [2024-05-15T06:09:41.089473 #2385316] INFO -- : [204/885] 2426679=test_gem_package I, [2024-05-15T06:09:41.101101 #2385316] INFO -- : [205/885] 2426688=test_have_macro I, [2024-05-15T06:09:41.209637 #2385316] INFO -- : [206/885] 2426692=test_merge_keys I, [2024-05-15T06:09:41.222685 #2385316] INFO -- : [207/885] 2426692=test_rdoc_extend I, [2024-05-15T06:09:41.240444 #2385316] INFO -- : [208/885] 2426692=test_win32ole_variant I, [2024-05-15T06:09:41.247234 #2385316] INFO -- : [209/885] 2426692=test_rdoc_markup_to_ansi I, [2024-05-15T06:09:41.283164 #2385316] INFO -- : [210/885] 2426692=test_history I, [2024-05-15T06:09:41.292668 #2385316] INFO -- : [211/885] 2426692=test_mixed_unicode_escapes I, [2024-05-15T06:09:41.294302 #2385316] INFO -- : [212/885] 2426692=test_ipaddr I, [2024-05-15T06:09:41.318651 #2385316] INFO -- : [213/885] 2426692=test_gem_resolver_api_specification I, [2024-05-15T06:09:41.359549 #2385316] INFO -- : [214/885] 2426692=test_nesting_parser I, [2024-05-15T06:09:41.371977 #2385316] INFO -- : [215/885] 2426692=test_win32ole_method_event I, [2024-05-15T06:09:41.375465 #2385316] INFO -- : [216/885] 2426692=test_benchmark I, [2024-05-15T06:09:41.543550 #2385316] INFO -- : [217/885] 2426681=test_gem_dependency_list I, [2024-05-15T06:09:41.589061 #2385316] INFO -- : [218/885] 2426688=test_helper_method I, [2024-05-15T06:09:41.604994 #2385316] INFO -- : [219/885] 2426681=test_gem_package_tar_writer I, [2024-05-15T06:09:41.670865 #2385316] INFO -- : [220/885] 2426681=test_array I, [2024-05-15T06:09:41.684914 #2385316] INFO -- : [221/885] 2426688=test_gem_commands_outdated_command I, [2024-05-15T06:09:41.702039 #2385316] INFO -- : [222/885] 2426679=test_scalar_scanner I, [2024-05-15T06:09:41.712324 #2385316] INFO -- : [223/885] 2426679=test_gem_source I, [2024-05-15T06:09:41.732503 #2385316] INFO -- : [224/885] 2426688=test_yamldbm I, [2024-05-15T06:09:41.739524 #2385316] INFO -- : [225/885] 2426688=test_gem_commands_rebuild_command I, [2024-05-15T06:09:41.740912 #2385316] INFO -- : [226/885] 2426678=test_load I, [2024-05-15T06:09:41.743970 #2385316] INFO -- : [227/885] 2426678=test_rdoc_parser_simple I, [2024-05-15T06:09:41.760785 #2385316] INFO -- : [228/885] 2426678=test_provider I, [2024-05-15T06:09:41.813671 #2385316] INFO -- : [229/885] 2426688=test_abi I, [2024-05-15T06:09:41.867679 #2385316] INFO -- : [230/885] 2426683=test_evaluation I, [2024-05-15T06:09:41.878263 #2385316] INFO -- : [231/885] 2426683=test_gem_ext_builder I, [2024-05-15T06:09:41.918303 #2385316] INFO -- : [232/885] 2426687=test_https I, [2024-05-15T06:09:41.922056 #2385316] INFO -- : [233/885] 2426679=test_gem_source_installed I, [2024-05-15T06:09:41.936053 #2385316] INFO -- : [234/885] 2426679=test_erb I, [2024-05-15T06:09:41.938511 #2385316] INFO -- : [235/885] 2426688=test_x509ext I, [2024-05-15T06:09:41.946867 #2385316] INFO -- : [236/885] 2426688=test_completion I, [2024-05-15T06:09:41.988327 #2385316] INFO -- : [237/885] 2426679=test_gem_commands_cert_command I, [2024-05-15T06:09:42.038337 #2385316] INFO -- : [238/885] 2426686=test_yield_block I, [2024-05-15T06:09:42.043139 #2385316] INFO -- : [239/885] 2426686=test_len I, [2024-05-15T06:09:42.046114 #2385316] INFO -- : [240/885] 2426686=test_rational2 I, [2024-05-15T06:09:42.051536 #2385316] INFO -- : [241/885] 2426686=test_rational I, [2024-05-15T06:09:42.079054 #2385316] INFO -- : [242/885] 2426686=test_propertyputref I, [2024-05-15T06:09:42.081156 #2385316] INFO -- : [243/885] 2426686=attribute_write_test I, [2024-05-15T06:09:42.083425 #2385316] INFO -- : [244/885] 2426686=test_spell_checker I, [2024-05-15T06:09:42.096301 #2385316] INFO -- : [245/885] 2426686=test_assembler I, [2024-05-15T06:09:42.097774 #2385316] INFO -- : [246/885] 2426686=test_ssl I, [2024-05-15T06:09:42.104711 #2385316] INFO -- : [247/885] 2426678=test_gem_ext_cargo_builder I, [2024-05-15T06:09:42.106211 #2385316] INFO -- : [248/885] 2426689=constant_path_node_test I, [2024-05-15T06:09:42.128136 #2385316] INFO -- : [249/885] 2426678=test_gem_request_set I, [2024-05-15T06:09:42.166366 #2385316] INFO -- : [250/885] 2426689=test_module I, [2024-05-15T06:09:42.279619 #2385316] INFO -- : [251/885] 2426687=test_parser I, [2024-05-15T06:09:42.320913 #2385316] INFO -- : [252/885] 2426687=test_method_name_check I, [2024-05-15T06:09:42.342331 #2385316] INFO -- : [253/885] 2426687=test_arith_seq_extract I, [2024-05-15T06:09:42.392557 #2385316] INFO -- : [254/885] 2426688=test_monitor I, [2024-05-15T06:09:42.498379 #2385316] INFO -- : [255/885] 2426678=test_buffered_io I, [2024-05-15T06:09:42.518250 #2385316] INFO -- : [256/885] 2426682=test_rubyvm I, [2024-05-15T06:09:42.520385 #2385316] INFO -- : [257/885] 2426687=test_configuration I, [2024-05-15T06:09:42.531543 #2385316] INFO -- : [258/885] 2426682=test_rdoc_generator_markup I, [2024-05-15T06:09:42.545174 #2385316] INFO -- : [259/885] 2426695=test_whileuntil I, [2024-05-15T06:09:42.548032 #2385316] INFO -- : [260/885] 2426695=test_boolean I, [2024-05-15T06:09:42.548952 #2385316] INFO -- : [261/885] 2426678=integer_parse_test I, [2024-05-15T06:09:42.554932 #2385316] INFO -- : [262/885] 2426678=test_instrumentation_api I, [2024-05-15T06:09:42.578188 #2385316] INFO -- : [263/885] 2426695=test_stringify_symbols I, [2024-05-15T06:09:42.587209 #2385316] INFO -- : [264/885] 2426695=json_common_interface_test I, [2024-05-15T06:09:42.602742 #2385316] INFO -- : [265/885] 2426688=test_dln I, [2024-05-15T06:09:42.603216 #2385316] INFO -- : [266/885] 2426688=test_gem_source_subpath_problem I, [2024-05-15T06:09:42.607841 #2385316] INFO -- : [267/885] 2426695=test_win32ole_variant_outarg I, [2024-05-15T06:09:42.611504 #2385316] INFO -- : [268/885] 2426695=test_config I, [2024-05-15T06:09:42.622138 #2385316] INFO -- : [269/885] 2426692=memsize_test I, [2024-05-15T06:09:42.635571 #2385316] INFO -- : [270/885] 2426687=test_nomethod_error I, [2024-05-15T06:09:42.639709 #2385316] INFO -- : [271/885] 2426687=json_parser_test I, [2024-05-15T06:09:42.649067 #2385316] INFO -- : [272/885] 2426695=test_cparser I, [2024-05-15T06:09:42.670002 #2385316] INFO -- : [273/885] 2426687=test_pkg_config I, [2024-05-15T06:09:42.679736 #2385316] INFO -- : [274/885] 2426687=test_variable I, [2024-05-15T06:09:42.685356 #2385316] INFO -- : [275/885] 2426682=test_rdoc_markup_include I, [2024-05-15T06:09:42.689502 #2385316] INFO -- : [276/885] 2426682=test_sexp I, [2024-05-15T06:09:42.699017 #2385316] INFO -- : [277/885] 2426677=fuzzer_test I, [2024-05-15T06:09:42.702069 #2385316] INFO -- : [278/885] 2426692=magic_comment_test I, [2024-05-15T06:09:42.704883 #2385316] INFO -- : [279/885] 2426677=test_rdoc_markup_to_html_snippet I, [2024-05-15T06:09:42.705486 #2385316] INFO -- : [280/885] 2426688=test_struct I, [2024-05-15T06:09:42.708548 #2385316] INFO -- : [281/885] 2426692=test_key_error I, [2024-05-15T06:09:42.710165 #2385316] INFO -- : [282/885] 2426688=test_div I, [2024-05-15T06:09:42.711398 #2385316] INFO -- : [283/885] 2426692=test_allocation I, [2024-05-15T06:09:42.714095 #2385316] INFO -- : [284/885] 2426688=test_engine I, [2024-05-15T06:09:42.715108 #2385316] INFO -- : [285/885] 2426688=test_win32ole_variant_m I, [2024-05-15T06:09:42.718427 #2385316] INFO -- : [286/885] 2426688=test_deprecated I, [2024-05-15T06:09:42.721925 #2385316] INFO -- : [287/885] 2426682=test_color_printer I, [2024-05-15T06:09:42.724397 #2385316] INFO -- : [288/885] 2426688=test_serialize_subclasses I, [2024-05-15T06:09:42.729423 #2385316] INFO -- : [289/885] 2426688=test_insns_leaf I, [2024-05-15T06:09:42.730862 #2385316] INFO -- : [290/885] 2426688=test_gem_path_support I, [2024-05-15T06:09:42.758910 #2385316] INFO -- : [291/885] 2426687=test_struct I, [2024-05-15T06:09:42.760237 #2385316] INFO -- : [292/885] 2426688=test_set I, [2024-05-15T06:09:42.776800 #2385316] INFO -- : [293/885] 2426682=test_files_test_1 I, [2024-05-15T06:09:42.783589 #2385316] INFO -- : [294/885] 2426688=test_rdoc_rd_inline I, [2024-05-15T06:09:42.791620 #2385316] INFO -- : [295/885] 2426688=test_mutex I, [2024-05-15T06:09:42.811639 #2385316] INFO -- : [296/885] 2426683=test_x509req I, [2024-05-15T06:09:42.875622 #2385316] INFO -- : [297/885] 2426695=test_cgi_cookie I, [2024-05-15T06:09:42.886021 #2385316] INFO -- : [298/885] 2426695=test_require I, [2024-05-15T06:09:42.916823 #2385316] INFO -- : [299/885] 2426677=test_float I, [2024-05-15T06:09:43.000637 #2385316] INFO -- : [300/885] 2426683=test_gem_resolver_installer_set I, [2024-05-15T06:09:43.143703 #2385316] INFO -- : [301/885] 2426684=test_dir_m17n I, [2024-05-15T06:09:43.180348 #2385316] INFO -- : [302/885] 2426683=test_gem_source_git I, [2024-05-15T06:09:43.270598 #2385316] INFO -- : [303/885] 2426687=test_gem_commands_signout_command I, [2024-05-15T06:09:43.306365 #2385316] INFO -- : [304/885] 2426687=test_refinement I, [2024-05-15T06:09:43.378866 #2385316] INFO -- : [305/885] 2426693=test_regex_casefold I, [2024-05-15T06:09:43.678076 #2385316] INFO -- : [306/885] 2426683=test_x509crl I, [2024-05-15T06:09:43.723211 #2385316] INFO -- : [307/885] 2426689=test_fixnum I, [2024-05-15T06:09:43.732715 #2385316] INFO -- : [308/885] 2426689=test_signal I, [2024-05-15T06:09:43.803200 #2385316] INFO -- : [309/885] 2426693=test_metaclass I, [2024-05-15T06:09:43.806058 #2385316] INFO -- : [310/885] 2426683=test_rdoc_top_level I, [2024-05-15T06:09:43.810751 #2385316] INFO -- : [311/885] 2426693=test_rdoc_rd I, [2024-05-15T06:09:43.918686 #2385316] INFO -- : [312/885] 2426693=test_cgi_session I, [2024-05-15T06:09:43.921698 #2385316] INFO -- : [313/885] 2426688=test_input_method I, [2024-05-15T06:09:43.947589 #2385316] INFO -- : [314/885] 2426693=test_windows_1252 I, [2024-05-15T06:09:43.948814 #2385316] INFO -- : [315/885] 2426693=test_process I, [2024-05-15T06:09:43.968206 #2385316] INFO -- : [316/885] 2426688=test_omap I, [2024-05-15T06:09:43.973700 #2385316] INFO -- : [317/885] 2426693=test_iterator I, [2024-05-15T06:09:43.977956 #2385316] INFO -- : [318/885] 2426688=test_string I, [2024-05-15T06:09:43.990033 #2385316] INFO -- : [319/885] 2426688=test_digest_extend I, [2024-05-15T06:09:44.018712 #2385316] INFO -- : [320/885] 2426688=test_shellwords I, [2024-05-15T06:09:44.025573 #2385316] INFO -- : [321/885] 2426688=test_memory_view I, [2024-05-15T06:09:44.032050 #2385316] INFO -- : [322/885] 2426683=pattern_test I, [2024-05-15T06:09:44.037643 #2385316] INFO -- : [323/885] 2426693=test_debug I, [2024-05-15T06:09:44.041799 #2385316] INFO -- : [324/885] 2426693=test_gem_security_signer I, [2024-05-15T06:09:44.047447 #2385316] INFO -- : [325/885] 2426683=test_cipher I, [2024-05-15T06:09:44.050726 #2385316] INFO -- : [326/885] 2426688=test_new I, [2024-05-15T06:09:44.054005 #2385316] INFO -- : [327/885] 2426688=test_storage I, [2024-05-15T06:09:44.059196 #2385316] INFO -- : [328/885] 2426688=test_gem_resolver_git_set I, [2024-05-15T06:09:44.096505 #2385316] INFO -- : [329/885] 2426683=test_within_pipe I, [2024-05-15T06:09:44.132729 #2385316] INFO -- : [330/885] 2426693=test_gem_bundler_version_finder I, [2024-05-15T06:09:44.160990 #2385316] INFO -- : [331/885] 2426693=test_emoji_breaks I, [2024-05-15T06:09:44.166039 #2385316] INFO -- : [332/885] 2426693=reflection_test I, [2024-05-15T06:09:44.168133 #2385316] INFO -- : [333/885] 2426683=test_beginendblock I, [2024-05-15T06:09:44.173405 #2385316] INFO -- : [334/885] 2426693=test_gem_commands_unpack_command I, [2024-05-15T06:09:44.345129 #2385316] INFO -- : [335/885] 2426679=test_files_lib I, [2024-05-15T06:09:44.359958 #2385316] INFO -- : [336/885] 2426677=test_help I, [2024-05-15T06:09:44.366422 #2385316] INFO -- : [337/885] 2426677=test_rdoc_markup_to_bs I, [2024-05-15T06:09:44.376061 #2385316] INFO -- : [338/885] 2426688=test_printf I, [2024-05-15T06:09:44.394879 #2385316] INFO -- : [339/885] 2426677=test_rdoc_markup_pre_process I, [2024-05-15T06:09:44.399728 #2385316] INFO -- : [340/885] 2426688=test_stream I, [2024-05-15T06:09:44.407510 #2385316] INFO -- : [341/885] 2426688=test_time I, [2024-05-15T06:09:44.439668 #2385316] INFO -- : [342/885] 2426693=test_webauthn_listener_response I, [2024-05-15T06:09:44.456580 #2385316] INFO -- : [343/885] 2426677=test_to_ary_concat I, [2024-05-15T06:09:44.462472 #2385316] INFO -- : [344/885] 2426693=test_pinned I, [2024-05-15T06:09:44.492399 #2385316] INFO -- : [345/885] 2426693=test_popen_deadlock I, [2024-05-15T06:09:44.529127 #2385316] INFO -- : [346/885] 2426684=test_delegate I, [2024-05-15T06:09:44.544394 #2385316] INFO -- : [347/885] 2426684=test_date_marshal I, [2024-05-15T06:09:44.545594 #2385316] INFO -- : [348/885] 2426684=test_mkmf I, [2024-05-15T06:09:44.562629 #2385316] INFO -- : [349/885] 2426688=test_history I, [2024-05-15T06:09:44.572845 #2385316] INFO -- : [350/885] 2426684=test_recursion I, [2024-05-15T06:09:44.573994 #2385316] INFO -- : [351/885] 2426684=test_exit I, [2024-05-15T06:09:44.581429 #2385316] INFO -- : [352/885] 2426688=test_digest I, [2024-05-15T06:09:44.591242 #2385316] INFO -- : [353/885] 2426688=test_rdoc_servlet I, [2024-05-15T06:09:44.615968 #2385316] INFO -- : [354/885] 2426683=test_gem_security I, [2024-05-15T06:09:44.717441 #2385316] INFO -- : [355/885] 2426688=test_ractor I, [2024-05-15T06:09:44.753369 #2385316] INFO -- : [356/885] 2426684=test_open3 I, [2024-05-15T06:09:44.766376 #2385316] INFO -- : [357/885] 2426696=test_fiber I, [2024-05-15T06:09:44.816014 #2385316] INFO -- : [358/885] 2426688=test_multi_irb_commands I, [2024-05-15T06:09:44.821433 #2385316] INFO -- : [359/885] 2426688=test_closure I, [2024-05-15T06:09:45.192338 #2385316] INFO -- : [360/885] 2426693=test_bundled_ca I, [2024-05-15T06:09:45.225108 #2385316] INFO -- : [361/885] 2426682=test_gem_commands_build_command I, [2024-05-15T06:09:45.327416 #2385316] INFO -- : [362/885] 2426692=test_case_comprehensive I, [2024-05-15T06:09:45.345911 #2385316] INFO -- : [363/885] 2426688=test_interned_str I, [2024-05-15T06:09:45.350024 #2385316] INFO -- : [364/885] 2426688=test_did_you_mean I, [2024-05-15T06:09:45.441371 #2385316] INFO -- : [365/885] 2426682=test_variable_name_check I, [2024-05-15T06:09:45.474875 #2385316] INFO -- : [366/885] 2426682=test_io_m17n I, [2024-05-15T06:09:45.481976 #2385316] INFO -- : [367/885] 2426688=test_gem_commands_server_command I, [2024-05-15T06:09:45.485026 #2385316] INFO -- : [368/885] 2426688=test_option I, [2024-05-15T06:09:45.558000 #2385316] INFO -- : [369/885] 2426678=test_append I, [2024-05-15T06:09:45.564492 #2385316] INFO -- : [370/885] 2426678=test_tracer I, [2024-05-15T06:09:45.580032 #2385316] INFO -- : [371/885] 2426688=test_cmethod I, [2024-05-15T06:09:45.587380 #2385316] INFO -- : [372/885] 2426688=test_iseq I, [2024-05-15T06:09:45.681235 #2385316] INFO -- : [373/885] 2426678=test_exception_at_throwing I, [2024-05-15T06:09:45.742894 #2385316] INFO -- : [374/885] 2426678=test_rdoc_markup_heading I, [2024-05-15T06:09:45.753809 #2385316] INFO -- : [375/885] 2426678=test_class I, [2024-05-15T06:09:45.759877 #2385316] INFO -- : [376/885] 2426678=test_ocsp I, [2024-05-15T06:09:45.855807 #2385316] INFO -- : [377/885] 2426695=test_pkey_dsa I, [2024-05-15T06:09:45.880708 #2385316] INFO -- : [378/885] 2426689=test_scheduler I, [2024-05-15T06:09:45.897356 #2385316] INFO -- : [379/885] 2426681=test_bug-14834 I, [2024-05-15T06:09:45.989201 #2385316] INFO -- : [380/885] 2426681=test_rdoc_markup_to_html I, [2024-05-15T06:09:46.039162 #2385316] INFO -- : [381/885] 2426681=test_date_compat I, [2024-05-15T06:09:46.041039 #2385316] INFO -- : [382/885] 2426689=test_compile_prism I, [2024-05-15T06:09:46.044449 #2385316] INFO -- : [383/885] 2426681=test_terminfo I, [2024-05-15T06:09:46.044743 #2385316] INFO -- : [384/885] 2426678=test_win32ole_param_event I, [2024-05-15T06:09:46.046816 #2385316] INFO -- : [385/885] 2426678=test_bn I, [2024-05-15T06:09:46.050769 #2385316] INFO -- : [386/885] 2426681=test_case_mapping I, [2024-05-15T06:09:46.056125 #2385316] INFO -- : [387/885] 2426681=redundant_return_test I, [2024-05-15T06:09:46.056582 #2385316] INFO -- : [388/885] 2426678=test_path I, [2024-05-15T06:09:46.062453 #2385316] INFO -- : [389/885] 2426678=test_tree_spell_checker I, [2024-05-15T06:09:46.089312 #2385316] INFO -- : [390/885] 2426678=test_addrinfo I, [2024-05-15T06:09:46.111133 #2385316] INFO -- : [391/885] 2426681=test_http I, [2024-05-15T06:09:46.120502 #2385316] INFO -- : [392/885] 2426678=test_rdoc_method_attr I, [2024-05-15T06:09:46.141465 #2385316] INFO -- : [393/885] 2426688=static_literals_test I, [2024-05-15T06:09:46.146355 #2385316] INFO -- : [394/885] 2426688=test_data I, [2024-05-15T06:09:46.151633 #2385316] INFO -- : [395/885] 2426688=test_gem_gem_runner I, [2024-05-15T06:09:46.197243 #2385316] INFO -- : [396/885] 2426688=test_filter I, [2024-05-15T06:09:46.202419 #2385316] INFO -- : [397/885] 2426677=test_rdoc_generator_pot I, [2024-05-15T06:09:46.208493 #2385316] INFO -- : [398/885] 2426677=test_unicode I, [2024-05-15T06:09:46.212164 #2385316] INFO -- : [399/885] 2426677=test_koi8 I, [2024-05-15T06:09:46.216839 #2385316] INFO -- : [400/885] 2426677=parameters_signature_test I, [2024-05-15T06:09:46.225009 #2385316] INFO -- : [401/885] 2426677=test_rdoc_parser_changelog I, [2024-05-15T06:09:46.238746 #2385316] INFO -- : [402/885] 2426678=test_enumerator I, [2024-05-15T06:09:46.242466 #2385316] INFO -- : [403/885] 2426688=test_lexer I, [2024-05-15T06:09:46.245433 #2385316] INFO -- : [404/885] 2426678=test_thread_cv I, [2024-05-15T06:09:46.259358 #2385316] INFO -- : [405/885] 2426688=test_ssl_session I, [2024-05-15T06:09:46.274790 #2385316] INFO -- : [406/885] 2426689=test_gem_commands_update_command I, [2024-05-15T06:09:46.283911 #2385316] INFO -- : [407/885] 2426677=test_gem_resolver_vendor_specification I, [2024-05-15T06:09:46.312628 #2385316] INFO -- : [408/885] 2426677=test_random I, [2024-05-15T06:09:46.322093 #2385316] INFO -- : [409/885] 2426677=test_notimplement I, [2024-05-15T06:09:46.324886 #2385316] INFO -- : [410/885] 2426677=test_key_event_record I, [2024-05-15T06:09:46.330741 #2385316] INFO -- : [411/885] 2426677=test_gem_uri I, [2024-05-15T06:09:46.358162 #2385316] INFO -- : [412/885] 2426677=test_primitive I, [2024-05-15T06:09:46.363432 #2385316] INFO -- : [413/885] 2426677=test_human_typo I, [2024-05-15T06:09:46.371807 #2385316] INFO -- : [414/885] 2426677=test_rbconfig I, [2024-05-15T06:09:46.374762 #2385316] INFO -- : [415/885] 2426677=test_euc_jp I, [2024-05-15T06:09:46.377126 #2385316] INFO -- : [416/885] 2426677=test_rdoc_generator_pot_po_entry I, [2024-05-15T06:09:46.384093 #2385316] INFO -- : [417/885] 2426677=test_acceptable I, [2024-05-15T06:09:46.482755 #2385316] INFO -- : [418/885] 2426677=test_document I, [2024-05-15T06:09:46.511746 #2385316] INFO -- : [419/885] 2426677=test_win32ole_param I, [2024-05-15T06:09:46.519478 #2385316] INFO -- : [420/885] 2426677=test_gem_commands_yank_command I, [2024-05-15T06:09:46.557482 #2385316] INFO -- : [421/885] 2426690=test_pair I, [2024-05-15T06:09:46.666852 #2385316] INFO -- : [422/885] 2426682=test_rdoc_i18n_locale I, [2024-05-15T06:09:46.672627 #2385316] INFO -- : [423/885] 2426682=test_name_error_extension I, [2024-05-15T06:09:46.685700 #2385316] INFO -- : [424/885] 2426682=test_chilled I, [2024-05-15T06:09:46.691609 #2385316] INFO -- : [425/885] 2426682=test_rdoc_ri_driver I, [2024-05-15T06:09:46.821066 #2385316] INFO -- : [426/885] 2426694=test_httpheader I, [2024-05-15T06:09:46.851121 #2385316] INFO -- : [427/885] 2426684=test_gem_resolver_local_specification I, [2024-05-15T06:09:46.879190 #2385316] INFO -- : [428/885] 2426678=test_httpresponses I, [2024-05-15T06:09:46.882371 #2385316] INFO -- : [429/885] 2426678=test_encoding I, [2024-05-15T06:09:46.885272 #2385316] INFO -- : [430/885] 2426682=test_set_len I, [2024-05-15T06:09:46.886399 #2385316] INFO -- : [431/885] 2426682=test_sockopt I, [2024-05-15T06:09:46.889359 #2385316] INFO -- : [432/885] 2426682=test_rdoc_markup_to_label I, [2024-05-15T06:09:46.893740 #2385316] INFO -- : [433/885] 2426678=test_install I, [2024-05-15T06:09:46.900844 #2385316] INFO -- : [434/885] 2426694=test_key_stroke I, [2024-05-15T06:09:46.910499 #2385316] INFO -- : [435/885] 2426684=test_color I, [2024-05-15T06:09:46.918783 #2385316] INFO -- : [436/885] 2426682=json_encoding_test I, [2024-05-15T06:09:46.927852 #2385316] INFO -- : [437/885] 2426682=test_type_completor I, [2024-05-15T06:09:46.932220 #2385316] INFO -- : [438/885] 2426682=test_summary I, [2024-05-15T06:09:46.965365 #2385316] INFO -- : [439/885] 2426694=test_console_attr I, [2024-05-15T06:09:46.967636 #2385316] INFO -- : [440/885] 2426694=test_date_attr I, [2024-05-15T06:09:46.976927 #2385316] INFO -- : [441/885] 2426694=test_ellipsize I, [2024-05-15T06:09:46.995208 #2385316] INFO -- : [442/885] 2426694=test_kwargs I, [2024-05-15T06:09:46.996376 #2385316] INFO -- : [443/885] 2426694=warnings_test I, [2024-05-15T06:09:47.003819 #2385316] INFO -- : [444/885] 2426677=test_gem_commands_exec_command I, [2024-05-15T06:09:47.044722 #2385316] INFO -- : [445/885] 2426693=test_io_wait I, [2024-05-15T06:09:47.056976 #2385316] INFO -- : [446/885] 2426684=test_ubf_async_safe I, [2024-05-15T06:09:47.063587 #2385316] INFO -- : [447/885] 2426684=test_hash I, [2024-05-15T06:09:47.067674 #2385316] INFO -- : [448/885] 2426682=test_win32ole_type_event I, [2024-05-15T06:09:47.075703 #2385316] INFO -- : [449/885] 2426682=test_emoji I, [2024-05-15T06:09:47.078810 #2385316] INFO -- : [450/885] 2426687=test_sorted_set I, [2024-05-15T06:09:47.090800 #2385316] INFO -- : [451/885] 2426682=test_io I, [2024-05-15T06:09:47.093891 #2385316] INFO -- : [452/885] 2426694=test_foreach I, [2024-05-15T06:09:47.095329 #2385316] INFO -- : [453/885] 2426695=test_gem_source_specific_file I, [2024-05-15T06:09:47.098250 #2385316] INFO -- : [454/885] 2426694=test_condition I, [2024-05-15T06:09:47.099143 #2385316] INFO -- : [455/885] 2426694=test_gem_commands_uninstall_command I, [2024-05-15T06:09:47.099590 #2385316] INFO -- : [456/885] 2426678=test_cp949 I, [2024-05-15T06:09:47.106214 #2385316] INFO -- : [457/885] 2426678=test_win32ole_record I, [2024-05-15T06:09:47.108671 #2385316] INFO -- : [458/885] 2426678=test_gem_unsatisfiable_dependency_error I, [2024-05-15T06:09:47.124621 #2385316] INFO -- : [459/885] 2426678=test_method I, [2024-05-15T06:09:47.254636 #2385316] INFO -- : [460/885] 2426688=test_gem_commands_query_command I, [2024-05-15T06:09:47.262265 #2385316] INFO -- : [461/885] 2426695=test_rdoc_rubygems_hook I, [2024-05-15T06:09:47.304777 #2385316] INFO -- : [462/885] 2426687=test_to_ruby I, [2024-05-15T06:09:47.321441 #2385316] INFO -- : [463/885] 2426682=test_pattern_key_name_check I, [2024-05-15T06:09:47.321754 #2385316] INFO -- : [464/885] 2426682=test_array_create I, [2024-05-15T06:09:47.323888 #2385316] INFO -- : [465/885] 2426682=test_pack I, [2024-05-15T06:09:47.336524 #2385316] INFO -- : [466/885] 2426687=test_gem_impossible_dependencies_error I, [2024-05-15T06:09:47.344183 #2385316] INFO -- : [467/885] 2426687=test_ftp I, [2024-05-15T06:09:47.356821 #2385316] INFO -- : [468/885] 2426687=test_rdoc_context_section I, [2024-05-15T06:09:47.379318 #2385316] INFO -- : [469/885] 2426693=test_euc_kr I, [2024-05-15T06:09:47.399243 #2385316] INFO -- : [470/885] 2426693=test_undef I, [2024-05-15T06:09:47.400396 #2385316] INFO -- : [471/885] 2426693=test_line_editor I, [2024-05-15T06:09:47.449373 #2385316] INFO -- : [472/885] 2426693=ripper_test I, [2024-05-15T06:09:47.454315 #2385316] INFO -- : [473/885] 2426687=test_objspace I, [2024-05-15T06:09:47.460392 #2385316] INFO -- : [474/885] 2426695=test_sprintf I, [2024-05-15T06:09:47.488772 #2385316] INFO -- : [475/885] 2426682=test_gem_requirement I, [2024-05-15T06:09:47.583190 #2385316] INFO -- : [476/885] 2426682=comments_test I, [2024-05-15T06:09:47.591997 #2385316] INFO -- : [477/885] 2426695=test_string_memory I, [2024-05-15T06:09:47.627996 #2385316] INFO -- : [478/885] 2426682=test_gem_security_trust_dir I, [2024-05-15T06:09:47.658685 #2385316] INFO -- : [479/885] 2426695=test_set I, [2024-05-15T06:09:47.665325 #2385316] INFO -- : [480/885] 2426695=test_show_source I, [2024-05-15T06:09:47.667178 #2385316] INFO -- : [481/885] 2426682=test_have_library I, [2024-05-15T06:09:47.759984 #2385316] INFO -- : [482/885] 2426695=test_remote_fetch_error I, [2024-05-15T06:09:47.770673 #2385316] INFO -- : [483/885] 2426695=test_gem_commands_stale_command I, [2024-05-15T06:09:47.780679 #2385316] INFO -- : [484/885] 2426695=test_c_struct_entry I, [2024-05-15T06:09:47.791836 #2385316] INFO -- : [485/885] 2426689=test_lock_native_thread I, [2024-05-15T06:09:47.827644 #2385316] INFO -- : [486/885] 2426685=test_win32ole_typelib I, [2024-05-15T06:09:47.830194 #2385316] INFO -- : [487/885] 2426685=test_protect I, [2024-05-15T06:09:47.833319 #2385316] INFO -- : [488/885] 2426685=test_raise_exception I, [2024-05-15T06:09:47.865844 #2385316] INFO -- : [489/885] 2426688=test_gem_request_set_lockfile I, [2024-05-15T06:09:47.881030 #2385316] INFO -- : [490/885] 2426693=test_external_new I, [2024-05-15T06:09:47.888193 #2385316] INFO -- : [491/885] 2426693=test_alias_and_anchor I, [2024-05-15T06:09:47.894216 #2385316] INFO -- : [492/885] 2426693=test_postponed_job I, [2024-05-15T06:09:47.924025 #2385316] INFO -- : [493/885] 2426695=test_hash I, [2024-05-15T06:09:47.928638 #2385316] INFO -- : [494/885] 2426694=test_tree_builder I, [2024-05-15T06:09:47.932282 #2385316] INFO -- : [495/885] 2426677=test_gem_resolver_dependency_request I, [2024-05-15T06:09:47.934859 #2385316] INFO -- : [496/885] 2426695=test_m17n I, [2024-05-15T06:09:47.938399 #2385316] INFO -- : [497/885] 2426694=test_gem_commands_environment_command I, [2024-05-15T06:09:47.954267 #2385316] INFO -- : [498/885] 2426677=test_ws I, [2024-05-15T06:09:47.970552 #2385316] INFO -- : [499/885] 2426677=test_yjit I, [2024-05-15T06:09:47.974952 #2385316] INFO -- : [500/885] 2426677=test_weakmap I, [2024-05-15T06:09:47.978177 #2385316] INFO -- : [501/885] 2426695=test_workspace I, [2024-05-15T06:09:47.986916 #2385316] INFO -- : [502/885] 2426694=test_ns_spki I, [2024-05-15T06:09:48.013216 #2385316] INFO -- : [503/885] 2426694=test_framework I, [2024-05-15T06:09:48.032420 #2385316] INFO -- : [504/885] 2426694=test_kill_ring I, [2024-05-15T06:09:48.043557 #2385316] INFO -- : [505/885] 2426694=test_argf I, [2024-05-15T06:09:48.052095 #2385316] INFO -- : [506/885] 2426689=test_rdoc_task I, [2024-05-15T06:09:48.061161 #2385316] INFO -- : [507/885] 2426689=test_gem_resolver_conflict I, [2024-05-15T06:09:48.068609 #2385316] INFO -- : [508/885] 2426679=test_io_buffer I, [2024-05-15T06:09:48.073155 #2385316] INFO -- : [509/885] 2426695=test_pack I, [2024-05-15T06:09:48.074131 #2385316] INFO -- : [510/885] 2426689=test_backtrace I, [2024-05-15T06:09:48.093181 #2385316] INFO -- : [511/885] 2426695=ruby_parser_test I, [2024-05-15T06:09:48.152694 #2385316] INFO -- : [512/885] 2426695=test_rdoc_markup_indented_paragraph I, [2024-05-15T06:09:48.157805 #2385316] INFO -- : [513/885] 2426695=test_rdoc_require I, [2024-05-15T06:09:48.175150 #2385316] INFO -- : [514/885] 2426695=locals_test I, [2024-05-15T06:09:48.179893 #2385316] INFO -- : [515/885] 2426679=test_readpartial I, [2024-05-15T06:09:48.207852 #2385316] INFO -- : [516/885] 2426688=test_gem_commands_install_command I, [2024-05-15T06:09:48.225485 #2385316] INFO -- : [517/885] 2426693=test_clone I, [2024-05-15T06:09:48.400010 #2385316] INFO -- : [518/885] 2426695=test_array I, [2024-05-15T06:09:48.405552 #2385316] INFO -- : [519/885] 2426695=test_optparse I, [2024-05-15T06:09:48.408901 #2385316] INFO -- : [520/885] 2426695=test_fstring I, [2024-05-15T06:09:48.413815 #2385316] INFO -- : [521/885] 2426693=test_typeddata I, [2024-05-15T06:09:48.415919 #2385316] INFO -- : [522/885] 2426691=encoding_test I, [2024-05-15T06:09:48.485102 #2385316] INFO -- : [523/885] 2426691=test_gem_resolver_best_set I, [2024-05-15T06:09:48.492465 #2385316] INFO -- : [524/885] 2426695=test_rdoc_markup_to_html_crossref I, [2024-05-15T06:09:48.494484 #2385316] INFO -- : [525/885] 2426685=test_webauthn_poller I, [2024-05-15T06:09:48.537659 #2385316] INFO -- : [526/885] 2426691=test_rdoc_markup_raw I, [2024-05-15T06:09:48.540217 #2385316] INFO -- : [527/885] 2426691=test_rat I, [2024-05-15T06:09:48.547914 #2385316] INFO -- : [528/885] 2426691=test_files_sample I, [2024-05-15T06:09:48.584189 #2385316] INFO -- : [529/885] 2426679=test_stringscanner I, [2024-05-15T06:09:48.596891 #2385316] INFO -- : [530/885] 2426693=test_yield I, [2024-05-15T06:09:48.638015 #2385316] INFO -- : [531/885] 2426679=test_rdoc_alias I, [2024-05-15T06:09:48.652093 #2385316] INFO -- : [532/885] 2426691=parser_test I, [2024-05-15T06:09:48.659727 #2385316] INFO -- : [533/885] 2426691=test_convertible I, [2024-05-15T06:09:48.676102 #2385316] INFO -- : [534/885] 2426679=test_pkcs12 I, [2024-05-15T06:09:48.734050 #2385316] INFO -- : [535/885] 2426695=test_system I, [2024-05-15T06:09:48.873492 #2385316] INFO -- : [536/885] 2426685=test_iseq_load I, [2024-05-15T06:09:48.892420 #2385316] INFO -- : [537/885] 2426682=test_gem_util I, [2024-05-15T06:09:49.018112 #2385316] INFO -- : [538/885] 2426682=test_gem_package_tar_header I, [2024-05-15T06:09:49.054434 #2385316] INFO -- : [539/885] 2426679=test_bigzero I, [2024-05-15T06:09:49.055837 #2385316] INFO -- : [540/885] 2426679=test_pkey_dh I, [2024-05-15T06:09:49.057769 #2385316] INFO -- : [541/885] 2426682=test_gem_resolver_activation_request I, [2024-05-15T06:09:49.068538 #2385316] INFO -- : [542/885] 2426682=test_protocol I, [2024-05-15T06:09:49.144463 #2385316] INFO -- : [543/885] 2426679=test_getopts I, [2024-05-15T06:09:49.145923 #2385316] INFO -- : [544/885] 2426679=test_ripper I, [2024-05-15T06:09:49.206325 #2385316] INFO -- : [545/885] 2426683=test_gem_config_file I, [2024-05-15T06:09:49.293051 #2385316] INFO -- : [546/885] 2426683=test_etc I, [2024-05-15T06:09:49.319634 #2385316] INFO -- : [547/885] 2426689=test_yjit_exit_locations I, [2024-05-15T06:09:49.319868 #2385316] INFO -- : [548/885] 2426689=test_yaml_tree I, [2024-05-15T06:09:49.339862 #2385316] INFO -- : [549/885] 2426689=test_config I, [2024-05-15T06:09:49.375417 #2385316] INFO -- : [550/885] 2426683=test_sleep I, [2024-05-15T06:09:49.376517 #2385316] INFO -- : [551/885] 2426682=test_gc I, [2024-05-15T06:09:49.377304 #2385316] INFO -- : [552/885] 2426689=test_gem_commands_fetch_command I, [2024-05-15T06:09:49.378566 #2385316] INFO -- : [553/885] 2426682=test_math I, [2024-05-15T06:09:49.396236 #2385316] INFO -- : [554/885] 2426682=test_libs I, [2024-05-15T06:09:49.409311 #2385316] INFO -- : [555/885] 2426682=test_unicode_escape I, [2024-05-15T06:09:49.433987 #2385316] INFO -- : [556/885] 2426679=test_io I, [2024-05-15T06:09:49.435662 #2385316] INFO -- : [557/885] 2426688=test_autoload I, [2024-05-15T06:09:49.499879 #2385316] INFO -- : [558/885] 2426689=test_utf16 I, [2024-05-15T06:09:49.501890 #2385316] INFO -- : [559/885] 2426682=test_rendering I, [2024-05-15T06:09:49.513038 #2385316] INFO -- : [560/885] 2426689=test_face I, [2024-05-15T06:09:49.540198 #2385316] INFO -- : [561/885] 2426695=test_case I, [2024-05-15T06:09:49.559391 #2385316] INFO -- : [562/885] 2426682=test_sizeof I, [2024-05-15T06:09:49.567175 #2385316] INFO -- : [563/885] 2426695=test_gem_ext_cmake_builder I, [2024-05-15T06:09:49.576429 #2385316] INFO -- : [564/885] 2426689=test_gem_commands_contents_command I, [2024-05-15T06:09:49.584961 #2385316] INFO -- : [565/885] 2426695=test_cgi_util I, [2024-05-15T06:09:49.669671 #2385316] INFO -- : [566/885] 2426689=test_require I, [2024-05-15T06:09:49.825059 #2385316] INFO -- : [567/885] 2426695=test_marshalable I, [2024-05-15T06:09:49.827340 #2385316] INFO -- : [568/885] 2426695=test_digest I, [2024-05-15T06:09:49.942918 #2385316] INFO -- : [569/885] 2426690=test_ractor I, [2024-05-15T06:09:49.969362 #2385316] INFO -- : [570/885] 2426685=test_find I, [2024-05-15T06:09:49.978305 #2385316] INFO -- : [571/885] 2426685=test_fiddle I, [2024-05-15T06:09:50.011166 #2385316] INFO -- : [572/885] 2426685=test_wss I, [2024-05-15T06:09:50.027482 #2385316] INFO -- : [573/885] 2426685=test_gem_available_set I, [2024-05-15T06:09:50.043283 #2385316] INFO -- : [574/885] 2426690=test_rdoc_markdown I, [2024-05-15T06:09:50.107305 #2385316] INFO -- : [575/885] 2426685=test_modify_expand I, [2024-05-15T06:09:50.108001 #2385316] INFO -- : [576/885] 2426685=test_rdoc_any_method I, [2024-05-15T06:09:50.211490 #2385316] INFO -- : [577/885] 2426686=test_file I, [2024-05-15T06:09:50.243462 #2385316] INFO -- : [578/885] 2426686=test_rdoc_encoding I, [2024-05-15T06:09:50.333840 #2385316] INFO -- : [579/885] 2426690=test_coverage I, [2024-05-15T06:09:50.401117 #2385316] INFO -- : [580/885] 2426686=test_gem_package_tar_reader I, [2024-05-15T06:09:50.431258 #2385316] INFO -- : [581/885] 2426686=regexp_test I, [2024-05-15T06:09:50.443227 #2385316] INFO -- : [582/885] 2426686=test_complexrational I, [2024-05-15T06:09:50.447070 #2385316] INFO -- : [583/885] 2426686=test_init I, [2024-05-15T06:09:50.506987 #2385316] INFO -- : [584/885] 2426685=test_pathname I, [2024-05-15T06:09:50.639833 #2385316] INFO -- : [585/885] 2426695=test_gem_commands_owner_command I, [2024-05-15T06:09:50.644221 #2385316] INFO -- : [586/885] 2426685=test_gem_source_vendor I, [2024-05-15T06:09:50.653962 #2385316] INFO -- : [587/885] 2426685=test_recorder I, [2024-05-15T06:09:50.657041 #2385316] INFO -- : [588/885] 2426685=test_rdoc_constant I, [2024-05-15T06:09:50.706710 #2385316] INFO -- : [589/885] 2426696=test_deprecate I, [2024-05-15T06:09:50.743144 #2385316] INFO -- : [590/885] 2426685=test_bash_completion I, [2024-05-15T06:09:50.751275 #2385316] INFO -- : [591/885] 2426685=test_formatter I, [2024-05-15T06:09:50.754442 #2385316] INFO -- : [592/885] 2426685=test_yaml I, [2024-05-15T06:09:50.845276 #2385316] INFO -- : [593/885] 2426685=test_forwardable I, [2024-05-15T06:09:50.846967 #2385316] INFO -- : [594/885] 2426677=test_handle I, [2024-05-15T06:09:50.857620 #2385316] INFO -- : [595/885] 2426685=test_wait I, [2024-05-15T06:09:50.866161 #2385316] INFO -- : [596/885] 2426696=test_big2str I, [2024-05-15T06:09:50.869044 #2385316] INFO -- : [597/885] 2426696=test_bmethod I, [2024-05-15T06:09:50.871500 #2385316] INFO -- : [598/885] 2426696=test_euc_tw I, [2024-05-15T06:09:50.874713 #2385316] INFO -- : [599/885] 2426696=test_ractor I, [2024-05-15T06:09:50.891363 #2385316] INFO -- : [600/885] 2426696=test_gem_commands_sources_command I, [2024-05-15T06:09:50.934193 #2385316] INFO -- : [601/885] 2426685=test_ansi_without_terminfo I, [2024-05-15T06:09:50.973458 #2385316] INFO -- : [602/885] 2426689=test_nowrite I, [2024-05-15T06:09:50.984131 #2385316] INFO -- : [603/885] 2426689=test_thread_queue I, [2024-05-15T06:09:51.001412 #2385316] INFO -- : [604/885] 2426685=test_rdoc_markup_formatter I, [2024-05-15T06:09:51.008704 #2385316] INFO -- : [605/885] 2426686=test_comparable I, [2024-05-15T06:09:51.012471 #2385316] INFO -- : [606/885] 2426686=test_rdoc_parser_c I, [2024-05-15T06:09:51.016056 #2385316] INFO -- : [607/885] 2426685=test_io_timeout I, [2024-05-15T06:09:51.019648 #2385316] INFO -- : [608/885] 2426685=json_fixtures_test I, [2024-05-15T06:09:51.033961 #2385316] INFO -- : [609/885] 2426685=test_shapes I, [2024-05-15T06:09:51.042562 #2385316] INFO -- : [610/885] 2426685=test_cstr I, [2024-05-15T06:09:51.061308 #2385316] INFO -- : [611/885] 2426696=test_pstore I, [2024-05-15T06:09:51.066973 #2385316] INFO -- : [612/885] 2426693=test_profile_frames I, [2024-05-15T06:09:51.068696 #2385316] INFO -- : [613/885] 2426684=test_gbk I, [2024-05-15T06:09:51.073925 #2385316] INFO -- : [614/885] 2426684=test_class2name I, [2024-05-15T06:09:51.077788 #2385316] INFO -- : [615/885] 2426684=test_enc_str_buf_cat I, [2024-05-15T06:09:51.082258 #2385316] INFO -- : [616/885] 2426684=test_too_many_dummy_encodings I, [2024-05-15T06:09:51.100250 #2385316] INFO -- : [617/885] 2426696=test_rdoc_include I, [2024-05-15T06:09:51.151829 #2385316] INFO -- : [618/885] 2426690=test_reqarg I, [2024-05-15T06:09:51.160020 #2385316] INFO -- : [619/885] 2426684=test_gem_commands_list_command I, [2024-05-15T06:09:51.171071 #2385316] INFO -- : [620/885] 2426684=test_stack I, [2024-05-15T06:09:51.209524 #2385316] INFO -- : [621/885] 2426695=test_string_processing I, [2024-05-15T06:09:51.217303 #2385316] INFO -- : [622/885] 2426695=test_fileutils I, [2024-05-15T06:09:51.221643 #2385316] INFO -- : [623/885] 2426693=test_gem_commands_signin_command I, [2024-05-15T06:09:51.242411 #2385316] INFO -- : [624/885] 2426677=test_resource I, [2024-05-15T06:09:51.265742 #2385316] INFO -- : [625/885] 2426677=test_emitter I, [2024-05-15T06:09:51.271949 #2385316] INFO -- : [626/885] 2426677=test_ldap I, [2024-05-15T06:09:51.279458 #2385316] INFO -- : [627/885] 2426677=test_gem_version I, [2024-05-15T06:09:51.321018 #2385316] INFO -- : [628/885] 2426693=test_rdoc_options I, [2024-05-15T06:09:51.334878 #2385316] INFO -- : [629/885] 2426686=test_cesu8 I, [2024-05-15T06:09:51.340717 #2385316] INFO -- : [630/885] 2426686=test_econv I, [2024-05-15T06:09:51.368227 #2385316] INFO -- : [631/885] 2426677=test_rdoc_markup_verbatim I, [2024-05-15T06:09:51.373285 #2385316] INFO -- : [632/885] 2426677=test_inlinecache I, [2024-05-15T06:09:51.384788 #2385316] INFO -- : [633/885] 2426696=test_gem_dependency I, [2024-05-15T06:09:51.420373 #2385316] INFO -- : [634/885] 2426677=test_gem_resolver_specification I, [2024-05-15T06:09:51.421404 #2385316] INFO -- : [635/885] 2426683=test_path_to_class I, [2024-05-15T06:09:51.424417 #2385316] INFO -- : [636/885] 2426683=test_gem_ext_ext_conf_builder I, [2024-05-15T06:09:51.443393 #2385316] INFO -- : [637/885] 2426677=test_frozen_error I, [2024-05-15T06:09:51.448030 #2385316] INFO -- : [638/885] 2426677=test_method_cache I, [2024-05-15T06:09:51.449749 #2385316] INFO -- : [639/885] 2426677=test_gem_stub_specification I, [2024-05-15T06:09:51.481413 #2385316] INFO -- : [640/885] 2426685=test_gem_commands_search_command I, [2024-05-15T06:09:51.489042 #2385316] INFO -- : [641/885] 2426685=test_complex I, [2024-05-15T06:09:51.520424 #2385316] INFO -- : [642/885] 2426696=test_scanner_events I, [2024-05-15T06:09:51.541290 #2385316] INFO -- : [643/885] 2426690=test_gem_resolver_installed_specification I, [2024-05-15T06:09:51.546169 #2385316] INFO -- : [644/885] 2426696=test_mdns I, [2024-05-15T06:09:51.556347 #2385316] INFO -- : [645/885] 2426695=test_parse I, [2024-05-15T06:09:51.560260 #2385316] INFO -- : [646/885] 2426696=test_gem_remote_fetcher I, [2024-05-15T06:09:51.584736 #2385316] INFO -- : [647/885] 2426677=test_yamlstore I, [2024-05-15T06:09:51.590416 #2385316] INFO -- : [648/885] 2426677=test_gem_installer I, [2024-05-15T06:09:51.600962 #2385316] INFO -- : [649/885] 2426685=test_date_strftime I, [2024-05-15T06:09:51.623768 #2385316] INFO -- : [650/885] 2426693=test_rdoc_parser_rd I, [2024-05-15T06:09:51.637675 #2385316] INFO -- : [651/885] 2426693=test_irb I, [2024-05-15T06:09:51.772897 #2385316] INFO -- : [652/885] 2426690=test_const I, [2024-05-15T06:09:51.780167 #2385316] INFO -- : [653/885] 2426690=test_rdoc_normal_class I, [2024-05-15T06:09:51.924567 #2385316] INFO -- : [654/885] 2426690=test_class I, [2024-05-15T06:09:52.040990 #2385316] INFO -- : [655/885] 2426693=test_load I, [2024-05-15T06:09:52.051533 #2385316] INFO -- : [656/885] 2426693=json_string_matching_test I, [2024-05-15T06:09:52.057249 #2385316] INFO -- : [657/885] 2426693=test_random I, [2024-05-15T06:09:52.067388 #2385316] INFO -- : [658/885] 2426684=test_asn1 I, [2024-05-15T06:09:52.068808 #2385316] INFO -- : [659/885] 2426693=test_tempfile I, [2024-05-15T06:09:52.091392 #2385316] INFO -- : [660/885] 2426684=test_noarg I, [2024-05-15T06:09:52.105265 #2385316] INFO -- : [661/885] 2426695=parse_comments_test I, [2024-05-15T06:09:52.106219 #2385316] INFO -- : [662/885] 2426695=test_queue I, [2024-05-15T06:09:52.119042 #2385316] INFO -- : [663/885] 2426695=test_function I, [2024-05-15T06:09:52.230553 #2385316] INFO -- : [664/885] 2426694=test_internal_ivar I, [2024-05-15T06:09:52.231228 #2385316] INFO -- : [665/885] 2426694=test_gem_resolver_index_specification I, [2024-05-15T06:09:52.271833 #2385316] INFO -- : [666/885] 2426686=test_basicsocket I, [2024-05-15T06:09:52.279288 #2385316] INFO -- : [667/885] 2426686=test_utf32 I, [2024-05-15T06:09:52.284574 #2385316] INFO -- : [668/885] 2426686=test_duplicate I, [2024-05-15T06:09:52.287199 #2385316] INFO -- : [669/885] 2426686=test_gem_commands_help_command I, [2024-05-15T06:09:52.287563 #2385316] INFO -- : [670/885] 2426694=test_rdoc_markup I, [2024-05-15T06:09:52.314936 #2385316] INFO -- : [671/885] 2426684=test_prettyprint I, [2024-05-15T06:09:52.332735 #2385316] INFO -- : [672/885] 2426684=test_tracepoint I, [2024-05-15T06:09:52.336141 #2385316] INFO -- : [673/885] 2426685=test_inadvertent_creation I, [2024-05-15T06:09:52.342037 #2385316] INFO -- : [674/885] 2426695=test_flags I, [2024-05-15T06:09:52.349822 #2385316] INFO -- : [675/885] 2426686=test_enumerator I, [2024-05-15T06:09:52.391976 #2385316] INFO -- : [676/885] 2426693=test_http I, [2024-05-15T06:09:52.398994 #2385316] INFO -- : [677/885] 2426693=test_shift_jis I, [2024-05-15T06:09:52.402402 #2385316] INFO -- : [678/885] 2426693=test_gem_commands_which_command I, [2024-05-15T06:09:52.431318 #2385316] INFO -- : [679/885] 2426682=test_gem_commands_specification_command I, [2024-05-15T06:09:52.434710 #2385316] INFO -- : [680/885] 2426693=test_gem_resolver I, [2024-05-15T06:09:52.462754 #2385316] INFO -- : [681/885] 2426694=test_safe_load I, [2024-05-15T06:09:52.470369 #2385316] INFO -- : [682/885] 2426685=test_gem_resolver_composed_set I, [2024-05-15T06:09:52.471617 #2385316] INFO -- : [683/885] 2426694=test_gem_commands_dependency_command I, [2024-05-15T06:09:52.487252 #2385316] INFO -- : [684/885] 2426685=test_rdoc_markup_attribute_manager I, [2024-05-15T06:09:52.523134 #2385316] INFO -- : [685/885] 2426685=test_name_error I, [2024-05-15T06:09:52.561600 #2385316] INFO -- : [686/885] 2426694=test_rdoc_parser_ruby I, [2024-05-15T06:09:52.569743 #2385316] INFO -- : [687/885] 2426682=test_httpresponse I, [2024-05-15T06:09:52.579846 #2385316] INFO -- : [688/885] 2426684=test_open-uri I, [2024-05-15T06:09:52.636078 #2385316] INFO -- : [689/885] 2426683=test_nil2vtempty I, [2024-05-15T06:09:52.641968 #2385316] INFO -- : [690/885] 2426683=test_stream I, [2024-05-15T06:09:52.644204 #2385316] INFO -- : [691/885] 2426685=test_rdoc_context I, [2024-05-15T06:09:52.650250 #2385316] INFO -- : [692/885] 2426683=test_rdoc_text I, [2024-05-15T06:09:52.653028 #2385316] INFO -- : [693/885] 2426682=test_tcp I, [2024-05-15T06:09:52.705938 #2385316] INFO -- : [694/885] 2426682=test_iso_8859 I, [2024-05-15T06:09:52.713528 #2385316] INFO -- : [695/885] 2426693=test_date_time I, [2024-05-15T06:09:52.714688 #2385316] INFO -- : [696/885] 2426683=test_rdoc_markup_to_joined_paragraph I, [2024-05-15T06:09:52.728343 #2385316] INFO -- : [697/885] 2426693=test_require I, [2024-05-15T06:09:52.730986 #2385316] INFO -- : [698/885] 2426683=test_data I, [2024-05-15T06:09:52.731675 #2385316] INFO -- : [699/885] 2426693=test_date_new I, [2024-05-15T06:09:52.737616 #2385316] INFO -- : [700/885] 2426683=index_write_test I, [2024-05-15T06:09:52.741525 #2385316] INFO -- : [701/885] 2426683=test_syntax I, [2024-05-15T06:09:52.746186 #2385316] INFO -- : [702/885] 2426693=test_gem_safe_yaml I, [2024-05-15T06:09:52.750406 #2385316] INFO -- : [703/885] 2426682=test_logperiod I, [2024-05-15T06:09:52.757078 #2385316] INFO -- : [704/885] 2426682=test_rdoc_normal_module I, [2024-05-15T06:09:52.758847 #2385316] INFO -- : [705/885] 2426693=test_c_union_entity I, [2024-05-15T06:09:52.832731 #2385316] INFO -- : [706/885] 2426682=test_rdoc_markdown_test I, [2024-05-15T06:09:52.845094 #2385316] INFO -- : [707/885] 2426693=test_securerandom I, [2024-05-15T06:09:52.882517 #2385316] INFO -- : [708/885] 2426693=test_switch_hitter I, [2024-05-15T06:09:52.902781 #2385316] INFO -- : [709/885] 2426693=test_io_console I, [2024-05-15T06:09:52.988092 #2385316] INFO -- : [710/885] 2426684=test_flush I, [2024-05-15T06:09:52.993301 #2385316] INFO -- : [711/885] 2426684=test_singleton I, [2024-05-15T06:09:52.997204 #2385316] INFO -- : [712/885] 2426684=test_stringchar I, [2024-05-15T06:09:52.999563 #2385316] INFO -- : [713/885] 2426678=test_hash_create I, [2024-05-15T06:09:53.001038 #2385316] INFO -- : [714/885] 2426678=newline_test I, [2024-05-15T06:09:53.068775 #2385316] INFO -- : [715/885] 2426684=test_uncorrectable_name_check I, [2024-05-15T06:09:53.074538 #2385316] INFO -- : [716/885] 2426684=test_thread_fd_close I, [2024-05-15T06:09:53.076030 #2385316] INFO -- : [717/885] 2426684=test_passing_block I, [2024-05-15T06:09:53.079235 #2385316] INFO -- : [718/885] 2426684=test_pack I, [2024-05-15T06:09:53.110831 #2385316] INFO -- : [719/885] 2426678=test_process I, [2024-05-15T06:09:53.174450 #2385316] INFO -- : [720/885] 2426685=test_last_thread I, [2024-05-15T06:09:53.237552 #2385316] INFO -- : [721/885] 2426694=test_gem_source_local I, [2024-05-15T06:09:53.239855 #2385316] INFO -- : [722/885] 2426695=test_gem_security_policy I, [2024-05-15T06:09:53.289969 #2385316] INFO -- : [723/885] 2426696=test_logdevice I, [2024-05-15T06:09:53.302942 #2385316] INFO -- : [724/885] 2426684=test_gem_ext_rake_builder I, [2024-05-15T06:09:53.353312 #2385316] INFO -- : [725/885] 2426691=test_arity I, [2024-05-15T06:09:53.358369 #2385316] INFO -- : [726/885] 2426691=test_x509cert I, [2024-05-15T06:09:53.439657 #2385316] INFO -- : [727/885] 2426695=test_gc I, [2024-05-15T06:09:53.501522 #2385316] INFO -- : [728/885] 2426694=test_gem_resolver_lock_specification I, [2024-05-15T06:09:53.539079 #2385316] INFO -- : [729/885] 2426694=test_err_in_callback I, [2024-05-15T06:09:53.548696 #2385316] INFO -- : [730/885] 2426694=test_reline I, [2024-05-15T06:09:53.560745 #2385316] INFO -- : [731/885] 2426682=test_parser_events I, [2024-05-15T06:09:53.599852 #2385316] INFO -- : [732/885] 2426682=test_pkey I, [2024-05-15T06:09:53.659585 #2385316] INFO -- : [733/885] 2426691=test_case I, [2024-05-15T06:09:53.659979 #2385316] INFO -- : [734/885] 2426691=test_gem_version_option I, [2024-05-15T06:09:53.665322 #2385316] INFO -- : [735/885] 2426682=test_grapheme_breaks I, [2024-05-15T06:09:53.693602 #2385316] INFO -- : [736/885] 2426691=test_gem_request_connection_pools I, [2024-05-15T06:09:53.695215 #2385316] INFO -- : [737/885] 2426682=test_cclass I, [2024-05-15T06:09:53.745178 #2385316] INFO -- : [738/885] 2426682=test_ractor I, [2024-05-15T06:09:53.794264 #2385316] INFO -- : [739/885] 2426682=test_m17n_comb I, [2024-05-15T06:09:53.858799 #2385316] INFO -- : [740/885] 2426688=test_memory_view I, [2024-05-15T06:09:53.878614 #2385316] INFO -- : [741/885] 2426684=test_json_tree I, [2024-05-15T06:09:53.887555 #2385316] INFO -- : [742/885] 2426684=test_rdoc_markup_to_markdown I, [2024-05-15T06:09:53.889280 #2385316] INFO -- : [743/885] 2426694=test_ansi_with_terminfo I, [2024-05-15T06:09:53.894719 #2385316] INFO -- : [744/885] 2426694=test_rdoc_generator_pot_po I, [2024-05-15T06:09:53.898468 #2385316] INFO -- : [745/885] 2426694=parse_test I, [2024-05-15T06:09:53.916841 #2385316] INFO -- : [746/885] 2426690=test_gem_install_update_options I, [2024-05-15T06:09:53.999040 #2385316] INFO -- : [747/885] 2426690=test_require_lib I, [2024-05-15T06:09:54.012814 #2385316] INFO -- : [748/885] 2426684=test_severity I, [2024-05-15T06:09:54.024507 #2385316] INFO -- : [749/885] 2426684=test_ractor I, [2024-05-15T06:09:54.043153 #2385316] INFO -- : [750/885] 2426684=test_extlibs I, [2024-05-15T06:09:54.079215 #2385316] INFO -- : [751/885] 2426696=test_rdoc_generator_ri I, [2024-05-15T06:09:54.085088 #2385316] INFO -- : [752/885] 2426696=test_gem_stream_ui I, [2024-05-15T06:09:54.115156 #2385316] INFO -- : [753/885] 2426688=test_c_struct_builder I, [2024-05-15T06:09:54.152614 #2385316] INFO -- : [754/885] 2426696=test_dot_dot I, [2024-05-15T06:09:54.157136 #2385316] INFO -- : [755/885] 2426696=test_str2big I, [2024-05-15T06:09:54.158871 #2385316] INFO -- : [756/885] 2426696=test_literal I, [2024-05-15T06:09:54.219456 #2385316] INFO -- : [757/885] 2426685=test_objectspace I, [2024-05-15T06:09:54.287560 #2385316] INFO -- : [758/885] 2426688=test_socket I, [2024-05-15T06:09:54.715031 #2385316] INFO -- : [759/885] 2426691=test_thread I, [2024-05-15T06:09:54.910730 #2385316] INFO -- : [760/885] 2426696=test_rdoc_markup_to_table_of_contents I, [2024-05-15T06:09:54.932646 #2385316] INFO -- : [761/885] 2426691=test_gem_commands_info_command I, [2024-05-15T06:09:54.947821 #2385316] INFO -- : [762/885] 2426696=test_scalar I, [2024-05-15T06:09:54.950301 #2385316] INFO -- : [763/885] 2426696=test_gem_dependency_installer I, [2024-05-15T06:09:54.957654 #2385316] INFO -- : [764/885] 2426691=test_rdoc_cross_reference I, [2024-05-15T06:09:55.184987 #2385316] INFO -- : [765/885] 2426689=test_store I, [2024-05-15T06:09:55.203908 #2385316] INFO -- : [766/885] 2426685=test_case_options I, [2024-05-15T06:09:55.206615 #2385316] INFO -- : [767/885] 2426685=test_exception I, [2024-05-15T06:09:55.305680 #2385316] INFO -- : [768/885] 2426682=test_gem_name_tuple I, [2024-05-15T06:09:55.319952 #2385316] INFO -- : [769/885] 2426682=test_gem_package_tar_reader_entry I, [2024-05-15T06:09:55.399638 #2385316] INFO -- : [770/885] 2426689=test_rand I, [2024-05-15T06:09:55.410749 #2385316] INFO -- : [771/885] 2426691=test_bug_reporter I, [2024-05-15T06:09:55.475660 #2385316] INFO -- : [772/885] 2426681=test_gem_ext_cargo_builder_link_flag_converter I, [2024-05-15T06:09:55.502399 #2385316] INFO -- : [773/885] 2426682=test_gem_commands_mirror I, [2024-05-15T06:09:55.506988 #2385316] INFO -- : [774/885] 2426682=test_sprintf_comb I, [2024-05-15T06:09:55.539950 #2385316] INFO -- : [775/885] 2426681=test_gem_request I, [2024-05-15T06:09:55.600537 #2385316] INFO -- : [776/885] 2426693=test_method_cache I, [2024-05-15T06:09:55.605189 #2385316] INFO -- : [777/885] 2426693=test_scan_args I, [2024-05-15T06:09:55.616177 #2385316] INFO -- : [778/885] 2426693=test_win32ole I, [2024-05-15T06:09:55.620106 #2385316] INFO -- : [779/885] 2426693=test_generic I, [2024-05-15T06:09:55.651386 #2385316] INFO -- : [780/885] 2426682=test_gem_text I, [2024-05-15T06:09:55.660685 #2385316] INFO -- : [781/885] 2426693=test_settracefunc I, [2024-05-15T06:09:55.690823 #2385316] INFO -- : [782/885] 2426689=test_enumerator_kw I, [2024-05-15T06:09:55.692942 #2385316] INFO -- : [783/885] 2426682=test_default_gems I, [2024-05-15T06:09:55.695596 #2385316] INFO -- : [784/885] 2426689=test_rdoc_markup_to_rdoc I, [2024-05-15T06:09:55.704161 #2385316] INFO -- : [785/885] 2426681=test_rdoc_rd_inline_parser I, [2024-05-15T06:09:55.727785 #2385316] INFO -- : [786/885] 2426688=test_mul I, [2024-05-15T06:09:55.734059 #2385316] INFO -- : [787/885] 2426688=test_null I, [2024-05-15T06:09:55.736989 #2385316] INFO -- : [788/885] 2426681=test_win32ole_type I, [2024-05-15T06:09:55.737461 #2385316] INFO -- : [789/885] 2426682=test_rdoc_markup_attributes I, [2024-05-15T06:09:55.737753 #2385316] INFO -- : [790/885] 2426688=test_date_parse I, [2024-05-15T06:09:55.741302 #2385316] INFO -- : [791/885] 2426689=test_pkey_ec I, [2024-05-15T06:09:55.741367 #2385316] INFO -- : [792/885] 2426681=test_pipe I, [2024-05-15T06:09:55.745577 #2385316] INFO -- : [793/885] 2426682=test_thread I, [2024-05-15T06:09:55.748376 #2385316] INFO -- : [794/885] 2426682=test_trick I, [2024-05-15T06:09:55.789292 #2385316] INFO -- : [795/885] 2426684=test_rdoc_i18n_text I, [2024-05-15T06:09:55.794770 #2385316] INFO -- : [796/885] 2426684=test_key_name_check I, [2024-05-15T06:09:55.800120 #2385316] INFO -- : [797/885] 2426684=test_backtrace I, [2024-05-15T06:09:55.805690 #2385316] INFO -- : [798/885] 2426684=test_defined I, [2024-05-15T06:09:55.835805 #2385316] INFO -- : [799/885] 2426689=test_io_buffer I, [2024-05-15T06:09:55.841240 #2385316] INFO -- : [800/885] 2426691=test_rdoc_rdoc I, [2024-05-15T06:09:55.873086 #2385316] INFO -- : [801/885] 2426684=test_time I, [2024-05-15T06:09:55.877044 #2385316] INFO -- : [802/885] 2426681=test_windows_1251 I, [2024-05-15T06:09:55.881891 #2385316] INFO -- : [803/885] 2426681=test_gb18030 I, [2024-05-15T06:09:55.882353 #2385316] INFO -- : [804/885] 2426688=test_buffering I, [2024-05-15T06:09:55.885874 #2385316] INFO -- : [805/885] 2426689=test_svcb_https I, [2024-05-15T06:09:55.886091 #2385316] INFO -- : [806/885] 2426681=test_gem_uninstaller I, [2024-05-15T06:09:55.893316 #2385316] INFO -- : [807/885] 2426688=test_optimization I, [2024-05-15T06:09:55.909724 #2385316] INFO -- : [808/885] 2426691=test_date_conv I, [2024-05-15T06:09:55.914256 #2385316] INFO -- : [809/885] 2426691=test_ole_methods I, [2024-05-15T06:09:55.915890 #2385316] INFO -- : [810/885] 2426689=test_erb_m17n I, [2024-05-15T06:09:55.917431 #2385316] INFO -- : [811/885] 2426691=test_egrep_cpp I, [2024-05-15T06:09:55.924654 #2385316] INFO -- : [812/885] 2426689=test_zlib I, [2024-05-15T06:09:55.999818 #2385316] INFO -- : [813/885] 2426684=test_cgi_tag_helper I, [2024-05-15T06:09:56.015819 #2385316] INFO -- : [814/885] 2426684=test_gem_package_old I, [2024-05-15T06:09:56.050807 #2385316] INFO -- : [815/885] 2426684=test_gem_resolver_index_set I, [2024-05-15T06:09:56.075747 #2385316] INFO -- : [816/885] 2426691=test_string I, [2024-05-15T06:09:56.080715 #2385316] INFO -- : [817/885] 2426684=test_proc I, [2024-05-15T06:09:56.539352 #2385316] INFO -- : [818/885] 2426677=test_gc_compact I, [2024-05-15T06:09:56.711463 #2385316] INFO -- : [819/885] 2426693=test_gem_validator I, [2024-05-15T06:09:56.733373 #2385316] INFO -- : [820/885] 2426694=test_files_test_2 I, [2024-05-15T06:09:56.738397 #2385316] INFO -- : [821/885] 2426693=test_fnmatch I, [2024-05-15T06:09:56.791409 #2385316] INFO -- : [822/885] 2426693=test_folderitem2_invokeverb I, [2024-05-15T06:09:56.791483 #2385316] INFO -- : [823/885] 2426693=test_rdoc_markup_parser I, [2024-05-15T06:09:56.882468 #2385316] INFO -- : [824/885] 2426693=test_require_path_check I, [2024-05-15T06:09:56.901101 #2385316] INFO -- : [825/885] 2426684=test_string I, [2024-05-15T06:09:56.926903 #2385316] INFO -- : [826/885] 2426684=test_pattern_matching I, [2024-05-15T06:09:56.962245 #2385316] INFO -- : [827/885] 2426684=test_rdoc_stats I, [2024-05-15T06:09:56.975423 #2385316] INFO -- : [828/885] 2426681=test_x509attr I, [2024-05-15T06:09:56.983299 #2385316] INFO -- : [829/885] 2426681=test_raise I, [2024-05-15T06:09:56.986441 #2385316] INFO -- : [830/885] 2426681=test_depth_first I, [2024-05-15T06:09:57.005478 #2385316] INFO -- : [831/885] 2426693=test_gem_request_set_lockfile_parser I, [2024-05-15T06:09:57.014331 #2385316] INFO -- : [832/885] 2426684=test_rdoc_store I, [2024-05-15T06:09:57.019756 #2385316] INFO -- : [833/885] 2426681=test_custom_command I, [2024-05-15T06:09:57.020303 #2385316] INFO -- : [834/885] 2426681=json_addition_test I, [2024-05-15T06:09:57.036924 #2385316] INFO -- : [835/885] 2426681=test_qsort I, [2024-05-15T06:09:57.039971 #2385316] INFO -- : [836/885] 2426681=test_rdoc_parser I, [2024-05-15T06:09:57.053788 #2385316] INFO -- : [837/885] 2426681=test_gem_dependency_resolution_error I, [2024-05-15T06:09:57.058662 #2385316] INFO -- : [838/885] 2426681=test_rdoc_markup_to_tt_only I, [2024-05-15T06:09:57.083885 #2385316] INFO -- : [839/885] 2426681=test_hmac I, [2024-05-15T06:09:57.091179 #2385316] INFO -- : [840/885] 2426681=test_rdoc_tom_doc I, [2024-05-15T06:09:57.102430 #2385316] INFO -- : [841/885] 2426693=test_gem_commands_lock_command I, [2024-05-15T06:09:57.103805 #2385316] INFO -- : [842/885] 2426681=test_assignment I, [2024-05-15T06:09:57.124108 #2385316] INFO -- : [843/885] 2426693=test_ifunless I, [2024-05-15T06:09:57.144408 #2385316] INFO -- : [844/885] 2426693=test_numeric I, [2024-05-15T06:09:57.211153 #2385316] INFO -- : [845/885] 2426679=test_gem_spec_fetcher I, [2024-05-15T06:09:57.237588 #2385316] INFO -- : [846/885] 2426693=test_common I, [2024-05-15T06:09:57.403706 #2385316] INFO -- : [847/885] 2426679=test_bug-3571 I, [2024-05-15T06:09:57.424310 #2385316] INFO -- : [848/885] 2426679=test_key_actor_vi I, [2024-05-15T06:09:57.444427 #2385316] INFO -- : [849/885] 2426690=test_gem_command I, [2024-05-15T06:09:57.463015 #2385316] INFO -- : [850/885] 2426693=test_address_resolve I, [2024-05-15T06:09:57.469380 #2385316] INFO -- : [851/885] 2426696=test_rdoc_token_stream I, [2024-05-15T06:09:57.474634 #2385316] INFO -- : [852/885] 2426696=test_optarg I, [2024-05-15T06:09:57.496995 #2385316] INFO -- : [853/885] 2426693=test_yaml_special_cases I, [2024-05-15T06:09:57.512164 #2385316] INFO -- : [854/885] 2426693=test_gem_source_list I, [2024-05-15T06:09:57.515168 #2385316] INFO -- : [855/885] 2426690=test_config I, [2024-05-15T06:09:57.572887 #2385316] INFO -- : [856/885] 2426693=test_pp I, [2024-05-15T06:09:57.600291 #2385316] INFO -- : [857/885] 2426696=test_frozen I, [2024-05-15T06:09:57.603798 #2385316] INFO -- : [858/885] 2426696=test_gem_ext_configure_builder I, [2024-05-15T06:09:57.615199 #2385316] INFO -- : [859/885] 2426690=test_macro I, [2024-05-15T06:09:57.627530 #2385316] INFO -- : [860/885] 2426693=test_rdoc_single_class I, [2024-05-15T06:09:57.632363 #2385316] INFO -- : [861/885] 2426679=test_num2int I, [2024-05-15T06:09:57.632716 #2385316] INFO -- : [862/885] 2426693=test_nil I, [2024-05-15T06:09:57.634740 #2385316] INFO -- : [863/885] 2426690=test_verbose I, [2024-05-15T06:09:57.638419 #2385316] INFO -- : [864/885] 2426693=test_iter_break I, [2024-05-15T06:09:57.638497 #2385316] INFO -- : [865/885] 2426685=test_exception I, [2024-05-15T06:09:57.648457 #2385316] INFO -- : [866/885] 2426693=test_zsh_completion I, [2024-05-15T06:09:57.652266 #2385316] INFO -- : [867/885] 2426685=test_files_ext I, [2024-05-15T06:09:57.659037 #2385316] INFO -- : [868/885] 2426693=test_bug-5832 I, [2024-05-15T06:09:57.676379 #2385316] INFO -- : [869/885] 2426696=test_gem_silent_ui I, [2024-05-15T06:09:57.678090 #2385316] INFO -- : [870/885] 2426693=test_emitter I, [2024-05-15T06:09:57.692624 #2385316] INFO -- : [871/885] 2426690=test_gem_doctor I, [2024-05-15T06:09:57.693124 #2385316] INFO -- : [872/885] 2426684=test_kdf I, [2024-05-15T06:09:57.700877 #2385316] INFO -- : [873/885] 2426696=dispatcher_test I, [2024-05-15T06:09:57.701705 #2385316] INFO -- : [874/885] 2426679=test_eval_history I, [2024-05-15T06:09:57.709399 #2385316] INFO -- : [875/885] 2426693=test_kernel I, [2024-05-15T06:09:57.717378 #2385316] INFO -- : [876/885] 2426696=test_rdoc_markup_paragraph I, [2024-05-15T06:09:57.722593 #2385316] INFO -- : [877/885] 2426696=!Nothing_to_test I, [2024-05-15T06:09:57.724857 #2385316] INFO -- : [878/885] 2426696=test_psych I, [2024-05-15T06:09:57.728578 #2385316] INFO -- : [879/885] 2426690=test_enc_raise I, [2024-05-15T06:09:57.740594 #2385316] INFO -- : [880/885] 2426696=test_object_create_start I, [2024-05-15T06:09:57.742749 #2385316] INFO -- : [881/885] 2426690=test_gem_rdoc I, [2024-05-15T06:09:57.748446 #2385316] INFO -- : [882/885] 2426696=test_date I, [2024-05-15T06:09:57.758281 #2385316] INFO -- : [883/885] 2426684=test_gem_ext_cargo_builder_unit I, [2024-05-15T06:09:57.764375 #2385316] INFO -- : [884/885] 2426696=test_at_exit I, [2024-05-15T06:09:57.772984 #2385316] INFO -- : [885/885] 2426679=test_command I, [2024-05-15T06:10:09.783359 #2385316] INFO -- : Finished tests in 31.833485s, 829.1584 tests/s, 293897.4476 assertions/s. E, [2024-05-15T06:10:09.783520 #2385316] ERROR -- : Children under /tmp/rubytest.v0gza1: E, [2024-05-15T06:10:09.783566 #2385316] ERROR -- : * drwxrwxr-x 3 60 2024-05-15 06:09:43 +0000 test_rubygems_20240515-2426688-sg9024/ E, [2024-05-15T06:10:09.783586 #2385316] ERROR -- : * drwxrwxr-x 3 60 2024-05-15 06:09:43 +0000 userhome/ E, [2024-05-15T06:10:09.783602 #2385316] ERROR -- : * drwxrwxr-x 3 60 2024-05-15 06:09:43 +0000 .local/ E, [2024-05-15T06:10:09.783616 #2385316] ERROR -- : * drwxrwxr-x 2 40 2024-05-15 06:09:43 +0000 share/ E, [2024-05-15T06:10:09.783629 #2385316] ERROR -- : * drwx------ 4 80 2024-05-15 06:09:41 +0000 gem_rebuild20240515-2426688-9oqaje/ E, [2024-05-15T06:10:09.783643 #2385316] ERROR -- : * drwxrwxr-x 2 60 2024-05-15 06:09:41 +0000 new/ E, [2024-05-15T06:10:09.783657 #2385316] ERROR -- : * -rw-rw-r-- 1 4096 2024-05-15 06:09:41 +0000 rebuild_test_gem-1.0.0.gem E, [2024-05-15T06:10:09.783671 #2385316] ERROR -- : * drwxrwxr-x 2 60 2024-05-15 06:09:41 +0000 old/ E, [2024-05-15T06:10:09.783685 #2385316] ERROR -- : * -rw-rw-r-- 1 4096 2024-05-15 06:09:41 +0000 rebuild_test_gem-1.0.0.gem I, [2024-05-15T06:10:09.785086 #2385316] INFO -- : 26395 tests, 9355780 assertions, 0 failures, 0 errors, 306 skips I, [2024-05-15T06:10:09.785114 #2385316] INFO -- : I, [2024-05-15T06:10:09.785121 #2385316] INFO -- : ruby -v: ruby 3.4.0dev (2024-05-14T21:44:34Z master e3e1e53098) [x86_64-linux] I, [2024-05-15T06:10:09.787207 #2385316] INFO -- : $$$[end] "make yes-test-all TESTOPTS='--stderr-on-failure' TESTS='-j20'" exit with 0. I, [2024-05-15T06:10:09.787349 #2385316] INFO -- : $$$[beg] make yes-test-rubyspec MSPECOPT='--error-output stderr --debug -j' TESTS='-j20' I, [2024-05-15T06:10:09.879172 #2385316] INFO -- : BASERUBY = /usr/bin/ruby --disable=gems I, [2024-05-15T06:10:09.879218 #2385316] INFO -- : CC = gcc I, [2024-05-15T06:10:09.879223 #2385316] INFO -- : LD = ld I, [2024-05-15T06:10:09.879227 #2385316] INFO -- : LDSHARED = gcc -shared I, [2024-05-15T06:10:09.879231 #2385316] INFO -- : CFLAGS = -O3 -fno-fast-math -ggdb3 -Wall -Wextra -Wdeprecated-declarations -Wdiv-by-zero -Wduplicated-cond -Wimplicit-function-declaration -Wimplicit-int -Wpointer-arith -Wwrite-strings -Wold-style-definition -Wimplicit-fallthrough=0 -Wmissing-noreturn -Wno-cast-function-type -Wno-constant-logical-operand -Wno-long-long -Wno-missing-field-initializers -Wno-overlength-strings -Wno-packed-bitfield-compat -Wno-parentheses-equality -Wno-self-assign -Wno-tautological-compare -Wno-unused-parameter -Wno-unused-value -Wsuggest-attribute=format -Wsuggest-attribute=noreturn -Wunused-variable -Wmisleading-indentation -Wundef -fPIC I, [2024-05-15T06:10:09.879236 #2385316] INFO -- : XCFLAGS = -U_FORTIFY_SOURCE -D_FORTIFY_SOURCE=2 -fstack-protector-strong -fno-strict-overflow -fvisibility=hidden -fexcess-precision=standard -DRUBY_EXPORT -I. -I.ext/include/x86_64-linux -I/tmp/ruby/src/trunk/include -I/tmp/ruby/src/trunk -I/tmp/ruby/src/trunk/prism -I/tmp/ruby/src/trunk/enc/unicode/15.0.0 I, [2024-05-15T06:10:09.879239 #2385316] INFO -- : CPPFLAGS = I, [2024-05-15T06:10:09.879243 #2385316] INFO -- : DLDFLAGS = -Wl,--compress-debug-sections=zlib -Wl,-soname,libruby.so.3.4 -fstack-protector-strong I, [2024-05-15T06:10:09.879247 #2385316] INFO -- : SOLIBS = -lz -lrt -lrt -lgmp -ldl -lcrypt -lm -lpthread I, [2024-05-15T06:10:09.879251 #2385316] INFO -- : LANG = en_US.UTF-8 I, [2024-05-15T06:10:09.879255 #2385316] INFO -- : LC_ALL = I, [2024-05-15T06:10:09.879258 #2385316] INFO -- : LC_CTYPE = I, [2024-05-15T06:10:09.879262 #2385316] INFO -- : MFLAGS = I, [2024-05-15T06:10:09.879267 #2385316] INFO -- : RUSTC = no I, [2024-05-15T06:10:09.879270 #2385316] INFO -- : YJIT_RUSTC_ARGS = --crate-name=yjit --crate-type=staticlib --edition=2021 -g -C lto=thin -C opt-level=3 -C overflow-checks=on '--out-dir=/tmp/ruby/build/trunk/yjit/target/release/' /tmp/ruby/src/trunk/yjit/src/lib.rs I, [2024-05-15T06:10:09.879909 #2385316] INFO -- : gcc (Ubuntu 11.4.0-1ubuntu1~22.04) 11.4.0 I, [2024-05-15T06:10:09.879930 #2385316] INFO -- : Copyright (C) 2021 Free Software Foundation, Inc. I, [2024-05-15T06:10:09.879935 #2385316] INFO -- : This is free software; see the source for copying conditions. There is NO I, [2024-05-15T06:10:09.879939 #2385316] INFO -- : warranty; not even for MERCHANTABILITY or FITNESS FOR A PARTICULAR PURPOSE. I, [2024-05-15T06:10:09.879943 #2385316] INFO -- : I, [2024-05-15T06:10:09.881758 #2385316] INFO -- : generating enc.mk I, [2024-05-15T06:10:09.999199 #2385316] INFO -- : making enc I, [2024-05-15T06:10:10.015978 #2385316] INFO -- : make[1]: Entering directory '/tmp/ruby/build/trunk' I, [2024-05-15T06:10:10.016003 #2385316] INFO -- : make[1]: Nothing to be done for 'enc'. I, [2024-05-15T06:10:10.016009 #2385316] INFO -- : make[1]: Leaving directory '/tmp/ruby/build/trunk' I, [2024-05-15T06:10:10.016765 #2385316] INFO -- : making srcs under enc I, [2024-05-15T06:10:10.046326 #2385316] INFO -- : make[1]: Entering directory '/tmp/ruby/build/trunk' I, [2024-05-15T06:10:10.046348 #2385316] INFO -- : make[1]: Nothing to be done for 'srcs'. I, [2024-05-15T06:10:10.046353 #2385316] INFO -- : make[1]: Leaving directory '/tmp/ruby/build/trunk' I, [2024-05-15T06:10:10.047269 #2385316] INFO -- : generating transdb.h I, [2024-05-15T06:10:10.143089 #2385316] INFO -- : transdb.h unchanged I, [2024-05-15T06:10:10.144332 #2385316] INFO -- : making trans I, [2024-05-15T06:10:10.179257 #2385316] INFO -- : make[1]: Entering directory '/tmp/ruby/build/trunk' I, [2024-05-15T06:10:10.179280 #2385316] INFO -- : make[1]: Nothing to be done for 'trans'. I, [2024-05-15T06:10:10.179286 #2385316] INFO -- : make[1]: Leaving directory '/tmp/ruby/build/trunk' I, [2024-05-15T06:10:10.179940 #2385316] INFO -- : making encs I, [2024-05-15T06:10:10.218187 #2385316] INFO -- : make[1]: Entering directory '/tmp/ruby/build/trunk' I, [2024-05-15T06:10:10.218209 #2385316] INFO -- : make[1]: Nothing to be done for 'encs'. I, [2024-05-15T06:10:10.218214 #2385316] INFO -- : make[1]: Leaving directory '/tmp/ruby/build/trunk' I, [2024-05-15T06:10:10.219924 #2385316] INFO -- : generating makefiles ext/configure-ext.mk I, [2024-05-15T06:10:10.246689 #2385316] INFO -- : ext/configure-ext.mk updated I, [2024-05-15T06:10:10.249028 #2385316] INFO -- : make[1]: Entering directory '/tmp/ruby/build/trunk' I, [2024-05-15T06:10:11.593726 #2385316] INFO -- : make[1]: Leaving directory '/tmp/ruby/build/trunk' I, [2024-05-15T06:10:11.594460 #2385316] INFO -- : generating makefile exts.mk I, [2024-05-15T06:10:11.631344 #2385316] INFO -- : exts.mk unchanged I, [2024-05-15T06:10:11.635530 #2385316] INFO -- : make[1]: Entering directory '/tmp/ruby/build/trunk' I, [2024-05-15T06:10:11.947331 #2385316] INFO -- : make[2]: Entering directory '/tmp/ruby/build/trunk/ext/coverage' I, [2024-05-15T06:10:11.950914 #2385316] INFO -- : make[2]: Leaving directory '/tmp/ruby/build/trunk/ext/coverage' I, [2024-05-15T06:10:11.957106 #2385316] INFO -- : make[2]: Entering directory '/tmp/ruby/build/trunk/ext/date' I, [2024-05-15T06:10:11.962209 #2385316] INFO -- : make[2]: Leaving directory '/tmp/ruby/build/trunk/ext/date' I, [2024-05-15T06:10:11.966013 #2385316] INFO -- : make[2]: Entering directory '/tmp/ruby/build/trunk/ext/digest' I, [2024-05-15T06:10:11.974838 #2385316] INFO -- : make[2]: Leaving directory '/tmp/ruby/build/trunk/ext/digest' I, [2024-05-15T06:10:12.001100 #2385316] INFO -- : make[2]: Entering directory '/tmp/ruby/build/trunk/ext/digest/sha2' I, [2024-05-15T06:10:12.005983 #2385316] INFO -- : make[2]: Leaving directory '/tmp/ruby/build/trunk/ext/digest/sha2' I, [2024-05-15T06:10:12.026637 #2385316] INFO -- : make[2]: Entering directory '/tmp/ruby/build/trunk/ext/fiddle' I, [2024-05-15T06:10:12.035815 #2385316] INFO -- : make[2]: Leaving directory '/tmp/ruby/build/trunk/ext/fiddle' I, [2024-05-15T06:10:12.040533 #2385316] INFO -- : make[2]: Entering directory '/tmp/ruby/build/trunk/ext/io/console' I, [2024-05-15T06:10:12.044694 #2385316] INFO -- : make[2]: Leaving directory '/tmp/ruby/build/trunk/ext/io/console' I, [2024-05-15T06:10:12.057546 #2385316] INFO -- : make[2]: Entering directory '/tmp/ruby/build/trunk/ext/json' I, [2024-05-15T06:10:12.067838 #2385316] INFO -- : make[2]: Leaving directory '/tmp/ruby/build/trunk/ext/json' I, [2024-05-15T06:10:12.082339 #2385316] INFO -- : make[2]: Entering directory '/tmp/ruby/build/trunk/ext/monitor' I, [2024-05-15T06:10:12.085959 #2385316] INFO -- : make[2]: Leaving directory '/tmp/ruby/build/trunk/ext/monitor' I, [2024-05-15T06:10:12.093126 #2385316] INFO -- : make[2]: Entering directory '/tmp/ruby/build/trunk/ext/objspace' I, [2024-05-15T06:10:12.099257 #2385316] INFO -- : make[2]: Leaving directory '/tmp/ruby/build/trunk/ext/objspace' I, [2024-05-15T06:10:12.113873 #2385316] INFO -- : make[2]: Entering directory '/tmp/ruby/build/trunk/ext/openssl' I, [2024-05-15T06:10:12.130651 #2385316] INFO -- : make[2]: Leaving directory '/tmp/ruby/build/trunk/ext/openssl' I, [2024-05-15T06:10:12.134312 #2385316] INFO -- : make[2]: Entering directory '/tmp/ruby/build/trunk/ext/pathname' I, [2024-05-15T06:10:12.138188 #2385316] INFO -- : make[2]: Leaving directory '/tmp/ruby/build/trunk/ext/pathname' I, [2024-05-15T06:10:12.144948 #2385316] INFO -- : make[2]: Entering directory '/tmp/ruby/build/trunk/ext/psych' I, [2024-05-15T06:10:12.167643 #2385316] INFO -- : make[2]: Leaving directory '/tmp/ruby/build/trunk/ext/psych' I, [2024-05-15T06:10:12.172321 #2385316] INFO -- : make[2]: Entering directory '/tmp/ruby/build/trunk/ext/pty' I, [2024-05-15T06:10:12.176358 #2385316] INFO -- : make[2]: Leaving directory '/tmp/ruby/build/trunk/ext/pty' I, [2024-05-15T06:10:12.192300 #2385316] INFO -- : make[2]: Entering directory '/tmp/ruby/build/trunk/ext/ripper' I, [2024-05-15T06:10:12.200611 #2385316] INFO -- : make[2]: Leaving directory '/tmp/ruby/build/trunk/ext/ripper' I, [2024-05-15T06:10:12.203036 #2385316] INFO -- : make[2]: Entering directory '/tmp/ruby/build/trunk/ext/rubyvm' I, [2024-05-15T06:10:12.206343 #2385316] INFO -- : make[2]: Leaving directory '/tmp/ruby/build/trunk/ext/rubyvm' I, [2024-05-15T06:10:12.218034 #2385316] INFO -- : make[2]: Entering directory '/tmp/ruby/build/trunk/ext/socket' I, [2024-05-15T06:10:12.224617 #2385316] INFO -- : make[2]: Leaving directory '/tmp/ruby/build/trunk/ext/socket' I, [2024-05-15T06:10:12.236231 #2385316] INFO -- : make[2]: Entering directory '/tmp/ruby/build/trunk/.bundle/gems/bigdecimal-3.1.8/ext/bigdecimal' I, [2024-05-15T06:10:12.260026 #2385316] INFO -- : make[2]: Leaving directory '/tmp/ruby/build/trunk/.bundle/gems/bigdecimal-3.1.8/ext/bigdecimal' I, [2024-05-15T06:10:12.261888 #2385316] INFO -- : make[2]: Entering directory '/tmp/ruby/build/trunk/.bundle/gems/debug-1.9.2/ext/debug' I, [2024-05-15T06:10:12.284467 #2385316] INFO -- : make[2]: Leaving directory '/tmp/ruby/build/trunk/.bundle/gems/debug-1.9.2/ext/debug' I, [2024-05-15T06:10:12.286368 #2385316] INFO -- : make[2]: Entering directory '/tmp/ruby/build/trunk/.bundle/gems/nkf-0.2.0/ext/nkf' I, [2024-05-15T06:10:12.311550 #2385316] INFO -- : make[2]: Leaving directory '/tmp/ruby/build/trunk/.bundle/gems/nkf-0.2.0/ext/nkf' I, [2024-05-15T06:10:12.313876 #2385316] INFO -- : make[2]: Entering directory '/tmp/ruby/build/trunk/.bundle/gems/racc-1.7.3/ext/racc/cparse' I, [2024-05-15T06:10:12.340514 #2385316] INFO -- : make[2]: Leaving directory '/tmp/ruby/build/trunk/.bundle/gems/racc-1.7.3/ext/racc/cparse' I, [2024-05-15T06:10:12.342801 #2385316] INFO -- : make[2]: Entering directory '/tmp/ruby/build/trunk/.bundle/gems/rbs-3.4.4/ext/rbs_extension' I, [2024-05-15T06:10:12.364948 #2385316] INFO -- : make[2]: Leaving directory '/tmp/ruby/build/trunk/.bundle/gems/rbs-3.4.4/ext/rbs_extension' I, [2024-05-15T06:10:12.366920 #2385316] INFO -- : make[2]: Entering directory '/tmp/ruby/build/trunk/.bundle/gems/syslog-0.1.2/ext/syslog' I, [2024-05-15T06:10:12.389359 #2385316] INFO -- : make[2]: Leaving directory '/tmp/ruby/build/trunk/.bundle/gems/syslog-0.1.2/ext/syslog' I, [2024-05-15T06:10:12.414258 #2385316] INFO -- : make[2]: Entering directory '/tmp/ruby/build/trunk' I, [2024-05-15T06:10:12.481025 #2385316] INFO -- : make[2]: 'ruby' is up to date. I, [2024-05-15T06:10:12.481064 #2385316] INFO -- : make[2]: Leaving directory '/tmp/ruby/build/trunk' I, [2024-05-15T06:10:12.481500 #2385316] INFO -- : make[1]: Leaving directory '/tmp/ruby/build/trunk' I, [2024-05-15T06:10:12.485010 #2385316] INFO -- : make[1]: Entering directory '/tmp/ruby/build/trunk' I, [2024-05-15T06:10:12.485032 #2385316] INFO -- : make[1]: Nothing to be done for 'note'. I, [2024-05-15T06:10:12.485038 #2385316] INFO -- : make[1]: Leaving directory '/tmp/ruby/build/trunk' E, [2024-05-15T06:10:12.542410 #2385316] ERROR -- : $ /tmp/ruby/build/trunk/miniruby -I/tmp/ruby/src/trunk/lib /tmp/ruby/src/trunk/tool/runruby.rb --archdir=/tmp/ruby/build/trunk --extout=.ext -- /tmp/ruby/src/trunk/spec/mspec/bin/mspec-run -B /tmp/ruby/src/trunk/spec/default.mspec --error-output stderr --debug -fy -o /tmp/rubytest.u22na2/1-mspec-multi-0 E, [2024-05-15T06:10:12.542626 #2385316] ERROR -- : $ /tmp/ruby/build/trunk/miniruby -I/tmp/ruby/src/trunk/lib /tmp/ruby/src/trunk/tool/runruby.rb --archdir=/tmp/ruby/build/trunk --extout=.ext -- /tmp/ruby/src/trunk/spec/mspec/bin/mspec-run -B /tmp/ruby/src/trunk/spec/default.mspec --error-output stderr --debug -fy -o /tmp/rubytest.u22na2/2-mspec-multi-1 E, [2024-05-15T06:10:12.542879 #2385316] ERROR -- : $ /tmp/ruby/build/trunk/miniruby -I/tmp/ruby/src/trunk/lib /tmp/ruby/src/trunk/tool/runruby.rb --archdir=/tmp/ruby/build/trunk --extout=.ext -- /tmp/ruby/src/trunk/spec/mspec/bin/mspec-run -B /tmp/ruby/src/trunk/spec/default.mspec --error-output stderr --debug -fy -o /tmp/rubytest.u22na2/3-mspec-multi-2 E, [2024-05-15T06:10:12.543154 #2385316] ERROR -- : $ /tmp/ruby/build/trunk/miniruby -I/tmp/ruby/src/trunk/lib /tmp/ruby/src/trunk/tool/runruby.rb --archdir=/tmp/ruby/build/trunk --extout=.ext -- /tmp/ruby/src/trunk/spec/mspec/bin/mspec-run -B /tmp/ruby/src/trunk/spec/default.mspec --error-output stderr --debug -fy -o /tmp/rubytest.u22na2/4-mspec-multi-3 E, [2024-05-15T06:10:12.543325 #2385316] ERROR -- : $ /tmp/ruby/build/trunk/miniruby -I/tmp/ruby/src/trunk/lib /tmp/ruby/src/trunk/tool/runruby.rb --archdir=/tmp/ruby/build/trunk --extout=.ext -- /tmp/ruby/src/trunk/spec/mspec/bin/mspec-run -B /tmp/ruby/src/trunk/spec/default.mspec --error-output stderr --debug -fy -o /tmp/rubytest.u22na2/5-mspec-multi-4 E, [2024-05-15T06:10:12.543558 #2385316] ERROR -- : $ /tmp/ruby/build/trunk/miniruby -I/tmp/ruby/src/trunk/lib /tmp/ruby/src/trunk/tool/runruby.rb --archdir=/tmp/ruby/build/trunk --extout=.ext -- /tmp/ruby/src/trunk/spec/mspec/bin/mspec-run -B /tmp/ruby/src/trunk/spec/default.mspec --error-output stderr --debug -fy -o /tmp/rubytest.u22na2/6-mspec-multi-5 E, [2024-05-15T06:10:12.543596 #2385316] ERROR -- : $ /tmp/ruby/build/trunk/miniruby -I/tmp/ruby/src/trunk/lib /tmp/ruby/src/trunk/tool/runruby.rb --archdir=/tmp/ruby/build/trunk --extout=.ext -- /tmp/ruby/src/trunk/spec/mspec/bin/mspec-run -B /tmp/ruby/src/trunk/spec/default.mspec --error-output stderr --debug -fy -o /tmp/rubytest.u22na2/7-mspec-multi-6 E, [2024-05-15T06:10:12.543748 #2385316] ERROR -- : $ /tmp/ruby/build/trunk/miniruby -I/tmp/ruby/src/trunk/lib /tmp/ruby/src/trunk/tool/runruby.rb --archdir=/tmp/ruby/build/trunk --extout=.ext -- /tmp/ruby/src/trunk/spec/mspec/bin/mspec-run -B /tmp/ruby/src/trunk/spec/default.mspec --error-output stderr --debug -fy -o /tmp/rubytest.u22na2/8-mspec-multi-7 E, [2024-05-15T06:10:12.543951 #2385316] ERROR -- : $ /tmp/ruby/build/trunk/miniruby -I/tmp/ruby/src/trunk/lib /tmp/ruby/src/trunk/tool/runruby.rb --archdir=/tmp/ruby/build/trunk --extout=.ext -- /tmp/ruby/src/trunk/spec/mspec/bin/mspec-run -B /tmp/ruby/src/trunk/spec/default.mspec --error-output stderr --debug -fy -o /tmp/rubytest.u22na2/9-mspec-multi-8 E, [2024-05-15T06:10:12.544156 #2385316] ERROR -- : $ /tmp/ruby/build/trunk/miniruby -I/tmp/ruby/src/trunk/lib /tmp/ruby/src/trunk/tool/runruby.rb --archdir=/tmp/ruby/build/trunk --extout=.ext -- /tmp/ruby/src/trunk/spec/mspec/bin/mspec-run -B /tmp/ruby/src/trunk/spec/default.mspec --error-output stderr --debug -fy -o /tmp/rubytest.u22na2/10-mspec-multi-9 E, [2024-05-15T06:10:12.544468 #2385316] ERROR -- : $ /tmp/ruby/build/trunk/miniruby -I/tmp/ruby/src/trunk/lib /tmp/ruby/src/trunk/tool/runruby.rb --archdir=/tmp/ruby/build/trunk --extout=.ext -- /tmp/ruby/src/trunk/spec/mspec/bin/mspec-run -B /tmp/ruby/src/trunk/spec/default.mspec --error-output stderr --debug -fy -o /tmp/rubytest.u22na2/11-mspec-multi-10 E, [2024-05-15T06:10:12.544655 #2385316] ERROR -- : $ /tmp/ruby/build/trunk/miniruby -I/tmp/ruby/src/trunk/lib /tmp/ruby/src/trunk/tool/runruby.rb --archdir=/tmp/ruby/build/trunk --extout=.ext -- /tmp/ruby/src/trunk/spec/mspec/bin/mspec-run -B /tmp/ruby/src/trunk/spec/default.mspec --error-output stderr --debug -fy -o /tmp/rubytest.u22na2/12-mspec-multi-11 E, [2024-05-15T06:10:12.544836 #2385316] ERROR -- : $ /tmp/ruby/build/trunk/miniruby -I/tmp/ruby/src/trunk/lib /tmp/ruby/src/trunk/tool/runruby.rb --archdir=/tmp/ruby/build/trunk --extout=.ext -- /tmp/ruby/src/trunk/spec/mspec/bin/mspec-run -B /tmp/ruby/src/trunk/spec/default.mspec --error-output stderr --debug -fy -o /tmp/rubytest.u22na2/13-mspec-multi-12 E, [2024-05-15T06:10:12.545051 #2385316] ERROR -- : $ /tmp/ruby/build/trunk/miniruby -I/tmp/ruby/src/trunk/lib /tmp/ruby/src/trunk/tool/runruby.rb --archdir=/tmp/ruby/build/trunk --extout=.ext -- /tmp/ruby/src/trunk/spec/mspec/bin/mspec-run -B /tmp/ruby/src/trunk/spec/default.mspec --error-output stderr --debug -fy -o /tmp/rubytest.u22na2/14-mspec-multi-13 E, [2024-05-15T06:10:12.545187 #2385316] ERROR -- : $ /tmp/ruby/build/trunk/miniruby -I/tmp/ruby/src/trunk/lib /tmp/ruby/src/trunk/tool/runruby.rb --archdir=/tmp/ruby/build/trunk --extout=.ext -- /tmp/ruby/src/trunk/spec/mspec/bin/mspec-run -B /tmp/ruby/src/trunk/spec/default.mspec --error-output stderr --debug -fy -o /tmp/rubytest.u22na2/15-mspec-multi-14 E, [2024-05-15T06:10:12.545416 #2385316] ERROR -- : $ /tmp/ruby/build/trunk/miniruby -I/tmp/ruby/src/trunk/lib /tmp/ruby/src/trunk/tool/runruby.rb --archdir=/tmp/ruby/build/trunk --extout=.ext -- /tmp/ruby/src/trunk/spec/mspec/bin/mspec-run -B /tmp/ruby/src/trunk/spec/default.mspec --error-output stderr --debug -fy -o /tmp/rubytest.u22na2/16-mspec-multi-15 E, [2024-05-15T06:10:12.545540 #2385316] ERROR -- : $ /tmp/ruby/build/trunk/miniruby -I/tmp/ruby/src/trunk/lib /tmp/ruby/src/trunk/tool/runruby.rb --archdir=/tmp/ruby/build/trunk --extout=.ext -- /tmp/ruby/src/trunk/spec/mspec/bin/mspec-run -B /tmp/ruby/src/trunk/spec/default.mspec --error-output stderr --debug -fy -o /tmp/rubytest.u22na2/17-mspec-multi-16 E, [2024-05-15T06:10:12.545816 #2385316] ERROR -- : $ /tmp/ruby/build/trunk/miniruby -I/tmp/ruby/src/trunk/lib /tmp/ruby/src/trunk/tool/runruby.rb --archdir=/tmp/ruby/build/trunk --extout=.ext -- /tmp/ruby/src/trunk/spec/mspec/bin/mspec-run -B /tmp/ruby/src/trunk/spec/default.mspec --error-output stderr --debug -fy -o /tmp/rubytest.u22na2/18-mspec-multi-17 E, [2024-05-15T06:10:12.548820 #2385316] ERROR -- : $ /tmp/ruby/build/trunk/miniruby -I/tmp/ruby/src/trunk/lib /tmp/ruby/src/trunk/tool/runruby.rb --archdir=/tmp/ruby/build/trunk --extout=.ext -- /tmp/ruby/src/trunk/spec/mspec/bin/mspec-run -B /tmp/ruby/src/trunk/spec/default.mspec --error-output stderr --debug -fy -o /tmp/rubytest.u22na2/19-mspec-multi-18 E, [2024-05-15T06:10:12.549127 #2385316] ERROR -- : $ /tmp/ruby/build/trunk/miniruby -I/tmp/ruby/src/trunk/lib /tmp/ruby/src/trunk/tool/runruby.rb --archdir=/tmp/ruby/build/trunk --extout=.ext -- /tmp/ruby/src/trunk/spec/mspec/bin/mspec-run -B /tmp/ruby/src/trunk/spec/default.mspec --error-output stderr --debug -fy -o /tmp/rubytest.u22na2/20-mspec-multi-19 I, [2024-05-15T06:10:12.714082 #2385316] INFO -- : ruby 3.4.0dev (2024-05-14T21:44:34Z master e3e1e53098) [x86_64-linux] I, [2024-05-15T06:10:13.335100 #2385316] INFO -- : 0 ......................................................................... I, [2024-05-15T06:10:13.739102 #2385316] INFO -- : 73 ......................................................................... I, [2024-05-15T06:10:13.869584 #2385316] INFO -- : 146 ......................................................................... I, [2024-05-15T06:10:13.922212 #2385316] INFO -- : 219 ......................................................................... I, [2024-05-15T06:10:13.990502 #2385316] INFO -- : 292 ......................................................................... I, [2024-05-15T06:10:14.024801 #2385316] INFO -- : 365 ......................................................................... I, [2024-05-15T06:10:14.041709 #2385316] INFO -- : 438 ......................................................................... I, [2024-05-15T06:10:14.057253 #2385316] INFO -- : 511 ......................................................................... I, [2024-05-15T06:10:14.072528 #2385316] INFO -- : 584 ......................................................................... I, [2024-05-15T06:10:14.129482 #2385316] INFO -- : 657 ......................................................................... I, [2024-05-15T06:10:14.163648 #2385316] INFO -- : 730 ......................................................................... I, [2024-05-15T06:10:14.192784 #2385316] INFO -- : 803 ......................................................................... I, [2024-05-15T06:10:14.233578 #2385316] INFO -- : 876 ......................................................................... I, [2024-05-15T06:10:14.271015 #2385316] INFO -- : 949 ......................................................................... I, [2024-05-15T06:10:14.345242 #2385316] INFO -- : 1022 ......................................................................... I, [2024-05-15T06:10:14.528068 #2385316] INFO -- : 1095 ......................................................................... I, [2024-05-15T06:10:14.653004 #2385316] INFO -- : 1168 ......................................................................... I, [2024-05-15T06:10:14.715844 #2385316] INFO -- : 1241 ......................................................................... I, [2024-05-15T06:10:14.762679 #2385316] INFO -- : 1314 ......................................................................... I, [2024-05-15T06:10:14.780558 #2385316] INFO -- : 1387 ......................................................................... I, [2024-05-15T06:10:14.889773 #2385316] INFO -- : 1460 ......................................................................... I, [2024-05-15T06:10:15.313700 #2385316] INFO -- : 1533 ......................................................................... I, [2024-05-15T06:10:15.383479 #2385316] INFO -- : 1606 ......................................................................... I, [2024-05-15T06:10:15.505585 #2385316] INFO -- : 1679 ......................................................................... I, [2024-05-15T06:10:15.628627 #2385316] INFO -- : 1752 ......................................................................... I, [2024-05-15T06:10:15.713239 #2385316] INFO -- : 1825 ......................................................................... I, [2024-05-15T06:10:15.811648 #2385316] INFO -- : 1898 ......................................................................... I, [2024-05-15T06:10:15.900982 #2385316] INFO -- : 1971 ......................................................................... I, [2024-05-15T06:10:15.966701 #2385316] INFO -- : 2044 ......................................................................... I, [2024-05-15T06:10:16.014111 #2385316] INFO -- : 2117 ......................................................................... I, [2024-05-15T06:10:16.029367 #2385316] INFO -- : 2190 ......................................................................... I, [2024-05-15T06:10:16.048772 #2385316] INFO -- : 2263 ......................................................................... I, [2024-05-15T06:10:16.061979 #2385316] INFO -- : 2336 ......................................................................... I, [2024-05-15T06:10:16.100208 #2385316] INFO -- : 2409 ......................................................................... I, [2024-05-15T06:10:16.210751 #2385316] INFO -- : 2482 ......................................................................... I, [2024-05-15T06:10:16.237020 #2385316] INFO -- : 2555 ......................................................................... I, [2024-05-15T06:10:16.339063 #2385316] INFO -- : 2628 ......................................................................... I, [2024-05-15T06:10:16.449139 #2385316] INFO -- : 2701 ......................................................................... I, [2024-05-15T06:10:16.484676 #2385316] INFO -- : 2774 ......................................................................... I, [2024-05-15T06:10:16.547591 #2385316] INFO -- : 2847 ......................................................................... I, [2024-05-15T06:10:16.587321 #2385316] INFO -- : 2920 ......................................................................... I, [2024-05-15T06:10:16.615542 #2385316] INFO -- : 2993 ......................................................................... I, [2024-05-15T06:10:16.637889 #2385316] INFO -- : 3066 ......................................................................... I, [2024-05-15T06:10:16.648638 #2385316] INFO -- : 3139 ......................................................................... I, [2024-05-15T06:10:16.657352 #2385316] INFO -- : 3212 ......................................................................... I, [2024-05-15T06:10:16.685965 #2385316] INFO -- : 3285 ......................................................................... I, [2024-05-15T06:10:20.657790 #2385316] INFO -- : 3358 ........................................................................ I, [2024-05-15T06:10:20.657864 #2385316] INFO -- : I, [2024-05-15T06:10:20.657879 #2385316] INFO -- : Finished in 8.114598 seconds I, [2024-05-15T06:10:20.657890 #2385316] INFO -- : I, [2024-05-15T06:10:20.657901 #2385316] INFO -- : 3429 files, 32611 examples, 189388 expectations, 0 failures, 0 errors, 0 tagged I, [2024-05-15T06:10:20.659623 #2385316] INFO -- : $$$[end] "make yes-test-rubyspec MSPECOPT='--error-output stderr --debug -j' TESTS='-j20'" exit with 0.