# Logfile created on 2024-05-15 00:09:34 +0000 by logger.rb/v1.5.0 I, [2024-05-15T00:09:34.893265 #678477] INFO -- : #, @formatter=nil, @logdev=#, @binmode=false, @mon_data=#, @mon_data_owner_object_id=860>>> I, [2024-05-15T00:09:34.895208 #678477] INFO -- : $$$[beg] make update-unicode -j4 I, [2024-05-15T00:09:35.443163 #678477] INFO -- : Downloading Unicode emoji 15.0 files... I, [2024-05-15T00:09:35.444561 #678477] INFO -- : Downloading Unicode emoji 15.0 files... I, [2024-05-15T00:09:35.444994 #678477] INFO -- : Downloading Unicode emoji 15.0 files... I, [2024-05-15T00:09:36.074112 #678477] INFO -- : made symlink emoji/15.0/emoji-sequences.txt to /tmp/ruby/src/trunk/.downloaded-cache/emoji/15.0/emoji-sequences.txt I, [2024-05-15T00:09:36.087018 #678477] INFO -- : downloading emoji/15.0/emoji-test.txt ... /tmp/ruby/src/trunk/enc/unicode/data/emoji/15.0/emoji-sequences.txt already exists I, [2024-05-15T00:09:36.109394 #678477] INFO -- : downloading emoji/15.0/emoji-test.txt ... /tmp/ruby/src/trunk/enc/unicode/data/emoji/15.0/emoji-sequences.txt already exists E, [2024-05-15T00:09:37.043563 #678477] ERROR -- : /tmp/ruby/src/trunk/tool/downloader.rb:302:in `rescue in download': failed to download emoji/15.0/emoji-test.txt (RuntimeError) E, [2024-05-15T00:09:37.044012 #678477] ERROR -- : OpenURI::HTTPError: 403 Forbidden: https://www.unicode.org/Public/emoji/15.0/emoji-test.txt E, [2024-05-15T00:09:37.044294 #678477] ERROR -- : from /tmp/ruby/src/trunk/tool/downloader.rb:201:in `download' E, [2024-05-15T00:09:37.044484 #678477] ERROR -- : from /tmp/ruby/src/trunk/tool/downloader.rb:136:in `download' E, [2024-05-15T00:09:37.044658 #678477] ERROR -- : from /tmp/ruby/src/trunk/tool/downloader.rb:482:in `block in
' E, [2024-05-15T00:09:37.044838 #678477] ERROR -- : from /tmp/ruby/src/trunk/tool/downloader.rb:465:in `each' E, [2024-05-15T00:09:37.045006 #678477] ERROR -- : from /tmp/ruby/src/trunk/tool/downloader.rb:465:in `
' E, [2024-05-15T00:09:37.045380 #678477] ERROR -- : /usr/lib/ruby/3.1.0/open-uri.rb:364:in `open_http': 403 Forbidden (OpenURI::HTTPError) E, [2024-05-15T00:09:37.045561 #678477] ERROR -- : from /usr/lib/ruby/3.1.0/open-uri.rb:741:in `buffer_open' E, [2024-05-15T00:09:37.045747 #678477] ERROR -- : from /usr/lib/ruby/3.1.0/open-uri.rb:212:in `block in open_loop' E, [2024-05-15T00:09:37.045915 #678477] ERROR -- : from /usr/lib/ruby/3.1.0/open-uri.rb:210:in `catch' E, [2024-05-15T00:09:37.046080 #678477] ERROR -- : from /usr/lib/ruby/3.1.0/open-uri.rb:210:in `open_loop' E, [2024-05-15T00:09:37.046250 #678477] ERROR -- : from /usr/lib/ruby/3.1.0/open-uri.rb:151:in `open_uri' E, [2024-05-15T00:09:37.046419 #678477] ERROR -- : from /usr/lib/ruby/3.1.0/open-uri.rb:721:in `open' E, [2024-05-15T00:09:37.046649 #678477] ERROR -- : from /usr/lib/ruby/3.1.0/open-uri.rb:729:in `read' E, [2024-05-15T00:09:37.046892 #678477] ERROR -- : from /tmp/ruby/src/trunk/tool/downloader.rb:247:in `block in download' E, [2024-05-15T00:09:37.047108 #678477] ERROR -- : from /tmp/ruby/src/trunk/tool/downloader.rb:378:in `with_retry' E, [2024-05-15T00:09:37.047277 #678477] ERROR -- : from /tmp/ruby/src/trunk/tool/downloader.rb:246:in `download' E, [2024-05-15T00:09:37.047485 #678477] ERROR -- : from /tmp/ruby/src/trunk/tool/downloader.rb:136:in `download' E, [2024-05-15T00:09:37.047659 #678477] ERROR -- : from /tmp/ruby/src/trunk/tool/downloader.rb:482:in `block in
' E, [2024-05-15T00:09:37.047828 #678477] ERROR -- : from /tmp/ruby/src/trunk/tool/downloader.rb:465:in `each' E, [2024-05-15T00:09:37.048041 #678477] ERROR -- : from /tmp/ruby/src/trunk/tool/downloader.rb:465:in `
' E, [2024-05-15T00:09:37.067412 #678477] ERROR -- : make: *** [uncommon.mk:1765: /tmp/ruby/src/trunk/enc/unicode/data/emoji/15.0/emoji-sequences.txt] Error 1 E, [2024-05-15T00:09:37.067616 #678477] ERROR -- : make: *** Deleting file '/tmp/ruby/src/trunk/enc/unicode/data/emoji/15.0/emoji-sequences.txt' E, [2024-05-15T00:09:37.067707 #678477] ERROR -- : make: *** Waiting for unfinished jobs.... E, [2024-05-15T00:09:37.069944 #678477] ERROR -- : /tmp/ruby/src/trunk/tool/downloader.rb:302:in `rescue in download': failed to download emoji/15.0/emoji-test.txt (RuntimeError) E, [2024-05-15T00:09:37.070118 #678477] ERROR -- : OpenURI::HTTPError: 403 Forbidden: https://www.unicode.org/Public/emoji/15.0/emoji-test.txt E, [2024-05-15T00:09:37.070232 #678477] ERROR -- : from /tmp/ruby/src/trunk/tool/downloader.rb:201:in `download' E, [2024-05-15T00:09:37.070429 #678477] ERROR -- : from /tmp/ruby/src/trunk/tool/downloader.rb:136:in `download' E, [2024-05-15T00:09:37.070586 #678477] ERROR -- : from /tmp/ruby/src/trunk/tool/downloader.rb:482:in `block in
' E, [2024-05-15T00:09:37.070996 #678477] ERROR -- : from /tmp/ruby/src/trunk/tool/downloader.rb:465:in `each' E, [2024-05-15T00:09:37.071150 #678477] ERROR -- : from /tmp/ruby/src/trunk/tool/downloader.rb:465:in `
' E, [2024-05-15T00:09:37.071301 #678477] ERROR -- : /usr/lib/ruby/3.1.0/open-uri.rb:364:in `open_http': 403 Forbidden (OpenURI::HTTPError) E, [2024-05-15T00:09:37.071433 #678477] ERROR -- : from /usr/lib/ruby/3.1.0/open-uri.rb:741:in `buffer_open' E, [2024-05-15T00:09:37.071533 #678477] ERROR -- : from /usr/lib/ruby/3.1.0/open-uri.rb:212:in `block in open_loop' E, [2024-05-15T00:09:37.071626 #678477] ERROR -- : from /usr/lib/ruby/3.1.0/open-uri.rb:210:in `catch' E, [2024-05-15T00:09:37.071756 #678477] ERROR -- : from /usr/lib/ruby/3.1.0/open-uri.rb:210:in `open_loop' E, [2024-05-15T00:09:37.071861 #678477] ERROR -- : from /usr/lib/ruby/3.1.0/open-uri.rb:151:in `open_uri' E, [2024-05-15T00:09:37.072031 #678477] ERROR -- : from /usr/lib/ruby/3.1.0/open-uri.rb:721:in `open' E, [2024-05-15T00:09:37.072179 #678477] ERROR -- : from /usr/lib/ruby/3.1.0/open-uri.rb:729:in `read' E, [2024-05-15T00:09:37.072292 #678477] ERROR -- : from /tmp/ruby/src/trunk/tool/downloader.rb:247:in `block in download' E, [2024-05-15T00:09:37.072409 #678477] ERROR -- : from /tmp/ruby/src/trunk/tool/downloader.rb:378:in `with_retry' E, [2024-05-15T00:09:37.072506 #678477] ERROR -- : from /tmp/ruby/src/trunk/tool/downloader.rb:246:in `download' E, [2024-05-15T00:09:37.072604 #678477] ERROR -- : from /tmp/ruby/src/trunk/tool/downloader.rb:136:in `download' E, [2024-05-15T00:09:37.072700 #678477] ERROR -- : from /tmp/ruby/src/trunk/tool/downloader.rb:482:in `block in
' E, [2024-05-15T00:09:37.072797 #678477] ERROR -- : from /tmp/ruby/src/trunk/tool/downloader.rb:465:in `each' E, [2024-05-15T00:09:37.072894 #678477] ERROR -- : from /tmp/ruby/src/trunk/tool/downloader.rb:465:in `
' E, [2024-05-15T00:09:37.085264 #678477] ERROR -- : /tmp/ruby/src/trunk/tool/downloader.rb:302:in `rescue in download': failed to download emoji/15.0/emoji-test.txt (RuntimeError) E, [2024-05-15T00:09:37.085489 #678477] ERROR -- : OpenURI::HTTPError: 403 Forbidden: https://www.unicode.org/Public/emoji/15.0/emoji-test.txt E, [2024-05-15T00:09:37.085682 #678477] ERROR -- : from /tmp/ruby/src/trunk/tool/downloader.rb:201:in `download' E, [2024-05-15T00:09:37.085803 #678477] ERROR -- : from /tmp/ruby/src/trunk/tool/downloader.rb:136:in `download' E, [2024-05-15T00:09:37.085916 #678477] ERROR -- : from /tmp/ruby/src/trunk/tool/downloader.rb:482:in `block in
' E, [2024-05-15T00:09:37.086087 #678477] ERROR -- : from /tmp/ruby/src/trunk/tool/downloader.rb:465:in `each' E, [2024-05-15T00:09:37.086425 #678477] ERROR -- : from /tmp/ruby/src/trunk/tool/downloader.rb:465:in `
' E, [2024-05-15T00:09:37.086573 #678477] ERROR -- : /usr/lib/ruby/3.1.0/open-uri.rb:364:in `open_http': 403 Forbidden (OpenURI::HTTPError) E, [2024-05-15T00:09:37.086685 #678477] ERROR -- : from /usr/lib/ruby/3.1.0/open-uri.rb:741:in `buffer_open' E, [2024-05-15T00:09:37.086804 #678477] ERROR -- : from /usr/lib/ruby/3.1.0/open-uri.rb:212:in `block in open_loop' E, [2024-05-15T00:09:37.086911 #678477] ERROR -- : from /usr/lib/ruby/3.1.0/open-uri.rb:210:in `catch' E, [2024-05-15T00:09:37.087026 #678477] ERROR -- : from /usr/lib/ruby/3.1.0/open-uri.rb:210:in `open_loop' E, [2024-05-15T00:09:37.087134 #678477] ERROR -- : from /usr/lib/ruby/3.1.0/open-uri.rb:151:in `open_uri' E, [2024-05-15T00:09:37.087238 #678477] ERROR -- : from /usr/lib/ruby/3.1.0/open-uri.rb:721:in `open' E, [2024-05-15T00:09:37.087348 #678477] ERROR -- : from /usr/lib/ruby/3.1.0/open-uri.rb:729:in `read' E, [2024-05-15T00:09:37.087459 #678477] ERROR -- : from /tmp/ruby/src/trunk/tool/downloader.rb:247:in `block in download' E, [2024-05-15T00:09:37.087569 #678477] ERROR -- : from /tmp/ruby/src/trunk/tool/downloader.rb:378:in `with_retry' E, [2024-05-15T00:09:37.087683 #678477] ERROR -- : from /tmp/ruby/src/trunk/tool/downloader.rb:246:in `download' E, [2024-05-15T00:09:37.087804 #678477] ERROR -- : from /tmp/ruby/src/trunk/tool/downloader.rb:136:in `download' E, [2024-05-15T00:09:37.087983 #678477] ERROR -- : from /tmp/ruby/src/trunk/tool/downloader.rb:482:in `block in
' E, [2024-05-15T00:09:37.088169 #678477] ERROR -- : from /tmp/ruby/src/trunk/tool/downloader.rb:465:in `each' E, [2024-05-15T00:09:37.088306 #678477] ERROR -- : from /tmp/ruby/src/trunk/tool/downloader.rb:465:in `
' E, [2024-05-15T00:09:37.093164 #678477] ERROR -- : make: *** [uncommon.mk:1765: /tmp/ruby/src/trunk/enc/unicode/data/emoji/15.0/emoji-test.txt] Error 1 E, [2024-05-15T00:09:37.105066 #678477] ERROR -- : make: *** [uncommon.mk:1765: /tmp/ruby/src/trunk/enc/unicode/data/emoji/15.0/emoji-zwj-sequences.txt] Error 1 I, [2024-05-15T00:09:37.105289 #678477] INFO -- : downloading emoji/15.0/emoji-test.txt ... I, [2024-05-15T00:09:37.106603 #678477] INFO -- : $$$[end] "make update-unicode -j4" exit with 512. I, [2024-05-15T00:09:37.106813 #678477] INFO -- : $$$[beg] make update-download -j4 I, [2024-05-15T00:09:38.238711 #678477] INFO -- : tool/config.guess already exists I, [2024-05-15T00:09:38.239092 #678477] INFO -- : tool/config.sub already exists I, [2024-05-15T00:09:38.257234 #678477] INFO -- : Update minitest to ea9caafc0754b1d6236a490d59e624b53209734a I, [2024-05-15T00:09:38.258163 #678477] INFO -- : Update power_assert to 84e85124c5014a139af39161d484156cfe87a9ed I, [2024-05-15T00:09:38.260524 #678477] INFO -- : Update rbs to ba7872795d5de04adb8ff500c0e6afdc81a041dd I, [2024-05-15T00:09:38.261297 #678477] INFO -- : Update typeprof to b19a6416da3a05d57fadd6ffdadb382b6d236ca5 I, [2024-05-15T00:09:38.266339 #678477] INFO -- : echo ea9caafc0754b1d6236a490d59e624b53209734a | /bin/sh /tmp/ruby/src/trunk/tool/ifchange /tmp/ruby/src/trunk/.bundle/.timestamp/minitest.revision - I, [2024-05-15T00:09:38.267793 #678477] INFO -- : echo 84e85124c5014a139af39161d484156cfe87a9ed | /bin/sh /tmp/ruby/src/trunk/tool/ifchange /tmp/ruby/src/trunk/.bundle/.timestamp/power_assert.revision - I, [2024-05-15T00:09:38.271137 #678477] INFO -- : echo ba7872795d5de04adb8ff500c0e6afdc81a041dd | /bin/sh /tmp/ruby/src/trunk/tool/ifchange /tmp/ruby/src/trunk/.bundle/.timestamp/rbs.revision - I, [2024-05-15T00:09:38.271544 #678477] INFO -- : echo b19a6416da3a05d57fadd6ffdadb382b6d236ca5 | /bin/sh /tmp/ruby/src/trunk/tool/ifchange /tmp/ruby/src/trunk/.bundle/.timestamp/typeprof.revision - I, [2024-05-15T00:09:38.278681 #678477] INFO -- : /tmp/ruby/src/trunk/.bundle/.timestamp/minitest.revision unchanged I, [2024-05-15T00:09:38.279962 #678477] INFO -- : /tmp/ruby/src/trunk/.bundle/.timestamp/power_assert.revision unchanged I, [2024-05-15T00:09:38.283236 #678477] INFO -- : /tmp/ruby/src/trunk/.bundle/.timestamp/rbs.revision unchanged I, [2024-05-15T00:09:38.285583 #678477] INFO -- : /tmp/ruby/src/trunk/.bundle/.timestamp/typeprof.revision unchanged I, [2024-05-15T00:09:39.092689 #678477] INFO -- : Building power_assert@84e85124c5014a139af39161d484156cfe87a9ed to /tmp/ruby/src/trunk/gems/power_assert-2.0.3.gem I, [2024-05-15T00:09:40.041420 #678477] INFO -- : Successfully built RubyGem I, [2024-05-15T00:09:40.041653 #678477] INFO -- : Name: power_assert I, [2024-05-15T00:09:40.042381 #678477] INFO -- : Version: 2.0.4dev I, [2024-05-15T00:09:40.042570 #678477] INFO -- : File: power_assert-2.0.4dev.gem I, [2024-05-15T00:09:40.707145 #678477] INFO -- : $$$[end] "make update-download -j4" exit with 0. I, [2024-05-15T00:09:40.707382 #678477] INFO -- : $$$[beg] make update-rubyspec -j4 I, [2024-05-15T00:09:41.226793 #678477] INFO -- : make: Nothing to be done for 'update-rubyspec'. I, [2024-05-15T00:09:41.228410 #678477] INFO -- : $$$[end] "make update-rubyspec -j4" exit with 0. I, [2024-05-15T00:09:41.228643 #678477] INFO -- : $$$[beg] make update-src -j4 I, [2024-05-15T00:09:43.196639 #678477] INFO -- : Already up to date. I, [2024-05-15T00:09:43.255457 #678477] INFO -- : Latest commit hash = e3e1e53098 I, [2024-05-15T00:09:43.261156 #678477] INFO -- : $$$[end] "make update-src -j4" exit with 0. I, [2024-05-15T00:09:43.261414 #678477] INFO -- : $$$[beg] make after-update -j4 I, [2024-05-15T00:09:44.101080 #678477] INFO -- : /tmp/ruby/src/trunk/revision.h updated I, [2024-05-15T00:09:44.115488 #678477] INFO -- : generating riscv64-linux-fake.rb I, [2024-05-15T00:09:44.607185 #678477] INFO -- : riscv64-linux-fake.rb updated I, [2024-05-15T00:09:44.613962 #678477] INFO -- : generating enc.mk I, [2024-05-15T00:09:46.101419 #678477] INFO -- : making srcs under enc I, [2024-05-15T00:09:46.402248 #678477] INFO -- : make[1]: Entering directory '/tmp/ruby/build/trunk' I, [2024-05-15T00:09:46.402466 #678477] INFO -- : make[1]: Nothing to be done for 'srcs'. I, [2024-05-15T00:09:46.402571 #678477] INFO -- : make[1]: Leaving directory '/tmp/ruby/build/trunk' I, [2024-05-15T00:09:47.057502 #678477] INFO -- : Update minitest to ea9caafc0754b1d6236a490d59e624b53209734a I, [2024-05-15T00:09:47.058320 #678477] INFO -- : Update power_assert to 84e85124c5014a139af39161d484156cfe87a9ed I, [2024-05-15T00:09:47.059068 #678477] INFO -- : Update rbs to ba7872795d5de04adb8ff500c0e6afdc81a041dd I, [2024-05-15T00:09:47.062513 #678477] INFO -- : Update typeprof to b19a6416da3a05d57fadd6ffdadb382b6d236ca5 I, [2024-05-15T00:09:47.068944 #678477] INFO -- : echo 84e85124c5014a139af39161d484156cfe87a9ed | /bin/sh /tmp/ruby/src/trunk/tool/ifchange /tmp/ruby/src/trunk/.bundle/.timestamp/power_assert.revision - I, [2024-05-15T00:09:47.069618 #678477] INFO -- : echo ba7872795d5de04adb8ff500c0e6afdc81a041dd | /bin/sh /tmp/ruby/src/trunk/tool/ifchange /tmp/ruby/src/trunk/.bundle/.timestamp/rbs.revision - I, [2024-05-15T00:09:47.070334 #678477] INFO -- : echo ea9caafc0754b1d6236a490d59e624b53209734a | /bin/sh /tmp/ruby/src/trunk/tool/ifchange /tmp/ruby/src/trunk/.bundle/.timestamp/minitest.revision - I, [2024-05-15T00:09:47.079291 #678477] INFO -- : echo b19a6416da3a05d57fadd6ffdadb382b6d236ca5 | /bin/sh /tmp/ruby/src/trunk/tool/ifchange /tmp/ruby/src/trunk/.bundle/.timestamp/typeprof.revision - I, [2024-05-15T00:09:47.080836 #678477] INFO -- : /tmp/ruby/src/trunk/.bundle/.timestamp/power_assert.revision unchanged I, [2024-05-15T00:09:47.082761 #678477] INFO -- : /tmp/ruby/src/trunk/.bundle/.timestamp/rbs.revision unchanged I, [2024-05-15T00:09:47.086475 #678477] INFO -- : /tmp/ruby/src/trunk/.bundle/.timestamp/minitest.revision unchanged I, [2024-05-15T00:09:47.090284 #678477] INFO -- : /tmp/ruby/src/trunk/.bundle/.timestamp/typeprof.revision unchanged I, [2024-05-15T00:09:47.893789 #678477] INFO -- : Building power_assert@84e85124c5014a139af39161d484156cfe87a9ed to /tmp/ruby/src/trunk/gems/power_assert-2.0.3.gem I, [2024-05-15T00:09:48.856685 #678477] INFO -- : Successfully built RubyGem I, [2024-05-15T00:09:48.856893 #678477] INFO -- : Name: power_assert I, [2024-05-15T00:09:48.856989 #678477] INFO -- : Version: 2.0.4dev I, [2024-05-15T00:09:48.862147 #678477] INFO -- : File: power_assert-2.0.4dev.gem I, [2024-05-15T00:09:48.872512 #678477] INFO -- : Extracting bundle gem power_assert-2.0.3... I, [2024-05-15T00:09:49.733515 #678477] INFO -- : Try with hash version of bundled gems instead of gems/power_assert-2.0.3.gem. We don't use this gem with release version of Ruby. I, [2024-05-15T00:09:49.787925 #678477] INFO -- : Unpacked gems/power_assert-2.0.4dev.gem I, [2024-05-15T00:09:49.803046 #678477] INFO -- : $$$[end] "make after-update -j4" exit with 0. I, [2024-05-15T00:09:49.803860 #678477] INFO -- : $$$[beg] make miniruby -j4 I, [2024-05-15T00:09:50.323727 #678477] INFO -- : BASERUBY = /usr/bin/ruby --disable=gems I, [2024-05-15T00:09:50.324177 #678477] INFO -- : CC = gcc I, [2024-05-15T00:09:50.324429 #678477] INFO -- : LD = ld I, [2024-05-15T00:09:50.324680 #678477] INFO -- : LDSHARED = gcc -shared I, [2024-05-15T00:09:50.324921 #678477] INFO -- : CFLAGS = -O3 -fno-fast-math -ggdb3 -Wall -Wextra -Wdeprecated-declarations -Wdiv-by-zero -Wduplicated-cond -Wimplicit-function-declaration -Wimplicit-int -Wpointer-arith -Wwrite-strings -Wold-style-definition -Wimplicit-fallthrough=0 -Wmissing-noreturn -Wno-cast-function-type -Wno-constant-logical-operand -Wno-long-long -Wno-missing-field-initializers -Wno-overlength-strings -Wno-packed-bitfield-compat -Wno-parentheses-equality -Wno-self-assign -Wno-tautological-compare -Wno-unused-parameter -Wno-unused-value -Wsuggest-attribute=format -Wsuggest-attribute=noreturn -Wunused-variable -Wmisleading-indentation -Wundef -fPIC I, [2024-05-15T00:09:50.325128 #678477] INFO -- : XCFLAGS = -U_FORTIFY_SOURCE -D_FORTIFY_SOURCE=2 -fstack-protector-strong -fno-strict-overflow -fvisibility=hidden -fexcess-precision=standard -DRUBY_EXPORT -I. -I.ext/include/riscv64-linux -I/tmp/ruby/src/trunk/include -I/tmp/ruby/src/trunk -I/tmp/ruby/src/trunk/prism -I/tmp/ruby/src/trunk/enc/unicode/15.0.0 I, [2024-05-15T00:09:50.325315 #678477] INFO -- : CPPFLAGS = I, [2024-05-15T00:09:50.325513 #678477] INFO -- : DLDFLAGS = -Wl,--compress-debug-sections=zlib -Wl,-soname,libruby.so.3.4 -fstack-protector-strong I, [2024-05-15T00:09:50.325712 #678477] INFO -- : SOLIBS = -lz -lrt -lrt -lgmp -ldl -lcrypt -lm -lpthread I, [2024-05-15T00:09:50.325892 #678477] INFO -- : LANG = I, [2024-05-15T00:09:50.326057 #678477] INFO -- : LC_ALL = I, [2024-05-15T00:09:50.326326 #678477] INFO -- : LC_CTYPE = I, [2024-05-15T00:09:50.326526 #678477] INFO -- : MFLAGS = -j4 --jobserver-auth=4,5 I, [2024-05-15T00:09:50.326758 #678477] INFO -- : RUSTC = rustc I, [2024-05-15T00:09:50.326984 #678477] INFO -- : YJIT_RUSTC_ARGS = --crate-name=yjit --crate-type=staticlib --edition=2021 -g -C lto=thin -C opt-level=3 -C overflow-checks=on '--out-dir=/tmp/ruby/build/trunk/yjit/target/release/' /tmp/ruby/src/trunk/yjit/src/lib.rs I, [2024-05-15T00:09:50.338269 #678477] INFO -- : gcc (Debian 13.2.0-4revyos1) 13.2.0 I, [2024-05-15T00:09:50.338469 #678477] INFO -- : Copyright (C) 2023 Free Software Foundation, Inc. I, [2024-05-15T00:09:50.338672 #678477] INFO -- : This is free software; see the source for copying conditions. There is NO I, [2024-05-15T00:09:50.338824 #678477] INFO -- : warranty; not even for MERCHANTABILITY or FITNESS FOR A PARTICULAR PURPOSE. I, [2024-05-15T00:09:50.338948 #678477] INFO -- : I, [2024-05-15T00:09:50.566528 #678477] INFO -- : compiling /tmp/ruby/src/trunk/version.c I, [2024-05-15T00:09:51.693310 #678477] INFO -- : linking miniruby I, [2024-05-15T00:10:32.641762 #678477] INFO -- : $$$[end] "make miniruby -j4" exit with 0. I, [2024-05-15T00:10:32.642418 #678477] INFO -- : $$$[beg] make ruby -j4 I, [2024-05-15T00:10:33.177059 #678477] INFO -- : BASERUBY = /usr/bin/ruby --disable=gems I, [2024-05-15T00:10:33.177460 #678477] INFO -- : CC = gcc I, [2024-05-15T00:10:33.177687 #678477] INFO -- : LD = ld I, [2024-05-15T00:10:33.177966 #678477] INFO -- : LDSHARED = gcc -shared I, [2024-05-15T00:10:33.178189 #678477] INFO -- : CFLAGS = -O3 -fno-fast-math -ggdb3 -Wall -Wextra -Wdeprecated-declarations -Wdiv-by-zero -Wduplicated-cond -Wimplicit-function-declaration -Wimplicit-int -Wpointer-arith -Wwrite-strings -Wold-style-definition -Wimplicit-fallthrough=0 -Wmissing-noreturn -Wno-cast-function-type -Wno-constant-logical-operand -Wno-long-long -Wno-missing-field-initializers -Wno-overlength-strings -Wno-packed-bitfield-compat -Wno-parentheses-equality -Wno-self-assign -Wno-tautological-compare -Wno-unused-parameter -Wno-unused-value -Wsuggest-attribute=format -Wsuggest-attribute=noreturn -Wunused-variable -Wmisleading-indentation -Wundef -fPIC I, [2024-05-15T00:10:33.178415 #678477] INFO -- : XCFLAGS = -U_FORTIFY_SOURCE -D_FORTIFY_SOURCE=2 -fstack-protector-strong -fno-strict-overflow -fvisibility=hidden -fexcess-precision=standard -DRUBY_EXPORT -I. -I.ext/include/riscv64-linux -I/tmp/ruby/src/trunk/include -I/tmp/ruby/src/trunk -I/tmp/ruby/src/trunk/prism -I/tmp/ruby/src/trunk/enc/unicode/15.0.0 I, [2024-05-15T00:10:33.178637 #678477] INFO -- : CPPFLAGS = I, [2024-05-15T00:10:33.178854 #678477] INFO -- : DLDFLAGS = -Wl,--compress-debug-sections=zlib -Wl,-soname,libruby.so.3.4 -fstack-protector-strong I, [2024-05-15T00:10:33.179053 #678477] INFO -- : SOLIBS = -lz -lrt -lrt -lgmp -ldl -lcrypt -lm -lpthread I, [2024-05-15T00:10:33.179252 #678477] INFO -- : LANG = I, [2024-05-15T00:10:33.179432 #678477] INFO -- : LC_ALL = I, [2024-05-15T00:10:33.179631 #678477] INFO -- : LC_CTYPE = I, [2024-05-15T00:10:33.179827 #678477] INFO -- : MFLAGS = -j4 --jobserver-auth=4,5 I, [2024-05-15T00:10:33.180244 #678477] INFO -- : RUSTC = rustc I, [2024-05-15T00:10:33.180540 #678477] INFO -- : YJIT_RUSTC_ARGS = --crate-name=yjit --crate-type=staticlib --edition=2021 -g -C lto=thin -C opt-level=3 -C overflow-checks=on '--out-dir=/tmp/ruby/build/trunk/yjit/target/release/' /tmp/ruby/src/trunk/yjit/src/lib.rs I, [2024-05-15T00:10:33.197141 #678477] INFO -- : gcc (Debian 13.2.0-4revyos1) 13.2.0 I, [2024-05-15T00:10:33.197332 #678477] INFO -- : Copyright (C) 2023 Free Software Foundation, Inc. I, [2024-05-15T00:10:33.197425 #678477] INFO -- : This is free software; see the source for copying conditions. There is NO I, [2024-05-15T00:10:33.197513 #678477] INFO -- : warranty; not even for MERCHANTABILITY or FITNESS FOR A PARTICULAR PURPOSE. I, [2024-05-15T00:10:33.197605 #678477] INFO -- : I, [2024-05-15T00:10:33.842195 #678477] INFO -- : builtin_binary.inc updated I, [2024-05-15T00:10:33.856288 #678477] INFO -- : 63c4b2d66003409833406b3a662615f9f67397fdf425c22dee41f60d762f36d6 builtin_binary.inc I, [2024-05-15T00:10:33.863023 #678477] INFO -- : compiling /tmp/ruby/src/trunk/builtin.c I, [2024-05-15T00:10:35.477475 #678477] INFO -- : linking static-library libruby-static.a I, [2024-05-15T00:10:42.412257 #678477] INFO -- : linking shared-library libruby.so.3.4.0 I, [2024-05-15T00:11:24.613634 #678477] INFO -- : linking ruby I, [2024-05-15T00:11:24.817663 #678477] INFO -- : $$$[end] "make ruby -j4" exit with 0. I, [2024-05-15T00:11:24.818275 #678477] INFO -- : $$$[beg] make all -j4 I, [2024-05-15T00:11:25.326954 #678477] INFO -- : BASERUBY = /usr/bin/ruby --disable=gems I, [2024-05-15T00:11:25.327204 #678477] INFO -- : CC = gcc I, [2024-05-15T00:11:25.327335 #678477] INFO -- : LD = ld I, [2024-05-15T00:11:25.327457 #678477] INFO -- : LDSHARED = gcc -shared I, [2024-05-15T00:11:25.327606 #678477] INFO -- : CFLAGS = -O3 -fno-fast-math -ggdb3 -Wall -Wextra -Wdeprecated-declarations -Wdiv-by-zero -Wduplicated-cond -Wimplicit-function-declaration -Wimplicit-int -Wpointer-arith -Wwrite-strings -Wold-style-definition -Wimplicit-fallthrough=0 -Wmissing-noreturn -Wno-cast-function-type -Wno-constant-logical-operand -Wno-long-long -Wno-missing-field-initializers -Wno-overlength-strings -Wno-packed-bitfield-compat -Wno-parentheses-equality -Wno-self-assign -Wno-tautological-compare -Wno-unused-parameter -Wno-unused-value -Wsuggest-attribute=format -Wsuggest-attribute=noreturn -Wunused-variable -Wmisleading-indentation -Wundef -fPIC I, [2024-05-15T00:11:25.327824 #678477] INFO -- : XCFLAGS = -U_FORTIFY_SOURCE -D_FORTIFY_SOURCE=2 -fstack-protector-strong -fno-strict-overflow -fvisibility=hidden -fexcess-precision=standard -DRUBY_EXPORT -I. -I.ext/include/riscv64-linux -I/tmp/ruby/src/trunk/include -I/tmp/ruby/src/trunk -I/tmp/ruby/src/trunk/prism -I/tmp/ruby/src/trunk/enc/unicode/15.0.0 I, [2024-05-15T00:11:25.328061 #678477] INFO -- : CPPFLAGS = I, [2024-05-15T00:11:25.328208 #678477] INFO -- : DLDFLAGS = -Wl,--compress-debug-sections=zlib -Wl,-soname,libruby.so.3.4 -fstack-protector-strong I, [2024-05-15T00:11:25.328322 #678477] INFO -- : SOLIBS = -lz -lrt -lrt -lgmp -ldl -lcrypt -lm -lpthread I, [2024-05-15T00:11:25.328425 #678477] INFO -- : LANG = I, [2024-05-15T00:11:25.328530 #678477] INFO -- : LC_ALL = I, [2024-05-15T00:11:25.328636 #678477] INFO -- : LC_CTYPE = I, [2024-05-15T00:11:25.328745 #678477] INFO -- : MFLAGS = -j4 --jobserver-auth=4,5 I, [2024-05-15T00:11:25.328855 #678477] INFO -- : RUSTC = rustc I, [2024-05-15T00:11:25.328980 #678477] INFO -- : YJIT_RUSTC_ARGS = --crate-name=yjit --crate-type=staticlib --edition=2021 -g -C lto=thin -C opt-level=3 -C overflow-checks=on '--out-dir=/tmp/ruby/build/trunk/yjit/target/release/' /tmp/ruby/src/trunk/yjit/src/lib.rs I, [2024-05-15T00:11:25.340766 #678477] INFO -- : gcc (Debian 13.2.0-4revyos1) 13.2.0 I, [2024-05-15T00:11:25.340956 #678477] INFO -- : Copyright (C) 2023 Free Software Foundation, Inc. I, [2024-05-15T00:11:25.341045 #678477] INFO -- : This is free software; see the source for copying conditions. There is NO I, [2024-05-15T00:11:25.341135 #678477] INFO -- : warranty; not even for MERCHANTABILITY or FITNESS FOR A PARTICULAR PURPOSE. I, [2024-05-15T00:11:25.341232 #678477] INFO -- : I, [2024-05-15T00:11:25.650656 #678477] INFO -- : generating enc.mk I, [2024-05-15T00:11:25.667792 #678477] INFO -- : building spec/ruby/optional/capi/ext/array_spec.so I, [2024-05-15T00:11:25.669681 #678477] INFO -- : building spec/ruby/optional/capi/ext/basic_object_spec.so I, [2024-05-15T00:11:25.673301 #678477] INFO -- : building spec/ruby/optional/capi/ext/bignum_spec.so I, [2024-05-15T00:11:26.618509 #678477] INFO -- : building spec/ruby/optional/capi/ext/binding_spec.so I, [2024-05-15T00:11:26.910926 #678477] INFO -- : building spec/ruby/optional/capi/ext/boolean_spec.so I, [2024-05-15T00:11:27.367609 #678477] INFO -- : building spec/ruby/optional/capi/ext/class_id_under_autoload_spec.so I, [2024-05-15T00:11:27.655088 #678477] INFO -- : building spec/ruby/optional/capi/ext/class_spec.so I, [2024-05-15T00:11:27.950306 #678477] INFO -- : building spec/ruby/optional/capi/ext/class_under_autoload_spec.so I, [2024-05-15T00:11:28.211844 #678477] INFO -- : building spec/ruby/optional/capi/ext/complex_spec.so I, [2024-05-15T00:11:28.402608 #678477] INFO -- : building spec/ruby/optional/capi/ext/constants_spec.so I, [2024-05-15T00:11:28.950451 #678477] INFO -- : building spec/ruby/optional/capi/ext/data_spec.so I, [2024-05-15T00:11:29.334939 #678477] INFO -- : building spec/ruby/optional/capi/ext/debug_spec.so I, [2024-05-15T00:11:29.398820 #678477] INFO -- : building spec/ruby/optional/capi/ext/encoding_spec.so I, [2024-05-15T00:11:30.295969 #678477] INFO -- : building spec/ruby/optional/capi/ext/enumerator_spec.so I, [2024-05-15T00:11:30.360091 #678477] INFO -- : building spec/ruby/optional/capi/ext/exception_spec.so I, [2024-05-15T00:11:30.697749 #678477] INFO -- : building spec/ruby/optional/capi/ext/fiber_spec.so I, [2024-05-15T00:11:31.589183 #678477] INFO -- : building spec/ruby/optional/capi/ext/file_spec.so I, [2024-05-15T00:11:31.829513 #678477] INFO -- : building spec/ruby/optional/capi/ext/fixnum_spec.so I, [2024-05-15T00:11:32.009004 #678477] INFO -- : building spec/ruby/optional/capi/ext/float_spec.so I, [2024-05-15T00:11:32.154589 #678477] INFO -- : building spec/ruby/optional/capi/ext/gc_spec.so I, [2024-05-15T00:11:32.670577 #678477] INFO -- : building spec/ruby/optional/capi/ext/globals_spec.so I, [2024-05-15T00:11:32.876475 #678477] INFO -- : building spec/ruby/optional/capi/ext/hash_spec.so I, [2024-05-15T00:11:33.114119 #678477] INFO -- : building spec/ruby/optional/capi/ext/integer_spec.so I, [2024-05-15T00:11:33.460773 #678477] INFO -- : building spec/ruby/optional/capi/ext/io_spec.so I, [2024-05-15T00:11:34.077392 #678477] INFO -- : building spec/ruby/optional/capi/ext/kernel_spec.so I, [2024-05-15T00:11:34.291339 #678477] INFO -- : building spec/ruby/optional/capi/ext/language_spec.so I, [2024-05-15T00:11:34.360766 #678477] INFO -- : building spec/ruby/optional/capi/ext/marshal_spec.so I, [2024-05-15T00:11:35.402388 #678477] INFO -- : building spec/ruby/optional/capi/ext/module_spec.so I, [2024-05-15T00:11:35.467118 #678477] INFO -- : building spec/ruby/optional/capi/ext/module_under_autoload_spec.so I, [2024-05-15T00:11:35.688956 #678477] INFO -- : building spec/ruby/optional/capi/ext/mutex_spec.so I, [2024-05-15T00:11:36.492488 #678477] INFO -- : building spec/ruby/optional/capi/ext/numeric_spec.so I, [2024-05-15T00:11:36.702606 #678477] INFO -- : building spec/ruby/optional/capi/ext/object_spec.so I, [2024-05-15T00:11:36.872972 #678477] INFO -- : building spec/ruby/optional/capi/ext/proc_spec.so I, [2024-05-15T00:11:37.059510 #678477] INFO -- : building spec/ruby/optional/capi/ext/range_spec.so I, [2024-05-15T00:11:38.071678 #678477] INFO -- : building spec/ruby/optional/capi/ext/rational_spec.so I, [2024-05-15T00:11:38.193453 #678477] INFO -- : building spec/ruby/optional/capi/ext/rbasic_spec.so I, [2024-05-15T00:11:38.469406 #678477] INFO -- : building spec/ruby/optional/capi/ext/regexp_spec.so I, [2024-05-15T00:11:39.186621 #678477] INFO -- : building spec/ruby/optional/capi/ext/st_spec.so I, [2024-05-15T00:11:39.430289 #678477] INFO -- : building spec/ruby/optional/capi/ext/string_spec.so I, [2024-05-15T00:11:39.554804 #678477] INFO -- : building spec/ruby/optional/capi/ext/struct_spec.so I, [2024-05-15T00:11:39.811466 #678477] INFO -- : building spec/ruby/optional/capi/ext/symbol_spec.so I, [2024-05-15T00:11:40.362570 #678477] INFO -- : building spec/ruby/optional/capi/ext/thread_spec.so I, [2024-05-15T00:11:40.698832 #678477] INFO -- : building spec/ruby/optional/capi/ext/time_spec.so I, [2024-05-15T00:11:41.510469 #678477] INFO -- : building spec/ruby/optional/capi/ext/tracepoint_spec.so I, [2024-05-15T00:11:41.854758 #678477] INFO -- : building spec/ruby/optional/capi/ext/typed_data_spec.so I, [2024-05-15T00:11:42.089203 #678477] INFO -- : building spec/ruby/optional/capi/ext/util_spec.so I, [2024-05-15T00:11:42.616533 #678477] INFO -- : making enc I, [2024-05-15T00:11:42.839503 #678477] INFO -- : make[1]: Entering directory '/tmp/ruby/build/trunk' I, [2024-05-15T00:11:42.839766 #678477] INFO -- : make[1]: Nothing to be done for 'enc'. I, [2024-05-15T00:11:42.840008 #678477] INFO -- : make[1]: Leaving directory '/tmp/ruby/build/trunk' I, [2024-05-15T00:11:42.843372 #678477] INFO -- : making srcs under enc I, [2024-05-15T00:11:43.169228 #678477] INFO -- : make[1]: Entering directory '/tmp/ruby/build/trunk' I, [2024-05-15T00:11:43.169464 #678477] INFO -- : make[1]: Nothing to be done for 'srcs'. I, [2024-05-15T00:11:43.169605 #678477] INFO -- : make[1]: Leaving directory '/tmp/ruby/build/trunk' I, [2024-05-15T00:11:43.173170 #678477] INFO -- : generating transdb.h I, [2024-05-15T00:11:44.476562 #678477] INFO -- : transdb.h unchanged I, [2024-05-15T00:11:44.482428 #678477] INFO -- : generating makefiles ext/configure-ext.mk I, [2024-05-15T00:11:44.483463 #678477] INFO -- : making trans I, [2024-05-15T00:11:44.673234 #678477] INFO -- : ext/configure-ext.mk updated I, [2024-05-15T00:11:44.685036 #678477] INFO -- : make[1]: Entering directory '/tmp/ruby/build/trunk' I, [2024-05-15T00:11:44.833873 #678477] INFO -- : make[1]: Entering directory '/tmp/ruby/build/trunk' I, [2024-05-15T00:11:44.834096 #678477] INFO -- : make[1]: Nothing to be done for 'trans'. I, [2024-05-15T00:11:44.834220 #678477] INFO -- : make[1]: Leaving directory '/tmp/ruby/build/trunk' I, [2024-05-15T00:11:45.504641 #678477] INFO -- : making encs I, [2024-05-15T00:11:45.935449 #678477] INFO -- : make[1]: Entering directory '/tmp/ruby/build/trunk' I, [2024-05-15T00:11:45.935803 #678477] INFO -- : make[1]: Nothing to be done for 'encs'. I, [2024-05-15T00:11:45.936291 #678477] INFO -- : make[1]: Leaving directory '/tmp/ruby/build/trunk' I, [2024-05-15T00:11:48.252482 #678477] INFO -- : make[1]: Leaving directory '/tmp/ruby/build/trunk' I, [2024-05-15T00:11:48.254740 #678477] INFO -- : generating makefile exts.mk I, [2024-05-15T00:11:48.578666 #678477] INFO -- : exts.mk unchanged I, [2024-05-15T00:11:48.615328 #678477] INFO -- : make[1]: Entering directory '/tmp/ruby/build/trunk' I, [2024-05-15T00:11:49.129127 #678477] INFO -- : make[2]: Entering directory '/tmp/ruby/build/trunk/ext/digest' I, [2024-05-15T00:11:49.129754 #678477] INFO -- : make[2]: Entering directory '/tmp/ruby/build/trunk/ext/coverage' I, [2024-05-15T00:11:49.142759 #678477] INFO -- : make[2]: Entering directory '/tmp/ruby/build/trunk/ext/date' I, [2024-05-15T00:11:49.151246 #678477] INFO -- : make[2]: Leaving directory '/tmp/ruby/build/trunk/ext/coverage' I, [2024-05-15T00:11:49.167723 #678477] INFO -- : make[2]: Leaving directory '/tmp/ruby/build/trunk/ext/digest' I, [2024-05-15T00:11:49.174987 #678477] INFO -- : make[2]: Leaving directory '/tmp/ruby/build/trunk/ext/date' I, [2024-05-15T00:11:49.195272 #678477] INFO -- : make[2]: Entering directory '/tmp/ruby/build/trunk/ext/io/console' I, [2024-05-15T00:11:49.214615 #678477] INFO -- : make[2]: Leaving directory '/tmp/ruby/build/trunk/ext/io/console' I, [2024-05-15T00:11:49.216802 #678477] INFO -- : make[2]: Entering directory '/tmp/ruby/build/trunk/ext/json' I, [2024-05-15T00:11:49.218017 #678477] INFO -- : make[2]: Entering directory '/tmp/ruby/build/trunk/ext/fiddle' I, [2024-05-15T00:11:49.232696 #678477] INFO -- : make[2]: Entering directory '/tmp/ruby/build/trunk/ext/monitor' I, [2024-05-15T00:11:49.250916 #678477] INFO -- : make[2]: Leaving directory '/tmp/ruby/build/trunk/ext/monitor' I, [2024-05-15T00:11:49.263005 #678477] INFO -- : make[2]: Entering directory '/tmp/ruby/build/trunk/ext/objspace' I, [2024-05-15T00:11:49.271368 #678477] INFO -- : make[2]: Leaving directory '/tmp/ruby/build/trunk/ext/json' I, [2024-05-15T00:11:49.284597 #678477] INFO -- : make[2]: Leaving directory '/tmp/ruby/build/trunk/ext/fiddle' I, [2024-05-15T00:11:49.293323 #678477] INFO -- : make[2]: Leaving directory '/tmp/ruby/build/trunk/ext/objspace' I, [2024-05-15T00:11:49.297716 #678477] INFO -- : make[2]: Entering directory '/tmp/ruby/build/trunk/ext/pathname' I, [2024-05-15T00:11:49.315933 #678477] INFO -- : make[2]: Leaving directory '/tmp/ruby/build/trunk/ext/pathname' I, [2024-05-15T00:11:49.321888 #678477] INFO -- : make[2]: Entering directory '/tmp/ruby/build/trunk/ext/pty' I, [2024-05-15T00:11:49.323963 #678477] INFO -- : make[2]: Entering directory '/tmp/ruby/build/trunk/ext/psych' I, [2024-05-15T00:11:49.340530 #678477] INFO -- : make[2]: Leaving directory '/tmp/ruby/build/trunk/ext/pty' I, [2024-05-15T00:11:49.376181 #678477] INFO -- : make[2]: Entering directory '/tmp/ruby/build/trunk/ext/openssl' I, [2024-05-15T00:11:49.395980 #678477] INFO -- : make[2]: Entering directory '/tmp/ruby/build/trunk/ext/ripper' I, [2024-05-15T00:11:49.407423 #678477] INFO -- : make[2]: Entering directory '/tmp/ruby/build/trunk/ext/rubyvm' I, [2024-05-15T00:11:49.433089 #678477] INFO -- : make[2]: Leaving directory '/tmp/ruby/build/trunk/ext/rubyvm' I, [2024-05-15T00:11:49.438819 #678477] INFO -- : make[2]: Leaving directory '/tmp/ruby/build/trunk/ext/psych' I, [2024-05-15T00:11:49.441796 #678477] INFO -- : make[2]: Leaving directory '/tmp/ruby/build/trunk/ext/ripper' I, [2024-05-15T00:11:49.484507 #678477] INFO -- : make[2]: Entering directory '/tmp/ruby/build/trunk/.bundle/gems/bigdecimal-3.1.8/ext/bigdecimal' I, [2024-05-15T00:11:49.506889 #678477] INFO -- : make[2]: Entering directory '/tmp/ruby/build/trunk/ext/socket' I, [2024-05-15T00:11:49.510458 #678477] INFO -- : make[2]: Entering directory '/tmp/ruby/build/trunk/.bundle/gems/debug-1.9.2/ext/debug' I, [2024-05-15T00:11:49.517149 #678477] INFO -- : make[2]: Leaving directory '/tmp/ruby/build/trunk/ext/openssl' I, [2024-05-15T00:11:49.532062 #678477] INFO -- : make[2]: Entering directory '/tmp/ruby/build/trunk/.bundle/gems/nkf-0.2.0/ext/nkf' I, [2024-05-15T00:11:49.566720 #678477] INFO -- : make[2]: Leaving directory '/tmp/ruby/build/trunk/ext/socket' I, [2024-05-15T00:11:49.581671 #678477] INFO -- : make[2]: Entering directory '/tmp/ruby/build/trunk/.bundle/gems/racc-1.7.3/ext/racc/cparse' I, [2024-05-15T00:11:49.646131 #678477] INFO -- : make[2]: Leaving directory '/tmp/ruby/build/trunk/.bundle/gems/bigdecimal-3.1.8/ext/bigdecimal' I, [2024-05-15T00:11:49.665081 #678477] INFO -- : make[2]: Entering directory '/tmp/ruby/build/trunk/.bundle/gems/rbs-3.4.4/ext/rbs_extension' I, [2024-05-15T00:11:49.677120 #678477] INFO -- : make[2]: Leaving directory '/tmp/ruby/build/trunk/.bundle/gems/debug-1.9.2/ext/debug' I, [2024-05-15T00:11:49.697457 #678477] INFO -- : make[2]: Leaving directory '/tmp/ruby/build/trunk/.bundle/gems/nkf-0.2.0/ext/nkf' I, [2024-05-15T00:11:49.699235 #678477] INFO -- : make[2]: Entering directory '/tmp/ruby/build/trunk/.bundle/gems/syslog-0.1.2/ext/syslog' I, [2024-05-15T00:11:49.747780 #678477] INFO -- : make[2]: Leaving directory '/tmp/ruby/build/trunk/.bundle/gems/racc-1.7.3/ext/racc/cparse' I, [2024-05-15T00:11:49.809481 #678477] INFO -- : make[2]: Entering directory '/tmp/ruby/build/trunk/ext/digest/sha2' I, [2024-05-15T00:11:49.827422 #678477] INFO -- : make[2]: Leaving directory '/tmp/ruby/build/trunk/.bundle/gems/rbs-3.4.4/ext/rbs_extension' I, [2024-05-15T00:11:49.834040 #678477] INFO -- : make[2]: Leaving directory '/tmp/ruby/build/trunk/ext/digest/sha2' I, [2024-05-15T00:11:49.860054 #678477] INFO -- : make[2]: Leaving directory '/tmp/ruby/build/trunk/.bundle/gems/syslog-0.1.2/ext/syslog' I, [2024-05-15T00:11:50.080899 #678477] INFO -- : make[2]: Entering directory '/tmp/ruby/build/trunk' I, [2024-05-15T00:11:50.736540 #678477] INFO -- : linking ruby I, [2024-05-15T00:11:50.930883 #678477] INFO -- : make[2]: Leaving directory '/tmp/ruby/build/trunk' I, [2024-05-15T00:11:50.933208 #678477] INFO -- : make[1]: Leaving directory '/tmp/ruby/build/trunk' I, [2024-05-15T00:11:50.967193 #678477] INFO -- : make[1]: Entering directory '/tmp/ruby/build/trunk' I, [2024-05-15T00:11:50.967391 #678477] INFO -- : make[1]: Nothing to be done for 'note'. I, [2024-05-15T00:11:50.967497 #678477] INFO -- : make[1]: Leaving directory '/tmp/ruby/build/trunk' I, [2024-05-15T00:11:50.970454 #678477] INFO -- : $$$[end] "make all -j4" exit with 0. I, [2024-05-15T00:11:50.971174 #678477] INFO -- : $$$[beg] make install -j4 I, [2024-05-15T00:11:51.555158 #678477] INFO -- : Update minitest to ea9caafc0754b1d6236a490d59e624b53209734a I, [2024-05-15T00:11:51.555877 #678477] INFO -- : Update power_assert to 84e85124c5014a139af39161d484156cfe87a9ed I, [2024-05-15T00:11:51.557090 #678477] INFO -- : Update rbs to ba7872795d5de04adb8ff500c0e6afdc81a041dd I, [2024-05-15T00:11:51.563982 #678477] INFO -- : Update typeprof to b19a6416da3a05d57fadd6ffdadb382b6d236ca5 I, [2024-05-15T00:11:51.568198 #678477] INFO -- : echo ea9caafc0754b1d6236a490d59e624b53209734a | /bin/sh /tmp/ruby/src/trunk/tool/ifchange /tmp/ruby/src/trunk/.bundle/.timestamp/minitest.revision - I, [2024-05-15T00:11:51.568754 #678477] INFO -- : echo 84e85124c5014a139af39161d484156cfe87a9ed | /bin/sh /tmp/ruby/src/trunk/tool/ifchange /tmp/ruby/src/trunk/.bundle/.timestamp/power_assert.revision - I, [2024-05-15T00:11:51.569333 #678477] INFO -- : echo ba7872795d5de04adb8ff500c0e6afdc81a041dd | /bin/sh /tmp/ruby/src/trunk/tool/ifchange /tmp/ruby/src/trunk/.bundle/.timestamp/rbs.revision - I, [2024-05-15T00:11:51.576834 #678477] INFO -- : echo b19a6416da3a05d57fadd6ffdadb382b6d236ca5 | /bin/sh /tmp/ruby/src/trunk/tool/ifchange /tmp/ruby/src/trunk/.bundle/.timestamp/typeprof.revision - I, [2024-05-15T00:11:51.579338 #678477] INFO -- : /tmp/ruby/src/trunk/.bundle/.timestamp/minitest.revision unchanged I, [2024-05-15T00:11:51.580732 #678477] INFO -- : /tmp/ruby/src/trunk/.bundle/.timestamp/power_assert.revision unchanged I, [2024-05-15T00:11:51.583592 #678477] INFO -- : /tmp/ruby/src/trunk/.bundle/.timestamp/rbs.revision unchanged I, [2024-05-15T00:11:51.586176 #678477] INFO -- : BASERUBY = /usr/bin/ruby --disable=gems I, [2024-05-15T00:11:51.586416 #678477] INFO -- : CC = gcc I, [2024-05-15T00:11:51.586560 #678477] INFO -- : LD = ld I, [2024-05-15T00:11:51.586714 #678477] INFO -- : LDSHARED = gcc -shared I, [2024-05-15T00:11:51.586865 #678477] INFO -- : CFLAGS = -O3 -fno-fast-math -ggdb3 -Wall -Wextra -Wdeprecated-declarations -Wdiv-by-zero -Wduplicated-cond -Wimplicit-function-declaration -Wimplicit-int -Wpointer-arith -Wwrite-strings -Wold-style-definition -Wimplicit-fallthrough=0 -Wmissing-noreturn -Wno-cast-function-type -Wno-constant-logical-operand -Wno-long-long -Wno-missing-field-initializers -Wno-overlength-strings -Wno-packed-bitfield-compat -Wno-parentheses-equality -Wno-self-assign -Wno-tautological-compare -Wno-unused-parameter -Wno-unused-value -Wsuggest-attribute=format -Wsuggest-attribute=noreturn -Wunused-variable -Wmisleading-indentation -Wundef -fPIC I, [2024-05-15T00:11:51.587040 #678477] INFO -- : XCFLAGS = -U_FORTIFY_SOURCE -D_FORTIFY_SOURCE=2 -fstack-protector-strong -fno-strict-overflow -fvisibility=hidden -fexcess-precision=standard -DRUBY_EXPORT -I. -I.ext/include/riscv64-linux -I/tmp/ruby/src/trunk/include -I/tmp/ruby/src/trunk -I/tmp/ruby/src/trunk/prism -I/tmp/ruby/src/trunk/enc/unicode/15.0.0 I, [2024-05-15T00:11:51.587211 #678477] INFO -- : CPPFLAGS = I, [2024-05-15T00:11:51.587360 #678477] INFO -- : DLDFLAGS = -Wl,--compress-debug-sections=zlib -Wl,-soname,libruby.so.3.4 -fstack-protector-strong I, [2024-05-15T00:11:51.587502 #678477] INFO -- : SOLIBS = -lz -lrt -lrt -lgmp -ldl -lcrypt -lm -lpthread I, [2024-05-15T00:11:51.587633 #678477] INFO -- : LANG = I, [2024-05-15T00:11:51.587781 #678477] INFO -- : LC_ALL = I, [2024-05-15T00:11:51.587940 #678477] INFO -- : LC_CTYPE = I, [2024-05-15T00:11:51.588126 #678477] INFO -- : MFLAGS = -j4 --jobserver-auth=4,5 I, [2024-05-15T00:11:51.588262 #678477] INFO -- : RUSTC = rustc I, [2024-05-15T00:11:51.588397 #678477] INFO -- : YJIT_RUSTC_ARGS = --crate-name=yjit --crate-type=staticlib --edition=2021 -g -C lto=thin -C opt-level=3 -C overflow-checks=on '--out-dir=/tmp/ruby/build/trunk/yjit/target/release/' /tmp/ruby/src/trunk/yjit/src/lib.rs I, [2024-05-15T00:11:51.591374 #678477] INFO -- : /tmp/ruby/src/trunk/.bundle/.timestamp/typeprof.revision unchanged I, [2024-05-15T00:11:51.891837 #678477] INFO -- : generating enc.mk I, [2024-05-15T00:11:51.892922 #678477] INFO -- : gcc (Debian 13.2.0-4revyos1) 13.2.0 I, [2024-05-15T00:11:51.893102 #678477] INFO -- : Copyright (C) 2023 Free Software Foundation, Inc. I, [2024-05-15T00:11:51.893211 #678477] INFO -- : This is free software; see the source for copying conditions. There is NO I, [2024-05-15T00:11:51.893323 #678477] INFO -- : warranty; not even for MERCHANTABILITY or FITNESS FOR A PARTICULAR PURPOSE. I, [2024-05-15T00:11:51.893436 #678477] INFO -- : I, [2024-05-15T00:11:53.433188 #678477] INFO -- : making srcs under enc I, [2024-05-15T00:11:53.756549 #678477] INFO -- : make[1]: Entering directory '/tmp/ruby/build/trunk' I, [2024-05-15T00:11:53.756800 #678477] INFO -- : make[1]: Nothing to be done for 'srcs'. I, [2024-05-15T00:11:53.757010 #678477] INFO -- : make[1]: Leaving directory '/tmp/ruby/build/trunk' I, [2024-05-15T00:11:53.759672 #678477] INFO -- : making enc I, [2024-05-15T00:11:53.934500 #678477] INFO -- : make[1]: Entering directory '/tmp/ruby/build/trunk' I, [2024-05-15T00:11:53.934725 #678477] INFO -- : make[1]: Nothing to be done for 'enc'. I, [2024-05-15T00:11:53.934836 #678477] INFO -- : make[1]: Leaving directory '/tmp/ruby/build/trunk' I, [2024-05-15T00:11:53.937757 #678477] INFO -- : generating transdb.h I, [2024-05-15T00:11:54.269343 #678477] INFO -- : Building power_assert@84e85124c5014a139af39161d484156cfe87a9ed to /tmp/ruby/src/trunk/gems/power_assert-2.0.3.gem I, [2024-05-15T00:11:55.182146 #678477] INFO -- : transdb.h unchanged I, [2024-05-15T00:11:55.188427 #678477] INFO -- : generating makefiles ext/configure-ext.mk I, [2024-05-15T00:11:55.189172 #678477] INFO -- : making trans I, [2024-05-15T00:11:55.250914 #678477] INFO -- : Successfully built RubyGem I, [2024-05-15T00:11:55.251124 #678477] INFO -- : Name: power_assert I, [2024-05-15T00:11:55.251220 #678477] INFO -- : Version: 2.0.4dev I, [2024-05-15T00:11:55.251310 #678477] INFO -- : File: power_assert-2.0.4dev.gem I, [2024-05-15T00:11:55.266509 #678477] INFO -- : Extracting bundle gem power_assert-2.0.3... I, [2024-05-15T00:11:55.384428 #678477] INFO -- : ext/configure-ext.mk unchanged I, [2024-05-15T00:11:55.396886 #678477] INFO -- : make[1]: Entering directory '/tmp/ruby/build/trunk' I, [2024-05-15T00:11:55.546489 #678477] INFO -- : make[1]: Entering directory '/tmp/ruby/build/trunk' I, [2024-05-15T00:11:55.546758 #678477] INFO -- : make[1]: Nothing to be done for 'trans'. I, [2024-05-15T00:11:55.546910 #678477] INFO -- : make[1]: Leaving directory '/tmp/ruby/build/trunk' I, [2024-05-15T00:11:56.306929 #678477] INFO -- : Try with hash version of bundled gems instead of gems/power_assert-2.0.3.gem. We don't use this gem with release version of Ruby. I, [2024-05-15T00:11:56.377196 #678477] INFO -- : Unpacked gems/power_assert-2.0.4dev.gem I, [2024-05-15T00:11:56.394102 #678477] INFO -- : making encs I, [2024-05-15T00:11:56.824574 #678477] INFO -- : make[1]: Entering directory '/tmp/ruby/build/trunk' I, [2024-05-15T00:11:56.824794 #678477] INFO -- : make[1]: Nothing to be done for 'encs'. I, [2024-05-15T00:11:56.824916 #678477] INFO -- : make[1]: Leaving directory '/tmp/ruby/build/trunk' I, [2024-05-15T00:11:59.152057 #678477] INFO -- : make[1]: Leaving directory '/tmp/ruby/build/trunk' I, [2024-05-15T00:11:59.153992 #678477] INFO -- : generating makefile exts.mk I, [2024-05-15T00:11:59.481054 #678477] INFO -- : exts.mk unchanged I, [2024-05-15T00:11:59.517837 #678477] INFO -- : make[1]: Entering directory '/tmp/ruby/build/trunk' I, [2024-05-15T00:12:00.027432 #678477] INFO -- : make[2]: Entering directory '/tmp/ruby/build/trunk/ext/coverage' I, [2024-05-15T00:12:00.033444 #678477] INFO -- : make[2]: Entering directory '/tmp/ruby/build/trunk/ext/digest' I, [2024-05-15T00:12:00.046659 #678477] INFO -- : make[2]: Entering directory '/tmp/ruby/build/trunk/ext/date' I, [2024-05-15T00:12:00.049579 #678477] INFO -- : make[2]: Leaving directory '/tmp/ruby/build/trunk/ext/coverage' I, [2024-05-15T00:12:00.070483 #678477] INFO -- : make[2]: Leaving directory '/tmp/ruby/build/trunk/ext/date' I, [2024-05-15T00:12:00.075492 #678477] INFO -- : make[2]: Leaving directory '/tmp/ruby/build/trunk/ext/digest' I, [2024-05-15T00:12:00.101674 #678477] INFO -- : make[2]: Entering directory '/tmp/ruby/build/trunk/ext/io/console' I, [2024-05-15T00:12:00.113862 #678477] INFO -- : make[2]: Entering directory '/tmp/ruby/build/trunk/ext/fiddle' I, [2024-05-15T00:12:00.118168 #678477] INFO -- : make[2]: Entering directory '/tmp/ruby/build/trunk/ext/json' I, [2024-05-15T00:12:00.119679 #678477] INFO -- : make[2]: Leaving directory '/tmp/ruby/build/trunk/ext/io/console' I, [2024-05-15T00:12:00.133370 #678477] INFO -- : make[2]: Entering directory '/tmp/ruby/build/trunk/ext/monitor' I, [2024-05-15T00:12:00.152421 #678477] INFO -- : make[2]: Leaving directory '/tmp/ruby/build/trunk/ext/monitor' I, [2024-05-15T00:12:00.161400 #678477] INFO -- : make[2]: Leaving directory '/tmp/ruby/build/trunk/ext/fiddle' I, [2024-05-15T00:12:00.166814 #678477] INFO -- : make[2]: Leaving directory '/tmp/ruby/build/trunk/ext/json' I, [2024-05-15T00:12:00.187674 #678477] INFO -- : make[2]: Entering directory '/tmp/ruby/build/trunk/ext/objspace' I, [2024-05-15T00:12:00.187991 #678477] INFO -- : make[2]: Entering directory '/tmp/ruby/build/trunk/ext/pathname' I, [2024-05-15T00:12:00.205853 #678477] INFO -- : make[2]: Entering directory '/tmp/ruby/build/trunk/ext/psych' I, [2024-05-15T00:12:00.207356 #678477] INFO -- : make[2]: Leaving directory '/tmp/ruby/build/trunk/ext/pathname' I, [2024-05-15T00:12:00.218708 #678477] INFO -- : make[2]: Leaving directory '/tmp/ruby/build/trunk/ext/objspace' I, [2024-05-15T00:12:00.248040 #678477] INFO -- : make[2]: Entering directory '/tmp/ruby/build/trunk/ext/pty' I, [2024-05-15T00:12:00.275552 #678477] INFO -- : make[2]: Entering directory '/tmp/ruby/build/trunk/ext/openssl' I, [2024-05-15T00:12:00.302666 #678477] INFO -- : make[2]: Leaving directory '/tmp/ruby/build/trunk/ext/pty' I, [2024-05-15T00:12:00.322672 #678477] INFO -- : make[2]: Leaving directory '/tmp/ruby/build/trunk/ext/psych' I, [2024-05-15T00:12:00.327030 #678477] INFO -- : make[2]: Entering directory '/tmp/ruby/build/trunk/ext/rubyvm' I, [2024-05-15T00:12:00.328005 #678477] INFO -- : make[2]: Entering directory '/tmp/ruby/build/trunk/ext/ripper' I, [2024-05-15T00:12:00.341485 #678477] INFO -- : make[2]: Leaving directory '/tmp/ruby/build/trunk/ext/rubyvm' I, [2024-05-15T00:12:00.373420 #678477] INFO -- : make[2]: Leaving directory '/tmp/ruby/build/trunk/ext/ripper' I, [2024-05-15T00:12:00.388062 #678477] INFO -- : make[2]: Leaving directory '/tmp/ruby/build/trunk/ext/openssl' I, [2024-05-15T00:12:00.400944 #678477] INFO -- : make[2]: Entering directory '/tmp/ruby/build/trunk/ext/socket' I, [2024-05-15T00:12:00.406202 #678477] INFO -- : make[2]: Entering directory '/tmp/ruby/build/trunk/.bundle/gems/bigdecimal-3.1.8/ext/bigdecimal' I, [2024-05-15T00:12:00.414102 #678477] INFO -- : make[2]: Entering directory '/tmp/ruby/build/trunk/.bundle/gems/debug-1.9.2/ext/debug' I, [2024-05-15T00:12:00.428716 #678477] INFO -- : make[2]: Entering directory '/tmp/ruby/build/trunk/.bundle/gems/nkf-0.2.0/ext/nkf' I, [2024-05-15T00:12:00.461034 #678477] INFO -- : make[2]: Leaving directory '/tmp/ruby/build/trunk/ext/socket' I, [2024-05-15T00:12:00.475311 #678477] INFO -- : make[2]: Entering directory '/tmp/ruby/build/trunk/.bundle/gems/racc-1.7.3/ext/racc/cparse' I, [2024-05-15T00:12:00.565610 #678477] INFO -- : make[2]: Leaving directory '/tmp/ruby/build/trunk/.bundle/gems/bigdecimal-3.1.8/ext/bigdecimal' I, [2024-05-15T00:12:00.573945 #678477] INFO -- : make[2]: Leaving directory '/tmp/ruby/build/trunk/.bundle/gems/debug-1.9.2/ext/debug' I, [2024-05-15T00:12:00.584829 #678477] INFO -- : make[2]: Entering directory '/tmp/ruby/build/trunk/.bundle/gems/rbs-3.4.4/ext/rbs_extension' I, [2024-05-15T00:12:00.588609 #678477] INFO -- : make[2]: Entering directory '/tmp/ruby/build/trunk/.bundle/gems/syslog-0.1.2/ext/syslog' I, [2024-05-15T00:12:00.597979 #678477] INFO -- : make[2]: Leaving directory '/tmp/ruby/build/trunk/.bundle/gems/nkf-0.2.0/ext/nkf' I, [2024-05-15T00:12:00.643408 #678477] INFO -- : make[2]: Leaving directory '/tmp/ruby/build/trunk/.bundle/gems/racc-1.7.3/ext/racc/cparse' I, [2024-05-15T00:12:00.712818 #678477] INFO -- : make[2]: Entering directory '/tmp/ruby/build/trunk/ext/digest/sha2' I, [2024-05-15T00:12:00.738251 #678477] INFO -- : make[2]: Leaving directory '/tmp/ruby/build/trunk/ext/digest/sha2' I, [2024-05-15T00:12:00.749174 #678477] INFO -- : make[2]: Leaving directory '/tmp/ruby/build/trunk/.bundle/gems/rbs-3.4.4/ext/rbs_extension' I, [2024-05-15T00:12:00.751723 #678477] INFO -- : make[2]: Leaving directory '/tmp/ruby/build/trunk/.bundle/gems/syslog-0.1.2/ext/syslog' I, [2024-05-15T00:12:00.985526 #678477] INFO -- : make[2]: Entering directory '/tmp/ruby/build/trunk' I, [2024-05-15T00:12:01.635886 #678477] INFO -- : make[2]: 'ruby' is up to date. I, [2024-05-15T00:12:01.636160 #678477] INFO -- : make[2]: Leaving directory '/tmp/ruby/build/trunk' I, [2024-05-15T00:12:01.637881 #678477] INFO -- : make[1]: Leaving directory '/tmp/ruby/build/trunk' I, [2024-05-15T00:12:01.672741 #678477] INFO -- : make[1]: Entering directory '/tmp/ruby/build/trunk' I, [2024-05-15T00:12:01.672940 #678477] INFO -- : make[1]: Nothing to be done for 'note'. I, [2024-05-15T00:12:01.673043 #678477] INFO -- : make[1]: Leaving directory '/tmp/ruby/build/trunk' I, [2024-05-15T00:12:01.674390 #678477] INFO -- : ./miniruby -I/tmp/ruby/src/trunk/lib -I. -I.ext/common /tmp/ruby/src/trunk/tool/runruby.rb --extout=.ext -- --disable-gems -r./riscv64-linux-fake /tmp/ruby/src/trunk/tool/rbinstall.rb --make="make" --dest-dir="" --extout=".ext" --ext-build-dir="./ext" --mflags="-j4 --jobserver-auth=4,5" --make-flags=" -j4 --jobserver-auth=4,5" --data-mode=0644 --prog-mode=0755 --installed-list .installed.list --mantype="doc" --gnumake --install=all --exclude=doc I, [2024-05-15T00:12:02.963051 #678477] INFO -- : Installing to I, [2024-05-15T00:12:02.965412 #678477] INFO -- : installing binary commands: /tmp/ruby/install/trunk/bin I, [2024-05-15T00:12:02.975320 #678477] INFO -- : installing base libraries: /tmp/ruby/install/trunk/lib I, [2024-05-15T00:12:03.048355 #678477] INFO -- : installing arch files: /tmp/ruby/install/trunk/lib/ruby/3.4.0+0/riscv64-linux I, [2024-05-15T00:12:03.049400 #678477] INFO -- : installing pkgconfig data: /tmp/ruby/install/trunk/lib/pkgconfig I, [2024-05-15T00:12:03.050194 #678477] INFO -- : installing extension objects: /tmp/ruby/install/trunk/lib/ruby/3.4.0+0/riscv64-linux I, [2024-05-15T00:12:03.171640 #678477] INFO -- : installing extension objects: /tmp/ruby/install/trunk/lib/ruby/site_ruby/3.4.0+0/riscv64-linux I, [2024-05-15T00:12:03.172090 #678477] INFO -- : installing extension objects: /tmp/ruby/install/trunk/lib/ruby/vendor_ruby/3.4.0+0/riscv64-linux I, [2024-05-15T00:12:03.172915 #678477] INFO -- : installing extension headers: /tmp/ruby/install/trunk/include/ruby-3.4.0+0/riscv64-linux I, [2024-05-15T00:12:03.175133 #678477] INFO -- : installing extension scripts: /tmp/ruby/install/trunk/lib/ruby/3.4.0+0 I, [2024-05-15T00:12:03.218807 #678477] INFO -- : installing extension scripts: /tmp/ruby/install/trunk/lib/ruby/site_ruby/3.4.0+0 I, [2024-05-15T00:12:03.219247 #678477] INFO -- : installing extension scripts: /tmp/ruby/install/trunk/lib/ruby/vendor_ruby/3.4.0+0 I, [2024-05-15T00:12:03.219581 #678477] INFO -- : installing extension headers: /tmp/ruby/install/trunk/include/ruby-3.4.0+0/ruby I, [2024-05-15T00:12:03.220757 #678477] INFO -- : installing command scripts: /tmp/ruby/install/trunk/bin I, [2024-05-15T00:12:03.221882 #678477] INFO -- : installing library scripts: /tmp/ruby/install/trunk/lib/ruby/3.4.0+0 I, [2024-05-15T00:12:03.733453 #678477] INFO -- : installing common headers: /tmp/ruby/install/trunk/include/ruby-3.4.0+0 I, [2024-05-15T00:12:03.821745 #678477] INFO -- : installing manpages: /tmp/ruby/install/trunk/share/man/man1 I, [2024-05-15T00:12:03.824367 #678477] INFO -- : installing default gems from lib: /tmp/ruby/install/trunk/lib/ruby/gems/3.4.0+0 I, [2024-05-15T00:12:04.145231 #678477] INFO -- : benchmark 0.3.0 I, [2024-05-15T00:12:04.249568 #678477] INFO -- : bundler 2.6.0.dev I, [2024-05-15T00:12:04.276745 #678477] INFO -- : cgi 0.4.1 I, [2024-05-15T00:12:04.284111 #678477] INFO -- : delegate 0.3.1 I, [2024-05-15T00:12:04.291175 #678477] INFO -- : did_you_mean 1.6.3 I, [2024-05-15T00:12:04.298358 #678477] INFO -- : english 0.8.0 I, [2024-05-15T00:12:04.305495 #678477] INFO -- : erb 4.0.4 I, [2024-05-15T00:12:04.316024 #678477] INFO -- : error_highlight 0.6.0 I, [2024-05-15T00:12:04.322945 #678477] INFO -- : fileutils 1.7.2 I, [2024-05-15T00:12:04.330028 #678477] INFO -- : find 0.2.0 I, [2024-05-15T00:12:04.337468 #678477] INFO -- : forwardable 1.3.3 I, [2024-05-15T00:12:04.344429 #678477] INFO -- : ipaddr 1.2.6 I, [2024-05-15T00:12:04.351381 #678477] INFO -- : irb 1.13.1 I, [2024-05-15T00:12:04.362886 #678477] INFO -- : logger 1.6.0 I, [2024-05-15T00:12:04.369917 #678477] INFO -- : net-http 0.4.1 I, [2024-05-15T00:12:04.377368 #678477] INFO -- : net-protocol 0.2.2 I, [2024-05-15T00:12:04.384952 #678477] INFO -- : open-uri 0.4.1 I, [2024-05-15T00:12:04.400754 #678477] INFO -- : open3 0.2.1 I, [2024-05-15T00:12:04.407943 #678477] INFO -- : optparse 0.5.0 I, [2024-05-15T00:12:04.415219 #678477] INFO -- : ostruct 0.6.0 I, [2024-05-15T00:12:04.422209 #678477] INFO -- : pp 0.5.0 I, [2024-05-15T00:12:04.429631 #678477] INFO -- : prettyprint 0.2.0 I, [2024-05-15T00:12:04.436930 #678477] INFO -- : prism 0.29.0 I, [2024-05-15T00:12:04.444492 #678477] INFO -- : pstore 0.1.3 I, [2024-05-15T00:12:04.451413 #678477] INFO -- : rdoc 6.6.3.1 I, [2024-05-15T00:12:04.466096 #678477] INFO -- : readline 0.0.4 I, [2024-05-15T00:12:04.473185 #678477] INFO -- : reline 0.5.7 I, [2024-05-15T00:12:04.480820 #678477] INFO -- : resolv 0.4.0 I, [2024-05-15T00:12:04.488039 #678477] INFO -- : ruby2_keywords 0.0.5 I, [2024-05-15T00:12:04.495279 #678477] INFO -- : securerandom 0.3.1 I, [2024-05-15T00:12:04.502571 #678477] INFO -- : set 1.1.0 I, [2024-05-15T00:12:04.509849 #678477] INFO -- : shellwords 0.2.0 I, [2024-05-15T00:12:04.517117 #678477] INFO -- : singleton 0.2.0 I, [2024-05-15T00:12:04.524029 #678477] INFO -- : syntax_suggest 2.0.0 I, [2024-05-15T00:12:04.542911 #678477] INFO -- : tempfile 0.2.1 I, [2024-05-15T00:12:04.550184 #678477] INFO -- : time 0.3.0 I, [2024-05-15T00:12:04.557620 #678477] INFO -- : timeout 0.4.1 I, [2024-05-15T00:12:04.564971 #678477] INFO -- : tmpdir 0.2.0 I, [2024-05-15T00:12:04.572432 #678477] INFO -- : tsort 0.2.0 I, [2024-05-15T00:12:04.579682 #678477] INFO -- : un 0.3.0 I, [2024-05-15T00:12:04.587046 #678477] INFO -- : uri 0.13.0 I, [2024-05-15T00:12:04.594628 #678477] INFO -- : weakref 0.1.3 I, [2024-05-15T00:12:04.601971 #678477] INFO -- : yaml 0.3.0 I, [2024-05-15T00:12:04.607748 #678477] INFO -- : installing default gems from ext: /tmp/ruby/install/trunk/lib/ruby/gems/3.4.0+0 I, [2024-05-15T00:12:04.687698 #678477] INFO -- : date 3.3.4 I, [2024-05-15T00:12:04.694981 #678477] INFO -- : digest 3.1.1 I, [2024-05-15T00:12:04.702744 #678477] INFO -- : etc 1.4.3 I, [2024-05-15T00:12:04.711679 #678477] INFO -- : fcntl 1.1.0 I, [2024-05-15T00:12:04.719523 #678477] INFO -- : fiddle 1.1.3 I, [2024-05-15T00:12:04.726472 #678477] INFO -- : io-console 0.7.2 I, [2024-05-15T00:12:04.733379 #678477] INFO -- : io-nonblock 0.3.0 I, [2024-05-15T00:12:04.740340 #678477] INFO -- : io-wait 0.3.1 I, [2024-05-15T00:12:04.748904 #678477] INFO -- : json 2.7.2 I, [2024-05-15T00:12:04.756604 #678477] INFO -- : openssl 3.2.0 I, [2024-05-15T00:12:04.763654 #678477] INFO -- : pathname 0.3.0 I, [2024-05-15T00:12:04.770680 #678477] INFO -- : psych 5.1.2 I, [2024-05-15T00:12:04.778628 #678477] INFO -- : stringio 3.1.1 I, [2024-05-15T00:12:04.785976 #678477] INFO -- : strscan 3.1.1 I, [2024-05-15T00:12:04.792935 #678477] INFO -- : zlib 3.1.0 I, [2024-05-15T00:12:04.798497 #678477] INFO -- : installing bundled gems: /tmp/ruby/install/trunk/lib/ruby/gems/3.4.0+0 I, [2024-05-15T00:12:04.807202 #678477] INFO -- : minitest 5.22.3 I, [2024-05-15T00:12:04.894014 #678477] INFO -- : rake 13.2.1 I, [2024-05-15T00:12:04.948874 #678477] INFO -- : test-unit 3.6.2 I, [2024-05-15T00:12:05.023464 #678477] INFO -- : rexml 3.2.6 I, [2024-05-15T00:12:05.082367 #678477] INFO -- : rss 0.3.0 I, [2024-05-15T00:12:05.125072 #678477] INFO -- : net-ftp 0.3.4 I, [2024-05-15T00:12:05.144915 #678477] INFO -- : net-imap 0.4.11 I, [2024-05-15T00:12:05.199242 #678477] INFO -- : net-pop 0.1.2 I, [2024-05-15T00:12:05.212652 #678477] INFO -- : net-smtp 0.5.0 I, [2024-05-15T00:12:05.228523 #678477] INFO -- : matrix 0.4.2 I, [2024-05-15T00:12:05.269292 #678477] INFO -- : prime 0.1.2 I, [2024-05-15T00:12:05.328454 #678477] INFO -- : rbs 3.4.4 I, [2024-05-15T00:12:05.711829 #678477] INFO -- : typeprof 0.21.11 I, [2024-05-15T00:12:05.747288 #678477] INFO -- : debug 1.9.2 I, [2024-05-15T00:12:05.788469 #678477] INFO -- : racc 1.7.3 I, [2024-05-15T00:12:05.827782 #678477] INFO -- : mutex_m 0.2.0 I, [2024-05-15T00:12:05.848802 #678477] INFO -- : getoptlong 0.2.1 I, [2024-05-15T00:12:05.868915 #678477] INFO -- : base64 0.2.0 I, [2024-05-15T00:12:05.884785 #678477] INFO -- : bigdecimal 3.1.8 I, [2024-05-15T00:12:05.913318 #678477] INFO -- : observer 0.1.2 I, [2024-05-15T00:12:05.928835 #678477] INFO -- : abbrev 0.1.2 I, [2024-05-15T00:12:05.943065 #678477] INFO -- : resolv-replace 0.1.1 I, [2024-05-15T00:12:05.958943 #678477] INFO -- : rinda 0.2.0 I, [2024-05-15T00:12:05.976180 #678477] INFO -- : drb 2.2.1 I, [2024-05-15T00:12:06.003567 #678477] INFO -- : nkf 0.2.0 I, [2024-05-15T00:12:06.037047 #678477] INFO -- : syslog 0.1.2 I, [2024-05-15T00:12:06.061869 #678477] INFO -- : csv 3.3.0 I, [2024-05-15T00:12:06.097641 #678477] INFO -- : installing bundled gem cache: /tmp/ruby/install/trunk/lib/ruby/gems/3.4.0+0/cache I, [2024-05-15T00:12:06.116628 #678477] INFO -- : skipped bundled gems: I, [2024-05-15T00:12:06.116833 #678477] INFO -- : power_assert-2.0.4dev.gem not found in bundled_gems I, [2024-05-15T00:12:06.140919 #678477] INFO -- : $$$[end] "make install -j4" exit with 0. I, [2024-05-15T00:12:06.141576 #678477] INFO -- : $$$[beg] make yes-btest TESTOPTS='-q -j4' I, [2024-05-15T00:13:14.313776 #678477] INFO -- : PASS all 1936 tests E, [2024-05-15T00:13:14.337431 #678477] ERROR -- : I, [2024-05-15T00:13:14.337935 #678477] INFO -- : $$$[end] "make yes-btest TESTOPTS='-q -j4'" exit with 0. I, [2024-05-15T00:13:14.338817 #678477] INFO -- : $$$[beg] make yes-test-basic TESTS='-j4' I, [2024-05-15T00:13:14.880954 #678477] INFO -- : BASERUBY = /usr/bin/ruby --disable=gems I, [2024-05-15T00:13:14.881161 #678477] INFO -- : CC = gcc I, [2024-05-15T00:13:14.881262 #678477] INFO -- : LD = ld I, [2024-05-15T00:13:14.881363 #678477] INFO -- : LDSHARED = gcc -shared I, [2024-05-15T00:13:14.881501 #678477] INFO -- : CFLAGS = -O3 -fno-fast-math -ggdb3 -Wall -Wextra -Wdeprecated-declarations -Wdiv-by-zero -Wduplicated-cond -Wimplicit-function-declaration -Wimplicit-int -Wpointer-arith -Wwrite-strings -Wold-style-definition -Wimplicit-fallthrough=0 -Wmissing-noreturn -Wno-cast-function-type -Wno-constant-logical-operand -Wno-long-long -Wno-missing-field-initializers -Wno-overlength-strings -Wno-packed-bitfield-compat -Wno-parentheses-equality -Wno-self-assign -Wno-tautological-compare -Wno-unused-parameter -Wno-unused-value -Wsuggest-attribute=format -Wsuggest-attribute=noreturn -Wunused-variable -Wmisleading-indentation -Wundef -fPIC I, [2024-05-15T00:13:14.881622 #678477] INFO -- : XCFLAGS = -U_FORTIFY_SOURCE -D_FORTIFY_SOURCE=2 -fstack-protector-strong -fno-strict-overflow -fvisibility=hidden -fexcess-precision=standard -DRUBY_EXPORT -I. -I.ext/include/riscv64-linux -I/tmp/ruby/src/trunk/include -I/tmp/ruby/src/trunk -I/tmp/ruby/src/trunk/prism -I/tmp/ruby/src/trunk/enc/unicode/15.0.0 I, [2024-05-15T00:13:14.881747 #678477] INFO -- : CPPFLAGS = I, [2024-05-15T00:13:14.881895 #678477] INFO -- : DLDFLAGS = -Wl,--compress-debug-sections=zlib -Wl,-soname,libruby.so.3.4 -fstack-protector-strong I, [2024-05-15T00:13:14.882014 #678477] INFO -- : SOLIBS = -lz -lrt -lrt -lgmp -ldl -lcrypt -lm -lpthread I, [2024-05-15T00:13:14.882117 #678477] INFO -- : LANG = I, [2024-05-15T00:13:14.882211 #678477] INFO -- : LC_ALL = I, [2024-05-15T00:13:14.882317 #678477] INFO -- : LC_CTYPE = I, [2024-05-15T00:13:14.882414 #678477] INFO -- : MFLAGS = I, [2024-05-15T00:13:14.882498 #678477] INFO -- : RUSTC = rustc I, [2024-05-15T00:13:14.882586 #678477] INFO -- : YJIT_RUSTC_ARGS = --crate-name=yjit --crate-type=staticlib --edition=2021 -g -C lto=thin -C opt-level=3 -C overflow-checks=on '--out-dir=/tmp/ruby/build/trunk/yjit/target/release/' /tmp/ruby/src/trunk/yjit/src/lib.rs I, [2024-05-15T00:13:14.884250 #678477] INFO -- : gcc (Debian 13.2.0-4revyos1) 13.2.0 I, [2024-05-15T00:13:14.884459 #678477] INFO -- : Copyright (C) 2023 Free Software Foundation, Inc. I, [2024-05-15T00:13:14.884553 #678477] INFO -- : This is free software; see the source for copying conditions. There is NO I, [2024-05-15T00:13:14.884639 #678477] INFO -- : warranty; not even for MERCHANTABILITY or FITNESS FOR A PARTICULAR PURPOSE. I, [2024-05-15T00:13:14.884735 #678477] INFO -- : I, [2024-05-15T00:13:16.780155 #678477] INFO -- : Checking leaked global symbols...none I, [2024-05-15T00:13:17.084449 #678477] INFO -- : /tmp/ruby/src/trunk/basictest/test.rb:assignment ....................................................................................................................................................................................................................................................................................................................................................................................OK 372 I, [2024-05-15T00:13:17.084730 #678477] INFO -- : /tmp/ruby/src/trunk/basictest/test.rb:condition ..OK 2 I, [2024-05-15T00:13:17.084856 #678477] INFO -- : /tmp/ruby/src/trunk/basictest/test.rb:if/unless ...OK 3 I, [2024-05-15T00:13:17.085036 #678477] INFO -- : /tmp/ruby/src/trunk/basictest/test.rb:case .....OK 5 I, [2024-05-15T00:13:17.086355 #678477] INFO -- : /tmp/ruby/src/trunk/basictest/test.rb:while/until ........OK 8 I, [2024-05-15T00:13:17.087153 #678477] INFO -- : /tmp/ruby/src/trunk/basictest/test.rb:exception ..........OK 10 I, [2024-05-15T00:13:17.089771 #678477] INFO -- : /tmp/ruby/src/trunk/basictest/test.rb:array .......................................OK 39 I, [2024-05-15T00:13:17.091381 #678477] INFO -- : /tmp/ruby/src/trunk/basictest/test.rb:hash ...........................OK 27 I, [2024-05-15T00:13:17.100297 #678477] INFO -- : /tmp/ruby/src/trunk/basictest/test.rb:iterator ...........................................................................................................OK 107 I, [2024-05-15T00:13:17.117045 #678477] INFO -- : /tmp/ruby/src/trunk/basictest/test.rb:float ................................................................................OK 80 I, [2024-05-15T00:13:17.128664 #678477] INFO -- : /tmp/ruby/src/trunk/basictest/test.rb:bignum ...............................OK 31 I, [2024-05-15T00:13:17.141324 #678477] INFO -- : /tmp/ruby/src/trunk/basictest/test.rb:string & char ..............................................................OK 62 I, [2024-05-15T00:13:17.141814 #678477] INFO -- : /tmp/ruby/src/trunk/basictest/test.rb:assignment ..........OK 10 I, [2024-05-15T00:13:17.142300 #678477] INFO -- : /tmp/ruby/src/trunk/basictest/test.rb:call ......OK 6 I, [2024-05-15T00:13:17.143111 #678477] INFO -- : /tmp/ruby/src/trunk/basictest/test.rb:proc .........OK 9 I, [2024-05-15T00:13:17.245519 #678477] INFO -- : /tmp/ruby/src/trunk/basictest/test.rb:signal ..OK 2 I, [2024-05-15T00:13:17.266664 #678477] INFO -- : /tmp/ruby/src/trunk/basictest/test.rb:eval ...........................OK 27 I, [2024-05-15T00:13:17.687716 #678477] INFO -- : /tmp/ruby/src/trunk/basictest/test.rb:system ........OK 8 I, [2024-05-15T00:13:17.688201 #678477] INFO -- : /tmp/ruby/src/trunk/basictest/test.rb:const .....OK 5 I, [2024-05-15T00:13:17.688763 #678477] INFO -- : /tmp/ruby/src/trunk/basictest/test.rb:clone .....OK 5 I, [2024-05-15T00:13:17.689832 #678477] INFO -- : /tmp/ruby/src/trunk/basictest/test.rb:marshal ....OK 4 I, [2024-05-15T00:13:17.690290 #678477] INFO -- : /tmp/ruby/src/trunk/basictest/test.rb:pack ....OK 4 I, [2024-05-15T00:13:17.690494 #678477] INFO -- : /tmp/ruby/src/trunk/basictest/test.rb:math ..OK 2 I, [2024-05-15T00:13:17.691038 #678477] INFO -- : /tmp/ruby/src/trunk/basictest/test.rb:struct ......OK 6 I, [2024-05-15T00:13:17.692074 #678477] INFO -- : /tmp/ruby/src/trunk/basictest/test.rb:variable ............OK 12 I, [2024-05-15T00:13:17.692319 #678477] INFO -- : /tmp/ruby/src/trunk/basictest/test.rb:trace ...OK 3 I, [2024-05-15T00:13:17.696593 #678477] INFO -- : /tmp/ruby/src/trunk/basictest/test.rb:defined? ............OK 12 I, [2024-05-15T00:13:17.697439 #678477] INFO -- : /tmp/ruby/src/trunk/basictest/test.rb:alias ......OK 6 I, [2024-05-15T00:13:17.700655 #678477] INFO -- : /tmp/ruby/src/trunk/basictest/test.rb:path .......................OK 23 I, [2024-05-15T00:13:18.092769 #678477] INFO -- : /tmp/ruby/src/trunk/basictest/test.rb:gc ....OK 4 I, [2024-05-15T00:13:18.109230 #678477] INFO -- : I, [2024-05-15T00:13:18.109430 #678477] INFO -- : test succeeded I, [2024-05-15T00:13:18.114523 #678477] INFO -- : $$$[end] "make yes-test-basic TESTS='-j4'" exit with 0. I, [2024-05-15T00:13:18.115237 #678477] INFO -- : $$$[beg] make yes-test-all TESTOPTS='--stderr-on-failure' TESTS='-j4' I, [2024-05-15T00:13:18.952519 #678477] INFO -- : BASERUBY = /usr/bin/ruby --disable=gems I, [2024-05-15T00:13:18.952731 #678477] INFO -- : CC = gcc I, [2024-05-15T00:13:18.952846 #678477] INFO -- : LD = ld I, [2024-05-15T00:13:18.953011 #678477] INFO -- : LDSHARED = gcc -shared I, [2024-05-15T00:13:18.953111 #678477] INFO -- : CFLAGS = -O3 -fno-fast-math -ggdb3 -Wall -Wextra -Wdeprecated-declarations -Wdiv-by-zero -Wduplicated-cond -Wimplicit-function-declaration -Wimplicit-int -Wpointer-arith -Wwrite-strings -Wold-style-definition -Wimplicit-fallthrough=0 -Wmissing-noreturn -Wno-cast-function-type -Wno-constant-logical-operand -Wno-long-long -Wno-missing-field-initializers -Wno-overlength-strings -Wno-packed-bitfield-compat -Wno-parentheses-equality -Wno-self-assign -Wno-tautological-compare -Wno-unused-parameter -Wno-unused-value -Wsuggest-attribute=format -Wsuggest-attribute=noreturn -Wunused-variable -Wmisleading-indentation -Wundef -fPIC I, [2024-05-15T00:13:18.953203 #678477] INFO -- : XCFLAGS = -U_FORTIFY_SOURCE -D_FORTIFY_SOURCE=2 -fstack-protector-strong -fno-strict-overflow -fvisibility=hidden -fexcess-precision=standard -DRUBY_EXPORT -I. -I.ext/include/riscv64-linux -I/tmp/ruby/src/trunk/include -I/tmp/ruby/src/trunk -I/tmp/ruby/src/trunk/prism -I/tmp/ruby/src/trunk/enc/unicode/15.0.0 I, [2024-05-15T00:13:18.953296 #678477] INFO -- : CPPFLAGS = I, [2024-05-15T00:13:18.953388 #678477] INFO -- : DLDFLAGS = -Wl,--compress-debug-sections=zlib -Wl,-soname,libruby.so.3.4 -fstack-protector-strong I, [2024-05-15T00:13:18.953483 #678477] INFO -- : SOLIBS = -lz -lrt -lrt -lgmp -ldl -lcrypt -lm -lpthread I, [2024-05-15T00:13:18.953566 #678477] INFO -- : LANG = I, [2024-05-15T00:13:18.953653 #678477] INFO -- : LC_ALL = I, [2024-05-15T00:13:18.953740 #678477] INFO -- : LC_CTYPE = I, [2024-05-15T00:13:18.953827 #678477] INFO -- : MFLAGS = I, [2024-05-15T00:13:18.953909 #678477] INFO -- : RUSTC = rustc I, [2024-05-15T00:13:18.953997 #678477] INFO -- : YJIT_RUSTC_ARGS = --crate-name=yjit --crate-type=staticlib --edition=2021 -g -C lto=thin -C opt-level=3 -C overflow-checks=on '--out-dir=/tmp/ruby/build/trunk/yjit/target/release/' /tmp/ruby/src/trunk/yjit/src/lib.rs I, [2024-05-15T00:13:18.957716 #678477] INFO -- : gcc (Debian 13.2.0-4revyos1) 13.2.0 I, [2024-05-15T00:13:18.957933 #678477] INFO -- : Copyright (C) 2023 Free Software Foundation, Inc. I, [2024-05-15T00:13:18.958046 #678477] INFO -- : This is free software; see the source for copying conditions. There is NO I, [2024-05-15T00:13:18.958152 #678477] INFO -- : warranty; not even for MERCHANTABILITY or FITNESS FOR A PARTICULAR PURPOSE. I, [2024-05-15T00:13:18.958277 #678477] INFO -- : I, [2024-05-15T00:13:18.976389 #678477] INFO -- : generating enc.mk I, [2024-05-15T00:13:20.589840 #678477] INFO -- : making enc I, [2024-05-15T00:13:20.758248 #678477] INFO -- : make[1]: Entering directory '/tmp/ruby/build/trunk' I, [2024-05-15T00:13:20.758451 #678477] INFO -- : make[1]: Nothing to be done for 'enc'. I, [2024-05-15T00:13:20.758554 #678477] INFO -- : make[1]: Leaving directory '/tmp/ruby/build/trunk' I, [2024-05-15T00:13:20.761113 #678477] INFO -- : making srcs under enc I, [2024-05-15T00:13:21.068995 #678477] INFO -- : make[1]: Entering directory '/tmp/ruby/build/trunk' I, [2024-05-15T00:13:21.069196 #678477] INFO -- : make[1]: Nothing to be done for 'srcs'. I, [2024-05-15T00:13:21.069310 #678477] INFO -- : make[1]: Leaving directory '/tmp/ruby/build/trunk' I, [2024-05-15T00:13:21.073976 #678477] INFO -- : generating transdb.h I, [2024-05-15T00:13:22.358896 #678477] INFO -- : transdb.h unchanged I, [2024-05-15T00:13:22.364860 #678477] INFO -- : making trans I, [2024-05-15T00:13:22.702738 #678477] INFO -- : make[1]: Entering directory '/tmp/ruby/build/trunk' I, [2024-05-15T00:13:22.702938 #678477] INFO -- : make[1]: Nothing to be done for 'trans'. I, [2024-05-15T00:13:22.703037 #678477] INFO -- : make[1]: Leaving directory '/tmp/ruby/build/trunk' I, [2024-05-15T00:13:22.705601 #678477] INFO -- : making encs I, [2024-05-15T00:13:23.095837 #678477] INFO -- : make[1]: Entering directory '/tmp/ruby/build/trunk' I, [2024-05-15T00:13:23.096094 #678477] INFO -- : make[1]: Nothing to be done for 'encs'. I, [2024-05-15T00:13:23.096264 #678477] INFO -- : make[1]: Leaving directory '/tmp/ruby/build/trunk' I, [2024-05-15T00:13:23.108377 #678477] INFO -- : generating makefiles ext/configure-ext.mk I, [2024-05-15T00:13:23.299191 #678477] INFO -- : ext/configure-ext.mk updated I, [2024-05-15T00:13:23.312662 #678477] INFO -- : make[1]: Entering directory '/tmp/ruby/build/trunk' I, [2024-05-15T00:13:35.251934 #678477] INFO -- : make[1]: Leaving directory '/tmp/ruby/build/trunk' I, [2024-05-15T00:13:35.254083 #678477] INFO -- : generating makefile exts.mk I, [2024-05-15T00:13:35.588518 #678477] INFO -- : exts.mk unchanged I, [2024-05-15T00:13:35.624742 #678477] INFO -- : make[1]: Entering directory '/tmp/ruby/build/trunk' I, [2024-05-15T00:13:37.778799 #678477] INFO -- : make[2]: Entering directory '/tmp/ruby/build/trunk/ext/coverage' I, [2024-05-15T00:13:37.802438 #678477] INFO -- : make[2]: Leaving directory '/tmp/ruby/build/trunk/ext/coverage' I, [2024-05-15T00:13:37.852671 #678477] INFO -- : make[2]: Entering directory '/tmp/ruby/build/trunk/ext/date' I, [2024-05-15T00:13:37.879764 #678477] INFO -- : make[2]: Leaving directory '/tmp/ruby/build/trunk/ext/date' I, [2024-05-15T00:13:37.911767 #678477] INFO -- : make[2]: Entering directory '/tmp/ruby/build/trunk/ext/digest' I, [2024-05-15T00:13:37.968212 #678477] INFO -- : make[2]: Leaving directory '/tmp/ruby/build/trunk/ext/digest' I, [2024-05-15T00:13:38.131926 #678477] INFO -- : make[2]: Entering directory '/tmp/ruby/build/trunk/ext/digest/sha2' I, [2024-05-15T00:13:38.159302 #678477] INFO -- : make[2]: Leaving directory '/tmp/ruby/build/trunk/ext/digest/sha2' I, [2024-05-15T00:13:38.285915 #678477] INFO -- : make[2]: Entering directory '/tmp/ruby/build/trunk/ext/fiddle' I, [2024-05-15T00:13:38.352248 #678477] INFO -- : make[2]: Leaving directory '/tmp/ruby/build/trunk/ext/fiddle' I, [2024-05-15T00:13:38.385194 #678477] INFO -- : make[2]: Entering directory '/tmp/ruby/build/trunk/ext/io/console' I, [2024-05-15T00:13:38.417143 #678477] INFO -- : make[2]: Leaving directory '/tmp/ruby/build/trunk/ext/io/console' I, [2024-05-15T00:13:38.510866 #678477] INFO -- : make[2]: Entering directory '/tmp/ruby/build/trunk/ext/json' I, [2024-05-15T00:13:38.576495 #678477] INFO -- : make[2]: Leaving directory '/tmp/ruby/build/trunk/ext/json' I, [2024-05-15T00:13:38.674344 #678477] INFO -- : make[2]: Entering directory '/tmp/ruby/build/trunk/ext/monitor' I, [2024-05-15T00:13:38.696324 #678477] INFO -- : make[2]: Leaving directory '/tmp/ruby/build/trunk/ext/monitor' I, [2024-05-15T00:13:38.748611 #678477] INFO -- : make[2]: Entering directory '/tmp/ruby/build/trunk/ext/objspace' I, [2024-05-15T00:13:38.782691 #678477] INFO -- : make[2]: Leaving directory '/tmp/ruby/build/trunk/ext/objspace' I, [2024-05-15T00:13:38.902521 #678477] INFO -- : make[2]: Entering directory '/tmp/ruby/build/trunk/ext/openssl' I, [2024-05-15T00:13:39.037132 #678477] INFO -- : make[2]: Leaving directory '/tmp/ruby/build/trunk/ext/openssl' I, [2024-05-15T00:13:39.064011 #678477] INFO -- : make[2]: Entering directory '/tmp/ruby/build/trunk/ext/pathname' I, [2024-05-15T00:13:39.084231 #678477] INFO -- : make[2]: Leaving directory '/tmp/ruby/build/trunk/ext/pathname' I, [2024-05-15T00:13:39.136619 #678477] INFO -- : make[2]: Entering directory '/tmp/ruby/build/trunk/ext/psych' I, [2024-05-15T00:13:39.297627 #678477] INFO -- : make[2]: Leaving directory '/tmp/ruby/build/trunk/ext/psych' I, [2024-05-15T00:13:39.339583 #678477] INFO -- : make[2]: Entering directory '/tmp/ruby/build/trunk/ext/pty' I, [2024-05-15T00:13:39.359475 #678477] INFO -- : make[2]: Leaving directory '/tmp/ruby/build/trunk/ext/pty' I, [2024-05-15T00:13:39.463326 #678477] INFO -- : make[2]: Entering directory '/tmp/ruby/build/trunk/ext/ripper' I, [2024-05-15T00:13:39.510536 #678477] INFO -- : make[2]: Leaving directory '/tmp/ruby/build/trunk/ext/ripper' I, [2024-05-15T00:13:39.524966 #678477] INFO -- : make[2]: Entering directory '/tmp/ruby/build/trunk/ext/rubyvm' I, [2024-05-15T00:13:39.550581 #678477] INFO -- : make[2]: Leaving directory '/tmp/ruby/build/trunk/ext/rubyvm' I, [2024-05-15T00:13:39.631031 #678477] INFO -- : make[2]: Entering directory '/tmp/ruby/build/trunk/ext/socket' I, [2024-05-15T00:13:39.690838 #678477] INFO -- : make[2]: Leaving directory '/tmp/ruby/build/trunk/ext/socket' I, [2024-05-15T00:13:39.808745 #678477] INFO -- : make[2]: Entering directory '/tmp/ruby/build/trunk/.bundle/gems/bigdecimal-3.1.8/ext/bigdecimal' I, [2024-05-15T00:13:39.968732 #678477] INFO -- : make[2]: Leaving directory '/tmp/ruby/build/trunk/.bundle/gems/bigdecimal-3.1.8/ext/bigdecimal' I, [2024-05-15T00:13:39.984109 #678477] INFO -- : make[2]: Entering directory '/tmp/ruby/build/trunk/.bundle/gems/debug-1.9.2/ext/debug' I, [2024-05-15T00:13:40.135953 #678477] INFO -- : make[2]: Leaving directory '/tmp/ruby/build/trunk/.bundle/gems/debug-1.9.2/ext/debug' I, [2024-05-15T00:13:40.153176 #678477] INFO -- : make[2]: Entering directory '/tmp/ruby/build/trunk/.bundle/gems/nkf-0.2.0/ext/nkf' I, [2024-05-15T00:13:40.308006 #678477] INFO -- : make[2]: Leaving directory '/tmp/ruby/build/trunk/.bundle/gems/nkf-0.2.0/ext/nkf' I, [2024-05-15T00:13:40.325779 #678477] INFO -- : make[2]: Entering directory '/tmp/ruby/build/trunk/.bundle/gems/racc-1.7.3/ext/racc/cparse' I, [2024-05-15T00:13:40.493022 #678477] INFO -- : make[2]: Leaving directory '/tmp/ruby/build/trunk/.bundle/gems/racc-1.7.3/ext/racc/cparse' I, [2024-05-15T00:13:40.527702 #678477] INFO -- : make[2]: Entering directory '/tmp/ruby/build/trunk/.bundle/gems/rbs-3.4.4/ext/rbs_extension' I, [2024-05-15T00:13:40.685930 #678477] INFO -- : make[2]: Leaving directory '/tmp/ruby/build/trunk/.bundle/gems/rbs-3.4.4/ext/rbs_extension' I, [2024-05-15T00:13:40.708300 #678477] INFO -- : make[2]: Entering directory '/tmp/ruby/build/trunk/.bundle/gems/syslog-0.1.2/ext/syslog' I, [2024-05-15T00:13:40.868932 #678477] INFO -- : make[2]: Leaving directory '/tmp/ruby/build/trunk/.bundle/gems/syslog-0.1.2/ext/syslog' I, [2024-05-15T00:13:41.084164 #678477] INFO -- : make[2]: Entering directory '/tmp/ruby/build/trunk' I, [2024-05-15T00:13:41.734248 #678477] INFO -- : make[2]: 'ruby' is up to date. I, [2024-05-15T00:13:41.734468 #678477] INFO -- : make[2]: Leaving directory '/tmp/ruby/build/trunk' I, [2024-05-15T00:13:41.736254 #678477] INFO -- : make[1]: Leaving directory '/tmp/ruby/build/trunk' I, [2024-05-15T00:13:41.768150 #678477] INFO -- : make[1]: Entering directory '/tmp/ruby/build/trunk' I, [2024-05-15T00:13:41.768342 #678477] INFO -- : make[1]: Nothing to be done for 'note'. I, [2024-05-15T00:13:41.768440 #678477] INFO -- : make[1]: Leaving directory '/tmp/ruby/build/trunk' I, [2024-05-15T00:13:42.535136 #678477] INFO -- : Run options: I, [2024-05-15T00:13:42.535346 #678477] INFO -- : --seed=36094 I, [2024-05-15T00:13:42.535453 #678477] INFO -- : "--ruby=./miniruby -I/tmp/ruby/src/trunk/lib -I. -I.ext/common /tmp/ruby/src/trunk/tool/runruby.rb --extout=.ext -- --disable-gems" I, [2024-05-15T00:13:42.535549 #678477] INFO -- : --excludes-dir=/tmp/ruby/src/trunk/test/.excludes I, [2024-05-15T00:13:42.535643 #678477] INFO -- : --name=!/memory_leak/ I, [2024-05-15T00:13:42.535734 #678477] INFO -- : --stderr-on-failure I, [2024-05-15T00:13:42.535821 #678477] INFO -- : -j4 I, [2024-05-15T00:13:42.535961 #678477] INFO -- : I, [2024-05-15T00:13:42.536096 #678477] INFO -- : # Running tests: I, [2024-05-15T00:13:42.536193 #678477] INFO -- : I, [2024-05-15T00:13:43.545195 #678477] INFO -- : [ 1/885] 719808=test_nowrite I, [2024-05-15T00:13:43.560069 #678477] INFO -- : [ 2/885] 719806=test_thread_queue I, [2024-05-15T00:13:43.565023 #678477] INFO -- : [ 3/885] 719809=test_rdoc_markup_formatter I, [2024-05-15T00:13:43.610450 #678477] INFO -- : [ 4/885] 719807=test_bmethod I, [2024-05-15T00:13:43.658861 #678477] INFO -- : [ 5/885] 719807=test_euc_tw I, [2024-05-15T00:13:43.678282 #678477] INFO -- : [ 6/885] 719807=test_ractor I, [2024-05-15T00:13:43.742387 #678477] INFO -- : [ 7/885] 719808=test_gem_commands_sources_command I, [2024-05-15T00:13:44.183606 #678477] INFO -- : [ 8/885] 719807=test_ansi_without_terminfo I, [2024-05-15T00:13:44.222367 #678477] INFO -- : [ 9/885] 719807=test_big2str I, [2024-05-15T00:13:44.426348 #678477] INFO -- : [ 10/885] 719807=test_yaml I, [2024-05-15T00:13:44.650342 #678477] INFO -- : [ 11/885] 719809=test_forwardable I, [2024-05-15T00:13:44.838923 #678477] INFO -- : [ 12/885] 719809=test_wait I, [2024-05-15T00:13:45.002163 #678477] INFO -- : [ 13/885] 719807=test_handle I, [2024-05-15T00:13:45.300918 #678477] INFO -- : [ 14/885] 719809=test_gbk I, [2024-05-15T00:13:45.305825 #678477] INFO -- : [ 15/885] 719809=test_class2name I, [2024-05-15T00:13:45.330480 #678477] INFO -- : [ 16/885] 719809=test_enc_str_buf_cat I, [2024-05-15T00:13:45.354391 #678477] INFO -- : [ 17/885] 719809=test_pstore I, [2024-05-15T00:13:45.465345 #678477] INFO -- : [ 18/885] 719807=test_cstr I, [2024-05-15T00:13:45.704991 #678477] INFO -- : [ 19/885] 719809=test_profile_frames I, [2024-05-15T00:13:46.341089 #678477] INFO -- : [ 20/885] 719807=test_io_timeout I, [2024-05-15T00:13:46.353731 #678477] INFO -- : [ 21/885] 719807=test_shapes I, [2024-05-15T00:13:46.401316 #678477] INFO -- : [ 22/885] 719809=json_fixtures_test I, [2024-05-15T00:13:46.411132 #678477] INFO -- : [ 23/885] 719807=test_comparable I, [2024-05-15T00:13:46.443546 #678477] INFO -- : [ 24/885] 719807=test_rdoc_parser_c I, [2024-05-15T00:13:46.484585 #678477] INFO -- : [ 25/885] 719809=test_fiddle I, [2024-05-15T00:13:46.646433 #678477] INFO -- : [ 26/885] 719809=test_wss I, [2024-05-15T00:13:46.712641 #678477] INFO -- : [ 27/885] 719808=test_ractor I, [2024-05-15T00:13:46.755779 #678477] INFO -- : [ 28/885] 719809=test_find I, [2024-05-15T00:13:46.872769 #678477] INFO -- : [ 29/885] 719809=test_marshalable I, [2024-05-15T00:13:47.030310 #678477] INFO -- : [ 30/885] 719809=test_digest I, [2024-05-15T00:13:47.249580 #678477] INFO -- : [ 31/885] 719808=test_gem_ext_cmake_builder I, [2024-05-15T00:13:47.439526 #678477] INFO -- : [ 32/885] 719808=test_gem_commands_contents_command I, [2024-05-15T00:13:47.934615 #678477] INFO -- : [ 33/885] 719808=test_cgi_util I, [2024-05-15T00:13:48.623667 #678477] INFO -- : [ 34/885] 719807=test_require I, [2024-05-15T00:13:49.686028 #678477] INFO -- : [ 35/885] 719808=test_deprecate I, [2024-05-15T00:13:50.360265 #678477] INFO -- : [ 36/885] 719808=test_rdoc_constant I, [2024-05-15T00:13:50.378553 #678477] INFO -- : [ 37/885] 719809=test_bash_completion I, [2024-05-15T00:13:50.440486 #678477] INFO -- : [ 38/885] 719809=test_formatter I, [2024-05-15T00:13:50.524618 #678477] INFO -- : [ 39/885] 719809=test_gem_source_vendor I, [2024-05-15T00:13:51.147778 #678477] INFO -- : [ 40/885] 719806=test_gem_commands_owner_command I, [2024-05-15T00:13:51.835100 #678477] INFO -- : [ 41/885] 719808=test_recorder I, [2024-05-15T00:13:51.858673 #678477] INFO -- : [ 42/885] 719808=test_rdoc_encoding I, [2024-05-15T00:13:52.052380 #678477] INFO -- : [ 43/885] 719808=test_coverage I, [2024-05-15T00:13:52.253225 #678477] INFO -- : [ 44/885] 719809=regexp_test I, [2024-05-15T00:13:53.015316 #678477] INFO -- : [ 45/885] 719809=test_gem_package_tar_reader I, [2024-05-15T00:13:53.273202 #678477] INFO -- : [ 46/885] 719809=test_complexrational I, [2024-05-15T00:13:53.327585 #678477] INFO -- : [ 47/885] 719809=test_init I, [2024-05-15T00:13:53.981084 #678477] INFO -- : [ 48/885] 719806=test_pathname I, [2024-05-15T00:13:55.853760 #678477] INFO -- : [ 49/885] 719806=test_rdoc_markdown I, [2024-05-15T00:13:56.365639 #678477] INFO -- : [ 50/885] 719809=test_gem_available_set I, [2024-05-15T00:13:56.539466 #678477] INFO -- : [ 51/885] 719808=test_rdoc_any_method I, [2024-05-15T00:13:56.929520 #678477] INFO -- : [ 52/885] 719809=test_modify_expand I, [2024-05-15T00:13:56.960926 #678477] INFO -- : [ 53/885] 719809=test_file I, [2024-05-15T00:13:57.001924 #678477] INFO -- : [ 54/885] 719809=test_rdoc_normal_class I, [2024-05-15T00:13:57.693661 #678477] INFO -- : [ 55/885] 719809=test_class I, [2024-05-15T00:13:58.824934 #678477] INFO -- : [ 56/885] 719806=test_const I, [2024-05-15T00:13:58.855689 #678477] INFO -- : [ 57/885] 719806=json_string_matching_test I, [2024-05-15T00:13:58.863979 #678477] INFO -- : [ 58/885] 719807=test_load I, [2024-05-15T00:13:58.893750 #678477] INFO -- : [ 59/885] 719806=test_random I, [2024-05-15T00:13:58.942392 #678477] INFO -- : [ 60/885] 719807=test_asn1 I, [2024-05-15T00:13:59.012947 #678477] INFO -- : [ 61/885] 719806=test_irb I, [2024-05-15T00:13:59.158777 #678477] INFO -- : [ 62/885] 719807=test_date_strftime I, [2024-05-15T00:13:59.454730 #678477] INFO -- : [ 63/885] 719808=test_rdoc_parser_rd I, [2024-05-15T00:13:59.620918 #678477] INFO -- : [ 64/885] 719808=test_yamlstore I, [2024-05-15T00:13:59.804791 #678477] INFO -- : [ 65/885] 719808=test_gem_installer I, [2024-05-15T00:14:01.653723 #678477] INFO -- : [ 66/885] 719806=test_utf32 I, [2024-05-15T00:14:01.718173 #678477] INFO -- : [ 67/885] 719806=test_basicsocket I, [2024-05-15T00:14:01.781847 #678477] INFO -- : [ 68/885] 719806=test_duplicate I, [2024-05-15T00:14:01.851206 #678477] INFO -- : [ 69/885] 719806=test_gem_commands_help_command I, [2024-05-15T00:14:02.417725 #678477] INFO -- : [ 70/885] 719806=test_rdoc_markup I, [2024-05-15T00:14:02.476443 #678477] INFO -- : [ 71/885] 719806=test_prettyprint I, [2024-05-15T00:14:02.647259 #678477] INFO -- : [ 72/885] 719806=test_tracepoint I, [2024-05-15T00:14:03.206577 #678477] INFO -- : [ 73/885] 719807=test_internal_ivar I, [2024-05-15T00:14:03.274831 #678477] INFO -- : [ 74/885] 719807=test_gem_resolver_index_specification I, [2024-05-15T00:14:03.560764 #678477] INFO -- : [ 75/885] 719807=test_function I, [2024-05-15T00:14:03.852838 #678477] INFO -- : [ 76/885] 719807=test_queue I, [2024-05-15T00:14:03.892648 #678477] INFO -- : [ 77/885] 719807=test_tempfile I, [2024-05-15T00:14:04.629279 #678477] INFO -- : [ 78/885] 719806=test_noarg I, [2024-05-15T00:14:05.005419 #678477] INFO -- : [ 79/885] 719807=parse_comments_test I, [2024-05-15T00:14:05.525453 #678477] INFO -- : [ 80/885] 719807=test_gem_version I, [2024-05-15T00:14:05.823693 #678477] INFO -- : [ 81/885] 719806=test_rdoc_options I, [2024-05-15T00:14:06.106523 #678477] INFO -- : [ 82/885] 719807=test_econv I, [2024-05-15T00:14:07.841888 #678477] INFO -- : [ 83/885] 719806=test_cesu8 I, [2024-05-15T00:14:07.889058 #678477] INFO -- : [ 84/885] 719806=test_string_processing I, [2024-05-15T00:14:08.008071 #678477] INFO -- : [ 85/885] 719806=test_fileutils I, [2024-05-15T00:14:09.804409 #678477] INFO -- : [ 86/885] 719806=test_emitter I, [2024-05-15T00:14:09.841080 #678477] INFO -- : [ 87/885] 719806=test_gem_commands_signin_command I, [2024-05-15T00:14:10.615155 #678477] INFO -- : [ 88/885] 719806=test_resource I, [2024-05-15T00:14:10.746118 #678477] INFO -- : [ 89/885] 719806=test_ldap I, [2024-05-15T00:14:11.027868 #678477] INFO -- : [ 90/885] 719806=test_rdoc_include I, [2024-05-15T00:14:11.232254 #678477] INFO -- : [ 91/885] 719806=test_reqarg I, [2024-05-15T00:14:13.369445 #678477] INFO -- : [ 92/885] 719806=test_gem_commands_list_command I, [2024-05-15T00:14:13.397036 #678477] INFO -- : [ 93/885] 719806=test_stack I, [2024-05-15T00:14:14.285194 #678477] INFO -- : [ 94/885] 719807=test_too_many_dummy_encodings I, [2024-05-15T00:14:14.407339 #678477] INFO -- : [ 95/885] 719807=test_mdns I, [2024-05-15T00:14:14.424686 #678477] INFO -- : [ 96/885] 719807=test_parse I, [2024-05-15T00:14:18.643000 #678477] INFO -- : [ 97/885] 719807=test_gem_remote_fetcher I, [2024-05-15T00:14:21.779597 #678477] INFO -- : [ 98/885] 719806=test_scanner_events I, [2024-05-15T00:14:22.035836 #678477] INFO -- : [ 99/885] 719806=test_gem_resolver_installed_specification I, [2024-05-15T00:14:22.233108 #678477] INFO -- : [100/885] 719806=test_gem_ext_ext_conf_builder I, [2024-05-15T00:14:22.309656 #678477] INFO -- : [101/885] 719809=test_frozen_error I, [2024-05-15T00:14:22.343335 #678477] INFO -- : [102/885] 719809=test_method_cache I, [2024-05-15T00:14:22.376322 #678477] INFO -- : [103/885] 719809=test_gem_stub_specification I, [2024-05-15T00:14:23.429944 #678477] INFO -- : [104/885] 719809=test_gem_commands_search_command I, [2024-05-15T00:14:23.504451 #678477] INFO -- : [105/885] 719809=test_complex I, [2024-05-15T00:14:24.075622 #678477] INFO -- : [106/885] 719809=test_inlinecache I, [2024-05-15T00:14:24.543869 #678477] INFO -- : [107/885] 719809=test_rdoc_markup_verbatim I, [2024-05-15T00:14:24.636213 #678477] INFO -- : [108/885] 719809=test_gem_resolver_specification I, [2024-05-15T00:14:24.748878 #678477] INFO -- : [109/885] 719809=test_gem_dependency I, [2024-05-15T00:14:25.543968 #678477] INFO -- : [110/885] 719809=test_path_to_class I, [2024-05-15T00:14:25.631042 #678477] INFO -- : [111/885] 719809=test_have_library I, [2024-05-15T00:14:28.505777 #678477] INFO -- : [112/885] 719807=test_remote_fetch_error I, [2024-05-15T00:14:28.798240 #678477] INFO -- : [113/885] 719807=test_lock_native_thread I, [2024-05-15T00:14:30.151006 #678477] INFO -- : [114/885] 719807=test_c_struct_entry I, [2024-05-15T00:14:31.323607 #678477] INFO -- : [115/885] 719807=test_gem_commands_stale_command I, [2024-05-15T00:14:31.347236 #678477] INFO -- : [116/885] 719807=test_set I, [2024-05-15T00:14:31.566603 #678477] INFO -- : [117/885] 719807=test_show_source I, [2024-05-15T00:14:31.786248 #678477] INFO -- : [118/885] 719806=comments_test I, [2024-05-15T00:14:31.940034 #678477] INFO -- : [119/885] 719807=test_sprintf I, [2024-05-15T00:14:32.182165 #678477] INFO -- : [120/885] 719806=test_gem_requirement I, [2024-05-15T00:14:33.249359 #678477] INFO -- : [121/885] 719806=test_string_memory I, [2024-05-15T00:14:33.517998 #678477] INFO -- : [122/885] 719806=test_gem_security_trust_dir I, [2024-05-15T00:14:33.692608 #678477] INFO -- : [123/885] 719807=test_undef I, [2024-05-15T00:14:33.723579 #678477] INFO -- : [124/885] 719807=test_line_editor I, [2024-05-15T00:14:33.726657 #678477] INFO -- : [125/885] 719806=ripper_test I, [2024-05-15T00:14:33.814862 #678477] INFO -- : [126/885] 719807=test_objspace I, [2024-05-15T00:14:33.986678 #678477] INFO -- : [127/885] 719808=test_kill_ring I, [2024-05-15T00:14:34.333442 #678477] INFO -- : [128/885] 719809=test_ns_spki I, [2024-05-15T00:14:34.377257 #678477] INFO -- : [129/885] 719808=test_framework I, [2024-05-15T00:14:34.540145 #678477] INFO -- : [130/885] 719808=test_argf I, [2024-05-15T00:14:34.565321 #678477] INFO -- : [131/885] 719809=test_gem_commands_environment_command I, [2024-05-15T00:14:35.035134 #678477] INFO -- : [132/885] 719809=test_m17n I, [2024-05-15T00:14:35.896704 #678477] INFO -- : [133/885] 719809=test_ws I, [2024-05-15T00:14:35.924270 #678477] INFO -- : [134/885] 719809=test_yjit I, [2024-05-15T00:14:35.974461 #678477] INFO -- : [135/885] 719809=test_weakmap I, [2024-05-15T00:14:37.530118 #678477] INFO -- : [136/885] 719806=test_workspace I, [2024-05-15T00:14:38.719065 #678477] INFO -- : [137/885] 719806=test_protect I, [2024-05-15T00:14:38.766912 #678477] INFO -- : [138/885] 719806=test_win32ole_typelib I, [2024-05-15T00:14:38.953247 #678477] INFO -- : [139/885] 719806=test_gem_request_set_lockfile I, [2024-05-15T00:14:41.650888 #678477] INFO -- : [140/885] 719806=test_raise_exception I, [2024-05-15T00:14:46.766396 #678477] INFO -- : [141/885] 719806=test_alias_and_anchor I, [2024-05-15T00:14:46.826072 #678477] INFO -- : [142/885] 719806=test_postponed_job I, [2024-05-15T00:14:49.894190 #678477] INFO -- : [143/885] 719806=test_external_new I, [2024-05-15T00:14:49.918555 #678477] INFO -- : [144/885] 719806=test_tree_builder I, [2024-05-15T00:14:49.966871 #678477] INFO -- : [145/885] 719806=test_gem_resolver_dependency_request I, [2024-05-15T00:14:50.142657 #678477] INFO -- : [146/885] 719806=test_hash I, [2024-05-15T00:14:50.378050 #678477] INFO -- : [147/885] 719806=test_gem_commands_uninstall_command I, [2024-05-15T00:14:54.146785 #678477] INFO -- : [148/885] 719809=test_foreach I, [2024-05-15T00:14:54.224468 #678477] INFO -- : [149/885] 719809=test_gem_source_specific_file I, [2024-05-15T00:14:54.748059 #678477] INFO -- : [150/885] 719809=test_condition I, [2024-05-15T00:14:54.770150 #678477] INFO -- : [151/885] 719809=test_cp949 I, [2024-05-15T00:14:54.822103 #678477] INFO -- : [152/885] 719809=test_win32ole_record I, [2024-05-15T00:14:54.836578 #678477] INFO -- : [153/885] 719809=test_gem_unsatisfiable_dependency_error I, [2024-05-15T00:14:54.949167 #678477] INFO -- : [154/885] 719809=test_ubf_async_safe I, [2024-05-15T00:14:55.083565 #678477] INFO -- : [155/885] 719809=test_hash I, [2024-05-15T00:14:56.420038 #678477] INFO -- : [156/885] 719806=test_sorted_set I, [2024-05-15T00:14:58.130136 #678477] INFO -- : [157/885] 719806=test_win32ole_type_event I, [2024-05-15T00:14:58.192809 #678477] INFO -- : [158/885] 719806=test_emoji I, [2024-05-15T00:14:58.396362 #678477] INFO -- : [159/885] 719806=test_io I, [2024-05-15T00:14:59.199851 #678477] INFO -- : [160/885] 719806=test_date_attr I, [2024-05-15T00:14:59.236687 #678477] INFO -- : [161/885] 719806=test_ellipsize I, [2024-05-15T00:14:59.294811 #678477] INFO -- : [162/885] 719806=test_kwargs I, [2024-05-15T00:14:59.334159 #678477] INFO -- : [163/885] 719806=warnings_test I, [2024-05-15T00:14:59.446856 #678477] INFO -- : [164/885] 719806=test_io_wait I, [2024-05-15T00:15:00.094965 #678477] INFO -- : [165/885] 719806=test_gem_commands_exec_command I, [2024-05-15T00:15:06.783466 #678477] INFO -- : [166/885] 719806=test_type_completor I, [2024-05-15T00:15:06.807006 #678477] INFO -- : [167/885] 719806=test_summary I, [2024-05-15T00:15:07.215438 #678477] INFO -- : [168/885] 719806=test_console_attr I, [2024-05-15T00:15:07.242771 #678477] INFO -- : [169/885] 719806=test_rdoc_context_section I, [2024-05-15T00:15:07.312166 #678477] INFO -- : [170/885] 719806=test_euc_kr I, [2024-05-15T00:15:07.353236 #678477] INFO -- : [171/885] 719806=test_ftp I, [2024-05-15T00:15:07.398180 #678477] INFO -- : [172/885] 719806=test_to_ruby I, [2024-05-15T00:15:07.565880 #678477] INFO -- : [173/885] 719806=test_pattern_key_name_check I, [2024-05-15T00:15:07.595713 #678477] INFO -- : [174/885] 719806=test_array_create I, [2024-05-15T00:15:07.621035 #678477] INFO -- : [175/885] 719806=test_pack I, [2024-05-15T00:15:08.833609 #678477] INFO -- : [176/885] 719808=test_gem_impossible_dependencies_error I, [2024-05-15T00:15:08.961619 #678477] INFO -- : [177/885] 719808=test_gem_commands_query_command I, [2024-05-15T00:15:09.380591 #678477] INFO -- : [178/885] 719806=test_method I, [2024-05-15T00:15:12.788717 #678477] INFO -- : [179/885] 719808=test_rdoc_rubygems_hook I, [2024-05-15T00:15:13.469362 #678477] INFO -- : [180/885] 719808=test_etc I, [2024-05-15T00:15:14.069568 #678477] INFO -- : [181/885] 719808=test_yjit_exit_locations I, [2024-05-15T00:15:14.107881 #678477] INFO -- : [182/885] 719808=test_gem_resolver_activation_request I, [2024-05-15T00:15:14.178099 #678477] INFO -- : [183/885] 719808=test_getopts I, [2024-05-15T00:15:14.340172 #678477] INFO -- : [184/885] 719808=test_protocol I, [2024-05-15T00:15:14.612369 #678477] INFO -- : [185/885] 719808=test_ripper I, [2024-05-15T00:15:17.504753 #678477] INFO -- : [186/885] 719808=test_gem_config_file I, [2024-05-15T00:15:18.815336 #678477] INFO -- : [187/885] 719808=test_gem_util I, [2024-05-15T00:15:20.013873 #678477] INFO -- : [188/885] 719808=test_iseq_load I, [2024-05-15T00:15:21.226458 #678477] INFO -- : [189/885] 719809=test_gem_package_tar_header I, [2024-05-15T00:15:21.552564 #678477] INFO -- : [190/885] 719809=test_pkey_dh I, [2024-05-15T00:15:22.123435 #678477] INFO -- : [191/885] 719809=test_bigzero I, [2024-05-15T00:15:22.590173 #678477] INFO -- : [192/885] 719809=test_pkcs12 I, [2024-05-15T00:15:26.681417 #678477] INFO -- : [193/885] 719809=test_system I, [2024-05-15T00:15:27.624042 #678477] INFO -- : [194/885] 719808=test_rendering I, [2024-05-15T00:15:27.662278 #678477] INFO -- : [195/885] 719808=test_face I, [2024-05-15T00:15:32.471933 #678477] INFO -- : [196/885] 719808=test_sizeof I, [2024-05-15T00:15:35.705530 #678477] INFO -- : [197/885] 719809=test_case I, [2024-05-15T00:15:36.144906 #678477] INFO -- : [198/885] 719809=test_unicode_escape I, [2024-05-15T00:15:36.611279 #678477] INFO -- : [199/885] 719809=test_io I, [2024-05-15T00:15:40.547320 #678477] INFO -- : [200/885] 719806=test_utf16 I, [2024-05-15T00:15:40.665347 #678477] INFO -- : [201/885] 719806=test_autoload I, [2024-05-15T00:15:52.520816 #678477] INFO -- : [202/885] 719807=test_config I, [2024-05-15T00:15:52.897333 #678477] INFO -- : [203/885] 719807=test_sleep I, [2024-05-15T00:15:54.396180 #678477] INFO -- : [204/885] 719808=test_gem_commands_fetch_command I, [2024-05-15T00:15:54.936817 #678477] INFO -- : [205/885] 719807=test_math I, [2024-05-15T00:15:55.022679 #678477] INFO -- : [206/885] 719807=test_gc I, [2024-05-15T00:15:55.048926 #678477] INFO -- : [207/885] 719807=test_libs I, [2024-05-15T00:15:55.190757 #678477] INFO -- : [208/885] 719808=test_yaml_tree I, [2024-05-15T00:15:55.224737 #678477] INFO -- : [209/885] 719807=test_readpartial I, [2024-05-15T00:15:55.443260 #678477] INFO -- : [210/885] 719808=test_gem_commands_install_command I, [2024-05-15T00:15:55.677530 #678477] INFO -- : [211/885] 719807=test_clone I, [2024-05-15T00:15:57.134924 #678477] INFO -- : [212/885] 719807=test_rdoc_require I, [2024-05-15T00:15:57.280617 #678477] INFO -- : [213/885] 719807=locals_test I, [2024-05-15T00:15:59.924903 #678477] INFO -- : [214/885] 719807=test_rdoc_markup_indented_paragraph I, [2024-05-15T00:15:59.973501 #678477] INFO -- : [215/885] 719807=test_rdoc_task I, [2024-05-15T00:15:59.997760 #678477] INFO -- : [216/885] 719807=test_gem_resolver_conflict I, [2024-05-15T00:16:00.166337 #678477] INFO -- : [217/885] 719807=test_pack I, [2024-05-15T00:16:00.200148 #678477] INFO -- : [218/885] 719807=test_backtrace I, [2024-05-15T00:16:00.810685 #678477] INFO -- : [219/885] 719806=ruby_parser_test I, [2024-05-15T00:16:00.827429 #678477] INFO -- : [220/885] 719806=test_io_buffer I, [2024-05-15T00:16:01.005262 #678477] INFO -- : [221/885] 719806=test_yield I, [2024-05-15T00:16:03.345887 #678477] INFO -- : [222/885] 719807=test_rdoc_alias I, [2024-05-15T00:16:03.472046 #678477] INFO -- : [223/885] 719807=parser_test I, [2024-05-15T00:16:03.533035 #678477] INFO -- : [224/885] 719807=test_convertible I, [2024-05-15T00:16:04.623170 #678477] INFO -- : [225/885] 719808=test_files_sample I, [2024-05-15T00:16:04.823808 #678477] INFO -- : [226/885] 719808=test_stringscanner I, [2024-05-15T00:16:05.299827 #678477] INFO -- : [227/885] 719808=encoding_test I, [2024-05-15T00:16:06.436309 #678477] INFO -- : [228/885] 719808=test_gem_resolver_best_set I, [2024-05-15T00:16:06.805142 #678477] INFO -- : [229/885] 719808=test_typeddata I, [2024-05-15T00:16:09.467936 #678477] INFO -- : [230/885] 719808=test_rdoc_markup_to_html_crossref I, [2024-05-15T00:16:11.764933 #678477] INFO -- : [231/885] 719808=test_webauthn_poller I, [2024-05-15T00:16:12.112576 #678477] INFO -- : [232/885] 719808=test_rdoc_markup_raw I, [2024-05-15T00:16:12.136503 #678477] INFO -- : [233/885] 719808=test_rat I, [2024-05-15T00:16:12.199456 #678477] INFO -- : [234/885] 719808=test_optparse I, [2024-05-15T00:16:12.616880 #678477] INFO -- : [235/885] 719808=test_array I, [2024-05-15T00:16:12.678606 #678477] INFO -- : [236/885] 719808=test_fstring I, [2024-05-15T00:16:13.545476 #678477] INFO -- : [237/885] 719809=test_files_test_2 I, [2024-05-15T00:16:13.591858 #678477] INFO -- : [238/885] 719808=test_fnmatch I, [2024-05-15T00:16:14.025685 #678477] INFO -- : [239/885] 719808=test_rdoc_markup_parser I, [2024-05-15T00:16:14.801423 #678477] INFO -- : [240/885] 719808=test_require_path_check I, [2024-05-15T00:16:14.925574 #678477] INFO -- : [241/885] 719808=test_folderitem2_invokeverb I, [2024-05-15T00:16:15.006042 #678477] INFO -- : [242/885] 719808=test_gem_validator I, [2024-05-15T00:16:15.085316 #678477] INFO -- : [243/885] 719808=test_gem_package_old I, [2024-05-15T00:16:15.366622 #678477] INFO -- : [244/885] 719808=test_gem_resolver_index_set I, [2024-05-15T00:16:15.693427 #678477] INFO -- : [245/885] 719808=test_gc_compact I, [2024-05-15T00:16:28.043476 #678477] INFO -- : [246/885] 719806=test_string I, [2024-05-15T00:16:34.336811 #678477] INFO -- : [247/885] 719808=test_proc I, [2024-05-15T00:16:42.877344 #678477] INFO -- : [248/885] 719809=test_date_conv I, [2024-05-15T00:16:42.921571 #678477] INFO -- : [249/885] 719807=test_optimization I, [2024-05-15T00:16:42.972830 #678477] INFO -- : [250/885] 719809=test_ole_methods I, [2024-05-15T00:16:43.004939 #678477] INFO -- : [251/885] 719809=test_erb_m17n I, [2024-05-15T00:16:43.085523 #678477] INFO -- : [252/885] 719809=test_egrep_cpp I, [2024-05-15T00:16:43.274341 #678477] INFO -- : [253/885] 719808=test_zlib I, [2024-05-15T00:16:44.213421 #678477] INFO -- : [254/885] 719809=test_cgi_tag_helper I, [2024-05-15T00:16:44.259017 #678477] INFO -- : [255/885] 719809=test_gem_dependency_resolution_error I, [2024-05-15T00:16:44.284255 #678477] INFO -- : [256/885] 719809=test_qsort I, [2024-05-15T00:16:44.323318 #678477] INFO -- : [257/885] 719809=test_rdoc_parser I, [2024-05-15T00:16:44.500693 #678477] INFO -- : [258/885] 719809=test_custom_command I, [2024-05-15T00:16:44.662982 #678477] INFO -- : [259/885] 719809=json_addition_test I, [2024-05-15T00:16:44.714343 #678477] INFO -- : [260/885] 719809=test_x509attr I, [2024-05-15T00:16:44.759931 #678477] INFO -- : [261/885] 719809=test_raise I, [2024-05-15T00:16:44.780503 #678477] INFO -- : [262/885] 719809=test_depth_first I, [2024-05-15T00:16:44.902952 #678477] INFO -- : [263/885] 719809=test_gem_request_set_lockfile_parser I, [2024-05-15T00:16:45.748190 #678477] INFO -- : [264/885] 719809=test_rdoc_store I, [2024-05-15T00:16:51.944871 #678477] INFO -- : [265/885] 719809=test_string I, [2024-05-15T00:16:52.164945 #678477] INFO -- : [266/885] 719809=test_rdoc_stats I, [2024-05-15T00:16:52.501493 #678477] INFO -- : [267/885] 719809=test_pattern_matching I, [2024-05-15T00:16:52.694686 #678477] INFO -- : [268/885] 719809=test_pkey_ec I, [2024-05-15T00:16:53.631756 #678477] INFO -- : [269/885] 719809=test_thread I, [2024-05-15T00:16:53.722945 #678477] INFO -- : [270/885] 719809=test_trick I, [2024-05-15T00:17:02.011082 #678477] INFO -- : [271/885] 719808=test_pipe I, [2024-05-15T00:17:03.142148 #678477] INFO -- : [272/885] 719808=test_date_parse I, [2024-05-15T00:17:03.900623 #678477] INFO -- : [273/885] 719808=test_rdoc_markup_attributes I, [2024-05-15T00:17:03.970988 #678477] INFO -- : [274/885] 719808=test_default_gems I, [2024-05-15T00:17:04.405777 #678477] INFO -- : [275/885] 719808=test_rdoc_markup_to_rdoc I, [2024-05-15T00:17:04.688373 #678477] INFO -- : [276/885] 719808=test_rdoc_rd_inline_parser I, [2024-05-15T00:17:04.837795 #678477] INFO -- : [277/885] 719808=test_mul I, [2024-05-15T00:17:04.896029 #678477] INFO -- : [278/885] 719808=test_null I, [2024-05-15T00:17:04.944965 #678477] INFO -- : [279/885] 719808=test_win32ole_type I, [2024-05-15T00:17:04.965779 #678477] INFO -- : [280/885] 719808=test_gb18030 I, [2024-05-15T00:17:05.044594 #678477] INFO -- : [281/885] 719808=test_buffering I, [2024-05-15T00:17:05.179112 #678477] INFO -- : [282/885] 719808=test_svcb_https I, [2024-05-15T00:17:05.455220 #678477] INFO -- : [283/885] 719808=test_gem_uninstaller I, [2024-05-15T00:17:06.945046 #678477] INFO -- : [284/885] 719809=test_rdoc_rdoc I, [2024-05-15T00:17:07.592904 #678477] INFO -- : [285/885] 719809=test_time I, [2024-05-15T00:17:08.598202 #678477] INFO -- : [286/885] 719809=test_windows_1251 I, [2024-05-15T00:17:08.637258 #678477] INFO -- : [287/885] 719809=test_rdoc_i18n_text I, [2024-05-15T00:17:08.691230 #678477] INFO -- : [288/885] 719809=test_io_buffer I, [2024-05-15T00:17:09.061648 #678477] INFO -- : [289/885] 719809=test_key_name_check I, [2024-05-15T00:17:09.097268 #678477] INFO -- : [290/885] 719809=test_backtrace I, [2024-05-15T00:17:09.191326 #678477] INFO -- : [291/885] 719809=test_defined I, [2024-05-15T00:17:09.832978 #678477] INFO -- : [292/885] 719809=test_eval_history I, [2024-05-15T00:17:10.073518 #678477] INFO -- : [293/885] 719809=dispatcher_test I, [2024-05-15T00:17:10.228162 #678477] INFO -- : [294/885] 719809=test_kernel I, [2024-05-15T00:17:13.300449 #678477] INFO -- : [295/885] 719808=test_gem_doctor I, [2024-05-15T00:17:13.594873 #678477] INFO -- : [296/885] 719808=test_kdf I, [2024-05-15T00:17:14.186458 #678477] INFO -- : [297/885] 719808=test_gem_silent_ui I, [2024-05-15T00:17:14.437760 #678477] INFO -- : [298/885] 719808=test_emitter I, [2024-05-15T00:17:14.449412 #678477] INFO -- : [299/885] 719808=test_files_ext I, [2024-05-15T00:17:14.471454 #678477] INFO -- : [300/885] 719808=test_bug-5832 I, [2024-05-15T00:17:14.526438 #678477] INFO -- : [301/885] 719808=test_gem_ext_cargo_builder_unit I, [2024-05-15T00:17:14.631482 #678477] INFO -- : [302/885] 719809=test_gem_rdoc I, [2024-05-15T00:17:14.658162 #678477] INFO -- : [303/885] 719808=test_date I, [2024-05-15T00:17:14.746109 #678477] INFO -- : [304/885] 719808=test_at_exit I, [2024-05-15T00:17:14.823654 #678477] INFO -- : [305/885] 719808=test_command I, [2024-05-15T00:17:15.540658 #678477] INFO -- : [306/885] 719809=test_object_create_start I, [2024-05-15T00:17:15.561281 #678477] INFO -- : [307/885] 719809=test_rdoc_markup_paragraph I, [2024-05-15T00:17:15.577682 #678477] INFO -- : [308/885] 719809=!Nothing_to_test I, [2024-05-15T00:17:15.609961 #678477] INFO -- : [309/885] 719809=test_enc_raise I, [2024-05-15T00:17:15.657419 #678477] INFO -- : [310/885] 719809=test_psych I, [2024-05-15T00:17:15.949634 #678477] INFO -- : [311/885] 719809=test_gem_spec_fetcher I, [2024-05-15T00:17:16.586237 #678477] INFO -- : [312/885] 719808=test_common I, [2024-05-15T00:17:17.285914 #678477] INFO -- : [313/885] 719809=test_bug-3571 I, [2024-05-15T00:17:17.352225 #678477] INFO -- : [314/885] 719809=test_key_actor_vi I, [2024-05-15T00:17:18.270278 #678477] INFO -- : [315/885] 719809=test_gem_command I, [2024-05-15T00:17:18.529088 #678477] INFO -- : [316/885] 719808=test_gem_commands_lock_command I, [2024-05-15T00:17:18.694490 #678477] INFO -- : [317/885] 719808=test_assignment I, [2024-05-15T00:17:18.932703 #678477] INFO -- : [318/885] 719809=test_ifunless I, [2024-05-15T00:17:18.976095 #678477] INFO -- : [319/885] 719809=test_numeric I, [2024-05-15T00:17:19.545339 #678477] INFO -- : [320/885] 719809=test_rdoc_tom_doc I, [2024-05-15T00:17:19.704368 #678477] INFO -- : [321/885] 719809=test_hmac I, [2024-05-15T00:17:19.774731 #678477] INFO -- : [322/885] 719809=test_rdoc_markup_to_tt_only I, [2024-05-15T00:17:20.059734 #678477] INFO -- : [323/885] 719809=test_iter_break I, [2024-05-15T00:17:20.094764 #678477] INFO -- : [324/885] 719809=test_zsh_completion I, [2024-05-15T00:17:20.123865 #678477] INFO -- : [325/885] 719809=test_exception I, [2024-05-15T00:17:20.206900 #678477] INFO -- : [326/885] 719809=test_frozen I, [2024-05-15T00:17:20.267139 #678477] INFO -- : [327/885] 719809=test_gem_ext_configure_builder I, [2024-05-15T00:17:20.449305 #678477] INFO -- : [328/885] 719809=test_pp I, [2024-05-15T00:17:20.758601 #678477] INFO -- : [329/885] 719809=test_macro I, [2024-05-15T00:17:20.783331 #678477] INFO -- : [330/885] 719809=test_rdoc_single_class I, [2024-05-15T00:17:20.809345 #678477] INFO -- : [331/885] 719809=test_nil I, [2024-05-15T00:17:20.872648 #678477] INFO -- : [332/885] 719809=test_num2int I, [2024-05-15T00:17:20.954801 #678477] INFO -- : [333/885] 719809=test_verbose I, [2024-05-15T00:17:21.178612 #678477] INFO -- : [334/885] 719809=test_config I, [2024-05-15T00:17:21.391141 #678477] INFO -- : [335/885] 719809=test_optarg I, [2024-05-15T00:17:22.267427 #678477] INFO -- : [336/885] 719809=test_yaml_special_cases I, [2024-05-15T00:17:22.356267 #678477] INFO -- : [337/885] 719809=test_gem_source_list I, [2024-05-15T00:17:22.751821 #678477] INFO -- : [338/885] 719809=test_address_resolve I, [2024-05-15T00:17:22.828650 #678477] INFO -- : [339/885] 719809=test_rdoc_token_stream I, [2024-05-15T00:17:22.876830 #678477] INFO -- : [340/885] 719809=test_thread_fd_close I, [2024-05-15T00:17:22.902740 #678477] INFO -- : [341/885] 719809=test_passing_block I, [2024-05-15T00:17:23.045613 #678477] INFO -- : [342/885] 719809=test_stringchar I, [2024-05-15T00:17:23.597895 #678477] INFO -- : [343/885] 719809=test_hash_create I, [2024-05-15T00:17:23.638217 #678477] INFO -- : [344/885] 719809=newline_test I, [2024-05-15T00:17:24.130482 #678477] INFO -- : [345/885] 719809=test_uncorrectable_name_check I, [2024-05-15T00:17:24.178803 #678477] INFO -- : [346/885] 719809=test_switch_hitter I, [2024-05-15T00:17:24.258931 #678477] INFO -- : [347/885] 719809=test_flush I, [2024-05-15T00:17:24.304266 #678477] INFO -- : [348/885] 719809=test_singleton I, [2024-05-15T00:17:24.485435 #678477] INFO -- : [349/885] 719809=test_io_console I, [2024-05-15T00:17:28.731322 #678477] INFO -- : [350/885] 719809=test_logperiod I, [2024-05-15T00:17:28.854396 #678477] INFO -- : [351/885] 719809=test_rdoc_normal_module I, [2024-05-15T00:17:29.201975 #678477] INFO -- : [352/885] 719809=test_c_union_entity I, [2024-05-15T00:17:29.578903 #678477] INFO -- : [353/885] 719809=test_rdoc_markdown_test I, [2024-05-15T00:17:34.001615 #678477] INFO -- : [354/885] 719807=test_securerandom I, [2024-05-15T00:17:34.409066 #678477] INFO -- : [355/885] 719807=test_x509cert I, [2024-05-15T00:17:34.776451 #678477] INFO -- : [356/885] 719808=test_gc I, [2024-05-15T00:17:36.840319 #678477] INFO -- : [357/885] 719807=test_gem_resolver_lock_specification I, [2024-05-15T00:17:37.105958 #678477] INFO -- : [358/885] 719807=test_err_in_callback I, [2024-05-15T00:17:37.172697 #678477] INFO -- : [359/885] 719807=test_logdevice I, [2024-05-15T00:17:37.224116 #678477] INFO -- : [360/885] 719809=test_arity I, [2024-05-15T00:17:37.318016 #678477] INFO -- : [361/885] 719809=test_gem_ext_rake_builder I, [2024-05-15T00:17:43.369031 #678477] INFO -- : [362/885] 719807=test_gem_source_local I, [2024-05-15T00:17:43.421153 #678477] INFO -- : [363/885] 719809=test_gem_security_policy I, [2024-05-15T00:17:45.103113 #678477] INFO -- : [364/885] 719807=test_pack I, [2024-05-15T00:17:46.158698 #678477] INFO -- : [365/885] 719809=test_last_thread I, [2024-05-15T00:17:47.207700 #678477] INFO -- : [366/885] 719807=test_process I, [2024-05-15T00:17:47.247778 #678477] INFO -- : [367/885] 719809=test_rdoc_markup_attribute_manager I, [2024-05-15T00:17:47.473980 #678477] INFO -- : [368/885] 719809=test_name_error I, [2024-05-15T00:17:48.358887 #678477] INFO -- : [369/885] 719809=test_gem_resolver I, [2024-05-15T00:17:50.116340 #678477] INFO -- : [370/885] 719809=test_safe_load I, [2024-05-15T00:17:50.209752 #678477] INFO -- : [371/885] 719809=test_gem_resolver_composed_set I, [2024-05-15T00:17:50.343625 #678477] INFO -- : [372/885] 719809=test_gem_commands_dependency_command I, [2024-05-15T00:17:50.911232 #678477] INFO -- : [373/885] 719809=test_gem_commands_specification_command I, [2024-05-15T00:17:51.880798 #678477] INFO -- : [374/885] 719809=test_flags I, [2024-05-15T00:17:54.345618 #678477] INFO -- : [375/885] 719806=test_inadvertent_creation I, [2024-05-15T00:17:55.733126 #678477] INFO -- : [376/885] 719806=test_enumerator I, [2024-05-15T00:18:00.176646 #678477] INFO -- : [377/885] 719809=test_http I, [2024-05-15T00:18:00.269896 #678477] INFO -- : [378/885] 719809=test_gem_commands_which_command I, [2024-05-15T00:18:00.462076 #678477] INFO -- : [379/885] 719809=test_shift_jis I, [2024-05-15T00:18:00.477200 #678477] INFO -- : [380/885] 719809=test_require I, [2024-05-15T00:18:00.509240 #678477] INFO -- : [381/885] 719809=test_date_time I, [2024-05-15T00:18:00.593925 #678477] INFO -- : [382/885] 719809=test_rdoc_markup_to_joined_paragraph I, [2024-05-15T00:18:00.630609 #678477] INFO -- : [383/885] 719809=test_data I, [2024-05-15T00:18:00.706053 #678477] INFO -- : [384/885] 719809=test_date_new I, [2024-05-15T00:18:00.781148 #678477] INFO -- : [385/885] 719809=index_write_test I, [2024-05-15T00:18:00.921547 #678477] INFO -- : [386/885] 719809=test_syntax I, [2024-05-15T00:18:31.821035 #678477] INFO -- : [387/885] 719808=test_gem_safe_yaml I, [2024-05-15T00:18:31.931539 #678477] INFO -- : [388/885] 719808=test_rdoc_text I, [2024-05-15T00:18:32.191617 #678477] INFO -- : [389/885] 719808=test_tcp I, [2024-05-15T00:18:32.773459 #678477] INFO -- : [390/885] 719808=test_iso_8859 I, [2024-05-15T00:18:32.980812 #678477] INFO -- : [391/885] 719808=test_nil2vtempty I, [2024-05-15T00:18:33.012343 #678477] INFO -- : [392/885] 719808=test_stream I, [2024-05-15T00:18:33.228382 #678477] INFO -- : [393/885] 719808=test_rdoc_context I, [2024-05-15T00:18:40.026029 #678477] INFO -- : [394/885] 719808=test_rdoc_parser_ruby I, [2024-05-15T00:18:44.760023 #678477] INFO -- : [395/885] 719808=test_httpresponse I, [2024-05-15T00:18:45.301863 #678477] INFO -- : [396/885] 719808=test_open-uri I, [2024-05-15T00:18:46.742268 #678477] INFO -- : [397/885] 719808=test_gem_package_tar_reader_entry I, [2024-05-15T00:18:48.173693 #678477] INFO -- : [398/885] 719808=test_gem_name_tuple I, [2024-05-15T00:18:48.744568 #678477] INFO -- : [399/885] 719808=test_rand I, [2024-05-15T00:18:50.767222 #678477] INFO -- : [400/885] 719809=test_bug_reporter I, [2024-05-15T00:18:50.919759 #678477] INFO -- : [401/885] 719808=test_exception I, [2024-05-15T00:18:51.210549 #678477] INFO -- : [402/885] 719809=test_store I, [2024-05-15T00:18:52.609440 #678477] INFO -- : [403/885] 719809=test_case_options I, [2024-05-15T00:18:52.716010 #678477] INFO -- : [404/885] 719809=test_gem_commands_info_command I, [2024-05-15T00:18:52.787209 #678477] INFO -- : [405/885] 719809=test_scalar I, [2024-05-15T00:18:52.984277 #678477] INFO -- : [406/885] 719809=test_gem_dependency_installer I, [2024-05-15T00:19:10.295399 #678477] INFO -- : [407/885] 719809=test_rdoc_cross_reference I, [2024-05-15T00:19:10.396983 #678477] INFO -- : [408/885] 719808=test_gem_text I, [2024-05-15T00:19:10.789727 #678477] INFO -- : [409/885] 719808=test_settracefunc I, [2024-05-15T00:19:13.403543 #678477] INFO -- : [410/885] 719806=test_enumerator_kw I, [2024-05-15T00:19:13.416461 #678477] INFO -- : [411/885] 719806=test_scan_args I, [2024-05-15T00:19:13.547181 #678477] INFO -- : [412/885] 719806=test_win32ole I, [2024-05-15T00:19:13.568040 #678477] INFO -- : [413/885] 719806=test_generic I, [2024-05-15T00:19:13.813980 #678477] INFO -- : [414/885] 719806=test_sprintf_comb I, [2024-05-15T00:19:14.004558 #678477] INFO -- : [415/885] 719809=test_method_cache I, [2024-05-15T00:19:14.066848 #678477] INFO -- : [416/885] 719809=test_gem_request I, [2024-05-15T00:19:14.862305 #678477] INFO -- : [417/885] 719806=test_gem_ext_cargo_builder_link_flag_converter I, [2024-05-15T00:19:15.272958 #678477] INFO -- : [418/885] 719806=test_gem_commands_mirror I, [2024-05-15T00:19:15.274763 #678477] INFO -- : [419/885] 719806=test_json_tree I, [2024-05-15T00:19:15.347346 #678477] INFO -- : [420/885] 719806=test_rdoc_markup_to_markdown I, [2024-05-15T00:19:15.649142 #678477] INFO -- : [421/885] 719806=test_ansi_with_terminfo I, [2024-05-15T00:19:15.669277 #678477] INFO -- : [422/885] 719806=test_rdoc_generator_pot_po I, [2024-05-15T00:19:15.857113 #678477] INFO -- : [423/885] 719806=test_ractor I, [2024-05-15T00:19:16.144998 #678477] INFO -- : [424/885] 719806=test_m17n_comb I, [2024-05-15T00:19:16.997481 #678477] INFO -- : [425/885] 719809=test_memory_view I, [2024-05-15T00:19:17.973271 #678477] INFO -- : [426/885] 719808=test_gem_version_option I, [2024-05-15T00:19:18.234798 #678477] INFO -- : [427/885] 719809=test_grapheme_breaks I, [2024-05-15T00:19:18.261724 #678477] INFO -- : [428/885] 719808=test_gem_request_connection_pools I, [2024-05-15T00:19:18.421095 #678477] INFO -- : [429/885] 719809=test_cclass I, [2024-05-15T00:19:18.859785 #678477] INFO -- : [430/885] 719809=test_parser_events I, [2024-05-15T00:19:19.405879 #678477] INFO -- : [431/885] 719809=test_reline I, [2024-05-15T00:19:19.608583 #678477] INFO -- : [432/885] 719808=test_case I, [2024-05-15T00:19:19.904135 #678477] INFO -- : [433/885] 719808=test_pkey I, [2024-05-15T00:19:20.237957 #678477] INFO -- : [434/885] 719808=test_objectspace I, [2024-05-15T00:19:21.730185 #678477] INFO -- : [435/885] 719809=test_thread I, [2024-05-15T00:19:22.021675 #678477] INFO -- : [436/885] 719809=test_socket I, [2024-05-15T00:19:24.293837 #678477] INFO -- : [437/885] 719808=test_rdoc_markup_to_table_of_contents I, [2024-05-15T00:19:24.490142 #678477] INFO -- : [438/885] 719808=test_dot_dot I, [2024-05-15T00:19:24.599352 #678477] INFO -- : [439/885] 719808=test_c_struct_builder I, [2024-05-15T00:19:25.399538 #678477] INFO -- : [440/885] 719808=test_str2big I, [2024-05-15T00:19:25.499423 #678477] INFO -- : [441/885] 719808=test_literal I, [2024-05-15T00:19:30.897550 #678477] INFO -- : [442/885] 719808=test_extlibs I, [2024-05-15T00:19:32.133219 #678477] INFO -- : [443/885] 719809=test_rdoc_generator_ri I, [2024-05-15T00:19:32.191451 #678477] INFO -- : [444/885] 719809=test_gem_stream_ui I, [2024-05-15T00:19:32.850969 #678477] INFO -- : [445/885] 719809=test_gem_install_update_options I, [2024-05-15T00:19:34.188885 #678477] INFO -- : [446/885] 719809=parse_test I, [2024-05-15T00:19:35.717831 #678477] INFO -- : [447/885] 719806=test_require_lib I, [2024-05-15T00:19:43.885261 #678477] INFO -- : [448/885] 719808=test_ractor I, [2024-05-15T00:19:43.891169 #678477] INFO -- : [449/885] 719808=test_severity I, [2024-05-15T00:19:43.948966 #678477] INFO -- : [450/885] 719808=test_have_func I, [2024-05-15T00:19:47.852682 #678477] INFO -- : [451/885] 719807=test_stat I, [2024-05-15T00:19:47.999034 #678477] INFO -- : [452/885] 719807=test_gem_request_set_lockfile_tokenizer I, [2024-05-15T00:19:48.545073 #678477] INFO -- : [453/885] 719807=test_capacity I, [2024-05-15T00:19:48.737335 #678477] INFO -- : [454/885] 719807=test_nextafter I, [2024-05-15T00:19:50.713295 #678477] INFO -- : [455/885] 719807=test_usrmarshal I, [2024-05-15T00:19:54.026638 #678477] INFO -- : [456/885] 719807=test_object_references I, [2024-05-15T00:19:54.124762 #678477] INFO -- : [457/885] 719807=test_gem_resolver_git_specification I, [2024-05-15T00:19:57.147304 #678477] INFO -- : [458/885] 719807=test_rubyoptions I, [2024-05-15T00:20:00.388060 #678477] INFO -- : [459/885] 719809=test_super I, [2024-05-15T00:20:10.026817 #678477] INFO -- : [460/885] 719809=test_integer I, [2024-05-15T00:20:16.711613 #678477] INFO -- : [461/885] 719806=test_cgi_modruby I, [2024-05-15T00:20:17.912621 #678477] INFO -- : [462/885] 719806=test_rubygems I, [2024-05-15T00:20:19.457266 #678477] INFO -- : [463/885] 719806=test_call I, [2024-05-15T00:20:20.531774 #678477] INFO -- : [464/885] 719806=test_https_proxy I, [2024-05-15T00:20:21.555049 #678477] INFO -- : [465/885] 719806=test_gem_commands_setup_command I, [2024-05-15T00:20:29.245055 #678477] INFO -- : [466/885] 719806=test_env I, [2024-05-15T00:20:41.901520 #678477] INFO -- : [467/885] 719808=test_rdoc_attr I, [2024-05-15T00:20:41.966028 #678477] INFO -- : [468/885] 719808=test_dryrun I, [2024-05-15T00:20:42.577437 #678477] INFO -- : [469/885] 719808=test_integer I, [2024-05-15T00:20:42.770184 #678477] INFO -- : [470/885] 719808=desugar_compiler_test I, [2024-05-15T00:20:42.798120 #678477] INFO -- : [471/885] 719808=test_registry I, [2024-05-15T00:20:42.798367 #678477] INFO -- : [472/885] 719808=parse_stream_test I, [2024-05-15T00:20:42.945187 #678477] INFO -- : [473/885] 719808=test_gem I, [2024-05-15T00:20:43.017097 #678477] INFO -- : [474/885] 719809=test_gem_source_lock I, [2024-05-15T00:20:43.422254 #678477] INFO -- : [475/885] 719809=test_ractor I, [2024-05-15T00:20:43.625225 #678477] INFO -- : [476/885] 719809=test_gem_commands_open_command I, [2024-05-15T00:20:44.279786 #678477] INFO -- : [477/885] 719809=test_dns I, [2024-05-15T00:20:44.375381 #678477] INFO -- : Environment variable changed: TestGem#test_self_clear_paths : "GEM_PRIVATE_KEY_PASSPHRASE" added I, [2024-05-15T00:20:44.375742 #678477] INFO -- : Environment variable changed: TestGem#test_self_clear_paths : "GEM_SPEC_CACHE" added I, [2024-05-15T00:20:44.376103 #678477] INFO -- : Environment variable changed: TestGem#test_self_clear_paths : "HOME" changed : "/home/sipeed" -> "/tmp/rubytest.6rt4dw/test_rubygems_20240515-719808-l3kc5s/userhome" I, [2024-05-15T00:20:44.376427 #678477] INFO -- : Environment variable changed: TestGem#test_self_clear_paths : "RUBYGEMS_PREVENT_UPDATE_SUGGESTION" added I, [2024-05-15T00:20:45.128093 #678477] INFO -- : [478/885] 719809=test_cgi_core I, [2024-05-15T00:20:45.222976 #678477] INFO -- : [479/885] 719809=test_parser I, [2024-05-15T00:20:45.311161 #678477] INFO -- : [480/885] 719809=test_timeout I, [2024-05-15T00:20:47.178546 #678477] INFO -- : [481/885] 719809=test_alias I, [2024-05-15T00:20:47.308436 #678477] INFO -- : [482/885] 719807=test_nonblock I, [2024-05-15T00:20:47.490055 #678477] INFO -- : [483/885] 719807=test_weakref I, [2024-05-15T00:20:48.326327 #678477] INFO -- : [484/885] 719809=test_marshal I, [2024-05-15T00:20:48.534573 #678477] INFO -- : [485/885] 719807=test_unicode_normalize I, [2024-05-15T00:20:51.109514 #678477] INFO -- : [486/885] 719808=test_reline_key I, [2024-05-15T00:20:51.144285 #678477] INFO -- : [487/885] 719808=test_rb_str_dup I, [2024-05-15T00:20:51.173020 #678477] INFO -- : [488/885] 719808=test_ancdata I, [2024-05-15T00:20:51.205615 #678477] INFO -- : [489/885] 719808=test_singleton_function I, [2024-05-15T00:20:51.317081 #678477] INFO -- : [490/885] 719808=test_ssl I, [2024-05-15T00:20:53.188180 #678477] INFO -- : [491/885] 719806=test_debugger_integration I, [2024-05-15T00:20:53.396211 #678477] INFO -- : [492/885] 719809=test_rendering I, [2024-05-15T00:20:53.426198 #678477] INFO -- : [493/885] 719806=test_my_integer I, [2024-05-15T00:20:53.433147 #678477] INFO -- : [494/885] 719809=json_ext_parser_test I, [2024-05-15T00:20:53.465299 #678477] INFO -- : [495/885] 719806=test_thread I, [2024-05-15T00:20:53.512034 #678477] INFO -- : [496/885] 719809=test_ractor I, [2024-05-15T00:20:53.954124 #678477] INFO -- : [497/885] 719808=test_resolve_symbol I, [2024-05-15T00:20:54.410288 #678477] INFO -- : [498/885] 719808=test_complex2 I, [2024-05-15T00:20:54.588062 #678477] INFO -- : [499/885] 719808=test_gem_package I, [2024-05-15T00:20:56.298468 #678477] INFO -- : [500/885] 719809=test_have_macro I, [2024-05-15T00:20:59.176539 #678477] INFO -- : [501/885] 719808=test_gem_specification I, [2024-05-15T00:20:59.228576 #678477] INFO -- : [502/885] 719809=test_enum I, [2024-05-15T00:21:05.161074 #678477] INFO -- : [503/885] 719809=test_threadgroup I, [2024-05-15T00:21:06.207460 #678477] INFO -- : [504/885] 719809=test_bignum I, [2024-05-15T00:21:07.096940 #678477] INFO -- : [505/885] 719809=test_rdoc_class_module I, [2024-05-15T00:21:09.737974 #678477] INFO -- : [506/885] 719806=test_gem_ci_detector I, [2024-05-15T00:21:09.884646 #678477] INFO -- : Environment variable changed: TestCiDetector#test_ci_strings : "GEM_PRIVATE_KEY_PASSPHRASE" added I, [2024-05-15T00:21:09.885569 #678477] INFO -- : Environment variable changed: TestCiDetector#test_ci_strings : "GEM_SPEC_CACHE" added I, [2024-05-15T00:21:09.886503 #678477] INFO -- : Environment variable changed: TestCiDetector#test_ci_strings : "HOME" changed : "/home/sipeed" -> "/tmp/rubytest.6rt4dw/test_rubygems_20240515-719806-pgzdqf/userhome" I, [2024-05-15T00:21:09.887441 #678477] INFO -- : Environment variable changed: TestCiDetector#test_ci_strings : "RUBYGEMS_PREVENT_UPDATE_SUGGESTION" added I, [2024-05-15T00:21:10.051990 #678477] INFO -- : Environment variable changed: TestCiDetector#test_ci? : "GEM_SPEC_CACHE" changed : "/tmp/rubytest.6rt4dw/test_rubygems_20240515-719806-pgzdqf/spec_cache" -> "/tmp/rubytest.6rt4dw/test_rubygems_20240515-719806-uj7uwq/spec_cache" I, [2024-05-15T00:21:10.053025 #678477] INFO -- : Environment variable changed: TestCiDetector#test_ci? : "HOME" changed : "/tmp/rubytest.6rt4dw/test_rubygems_20240515-719806-pgzdqf/userhome" -> "/tmp/rubytest.6rt4dw/test_rubygems_20240515-719806-uj7uwq/userhome" I, [2024-05-15T00:21:10.200994 #678477] INFO -- : [507/885] 719806=test_arity I, [2024-05-15T00:21:10.263767 #678477] INFO -- : [508/885] 719806=test_stringio I, [2024-05-15T00:21:10.903602 #678477] INFO -- : [509/885] 719806=test_io_wait_uncommon I, [2024-05-15T00:21:10.954248 #678477] INFO -- : [510/885] 719806=test_win32ole_variable I, [2024-05-15T00:21:10.972443 #678477] INFO -- : [511/885] 719806=ractor_test I, [2024-05-15T00:21:11.413199 #678477] INFO -- : [512/885] 719809=test_trace I, [2024-05-15T00:21:11.455138 #678477] INFO -- : [513/885] 719806=test_win32ole_event I, [2024-05-15T00:21:11.476073 #678477] INFO -- : [514/885] 719806=test_time_tz I, [2024-05-15T00:21:11.565877 #678477] INFO -- : [515/885] 719809=test_rdoc_generator_json_index I, [2024-05-15T00:21:11.739347 #678477] INFO -- : [516/885] 719809=test_gem_resolver_api_specification I, [2024-05-15T00:21:12.036551 #678477] INFO -- : [517/885] 719809=test_win32ole_variant I, [2024-05-15T00:21:12.099443 #678477] INFO -- : [518/885] 719809=test_history I, [2024-05-15T00:21:12.191269 #678477] INFO -- : [519/885] 719809=test_mixed_unicode_escapes I, [2024-05-15T00:21:12.220304 #678477] INFO -- : [520/885] 719806=test_rdoc_markup_to_ansi I, [2024-05-15T00:21:12.232313 #678477] INFO -- : [521/885] 719809=test_ipaddr I, [2024-05-15T00:21:12.384595 #678477] INFO -- : [522/885] 719809=test_rdoc_extend I, [2024-05-15T00:21:12.554074 #678477] INFO -- : [523/885] 719809=test_merge_keys I, [2024-05-15T00:21:12.576917 #678477] INFO -- : [524/885] 719806=test_rdoc_comment I, [2024-05-15T00:21:12.616571 #678477] INFO -- : [525/885] 719809=test_resize I, [2024-05-15T00:21:12.668278 #678477] INFO -- : [526/885] 719809=test_error_highlight I, [2024-05-15T00:21:13.078257 #678477] INFO -- : [527/885] 719806=test_rdoc_generator_darkfish I, [2024-05-15T00:21:15.069985 #678477] INFO -- : [528/885] 719806=test_http_request I, [2024-05-15T00:21:15.121009 #678477] INFO -- : [529/885] 719806=test_gem_source_fetch_problem I, [2024-05-15T00:21:15.165386 #678477] INFO -- : [530/885] 719806=json_generic_object_test I, [2024-05-15T00:21:15.244735 #678477] INFO -- : [531/885] 719806=location_test I, [2024-05-15T00:21:15.741269 #678477] INFO -- : [532/885] 719806=test_symbol I, [2024-05-15T00:21:15.776598 #678477] INFO -- : [533/885] 719806=test_coderange I, [2024-05-15T00:21:15.810205 #678477] INFO -- : [534/885] 719806=test_mailto I, [2024-05-15T00:21:15.861531 #678477] INFO -- : [535/885] 719806=format_errors_test I, [2024-05-15T00:21:15.919055 #678477] INFO -- : [536/885] 719806=test_dir I, [2024-05-15T00:21:16.678684 #678477] INFO -- : [537/885] 719808=test_date_ractor I, [2024-05-15T00:21:17.194472 #678477] INFO -- : [538/885] 719809=test_gem_console_ui I, [2024-05-15T00:21:17.225536 #678477] INFO -- : [539/885] 719809=test_eval I, [2024-05-15T00:21:17.254437 #678477] INFO -- : [540/885] 719809=test_autoconf I, [2024-05-15T00:21:17.397597 #678477] INFO -- : [541/885] 719809=test_ractor_compatibility I, [2024-05-15T00:21:17.914378 #678477] INFO -- : [542/885] 719806=test_member I, [2024-05-15T00:21:17.964825 #678477] INFO -- : [543/885] 719806=test_numeric I, [2024-05-15T00:21:17.978349 #678477] INFO -- : [544/885] 719807=test_cgi_multipart I, [2024-05-15T00:21:18.008470 #678477] INFO -- : [545/885] 719806=test_word I, [2024-05-15T00:21:18.075189 #678477] INFO -- : [546/885] 719806=test_gem_commands_cleanup_command I, [2024-05-15T00:21:18.498385 #678477] INFO -- : [547/885] 719807=test_find_executable I, [2024-05-15T00:21:18.542392 #678477] INFO -- : [548/885] 719807=ruby_api_test I, [2024-05-15T00:21:18.643810 #678477] INFO -- : [549/885] 719808=test_context I, [2024-05-15T00:21:19.495730 #678477] INFO -- : [550/885] 719808=test_gem_commands_pristine_command I, [2024-05-15T00:21:19.677604 #678477] INFO -- : [551/885] 719807=test_nofree I, [2024-05-15T00:21:19.683411 #678477] INFO -- : [552/885] 719807=test_coder I, [2024-05-15T00:21:19.859821 #678477] INFO -- : [553/885] 719807=test_symbol I, [2024-05-15T00:21:20.284315 #678477] INFO -- : [554/885] 719809=test_unix I, [2024-05-15T00:21:20.473185 #678477] INFO -- : [555/885] 719809=test_lazy_enumerator I, [2024-05-15T00:21:22.105826 #678477] INFO -- : [556/885] 719806=test_enc_associate I, [2024-05-15T00:21:23.635461 #678477] INFO -- : [557/885] 719809=test_pkcs7 I, [2024-05-15T00:21:25.407238 #678477] INFO -- : [558/885] 719809=test_arith_seq_beg_len_step I, [2024-05-15T00:21:25.569409 #678477] INFO -- : [559/885] 719806=test_gem_resolver_requirement_list I, [2024-05-15T00:21:25.581151 #678477] INFO -- : [560/885] 719806=test_function_entry I, [2024-05-15T00:21:25.591628 #678477] INFO -- : [561/885] 719806=test_continuation I, [2024-05-15T00:21:25.634128 #678477] INFO -- : [562/885] 719806=test_fd_setsize I, [2024-05-15T00:21:25.676509 #678477] INFO -- : [563/885] 719806=test_class_name_check I, [2024-05-15T00:21:25.822612 #678477] INFO -- : [564/885] 719806=test_keyword I, [2024-05-15T00:21:25.926730 #678477] INFO -- : [565/885] 719809=test_delete I, [2024-05-15T00:21:25.967316 #678477] INFO -- : [566/885] 719809=test_win32ole_method I, [2024-05-15T00:21:25.990429 #678477] INFO -- : [567/885] 719809=test_rdoc_markup_hard_break I, [2024-05-15T00:21:26.024602 #678477] INFO -- : [568/885] 719809=test_gem_package_task I, [2024-05-15T00:21:26.071339 #678477] INFO -- : [569/885] 719809=test_date_strptime I, [2024-05-15T00:21:27.228871 #678477] INFO -- : [570/885] 719809=test_placearg I, [2024-05-15T00:21:27.761066 #678477] INFO -- : [571/885] 719809=test_gem_platform I, [2024-05-15T00:21:28.642765 #678477] INFO -- : [572/885] 719809=test_pkey_rsa I, [2024-05-15T00:21:29.831278 #678477] INFO -- : [573/885] 719808=test_numhash I, [2024-05-15T00:21:29.855223 #678477] INFO -- : [574/885] 719808=test_gem_commands_push_command I, [2024-05-15T00:21:30.012904 #678477] INFO -- : [575/885] 719806=test_weakkeymap I, [2024-05-15T00:21:31.374946 #678477] INFO -- : [576/885] 719809=test_rdoc_parser_markdown I, [2024-05-15T00:21:31.460124 #678477] INFO -- : [577/885] 719809=test_import I, [2024-05-15T00:21:32.629754 #678477] INFO -- : [578/885] 719808=test_gem_resolver_lock_set I, [2024-05-15T00:21:32.676381 #678477] INFO -- : [579/885] 719806=test_not I, [2024-05-15T00:21:32.742494 #678477] INFO -- : [580/885] 719806=test_logger I, [2024-05-15T00:21:32.746261 #678477] INFO -- : [581/885] 719808=test_gem_update_suggestion I, [2024-05-15T00:21:32.753604 #678477] INFO -- : [582/885] 719808=test_files_test I, [2024-05-15T00:21:32.774130 #678477] INFO -- : [583/885] 719808=test_file_exhaustive I, [2024-05-15T00:21:32.941598 #678477] INFO -- : [584/885] 719806=test_arithmetic_sequence I, [2024-05-15T00:21:33.160118 #678477] INFO -- : [585/885] 719806=test_key_actor_emacs I, [2024-05-15T00:21:34.275458 #678477] INFO -- : [586/885] 719806=test_gem_command_manager I, [2024-05-15T00:21:35.205326 #678477] INFO -- : [587/885] 719806=test_basicinstructions I, [2024-05-15T00:21:35.885287 #678477] INFO -- : [588/885] 719806=test_gem_gemcutter_utilities I, [2024-05-15T00:21:37.197444 #678477] INFO -- : [589/885] 719806=version_test I, [2024-05-15T00:21:37.224760 #678477] INFO -- : [590/885] 719806=test_cgi_header I, [2024-05-15T00:21:37.261776 #678477] INFO -- : [591/885] 719806=heredoc_dedent_test I, [2024-05-15T00:21:37.327817 #678477] INFO -- : [592/885] 719806=test_object I, [2024-05-15T00:21:37.374262 #678477] INFO -- : [593/885] 719806=test_rdoc_rd_block_parser I, [2024-05-15T00:21:37.573090 #678477] INFO -- : [594/885] 719806=test_tsort I, [2024-05-15T00:21:37.641593 #678477] INFO -- : [595/885] 719806=test_signedness I, [2024-05-15T00:21:40.196278 #678477] INFO -- : [596/885] 719809=test_type I, [2024-05-15T00:21:40.719081 #678477] INFO -- : [597/885] 719809=test_ractor I, [2024-05-15T00:21:40.916495 #678477] INFO -- : [598/885] 719809=test_pointer I, [2024-05-15T00:21:43.924679 #678477] INFO -- : [599/885] 719807=test_func I, [2024-05-15T00:21:46.143417 #678477] INFO -- : [600/885] 719809=test_big5 I, [2024-05-15T00:21:46.209595 #678477] INFO -- : [601/885] 719809=test_gem_local_remote_options I, [2024-05-15T00:21:46.514347 #678477] INFO -- : [602/885] 719809=test_date_arith I, [2024-05-15T00:21:46.598730 #678477] INFO -- : [603/885] 719809=test_ruby_lex I, [2024-05-15T00:21:47.865793 #678477] INFO -- : [604/885] 719809=test_object I, [2024-05-15T00:21:51.282387 #678477] INFO -- : [605/885] 719809=test_sleep I, [2024-05-15T00:21:55.714599 #678477] INFO -- : [606/885] 719809=test_flip I, [2024-05-15T00:21:56.037432 #678477] INFO -- : [607/885] 719809=compiler_test I, [2024-05-15T00:21:56.196091 #678477] INFO -- : [608/885] 719809=test_change_word I, [2024-05-15T00:21:56.354958 #678477] INFO -- : [609/885] 719809=test_ossl I, [2024-05-15T00:21:58.488888 #678477] INFO -- : [610/885] 719806=test_normalize I, [2024-05-15T00:21:58.522174 #678477] INFO -- : [611/885] 719806=test_timeout I, [2024-05-15T00:21:58.565383 #678477] INFO -- : [612/885] 719806=static_inspect_test I, [2024-05-15T00:21:58.694817 #678477] INFO -- : [613/885] 719806=unescape_test I, [2024-05-15T00:21:59.445124 #678477] INFO -- : [614/885] 719808=test_ostruct I, [2024-05-15T00:21:59.498920 #678477] INFO -- : [615/885] 719807=test_file I, [2024-05-15T00:22:00.599288 #678477] INFO -- : [616/885] 719808=test_force_exit I, [2024-05-15T00:22:00.652759 #678477] INFO -- : [617/885] 719808=test_data_error I, [2024-05-15T00:22:01.249639 #678477] INFO -- : [618/885] 719808=bom_test I, [2024-05-15T00:22:01.305473 #678477] INFO -- : [619/885] 719808=test_udp I, [2024-05-15T00:22:01.326913 #678477] INFO -- : [620/885] 719808=test_vm_dump I, [2024-05-15T00:22:01.542721 #678477] INFO -- : [621/885] 719808=test_integer_comb I, [2024-05-15T00:22:06.218994 #678477] INFO -- : [622/885] 719807=test_rdoc_markup_document I, [2024-05-15T00:22:06.326549 #678477] INFO -- : [623/885] 719807=test_tmpdir I, [2024-05-15T00:22:07.040978 #678477] INFO -- : [624/885] 719807=test_gem_commands_check_command I, [2024-05-15T00:22:07.329450 #678477] INFO -- : [625/885] 719807=test_regexp I, [2024-05-15T00:22:14.962953 #678477] INFO -- : [626/885] 719809=errors_test I, [2024-05-15T00:22:15.526031 #678477] INFO -- : [627/885] 719809=test_ts I, [2024-05-15T00:22:17.218321 #678477] INFO -- : [628/885] 719806=library_symbols_test I, [2024-05-15T00:22:17.247648 #678477] INFO -- : [629/885] 719806=test_locale I, [2024-05-15T00:22:17.421270 #678477] INFO -- : [630/885] 719806=test_addr I, [2024-05-15T00:22:17.578396 #678477] INFO -- : [631/885] 719806=test_ensured I, [2024-05-15T00:22:17.971536 #678477] INFO -- : [632/885] 719806=test_rdoc_ri_paths I, [2024-05-15T00:22:18.297877 #678477] INFO -- : [633/885] 719806=test_constant I, [2024-05-15T00:22:20.509213 #678477] INFO -- : [634/885] 719809=test_dup I, [2024-05-15T00:22:22.553335 #678477] INFO -- : [635/885] 719809=test_pty I, [2024-05-15T00:22:24.642772 #678477] INFO -- : [636/885] 719809=command_line_test I, [2024-05-15T00:22:24.745346 #678477] INFO -- : [637/885] 719809=test_range I, [2024-05-15T00:22:25.567057 #678477] INFO -- : [638/885] 719808=test_project_sanity I, [2024-05-15T00:22:25.724860 #678477] INFO -- : [639/885] 719808=test_gem_uri_formatter I, [2024-05-15T00:22:25.827229 #678477] INFO -- : [640/885] 719808=test_encoding I, [2024-05-15T00:22:27.569634 #678477] INFO -- : [641/885] 719808=test_helper I, [2024-05-15T00:22:27.706753 #678477] INFO -- : [642/885] 719808=test_erb_command I, [2024-05-15T00:22:27.863388 #678477] INFO -- : [643/885] 719808=test_eval I, [2024-05-15T00:22:29.927196 #678477] INFO -- : [644/885] 719808=json_generator_test I, [2024-05-15T00:22:30.818076 #678477] INFO -- : [645/885] 719808=test_transcode I, [2024-05-15T00:22:32.088939 #678477] INFO -- : [646/885] 719809=test_gem_safe_marshal I, [2024-05-15T00:22:32.539652 #678477] INFO -- : [647/885] 719808=test_gem_resolver_api_set I, [2024-05-15T00:22:33.109418 #678477] INFO -- : [648/885] 719808=test_gem_resolver_vendor_set I, [2024-05-15T00:22:33.293085 #678477] INFO -- : [649/885] 719808=test_config I, [2024-05-15T00:22:36.751565 #678477] INFO -- : [650/885] 719809=test_enumerable I, [2024-05-15T00:22:36.853956 #678477] INFO -- : [651/885] 719809=test_webauthn_listener I, [2024-05-15T00:22:36.866554 #678477] INFO -- : Leaked file descriptor: WebauthnListenerTest#test_wait_for_otp_code_get_follows_options: 11 : # I, [2024-05-15T00:22:36.945511 #678477] INFO -- : COMMAND PID USER FD TYPE DEVICE SIZE/OFF NODE NAME I, [2024-05-15T00:22:36.945795 #678477] INFO -- : ruby 719809 sipeed 11u IPv4 2554562 0t0 TCP localhost:43905->localhost:53184 (CLOSE_WAIT) I, [2024-05-15T00:22:37.462224 #678477] INFO -- : [652/885] 719808=test_gem_request_set_gem_dependency_api I, [2024-05-15T00:22:37.493056 #678477] INFO -- : [653/885] 719806=test_ast I, [2024-05-15T00:22:37.528090 #678477] INFO -- : [654/885] 719809=test_lambda I, [2024-05-15T00:22:38.072471 #678477] INFO -- : [655/885] 719809=test_jaro_winkler I, [2024-05-15T00:22:38.108096 #678477] INFO -- : [656/885] 719809=test_random_formatter I, [2024-05-15T00:22:38.253147 #678477] INFO -- : [657/885] 719809=test_helper I, [2024-05-15T00:22:38.272733 #678477] INFO -- : [658/885] 719809=test_fips I, [2024-05-15T00:22:38.293944 #678477] INFO -- : Closed file descriptor: OpenSSL::TestFIPS#test_fips_mode_get_is_true_on_fips_mode_enabled: 11 I, [2024-05-15T00:22:39.446619 #678477] INFO -- : [659/885] 719808=test_x509name I, [2024-05-15T00:22:39.521170 #678477] INFO -- : [660/885] 719808=test_update I, [2024-05-15T00:22:39.605414 #678477] INFO -- : [661/885] 719808=test_rdoc_code_object I, [2024-05-15T00:22:41.326832 #678477] INFO -- : [662/885] 719809=test_x509store I, [2024-05-15T00:22:42.935426 #678477] INFO -- : [663/885] 719808=test_option I, [2024-05-15T00:22:43.897499 #678477] INFO -- : [664/885] 719808=test_append I, [2024-05-15T00:22:43.927526 #678477] INFO -- : [665/885] 719808=test_tracer I, [2024-05-15T00:22:43.951042 #678477] INFO -- : [666/885] 719808=test_cmethod I, [2024-05-15T00:22:43.978418 #678477] INFO -- : [667/885] 719808=test_did_you_mean I, [2024-05-15T00:22:44.331570 #678477] INFO -- : [668/885] 719809=test_io_m17n I, [2024-05-15T00:22:44.447059 #678477] INFO -- : [669/885] 719808=test_variable_name_check I, [2024-05-15T00:22:45.132163 #678477] INFO -- : [670/885] 719808=test_gem_commands_server_command I, [2024-05-15T00:22:45.294741 #678477] INFO -- : [671/885] 719808=test_case_comprehensive I, [2024-05-15T00:22:54.062103 #678477] INFO -- : [672/885] 719809=test_interned_str I, [2024-05-15T00:22:54.375967 #678477] INFO -- : [673/885] 719809=test_gem_commands_build_command I, [2024-05-15T00:22:56.132197 #678477] INFO -- : [674/885] 719809=test_scheduler I, [2024-05-15T00:22:56.650603 #678477] INFO -- : [675/885] 719809=test_ocsp I, [2024-05-15T00:22:59.599388 #678477] INFO -- : [676/885] 719809=test_class I, [2024-05-15T00:22:59.695760 #678477] INFO -- : [677/885] 719809=test_pkey_dsa I, [2024-05-15T00:23:07.335562 #678477] INFO -- : [678/885] 719809=test_exception_at_throwing I, [2024-05-15T00:23:07.957769 #678477] INFO -- : [679/885] 719809=test_iseq I, [2024-05-15T00:23:12.005161 #678477] INFO -- : [680/885] 719809=test_rdoc_markup_heading I, [2024-05-15T00:23:12.133593 #678477] INFO -- : [681/885] 719809=test_pinned I, [2024-05-15T00:23:12.451508 #678477] INFO -- : [682/885] 719809=test_printf I, [2024-05-15T00:23:12.570241 #678477] INFO -- : [683/885] 719809=test_rdoc_markup_pre_process I, [2024-05-15T00:23:13.260866 #678477] INFO -- : [684/885] 719809=test_stream I, [2024-05-15T00:23:14.790455 #678477] INFO -- : [685/885] 719809=test_to_ary_concat I, [2024-05-15T00:23:33.330573 #678477] INFO -- : [686/885] 719809=test_webauthn_listener_response I, [2024-05-15T00:23:33.485001 #678477] INFO -- : [687/885] 719809=test_time I, [2024-05-15T00:23:34.881694 #678477] INFO -- : [688/885] 719809=test_beginendblock I, [2024-05-15T00:23:37.553975 #678477] INFO -- : [689/885] 719809=test_files_lib I, [2024-05-15T00:23:38.121907 #678477] INFO -- : [690/885] 719809=test_gem_commands_unpack_command I, [2024-05-15T00:23:40.158560 #678477] INFO -- : [691/885] 719809=test_help I, [2024-05-15T00:23:40.196882 #678477] INFO -- : [692/885] 719809=test_rdoc_markup_to_bs I, [2024-05-15T00:23:40.456024 #678477] INFO -- : [693/885] 719809=test_within_pipe I, [2024-05-15T00:23:40.625091 #678477] INFO -- : [694/885] 719809=test_emoji_breaks I, [2024-05-15T00:23:40.672351 #678477] INFO -- : [695/885] 719809=test_gem_bundler_version_finder I, [2024-05-15T00:23:40.898895 #678477] INFO -- : [696/885] 719809=reflection_test I, [2024-05-15T00:23:41.416669 #678477] INFO -- : [697/885] 719809=test_open3 I, [2024-05-15T00:24:02.705737 #678477] INFO -- : [698/885] 719809=test_multi_irb_commands I, [2024-05-15T00:24:02.830012 #678477] INFO -- : [699/885] 719809=test_fiber I, [2024-05-15T00:24:11.637847 #678477] INFO -- : [700/885] 719807=test_closure I, [2024-05-15T00:24:15.732183 #678477] INFO -- : [701/885] 719807=test_bundled_ca I, [2024-05-15T00:24:16.885628 #678477] INFO -- : [702/885] 719809=test_digest I, [2024-05-15T00:24:16.921623 #678477] INFO -- : [703/885] 719809=test_rdoc_servlet I, [2024-05-15T00:24:17.766346 #678477] INFO -- : [704/885] 719809=test_gem_security I, [2024-05-15T00:24:18.610935 #678477] INFO -- : [705/885] 719807=test_ractor I, [2024-05-15T00:24:18.642050 #678477] INFO -- : [706/885] 719807=test_recursion I, [2024-05-15T00:24:18.687414 #678477] INFO -- : [707/885] 719807=test_exit I, [2024-05-15T00:24:19.237602 #678477] INFO -- : [708/885] 719807=test_popen_deadlock I, [2024-05-15T00:24:23.397037 #678477] INFO -- : [709/885] 719807=test_delegate I, [2024-05-15T00:24:23.529914 #678477] INFO -- : [710/885] 719807=test_mkmf I, [2024-05-15T00:24:23.766203 #678477] INFO -- : [711/885] 719807=test_date_marshal I, [2024-05-15T00:24:23.799277 #678477] INFO -- : [712/885] 719807=test_history I, [2024-05-15T00:24:24.177821 #678477] INFO -- : [713/885] 719807=test_rdoc_i18n_locale I, [2024-05-15T00:24:24.217576 #678477] INFO -- : [714/885] 719807=test_chilled I, [2024-05-15T00:24:24.283013 #678477] INFO -- : [715/885] 719807=test_name_error_extension I, [2024-05-15T00:24:24.347805 #678477] INFO -- : [716/885] 719807=test_acceptable I, [2024-05-15T00:24:25.083539 #678477] INFO -- : [717/885] 719807=test_euc_jp I, [2024-05-15T00:24:25.117884 #678477] INFO -- : [718/885] 719807=test_rdoc_generator_pot_po_entry I, [2024-05-15T00:24:25.187476 #678477] INFO -- : [719/885] 719807=test_document I, [2024-05-15T00:24:25.601199 #678477] INFO -- : [720/885] 719807=test_pair I, [2024-05-15T00:24:46.820483 #678477] INFO -- : [721/885] 719807=test_win32ole_param I, [2024-05-15T00:24:46.910667 #678477] INFO -- : [722/885] 719807=test_gem_commands_yank_command I, [2024-05-15T00:24:47.931971 #678477] INFO -- : [723/885] 719807=test_rbconfig I, [2024-05-15T00:24:47.985007 #678477] INFO -- : [724/885] 719807=test_primitive I, [2024-05-15T00:24:48.073617 #678477] INFO -- : [725/885] 719807=test_human_typo I, [2024-05-15T00:24:48.130702 #678477] INFO -- : [726/885] 719807=test_key_stroke I, [2024-05-15T00:24:48.189865 #678477] INFO -- : [727/885] 719807=json_encoding_test I, [2024-05-15T00:24:48.259279 #678477] INFO -- : [728/885] 719807=test_color I, [2024-05-15T00:24:48.669368 #678477] INFO -- : [729/885] 719807=test_sockopt I, [2024-05-15T00:24:48.702468 #678477] INFO -- : [730/885] 719807=test_rdoc_markup_to_label I, [2024-05-15T00:24:49.693022 #678477] INFO -- : [731/885] 719807=test_install I, [2024-05-15T00:24:50.355792 #678477] INFO -- : [732/885] 719807=test_rdoc_ri_driver I, [2024-05-15T00:24:52.511078 #678477] INFO -- : [733/885] 719807=test_httpheader I, [2024-05-15T00:24:52.793600 #678477] INFO -- : [734/885] 719807=test_gem_resolver_local_specification I, [2024-05-15T00:24:52.883603 #678477] INFO -- : [735/885] 719807=test_set_len I, [2024-05-15T00:24:52.906985 #678477] INFO -- : [736/885] 719807=test_httpresponses I, [2024-05-15T00:24:52.963789 #678477] INFO -- : [737/885] 719807=test_encoding I, [2024-05-15T00:24:53.071975 #678477] INFO -- : [738/885] 719807=test_tree_spell_checker I, [2024-05-15T00:24:53.439340 #678477] INFO -- : [739/885] 719807=test_addrinfo I, [2024-05-15T00:24:53.644820 #678477] INFO -- : [740/885] 719807=test_http I, [2024-05-15T00:25:08.711697 #678477] INFO -- : [741/885] 719807=test_win32ole_param_event I, [2024-05-15T00:25:08.774604 #678477] INFO -- : [742/885] 719807=test_bn I, [2024-05-15T00:25:08.884240 #678477] INFO -- : [743/885] 719807=redundant_return_test I, [2024-05-15T00:25:08.944277 #678477] INFO -- : [744/885] 719807=test_case_mapping I, [2024-05-15T00:25:09.007627 #678477] INFO -- : [745/885] 719807=test_path I, [2024-05-15T00:25:09.108404 #678477] INFO -- : [746/885] 719807=test_terminfo I, [2024-05-15T00:25:09.187504 #678477] INFO -- : [747/885] 719807=test_compile_prism I, [2024-05-15T00:25:11.460745 #678477] INFO -- : [748/885] 719807=test_bug-14834 I, [2024-05-15T00:25:12.105758 #678477] INFO -- : [749/885] 719807=test_rdoc_markup_to_html I, [2024-05-15T00:25:12.696993 #678477] INFO -- : [750/885] 719807=test_date_compat I, [2024-05-15T00:25:12.750252 #678477] INFO -- : [751/885] 719807=test_gem_resolver_vendor_specification I, [2024-05-15T00:25:13.108794 #678477] INFO -- : [752/885] 719807=test_gem_commands_update_command I, [2024-05-15T00:25:20.168537 #678477] INFO -- : [753/885] 719807=test_notimplement I, [2024-05-15T00:25:20.207230 #678477] INFO -- : [754/885] 719807=test_random I, [2024-05-15T00:25:20.310527 #678477] INFO -- : [755/885] 719807=test_gem_uri I, [2024-05-15T00:25:20.456791 #678477] INFO -- : [756/885] 719807=test_key_event_record I, [2024-05-15T00:25:21.324454 #678477] INFO -- : [757/885] 719807=test_ssl_session I, [2024-05-15T00:25:24.712244 #678477] INFO -- : [758/885] 719809=test_lexer I, [2024-05-15T00:25:24.836753 #678477] INFO -- : [759/885] 719809=test_thread_cv I, [2024-05-15T00:25:24.888502 #678477] INFO -- : [760/885] 719807=test_rdoc_generator_pot I, [2024-05-15T00:25:24.918284 #678477] INFO -- : [761/885] 719807=test_unicode I, [2024-05-15T00:25:24.986360 #678477] INFO -- : [762/885] 719807=test_rdoc_parser_changelog I, [2024-05-15T00:25:25.514136 #678477] INFO -- : [763/885] 719807=test_enumerator I, [2024-05-15T00:25:25.520085 #678477] INFO -- : [764/885] 719807=test_koi8 I, [2024-05-15T00:25:25.585477 #678477] INFO -- : [765/885] 719807=parameters_signature_test I, [2024-05-15T00:25:25.592427 #678477] INFO -- : [766/885] 719809=test_rdoc_method_attr I, [2024-05-15T00:25:25.683037 #678477] INFO -- : [767/885] 719807=static_literals_test I, [2024-05-15T00:25:25.704552 #678477] INFO -- : [768/885] 719807=test_data I, [2024-05-15T00:25:25.728144 #678477] INFO -- : [769/885] 719807=test_filter I, [2024-05-15T00:25:25.933200 #678477] INFO -- : [770/885] 719807=test_gem_gem_runner I, [2024-05-15T00:25:26.277378 #678477] INFO -- : [771/885] 719807=test_parser I, [2024-05-15T00:25:26.430704 #678477] INFO -- : [772/885] 719807=test_method_name_check I, [2024-05-15T00:25:26.672875 #678477] INFO -- : [773/885] 719807=test_arith_seq_extract I, [2024-05-15T00:25:26.999447 #678477] INFO -- : [774/885] 719809=test_gem_request_set I, [2024-05-15T00:25:27.972537 #678477] INFO -- : [775/885] 719807=test_module I, [2024-05-15T00:25:29.644410 #678477] INFO -- : [776/885] 719809=test_ssl I, [2024-05-15T00:25:44.842452 #678477] INFO -- : [777/885] 719807=test_gem_ext_cargo_builder I, [2024-05-15T00:25:45.038048 #678477] INFO -- : [778/885] 719807=constant_path_node_test I, [2024-05-15T00:25:45.052177 #678477] INFO -- : [779/885] 719807=test_stringify_symbols I, [2024-05-15T00:25:45.134151 #678477] INFO -- : [780/885] 719807=integer_parse_test I, [2024-05-15T00:25:45.175085 #678477] INFO -- : [781/885] 719807=test_instrumentation_api I, [2024-05-15T00:25:49.160330 #678477] INFO -- : [782/885] 719807=test_boolean I, [2024-05-15T00:25:49.219690 #678477] INFO -- : [783/885] 719807=test_rdoc_generator_markup I, [2024-05-15T00:25:49.275710 #678477] INFO -- : [784/885] 719807=test_whileuntil I, [2024-05-15T00:25:49.303069 #678477] INFO -- : [785/885] 719807=test_monitor I, [2024-05-15T00:25:49.585442 #678477] INFO -- : [786/885] 719807=test_buffered_io I, [2024-05-15T00:25:49.636775 #678477] INFO -- : [787/885] 719807=test_rubyvm I, [2024-05-15T00:25:49.668298 #678477] INFO -- : [788/885] 719807=test_configuration I, [2024-05-15T00:25:50.332995 #678477] INFO -- : [789/885] 719807=test_evaluation I, [2024-05-15T00:25:50.424065 #678477] INFO -- : [790/885] 719807=test_gem_ext_builder I, [2024-05-15T00:25:57.909962 #678477] INFO -- : [791/885] 719807=test_https I, [2024-05-15T00:25:59.170704 #678477] INFO -- : [792/885] 719807=test_load I, [2024-05-15T00:25:59.209332 #678477] INFO -- : [793/885] 719807=test_yamldbm I, [2024-05-15T00:25:59.292748 #678477] INFO -- : [794/885] 719807=test_gem_commands_rebuild_command I, [2024-05-15T00:25:59.655444 #678477] INFO -- : [795/885] 719807=test_rdoc_parser_simple I, [2024-05-15T00:25:59.864390 #678477] INFO -- : [796/885] 719807=test_provider I, [2024-05-15T00:26:03.801148 #678477] INFO -- : [797/885] 719807=test_abi I, [2024-05-15T00:26:04.818064 #678477] INFO -- : [798/885] 719807=test_array I, [2024-05-15T00:26:08.550837 #678477] INFO -- : [799/885] 719808=test_helper_method I, [2024-05-15T00:26:08.587112 #678477] INFO -- : [800/885] 719808=test_gem_package_tar_writer I, [2024-05-15T00:26:09.714057 #678477] INFO -- : [801/885] 719808=test_gem_commands_outdated_command I, [2024-05-15T00:26:09.979692 #678477] INFO -- : [802/885] 719808=test_scalar_scanner I, [2024-05-15T00:26:10.065446 #678477] INFO -- : [803/885] 719808=test_gem_source I, [2024-05-15T00:26:11.936154 #678477] INFO -- : [804/885] 719808=test_nesting_parser I, [2024-05-15T00:26:12.058074 #678477] INFO -- : [805/885] 719808=test_win32ole_method_event I, [2024-05-15T00:26:12.113006 #678477] INFO -- : [806/885] 719808=test_benchmark I, [2024-05-15T00:26:15.152140 #678477] INFO -- : [807/885] 719808=test_gem_dependency_list I, [2024-05-15T00:26:15.640238 #678477] INFO -- : [808/885] 719808=test_propertyputref I, [2024-05-15T00:26:15.657656 #678477] INFO -- : [809/885] 719808=attribute_write_test I, [2024-05-15T00:26:15.725219 #678477] INFO -- : [810/885] 719808=test_spell_checker I, [2024-05-15T00:26:15.791518 #678477] INFO -- : [811/885] 719808=test_assembler I, [2024-05-15T00:26:15.878372 #678477] INFO -- : [812/885] 719808=test_rational2 I, [2024-05-15T00:26:15.940428 #678477] INFO -- : [813/885] 719808=test_rational I, [2024-05-15T00:26:16.142677 #678477] INFO -- : [814/885] 719808=test_gem_commands_cert_command I, [2024-05-15T00:26:17.029934 #678477] INFO -- : [815/885] 719809=test_completion I, [2024-05-15T00:26:22.129162 #678477] INFO -- : [816/885] 719809=test_yield_block I, [2024-05-15T00:26:22.157645 #678477] INFO -- : [817/885] 719809=test_len I, [2024-05-15T00:26:22.207935 #678477] INFO -- : [818/885] 719809=test_gem_source_installed I, [2024-05-15T00:26:22.254295 #678477] INFO -- : [819/885] 719809=test_erb I, [2024-05-15T00:26:22.678801 #678477] INFO -- : [820/885] 719809=test_x509ext I, [2024-05-15T00:26:22.759784 #678477] INFO -- : [821/885] 719809=test_input_method I, [2024-05-15T00:26:23.067598 #678477] INFO -- : [822/885] 719809=test_windows_1252 I, [2024-05-15T00:26:23.190042 #678477] INFO -- : [823/885] 719809=test_process I, [2024-05-15T00:26:23.303622 #678477] INFO -- : [824/885] 719809=test_x509crl I, [2024-05-15T00:26:24.860563 #678477] INFO -- : [825/885] 719809=test_fixnum I, [2024-05-15T00:26:25.282907 #678477] INFO -- : [826/885] 719809=test_signal I, [2024-05-15T00:26:28.937737 #678477] INFO -- : [827/885] 719808=test_rdoc_top_level I, [2024-05-15T00:26:30.367181 #678477] INFO -- : [828/885] 719809=test_metaclass I, [2024-05-15T00:26:30.388772 #678477] INFO -- : [829/885] 719809=test_rdoc_rd I, [2024-05-15T00:26:30.406305 #678477] INFO -- : [830/885] 719809=test_cgi_session I, [2024-05-15T00:26:30.547412 #678477] INFO -- : [831/885] 719809=test_gem_resolver_installer_set I, [2024-05-15T00:26:31.234038 #678477] INFO -- : [832/885] 719808=test_dir_m17n I, [2024-05-15T00:26:32.216292 #678477] INFO -- : [833/885] 719809=test_gem_source_git I, [2024-05-15T00:26:35.441831 #678477] INFO -- : [834/885] 719809=test_regex_casefold I, [2024-05-15T00:26:39.607055 #678477] INFO -- : [835/885] 719809=test_gem_commands_signout_command I, [2024-05-15T00:26:39.720775 #678477] INFO -- : [836/885] 719809=test_refinement I, [2024-05-15T00:26:42.313280 #678477] INFO -- : [837/885] 719808=test_require I, [2024-05-15T00:27:02.139711 #678477] INFO -- : [838/885] 719808=test_cgi_cookie I, [2024-05-15T00:27:02.348555 #678477] INFO -- : [839/885] 719808=test_float I, [2024-05-15T00:27:05.813509 #678477] INFO -- : [840/885] 719809=test_storage I, [2024-05-15T00:27:06.101415 #678477] INFO -- : [841/885] 719809=test_gem_resolver_git_set I, [2024-05-15T00:27:07.937026 #678477] INFO -- : [842/885] 719808=test_gem_security_signer I, [2024-05-15T00:27:07.992762 #678477] INFO -- : [843/885] 719809=test_cipher I, [2024-05-15T00:27:08.423656 #678477] INFO -- : [844/885] 719809=test_new I, [2024-05-15T00:27:08.467379 #678477] INFO -- : [845/885] 719809=test_shellwords I, [2024-05-15T00:27:08.505362 #678477] INFO -- : [846/885] 719809=test_memory_view I, [2024-05-15T00:27:08.649596 #678477] INFO -- : [847/885] 719809=pattern_test I, [2024-05-15T00:27:08.730629 #678477] INFO -- : [848/885] 719809=test_debug I, [2024-05-15T00:27:08.760487 #678477] INFO -- : [849/885] 719808=test_omap I, [2024-05-15T00:27:08.762825 #678477] INFO -- : [850/885] 719809=test_iterator I, [2024-05-15T00:27:08.810645 #678477] INFO -- : [851/885] 719808=test_string I, [2024-05-15T00:27:08.817883 #678477] INFO -- : [852/885] 719808=test_digest_extend I, [2024-05-15T00:27:08.995023 #678477] INFO -- : [853/885] 719808=test_variable I, [2024-05-15T00:27:09.246054 #678477] INFO -- : [854/885] 719807=fuzzer_test I, [2024-05-15T00:27:09.305987 #678477] INFO -- : [855/885] 719809=test_rdoc_markup_include I, [2024-05-15T00:27:09.330538 #678477] INFO -- : [856/885] 719809=test_sexp I, [2024-05-15T00:27:09.350408 #678477] INFO -- : [857/885] 719807=magic_comment_test I, [2024-05-15T00:27:09.450537 #678477] INFO -- : [858/885] 719807=test_rdoc_markup_to_html_snippet I, [2024-05-15T00:27:09.504621 #678477] INFO -- : [859/885] 719809=test_struct I, [2024-05-15T00:27:09.526997 #678477] INFO -- : [860/885] 719809=test_cparser I, [2024-05-15T00:27:09.705460 #678477] INFO -- : [861/885] 719808=test_pkg_config I, [2024-05-15T00:27:09.754411 #678477] INFO -- : [862/885] 719808=test_config I, [2024-05-15T00:27:10.085287 #678477] INFO -- : [863/885] 719808=test_nomethod_error I, [2024-05-15T00:27:10.122408 #678477] INFO -- : [864/885] 719808=json_parser_test I, [2024-05-15T00:27:10.186219 #678477] INFO -- : [865/885] 719807=memsize_test I, [2024-05-15T00:27:10.210249 #678477] INFO -- : [866/885] 719807=json_common_interface_test I, [2024-05-15T00:27:10.323863 #678477] INFO -- : [867/885] 719807=test_dln I, [2024-05-15T00:27:10.397984 #678477] INFO -- : [868/885] 719807=test_gem_source_subpath_problem I, [2024-05-15T00:27:10.518503 #678477] INFO -- : [869/885] 719808=test_win32ole_variant_outarg I, [2024-05-15T00:27:10.558542 #678477] INFO -- : [870/885] 719808=test_rdoc_rd_inline I, [2024-05-15T00:27:10.590320 #678477] INFO -- : [871/885] 719808=test_mutex I, [2024-05-15T00:27:11.318639 #678477] INFO -- : [872/885] 719807=test_x509req I, [2024-05-15T00:27:11.868750 #678477] INFO -- : [873/885] 719808=test_struct I, [2024-05-15T00:27:12.955653 #678477] INFO -- : [874/885] 719807=test_gem_path_support I, [2024-05-15T00:27:13.138385 #678477] INFO -- : [875/885] 719807=test_set I, [2024-05-15T00:27:13.522656 #678477] INFO -- : [876/885] 719807=test_files_test_1 I, [2024-05-15T00:27:17.069380 #678477] INFO -- : [877/885] 719809=test_deprecated I, [2024-05-15T00:27:17.111543 #678477] INFO -- : [878/885] 719809=test_color_printer I, [2024-05-15T00:27:17.136554 #678477] INFO -- : [879/885] 719809=test_insns_leaf I, [2024-05-15T00:27:17.162575 #678477] INFO -- : [880/885] 719809=test_serialize_subclasses I, [2024-05-15T00:27:17.189129 #678477] INFO -- : [881/885] 719809=test_key_error I, [2024-05-15T00:27:17.225305 #678477] INFO -- : [882/885] 719809=test_div I, [2024-05-15T00:27:17.683224 #678477] INFO -- : [883/885] 719809=test_allocation I, [2024-05-15T00:27:18.517046 #678477] INFO -- : [884/885] 719808=test_engine I, [2024-05-15T00:27:18.640748 #678477] INFO -- : [885/885] 719808=test_win32ole_variant_m I, [2024-05-15T00:28:21.732740 #678477] INFO -- : Finished tests in 879.252099s, 29.9414 tests/s, 10629.8433 assertions/s. E, [2024-05-15T00:28:21.735049 #678477] ERROR -- : Children under /tmp/rubytest.6rt4dw: E, [2024-05-15T00:28:21.736862 #678477] ERROR -- : * drwx------ 4 80 2024-05-15 00:25:59 +0000 gem_rebuild20240515-719807-996dbg/ E, [2024-05-15T00:28:21.737958 #678477] ERROR -- : * drwxr-xr-x 2 60 2024-05-15 00:25:59 +0000 new/ E, [2024-05-15T00:28:21.738848 #678477] ERROR -- : * -rw-r--r-- 1 4096 2024-05-15 00:25:59 +0000 rebuild_test_gem-1.0.0.gem E, [2024-05-15T00:28:21.739843 #678477] ERROR -- : * drwxr-xr-x 2 60 2024-05-15 00:25:59 +0000 old/ E, [2024-05-15T00:28:21.740892 #678477] ERROR -- : * -rw-r--r-- 1 4096 2024-05-15 00:25:59 +0000 rebuild_test_gem-1.0.0.gem I, [2024-05-15T00:28:21.755040 #678477] INFO -- : 26326 tests, 9346312 assertions, 0 failures, 0 errors, 324 skips I, [2024-05-15T00:28:21.755240 #678477] INFO -- : I, [2024-05-15T00:28:21.755342 #678477] INFO -- : ruby -v: ruby 3.4.0dev (2024-05-14T21:44:34Z master e3e1e53098) [riscv64-linux] I, [2024-05-15T00:28:21.765514 #678477] INFO -- : $$$[end] "make yes-test-all TESTOPTS='--stderr-on-failure' TESTS='-j4'" exit with 0. I, [2024-05-15T00:28:21.766414 #678477] INFO -- : $$$[beg] make yes-test-rubyspec MSPECOPT='--error-output stderr --debug -j' TESTS='-j4' I, [2024-05-15T00:28:22.598939 #678477] INFO -- : BASERUBY = /usr/bin/ruby --disable=gems I, [2024-05-15T00:28:22.599151 #678477] INFO -- : CC = gcc I, [2024-05-15T00:28:22.599272 #678477] INFO -- : LD = ld I, [2024-05-15T00:28:22.599378 #678477] INFO -- : LDSHARED = gcc -shared I, [2024-05-15T00:28:22.599475 #678477] INFO -- : CFLAGS = -O3 -fno-fast-math -ggdb3 -Wall -Wextra -Wdeprecated-declarations -Wdiv-by-zero -Wduplicated-cond -Wimplicit-function-declaration -Wimplicit-int -Wpointer-arith -Wwrite-strings -Wold-style-definition -Wimplicit-fallthrough=0 -Wmissing-noreturn -Wno-cast-function-type -Wno-constant-logical-operand -Wno-long-long -Wno-missing-field-initializers -Wno-overlength-strings -Wno-packed-bitfield-compat -Wno-parentheses-equality -Wno-self-assign -Wno-tautological-compare -Wno-unused-parameter -Wno-unused-value -Wsuggest-attribute=format -Wsuggest-attribute=noreturn -Wunused-variable -Wmisleading-indentation -Wundef -fPIC I, [2024-05-15T00:28:22.599573 #678477] INFO -- : XCFLAGS = -U_FORTIFY_SOURCE -D_FORTIFY_SOURCE=2 -fstack-protector-strong -fno-strict-overflow -fvisibility=hidden -fexcess-precision=standard -DRUBY_EXPORT -I. -I.ext/include/riscv64-linux -I/tmp/ruby/src/trunk/include -I/tmp/ruby/src/trunk -I/tmp/ruby/src/trunk/prism -I/tmp/ruby/src/trunk/enc/unicode/15.0.0 I, [2024-05-15T00:28:22.599662 #678477] INFO -- : CPPFLAGS = I, [2024-05-15T00:28:22.599759 #678477] INFO -- : DLDFLAGS = -Wl,--compress-debug-sections=zlib -Wl,-soname,libruby.so.3.4 -fstack-protector-strong I, [2024-05-15T00:28:22.599852 #678477] INFO -- : SOLIBS = -lz -lrt -lrt -lgmp -ldl -lcrypt -lm -lpthread I, [2024-05-15T00:28:22.600048 #678477] INFO -- : LANG = I, [2024-05-15T00:28:22.600171 #678477] INFO -- : LC_ALL = I, [2024-05-15T00:28:22.600280 #678477] INFO -- : LC_CTYPE = I, [2024-05-15T00:28:22.600376 #678477] INFO -- : MFLAGS = I, [2024-05-15T00:28:22.600485 #678477] INFO -- : RUSTC = rustc I, [2024-05-15T00:28:22.600616 #678477] INFO -- : YJIT_RUSTC_ARGS = --crate-name=yjit --crate-type=staticlib --edition=2021 -g -C lto=thin -C opt-level=3 -C overflow-checks=on '--out-dir=/tmp/ruby/build/trunk/yjit/target/release/' /tmp/ruby/src/trunk/yjit/src/lib.rs I, [2024-05-15T00:28:22.602994 #678477] INFO -- : gcc (Debian 13.2.0-4revyos1) 13.2.0 I, [2024-05-15T00:28:22.603168 #678477] INFO -- : Copyright (C) 2023 Free Software Foundation, Inc. I, [2024-05-15T00:28:22.603253 #678477] INFO -- : This is free software; see the source for copying conditions. There is NO I, [2024-05-15T00:28:22.603341 #678477] INFO -- : warranty; not even for MERCHANTABILITY or FITNESS FOR A PARTICULAR PURPOSE. I, [2024-05-15T00:28:22.603425 #678477] INFO -- : I, [2024-05-15T00:28:22.620192 #678477] INFO -- : generating enc.mk I, [2024-05-15T00:28:24.098127 #678477] INFO -- : making enc I, [2024-05-15T00:28:24.261435 #678477] INFO -- : make[1]: Entering directory '/tmp/ruby/build/trunk' I, [2024-05-15T00:28:24.261696 #678477] INFO -- : make[1]: Nothing to be done for 'enc'. I, [2024-05-15T00:28:24.261810 #678477] INFO -- : make[1]: Leaving directory '/tmp/ruby/build/trunk' I, [2024-05-15T00:28:24.264215 #678477] INFO -- : making srcs under enc I, [2024-05-15T00:28:24.556709 #678477] INFO -- : make[1]: Entering directory '/tmp/ruby/build/trunk' I, [2024-05-15T00:28:24.556987 #678477] INFO -- : make[1]: Nothing to be done for 'srcs'. I, [2024-05-15T00:28:24.557208 #678477] INFO -- : make[1]: Leaving directory '/tmp/ruby/build/trunk' I, [2024-05-15T00:28:24.562443 #678477] INFO -- : generating transdb.h I, [2024-05-15T00:28:25.986567 #678477] INFO -- : transdb.h unchanged I, [2024-05-15T00:28:25.992486 #678477] INFO -- : making trans I, [2024-05-15T00:28:26.329833 #678477] INFO -- : make[1]: Entering directory '/tmp/ruby/build/trunk' I, [2024-05-15T00:28:26.330112 #678477] INFO -- : make[1]: Nothing to be done for 'trans'. I, [2024-05-15T00:28:26.330327 #678477] INFO -- : make[1]: Leaving directory '/tmp/ruby/build/trunk' I, [2024-05-15T00:28:26.333325 #678477] INFO -- : making encs I, [2024-05-15T00:28:26.715674 #678477] INFO -- : make[1]: Entering directory '/tmp/ruby/build/trunk' I, [2024-05-15T00:28:26.715984 #678477] INFO -- : make[1]: Nothing to be done for 'encs'. I, [2024-05-15T00:28:26.716204 #678477] INFO -- : make[1]: Leaving directory '/tmp/ruby/build/trunk' I, [2024-05-15T00:28:26.734064 #678477] INFO -- : generating makefiles ext/configure-ext.mk I, [2024-05-15T00:28:26.936898 #678477] INFO -- : ext/configure-ext.mk updated I, [2024-05-15T00:28:26.950383 #678477] INFO -- : make[1]: Entering directory '/tmp/ruby/build/trunk' I, [2024-05-15T00:28:38.984418 #678477] INFO -- : make[1]: Leaving directory '/tmp/ruby/build/trunk' I, [2024-05-15T00:28:38.986706 #678477] INFO -- : generating makefile exts.mk I, [2024-05-15T00:28:39.309146 #678477] INFO -- : exts.mk unchanged I, [2024-05-15T00:28:39.345759 #678477] INFO -- : make[1]: Entering directory '/tmp/ruby/build/trunk' I, [2024-05-15T00:28:41.534837 #678477] INFO -- : make[2]: Entering directory '/tmp/ruby/build/trunk/ext/coverage' I, [2024-05-15T00:28:41.560056 #678477] INFO -- : make[2]: Leaving directory '/tmp/ruby/build/trunk/ext/coverage' I, [2024-05-15T00:28:41.608406 #678477] INFO -- : make[2]: Entering directory '/tmp/ruby/build/trunk/ext/date' I, [2024-05-15T00:28:41.637350 #678477] INFO -- : make[2]: Leaving directory '/tmp/ruby/build/trunk/ext/date' I, [2024-05-15T00:28:41.662944 #678477] INFO -- : make[2]: Entering directory '/tmp/ruby/build/trunk/ext/digest' I, [2024-05-15T00:28:41.720151 #678477] INFO -- : make[2]: Leaving directory '/tmp/ruby/build/trunk/ext/digest' I, [2024-05-15T00:28:41.891598 #678477] INFO -- : make[2]: Entering directory '/tmp/ruby/build/trunk/ext/digest/sha2' I, [2024-05-15T00:28:41.918628 #678477] INFO -- : make[2]: Leaving directory '/tmp/ruby/build/trunk/ext/digest/sha2' I, [2024-05-15T00:28:42.047776 #678477] INFO -- : make[2]: Entering directory '/tmp/ruby/build/trunk/ext/fiddle' I, [2024-05-15T00:28:42.120192 #678477] INFO -- : make[2]: Leaving directory '/tmp/ruby/build/trunk/ext/fiddle' I, [2024-05-15T00:28:42.151543 #678477] INFO -- : make[2]: Entering directory '/tmp/ruby/build/trunk/ext/io/console' I, [2024-05-15T00:28:42.172581 #678477] INFO -- : make[2]: Leaving directory '/tmp/ruby/build/trunk/ext/io/console' I, [2024-05-15T00:28:42.260091 #678477] INFO -- : make[2]: Entering directory '/tmp/ruby/build/trunk/ext/json' I, [2024-05-15T00:28:42.330652 #678477] INFO -- : make[2]: Leaving directory '/tmp/ruby/build/trunk/ext/json' I, [2024-05-15T00:28:42.424569 #678477] INFO -- : make[2]: Entering directory '/tmp/ruby/build/trunk/ext/monitor' I, [2024-05-15T00:28:42.446437 #678477] INFO -- : make[2]: Leaving directory '/tmp/ruby/build/trunk/ext/monitor' I, [2024-05-15T00:28:42.498094 #678477] INFO -- : make[2]: Entering directory '/tmp/ruby/build/trunk/ext/objspace' I, [2024-05-15T00:28:42.531757 #678477] INFO -- : make[2]: Leaving directory '/tmp/ruby/build/trunk/ext/objspace' I, [2024-05-15T00:28:42.649485 #678477] INFO -- : make[2]: Entering directory '/tmp/ruby/build/trunk/ext/openssl' I, [2024-05-15T00:28:42.791093 #678477] INFO -- : make[2]: Leaving directory '/tmp/ruby/build/trunk/ext/openssl' I, [2024-05-15T00:28:42.823031 #678477] INFO -- : make[2]: Entering directory '/tmp/ruby/build/trunk/ext/pathname' I, [2024-05-15T00:28:42.842493 #678477] INFO -- : make[2]: Leaving directory '/tmp/ruby/build/trunk/ext/pathname' I, [2024-05-15T00:28:42.895879 #678477] INFO -- : make[2]: Entering directory '/tmp/ruby/build/trunk/ext/psych' I, [2024-05-15T00:28:43.059705 #678477] INFO -- : make[2]: Leaving directory '/tmp/ruby/build/trunk/ext/psych' I, [2024-05-15T00:28:43.092526 #678477] INFO -- : make[2]: Entering directory '/tmp/ruby/build/trunk/ext/pty' I, [2024-05-15T00:28:43.122302 #678477] INFO -- : make[2]: Leaving directory '/tmp/ruby/build/trunk/ext/pty' I, [2024-05-15T00:28:43.226861 #678477] INFO -- : make[2]: Entering directory '/tmp/ruby/build/trunk/ext/ripper' I, [2024-05-15T00:28:43.283154 #678477] INFO -- : make[2]: Leaving directory '/tmp/ruby/build/trunk/ext/ripper' I, [2024-05-15T00:28:43.299955 #678477] INFO -- : make[2]: Entering directory '/tmp/ruby/build/trunk/ext/rubyvm' I, [2024-05-15T00:28:43.317359 #678477] INFO -- : make[2]: Leaving directory '/tmp/ruby/build/trunk/ext/rubyvm' I, [2024-05-15T00:28:43.397658 #678477] INFO -- : make[2]: Entering directory '/tmp/ruby/build/trunk/ext/socket' I, [2024-05-15T00:28:43.458365 #678477] INFO -- : make[2]: Leaving directory '/tmp/ruby/build/trunk/ext/socket' I, [2024-05-15T00:28:43.577815 #678477] INFO -- : make[2]: Entering directory '/tmp/ruby/build/trunk/.bundle/gems/bigdecimal-3.1.8/ext/bigdecimal' I, [2024-05-15T00:28:43.733041 #678477] INFO -- : make[2]: Leaving directory '/tmp/ruby/build/trunk/.bundle/gems/bigdecimal-3.1.8/ext/bigdecimal' I, [2024-05-15T00:28:43.751411 #678477] INFO -- : make[2]: Entering directory '/tmp/ruby/build/trunk/.bundle/gems/debug-1.9.2/ext/debug' I, [2024-05-15T00:28:43.912074 #678477] INFO -- : make[2]: Leaving directory '/tmp/ruby/build/trunk/.bundle/gems/debug-1.9.2/ext/debug' I, [2024-05-15T00:28:43.929439 #678477] INFO -- : make[2]: Entering directory '/tmp/ruby/build/trunk/.bundle/gems/nkf-0.2.0/ext/nkf' I, [2024-05-15T00:28:44.085350 #678477] INFO -- : make[2]: Leaving directory '/tmp/ruby/build/trunk/.bundle/gems/nkf-0.2.0/ext/nkf' I, [2024-05-15T00:28:44.103231 #678477] INFO -- : make[2]: Entering directory '/tmp/ruby/build/trunk/.bundle/gems/racc-1.7.3/ext/racc/cparse' I, [2024-05-15T00:28:44.260799 #678477] INFO -- : make[2]: Leaving directory '/tmp/ruby/build/trunk/.bundle/gems/racc-1.7.3/ext/racc/cparse' I, [2024-05-15T00:28:44.283171 #678477] INFO -- : make[2]: Entering directory '/tmp/ruby/build/trunk/.bundle/gems/rbs-3.4.4/ext/rbs_extension' I, [2024-05-15T00:28:44.436047 #678477] INFO -- : make[2]: Leaving directory '/tmp/ruby/build/trunk/.bundle/gems/rbs-3.4.4/ext/rbs_extension' I, [2024-05-15T00:28:44.453374 #678477] INFO -- : make[2]: Entering directory '/tmp/ruby/build/trunk/.bundle/gems/syslog-0.1.2/ext/syslog' I, [2024-05-15T00:28:44.608798 #678477] INFO -- : make[2]: Leaving directory '/tmp/ruby/build/trunk/.bundle/gems/syslog-0.1.2/ext/syslog' I, [2024-05-15T00:28:44.838447 #678477] INFO -- : make[2]: Entering directory '/tmp/ruby/build/trunk' I, [2024-05-15T00:28:45.476415 #678477] INFO -- : make[2]: 'ruby' is up to date. I, [2024-05-15T00:28:45.476635 #678477] INFO -- : make[2]: Leaving directory '/tmp/ruby/build/trunk' I, [2024-05-15T00:28:45.478444 #678477] INFO -- : make[1]: Leaving directory '/tmp/ruby/build/trunk' I, [2024-05-15T00:28:45.511404 #678477] INFO -- : make[1]: Entering directory '/tmp/ruby/build/trunk' I, [2024-05-15T00:28:45.511632 #678477] INFO -- : make[1]: Nothing to be done for 'note'. I, [2024-05-15T00:28:45.511757 #678477] INFO -- : make[1]: Leaving directory '/tmp/ruby/build/trunk' E, [2024-05-15T00:28:46.062089 #678477] ERROR -- : $ /tmp/ruby/build/trunk/miniruby -I/tmp/ruby/src/trunk/lib /tmp/ruby/src/trunk/tool/runruby.rb --archdir=/tmp/ruby/build/trunk --extout=.ext -- /tmp/ruby/src/trunk/spec/mspec/bin/mspec-run -B /tmp/ruby/src/trunk/spec/default.mspec --error-output stderr --debug -fy -o /tmp/rubytest.5vbqiy/1-mspec-multi-0 E, [2024-05-15T00:28:46.063175 #678477] ERROR -- : $ /tmp/ruby/build/trunk/miniruby -I/tmp/ruby/src/trunk/lib /tmp/ruby/src/trunk/tool/runruby.rb --archdir=/tmp/ruby/build/trunk --extout=.ext -- /tmp/ruby/src/trunk/spec/mspec/bin/mspec-run -B /tmp/ruby/src/trunk/spec/default.mspec --error-output stderr --debug -fy -o /tmp/rubytest.5vbqiy/2-mspec-multi-1 E, [2024-05-15T00:28:46.064257 #678477] ERROR -- : $ /tmp/ruby/build/trunk/miniruby -I/tmp/ruby/src/trunk/lib /tmp/ruby/src/trunk/tool/runruby.rb --archdir=/tmp/ruby/build/trunk --extout=.ext -- /tmp/ruby/src/trunk/spec/mspec/bin/mspec-run -B /tmp/ruby/src/trunk/spec/default.mspec --error-output stderr --debug -fy -o /tmp/rubytest.5vbqiy/3-mspec-multi-2 E, [2024-05-15T00:28:46.065338 #678477] ERROR -- : $ /tmp/ruby/build/trunk/miniruby -I/tmp/ruby/src/trunk/lib /tmp/ruby/src/trunk/tool/runruby.rb --archdir=/tmp/ruby/build/trunk --extout=.ext -- /tmp/ruby/src/trunk/spec/mspec/bin/mspec-run -B /tmp/ruby/src/trunk/spec/default.mspec --error-output stderr --debug -fy -o /tmp/rubytest.5vbqiy/4-mspec-multi-3 I, [2024-05-15T00:28:47.080089 #678477] INFO -- : ruby 3.4.0dev (2024-05-14T21:44:34Z master e3e1e53098) [riscv64-linux] I, [2024-05-15T00:29:19.122273 #678477] INFO -- : 0 ......................................................................... I, [2024-05-15T00:29:30.070243 #678477] INFO -- : 73 ......................................................................... I, [2024-05-15T00:29:31.311594 #678477] INFO -- : 146 ......................................................................... I, [2024-05-15T00:29:33.120770 #678477] INFO -- : 219 ......................................................................... I, [2024-05-15T00:29:33.841005 #678477] INFO -- : 292 ......................................................................... I, [2024-05-15T00:29:34.941862 #678477] INFO -- : 365 ......................................................................... I, [2024-05-15T00:29:35.680079 #678477] INFO -- : 438 ......................................................................... I, [2024-05-15T00:29:36.027260 #678477] INFO -- : 511 ......................................................................... I, [2024-05-15T00:29:36.364824 #678477] INFO -- : 584 ......................................................................... I, [2024-05-15T00:29:39.413057 #678477] INFO -- : 657 ......................................................................... I, [2024-05-15T00:29:39.938533 #678477] INFO -- : 730 ......................................................................... I, [2024-05-15T00:29:40.214759 #678477] INFO -- : 803 ......................................................................... I, [2024-05-15T00:29:41.245618 #678477] INFO -- : 876 ......................................................................... I, [2024-05-15T00:29:41.848340 #678477] INFO -- : 949 ......................................................................... I, [2024-05-15T00:29:44.680278 #678477] INFO -- : 1022 ......................................................................... I, [2024-05-15T00:29:56.449125 #678477] INFO -- : 1095 ......................................................................... I, [2024-05-15T00:30:01.799526 #678477] INFO -- : 1168 ......................................................................... I, [2024-05-15T00:30:02.851127 #678477] INFO -- : 1241 ......................................................................... I, [2024-05-15T00:30:03.952506 #678477] INFO -- : 1314 ......................................................................... I, [2024-05-15T00:30:04.309934 #678477] INFO -- : 1387 ......................................................................... I, [2024-05-15T00:30:10.379324 #678477] INFO -- : 1460 ......................................................................... I, [2024-05-15T00:30:27.400652 #678477] INFO -- : 1533 ......................................................................... I, [2024-05-15T00:30:29.756049 #678477] INFO -- : 1606 ......................................................................... I, [2024-05-15T00:30:33.025969 #678477] INFO -- : 1679 ......................................................................... I, [2024-05-15T00:30:35.192893 #678477] INFO -- : 1752 ......................................................................... I, [2024-05-15T00:30:37.416644 #678477] INFO -- : 1825 ......................................................................... I, [2024-05-15T00:30:39.583180 #678477] INFO -- : 1898 ......................................................................... I, [2024-05-15T00:30:41.322411 #678477] INFO -- : 1971 ......................................................................... I, [2024-05-15T00:30:43.420020 #678477] INFO -- : 2044 ......................................................................... I, [2024-05-15T00:30:44.867810 #678477] INFO -- : 2117 ......................................................................... I, [2024-05-15T00:30:45.329071 #678477] INFO -- : 2190 ......................................................................... I, [2024-05-15T00:30:45.595209 #678477] INFO -- : 2263 ......................................................................... I, [2024-05-15T00:30:45.876671 #678477] INFO -- : 2336 ......................................................................... I, [2024-05-15T00:30:46.369075 #678477] INFO -- : 2409 ......................................................................... I, [2024-05-15T00:30:47.597536 #678477] INFO -- : 2482 ......................................................................... I, [2024-05-15T00:30:48.354168 #678477] INFO -- : 2555 ......................................................................... I, [2024-05-15T00:30:51.407354 #678477] INFO -- : 2628 ......................................................................... I, [2024-05-15T00:30:53.262372 #678477] INFO -- : 2701 ......................................................................... I, [2024-05-15T00:30:53.967774 #678477] INFO -- : 2774 ......................................................................... I, [2024-05-15T00:30:55.328076 #678477] INFO -- : 2847 ......................................................................... I, [2024-05-15T00:30:56.500037 #678477] INFO -- : 2920 ......................................................................... I, [2024-05-15T00:30:57.320643 #678477] INFO -- : 2993 ......................................................................... I, [2024-05-15T00:30:57.766281 #678477] INFO -- : 3066 ......................................................................... I, [2024-05-15T00:30:58.050406 #678477] INFO -- : 3139 ......................................................................... I, [2024-05-15T00:30:58.415180 #678477] INFO -- : 3212 ......................................................................... I, [2024-05-15T00:30:58.955636 #678477] INFO -- : 3285 ......................................................................... I, [2024-05-15T00:31:05.356852 #678477] INFO -- : 3358 ........................................................................ I, [2024-05-15T00:31:05.357090 #678477] INFO -- : I, [2024-05-15T00:31:05.357198 #678477] INFO -- : Finished in 139.295697 seconds I, [2024-05-15T00:31:05.357297 #678477] INFO -- : I, [2024-05-15T00:31:05.357406 #678477] INFO -- : 3429 files, 32608 examples, 133158 expectations, 0 failures, 0 errors, 0 tagged I, [2024-05-15T00:31:05.370590 #678477] INFO -- : $$$[end] "make yes-test-rubyspec MSPECOPT='--error-output stderr --debug -j' TESTS='-j4'" exit with 0.