# Logfile created on 2024-05-14 22:52:56 +0000 by logger.rb/v1.4.3 I, [2024-05-14T22:52:56.904367 #2230357] INFO -- : #, @formatter=nil, @logdev=#, @binmode=false, @mon_data=#, @mon_data_owner_object_id=860>>> I, [2024-05-14T22:52:56.904489 #2230357] INFO -- : $$$[beg] make update-unicode -j20 I, [2024-05-14T22:52:56.967038 #2230357] INFO -- : Downloading Unicode emoji 15.0 files... I, [2024-05-14T22:52:56.967333 #2230357] INFO -- : Downloading Unicode emoji 15.0 files... I, [2024-05-14T22:52:56.967877 #2230357] INFO -- : Downloading Unicode emoji 15.0 files... I, [2024-05-14T22:52:57.013630 #2230357] INFO -- : made symlink emoji/15.0/emoji-sequences.txt to /tmp/ruby/src/trunk/.downloaded-cache/emoji/15.0/emoji-sequences.txt I, [2024-05-14T22:52:57.014578 #2230357] INFO -- : downloading emoji/15.0/emoji-sequences.txt ... downloading emoji/15.0/emoji-test.txt ... /tmp/ruby/src/trunk/enc/unicode/data/emoji/15.0/emoji-sequences.txt already exists E, [2024-05-14T22:52:57.455292 #2230357] ERROR -- : /tmp/ruby/src/trunk/tool/downloader.rb:302:in `rescue in download': failed to download emoji/15.0/emoji-test.txt (RuntimeError) E, [2024-05-14T22:52:57.455444 #2230357] ERROR -- : OpenURI::HTTPError: 403 Forbidden: https://www.unicode.org/Public/emoji/15.0/emoji-test.txt E, [2024-05-14T22:52:57.455467 #2230357] ERROR -- : from /tmp/ruby/src/trunk/tool/downloader.rb:201:in `download' E, [2024-05-14T22:52:57.455482 #2230357] ERROR -- : from /tmp/ruby/src/trunk/tool/downloader.rb:136:in `download' E, [2024-05-14T22:52:57.455496 #2230357] ERROR -- : from /tmp/ruby/src/trunk/tool/downloader.rb:482:in `block in
' E, [2024-05-14T22:52:57.455509 #2230357] ERROR -- : from /tmp/ruby/src/trunk/tool/downloader.rb:465:in `each' E, [2024-05-14T22:52:57.455524 #2230357] ERROR -- : from /tmp/ruby/src/trunk/tool/downloader.rb:465:in `
' E, [2024-05-14T22:52:57.455538 #2230357] ERROR -- : /usr/lib/ruby/3.0.0/open-uri.rb:364:in `open_http': 403 Forbidden (OpenURI::HTTPError) E, [2024-05-14T22:52:57.455551 #2230357] ERROR -- : from /usr/lib/ruby/3.0.0/open-uri.rb:741:in `buffer_open' E, [2024-05-14T22:52:57.455568 #2230357] ERROR -- : from /usr/lib/ruby/3.0.0/open-uri.rb:212:in `block in open_loop' E, [2024-05-14T22:52:57.455581 #2230357] ERROR -- : from /usr/lib/ruby/3.0.0/open-uri.rb:210:in `catch' E, [2024-05-14T22:52:57.455594 #2230357] ERROR -- : from /usr/lib/ruby/3.0.0/open-uri.rb:210:in `open_loop' E, [2024-05-14T22:52:57.455607 #2230357] ERROR -- : from /usr/lib/ruby/3.0.0/open-uri.rb:151:in `open_uri' E, [2024-05-14T22:52:57.455619 #2230357] ERROR -- : from /usr/lib/ruby/3.0.0/open-uri.rb:721:in `open' E, [2024-05-14T22:52:57.455633 #2230357] ERROR -- : from /usr/lib/ruby/3.0.0/open-uri.rb:729:in `read' E, [2024-05-14T22:52:57.455645 #2230357] ERROR -- : from /tmp/ruby/src/trunk/tool/downloader.rb:247:in `block in download' E, [2024-05-14T22:52:57.455676 #2230357] ERROR -- : from /tmp/ruby/src/trunk/tool/downloader.rb:378:in `with_retry' E, [2024-05-14T22:52:57.455725 #2230357] ERROR -- : from /tmp/ruby/src/trunk/tool/downloader.rb:246:in `download' E, [2024-05-14T22:52:57.455744 #2230357] ERROR -- : from /tmp/ruby/src/trunk/tool/downloader.rb:136:in `download' E, [2024-05-14T22:52:57.455756 #2230357] ERROR -- : from /tmp/ruby/src/trunk/tool/downloader.rb:482:in `block in
' E, [2024-05-14T22:52:57.455768 #2230357] ERROR -- : from /tmp/ruby/src/trunk/tool/downloader.rb:465:in `each' E, [2024-05-14T22:52:57.455780 #2230357] ERROR -- : from /tmp/ruby/src/trunk/tool/downloader.rb:465:in `
' E, [2024-05-14T22:52:57.459881 #2230357] ERROR -- : make: *** [uncommon.mk:1765: /tmp/ruby/src/trunk/enc/unicode/data/emoji/15.0/emoji-test.txt] Error 1 E, [2024-05-14T22:52:57.460076 #2230357] ERROR -- : make: *** Waiting for unfinished jobs.... E, [2024-05-14T22:52:57.494116 #2230357] ERROR -- : /tmp/ruby/src/trunk/tool/downloader.rb:302:in `rescue in download': failed to download emoji/15.0/emoji-test.txt (RuntimeError) E, [2024-05-14T22:52:57.494288 #2230357] ERROR -- : OpenURI::HTTPError: 403 Forbidden: https://www.unicode.org/Public/emoji/15.0/emoji-test.txt E, [2024-05-14T22:52:57.494317 #2230357] ERROR -- : from /tmp/ruby/src/trunk/tool/downloader.rb:201:in `download' E, [2024-05-14T22:52:57.494331 #2230357] ERROR -- : from /tmp/ruby/src/trunk/tool/downloader.rb:136:in `download' E, [2024-05-14T22:52:57.494344 #2230357] ERROR -- : from /tmp/ruby/src/trunk/tool/downloader.rb:482:in `block in
' E, [2024-05-14T22:52:57.494358 #2230357] ERROR -- : from /tmp/ruby/src/trunk/tool/downloader.rb:465:in `each' E, [2024-05-14T22:52:57.494372 #2230357] ERROR -- : from /tmp/ruby/src/trunk/tool/downloader.rb:465:in `
' E, [2024-05-14T22:52:57.494392 #2230357] ERROR -- : /usr/lib/ruby/3.0.0/open-uri.rb:364:in `open_http': 403 Forbidden (OpenURI::HTTPError) E, [2024-05-14T22:52:57.494413 #2230357] ERROR -- : from /usr/lib/ruby/3.0.0/open-uri.rb:741:in `buffer_open' E, [2024-05-14T22:52:57.494430 #2230357] ERROR -- : from /usr/lib/ruby/3.0.0/open-uri.rb:212:in `block in open_loop' E, [2024-05-14T22:52:57.494443 #2230357] ERROR -- : from /usr/lib/ruby/3.0.0/open-uri.rb:210:in `catch' E, [2024-05-14T22:52:57.494457 #2230357] ERROR -- : from /usr/lib/ruby/3.0.0/open-uri.rb:210:in `open_loop' E, [2024-05-14T22:52:57.494470 #2230357] ERROR -- : from /usr/lib/ruby/3.0.0/open-uri.rb:151:in `open_uri' E, [2024-05-14T22:52:57.494483 #2230357] ERROR -- : from /usr/lib/ruby/3.0.0/open-uri.rb:721:in `open' E, [2024-05-14T22:52:57.494495 #2230357] ERROR -- : from /usr/lib/ruby/3.0.0/open-uri.rb:729:in `read' E, [2024-05-14T22:52:57.494508 #2230357] ERROR -- : from /tmp/ruby/src/trunk/tool/downloader.rb:247:in `block in download' E, [2024-05-14T22:52:57.494520 #2230357] ERROR -- : from /tmp/ruby/src/trunk/tool/downloader.rb:378:in `with_retry' E, [2024-05-14T22:52:57.494536 #2230357] ERROR -- : from /tmp/ruby/src/trunk/tool/downloader.rb:246:in `download' E, [2024-05-14T22:52:57.494550 #2230357] ERROR -- : from /tmp/ruby/src/trunk/tool/downloader.rb:136:in `download' E, [2024-05-14T22:52:57.494562 #2230357] ERROR -- : from /tmp/ruby/src/trunk/tool/downloader.rb:482:in `block in
' E, [2024-05-14T22:52:57.494575 #2230357] ERROR -- : from /tmp/ruby/src/trunk/tool/downloader.rb:465:in `each' E, [2024-05-14T22:52:57.494588 #2230357] ERROR -- : from /tmp/ruby/src/trunk/tool/downloader.rb:465:in `
' E, [2024-05-14T22:52:57.499120 #2230357] ERROR -- : make: *** [uncommon.mk:1765: /tmp/ruby/src/trunk/enc/unicode/data/emoji/15.0/emoji-zwj-sequences.txt] Error 1 E, [2024-05-14T22:52:57.958047 #2230357] ERROR -- : /tmp/ruby/src/trunk/tool/downloader.rb:302:in `rescue in download': failed to download emoji/15.0/emoji-sequences.txt (RuntimeError) E, [2024-05-14T22:52:57.958237 #2230357] ERROR -- : EOFError: end of file reached: https://www.unicode.org/Public/emoji/15.0/emoji-sequences.txt E, [2024-05-14T22:52:57.958289 #2230357] ERROR -- : from /tmp/ruby/src/trunk/tool/downloader.rb:201:in `download' E, [2024-05-14T22:52:57.958306 #2230357] ERROR -- : from /tmp/ruby/src/trunk/tool/downloader.rb:136:in `download' E, [2024-05-14T22:52:57.958321 #2230357] ERROR -- : from /tmp/ruby/src/trunk/tool/downloader.rb:482:in `block in
' E, [2024-05-14T22:52:57.958335 #2230357] ERROR -- : from /tmp/ruby/src/trunk/tool/downloader.rb:465:in `each' E, [2024-05-14T22:52:57.958350 #2230357] ERROR -- : from /tmp/ruby/src/trunk/tool/downloader.rb:465:in `
' E, [2024-05-14T22:52:57.958364 #2230357] ERROR -- : /usr/lib/ruby/3.0.0/net/protocol.rb:227:in `rbuf_fill': end of file reached (EOFError) E, [2024-05-14T22:52:57.958379 #2230357] ERROR -- : from /usr/lib/ruby/3.0.0/net/protocol.rb:193:in `readuntil' E, [2024-05-14T22:52:57.958397 #2230357] ERROR -- : from /usr/lib/ruby/3.0.0/net/protocol.rb:203:in `readline' E, [2024-05-14T22:52:57.958412 #2230357] ERROR -- : from /usr/lib/ruby/3.0.0/net/http/response.rb:42:in `read_status_line' E, [2024-05-14T22:52:57.958427 #2230357] ERROR -- : from /usr/lib/ruby/3.0.0/net/http/response.rb:31:in `read_new' E, [2024-05-14T22:52:57.958442 #2230357] ERROR -- : from /usr/lib/ruby/3.0.0/net/http.rb:1557:in `block in transport_request' E, [2024-05-14T22:52:57.958456 #2230357] ERROR -- : from /usr/lib/ruby/3.0.0/net/http.rb:1548:in `catch' E, [2024-05-14T22:52:57.958483 #2230357] ERROR -- : from /usr/lib/ruby/3.0.0/net/http.rb:1548:in `transport_request' E, [2024-05-14T22:52:57.958499 #2230357] ERROR -- : from /usr/lib/ruby/3.0.0/net/http.rb:1521:in `request' E, [2024-05-14T22:52:57.958749 #2230357] ERROR -- : from /usr/lib/ruby/3.0.0/open-uri.rb:329:in `block in open_http' E, [2024-05-14T22:52:57.958767 #2230357] ERROR -- : from /usr/lib/ruby/3.0.0/net/http.rb:960:in `start' E, [2024-05-14T22:52:57.958780 #2230357] ERROR -- : from /usr/lib/ruby/3.0.0/open-uri.rb:323:in `open_http' E, [2024-05-14T22:52:57.958793 #2230357] ERROR -- : from /usr/lib/ruby/3.0.0/open-uri.rb:741:in `buffer_open' E, [2024-05-14T22:52:57.958805 #2230357] ERROR -- : from /usr/lib/ruby/3.0.0/open-uri.rb:212:in `block in open_loop' E, [2024-05-14T22:52:57.958822 #2230357] ERROR -- : from /usr/lib/ruby/3.0.0/open-uri.rb:210:in `catch' E, [2024-05-14T22:52:57.958835 #2230357] ERROR -- : from /usr/lib/ruby/3.0.0/open-uri.rb:210:in `open_loop' E, [2024-05-14T22:52:57.958848 #2230357] ERROR -- : from /usr/lib/ruby/3.0.0/open-uri.rb:151:in `open_uri' E, [2024-05-14T22:52:57.958860 #2230357] ERROR -- : from /usr/lib/ruby/3.0.0/open-uri.rb:721:in `open' E, [2024-05-14T22:52:57.958873 #2230357] ERROR -- : from /usr/lib/ruby/3.0.0/open-uri.rb:729:in `read' E, [2024-05-14T22:52:57.958886 #2230357] ERROR -- : from /tmp/ruby/src/trunk/tool/downloader.rb:247:in `block in download' E, [2024-05-14T22:52:57.958906 #2230357] ERROR -- : from /tmp/ruby/src/trunk/tool/downloader.rb:378:in `with_retry' E, [2024-05-14T22:52:57.958923 #2230357] ERROR -- : from /tmp/ruby/src/trunk/tool/downloader.rb:246:in `download' E, [2024-05-14T22:52:57.958937 #2230357] ERROR -- : from /tmp/ruby/src/trunk/tool/downloader.rb:136:in `download' E, [2024-05-14T22:52:57.958952 #2230357] ERROR -- : from /tmp/ruby/src/trunk/tool/downloader.rb:482:in `block in
' E, [2024-05-14T22:52:57.958970 #2230357] ERROR -- : from /tmp/ruby/src/trunk/tool/downloader.rb:465:in `each' E, [2024-05-14T22:52:57.958983 #2230357] ERROR -- : from /tmp/ruby/src/trunk/tool/downloader.rb:465:in `
' E, [2024-05-14T22:52:57.963148 #2230357] ERROR -- : make: *** [uncommon.mk:1765: /tmp/ruby/src/trunk/enc/unicode/data/emoji/15.0/emoji-sequences.txt] Error 1 E, [2024-05-14T22:52:57.963212 #2230357] ERROR -- : make: *** Deleting file '/tmp/ruby/src/trunk/enc/unicode/data/emoji/15.0/emoji-sequences.txt' I, [2024-05-14T22:52:57.963269 #2230357] INFO -- : downloading emoji/15.0/emoji-test.txt ... I, [2024-05-14T22:52:57.963595 #2230357] INFO -- : $$$[end] "make update-unicode -j20" exit with 512. I, [2024-05-14T22:52:57.963670 #2230357] INFO -- : $$$[beg] make update-download -j20 I, [2024-05-14T22:52:58.073877 #2230357] INFO -- : tool/config.guess already exists I, [2024-05-14T22:52:58.073915 #2230357] INFO -- : tool/config.sub already exists I, [2024-05-14T22:52:58.075943 #2230357] INFO -- : Update minitest to ea9caafc0754b1d6236a490d59e624b53209734a I, [2024-05-14T22:52:58.076128 #2230357] INFO -- : Update power_assert to 84e85124c5014a139af39161d484156cfe87a9ed I, [2024-05-14T22:52:58.076757 #2230357] INFO -- : Update rbs to ba7872795d5de04adb8ff500c0e6afdc81a041dd I, [2024-05-14T22:52:58.077059 #2230357] INFO -- : Update typeprof to b19a6416da3a05d57fadd6ffdadb382b6d236ca5 I, [2024-05-14T22:52:58.077191 #2230357] INFO -- : echo ea9caafc0754b1d6236a490d59e624b53209734a | /bin/sh /tmp/ruby/src/trunk/tool/ifchange /tmp/ruby/src/trunk/.bundle/.timestamp/minitest.revision - I, [2024-05-14T22:52:58.077396 #2230357] INFO -- : echo 84e85124c5014a139af39161d484156cfe87a9ed | /bin/sh /tmp/ruby/src/trunk/tool/ifchange /tmp/ruby/src/trunk/.bundle/.timestamp/power_assert.revision - I, [2024-05-14T22:52:58.077881 #2230357] INFO -- : echo ba7872795d5de04adb8ff500c0e6afdc81a041dd | /bin/sh /tmp/ruby/src/trunk/tool/ifchange /tmp/ruby/src/trunk/.bundle/.timestamp/rbs.revision - I, [2024-05-14T22:52:58.078687 #2230357] INFO -- : echo b19a6416da3a05d57fadd6ffdadb382b6d236ca5 | /bin/sh /tmp/ruby/src/trunk/tool/ifchange /tmp/ruby/src/trunk/.bundle/.timestamp/typeprof.revision - I, [2024-05-14T22:52:58.078825 #2230357] INFO -- : /tmp/ruby/src/trunk/.bundle/.timestamp/minitest.revision unchanged I, [2024-05-14T22:52:58.079166 #2230357] INFO -- : /tmp/ruby/src/trunk/.bundle/.timestamp/power_assert.revision unchanged I, [2024-05-14T22:52:58.079659 #2230357] INFO -- : /tmp/ruby/src/trunk/.bundle/.timestamp/rbs.revision unchanged I, [2024-05-14T22:52:58.080083 #2230357] INFO -- : Building power_assert@84e85124c5014a139af39161d484156cfe87a9ed to /tmp/ruby/src/trunk/gems/power_assert-2.0.3.gem I, [2024-05-14T22:52:58.080365 #2230357] INFO -- : /tmp/ruby/src/trunk/.bundle/.timestamp/typeprof.revision unchanged I, [2024-05-14T22:52:58.149647 #2230357] INFO -- : Successfully built RubyGem I, [2024-05-14T22:52:58.149688 #2230357] INFO -- : Name: power_assert I, [2024-05-14T22:52:58.149698 #2230357] INFO -- : Version: 2.0.4dev I, [2024-05-14T22:52:58.149702 #2230357] INFO -- : File: power_assert-2.0.4dev.gem I, [2024-05-14T22:52:58.195179 #2230357] INFO -- : $$$[end] "make update-download -j20" exit with 0. I, [2024-05-14T22:52:58.195213 #2230357] INFO -- : $$$[beg] make update-rubyspec -j20 I, [2024-05-14T22:52:58.253362 #2230357] INFO -- : make: Nothing to be done for 'update-rubyspec'. I, [2024-05-14T22:52:58.253631 #2230357] INFO -- : $$$[end] "make update-rubyspec -j20" exit with 0. I, [2024-05-14T22:52:58.253658 #2230357] INFO -- : $$$[beg] make update-src -j20 I, [2024-05-14T22:52:58.907673 #2230357] INFO -- : Already up to date. I, [2024-05-14T22:52:58.924153 #2230357] INFO -- : Latest commit hash = e3e1e53098 I, [2024-05-14T22:52:58.925512 #2230357] INFO -- : $$$[end] "make update-src -j20" exit with 0. I, [2024-05-14T22:52:58.925545 #2230357] INFO -- : $$$[beg] make after-update -j20 I, [2024-05-14T22:52:59.009748 #2230357] INFO -- : generating /tmp/ruby/src/trunk/ext/ripper/eventids2table.c I, [2024-05-14T22:52:59.014046 #2230357] INFO -- : make[1]: Entering directory '/tmp/ruby/src/trunk/ext/ripper' I, [2024-05-14T22:52:59.014069 #2230357] INFO -- : make[1]: Nothing to be done for 'src'. I, [2024-05-14T22:52:59.014075 #2230357] INFO -- : make[1]: Leaving directory '/tmp/ruby/src/trunk/ext/ripper' I, [2024-05-14T22:52:59.030765 #2230357] INFO -- : /tmp/ruby/src/trunk/revision.h updated I, [2024-05-14T22:52:59.031888 #2230357] INFO -- : generating x86_64-linux-fake.rb I, [2024-05-14T22:52:59.086352 #2230357] INFO -- : x86_64-linux-fake.rb updated I, [2024-05-14T22:52:59.088050 #2230357] INFO -- : generating enc.mk I, [2024-05-14T22:52:59.208782 #2230357] INFO -- : making srcs under enc I, [2024-05-14T22:52:59.238932 #2230357] INFO -- : make[1]: Entering directory '/tmp/ruby/build/trunk' I, [2024-05-14T22:52:59.238973 #2230357] INFO -- : make[1]: Nothing to be done for 'srcs'. I, [2024-05-14T22:52:59.238981 #2230357] INFO -- : make[1]: Leaving directory '/tmp/ruby/build/trunk' I, [2024-05-14T22:52:59.283746 #2230357] INFO -- : Update minitest to ea9caafc0754b1d6236a490d59e624b53209734a I, [2024-05-14T22:52:59.283881 #2230357] INFO -- : Update power_assert to 84e85124c5014a139af39161d484156cfe87a9ed I, [2024-05-14T22:52:59.284050 #2230357] INFO -- : Update rbs to ba7872795d5de04adb8ff500c0e6afdc81a041dd I, [2024-05-14T22:52:59.284906 #2230357] INFO -- : Update typeprof to b19a6416da3a05d57fadd6ffdadb382b6d236ca5 I, [2024-05-14T22:52:59.285248 #2230357] INFO -- : echo ea9caafc0754b1d6236a490d59e624b53209734a | /bin/sh /tmp/ruby/src/trunk/tool/ifchange /tmp/ruby/src/trunk/.bundle/.timestamp/minitest.revision - I, [2024-05-14T22:52:59.285360 #2230357] INFO -- : echo 84e85124c5014a139af39161d484156cfe87a9ed | /bin/sh /tmp/ruby/src/trunk/tool/ifchange /tmp/ruby/src/trunk/.bundle/.timestamp/power_assert.revision - I, [2024-05-14T22:52:59.285466 #2230357] INFO -- : echo ba7872795d5de04adb8ff500c0e6afdc81a041dd | /bin/sh /tmp/ruby/src/trunk/tool/ifchange /tmp/ruby/src/trunk/.bundle/.timestamp/rbs.revision - I, [2024-05-14T22:52:59.286634 #2230357] INFO -- : echo b19a6416da3a05d57fadd6ffdadb382b6d236ca5 | /bin/sh /tmp/ruby/src/trunk/tool/ifchange /tmp/ruby/src/trunk/.bundle/.timestamp/typeprof.revision - I, [2024-05-14T22:52:59.287178 #2230357] INFO -- : /tmp/ruby/src/trunk/.bundle/.timestamp/minitest.revision unchanged I, [2024-05-14T22:52:59.287289 #2230357] INFO -- : /tmp/ruby/src/trunk/.bundle/.timestamp/power_assert.revision unchanged I, [2024-05-14T22:52:59.287296 #2230357] INFO -- : /tmp/ruby/src/trunk/.bundle/.timestamp/rbs.revision unchanged I, [2024-05-14T22:52:59.288109 #2230357] INFO -- : /tmp/ruby/src/trunk/.bundle/.timestamp/typeprof.revision unchanged I, [2024-05-14T22:52:59.288205 #2230357] INFO -- : Building power_assert@84e85124c5014a139af39161d484156cfe87a9ed to /tmp/ruby/src/trunk/gems/power_assert-2.0.3.gem I, [2024-05-14T22:52:59.357376 #2230357] INFO -- : Successfully built RubyGem I, [2024-05-14T22:52:59.357417 #2230357] INFO -- : Name: power_assert I, [2024-05-14T22:52:59.357423 #2230357] INFO -- : Version: 2.0.4dev I, [2024-05-14T22:52:59.357430 #2230357] INFO -- : File: power_assert-2.0.4dev.gem I, [2024-05-14T22:52:59.359771 #2230357] INFO -- : Extracting bundle gem power_assert-2.0.3... I, [2024-05-14T22:52:59.421449 #2230357] INFO -- : Try with hash version of bundled gems instead of gems/power_assert-2.0.3.gem. We don't use this gem with release version of Ruby. I, [2024-05-14T22:52:59.426391 #2230357] INFO -- : Unpacked gems/power_assert-2.0.4dev.gem I, [2024-05-14T22:52:59.428769 #2230357] INFO -- : $$$[end] "make after-update -j20" exit with 0. I, [2024-05-14T22:52:59.428892 #2230357] INFO -- : $$$[beg] make miniruby -j20 I, [2024-05-14T22:52:59.495244 #2230357] INFO -- : BASERUBY = /usr/bin/ruby --disable=gems I, [2024-05-14T22:52:59.495290 #2230357] INFO -- : CC = gcc I, [2024-05-14T22:52:59.495300 #2230357] INFO -- : LD = ld I, [2024-05-14T22:52:59.495307 #2230357] INFO -- : LDSHARED = gcc -shared I, [2024-05-14T22:52:59.495314 #2230357] INFO -- : CFLAGS = -O3 -fno-fast-math -ggdb3 -Wall -Wextra -Wdeprecated-declarations -Wdiv-by-zero -Wduplicated-cond -Wimplicit-function-declaration -Wimplicit-int -Wpointer-arith -Wwrite-strings -Wold-style-definition -Wimplicit-fallthrough=0 -Wmissing-noreturn -Wno-cast-function-type -Wno-constant-logical-operand -Wno-long-long -Wno-missing-field-initializers -Wno-overlength-strings -Wno-packed-bitfield-compat -Wno-parentheses-equality -Wno-self-assign -Wno-tautological-compare -Wno-unused-parameter -Wno-unused-value -Wsuggest-attribute=format -Wsuggest-attribute=noreturn -Wunused-variable -Wmisleading-indentation -Wundef -fPIC I, [2024-05-14T22:52:59.495321 #2230357] INFO -- : XCFLAGS = -U_FORTIFY_SOURCE -D_FORTIFY_SOURCE=2 -fstack-protector-strong -fno-strict-overflow -fvisibility=hidden -fexcess-precision=standard -DRUBY_EXPORT -I. -I.ext/include/x86_64-linux -I/tmp/ruby/src/trunk/include -I/tmp/ruby/src/trunk -I/tmp/ruby/src/trunk/prism -I/tmp/ruby/src/trunk/enc/unicode/15.0.0 I, [2024-05-14T22:52:59.495337 #2230357] INFO -- : CPPFLAGS = I, [2024-05-14T22:52:59.495344 #2230357] INFO -- : DLDFLAGS = -Wl,--compress-debug-sections=zlib -Wl,-soname,libruby.so.3.4 -fstack-protector-strong I, [2024-05-14T22:52:59.495351 #2230357] INFO -- : SOLIBS = -lz -lrt -lrt -lgmp -ldl -lcrypt -lm -lpthread I, [2024-05-14T22:52:59.495360 #2230357] INFO -- : LANG = en_US.UTF-8 I, [2024-05-14T22:52:59.495366 #2230357] INFO -- : LC_ALL = I, [2024-05-14T22:52:59.495371 #2230357] INFO -- : LC_CTYPE = I, [2024-05-14T22:52:59.495377 #2230357] INFO -- : MFLAGS = -j20 --jobserver-auth=4,5 I, [2024-05-14T22:52:59.495383 #2230357] INFO -- : RUSTC = no I, [2024-05-14T22:52:59.495389 #2230357] INFO -- : YJIT_RUSTC_ARGS = --crate-name=yjit --crate-type=staticlib --edition=2021 -g -C lto=thin -C opt-level=3 -C overflow-checks=on '--out-dir=/tmp/ruby/build/trunk/yjit/target/release/' /tmp/ruby/src/trunk/yjit/src/lib.rs I, [2024-05-14T22:52:59.497524 #2230357] INFO -- : gcc (Ubuntu 11.4.0-1ubuntu1~22.04) 11.4.0 I, [2024-05-14T22:52:59.497561 #2230357] INFO -- : Copyright (C) 2021 Free Software Foundation, Inc. I, [2024-05-14T22:52:59.497571 #2230357] INFO -- : This is free software; see the source for copying conditions. There is NO I, [2024-05-14T22:52:59.497578 #2230357] INFO -- : warranty; not even for MERCHANTABILITY or FITNESS FOR A PARTICULAR PURPOSE. I, [2024-05-14T22:52:59.497585 #2230357] INFO -- : I, [2024-05-14T22:52:59.522947 #2230357] INFO -- : compiling /tmp/ruby/src/trunk/version.c I, [2024-05-14T22:52:59.625637 #2230357] INFO -- : linking miniruby I, [2024-05-14T22:53:00.147146 #2230357] INFO -- : $$$[end] "make miniruby -j20" exit with 0. I, [2024-05-14T22:53:00.147258 #2230357] INFO -- : $$$[beg] make ruby -j20 I, [2024-05-14T22:53:00.204971 #2230357] INFO -- : BASERUBY = /usr/bin/ruby --disable=gems I, [2024-05-14T22:53:00.205012 #2230357] INFO -- : CC = gcc I, [2024-05-14T22:53:00.205025 #2230357] INFO -- : LD = ld I, [2024-05-14T22:53:00.205037 #2230357] INFO -- : LDSHARED = gcc -shared I, [2024-05-14T22:53:00.205053 #2230357] INFO -- : CFLAGS = -O3 -fno-fast-math -ggdb3 -Wall -Wextra -Wdeprecated-declarations -Wdiv-by-zero -Wduplicated-cond -Wimplicit-function-declaration -Wimplicit-int -Wpointer-arith -Wwrite-strings -Wold-style-definition -Wimplicit-fallthrough=0 -Wmissing-noreturn -Wno-cast-function-type -Wno-constant-logical-operand -Wno-long-long -Wno-missing-field-initializers -Wno-overlength-strings -Wno-packed-bitfield-compat -Wno-parentheses-equality -Wno-self-assign -Wno-tautological-compare -Wno-unused-parameter -Wno-unused-value -Wsuggest-attribute=format -Wsuggest-attribute=noreturn -Wunused-variable -Wmisleading-indentation -Wundef -fPIC I, [2024-05-14T22:53:00.205065 #2230357] INFO -- : XCFLAGS = -U_FORTIFY_SOURCE -D_FORTIFY_SOURCE=2 -fstack-protector-strong -fno-strict-overflow -fvisibility=hidden -fexcess-precision=standard -DRUBY_EXPORT -I. -I.ext/include/x86_64-linux -I/tmp/ruby/src/trunk/include -I/tmp/ruby/src/trunk -I/tmp/ruby/src/trunk/prism -I/tmp/ruby/src/trunk/enc/unicode/15.0.0 I, [2024-05-14T22:53:00.205076 #2230357] INFO -- : CPPFLAGS = I, [2024-05-14T22:53:00.205087 #2230357] INFO -- : DLDFLAGS = -Wl,--compress-debug-sections=zlib -Wl,-soname,libruby.so.3.4 -fstack-protector-strong I, [2024-05-14T22:53:00.205097 #2230357] INFO -- : SOLIBS = -lz -lrt -lrt -lgmp -ldl -lcrypt -lm -lpthread I, [2024-05-14T22:53:00.205108 #2230357] INFO -- : LANG = en_US.UTF-8 I, [2024-05-14T22:53:00.205118 #2230357] INFO -- : LC_ALL = I, [2024-05-14T22:53:00.205128 #2230357] INFO -- : LC_CTYPE = I, [2024-05-14T22:53:00.205138 #2230357] INFO -- : MFLAGS = -j20 --jobserver-auth=4,5 I, [2024-05-14T22:53:00.205149 #2230357] INFO -- : RUSTC = no I, [2024-05-14T22:53:00.205159 #2230357] INFO -- : YJIT_RUSTC_ARGS = --crate-name=yjit --crate-type=staticlib --edition=2021 -g -C lto=thin -C opt-level=3 -C overflow-checks=on '--out-dir=/tmp/ruby/build/trunk/yjit/target/release/' /tmp/ruby/src/trunk/yjit/src/lib.rs I, [2024-05-14T22:53:00.206432 #2230357] INFO -- : gcc (Ubuntu 11.4.0-1ubuntu1~22.04) 11.4.0 I, [2024-05-14T22:53:00.206479 #2230357] INFO -- : Copyright (C) 2021 Free Software Foundation, Inc. I, [2024-05-14T22:53:00.206493 #2230357] INFO -- : This is free software; see the source for copying conditions. There is NO I, [2024-05-14T22:53:00.206505 #2230357] INFO -- : warranty; not even for MERCHANTABILITY or FITNESS FOR A PARTICULAR PURPOSE. I, [2024-05-14T22:53:00.206515 #2230357] INFO -- : I, [2024-05-14T22:53:00.314821 #2230357] INFO -- : builtin_binary.inc updated I, [2024-05-14T22:53:00.319396 #2230357] INFO -- : c5234a9416e4f20f175185e840b25b0f08674d14078ed7083f37e655458e3ca9 builtin_binary.inc I, [2024-05-14T22:53:00.320161 #2230357] INFO -- : compiling /tmp/ruby/src/trunk/builtin.c I, [2024-05-14T22:53:00.502876 #2230357] INFO -- : linking static-library libruby-static.a I, [2024-05-14T22:53:00.812992 #2230357] INFO -- : linking shared-library libruby.so.3.4.0 I, [2024-05-14T22:53:02.394664 #2230357] INFO -- : linking ruby I, [2024-05-14T22:53:02.417956 #2230357] INFO -- : $$$[end] "make ruby -j20" exit with 0. I, [2024-05-14T22:53:02.418108 #2230357] INFO -- : $$$[beg] make all -j20 I, [2024-05-14T22:53:02.476739 #2230357] INFO -- : BASERUBY = /usr/bin/ruby --disable=gems I, [2024-05-14T22:53:02.476777 #2230357] INFO -- : CC = gcc I, [2024-05-14T22:53:02.476784 #2230357] INFO -- : LD = ld I, [2024-05-14T22:53:02.476789 #2230357] INFO -- : LDSHARED = gcc -shared I, [2024-05-14T22:53:02.476794 #2230357] INFO -- : CFLAGS = -O3 -fno-fast-math -ggdb3 -Wall -Wextra -Wdeprecated-declarations -Wdiv-by-zero -Wduplicated-cond -Wimplicit-function-declaration -Wimplicit-int -Wpointer-arith -Wwrite-strings -Wold-style-definition -Wimplicit-fallthrough=0 -Wmissing-noreturn -Wno-cast-function-type -Wno-constant-logical-operand -Wno-long-long -Wno-missing-field-initializers -Wno-overlength-strings -Wno-packed-bitfield-compat -Wno-parentheses-equality -Wno-self-assign -Wno-tautological-compare -Wno-unused-parameter -Wno-unused-value -Wsuggest-attribute=format -Wsuggest-attribute=noreturn -Wunused-variable -Wmisleading-indentation -Wundef -fPIC I, [2024-05-14T22:53:02.476802 #2230357] INFO -- : XCFLAGS = -U_FORTIFY_SOURCE -D_FORTIFY_SOURCE=2 -fstack-protector-strong -fno-strict-overflow -fvisibility=hidden -fexcess-precision=standard -DRUBY_EXPORT -I. -I.ext/include/x86_64-linux -I/tmp/ruby/src/trunk/include -I/tmp/ruby/src/trunk -I/tmp/ruby/src/trunk/prism -I/tmp/ruby/src/trunk/enc/unicode/15.0.0 I, [2024-05-14T22:53:02.476807 #2230357] INFO -- : CPPFLAGS = I, [2024-05-14T22:53:02.476812 #2230357] INFO -- : DLDFLAGS = -Wl,--compress-debug-sections=zlib -Wl,-soname,libruby.so.3.4 -fstack-protector-strong I, [2024-05-14T22:53:02.476817 #2230357] INFO -- : SOLIBS = -lz -lrt -lrt -lgmp -ldl -lcrypt -lm -lpthread I, [2024-05-14T22:53:02.476822 #2230357] INFO -- : LANG = en_US.UTF-8 I, [2024-05-14T22:53:02.476827 #2230357] INFO -- : LC_ALL = I, [2024-05-14T22:53:02.476832 #2230357] INFO -- : LC_CTYPE = I, [2024-05-14T22:53:02.476837 #2230357] INFO -- : MFLAGS = -j20 --jobserver-auth=4,5 I, [2024-05-14T22:53:02.476841 #2230357] INFO -- : RUSTC = no I, [2024-05-14T22:53:02.476847 #2230357] INFO -- : YJIT_RUSTC_ARGS = --crate-name=yjit --crate-type=staticlib --edition=2021 -g -C lto=thin -C opt-level=3 -C overflow-checks=on '--out-dir=/tmp/ruby/build/trunk/yjit/target/release/' /tmp/ruby/src/trunk/yjit/src/lib.rs I, [2024-05-14T22:53:02.478722 #2230357] INFO -- : gcc (Ubuntu 11.4.0-1ubuntu1~22.04) 11.4.0 I, [2024-05-14T22:53:02.478754 #2230357] INFO -- : Copyright (C) 2021 Free Software Foundation, Inc. I, [2024-05-14T22:53:02.478767 #2230357] INFO -- : This is free software; see the source for copying conditions. There is NO I, [2024-05-14T22:53:02.478774 #2230357] INFO -- : warranty; not even for MERCHANTABILITY or FITNESS FOR A PARTICULAR PURPOSE. I, [2024-05-14T22:53:02.478794 #2230357] INFO -- : I, [2024-05-14T22:53:02.513493 #2230357] INFO -- : generating enc.mk I, [2024-05-14T22:53:02.515510 #2230357] INFO -- : building spec/ruby/optional/capi/ext/array_spec.so I, [2024-05-14T22:53:02.515772 #2230357] INFO -- : building spec/ruby/optional/capi/ext/basic_object_spec.so I, [2024-05-14T22:53:02.516280 #2230357] INFO -- : building spec/ruby/optional/capi/ext/bignum_spec.so I, [2024-05-14T22:53:02.517060 #2230357] INFO -- : building spec/ruby/optional/capi/ext/binding_spec.so I, [2024-05-14T22:53:02.517234 #2230357] INFO -- : building spec/ruby/optional/capi/ext/boolean_spec.so I, [2024-05-14T22:53:02.518708 #2230357] INFO -- : building spec/ruby/optional/capi/ext/class_id_under_autoload_spec.so I, [2024-05-14T22:53:02.519454 #2230357] INFO -- : building spec/ruby/optional/capi/ext/class_spec.so I, [2024-05-14T22:53:02.519775 #2230357] INFO -- : building spec/ruby/optional/capi/ext/class_under_autoload_spec.so I, [2024-05-14T22:53:02.520555 #2230357] INFO -- : building spec/ruby/optional/capi/ext/complex_spec.so I, [2024-05-14T22:53:02.520942 #2230357] INFO -- : building spec/ruby/optional/capi/ext/constants_spec.so I, [2024-05-14T22:53:02.522102 #2230357] INFO -- : building spec/ruby/optional/capi/ext/data_spec.so I, [2024-05-14T22:53:02.523015 #2230357] INFO -- : building spec/ruby/optional/capi/ext/debug_spec.so I, [2024-05-14T22:53:02.523306 #2230357] INFO -- : building spec/ruby/optional/capi/ext/encoding_spec.so I, [2024-05-14T22:53:02.523978 #2230357] INFO -- : building spec/ruby/optional/capi/ext/enumerator_spec.so I, [2024-05-14T22:53:02.524230 #2230357] INFO -- : building spec/ruby/optional/capi/ext/exception_spec.so I, [2024-05-14T22:53:02.525054 #2230357] INFO -- : building spec/ruby/optional/capi/ext/fiber_spec.so I, [2024-05-14T22:53:02.525301 #2230357] INFO -- : building spec/ruby/optional/capi/ext/file_spec.so I, [2024-05-14T22:53:02.526260 #2230357] INFO -- : building spec/ruby/optional/capi/ext/fixnum_spec.so I, [2024-05-14T22:53:02.527013 #2230357] INFO -- : building spec/ruby/optional/capi/ext/float_spec.so I, [2024-05-14T22:53:02.642005 #2230357] INFO -- : building spec/ruby/optional/capi/ext/gc_spec.so I, [2024-05-14T22:53:02.661661 #2230357] INFO -- : building spec/ruby/optional/capi/ext/globals_spec.so I, [2024-05-14T22:53:02.663503 #2230357] INFO -- : building spec/ruby/optional/capi/ext/hash_spec.so I, [2024-05-14T22:53:02.664792 #2230357] INFO -- : building spec/ruby/optional/capi/ext/integer_spec.so I, [2024-05-14T22:53:02.667970 #2230357] INFO -- : building spec/ruby/optional/capi/ext/io_spec.so I, [2024-05-14T22:53:02.677062 #2230357] INFO -- : building spec/ruby/optional/capi/ext/kernel_spec.so I, [2024-05-14T22:53:02.677482 #2230357] INFO -- : building spec/ruby/optional/capi/ext/language_spec.so I, [2024-05-14T22:53:02.679773 #2230357] INFO -- : building spec/ruby/optional/capi/ext/marshal_spec.so I, [2024-05-14T22:53:02.684124 #2230357] INFO -- : building spec/ruby/optional/capi/ext/module_spec.so I, [2024-05-14T22:53:02.689693 #2230357] INFO -- : building spec/ruby/optional/capi/ext/module_under_autoload_spec.so I, [2024-05-14T22:53:02.700500 #2230357] INFO -- : building spec/ruby/optional/capi/ext/mutex_spec.so I, [2024-05-14T22:53:02.700564 #2230357] INFO -- : building spec/ruby/optional/capi/ext/numeric_spec.so I, [2024-05-14T22:53:02.712039 #2230357] INFO -- : building spec/ruby/optional/capi/ext/object_spec.so I, [2024-05-14T22:53:02.716320 #2230357] INFO -- : building spec/ruby/optional/capi/ext/proc_spec.so I, [2024-05-14T22:53:02.717066 #2230357] INFO -- : building spec/ruby/optional/capi/ext/range_spec.so I, [2024-05-14T22:53:02.742094 #2230357] INFO -- : building spec/ruby/optional/capi/ext/rational_spec.so I, [2024-05-14T22:53:02.762610 #2230357] INFO -- : building spec/ruby/optional/capi/ext/rbasic_spec.so I, [2024-05-14T22:53:02.773979 #2230357] INFO -- : building spec/ruby/optional/capi/ext/regexp_spec.so I, [2024-05-14T22:53:02.811866 #2230357] INFO -- : building spec/ruby/optional/capi/ext/string_spec.so I, [2024-05-14T22:53:02.812095 #2230357] INFO -- : building spec/ruby/optional/capi/ext/struct_spec.so I, [2024-05-14T22:53:02.823815 #2230357] INFO -- : building spec/ruby/optional/capi/ext/st_spec.so I, [2024-05-14T22:53:02.827575 #2230357] INFO -- : building spec/ruby/optional/capi/ext/symbol_spec.so I, [2024-05-14T22:53:02.838066 #2230357] INFO -- : building spec/ruby/optional/capi/ext/thread_spec.so I, [2024-05-14T22:53:02.841078 #2230357] INFO -- : building spec/ruby/optional/capi/ext/time_spec.so I, [2024-05-14T22:53:02.845333 #2230357] INFO -- : building spec/ruby/optional/capi/ext/tracepoint_spec.so I, [2024-05-14T22:53:02.847574 #2230357] INFO -- : building spec/ruby/optional/capi/ext/typed_data_spec.so I, [2024-05-14T22:53:02.865113 #2230357] INFO -- : building spec/ruby/optional/capi/ext/util_spec.so I, [2024-05-14T22:53:02.869622 #2230357] INFO -- : making enc I, [2024-05-14T22:53:02.871529 #2230357] INFO -- : making srcs under enc I, [2024-05-14T22:53:02.897456 #2230357] INFO -- : make[1]: Entering directory '/tmp/ruby/build/trunk' I, [2024-05-14T22:53:02.897532 #2230357] INFO -- : make[1]: Nothing to be done for 'enc'. I, [2024-05-14T22:53:02.897557 #2230357] INFO -- : make[1]: Leaving directory '/tmp/ruby/build/trunk' I, [2024-05-14T22:53:02.919102 #2230357] INFO -- : make[1]: Entering directory '/tmp/ruby/build/trunk' I, [2024-05-14T22:53:02.919160 #2230357] INFO -- : make[1]: Nothing to be done for 'srcs'. I, [2024-05-14T22:53:02.919169 #2230357] INFO -- : make[1]: Leaving directory '/tmp/ruby/build/trunk' I, [2024-05-14T22:53:02.919889 #2230357] INFO -- : generating transdb.h I, [2024-05-14T22:53:03.046718 #2230357] INFO -- : transdb.h unchanged I, [2024-05-14T22:53:03.048143 #2230357] INFO -- : generating makefiles ext/configure-ext.mk I, [2024-05-14T22:53:03.048308 #2230357] INFO -- : making trans I, [2024-05-14T22:53:03.074665 #2230357] INFO -- : ext/configure-ext.mk updated I, [2024-05-14T22:53:03.077239 #2230357] INFO -- : make[1]: Entering directory '/tmp/ruby/build/trunk' I, [2024-05-14T22:53:03.083785 #2230357] INFO -- : make[1]: Entering directory '/tmp/ruby/build/trunk' I, [2024-05-14T22:53:03.083881 #2230357] INFO -- : make[1]: Nothing to be done for 'trans'. I, [2024-05-14T22:53:03.083893 #2230357] INFO -- : make[1]: Leaving directory '/tmp/ruby/build/trunk' I, [2024-05-14T22:53:03.084819 #2230357] INFO -- : making encs I, [2024-05-14T22:53:03.144433 #2230357] INFO -- : make[1]: Entering directory '/tmp/ruby/build/trunk' I, [2024-05-14T22:53:03.144501 #2230357] INFO -- : make[1]: Nothing to be done for 'encs'. I, [2024-05-14T22:53:03.144523 #2230357] INFO -- : make[1]: Leaving directory '/tmp/ruby/build/trunk' I, [2024-05-14T22:53:03.230243 #2230357] INFO -- : make[1]: Leaving directory '/tmp/ruby/build/trunk' I, [2024-05-14T22:53:03.231153 #2230357] INFO -- : generating makefile exts.mk I, [2024-05-14T22:53:03.268334 #2230357] INFO -- : exts.mk unchanged I, [2024-05-14T22:53:03.272906 #2230357] INFO -- : make[1]: Entering directory '/tmp/ruby/build/trunk' I, [2024-05-14T22:53:03.291940 #2230357] INFO -- : make[2]: Entering directory '/tmp/ruby/build/trunk/ext/digest' I, [2024-05-14T22:53:03.292976 #2230357] INFO -- : make[2]: Entering directory '/tmp/ruby/build/trunk/ext/json' I, [2024-05-14T22:53:03.293180 #2230357] INFO -- : make[2]: Entering directory '/tmp/ruby/build/trunk/ext/coverage' I, [2024-05-14T22:53:03.293927 #2230357] INFO -- : make[2]: Entering directory '/tmp/ruby/build/trunk/ext/io/console' I, [2024-05-14T22:53:03.294082 #2230357] INFO -- : make[2]: Entering directory '/tmp/ruby/build/trunk/ext/date' I, [2024-05-14T22:53:03.294487 #2230357] INFO -- : make[2]: Entering directory '/tmp/ruby/build/trunk/ext/rubyvm' I, [2024-05-14T22:53:03.294950 #2230357] INFO -- : make[2]: Entering directory '/tmp/ruby/build/trunk/ext/monitor' I, [2024-05-14T22:53:03.295685 #2230357] INFO -- : make[2]: Entering directory '/tmp/ruby/build/trunk/ext/pathname' I, [2024-05-14T22:53:03.296448 #2230357] INFO -- : make[2]: Entering directory '/tmp/ruby/build/trunk/ext/fiddle' I, [2024-05-14T22:53:03.296481 #2230357] INFO -- : make[2]: Entering directory '/tmp/ruby/build/trunk/ext/pty' I, [2024-05-14T22:53:03.296890 #2230357] INFO -- : make[2]: Leaving directory '/tmp/ruby/build/trunk/ext/coverage' I, [2024-05-14T22:53:03.297056 #2230357] INFO -- : make[2]: Leaving directory '/tmp/ruby/build/trunk/ext/rubyvm' I, [2024-05-14T22:53:03.297259 #2230357] INFO -- : make[2]: Leaving directory '/tmp/ruby/build/trunk/ext/io/console' I, [2024-05-14T22:53:03.297361 #2230357] INFO -- : make[2]: Leaving directory '/tmp/ruby/build/trunk/ext/digest' I, [2024-05-14T22:53:03.297554 #2230357] INFO -- : make[2]: Entering directory '/tmp/ruby/build/trunk/ext/objspace' I, [2024-05-14T22:53:03.297875 #2230357] INFO -- : make[2]: Entering directory '/tmp/ruby/build/trunk/ext/psych' I, [2024-05-14T22:53:03.298129 #2230357] INFO -- : make[2]: Leaving directory '/tmp/ruby/build/trunk/ext/monitor' I, [2024-05-14T22:53:03.298243 #2230357] INFO -- : make[2]: Leaving directory '/tmp/ruby/build/trunk/ext/date' I, [2024-05-14T22:53:03.298960 #2230357] INFO -- : make[2]: Leaving directory '/tmp/ruby/build/trunk/ext/pathname' I, [2024-05-14T22:53:03.299275 #2230357] INFO -- : make[2]: Entering directory '/tmp/ruby/build/trunk/.bundle/gems/debug-1.9.2/ext/debug' I, [2024-05-14T22:53:03.299367 #2230357] INFO -- : make[2]: Entering directory '/tmp/ruby/build/trunk/.bundle/gems/bigdecimal-3.1.8/ext/bigdecimal' I, [2024-05-14T22:53:03.299398 #2230357] INFO -- : make[2]: Entering directory '/tmp/ruby/build/trunk/.bundle/gems/nkf-0.2.0/ext/nkf' I, [2024-05-14T22:53:03.299714 #2230357] INFO -- : make[2]: Leaving directory '/tmp/ruby/build/trunk/ext/pty' I, [2024-05-14T22:53:03.299738 #2230357] INFO -- : make[2]: Entering directory '/tmp/ruby/build/trunk/.bundle/gems/racc-1.7.3/ext/racc/cparse' I, [2024-05-14T22:53:03.300298 #2230357] INFO -- : make[2]: Entering directory '/tmp/ruby/build/trunk/.bundle/gems/rbs-3.4.4/ext/rbs_extension' I, [2024-05-14T22:53:03.300479 #2230357] INFO -- : make[2]: Entering directory '/tmp/ruby/build/trunk/ext/ripper' I, [2024-05-14T22:53:03.300607 #2230357] INFO -- : make[2]: Entering directory '/tmp/ruby/build/trunk/.bundle/gems/syslog-0.1.2/ext/syslog' I, [2024-05-14T22:53:03.302427 #2230357] INFO -- : make[2]: Leaving directory '/tmp/ruby/build/trunk/ext/json' I, [2024-05-14T22:53:03.302661 #2230357] INFO -- : make[2]: Leaving directory '/tmp/ruby/build/trunk/ext/objspace' I, [2024-05-14T22:53:03.303962 #2230357] INFO -- : make[2]: Entering directory '/tmp/ruby/build/trunk/ext/digest/sha2' I, [2024-05-14T22:53:03.305666 #2230357] INFO -- : make[2]: Entering directory '/tmp/ruby/build/trunk/ext/socket' I, [2024-05-14T22:53:03.305732 #2230357] INFO -- : make[2]: Leaving directory '/tmp/ruby/build/trunk/ext/ripper' I, [2024-05-14T22:53:03.306059 #2230357] INFO -- : make[2]: Leaving directory '/tmp/ruby/build/trunk/ext/fiddle' I, [2024-05-14T22:53:03.307221 #2230357] INFO -- : make[2]: Leaving directory '/tmp/ruby/build/trunk/ext/digest/sha2' I, [2024-05-14T22:53:03.307940 #2230357] INFO -- : make[2]: Entering directory '/tmp/ruby/build/trunk/ext/openssl' I, [2024-05-14T22:53:03.311685 #2230357] INFO -- : make[2]: Leaving directory '/tmp/ruby/build/trunk/ext/socket' I, [2024-05-14T22:53:03.319696 #2230357] INFO -- : make[2]: Leaving directory '/tmp/ruby/build/trunk/ext/psych' I, [2024-05-14T22:53:03.322415 #2230357] INFO -- : make[2]: Leaving directory '/tmp/ruby/build/trunk/.bundle/gems/rbs-3.4.4/ext/rbs_extension' I, [2024-05-14T22:53:03.322597 #2230357] INFO -- : make[2]: Leaving directory '/tmp/ruby/build/trunk/.bundle/gems/nkf-0.2.0/ext/nkf' I, [2024-05-14T22:53:03.323485 #2230357] INFO -- : make[2]: Leaving directory '/tmp/ruby/build/trunk/.bundle/gems/racc-1.7.3/ext/racc/cparse' I, [2024-05-14T22:53:03.323707 #2230357] INFO -- : make[2]: Leaving directory '/tmp/ruby/build/trunk/ext/openssl' I, [2024-05-14T22:53:03.324814 #2230357] INFO -- : make[2]: Leaving directory '/tmp/ruby/build/trunk/.bundle/gems/syslog-0.1.2/ext/syslog' I, [2024-05-14T22:53:03.326189 #2230357] INFO -- : make[2]: Leaving directory '/tmp/ruby/build/trunk/.bundle/gems/debug-1.9.2/ext/debug' I, [2024-05-14T22:53:03.331415 #2230357] INFO -- : make[2]: Leaving directory '/tmp/ruby/build/trunk/.bundle/gems/bigdecimal-3.1.8/ext/bigdecimal' I, [2024-05-14T22:53:03.355686 #2230357] INFO -- : make[2]: Entering directory '/tmp/ruby/build/trunk' I, [2024-05-14T22:53:03.423723 #2230357] INFO -- : linking ruby I, [2024-05-14T22:53:03.446226 #2230357] INFO -- : make[2]: Leaving directory '/tmp/ruby/build/trunk' I, [2024-05-14T22:53:03.446847 #2230357] INFO -- : make[1]: Leaving directory '/tmp/ruby/build/trunk' I, [2024-05-14T22:53:03.450732 #2230357] INFO -- : make[1]: Entering directory '/tmp/ruby/build/trunk' I, [2024-05-14T22:53:03.450757 #2230357] INFO -- : make[1]: Nothing to be done for 'note'. I, [2024-05-14T22:53:03.450763 #2230357] INFO -- : make[1]: Leaving directory '/tmp/ruby/build/trunk' I, [2024-05-14T22:53:03.451934 #2230357] INFO -- : $$$[end] "make all -j20" exit with 0. I, [2024-05-14T22:53:03.452084 #2230357] INFO -- : $$$[beg] make install -j20 I, [2024-05-14T22:53:03.518714 #2230357] INFO -- : Update minitest to ea9caafc0754b1d6236a490d59e624b53209734a I, [2024-05-14T22:53:03.518772 #2230357] INFO -- : Update power_assert to 84e85124c5014a139af39161d484156cfe87a9ed I, [2024-05-14T22:53:03.519021 #2230357] INFO -- : Update rbs to ba7872795d5de04adb8ff500c0e6afdc81a041dd I, [2024-05-14T22:53:03.519616 #2230357] INFO -- : Update typeprof to b19a6416da3a05d57fadd6ffdadb382b6d236ca5 I, [2024-05-14T22:53:03.520345 #2230357] INFO -- : echo ea9caafc0754b1d6236a490d59e624b53209734a | /bin/sh /tmp/ruby/src/trunk/tool/ifchange /tmp/ruby/src/trunk/.bundle/.timestamp/minitest.revision - I, [2024-05-14T22:53:03.520474 #2230357] INFO -- : echo 84e85124c5014a139af39161d484156cfe87a9ed | /bin/sh /tmp/ruby/src/trunk/tool/ifchange /tmp/ruby/src/trunk/.bundle/.timestamp/power_assert.revision - I, [2024-05-14T22:53:03.520755 #2230357] INFO -- : echo ba7872795d5de04adb8ff500c0e6afdc81a041dd | /bin/sh /tmp/ruby/src/trunk/tool/ifchange /tmp/ruby/src/trunk/.bundle/.timestamp/rbs.revision - I, [2024-05-14T22:53:03.521606 #2230357] INFO -- : BASERUBY = /usr/bin/ruby --disable=gems I, [2024-05-14T22:53:03.521662 #2230357] INFO -- : CC = gcc I, [2024-05-14T22:53:03.521676 #2230357] INFO -- : LD = ld I, [2024-05-14T22:53:03.521689 #2230357] INFO -- : LDSHARED = gcc -shared I, [2024-05-14T22:53:03.521701 #2230357] INFO -- : CFLAGS = -O3 -fno-fast-math -ggdb3 -Wall -Wextra -Wdeprecated-declarations -Wdiv-by-zero -Wduplicated-cond -Wimplicit-function-declaration -Wimplicit-int -Wpointer-arith -Wwrite-strings -Wold-style-definition -Wimplicit-fallthrough=0 -Wmissing-noreturn -Wno-cast-function-type -Wno-constant-logical-operand -Wno-long-long -Wno-missing-field-initializers -Wno-overlength-strings -Wno-packed-bitfield-compat -Wno-parentheses-equality -Wno-self-assign -Wno-tautological-compare -Wno-unused-parameter -Wno-unused-value -Wsuggest-attribute=format -Wsuggest-attribute=noreturn -Wunused-variable -Wmisleading-indentation -Wundef -fPIC I, [2024-05-14T22:53:03.521713 #2230357] INFO -- : XCFLAGS = -U_FORTIFY_SOURCE -D_FORTIFY_SOURCE=2 -fstack-protector-strong -fno-strict-overflow -fvisibility=hidden -fexcess-precision=standard -DRUBY_EXPORT -I. -I.ext/include/x86_64-linux -I/tmp/ruby/src/trunk/include -I/tmp/ruby/src/trunk -I/tmp/ruby/src/trunk/prism -I/tmp/ruby/src/trunk/enc/unicode/15.0.0 I, [2024-05-14T22:53:03.521725 #2230357] INFO -- : CPPFLAGS = I, [2024-05-14T22:53:03.521736 #2230357] INFO -- : DLDFLAGS = -Wl,--compress-debug-sections=zlib -Wl,-soname,libruby.so.3.4 -fstack-protector-strong I, [2024-05-14T22:53:03.521747 #2230357] INFO -- : SOLIBS = -lz -lrt -lrt -lgmp -ldl -lcrypt -lm -lpthread I, [2024-05-14T22:53:03.521760 #2230357] INFO -- : LANG = en_US.UTF-8 I, [2024-05-14T22:53:03.521783 #2230357] INFO -- : LC_ALL = I, [2024-05-14T22:53:03.521803 #2230357] INFO -- : LC_CTYPE = I, [2024-05-14T22:53:03.521819 #2230357] INFO -- : MFLAGS = -j20 --jobserver-auth=4,5 I, [2024-05-14T22:53:03.521830 #2230357] INFO -- : RUSTC = no I, [2024-05-14T22:53:03.521841 #2230357] INFO -- : YJIT_RUSTC_ARGS = --crate-name=yjit --crate-type=staticlib --edition=2021 -g -C lto=thin -C opt-level=3 -C overflow-checks=on '--out-dir=/tmp/ruby/build/trunk/yjit/target/release/' /tmp/ruby/src/trunk/yjit/src/lib.rs I, [2024-05-14T22:53:03.522286 #2230357] INFO -- : /tmp/ruby/src/trunk/.bundle/.timestamp/minitest.revision unchanged I, [2024-05-14T22:53:03.522317 #2230357] INFO -- : /tmp/ruby/src/trunk/.bundle/.timestamp/power_assert.revision unchanged I, [2024-05-14T22:53:03.522809 #2230357] INFO -- : /tmp/ruby/src/trunk/.bundle/.timestamp/rbs.revision unchanged I, [2024-05-14T22:53:03.552791 #2230357] INFO -- : echo b19a6416da3a05d57fadd6ffdadb382b6d236ca5 | /bin/sh /tmp/ruby/src/trunk/tool/ifchange /tmp/ruby/src/trunk/.bundle/.timestamp/typeprof.revision - I, [2024-05-14T22:53:03.553546 #2230357] INFO -- : gcc (Ubuntu 11.4.0-1ubuntu1~22.04) 11.4.0 I, [2024-05-14T22:53:03.553568 #2230357] INFO -- : Copyright (C) 2021 Free Software Foundation, Inc. I, [2024-05-14T22:53:03.553575 #2230357] INFO -- : This is free software; see the source for copying conditions. There is NO I, [2024-05-14T22:53:03.553580 #2230357] INFO -- : warranty; not even for MERCHANTABILITY or FITNESS FOR A PARTICULAR PURPOSE. I, [2024-05-14T22:53:03.553585 #2230357] INFO -- : I, [2024-05-14T22:53:03.553589 #2230357] INFO -- : generating enc.mk I, [2024-05-14T22:53:03.555017 #2230357] INFO -- : /tmp/ruby/src/trunk/.bundle/.timestamp/typeprof.revision unchanged I, [2024-05-14T22:53:03.674862 #2230357] INFO -- : Building power_assert@84e85124c5014a139af39161d484156cfe87a9ed to /tmp/ruby/src/trunk/gems/power_assert-2.0.3.gem I, [2024-05-14T22:53:03.675198 #2230357] INFO -- : making srcs under enc I, [2024-05-14T22:53:03.675776 #2230357] INFO -- : making enc I, [2024-05-14T22:53:03.692654 #2230357] INFO -- : make[1]: Entering directory '/tmp/ruby/build/trunk' I, [2024-05-14T22:53:03.692707 #2230357] INFO -- : make[1]: Nothing to be done for 'enc'. I, [2024-05-14T22:53:03.692721 #2230357] INFO -- : make[1]: Leaving directory '/tmp/ruby/build/trunk' I, [2024-05-14T22:53:03.704393 #2230357] INFO -- : make[1]: Entering directory '/tmp/ruby/build/trunk' I, [2024-05-14T22:53:03.704454 #2230357] INFO -- : make[1]: Nothing to be done for 'srcs'. I, [2024-05-14T22:53:03.704468 #2230357] INFO -- : make[1]: Leaving directory '/tmp/ruby/build/trunk' I, [2024-05-14T22:53:03.705170 #2230357] INFO -- : generating transdb.h I, [2024-05-14T22:53:03.743446 #2230357] INFO -- : Successfully built RubyGem I, [2024-05-14T22:53:03.743521 #2230357] INFO -- : Name: power_assert I, [2024-05-14T22:53:03.743537 #2230357] INFO -- : Version: 2.0.4dev I, [2024-05-14T22:53:03.743550 #2230357] INFO -- : File: power_assert-2.0.4dev.gem I, [2024-05-14T22:53:03.745736 #2230357] INFO -- : Extracting bundle gem power_assert-2.0.3... I, [2024-05-14T22:53:03.802180 #2230357] INFO -- : transdb.h unchanged I, [2024-05-14T22:53:03.803910 #2230357] INFO -- : generating makefiles ext/configure-ext.mk I, [2024-05-14T22:53:03.804059 #2230357] INFO -- : making trans I, [2024-05-14T22:53:03.808431 #2230357] INFO -- : Try with hash version of bundled gems instead of gems/power_assert-2.0.3.gem. We don't use this gem with release version of Ruby. I, [2024-05-14T22:53:03.813403 #2230357] INFO -- : Unpacked gems/power_assert-2.0.4dev.gem I, [2024-05-14T22:53:03.830927 #2230357] INFO -- : ext/configure-ext.mk unchanged I, [2024-05-14T22:53:03.833290 #2230357] INFO -- : make[1]: Entering directory '/tmp/ruby/build/trunk' I, [2024-05-14T22:53:03.840304 #2230357] INFO -- : make[1]: Entering directory '/tmp/ruby/build/trunk' I, [2024-05-14T22:53:03.840413 #2230357] INFO -- : make[1]: Nothing to be done for 'trans'. I, [2024-05-14T22:53:03.840424 #2230357] INFO -- : make[1]: Leaving directory '/tmp/ruby/build/trunk' I, [2024-05-14T22:53:03.841282 #2230357] INFO -- : making encs I, [2024-05-14T22:53:03.897867 #2230357] INFO -- : make[1]: Entering directory '/tmp/ruby/build/trunk' I, [2024-05-14T22:53:03.897947 #2230357] INFO -- : make[1]: Nothing to be done for 'encs'. I, [2024-05-14T22:53:03.897974 #2230357] INFO -- : make[1]: Leaving directory '/tmp/ruby/build/trunk' I, [2024-05-14T22:53:03.987501 #2230357] INFO -- : make[1]: Leaving directory '/tmp/ruby/build/trunk' I, [2024-05-14T22:53:03.988246 #2230357] INFO -- : generating makefile exts.mk I, [2024-05-14T22:53:04.025309 #2230357] INFO -- : exts.mk unchanged I, [2024-05-14T22:53:04.029907 #2230357] INFO -- : make[1]: Entering directory '/tmp/ruby/build/trunk' I, [2024-05-14T22:53:04.048515 #2230357] INFO -- : make[2]: Entering directory '/tmp/ruby/build/trunk/ext/digest' I, [2024-05-14T22:53:04.050079 #2230357] INFO -- : make[2]: Entering directory '/tmp/ruby/build/trunk/ext/json' I, [2024-05-14T22:53:04.050151 #2230357] INFO -- : make[2]: Entering directory '/tmp/ruby/build/trunk/ext/coverage' I, [2024-05-14T22:53:04.050836 #2230357] INFO -- : make[2]: Entering directory '/tmp/ruby/build/trunk/ext/io/console' I, [2024-05-14T22:53:04.050903 #2230357] INFO -- : make[2]: Entering directory '/tmp/ruby/build/trunk/ext/date' I, [2024-05-14T22:53:04.051071 #2230357] INFO -- : make[2]: Entering directory '/tmp/ruby/build/trunk/ext/rubyvm' I, [2024-05-14T22:53:04.052256 #2230357] INFO -- : make[2]: Entering directory '/tmp/ruby/build/trunk/ext/monitor' I, [2024-05-14T22:53:04.052412 #2230357] INFO -- : make[2]: Entering directory '/tmp/ruby/build/trunk/ext/pathname' I, [2024-05-14T22:53:04.052801 #2230357] INFO -- : make[2]: Entering directory '/tmp/ruby/build/trunk/ext/pty' I, [2024-05-14T22:53:04.052907 #2230357] INFO -- : make[2]: Entering directory '/tmp/ruby/build/trunk/ext/fiddle' I, [2024-05-14T22:53:04.053909 #2230357] INFO -- : make[2]: Leaving directory '/tmp/ruby/build/trunk/ext/coverage' I, [2024-05-14T22:53:04.053985 #2230357] INFO -- : make[2]: Entering directory '/tmp/ruby/build/trunk/ext/objspace' I, [2024-05-14T22:53:04.054132 #2230357] INFO -- : make[2]: Leaving directory '/tmp/ruby/build/trunk/ext/io/console' I, [2024-05-14T22:53:04.054172 #2230357] INFO -- : make[2]: Leaving directory '/tmp/ruby/build/trunk/ext/digest' I, [2024-05-14T22:53:04.054329 #2230357] INFO -- : make[2]: Leaving directory '/tmp/ruby/build/trunk/ext/monitor' I, [2024-05-14T22:53:04.054541 #2230357] INFO -- : make[2]: Leaving directory '/tmp/ruby/build/trunk/ext/date' I, [2024-05-14T22:53:04.054677 #2230357] INFO -- : make[2]: Leaving directory '/tmp/ruby/build/trunk/ext/pty' I, [2024-05-14T22:53:04.054940 #2230357] INFO -- : make[2]: Entering directory '/tmp/ruby/build/trunk/ext/psych' I, [2024-05-14T22:53:04.055049 #2230357] INFO -- : make[2]: Leaving directory '/tmp/ruby/build/trunk/ext/pathname' I, [2024-05-14T22:53:04.055948 #2230357] INFO -- : make[2]: Leaving directory '/tmp/ruby/build/trunk/ext/rubyvm' I, [2024-05-14T22:53:04.056327 #2230357] INFO -- : make[2]: Entering directory '/tmp/ruby/build/trunk/ext/ripper' I, [2024-05-14T22:53:04.056640 #2230357] INFO -- : make[2]: Entering directory '/tmp/ruby/build/trunk/.bundle/gems/bigdecimal-3.1.8/ext/bigdecimal' I, [2024-05-14T22:53:04.056882 #2230357] INFO -- : make[2]: Entering directory '/tmp/ruby/build/trunk/.bundle/gems/debug-1.9.2/ext/debug' I, [2024-05-14T22:53:04.057161 #2230357] INFO -- : make[2]: Entering directory '/tmp/ruby/build/trunk/.bundle/gems/nkf-0.2.0/ext/nkf' I, [2024-05-14T22:53:04.057398 #2230357] INFO -- : make[2]: Entering directory '/tmp/ruby/build/trunk/.bundle/gems/racc-1.7.3/ext/racc/cparse' I, [2024-05-14T22:53:04.057577 #2230357] INFO -- : make[2]: Entering directory '/tmp/ruby/build/trunk/.bundle/gems/syslog-0.1.2/ext/syslog' I, [2024-05-14T22:53:04.057953 #2230357] INFO -- : make[2]: Entering directory '/tmp/ruby/build/trunk/.bundle/gems/rbs-3.4.4/ext/rbs_extension' I, [2024-05-14T22:53:04.057980 #2230357] INFO -- : make[2]: Leaving directory '/tmp/ruby/build/trunk/ext/objspace' I, [2024-05-14T22:53:04.059424 #2230357] INFO -- : make[2]: Leaving directory '/tmp/ruby/build/trunk/ext/fiddle' I, [2024-05-14T22:53:04.059671 #2230357] INFO -- : make[2]: Leaving directory '/tmp/ruby/build/trunk/ext/json' I, [2024-05-14T22:53:04.061960 #2230357] INFO -- : make[2]: Leaving directory '/tmp/ruby/build/trunk/ext/ripper' I, [2024-05-14T22:53:04.064075 #2230357] INFO -- : make[2]: Entering directory '/tmp/ruby/build/trunk/ext/digest/sha2' I, [2024-05-14T22:53:04.065931 #2230357] INFO -- : make[2]: Leaving directory '/tmp/ruby/build/trunk/ext/psych' I, [2024-05-14T22:53:04.066084 #2230357] INFO -- : make[2]: Entering directory '/tmp/ruby/build/trunk/ext/socket' I, [2024-05-14T22:53:04.066189 #2230357] INFO -- : make[2]: Entering directory '/tmp/ruby/build/trunk/ext/openssl' I, [2024-05-14T22:53:04.066483 #2230357] INFO -- : make[2]: Leaving directory '/tmp/ruby/build/trunk/ext/digest/sha2' I, [2024-05-14T22:53:04.072108 #2230357] INFO -- : make[2]: Leaving directory '/tmp/ruby/build/trunk/ext/socket' I, [2024-05-14T22:53:04.077374 #2230357] INFO -- : make[2]: Leaving directory '/tmp/ruby/build/trunk/ext/openssl' I, [2024-05-14T22:53:04.080336 #2230357] INFO -- : make[2]: Leaving directory '/tmp/ruby/build/trunk/.bundle/gems/debug-1.9.2/ext/debug' I, [2024-05-14T22:53:04.080406 #2230357] INFO -- : make[2]: Leaving directory '/tmp/ruby/build/trunk/.bundle/gems/nkf-0.2.0/ext/nkf' I, [2024-05-14T22:53:04.080425 #2230357] INFO -- : make[2]: Leaving directory '/tmp/ruby/build/trunk/.bundle/gems/bigdecimal-3.1.8/ext/bigdecimal' I, [2024-05-14T22:53:04.081116 #2230357] INFO -- : make[2]: Leaving directory '/tmp/ruby/build/trunk/.bundle/gems/syslog-0.1.2/ext/syslog' I, [2024-05-14T22:53:04.087327 #2230357] INFO -- : make[2]: Leaving directory '/tmp/ruby/build/trunk/.bundle/gems/racc-1.7.3/ext/racc/cparse' I, [2024-05-14T22:53:04.087396 #2230357] INFO -- : make[2]: Leaving directory '/tmp/ruby/build/trunk/.bundle/gems/rbs-3.4.4/ext/rbs_extension' I, [2024-05-14T22:53:04.110870 #2230357] INFO -- : make[2]: Entering directory '/tmp/ruby/build/trunk' I, [2024-05-14T22:53:04.176745 #2230357] INFO -- : make[2]: 'ruby' is up to date. I, [2024-05-14T22:53:04.176818 #2230357] INFO -- : make[2]: Leaving directory '/tmp/ruby/build/trunk' I, [2024-05-14T22:53:04.177140 #2230357] INFO -- : make[1]: Leaving directory '/tmp/ruby/build/trunk' I, [2024-05-14T22:53:04.180889 #2230357] INFO -- : make[1]: Entering directory '/tmp/ruby/build/trunk' I, [2024-05-14T22:53:04.180947 #2230357] INFO -- : make[1]: Nothing to be done for 'note'. I, [2024-05-14T22:53:04.180964 #2230357] INFO -- : make[1]: Leaving directory '/tmp/ruby/build/trunk' I, [2024-05-14T22:53:04.181090 #2230357] INFO -- : ./miniruby -I/tmp/ruby/src/trunk/lib -I. -I.ext/common /tmp/ruby/src/trunk/tool/runruby.rb --extout=.ext -- --disable-gems -r./x86_64-linux-fake /tmp/ruby/src/trunk/tool/rbinstall.rb --make="make" --dest-dir="" --extout=".ext" --ext-build-dir="./ext" --mflags="-j20 --jobserver-auth=4,5" --make-flags=" -j20 --jobserver-auth=4,5" --data-mode=0644 --prog-mode=0755 --installed-list .installed.list --mantype="doc" --gnumake --install=all --exclude=doc I, [2024-05-14T22:53:04.275535 #2230357] INFO -- : Installing to I, [2024-05-14T22:53:04.275622 #2230357] INFO -- : installing binary commands: /tmp/ruby/install/trunk/bin I, [2024-05-14T22:53:04.275641 #2230357] INFO -- : installing base libraries: /tmp/ruby/install/trunk/lib I, [2024-05-14T22:53:04.283024 #2230357] INFO -- : installing arch files: /tmp/ruby/install/trunk/lib/ruby/3.4.0+0/x86_64-linux I, [2024-05-14T22:53:04.283089 #2230357] INFO -- : installing pkgconfig data: /tmp/ruby/install/trunk/lib/pkgconfig I, [2024-05-14T22:53:04.283105 #2230357] INFO -- : installing extension objects: /tmp/ruby/install/trunk/lib/ruby/3.4.0+0/x86_64-linux I, [2024-05-14T22:53:04.292615 #2230357] INFO -- : installing extension objects: /tmp/ruby/install/trunk/lib/ruby/site_ruby/3.4.0+0/x86_64-linux I, [2024-05-14T22:53:04.292684 #2230357] INFO -- : installing extension objects: /tmp/ruby/install/trunk/lib/ruby/vendor_ruby/3.4.0+0/x86_64-linux I, [2024-05-14T22:53:04.292698 #2230357] INFO -- : installing extension headers: /tmp/ruby/install/trunk/include/ruby-3.4.0+0/x86_64-linux I, [2024-05-14T22:53:04.292710 #2230357] INFO -- : installing extension scripts: /tmp/ruby/install/trunk/lib/ruby/3.4.0+0 I, [2024-05-14T22:53:04.297264 #2230357] INFO -- : installing extension scripts: /tmp/ruby/install/trunk/lib/ruby/site_ruby/3.4.0+0 I, [2024-05-14T22:53:04.297326 #2230357] INFO -- : installing extension scripts: /tmp/ruby/install/trunk/lib/ruby/vendor_ruby/3.4.0+0 I, [2024-05-14T22:53:04.297339 #2230357] INFO -- : installing extension headers: /tmp/ruby/install/trunk/include/ruby-3.4.0+0/ruby I, [2024-05-14T22:53:04.297357 #2230357] INFO -- : installing command scripts: /tmp/ruby/install/trunk/bin I, [2024-05-14T22:53:04.297370 #2230357] INFO -- : installing library scripts: /tmp/ruby/install/trunk/lib/ruby/3.4.0+0 I, [2024-05-14T22:53:04.328924 #2230357] INFO -- : installing common headers: /tmp/ruby/install/trunk/include/ruby-3.4.0+0 I, [2024-05-14T22:53:04.333900 #2230357] INFO -- : installing manpages: /tmp/ruby/install/trunk/share/man/man1 I, [2024-05-14T22:53:04.333969 #2230357] INFO -- : installing default gems from lib: /tmp/ruby/install/trunk/lib/ruby/gems/3.4.0+0 I, [2024-05-14T22:53:04.356680 #2230357] INFO -- : benchmark 0.3.0 I, [2024-05-14T22:53:04.363901 #2230357] INFO -- : bundler 2.6.0.dev I, [2024-05-14T22:53:04.365323 #2230357] INFO -- : cgi 0.4.1 I, [2024-05-14T22:53:04.365847 #2230357] INFO -- : delegate 0.3.1 I, [2024-05-14T22:53:04.366594 #2230357] INFO -- : did_you_mean 1.6.3 I, [2024-05-14T22:53:04.367247 #2230357] INFO -- : english 0.8.0 I, [2024-05-14T22:53:04.368377 #2230357] INFO -- : erb 4.0.4 I, [2024-05-14T22:53:04.369895 #2230357] INFO -- : error_highlight 0.6.0 I, [2024-05-14T22:53:04.370561 #2230357] INFO -- : fileutils 1.7.2 I, [2024-05-14T22:53:04.371007 #2230357] INFO -- : find 0.2.0 I, [2024-05-14T22:53:04.371525 #2230357] INFO -- : forwardable 1.3.3 I, [2024-05-14T22:53:04.371990 #2230357] INFO -- : ipaddr 1.2.6 I, [2024-05-14T22:53:04.372419 #2230357] INFO -- : irb 1.13.1 I, [2024-05-14T22:53:04.373176 #2230357] INFO -- : logger 1.6.0 I, [2024-05-14T22:53:04.373628 #2230357] INFO -- : net-http 0.4.1 I, [2024-05-14T22:53:04.374126 #2230357] INFO -- : net-protocol 0.2.2 I, [2024-05-14T22:53:04.374536 #2230357] INFO -- : open-uri 0.4.1 I, [2024-05-14T22:53:04.375028 #2230357] INFO -- : open3 0.2.1 I, [2024-05-14T22:53:04.375566 #2230357] INFO -- : optparse 0.5.0 I, [2024-05-14T22:53:04.376698 #2230357] INFO -- : ostruct 0.6.0 I, [2024-05-14T22:53:04.377176 #2230357] INFO -- : pp 0.5.0 I, [2024-05-14T22:53:04.377681 #2230357] INFO -- : prettyprint 0.2.0 I, [2024-05-14T22:53:04.378140 #2230357] INFO -- : prism 0.29.0 I, [2024-05-14T22:53:04.378628 #2230357] INFO -- : pstore 0.1.3 I, [2024-05-14T22:53:04.379084 #2230357] INFO -- : rdoc 6.6.3.1 I, [2024-05-14T22:53:04.379983 #2230357] INFO -- : readline 0.0.4 I, [2024-05-14T22:53:04.380500 #2230357] INFO -- : reline 0.5.7 I, [2024-05-14T22:53:04.381023 #2230357] INFO -- : resolv 0.4.0 I, [2024-05-14T22:53:04.381573 #2230357] INFO -- : ruby2_keywords 0.0.5 I, [2024-05-14T22:53:04.382432 #2230357] INFO -- : securerandom 0.3.1 I, [2024-05-14T22:53:04.383099 #2230357] INFO -- : set 1.1.0 I, [2024-05-14T22:53:04.383603 #2230357] INFO -- : shellwords 0.2.0 I, [2024-05-14T22:53:04.384090 #2230357] INFO -- : singleton 0.2.0 I, [2024-05-14T22:53:04.384536 #2230357] INFO -- : syntax_suggest 2.0.0 I, [2024-05-14T22:53:04.385232 #2230357] INFO -- : tempfile 0.2.1 I, [2024-05-14T22:53:04.385713 #2230357] INFO -- : time 0.3.0 I, [2024-05-14T22:53:04.386142 #2230357] INFO -- : timeout 0.4.1 I, [2024-05-14T22:53:04.386695 #2230357] INFO -- : tmpdir 0.2.0 I, [2024-05-14T22:53:04.387176 #2230357] INFO -- : tsort 0.2.0 I, [2024-05-14T22:53:04.387646 #2230357] INFO -- : un 0.3.0 I, [2024-05-14T22:53:04.388180 #2230357] INFO -- : uri 0.13.0 I, [2024-05-14T22:53:04.389212 #2230357] INFO -- : weakref 0.1.3 I, [2024-05-14T22:53:04.389712 #2230357] INFO -- : yaml 0.3.0 I, [2024-05-14T22:53:04.390056 #2230357] INFO -- : installing default gems from ext: /tmp/ruby/install/trunk/lib/ruby/gems/3.4.0+0 I, [2024-05-14T22:53:04.395910 #2230357] INFO -- : date 3.3.4 I, [2024-05-14T22:53:04.396431 #2230357] INFO -- : digest 3.1.1 I, [2024-05-14T22:53:04.397342 #2230357] INFO -- : etc 1.4.3 I, [2024-05-14T22:53:04.398020 #2230357] INFO -- : fcntl 1.1.0 I, [2024-05-14T22:53:04.398514 #2230357] INFO -- : fiddle 1.1.3 I, [2024-05-14T22:53:04.399004 #2230357] INFO -- : io-console 0.7.2 I, [2024-05-14T22:53:04.399461 #2230357] INFO -- : io-nonblock 0.3.0 I, [2024-05-14T22:53:04.399867 #2230357] INFO -- : io-wait 0.3.1 I, [2024-05-14T22:53:04.400644 #2230357] INFO -- : json 2.7.2 I, [2024-05-14T22:53:04.401416 #2230357] INFO -- : openssl 3.2.0 I, [2024-05-14T22:53:04.402346 #2230357] INFO -- : pathname 0.3.0 I, [2024-05-14T22:53:04.403255 #2230357] INFO -- : psych 5.1.2 I, [2024-05-14T22:53:04.404538 #2230357] INFO -- : stringio 3.1.1 I, [2024-05-14T22:53:04.405070 #2230357] INFO -- : strscan 3.1.1 I, [2024-05-14T22:53:04.405554 #2230357] INFO -- : zlib 3.1.0 I, [2024-05-14T22:53:04.405899 #2230357] INFO -- : installing bundled gems: /tmp/ruby/install/trunk/lib/ruby/gems/3.4.0+0 I, [2024-05-14T22:53:04.406218 #2230357] INFO -- : minitest 5.22.3 I, [2024-05-14T22:53:04.413749 #2230357] INFO -- : rake 13.2.1 I, [2024-05-14T22:53:04.417150 #2230357] INFO -- : test-unit 3.6.2 I, [2024-05-14T22:53:04.420726 #2230357] INFO -- : rexml 3.2.6 I, [2024-05-14T22:53:04.424536 #2230357] INFO -- : rss 0.3.0 I, [2024-05-14T22:53:04.427069 #2230357] INFO -- : net-ftp 0.3.4 I, [2024-05-14T22:53:04.428568 #2230357] INFO -- : net-imap 0.4.11 I, [2024-05-14T22:53:04.431766 #2230357] INFO -- : net-pop 0.1.2 I, [2024-05-14T22:53:04.432675 #2230357] INFO -- : net-smtp 0.5.0 I, [2024-05-14T22:53:04.433862 #2230357] INFO -- : matrix 0.4.2 I, [2024-05-14T22:53:04.437461 #2230357] INFO -- : prime 0.1.2 I, [2024-05-14T22:53:04.441732 #2230357] INFO -- : rbs 3.4.4 I, [2024-05-14T22:53:04.464234 #2230357] INFO -- : typeprof 0.21.11 I, [2024-05-14T22:53:04.466394 #2230357] INFO -- : debug 1.9.2 I, [2024-05-14T22:53:04.469731 #2230357] INFO -- : racc 1.7.3 I, [2024-05-14T22:53:04.472328 #2230357] INFO -- : mutex_m 0.2.0 I, [2024-05-14T22:53:04.473452 #2230357] INFO -- : getoptlong 0.2.1 I, [2024-05-14T22:53:04.474734 #2230357] INFO -- : base64 0.2.0 I, [2024-05-14T22:53:04.475729 #2230357] INFO -- : bigdecimal 3.1.8 I, [2024-05-14T22:53:04.477838 #2230357] INFO -- : observer 0.1.2 I, [2024-05-14T22:53:04.478921 #2230357] INFO -- : abbrev 0.1.2 I, [2024-05-14T22:53:04.479851 #2230357] INFO -- : resolv-replace 0.1.1 I, [2024-05-14T22:53:04.481432 #2230357] INFO -- : rinda 0.2.0 I, [2024-05-14T22:53:04.482662 #2230357] INFO -- : drb 2.2.1 I, [2024-05-14T22:53:04.484483 #2230357] INFO -- : nkf 0.2.0 I, [2024-05-14T22:53:04.486799 #2230357] INFO -- : syslog 0.1.2 I, [2024-05-14T22:53:04.488437 #2230357] INFO -- : csv 3.3.0 I, [2024-05-14T22:53:04.490467 #2230357] INFO -- : installing bundled gem cache: /tmp/ruby/install/trunk/lib/ruby/gems/3.4.0+0/cache I, [2024-05-14T22:53:04.491805 #2230357] INFO -- : skipped bundled gems: I, [2024-05-14T22:53:04.491873 #2230357] INFO -- : power_assert-2.0.4dev.gem not found in bundled_gems I, [2024-05-14T22:53:04.494926 #2230357] INFO -- : $$$[end] "make install -j20" exit with 0. I, [2024-05-14T22:53:04.495075 #2230357] INFO -- : $$$[beg] make yes-btest TESTOPTS='-q -j20' I, [2024-05-14T22:53:10.485797 #2230357] INFO -- : PASS all 1936 tests E, [2024-05-14T22:53:10.491236 #2230357] ERROR -- : I, [2024-05-14T22:53:10.491433 #2230357] INFO -- : $$$[end] "make yes-btest TESTOPTS='-q -j20'" exit with 0. I, [2024-05-14T22:53:10.491527 #2230357] INFO -- : $$$[beg] make yes-test-basic TESTS='-j20' I, [2024-05-14T22:53:10.551455 #2230357] INFO -- : BASERUBY = /usr/bin/ruby --disable=gems I, [2024-05-14T22:53:10.551499 #2230357] INFO -- : CC = gcc I, [2024-05-14T22:53:10.551514 #2230357] INFO -- : LD = ld I, [2024-05-14T22:53:10.551526 #2230357] INFO -- : LDSHARED = gcc -shared I, [2024-05-14T22:53:10.551539 #2230357] INFO -- : CFLAGS = -O3 -fno-fast-math -ggdb3 -Wall -Wextra -Wdeprecated-declarations -Wdiv-by-zero -Wduplicated-cond -Wimplicit-function-declaration -Wimplicit-int -Wpointer-arith -Wwrite-strings -Wold-style-definition -Wimplicit-fallthrough=0 -Wmissing-noreturn -Wno-cast-function-type -Wno-constant-logical-operand -Wno-long-long -Wno-missing-field-initializers -Wno-overlength-strings -Wno-packed-bitfield-compat -Wno-parentheses-equality -Wno-self-assign -Wno-tautological-compare -Wno-unused-parameter -Wno-unused-value -Wsuggest-attribute=format -Wsuggest-attribute=noreturn -Wunused-variable -Wmisleading-indentation -Wundef -fPIC I, [2024-05-14T22:53:10.551551 #2230357] INFO -- : XCFLAGS = -U_FORTIFY_SOURCE -D_FORTIFY_SOURCE=2 -fstack-protector-strong -fno-strict-overflow -fvisibility=hidden -fexcess-precision=standard -DRUBY_EXPORT -I. -I.ext/include/x86_64-linux -I/tmp/ruby/src/trunk/include -I/tmp/ruby/src/trunk -I/tmp/ruby/src/trunk/prism -I/tmp/ruby/src/trunk/enc/unicode/15.0.0 I, [2024-05-14T22:53:10.551578 #2230357] INFO -- : CPPFLAGS = I, [2024-05-14T22:53:10.551591 #2230357] INFO -- : DLDFLAGS = -Wl,--compress-debug-sections=zlib -Wl,-soname,libruby.so.3.4 -fstack-protector-strong I, [2024-05-14T22:53:10.551602 #2230357] INFO -- : SOLIBS = -lz -lrt -lrt -lgmp -ldl -lcrypt -lm -lpthread I, [2024-05-14T22:53:10.551613 #2230357] INFO -- : LANG = en_US.UTF-8 I, [2024-05-14T22:53:10.551624 #2230357] INFO -- : LC_ALL = I, [2024-05-14T22:53:10.551635 #2230357] INFO -- : LC_CTYPE = I, [2024-05-14T22:53:10.551646 #2230357] INFO -- : MFLAGS = I, [2024-05-14T22:53:10.551656 #2230357] INFO -- : RUSTC = no I, [2024-05-14T22:53:10.551667 #2230357] INFO -- : YJIT_RUSTC_ARGS = --crate-name=yjit --crate-type=staticlib --edition=2021 -g -C lto=thin -C opt-level=3 -C overflow-checks=on '--out-dir=/tmp/ruby/build/trunk/yjit/target/release/' /tmp/ruby/src/trunk/yjit/src/lib.rs I, [2024-05-14T22:53:10.551993 #2230357] INFO -- : gcc (Ubuntu 11.4.0-1ubuntu1~22.04) 11.4.0 I, [2024-05-14T22:53:10.552048 #2230357] INFO -- : Copyright (C) 2021 Free Software Foundation, Inc. I, [2024-05-14T22:53:10.552062 #2230357] INFO -- : This is free software; see the source for copying conditions. There is NO I, [2024-05-14T22:53:10.552074 #2230357] INFO -- : warranty; not even for MERCHANTABILITY or FITNESS FOR A PARTICULAR PURPOSE. I, [2024-05-14T22:53:10.552096 #2230357] INFO -- : I, [2024-05-14T22:53:10.656779 #2230357] INFO -- : Checking leaked global symbols...none I, [2024-05-14T22:53:10.697104 #2230357] INFO -- : /tmp/ruby/src/trunk/basictest/test.rb:assignment ....................................................................................................................................................................................................................................................................................................................................................................................OK 372 I, [2024-05-14T22:53:10.697190 #2230357] INFO -- : /tmp/ruby/src/trunk/basictest/test.rb:condition ..OK 2 I, [2024-05-14T22:53:10.697207 #2230357] INFO -- : /tmp/ruby/src/trunk/basictest/test.rb:if/unless ...OK 3 I, [2024-05-14T22:53:10.697221 #2230357] INFO -- : /tmp/ruby/src/trunk/basictest/test.rb:case .....OK 5 I, [2024-05-14T22:53:10.697373 #2230357] INFO -- : /tmp/ruby/src/trunk/basictest/test.rb:while/until ........OK 8 I, [2024-05-14T22:53:10.697423 #2230357] INFO -- : /tmp/ruby/src/trunk/basictest/test.rb:exception ..........OK 10 I, [2024-05-14T22:53:10.697696 #2230357] INFO -- : /tmp/ruby/src/trunk/basictest/test.rb:array .......................................OK 39 I, [2024-05-14T22:53:10.697795 #2230357] INFO -- : /tmp/ruby/src/trunk/basictest/test.rb:hash ...........................OK 27 I, [2024-05-14T22:53:10.698512 #2230357] INFO -- : /tmp/ruby/src/trunk/basictest/test.rb:iterator ...........................................................................................................OK 107 I, [2024-05-14T22:53:10.698785 #2230357] INFO -- : /tmp/ruby/src/trunk/basictest/test.rb:float ................................................................................OK 80 I, [2024-05-14T22:53:10.699793 #2230357] INFO -- : /tmp/ruby/src/trunk/basictest/test.rb:bignum ...............................OK 31 I, [2024-05-14T22:53:10.700572 #2230357] INFO -- : /tmp/ruby/src/trunk/basictest/test.rb:string & char ..............................................................OK 62 I, [2024-05-14T22:53:10.700653 #2230357] INFO -- : /tmp/ruby/src/trunk/basictest/test.rb:assignment ..........OK 10 I, [2024-05-14T22:53:10.700660 #2230357] INFO -- : /tmp/ruby/src/trunk/basictest/test.rb:call ......OK 6 I, [2024-05-14T22:53:10.700666 #2230357] INFO -- : /tmp/ruby/src/trunk/basictest/test.rb:proc .........OK 9 I, [2024-05-14T22:53:10.801219 #2230357] INFO -- : /tmp/ruby/src/trunk/basictest/test.rb:signal ..OK 2 I, [2024-05-14T22:53:10.802889 #2230357] INFO -- : /tmp/ruby/src/trunk/basictest/test.rb:eval ...........................OK 27 I, [2024-05-14T22:53:10.911202 #2230357] INFO -- : /tmp/ruby/src/trunk/basictest/test.rb:system ........OK 8 I, [2024-05-14T22:53:10.911269 #2230357] INFO -- : /tmp/ruby/src/trunk/basictest/test.rb:const .....OK 5 I, [2024-05-14T22:53:10.911275 #2230357] INFO -- : /tmp/ruby/src/trunk/basictest/test.rb:clone .....OK 5 I, [2024-05-14T22:53:10.911391 #2230357] INFO -- : /tmp/ruby/src/trunk/basictest/test.rb:marshal ....OK 4 I, [2024-05-14T22:53:10.911439 #2230357] INFO -- : /tmp/ruby/src/trunk/basictest/test.rb:pack ....OK 4 I, [2024-05-14T22:53:10.911453 #2230357] INFO -- : /tmp/ruby/src/trunk/basictest/test.rb:math ..OK 2 I, [2024-05-14T22:53:10.911500 #2230357] INFO -- : /tmp/ruby/src/trunk/basictest/test.rb:struct ......OK 6 I, [2024-05-14T22:53:10.911597 #2230357] INFO -- : /tmp/ruby/src/trunk/basictest/test.rb:variable ............OK 12 I, [2024-05-14T22:53:10.911623 #2230357] INFO -- : /tmp/ruby/src/trunk/basictest/test.rb:trace ...OK 3 I, [2024-05-14T22:53:10.911685 #2230357] INFO -- : /tmp/ruby/src/trunk/basictest/test.rb:defined? ............OK 12 I, [2024-05-14T22:53:10.911768 #2230357] INFO -- : /tmp/ruby/src/trunk/basictest/test.rb:alias ......OK 6 I, [2024-05-14T22:53:10.912112 #2230357] INFO -- : /tmp/ruby/src/trunk/basictest/test.rb:path .......................OK 23 I, [2024-05-14T22:53:10.945256 #2230357] INFO -- : /tmp/ruby/src/trunk/basictest/test.rb:gc ....OK 4 I, [2024-05-14T22:53:10.947582 #2230357] INFO -- : I, [2024-05-14T22:53:10.947605 #2230357] INFO -- : test succeeded I, [2024-05-14T22:53:10.948942 #2230357] INFO -- : $$$[end] "make yes-test-basic TESTS='-j20'" exit with 0. I, [2024-05-14T22:53:10.949037 #2230357] INFO -- : $$$[beg] make yes-test-all TESTOPTS='--stderr-on-failure' TESTS='-j20' I, [2024-05-14T22:53:11.038784 #2230357] INFO -- : BASERUBY = /usr/bin/ruby --disable=gems I, [2024-05-14T22:53:11.038824 #2230357] INFO -- : CC = gcc I, [2024-05-14T22:53:11.038833 #2230357] INFO -- : LD = ld I, [2024-05-14T22:53:11.038839 #2230357] INFO -- : LDSHARED = gcc -shared I, [2024-05-14T22:53:11.038845 #2230357] INFO -- : CFLAGS = -O3 -fno-fast-math -ggdb3 -Wall -Wextra -Wdeprecated-declarations -Wdiv-by-zero -Wduplicated-cond -Wimplicit-function-declaration -Wimplicit-int -Wpointer-arith -Wwrite-strings -Wold-style-definition -Wimplicit-fallthrough=0 -Wmissing-noreturn -Wno-cast-function-type -Wno-constant-logical-operand -Wno-long-long -Wno-missing-field-initializers -Wno-overlength-strings -Wno-packed-bitfield-compat -Wno-parentheses-equality -Wno-self-assign -Wno-tautological-compare -Wno-unused-parameter -Wno-unused-value -Wsuggest-attribute=format -Wsuggest-attribute=noreturn -Wunused-variable -Wmisleading-indentation -Wundef -fPIC I, [2024-05-14T22:53:11.038851 #2230357] INFO -- : XCFLAGS = -U_FORTIFY_SOURCE -D_FORTIFY_SOURCE=2 -fstack-protector-strong -fno-strict-overflow -fvisibility=hidden -fexcess-precision=standard -DRUBY_EXPORT -I. -I.ext/include/x86_64-linux -I/tmp/ruby/src/trunk/include -I/tmp/ruby/src/trunk -I/tmp/ruby/src/trunk/prism -I/tmp/ruby/src/trunk/enc/unicode/15.0.0 I, [2024-05-14T22:53:11.038855 #2230357] INFO -- : CPPFLAGS = I, [2024-05-14T22:53:11.038859 #2230357] INFO -- : DLDFLAGS = -Wl,--compress-debug-sections=zlib -Wl,-soname,libruby.so.3.4 -fstack-protector-strong I, [2024-05-14T22:53:11.038863 #2230357] INFO -- : SOLIBS = -lz -lrt -lrt -lgmp -ldl -lcrypt -lm -lpthread I, [2024-05-14T22:53:11.038866 #2230357] INFO -- : LANG = en_US.UTF-8 I, [2024-05-14T22:53:11.038870 #2230357] INFO -- : LC_ALL = I, [2024-05-14T22:53:11.038873 #2230357] INFO -- : LC_CTYPE = I, [2024-05-14T22:53:11.038876 #2230357] INFO -- : MFLAGS = I, [2024-05-14T22:53:11.038880 #2230357] INFO -- : RUSTC = no I, [2024-05-14T22:53:11.038885 #2230357] INFO -- : YJIT_RUSTC_ARGS = --crate-name=yjit --crate-type=staticlib --edition=2021 -g -C lto=thin -C opt-level=3 -C overflow-checks=on '--out-dir=/tmp/ruby/build/trunk/yjit/target/release/' /tmp/ruby/src/trunk/yjit/src/lib.rs I, [2024-05-14T22:53:11.039411 #2230357] INFO -- : gcc (Ubuntu 11.4.0-1ubuntu1~22.04) 11.4.0 I, [2024-05-14T22:53:11.039431 #2230357] INFO -- : Copyright (C) 2021 Free Software Foundation, Inc. I, [2024-05-14T22:53:11.039436 #2230357] INFO -- : This is free software; see the source for copying conditions. There is NO I, [2024-05-14T22:53:11.039442 #2230357] INFO -- : warranty; not even for MERCHANTABILITY or FITNESS FOR A PARTICULAR PURPOSE. I, [2024-05-14T22:53:11.039448 #2230357] INFO -- : I, [2024-05-14T22:53:11.041122 #2230357] INFO -- : generating enc.mk I, [2024-05-14T22:53:11.158476 #2230357] INFO -- : making enc I, [2024-05-14T22:53:11.175545 #2230357] INFO -- : make[1]: Entering directory '/tmp/ruby/build/trunk' I, [2024-05-14T22:53:11.175569 #2230357] INFO -- : make[1]: Nothing to be done for 'enc'. I, [2024-05-14T22:53:11.175575 #2230357] INFO -- : make[1]: Leaving directory '/tmp/ruby/build/trunk' I, [2024-05-14T22:53:11.176190 #2230357] INFO -- : making srcs under enc I, [2024-05-14T22:53:11.206225 #2230357] INFO -- : make[1]: Entering directory '/tmp/ruby/build/trunk' I, [2024-05-14T22:53:11.206248 #2230357] INFO -- : make[1]: Nothing to be done for 'srcs'. I, [2024-05-14T22:53:11.206254 #2230357] INFO -- : make[1]: Leaving directory '/tmp/ruby/build/trunk' I, [2024-05-14T22:53:11.207045 #2230357] INFO -- : generating transdb.h I, [2024-05-14T22:53:11.304712 #2230357] INFO -- : transdb.h unchanged I, [2024-05-14T22:53:11.306139 #2230357] INFO -- : making trans I, [2024-05-14T22:53:11.339588 #2230357] INFO -- : make[1]: Entering directory '/tmp/ruby/build/trunk' I, [2024-05-14T22:53:11.339613 #2230357] INFO -- : make[1]: Nothing to be done for 'trans'. I, [2024-05-14T22:53:11.339621 #2230357] INFO -- : make[1]: Leaving directory '/tmp/ruby/build/trunk' I, [2024-05-14T22:53:11.340265 #2230357] INFO -- : making encs I, [2024-05-14T22:53:11.381745 #2230357] INFO -- : make[1]: Entering directory '/tmp/ruby/build/trunk' I, [2024-05-14T22:53:11.381766 #2230357] INFO -- : make[1]: Nothing to be done for 'encs'. I, [2024-05-14T22:53:11.381771 #2230357] INFO -- : make[1]: Leaving directory '/tmp/ruby/build/trunk' I, [2024-05-14T22:53:11.383487 #2230357] INFO -- : generating makefiles ext/configure-ext.mk I, [2024-05-14T22:53:11.410461 #2230357] INFO -- : ext/configure-ext.mk updated I, [2024-05-14T22:53:11.412880 #2230357] INFO -- : make[1]: Entering directory '/tmp/ruby/build/trunk' I, [2024-05-14T22:53:12.759654 #2230357] INFO -- : make[1]: Leaving directory '/tmp/ruby/build/trunk' I, [2024-05-14T22:53:12.760158 #2230357] INFO -- : generating makefile exts.mk I, [2024-05-14T22:53:12.796668 #2230357] INFO -- : exts.mk unchanged I, [2024-05-14T22:53:12.801046 #2230357] INFO -- : make[1]: Entering directory '/tmp/ruby/build/trunk' I, [2024-05-14T22:53:13.114785 #2230357] INFO -- : make[2]: Entering directory '/tmp/ruby/build/trunk/ext/coverage' I, [2024-05-14T22:53:13.118188 #2230357] INFO -- : make[2]: Leaving directory '/tmp/ruby/build/trunk/ext/coverage' I, [2024-05-14T22:53:13.124113 #2230357] INFO -- : make[2]: Entering directory '/tmp/ruby/build/trunk/ext/date' I, [2024-05-14T22:53:13.129201 #2230357] INFO -- : make[2]: Leaving directory '/tmp/ruby/build/trunk/ext/date' I, [2024-05-14T22:53:13.132944 #2230357] INFO -- : make[2]: Entering directory '/tmp/ruby/build/trunk/ext/digest' I, [2024-05-14T22:53:13.141630 #2230357] INFO -- : make[2]: Leaving directory '/tmp/ruby/build/trunk/ext/digest' I, [2024-05-14T22:53:13.167826 #2230357] INFO -- : make[2]: Entering directory '/tmp/ruby/build/trunk/ext/digest/sha2' I, [2024-05-14T22:53:13.172611 #2230357] INFO -- : make[2]: Leaving directory '/tmp/ruby/build/trunk/ext/digest/sha2' I, [2024-05-14T22:53:13.194057 #2230357] INFO -- : make[2]: Entering directory '/tmp/ruby/build/trunk/ext/fiddle' I, [2024-05-14T22:53:13.204728 #2230357] INFO -- : make[2]: Leaving directory '/tmp/ruby/build/trunk/ext/fiddle' I, [2024-05-14T22:53:13.209760 #2230357] INFO -- : make[2]: Entering directory '/tmp/ruby/build/trunk/ext/io/console' I, [2024-05-14T22:53:13.213976 #2230357] INFO -- : make[2]: Leaving directory '/tmp/ruby/build/trunk/ext/io/console' I, [2024-05-14T22:53:13.226859 #2230357] INFO -- : make[2]: Entering directory '/tmp/ruby/build/trunk/ext/json' I, [2024-05-14T22:53:13.237349 #2230357] INFO -- : make[2]: Leaving directory '/tmp/ruby/build/trunk/ext/json' I, [2024-05-14T22:53:13.252479 #2230357] INFO -- : make[2]: Entering directory '/tmp/ruby/build/trunk/ext/monitor' I, [2024-05-14T22:53:13.256646 #2230357] INFO -- : make[2]: Leaving directory '/tmp/ruby/build/trunk/ext/monitor' I, [2024-05-14T22:53:13.263790 #2230357] INFO -- : make[2]: Entering directory '/tmp/ruby/build/trunk/ext/objspace' I, [2024-05-14T22:53:13.269935 #2230357] INFO -- : make[2]: Leaving directory '/tmp/ruby/build/trunk/ext/objspace' I, [2024-05-14T22:53:13.288255 #2230357] INFO -- : make[2]: Entering directory '/tmp/ruby/build/trunk/ext/openssl' I, [2024-05-14T22:53:13.301566 #2230357] INFO -- : make[2]: Leaving directory '/tmp/ruby/build/trunk/ext/openssl' I, [2024-05-14T22:53:13.304480 #2230357] INFO -- : make[2]: Entering directory '/tmp/ruby/build/trunk/ext/pathname' I, [2024-05-14T22:53:13.307085 #2230357] INFO -- : make[2]: Leaving directory '/tmp/ruby/build/trunk/ext/pathname' I, [2024-05-14T22:53:13.311512 #2230357] INFO -- : make[2]: Entering directory '/tmp/ruby/build/trunk/ext/psych' I, [2024-05-14T22:53:13.334547 #2230357] INFO -- : make[2]: Leaving directory '/tmp/ruby/build/trunk/ext/psych' I, [2024-05-14T22:53:13.339767 #2230357] INFO -- : make[2]: Entering directory '/tmp/ruby/build/trunk/ext/pty' I, [2024-05-14T22:53:13.343818 #2230357] INFO -- : make[2]: Leaving directory '/tmp/ruby/build/trunk/ext/pty' I, [2024-05-14T22:53:13.359981 #2230357] INFO -- : make[2]: Entering directory '/tmp/ruby/build/trunk/ext/ripper' I, [2024-05-14T22:53:13.368204 #2230357] INFO -- : make[2]: Leaving directory '/tmp/ruby/build/trunk/ext/ripper' I, [2024-05-14T22:53:13.370712 #2230357] INFO -- : make[2]: Entering directory '/tmp/ruby/build/trunk/ext/rubyvm' I, [2024-05-14T22:53:13.374013 #2230357] INFO -- : make[2]: Leaving directory '/tmp/ruby/build/trunk/ext/rubyvm' I, [2024-05-14T22:53:13.385668 #2230357] INFO -- : make[2]: Entering directory '/tmp/ruby/build/trunk/ext/socket' I, [2024-05-14T22:53:13.392945 #2230357] INFO -- : make[2]: Leaving directory '/tmp/ruby/build/trunk/ext/socket' I, [2024-05-14T22:53:13.410655 #2230357] INFO -- : make[2]: Entering directory '/tmp/ruby/build/trunk/.bundle/gems/bigdecimal-3.1.8/ext/bigdecimal' I, [2024-05-14T22:53:13.434445 #2230357] INFO -- : make[2]: Leaving directory '/tmp/ruby/build/trunk/.bundle/gems/bigdecimal-3.1.8/ext/bigdecimal' I, [2024-05-14T22:53:13.436395 #2230357] INFO -- : make[2]: Entering directory '/tmp/ruby/build/trunk/.bundle/gems/debug-1.9.2/ext/debug' I, [2024-05-14T22:53:13.458236 #2230357] INFO -- : make[2]: Leaving directory '/tmp/ruby/build/trunk/.bundle/gems/debug-1.9.2/ext/debug' I, [2024-05-14T22:53:13.460168 #2230357] INFO -- : make[2]: Entering directory '/tmp/ruby/build/trunk/.bundle/gems/nkf-0.2.0/ext/nkf' I, [2024-05-14T22:53:13.481605 #2230357] INFO -- : make[2]: Leaving directory '/tmp/ruby/build/trunk/.bundle/gems/nkf-0.2.0/ext/nkf' I, [2024-05-14T22:53:13.483382 #2230357] INFO -- : make[2]: Entering directory '/tmp/ruby/build/trunk/.bundle/gems/racc-1.7.3/ext/racc/cparse' I, [2024-05-14T22:53:13.507434 #2230357] INFO -- : make[2]: Leaving directory '/tmp/ruby/build/trunk/.bundle/gems/racc-1.7.3/ext/racc/cparse' I, [2024-05-14T22:53:13.510419 #2230357] INFO -- : make[2]: Entering directory '/tmp/ruby/build/trunk/.bundle/gems/rbs-3.4.4/ext/rbs_extension' I, [2024-05-14T22:53:13.537405 #2230357] INFO -- : make[2]: Leaving directory '/tmp/ruby/build/trunk/.bundle/gems/rbs-3.4.4/ext/rbs_extension' I, [2024-05-14T22:53:13.539273 #2230357] INFO -- : make[2]: Entering directory '/tmp/ruby/build/trunk/.bundle/gems/syslog-0.1.2/ext/syslog' I, [2024-05-14T22:53:13.560893 #2230357] INFO -- : make[2]: Leaving directory '/tmp/ruby/build/trunk/.bundle/gems/syslog-0.1.2/ext/syslog' I, [2024-05-14T22:53:13.584598 #2230357] INFO -- : make[2]: Entering directory '/tmp/ruby/build/trunk' I, [2024-05-14T22:53:13.656452 #2230357] INFO -- : make[2]: 'ruby' is up to date. I, [2024-05-14T22:53:13.656493 #2230357] INFO -- : make[2]: Leaving directory '/tmp/ruby/build/trunk' I, [2024-05-14T22:53:13.656916 #2230357] INFO -- : make[1]: Leaving directory '/tmp/ruby/build/trunk' I, [2024-05-14T22:53:13.660664 #2230357] INFO -- : make[1]: Entering directory '/tmp/ruby/build/trunk' I, [2024-05-14T22:53:13.660690 #2230357] INFO -- : make[1]: Nothing to be done for 'note'. I, [2024-05-14T22:53:13.660698 #2230357] INFO -- : make[1]: Leaving directory '/tmp/ruby/build/trunk' I, [2024-05-14T22:53:13.734652 #2230357] INFO -- : Run options: I, [2024-05-14T22:53:13.734719 #2230357] INFO -- : --seed=61847 I, [2024-05-14T22:53:13.734725 #2230357] INFO -- : "--ruby=./miniruby -I/tmp/ruby/src/trunk/lib -I. -I.ext/common /tmp/ruby/src/trunk/tool/runruby.rb --extout=.ext -- --disable-gems" I, [2024-05-14T22:53:13.734731 #2230357] INFO -- : --excludes-dir=/tmp/ruby/src/trunk/test/.excludes I, [2024-05-14T22:53:13.734735 #2230357] INFO -- : --name=!/memory_leak/ I, [2024-05-14T22:53:13.734739 #2230357] INFO -- : --stderr-on-failure I, [2024-05-14T22:53:13.734744 #2230357] INFO -- : -j20 I, [2024-05-14T22:53:13.734748 #2230357] INFO -- : I, [2024-05-14T22:53:13.734752 #2230357] INFO -- : # Running tests: I, [2024-05-14T22:53:13.734757 #2230357] INFO -- : I, [2024-05-14T22:53:13.881968 #2230357] INFO -- : [ 1/885] 2271720=test_gb18030 I, [2024-05-14T22:53:13.882385 #2230357] INFO -- : [ 2/885] 2271717=test_svcb_https I, [2024-05-14T22:53:13.882518 #2230357] INFO -- : [ 3/885] 2271716=test_buffering I, [2024-05-14T22:53:13.883111 #2230357] INFO -- : [ 4/885] 2271715=test_gem_uninstaller I, [2024-05-14T22:53:13.884772 #2230357] INFO -- : [ 5/885] 2271719=test_rdoc_rdoc I, [2024-05-14T22:53:13.885434 #2230357] INFO -- : [ 6/885] 2271729=test_windows_1251 I, [2024-05-14T22:53:13.885642 #2230357] INFO -- : [ 7/885] 2271734=test_time I, [2024-05-14T22:53:13.886201 #2230357] INFO -- : [ 8/885] 2271718=test_rdoc_i18n_text I, [2024-05-14T22:53:13.886220 #2230357] INFO -- : [ 9/885] 2271733=test_io_buffer I, [2024-05-14T22:53:13.886229 #2230357] INFO -- : [ 10/885] 2271730=test_defined I, [2024-05-14T22:53:13.887026 #2230357] INFO -- : [ 11/885] 2271731=test_backtrace I, [2024-05-14T22:53:13.887064 #2230357] INFO -- : [ 12/885] 2271732=test_key_name_check I, [2024-05-14T22:53:13.889249 #2230357] INFO -- : [ 13/885] 2271720=test_pkey_ec I, [2024-05-14T22:53:13.890300 #2230357] INFO -- : [ 14/885] 2271731=test_trick I, [2024-05-14T22:53:13.894833 #2230357] INFO -- : [ 15/885] 2271729=test_thread I, [2024-05-14T22:53:13.894893 #2230357] INFO -- : [ 16/885] 2271729=test_pipe I, [2024-05-14T22:53:13.908247 #2230357] INFO -- : [ 17/885] 2271732=test_date_parse I, [2024-05-14T22:53:13.909042 #2230357] INFO -- : [ 18/885] 2271728=test_rdoc_markup_attributes I, [2024-05-14T22:53:13.913643 #2230357] INFO -- : [ 19/885] 2271717=test_default_gems I, [2024-05-14T22:53:13.915630 #2230357] INFO -- : [ 20/885] 2271722=test_rdoc_rd_inline_parser I, [2024-05-14T22:53:13.920328 #2230357] INFO -- : [ 21/885] 2271721=test_rdoc_markup_to_rdoc I, [2024-05-14T22:53:13.920405 #2230357] INFO -- : [ 22/885] 2271723=test_mul I, [2024-05-14T22:53:13.920503 #2230357] INFO -- : [ 23/885] 2271724=test_win32ole_type I, [2024-05-14T22:53:13.920610 #2230357] INFO -- : [ 24/885] 2271725=test_null I, [2024-05-14T22:53:13.920701 #2230357] INFO -- : [ 25/885] 2271726=test_gem_dependency_resolution_error I, [2024-05-14T22:53:13.921462 #2230357] INFO -- : [ 26/885] 2271727=test_rdoc_parser I, [2024-05-14T22:53:13.925057 #2230357] INFO -- : [ 27/885] 2271724=test_qsort I, [2024-05-14T22:53:13.928177 #2230357] INFO -- : [ 28/885] 2271733=json_addition_test I, [2024-05-14T22:53:13.930842 #2230357] INFO -- : [ 29/885] 2271724=test_custom_command I, [2024-05-14T22:53:13.935013 #2230357] INFO -- : [ 30/885] 2271723=test_raise I, [2024-05-14T22:53:13.936997 #2230357] INFO -- : [ 31/885] 2271723=test_x509attr I, [2024-05-14T22:53:13.940352 #2230357] INFO -- : [ 32/885] 2271716=test_gem_request_set_lockfile_parser I, [2024-05-14T22:53:13.944964 #2230357] INFO -- : [ 33/885] 2271725=test_depth_first I, [2024-05-14T22:53:13.957114 #2230357] INFO -- : [ 34/885] 2271733=test_rdoc_store I, [2024-05-14T22:53:13.964617 #2230357] INFO -- : [ 35/885] 2271730=test_string I, [2024-05-14T22:53:13.971790 #2230357] INFO -- : [ 36/885] 2271717=test_rdoc_stats I, [2024-05-14T22:53:13.975213 #2230357] INFO -- : [ 37/885] 2271725=test_pattern_matching I, [2024-05-14T22:53:13.982398 #2230357] INFO -- : [ 38/885] 2271723=test_files_test_2 I, [2024-05-14T22:53:13.994592 #2230357] INFO -- : [ 39/885] 2271730=test_fnmatch I, [2024-05-14T22:53:14.015727 #2230357] INFO -- : [ 40/885] 2271734=test_require_path_check I, [2024-05-14T22:53:14.015787 #2230357] INFO -- : [ 41/885] 2271720=test_rdoc_markup_parser I, [2024-05-14T22:53:14.015796 #2230357] INFO -- : [ 42/885] 2271725=test_folderitem2_invokeverb I, [2024-05-14T22:53:14.015802 #2230357] INFO -- : [ 43/885] 2271725=test_gem_validator I, [2024-05-14T22:53:14.015807 #2230357] INFO -- : [ 44/885] 2271718=test_gem_package_old I, [2024-05-14T22:53:14.024096 #2230357] INFO -- : [ 45/885] 2271732=test_gem_resolver_index_set I, [2024-05-14T22:53:14.030148 #2230357] INFO -- : [ 46/885] 2271728=test_gc_compact I, [2024-05-14T22:53:14.048270 #2230357] INFO -- : [ 47/885] 2271730=test_proc I, [2024-05-14T22:53:14.056592 #2230357] INFO -- : [ 48/885] 2271729=test_string I, [2024-05-14T22:53:14.059409 #2230357] INFO -- : [ 49/885] 2271724=test_date_conv I, [2024-05-14T22:53:14.061193 #2230357] INFO -- : [ 50/885] 2271734=test_optimization I, [2024-05-14T22:53:14.075846 #2230357] INFO -- : [ 51/885] 2271724=test_erb_m17n I, [2024-05-14T22:53:14.097571 #2230357] INFO -- : [ 52/885] 2271724=test_ole_methods I, [2024-05-14T22:53:14.099327 #2230357] INFO -- : [ 53/885] 2271724=test_egrep_cpp I, [2024-05-14T22:53:14.101779 #2230357] INFO -- : [ 54/885] 2271722=test_cgi_tag_helper I, [2024-05-14T22:53:14.104834 #2230357] INFO -- : [ 55/885] 2271719=test_zlib I, [2024-05-14T22:53:14.115365 #2230357] INFO -- : [ 56/885] 2271726=test_iter_break I, [2024-05-14T22:53:14.119030 #2230357] INFO -- : [ 57/885] 2271726=test_zsh_completion I, [2024-05-14T22:53:14.120964 #2230357] INFO -- : [ 58/885] 2271721=test_exception I, [2024-05-14T22:53:14.121296 #2230357] INFO -- : [ 59/885] 2271726=test_gem_ext_configure_builder I, [2024-05-14T22:53:14.124468 #2230357] INFO -- : [ 60/885] 2271722=test_frozen I, [2024-05-14T22:53:14.127684 #2230357] INFO -- : [ 61/885] 2271727=test_pp I, [2024-05-14T22:53:14.132166 #2230357] INFO -- : [ 62/885] 2271722=test_macro I, [2024-05-14T22:53:14.153939 #2230357] INFO -- : [ 63/885] 2271721=test_rdoc_single_class I, [2024-05-14T22:53:14.158529 #2230357] INFO -- : [ 64/885] 2271721=test_num2int I, [2024-05-14T22:53:14.171508 #2230357] INFO -- : [ 65/885] 2271726=test_nil I, [2024-05-14T22:53:14.171575 #2230357] INFO -- : [ 66/885] 2271727=test_verbose I, [2024-05-14T22:53:14.171591 #2230357] INFO -- : [ 67/885] 2271721=test_config I, [2024-05-14T22:53:14.171681 #2230357] INFO -- : [ 68/885] 2271717=test_gem_source_list I, [2024-05-14T22:53:14.185175 #2230357] INFO -- : [ 69/885] 2271726=test_optarg I, [2024-05-14T22:53:14.185479 #2230357] INFO -- : [ 70/885] 2271727=test_yaml_special_cases I, [2024-05-14T22:53:14.194260 #2230357] INFO -- : [ 71/885] 2271720=test_address_resolve I, [2024-05-14T22:53:14.207809 #2230357] INFO -- : [ 72/885] 2271732=test_rdoc_token_stream I, [2024-05-14T22:53:14.216640 #2230357] INFO -- : [ 73/885] 2271720=test_gem_spec_fetcher I, [2024-05-14T22:53:14.217807 #2230357] INFO -- : [ 74/885] 2271722=test_common I, [2024-05-14T22:53:14.219514 #2230357] INFO -- : [ 75/885] 2271727=test_key_actor_vi I, [2024-05-14T22:53:14.237092 #2230357] INFO -- : [ 76/885] 2271718=test_bug-3571 I, [2024-05-14T22:53:14.245411 #2230357] INFO -- : [ 77/885] 2271718=test_gem_command I, [2024-05-14T22:53:14.274886 #2230357] INFO -- : [ 78/885] 2271724=test_gem_commands_lock_command I, [2024-05-14T22:53:14.274946 #2230357] INFO -- : [ 79/885] 2271721=test_ifunless I, [2024-05-14T22:53:14.276423 #2230357] INFO -- : [ 80/885] 2271721=test_assignment I, [2024-05-14T22:53:14.279804 #2230357] INFO -- : [ 81/885] 2271725=test_numeric I, [2024-05-14T22:53:14.282080 #2230357] INFO -- : [ 82/885] 2271716=test_rdoc_tom_doc I, [2024-05-14T22:53:14.322029 #2230357] INFO -- : [ 83/885] 2271718=test_hmac I, [2024-05-14T22:53:14.326889 #2230357] INFO -- : [ 84/885] 2271718=test_rdoc_markup_to_tt_only I, [2024-05-14T22:53:14.339546 #2230357] INFO -- : [ 85/885] 2271732=test_gem_ext_cargo_builder_unit I, [2024-05-14T22:53:14.348493 #2230357] INFO -- : [ 86/885] 2271725=test_date I, [2024-05-14T22:53:14.350172 #2230357] INFO -- : [ 87/885] 2271718=test_gem_rdoc I, [2024-05-14T22:53:14.360153 #2230357] INFO -- : [ 88/885] 2271725=test_command I, [2024-05-14T22:53:14.361687 #2230357] INFO -- : [ 89/885] 2271726=test_at_exit I, [2024-05-14T22:53:14.362395 #2230357] INFO -- : [ 90/885] 2271732=test_object_create_start I, [2024-05-14T22:53:14.364964 #2230357] INFO -- : [ 91/885] 2271732=test_rdoc_markup_paragraph I, [2024-05-14T22:53:14.379029 #2230357] INFO -- : [ 92/885] 2271726=!Nothing_to_test I, [2024-05-14T22:53:14.380098 #2230357] INFO -- : [ 93/885] 2271726=test_enc_raise I, [2024-05-14T22:53:14.385672 #2230357] INFO -- : [ 94/885] 2271726=test_psych I, [2024-05-14T22:53:14.387375 #2230357] INFO -- : [ 95/885] 2271732=test_eval_history I, [2024-05-14T22:53:14.405098 #2230357] INFO -- : [ 96/885] 2271726=dispatcher_test I, [2024-05-14T22:53:14.417678 #2230357] INFO -- : [ 97/885] 2271717=test_kernel I, [2024-05-14T22:53:14.431986 #2230357] INFO -- : [ 98/885] 2271722=test_kdf I, [2024-05-14T22:53:14.435979 #2230357] INFO -- : [ 99/885] 2271727=test_gem_doctor I, [2024-05-14T22:53:14.470816 #2230357] INFO -- : [100/885] 2271718=test_gem_silent_ui I, [2024-05-14T22:53:14.490679 #2230357] INFO -- : [101/885] 2271716=test_emitter I, [2024-05-14T22:53:14.493612 #2230357] INFO -- : [102/885] 2271726=test_bug-5832 I, [2024-05-14T22:53:14.497847 #2230357] INFO -- : [103/885] 2271726=test_files_ext I, [2024-05-14T22:53:14.504171 #2230357] INFO -- : [104/885] 2271718=test_require I, [2024-05-14T22:53:14.506970 #2230357] INFO -- : [105/885] 2271718=test_rdoc_markup_to_joined_paragraph I, [2024-05-14T22:53:14.508754 #2230357] INFO -- : [106/885] 2271716=test_date_time I, [2024-05-14T22:53:14.513134 #2230357] INFO -- : [107/885] 2271718=index_write_test I, [2024-05-14T22:53:14.517768 #2230357] INFO -- : [108/885] 2271724=test_date_new I, [2024-05-14T22:53:14.520623 #2230357] INFO -- : [109/885] 2271716=test_data I, [2024-05-14T22:53:14.528197 #2230357] INFO -- : [110/885] 2271724=test_syntax I, [2024-05-14T22:53:14.528267 #2230357] INFO -- : [111/885] 2271716=test_gem_safe_yaml I, [2024-05-14T22:53:14.529759 #2230357] INFO -- : [112/885] 2271722=test_rdoc_text I, [2024-05-14T22:53:14.534356 #2230357] INFO -- : [113/885] 2271732=test_tcp I, [2024-05-14T22:53:14.538474 #2230357] INFO -- : [114/885] 2271716=test_iso_8859 I, [2024-05-14T22:53:14.564298 #2230357] INFO -- : [115/885] 2271716=test_nil2vtempty I, [2024-05-14T22:53:14.568876 #2230357] INFO -- : [116/885] 2271716=test_stream I, [2024-05-14T22:53:14.571085 #2230357] INFO -- : [117/885] 2271722=test_rdoc_context I, [2024-05-14T22:53:14.580851 #2230357] INFO -- : [118/885] 2271716=test_httpresponse I, [2024-05-14T22:53:14.586271 #2230357] INFO -- : [119/885] 2271720=test_open-uri I, [2024-05-14T22:53:14.587323 #2230357] INFO -- : [120/885] 2271718=test_rdoc_parser_ruby I, [2024-05-14T22:53:14.590572 #2230357] INFO -- : [121/885] 2271726=test_name_error I, [2024-05-14T22:53:14.677347 #2230357] INFO -- : [122/885] 2271716=test_rdoc_markup_attribute_manager I, [2024-05-14T22:53:14.707992 #2230357] INFO -- : [123/885] 2271726=test_gem_resolver I, [2024-05-14T22:53:14.708941 #2230357] INFO -- : [124/885] 2271716=test_gem_resolver_composed_set I, [2024-05-14T22:53:14.715626 #2230357] INFO -- : [125/885] 2271727=test_safe_load I, [2024-05-14T22:53:14.720493 #2230357] INFO -- : [126/885] 2271716=test_gem_commands_dependency_command I, [2024-05-14T22:53:14.729616 #2230357] INFO -- : [127/885] 2271727=test_gem_commands_specification_command I, [2024-05-14T22:53:14.744980 #2230357] INFO -- : [128/885] 2271732=test_flags I, [2024-05-14T22:53:14.786768 #2230357] INFO -- : [129/885] 2271725=test_inadvertent_creation I, [2024-05-14T22:53:14.804396 #2230357] INFO -- : [130/885] 2271716=test_enumerator I, [2024-05-14T22:53:14.883899 #2230357] INFO -- : [131/885] 2271725=test_http I, [2024-05-14T22:53:14.886072 #2230357] INFO -- : [132/885] 2271727=test_gem_commands_which_command I, [2024-05-14T22:53:14.891026 #2230357] INFO -- : [133/885] 2271730=test_shift_jis I, [2024-05-14T22:53:14.894540 #2230357] INFO -- : [134/885] 2271730=test_x509cert I, [2024-05-14T22:53:14.896224 #2230357] INFO -- : [135/885] 2271725=test_gc I, [2024-05-14T22:53:14.923384 #2230357] INFO -- : [136/885] 2271727=test_gem_resolver_lock_specification I, [2024-05-14T22:53:14.937291 #2230357] INFO -- : [137/885] 2271733=test_err_in_callback I, [2024-05-14T22:53:14.939744 #2230357] INFO -- : [138/885] 2271733=test_logdevice I, [2024-05-14T22:53:14.961598 #2230357] INFO -- : [139/885] 2271727=test_arity I, [2024-05-14T22:53:14.967645 #2230357] INFO -- : [140/885] 2271727=test_gem_ext_rake_builder I, [2024-05-14T22:53:14.998668 #2230357] INFO -- : [141/885] 2271715=test_gem_security_policy I, [2024-05-14T22:53:15.020507 #2230357] INFO -- : [142/885] 2271726=test_gem_source_local I, [2024-05-14T22:53:15.065757 #2230357] INFO -- : [143/885] 2271718=test_pack I, [2024-05-14T22:53:15.114791 #2230357] INFO -- : [144/885] 2271717=test_last_thread I, [2024-05-14T22:53:15.183948 #2230357] INFO -- : [145/885] 2271730=test_process I, [2024-05-14T22:53:15.229775 #2230357] INFO -- : [146/885] 2271715=test_thread_fd_close I, [2024-05-14T22:53:15.233088 #2230357] INFO -- : [147/885] 2271715=test_passing_block I, [2024-05-14T22:53:15.236565 #2230357] INFO -- : [148/885] 2271715=test_stringchar I, [2024-05-14T22:53:15.270229 #2230357] INFO -- : [149/885] 2271726=test_hash_create I, [2024-05-14T22:53:15.280430 #2230357] INFO -- : [150/885] 2271726=newline_test I, [2024-05-14T22:53:15.300339 #2230357] INFO -- : [151/885] 2271715=test_uncorrectable_name_check I, [2024-05-14T22:53:15.304087 #2230357] INFO -- : [152/885] 2271718=test_switch_hitter I, [2024-05-14T22:53:15.310004 #2230357] INFO -- : [153/885] 2271715=test_singleton I, [2024-05-14T22:53:15.316889 #2230357] INFO -- : [154/885] 2271715=test_flush I, [2024-05-14T22:53:15.320042 #2230357] INFO -- : [155/885] 2271718=test_io_console I, [2024-05-14T22:53:15.321672 #2230357] INFO -- : [156/885] 2271715=test_logperiod I, [2024-05-14T22:53:15.333953 #2230357] INFO -- : [157/885] 2271715=test_c_union_entity I, [2024-05-14T22:53:15.360538 #2230357] INFO -- : [158/885] 2271726=test_rdoc_normal_module I, [2024-05-14T22:53:15.369324 #2230357] INFO -- : [159/885] 2271715=test_rdoc_markdown_test I, [2024-05-14T22:53:15.388109 #2230357] INFO -- : [160/885] 2271722=test_securerandom I, [2024-05-14T22:53:15.391909 #2230357] INFO -- : [161/885] 2271720=test_objectspace I, [2024-05-14T22:53:15.407867 #2230357] INFO -- : [162/885] 2271722=test_thread I, [2024-05-14T22:53:15.548756 #2230357] INFO -- : [163/885] 2271726=test_socket I, [2024-05-14T22:53:15.628210 #2230357] INFO -- : [164/885] 2271722=test_rdoc_markup_to_table_of_contents I, [2024-05-14T22:53:15.641952 #2230357] INFO -- : [165/885] 2271722=test_dot_dot I, [2024-05-14T22:53:15.645292 #2230357] INFO -- : [166/885] 2271722=test_c_struct_builder I, [2024-05-14T22:53:15.656333 #2230357] INFO -- : [167/885] 2271719=test_str2big I, [2024-05-14T22:53:15.658329 #2230357] INFO -- : [168/885] 2271719=test_literal I, [2024-05-14T22:53:15.685159 #2230357] INFO -- : [169/885] 2271733=test_rdoc_generator_ri I, [2024-05-14T22:53:15.690681 #2230357] INFO -- : [170/885] 2271733=test_extlibs I, [2024-05-14T22:53:15.699952 #2230357] INFO -- : [171/885] 2271727=test_gem_stream_ui I, [2024-05-14T22:53:15.702842 #2230357] INFO -- : [172/885] 2271722=test_gem_install_update_options I, [2024-05-14T22:53:15.776793 #2230357] INFO -- : [173/885] 2271727=parse_test I, [2024-05-14T22:53:15.799124 #2230357] INFO -- : [174/885] 2271732=test_require_lib I, [2024-05-14T22:53:15.944244 #2230357] INFO -- : [175/885] 2271722=test_ractor I, [2024-05-14T22:53:15.952729 #2230357] INFO -- : [176/885] 2271731=test_severity I, [2024-05-14T22:53:15.955641 #2230357] INFO -- : [177/885] 2271722=test_rdoc_markup_to_markdown I, [2024-05-14T22:53:15.956509 #2230357] INFO -- : [178/885] 2271731=test_json_tree I, [2024-05-14T22:53:15.972358 #2230357] INFO -- : [179/885] 2271731=test_ansi_with_terminfo I, [2024-05-14T22:53:15.988111 #2230357] INFO -- : [180/885] 2271722=test_rdoc_generator_pot_po I, [2024-05-14T22:53:15.991665 #2230357] INFO -- : [181/885] 2271722=test_ractor I, [2024-05-14T22:53:16.002618 #2230357] INFO -- : [182/885] 2271721=test_m17n_comb I, [2024-05-14T22:53:16.016283 #2230357] INFO -- : [183/885] 2271731=test_memory_view I, [2024-05-14T22:53:16.054486 #2230357] INFO -- : [184/885] 2271722=test_grapheme_breaks I, [2024-05-14T22:53:16.060880 #2230357] INFO -- : [185/885] 2271731=test_gem_version_option I, [2024-05-14T22:53:16.079980 #2230357] INFO -- : [186/885] 2271722=test_gem_request_connection_pools I, [2024-05-14T22:53:16.175596 #2230357] INFO -- : [187/885] 2271717=test_cclass I, [2024-05-14T22:53:16.255990 #2230357] INFO -- : [188/885] 2271719=test_parser_events I, [2024-05-14T22:53:16.256184 #2230357] INFO -- : [189/885] 2271731=test_reline I, [2024-05-14T22:53:16.259183 #2230357] INFO -- : [190/885] 2271717=test_case I, [2024-05-14T22:53:16.260825 #2230357] INFO -- : [191/885] 2271717=test_pkey I, [2024-05-14T22:53:16.304222 #2230357] INFO -- : [192/885] 2271717=test_settracefunc I, [2024-05-14T22:53:16.325070 #2230357] INFO -- : [193/885] 2271719=test_gem_text I, [2024-05-14T22:53:16.358059 #2230357] INFO -- : [194/885] 2271720=test_enumerator_kw I, [2024-05-14T22:53:16.361208 #2230357] INFO -- : [195/885] 2271720=test_scan_args I, [2024-05-14T22:53:16.371283 #2230357] INFO -- : [196/885] 2271720=test_generic I, [2024-05-14T22:53:16.401705 #2230357] INFO -- : [197/885] 2271720=test_win32ole I, [2024-05-14T22:53:16.405138 #2230357] INFO -- : [198/885] 2271720=test_sprintf_comb I, [2024-05-14T22:53:16.409772 #2230357] INFO -- : [199/885] 2271728=test_method_cache I, [2024-05-14T22:53:16.414177 #2230357] INFO -- : [200/885] 2271728=test_gem_request I, [2024-05-14T22:53:16.516874 #2230357] INFO -- : [201/885] 2271719=test_gem_commands_mirror I, [2024-05-14T22:53:16.522943 #2230357] INFO -- : [202/885] 2271719=test_gem_ext_cargo_builder_link_flag_converter I, [2024-05-14T22:53:16.524994 #2230357] INFO -- : [203/885] 2271731=test_gem_package_tar_reader_entry I, [2024-05-14T22:53:16.555361 #2230357] INFO -- : [204/885] 2271720=test_gem_name_tuple I, [2024-05-14T22:53:16.568181 #2230357] INFO -- : [205/885] 2271720=test_rand I, [2024-05-14T22:53:16.574741 #2230357] INFO -- : [206/885] 2271719=test_bug_reporter I, [2024-05-14T22:53:16.694713 #2230357] INFO -- : [207/885] 2271731=test_exception I, [2024-05-14T22:53:16.712824 #2230357] INFO -- : [208/885] 2271728=test_store I, [2024-05-14T22:53:16.797554 #2230357] INFO -- : [209/885] 2271720=test_case_options I, [2024-05-14T22:53:16.800477 #2230357] INFO -- : [210/885] 2271720=test_gem_commands_info_command I, [2024-05-14T22:53:16.826228 #2230357] INFO -- : [211/885] 2271720=test_gem_dependency_installer I, [2024-05-14T22:53:16.835367 #2230357] INFO -- : [212/885] 2271728=test_scalar I, [2024-05-14T22:53:16.839823 #2230357] INFO -- : [213/885] 2271728=test_rdoc_cross_reference I, [2024-05-14T22:53:16.840497 #2230357] INFO -- : [214/885] 2271715=test_deprecate I, [2024-05-14T22:53:16.881614 #2230357] INFO -- : [215/885] 2271715=test_rdoc_constant I, [2024-05-14T22:53:16.939932 #2230357] INFO -- : [216/885] 2271726=test_bash_completion I, [2024-05-14T22:53:16.944809 #2230357] INFO -- : [217/885] 2271726=test_formatter I, [2024-05-14T22:53:16.954579 #2230357] INFO -- : [218/885] 2271726=test_gem_source_vendor I, [2024-05-14T22:53:16.956192 #2230357] INFO -- : [219/885] 2271719=test_gem_commands_owner_command I, [2024-05-14T22:53:16.964329 #2230357] INFO -- : [220/885] 2271726=test_recorder I, [2024-05-14T22:53:16.967465 #2230357] INFO -- : [221/885] 2271726=test_coverage I, [2024-05-14T22:53:17.009480 #2230357] INFO -- : [222/885] 2271715=test_rdoc_encoding I, [2024-05-14T22:53:17.045874 #2230357] INFO -- : [223/885] 2271715=regexp_test I, [2024-05-14T22:53:17.111742 #2230357] INFO -- : [224/885] 2271722=test_gem_package_tar_reader I, [2024-05-14T22:53:17.127406 #2230357] INFO -- : [225/885] 2271715=test_init I, [2024-05-14T22:53:17.141619 #2230357] INFO -- : [226/885] 2271722=test_complexrational I, [2024-05-14T22:53:17.146526 #2230357] INFO -- : [227/885] 2271722=test_pathname I, [2024-05-14T22:53:17.216415 #2230357] INFO -- : [228/885] 2271717=test_rdoc_markdown I, [2024-05-14T22:53:17.249536 #2230357] INFO -- : [229/885] 2271723=test_gem_available_set I, [2024-05-14T22:53:17.387650 #2230357] INFO -- : [230/885] 2271722=test_rdoc_any_method I, [2024-05-14T22:53:17.422001 #2230357] INFO -- : [231/885] 2271728=test_modify_expand I, [2024-05-14T22:53:17.426402 #2230357] INFO -- : [232/885] 2271728=test_file I, [2024-05-14T22:53:17.430453 #2230357] INFO -- : [233/885] 2271728=test_fiddle I, [2024-05-14T22:53:17.437441 #2230357] INFO -- : [234/885] 2271717=test_wss I, [2024-05-14T22:53:17.452811 #2230357] INFO -- : [235/885] 2271717=test_ractor I, [2024-05-14T22:53:17.463984 #2230357] INFO -- : [236/885] 2271723=test_find I, [2024-05-14T22:53:17.477626 #2230357] INFO -- : [237/885] 2271728=test_marshalable I, [2024-05-14T22:53:17.479291 #2230357] INFO -- : [238/885] 2271723=test_digest I, [2024-05-14T22:53:17.481834 #2230357] INFO -- : [239/885] 2271728=test_gem_ext_cmake_builder I, [2024-05-14T22:53:17.501260 #2230357] INFO -- : [240/885] 2271728=test_gem_commands_contents_command I, [2024-05-14T22:53:17.523664 #2230357] INFO -- : [241/885] 2271719=test_cgi_util I, [2024-05-14T22:53:17.553363 #2230357] INFO -- : [242/885] 2271717=test_require I, [2024-05-14T22:53:17.602739 #2230357] INFO -- : [243/885] 2271728=test_gbk I, [2024-05-14T22:53:17.610137 #2230357] INFO -- : [244/885] 2271728=test_class2name I, [2024-05-14T22:53:17.612621 #2230357] INFO -- : [245/885] 2271728=test_enc_str_buf_cat I, [2024-05-14T22:53:17.614847 #2230357] INFO -- : [246/885] 2271729=test_pstore I, [2024-05-14T22:53:17.616785 #2230357] INFO -- : [247/885] 2271728=test_cstr I, [2024-05-14T22:53:17.633267 #2230357] INFO -- : [248/885] 2271715=test_profile_frames I, [2024-05-14T22:53:17.641589 #2230357] INFO -- : [249/885] 2271733=test_io_timeout I, [2024-05-14T22:53:17.654327 #2230357] INFO -- : [250/885] 2271733=test_shapes I, [2024-05-14T22:53:17.656226 #2230357] INFO -- : [251/885] 2271733=json_fixtures_test I, [2024-05-14T22:53:17.658630 #2230357] INFO -- : [252/885] 2271729=test_comparable I, [2024-05-14T22:53:17.660659 #2230357] INFO -- : [253/885] 2271733=test_rdoc_parser_c I, [2024-05-14T22:53:17.668487 #2230357] INFO -- : [254/885] 2271729=test_nowrite I, [2024-05-14T22:53:17.683168 #2230357] INFO -- : [255/885] 2271729=test_thread_queue I, [2024-05-14T22:53:17.753943 #2230357] INFO -- : [256/885] 2271719=test_rdoc_markup_formatter I, [2024-05-14T22:53:17.760164 #2230357] INFO -- : [257/885] 2271719=test_bmethod I, [2024-05-14T22:53:17.764814 #2230357] INFO -- : [258/885] 2271719=test_ractor I, [2024-05-14T22:53:17.778684 #2230357] INFO -- : [259/885] 2271719=test_euc_tw I, [2024-05-14T22:53:17.782773 #2230357] INFO -- : [260/885] 2271719=test_ansi_without_terminfo I, [2024-05-14T22:53:17.793573 #2230357] INFO -- : [261/885] 2271726=test_gem_commands_sources_command I, [2024-05-14T22:53:17.804296 #2230357] INFO -- : [262/885] 2271715=test_big2str I, [2024-05-14T22:53:17.808859 #2230357] INFO -- : [263/885] 2271715=test_yaml I, [2024-05-14T22:53:17.824909 #2230357] INFO -- : [264/885] 2271733=test_forwardable I, [2024-05-14T22:53:17.829308 #2230357] INFO -- : [265/885] 2271719=test_wait I, [2024-05-14T22:53:17.842618 #2230357] INFO -- : [266/885] 2271733=test_handle I, [2024-05-14T22:53:17.867664 #2230357] INFO -- : [267/885] 2271722=test_mdns I, [2024-05-14T22:53:17.880098 #2230357] INFO -- : [268/885] 2271719=test_parse I, [2024-05-14T22:53:17.886538 #2230357] INFO -- : [269/885] 2271722=test_gem_remote_fetcher I, [2024-05-14T22:53:17.911005 #2230357] INFO -- : [270/885] 2271715=test_scanner_events I, [2024-05-14T22:53:17.931841 #2230357] INFO -- : [271/885] 2271726=test_gem_resolver_installed_specification I, [2024-05-14T22:53:17.939308 #2230357] INFO -- : [272/885] 2271715=test_gem_ext_ext_conf_builder I, [2024-05-14T22:53:17.947562 #2230357] INFO -- : [273/885] 2271726=test_frozen_error I, [2024-05-14T22:53:17.952793 #2230357] INFO -- : [274/885] 2271726=test_gem_stub_specification I, [2024-05-14T22:53:17.960533 #2230357] INFO -- : [275/885] 2271733=test_method_cache I, [2024-05-14T22:53:17.963040 #2230357] INFO -- : [276/885] 2271733=test_gem_commands_search_command I, [2024-05-14T22:53:18.006121 #2230357] INFO -- : [277/885] 2271718=test_complex I, [2024-05-14T22:53:18.052650 #2230357] INFO -- : [278/885] 2271728=test_inlinecache I, [2024-05-14T22:53:18.072163 #2230357] INFO -- : [279/885] 2271726=test_rdoc_markup_verbatim I, [2024-05-14T22:53:18.076609 #2230357] INFO -- : [280/885] 2271726=test_gem_resolver_specification I, [2024-05-14T22:53:18.097730 #2230357] INFO -- : [281/885] 2271728=test_gem_dependency I, [2024-05-14T22:53:18.101638 #2230357] INFO -- : [282/885] 2271726=test_path_to_class I, [2024-05-14T22:53:18.103277 #2230357] INFO -- : [283/885] 2271726=test_gem_version I, [2024-05-14T22:53:18.108954 #2230357] INFO -- : [284/885] 2271733=test_rdoc_options I, [2024-05-14T22:53:18.124878 #2230357] INFO -- : [285/885] 2271718=test_econv I, [2024-05-14T22:53:18.152311 #2230357] INFO -- : [286/885] 2271726=test_cesu8 I, [2024-05-14T22:53:18.156596 #2230357] INFO -- : [287/885] 2271726=test_fileutils I, [2024-05-14T22:53:18.184798 #2230357] INFO -- : [288/885] 2271728=test_string_processing I, [2024-05-14T22:53:18.239179 #2230357] INFO -- : [289/885] 2271728=test_emitter I, [2024-05-14T22:53:18.245275 #2230357] INFO -- : [290/885] 2271728=test_resource I, [2024-05-14T22:53:18.265680 #2230357] INFO -- : [291/885] 2271728=test_gem_commands_signin_command I, [2024-05-14T22:53:18.294445 #2230357] INFO -- : [292/885] 2271723=test_ldap I, [2024-05-14T22:53:18.304676 #2230357] INFO -- : [293/885] 2271727=test_gem_commands_list_command I, [2024-05-14T22:53:18.306367 #2230357] INFO -- : [294/885] 2271723=test_stack I, [2024-05-14T22:53:18.315682 #2230357] INFO -- : [295/885] 2271731=test_rdoc_include I, [2024-05-14T22:53:18.315763 #2230357] INFO -- : [296/885] 2271727=test_reqarg I, [2024-05-14T22:53:18.350523 #2230357] INFO -- : [297/885] 2271733=test_too_many_dummy_encodings I, [2024-05-14T22:53:18.350808 #2230357] INFO -- : [298/885] 2271728=test_utf32 I, [2024-05-14T22:53:18.359242 #2230357] INFO -- : [299/885] 2271728=test_basicsocket I, [2024-05-14T22:53:18.380802 #2230357] INFO -- : [300/885] 2271728=test_duplicate I, [2024-05-14T22:53:18.385369 #2230357] INFO -- : [301/885] 2271728=test_rdoc_markup I, [2024-05-14T22:53:18.392345 #2230357] INFO -- : [302/885] 2271728=test_gem_commands_help_command I, [2024-05-14T22:53:18.427204 #2230357] INFO -- : [303/885] 2271733=test_prettyprint I, [2024-05-14T22:53:18.439455 #2230357] INFO -- : [304/885] 2271726=test_tracepoint I, [2024-05-14T22:53:18.451378 #2230357] INFO -- : [305/885] 2271733=test_internal_ivar I, [2024-05-14T22:53:18.453962 #2230357] INFO -- : [306/885] 2271733=test_gem_resolver_index_specification I, [2024-05-14T22:53:18.475269 #2230357] INFO -- : [307/885] 2271719=test_function I, [2024-05-14T22:53:18.482096 #2230357] INFO -- : [308/885] 2271728=test_queue I, [2024-05-14T22:53:18.484636 #2230357] INFO -- : [309/885] 2271728=test_tempfile I, [2024-05-14T22:53:18.511525 #2230357] INFO -- : [310/885] 2271731=parse_comments_test I, [2024-05-14T22:53:18.527606 #2230357] INFO -- : [311/885] 2271733=test_noarg I, [2024-05-14T22:53:18.564666 #2230357] INFO -- : [312/885] 2271731=test_class I, [2024-05-14T22:53:18.643552 #2230357] INFO -- : [313/885] 2271726=test_rdoc_normal_class I, [2024-05-14T22:53:18.691815 #2230357] INFO -- : [314/885] 2271726=test_const I, [2024-05-14T22:53:18.693344 #2230357] INFO -- : [315/885] 2271727=json_string_matching_test I, [2024-05-14T22:53:18.696088 #2230357] INFO -- : [316/885] 2271726=test_load I, [2024-05-14T22:53:18.704400 #2230357] INFO -- : [317/885] 2271726=test_random I, [2024-05-14T22:53:18.705407 #2230357] INFO -- : [318/885] 2271733=test_asn1 I, [2024-05-14T22:53:18.707210 #2230357] INFO -- : [319/885] 2271719=test_irb I, [2024-05-14T22:53:18.711937 #2230357] INFO -- : [320/885] 2271727=test_date_strftime I, [2024-05-14T22:53:18.720673 #2230357] INFO -- : [321/885] 2271726=test_rdoc_parser_rd I, [2024-05-14T22:53:18.728895 #2230357] INFO -- : [322/885] 2271728=test_yamlstore I, [2024-05-14T22:53:18.734251 #2230357] INFO -- : [323/885] 2271717=test_gem_installer I, [2024-05-14T22:53:18.734966 #2230357] INFO -- : [324/885] 2271726=test_euc_kr I, [2024-05-14T22:53:18.737258 #2230357] INFO -- : [325/885] 2271728=test_rdoc_context_section I, [2024-05-14T22:53:18.740420 #2230357] INFO -- : [326/885] 2271726=test_ftp I, [2024-05-14T22:53:18.743849 #2230357] INFO -- : [327/885] 2271733=test_pattern_key_name_check I, [2024-05-14T22:53:18.745685 #2230357] INFO -- : [328/885] 2271728=test_to_ruby I, [2024-05-14T22:53:18.758177 #2230357] INFO -- : [329/885] 2271726=test_pack I, [2024-05-14T22:53:18.762272 #2230357] INFO -- : [330/885] 2271733=test_array_create I, [2024-05-14T22:53:18.763392 #2230357] INFO -- : [331/885] 2271733=test_gem_impossible_dependencies_error I, [2024-05-14T22:53:18.770674 #2230357] INFO -- : [332/885] 2271733=test_gem_commands_query_command I, [2024-05-14T22:53:18.781139 #2230357] INFO -- : [333/885] 2271728=test_method I, [2024-05-14T22:53:18.981161 #2230357] INFO -- : [334/885] 2271720=test_rdoc_rubygems_hook I, [2024-05-14T22:53:18.990867 #2230357] INFO -- : [335/885] 2271726=test_gem_commands_uninstall_command I, [2024-05-14T22:53:19.002042 #2230357] INFO -- : [336/885] 2271719=test_condition I, [2024-05-14T22:53:19.010968 #2230357] INFO -- : [337/885] 2271719=test_gem_source_specific_file I, [2024-05-14T22:53:19.019009 #2230357] INFO -- : [338/885] 2271721=test_foreach I, [2024-05-14T22:53:19.020673 #2230357] INFO -- : [339/885] 2271721=test_cp949 I, [2024-05-14T22:53:19.023909 #2230357] INFO -- : [340/885] 2271721=test_win32ole_record I, [2024-05-14T22:53:19.027407 #2230357] INFO -- : [341/885] 2271721=test_gem_unsatisfiable_dependency_error I, [2024-05-14T22:53:19.081406 #2230357] INFO -- : [342/885] 2271719=test_hash I, [2024-05-14T22:53:19.099423 #2230357] INFO -- : [343/885] 2271718=test_ubf_async_safe I, [2024-05-14T22:53:19.112429 #2230357] INFO -- : [344/885] 2271718=test_sorted_set I, [2024-05-14T22:53:19.114811 #2230357] INFO -- : [345/885] 2271727=test_emoji I, [2024-05-14T22:53:19.121498 #2230357] INFO -- : [346/885] 2271720=test_win32ole_type_event I, [2024-05-14T22:53:19.126914 #2230357] INFO -- : [347/885] 2271715=test_io I, [2024-05-14T22:53:19.131043 #2230357] INFO -- : [348/885] 2271720=test_date_attr I, [2024-05-14T22:53:19.136182 #2230357] INFO -- : [349/885] 2271727=test_ellipsize I, [2024-05-14T22:53:19.137278 #2230357] INFO -- : [350/885] 2271720=warnings_test I, [2024-05-14T22:53:19.149454 #2230357] INFO -- : [351/885] 2271727=test_kwargs I, [2024-05-14T22:53:19.157667 #2230357] INFO -- : [352/885] 2271727=test_io_wait I, [2024-05-14T22:53:19.217091 #2230357] INFO -- : [353/885] 2271723=test_gem_commands_exec_command I, [2024-05-14T22:53:19.234933 #2230357] INFO -- : [354/885] 2271720=test_type_completor I, [2024-05-14T22:53:19.237554 #2230357] INFO -- : [355/885] 2271720=test_summary I, [2024-05-14T22:53:19.241642 #2230357] INFO -- : [356/885] 2271732=test_console_attr I, [2024-05-14T22:53:19.242635 #2230357] INFO -- : [357/885] 2271733=test_kill_ring I, [2024-05-14T22:53:19.243774 #2230357] INFO -- : [358/885] 2271732=test_framework I, [2024-05-14T22:53:19.247539 #2230357] INFO -- : [359/885] 2271732=test_ns_spki I, [2024-05-14T22:53:19.251915 #2230357] INFO -- : [360/885] 2271721=test_argf I, [2024-05-14T22:53:19.270893 #2230357] INFO -- : [361/885] 2271732=test_gem_commands_environment_command I, [2024-05-14T22:53:19.295832 #2230357] INFO -- : [362/885] 2271733=test_m17n I, [2024-05-14T22:53:19.312884 #2230357] INFO -- : [363/885] 2271732=test_ws I, [2024-05-14T22:53:19.325874 #2230357] INFO -- : [364/885] 2271718=test_yjit I, [2024-05-14T22:53:19.329444 #2230357] INFO -- : [365/885] 2271732=test_workspace I, [2024-05-14T22:53:19.332200 #2230357] INFO -- : [366/885] 2271718=test_weakmap I, [2024-05-14T22:53:19.359564 #2230357] INFO -- : [367/885] 2271715=test_protect I, [2024-05-14T22:53:19.365598 #2230357] INFO -- : [368/885] 2271733=test_win32ole_typelib I, [2024-05-14T22:53:19.367719 #2230357] INFO -- : [369/885] 2271715=test_gem_request_set_lockfile I, [2024-05-14T22:53:19.368244 #2230357] INFO -- : [370/885] 2271733=test_raise_exception I, [2024-05-14T22:53:19.403498 #2230357] INFO -- : [371/885] 2271720=test_postponed_job I, [2024-05-14T22:53:19.456661 #2230357] INFO -- : [372/885] 2271732=test_alias_and_anchor I, [2024-05-14T22:53:19.485170 #2230357] INFO -- : [373/885] 2271732=test_external_new I, [2024-05-14T22:53:19.489184 #2230357] INFO -- : [374/885] 2271727=test_gem_resolver_dependency_request I, [2024-05-14T22:53:19.489843 #2230357] INFO -- : [375/885] 2271732=test_tree_builder I, [2024-05-14T22:53:19.494985 #2230357] INFO -- : [376/885] 2271732=test_hash I, [2024-05-14T22:53:19.507511 #2230357] INFO -- : [377/885] 2271732=test_remote_fetch_error I, [2024-05-14T22:53:19.511361 #2230357] INFO -- : [378/885] 2271727=test_have_library I, [2024-05-14T22:53:19.519916 #2230357] INFO -- : [379/885] 2271732=test_c_struct_entry I, [2024-05-14T22:53:19.669279 #2230357] INFO -- : [380/885] 2271726=test_lock_native_thread I, [2024-05-14T22:53:19.675066 #2230357] INFO -- : [381/885] 2271715=test_gem_commands_stale_command I, [2024-05-14T22:53:19.680742 #2230357] INFO -- : [382/885] 2271715=test_set I, [2024-05-14T22:53:19.687001 #2230357] INFO -- : [383/885] 2271715=test_show_source I, [2024-05-14T22:53:19.700926 #2230357] INFO -- : [384/885] 2271715=comments_test I, [2024-05-14T22:53:19.709594 #2230357] INFO -- : [385/885] 2271732=test_gem_requirement I, [2024-05-14T22:53:19.715338 #2230357] INFO -- : [386/885] 2271715=test_sprintf I, [2024-05-14T22:53:19.803060 #2230357] INFO -- : [387/885] 2271722=test_string_memory I, [2024-05-14T22:53:19.836414 #2230357] INFO -- : [388/885] 2271720=test_gem_security_trust_dir I, [2024-05-14T22:53:19.854266 #2230357] INFO -- : [389/885] 2271732=test_undef I, [2024-05-14T22:53:19.862070 #2230357] INFO -- : [390/885] 2271732=test_objspace I, [2024-05-14T22:53:19.863924 #2230357] INFO -- : [391/885] 2271722=ripper_test I, [2024-05-14T22:53:19.879024 #2230357] INFO -- : [392/885] 2271720=test_line_editor I, [2024-05-14T22:53:19.910378 #2230357] INFO -- : [393/885] 2271715=test_yield I, [2024-05-14T22:53:19.936328 #2230357] INFO -- : [394/885] 2271726=test_rdoc_alias I, [2024-05-14T22:53:19.943878 #2230357] INFO -- : [395/885] 2271726=test_convertible I, [2024-05-14T22:53:19.945381 #2230357] INFO -- : [396/885] 2271720=parser_test I, [2024-05-14T22:53:19.957076 #2230357] INFO -- : [397/885] 2271720=test_files_sample I, [2024-05-14T22:53:20.032913 #2230357] INFO -- : [398/885] 2271720=test_stringscanner I, [2024-05-14T22:53:20.060348 #2230357] INFO -- : [399/885] 2271733=test_gem_resolver_best_set I, [2024-05-14T22:53:20.063392 #2230357] INFO -- : [400/885] 2271720=encoding_test I, [2024-05-14T22:53:20.122189 #2230357] INFO -- : [401/885] 2271723=test_typeddata I, [2024-05-14T22:53:20.135206 #2230357] INFO -- : [402/885] 2271733=test_rdoc_markup_to_html_crossref I, [2024-05-14T22:53:20.139953 #2230357] INFO -- : [403/885] 2271720=test_webauthn_poller I, [2024-05-14T22:53:20.244852 #2230357] INFO -- : [404/885] 2271724=test_rdoc_markup_raw I, [2024-05-14T22:53:20.282877 #2230357] INFO -- : [405/885] 2271720=test_rat I, [2024-05-14T22:53:20.288379 #2230357] INFO -- : [406/885] 2271720=test_optparse I, [2024-05-14T22:53:20.288609 #2230357] INFO -- : [407/885] 2271720=test_array I, [2024-05-14T22:53:20.300806 #2230357] INFO -- : [408/885] 2271720=test_fstring I, [2024-05-14T22:53:20.311202 #2230357] INFO -- : [409/885] 2271734=test_readpartial I, [2024-05-14T22:53:20.359101 #2230357] INFO -- : [410/885] 2271724=test_clone I, [2024-05-14T22:53:20.381133 #2230357] INFO -- : [411/885] 2271733=test_gem_commands_install_command I, [2024-05-14T22:53:20.392926 #2230357] INFO -- : [412/885] 2271723=test_rdoc_require I, [2024-05-14T22:53:20.420054 #2230357] INFO -- : [413/885] 2271722=locals_test I, [2024-05-14T22:53:20.451608 #2230357] INFO -- : [414/885] 2271720=test_rdoc_markup_indented_paragraph I, [2024-05-14T22:53:20.456695 #2230357] INFO -- : [415/885] 2271720=test_rdoc_task I, [2024-05-14T22:53:20.461878 #2230357] INFO -- : [416/885] 2271720=test_gem_resolver_conflict I, [2024-05-14T22:53:20.462625 #2230357] INFO -- : [417/885] 2271731=ruby_parser_test I, [2024-05-14T22:53:20.465309 #2230357] INFO -- : [418/885] 2271731=test_backtrace I, [2024-05-14T22:53:20.480727 #2230357] INFO -- : [419/885] 2271720=test_pack I, [2024-05-14T22:53:20.504944 #2230357] INFO -- : [420/885] 2271720=test_io_buffer I, [2024-05-14T22:53:20.551415 #2230357] INFO -- : [421/885] 2271724=test_rendering I, [2024-05-14T22:53:20.560953 #2230357] INFO -- : [422/885] 2271724=test_face I, [2024-05-14T22:53:20.579902 #2230357] INFO -- : [423/885] 2271724=test_sizeof I, [2024-05-14T22:53:20.614595 #2230357] INFO -- : [424/885] 2271720=test_case I, [2024-05-14T22:53:20.627325 #2230357] INFO -- : [425/885] 2271723=test_unicode_escape I, [2024-05-14T22:53:20.635649 #2230357] INFO -- : [426/885] 2271720=test_io I, [2024-05-14T22:53:20.716178 #2230357] INFO -- : [427/885] 2271734=test_utf16 I, [2024-05-14T22:53:20.722683 #2230357] INFO -- : [428/885] 2271723=test_autoload I, [2024-05-14T22:53:20.731948 #2230357] INFO -- : [429/885] 2271727=test_config I, [2024-05-14T22:53:20.733537 #2230357] INFO -- : [430/885] 2271734=test_sleep I, [2024-05-14T22:53:20.786997 #2230357] INFO -- : [431/885] 2271722=test_math I, [2024-05-14T22:53:20.792404 #2230357] INFO -- : [432/885] 2271727=test_gem_commands_fetch_command I, [2024-05-14T22:53:20.807047 #2230357] INFO -- : [433/885] 2271722=test_gc I, [2024-05-14T22:53:20.809065 #2230357] INFO -- : [434/885] 2271722=test_libs I, [2024-05-14T22:53:20.846879 #2230357] INFO -- : [435/885] 2271722=test_yaml_tree I, [2024-05-14T22:53:20.876179 #2230357] INFO -- : [436/885] 2271722=test_etc I, [2024-05-14T22:53:20.942667 #2230357] INFO -- : [437/885] 2271722=test_yjit_exit_locations I, [2024-05-14T22:53:20.943780 #2230357] INFO -- : [438/885] 2271722=test_gem_resolver_activation_request I, [2024-05-14T22:53:20.944270 #2230357] INFO -- : [439/885] 2271727=test_getopts I, [2024-05-14T22:53:20.950302 #2230357] INFO -- : [440/885] 2271727=test_protocol I, [2024-05-14T22:53:20.954316 #2230357] INFO -- : [441/885] 2271722=test_ripper I, [2024-05-14T22:53:21.270716 #2230357] INFO -- : [442/885] 2271727=test_gem_config_file I, [2024-05-14T22:53:21.276641 #2230357] INFO -- : [443/885] 2271722=test_gem_util I, [2024-05-14T22:53:21.284121 #2230357] INFO -- : [444/885] 2271725=test_iseq_load I, [2024-05-14T22:53:21.359331 #2230357] INFO -- : [445/885] 2271727=test_gem_package_tar_header I, [2024-05-14T22:53:21.382813 #2230357] INFO -- : [446/885] 2271727=test_pkey_dh I, [2024-05-14T22:53:21.450857 #2230357] INFO -- : [447/885] 2271727=test_bigzero I, [2024-05-14T22:53:21.456185 #2230357] INFO -- : [448/885] 2271727=test_pkcs12 I, [2024-05-14T22:53:21.460668 #2230357] INFO -- : [449/885] 2271733=test_system I, [2024-05-14T22:53:21.466443 #2230357] INFO -- : [450/885] 2271722=test_open3 I, [2024-05-14T22:53:21.765253 #2230357] INFO -- : [451/885] 2271727=test_multi_irb_commands I, [2024-05-14T22:53:21.788165 #2230357] INFO -- : [452/885] 2271727=test_fiber I, [2024-05-14T22:53:21.823966 #2230357] INFO -- : [453/885] 2271731=test_bundled_ca I, [2024-05-14T22:53:22.032979 #2230357] INFO -- : [454/885] 2271729=test_closure I, [2024-05-14T22:53:22.142219 #2230357] INFO -- : [455/885] 2271725=test_digest I, [2024-05-14T22:53:22.159487 #2230357] INFO -- : [456/885] 2271725=test_gem_security I, [2024-05-14T22:53:22.167467 #2230357] INFO -- : [457/885] 2271729=test_rdoc_servlet I, [2024-05-14T22:53:22.284884 #2230357] INFO -- : [458/885] 2271728=test_ractor I, [2024-05-14T22:53:22.330007 #2230357] INFO -- : [459/885] 2271728=test_recursion I, [2024-05-14T22:53:22.335208 #2230357] INFO -- : [460/885] 2271728=test_exit I, [2024-05-14T22:53:22.425765 #2230357] INFO -- : [461/885] 2271733=test_popen_deadlock I, [2024-05-14T22:53:22.428776 #2230357] INFO -- : [462/885] 2271728=test_delegate I, [2024-05-14T22:53:22.439322 #2230357] INFO -- : [463/885] 2271728=test_mkmf I, [2024-05-14T22:53:22.465563 #2230357] INFO -- : [464/885] 2271728=test_date_marshal I, [2024-05-14T22:53:22.469435 #2230357] INFO -- : [465/885] 2271728=test_history I, [2024-05-14T22:53:22.484084 #2230357] INFO -- : [466/885] 2271729=test_pinned I, [2024-05-14T22:53:22.494144 #2230357] INFO -- : [467/885] 2271729=test_rdoc_markup_pre_process I, [2024-05-14T22:53:22.533039 #2230357] INFO -- : [468/885] 2271729=test_printf I, [2024-05-14T22:53:22.540257 #2230357] INFO -- : [469/885] 2271728=test_stream I, [2024-05-14T22:53:22.540968 #2230357] INFO -- : [470/885] 2271729=test_to_ary_concat I, [2024-05-14T22:53:22.550628 #2230357] INFO -- : [471/885] 2271728=test_time I, [2024-05-14T22:53:22.628369 #2230357] INFO -- : [472/885] 2271718=test_webauthn_listener_response I, [2024-05-14T22:53:22.651145 #2230357] INFO -- : [473/885] 2271718=test_beginendblock I, [2024-05-14T22:53:22.709310 #2230357] INFO -- : [474/885] 2271728=test_files_lib I, [2024-05-14T22:53:22.803451 #2230357] INFO -- : [475/885] 2271734=test_gem_commands_unpack_command I, [2024-05-14T22:53:22.844699 #2230357] INFO -- : [476/885] 2271731=test_rdoc_markup_to_bs I, [2024-05-14T22:53:22.878003 #2230357] INFO -- : [477/885] 2271731=test_help I, [2024-05-14T22:53:22.881247 #2230357] INFO -- : [478/885] 2271731=test_within_pipe I, [2024-05-14T22:53:22.898737 #2230357] INFO -- : [479/885] 2271731=test_emoji_breaks I, [2024-05-14T22:53:22.905409 #2230357] INFO -- : [480/885] 2271731=test_gem_bundler_version_finder I, [2024-05-14T22:53:22.923492 #2230357] INFO -- : [481/885] 2271731=reflection_test I, [2024-05-14T22:53:22.933645 #2230357] INFO -- : [482/885] 2271731=test_scheduler I, [2024-05-14T22:53:22.992328 #2230357] INFO -- : [483/885] 2271718=test_ocsp I, [2024-05-14T22:53:23.060273 #2230357] INFO -- : [484/885] 2271733=test_class I, [2024-05-14T22:53:23.068398 #2230357] INFO -- : [485/885] 2271733=test_pkey_dsa I, [2024-05-14T22:53:23.078003 #2230357] INFO -- : [486/885] 2271731=test_exception_at_throwing I, [2024-05-14T22:53:23.090356 #2230357] INFO -- : [487/885] 2271729=test_iseq I, [2024-05-14T22:53:23.152053 #2230357] INFO -- : [488/885] 2271731=test_rdoc_markup_heading I, [2024-05-14T22:53:23.163880 #2230357] INFO -- : [489/885] 2271731=test_option I, [2024-05-14T22:53:23.193445 #2230357] INFO -- : [490/885] 2271719=test_append I, [2024-05-14T22:53:23.194370 #2230357] INFO -- : [491/885] 2271719=test_tracer I, [2024-05-14T22:53:23.200623 #2230357] INFO -- : [492/885] 2271719=test_cmethod I, [2024-05-14T22:53:23.202621 #2230357] INFO -- : [493/885] 2271719=test_did_you_mean I, [2024-05-14T22:53:23.208397 #2230357] INFO -- : [494/885] 2271734=test_io_m17n I, [2024-05-14T22:53:23.221138 #2230357] INFO -- : [495/885] 2271716=test_variable_name_check I, [2024-05-14T22:53:23.228589 #2230357] INFO -- : [496/885] 2271715=test_gem_commands_server_command I, [2024-05-14T22:53:23.237995 #2230357] INFO -- : [497/885] 2271715=test_case_comprehensive I, [2024-05-14T22:53:23.253262 #2230357] INFO -- : [498/885] 2271716=test_interned_str I, [2024-05-14T22:53:23.261041 #2230357] INFO -- : [499/885] 2271716=test_gem_commands_build_command I, [2024-05-14T22:53:23.276735 #2230357] INFO -- : [500/885] 2271731=test_gem_resolver_vendor_specification I, [2024-05-14T22:53:23.295235 #2230357] INFO -- : [501/885] 2271731=test_gem_commands_update_command I, [2024-05-14T22:53:23.320366 #2230357] INFO -- : [502/885] 2271719=test_notimplement I, [2024-05-14T22:53:23.328879 #2230357] INFO -- : [503/885] 2271719=test_random I, [2024-05-14T22:53:23.331084 #2230357] INFO -- : [504/885] 2271718=test_gem_uri I, [2024-05-14T22:53:23.338763 #2230357] INFO -- : [505/885] 2271719=test_key_event_record I, [2024-05-14T22:53:23.340863 #2230357] INFO -- : [506/885] 2271719=test_ssl_session I, [2024-05-14T22:53:23.367602 #2230357] INFO -- : [507/885] 2271718=test_thread_cv I, [2024-05-14T22:53:23.378617 #2230357] INFO -- : [508/885] 2271721=test_lexer I, [2024-05-14T22:53:23.402467 #2230357] INFO -- : [509/885] 2271721=test_rdoc_generator_pot I, [2024-05-14T22:53:23.427212 #2230357] INFO -- : [510/885] 2271721=test_unicode I, [2024-05-14T22:53:23.433500 #2230357] INFO -- : [511/885] 2271721=test_enumerator I, [2024-05-14T22:53:23.434324 #2230357] INFO -- : [512/885] 2271721=test_rdoc_parser_changelog I, [2024-05-14T22:53:23.490237 #2230357] INFO -- : [513/885] 2271721=parameters_signature_test I, [2024-05-14T22:53:23.495981 #2230357] INFO -- : [514/885] 2271717=test_koi8 I, [2024-05-14T22:53:23.511556 #2230357] INFO -- : [515/885] 2271717=test_rdoc_method_attr I, [2024-05-14T22:53:23.549291 #2230357] INFO -- : [516/885] 2271724=test_data I, [2024-05-14T22:53:23.552476 #2230357] INFO -- : [517/885] 2271724=static_literals_test I, [2024-05-14T22:53:23.553293 #2230357] INFO -- : [518/885] 2271721=test_filter I, [2024-05-14T22:53:23.564472 #2230357] INFO -- : [519/885] 2271716=test_gem_gem_runner I, [2024-05-14T22:53:23.603660 #2230357] INFO -- : [520/885] 2271721=test_tree_spell_checker I, [2024-05-14T22:53:23.614025 #2230357] INFO -- : [521/885] 2271716=test_http I, [2024-05-14T22:53:23.615812 #2230357] INFO -- : [522/885] 2271724=test_addrinfo I, [2024-05-14T22:53:23.619907 #2230357] INFO -- : [523/885] 2271717=test_win32ole_param_event I, [2024-05-14T22:53:23.627539 #2230357] INFO -- : [524/885] 2271717=test_bn I, [2024-05-14T22:53:23.631832 #2230357] INFO -- : [525/885] 2271721=redundant_return_test I, [2024-05-14T22:53:23.636892 #2230357] INFO -- : [526/885] 2271721=test_case_mapping I, [2024-05-14T22:53:23.640502 #2230357] INFO -- : [527/885] 2271717=test_path I, [2024-05-14T22:53:23.646478 #2230357] INFO -- : [528/885] 2271721=test_terminfo I, [2024-05-14T22:53:23.650384 #2230357] INFO -- : [529/885] 2271721=test_compile_prism I, [2024-05-14T22:53:23.654985 #2230357] INFO -- : [530/885] 2271717=test_bug-14834 I, [2024-05-14T22:53:23.667058 #2230357] INFO -- : [531/885] 2271724=test_rdoc_markup_to_html I, [2024-05-14T22:53:23.712851 #2230357] INFO -- : [532/885] 2271729=test_date_compat I, [2024-05-14T22:53:23.720577 #2230357] INFO -- : [533/885] 2271729=test_key_stroke I, [2024-05-14T22:53:23.738823 #2230357] INFO -- : [534/885] 2271717=json_encoding_test I, [2024-05-14T22:53:23.752305 #2230357] INFO -- : [535/885] 2271717=test_color I, [2024-05-14T22:53:23.772565 #2230357] INFO -- : [536/885] 2271729=test_sockopt I, [2024-05-14T22:53:23.775414 #2230357] INFO -- : [537/885] 2271729=test_rdoc_markup_to_label I, [2024-05-14T22:53:23.813246 #2230357] INFO -- : [538/885] 2271729=test_install I, [2024-05-14T22:53:23.817940 #2230357] INFO -- : [539/885] 2271724=test_rdoc_ri_driver I, [2024-05-14T22:53:23.904593 #2230357] INFO -- : [540/885] 2271722=test_gem_resolver_local_specification I, [2024-05-14T22:53:23.922548 #2230357] INFO -- : [541/885] 2271717=test_httpheader I, [2024-05-14T22:53:23.927759 #2230357] INFO -- : [542/885] 2271721=test_set_len I, [2024-05-14T22:53:23.930824 #2230357] INFO -- : [543/885] 2271721=test_encoding I, [2024-05-14T22:53:23.931495 #2230357] INFO -- : [544/885] 2271722=test_httpresponses I, [2024-05-14T22:53:23.942352 #2230357] INFO -- : [545/885] 2271721=test_rdoc_i18n_locale I, [2024-05-14T22:53:23.953436 #2230357] INFO -- : [546/885] 2271721=test_chilled I, [2024-05-14T22:53:23.954309 #2230357] INFO -- : [547/885] 2271721=test_name_error_extension I, [2024-05-14T22:53:23.958632 #2230357] INFO -- : [548/885] 2271721=test_acceptable I, [2024-05-14T22:53:23.963652 #2230357] INFO -- : [549/885] 2271717=test_rdoc_generator_pot_po_entry I, [2024-05-14T22:53:23.971780 #2230357] INFO -- : [550/885] 2271717=test_euc_jp I, [2024-05-14T22:53:23.975398 #2230357] INFO -- : [551/885] 2271717=test_document I, [2024-05-14T22:53:23.976869 #2230357] INFO -- : [552/885] 2271722=test_pair I, [2024-05-14T22:53:23.982200 #2230357] INFO -- : [553/885] 2271717=test_gem_commands_yank_command I, [2024-05-14T22:53:24.002820 #2230357] INFO -- : [554/885] 2271718=test_win32ole_param I, [2024-05-14T22:53:24.005275 #2230357] INFO -- : [555/885] 2271718=test_rbconfig I, [2024-05-14T22:53:24.008935 #2230357] INFO -- : [556/885] 2271729=test_primitive I, [2024-05-14T22:53:24.009919 #2230357] INFO -- : [557/885] 2271718=test_human_typo I, [2024-05-14T22:53:24.018826 #2230357] INFO -- : [558/885] 2271729=test_spell_checker I, [2024-05-14T22:53:24.024145 #2230357] INFO -- : [559/885] 2271733=test_propertyputref I, [2024-05-14T22:53:24.025693 #2230357] INFO -- : [560/885] 2271733=attribute_write_test I, [2024-05-14T22:53:24.030315 #2230357] INFO -- : [561/885] 2271729=test_assembler I, [2024-05-14T22:53:24.031754 #2230357] INFO -- : [562/885] 2271718=test_rational2 I, [2024-05-14T22:53:24.035048 #2230357] INFO -- : [563/885] 2271729=test_rational I, [2024-05-14T22:53:24.043135 #2230357] INFO -- : [564/885] 2271718=test_gem_commands_cert_command I, [2024-05-14T22:53:24.055018 #2230357] INFO -- : [565/885] 2271724=test_completion I, [2024-05-14T22:53:24.060042 #2230357] INFO -- : [566/885] 2271729=test_yield_block I, [2024-05-14T22:53:24.060815 #2230357] INFO -- : [567/885] 2271733=test_len I, [2024-05-14T22:53:24.062997 #2230357] INFO -- : [568/885] 2271729=test_gem_source_installed I, [2024-05-14T22:53:24.065019 #2230357] INFO -- : [569/885] 2271733=test_x509ext I, [2024-05-14T22:53:24.069737 #2230357] INFO -- : [570/885] 2271733=test_erb I, [2024-05-14T22:53:24.081124 #2230357] INFO -- : [571/885] 2271721=test_evaluation I, [2024-05-14T22:53:24.091651 #2230357] INFO -- : [572/885] 2271721=test_gem_ext_builder I, [2024-05-14T22:53:24.111040 #2230357] INFO -- : [573/885] 2271733=test_https I, [2024-05-14T22:53:24.255497 #2230357] INFO -- : [574/885] 2271729=test_load I, [2024-05-14T22:53:24.260089 #2230357] INFO -- : [575/885] 2271729=test_gem_commands_rebuild_command I, [2024-05-14T22:53:24.308271 #2230357] INFO -- : [576/885] 2271729=test_yamldbm I, [2024-05-14T22:53:24.310855 #2230357] INFO -- : [577/885] 2271729=test_rdoc_parser_simple I, [2024-05-14T22:53:24.321121 #2230357] INFO -- : [578/885] 2271719=test_provider I, [2024-05-14T22:53:24.327422 #2230357] INFO -- : [579/885] 2271729=test_abi I, [2024-05-14T22:53:24.403963 #2230357] INFO -- : [580/885] 2271731=test_array I, [2024-05-14T22:53:24.482999 #2230357] INFO -- : [581/885] 2271717=test_gem_package_tar_writer I, [2024-05-14T22:53:24.501162 #2230357] INFO -- : [582/885] 2271733=test_helper_method I, [2024-05-14T22:53:24.515640 #2230357] INFO -- : [583/885] 2271734=test_gem_commands_outdated_command I, [2024-05-14T22:53:24.541007 #2230357] INFO -- : [584/885] 2271729=test_scalar_scanner I, [2024-05-14T22:53:24.552518 #2230357] INFO -- : [585/885] 2271729=test_gem_source I, [2024-05-14T22:53:24.575847 #2230357] INFO -- : [586/885] 2271733=test_nesting_parser I, [2024-05-14T22:53:24.577998 #2230357] INFO -- : [587/885] 2271717=test_win32ole_method_event I, [2024-05-14T22:53:24.580915 #2230357] INFO -- : [588/885] 2271717=test_benchmark I, [2024-05-14T22:53:24.591374 #2230357] INFO -- : [589/885] 2271733=test_gem_dependency_list I, [2024-05-14T22:53:24.599873 #2230357] INFO -- : [590/885] 2271734=test_stringify_symbols I, [2024-05-14T22:53:24.611320 #2230357] INFO -- : [591/885] 2271734=test_instrumentation_api I, [2024-05-14T22:53:24.635221 #2230357] INFO -- : [592/885] 2271726=integer_parse_test I, [2024-05-14T22:53:24.641984 #2230357] INFO -- : [593/885] 2271726=test_boolean I, [2024-05-14T22:53:24.648710 #2230357] INFO -- : [594/885] 2271726=test_rdoc_generator_markup I, [2024-05-14T22:53:24.661644 #2230357] INFO -- : [595/885] 2271726=test_whileuntil I, [2024-05-14T22:53:24.663306 #2230357] INFO -- : [596/885] 2271733=test_buffered_io I, [2024-05-14T22:53:24.664987 #2230357] INFO -- : [597/885] 2271719=test_monitor I, [2024-05-14T22:53:24.666449 #2230357] INFO -- : [598/885] 2271726=test_rubyvm I, [2024-05-14T22:53:24.667136 #2230357] INFO -- : [599/885] 2271733=test_configuration I, [2024-05-14T22:53:24.671980 #2230357] INFO -- : [600/885] 2271726=test_parser I, [2024-05-14T22:53:24.701306 #2230357] INFO -- : [601/885] 2271726=test_arith_seq_extract I, [2024-05-14T22:53:24.741635 #2230357] INFO -- : [602/885] 2271724=test_method_name_check I, [2024-05-14T22:53:24.756844 #2230357] INFO -- : [603/885] 2271729=test_gem_request_set I, [2024-05-14T22:53:24.766865 #2230357] INFO -- : [604/885] 2271724=test_module I, [2024-05-14T22:53:24.809924 #2230357] INFO -- : [605/885] 2271733=test_gem_ext_cargo_builder I, [2024-05-14T22:53:24.834232 #2230357] INFO -- : [606/885] 2271733=test_ssl I, [2024-05-14T22:53:24.876619 #2230357] INFO -- : [607/885] 2271719=constant_path_node_test I, [2024-05-14T22:53:24.882509 #2230357] INFO -- : [608/885] 2271726=test_rdoc_rd_inline I, [2024-05-14T22:53:24.889160 #2230357] INFO -- : [609/885] 2271726=test_x509req I, [2024-05-14T22:53:24.934994 #2230357] INFO -- : [610/885] 2271719=test_mutex I, [2024-05-14T22:53:25.012771 #2230357] INFO -- : [611/885] 2271723=test_struct I, [2024-05-14T22:53:25.077429 #2230357] INFO -- : [612/885] 2271726=test_gem_path_support I, [2024-05-14T22:53:25.095158 #2230357] INFO -- : [613/885] 2271729=test_set I, [2024-05-14T22:53:25.099715 #2230357] INFO -- : [614/885] 2271726=test_files_test_1 I, [2024-05-14T22:53:25.102839 #2230357] INFO -- : [615/885] 2271726=test_color_printer I, [2024-05-14T22:53:25.124813 #2230357] INFO -- : [616/885] 2271729=test_deprecated I, [2024-05-14T22:53:25.127878 #2230357] INFO -- : [617/885] 2271729=test_insns_leaf I, [2024-05-14T22:53:25.130058 #2230357] INFO -- : [618/885] 2271729=test_serialize_subclasses I, [2024-05-14T22:53:25.131706 #2230357] INFO -- : [619/885] 2271729=test_key_error I, [2024-05-14T22:53:25.133125 #2230357] INFO -- : [620/885] 2271729=test_win32ole_variant_m I, [2024-05-14T22:53:25.137311 #2230357] INFO -- : [621/885] 2271729=test_engine I, [2024-05-14T22:53:25.142751 #2230357] INFO -- : [622/885] 2271721=test_allocation I, [2024-05-14T22:53:25.146618 #2230357] INFO -- : [623/885] 2271729=test_div I, [2024-05-14T22:53:25.149029 #2230357] INFO -- : [624/885] 2271729=test_variable I, [2024-05-14T22:53:25.174749 #2230357] INFO -- : [625/885] 2271726=fuzzer_test I, [2024-05-14T22:53:25.188229 #2230357] INFO -- : [626/885] 2271726=test_sexp I, [2024-05-14T22:53:25.236395 #2230357] INFO -- : [627/885] 2271726=test_rdoc_markup_include I, [2024-05-14T22:53:25.247863 #2230357] INFO -- : [628/885] 2271726=test_rdoc_markup_to_html_snippet I, [2024-05-14T22:53:25.267203 #2230357] INFO -- : [629/885] 2271729=magic_comment_test I, [2024-05-14T22:53:25.307378 #2230357] INFO -- : [630/885] 2271726=test_struct I, [2024-05-14T22:53:25.312261 #2230357] INFO -- : [631/885] 2271726=test_cparser I, [2024-05-14T22:53:25.332083 #2230357] INFO -- : [632/885] 2271728=test_pkg_config I, [2024-05-14T22:53:25.354390 #2230357] INFO -- : [633/885] 2271723=test_config I, [2024-05-14T22:53:25.355599 #2230357] INFO -- : [634/885] 2271728=test_nomethod_error I, [2024-05-14T22:53:25.357610 #2230357] INFO -- : [635/885] 2271729=json_parser_test I, [2024-05-14T22:53:25.364311 #2230357] INFO -- : [636/885] 2271728=memsize_test I, [2024-05-14T22:53:25.371548 #2230357] INFO -- : [637/885] 2271723=json_common_interface_test I, [2024-05-14T22:53:25.389228 #2230357] INFO -- : [638/885] 2271723=test_dln I, [2024-05-14T22:53:25.392434 #2230357] INFO -- : [639/885] 2271723=test_gem_source_subpath_problem I, [2024-05-14T22:53:25.408232 #2230357] INFO -- : [640/885] 2271728=test_win32ole_variant_outarg I, [2024-05-14T22:53:25.410401 #2230357] INFO -- : [641/885] 2271728=test_storage I, [2024-05-14T22:53:25.412144 #2230357] INFO -- : [642/885] 2271728=test_gem_resolver_git_set I, [2024-05-14T22:53:25.416917 #2230357] INFO -- : [643/885] 2271729=test_gem_security_signer I, [2024-05-14T22:53:25.469832 #2230357] INFO -- : [644/885] 2271723=test_cipher I, [2024-05-14T22:53:25.514356 #2230357] INFO -- : [645/885] 2271723=test_new I, [2024-05-14T22:53:25.516712 #2230357] INFO -- : [646/885] 2271723=test_shellwords I, [2024-05-14T22:53:25.521307 #2230357] INFO -- : [647/885] 2271723=test_memory_view I, [2024-05-14T22:53:25.536072 #2230357] INFO -- : [648/885] 2271729=pattern_test I, [2024-05-14T22:53:25.550625 #2230357] INFO -- : [649/885] 2271723=test_debug I, [2024-05-14T22:53:25.551433 #2230357] INFO -- : [650/885] 2271723=test_omap I, [2024-05-14T22:53:25.557827 #2230357] INFO -- : [651/885] 2271729=test_string I, [2024-05-14T22:53:25.559218 #2230357] INFO -- : [652/885] 2271729=test_iterator I, [2024-05-14T22:53:25.559629 #2230357] INFO -- : [653/885] 2271723=test_digest_extend I, [2024-05-14T22:53:25.576269 #2230357] INFO -- : [654/885] 2271723=test_windows_1252 I, [2024-05-14T22:53:25.580613 #2230357] INFO -- : [655/885] 2271723=test_input_method I, [2024-05-14T22:53:25.654159 #2230357] INFO -- : [656/885] 2271729=test_process I, [2024-05-14T22:53:25.666416 #2230357] INFO -- : [657/885] 2271718=test_x509crl I, [2024-05-14T22:53:25.682708 #2230357] INFO -- : [658/885] 2271729=test_signal I, [2024-05-14T22:53:25.702035 #2230357] INFO -- : [659/885] 2271723=test_fixnum I, [2024-05-14T22:53:25.711102 #2230357] INFO -- : [660/885] 2271723=test_rdoc_top_level I, [2024-05-14T22:53:25.722534 #2230357] INFO -- : [661/885] 2271728=test_metaclass I, [2024-05-14T22:53:25.726568 #2230357] INFO -- : [662/885] 2271728=test_cgi_session I, [2024-05-14T22:53:25.737481 #2230357] INFO -- : [663/885] 2271728=test_rdoc_rd I, [2024-05-14T22:53:25.761719 #2230357] INFO -- : [664/885] 2271728=test_gem_resolver_installer_set I, [2024-05-14T22:53:25.837635 #2230357] INFO -- : [665/885] 2271718=test_dir_m17n I, [2024-05-14T22:53:25.852251 #2230357] INFO -- : [666/885] 2271717=test_gem_source_git I, [2024-05-14T22:53:25.911810 #2230357] INFO -- : [667/885] 2271726=test_regex_casefold I, [2024-05-14T22:53:25.998042 #2230357] INFO -- : [668/885] 2271728=test_refinement I, [2024-05-14T22:53:26.040496 #2230357] INFO -- : [669/885] 2271723=test_gem_commands_signout_command I, [2024-05-14T22:53:26.053608 #2230357] INFO -- : [670/885] 2271723=test_require I, [2024-05-14T22:53:26.060579 #2230357] INFO -- : [671/885] 2271719=test_cgi_cookie I, [2024-05-14T22:53:26.070385 #2230357] INFO -- : [672/885] 2271719=test_float I, [2024-05-14T22:53:26.399417 #2230357] INFO -- : [673/885] 2271717=test_timeout I, [2024-05-14T22:53:26.509415 #2230357] INFO -- : [674/885] 2271726=test_alias I, [2024-05-14T22:53:26.617752 #2230357] INFO -- : [675/885] 2271724=test_weakref I, [2024-05-14T22:53:26.638683 #2230357] INFO -- : [676/885] 2271726=test_nonblock I, [2024-05-14T22:53:26.650975 #2230357] INFO -- : [677/885] 2271726=test_marshal I, [2024-05-14T22:53:26.765826 #2230357] INFO -- : [678/885] 2271724=test_unicode_normalize I, [2024-05-14T22:53:27.140294 #2230357] INFO -- : [679/885] 2271726=test_reline_key I, [2024-05-14T22:53:27.147629 #2230357] INFO -- : [680/885] 2271726=test_rb_str_dup I, [2024-05-14T22:53:27.152792 #2230357] INFO -- : [681/885] 2271726=test_ancdata I, [2024-05-14T22:53:27.154258 #2230357] INFO -- : [682/885] 2271726=test_singleton_function I, [2024-05-14T22:53:27.164047 #2230357] INFO -- : [683/885] 2271726=test_ssl I, [2024-05-14T22:53:27.201412 #2230357] INFO -- : [684/885] 2271718=test_rendering I, [2024-05-14T22:53:27.256184 #2230357] INFO -- : [685/885] 2271718=test_debugger_integration I, [2024-05-14T22:53:27.256345 #2230357] INFO -- : [686/885] 2271718=test_my_integer I, [2024-05-14T22:53:27.272631 #2230357] INFO -- : [687/885] 2271718=json_ext_parser_test I, [2024-05-14T22:53:27.275244 #2230357] INFO -- : [688/885] 2271718=test_thread I, [2024-05-14T22:53:27.332659 #2230357] INFO -- : [689/885] 2271717=test_ractor I, [2024-05-14T22:53:27.443234 #2230357] INFO -- : [690/885] 2271722=test_registry I, [2024-05-14T22:53:27.444413 #2230357] INFO -- : [691/885] 2271722=parse_stream_test I, [2024-05-14T22:53:27.451765 #2230357] INFO -- : [692/885] 2271722=test_gem I, [2024-05-14T22:53:27.455102 #2230357] INFO -- : [693/885] 2271725=test_gem_source_lock I, [2024-05-14T22:53:27.465328 #2230357] INFO -- : [694/885] 2271719=test_ractor I, [2024-05-14T22:53:27.475394 #2230357] INFO -- : [695/885] 2271719=test_dns I, [2024-05-14T22:53:27.505193 #2230357] INFO -- : [696/885] 2271725=test_gem_commands_open_command I, [2024-05-14T22:53:27.559339 #2230357] INFO -- : [697/885] 2271734=test_cgi_core I, [2024-05-14T22:53:27.571036 #2230357] INFO -- : [698/885] 2271725=test_parser I, [2024-05-14T22:53:27.576813 #2230357] INFO -- : [699/885] 2271734=test_gem_commands_setup_command I, [2024-05-14T22:53:27.582261 #2230357] INFO -- : [700/885] 2271725=test_env I, [2024-05-14T22:53:27.598502 #2230357] INFO -- : [701/885] 2271721=test_rdoc_attr I, [2024-05-14T22:53:27.607928 #2230357] INFO -- : [702/885] 2271726=test_dryrun I, [2024-05-14T22:53:27.611646 #2230357] INFO -- : [703/885] 2271721=test_integer I, [2024-05-14T22:53:27.676014 #2230357] INFO -- : [704/885] 2271726=desugar_compiler_test I, [2024-05-14T22:53:27.676965 #2230357] INFO -- : [705/885] 2271721=test_have_func I, [2024-05-14T22:53:27.678712 #2230357] INFO -- : [706/885] 2271726=test_gem_request_set_lockfile_tokenizer I, [2024-05-14T22:53:27.701797 #2230357] INFO -- : [707/885] 2271727=test_stat I, [2024-05-14T22:53:27.704570 #2230357] INFO -- : [708/885] 2271717=test_capacity I, [2024-05-14T22:53:27.707854 #2230357] INFO -- : [709/885] 2271727=test_nextafter I, [2024-05-14T22:53:27.711341 #2230357] INFO -- : [710/885] 2271717=test_usrmarshal I, [2024-05-14T22:53:27.722412 #2230357] INFO -- : [711/885] 2271726=test_object_references I, [2024-05-14T22:53:27.733602 #2230357] INFO -- : [712/885] 2271726=test_gem_resolver_git_specification I, [2024-05-14T22:53:27.751076 #2230357] INFO -- : [713/885] 2271729=test_rubyoptions I, [2024-05-14T22:53:27.779786 #2230357] INFO -- : [714/885] 2271727=test_super I, [2024-05-14T22:53:27.879385 #2230357] INFO -- : [715/885] 2271717=test_integer I, [2024-05-14T22:53:27.938988 #2230357] INFO -- : [716/885] 2271726=test_cgi_modruby I, [2024-05-14T22:53:27.947065 #2230357] INFO -- : [717/885] 2271726=test_rubygems I, [2024-05-14T22:53:27.953629 #2230357] INFO -- : [718/885] 2271734=test_call I, [2024-05-14T22:53:27.968661 #2230357] INFO -- : [719/885] 2271719=test_https_proxy I, [2024-05-14T22:53:28.001655 #2230357] INFO -- : Environment variable changed: TestGem#test_self_clear_paths : "GEM_PRIVATE_KEY_PASSPHRASE" added I, [2024-05-14T22:53:28.001716 #2230357] INFO -- : Environment variable changed: TestGem#test_self_clear_paths : "GEM_SPEC_CACHE" added I, [2024-05-14T22:53:28.001727 #2230357] INFO -- : Environment variable changed: TestGem#test_self_clear_paths : "HOME" changed : "/home/ko1" -> "/tmp/rubytest.hj2zu2/test_rubygems_20240514-2271722-mxku0t/userhome" I, [2024-05-14T22:53:28.014435 #2230357] INFO -- : [720/885] 2271719=test_find_executable I, [2024-05-14T22:53:28.023159 #2230357] INFO -- : Environment variable changed: TestGem#test_self_clear_paths : "RUBYGEMS_PREVENT_UPDATE_SUGGESTION" added I, [2024-05-14T22:53:28.058294 #2230357] INFO -- : [721/885] 2271719=ruby_api_test I, [2024-05-14T22:53:28.115253 #2230357] INFO -- : [722/885] 2271734=test_gem_commands_pristine_command I, [2024-05-14T22:53:28.129757 #2230357] INFO -- : [723/885] 2271726=test_context I, [2024-05-14T22:53:28.217471 #2230357] INFO -- : [724/885] 2271719=test_nofree I, [2024-05-14T22:53:28.221861 #2230357] INFO -- : [725/885] 2271719=test_coder I, [2024-05-14T22:53:28.235298 #2230357] INFO -- : [726/885] 2271719=test_symbol I, [2024-05-14T22:53:28.276967 #2230357] INFO -- : [727/885] 2271726=test_unix I, [2024-05-14T22:53:28.309901 #2230357] INFO -- : [728/885] 2271726=test_lazy_enumerator I, [2024-05-14T22:53:28.434223 #2230357] INFO -- : [729/885] 2271728=test_enc_associate I, [2024-05-14T22:53:28.552270 #2230357] INFO -- : [730/885] 2271720=test_pkcs7 I, [2024-05-14T22:53:28.690465 #2230357] INFO -- : [731/885] 2271727=test_arith_seq_beg_len_step I, [2024-05-14T22:53:28.730309 #2230357] INFO -- : [732/885] 2271726=test_gem_resolver_requirement_list I, [2024-05-14T22:53:28.732622 #2230357] INFO -- : [733/885] 2271720=test_function_entry I, [2024-05-14T22:53:28.735618 #2230357] INFO -- : [734/885] 2271720=test_rdoc_comment I, [2024-05-14T22:53:28.737061 #2230357] INFO -- : [735/885] 2271726=test_error_highlight I, [2024-05-14T22:53:28.758525 #2230357] INFO -- : [736/885] 2271727=test_resize I, [2024-05-14T22:53:28.768974 #2230357] INFO -- : [737/885] 2271727=test_rdoc_generator_darkfish I, [2024-05-14T22:53:28.797871 #2230357] INFO -- : [738/885] 2271720=test_http_request I, [2024-05-14T22:53:28.802270 #2230357] INFO -- : [739/885] 2271720=json_generic_object_test I, [2024-05-14T22:53:28.812061 #2230357] INFO -- : [740/885] 2271720=test_gem_source_fetch_problem I, [2024-05-14T22:53:28.828137 #2230357] INFO -- : [741/885] 2271720=location_test I, [2024-05-14T22:53:28.878101 #2230357] INFO -- : [742/885] 2271720=test_symbol I, [2024-05-14T22:53:28.889998 #2230357] INFO -- : [743/885] 2271720=test_coderange I, [2024-05-14T22:53:28.892045 #2230357] INFO -- : [744/885] 2271720=test_mailto I, [2024-05-14T22:53:28.900317 #2230357] INFO -- : [745/885] 2271720=test_gem_console_ui I, [2024-05-14T22:53:28.906455 #2230357] INFO -- : [746/885] 2271720=test_date_ractor I, [2024-05-14T22:53:28.950435 #2230357] INFO -- : [747/885] 2271728=test_dir I, [2024-05-14T22:53:28.957259 #2230357] INFO -- : [748/885] 2271723=format_errors_test I, [2024-05-14T22:53:28.989226 #2230357] INFO -- : [749/885] 2271721=test_autoconf I, [2024-05-14T22:53:28.998425 #2230357] INFO -- : [750/885] 2271721=test_eval I, [2024-05-14T22:53:29.001656 #2230357] INFO -- : [751/885] 2271721=test_ractor_compatibility I, [2024-05-14T22:53:29.043660 #2230357] INFO -- : [752/885] 2271723=test_member I, [2024-05-14T22:53:29.047363 #2230357] INFO -- : [753/885] 2271723=test_numeric I, [2024-05-14T22:53:29.052240 #2230357] INFO -- : [754/885] 2271723=test_cgi_multipart I, [2024-05-14T22:53:29.094793 #2230357] INFO -- : [755/885] 2271726=test_gem_commands_cleanup_command I, [2024-05-14T22:53:29.114919 #2230357] INFO -- : [756/885] 2271724=test_word I, [2024-05-14T22:53:29.117891 #2230357] INFO -- : [757/885] 2271724=test_gem_resolver_api_specification I, [2024-05-14T22:53:29.143118 #2230357] INFO -- : [758/885] 2271727=test_win32ole_variant I, [2024-05-14T22:53:29.144240 #2230357] INFO -- : [759/885] 2271727=test_mixed_unicode_escapes I, [2024-05-14T22:53:29.162448 #2230357] INFO -- : [760/885] 2271724=test_history I, [2024-05-14T22:53:29.166987 #2230357] INFO -- : [761/885] 2271720=test_rdoc_markup_to_ansi I, [2024-05-14T22:53:29.167430 #2230357] INFO -- : [762/885] 2271727=test_ipaddr I, [2024-05-14T22:53:29.171439 #2230357] INFO -- : [763/885] 2271724=test_rdoc_extend I, [2024-05-14T22:53:29.186806 #2230357] INFO -- : [764/885] 2271731=test_merge_keys I, [2024-05-14T22:53:29.193033 #2230357] INFO -- : [765/885] 2271727=test_gem_package I, [2024-05-14T22:53:29.194128 #2230357] INFO -- : [766/885] 2271720=test_resolve_symbol I, [2024-05-14T22:53:29.197270 #2230357] INFO -- : [767/885] 2271731=test_complex2 I, [2024-05-14T22:53:29.202312 #2230357] INFO -- : [768/885] 2271724=test_have_macro I, [2024-05-14T22:53:29.208261 #2230357] INFO -- : [769/885] 2271731=test_enum I, [2024-05-14T22:53:29.217578 #2230357] INFO -- : [770/885] 2271723=test_gem_specification I, [2024-05-14T22:53:29.228447 #2230357] INFO -- : [771/885] 2271728=test_threadgroup I, [2024-05-14T22:53:29.275767 #2230357] INFO -- : [772/885] 2271720=test_rdoc_class_module I, [2024-05-14T22:53:29.301557 #2230357] INFO -- : [773/885] 2271734=test_bignum I, [2024-05-14T22:53:29.362450 #2230357] INFO -- : [774/885] 2271721=test_gem_ci_detector I, [2024-05-14T22:53:29.366856 #2230357] INFO -- : Environment variable changed: TestCiDetector#test_ci? : "GEM_PRIVATE_KEY_PASSPHRASE" added I, [2024-05-14T22:53:29.366919 #2230357] INFO -- : Environment variable changed: TestCiDetector#test_ci? : "GEM_SPEC_CACHE" added I, [2024-05-14T22:53:29.367039 #2230357] INFO -- : Environment variable changed: TestCiDetector#test_ci? : "HOME" changed : "/home/ko1" -> "/tmp/rubytest.hj2zu2/test_rubygems_20240514-2271721-efitid/userhome" I, [2024-05-14T22:53:29.382863 #2230357] INFO -- : Environment variable changed: TestCiDetector#test_ci? : "RUBYGEMS_PREVENT_UPDATE_SUGGESTION" added I, [2024-05-14T22:53:29.386725 #2230357] INFO -- : Environment variable changed: TestCiDetector#test_ci_strings : "GEM_SPEC_CACHE" changed : "/tmp/rubytest.hj2zu2/test_rubygems_20240514-2271721-efitid/spec_cache" -> "/tmp/rubytest.hj2zu2/test_rubygems_20240514-2271721-voszf2/spec_cache" I, [2024-05-14T22:53:29.400647 #2230357] INFO -- : Environment variable changed: TestCiDetector#test_ci_strings : "HOME" changed : "/tmp/rubytest.hj2zu2/test_rubygems_20240514-2271721-efitid/userhome" -> "/tmp/rubytest.hj2zu2/test_rubygems_20240514-2271721-voszf2/userhome" I, [2024-05-14T22:53:29.402513 #2230357] INFO -- : [775/885] 2271721=test_stringio I, [2024-05-14T22:53:29.410849 #2230357] INFO -- : [776/885] 2271734=test_arity I, [2024-05-14T22:53:29.415660 #2230357] INFO -- : [777/885] 2271734=test_io_wait_uncommon I, [2024-05-14T22:53:29.423032 #2230357] INFO -- : [778/885] 2271734=test_win32ole_variable I, [2024-05-14T22:53:29.424988 #2230357] INFO -- : [779/885] 2271734=test_trace I, [2024-05-14T22:53:29.437472 #2230357] INFO -- : [780/885] 2271734=ractor_test I, [2024-05-14T22:53:29.459351 #2230357] INFO -- : [781/885] 2271726=test_time_tz I, [2024-05-14T22:53:29.483610 #2230357] INFO -- : [782/885] 2271722=test_win32ole_event I, [2024-05-14T22:53:29.492010 #2230357] INFO -- : [783/885] 2271722=test_rdoc_generator_json_index I, [2024-05-14T22:53:29.497325 #2230357] INFO -- : [784/885] 2271721=test_rdoc_rd_block_parser I, [2024-05-14T22:53:29.503673 #2230357] INFO -- : [785/885] 2271726=test_tsort I, [2024-05-14T22:53:29.506774 #2230357] INFO -- : [786/885] 2271726=test_signedness I, [2024-05-14T22:53:29.511362 #2230357] INFO -- : [787/885] 2271734=test_type I, [2024-05-14T22:53:29.516245 #2230357] INFO -- : [788/885] 2271734=test_ractor I, [2024-05-14T22:53:29.519829 #2230357] INFO -- : [789/885] 2271722=test_func I, [2024-05-14T22:53:29.538269 #2230357] INFO -- : [790/885] 2271721=test_big5 I, [2024-05-14T22:53:29.539644 #2230357] INFO -- : [791/885] 2271721=test_pointer I, [2024-05-14T22:53:29.594487 #2230357] INFO -- : [792/885] 2271734=test_gem_local_remote_options I, [2024-05-14T22:53:29.601099 #2230357] INFO -- : [793/885] 2271724=test_date_arith I, [2024-05-14T22:53:29.623677 #2230357] INFO -- : [794/885] 2271724=test_object I, [2024-05-14T22:53:29.658251 #2230357] INFO -- : [795/885] 2271734=test_ruby_lex I, [2024-05-14T22:53:29.674802 #2230357] INFO -- : [796/885] 2271732=test_sleep I, [2024-05-14T22:53:29.682327 #2230357] INFO -- : [797/885] 2271720=compiler_test I, [2024-05-14T22:53:29.687918 #2230357] INFO -- : [798/885] 2271720=test_flip I, [2024-05-14T22:53:29.710813 #2230357] INFO -- : [799/885] 2271720=test_change_word I, [2024-05-14T22:53:29.723796 #2230357] INFO -- : [800/885] 2271720=test_ossl I, [2024-05-14T22:53:29.783581 #2230357] INFO -- : [801/885] 2271727=test_normalize I, [2024-05-14T22:53:29.784868 #2230357] INFO -- : [802/885] 2271727=test_timeout I, [2024-05-14T22:53:29.798371 #2230357] INFO -- : [803/885] 2271727=test_arithmetic_sequence I, [2024-05-14T22:53:29.813072 #2230357] INFO -- : [804/885] 2271727=test_key_actor_emacs I, [2024-05-14T22:53:29.915999 #2230357] INFO -- : [805/885] 2271727=test_gem_command_manager I, [2024-05-14T22:53:29.926283 #2230357] INFO -- : [806/885] 2271721=test_gem_gemcutter_utilities I, [2024-05-14T22:53:29.941110 #2230357] INFO -- : [807/885] 2271734=test_basicinstructions I, [2024-05-14T22:53:29.992517 #2230357] INFO -- : [808/885] 2271731=version_test I, [2024-05-14T22:53:29.995973 #2230357] INFO -- : [809/885] 2271731=test_cgi_header I, [2024-05-14T22:53:30.002182 #2230357] INFO -- : [810/885] 2271731=heredoc_dedent_test I, [2024-05-14T22:53:30.005800 #2230357] INFO -- : [811/885] 2271731=test_object I, [2024-05-14T22:53:30.010179 #2230357] INFO -- : [812/885] 2271731=test_rdoc_parser_markdown I, [2024-05-14T22:53:30.014657 #2230357] INFO -- : [813/885] 2271724=test_import I, [2024-05-14T22:53:30.015624 #2230357] INFO -- : [814/885] 2271734=test_gem_resolver_lock_set I, [2024-05-14T22:53:30.032806 #2230357] INFO -- : [815/885] 2271731=test_not I, [2024-05-14T22:53:30.035087 #2230357] INFO -- : [816/885] 2271731=test_logger I, [2024-05-14T22:53:30.037528 #2230357] INFO -- : [817/885] 2271734=test_files_test I, [2024-05-14T22:53:30.044270 #2230357] INFO -- : [818/885] 2271731=test_gem_update_suggestion I, [2024-05-14T22:53:30.066175 #2230357] INFO -- : [819/885] 2271727=test_file_exhaustive I, [2024-05-14T22:53:30.078335 #2230357] INFO -- : [820/885] 2271731=test_continuation I, [2024-05-14T22:53:30.082174 #2230357] INFO -- : [821/885] 2271731=test_fd_setsize I, [2024-05-14T22:53:30.087586 #2230357] INFO -- : [822/885] 2271731=test_keyword I, [2024-05-14T22:53:30.105533 #2230357] INFO -- : [823/885] 2271734=test_class_name_check I, [2024-05-14T22:53:30.150679 #2230357] INFO -- : [824/885] 2271734=test_delete I, [2024-05-14T22:53:30.157257 #2230357] INFO -- : [825/885] 2271734=test_win32ole_method I, [2024-05-14T22:53:30.163347 #2230357] INFO -- : [826/885] 2271734=test_rdoc_markup_hard_break I, [2024-05-14T22:53:30.232499 #2230357] INFO -- : [827/885] 2271728=test_date_strptime I, [2024-05-14T22:53:30.267585 #2230357] INFO -- : [828/885] 2271721=test_gem_package_task I, [2024-05-14T22:53:30.277801 #2230357] INFO -- : [829/885] 2271721=test_placearg I, [2024-05-14T22:53:30.306345 #2230357] INFO -- : [830/885] 2271728=test_gem_platform I, [2024-05-14T22:53:30.322296 #2230357] INFO -- : [831/885] 2271734=test_pkey_rsa I, [2024-05-14T22:53:30.338732 #2230357] INFO -- : [832/885] 2271721=test_numhash I, [2024-05-14T22:53:30.342700 #2230357] INFO -- : [833/885] 2271721=test_weakkeymap I, [2024-05-14T22:53:30.361469 #2230357] INFO -- : [834/885] 2271728=test_gem_commands_push_command I, [2024-05-14T22:53:30.438684 #2230357] INFO -- : [835/885] 2271725=test_webauthn_listener I, [2024-05-14T22:53:30.495884 #2230357] INFO -- : [836/885] 2271725=test_lambda I, [2024-05-14T22:53:30.500909 #2230357] INFO -- : [837/885] 2271717=test_gem_request_set_gem_dependency_api I, [2024-05-14T22:53:30.551920 #2230357] INFO -- : [838/885] 2271721=test_ast I, [2024-05-14T22:53:30.561274 #2230357] INFO -- : [839/885] 2271725=test_jaro_winkler I, [2024-05-14T22:53:30.565631 #2230357] INFO -- : [840/885] 2271725=test_random_formatter I, [2024-05-14T22:53:30.583334 #2230357] INFO -- : [841/885] 2271731=test_helper I, [2024-05-14T22:53:30.583630 #2230357] INFO -- : [842/885] 2271731=test_fips I, [2024-05-14T22:53:30.596699 #2230357] INFO -- : [843/885] 2271725=test_x509name I, [2024-05-14T22:53:30.608284 #2230357] INFO -- : [844/885] 2271725=test_update I, [2024-05-14T22:53:30.610378 #2230357] INFO -- : [845/885] 2271734=test_rdoc_code_object I, [2024-05-14T22:53:30.611669 #2230357] INFO -- : [846/885] 2271725=test_x509store I, [2024-05-14T22:53:30.668671 #2230357] INFO -- : [847/885] 2271723=test_eval I, [2024-05-14T22:53:30.739535 #2230357] INFO -- : [848/885] 2271717=json_generator_test I, [2024-05-14T22:53:30.785211 #2230357] INFO -- : [849/885] 2271731=test_transcode I, [2024-05-14T22:53:30.824827 #2230357] INFO -- : [850/885] 2271717=test_gem_safe_marshal I, [2024-05-14T22:53:30.839537 #2230357] INFO -- : [851/885] 2271728=test_gem_resolver_api_set I, [2024-05-14T22:53:30.867587 #2230357] INFO -- : [852/885] 2271725=test_gem_resolver_vendor_set I, [2024-05-14T22:53:30.880344 #2230357] INFO -- : [853/885] 2271723=test_config I, [2024-05-14T22:53:30.886590 #2230357] INFO -- : [854/885] 2271725=test_enumerable I, [2024-05-14T22:53:30.889557 #2230357] INFO -- : [855/885] 2271725=test_ts I, [2024-05-14T22:53:30.901351 #2230357] INFO -- : [856/885] 2271728=library_symbols_test I, [2024-05-14T22:53:30.904637 #2230357] INFO -- : [857/885] 2271728=test_addr I, [2024-05-14T22:53:30.911192 #2230357] INFO -- : [858/885] 2271728=test_locale I, [2024-05-14T22:53:30.924589 #2230357] INFO -- : [859/885] 2271728=test_ensured I, [2024-05-14T22:53:30.937403 #2230357] INFO -- : [860/885] 2271731=test_rdoc_ri_paths I, [2024-05-14T22:53:30.940612 #2230357] INFO -- : [861/885] 2271734=test_pty I, [2024-05-14T22:53:30.953433 #2230357] INFO -- : [862/885] 2271731=test_dup I, [2024-05-14T22:53:30.971411 #2230357] INFO -- : [863/885] 2271728=test_constant I, [2024-05-14T22:53:31.141331 #2230357] INFO -- : [864/885] 2271731=command_line_test I, [2024-05-14T22:53:31.146353 #2230357] INFO -- : [865/885] 2271731=test_project_sanity I, [2024-05-14T22:53:31.193316 #2230357] INFO -- : [866/885] 2271731=test_range I, [2024-05-14T22:53:31.316064 #2230357] INFO -- : [867/885] 2271725=test_gem_uri_formatter I, [2024-05-14T22:53:31.328328 #2230357] INFO -- : [868/885] 2271725=test_encoding I, [2024-05-14T22:53:31.353800 #2230357] INFO -- : [869/885] 2271723=test_helper I, [2024-05-14T22:53:31.354181 #2230357] INFO -- : [870/885] 2271723=test_erb_command I, [2024-05-14T22:53:31.376976 #2230357] INFO -- : [871/885] 2271726=static_inspect_test I, [2024-05-14T22:53:31.381813 #2230357] INFO -- : [872/885] 2271726=test_file I, [2024-05-14T22:53:31.392188 #2230357] INFO -- : [873/885] 2271723=test_force_exit I, [2024-05-14T22:53:31.400539 #2230357] INFO -- : [874/885] 2271723=test_ostruct I, [2024-05-14T22:53:31.449575 #2230357] INFO -- : [875/885] 2271717=unescape_test I, [2024-05-14T22:53:31.451589 #2230357] INFO -- : [876/885] 2271734=test_data_error I, [2024-05-14T22:53:31.453688 #2230357] INFO -- : [877/885] 2271719=bom_test I, [2024-05-14T22:53:31.464473 #2230357] INFO -- : [878/885] 2271719=test_udp I, [2024-05-14T22:53:31.467996 #2230357] INFO -- : [879/885] 2271719=test_vm_dump I, [2024-05-14T22:53:31.471299 #2230357] INFO -- : [880/885] 2271719=test_tmpdir I, [2024-05-14T22:53:31.505443 #2230357] INFO -- : [881/885] 2271730=test_rdoc_markup_document I, [2024-05-14T22:53:31.506004 #2230357] INFO -- : [882/885] 2271734=test_integer_comb I, [2024-05-14T22:53:31.538059 #2230357] INFO -- : [883/885] 2271725=test_regexp I, [2024-05-14T22:53:31.544966 #2230357] INFO -- : [884/885] 2271723=test_gem_commands_check_command I, [2024-05-14T22:53:31.562662 #2230357] INFO -- : [885/885] 2271719=errors_test I, [2024-05-14T22:53:53.163021 #2230357] INFO -- : Finished tests in 39.433173s, 668.8024 tests/s, 237150.8862 assertions/s. E, [2024-05-14T22:53:53.163169 #2230357] ERROR -- : Children under /tmp/rubytest.hj2zu2: E, [2024-05-14T22:53:53.163194 #2230357] ERROR -- : * drwx------ 4 80 2024-05-14 22:53:24 +0000 gem_rebuild20240514-2271729-22f4o0/ E, [2024-05-14T22:53:53.163201 #2230357] ERROR -- : * drwxrwxr-x 2 60 2024-05-14 22:53:24 +0000 new/ E, [2024-05-14T22:53:53.163205 #2230357] ERROR -- : * -rw-rw-r-- 1 4096 2024-05-14 22:53:24 +0000 rebuild_test_gem-1.0.0.gem E, [2024-05-14T22:53:53.163227 #2230357] ERROR -- : * drwxrwxr-x 2 60 2024-05-14 22:53:24 +0000 old/ E, [2024-05-14T22:53:53.163242 #2230357] ERROR -- : * -rw-rw-r-- 1 4096 2024-05-14 22:53:24 +0000 rebuild_test_gem-1.0.0.gem I, [2024-05-14T22:53:53.164742 #2230357] INFO -- : 26373 tests, 9351612 assertions, 0 failures, 0 errors, 316 skips I, [2024-05-14T22:53:53.164769 #2230357] INFO -- : I, [2024-05-14T22:53:53.164777 #2230357] INFO -- : ruby -v: ruby 3.4.0dev (2024-05-14T21:44:34Z master e3e1e53098) [x86_64-linux] I, [2024-05-14T22:53:53.167019 #2230357] INFO -- : $$$[end] "make yes-test-all TESTOPTS='--stderr-on-failure' TESTS='-j20'" exit with 0. I, [2024-05-14T22:53:53.167145 #2230357] INFO -- : $$$[beg] make yes-test-rubyspec MSPECOPT='--error-output stderr --debug -j' TESTS='-j20' I, [2024-05-14T22:53:53.255835 #2230357] INFO -- : BASERUBY = /usr/bin/ruby --disable=gems I, [2024-05-14T22:53:53.255884 #2230357] INFO -- : CC = gcc I, [2024-05-14T22:53:53.255890 #2230357] INFO -- : LD = ld I, [2024-05-14T22:53:53.255895 #2230357] INFO -- : LDSHARED = gcc -shared I, [2024-05-14T22:53:53.255900 #2230357] INFO -- : CFLAGS = -O3 -fno-fast-math -ggdb3 -Wall -Wextra -Wdeprecated-declarations -Wdiv-by-zero -Wduplicated-cond -Wimplicit-function-declaration -Wimplicit-int -Wpointer-arith -Wwrite-strings -Wold-style-definition -Wimplicit-fallthrough=0 -Wmissing-noreturn -Wno-cast-function-type -Wno-constant-logical-operand -Wno-long-long -Wno-missing-field-initializers -Wno-overlength-strings -Wno-packed-bitfield-compat -Wno-parentheses-equality -Wno-self-assign -Wno-tautological-compare -Wno-unused-parameter -Wno-unused-value -Wsuggest-attribute=format -Wsuggest-attribute=noreturn -Wunused-variable -Wmisleading-indentation -Wundef -fPIC I, [2024-05-14T22:53:53.255904 #2230357] INFO -- : XCFLAGS = -U_FORTIFY_SOURCE -D_FORTIFY_SOURCE=2 -fstack-protector-strong -fno-strict-overflow -fvisibility=hidden -fexcess-precision=standard -DRUBY_EXPORT -I. -I.ext/include/x86_64-linux -I/tmp/ruby/src/trunk/include -I/tmp/ruby/src/trunk -I/tmp/ruby/src/trunk/prism -I/tmp/ruby/src/trunk/enc/unicode/15.0.0 I, [2024-05-14T22:53:53.255908 #2230357] INFO -- : CPPFLAGS = I, [2024-05-14T22:53:53.255912 #2230357] INFO -- : DLDFLAGS = -Wl,--compress-debug-sections=zlib -Wl,-soname,libruby.so.3.4 -fstack-protector-strong I, [2024-05-14T22:53:53.255916 #2230357] INFO -- : SOLIBS = -lz -lrt -lrt -lgmp -ldl -lcrypt -lm -lpthread I, [2024-05-14T22:53:53.255919 #2230357] INFO -- : LANG = en_US.UTF-8 I, [2024-05-14T22:53:53.255923 #2230357] INFO -- : LC_ALL = I, [2024-05-14T22:53:53.255931 #2230357] INFO -- : LC_CTYPE = I, [2024-05-14T22:53:53.255935 #2230357] INFO -- : MFLAGS = I, [2024-05-14T22:53:53.255939 #2230357] INFO -- : RUSTC = no I, [2024-05-14T22:53:53.255943 #2230357] INFO -- : YJIT_RUSTC_ARGS = --crate-name=yjit --crate-type=staticlib --edition=2021 -g -C lto=thin -C opt-level=3 -C overflow-checks=on '--out-dir=/tmp/ruby/build/trunk/yjit/target/release/' /tmp/ruby/src/trunk/yjit/src/lib.rs I, [2024-05-14T22:53:53.256531 #2230357] INFO -- : gcc (Ubuntu 11.4.0-1ubuntu1~22.04) 11.4.0 I, [2024-05-14T22:53:53.256553 #2230357] INFO -- : Copyright (C) 2021 Free Software Foundation, Inc. I, [2024-05-14T22:53:53.256558 #2230357] INFO -- : This is free software; see the source for copying conditions. There is NO I, [2024-05-14T22:53:53.256563 #2230357] INFO -- : warranty; not even for MERCHANTABILITY or FITNESS FOR A PARTICULAR PURPOSE. I, [2024-05-14T22:53:53.256567 #2230357] INFO -- : I, [2024-05-14T22:53:53.258519 #2230357] INFO -- : generating enc.mk I, [2024-05-14T22:53:53.376974 #2230357] INFO -- : making enc I, [2024-05-14T22:53:53.394207 #2230357] INFO -- : make[1]: Entering directory '/tmp/ruby/build/trunk' I, [2024-05-14T22:53:53.394230 #2230357] INFO -- : make[1]: Nothing to be done for 'enc'. I, [2024-05-14T22:53:53.394236 #2230357] INFO -- : make[1]: Leaving directory '/tmp/ruby/build/trunk' I, [2024-05-14T22:53:53.394914 #2230357] INFO -- : making srcs under enc I, [2024-05-14T22:53:53.424829 #2230357] INFO -- : make[1]: Entering directory '/tmp/ruby/build/trunk' I, [2024-05-14T22:53:53.424855 #2230357] INFO -- : make[1]: Nothing to be done for 'srcs'. I, [2024-05-14T22:53:53.424869 #2230357] INFO -- : make[1]: Leaving directory '/tmp/ruby/build/trunk' I, [2024-05-14T22:53:53.425827 #2230357] INFO -- : generating transdb.h I, [2024-05-14T22:53:53.526171 #2230357] INFO -- : transdb.h unchanged I, [2024-05-14T22:53:53.527474 #2230357] INFO -- : making trans I, [2024-05-14T22:53:53.561471 #2230357] INFO -- : make[1]: Entering directory '/tmp/ruby/build/trunk' I, [2024-05-14T22:53:53.561493 #2230357] INFO -- : make[1]: Nothing to be done for 'trans'. I, [2024-05-14T22:53:53.561499 #2230357] INFO -- : make[1]: Leaving directory '/tmp/ruby/build/trunk' I, [2024-05-14T22:53:53.562237 #2230357] INFO -- : making encs I, [2024-05-14T22:53:53.600509 #2230357] INFO -- : make[1]: Entering directory '/tmp/ruby/build/trunk' I, [2024-05-14T22:53:53.600531 #2230357] INFO -- : make[1]: Nothing to be done for 'encs'. I, [2024-05-14T22:53:53.600537 #2230357] INFO -- : make[1]: Leaving directory '/tmp/ruby/build/trunk' I, [2024-05-14T22:53:53.602469 #2230357] INFO -- : generating makefiles ext/configure-ext.mk I, [2024-05-14T22:53:53.633899 #2230357] INFO -- : ext/configure-ext.mk updated I, [2024-05-14T22:53:53.636497 #2230357] INFO -- : make[1]: Entering directory '/tmp/ruby/build/trunk' I, [2024-05-14T22:53:54.987180 #2230357] INFO -- : make[1]: Leaving directory '/tmp/ruby/build/trunk' I, [2024-05-14T22:53:54.987906 #2230357] INFO -- : generating makefile exts.mk I, [2024-05-14T22:53:55.024527 #2230357] INFO -- : exts.mk unchanged I, [2024-05-14T22:53:55.029391 #2230357] INFO -- : make[1]: Entering directory '/tmp/ruby/build/trunk' I, [2024-05-14T22:53:55.339743 #2230357] INFO -- : make[2]: Entering directory '/tmp/ruby/build/trunk/ext/coverage' I, [2024-05-14T22:53:55.344483 #2230357] INFO -- : make[2]: Leaving directory '/tmp/ruby/build/trunk/ext/coverage' I, [2024-05-14T22:53:55.351434 #2230357] INFO -- : make[2]: Entering directory '/tmp/ruby/build/trunk/ext/date' I, [2024-05-14T22:53:55.356551 #2230357] INFO -- : make[2]: Leaving directory '/tmp/ruby/build/trunk/ext/date' I, [2024-05-14T22:53:55.360403 #2230357] INFO -- : make[2]: Entering directory '/tmp/ruby/build/trunk/ext/digest' I, [2024-05-14T22:53:55.369402 #2230357] INFO -- : make[2]: Leaving directory '/tmp/ruby/build/trunk/ext/digest' I, [2024-05-14T22:53:55.396462 #2230357] INFO -- : make[2]: Entering directory '/tmp/ruby/build/trunk/ext/digest/sha2' I, [2024-05-14T22:53:55.401010 #2230357] INFO -- : make[2]: Leaving directory '/tmp/ruby/build/trunk/ext/digest/sha2' I, [2024-05-14T22:53:55.422726 #2230357] INFO -- : make[2]: Entering directory '/tmp/ruby/build/trunk/ext/fiddle' I, [2024-05-14T22:53:55.433583 #2230357] INFO -- : make[2]: Leaving directory '/tmp/ruby/build/trunk/ext/fiddle' I, [2024-05-14T22:53:55.438640 #2230357] INFO -- : make[2]: Entering directory '/tmp/ruby/build/trunk/ext/io/console' I, [2024-05-14T22:53:55.442854 #2230357] INFO -- : make[2]: Leaving directory '/tmp/ruby/build/trunk/ext/io/console' I, [2024-05-14T22:53:55.455631 #2230357] INFO -- : make[2]: Entering directory '/tmp/ruby/build/trunk/ext/json' I, [2024-05-14T22:53:55.466268 #2230357] INFO -- : make[2]: Leaving directory '/tmp/ruby/build/trunk/ext/json' I, [2024-05-14T22:53:55.481871 #2230357] INFO -- : make[2]: Entering directory '/tmp/ruby/build/trunk/ext/monitor' I, [2024-05-14T22:53:55.485905 #2230357] INFO -- : make[2]: Leaving directory '/tmp/ruby/build/trunk/ext/monitor' I, [2024-05-14T22:53:55.493060 #2230357] INFO -- : make[2]: Entering directory '/tmp/ruby/build/trunk/ext/objspace' I, [2024-05-14T22:53:55.499178 #2230357] INFO -- : make[2]: Leaving directory '/tmp/ruby/build/trunk/ext/objspace' I, [2024-05-14T22:53:55.519821 #2230357] INFO -- : make[2]: Entering directory '/tmp/ruby/build/trunk/ext/openssl' I, [2024-05-14T22:53:55.541936 #2230357] INFO -- : make[2]: Leaving directory '/tmp/ruby/build/trunk/ext/openssl' I, [2024-05-14T22:53:55.546174 #2230357] INFO -- : make[2]: Entering directory '/tmp/ruby/build/trunk/ext/pathname' I, [2024-05-14T22:53:55.550259 #2230357] INFO -- : make[2]: Leaving directory '/tmp/ruby/build/trunk/ext/pathname' I, [2024-05-14T22:53:55.557320 #2230357] INFO -- : make[2]: Entering directory '/tmp/ruby/build/trunk/ext/psych' I, [2024-05-14T22:53:55.577851 #2230357] INFO -- : make[2]: Leaving directory '/tmp/ruby/build/trunk/ext/psych' I, [2024-05-14T22:53:55.580962 #2230357] INFO -- : make[2]: Entering directory '/tmp/ruby/build/trunk/ext/pty' I, [2024-05-14T22:53:55.583546 #2230357] INFO -- : make[2]: Leaving directory '/tmp/ruby/build/trunk/ext/pty' I, [2024-05-14T22:53:55.596088 #2230357] INFO -- : make[2]: Entering directory '/tmp/ruby/build/trunk/ext/ripper' I, [2024-05-14T22:53:55.604820 #2230357] INFO -- : make[2]: Leaving directory '/tmp/ruby/build/trunk/ext/ripper' I, [2024-05-14T22:53:55.607278 #2230357] INFO -- : make[2]: Entering directory '/tmp/ruby/build/trunk/ext/rubyvm' I, [2024-05-14T22:53:55.610580 #2230357] INFO -- : make[2]: Leaving directory '/tmp/ruby/build/trunk/ext/rubyvm' I, [2024-05-14T22:53:55.623972 #2230357] INFO -- : make[2]: Entering directory '/tmp/ruby/build/trunk/ext/socket' I, [2024-05-14T22:53:55.634198 #2230357] INFO -- : make[2]: Leaving directory '/tmp/ruby/build/trunk/ext/socket' I, [2024-05-14T22:53:55.651289 #2230357] INFO -- : make[2]: Entering directory '/tmp/ruby/build/trunk/.bundle/gems/bigdecimal-3.1.8/ext/bigdecimal' I, [2024-05-14T22:53:55.678495 #2230357] INFO -- : make[2]: Leaving directory '/tmp/ruby/build/trunk/.bundle/gems/bigdecimal-3.1.8/ext/bigdecimal' I, [2024-05-14T22:53:55.680496 #2230357] INFO -- : make[2]: Entering directory '/tmp/ruby/build/trunk/.bundle/gems/debug-1.9.2/ext/debug' I, [2024-05-14T22:53:55.702535 #2230357] INFO -- : make[2]: Leaving directory '/tmp/ruby/build/trunk/.bundle/gems/debug-1.9.2/ext/debug' I, [2024-05-14T22:53:55.704590 #2230357] INFO -- : make[2]: Entering directory '/tmp/ruby/build/trunk/.bundle/gems/nkf-0.2.0/ext/nkf' I, [2024-05-14T22:53:55.728619 #2230357] INFO -- : make[2]: Leaving directory '/tmp/ruby/build/trunk/.bundle/gems/nkf-0.2.0/ext/nkf' I, [2024-05-14T22:53:55.730530 #2230357] INFO -- : make[2]: Entering directory '/tmp/ruby/build/trunk/.bundle/gems/racc-1.7.3/ext/racc/cparse' I, [2024-05-14T22:53:55.752874 #2230357] INFO -- : make[2]: Leaving directory '/tmp/ruby/build/trunk/.bundle/gems/racc-1.7.3/ext/racc/cparse' I, [2024-05-14T22:53:55.755247 #2230357] INFO -- : make[2]: Entering directory '/tmp/ruby/build/trunk/.bundle/gems/rbs-3.4.4/ext/rbs_extension' I, [2024-05-14T22:53:55.777230 #2230357] INFO -- : make[2]: Leaving directory '/tmp/ruby/build/trunk/.bundle/gems/rbs-3.4.4/ext/rbs_extension' I, [2024-05-14T22:53:55.779105 #2230357] INFO -- : make[2]: Entering directory '/tmp/ruby/build/trunk/.bundle/gems/syslog-0.1.2/ext/syslog' I, [2024-05-14T22:53:55.801489 #2230357] INFO -- : make[2]: Leaving directory '/tmp/ruby/build/trunk/.bundle/gems/syslog-0.1.2/ext/syslog' I, [2024-05-14T22:53:55.826214 #2230357] INFO -- : make[2]: Entering directory '/tmp/ruby/build/trunk' I, [2024-05-14T22:53:55.891230 #2230357] INFO -- : make[2]: 'ruby' is up to date. I, [2024-05-14T22:53:55.891267 #2230357] INFO -- : make[2]: Leaving directory '/tmp/ruby/build/trunk' I, [2024-05-14T22:53:55.891525 #2230357] INFO -- : make[1]: Leaving directory '/tmp/ruby/build/trunk' I, [2024-05-14T22:53:55.895053 #2230357] INFO -- : make[1]: Entering directory '/tmp/ruby/build/trunk' I, [2024-05-14T22:53:55.895075 #2230357] INFO -- : make[1]: Nothing to be done for 'note'. I, [2024-05-14T22:53:55.895081 #2230357] INFO -- : make[1]: Leaving directory '/tmp/ruby/build/trunk' E, [2024-05-14T22:53:55.953962 #2230357] ERROR -- : $ /tmp/ruby/build/trunk/miniruby -I/tmp/ruby/src/trunk/lib /tmp/ruby/src/trunk/tool/runruby.rb --archdir=/tmp/ruby/build/trunk --extout=.ext -- /tmp/ruby/src/trunk/spec/mspec/bin/mspec-run -B /tmp/ruby/src/trunk/spec/default.mspec --error-output stderr --debug -fy -o /tmp/rubytest.r5byhx/1-mspec-multi-0 E, [2024-05-14T22:53:55.954186 #2230357] ERROR -- : $ /tmp/ruby/build/trunk/miniruby -I/tmp/ruby/src/trunk/lib /tmp/ruby/src/trunk/tool/runruby.rb --archdir=/tmp/ruby/build/trunk --extout=.ext -- /tmp/ruby/src/trunk/spec/mspec/bin/mspec-run -B /tmp/ruby/src/trunk/spec/default.mspec --error-output stderr --debug -fy -o /tmp/rubytest.r5byhx/2-mspec-multi-1 E, [2024-05-14T22:53:55.954451 #2230357] ERROR -- : $ /tmp/ruby/build/trunk/miniruby -I/tmp/ruby/src/trunk/lib /tmp/ruby/src/trunk/tool/runruby.rb --archdir=/tmp/ruby/build/trunk --extout=.ext -- /tmp/ruby/src/trunk/spec/mspec/bin/mspec-run -B /tmp/ruby/src/trunk/spec/default.mspec --error-output stderr --debug -fy -o /tmp/rubytest.r5byhx/3-mspec-multi-2 E, [2024-05-14T22:53:55.954717 #2230357] ERROR -- : $ /tmp/ruby/build/trunk/miniruby -I/tmp/ruby/src/trunk/lib /tmp/ruby/src/trunk/tool/runruby.rb --archdir=/tmp/ruby/build/trunk --extout=.ext -- /tmp/ruby/src/trunk/spec/mspec/bin/mspec-run -B /tmp/ruby/src/trunk/spec/default.mspec --error-output stderr --debug -fy -o /tmp/rubytest.r5byhx/4-mspec-multi-3 E, [2024-05-14T22:53:55.954998 #2230357] ERROR -- : $ /tmp/ruby/build/trunk/miniruby -I/tmp/ruby/src/trunk/lib /tmp/ruby/src/trunk/tool/runruby.rb --archdir=/tmp/ruby/build/trunk --extout=.ext -- /tmp/ruby/src/trunk/spec/mspec/bin/mspec-run -B /tmp/ruby/src/trunk/spec/default.mspec --error-output stderr --debug -fy -o /tmp/rubytest.r5byhx/5-mspec-multi-4 E, [2024-05-14T22:53:55.955106 #2230357] ERROR -- : $ /tmp/ruby/build/trunk/miniruby -I/tmp/ruby/src/trunk/lib /tmp/ruby/src/trunk/tool/runruby.rb --archdir=/tmp/ruby/build/trunk --extout=.ext -- /tmp/ruby/src/trunk/spec/mspec/bin/mspec-run -B /tmp/ruby/src/trunk/spec/default.mspec --error-output stderr --debug -fy -o /tmp/rubytest.r5byhx/6-mspec-multi-5 E, [2024-05-14T22:53:55.955513 #2230357] ERROR -- : $ /tmp/ruby/build/trunk/miniruby -I/tmp/ruby/src/trunk/lib /tmp/ruby/src/trunk/tool/runruby.rb --archdir=/tmp/ruby/build/trunk --extout=.ext -- /tmp/ruby/src/trunk/spec/mspec/bin/mspec-run -B /tmp/ruby/src/trunk/spec/default.mspec --error-output stderr --debug -fy -o /tmp/rubytest.r5byhx/7-mspec-multi-6 E, [2024-05-14T22:53:55.955644 #2230357] ERROR -- : $ /tmp/ruby/build/trunk/miniruby -I/tmp/ruby/src/trunk/lib /tmp/ruby/src/trunk/tool/runruby.rb --archdir=/tmp/ruby/build/trunk --extout=.ext -- /tmp/ruby/src/trunk/spec/mspec/bin/mspec-run -B /tmp/ruby/src/trunk/spec/default.mspec --error-output stderr --debug -fy -o /tmp/rubytest.r5byhx/8-mspec-multi-7 E, [2024-05-14T22:53:55.955924 #2230357] ERROR -- : $ /tmp/ruby/build/trunk/miniruby -I/tmp/ruby/src/trunk/lib /tmp/ruby/src/trunk/tool/runruby.rb --archdir=/tmp/ruby/build/trunk --extout=.ext -- /tmp/ruby/src/trunk/spec/mspec/bin/mspec-run -B /tmp/ruby/src/trunk/spec/default.mspec --error-output stderr --debug -fy -o /tmp/rubytest.r5byhx/9-mspec-multi-8 E, [2024-05-14T22:53:55.956224 #2230357] ERROR -- : $ /tmp/ruby/build/trunk/miniruby -I/tmp/ruby/src/trunk/lib /tmp/ruby/src/trunk/tool/runruby.rb --archdir=/tmp/ruby/build/trunk --extout=.ext -- /tmp/ruby/src/trunk/spec/mspec/bin/mspec-run -B /tmp/ruby/src/trunk/spec/default.mspec --error-output stderr --debug -fy -o /tmp/rubytest.r5byhx/10-mspec-multi-9 E, [2024-05-14T22:53:55.956521 #2230357] ERROR -- : $ /tmp/ruby/build/trunk/miniruby -I/tmp/ruby/src/trunk/lib /tmp/ruby/src/trunk/tool/runruby.rb --archdir=/tmp/ruby/build/trunk --extout=.ext -- /tmp/ruby/src/trunk/spec/mspec/bin/mspec-run -B /tmp/ruby/src/trunk/spec/default.mspec --error-output stderr --debug -fy -o /tmp/rubytest.r5byhx/11-mspec-multi-10 E, [2024-05-14T22:53:55.956792 #2230357] ERROR -- : $ /tmp/ruby/build/trunk/miniruby -I/tmp/ruby/src/trunk/lib /tmp/ruby/src/trunk/tool/runruby.rb --archdir=/tmp/ruby/build/trunk --extout=.ext -- /tmp/ruby/src/trunk/spec/mspec/bin/mspec-run -B /tmp/ruby/src/trunk/spec/default.mspec --error-output stderr --debug -fy -o /tmp/rubytest.r5byhx/12-mspec-multi-11 E, [2024-05-14T22:53:55.957070 #2230357] ERROR -- : $ /tmp/ruby/build/trunk/miniruby -I/tmp/ruby/src/trunk/lib /tmp/ruby/src/trunk/tool/runruby.rb --archdir=/tmp/ruby/build/trunk --extout=.ext -- /tmp/ruby/src/trunk/spec/mspec/bin/mspec-run -B /tmp/ruby/src/trunk/spec/default.mspec --error-output stderr --debug -fy -o /tmp/rubytest.r5byhx/13-mspec-multi-12 E, [2024-05-14T22:53:55.957303 #2230357] ERROR -- : $ /tmp/ruby/build/trunk/miniruby -I/tmp/ruby/src/trunk/lib /tmp/ruby/src/trunk/tool/runruby.rb --archdir=/tmp/ruby/build/trunk --extout=.ext -- /tmp/ruby/src/trunk/spec/mspec/bin/mspec-run -B /tmp/ruby/src/trunk/spec/default.mspec --error-output stderr --debug -fy -o /tmp/rubytest.r5byhx/14-mspec-multi-13 E, [2024-05-14T22:53:55.957528 #2230357] ERROR -- : $ /tmp/ruby/build/trunk/miniruby -I/tmp/ruby/src/trunk/lib /tmp/ruby/src/trunk/tool/runruby.rb --archdir=/tmp/ruby/build/trunk --extout=.ext -- /tmp/ruby/src/trunk/spec/mspec/bin/mspec-run -B /tmp/ruby/src/trunk/spec/default.mspec --error-output stderr --debug -fy -o /tmp/rubytest.r5byhx/15-mspec-multi-14 E, [2024-05-14T22:53:55.957707 #2230357] ERROR -- : $ /tmp/ruby/build/trunk/miniruby -I/tmp/ruby/src/trunk/lib /tmp/ruby/src/trunk/tool/runruby.rb --archdir=/tmp/ruby/build/trunk --extout=.ext -- /tmp/ruby/src/trunk/spec/mspec/bin/mspec-run -B /tmp/ruby/src/trunk/spec/default.mspec --error-output stderr --debug -fy -o /tmp/rubytest.r5byhx/16-mspec-multi-15 E, [2024-05-14T22:53:55.957870 #2230357] ERROR -- : $ /tmp/ruby/build/trunk/miniruby -I/tmp/ruby/src/trunk/lib /tmp/ruby/src/trunk/tool/runruby.rb --archdir=/tmp/ruby/build/trunk --extout=.ext -- /tmp/ruby/src/trunk/spec/mspec/bin/mspec-run -B /tmp/ruby/src/trunk/spec/default.mspec --error-output stderr --debug -fy -o /tmp/rubytest.r5byhx/17-mspec-multi-16 E, [2024-05-14T22:53:55.958059 #2230357] ERROR -- : $ /tmp/ruby/build/trunk/miniruby -I/tmp/ruby/src/trunk/lib /tmp/ruby/src/trunk/tool/runruby.rb --archdir=/tmp/ruby/build/trunk --extout=.ext -- /tmp/ruby/src/trunk/spec/mspec/bin/mspec-run -B /tmp/ruby/src/trunk/spec/default.mspec --error-output stderr --debug -fy -o /tmp/rubytest.r5byhx/18-mspec-multi-17 E, [2024-05-14T22:53:55.960919 #2230357] ERROR -- : $ /tmp/ruby/build/trunk/miniruby -I/tmp/ruby/src/trunk/lib /tmp/ruby/src/trunk/tool/runruby.rb --archdir=/tmp/ruby/build/trunk --extout=.ext -- /tmp/ruby/src/trunk/spec/mspec/bin/mspec-run -B /tmp/ruby/src/trunk/spec/default.mspec --error-output stderr --debug -fy -o /tmp/rubytest.r5byhx/19-mspec-multi-18 E, [2024-05-14T22:53:55.961246 #2230357] ERROR -- : $ /tmp/ruby/build/trunk/miniruby -I/tmp/ruby/src/trunk/lib /tmp/ruby/src/trunk/tool/runruby.rb --archdir=/tmp/ruby/build/trunk --extout=.ext -- /tmp/ruby/src/trunk/spec/mspec/bin/mspec-run -B /tmp/ruby/src/trunk/spec/default.mspec --error-output stderr --debug -fy -o /tmp/rubytest.r5byhx/20-mspec-multi-19 I, [2024-05-14T22:53:56.121163 #2230357] INFO -- : ruby 3.4.0dev (2024-05-14T21:44:34Z master e3e1e53098) [x86_64-linux] I, [2024-05-14T22:53:56.727133 #2230357] INFO -- : 0 ......................................................................... I, [2024-05-14T22:53:57.109496 #2230357] INFO -- : 73 ......................................................................... I, [2024-05-14T22:53:57.282532 #2230357] INFO -- : 146 ......................................................................... I, [2024-05-14T22:53:57.319203 #2230357] INFO -- : 219 ......................................................................... I, [2024-05-14T22:53:57.372820 #2230357] INFO -- : 292 ......................................................................... I, [2024-05-14T22:53:57.430726 #2230357] INFO -- : 365 ......................................................................... I, [2024-05-14T22:53:57.446202 #2230357] INFO -- : 438 ......................................................................... I, [2024-05-14T22:53:57.466419 #2230357] INFO -- : 511 ......................................................................... I, [2024-05-14T22:53:57.484256 #2230357] INFO -- : 584 ......................................................................... I, [2024-05-14T22:53:57.542703 #2230357] INFO -- : 657 ......................................................................... I, [2024-05-14T22:53:57.567717 #2230357] INFO -- : 730 ......................................................................... I, [2024-05-14T22:53:57.590403 #2230357] INFO -- : 803 ......................................................................... I, [2024-05-14T22:53:57.621304 #2230357] INFO -- : 876 ......................................................................... I, [2024-05-14T22:53:57.674420 #2230357] INFO -- : 949 ......................................................................... I, [2024-05-14T22:53:57.760293 #2230357] INFO -- : 1022 ......................................................................... I, [2024-05-14T22:53:57.944184 #2230357] INFO -- : 1095 ......................................................................... I, [2024-05-14T22:53:58.029511 #2230357] INFO -- : 1168 ......................................................................... I, [2024-05-14T22:53:58.089838 #2230357] INFO -- : 1241 ......................................................................... I, [2024-05-14T22:53:58.135707 #2230357] INFO -- : 1314 ......................................................................... I, [2024-05-14T22:53:58.154928 #2230357] INFO -- : 1387 ......................................................................... I, [2024-05-14T22:53:58.254973 #2230357] INFO -- : 1460 ......................................................................... I, [2024-05-14T22:53:58.760098 #2230357] INFO -- : 1533 ......................................................................... I, [2024-05-14T22:53:58.811863 #2230357] INFO -- : 1606 ......................................................................... I, [2024-05-14T22:53:58.909451 #2230357] INFO -- : 1679 ......................................................................... I, [2024-05-14T22:53:59.029870 #2230357] INFO -- : 1752 ......................................................................... I, [2024-05-14T22:53:59.115038 #2230357] INFO -- : 1825 ......................................................................... I, [2024-05-14T22:53:59.199817 #2230357] INFO -- : 1898 ......................................................................... I, [2024-05-14T22:53:59.284440 #2230357] INFO -- : 1971 ......................................................................... I, [2024-05-14T22:53:59.356030 #2230357] INFO -- : 2044 ......................................................................... I, [2024-05-14T22:53:59.409605 #2230357] INFO -- : 2117 ......................................................................... I, [2024-05-14T22:53:59.428680 #2230357] INFO -- : 2190 ......................................................................... I, [2024-05-14T22:53:59.450162 #2230357] INFO -- : 2263 ......................................................................... I, [2024-05-14T22:53:59.465322 #2230357] INFO -- : 2336 ......................................................................... I, [2024-05-14T22:53:59.502337 #2230357] INFO -- : 2409 ......................................................................... I, [2024-05-14T22:53:59.607668 #2230357] INFO -- : 2482 ......................................................................... I, [2024-05-14T22:53:59.630126 #2230357] INFO -- : 2555 ......................................................................... I, [2024-05-14T22:53:59.747897 #2230357] INFO -- : 2628 ......................................................................... I, [2024-05-14T22:53:59.855634 #2230357] INFO -- : 2701 ......................................................................... I, [2024-05-14T22:53:59.887570 #2230357] INFO -- : 2774 ......................................................................... I, [2024-05-14T22:53:59.946210 #2230357] INFO -- : 2847 ......................................................................... I, [2024-05-14T22:53:59.978945 #2230357] INFO -- : 2920 ......................................................................... I, [2024-05-14T22:54:00.003806 #2230357] INFO -- : 2993 ......................................................................... I, [2024-05-14T22:54:00.023009 #2230357] INFO -- : 3066 ......................................................................... I, [2024-05-14T22:54:00.036353 #2230357] INFO -- : 3139 ......................................................................... I, [2024-05-14T22:54:00.044342 #2230357] INFO -- : 3212 ......................................................................... I, [2024-05-14T22:54:00.069878 #2230357] INFO -- : 3285 ......................................................................... I, [2024-05-14T22:54:04.062817 #2230357] INFO -- : 3358 ........................................................................ I, [2024-05-14T22:54:04.062914 #2230357] INFO -- : I, [2024-05-14T22:54:04.062933 #2230357] INFO -- : Finished in 8.106244 seconds I, [2024-05-14T22:54:04.062948 #2230357] INFO -- : I, [2024-05-14T22:54:04.062962 #2230357] INFO -- : 3429 files, 32611 examples, 202038 expectations, 0 failures, 0 errors, 0 tagged I, [2024-05-14T22:54:04.066305 #2230357] INFO -- : $$$[end] "make yes-test-rubyspec MSPECOPT='--error-output stderr --debug -j' TESTS='-j20'" exit with 0.