# Logfile created on 2024-05-14 10:14:10 +0000 by logger.rb/v1.4.3 I, [2024-05-14T10:14:10.380069 #39176] INFO -- : #, @formatter=nil, @logdev=#, @binmode=false, @mon_data=#, @mon_data_owner_object_id=860>>> I, [2024-05-14T10:14:10.380190 #39176] INFO -- : $$$[beg] make update-unicode -j20 I, [2024-05-14T10:14:10.439368 #39176] INFO -- : Downloading Unicode emoji 15.0 files... I, [2024-05-14T10:14:10.439460 #39176] INFO -- : Downloading Unicode emoji 15.0 files... I, [2024-05-14T10:14:10.439757 #39176] INFO -- : Downloading Unicode emoji 15.0 files... I, [2024-05-14T10:14:10.481105 #39176] INFO -- : made symlink emoji/15.0/emoji-sequences.txt to /tmp/ruby/src/trunk/.downloaded-cache/emoji/15.0/emoji-sequences.txt E, [2024-05-14T10:14:10.929443 #39176] ERROR -- : /tmp/ruby/src/trunk/tool/downloader.rb:302:in `rescue in download': failed to download emoji/15.0/emoji-test.txt (RuntimeError) E, [2024-05-14T10:14:10.929558 #39176] ERROR -- : OpenURI::HTTPError: 403 Forbidden: https://www.unicode.org/Public/emoji/15.0/emoji-test.txt E, [2024-05-14T10:14:10.929577 #39176] ERROR -- : from /tmp/ruby/src/trunk/tool/downloader.rb:201:in `download' E, [2024-05-14T10:14:10.929590 #39176] ERROR -- : from /tmp/ruby/src/trunk/tool/downloader.rb:136:in `download' E, [2024-05-14T10:14:10.929602 #39176] ERROR -- : from /tmp/ruby/src/trunk/tool/downloader.rb:482:in `block in
' E, [2024-05-14T10:14:10.929614 #39176] ERROR -- : from /tmp/ruby/src/trunk/tool/downloader.rb:465:in `each' E, [2024-05-14T10:14:10.929631 #39176] ERROR -- : from /tmp/ruby/src/trunk/tool/downloader.rb:465:in `
' E, [2024-05-14T10:14:10.929642 #39176] ERROR -- : /usr/lib/ruby/3.0.0/open-uri.rb:364:in `open_http': 403 Forbidden (OpenURI::HTTPError) E, [2024-05-14T10:14:10.929653 #39176] ERROR -- : from /usr/lib/ruby/3.0.0/open-uri.rb:741:in `buffer_open' E, [2024-05-14T10:14:10.929666 #39176] ERROR -- : from /usr/lib/ruby/3.0.0/open-uri.rb:212:in `block in open_loop' E, [2024-05-14T10:14:10.929677 #39176] ERROR -- : from /usr/lib/ruby/3.0.0/open-uri.rb:210:in `catch' E, [2024-05-14T10:14:10.929688 #39176] ERROR -- : from /usr/lib/ruby/3.0.0/open-uri.rb:210:in `open_loop' E, [2024-05-14T10:14:10.929699 #39176] ERROR -- : from /usr/lib/ruby/3.0.0/open-uri.rb:151:in `open_uri' E, [2024-05-14T10:14:10.929709 #39176] ERROR -- : from /usr/lib/ruby/3.0.0/open-uri.rb:721:in `open' E, [2024-05-14T10:14:10.929719 #39176] ERROR -- : from /usr/lib/ruby/3.0.0/open-uri.rb:729:in `read' E, [2024-05-14T10:14:10.929730 #39176] ERROR -- : from /tmp/ruby/src/trunk/tool/downloader.rb:247:in `block in download' E, [2024-05-14T10:14:10.929740 #39176] ERROR -- : from /tmp/ruby/src/trunk/tool/downloader.rb:378:in `with_retry' E, [2024-05-14T10:14:10.929752 #39176] ERROR -- : from /tmp/ruby/src/trunk/tool/downloader.rb:246:in `download' E, [2024-05-14T10:14:10.929781 #39176] ERROR -- : from /tmp/ruby/src/trunk/tool/downloader.rb:136:in `download' E, [2024-05-14T10:14:10.929793 #39176] ERROR -- : from /tmp/ruby/src/trunk/tool/downloader.rb:482:in `block in
' E, [2024-05-14T10:14:10.929804 #39176] ERROR -- : from /tmp/ruby/src/trunk/tool/downloader.rb:465:in `each' E, [2024-05-14T10:14:10.929815 #39176] ERROR -- : from /tmp/ruby/src/trunk/tool/downloader.rb:465:in `
' E, [2024-05-14T10:14:10.933736 #39176] ERROR -- : make: *** [uncommon.mk:1765: /tmp/ruby/src/trunk/enc/unicode/data/emoji/15.0/emoji-sequences.txt] Error 1 E, [2024-05-14T10:14:10.933791 #39176] ERROR -- : make: *** Deleting file '/tmp/ruby/src/trunk/enc/unicode/data/emoji/15.0/emoji-sequences.txt' E, [2024-05-14T10:14:10.933810 #39176] ERROR -- : make: *** Waiting for unfinished jobs.... E, [2024-05-14T10:14:11.358669 #39176] ERROR -- : /tmp/ruby/src/trunk/tool/downloader.rb:302:in `rescue in download': failed to download emoji/15.0/emoji-sequences.txt (RuntimeError) E, [2024-05-14T10:14:11.358824 #39176] ERROR -- : EOFError: end of file reached: https://www.unicode.org/Public/emoji/15.0/emoji-sequences.txt E, [2024-05-14T10:14:11.358850 #39176] ERROR -- : from /tmp/ruby/src/trunk/tool/downloader.rb:201:in `download' E, [2024-05-14T10:14:11.358866 #39176] ERROR -- : from /tmp/ruby/src/trunk/tool/downloader.rb:136:in `download' E, [2024-05-14T10:14:11.358882 #39176] ERROR -- : from /tmp/ruby/src/trunk/tool/downloader.rb:482:in `block in
' E, [2024-05-14T10:14:11.358897 #39176] ERROR -- : from /tmp/ruby/src/trunk/tool/downloader.rb:465:in `each' E, [2024-05-14T10:14:11.358912 #39176] ERROR -- : from /tmp/ruby/src/trunk/tool/downloader.rb:465:in `
' E, [2024-05-14T10:14:11.358927 #39176] ERROR -- : /usr/lib/ruby/3.0.0/net/protocol.rb:227:in `rbuf_fill': end of file reached (EOFError) E, [2024-05-14T10:14:11.358948 #39176] ERROR -- : from /usr/lib/ruby/3.0.0/net/protocol.rb:193:in `readuntil' E, [2024-05-14T10:14:11.358964 #39176] ERROR -- : from /usr/lib/ruby/3.0.0/net/protocol.rb:203:in `readline' E, [2024-05-14T10:14:11.358978 #39176] ERROR -- : from /usr/lib/ruby/3.0.0/net/http/response.rb:42:in `read_status_line' E, [2024-05-14T10:14:11.358993 #39176] ERROR -- : from /usr/lib/ruby/3.0.0/net/http/response.rb:31:in `read_new' E, [2024-05-14T10:14:11.359016 #39176] ERROR -- : from /usr/lib/ruby/3.0.0/net/http.rb:1557:in `block in transport_request' E, [2024-05-14T10:14:11.359030 #39176] ERROR -- : from /usr/lib/ruby/3.0.0/net/http.rb:1548:in `catch' E, [2024-05-14T10:14:11.359043 #39176] ERROR -- : from /usr/lib/ruby/3.0.0/net/http.rb:1548:in `transport_request' E, [2024-05-14T10:14:11.359062 #39176] ERROR -- : from /usr/lib/ruby/3.0.0/net/http.rb:1521:in `request' E, [2024-05-14T10:14:11.359076 #39176] ERROR -- : from /usr/lib/ruby/3.0.0/open-uri.rb:329:in `block in open_http' E, [2024-05-14T10:14:11.359090 #39176] ERROR -- : from /usr/lib/ruby/3.0.0/net/http.rb:960:in `start' E, [2024-05-14T10:14:11.359104 #39176] ERROR -- : from /usr/lib/ruby/3.0.0/open-uri.rb:323:in `open_http' E, [2024-05-14T10:14:11.359118 #39176] ERROR -- : from /usr/lib/ruby/3.0.0/open-uri.rb:741:in `buffer_open' E, [2024-05-14T10:14:11.359132 #39176] ERROR -- : from /usr/lib/ruby/3.0.0/open-uri.rb:212:in `block in open_loop' E, [2024-05-14T10:14:11.359146 #39176] ERROR -- : from /usr/lib/ruby/3.0.0/open-uri.rb:210:in `catch' E, [2024-05-14T10:14:11.359163 #39176] ERROR -- : from /usr/lib/ruby/3.0.0/open-uri.rb:210:in `open_loop' E, [2024-05-14T10:14:11.359177 #39176] ERROR -- : from /usr/lib/ruby/3.0.0/open-uri.rb:151:in `open_uri' E, [2024-05-14T10:14:11.359193 #39176] ERROR -- : from /usr/lib/ruby/3.0.0/open-uri.rb:721:in `open' E, [2024-05-14T10:14:11.359205 #39176] ERROR -- : from /usr/lib/ruby/3.0.0/open-uri.rb:729:in `read' E, [2024-05-14T10:14:11.359218 #39176] ERROR -- : from /tmp/ruby/src/trunk/tool/downloader.rb:247:in `block in download' E, [2024-05-14T10:14:11.359231 #39176] ERROR -- : from /tmp/ruby/src/trunk/tool/downloader.rb:378:in `with_retry' E, [2024-05-14T10:14:11.359263 #39176] ERROR -- : from /tmp/ruby/src/trunk/tool/downloader.rb:246:in `download' E, [2024-05-14T10:14:11.359277 #39176] ERROR -- : from /tmp/ruby/src/trunk/tool/downloader.rb:136:in `download' E, [2024-05-14T10:14:11.359290 #39176] ERROR -- : from /tmp/ruby/src/trunk/tool/downloader.rb:482:in `block in
' E, [2024-05-14T10:14:11.359302 #39176] ERROR -- : from /tmp/ruby/src/trunk/tool/downloader.rb:465:in `each' E, [2024-05-14T10:14:11.359319 #39176] ERROR -- : from /tmp/ruby/src/trunk/tool/downloader.rb:465:in `
' E, [2024-05-14T10:14:11.364120 #39176] ERROR -- : make: *** [uncommon.mk:1765: /tmp/ruby/src/trunk/enc/unicode/data/emoji/15.0/emoji-zwj-sequences.txt] Error 1 E, [2024-05-14T10:14:11.429665 #39176] ERROR -- : /tmp/ruby/src/trunk/tool/downloader.rb:302:in `rescue in download': failed to download emoji/15.0/emoji-sequences.txt (RuntimeError) E, [2024-05-14T10:14:11.429832 #39176] ERROR -- : EOFError: end of file reached: https://www.unicode.org/Public/emoji/15.0/emoji-sequences.txt E, [2024-05-14T10:14:11.429864 #39176] ERROR -- : from /tmp/ruby/src/trunk/tool/downloader.rb:201:in `download' E, [2024-05-14T10:14:11.430235 #39176] ERROR -- : from /tmp/ruby/src/trunk/tool/downloader.rb:136:in `download' E, [2024-05-14T10:14:11.430280 #39176] ERROR -- : from /tmp/ruby/src/trunk/tool/downloader.rb:482:in `block in
' E, [2024-05-14T10:14:11.430304 #39176] ERROR -- : from /tmp/ruby/src/trunk/tool/downloader.rb:465:in `each' E, [2024-05-14T10:14:11.430323 #39176] ERROR -- : from /tmp/ruby/src/trunk/tool/downloader.rb:465:in `
' E, [2024-05-14T10:14:11.430341 #39176] ERROR -- : /usr/lib/ruby/3.0.0/net/protocol.rb:227:in `rbuf_fill': end of file reached (EOFError) E, [2024-05-14T10:14:11.430360 #39176] ERROR -- : from /usr/lib/ruby/3.0.0/net/protocol.rb:193:in `readuntil' E, [2024-05-14T10:14:11.430378 #39176] ERROR -- : from /usr/lib/ruby/3.0.0/net/protocol.rb:203:in `readline' E, [2024-05-14T10:14:11.430397 #39176] ERROR -- : from /usr/lib/ruby/3.0.0/net/http/response.rb:42:in `read_status_line' E, [2024-05-14T10:14:11.430451 #39176] ERROR -- : from /usr/lib/ruby/3.0.0/net/http/response.rb:31:in `read_new' E, [2024-05-14T10:14:11.430471 #39176] ERROR -- : from /usr/lib/ruby/3.0.0/net/http.rb:1557:in `block in transport_request' E, [2024-05-14T10:14:11.430490 #39176] ERROR -- : from /usr/lib/ruby/3.0.0/net/http.rb:1548:in `catch' E, [2024-05-14T10:14:11.430512 #39176] ERROR -- : from /usr/lib/ruby/3.0.0/net/http.rb:1548:in `transport_request' E, [2024-05-14T10:14:11.430531 #39176] ERROR -- : from /usr/lib/ruby/3.0.0/net/http.rb:1521:in `request' E, [2024-05-14T10:14:11.430549 #39176] ERROR -- : from /usr/lib/ruby/3.0.0/open-uri.rb:329:in `block in open_http' E, [2024-05-14T10:14:11.430568 #39176] ERROR -- : from /usr/lib/ruby/3.0.0/net/http.rb:960:in `start' E, [2024-05-14T10:14:11.430586 #39176] ERROR -- : from /usr/lib/ruby/3.0.0/open-uri.rb:323:in `open_http' E, [2024-05-14T10:14:11.430609 #39176] ERROR -- : from /usr/lib/ruby/3.0.0/open-uri.rb:741:in `buffer_open' E, [2024-05-14T10:14:11.430628 #39176] ERROR -- : from /usr/lib/ruby/3.0.0/open-uri.rb:212:in `block in open_loop' E, [2024-05-14T10:14:11.430646 #39176] ERROR -- : from /usr/lib/ruby/3.0.0/open-uri.rb:210:in `catch' E, [2024-05-14T10:14:11.430664 #39176] ERROR -- : from /usr/lib/ruby/3.0.0/open-uri.rb:210:in `open_loop' E, [2024-05-14T10:14:11.430682 #39176] ERROR -- : from /usr/lib/ruby/3.0.0/open-uri.rb:151:in `open_uri' E, [2024-05-14T10:14:11.430700 #39176] ERROR -- : from /usr/lib/ruby/3.0.0/open-uri.rb:721:in `open' E, [2024-05-14T10:14:11.430718 #39176] ERROR -- : from /usr/lib/ruby/3.0.0/open-uri.rb:729:in `read' E, [2024-05-14T10:14:11.430736 #39176] ERROR -- : from /tmp/ruby/src/trunk/tool/downloader.rb:247:in `block in download' E, [2024-05-14T10:14:11.430755 #39176] ERROR -- : from /tmp/ruby/src/trunk/tool/downloader.rb:378:in `with_retry' E, [2024-05-14T10:14:11.430777 #39176] ERROR -- : from /tmp/ruby/src/trunk/tool/downloader.rb:246:in `download' E, [2024-05-14T10:14:11.430795 #39176] ERROR -- : from /tmp/ruby/src/trunk/tool/downloader.rb:136:in `download' E, [2024-05-14T10:14:11.430837 #39176] ERROR -- : from /tmp/ruby/src/trunk/tool/downloader.rb:482:in `block in
' E, [2024-05-14T10:14:11.430856 #39176] ERROR -- : from /tmp/ruby/src/trunk/tool/downloader.rb:465:in `each' E, [2024-05-14T10:14:11.430875 #39176] ERROR -- : from /tmp/ruby/src/trunk/tool/downloader.rb:465:in `
' E, [2024-05-14T10:14:11.436362 #39176] ERROR -- : make: *** [uncommon.mk:1765: /tmp/ruby/src/trunk/enc/unicode/data/emoji/15.0/emoji-test.txt] Error 1 I, [2024-05-14T10:14:11.436557 #39176] INFO -- : downloading emoji/15.0/emoji-sequences.txt ... downloading emoji/15.0/emoji-sequences.txt ... downloading emoji/15.0/emoji-test.txt ... I, [2024-05-14T10:14:11.437238 #39176] INFO -- : $$$[end] "make update-unicode -j20" exit with 512. I, [2024-05-14T10:14:11.437321 #39176] INFO -- : $$$[beg] make update-download -j20 I, [2024-05-14T10:14:11.541844 #39176] INFO -- : tool/config.guess already exists I, [2024-05-14T10:14:11.541889 #39176] INFO -- : tool/config.sub already exists I, [2024-05-14T10:14:11.543899 #39176] INFO -- : Update minitest to ea9caafc0754b1d6236a490d59e624b53209734a I, [2024-05-14T10:14:11.544081 #39176] INFO -- : Update power_assert to 84e85124c5014a139af39161d484156cfe87a9ed I, [2024-05-14T10:14:11.544697 #39176] INFO -- : Update rbs to ba7872795d5de04adb8ff500c0e6afdc81a041dd I, [2024-05-14T10:14:11.545007 #39176] INFO -- : Update typeprof to b19a6416da3a05d57fadd6ffdadb382b6d236ca5 I, [2024-05-14T10:14:11.545345 #39176] INFO -- : echo ea9caafc0754b1d6236a490d59e624b53209734a | /bin/sh /tmp/ruby/src/trunk/tool/ifchange /tmp/ruby/src/trunk/.bundle/.timestamp/minitest.revision - I, [2024-05-14T10:14:11.545663 #39176] INFO -- : echo 84e85124c5014a139af39161d484156cfe87a9ed | /bin/sh /tmp/ruby/src/trunk/tool/ifchange /tmp/ruby/src/trunk/.bundle/.timestamp/power_assert.revision - I, [2024-05-14T10:14:11.545823 #39176] INFO -- : echo ba7872795d5de04adb8ff500c0e6afdc81a041dd | /bin/sh /tmp/ruby/src/trunk/tool/ifchange /tmp/ruby/src/trunk/.bundle/.timestamp/rbs.revision - I, [2024-05-14T10:14:11.546214 #39176] INFO -- : echo b19a6416da3a05d57fadd6ffdadb382b6d236ca5 | /bin/sh /tmp/ruby/src/trunk/tool/ifchange /tmp/ruby/src/trunk/.bundle/.timestamp/typeprof.revision - I, [2024-05-14T10:14:11.547087 #39176] INFO -- : /tmp/ruby/src/trunk/.bundle/.timestamp/minitest.revision unchanged I, [2024-05-14T10:14:11.547464 #39176] INFO -- : /tmp/ruby/src/trunk/.bundle/.timestamp/power_assert.revision unchanged I, [2024-05-14T10:14:11.547484 #39176] INFO -- : /tmp/ruby/src/trunk/.bundle/.timestamp/rbs.revision unchanged I, [2024-05-14T10:14:11.548044 #39176] INFO -- : /tmp/ruby/src/trunk/.bundle/.timestamp/typeprof.revision unchanged I, [2024-05-14T10:14:11.548939 #39176] INFO -- : Building power_assert@84e85124c5014a139af39161d484156cfe87a9ed to /tmp/ruby/src/trunk/gems/power_assert-2.0.3.gem I, [2024-05-14T10:14:11.617380 #39176] INFO -- : Successfully built RubyGem I, [2024-05-14T10:14:11.617425 #39176] INFO -- : Name: power_assert I, [2024-05-14T10:14:11.617436 #39176] INFO -- : Version: 2.0.4dev I, [2024-05-14T10:14:11.617441 #39176] INFO -- : File: power_assert-2.0.4dev.gem I, [2024-05-14T10:14:11.662088 #39176] INFO -- : $$$[end] "make update-download -j20" exit with 0. I, [2024-05-14T10:14:11.662126 #39176] INFO -- : $$$[beg] make update-rubyspec -j20 I, [2024-05-14T10:14:11.719660 #39176] INFO -- : make: Nothing to be done for 'update-rubyspec'. I, [2024-05-14T10:14:11.719937 #39176] INFO -- : $$$[end] "make update-rubyspec -j20" exit with 0. I, [2024-05-14T10:14:11.719963 #39176] INFO -- : $$$[beg] make update-src -j20 I, [2024-05-14T10:14:12.373284 #39176] INFO -- : Already up to date. I, [2024-05-14T10:14:12.391339 #39176] INFO -- : Latest commit hash = 41e6fd066e I, [2024-05-14T10:14:12.392584 #39176] INFO -- : $$$[end] "make update-src -j20" exit with 0. I, [2024-05-14T10:14:12.392620 #39176] INFO -- : $$$[beg] make after-update -j20 I, [2024-05-14T10:14:12.468752 #39176] INFO -- : generating /tmp/ruby/src/trunk/ext/ripper/eventids2table.c I, [2024-05-14T10:14:12.473053 #39176] INFO -- : make[1]: Entering directory '/tmp/ruby/src/trunk/ext/ripper' I, [2024-05-14T10:14:12.473076 #39176] INFO -- : make[1]: Nothing to be done for 'src'. I, [2024-05-14T10:14:12.473081 #39176] INFO -- : make[1]: Leaving directory '/tmp/ruby/src/trunk/ext/ripper' I, [2024-05-14T10:14:12.489734 #39176] INFO -- : /tmp/ruby/src/trunk/revision.h updated I, [2024-05-14T10:14:12.491056 #39176] INFO -- : generating x86_64-linux-fake.rb I, [2024-05-14T10:14:12.542084 #39176] INFO -- : x86_64-linux-fake.rb updated I, [2024-05-14T10:14:12.543560 #39176] INFO -- : generating enc.mk I, [2024-05-14T10:14:12.663028 #39176] INFO -- : making srcs under enc I, [2024-05-14T10:14:12.693321 #39176] INFO -- : make[1]: Entering directory '/tmp/ruby/build/trunk' I, [2024-05-14T10:14:12.693349 #39176] INFO -- : make[1]: Nothing to be done for 'srcs'. I, [2024-05-14T10:14:12.693359 #39176] INFO -- : make[1]: Leaving directory '/tmp/ruby/build/trunk' I, [2024-05-14T10:14:12.738265 #39176] INFO -- : Update minitest to ea9caafc0754b1d6236a490d59e624b53209734a I, [2024-05-14T10:14:12.738479 #39176] INFO -- : Update power_assert to 84e85124c5014a139af39161d484156cfe87a9ed I, [2024-05-14T10:14:12.739132 #39176] INFO -- : Update rbs to ba7872795d5de04adb8ff500c0e6afdc81a041dd I, [2024-05-14T10:14:12.739413 #39176] INFO -- : Update typeprof to b19a6416da3a05d57fadd6ffdadb382b6d236ca5 I, [2024-05-14T10:14:12.739805 #39176] INFO -- : echo ea9caafc0754b1d6236a490d59e624b53209734a | /bin/sh /tmp/ruby/src/trunk/tool/ifchange /tmp/ruby/src/trunk/.bundle/.timestamp/minitest.revision - I, [2024-05-14T10:14:12.739970 #39176] INFO -- : echo 84e85124c5014a139af39161d484156cfe87a9ed | /bin/sh /tmp/ruby/src/trunk/tool/ifchange /tmp/ruby/src/trunk/.bundle/.timestamp/power_assert.revision - I, [2024-05-14T10:14:12.741247 #39176] INFO -- : echo ba7872795d5de04adb8ff500c0e6afdc81a041dd | /bin/sh /tmp/ruby/src/trunk/tool/ifchange /tmp/ruby/src/trunk/.bundle/.timestamp/rbs.revision - I, [2024-05-14T10:14:12.741422 #39176] INFO -- : echo b19a6416da3a05d57fadd6ffdadb382b6d236ca5 | /bin/sh /tmp/ruby/src/trunk/tool/ifchange /tmp/ruby/src/trunk/.bundle/.timestamp/typeprof.revision - I, [2024-05-14T10:14:12.741704 #39176] INFO -- : /tmp/ruby/src/trunk/.bundle/.timestamp/minitest.revision unchanged I, [2024-05-14T10:14:12.742037 #39176] INFO -- : /tmp/ruby/src/trunk/.bundle/.timestamp/power_assert.revision unchanged I, [2024-05-14T10:14:12.743049 #39176] INFO -- : Building power_assert@84e85124c5014a139af39161d484156cfe87a9ed to /tmp/ruby/src/trunk/gems/power_assert-2.0.3.gem I, [2024-05-14T10:14:12.743092 #39176] INFO -- : /tmp/ruby/src/trunk/.bundle/.timestamp/rbs.revision unchanged I, [2024-05-14T10:14:12.743283 #39176] INFO -- : /tmp/ruby/src/trunk/.bundle/.timestamp/typeprof.revision unchanged I, [2024-05-14T10:14:12.812444 #39176] INFO -- : Successfully built RubyGem I, [2024-05-14T10:14:12.812509 #39176] INFO -- : Name: power_assert I, [2024-05-14T10:14:12.812528 #39176] INFO -- : Version: 2.0.4dev I, [2024-05-14T10:14:12.812543 #39176] INFO -- : File: power_assert-2.0.4dev.gem I, [2024-05-14T10:14:12.814769 #39176] INFO -- : Extracting bundle gem power_assert-2.0.3... I, [2024-05-14T10:14:12.875475 #39176] INFO -- : Try with hash version of bundled gems instead of gems/power_assert-2.0.3.gem. We don't use this gem with release version of Ruby. I, [2024-05-14T10:14:12.880423 #39176] INFO -- : Unpacked gems/power_assert-2.0.4dev.gem I, [2024-05-14T10:14:12.882483 #39176] INFO -- : $$$[end] "make after-update -j20" exit with 0. I, [2024-05-14T10:14:12.882635 #39176] INFO -- : $$$[beg] make miniruby -j20 I, [2024-05-14T10:14:12.939675 #39176] INFO -- : BASERUBY = /usr/bin/ruby --disable=gems I, [2024-05-14T10:14:12.939710 #39176] INFO -- : CC = gcc I, [2024-05-14T10:14:12.939716 #39176] INFO -- : LD = ld I, [2024-05-14T10:14:12.939720 #39176] INFO -- : LDSHARED = gcc -shared I, [2024-05-14T10:14:12.939730 #39176] INFO -- : CFLAGS = -O3 -fno-fast-math -ggdb3 -Wall -Wextra -Wdeprecated-declarations -Wdiv-by-zero -Wduplicated-cond -Wimplicit-function-declaration -Wimplicit-int -Wpointer-arith -Wwrite-strings -Wold-style-definition -Wimplicit-fallthrough=0 -Wmissing-noreturn -Wno-cast-function-type -Wno-constant-logical-operand -Wno-long-long -Wno-missing-field-initializers -Wno-overlength-strings -Wno-packed-bitfield-compat -Wno-parentheses-equality -Wno-self-assign -Wno-tautological-compare -Wno-unused-parameter -Wno-unused-value -Wsuggest-attribute=format -Wsuggest-attribute=noreturn -Wunused-variable -Wmisleading-indentation -Wundef -fPIC I, [2024-05-14T10:14:12.939734 #39176] INFO -- : XCFLAGS = -U_FORTIFY_SOURCE -D_FORTIFY_SOURCE=2 -fstack-protector-strong -fno-strict-overflow -fvisibility=hidden -fexcess-precision=standard -DRUBY_EXPORT -I. -I.ext/include/x86_64-linux -I/tmp/ruby/src/trunk/include -I/tmp/ruby/src/trunk -I/tmp/ruby/src/trunk/prism -I/tmp/ruby/src/trunk/enc/unicode/15.0.0 I, [2024-05-14T10:14:12.939738 #39176] INFO -- : CPPFLAGS = I, [2024-05-14T10:14:12.939742 #39176] INFO -- : DLDFLAGS = -Wl,--compress-debug-sections=zlib -Wl,-soname,libruby.so.3.4 -fstack-protector-strong I, [2024-05-14T10:14:12.939746 #39176] INFO -- : SOLIBS = -lz -lrt -lrt -lgmp -ldl -lcrypt -lm -lpthread I, [2024-05-14T10:14:12.939749 #39176] INFO -- : LANG = en_US.UTF-8 I, [2024-05-14T10:14:12.939752 #39176] INFO -- : LC_ALL = I, [2024-05-14T10:14:12.939756 #39176] INFO -- : LC_CTYPE = I, [2024-05-14T10:14:12.939759 #39176] INFO -- : MFLAGS = -j20 --jobserver-auth=4,5 I, [2024-05-14T10:14:12.939763 #39176] INFO -- : RUSTC = no I, [2024-05-14T10:14:12.939766 #39176] INFO -- : YJIT_RUSTC_ARGS = --crate-name=yjit --crate-type=staticlib --edition=2021 -g -C lto=thin -C opt-level=3 -C overflow-checks=on '--out-dir=/tmp/ruby/build/trunk/yjit/target/release/' /tmp/ruby/src/trunk/yjit/src/lib.rs I, [2024-05-14T10:14:12.941043 #39176] INFO -- : gcc (Ubuntu 11.4.0-1ubuntu1~22.04) 11.4.0 I, [2024-05-14T10:14:12.941063 #39176] INFO -- : Copyright (C) 2021 Free Software Foundation, Inc. I, [2024-05-14T10:14:12.941069 #39176] INFO -- : This is free software; see the source for copying conditions. There is NO I, [2024-05-14T10:14:12.941073 #39176] INFO -- : warranty; not even for MERCHANTABILITY or FITNESS FOR A PARTICULAR PURPOSE. I, [2024-05-14T10:14:12.941077 #39176] INFO -- : I, [2024-05-14T10:14:12.961958 #39176] INFO -- : compiling /tmp/ruby/src/trunk/version.c I, [2024-05-14T10:14:13.063839 #39176] INFO -- : linking miniruby I, [2024-05-14T10:14:13.617633 #39176] INFO -- : $$$[end] "make miniruby -j20" exit with 0. I, [2024-05-14T10:14:13.617747 #39176] INFO -- : $$$[beg] make ruby -j20 I, [2024-05-14T10:14:13.675470 #39176] INFO -- : BASERUBY = /usr/bin/ruby --disable=gems I, [2024-05-14T10:14:13.675511 #39176] INFO -- : CC = gcc I, [2024-05-14T10:14:13.675524 #39176] INFO -- : LD = ld I, [2024-05-14T10:14:13.675535 #39176] INFO -- : LDSHARED = gcc -shared I, [2024-05-14T10:14:13.675552 #39176] INFO -- : CFLAGS = -O3 -fno-fast-math -ggdb3 -Wall -Wextra -Wdeprecated-declarations -Wdiv-by-zero -Wduplicated-cond -Wimplicit-function-declaration -Wimplicit-int -Wpointer-arith -Wwrite-strings -Wold-style-definition -Wimplicit-fallthrough=0 -Wmissing-noreturn -Wno-cast-function-type -Wno-constant-logical-operand -Wno-long-long -Wno-missing-field-initializers -Wno-overlength-strings -Wno-packed-bitfield-compat -Wno-parentheses-equality -Wno-self-assign -Wno-tautological-compare -Wno-unused-parameter -Wno-unused-value -Wsuggest-attribute=format -Wsuggest-attribute=noreturn -Wunused-variable -Wmisleading-indentation -Wundef -fPIC I, [2024-05-14T10:14:13.675564 #39176] INFO -- : XCFLAGS = -U_FORTIFY_SOURCE -D_FORTIFY_SOURCE=2 -fstack-protector-strong -fno-strict-overflow -fvisibility=hidden -fexcess-precision=standard -DRUBY_EXPORT -I. -I.ext/include/x86_64-linux -I/tmp/ruby/src/trunk/include -I/tmp/ruby/src/trunk -I/tmp/ruby/src/trunk/prism -I/tmp/ruby/src/trunk/enc/unicode/15.0.0 I, [2024-05-14T10:14:13.675582 #39176] INFO -- : CPPFLAGS = I, [2024-05-14T10:14:13.675593 #39176] INFO -- : DLDFLAGS = -Wl,--compress-debug-sections=zlib -Wl,-soname,libruby.so.3.4 -fstack-protector-strong I, [2024-05-14T10:14:13.675604 #39176] INFO -- : SOLIBS = -lz -lrt -lrt -lgmp -ldl -lcrypt -lm -lpthread I, [2024-05-14T10:14:13.675614 #39176] INFO -- : LANG = en_US.UTF-8 I, [2024-05-14T10:14:13.675624 #39176] INFO -- : LC_ALL = I, [2024-05-14T10:14:13.675634 #39176] INFO -- : LC_CTYPE = I, [2024-05-14T10:14:13.675645 #39176] INFO -- : MFLAGS = -j20 --jobserver-auth=4,5 I, [2024-05-14T10:14:13.675655 #39176] INFO -- : RUSTC = no I, [2024-05-14T10:14:13.675666 #39176] INFO -- : YJIT_RUSTC_ARGS = --crate-name=yjit --crate-type=staticlib --edition=2021 -g -C lto=thin -C opt-level=3 -C overflow-checks=on '--out-dir=/tmp/ruby/build/trunk/yjit/target/release/' /tmp/ruby/src/trunk/yjit/src/lib.rs I, [2024-05-14T10:14:13.676799 #39176] INFO -- : gcc (Ubuntu 11.4.0-1ubuntu1~22.04) 11.4.0 I, [2024-05-14T10:14:13.676840 #39176] INFO -- : Copyright (C) 2021 Free Software Foundation, Inc. I, [2024-05-14T10:14:13.676858 #39176] INFO -- : This is free software; see the source for copying conditions. There is NO I, [2024-05-14T10:14:13.676871 #39176] INFO -- : warranty; not even for MERCHANTABILITY or FITNESS FOR A PARTICULAR PURPOSE. I, [2024-05-14T10:14:13.676881 #39176] INFO -- : I, [2024-05-14T10:14:13.782316 #39176] INFO -- : builtin_binary.inc updated I, [2024-05-14T10:14:13.786713 #39176] INFO -- : c5234a9416e4f20f175185e840b25b0f08674d14078ed7083f37e655458e3ca9 builtin_binary.inc I, [2024-05-14T10:14:13.787470 #39176] INFO -- : compiling /tmp/ruby/src/trunk/builtin.c I, [2024-05-14T10:14:13.970666 #39176] INFO -- : linking static-library libruby-static.a I, [2024-05-14T10:14:14.278885 #39176] INFO -- : linking shared-library libruby.so.3.4.0 I, [2024-05-14T10:14:15.832319 #39176] INFO -- : linking ruby I, [2024-05-14T10:14:15.855608 #39176] INFO -- : $$$[end] "make ruby -j20" exit with 0. I, [2024-05-14T10:14:15.855767 #39176] INFO -- : $$$[beg] make all -j20 I, [2024-05-14T10:14:15.913007 #39176] INFO -- : BASERUBY = /usr/bin/ruby --disable=gems I, [2024-05-14T10:14:15.913039 #39176] INFO -- : CC = gcc I, [2024-05-14T10:14:15.913046 #39176] INFO -- : LD = ld I, [2024-05-14T10:14:15.913050 #39176] INFO -- : LDSHARED = gcc -shared I, [2024-05-14T10:14:15.913056 #39176] INFO -- : CFLAGS = -O3 -fno-fast-math -ggdb3 -Wall -Wextra -Wdeprecated-declarations -Wdiv-by-zero -Wduplicated-cond -Wimplicit-function-declaration -Wimplicit-int -Wpointer-arith -Wwrite-strings -Wold-style-definition -Wimplicit-fallthrough=0 -Wmissing-noreturn -Wno-cast-function-type -Wno-constant-logical-operand -Wno-long-long -Wno-missing-field-initializers -Wno-overlength-strings -Wno-packed-bitfield-compat -Wno-parentheses-equality -Wno-self-assign -Wno-tautological-compare -Wno-unused-parameter -Wno-unused-value -Wsuggest-attribute=format -Wsuggest-attribute=noreturn -Wunused-variable -Wmisleading-indentation -Wundef -fPIC I, [2024-05-14T10:14:15.913062 #39176] INFO -- : XCFLAGS = -U_FORTIFY_SOURCE -D_FORTIFY_SOURCE=2 -fstack-protector-strong -fno-strict-overflow -fvisibility=hidden -fexcess-precision=standard -DRUBY_EXPORT -I. -I.ext/include/x86_64-linux -I/tmp/ruby/src/trunk/include -I/tmp/ruby/src/trunk -I/tmp/ruby/src/trunk/prism -I/tmp/ruby/src/trunk/enc/unicode/15.0.0 I, [2024-05-14T10:14:15.913067 #39176] INFO -- : CPPFLAGS = I, [2024-05-14T10:14:15.913071 #39176] INFO -- : DLDFLAGS = -Wl,--compress-debug-sections=zlib -Wl,-soname,libruby.so.3.4 -fstack-protector-strong I, [2024-05-14T10:14:15.913076 #39176] INFO -- : SOLIBS = -lz -lrt -lrt -lgmp -ldl -lcrypt -lm -lpthread I, [2024-05-14T10:14:15.913080 #39176] INFO -- : LANG = en_US.UTF-8 I, [2024-05-14T10:14:15.913084 #39176] INFO -- : LC_ALL = I, [2024-05-14T10:14:15.913088 #39176] INFO -- : LC_CTYPE = I, [2024-05-14T10:14:15.913092 #39176] INFO -- : MFLAGS = -j20 --jobserver-auth=4,5 I, [2024-05-14T10:14:15.913104 #39176] INFO -- : RUSTC = no I, [2024-05-14T10:14:15.913110 #39176] INFO -- : YJIT_RUSTC_ARGS = --crate-name=yjit --crate-type=staticlib --edition=2021 -g -C lto=thin -C opt-level=3 -C overflow-checks=on '--out-dir=/tmp/ruby/build/trunk/yjit/target/release/' /tmp/ruby/src/trunk/yjit/src/lib.rs I, [2024-05-14T10:14:15.914772 #39176] INFO -- : gcc (Ubuntu 11.4.0-1ubuntu1~22.04) 11.4.0 I, [2024-05-14T10:14:15.914804 #39176] INFO -- : Copyright (C) 2021 Free Software Foundation, Inc. I, [2024-05-14T10:14:15.914811 #39176] INFO -- : This is free software; see the source for copying conditions. There is NO I, [2024-05-14T10:14:15.914817 #39176] INFO -- : warranty; not even for MERCHANTABILITY or FITNESS FOR A PARTICULAR PURPOSE. I, [2024-05-14T10:14:15.914822 #39176] INFO -- : I, [2024-05-14T10:14:15.948659 #39176] INFO -- : generating enc.mk I, [2024-05-14T10:14:15.950486 #39176] INFO -- : building spec/ruby/optional/capi/ext/array_spec.so I, [2024-05-14T10:14:15.950896 #39176] INFO -- : building spec/ruby/optional/capi/ext/basic_object_spec.so I, [2024-05-14T10:14:15.951564 #39176] INFO -- : building spec/ruby/optional/capi/ext/bignum_spec.so I, [2024-05-14T10:14:15.952436 #39176] INFO -- : building spec/ruby/optional/capi/ext/binding_spec.so I, [2024-05-14T10:14:15.953260 #39176] INFO -- : building spec/ruby/optional/capi/ext/boolean_spec.so I, [2024-05-14T10:14:15.954298 #39176] INFO -- : building spec/ruby/optional/capi/ext/class_id_under_autoload_spec.so I, [2024-05-14T10:14:15.955153 #39176] INFO -- : building spec/ruby/optional/capi/ext/class_spec.so I, [2024-05-14T10:14:15.955769 #39176] INFO -- : building spec/ruby/optional/capi/ext/class_under_autoload_spec.so I, [2024-05-14T10:14:15.956097 #39176] INFO -- : building spec/ruby/optional/capi/ext/complex_spec.so I, [2024-05-14T10:14:15.956997 #39176] INFO -- : building spec/ruby/optional/capi/ext/constants_spec.so I, [2024-05-14T10:14:15.957244 #39176] INFO -- : building spec/ruby/optional/capi/ext/data_spec.so I, [2024-05-14T10:14:15.958285 #39176] INFO -- : building spec/ruby/optional/capi/ext/debug_spec.so I, [2024-05-14T10:14:15.959096 #39176] INFO -- : building spec/ruby/optional/capi/ext/encoding_spec.so I, [2024-05-14T10:14:15.959370 #39176] INFO -- : building spec/ruby/optional/capi/ext/enumerator_spec.so I, [2024-05-14T10:14:15.959956 #39176] INFO -- : building spec/ruby/optional/capi/ext/exception_spec.so I, [2024-05-14T10:14:15.960247 #39176] INFO -- : building spec/ruby/optional/capi/ext/fiber_spec.so I, [2024-05-14T10:14:15.960919 #39176] INFO -- : building spec/ruby/optional/capi/ext/file_spec.so I, [2024-05-14T10:14:15.961240 #39176] INFO -- : building spec/ruby/optional/capi/ext/fixnum_spec.so I, [2024-05-14T10:14:15.962348 #39176] INFO -- : building spec/ruby/optional/capi/ext/float_spec.so I, [2024-05-14T10:14:16.087760 #39176] INFO -- : building spec/ruby/optional/capi/ext/gc_spec.so I, [2024-05-14T10:14:16.089047 #39176] INFO -- : building spec/ruby/optional/capi/ext/globals_spec.so I, [2024-05-14T10:14:16.098162 #39176] INFO -- : building spec/ruby/optional/capi/ext/hash_spec.so I, [2024-05-14T10:14:16.099754 #39176] INFO -- : building spec/ruby/optional/capi/ext/integer_spec.so I, [2024-05-14T10:14:16.100989 #39176] INFO -- : building spec/ruby/optional/capi/ext/io_spec.so I, [2024-05-14T10:14:16.112908 #39176] INFO -- : building spec/ruby/optional/capi/ext/kernel_spec.so I, [2024-05-14T10:14:16.114866 #39176] INFO -- : building spec/ruby/optional/capi/ext/language_spec.so I, [2024-05-14T10:14:16.120238 #39176] INFO -- : building spec/ruby/optional/capi/ext/marshal_spec.so I, [2024-05-14T10:14:16.131255 #39176] INFO -- : building spec/ruby/optional/capi/ext/module_spec.so I, [2024-05-14T10:14:16.131969 #39176] INFO -- : building spec/ruby/optional/capi/ext/module_under_autoload_spec.so I, [2024-05-14T10:14:16.132721 #39176] INFO -- : building spec/ruby/optional/capi/ext/mutex_spec.so I, [2024-05-14T10:14:16.146061 #39176] INFO -- : building spec/ruby/optional/capi/ext/numeric_spec.so I, [2024-05-14T10:14:16.146328 #39176] INFO -- : building spec/ruby/optional/capi/ext/object_spec.so I, [2024-05-14T10:14:16.146745 #39176] INFO -- : building spec/ruby/optional/capi/ext/proc_spec.so I, [2024-05-14T10:14:16.147441 #39176] INFO -- : building spec/ruby/optional/capi/ext/range_spec.so I, [2024-05-14T10:14:16.171756 #39176] INFO -- : building spec/ruby/optional/capi/ext/rational_spec.so I, [2024-05-14T10:14:16.178705 #39176] INFO -- : building spec/ruby/optional/capi/ext/rbasic_spec.so I, [2024-05-14T10:14:16.205576 #39176] INFO -- : building spec/ruby/optional/capi/ext/regexp_spec.so I, [2024-05-14T10:14:16.258687 #39176] INFO -- : building spec/ruby/optional/capi/ext/string_spec.so I, [2024-05-14T10:14:16.266385 #39176] INFO -- : building spec/ruby/optional/capi/ext/struct_spec.so I, [2024-05-14T10:14:16.267197 #39176] INFO -- : building spec/ruby/optional/capi/ext/st_spec.so I, [2024-05-14T10:14:16.272331 #39176] INFO -- : building spec/ruby/optional/capi/ext/symbol_spec.so I, [2024-05-14T10:14:16.289006 #39176] INFO -- : building spec/ruby/optional/capi/ext/thread_spec.so I, [2024-05-14T10:14:16.291523 #39176] INFO -- : building spec/ruby/optional/capi/ext/time_spec.so I, [2024-05-14T10:14:16.295817 #39176] INFO -- : building spec/ruby/optional/capi/ext/tracepoint_spec.so I, [2024-05-14T10:14:16.301199 #39176] INFO -- : building spec/ruby/optional/capi/ext/typed_data_spec.so I, [2024-05-14T10:14:16.301953 #39176] INFO -- : building spec/ruby/optional/capi/ext/util_spec.so I, [2024-05-14T10:14:16.308132 #39176] INFO -- : making enc I, [2024-05-14T10:14:16.309008 #39176] INFO -- : making srcs under enc I, [2024-05-14T10:14:16.334352 #39176] INFO -- : make[1]: Entering directory '/tmp/ruby/build/trunk' I, [2024-05-14T10:14:16.334412 #39176] INFO -- : make[1]: Nothing to be done for 'enc'. I, [2024-05-14T10:14:16.334423 #39176] INFO -- : make[1]: Leaving directory '/tmp/ruby/build/trunk' I, [2024-05-14T10:14:16.349271 #39176] INFO -- : make[1]: Entering directory '/tmp/ruby/build/trunk' I, [2024-05-14T10:14:16.349337 #39176] INFO -- : make[1]: Nothing to be done for 'srcs'. I, [2024-05-14T10:14:16.349348 #39176] INFO -- : make[1]: Leaving directory '/tmp/ruby/build/trunk' I, [2024-05-14T10:14:16.350010 #39176] INFO -- : generating transdb.h I, [2024-05-14T10:14:16.450411 #39176] INFO -- : transdb.h unchanged I, [2024-05-14T10:14:16.451543 #39176] INFO -- : generating makefiles ext/configure-ext.mk I, [2024-05-14T10:14:16.451840 #39176] INFO -- : making trans I, [2024-05-14T10:14:16.478405 #39176] INFO -- : ext/configure-ext.mk updated I, [2024-05-14T10:14:16.480622 #39176] INFO -- : make[1]: Entering directory '/tmp/ruby/build/trunk' I, [2024-05-14T10:14:16.486473 #39176] INFO -- : make[1]: Entering directory '/tmp/ruby/build/trunk' I, [2024-05-14T10:14:16.486565 #39176] INFO -- : make[1]: Nothing to be done for 'trans'. I, [2024-05-14T10:14:16.486574 #39176] INFO -- : make[1]: Leaving directory '/tmp/ruby/build/trunk' I, [2024-05-14T10:14:16.487489 #39176] INFO -- : making encs I, [2024-05-14T10:14:16.545597 #39176] INFO -- : make[1]: Entering directory '/tmp/ruby/build/trunk' I, [2024-05-14T10:14:16.545665 #39176] INFO -- : make[1]: Nothing to be done for 'encs'. I, [2024-05-14T10:14:16.545687 #39176] INFO -- : make[1]: Leaving directory '/tmp/ruby/build/trunk' I, [2024-05-14T10:14:16.633846 #39176] INFO -- : make[1]: Leaving directory '/tmp/ruby/build/trunk' I, [2024-05-14T10:14:16.634639 #39176] INFO -- : generating makefile exts.mk I, [2024-05-14T10:14:16.672702 #39176] INFO -- : exts.mk unchanged I, [2024-05-14T10:14:16.677125 #39176] INFO -- : make[1]: Entering directory '/tmp/ruby/build/trunk' I, [2024-05-14T10:14:16.695399 #39176] INFO -- : make[2]: Entering directory '/tmp/ruby/build/trunk/ext/digest' I, [2024-05-14T10:14:16.697191 #39176] INFO -- : make[2]: Entering directory '/tmp/ruby/build/trunk/ext/coverage' I, [2024-05-14T10:14:16.697214 #39176] INFO -- : make[2]: Entering directory '/tmp/ruby/build/trunk/ext/json' I, [2024-05-14T10:14:16.697222 #39176] INFO -- : make[2]: Entering directory '/tmp/ruby/build/trunk/ext/io/console' I, [2024-05-14T10:14:16.697880 #39176] INFO -- : make[2]: Entering directory '/tmp/ruby/build/trunk/ext/date' I, [2024-05-14T10:14:16.698199 #39176] INFO -- : make[2]: Entering directory '/tmp/ruby/build/trunk/ext/monitor' I, [2024-05-14T10:14:16.699847 #39176] INFO -- : make[2]: Leaving directory '/tmp/ruby/build/trunk/ext/io/console' I, [2024-05-14T10:14:16.699886 #39176] INFO -- : make[2]: Entering directory '/tmp/ruby/build/trunk/ext/rubyvm' I, [2024-05-14T10:14:16.700052 #39176] INFO -- : make[2]: Entering directory '/tmp/ruby/build/trunk/ext/fiddle' I, [2024-05-14T10:14:16.700087 #39176] INFO -- : make[2]: Leaving directory '/tmp/ruby/build/trunk/ext/coverage' I, [2024-05-14T10:14:16.700549 #39176] INFO -- : make[2]: Leaving directory '/tmp/ruby/build/trunk/ext/digest' I, [2024-05-14T10:14:16.701026 #39176] INFO -- : make[2]: Entering directory '/tmp/ruby/build/trunk/ext/pty' I, [2024-05-14T10:14:16.701384 #39176] INFO -- : make[2]: Leaving directory '/tmp/ruby/build/trunk/ext/monitor' I, [2024-05-14T10:14:16.701419 #39176] INFO -- : make[2]: Entering directory '/tmp/ruby/build/trunk/ext/objspace' I, [2024-05-14T10:14:16.701459 #39176] INFO -- : make[2]: Entering directory '/tmp/ruby/build/trunk/ext/pathname' I, [2024-05-14T10:14:16.701591 #39176] INFO -- : make[2]: Leaving directory '/tmp/ruby/build/trunk/ext/date' I, [2024-05-14T10:14:16.701989 #39176] INFO -- : make[2]: Leaving directory '/tmp/ruby/build/trunk/ext/rubyvm' I, [2024-05-14T10:14:16.702979 #39176] INFO -- : make[2]: Leaving directory '/tmp/ruby/build/trunk/ext/json' I, [2024-05-14T10:14:16.703001 #39176] INFO -- : make[2]: Entering directory '/tmp/ruby/build/trunk/ext/psych' I, [2024-05-14T10:14:16.703665 #39176] INFO -- : make[2]: Leaving directory '/tmp/ruby/build/trunk/ext/pty' I, [2024-05-14T10:14:16.703707 #39176] INFO -- : make[2]: Entering directory '/tmp/ruby/build/trunk/ext/ripper' I, [2024-05-14T10:14:16.704110 #39176] INFO -- : make[2]: Leaving directory '/tmp/ruby/build/trunk/ext/pathname' I, [2024-05-14T10:14:16.704454 #39176] INFO -- : make[2]: Leaving directory '/tmp/ruby/build/trunk/ext/objspace' I, [2024-05-14T10:14:16.704906 #39176] INFO -- : make[2]: Leaving directory '/tmp/ruby/build/trunk/ext/fiddle' I, [2024-05-14T10:14:16.706147 #39176] INFO -- : make[2]: Entering directory '/tmp/ruby/build/trunk/.bundle/gems/bigdecimal-3.1.8/ext/bigdecimal' I, [2024-05-14T10:14:16.706517 #39176] INFO -- : make[2]: Entering directory '/tmp/ruby/build/trunk/.bundle/gems/debug-1.9.2/ext/debug' I, [2024-05-14T10:14:16.706864 #39176] INFO -- : make[2]: Entering directory '/tmp/ruby/build/trunk/.bundle/gems/nkf-0.2.0/ext/nkf' I, [2024-05-14T10:14:16.707014 #39176] INFO -- : make[2]: Entering directory '/tmp/ruby/build/trunk/.bundle/gems/racc-1.7.3/ext/racc/cparse' I, [2024-05-14T10:14:16.707199 #39176] INFO -- : make[2]: Entering directory '/tmp/ruby/build/trunk/.bundle/gems/syslog-0.1.2/ext/syslog' I, [2024-05-14T10:14:16.707628 #39176] INFO -- : make[2]: Entering directory '/tmp/ruby/build/trunk/.bundle/gems/rbs-3.4.4/ext/rbs_extension' I, [2024-05-14T10:14:16.708771 #39176] INFO -- : make[2]: Leaving directory '/tmp/ruby/build/trunk/ext/ripper' I, [2024-05-14T10:14:16.709675 #39176] INFO -- : make[2]: Entering directory '/tmp/ruby/build/trunk/ext/openssl' I, [2024-05-14T10:14:16.709924 #39176] INFO -- : make[2]: Entering directory '/tmp/ruby/build/trunk/ext/socket' I, [2024-05-14T10:14:16.710487 #39176] INFO -- : make[2]: Entering directory '/tmp/ruby/build/trunk/ext/digest/sha2' I, [2024-05-14T10:14:16.713324 #39176] INFO -- : make[2]: Leaving directory '/tmp/ruby/build/trunk/ext/psych' I, [2024-05-14T10:14:16.713940 #39176] INFO -- : make[2]: Leaving directory '/tmp/ruby/build/trunk/ext/digest/sha2' I, [2024-05-14T10:14:16.716038 #39176] INFO -- : make[2]: Leaving directory '/tmp/ruby/build/trunk/ext/socket' I, [2024-05-14T10:14:16.720946 #39176] INFO -- : make[2]: Leaving directory '/tmp/ruby/build/trunk/ext/openssl' I, [2024-05-14T10:14:16.729916 #39176] INFO -- : make[2]: Leaving directory '/tmp/ruby/build/trunk/.bundle/gems/debug-1.9.2/ext/debug' I, [2024-05-14T10:14:16.730427 #39176] INFO -- : make[2]: Leaving directory '/tmp/ruby/build/trunk/.bundle/gems/racc-1.7.3/ext/racc/cparse' I, [2024-05-14T10:14:16.731775 #39176] INFO -- : make[2]: Leaving directory '/tmp/ruby/build/trunk/.bundle/gems/nkf-0.2.0/ext/nkf' I, [2024-05-14T10:14:16.731998 #39176] INFO -- : make[2]: Leaving directory '/tmp/ruby/build/trunk/.bundle/gems/syslog-0.1.2/ext/syslog' I, [2024-05-14T10:14:16.733310 #39176] INFO -- : make[2]: Leaving directory '/tmp/ruby/build/trunk/.bundle/gems/bigdecimal-3.1.8/ext/bigdecimal' I, [2024-05-14T10:14:16.739285 #39176] INFO -- : make[2]: Leaving directory '/tmp/ruby/build/trunk/.bundle/gems/rbs-3.4.4/ext/rbs_extension' I, [2024-05-14T10:14:16.762915 #39176] INFO -- : make[2]: Entering directory '/tmp/ruby/build/trunk' I, [2024-05-14T10:14:16.831341 #39176] INFO -- : linking ruby I, [2024-05-14T10:14:16.853695 #39176] INFO -- : make[2]: Leaving directory '/tmp/ruby/build/trunk' I, [2024-05-14T10:14:16.854311 #39176] INFO -- : make[1]: Leaving directory '/tmp/ruby/build/trunk' I, [2024-05-14T10:14:16.857993 #39176] INFO -- : make[1]: Entering directory '/tmp/ruby/build/trunk' I, [2024-05-14T10:14:16.858050 #39176] INFO -- : make[1]: Nothing to be done for 'note'. I, [2024-05-14T10:14:16.858066 #39176] INFO -- : make[1]: Leaving directory '/tmp/ruby/build/trunk' I, [2024-05-14T10:14:16.858836 #39176] INFO -- : $$$[end] "make all -j20" exit with 0. I, [2024-05-14T10:14:16.858989 #39176] INFO -- : $$$[beg] make install -j20 I, [2024-05-14T10:14:16.929229 #39176] INFO -- : Update minitest to ea9caafc0754b1d6236a490d59e624b53209734a I, [2024-05-14T10:14:16.929508 #39176] INFO -- : Update power_assert to 84e85124c5014a139af39161d484156cfe87a9ed I, [2024-05-14T10:14:16.930332 #39176] INFO -- : Update rbs to ba7872795d5de04adb8ff500c0e6afdc81a041dd I, [2024-05-14T10:14:16.930492 #39176] INFO -- : Update typeprof to b19a6416da3a05d57fadd6ffdadb382b6d236ca5 I, [2024-05-14T10:14:16.931544 #39176] INFO -- : echo ea9caafc0754b1d6236a490d59e624b53209734a | /bin/sh /tmp/ruby/src/trunk/tool/ifchange /tmp/ruby/src/trunk/.bundle/.timestamp/minitest.revision - I, [2024-05-14T10:14:16.931628 #39176] INFO -- : echo 84e85124c5014a139af39161d484156cfe87a9ed | /bin/sh /tmp/ruby/src/trunk/tool/ifchange /tmp/ruby/src/trunk/.bundle/.timestamp/power_assert.revision - I, [2024-05-14T10:14:16.933136 #39176] INFO -- : BASERUBY = /usr/bin/ruby --disable=gems I, [2024-05-14T10:14:16.933202 #39176] INFO -- : CC = gcc I, [2024-05-14T10:14:16.933221 #39176] INFO -- : LD = ld I, [2024-05-14T10:14:16.933238 #39176] INFO -- : LDSHARED = gcc -shared I, [2024-05-14T10:14:16.933254 #39176] INFO -- : CFLAGS = -O3 -fno-fast-math -ggdb3 -Wall -Wextra -Wdeprecated-declarations -Wdiv-by-zero -Wduplicated-cond -Wimplicit-function-declaration -Wimplicit-int -Wpointer-arith -Wwrite-strings -Wold-style-definition -Wimplicit-fallthrough=0 -Wmissing-noreturn -Wno-cast-function-type -Wno-constant-logical-operand -Wno-long-long -Wno-missing-field-initializers -Wno-overlength-strings -Wno-packed-bitfield-compat -Wno-parentheses-equality -Wno-self-assign -Wno-tautological-compare -Wno-unused-parameter -Wno-unused-value -Wsuggest-attribute=format -Wsuggest-attribute=noreturn -Wunused-variable -Wmisleading-indentation -Wundef -fPIC I, [2024-05-14T10:14:16.933279 #39176] INFO -- : XCFLAGS = -U_FORTIFY_SOURCE -D_FORTIFY_SOURCE=2 -fstack-protector-strong -fno-strict-overflow -fvisibility=hidden -fexcess-precision=standard -DRUBY_EXPORT -I. -I.ext/include/x86_64-linux -I/tmp/ruby/src/trunk/include -I/tmp/ruby/src/trunk -I/tmp/ruby/src/trunk/prism -I/tmp/ruby/src/trunk/enc/unicode/15.0.0 I, [2024-05-14T10:14:16.933295 #39176] INFO -- : CPPFLAGS = I, [2024-05-14T10:14:16.933311 #39176] INFO -- : DLDFLAGS = -Wl,--compress-debug-sections=zlib -Wl,-soname,libruby.so.3.4 -fstack-protector-strong I, [2024-05-14T10:14:16.933326 #39176] INFO -- : SOLIBS = -lz -lrt -lrt -lgmp -ldl -lcrypt -lm -lpthread I, [2024-05-14T10:14:16.933356 #39176] INFO -- : LANG = en_US.UTF-8 I, [2024-05-14T10:14:16.933372 #39176] INFO -- : LC_ALL = I, [2024-05-14T10:14:16.933387 #39176] INFO -- : LC_CTYPE = I, [2024-05-14T10:14:16.933402 #39176] INFO -- : MFLAGS = -j20 --jobserver-auth=4,5 I, [2024-05-14T10:14:16.933420 #39176] INFO -- : RUSTC = no I, [2024-05-14T10:14:16.933436 #39176] INFO -- : YJIT_RUSTC_ARGS = --crate-name=yjit --crate-type=staticlib --edition=2021 -g -C lto=thin -C opt-level=3 -C overflow-checks=on '--out-dir=/tmp/ruby/build/trunk/yjit/target/release/' /tmp/ruby/src/trunk/yjit/src/lib.rs I, [2024-05-14T10:14:16.934770 #39176] INFO -- : /tmp/ruby/src/trunk/.bundle/.timestamp/power_assert.revision unchanged I, [2024-05-14T10:14:16.934851 #39176] INFO -- : /tmp/ruby/src/trunk/.bundle/.timestamp/minitest.revision unchanged I, [2024-05-14T10:14:16.961319 #39176] INFO -- : echo ba7872795d5de04adb8ff500c0e6afdc81a041dd | /bin/sh /tmp/ruby/src/trunk/tool/ifchange /tmp/ruby/src/trunk/.bundle/.timestamp/rbs.revision - I, [2024-05-14T10:14:16.961453 #39176] INFO -- : echo b19a6416da3a05d57fadd6ffdadb382b6d236ca5 | /bin/sh /tmp/ruby/src/trunk/tool/ifchange /tmp/ruby/src/trunk/.bundle/.timestamp/typeprof.revision - I, [2024-05-14T10:14:16.962352 #39176] INFO -- : generating enc.mk I, [2024-05-14T10:14:16.962414 #39176] INFO -- : gcc (Ubuntu 11.4.0-1ubuntu1~22.04) 11.4.0 I, [2024-05-14T10:14:16.962432 #39176] INFO -- : Copyright (C) 2021 Free Software Foundation, Inc. I, [2024-05-14T10:14:16.962447 #39176] INFO -- : This is free software; see the source for copying conditions. There is NO I, [2024-05-14T10:14:16.962461 #39176] INFO -- : warranty; not even for MERCHANTABILITY or FITNESS FOR A PARTICULAR PURPOSE. I, [2024-05-14T10:14:16.962474 #39176] INFO -- : I, [2024-05-14T10:14:16.963345 #39176] INFO -- : /tmp/ruby/src/trunk/.bundle/.timestamp/rbs.revision unchanged I, [2024-05-14T10:14:16.963421 #39176] INFO -- : /tmp/ruby/src/trunk/.bundle/.timestamp/typeprof.revision unchanged I, [2024-05-14T10:14:17.084648 #39176] INFO -- : Building power_assert@84e85124c5014a139af39161d484156cfe87a9ed to /tmp/ruby/src/trunk/gems/power_assert-2.0.3.gem I, [2024-05-14T10:14:17.085443 #39176] INFO -- : making srcs under enc I, [2024-05-14T10:14:17.085583 #39176] INFO -- : making enc I, [2024-05-14T10:14:17.102338 #39176] INFO -- : make[1]: Entering directory '/tmp/ruby/build/trunk' I, [2024-05-14T10:14:17.102389 #39176] INFO -- : make[1]: Nothing to be done for 'enc'. I, [2024-05-14T10:14:17.102403 #39176] INFO -- : make[1]: Leaving directory '/tmp/ruby/build/trunk' I, [2024-05-14T10:14:17.115058 #39176] INFO -- : make[1]: Entering directory '/tmp/ruby/build/trunk' I, [2024-05-14T10:14:17.115117 #39176] INFO -- : make[1]: Nothing to be done for 'srcs'. I, [2024-05-14T10:14:17.115131 #39176] INFO -- : make[1]: Leaving directory '/tmp/ruby/build/trunk' I, [2024-05-14T10:14:17.115957 #39176] INFO -- : generating transdb.h I, [2024-05-14T10:14:17.153653 #39176] INFO -- : Successfully built RubyGem I, [2024-05-14T10:14:17.153712 #39176] INFO -- : Name: power_assert I, [2024-05-14T10:14:17.153733 #39176] INFO -- : Version: 2.0.4dev I, [2024-05-14T10:14:17.153745 #39176] INFO -- : File: power_assert-2.0.4dev.gem I, [2024-05-14T10:14:17.156029 #39176] INFO -- : Extracting bundle gem power_assert-2.0.3... I, [2024-05-14T10:14:17.213052 #39176] INFO -- : transdb.h unchanged I, [2024-05-14T10:14:17.214582 #39176] INFO -- : generating makefiles ext/configure-ext.mk I, [2024-05-14T10:14:17.214949 #39176] INFO -- : making trans I, [2024-05-14T10:14:17.218167 #39176] INFO -- : Try with hash version of bundled gems instead of gems/power_assert-2.0.3.gem. We don't use this gem with release version of Ruby. I, [2024-05-14T10:14:17.223150 #39176] INFO -- : Unpacked gems/power_assert-2.0.4dev.gem I, [2024-05-14T10:14:17.241807 #39176] INFO -- : ext/configure-ext.mk unchanged I, [2024-05-14T10:14:17.244375 #39176] INFO -- : make[1]: Entering directory '/tmp/ruby/build/trunk' I, [2024-05-14T10:14:17.250638 #39176] INFO -- : make[1]: Entering directory '/tmp/ruby/build/trunk' I, [2024-05-14T10:14:17.250740 #39176] INFO -- : make[1]: Nothing to be done for 'trans'. I, [2024-05-14T10:14:17.250750 #39176] INFO -- : make[1]: Leaving directory '/tmp/ruby/build/trunk' I, [2024-05-14T10:14:17.312493 #39176] INFO -- : making encs I, [2024-05-14T10:14:17.372714 #39176] INFO -- : make[1]: Entering directory '/tmp/ruby/build/trunk' I, [2024-05-14T10:14:17.372773 #39176] INFO -- : make[1]: Nothing to be done for 'encs'. I, [2024-05-14T10:14:17.372782 #39176] INFO -- : make[1]: Leaving directory '/tmp/ruby/build/trunk' I, [2024-05-14T10:14:17.388008 #39176] INFO -- : make[1]: Leaving directory '/tmp/ruby/build/trunk' I, [2024-05-14T10:14:17.388786 #39176] INFO -- : generating makefile exts.mk I, [2024-05-14T10:14:17.425522 #39176] INFO -- : exts.mk unchanged I, [2024-05-14T10:14:17.430245 #39176] INFO -- : make[1]: Entering directory '/tmp/ruby/build/trunk' I, [2024-05-14T10:14:17.448088 #39176] INFO -- : make[2]: Entering directory '/tmp/ruby/build/trunk/ext/digest' I, [2024-05-14T10:14:17.449669 #39176] INFO -- : make[2]: Entering directory '/tmp/ruby/build/trunk/ext/coverage' I, [2024-05-14T10:14:17.449701 #39176] INFO -- : make[2]: Entering directory '/tmp/ruby/build/trunk/ext/json' I, [2024-05-14T10:14:17.450533 #39176] INFO -- : make[2]: Entering directory '/tmp/ruby/build/trunk/ext/io/console' I, [2024-05-14T10:14:17.450568 #39176] INFO -- : make[2]: Entering directory '/tmp/ruby/build/trunk/ext/date' I, [2024-05-14T10:14:17.451447 #39176] INFO -- : make[2]: Entering directory '/tmp/ruby/build/trunk/ext/rubyvm' I, [2024-05-14T10:14:17.451642 #39176] INFO -- : make[2]: Entering directory '/tmp/ruby/build/trunk/ext/monitor' I, [2024-05-14T10:14:17.452092 #39176] INFO -- : make[2]: Entering directory '/tmp/ruby/build/trunk/ext/pathname' I, [2024-05-14T10:14:17.452764 #39176] INFO -- : make[2]: Entering directory '/tmp/ruby/build/trunk/ext/fiddle' I, [2024-05-14T10:14:17.452788 #39176] INFO -- : make[2]: Entering directory '/tmp/ruby/build/trunk/ext/pty' I, [2024-05-14T10:14:17.453450 #39176] INFO -- : make[2]: Leaving directory '/tmp/ruby/build/trunk/ext/coverage' I, [2024-05-14T10:14:17.454106 #39176] INFO -- : make[2]: Leaving directory '/tmp/ruby/build/trunk/ext/monitor' I, [2024-05-14T10:14:17.454132 #39176] INFO -- : make[2]: Leaving directory '/tmp/ruby/build/trunk/ext/date' I, [2024-05-14T10:14:17.454169 #39176] INFO -- : make[2]: Entering directory '/tmp/ruby/build/trunk/ext/objspace' I, [2024-05-14T10:14:17.454222 #39176] INFO -- : make[2]: Leaving directory '/tmp/ruby/build/trunk/ext/io/console' I, [2024-05-14T10:14:17.454807 #39176] INFO -- : make[2]: Entering directory '/tmp/ruby/build/trunk/ext/psych' I, [2024-05-14T10:14:17.455275 #39176] INFO -- : make[2]: Leaving directory '/tmp/ruby/build/trunk/ext/pathname' I, [2024-05-14T10:14:17.455299 #39176] INFO -- : make[2]: Leaving directory '/tmp/ruby/build/trunk/ext/pty' I, [2024-05-14T10:14:17.455731 #39176] INFO -- : make[2]: Entering directory '/tmp/ruby/build/trunk/.bundle/gems/bigdecimal-3.1.8/ext/bigdecimal' I, [2024-05-14T10:14:17.455902 #39176] INFO -- : make[2]: Entering directory '/tmp/ruby/build/trunk/.bundle/gems/debug-1.9.2/ext/debug' I, [2024-05-14T10:14:17.456309 #39176] INFO -- : make[2]: Entering directory '/tmp/ruby/build/trunk/.bundle/gems/nkf-0.2.0/ext/nkf' I, [2024-05-14T10:14:17.456320 #39176] INFO -- : make[2]: Leaving directory '/tmp/ruby/build/trunk/ext/rubyvm' I, [2024-05-14T10:14:17.456607 #39176] INFO -- : make[2]: Entering directory '/tmp/ruby/build/trunk/.bundle/gems/racc-1.7.3/ext/racc/cparse' I, [2024-05-14T10:14:17.456947 #39176] INFO -- : make[2]: Entering directory '/tmp/ruby/build/trunk/.bundle/gems/syslog-0.1.2/ext/syslog' I, [2024-05-14T10:14:17.457101 #39176] INFO -- : make[2]: Leaving directory '/tmp/ruby/build/trunk/ext/json' I, [2024-05-14T10:14:17.457270 #39176] INFO -- : make[2]: Leaving directory '/tmp/ruby/build/trunk/ext/digest' I, [2024-05-14T10:14:17.457353 #39176] INFO -- : make[2]: Entering directory '/tmp/ruby/build/trunk/ext/ripper' I, [2024-05-14T10:14:17.457441 #39176] INFO -- : make[2]: Leaving directory '/tmp/ruby/build/trunk/ext/objspace' I, [2024-05-14T10:14:17.458270 #39176] INFO -- : make[2]: Entering directory '/tmp/ruby/build/trunk/.bundle/gems/rbs-3.4.4/ext/rbs_extension' I, [2024-05-14T10:14:17.460542 #39176] INFO -- : make[2]: Leaving directory '/tmp/ruby/build/trunk/ext/fiddle' I, [2024-05-14T10:14:17.461621 #39176] INFO -- : make[2]: Leaving directory '/tmp/ruby/build/trunk/ext/ripper' I, [2024-05-14T10:14:17.461923 #39176] INFO -- : make[2]: Entering directory '/tmp/ruby/build/trunk/ext/socket' I, [2024-05-14T10:14:17.464412 #39176] INFO -- : make[2]: Entering directory '/tmp/ruby/build/trunk/ext/openssl' I, [2024-05-14T10:14:17.465153 #39176] INFO -- : make[2]: Entering directory '/tmp/ruby/build/trunk/ext/digest/sha2' I, [2024-05-14T10:14:17.468217 #39176] INFO -- : make[2]: Leaving directory '/tmp/ruby/build/trunk/ext/digest/sha2' I, [2024-05-14T10:14:17.470117 #39176] INFO -- : make[2]: Leaving directory '/tmp/ruby/build/trunk/ext/psych' I, [2024-05-14T10:14:17.470731 #39176] INFO -- : make[2]: Leaving directory '/tmp/ruby/build/trunk/ext/socket' I, [2024-05-14T10:14:17.475520 #39176] INFO -- : make[2]: Leaving directory '/tmp/ruby/build/trunk/ext/openssl' I, [2024-05-14T10:14:17.479540 #39176] INFO -- : make[2]: Leaving directory '/tmp/ruby/build/trunk/.bundle/gems/racc-1.7.3/ext/racc/cparse' I, [2024-05-14T10:14:17.479670 #39176] INFO -- : make[2]: Leaving directory '/tmp/ruby/build/trunk/.bundle/gems/nkf-0.2.0/ext/nkf' I, [2024-05-14T10:14:17.479994 #39176] INFO -- : make[2]: Leaving directory '/tmp/ruby/build/trunk/.bundle/gems/rbs-3.4.4/ext/rbs_extension' I, [2024-05-14T10:14:17.487206 #39176] INFO -- : make[2]: Leaving directory '/tmp/ruby/build/trunk/.bundle/gems/debug-1.9.2/ext/debug' I, [2024-05-14T10:14:17.487467 #39176] INFO -- : make[2]: Leaving directory '/tmp/ruby/build/trunk/.bundle/gems/syslog-0.1.2/ext/syslog' I, [2024-05-14T10:14:17.488142 #39176] INFO -- : make[2]: Leaving directory '/tmp/ruby/build/trunk/.bundle/gems/bigdecimal-3.1.8/ext/bigdecimal' I, [2024-05-14T10:14:17.512475 #39176] INFO -- : make[2]: Entering directory '/tmp/ruby/build/trunk' I, [2024-05-14T10:14:17.583625 #39176] INFO -- : make[2]: 'ruby' is up to date. I, [2024-05-14T10:14:17.583665 #39176] INFO -- : make[2]: Leaving directory '/tmp/ruby/build/trunk' I, [2024-05-14T10:14:17.583932 #39176] INFO -- : make[1]: Leaving directory '/tmp/ruby/build/trunk' I, [2024-05-14T10:14:17.587589 #39176] INFO -- : make[1]: Entering directory '/tmp/ruby/build/trunk' I, [2024-05-14T10:14:17.587627 #39176] INFO -- : make[1]: Nothing to be done for 'note'. I, [2024-05-14T10:14:17.587643 #39176] INFO -- : make[1]: Leaving directory '/tmp/ruby/build/trunk' I, [2024-05-14T10:14:17.587955 #39176] INFO -- : ./miniruby -I/tmp/ruby/src/trunk/lib -I. -I.ext/common /tmp/ruby/src/trunk/tool/runruby.rb --extout=.ext -- --disable-gems -r./x86_64-linux-fake /tmp/ruby/src/trunk/tool/rbinstall.rb --make="make" --dest-dir="" --extout=".ext" --ext-build-dir="./ext" --mflags="-j20 --jobserver-auth=4,5" --make-flags=" -j20 --jobserver-auth=4,5" --data-mode=0644 --prog-mode=0755 --installed-list .installed.list --mantype="doc" --gnumake --install=all --exclude=doc I, [2024-05-14T10:14:17.682450 #39176] INFO -- : Installing to I, [2024-05-14T10:14:17.682528 #39176] INFO -- : installing binary commands: /tmp/ruby/install/trunk/bin I, [2024-05-14T10:14:17.682543 #39176] INFO -- : installing base libraries: /tmp/ruby/install/trunk/lib I, [2024-05-14T10:14:17.689981 #39176] INFO -- : installing arch files: /tmp/ruby/install/trunk/lib/ruby/3.4.0+0/x86_64-linux I, [2024-05-14T10:14:17.690043 #39176] INFO -- : installing pkgconfig data: /tmp/ruby/install/trunk/lib/pkgconfig I, [2024-05-14T10:14:17.690057 #39176] INFO -- : installing extension objects: /tmp/ruby/install/trunk/lib/ruby/3.4.0+0/x86_64-linux I, [2024-05-14T10:14:17.699298 #39176] INFO -- : installing extension objects: /tmp/ruby/install/trunk/lib/ruby/site_ruby/3.4.0+0/x86_64-linux I, [2024-05-14T10:14:17.699363 #39176] INFO -- : installing extension objects: /tmp/ruby/install/trunk/lib/ruby/vendor_ruby/3.4.0+0/x86_64-linux I, [2024-05-14T10:14:17.699377 #39176] INFO -- : installing extension headers: /tmp/ruby/install/trunk/include/ruby-3.4.0+0/x86_64-linux I, [2024-05-14T10:14:17.699399 #39176] INFO -- : installing extension scripts: /tmp/ruby/install/trunk/lib/ruby/3.4.0+0 I, [2024-05-14T10:14:17.703338 #39176] INFO -- : installing extension scripts: /tmp/ruby/install/trunk/lib/ruby/site_ruby/3.4.0+0 I, [2024-05-14T10:14:17.703396 #39176] INFO -- : installing extension scripts: /tmp/ruby/install/trunk/lib/ruby/vendor_ruby/3.4.0+0 I, [2024-05-14T10:14:17.703409 #39176] INFO -- : installing extension headers: /tmp/ruby/install/trunk/include/ruby-3.4.0+0/ruby I, [2024-05-14T10:14:17.703426 #39176] INFO -- : installing command scripts: /tmp/ruby/install/trunk/bin I, [2024-05-14T10:14:17.703439 #39176] INFO -- : installing library scripts: /tmp/ruby/install/trunk/lib/ruby/3.4.0+0 I, [2024-05-14T10:14:17.736594 #39176] INFO -- : installing common headers: /tmp/ruby/install/trunk/include/ruby-3.4.0+0 I, [2024-05-14T10:14:17.741847 #39176] INFO -- : installing manpages: /tmp/ruby/install/trunk/share/man/man1 I, [2024-05-14T10:14:17.741914 #39176] INFO -- : installing default gems from lib: /tmp/ruby/install/trunk/lib/ruby/gems/3.4.0+0 I, [2024-05-14T10:14:17.764374 #39176] INFO -- : benchmark 0.3.0 I, [2024-05-14T10:14:17.771242 #39176] INFO -- : bundler 2.6.0.dev I, [2024-05-14T10:14:17.773324 #39176] INFO -- : cgi 0.4.1 I, [2024-05-14T10:14:17.773855 #39176] INFO -- : delegate 0.3.1 I, [2024-05-14T10:14:17.774322 #39176] INFO -- : did_you_mean 1.6.3 I, [2024-05-14T10:14:17.774778 #39176] INFO -- : english 0.8.0 I, [2024-05-14T10:14:17.775244 #39176] INFO -- : erb 4.0.4 I, [2024-05-14T10:14:17.776016 #39176] INFO -- : error_highlight 0.6.0 I, [2024-05-14T10:14:17.776448 #39176] INFO -- : fileutils 1.7.2 I, [2024-05-14T10:14:17.776867 #39176] INFO -- : find 0.2.0 I, [2024-05-14T10:14:17.777301 #39176] INFO -- : forwardable 1.3.3 I, [2024-05-14T10:14:17.777750 #39176] INFO -- : ipaddr 1.2.6 I, [2024-05-14T10:14:17.778250 #39176] INFO -- : irb 1.13.1 I, [2024-05-14T10:14:17.779731 #39176] INFO -- : logger 1.6.0 I, [2024-05-14T10:14:17.780130 #39176] INFO -- : net-http 0.4.1 I, [2024-05-14T10:14:17.780687 #39176] INFO -- : net-protocol 0.2.2 I, [2024-05-14T10:14:17.781167 #39176] INFO -- : open-uri 0.4.1 I, [2024-05-14T10:14:17.781636 #39176] INFO -- : open3 0.2.1 I, [2024-05-14T10:14:17.782141 #39176] INFO -- : optparse 0.5.0 I, [2024-05-14T10:14:17.782608 #39176] INFO -- : ostruct 0.6.0 I, [2024-05-14T10:14:17.783102 #39176] INFO -- : pp 0.5.0 I, [2024-05-14T10:14:17.783582 #39176] INFO -- : prettyprint 0.2.0 I, [2024-05-14T10:14:17.784024 #39176] INFO -- : prism 0.29.0 I, [2024-05-14T10:14:17.784565 #39176] INFO -- : pstore 0.1.3 I, [2024-05-14T10:14:17.785001 #39176] INFO -- : rdoc 6.6.3.1 I, [2024-05-14T10:14:17.786562 #39176] INFO -- : readline 0.0.4 I, [2024-05-14T10:14:17.787000 #39176] INFO -- : reline 0.5.7 I, [2024-05-14T10:14:17.787508 #39176] INFO -- : resolv 0.4.0 I, [2024-05-14T10:14:17.788071 #39176] INFO -- : ruby2_keywords 0.0.5 I, [2024-05-14T10:14:17.788550 #39176] INFO -- : securerandom 0.3.1 I, [2024-05-14T10:14:17.789019 #39176] INFO -- : set 1.1.0 I, [2024-05-14T10:14:17.789507 #39176] INFO -- : shellwords 0.2.0 I, [2024-05-14T10:14:17.789995 #39176] INFO -- : singleton 0.2.0 I, [2024-05-14T10:14:17.790375 #39176] INFO -- : syntax_suggest 2.0.0 I, [2024-05-14T10:14:17.791047 #39176] INFO -- : tempfile 0.2.1 I, [2024-05-14T10:14:17.791515 #39176] INFO -- : time 0.3.0 I, [2024-05-14T10:14:17.792109 #39176] INFO -- : timeout 0.4.1 I, [2024-05-14T10:14:17.793056 #39176] INFO -- : tmpdir 0.2.0 I, [2024-05-14T10:14:17.793595 #39176] INFO -- : tsort 0.2.0 I, [2024-05-14T10:14:17.794056 #39176] INFO -- : un 0.3.0 I, [2024-05-14T10:14:17.794605 #39176] INFO -- : uri 0.13.0 I, [2024-05-14T10:14:17.795104 #39176] INFO -- : weakref 0.1.3 I, [2024-05-14T10:14:17.795584 #39176] INFO -- : yaml 0.3.0 I, [2024-05-14T10:14:17.795924 #39176] INFO -- : installing default gems from ext: /tmp/ruby/install/trunk/lib/ruby/gems/3.4.0+0 I, [2024-05-14T10:14:17.802387 #39176] INFO -- : date 3.3.4 I, [2024-05-14T10:14:17.802912 #39176] INFO -- : digest 3.1.1 I, [2024-05-14T10:14:17.803381 #39176] INFO -- : etc 1.4.3 I, [2024-05-14T10:14:17.803893 #39176] INFO -- : fcntl 1.1.0 I, [2024-05-14T10:14:17.804433 #39176] INFO -- : fiddle 1.1.3 I, [2024-05-14T10:14:17.804901 #39176] INFO -- : io-console 0.7.2 I, [2024-05-14T10:14:17.805501 #39176] INFO -- : io-nonblock 0.3.0 I, [2024-05-14T10:14:17.805987 #39176] INFO -- : io-wait 0.3.1 I, [2024-05-14T10:14:17.806369 #39176] INFO -- : json 2.7.2 I, [2024-05-14T10:14:17.807216 #39176] INFO -- : openssl 3.2.0 I, [2024-05-14T10:14:17.807952 #39176] INFO -- : pathname 0.3.0 I, [2024-05-14T10:14:17.808496 #39176] INFO -- : psych 5.1.2 I, [2024-05-14T10:14:17.809071 #39176] INFO -- : stringio 3.1.1 I, [2024-05-14T10:14:17.809575 #39176] INFO -- : strscan 3.1.1 I, [2024-05-14T10:14:17.810049 #39176] INFO -- : zlib 3.1.0 I, [2024-05-14T10:14:17.810450 #39176] INFO -- : installing bundled gems: /tmp/ruby/install/trunk/lib/ruby/gems/3.4.0+0 I, [2024-05-14T10:14:17.810734 #39176] INFO -- : minitest 5.22.3 I, [2024-05-14T10:14:17.818204 #39176] INFO -- : rake 13.2.1 I, [2024-05-14T10:14:17.821404 #39176] INFO -- : test-unit 3.6.2 I, [2024-05-14T10:14:17.825766 #39176] INFO -- : rexml 3.2.6 I, [2024-05-14T10:14:17.829218 #39176] INFO -- : rss 0.3.0 I, [2024-05-14T10:14:17.832113 #39176] INFO -- : net-ftp 0.3.4 I, [2024-05-14T10:14:17.833611 #39176] INFO -- : net-imap 0.4.11 I, [2024-05-14T10:14:17.836538 #39176] INFO -- : net-pop 0.1.2 I, [2024-05-14T10:14:17.837424 #39176] INFO -- : net-smtp 0.5.0 I, [2024-05-14T10:14:17.838477 #39176] INFO -- : matrix 0.4.2 I, [2024-05-14T10:14:17.841929 #39176] INFO -- : prime 0.1.2 I, [2024-05-14T10:14:17.847315 #39176] INFO -- : rbs 3.4.4 I, [2024-05-14T10:14:17.869266 #39176] INFO -- : typeprof 0.21.11 I, [2024-05-14T10:14:17.871794 #39176] INFO -- : debug 1.9.2 I, [2024-05-14T10:14:17.874505 #39176] INFO -- : racc 1.7.3 I, [2024-05-14T10:14:17.876942 #39176] INFO -- : mutex_m 0.2.0 I, [2024-05-14T10:14:17.878116 #39176] INFO -- : getoptlong 0.2.1 I, [2024-05-14T10:14:17.879380 #39176] INFO -- : base64 0.2.0 I, [2024-05-14T10:14:17.880421 #39176] INFO -- : bigdecimal 3.1.8 I, [2024-05-14T10:14:17.882436 #39176] INFO -- : observer 0.1.2 I, [2024-05-14T10:14:17.883502 #39176] INFO -- : abbrev 0.1.2 I, [2024-05-14T10:14:17.885160 #39176] INFO -- : resolv-replace 0.1.1 I, [2024-05-14T10:14:17.886272 #39176] INFO -- : rinda 0.2.0 I, [2024-05-14T10:14:17.887652 #39176] INFO -- : drb 2.2.1 I, [2024-05-14T10:14:17.889138 #39176] INFO -- : nkf 0.2.0 I, [2024-05-14T10:14:17.891528 #39176] INFO -- : syslog 0.1.2 I, [2024-05-14T10:14:17.893514 #39176] INFO -- : csv 3.3.0 I, [2024-05-14T10:14:17.895570 #39176] INFO -- : installing bundled gem cache: /tmp/ruby/install/trunk/lib/ruby/gems/3.4.0+0/cache I, [2024-05-14T10:14:17.896927 #39176] INFO -- : skipped bundled gems: I, [2024-05-14T10:14:17.896948 #39176] INFO -- : power_assert-2.0.4dev.gem not found in bundled_gems I, [2024-05-14T10:14:17.900155 #39176] INFO -- : $$$[end] "make install -j20" exit with 0. I, [2024-05-14T10:14:17.900293 #39176] INFO -- : $$$[beg] make yes-btest TESTOPTS='-q -j20' I, [2024-05-14T10:14:23.158418 #39176] INFO -- : PASS all 1936 tests E, [2024-05-14T10:14:23.163836 #39176] ERROR -- : I, [2024-05-14T10:14:23.164235 #39176] INFO -- : $$$[end] "make yes-btest TESTOPTS='-q -j20'" exit with 0. I, [2024-05-14T10:14:23.164319 #39176] INFO -- : $$$[beg] make yes-test-basic TESTS='-j20' I, [2024-05-14T10:14:23.225279 #39176] INFO -- : BASERUBY = /usr/bin/ruby --disable=gems I, [2024-05-14T10:14:23.225315 #39176] INFO -- : CC = gcc I, [2024-05-14T10:14:23.225322 #39176] INFO -- : LD = ld I, [2024-05-14T10:14:23.225327 #39176] INFO -- : LDSHARED = gcc -shared I, [2024-05-14T10:14:23.225331 #39176] INFO -- : CFLAGS = -O3 -fno-fast-math -ggdb3 -Wall -Wextra -Wdeprecated-declarations -Wdiv-by-zero -Wduplicated-cond -Wimplicit-function-declaration -Wimplicit-int -Wpointer-arith -Wwrite-strings -Wold-style-definition -Wimplicit-fallthrough=0 -Wmissing-noreturn -Wno-cast-function-type -Wno-constant-logical-operand -Wno-long-long -Wno-missing-field-initializers -Wno-overlength-strings -Wno-packed-bitfield-compat -Wno-parentheses-equality -Wno-self-assign -Wno-tautological-compare -Wno-unused-parameter -Wno-unused-value -Wsuggest-attribute=format -Wsuggest-attribute=noreturn -Wunused-variable -Wmisleading-indentation -Wundef -fPIC I, [2024-05-14T10:14:23.225335 #39176] INFO -- : XCFLAGS = -U_FORTIFY_SOURCE -D_FORTIFY_SOURCE=2 -fstack-protector-strong -fno-strict-overflow -fvisibility=hidden -fexcess-precision=standard -DRUBY_EXPORT -I. -I.ext/include/x86_64-linux -I/tmp/ruby/src/trunk/include -I/tmp/ruby/src/trunk -I/tmp/ruby/src/trunk/prism -I/tmp/ruby/src/trunk/enc/unicode/15.0.0 I, [2024-05-14T10:14:23.225350 #39176] INFO -- : CPPFLAGS = I, [2024-05-14T10:14:23.225354 #39176] INFO -- : DLDFLAGS = -Wl,--compress-debug-sections=zlib -Wl,-soname,libruby.so.3.4 -fstack-protector-strong I, [2024-05-14T10:14:23.225358 #39176] INFO -- : SOLIBS = -lz -lrt -lrt -lgmp -ldl -lcrypt -lm -lpthread I, [2024-05-14T10:14:23.225361 #39176] INFO -- : LANG = en_US.UTF-8 I, [2024-05-14T10:14:23.225365 #39176] INFO -- : LC_ALL = I, [2024-05-14T10:14:23.225368 #39176] INFO -- : LC_CTYPE = I, [2024-05-14T10:14:23.225377 #39176] INFO -- : MFLAGS = I, [2024-05-14T10:14:23.225380 #39176] INFO -- : RUSTC = no I, [2024-05-14T10:14:23.225384 #39176] INFO -- : YJIT_RUSTC_ARGS = --crate-name=yjit --crate-type=staticlib --edition=2021 -g -C lto=thin -C opt-level=3 -C overflow-checks=on '--out-dir=/tmp/ruby/build/trunk/yjit/target/release/' /tmp/ruby/src/trunk/yjit/src/lib.rs I, [2024-05-14T10:14:23.225856 #39176] INFO -- : gcc (Ubuntu 11.4.0-1ubuntu1~22.04) 11.4.0 I, [2024-05-14T10:14:23.225860 #39176] INFO -- : Copyright (C) 2021 Free Software Foundation, Inc. I, [2024-05-14T10:14:23.225864 #39176] INFO -- : This is free software; see the source for copying conditions. There is NO I, [2024-05-14T10:14:23.225868 #39176] INFO -- : warranty; not even for MERCHANTABILITY or FITNESS FOR A PARTICULAR PURPOSE. I, [2024-05-14T10:14:23.225871 #39176] INFO -- : I, [2024-05-14T10:14:23.330667 #39176] INFO -- : Checking leaked global symbols...none I, [2024-05-14T10:14:23.372007 #39176] INFO -- : /tmp/ruby/src/trunk/basictest/test.rb:assignment ....................................................................................................................................................................................................................................................................................................................................................................................OK 372 I, [2024-05-14T10:14:23.372071 #39176] INFO -- : /tmp/ruby/src/trunk/basictest/test.rb:condition ..OK 2 I, [2024-05-14T10:14:23.372079 #39176] INFO -- : /tmp/ruby/src/trunk/basictest/test.rb:if/unless ...OK 3 I, [2024-05-14T10:14:23.372084 #39176] INFO -- : /tmp/ruby/src/trunk/basictest/test.rb:case .....OK 5 I, [2024-05-14T10:14:23.372250 #39176] INFO -- : /tmp/ruby/src/trunk/basictest/test.rb:while/until ........OK 8 I, [2024-05-14T10:14:23.372307 #39176] INFO -- : /tmp/ruby/src/trunk/basictest/test.rb:exception ..........OK 10 I, [2024-05-14T10:14:23.372583 #39176] INFO -- : /tmp/ruby/src/trunk/basictest/test.rb:array .......................................OK 39 I, [2024-05-14T10:14:23.372681 #39176] INFO -- : /tmp/ruby/src/trunk/basictest/test.rb:hash ...........................OK 27 I, [2024-05-14T10:14:23.373407 #39176] INFO -- : /tmp/ruby/src/trunk/basictest/test.rb:iterator ...........................................................................................................OK 107 I, [2024-05-14T10:14:23.373691 #39176] INFO -- : /tmp/ruby/src/trunk/basictest/test.rb:float ................................................................................OK 80 I, [2024-05-14T10:14:23.374704 #39176] INFO -- : /tmp/ruby/src/trunk/basictest/test.rb:bignum ...............................OK 31 I, [2024-05-14T10:14:23.375484 #39176] INFO -- : /tmp/ruby/src/trunk/basictest/test.rb:string & char ..............................................................OK 62 I, [2024-05-14T10:14:23.375509 #39176] INFO -- : /tmp/ruby/src/trunk/basictest/test.rb:assignment ..........OK 10 I, [2024-05-14T10:14:23.375530 #39176] INFO -- : /tmp/ruby/src/trunk/basictest/test.rb:call ......OK 6 I, [2024-05-14T10:14:23.375581 #39176] INFO -- : /tmp/ruby/src/trunk/basictest/test.rb:proc .........OK 9 I, [2024-05-14T10:14:23.476260 #39176] INFO -- : /tmp/ruby/src/trunk/basictest/test.rb:signal ..OK 2 I, [2024-05-14T10:14:23.479164 #39176] INFO -- : /tmp/ruby/src/trunk/basictest/test.rb:eval ...........................OK 27 I, [2024-05-14T10:14:23.596946 #39176] INFO -- : /tmp/ruby/src/trunk/basictest/test.rb:system ........OK 8 I, [2024-05-14T10:14:23.597010 #39176] INFO -- : /tmp/ruby/src/trunk/basictest/test.rb:const .....OK 5 I, [2024-05-14T10:14:23.597017 #39176] INFO -- : /tmp/ruby/src/trunk/basictest/test.rb:clone .....OK 5 I, [2024-05-14T10:14:23.597180 #39176] INFO -- : /tmp/ruby/src/trunk/basictest/test.rb:marshal ....OK 4 I, [2024-05-14T10:14:23.597214 #39176] INFO -- : /tmp/ruby/src/trunk/basictest/test.rb:pack ....OK 4 I, [2024-05-14T10:14:23.597233 #39176] INFO -- : /tmp/ruby/src/trunk/basictest/test.rb:math ..OK 2 I, [2024-05-14T10:14:23.597320 #39176] INFO -- : /tmp/ruby/src/trunk/basictest/test.rb:struct ......OK 6 I, [2024-05-14T10:14:23.597395 #39176] INFO -- : /tmp/ruby/src/trunk/basictest/test.rb:variable ............OK 12 I, [2024-05-14T10:14:23.597415 #39176] INFO -- : /tmp/ruby/src/trunk/basictest/test.rb:trace ...OK 3 I, [2024-05-14T10:14:23.597474 #39176] INFO -- : /tmp/ruby/src/trunk/basictest/test.rb:defined? ............OK 12 I, [2024-05-14T10:14:23.597518 #39176] INFO -- : /tmp/ruby/src/trunk/basictest/test.rb:alias ......OK 6 I, [2024-05-14T10:14:23.597896 #39176] INFO -- : /tmp/ruby/src/trunk/basictest/test.rb:path .......................OK 23 I, [2024-05-14T10:14:23.631544 #39176] INFO -- : /tmp/ruby/src/trunk/basictest/test.rb:gc ....OK 4 I, [2024-05-14T10:14:23.634017 #39176] INFO -- : I, [2024-05-14T10:14:23.634040 #39176] INFO -- : test succeeded I, [2024-05-14T10:14:23.635618 #39176] INFO -- : $$$[end] "make yes-test-basic TESTS='-j20'" exit with 0. I, [2024-05-14T10:14:23.635733 #39176] INFO -- : $$$[beg] make yes-test-all TESTOPTS='--stderr-on-failure' TESTS='-j20' I, [2024-05-14T10:14:23.727793 #39176] INFO -- : BASERUBY = /usr/bin/ruby --disable=gems I, [2024-05-14T10:14:23.727831 #39176] INFO -- : CC = gcc I, [2024-05-14T10:14:23.727837 #39176] INFO -- : LD = ld I, [2024-05-14T10:14:23.727841 #39176] INFO -- : LDSHARED = gcc -shared I, [2024-05-14T10:14:23.727846 #39176] INFO -- : CFLAGS = -O3 -fno-fast-math -ggdb3 -Wall -Wextra -Wdeprecated-declarations -Wdiv-by-zero -Wduplicated-cond -Wimplicit-function-declaration -Wimplicit-int -Wpointer-arith -Wwrite-strings -Wold-style-definition -Wimplicit-fallthrough=0 -Wmissing-noreturn -Wno-cast-function-type -Wno-constant-logical-operand -Wno-long-long -Wno-missing-field-initializers -Wno-overlength-strings -Wno-packed-bitfield-compat -Wno-parentheses-equality -Wno-self-assign -Wno-tautological-compare -Wno-unused-parameter -Wno-unused-value -Wsuggest-attribute=format -Wsuggest-attribute=noreturn -Wunused-variable -Wmisleading-indentation -Wundef -fPIC I, [2024-05-14T10:14:23.727855 #39176] INFO -- : XCFLAGS = -U_FORTIFY_SOURCE -D_FORTIFY_SOURCE=2 -fstack-protector-strong -fno-strict-overflow -fvisibility=hidden -fexcess-precision=standard -DRUBY_EXPORT -I. -I.ext/include/x86_64-linux -I/tmp/ruby/src/trunk/include -I/tmp/ruby/src/trunk -I/tmp/ruby/src/trunk/prism -I/tmp/ruby/src/trunk/enc/unicode/15.0.0 I, [2024-05-14T10:14:23.727859 #39176] INFO -- : CPPFLAGS = I, [2024-05-14T10:14:23.727863 #39176] INFO -- : DLDFLAGS = -Wl,--compress-debug-sections=zlib -Wl,-soname,libruby.so.3.4 -fstack-protector-strong I, [2024-05-14T10:14:23.727867 #39176] INFO -- : SOLIBS = -lz -lrt -lrt -lgmp -ldl -lcrypt -lm -lpthread I, [2024-05-14T10:14:23.727870 #39176] INFO -- : LANG = en_US.UTF-8 I, [2024-05-14T10:14:23.727874 #39176] INFO -- : LC_ALL = I, [2024-05-14T10:14:23.727877 #39176] INFO -- : LC_CTYPE = I, [2024-05-14T10:14:23.727881 #39176] INFO -- : MFLAGS = I, [2024-05-14T10:14:23.727884 #39176] INFO -- : RUSTC = no I, [2024-05-14T10:14:23.727888 #39176] INFO -- : YJIT_RUSTC_ARGS = --crate-name=yjit --crate-type=staticlib --edition=2021 -g -C lto=thin -C opt-level=3 -C overflow-checks=on '--out-dir=/tmp/ruby/build/trunk/yjit/target/release/' /tmp/ruby/src/trunk/yjit/src/lib.rs I, [2024-05-14T10:14:23.728407 #39176] INFO -- : gcc (Ubuntu 11.4.0-1ubuntu1~22.04) 11.4.0 I, [2024-05-14T10:14:23.728428 #39176] INFO -- : Copyright (C) 2021 Free Software Foundation, Inc. I, [2024-05-14T10:14:23.728434 #39176] INFO -- : This is free software; see the source for copying conditions. There is NO I, [2024-05-14T10:14:23.728438 #39176] INFO -- : warranty; not even for MERCHANTABILITY or FITNESS FOR A PARTICULAR PURPOSE. I, [2024-05-14T10:14:23.728442 #39176] INFO -- : I, [2024-05-14T10:14:23.730047 #39176] INFO -- : generating enc.mk I, [2024-05-14T10:14:23.847365 #39176] INFO -- : making enc I, [2024-05-14T10:14:23.865200 #39176] INFO -- : make[1]: Entering directory '/tmp/ruby/build/trunk' I, [2024-05-14T10:14:23.865227 #39176] INFO -- : make[1]: Nothing to be done for 'enc'. I, [2024-05-14T10:14:23.865233 #39176] INFO -- : make[1]: Leaving directory '/tmp/ruby/build/trunk' I, [2024-05-14T10:14:23.865843 #39176] INFO -- : making srcs under enc I, [2024-05-14T10:14:23.897107 #39176] INFO -- : make[1]: Entering directory '/tmp/ruby/build/trunk' I, [2024-05-14T10:14:23.897128 #39176] INFO -- : make[1]: Nothing to be done for 'srcs'. I, [2024-05-14T10:14:23.897134 #39176] INFO -- : make[1]: Leaving directory '/tmp/ruby/build/trunk' I, [2024-05-14T10:14:23.898072 #39176] INFO -- : generating transdb.h I, [2024-05-14T10:14:23.994374 #39176] INFO -- : transdb.h unchanged I, [2024-05-14T10:14:23.995673 #39176] INFO -- : making trans I, [2024-05-14T10:14:24.029119 #39176] INFO -- : make[1]: Entering directory '/tmp/ruby/build/trunk' I, [2024-05-14T10:14:24.029140 #39176] INFO -- : make[1]: Nothing to be done for 'trans'. I, [2024-05-14T10:14:24.029146 #39176] INFO -- : make[1]: Leaving directory '/tmp/ruby/build/trunk' I, [2024-05-14T10:14:24.029915 #39176] INFO -- : making encs I, [2024-05-14T10:14:24.067958 #39176] INFO -- : make[1]: Entering directory '/tmp/ruby/build/trunk' I, [2024-05-14T10:14:24.067981 #39176] INFO -- : make[1]: Nothing to be done for 'encs'. I, [2024-05-14T10:14:24.067987 #39176] INFO -- : make[1]: Leaving directory '/tmp/ruby/build/trunk' I, [2024-05-14T10:14:24.069834 #39176] INFO -- : generating makefiles ext/configure-ext.mk I, [2024-05-14T10:14:24.096711 #39176] INFO -- : ext/configure-ext.mk updated I, [2024-05-14T10:14:24.099273 #39176] INFO -- : make[1]: Entering directory '/tmp/ruby/build/trunk' I, [2024-05-14T10:14:25.446343 #39176] INFO -- : make[1]: Leaving directory '/tmp/ruby/build/trunk' I, [2024-05-14T10:14:25.447055 #39176] INFO -- : generating makefile exts.mk I, [2024-05-14T10:14:25.483332 #39176] INFO -- : exts.mk unchanged I, [2024-05-14T10:14:25.487520 #39176] INFO -- : make[1]: Entering directory '/tmp/ruby/build/trunk' I, [2024-05-14T10:14:25.799480 #39176] INFO -- : make[2]: Entering directory '/tmp/ruby/build/trunk/ext/coverage' I, [2024-05-14T10:14:25.803826 #39176] INFO -- : make[2]: Leaving directory '/tmp/ruby/build/trunk/ext/coverage' I, [2024-05-14T10:14:25.810127 #39176] INFO -- : make[2]: Entering directory '/tmp/ruby/build/trunk/ext/date' I, [2024-05-14T10:14:25.815115 #39176] INFO -- : make[2]: Leaving directory '/tmp/ruby/build/trunk/ext/date' I, [2024-05-14T10:14:25.818829 #39176] INFO -- : make[2]: Entering directory '/tmp/ruby/build/trunk/ext/digest' I, [2024-05-14T10:14:25.827684 #39176] INFO -- : make[2]: Leaving directory '/tmp/ruby/build/trunk/ext/digest' I, [2024-05-14T10:14:25.854229 #39176] INFO -- : make[2]: Entering directory '/tmp/ruby/build/trunk/ext/digest/sha2' I, [2024-05-14T10:14:25.859102 #39176] INFO -- : make[2]: Leaving directory '/tmp/ruby/build/trunk/ext/digest/sha2' I, [2024-05-14T10:14:25.880326 #39176] INFO -- : make[2]: Entering directory '/tmp/ruby/build/trunk/ext/fiddle' I, [2024-05-14T10:14:25.890779 #39176] INFO -- : make[2]: Leaving directory '/tmp/ruby/build/trunk/ext/fiddle' I, [2024-05-14T10:14:25.895626 #39176] INFO -- : make[2]: Entering directory '/tmp/ruby/build/trunk/ext/io/console' I, [2024-05-14T10:14:25.899316 #39176] INFO -- : make[2]: Leaving directory '/tmp/ruby/build/trunk/ext/io/console' I, [2024-05-14T10:14:25.911944 #39176] INFO -- : make[2]: Entering directory '/tmp/ruby/build/trunk/ext/json' I, [2024-05-14T10:14:25.922436 #39176] INFO -- : make[2]: Leaving directory '/tmp/ruby/build/trunk/ext/json' I, [2024-05-14T10:14:25.937518 #39176] INFO -- : make[2]: Entering directory '/tmp/ruby/build/trunk/ext/monitor' I, [2024-05-14T10:14:25.941418 #39176] INFO -- : make[2]: Leaving directory '/tmp/ruby/build/trunk/ext/monitor' I, [2024-05-14T10:14:25.948617 #39176] INFO -- : make[2]: Entering directory '/tmp/ruby/build/trunk/ext/objspace' I, [2024-05-14T10:14:25.954755 #39176] INFO -- : make[2]: Leaving directory '/tmp/ruby/build/trunk/ext/objspace' I, [2024-05-14T10:14:25.971061 #39176] INFO -- : make[2]: Entering directory '/tmp/ruby/build/trunk/ext/openssl' I, [2024-05-14T10:14:25.989176 #39176] INFO -- : make[2]: Leaving directory '/tmp/ruby/build/trunk/ext/openssl' I, [2024-05-14T10:14:25.992859 #39176] INFO -- : make[2]: Entering directory '/tmp/ruby/build/trunk/ext/pathname' I, [2024-05-14T10:14:25.996705 #39176] INFO -- : make[2]: Leaving directory '/tmp/ruby/build/trunk/ext/pathname' I, [2024-05-14T10:14:26.003832 #39176] INFO -- : make[2]: Entering directory '/tmp/ruby/build/trunk/ext/psych' I, [2024-05-14T10:14:26.027018 #39176] INFO -- : make[2]: Leaving directory '/tmp/ruby/build/trunk/ext/psych' I, [2024-05-14T10:14:26.031837 #39176] INFO -- : make[2]: Entering directory '/tmp/ruby/build/trunk/ext/pty' I, [2024-05-14T10:14:26.035828 #39176] INFO -- : make[2]: Leaving directory '/tmp/ruby/build/trunk/ext/pty' I, [2024-05-14T10:14:26.051326 #39176] INFO -- : make[2]: Entering directory '/tmp/ruby/build/trunk/ext/ripper' I, [2024-05-14T10:14:26.059400 #39176] INFO -- : make[2]: Leaving directory '/tmp/ruby/build/trunk/ext/ripper' I, [2024-05-14T10:14:26.061784 #39176] INFO -- : make[2]: Entering directory '/tmp/ruby/build/trunk/ext/rubyvm' I, [2024-05-14T10:14:26.065068 #39176] INFO -- : make[2]: Leaving directory '/tmp/ruby/build/trunk/ext/rubyvm' I, [2024-05-14T10:14:26.078828 #39176] INFO -- : make[2]: Entering directory '/tmp/ruby/build/trunk/ext/socket' I, [2024-05-14T10:14:26.089628 #39176] INFO -- : make[2]: Leaving directory '/tmp/ruby/build/trunk/ext/socket' I, [2024-05-14T10:14:26.107721 #39176] INFO -- : make[2]: Entering directory '/tmp/ruby/build/trunk/.bundle/gems/bigdecimal-3.1.8/ext/bigdecimal' I, [2024-05-14T10:14:26.135156 #39176] INFO -- : make[2]: Leaving directory '/tmp/ruby/build/trunk/.bundle/gems/bigdecimal-3.1.8/ext/bigdecimal' I, [2024-05-14T10:14:26.137336 #39176] INFO -- : make[2]: Entering directory '/tmp/ruby/build/trunk/.bundle/gems/debug-1.9.2/ext/debug' I, [2024-05-14T10:14:26.159857 #39176] INFO -- : make[2]: Leaving directory '/tmp/ruby/build/trunk/.bundle/gems/debug-1.9.2/ext/debug' I, [2024-05-14T10:14:26.161980 #39176] INFO -- : make[2]: Entering directory '/tmp/ruby/build/trunk/.bundle/gems/nkf-0.2.0/ext/nkf' I, [2024-05-14T10:14:26.183441 #39176] INFO -- : make[2]: Leaving directory '/tmp/ruby/build/trunk/.bundle/gems/nkf-0.2.0/ext/nkf' I, [2024-05-14T10:14:26.185513 #39176] INFO -- : make[2]: Entering directory '/tmp/ruby/build/trunk/.bundle/gems/racc-1.7.3/ext/racc/cparse' I, [2024-05-14T10:14:26.206896 #39176] INFO -- : make[2]: Leaving directory '/tmp/ruby/build/trunk/.bundle/gems/racc-1.7.3/ext/racc/cparse' I, [2024-05-14T10:14:26.209202 #39176] INFO -- : make[2]: Entering directory '/tmp/ruby/build/trunk/.bundle/gems/rbs-3.4.4/ext/rbs_extension' I, [2024-05-14T10:14:26.230810 #39176] INFO -- : make[2]: Leaving directory '/tmp/ruby/build/trunk/.bundle/gems/rbs-3.4.4/ext/rbs_extension' I, [2024-05-14T10:14:26.232744 #39176] INFO -- : make[2]: Entering directory '/tmp/ruby/build/trunk/.bundle/gems/syslog-0.1.2/ext/syslog' I, [2024-05-14T10:14:26.253770 #39176] INFO -- : make[2]: Leaving directory '/tmp/ruby/build/trunk/.bundle/gems/syslog-0.1.2/ext/syslog' I, [2024-05-14T10:14:26.277109 #39176] INFO -- : make[2]: Entering directory '/tmp/ruby/build/trunk' I, [2024-05-14T10:14:26.346551 #39176] INFO -- : make[2]: 'ruby' is up to date. I, [2024-05-14T10:14:26.346591 #39176] INFO -- : make[2]: Leaving directory '/tmp/ruby/build/trunk' I, [2024-05-14T10:14:26.347008 #39176] INFO -- : make[1]: Leaving directory '/tmp/ruby/build/trunk' I, [2024-05-14T10:14:26.350809 #39176] INFO -- : make[1]: Entering directory '/tmp/ruby/build/trunk' I, [2024-05-14T10:14:26.350831 #39176] INFO -- : make[1]: Nothing to be done for 'note'. I, [2024-05-14T10:14:26.350836 #39176] INFO -- : make[1]: Leaving directory '/tmp/ruby/build/trunk' I, [2024-05-14T10:14:26.428028 #39176] INFO -- : Run options: I, [2024-05-14T10:14:26.428085 #39176] INFO -- : --seed=38669 I, [2024-05-14T10:14:26.428091 #39176] INFO -- : "--ruby=./miniruby -I/tmp/ruby/src/trunk/lib -I. -I.ext/common /tmp/ruby/src/trunk/tool/runruby.rb --extout=.ext -- --disable-gems" I, [2024-05-14T10:14:26.428095 #39176] INFO -- : --excludes-dir=/tmp/ruby/src/trunk/test/.excludes I, [2024-05-14T10:14:26.428098 #39176] INFO -- : --name=!/memory_leak/ I, [2024-05-14T10:14:26.428106 #39176] INFO -- : --stderr-on-failure I, [2024-05-14T10:14:26.428110 #39176] INFO -- : -j20 I, [2024-05-14T10:14:26.428113 #39176] INFO -- : I, [2024-05-14T10:14:26.428117 #39176] INFO -- : # Running tests: I, [2024-05-14T10:14:26.428120 #39176] INFO -- : I, [2024-05-14T10:14:26.537228 #39176] INFO -- : [ 1/885] 80536=test_system I, [2024-05-14T10:14:26.575965 #39176] INFO -- : [ 2/885] 80537=test_pkcs12 I, [2024-05-14T10:14:26.576025 #39176] INFO -- : [ 3/885] 80538=test_bigzero I, [2024-05-14T10:14:26.576036 #39176] INFO -- : [ 4/885] 80533=test_pkey_dh I, [2024-05-14T10:14:26.576043 #39176] INFO -- : [ 5/885] 80535=test_gem_package_tar_header I, [2024-05-14T10:14:26.578453 #39176] INFO -- : [ 6/885] 80534=test_iseq_load I, [2024-05-14T10:14:26.578563 #39176] INFO -- : [ 7/885] 80549=test_gem_util I, [2024-05-14T10:14:26.578843 #39176] INFO -- : [ 8/885] 80552=test_gem_config_file I, [2024-05-14T10:14:26.578928 #39176] INFO -- : [ 9/885] 80548=test_ripper I, [2024-05-14T10:14:26.579025 #39176] INFO -- : [ 10/885] 80547=test_protocol I, [2024-05-14T10:14:26.581362 #39176] INFO -- : [ 11/885] 80551=test_getopts I, [2024-05-14T10:14:26.589494 #39176] INFO -- : [ 12/885] 80551=test_gem_resolver_activation_request I, [2024-05-14T10:14:26.595282 #39176] INFO -- : [ 13/885] 80538=test_yjit_exit_locations I, [2024-05-14T10:14:26.602094 #39176] INFO -- : [ 14/885] 80538=test_etc I, [2024-05-14T10:14:26.608817 #39176] INFO -- : [ 15/885] 80550=test_yaml_tree I, [2024-05-14T10:14:26.610199 #39176] INFO -- : [ 16/885] 80542=test_libs I, [2024-05-14T10:14:26.610255 #39176] INFO -- : [ 17/885] 80540=test_gc I, [2024-05-14T10:14:26.610271 #39176] INFO -- : [ 18/885] 80541=test_gem_commands_fetch_command I, [2024-05-14T10:14:26.611174 #39176] INFO -- : [ 19/885] 80545=test_math I, [2024-05-14T10:14:26.614426 #39176] INFO -- : [ 20/885] 80544=test_sleep I, [2024-05-14T10:14:26.624429 #39176] INFO -- : [ 21/885] 80540=test_config I, [2024-05-14T10:14:26.625613 #39176] INFO -- : [ 22/885] 80539=test_autoload I, [2024-05-14T10:14:26.629534 #39176] INFO -- : [ 23/885] 80545=test_utf16 I, [2024-05-14T10:14:26.645415 #39176] INFO -- : [ 24/885] 80543=test_io I, [2024-05-14T10:14:26.646068 #39176] INFO -- : [ 25/885] 80545=test_unicode_escape I, [2024-05-14T10:14:26.652064 #39176] INFO -- : [ 26/885] 80542=test_case I, [2024-05-14T10:14:26.657752 #39176] INFO -- : [ 27/885] 80546=test_sizeof I, [2024-05-14T10:14:26.676447 #39176] INFO -- : [ 28/885] 80550=test_face I, [2024-05-14T10:14:26.708420 #39176] INFO -- : [ 29/885] 80542=test_rendering I, [2024-05-14T10:14:26.719816 #39176] INFO -- : [ 30/885] 80538=test_io_buffer I, [2024-05-14T10:14:26.727752 #39176] INFO -- : [ 31/885] 80551=ruby_parser_test I, [2024-05-14T10:14:26.731076 #39176] INFO -- : [ 32/885] 80535=test_pack I, [2024-05-14T10:14:26.734746 #39176] INFO -- : [ 33/885] 80545=test_backtrace I, [2024-05-14T10:14:26.741710 #39176] INFO -- : [ 34/885] 80533=test_gem_resolver_conflict I, [2024-05-14T10:14:26.741775 #39176] INFO -- : [ 35/885] 80535=test_rdoc_task I, [2024-05-14T10:14:26.746340 #39176] INFO -- : [ 36/885] 80550=test_rdoc_markup_indented_paragraph I, [2024-05-14T10:14:26.752009 #39176] INFO -- : [ 37/885] 80535=locals_test I, [2024-05-14T10:14:26.778448 #39176] INFO -- : [ 38/885] 80551=test_rdoc_require I, [2024-05-14T10:14:26.790850 #39176] INFO -- : [ 39/885] 80542=test_gem_commands_install_command I, [2024-05-14T10:14:26.833471 #39176] INFO -- : [ 40/885] 80538=test_clone I, [2024-05-14T10:14:26.833802 #39176] INFO -- : [ 41/885] 80552=test_readpartial I, [2024-05-14T10:14:26.848529 #39176] INFO -- : [ 42/885] 80540=test_fstring I, [2024-05-14T10:14:26.854845 #39176] INFO -- : [ 43/885] 80533=test_array I, [2024-05-14T10:14:26.873751 #39176] INFO -- : [ 44/885] 80533=test_optparse I, [2024-05-14T10:14:26.886002 #39176] INFO -- : [ 45/885] 80548=test_rat I, [2024-05-14T10:14:26.891148 #39176] INFO -- : [ 46/885] 80548=test_webauthn_poller I, [2024-05-14T10:14:26.896960 #39176] INFO -- : [ 47/885] 80547=test_rdoc_markup_raw I, [2024-05-14T10:14:26.902170 #39176] INFO -- : [ 48/885] 80549=test_rdoc_markup_to_html_crossref I, [2024-05-14T10:14:26.904900 #39176] INFO -- : [ 49/885] 80551=test_typeddata I, [2024-05-14T10:14:26.910583 #39176] INFO -- : [ 50/885] 80550=test_gem_resolver_best_set I, [2024-05-14T10:14:26.927816 #39176] INFO -- : [ 51/885] 80533=encoding_test I, [2024-05-14T10:14:26.992849 #39176] INFO -- : [ 52/885] 80538=test_stringscanner I, [2024-05-14T10:14:26.996427 #39176] INFO -- : [ 53/885] 80540=test_files_sample I, [2024-05-14T10:14:27.004660 #39176] INFO -- : [ 54/885] 80541=test_convertible I, [2024-05-14T10:14:27.019186 #39176] INFO -- : [ 55/885] 80538=parser_test I, [2024-05-14T10:14:27.019680 #39176] INFO -- : [ 56/885] 80547=test_rdoc_alias I, [2024-05-14T10:14:27.050841 #39176] INFO -- : [ 57/885] 80533=test_yield I, [2024-05-14T10:14:27.077523 #39176] INFO -- : [ 58/885] 80535=test_objspace I, [2024-05-14T10:14:27.081808 #39176] INFO -- : [ 59/885] 80547=ripper_test I, [2024-05-14T10:14:27.094927 #39176] INFO -- : [ 60/885] 80538=test_line_editor I, [2024-05-14T10:14:27.098734 #39176] INFO -- : [ 61/885] 80551=test_undef I, [2024-05-14T10:14:27.103466 #39176] INFO -- : [ 62/885] 80551=test_gem_security_trust_dir I, [2024-05-14T10:14:27.118591 #39176] INFO -- : [ 63/885] 80540=test_string_memory I, [2024-05-14T10:14:27.140442 #39176] INFO -- : [ 64/885] 80551=test_gem_requirement I, [2024-05-14T10:14:27.153392 #39176] INFO -- : [ 65/885] 80540=test_sprintf I, [2024-05-14T10:14:27.170499 #39176] INFO -- : [ 66/885] 80538=comments_test I, [2024-05-14T10:14:27.176956 #39176] INFO -- : [ 67/885] 80538=test_show_source I, [2024-05-14T10:14:27.180297 #39176] INFO -- : [ 68/885] 80537=test_set I, [2024-05-14T10:14:27.198648 #39176] INFO -- : [ 69/885] 80550=test_gem_commands_stale_command I, [2024-05-14T10:14:27.206189 #39176] INFO -- : [ 70/885] 80537=test_lock_native_thread I, [2024-05-14T10:14:27.218318 #39176] INFO -- : [ 71/885] 80550=test_c_struct_entry I, [2024-05-14T10:14:27.227326 #39176] INFO -- : [ 72/885] 80551=test_have_library I, [2024-05-14T10:14:27.235026 #39176] INFO -- : [ 73/885] 80548=test_remote_fetch_error I, [2024-05-14T10:14:27.239186 #39176] INFO -- : [ 74/885] 80552=test_hash I, [2024-05-14T10:14:27.243715 #39176] INFO -- : [ 75/885] 80548=test_gem_resolver_dependency_request I, [2024-05-14T10:14:27.260665 #39176] INFO -- : [ 76/885] 80538=test_tree_builder I, [2024-05-14T10:14:27.260795 #39176] INFO -- : [ 77/885] 80549=test_external_new I, [2024-05-14T10:14:27.266388 #39176] INFO -- : [ 78/885] 80549=test_alias_and_anchor I, [2024-05-14T10:14:27.270773 #39176] INFO -- : [ 79/885] 80552=test_postponed_job I, [2024-05-14T10:14:27.271270 #39176] INFO -- : [ 80/885] 80548=test_raise_exception I, [2024-05-14T10:14:27.285644 #39176] INFO -- : [ 81/885] 80538=test_gem_request_set_lockfile I, [2024-05-14T10:14:27.287181 #39176] INFO -- : [ 82/885] 80549=test_win32ole_typelib I, [2024-05-14T10:14:27.288158 #39176] INFO -- : [ 83/885] 80534=test_protect I, [2024-05-14T10:14:27.289933 #39176] INFO -- : [ 84/885] 80549=test_weakmap I, [2024-05-14T10:14:27.292764 #39176] INFO -- : [ 85/885] 80534=test_workspace I, [2024-05-14T10:14:27.384671 #39176] INFO -- : [ 86/885] 80536=test_yjit I, [2024-05-14T10:14:27.391685 #39176] INFO -- : [ 87/885] 80536=test_ws I, [2024-05-14T10:14:27.420449 #39176] INFO -- : [ 88/885] 80536=test_m17n I, [2024-05-14T10:14:27.429012 #39176] INFO -- : [ 89/885] 80540=test_gem_commands_environment_command I, [2024-05-14T10:14:27.435543 #39176] INFO -- : [ 90/885] 80550=test_argf I, [2024-05-14T10:14:27.464552 #39176] INFO -- : [ 91/885] 80537=test_framework I, [2024-05-14T10:14:27.473846 #39176] INFO -- : [ 92/885] 80540=test_ns_spki I, [2024-05-14T10:14:27.480061 #39176] INFO -- : [ 93/885] 80537=test_kill_ring I, [2024-05-14T10:14:27.482874 #39176] INFO -- : [ 94/885] 80536=test_console_attr I, [2024-05-14T10:14:27.483907 #39176] INFO -- : [ 95/885] 80536=test_summary I, [2024-05-14T10:14:27.498893 #39176] INFO -- : [ 96/885] 80540=test_type_completor I, [2024-05-14T10:14:27.502721 #39176] INFO -- : [ 97/885] 80540=test_gem_commands_exec_command I, [2024-05-14T10:14:27.530198 #39176] INFO -- : [ 98/885] 80534=test_io_wait I, [2024-05-14T10:14:27.530255 #39176] INFO -- : [ 99/885] 80537=test_kwargs I, [2024-05-14T10:14:27.533345 #39176] INFO -- : [100/885] 80537=warnings_test I, [2024-05-14T10:14:27.592994 #39176] INFO -- : [101/885] 80537=test_ellipsize I, [2024-05-14T10:14:27.605130 #39176] INFO -- : [102/885] 80537=test_date_attr I, [2024-05-14T10:14:27.607624 #39176] INFO -- : [103/885] 80537=test_io I, [2024-05-14T10:14:27.612729 #39176] INFO -- : [104/885] 80536=test_emoji I, [2024-05-14T10:14:27.627057 #39176] INFO -- : [105/885] 80552=test_win32ole_type_event I, [2024-05-14T10:14:27.631723 #39176] INFO -- : [106/885] 80552=test_sorted_set I, [2024-05-14T10:14:27.633390 #39176] INFO -- : [107/885] 80536=test_hash I, [2024-05-14T10:14:27.672696 #39176] INFO -- : [108/885] 80547=test_ubf_async_safe I, [2024-05-14T10:14:27.679502 #39176] INFO -- : [109/885] 80547=test_gem_unsatisfiable_dependency_error I, [2024-05-14T10:14:27.728632 #39176] INFO -- : [110/885] 80538=test_win32ole_record I, [2024-05-14T10:14:27.731026 #39176] INFO -- : [111/885] 80538=test_cp949 I, [2024-05-14T10:14:27.733187 #39176] INFO -- : [112/885] 80538=test_condition I, [2024-05-14T10:14:27.734831 #39176] INFO -- : [113/885] 80538=test_foreach I, [2024-05-14T10:14:27.738059 #39176] INFO -- : [114/885] 80538=test_gem_source_specific_file I, [2024-05-14T10:14:27.785219 #39176] INFO -- : [115/885] 80538=test_gem_commands_uninstall_command I, [2024-05-14T10:14:27.819922 #39176] INFO -- : [116/885] 80552=test_rdoc_rubygems_hook I, [2024-05-14T10:14:27.867365 #39176] INFO -- : [117/885] 80537=test_method I, [2024-05-14T10:14:27.870406 #39176] INFO -- : [118/885] 80534=test_gem_commands_query_command I, [2024-05-14T10:14:27.904641 #39176] INFO -- : [119/885] 80547=test_gem_impossible_dependencies_error I, [2024-05-14T10:14:27.906147 #39176] INFO -- : [120/885] 80547=test_pack I, [2024-05-14T10:14:27.995179 #39176] INFO -- : [121/885] 80545=test_array_create I, [2024-05-14T10:14:28.006059 #39176] INFO -- : [122/885] 80545=test_to_ruby I, [2024-05-14T10:14:28.009837 #39176] INFO -- : [123/885] 80548=test_pattern_key_name_check I, [2024-05-14T10:14:28.014873 #39176] INFO -- : [124/885] 80548=test_ftp I, [2024-05-14T10:14:28.026171 #39176] INFO -- : [125/885] 80545=test_euc_kr I, [2024-05-14T10:14:28.033450 #39176] INFO -- : [126/885] 80545=test_rdoc_context_section I, [2024-05-14T10:14:28.039513 #39176] INFO -- : [127/885] 80548=test_gem_installer I, [2024-05-14T10:14:28.061965 #39176] INFO -- : [128/885] 80552=test_yamlstore I, [2024-05-14T10:14:28.074218 #39176] INFO -- : [129/885] 80552=test_date_strftime I, [2024-05-14T10:14:28.146312 #39176] INFO -- : [130/885] 80547=test_rdoc_parser_rd I, [2024-05-14T10:14:28.177331 #39176] INFO -- : [131/885] 80547=test_irb I, [2024-05-14T10:14:28.200659 #39176] INFO -- : [132/885] 80545=test_asn1 I, [2024-05-14T10:14:28.270217 #39176] INFO -- : [133/885] 80545=test_random I, [2024-05-14T10:14:28.270644 #39176] INFO -- : [134/885] 80545=test_load I, [2024-05-14T10:14:28.282777 #39176] INFO -- : [135/885] 80545=json_string_matching_test I, [2024-05-14T10:14:28.303367 #39176] INFO -- : [136/885] 80545=test_const I, [2024-05-14T10:14:28.305596 #39176] INFO -- : [137/885] 80545=test_rdoc_normal_class I, [2024-05-14T10:14:28.371097 #39176] INFO -- : [138/885] 80540=test_class I, [2024-05-14T10:14:28.405145 #39176] INFO -- : [139/885] 80538=test_noarg I, [2024-05-14T10:14:28.406842 #39176] INFO -- : [140/885] 80542=parse_comments_test I, [2024-05-14T10:14:28.411435 #39176] INFO -- : [141/885] 80551=test_tempfile I, [2024-05-14T10:14:28.429730 #39176] INFO -- : [142/885] 80545=test_queue I, [2024-05-14T10:14:28.436369 #39176] INFO -- : [143/885] 80545=test_function I, [2024-05-14T10:14:28.474492 #39176] INFO -- : [144/885] 80552=test_gem_resolver_index_specification I, [2024-05-14T10:14:28.483065 #39176] INFO -- : [145/885] 80542=test_internal_ivar I, [2024-05-14T10:14:28.487287 #39176] INFO -- : [146/885] 80542=test_prettyprint I, [2024-05-14T10:14:28.500462 #39176] INFO -- : [147/885] 80542=test_tracepoint I, [2024-05-14T10:14:28.527795 #39176] INFO -- : [148/885] 80547=test_rdoc_markup I, [2024-05-14T10:14:28.531891 #39176] INFO -- : [149/885] 80547=test_gem_commands_help_command I, [2024-05-14T10:14:28.546677 #39176] INFO -- : [150/885] 80538=test_duplicate I, [2024-05-14T10:14:28.548882 #39176] INFO -- : [151/885] 80552=test_basicsocket I, [2024-05-14T10:14:28.550178 #39176] INFO -- : [152/885] 80538=test_utf32 I, [2024-05-14T10:14:28.555530 #39176] INFO -- : [153/885] 80552=test_too_many_dummy_encodings I, [2024-05-14T10:14:28.572209 #39176] INFO -- : [154/885] 80538=test_gem_commands_list_command I, [2024-05-14T10:14:28.576600 #39176] INFO -- : [155/885] 80538=test_stack I, [2024-05-14T10:14:28.631141 #39176] INFO -- : [156/885] 80547=test_rdoc_include I, [2024-05-14T10:14:28.631356 #39176] INFO -- : [157/885] 80552=test_reqarg I, [2024-05-14T10:14:28.663041 #39176] INFO -- : [158/885] 80545=test_ldap I, [2024-05-14T10:14:28.668144 #39176] INFO -- : [159/885] 80547=test_gem_commands_signin_command I, [2024-05-14T10:14:28.669990 #39176] INFO -- : [160/885] 80544=test_resource I, [2024-05-14T10:14:28.672289 #39176] INFO -- : [161/885] 80551=test_emitter I, [2024-05-14T10:14:28.677760 #39176] INFO -- : [162/885] 80545=test_fileutils I, [2024-05-14T10:14:28.696700 #39176] INFO -- : [163/885] 80544=test_string_processing I, [2024-05-14T10:14:28.701119 #39176] INFO -- : [164/885] 80551=test_cesu8 I, [2024-05-14T10:14:28.704746 #39176] INFO -- : [165/885] 80551=test_econv I, [2024-05-14T10:14:28.716317 #39176] INFO -- : [166/885] 80534=test_rdoc_options I, [2024-05-14T10:14:28.745113 #39176] INFO -- : [167/885] 80547=test_gem_version I, [2024-05-14T10:14:28.747014 #39176] INFO -- : [168/885] 80544=test_path_to_class I, [2024-05-14T10:14:28.749690 #39176] INFO -- : [169/885] 80544=test_gem_dependency I, [2024-05-14T10:14:28.760909 #39176] INFO -- : [170/885] 80542=test_gem_resolver_specification I, [2024-05-14T10:14:28.787176 #39176] INFO -- : [171/885] 80542=test_rdoc_markup_verbatim I, [2024-05-14T10:14:28.808976 #39176] INFO -- : [172/885] 80547=test_inlinecache I, [2024-05-14T10:14:28.827717 #39176] INFO -- : [173/885] 80542=test_complex I, [2024-05-14T10:14:28.864545 #39176] INFO -- : [174/885] 80547=test_gem_commands_search_command I, [2024-05-14T10:14:28.870865 #39176] INFO -- : [175/885] 80547=test_frozen_error I, [2024-05-14T10:14:28.874726 #39176] INFO -- : [176/885] 80547=test_method_cache I, [2024-05-14T10:14:28.880250 #39176] INFO -- : [177/885] 80547=test_gem_stub_specification I, [2024-05-14T10:14:28.964235 #39176] INFO -- : [178/885] 80542=test_gem_ext_ext_conf_builder I, [2024-05-14T10:14:28.995836 #39176] INFO -- : [179/885] 80547=test_gem_resolver_installed_specification I, [2024-05-14T10:14:29.023206 #39176] INFO -- : [180/885] 80547=test_scanner_events I, [2024-05-14T10:14:29.055132 #39176] INFO -- : [181/885] 80547=test_gem_remote_fetcher I, [2024-05-14T10:14:29.094834 #39176] INFO -- : [182/885] 80552=test_parse I, [2024-05-14T10:14:29.105888 #39176] INFO -- : [183/885] 80544=test_mdns I, [2024-05-14T10:14:29.109468 #39176] INFO -- : [184/885] 80544=test_handle I, [2024-05-14T10:14:29.211542 #39176] INFO -- : [185/885] 80549=test_wait I, [2024-05-14T10:14:29.215321 #39176] INFO -- : [186/885] 80534=test_forwardable I, [2024-05-14T10:14:29.217381 #39176] INFO -- : [187/885] 80545=test_yaml I, [2024-05-14T10:14:29.232104 #39176] INFO -- : [188/885] 80533=test_big2str I, [2024-05-14T10:14:29.236616 #39176] INFO -- : [189/885] 80534=test_ansi_without_terminfo I, [2024-05-14T10:14:29.238599 #39176] INFO -- : [190/885] 80533=test_gem_commands_sources_command I, [2024-05-14T10:14:29.253882 #39176] INFO -- : [191/885] 80534=test_ractor I, [2024-05-14T10:14:29.268298 #39176] INFO -- : [192/885] 80534=test_euc_tw I, [2024-05-14T10:14:29.270587 #39176] INFO -- : [193/885] 80534=test_bmethod I, [2024-05-14T10:14:29.276213 #39176] INFO -- : [194/885] 80534=test_rdoc_markup_formatter I, [2024-05-14T10:14:29.288335 #39176] INFO -- : [195/885] 80549=test_thread_queue I, [2024-05-14T10:14:29.292348 #39176] INFO -- : [196/885] 80534=test_nowrite I, [2024-05-14T10:14:29.293330 #39176] INFO -- : [197/885] 80544=test_rdoc_parser_c I, [2024-05-14T10:14:29.317022 #39176] INFO -- : [198/885] 80534=test_comparable I, [2024-05-14T10:14:29.328976 #39176] INFO -- : [199/885] 80534=json_fixtures_test I, [2024-05-14T10:14:29.337807 #39176] INFO -- : [200/885] 80545=test_shapes I, [2024-05-14T10:14:29.340492 #39176] INFO -- : [201/885] 80534=test_io_timeout I, [2024-05-14T10:14:29.343067 #39176] INFO -- : [202/885] 80545=test_profile_frames I, [2024-05-14T10:14:29.348056 #39176] INFO -- : [203/885] 80534=test_cstr I, [2024-05-14T10:14:29.399100 #39176] INFO -- : [204/885] 80533=test_pstore I, [2024-05-14T10:14:29.453137 #39176] INFO -- : [205/885] 80533=test_enc_str_buf_cat I, [2024-05-14T10:14:29.456436 #39176] INFO -- : [206/885] 80533=test_class2name I, [2024-05-14T10:14:29.459981 #39176] INFO -- : [207/885] 80533=test_gbk I, [2024-05-14T10:14:29.465074 #39176] INFO -- : [208/885] 80533=test_require I, [2024-05-14T10:14:29.503529 #39176] INFO -- : [209/885] 80538=test_cgi_util I, [2024-05-14T10:14:29.521144 #39176] INFO -- : [210/885] 80545=test_gem_commands_contents_command I, [2024-05-14T10:14:29.632774 #39176] INFO -- : [211/885] 80552=test_gem_ext_cmake_builder I, [2024-05-14T10:14:29.640680 #39176] INFO -- : [212/885] 80544=test_digest I, [2024-05-14T10:14:29.652445 #39176] INFO -- : [213/885] 80552=test_marshalable I, [2024-05-14T10:14:29.663815 #39176] INFO -- : [214/885] 80552=test_find I, [2024-05-14T10:14:29.677830 #39176] INFO -- : [215/885] 80552=test_ractor I, [2024-05-14T10:14:29.708996 #39176] INFO -- : [216/885] 80538=test_wss I, [2024-05-14T10:14:29.728309 #39176] INFO -- : [217/885] 80538=test_fiddle I, [2024-05-14T10:14:29.754681 #39176] INFO -- : [218/885] 80545=test_file I, [2024-05-14T10:14:29.755458 #39176] INFO -- : [219/885] 80545=test_modify_expand I, [2024-05-14T10:14:29.756713 #39176] INFO -- : [220/885] 80551=test_rdoc_any_method I, [2024-05-14T10:14:29.767012 #39176] INFO -- : [221/885] 80545=test_gem_available_set I, [2024-05-14T10:14:29.776710 #39176] INFO -- : [222/885] 80552=test_rdoc_markdown I, [2024-05-14T10:14:29.777695 #39176] INFO -- : [223/885] 80538=test_pathname I, [2024-05-14T10:14:29.778224 #39176] INFO -- : [224/885] 80546=test_init I, [2024-05-14T10:14:29.873334 #39176] INFO -- : [225/885] 80545=test_complexrational I, [2024-05-14T10:14:29.880980 #39176] INFO -- : [226/885] 80545=test_gem_package_tar_reader I, [2024-05-14T10:14:29.914333 #39176] INFO -- : [227/885] 80545=regexp_test I, [2024-05-14T10:14:29.954724 #39176] INFO -- : [228/885] 80552=test_coverage I, [2024-05-14T10:14:29.966549 #39176] INFO -- : [229/885] 80538=test_rdoc_encoding I, [2024-05-14T10:14:29.989201 #39176] INFO -- : [230/885] 80545=test_recorder I, [2024-05-14T10:14:29.991639 #39176] INFO -- : [231/885] 80545=test_gem_commands_owner_command I, [2024-05-14T10:14:30.002663 #39176] INFO -- : [232/885] 80534=test_gem_source_vendor I, [2024-05-14T10:14:30.012199 #39176] INFO -- : [233/885] 80534=test_bash_completion I, [2024-05-14T10:14:30.021536 #39176] INFO -- : [234/885] 80534=test_formatter I, [2024-05-14T10:14:30.025374 #39176] INFO -- : [235/885] 80534=test_rdoc_constant I, [2024-05-14T10:14:30.116678 #39176] INFO -- : [236/885] 80542=test_deprecate I, [2024-05-14T10:14:30.125358 #39176] INFO -- : [237/885] 80538=test_rdoc_cross_reference I, [2024-05-14T10:14:30.149577 #39176] INFO -- : [238/885] 80534=test_scalar I, [2024-05-14T10:14:30.153161 #39176] INFO -- : [239/885] 80542=test_gem_dependency_installer I, [2024-05-14T10:14:30.158608 #39176] INFO -- : [240/885] 80534=test_gem_commands_info_command I, [2024-05-14T10:14:30.177844 #39176] INFO -- : [241/885] 80534=test_case_options I, [2024-05-14T10:14:30.183657 #39176] INFO -- : [242/885] 80534=test_store I, [2024-05-14T10:14:30.218148 #39176] INFO -- : [243/885] 80546=test_exception I, [2024-05-14T10:14:30.220275 #39176] INFO -- : [244/885] 80551=test_bug_reporter I, [2024-05-14T10:14:30.301777 #39176] INFO -- : [245/885] 80534=test_rand I, [2024-05-14T10:14:30.348638 #39176] INFO -- : [246/885] 80540=test_gem_name_tuple I, [2024-05-14T10:14:30.367404 #39176] INFO -- : [247/885] 80540=test_gem_package_tar_reader_entry I, [2024-05-14T10:14:30.387819 #39176] INFO -- : [248/885] 80544=test_gem_ext_cargo_builder_link_flag_converter I, [2024-05-14T10:14:30.425770 #39176] INFO -- : [249/885] 80544=test_gem_commands_mirror I, [2024-05-14T10:14:30.429756 #39176] INFO -- : [250/885] 80544=test_gem_request I, [2024-05-14T10:14:30.452155 #39176] INFO -- : [251/885] 80538=test_method_cache I, [2024-05-14T10:14:30.456966 #39176] INFO -- : [252/885] 80538=test_sprintf_comb I, [2024-05-14T10:14:30.508009 #39176] INFO -- : [253/885] 80534=test_generic I, [2024-05-14T10:14:30.512054 #39176] INFO -- : [254/885] 80540=test_win32ole I, [2024-05-14T10:14:30.515039 #39176] INFO -- : [255/885] 80540=test_scan_args I, [2024-05-14T10:14:30.522054 #39176] INFO -- : [256/885] 80540=test_enumerator_kw I, [2024-05-14T10:14:30.527287 #39176] INFO -- : [257/885] 80540=test_settracefunc I, [2024-05-14T10:14:30.551506 #39176] INFO -- : [258/885] 80534=test_gem_text I, [2024-05-14T10:14:30.581426 #39176] INFO -- : [259/885] 80545=test_pkey I, [2024-05-14T10:14:30.581789 #39176] INFO -- : [260/885] 80544=test_case I, [2024-05-14T10:14:30.583130 #39176] INFO -- : [261/885] 80544=test_reline I, [2024-05-14T10:14:30.599152 #39176] INFO -- : [262/885] 80534=test_parser_events I, [2024-05-14T10:14:30.612650 #39176] INFO -- : [263/885] 80538=test_cclass I, [2024-05-14T10:14:30.628222 #39176] INFO -- : [264/885] 80545=test_gem_request_connection_pools I, [2024-05-14T10:14:30.644973 #39176] INFO -- : [265/885] 80551=test_gem_version_option I, [2024-05-14T10:14:30.661039 #39176] INFO -- : [266/885] 80552=test_grapheme_breaks I, [2024-05-14T10:14:30.661135 #39176] INFO -- : [267/885] 80538=test_m17n_comb I, [2024-05-14T10:14:30.669643 #39176] INFO -- : [268/885] 80534=test_memory_view I, [2024-05-14T10:14:30.683174 #39176] INFO -- : [269/885] 80551=test_ractor I, [2024-05-14T10:14:30.691774 #39176] INFO -- : [270/885] 80552=test_rdoc_generator_pot_po I, [2024-05-14T10:14:30.699608 #39176] INFO -- : [271/885] 80552=test_ansi_with_terminfo I, [2024-05-14T10:14:30.705266 #39176] INFO -- : [272/885] 80533=test_json_tree I, [2024-05-14T10:14:30.710421 #39176] INFO -- : [273/885] 80533=test_rdoc_markup_to_markdown I, [2024-05-14T10:14:30.740039 #39176] INFO -- : [274/885] 80551=test_severity I, [2024-05-14T10:14:30.744308 #39176] INFO -- : [275/885] 80552=test_ractor I, [2024-05-14T10:14:30.749166 #39176] INFO -- : [276/885] 80551=test_require_lib I, [2024-05-14T10:14:30.758756 #39176] INFO -- : [277/885] 80552=parse_test I, [2024-05-14T10:14:30.845892 #39176] INFO -- : [278/885] 80534=test_gem_install_update_options I, [2024-05-14T10:14:30.861154 #39176] INFO -- : [279/885] 80533=test_gem_stream_ui I, [2024-05-14T10:14:30.885397 #39176] INFO -- : [280/885] 80544=test_extlibs I, [2024-05-14T10:14:30.938102 #39176] INFO -- : [281/885] 80533=test_rdoc_generator_ri I, [2024-05-14T10:14:30.944550 #39176] INFO -- : [282/885] 80533=test_literal I, [2024-05-14T10:14:30.969323 #39176] INFO -- : [283/885] 80547=test_str2big I, [2024-05-14T10:14:30.972365 #39176] INFO -- : [284/885] 80534=test_c_struct_builder I, [2024-05-14T10:14:30.973157 #39176] INFO -- : [285/885] 80547=test_dot_dot I, [2024-05-14T10:14:30.983606 #39176] INFO -- : [286/885] 80547=test_rdoc_markup_to_table_of_contents I, [2024-05-14T10:14:31.019746 #39176] INFO -- : [287/885] 80547=test_socket I, [2024-05-14T10:14:31.056611 #39176] INFO -- : [288/885] 80534=test_thread I, [2024-05-14T10:14:31.094584 #39176] INFO -- : [289/885] 80536=test_objectspace I, [2024-05-14T10:14:31.151144 #39176] INFO -- : [290/885] 80537=test_securerandom I, [2024-05-14T10:14:31.200314 #39176] INFO -- : [291/885] 80537=test_c_union_entity I, [2024-05-14T10:14:31.228662 #39176] INFO -- : [292/885] 80537=test_rdoc_normal_module I, [2024-05-14T10:14:31.270388 #39176] INFO -- : [293/885] 80534=test_rdoc_markdown_test I, [2024-05-14T10:14:31.366485 #39176] INFO -- : [294/885] 80533=test_logperiod I, [2024-05-14T10:14:31.377231 #39176] INFO -- : [295/885] 80533=test_io_console I, [2024-05-14T10:14:31.478285 #39176] INFO -- : [296/885] 80546=test_singleton I, [2024-05-14T10:14:31.480886 #39176] INFO -- : [297/885] 80537=test_flush I, [2024-05-14T10:14:31.481316 #39176] INFO -- : [298/885] 80537=test_switch_hitter I, [2024-05-14T10:14:31.488883 #39176] INFO -- : [299/885] 80546=test_uncorrectable_name_check I, [2024-05-14T10:14:31.495343 #39176] INFO -- : [300/885] 80537=newline_test I, [2024-05-14T10:14:31.499517 #39176] INFO -- : [301/885] 80546=test_hash_create I, [2024-05-14T10:14:31.500951 #39176] INFO -- : [302/885] 80539=test_stringchar I, [2024-05-14T10:14:31.501979 #39176] INFO -- : [303/885] 80546=test_passing_block I, [2024-05-14T10:14:31.504992 #39176] INFO -- : [304/885] 80546=test_thread_fd_close I, [2024-05-14T10:14:31.508118 #39176] INFO -- : [305/885] 80546=test_process I, [2024-05-14T10:14:31.556488 #39176] INFO -- : [306/885] 80540=test_last_thread I, [2024-05-14T10:14:31.572769 #39176] INFO -- : [307/885] 80537=test_pack I, [2024-05-14T10:14:31.617736 #39176] INFO -- : [308/885] 80539=test_gem_security_policy I, [2024-05-14T10:14:31.620059 #39176] INFO -- : [309/885] 80550=test_gem_source_local I, [2024-05-14T10:14:31.668443 #39176] INFO -- : [310/885] 80545=test_gem_ext_rake_builder I, [2024-05-14T10:14:31.730730 #39176] INFO -- : [311/885] 80537=test_arity I, [2024-05-14T10:14:31.737130 #39176] INFO -- : [312/885] 80537=test_logdevice I, [2024-05-14T10:14:31.791186 #39176] INFO -- : [313/885] 80550=test_err_in_callback I, [2024-05-14T10:14:31.795083 #39176] INFO -- : [314/885] 80550=test_gem_resolver_lock_specification I, [2024-05-14T10:14:31.821956 #39176] INFO -- : [315/885] 80550=test_gc I, [2024-05-14T10:14:31.852702 #39176] INFO -- : [316/885] 80541=test_x509cert I, [2024-05-14T10:14:31.936746 #39176] INFO -- : [317/885] 80536=test_shift_jis I, [2024-05-14T10:14:31.939150 #39176] INFO -- : [318/885] 80536=test_gem_commands_which_command I, [2024-05-14T10:14:31.945182 #39176] INFO -- : [319/885] 80539=test_http I, [2024-05-14T10:14:31.961660 #39176] INFO -- : [320/885] 80539=test_enumerator I, [2024-05-14T10:14:32.121507 #39176] INFO -- : [321/885] 80541=test_inadvertent_creation I, [2024-05-14T10:14:32.142137 #39176] INFO -- : [322/885] 80536=test_flags I, [2024-05-14T10:14:32.229629 #39176] INFO -- : [323/885] 80547=test_gem_commands_specification_command I, [2024-05-14T10:14:32.255048 #39176] INFO -- : [324/885] 80541=test_gem_commands_dependency_command I, [2024-05-14T10:14:32.267470 #39176] INFO -- : [325/885] 80542=test_safe_load I, [2024-05-14T10:14:32.275963 #39176] INFO -- : [326/885] 80542=test_gem_resolver_composed_set I, [2024-05-14T10:14:32.286522 #39176] INFO -- : [327/885] 80542=test_gem_resolver I, [2024-05-14T10:14:32.335780 #39176] INFO -- : [328/885] 80541=test_name_error I, [2024-05-14T10:14:32.345540 #39176] INFO -- : [329/885] 80547=test_rdoc_markup_attribute_manager I, [2024-05-14T10:14:32.367774 #39176] INFO -- : [330/885] 80547=test_httpresponse I, [2024-05-14T10:14:32.391019 #39176] INFO -- : [331/885] 80545=test_open-uri I, [2024-05-14T10:14:32.426992 #39176] INFO -- : [332/885] 80547=test_rdoc_parser_ruby I, [2024-05-14T10:14:32.454542 #39176] INFO -- : [333/885] 80541=test_rdoc_context I, [2024-05-14T10:14:32.477869 #39176] INFO -- : [334/885] 80542=test_stream I, [2024-05-14T10:14:32.483091 #39176] INFO -- : [335/885] 80542=test_nil2vtempty I, [2024-05-14T10:14:32.487509 #39176] INFO -- : [336/885] 80542=test_iso_8859 I, [2024-05-14T10:14:32.498120 #39176] INFO -- : [337/885] 80537=test_tcp I, [2024-05-14T10:14:32.515291 #39176] INFO -- : [338/885] 80542=test_rdoc_text I, [2024-05-14T10:14:32.516272 #39176] INFO -- : [339/885] 80537=test_gem_safe_yaml I, [2024-05-14T10:14:32.577587 #39176] INFO -- : [340/885] 80544=test_syntax I, [2024-05-14T10:14:32.578742 #39176] INFO -- : [341/885] 80542=test_date_new I, [2024-05-14T10:14:32.591904 #39176] INFO -- : [342/885] 80542=index_write_test I, [2024-05-14T10:14:32.593239 #39176] INFO -- : [343/885] 80534=test_data I, [2024-05-14T10:14:32.595882 #39176] INFO -- : [344/885] 80542=test_rdoc_markup_to_joined_paragraph I, [2024-05-14T10:14:32.599159 #39176] INFO -- : [345/885] 80542=test_date_time I, [2024-05-14T10:14:32.603429 #39176] INFO -- : [346/885] 80534=test_require I, [2024-05-14T10:14:32.607038 #39176] INFO -- : [347/885] 80534=test_files_ext I, [2024-05-14T10:14:32.612223 #39176] INFO -- : [348/885] 80542=test_bug-5832 I, [2024-05-14T10:14:32.617224 #39176] INFO -- : [349/885] 80548=test_emitter I, [2024-05-14T10:14:32.617932 #39176] INFO -- : [350/885] 80540=test_gem_silent_ui I, [2024-05-14T10:14:32.619931 #39176] INFO -- : [351/885] 80542=test_gem_doctor I, [2024-05-14T10:14:32.627096 #39176] INFO -- : [352/885] 80548=test_kdf I, [2024-05-14T10:14:32.656452 #39176] INFO -- : [353/885] 80540=test_kernel I, [2024-05-14T10:14:32.664551 #39176] INFO -- : [354/885] 80542=dispatcher_test I, [2024-05-14T10:14:32.682965 #39176] INFO -- : [355/885] 80542=test_eval_history I, [2024-05-14T10:14:32.697072 #39176] INFO -- : [356/885] 80548=test_psych I, [2024-05-14T10:14:32.701043 #39176] INFO -- : [357/885] 80542=test_enc_raise I, [2024-05-14T10:14:32.708319 #39176] INFO -- : [358/885] 80542=!Nothing_to_test I, [2024-05-14T10:14:32.709213 #39176] INFO -- : [359/885] 80542=test_rdoc_markup_paragraph I, [2024-05-14T10:14:32.714982 #39176] INFO -- : [360/885] 80548=test_object_create_start I, [2024-05-14T10:14:32.719991 #39176] INFO -- : [361/885] 80548=test_command I, [2024-05-14T10:14:32.720697 #39176] INFO -- : [362/885] 80542=test_at_exit I, [2024-05-14T10:14:32.722304 #39176] INFO -- : [363/885] 80537=test_date I, [2024-05-14T10:14:32.728466 #39176] INFO -- : [364/885] 80537=test_gem_rdoc I, [2024-05-14T10:14:32.740079 #39176] INFO -- : [365/885] 80542=test_gem_ext_cargo_builder_unit I, [2024-05-14T10:14:32.747327 #39176] INFO -- : [366/885] 80534=test_rdoc_markup_to_tt_only I, [2024-05-14T10:14:32.762748 #39176] INFO -- : [367/885] 80542=test_hmac I, [2024-05-14T10:14:32.772366 #39176] INFO -- : [368/885] 80534=test_rdoc_tom_doc I, [2024-05-14T10:14:32.777491 #39176] INFO -- : [369/885] 80542=test_numeric I, [2024-05-14T10:14:32.792981 #39176] INFO -- : [370/885] 80534=test_ifunless I, [2024-05-14T10:14:32.797045 #39176] INFO -- : [371/885] 80534=test_assignment I, [2024-05-14T10:14:32.866708 #39176] INFO -- : [372/885] 80542=test_gem_commands_lock_command I, [2024-05-14T10:14:32.876051 #39176] INFO -- : [373/885] 80545=test_gem_command I, [2024-05-14T10:14:32.892026 #39176] INFO -- : [374/885] 80537=test_bug-3571 I, [2024-05-14T10:14:32.897686 #39176] INFO -- : [375/885] 80542=test_key_actor_vi I, [2024-05-14T10:14:32.908619 #39176] INFO -- : [376/885] 80543=test_common I, [2024-05-14T10:14:32.912575 #39176] INFO -- : [377/885] 80537=test_gem_spec_fetcher I, [2024-05-14T10:14:32.991602 #39176] INFO -- : [378/885] 80545=test_rdoc_token_stream I, [2024-05-14T10:14:32.999619 #39176] INFO -- : [379/885] 80545=test_address_resolve I, [2024-05-14T10:14:33.008093 #39176] INFO -- : [380/885] 80545=test_gem_source_list I, [2024-05-14T10:14:33.020206 #39176] INFO -- : [381/885] 80542=test_optarg I, [2024-05-14T10:14:33.056320 #39176] INFO -- : [382/885] 80545=test_yaml_special_cases I, [2024-05-14T10:14:33.061459 #39176] INFO -- : [383/885] 80537=test_config I, [2024-05-14T10:14:33.084604 #39176] INFO -- : [384/885] 80537=test_verbose I, [2024-05-14T10:14:33.085900 #39176] INFO -- : [385/885] 80547=test_rdoc_single_class I, [2024-05-14T10:14:33.086743 #39176] INFO -- : [386/885] 80545=test_nil I, [2024-05-14T10:14:33.090399 #39176] INFO -- : [387/885] 80547=test_num2int I, [2024-05-14T10:14:33.090750 #39176] INFO -- : [388/885] 80545=test_macro I, [2024-05-14T10:14:33.101448 #39176] INFO -- : [389/885] 80537=test_pp I, [2024-05-14T10:14:33.116479 #39176] INFO -- : [390/885] 80548=test_gem_ext_configure_builder I, [2024-05-14T10:14:33.120652 #39176] INFO -- : [391/885] 80547=test_frozen I, [2024-05-14T10:14:33.124888 #39176] INFO -- : [392/885] 80547=test_exception I, [2024-05-14T10:14:33.136341 #39176] INFO -- : [393/885] 80537=test_zsh_completion I, [2024-05-14T10:14:33.137585 #39176] INFO -- : [394/885] 80547=test_iter_break I, [2024-05-14T10:14:33.139241 #39176] INFO -- : [395/885] 80537=test_cgi_tag_helper I, [2024-05-14T10:14:33.143295 #39176] INFO -- : [396/885] 80543=test_zlib I, [2024-05-14T10:14:33.143497 #39176] INFO -- : [397/885] 80547=test_egrep_cpp I, [2024-05-14T10:14:33.149184 #39176] INFO -- : [398/885] 80537=test_ole_methods I, [2024-05-14T10:14:33.151283 #39176] INFO -- : [399/885] 80545=test_erb_m17n I, [2024-05-14T10:14:33.152543 #39176] INFO -- : [400/885] 80537=test_optimization I, [2024-05-14T10:14:33.154234 #39176] INFO -- : [401/885] 80548=test_date_conv I, [2024-05-14T10:14:33.158964 #39176] INFO -- : [402/885] 80545=test_string I, [2024-05-14T10:14:33.161742 #39176] INFO -- : [403/885] 80548=test_proc I, [2024-05-14T10:14:33.180377 #39176] INFO -- : [404/885] 80536=test_gc_compact I, [2024-05-14T10:14:33.180658 #39176] INFO -- : [405/885] 80540=test_gem_resolver_index_set I, [2024-05-14T10:14:33.190602 #39176] INFO -- : [406/885] 80542=test_gem_package_old I, [2024-05-14T10:14:33.210850 #39176] INFO -- : [407/885] 80540=test_gem_validator I, [2024-05-14T10:14:33.228439 #39176] INFO -- : [408/885] 80540=test_folderitem2_invokeverb I, [2024-05-14T10:14:33.229920 #39176] INFO -- : [409/885] 80542=test_require_path_check I, [2024-05-14T10:14:33.230021 #39176] INFO -- : [410/885] 80540=test_rdoc_markup_parser I, [2024-05-14T10:14:33.257147 #39176] INFO -- : [411/885] 80547=test_fnmatch I, [2024-05-14T10:14:33.287294 #39176] INFO -- : [412/885] 80542=test_files_test_2 I, [2024-05-14T10:14:33.296253 #39176] INFO -- : [413/885] 80547=test_pattern_matching I, [2024-05-14T10:14:33.324831 #39176] INFO -- : [414/885] 80547=test_rdoc_stats I, [2024-05-14T10:14:33.329919 #39176] INFO -- : [415/885] 80538=test_string I, [2024-05-14T10:14:33.353958 #39176] INFO -- : [416/885] 80538=test_rdoc_store I, [2024-05-14T10:14:33.380380 #39176] INFO -- : [417/885] 80547=test_gem_request_set_lockfile_parser I, [2024-05-14T10:14:33.413163 #39176] INFO -- : [418/885] 80540=test_depth_first I, [2024-05-14T10:14:33.418306 #39176] INFO -- : [419/885] 80540=test_x509attr I, [2024-05-14T10:14:33.422859 #39176] INFO -- : [420/885] 80540=test_raise I, [2024-05-14T10:14:33.423092 #39176] INFO -- : [421/885] 80540=json_addition_test I, [2024-05-14T10:14:33.446069 #39176] INFO -- : [422/885] 80540=test_custom_command I, [2024-05-14T10:14:33.462065 #39176] INFO -- : [423/885] 80541=test_qsort I, [2024-05-14T10:14:33.467296 #39176] INFO -- : [424/885] 80541=test_rdoc_parser I, [2024-05-14T10:14:33.481932 #39176] INFO -- : [425/885] 80541=test_gem_dependency_resolution_error I, [2024-05-14T10:14:33.485622 #39176] INFO -- : [426/885] 80547=test_win32ole_type I, [2024-05-14T10:14:33.485955 #39176] INFO -- : [427/885] 80541=test_null I, [2024-05-14T10:14:33.491427 #39176] INFO -- : [428/885] 80541=test_mul I, [2024-05-14T10:14:33.492539 #39176] INFO -- : [429/885] 80547=test_rdoc_rd_inline_parser I, [2024-05-14T10:14:33.497037 #39176] INFO -- : [430/885] 80541=test_rdoc_markup_to_rdoc I, [2024-05-14T10:14:33.506723 #39176] INFO -- : [431/885] 80547=test_default_gems I, [2024-05-14T10:14:33.535125 #39176] INFO -- : [432/885] 80541=test_rdoc_markup_attributes I, [2024-05-14T10:14:33.539017 #39176] INFO -- : [433/885] 80541=test_date_parse I, [2024-05-14T10:14:33.544743 #39176] INFO -- : [434/885] 80549=test_pipe I, [2024-05-14T10:14:33.555724 #39176] INFO -- : [435/885] 80547=test_thread I, [2024-05-14T10:14:33.557780 #39176] INFO -- : [436/885] 80547=test_trick I, [2024-05-14T10:14:33.583919 #39176] INFO -- : [437/885] 80540=test_pkey_ec I, [2024-05-14T10:14:33.627899 #39176] INFO -- : [438/885] 80552=test_backtrace I, [2024-05-14T10:14:33.631492 #39176] INFO -- : [439/885] 80552=test_defined I, [2024-05-14T10:14:33.649110 #39176] INFO -- : [440/885] 80541=test_key_name_check I, [2024-05-14T10:14:33.662246 #39176] INFO -- : [441/885] 80541=test_io_buffer I, [2024-05-14T10:14:33.662693 #39176] INFO -- : [442/885] 80540=test_rdoc_i18n_text I, [2024-05-14T10:14:33.678939 #39176] INFO -- : [443/885] 80540=test_time I, [2024-05-14T10:14:33.701306 #39176] INFO -- : [444/885] 80541=test_windows_1251 I, [2024-05-14T10:14:33.707747 #39176] INFO -- : [445/885] 80541=test_rdoc_rdoc I, [2024-05-14T10:14:33.708851 #39176] INFO -- : [446/885] 80552=test_gem_uninstaller I, [2024-05-14T10:14:33.718110 #39176] INFO -- : [447/885] 80549=test_svcb_https I, [2024-05-14T10:14:33.742971 #39176] INFO -- : [448/885] 80549=test_buffering I, [2024-05-14T10:14:33.745115 #39176] INFO -- : [449/885] 80549=test_gb18030 I, [2024-05-14T10:14:33.748327 #39176] INFO -- : [450/885] 80549=errors_test I, [2024-05-14T10:14:33.817335 #39176] INFO -- : [451/885] 80541=test_regexp I, [2024-05-14T10:14:33.826571 #39176] INFO -- : [452/885] 80540=test_gem_commands_check_command I, [2024-05-14T10:14:33.858068 #39176] INFO -- : [453/885] 80540=test_tmpdir I, [2024-05-14T10:14:33.906623 #39176] INFO -- : [454/885] 80549=test_integer_comb I, [2024-05-14T10:14:33.943153 #39176] INFO -- : [455/885] 80540=test_rdoc_markup_document I, [2024-05-14T10:14:33.955939 #39176] INFO -- : [456/885] 80540=test_vm_dump I, [2024-05-14T10:14:33.960534 #39176] INFO -- : [457/885] 80540=test_udp I, [2024-05-14T10:14:33.972066 #39176] INFO -- : [458/885] 80540=bom_test I, [2024-05-14T10:14:34.036752 #39176] INFO -- : [459/885] 80540=test_data_error I, [2024-05-14T10:14:34.066054 #39176] INFO -- : [460/885] 80534=unescape_test I, [2024-05-14T10:14:34.072262 #39176] INFO -- : [461/885] 80551=test_ostruct I, [2024-05-14T10:14:34.090875 #39176] INFO -- : [462/885] 80548=test_file I, [2024-05-14T10:14:34.103925 #39176] INFO -- : [463/885] 80533=test_force_exit I, [2024-05-14T10:14:34.112924 #39176] INFO -- : [464/885] 80540=static_inspect_test I, [2024-05-14T10:14:34.114916 #39176] INFO -- : [465/885] 80540=test_helper I, [2024-05-14T10:14:34.118126 #39176] INFO -- : [466/885] 80540=test_erb_command I, [2024-05-14T10:14:34.163249 #39176] INFO -- : [467/885] 80538=test_encoding I, [2024-05-14T10:14:34.166858 #39176] INFO -- : [468/885] 80540=test_gem_uri_formatter I, [2024-05-14T10:14:34.197943 #39176] INFO -- : [469/885] 80540=test_range I, [2024-05-14T10:14:34.225767 #39176] INFO -- : [470/885] 80533=test_project_sanity I, [2024-05-14T10:14:34.271586 #39176] INFO -- : [471/885] 80551=command_line_test I, [2024-05-14T10:14:34.276866 #39176] INFO -- : [472/885] 80551=test_dup I, [2024-05-14T10:14:34.305746 #39176] INFO -- : [473/885] 80533=test_pty I, [2024-05-14T10:14:34.411996 #39176] INFO -- : [474/885] 80538=test_constant I, [2024-05-14T10:14:34.483396 #39176] INFO -- : [475/885] 80551=test_rdoc_ri_paths I, [2024-05-14T10:14:34.518820 #39176] INFO -- : [476/885] 80551=test_ensured I, [2024-05-14T10:14:34.547894 #39176] INFO -- : [477/885] 80551=test_addr I, [2024-05-14T10:14:34.574021 #39176] INFO -- : [478/885] 80551=test_locale I, [2024-05-14T10:14:34.692535 #39176] INFO -- : [479/885] 80551=library_symbols_test I, [2024-05-14T10:14:34.693522 #39176] INFO -- : [480/885] 80551=test_ts I, [2024-05-14T10:14:34.843218 #39176] INFO -- : [481/885] 80533=test_enumerable I, [2024-05-14T10:14:34.855717 #39176] INFO -- : [482/885] 80533=test_config I, [2024-05-14T10:14:34.895377 #39176] INFO -- : [483/885] 80552=test_gem_resolver_vendor_set I, [2024-05-14T10:14:34.906985 #39176] INFO -- : [484/885] 80543=test_gem_resolver_api_set I, [2024-05-14T10:14:34.934952 #39176] INFO -- : [485/885] 80552=test_gem_safe_marshal I, [2024-05-14T10:14:35.174993 #39176] INFO -- : [486/885] 80540=test_transcode I, [2024-05-14T10:14:35.182462 #39176] INFO -- : [487/885] 80551=json_generator_test I, [2024-05-14T10:14:35.185614 #39176] INFO -- : [488/885] 80543=test_eval I, [2024-05-14T10:14:35.291976 #39176] INFO -- : [489/885] 80551=test_x509store I, [2024-05-14T10:14:35.394533 #39176] INFO -- : [490/885] 80533=test_rdoc_code_object I, [2024-05-14T10:14:35.419147 #39176] INFO -- : [491/885] 80540=test_update I, [2024-05-14T10:14:35.426315 #39176] INFO -- : [492/885] 80543=test_x509name I, [2024-05-14T10:14:35.432010 #39176] INFO -- : [493/885] 80540=test_fips I, [2024-05-14T10:14:35.443774 #39176] INFO -- : [494/885] 80543=test_helper I, [2024-05-14T10:14:35.524270 #39176] INFO -- : [495/885] 80543=test_random_formatter I, [2024-05-14T10:14:35.546099 #39176] INFO -- : [496/885] 80543=test_jaro_winkler I, [2024-05-14T10:14:35.551153 #39176] INFO -- : [497/885] 80551=test_lambda I, [2024-05-14T10:14:35.558769 #39176] INFO -- : [498/885] 80543=test_gem_request_set_gem_dependency_api I, [2024-05-14T10:14:35.615047 #39176] INFO -- : [499/885] 80539=test_ast I, [2024-05-14T10:14:35.652353 #39176] INFO -- : [500/885] 80551=test_webauthn_listener I, [2024-05-14T10:14:35.652419 #39176] INFO -- : [501/885] 80534=test_gem_commands_push_command I, [2024-05-14T10:14:35.666851 #39176] INFO -- : [502/885] 80540=test_weakkeymap I, [2024-05-14T10:14:35.671563 #39176] INFO -- : Leaked file descriptor: WebauthnListenerTest#test_wait_for_otp_code_options_request: 11 : # I, [2024-05-14T10:14:35.700357 #39176] INFO -- : [503/885] 80552=test_numhash I, [2024-05-14T10:14:35.708351 #39176] INFO -- : [504/885] 80552=test_pkey_rsa I, [2024-05-14T10:14:35.710571 #39176] INFO -- : [505/885] 80547=test_gem_platform I, [2024-05-14T10:14:35.726136 #39176] INFO -- : COMMAND PID USER FD TYPE DEVICE SIZE/OFF NODE NAME I, [2024-05-14T10:14:35.726200 #39176] INFO -- : ruby 80551 ko1 11u IPv4 139681384 0t0 TCP localhost:41583->localhost:47274 (CLOSE_WAIT) I, [2024-05-14T10:14:35.744251 #39176] INFO -- : [506/885] 80543=test_placearg I, [2024-05-14T10:14:35.751212 #39176] INFO -- : Closed file descriptor: WebauthnListenerTest#test_wait_for_otp_code_get_follows_options: 11 I, [2024-05-14T10:14:35.755233 #39176] INFO -- : [507/885] 80536=test_gem_package_task I, [2024-05-14T10:14:35.762125 #39176] INFO -- : [508/885] 80536=test_date_strptime I, [2024-05-14T10:14:35.823210 #39176] INFO -- : [509/885] 80547=test_rdoc_markup_hard_break I, [2024-05-14T10:14:35.828022 #39176] INFO -- : [510/885] 80551=test_win32ole_method I, [2024-05-14T10:14:35.828086 #39176] INFO -- : [511/885] 80551=test_delete I, [2024-05-14T10:14:35.830842 #39176] INFO -- : [512/885] 80547=test_keyword I, [2024-05-14T10:14:35.842278 #39176] INFO -- : [513/885] 80551=test_class_name_check I, [2024-05-14T10:14:35.850993 #39176] INFO -- : [514/885] 80536=test_fd_setsize I, [2024-05-14T10:14:35.853989 #39176] INFO -- : [515/885] 80536=test_continuation I, [2024-05-14T10:14:35.859668 #39176] INFO -- : [516/885] 80536=test_file_exhaustive I, [2024-05-14T10:14:35.861272 #39176] INFO -- : [517/885] 80533=test_files_test I, [2024-05-14T10:14:35.870637 #39176] INFO -- : [518/885] 80543=test_gem_update_suggestion I, [2024-05-14T10:14:35.881702 #39176] INFO -- : [519/885] 80551=test_logger I, [2024-05-14T10:14:35.890630 #39176] INFO -- : [520/885] 80551=test_not I, [2024-05-14T10:14:35.890974 #39176] INFO -- : [521/885] 80551=test_gem_resolver_lock_set I, [2024-05-14T10:14:35.910022 #39176] INFO -- : [522/885] 80540=test_import I, [2024-05-14T10:14:35.915645 #39176] INFO -- : [523/885] 80551=test_rdoc_parser_markdown I, [2024-05-14T10:14:35.925637 #39176] INFO -- : [524/885] 80551=test_object I, [2024-05-14T10:14:35.929457 #39176] INFO -- : [525/885] 80551=heredoc_dedent_test I, [2024-05-14T10:14:35.938462 #39176] INFO -- : [526/885] 80551=test_cgi_header I, [2024-05-14T10:14:35.943893 #39176] INFO -- : [527/885] 80551=version_test I, [2024-05-14T10:14:35.945539 #39176] INFO -- : [528/885] 80543=test_basicinstructions I, [2024-05-14T10:14:35.946370 #39176] INFO -- : [529/885] 80551=test_gem_gemcutter_utilities I, [2024-05-14T10:14:35.948396 #39176] INFO -- : [530/885] 80533=test_gem_command_manager I, [2024-05-14T10:14:36.025480 #39176] INFO -- : [531/885] 80552=test_key_actor_emacs I, [2024-05-14T10:14:36.043727 #39176] INFO -- : [532/885] 80543=test_arithmetic_sequence I, [2024-05-14T10:14:36.062933 #39176] INFO -- : [533/885] 80543=test_timeout I, [2024-05-14T10:14:36.068224 #39176] INFO -- : [534/885] 80543=test_ossl I, [2024-05-14T10:14:36.075347 #39176] INFO -- : [535/885] 80533=test_normalize I, [2024-05-14T10:14:36.077061 #39176] INFO -- : [536/885] 80533=test_change_word I, [2024-05-14T10:14:36.085774 #39176] INFO -- : [537/885] 80533=test_flip I, [2024-05-14T10:14:36.089541 #39176] INFO -- : [538/885] 80535=compiler_test I, [2024-05-14T10:14:36.095054 #39176] INFO -- : [539/885] 80535=test_sleep I, [2024-05-14T10:14:36.101801 #39176] INFO -- : [540/885] 80533=test_object I, [2024-05-14T10:14:36.137875 #39176] INFO -- : [541/885] 80534=test_ruby_lex I, [2024-05-14T10:14:36.162445 #39176] INFO -- : [542/885] 80552=test_date_arith I, [2024-05-14T10:14:36.169835 #39176] INFO -- : [543/885] 80552=test_gem_local_remote_options I, [2024-05-14T10:14:36.226847 #39176] INFO -- : [544/885] 80552=test_func I, [2024-05-14T10:14:36.251668 #39176] INFO -- : [545/885] 80534=test_big5 I, [2024-05-14T10:14:36.257768 #39176] INFO -- : [546/885] 80534=test_pointer I, [2024-05-14T10:14:36.295782 #39176] INFO -- : [547/885] 80551=test_ractor I, [2024-05-14T10:14:36.356177 #39176] INFO -- : [548/885] 80551=test_type I, [2024-05-14T10:14:36.360151 #39176] INFO -- : [549/885] 80551=test_signedness I, [2024-05-14T10:14:36.445437 #39176] INFO -- : [550/885] 80547=test_tsort I, [2024-05-14T10:14:36.451337 #39176] INFO -- : [551/885] 80547=test_rdoc_rd_block_parser I, [2024-05-14T10:14:36.477742 #39176] INFO -- : [552/885] 80547=test_rdoc_generator_json_index I, [2024-05-14T10:14:36.493567 #39176] INFO -- : [553/885] 80549=test_win32ole_event I, [2024-05-14T10:14:36.497192 #39176] INFO -- : [554/885] 80547=test_time_tz I, [2024-05-14T10:14:36.499907 #39176] INFO -- : [555/885] 80549=test_trace I, [2024-05-14T10:14:36.513107 #39176] INFO -- : [556/885] 80549=ractor_test I, [2024-05-14T10:14:36.539718 #39176] INFO -- : [557/885] 80533=test_win32ole_variable I, [2024-05-14T10:14:36.541916 #39176] INFO -- : [558/885] 80533=test_io_wait_uncommon I, [2024-05-14T10:14:36.544012 #39176] INFO -- : [559/885] 80547=test_stringio I, [2024-05-14T10:14:36.547506 #39176] INFO -- : [560/885] 80533=test_arity I, [2024-05-14T10:14:36.554727 #39176] INFO -- : [561/885] 80533=test_gem_ci_detector I, [2024-05-14T10:14:36.560141 #39176] INFO -- : [562/885] 80533=test_rdoc_class_module I, [2024-05-14T10:14:36.598134 #39176] INFO -- : [563/885] 80549=test_bignum I, [2024-05-14T10:14:36.675756 #39176] INFO -- : [564/885] 80547=test_threadgroup I, [2024-05-14T10:14:36.698564 #39176] INFO -- : [565/885] 80549=test_enum I, [2024-05-14T10:14:36.701744 #39176] INFO -- : [566/885] 80540=test_gem_specification I, [2024-05-14T10:14:36.706223 #39176] INFO -- : [567/885] 80542=test_have_macro I, [2024-05-14T10:14:36.777530 #39176] INFO -- : [568/885] 80538=test_gem_package I, [2024-05-14T10:14:36.951847 #39176] INFO -- : [569/885] 80534=test_resolve_symbol I, [2024-05-14T10:14:37.000047 #39176] INFO -- : [570/885] 80534=test_complex2 I, [2024-05-14T10:14:37.008865 #39176] INFO -- : [571/885] 80534=test_merge_keys I, [2024-05-14T10:14:37.017589 #39176] INFO -- : [572/885] 80534=test_rdoc_extend I, [2024-05-14T10:14:37.041623 #39176] INFO -- : [573/885] 80534=test_ipaddr I, [2024-05-14T10:14:37.048170 #39176] INFO -- : [574/885] 80533=test_rdoc_markup_to_ansi I, [2024-05-14T10:14:37.067608 #39176] INFO -- : [575/885] 80534=test_mixed_unicode_escapes I, [2024-05-14T10:14:37.070565 #39176] INFO -- : [576/885] 80533=test_history I, [2024-05-14T10:14:37.072975 #39176] INFO -- : [577/885] 80534=test_win32ole_variant I, [2024-05-14T10:14:37.079383 #39176] INFO -- : [578/885] 80533=test_gem_resolver_api_specification I, [2024-05-14T10:14:37.085008 #39176] INFO -- : [579/885] 80534=test_gem_commands_cleanup_command I, [2024-05-14T10:14:37.103574 #39176] INFO -- : [580/885] 80533=test_word I, [2024-05-14T10:14:37.105942 #39176] INFO -- : [581/885] 80533=test_cgi_multipart I, [2024-05-14T10:14:37.149113 #39176] INFO -- : [582/885] 80542=test_numeric I, [2024-05-14T10:14:37.154411 #39176] INFO -- : [583/885] 80542=test_member I, [2024-05-14T10:14:37.161005 #39176] INFO -- : [584/885] 80542=test_ractor_compatibility I, [2024-05-14T10:14:37.264326 #39176] INFO -- : [585/885] 80533=test_eval I, [2024-05-14T10:14:37.268428 #39176] INFO -- : [586/885] 80533=test_autoconf I, [2024-05-14T10:14:37.276606 #39176] INFO -- : [587/885] 80533=test_date_ractor I, [2024-05-14T10:14:37.459228 #39176] INFO -- : [588/885] 80533=test_gem_console_ui I, [2024-05-14T10:14:37.463973 #39176] INFO -- : [589/885] 80533=format_errors_test I, [2024-05-14T10:14:37.467047 #39176] INFO -- : [590/885] 80533=test_dir I, [2024-05-14T10:14:37.469887 #39176] INFO -- : [591/885] 80538=test_mailto I, [2024-05-14T10:14:37.479292 #39176] INFO -- : [592/885] 80538=test_coderange I, [2024-05-14T10:14:37.484555 #39176] INFO -- : [593/885] 80538=test_symbol I, [2024-05-14T10:14:37.490352 #39176] INFO -- : [594/885] 80538=location_test I, [2024-05-14T10:14:37.514543 #39176] INFO -- : [595/885] 80549=test_gem_source_fetch_problem I, [2024-05-14T10:14:37.528176 #39176] INFO -- : [596/885] 80549=json_generic_object_test I, [2024-05-14T10:14:37.534488 #39176] INFO -- : [597/885] 80549=test_http_request I, [2024-05-14T10:14:37.551983 #39176] INFO -- : [598/885] 80538=test_rdoc_generator_darkfish I, [2024-05-14T10:14:37.571984 #39176] INFO -- : [599/885] 80549=test_error_highlight I, [2024-05-14T10:14:37.577538 #39176] INFO -- : [600/885] 80542=test_resize I, [2024-05-14T10:14:37.588089 #39176] INFO -- : [601/885] 80542=test_rdoc_comment I, [2024-05-14T10:14:37.614055 #39176] INFO -- : [602/885] 80542=test_function_entry I, [2024-05-14T10:14:37.615822 #39176] INFO -- : [603/885] 80542=test_gem_resolver_requirement_list I, [2024-05-14T10:14:37.625879 #39176] INFO -- : [604/885] 80542=test_arith_seq_beg_len_step I, [2024-05-14T10:14:37.670566 #39176] INFO -- : [605/885] 80542=test_pkcs7 I, [2024-05-14T10:14:37.680932 #39176] INFO -- : [606/885] 80547=test_lazy_enumerator I, [2024-05-14T10:14:37.683967 #39176] INFO -- : [607/885] 80533=test_enc_associate I, [2024-05-14T10:14:37.702155 #39176] INFO -- : [608/885] 80534=test_unix I, [2024-05-14T10:14:37.737035 #39176] INFO -- : [609/885] 80534=test_symbol I, [2024-05-14T10:14:37.832900 #39176] INFO -- : [610/885] 80542=test_coder I, [2024-05-14T10:14:37.842493 #39176] INFO -- : [611/885] 80542=test_nofree I, [2024-05-14T10:14:37.842724 #39176] INFO -- : [612/885] 80542=test_context I, [2024-05-14T10:14:37.924873 #39176] INFO -- : [613/885] 80538=test_gem_commands_pristine_command I, [2024-05-14T10:14:37.940065 #39176] INFO -- : [614/885] 80542=ruby_api_test I, [2024-05-14T10:14:38.017258 #39176] INFO -- : [615/885] 80549=test_find_executable I, [2024-05-14T10:14:38.041283 #39176] INFO -- : [616/885] 80549=test_https_proxy I, [2024-05-14T10:14:38.048961 #39176] INFO -- : [617/885] 80549=test_call I, [2024-05-14T10:14:38.059555 #39176] INFO -- : [618/885] 80542=test_rubygems I, [2024-05-14T10:14:38.069065 #39176] INFO -- : [619/885] 80547=test_cgi_modruby I, [2024-05-14T10:14:38.079176 #39176] INFO -- : [620/885] 80547=test_integer I, [2024-05-14T10:14:38.183985 #39176] INFO -- : [621/885] 80533=test_super I, [2024-05-14T10:14:38.197703 #39176] INFO -- : [622/885] 80542=test_rubyoptions I, [2024-05-14T10:14:38.207253 #39176] INFO -- : [623/885] 80549=test_gem_resolver_git_specification I, [2024-05-14T10:14:38.213149 #39176] INFO -- : [624/885] 80540=test_object_references I, [2024-05-14T10:14:38.217438 #39176] INFO -- : [625/885] 80540=test_usrmarshal I, [2024-05-14T10:14:38.392753 #39176] INFO -- : [626/885] 80540=test_nextafter I, [2024-05-14T10:14:38.413584 #39176] INFO -- : [627/885] 80549=test_capacity I, [2024-05-14T10:14:38.420181 #39176] INFO -- : [628/885] 80549=test_gem_request_set_lockfile_tokenizer I, [2024-05-14T10:14:38.434538 #39176] INFO -- : [629/885] 80540=test_stat I, [2024-05-14T10:14:38.435863 #39176] INFO -- : [630/885] 80540=test_have_func I, [2024-05-14T10:14:38.446703 #39176] INFO -- : [631/885] 80551=desugar_compiler_test I, [2024-05-14T10:14:38.461328 #39176] INFO -- : [632/885] 80551=test_integer I, [2024-05-14T10:14:38.479754 #39176] INFO -- : [633/885] 80549=test_dryrun I, [2024-05-14T10:14:38.496449 #39176] INFO -- : [634/885] 80549=test_rdoc_attr I, [2024-05-14T10:14:38.509310 #39176] INFO -- : [635/885] 80549=test_env I, [2024-05-14T10:14:38.526913 #39176] INFO -- : [636/885] 80551=test_gem_commands_setup_command I, [2024-05-14T10:14:38.638928 #39176] INFO -- : [637/885] 80544=test_parser I, [2024-05-14T10:14:38.657970 #39176] INFO -- : [638/885] 80544=test_cgi_core I, [2024-05-14T10:14:38.664158 #39176] INFO -- : [639/885] 80544=test_dns I, [2024-05-14T10:14:38.838696 #39176] INFO -- : [640/885] 80533=test_gem_commands_open_command I, [2024-05-14T10:14:38.871845 #39176] INFO -- : [641/885] 80552=test_ractor I, [2024-05-14T10:14:38.886426 #39176] INFO -- : [642/885] 80552=test_gem_source_lock I, [2024-05-14T10:14:38.900606 #39176] INFO -- : [643/885] 80533=test_gem I, [2024-05-14T10:14:38.943035 #39176] INFO -- : [644/885] 80552=parse_stream_test I, [2024-05-14T10:14:38.948633 #39176] INFO -- : [645/885] 80552=test_registry I, [2024-05-14T10:14:38.949444 #39176] INFO -- : [646/885] 80552=test_ractor I, [2024-05-14T10:14:39.009885 #39176] INFO -- : [647/885] 80551=json_ext_parser_test I, [2024-05-14T10:14:39.015754 #39176] INFO -- : [648/885] 80551=test_thread I, [2024-05-14T10:14:39.086559 #39176] INFO -- : [649/885] 80550=test_my_integer I, [2024-05-14T10:14:39.091821 #39176] INFO -- : [650/885] 80550=test_rendering I, [2024-05-14T10:14:39.094919 #39176] INFO -- : [651/885] 80544=test_debugger_integration I, [2024-05-14T10:14:39.103439 #39176] INFO -- : [652/885] 80550=test_ssl I, [2024-05-14T10:14:39.112502 #39176] INFO -- : [653/885] 80544=test_ancdata I, [2024-05-14T10:14:39.120552 #39176] INFO -- : [654/885] 80544=test_singleton_function I, [2024-05-14T10:14:39.122191 #39176] INFO -- : [655/885] 80538=test_rb_str_dup I, [2024-05-14T10:14:39.124353 #39176] INFO -- : [656/885] 80544=test_reline_key I, [2024-05-14T10:14:39.126714 #39176] INFO -- : [657/885] 80538=test_unicode_normalize I, [2024-05-14T10:14:39.131505 #39176] INFO -- : [658/885] 80544=test_marshal I, [2024-05-14T10:14:39.390522 #39176] INFO -- : [659/885] 80537=test_nonblock I, [2024-05-14T10:14:39.414431 #39176] INFO -- : [660/885] 80537=test_weakref I, [2024-05-14T10:14:39.424880 #39176] INFO -- : [661/885] 80552=test_alias I, [2024-05-14T10:14:39.578934 #39176] INFO -- : [662/885] 80552=test_timeout I, [2024-05-14T10:14:39.594976 #39176] INFO -- : [663/885] 80537=test_float I, [2024-05-14T10:14:39.632799 #39176] INFO -- : [664/885] 80550=test_cgi_cookie I, [2024-05-14T10:14:39.674475 #39176] INFO -- : [665/885] 80550=test_require I, [2024-05-14T10:14:39.714985 #39176] INFO -- : [666/885] 80540=test_gem_commands_signout_command I, [2024-05-14T10:14:39.730926 #39176] INFO -- : [667/885] 80540=test_refinement I, [2024-05-14T10:14:39.735069 #39176] INFO -- : [668/885] 80544=test_regex_casefold I, [2024-05-14T10:14:40.067244 #39176] INFO -- : [669/885] 80544=test_gem_source_git I, [2024-05-14T10:14:40.168062 #39176] INFO -- : [670/885] 80548=test_dir_m17n I, [2024-05-14T10:14:40.425580 #39176] INFO -- : [671/885] 80534=test_gem_resolver_installer_set I, [2024-05-14T10:14:40.498405 #39176] INFO -- : [672/885] 80552=test_cgi_session I, [2024-05-14T10:14:40.510996 #39176] INFO -- : [673/885] 80552=test_rdoc_rd I, [2024-05-14T10:14:40.528093 #39176] INFO -- : [674/885] 80552=test_metaclass I, [2024-05-14T10:14:40.556379 #39176] INFO -- : [675/885] 80552=test_rdoc_top_level I, [2024-05-14T10:14:40.586190 #39176] INFO -- : [676/885] 80534=test_signal I, [2024-05-14T10:14:40.610449 #39176] INFO -- : [677/885] 80544=test_fixnum I, [2024-05-14T10:14:40.623977 #39176] INFO -- : [678/885] 80544=test_x509crl I, [2024-05-14T10:14:40.763697 #39176] INFO -- : [679/885] 80533=test_process I, [2024-05-14T10:14:40.788806 #39176] INFO -- : [680/885] 80533=test_windows_1252 I, [2024-05-14T10:14:40.798806 #39176] INFO -- : [681/885] 80533=test_input_method I, [2024-05-14T10:14:40.800089 #39176] INFO -- : [682/885] 80544=test_digest_extend I, [2024-05-14T10:14:40.816910 #39176] INFO -- : [683/885] 80544=test_string I, [2024-05-14T10:14:40.816970 #39176] INFO -- : [684/885] 80544=test_iterator I, [2024-05-14T10:14:40.817389 #39176] INFO -- : [685/885] 80552=test_omap I, [2024-05-14T10:14:40.823921 #39176] INFO -- : [686/885] 80552=test_debug I, [2024-05-14T10:14:40.828848 #39176] INFO -- : [687/885] 80552=test_memory_view I, [2024-05-14T10:14:40.834533 #39176] INFO -- : [688/885] 80533=pattern_test I, [2024-05-14T10:14:40.850557 #39176] INFO -- : [689/885] 80552=test_shellwords I, [2024-05-14T10:14:40.856436 #39176] INFO -- : [690/885] 80552=test_new I, [2024-05-14T10:14:40.862881 #39176] INFO -- : [691/885] 80552=test_cipher I, [2024-05-14T10:14:40.877737 #39176] INFO -- : [692/885] 80533=test_gem_security_signer I, [2024-05-14T10:14:40.909492 #39176] INFO -- : [693/885] 80552=test_storage I, [2024-05-14T10:14:40.913221 #39176] INFO -- : [694/885] 80552=test_gem_resolver_git_set I, [2024-05-14T10:14:40.916758 #39176] INFO -- : [695/885] 80544=test_win32ole_variant_outarg I, [2024-05-14T10:14:40.918080 #39176] INFO -- : [696/885] 80544=test_dln I, [2024-05-14T10:14:40.921540 #39176] INFO -- : [697/885] 80544=test_gem_source_subpath_problem I, [2024-05-14T10:14:40.986420 #39176] INFO -- : [698/885] 80533=json_common_interface_test I, [2024-05-14T10:14:40.987051 #39176] INFO -- : [699/885] 80549=memsize_test I, [2024-05-14T10:14:40.990292 #39176] INFO -- : [700/885] 80549=test_nomethod_error I, [2024-05-14T10:14:40.996491 #39176] INFO -- : [701/885] 80549=json_parser_test I, [2024-05-14T10:14:41.007122 #39176] INFO -- : [702/885] 80533=test_config I, [2024-05-14T10:14:41.037846 #39176] INFO -- : [703/885] 80533=test_pkg_config I, [2024-05-14T10:14:41.043378 #39176] INFO -- : [704/885] 80549=test_cparser I, [2024-05-14T10:14:41.058678 #39176] INFO -- : [705/885] 80533=test_struct I, [2024-05-14T10:14:41.062611 #39176] INFO -- : [706/885] 80533=test_rdoc_markup_to_html_snippet I, [2024-05-14T10:14:41.072141 #39176] INFO -- : [707/885] 80544=magic_comment_test I, [2024-05-14T10:14:41.101115 #39176] INFO -- : [708/885] 80535=test_sexp I, [2024-05-14T10:14:41.111751 #39176] INFO -- : [709/885] 80535=test_rdoc_markup_include I, [2024-05-14T10:14:41.114311 #39176] INFO -- : [710/885] 80533=fuzzer_test I, [2024-05-14T10:14:41.121277 #39176] INFO -- : [711/885] 80533=test_variable I, [2024-05-14T10:14:41.126099 #39176] INFO -- : [712/885] 80536=test_engine I, [2024-05-14T10:14:41.135047 #39176] INFO -- : [713/885] 80536=test_win32ole_variant_m I, [2024-05-14T10:14:41.138150 #39176] INFO -- : [714/885] 80536=test_div I, [2024-05-14T10:14:41.140254 #39176] INFO -- : [715/885] 80536=test_allocation I, [2024-05-14T10:14:41.160358 #39176] INFO -- : [716/885] 80537=test_key_error I, [2024-05-14T10:14:41.171500 #39176] INFO -- : [717/885] 80537=test_serialize_subclasses I, [2024-05-14T10:14:41.171560 #39176] INFO -- : [718/885] 80544=test_insns_leaf I, [2024-05-14T10:14:41.174741 #39176] INFO -- : [719/885] 80544=test_color_printer I, [2024-05-14T10:14:41.175281 #39176] INFO -- : [720/885] 80547=test_deprecated I, [2024-05-14T10:14:41.184845 #39176] INFO -- : [721/885] 80544=test_files_test_1 I, [2024-05-14T10:14:41.187674 #39176] INFO -- : [722/885] 80547=test_set I, [2024-05-14T10:14:41.190671 #39176] INFO -- : [723/885] 80537=test_gem_path_support I, [2024-05-14T10:14:41.223623 #39176] INFO -- : [724/885] 80537=test_struct I, [2024-05-14T10:14:41.236274 #39176] INFO -- : [725/885] 80547=test_x509req I, [2024-05-14T10:14:41.237768 #39176] INFO -- : [726/885] 80535=test_mutex I, [2024-05-14T10:14:41.262295 #39176] INFO -- : [727/885] 80533=test_rdoc_rd_inline I, [2024-05-14T10:14:41.269259 #39176] INFO -- : [728/885] 80533=constant_path_node_test I, [2024-05-14T10:14:41.273211 #39176] INFO -- : [729/885] 80533=test_gem_ext_cargo_builder I, [2024-05-14T10:14:41.298597 #39176] INFO -- : [730/885] 80533=test_ssl I, [2024-05-14T10:14:41.347247 #39176] INFO -- : [731/885] 80552=test_module I, [2024-05-14T10:14:41.430623 #39176] INFO -- : [732/885] 80547=test_gem_request_set I, [2024-05-14T10:14:41.638097 #39176] INFO -- : [733/885] 80548=test_arith_seq_extract I, [2024-05-14T10:14:41.674836 #39176] INFO -- : [734/885] 80549=test_method_name_check I, [2024-05-14T10:14:41.736334 #39176] INFO -- : [735/885] 80549=test_parser I, [2024-05-14T10:14:41.761835 #39176] INFO -- : [736/885] 80549=test_configuration I, [2024-05-14T10:14:41.838998 #39176] INFO -- : [737/885] 80548=test_rubyvm I, [2024-05-14T10:14:41.843565 #39176] INFO -- : [738/885] 80548=test_buffered_io I, [2024-05-14T10:14:41.846092 #39176] INFO -- : [739/885] 80549=test_monitor I, [2024-05-14T10:14:41.865468 #39176] INFO -- : [740/885] 80547=test_whileuntil I, [2024-05-14T10:14:41.872468 #39176] INFO -- : [741/885] 80547=test_rdoc_generator_markup I, [2024-05-14T10:14:41.881288 #39176] INFO -- : [742/885] 80547=test_boolean I, [2024-05-14T10:14:41.899236 #39176] INFO -- : [743/885] 80547=test_instrumentation_api I, [2024-05-14T10:14:41.904864 #39176] INFO -- : [744/885] 80548=integer_parse_test I, [2024-05-14T10:14:41.972832 #39176] INFO -- : [745/885] 80537=test_stringify_symbols I, [2024-05-14T10:14:41.974156 #39176] INFO -- : [746/885] 80548=test_gem_dependency_list I, [2024-05-14T10:14:41.982980 #39176] INFO -- : [747/885] 80537=test_benchmark I, [2024-05-14T10:14:42.056224 #39176] INFO -- : [748/885] 80549=test_win32ole_method_event I, [2024-05-14T10:14:42.058468 #39176] INFO -- : [749/885] 80538=test_nesting_parser I, [2024-05-14T10:14:42.058733 #39176] INFO -- : [750/885] 80549=test_gem_source I, [2024-05-14T10:14:42.059779 #39176] INFO -- : [751/885] 80548=test_scalar_scanner I, [2024-05-14T10:14:42.069947 #39176] INFO -- : [752/885] 80548=test_gem_commands_outdated_command I, [2024-05-14T10:14:42.082235 #39176] INFO -- : [753/885] 80538=test_gem_package_tar_writer I, [2024-05-14T10:14:42.128225 #39176] INFO -- : [754/885] 80548=test_helper_method I, [2024-05-14T10:14:42.142000 #39176] INFO -- : [755/885] 80548=test_array I, [2024-05-14T10:14:42.319867 #39176] INFO -- : [756/885] 80538=test_abi I, [2024-05-14T10:14:42.336973 #39176] INFO -- : [757/885] 80549=test_provider I, [2024-05-14T10:14:42.380153 #39176] INFO -- : [758/885] 80535=test_rdoc_parser_simple I, [2024-05-14T10:14:42.440554 #39176] INFO -- : [759/885] 80535=test_gem_commands_rebuild_command I, [2024-05-14T10:14:42.503665 #39176] INFO -- : [760/885] 80535=test_yamldbm I, [2024-05-14T10:14:42.504649 #39176] INFO -- : [761/885] 80535=test_load I, [2024-05-14T10:14:42.515727 #39176] INFO -- : [762/885] 80535=test_https I, [2024-05-14T10:14:42.550440 #39176] INFO -- : [763/885] 80538=test_gem_ext_builder I, [2024-05-14T10:14:42.683105 #39176] INFO -- : [764/885] 80540=test_evaluation I, [2024-05-14T10:14:42.685412 #39176] INFO -- : [765/885] 80540=test_x509ext I, [2024-05-14T10:14:42.701610 #39176] INFO -- : [766/885] 80540=test_erb I, [2024-05-14T10:14:42.704469 #39176] INFO -- : [767/885] 80549=test_gem_source_installed I, [2024-05-14T10:14:42.715266 #39176] INFO -- : [768/885] 80549=test_len I, [2024-05-14T10:14:42.718292 #39176] INFO -- : [769/885] 80549=test_yield_block I, [2024-05-14T10:14:42.723721 #39176] INFO -- : [770/885] 80549=test_completion I, [2024-05-14T10:14:42.742435 #39176] INFO -- : [771/885] 80534=test_gem_commands_cert_command I, [2024-05-14T10:14:42.786334 #39176] INFO -- : [772/885] 80540=test_rational I, [2024-05-14T10:14:42.803353 #39176] INFO -- : [773/885] 80540=test_rational2 I, [2024-05-14T10:14:42.817183 #39176] INFO -- : [774/885] 80540=test_assembler I, [2024-05-14T10:14:42.820934 #39176] INFO -- : [775/885] 80540=test_propertyputref I, [2024-05-14T10:14:42.824982 #39176] INFO -- : [776/885] 80540=attribute_write_test I, [2024-05-14T10:14:42.832674 #39176] INFO -- : [777/885] 80540=test_spell_checker I, [2024-05-14T10:14:42.847699 #39176] INFO -- : [778/885] 80540=test_human_typo I, [2024-05-14T10:14:42.856820 #39176] INFO -- : [779/885] 80540=test_primitive I, [2024-05-14T10:14:42.864193 #39176] INFO -- : [780/885] 80540=test_rbconfig I, [2024-05-14T10:14:42.869135 #39176] INFO -- : [781/885] 80540=test_win32ole_param I, [2024-05-14T10:14:42.873173 #39176] INFO -- : [782/885] 80540=test_gem_commands_yank_command I, [2024-05-14T10:14:42.928076 #39176] INFO -- : [783/885] 80550=test_pair I, [2024-05-14T10:14:42.929585 #39176] INFO -- : [784/885] 80535=test_document I, [2024-05-14T10:14:42.946304 #39176] INFO -- : [785/885] 80535=test_rdoc_generator_pot_po_entry I, [2024-05-14T10:14:42.954756 #39176] INFO -- : [786/885] 80535=test_euc_jp I, [2024-05-14T10:14:42.955948 #39176] INFO -- : [787/885] 80535=test_acceptable I, [2024-05-14T10:14:43.096923 #39176] INFO -- : [788/885] 80535=test_name_error_extension I, [2024-05-14T10:14:43.112298 #39176] INFO -- : [789/885] 80535=test_chilled I, [2024-05-14T10:14:43.118306 #39176] INFO -- : [790/885] 80535=test_rdoc_i18n_locale I, [2024-05-14T10:14:43.122590 #39176] INFO -- : [791/885] 80535=test_encoding I, [2024-05-14T10:14:43.139148 #39176] INFO -- : [792/885] 80535=test_httpresponses I, [2024-05-14T10:14:43.141510 #39176] INFO -- : [793/885] 80535=test_set_len I, [2024-05-14T10:14:43.146312 #39176] INFO -- : [794/885] 80535=test_httpheader I, [2024-05-14T10:14:43.160118 #39176] INFO -- : [795/885] 80535=test_gem_resolver_local_specification I, [2024-05-14T10:14:43.193206 #39176] INFO -- : [796/885] 80535=test_rdoc_ri_driver I, [2024-05-14T10:14:43.300896 #39176] INFO -- : [797/885] 80537=test_install I, [2024-05-14T10:14:43.374101 #39176] INFO -- : [798/885] 80549=test_rdoc_markup_to_label I, [2024-05-14T10:14:43.389349 #39176] INFO -- : [799/885] 80540=test_sockopt I, [2024-05-14T10:14:43.393908 #39176] INFO -- : [800/885] 80540=test_color I, [2024-05-14T10:14:43.397218 #39176] INFO -- : [801/885] 80549=json_encoding_test I, [2024-05-14T10:14:43.408955 #39176] INFO -- : [802/885] 80549=test_key_stroke I, [2024-05-14T10:14:43.423107 #39176] INFO -- : [803/885] 80549=test_date_compat I, [2024-05-14T10:14:43.426279 #39176] INFO -- : [804/885] 80549=test_rdoc_markup_to_html I, [2024-05-14T10:14:43.480275 #39176] INFO -- : [805/885] 80540=test_bug-14834 I, [2024-05-14T10:14:43.489585 #39176] INFO -- : [806/885] 80535=test_compile_prism I, [2024-05-14T10:14:43.515472 #39176] INFO -- : [807/885] 80537=test_terminfo I, [2024-05-14T10:14:43.517806 #39176] INFO -- : [808/885] 80537=test_path I, [2024-05-14T10:14:43.520070 #39176] INFO -- : [809/885] 80549=test_case_mapping I, [2024-05-14T10:14:43.527001 #39176] INFO -- : [810/885] 80537=redundant_return_test I, [2024-05-14T10:14:43.529784 #39176] INFO -- : [811/885] 80537=test_bn I, [2024-05-14T10:14:43.532072 #39176] INFO -- : [812/885] 80549=test_win32ole_param_event I, [2024-05-14T10:14:43.535460 #39176] INFO -- : [813/885] 80549=test_addrinfo I, [2024-05-14T10:14:43.540551 #39176] INFO -- : [814/885] 80537=test_http I, [2024-05-14T10:14:43.543392 #39176] INFO -- : [815/885] 80540=test_tree_spell_checker I, [2024-05-14T10:14:43.601910 #39176] INFO -- : [816/885] 80540=test_gem_gem_runner I, [2024-05-14T10:14:43.607050 #39176] INFO -- : [817/885] 80549=test_filter I, [2024-05-14T10:14:43.623789 #39176] INFO -- : [818/885] 80552=static_literals_test I, [2024-05-14T10:14:43.627966 #39176] INFO -- : [819/885] 80549=test_data I, [2024-05-14T10:14:43.629945 #39176] INFO -- : [820/885] 80552=test_rdoc_method_attr I, [2024-05-14T10:14:43.631147 #39176] INFO -- : [821/885] 80549=test_koi8 I, [2024-05-14T10:14:43.636133 #39176] INFO -- : [822/885] 80549=parameters_signature_test I, [2024-05-14T10:14:43.645704 #39176] INFO -- : [823/885] 80549=test_rdoc_parser_changelog I, [2024-05-14T10:14:43.660028 #39176] INFO -- : [824/885] 80540=test_enumerator I, [2024-05-14T10:14:43.662317 #39176] INFO -- : [825/885] 80538=test_unicode I, [2024-05-14T10:14:43.664400 #39176] INFO -- : [826/885] 80540=test_rdoc_generator_pot I, [2024-05-14T10:14:43.671730 #39176] INFO -- : [827/885] 80538=test_thread_cv I, [2024-05-14T10:14:43.691086 #39176] INFO -- : [828/885] 80540=test_lexer I, [2024-05-14T10:14:43.700908 #39176] INFO -- : [829/885] 80540=test_ssl_session I, [2024-05-14T10:14:43.739090 #39176] INFO -- : [830/885] 80552=test_key_event_record I, [2024-05-14T10:14:43.739328 #39176] INFO -- : [831/885] 80552=test_gem_uri I, [2024-05-14T10:14:43.744375 #39176] INFO -- : [832/885] 80549=test_random I, [2024-05-14T10:14:43.756613 #39176] INFO -- : [833/885] 80549=test_notimplement I, [2024-05-14T10:14:43.764306 #39176] INFO -- : [834/885] 80549=test_gem_commands_update_command I, [2024-05-14T10:14:43.776616 #39176] INFO -- : [835/885] 80552=test_gem_resolver_vendor_specification I, [2024-05-14T10:14:43.807553 #39176] INFO -- : [836/885] 80552=test_gem_commands_build_command I, [2024-05-14T10:14:43.815511 #39176] INFO -- : [837/885] 80535=test_interned_str I, [2024-05-14T10:14:43.818813 #39176] INFO -- : [838/885] 80535=test_case_comprehensive I, [2024-05-14T10:14:43.920569 #39176] INFO -- : [839/885] 80536=test_gem_commands_server_command I, [2024-05-14T10:14:43.923540 #39176] INFO -- : [840/885] 80536=test_variable_name_check I, [2024-05-14T10:14:43.970189 #39176] INFO -- : [841/885] 80536=test_io_m17n I, [2024-05-14T10:14:44.092242 #39176] INFO -- : [842/885] 80552=test_did_you_mean I, [2024-05-14T10:14:44.154012 #39176] INFO -- : [843/885] 80552=test_cmethod I, [2024-05-14T10:14:44.157257 #39176] INFO -- : [844/885] 80552=test_tracer I, [2024-05-14T10:14:44.207090 #39176] INFO -- : [845/885] 80552=test_append I, [2024-05-14T10:14:44.209703 #39176] INFO -- : [846/885] 80544=test_option I, [2024-05-14T10:14:44.218179 #39176] INFO -- : [847/885] 80552=test_rdoc_markup_heading I, [2024-05-14T10:14:44.230248 #39176] INFO -- : [848/885] 80552=test_iseq I, [2024-05-14T10:14:44.313504 #39176] INFO -- : [849/885] 80544=test_exception_at_throwing I, [2024-05-14T10:14:44.324480 #39176] INFO -- : [850/885] 80538=test_pkey_dsa I, [2024-05-14T10:14:44.374773 #39176] INFO -- : [851/885] 80544=test_class I, [2024-05-14T10:14:44.391651 #39176] INFO -- : [852/885] 80544=test_ocsp I, [2024-05-14T10:14:44.677689 #39176] INFO -- : [853/885] 80540=test_scheduler I, [2024-05-14T10:14:44.695354 #39176] INFO -- : [854/885] 80544=reflection_test I, [2024-05-14T10:14:44.708357 #39176] INFO -- : [855/885] 80544=test_gem_bundler_version_finder I, [2024-05-14T10:14:44.722794 #39176] INFO -- : [856/885] 80543=test_emoji_breaks I, [2024-05-14T10:14:44.727484 #39176] INFO -- : [857/885] 80543=test_within_pipe I, [2024-05-14T10:14:44.749244 #39176] INFO -- : [858/885] 80544=test_rdoc_markup_to_bs I, [2024-05-14T10:14:44.796969 #39176] INFO -- : [859/885] 80544=test_help I, [2024-05-14T10:14:44.800263 #39176] INFO -- : [860/885] 80544=test_gem_commands_unpack_command I, [2024-05-14T10:14:44.823282 #39176] INFO -- : [861/885] 80540=test_files_lib I, [2024-05-14T10:14:44.824140 #39176] INFO -- : [862/885] 80540=test_beginendblock I, [2024-05-14T10:14:44.832804 #39176] INFO -- : [863/885] 80543=test_webauthn_listener_response I, [2024-05-14T10:14:44.838169 #39176] INFO -- : [864/885] 80547=test_time I, [2024-05-14T10:14:44.852382 #39176] INFO -- : [865/885] 80543=test_to_ary_concat I, [2024-05-14T10:14:44.988835 #39176] INFO -- : [866/885] 80552=test_stream I, [2024-05-14T10:14:44.994422 #39176] INFO -- : [867/885] 80552=test_printf I, [2024-05-14T10:14:45.019992 #39176] INFO -- : [868/885] 80552=test_rdoc_markup_pre_process I, [2024-05-14T10:14:45.025008 #39176] INFO -- : [869/885] 80547=test_pinned I, [2024-05-14T10:14:45.093413 #39176] INFO -- : [870/885] 80547=test_history I, [2024-05-14T10:14:45.106464 #39176] INFO -- : [871/885] 80547=test_date_marshal I, [2024-05-14T10:14:45.112706 #39176] INFO -- : [872/885] 80547=test_mkmf I, [2024-05-14T10:14:45.114487 #39176] INFO -- : [873/885] 80549=test_delegate I, [2024-05-14T10:14:45.132211 #39176] INFO -- : [874/885] 80549=test_popen_deadlock I, [2024-05-14T10:14:45.135901 #39176] INFO -- : [875/885] 80547=test_exit I, [2024-05-14T10:14:45.149121 #39176] INFO -- : [876/885] 80544=test_recursion I, [2024-05-14T10:14:45.153853 #39176] INFO -- : [877/885] 80552=test_ractor I, [2024-05-14T10:14:45.156680 #39176] INFO -- : [878/885] 80544=test_gem_security I, [2024-05-14T10:14:45.216230 #39176] INFO -- : [879/885] 80538=test_rdoc_servlet I, [2024-05-14T10:14:45.219006 #39176] INFO -- : [880/885] 80547=test_digest I, [2024-05-14T10:14:45.233172 #39176] INFO -- : [881/885] 80547=test_bundled_ca I, [2024-05-14T10:14:45.243327 #39176] INFO -- : [882/885] 80552=test_closure I, [2024-05-14T10:14:45.264212 #39176] INFO -- : [883/885] 80540=test_fiber I, [2024-05-14T10:14:45.347981 #39176] INFO -- : [884/885] 80536=test_multi_irb_commands I, [2024-05-14T10:14:45.359496 #39176] INFO -- : [885/885] 80536=test_open3 I, [2024-05-14T10:15:01.277648 #39176] INFO -- : Finished tests in 34.854448s, 756.6036 tests/s, 268397.3393 assertions/s. E, [2024-05-14T10:15:01.277841 #39176] ERROR -- : Children under /tmp/rubytest.g9ugae: E, [2024-05-14T10:15:01.277881 #39176] ERROR -- : * drwx------ 4 80 2024-05-14 10:14:42 +0000 gem_rebuild20240514-80535-qjffg5/ E, [2024-05-14T10:15:01.277907 #39176] ERROR -- : * drwxrwxr-x 2 60 2024-05-14 10:14:42 +0000 new/ E, [2024-05-14T10:15:01.277921 #39176] ERROR -- : * -rw-rw-r-- 1 4096 2024-05-14 10:14:42 +0000 rebuild_test_gem-1.0.0.gem E, [2024-05-14T10:15:01.277936 #39176] ERROR -- : * drwxrwxr-x 2 60 2024-05-14 10:14:42 +0000 old/ E, [2024-05-14T10:15:01.277949 #39176] ERROR -- : * -rw-rw-r-- 1 4096 2024-05-14 10:14:42 +0000 rebuild_test_gem-1.0.0.gem I, [2024-05-14T10:15:01.279117 #39176] INFO -- : 26371 tests, 9354841 assertions, 0 failures, 0 errors, 306 skips I, [2024-05-14T10:15:01.279162 #39176] INFO -- : I, [2024-05-14T10:15:01.279169 #39176] INFO -- : ruby -v: ruby 3.4.0dev (2024-05-14T08:22:36Z master 41e6fd066e) [x86_64-linux] I, [2024-05-14T10:15:01.281197 #39176] INFO -- : $$$[end] "make yes-test-all TESTOPTS='--stderr-on-failure' TESTS='-j20'" exit with 0. I, [2024-05-14T10:15:01.281333 #39176] INFO -- : $$$[beg] make yes-test-rubyspec MSPECOPT='--error-output stderr --debug -j' TESTS='-j20' I, [2024-05-14T10:15:01.369234 #39176] INFO -- : BASERUBY = /usr/bin/ruby --disable=gems I, [2024-05-14T10:15:01.369270 #39176] INFO -- : CC = gcc I, [2024-05-14T10:15:01.369276 #39176] INFO -- : LD = ld I, [2024-05-14T10:15:01.369280 #39176] INFO -- : LDSHARED = gcc -shared I, [2024-05-14T10:15:01.369285 #39176] INFO -- : CFLAGS = -O3 -fno-fast-math -ggdb3 -Wall -Wextra -Wdeprecated-declarations -Wdiv-by-zero -Wduplicated-cond -Wimplicit-function-declaration -Wimplicit-int -Wpointer-arith -Wwrite-strings -Wold-style-definition -Wimplicit-fallthrough=0 -Wmissing-noreturn -Wno-cast-function-type -Wno-constant-logical-operand -Wno-long-long -Wno-missing-field-initializers -Wno-overlength-strings -Wno-packed-bitfield-compat -Wno-parentheses-equality -Wno-self-assign -Wno-tautological-compare -Wno-unused-parameter -Wno-unused-value -Wsuggest-attribute=format -Wsuggest-attribute=noreturn -Wunused-variable -Wmisleading-indentation -Wundef -fPIC I, [2024-05-14T10:15:01.369297 #39176] INFO -- : XCFLAGS = -U_FORTIFY_SOURCE -D_FORTIFY_SOURCE=2 -fstack-protector-strong -fno-strict-overflow -fvisibility=hidden -fexcess-precision=standard -DRUBY_EXPORT -I. -I.ext/include/x86_64-linux -I/tmp/ruby/src/trunk/include -I/tmp/ruby/src/trunk -I/tmp/ruby/src/trunk/prism -I/tmp/ruby/src/trunk/enc/unicode/15.0.0 I, [2024-05-14T10:15:01.369301 #39176] INFO -- : CPPFLAGS = I, [2024-05-14T10:15:01.369311 #39176] INFO -- : DLDFLAGS = -Wl,--compress-debug-sections=zlib -Wl,-soname,libruby.so.3.4 -fstack-protector-strong I, [2024-05-14T10:15:01.369316 #39176] INFO -- : SOLIBS = -lz -lrt -lrt -lgmp -ldl -lcrypt -lm -lpthread I, [2024-05-14T10:15:01.369319 #39176] INFO -- : LANG = en_US.UTF-8 I, [2024-05-14T10:15:01.369323 #39176] INFO -- : LC_ALL = I, [2024-05-14T10:15:01.369327 #39176] INFO -- : LC_CTYPE = I, [2024-05-14T10:15:01.369330 #39176] INFO -- : MFLAGS = I, [2024-05-14T10:15:01.369333 #39176] INFO -- : RUSTC = no I, [2024-05-14T10:15:01.369338 #39176] INFO -- : YJIT_RUSTC_ARGS = --crate-name=yjit --crate-type=staticlib --edition=2021 -g -C lto=thin -C opt-level=3 -C overflow-checks=on '--out-dir=/tmp/ruby/build/trunk/yjit/target/release/' /tmp/ruby/src/trunk/yjit/src/lib.rs I, [2024-05-14T10:15:01.369929 #39176] INFO -- : gcc (Ubuntu 11.4.0-1ubuntu1~22.04) 11.4.0 I, [2024-05-14T10:15:01.369950 #39176] INFO -- : Copyright (C) 2021 Free Software Foundation, Inc. I, [2024-05-14T10:15:01.369955 #39176] INFO -- : This is free software; see the source for copying conditions. There is NO I, [2024-05-14T10:15:01.369960 #39176] INFO -- : warranty; not even for MERCHANTABILITY or FITNESS FOR A PARTICULAR PURPOSE. I, [2024-05-14T10:15:01.369964 #39176] INFO -- : I, [2024-05-14T10:15:01.371811 #39176] INFO -- : generating enc.mk I, [2024-05-14T10:15:01.488899 #39176] INFO -- : making enc I, [2024-05-14T10:15:01.506041 #39176] INFO -- : make[1]: Entering directory '/tmp/ruby/build/trunk' I, [2024-05-14T10:15:01.506081 #39176] INFO -- : make[1]: Nothing to be done for 'enc'. I, [2024-05-14T10:15:01.506089 #39176] INFO -- : make[1]: Leaving directory '/tmp/ruby/build/trunk' I, [2024-05-14T10:15:01.506834 #39176] INFO -- : making srcs under enc I, [2024-05-14T10:15:01.537659 #39176] INFO -- : make[1]: Entering directory '/tmp/ruby/build/trunk' I, [2024-05-14T10:15:01.537680 #39176] INFO -- : make[1]: Nothing to be done for 'srcs'. I, [2024-05-14T10:15:01.537686 #39176] INFO -- : make[1]: Leaving directory '/tmp/ruby/build/trunk' I, [2024-05-14T10:15:01.538670 #39176] INFO -- : generating transdb.h I, [2024-05-14T10:15:01.635495 #39176] INFO -- : transdb.h unchanged I, [2024-05-14T10:15:01.636767 #39176] INFO -- : making trans I, [2024-05-14T10:15:01.670304 #39176] INFO -- : make[1]: Entering directory '/tmp/ruby/build/trunk' I, [2024-05-14T10:15:01.670324 #39176] INFO -- : make[1]: Nothing to be done for 'trans'. I, [2024-05-14T10:15:01.670330 #39176] INFO -- : make[1]: Leaving directory '/tmp/ruby/build/trunk' I, [2024-05-14T10:15:01.671048 #39176] INFO -- : making encs I, [2024-05-14T10:15:01.709191 #39176] INFO -- : make[1]: Entering directory '/tmp/ruby/build/trunk' I, [2024-05-14T10:15:01.709212 #39176] INFO -- : make[1]: Nothing to be done for 'encs'. I, [2024-05-14T10:15:01.709218 #39176] INFO -- : make[1]: Leaving directory '/tmp/ruby/build/trunk' I, [2024-05-14T10:15:01.711128 #39176] INFO -- : generating makefiles ext/configure-ext.mk I, [2024-05-14T10:15:01.737644 #39176] INFO -- : ext/configure-ext.mk updated I, [2024-05-14T10:15:01.739953 #39176] INFO -- : make[1]: Entering directory '/tmp/ruby/build/trunk' I, [2024-05-14T10:15:03.083136 #39176] INFO -- : make[1]: Leaving directory '/tmp/ruby/build/trunk' I, [2024-05-14T10:15:03.083578 #39176] INFO -- : generating makefile exts.mk I, [2024-05-14T10:15:03.119999 #39176] INFO -- : exts.mk unchanged I, [2024-05-14T10:15:03.124824 #39176] INFO -- : make[1]: Entering directory '/tmp/ruby/build/trunk' I, [2024-05-14T10:15:03.421220 #39176] INFO -- : make[2]: Entering directory '/tmp/ruby/build/trunk/ext/coverage' I, [2024-05-14T10:15:03.424389 #39176] INFO -- : make[2]: Leaving directory '/tmp/ruby/build/trunk/ext/coverage' I, [2024-05-14T10:15:03.429810 #39176] INFO -- : make[2]: Entering directory '/tmp/ruby/build/trunk/ext/date' I, [2024-05-14T10:15:03.435315 #39176] INFO -- : make[2]: Leaving directory '/tmp/ruby/build/trunk/ext/date' I, [2024-05-14T10:15:03.439307 #39176] INFO -- : make[2]: Entering directory '/tmp/ruby/build/trunk/ext/digest' I, [2024-05-14T10:15:03.448118 #39176] INFO -- : make[2]: Leaving directory '/tmp/ruby/build/trunk/ext/digest' I, [2024-05-14T10:15:03.475161 #39176] INFO -- : make[2]: Entering directory '/tmp/ruby/build/trunk/ext/digest/sha2' I, [2024-05-14T10:15:03.480223 #39176] INFO -- : make[2]: Leaving directory '/tmp/ruby/build/trunk/ext/digest/sha2' I, [2024-05-14T10:15:03.500852 #39176] INFO -- : make[2]: Entering directory '/tmp/ruby/build/trunk/ext/fiddle' I, [2024-05-14T10:15:03.510107 #39176] INFO -- : make[2]: Leaving directory '/tmp/ruby/build/trunk/ext/fiddle' I, [2024-05-14T10:15:03.515164 #39176] INFO -- : make[2]: Entering directory '/tmp/ruby/build/trunk/ext/io/console' I, [2024-05-14T10:15:03.519327 #39176] INFO -- : make[2]: Leaving directory '/tmp/ruby/build/trunk/ext/io/console' I, [2024-05-14T10:15:03.532220 #39176] INFO -- : make[2]: Entering directory '/tmp/ruby/build/trunk/ext/json' I, [2024-05-14T10:15:03.542727 #39176] INFO -- : make[2]: Leaving directory '/tmp/ruby/build/trunk/ext/json' I, [2024-05-14T10:15:03.558019 #39176] INFO -- : make[2]: Entering directory '/tmp/ruby/build/trunk/ext/monitor' I, [2024-05-14T10:15:03.562021 #39176] INFO -- : make[2]: Leaving directory '/tmp/ruby/build/trunk/ext/monitor' I, [2024-05-14T10:15:03.569089 #39176] INFO -- : make[2]: Entering directory '/tmp/ruby/build/trunk/ext/objspace' I, [2024-05-14T10:15:03.575266 #39176] INFO -- : make[2]: Leaving directory '/tmp/ruby/build/trunk/ext/objspace' I, [2024-05-14T10:15:03.591109 #39176] INFO -- : make[2]: Entering directory '/tmp/ruby/build/trunk/ext/openssl' I, [2024-05-14T10:15:03.604223 #39176] INFO -- : make[2]: Leaving directory '/tmp/ruby/build/trunk/ext/openssl' I, [2024-05-14T10:15:03.607144 #39176] INFO -- : make[2]: Entering directory '/tmp/ruby/build/trunk/ext/pathname' I, [2024-05-14T10:15:03.609625 #39176] INFO -- : make[2]: Leaving directory '/tmp/ruby/build/trunk/ext/pathname' I, [2024-05-14T10:15:03.613900 #39176] INFO -- : make[2]: Entering directory '/tmp/ruby/build/trunk/ext/psych' I, [2024-05-14T10:15:03.636587 #39176] INFO -- : make[2]: Leaving directory '/tmp/ruby/build/trunk/ext/psych' I, [2024-05-14T10:15:03.641194 #39176] INFO -- : make[2]: Entering directory '/tmp/ruby/build/trunk/ext/pty' I, [2024-05-14T10:15:03.645293 #39176] INFO -- : make[2]: Leaving directory '/tmp/ruby/build/trunk/ext/pty' I, [2024-05-14T10:15:03.660835 #39176] INFO -- : make[2]: Entering directory '/tmp/ruby/build/trunk/ext/ripper' I, [2024-05-14T10:15:03.667922 #39176] INFO -- : make[2]: Leaving directory '/tmp/ruby/build/trunk/ext/ripper' I, [2024-05-14T10:15:03.670173 #39176] INFO -- : make[2]: Entering directory '/tmp/ruby/build/trunk/ext/rubyvm' I, [2024-05-14T10:15:03.673522 #39176] INFO -- : make[2]: Leaving directory '/tmp/ruby/build/trunk/ext/rubyvm' I, [2024-05-14T10:15:03.684495 #39176] INFO -- : make[2]: Entering directory '/tmp/ruby/build/trunk/ext/socket' I, [2024-05-14T10:15:03.691401 #39176] INFO -- : make[2]: Leaving directory '/tmp/ruby/build/trunk/ext/socket' I, [2024-05-14T10:15:03.708883 #39176] INFO -- : make[2]: Entering directory '/tmp/ruby/build/trunk/.bundle/gems/bigdecimal-3.1.8/ext/bigdecimal' I, [2024-05-14T10:15:03.739427 #39176] INFO -- : make[2]: Leaving directory '/tmp/ruby/build/trunk/.bundle/gems/bigdecimal-3.1.8/ext/bigdecimal' I, [2024-05-14T10:15:03.741495 #39176] INFO -- : make[2]: Entering directory '/tmp/ruby/build/trunk/.bundle/gems/debug-1.9.2/ext/debug' I, [2024-05-14T10:15:03.763037 #39176] INFO -- : make[2]: Leaving directory '/tmp/ruby/build/trunk/.bundle/gems/debug-1.9.2/ext/debug' I, [2024-05-14T10:15:03.764960 #39176] INFO -- : make[2]: Entering directory '/tmp/ruby/build/trunk/.bundle/gems/nkf-0.2.0/ext/nkf' I, [2024-05-14T10:15:03.786141 #39176] INFO -- : make[2]: Leaving directory '/tmp/ruby/build/trunk/.bundle/gems/nkf-0.2.0/ext/nkf' I, [2024-05-14T10:15:03.788126 #39176] INFO -- : make[2]: Entering directory '/tmp/ruby/build/trunk/.bundle/gems/racc-1.7.3/ext/racc/cparse' I, [2024-05-14T10:15:03.809564 #39176] INFO -- : make[2]: Leaving directory '/tmp/ruby/build/trunk/.bundle/gems/racc-1.7.3/ext/racc/cparse' I, [2024-05-14T10:15:03.811874 #39176] INFO -- : make[2]: Entering directory '/tmp/ruby/build/trunk/.bundle/gems/rbs-3.4.4/ext/rbs_extension' I, [2024-05-14T10:15:03.838830 #39176] INFO -- : make[2]: Leaving directory '/tmp/ruby/build/trunk/.bundle/gems/rbs-3.4.4/ext/rbs_extension' I, [2024-05-14T10:15:03.840797 #39176] INFO -- : make[2]: Entering directory '/tmp/ruby/build/trunk/.bundle/gems/syslog-0.1.2/ext/syslog' I, [2024-05-14T10:15:03.866841 #39176] INFO -- : make[2]: Leaving directory '/tmp/ruby/build/trunk/.bundle/gems/syslog-0.1.2/ext/syslog' I, [2024-05-14T10:15:03.895363 #39176] INFO -- : make[2]: Entering directory '/tmp/ruby/build/trunk' I, [2024-05-14T10:15:03.968636 #39176] INFO -- : make[2]: 'ruby' is up to date. I, [2024-05-14T10:15:03.968676 #39176] INFO -- : make[2]: Leaving directory '/tmp/ruby/build/trunk' I, [2024-05-14T10:15:03.969007 #39176] INFO -- : make[1]: Leaving directory '/tmp/ruby/build/trunk' I, [2024-05-14T10:15:03.972984 #39176] INFO -- : make[1]: Entering directory '/tmp/ruby/build/trunk' I, [2024-05-14T10:15:03.973005 #39176] INFO -- : make[1]: Nothing to be done for 'note'. I, [2024-05-14T10:15:03.973012 #39176] INFO -- : make[1]: Leaving directory '/tmp/ruby/build/trunk' E, [2024-05-14T10:15:04.030698 #39176] ERROR -- : $ /tmp/ruby/build/trunk/miniruby -I/tmp/ruby/src/trunk/lib /tmp/ruby/src/trunk/tool/runruby.rb --archdir=/tmp/ruby/build/trunk --extout=.ext -- /tmp/ruby/src/trunk/spec/mspec/bin/mspec-run -B /tmp/ruby/src/trunk/spec/default.mspec --error-output stderr --debug -fy -o /tmp/rubytest.8iup2n/1-mspec-multi-0 E, [2024-05-14T10:15:04.030929 #39176] ERROR -- : $ /tmp/ruby/build/trunk/miniruby -I/tmp/ruby/src/trunk/lib /tmp/ruby/src/trunk/tool/runruby.rb --archdir=/tmp/ruby/build/trunk --extout=.ext -- /tmp/ruby/src/trunk/spec/mspec/bin/mspec-run -B /tmp/ruby/src/trunk/spec/default.mspec --error-output stderr --debug -fy -o /tmp/rubytest.8iup2n/2-mspec-multi-1 E, [2024-05-14T10:15:04.031150 #39176] ERROR -- : $ /tmp/ruby/build/trunk/miniruby -I/tmp/ruby/src/trunk/lib /tmp/ruby/src/trunk/tool/runruby.rb --archdir=/tmp/ruby/build/trunk --extout=.ext -- /tmp/ruby/src/trunk/spec/mspec/bin/mspec-run -B /tmp/ruby/src/trunk/spec/default.mspec --error-output stderr --debug -fy -o /tmp/rubytest.8iup2n/3-mspec-multi-2 E, [2024-05-14T10:15:04.031300 #39176] ERROR -- : $ /tmp/ruby/build/trunk/miniruby -I/tmp/ruby/src/trunk/lib /tmp/ruby/src/trunk/tool/runruby.rb --archdir=/tmp/ruby/build/trunk --extout=.ext -- /tmp/ruby/src/trunk/spec/mspec/bin/mspec-run -B /tmp/ruby/src/trunk/spec/default.mspec --error-output stderr --debug -fy -o /tmp/rubytest.8iup2n/4-mspec-multi-3 E, [2024-05-14T10:15:04.031479 #39176] ERROR -- : $ /tmp/ruby/build/trunk/miniruby -I/tmp/ruby/src/trunk/lib /tmp/ruby/src/trunk/tool/runruby.rb --archdir=/tmp/ruby/build/trunk --extout=.ext -- /tmp/ruby/src/trunk/spec/mspec/bin/mspec-run -B /tmp/ruby/src/trunk/spec/default.mspec --error-output stderr --debug -fy -o /tmp/rubytest.8iup2n/5-mspec-multi-4 E, [2024-05-14T10:15:04.031668 #39176] ERROR -- : $ /tmp/ruby/build/trunk/miniruby -I/tmp/ruby/src/trunk/lib /tmp/ruby/src/trunk/tool/runruby.rb --archdir=/tmp/ruby/build/trunk --extout=.ext -- /tmp/ruby/src/trunk/spec/mspec/bin/mspec-run -B /tmp/ruby/src/trunk/spec/default.mspec --error-output stderr --debug -fy -o /tmp/rubytest.8iup2n/6-mspec-multi-5 E, [2024-05-14T10:15:04.031835 #39176] ERROR -- : $ /tmp/ruby/build/trunk/miniruby -I/tmp/ruby/src/trunk/lib /tmp/ruby/src/trunk/tool/runruby.rb --archdir=/tmp/ruby/build/trunk --extout=.ext -- /tmp/ruby/src/trunk/spec/mspec/bin/mspec-run -B /tmp/ruby/src/trunk/spec/default.mspec --error-output stderr --debug -fy -o /tmp/rubytest.8iup2n/7-mspec-multi-6 E, [2024-05-14T10:15:04.032188 #39176] ERROR -- : $ /tmp/ruby/build/trunk/miniruby -I/tmp/ruby/src/trunk/lib /tmp/ruby/src/trunk/tool/runruby.rb --archdir=/tmp/ruby/build/trunk --extout=.ext -- /tmp/ruby/src/trunk/spec/mspec/bin/mspec-run -B /tmp/ruby/src/trunk/spec/default.mspec --error-output stderr --debug -fy -o /tmp/rubytest.8iup2n/8-mspec-multi-7 E, [2024-05-14T10:15:04.032497 #39176] ERROR -- : $ /tmp/ruby/build/trunk/miniruby -I/tmp/ruby/src/trunk/lib /tmp/ruby/src/trunk/tool/runruby.rb --archdir=/tmp/ruby/build/trunk --extout=.ext -- /tmp/ruby/src/trunk/spec/mspec/bin/mspec-run -B /tmp/ruby/src/trunk/spec/default.mspec --error-output stderr --debug -fy -o /tmp/rubytest.8iup2n/9-mspec-multi-8 E, [2024-05-14T10:15:04.032960 #39176] ERROR -- : $ /tmp/ruby/build/trunk/miniruby -I/tmp/ruby/src/trunk/lib /tmp/ruby/src/trunk/tool/runruby.rb --archdir=/tmp/ruby/build/trunk --extout=.ext -- /tmp/ruby/src/trunk/spec/mspec/bin/mspec-run -B /tmp/ruby/src/trunk/spec/default.mspec --error-output stderr --debug -fy -o /tmp/rubytest.8iup2n/10-mspec-multi-9 E, [2024-05-14T10:15:04.033239 #39176] ERROR -- : $ /tmp/ruby/build/trunk/miniruby -I/tmp/ruby/src/trunk/lib /tmp/ruby/src/trunk/tool/runruby.rb --archdir=/tmp/ruby/build/trunk --extout=.ext -- /tmp/ruby/src/trunk/spec/mspec/bin/mspec-run -B /tmp/ruby/src/trunk/spec/default.mspec --error-output stderr --debug -fy -o /tmp/rubytest.8iup2n/11-mspec-multi-10 E, [2024-05-14T10:15:04.033531 #39176] ERROR -- : $ /tmp/ruby/build/trunk/miniruby -I/tmp/ruby/src/trunk/lib /tmp/ruby/src/trunk/tool/runruby.rb --archdir=/tmp/ruby/build/trunk --extout=.ext -- /tmp/ruby/src/trunk/spec/mspec/bin/mspec-run -B /tmp/ruby/src/trunk/spec/default.mspec --error-output stderr --debug -fy -o /tmp/rubytest.8iup2n/12-mspec-multi-11 E, [2024-05-14T10:15:04.033837 #39176] ERROR -- : $ /tmp/ruby/build/trunk/miniruby -I/tmp/ruby/src/trunk/lib /tmp/ruby/src/trunk/tool/runruby.rb --archdir=/tmp/ruby/build/trunk --extout=.ext -- /tmp/ruby/src/trunk/spec/mspec/bin/mspec-run -B /tmp/ruby/src/trunk/spec/default.mspec --error-output stderr --debug -fy -o /tmp/rubytest.8iup2n/13-mspec-multi-12 E, [2024-05-14T10:15:04.034055 #39176] ERROR -- : $ /tmp/ruby/build/trunk/miniruby -I/tmp/ruby/src/trunk/lib /tmp/ruby/src/trunk/tool/runruby.rb --archdir=/tmp/ruby/build/trunk --extout=.ext -- /tmp/ruby/src/trunk/spec/mspec/bin/mspec-run -B /tmp/ruby/src/trunk/spec/default.mspec --error-output stderr --debug -fy -o /tmp/rubytest.8iup2n/14-mspec-multi-13 E, [2024-05-14T10:15:04.034247 #39176] ERROR -- : $ /tmp/ruby/build/trunk/miniruby -I/tmp/ruby/src/trunk/lib /tmp/ruby/src/trunk/tool/runruby.rb --archdir=/tmp/ruby/build/trunk --extout=.ext -- /tmp/ruby/src/trunk/spec/mspec/bin/mspec-run -B /tmp/ruby/src/trunk/spec/default.mspec --error-output stderr --debug -fy -o /tmp/rubytest.8iup2n/15-mspec-multi-14 E, [2024-05-14T10:15:04.034442 #39176] ERROR -- : $ /tmp/ruby/build/trunk/miniruby -I/tmp/ruby/src/trunk/lib /tmp/ruby/src/trunk/tool/runruby.rb --archdir=/tmp/ruby/build/trunk --extout=.ext -- /tmp/ruby/src/trunk/spec/mspec/bin/mspec-run -B /tmp/ruby/src/trunk/spec/default.mspec --error-output stderr --debug -fy -o /tmp/rubytest.8iup2n/16-mspec-multi-15 E, [2024-05-14T10:15:04.034624 #39176] ERROR -- : $ /tmp/ruby/build/trunk/miniruby -I/tmp/ruby/src/trunk/lib /tmp/ruby/src/trunk/tool/runruby.rb --archdir=/tmp/ruby/build/trunk --extout=.ext -- /tmp/ruby/src/trunk/spec/mspec/bin/mspec-run -B /tmp/ruby/src/trunk/spec/default.mspec --error-output stderr --debug -fy -o /tmp/rubytest.8iup2n/17-mspec-multi-16 E, [2024-05-14T10:15:04.034804 #39176] ERROR -- : $ /tmp/ruby/build/trunk/miniruby -I/tmp/ruby/src/trunk/lib /tmp/ruby/src/trunk/tool/runruby.rb --archdir=/tmp/ruby/build/trunk --extout=.ext -- /tmp/ruby/src/trunk/spec/mspec/bin/mspec-run -B /tmp/ruby/src/trunk/spec/default.mspec --error-output stderr --debug -fy -o /tmp/rubytest.8iup2n/18-mspec-multi-17 E, [2024-05-14T10:15:04.037796 #39176] ERROR -- : $ /tmp/ruby/build/trunk/miniruby -I/tmp/ruby/src/trunk/lib /tmp/ruby/src/trunk/tool/runruby.rb --archdir=/tmp/ruby/build/trunk --extout=.ext -- /tmp/ruby/src/trunk/spec/mspec/bin/mspec-run -B /tmp/ruby/src/trunk/spec/default.mspec --error-output stderr --debug -fy -o /tmp/rubytest.8iup2n/19-mspec-multi-18 E, [2024-05-14T10:15:04.038074 #39176] ERROR -- : $ /tmp/ruby/build/trunk/miniruby -I/tmp/ruby/src/trunk/lib /tmp/ruby/src/trunk/tool/runruby.rb --archdir=/tmp/ruby/build/trunk --extout=.ext -- /tmp/ruby/src/trunk/spec/mspec/bin/mspec-run -B /tmp/ruby/src/trunk/spec/default.mspec --error-output stderr --debug -fy -o /tmp/rubytest.8iup2n/20-mspec-multi-19 I, [2024-05-14T10:15:04.203537 #39176] INFO -- : ruby 3.4.0dev (2024-05-14T08:22:36Z master 41e6fd066e) [x86_64-linux] I, [2024-05-14T10:15:04.805799 #39176] INFO -- : 0 ......................................................................... I, [2024-05-14T10:15:05.213074 #39176] INFO -- : 73 ......................................................................... I, [2024-05-14T10:15:05.346053 #39176] INFO -- : 146 ......................................................................... I, [2024-05-14T10:15:05.394312 #39176] INFO -- : 219 ......................................................................... I, [2024-05-14T10:15:05.449062 #39176] INFO -- : 292 ......................................................................... I, [2024-05-14T10:15:05.490383 #39176] INFO -- : 365 ......................................................................... I, [2024-05-14T10:15:05.509701 #39176] INFO -- : 438 ......................................................................... I, [2024-05-14T10:15:05.527009 #39176] INFO -- : 511 ......................................................................... I, [2024-05-14T10:15:05.545003 #39176] INFO -- : 584 ......................................................................... I, [2024-05-14T10:15:05.602370 #39176] INFO -- : 657 ......................................................................... I, [2024-05-14T10:15:05.629463 #39176] INFO -- : 730 ......................................................................... I, [2024-05-14T10:15:05.651583 #39176] INFO -- : 803 ......................................................................... I, [2024-05-14T10:15:05.685374 #39176] INFO -- : 876 ......................................................................... I, [2024-05-14T10:15:05.728328 #39176] INFO -- : 949 ......................................................................... I, [2024-05-14T10:15:05.816466 #39176] INFO -- : 1022 ......................................................................... I, [2024-05-14T10:15:06.005721 #39176] INFO -- : 1095 ......................................................................... I, [2024-05-14T10:15:06.107662 #39176] INFO -- : 1168 ......................................................................... I, [2024-05-14T10:15:06.163139 #39176] INFO -- : 1241 ......................................................................... I, [2024-05-14T10:15:06.208158 #39176] INFO -- : 1314 ......................................................................... I, [2024-05-14T10:15:06.228333 #39176] INFO -- : 1387 ......................................................................... I, [2024-05-14T10:15:06.331445 #39176] INFO -- : 1460 ......................................................................... I, [2024-05-14T10:15:06.784101 #39176] INFO -- : 1533 ......................................................................... I, [2024-05-14T10:15:06.840828 #39176] INFO -- : 1606 ......................................................................... I, [2024-05-14T10:15:06.948033 #39176] INFO -- : 1679 ......................................................................... I, [2024-05-14T10:15:07.064406 #39176] INFO -- : 1752 ......................................................................... I, [2024-05-14T10:15:07.154204 #39176] INFO -- : 1825 ......................................................................... I, [2024-05-14T10:15:07.243811 #39176] INFO -- : 1898 ......................................................................... I, [2024-05-14T10:15:07.328665 #39176] INFO -- : 1971 ......................................................................... I, [2024-05-14T10:15:07.393076 #39176] INFO -- : 2044 ......................................................................... I, [2024-05-14T10:15:07.444473 #39176] INFO -- : 2117 ......................................................................... I, [2024-05-14T10:15:07.465167 #39176] INFO -- : 2190 ......................................................................... I, [2024-05-14T10:15:07.483820 #39176] INFO -- : 2263 ......................................................................... I, [2024-05-14T10:15:07.499940 #39176] INFO -- : 2336 ......................................................................... I, [2024-05-14T10:15:07.530718 #39176] INFO -- : 2409 ......................................................................... I, [2024-05-14T10:15:07.638585 #39176] INFO -- : 2482 ......................................................................... I, [2024-05-14T10:15:07.661253 #39176] INFO -- : 2555 ......................................................................... I, [2024-05-14T10:15:07.756553 #39176] INFO -- : 2628 ......................................................................... I, [2024-05-14T10:15:07.864508 #39176] INFO -- : 2701 ......................................................................... I, [2024-05-14T10:15:07.899106 #39176] INFO -- : 2774 ......................................................................... I, [2024-05-14T10:15:07.961566 #39176] INFO -- : 2847 ......................................................................... I, [2024-05-14T10:15:07.998241 #39176] INFO -- : 2920 ......................................................................... I, [2024-05-14T10:15:08.020550 #39176] INFO -- : 2993 ......................................................................... I, [2024-05-14T10:15:08.044685 #39176] INFO -- : 3066 ......................................................................... I, [2024-05-14T10:15:08.056194 #39176] INFO -- : 3139 ......................................................................... I, [2024-05-14T10:15:08.066204 #39176] INFO -- : 3212 ......................................................................... I, [2024-05-14T10:15:08.096508 #39176] INFO -- : 3285 ......................................................................... I, [2024-05-14T10:15:12.072556 #39176] INFO -- : 3358 ........................................................................ I, [2024-05-14T10:15:12.072640 #39176] INFO -- : I, [2024-05-14T10:15:12.072655 #39176] INFO -- : Finished in 8.039383 seconds I, [2024-05-14T10:15:12.072666 #39176] INFO -- : I, [2024-05-14T10:15:12.072678 #39176] INFO -- : 3429 files, 32611 examples, 197991 expectations, 0 failures, 0 errors, 0 tagged I, [2024-05-14T10:15:12.075946 #39176] INFO -- : $$$[end] "make yes-test-rubyspec MSPECOPT='--error-output stderr --debug -j' TESTS='-j20'" exit with 0.