# Logfile created on 2024-05-14 07:31:33 +0000 by logger.rb/v1.4.3 I, [2024-05-14T07:31:33.649115 #1268856] INFO -- : #, @formatter=nil, @logdev=#, @binmode=false, @mon_data=#, @mon_data_owner_object_id=860>>> I, [2024-05-14T07:31:33.649241 #1268856] INFO -- : $$$[beg] make update-unicode -j20 I, [2024-05-14T07:31:33.707845 #1268856] INFO -- : Downloading Unicode emoji 15.0 files... I, [2024-05-14T07:31:33.707930 #1268856] INFO -- : Downloading Unicode emoji 15.0 files... I, [2024-05-14T07:31:33.708503 #1268856] INFO -- : Downloading Unicode emoji 15.0 files... I, [2024-05-14T07:31:33.749025 #1268856] INFO -- : made symlink emoji/15.0/emoji-sequences.txt to /tmp/ruby/src/trunk/.downloaded-cache/emoji/15.0/emoji-sequences.txt I, [2024-05-14T07:31:33.749258 #1268856] INFO -- : downloading emoji/15.0/emoji-sequences.txt ... downloading emoji/15.0/emoji-test.txt ... /tmp/ruby/src/trunk/enc/unicode/data/emoji/15.0/emoji-sequences.txt already exists E, [2024-05-14T07:31:34.191354 #1268856] ERROR -- : /tmp/ruby/src/trunk/tool/downloader.rb:302:in `rescue in download': failed to download emoji/15.0/emoji-test.txt (RuntimeError) E, [2024-05-14T07:31:34.191479 #1268856] ERROR -- : OpenURI::HTTPError: 403 Forbidden: https://www.unicode.org/Public/emoji/15.0/emoji-test.txt E, [2024-05-14T07:31:34.191507 #1268856] ERROR -- : from /tmp/ruby/src/trunk/tool/downloader.rb:201:in `download' E, [2024-05-14T07:31:34.191526 #1268856] ERROR -- : from /tmp/ruby/src/trunk/tool/downloader.rb:136:in `download' E, [2024-05-14T07:31:34.191539 #1268856] ERROR -- : from /tmp/ruby/src/trunk/tool/downloader.rb:482:in `block in
' E, [2024-05-14T07:31:34.191552 #1268856] ERROR -- : from /tmp/ruby/src/trunk/tool/downloader.rb:465:in `each' E, [2024-05-14T07:31:34.191565 #1268856] ERROR -- : from /tmp/ruby/src/trunk/tool/downloader.rb:465:in `
' E, [2024-05-14T07:31:34.191577 #1268856] ERROR -- : /usr/lib/ruby/3.0.0/open-uri.rb:364:in `open_http': 403 Forbidden (OpenURI::HTTPError) E, [2024-05-14T07:31:34.191589 #1268856] ERROR -- : from /usr/lib/ruby/3.0.0/open-uri.rb:741:in `buffer_open' E, [2024-05-14T07:31:34.191604 #1268856] ERROR -- : from /usr/lib/ruby/3.0.0/open-uri.rb:212:in `block in open_loop' E, [2024-05-14T07:31:34.191616 #1268856] ERROR -- : from /usr/lib/ruby/3.0.0/open-uri.rb:210:in `catch' E, [2024-05-14T07:31:34.191627 #1268856] ERROR -- : from /usr/lib/ruby/3.0.0/open-uri.rb:210:in `open_loop' E, [2024-05-14T07:31:34.191639 #1268856] ERROR -- : from /usr/lib/ruby/3.0.0/open-uri.rb:151:in `open_uri' E, [2024-05-14T07:31:34.191651 #1268856] ERROR -- : from /usr/lib/ruby/3.0.0/open-uri.rb:721:in `open' E, [2024-05-14T07:31:34.191663 #1268856] ERROR -- : from /usr/lib/ruby/3.0.0/open-uri.rb:729:in `read' E, [2024-05-14T07:31:34.191675 #1268856] ERROR -- : from /tmp/ruby/src/trunk/tool/downloader.rb:247:in `block in download' E, [2024-05-14T07:31:34.191747 #1268856] ERROR -- : from /tmp/ruby/src/trunk/tool/downloader.rb:378:in `with_retry' E, [2024-05-14T07:31:34.191766 #1268856] ERROR -- : from /tmp/ruby/src/trunk/tool/downloader.rb:246:in `download' E, [2024-05-14T07:31:34.191778 #1268856] ERROR -- : from /tmp/ruby/src/trunk/tool/downloader.rb:136:in `download' E, [2024-05-14T07:31:34.191791 #1268856] ERROR -- : from /tmp/ruby/src/trunk/tool/downloader.rb:482:in `block in
' E, [2024-05-14T07:31:34.191803 #1268856] ERROR -- : from /tmp/ruby/src/trunk/tool/downloader.rb:465:in `each' E, [2024-05-14T07:31:34.191815 #1268856] ERROR -- : from /tmp/ruby/src/trunk/tool/downloader.rb:465:in `
' E, [2024-05-14T07:31:34.196105 #1268856] ERROR -- : make: *** [uncommon.mk:1765: /tmp/ruby/src/trunk/enc/unicode/data/emoji/15.0/emoji-sequences.txt] Error 1 E, [2024-05-14T07:31:34.196164 #1268856] ERROR -- : make: *** Deleting file '/tmp/ruby/src/trunk/enc/unicode/data/emoji/15.0/emoji-sequences.txt' E, [2024-05-14T07:31:34.196178 #1268856] ERROR -- : make: *** Waiting for unfinished jobs.... E, [2024-05-14T07:31:34.209856 #1268856] ERROR -- : /tmp/ruby/src/trunk/tool/downloader.rb:302:in `rescue in download': failed to download emoji/15.0/emoji-test.txt (RuntimeError) E, [2024-05-14T07:31:34.209952 #1268856] ERROR -- : OpenURI::HTTPError: 403 Forbidden: https://www.unicode.org/Public/emoji/15.0/emoji-test.txt E, [2024-05-14T07:31:34.209971 #1268856] ERROR -- : from /tmp/ruby/src/trunk/tool/downloader.rb:201:in `download' E, [2024-05-14T07:31:34.209983 #1268856] ERROR -- : from /tmp/ruby/src/trunk/tool/downloader.rb:136:in `download' E, [2024-05-14T07:31:34.209994 #1268856] ERROR -- : from /tmp/ruby/src/trunk/tool/downloader.rb:482:in `block in
' E, [2024-05-14T07:31:34.210005 #1268856] ERROR -- : from /tmp/ruby/src/trunk/tool/downloader.rb:465:in `each' E, [2024-05-14T07:31:34.210016 #1268856] ERROR -- : from /tmp/ruby/src/trunk/tool/downloader.rb:465:in `
' E, [2024-05-14T07:31:34.210031 #1268856] ERROR -- : /usr/lib/ruby/3.0.0/open-uri.rb:364:in `open_http': 403 Forbidden (OpenURI::HTTPError) E, [2024-05-14T07:31:34.210043 #1268856] ERROR -- : from /usr/lib/ruby/3.0.0/open-uri.rb:741:in `buffer_open' E, [2024-05-14T07:31:34.210055 #1268856] ERROR -- : from /usr/lib/ruby/3.0.0/open-uri.rb:212:in `block in open_loop' E, [2024-05-14T07:31:34.210066 #1268856] ERROR -- : from /usr/lib/ruby/3.0.0/open-uri.rb:210:in `catch' E, [2024-05-14T07:31:34.210077 #1268856] ERROR -- : from /usr/lib/ruby/3.0.0/open-uri.rb:210:in `open_loop' E, [2024-05-14T07:31:34.210087 #1268856] ERROR -- : from /usr/lib/ruby/3.0.0/open-uri.rb:151:in `open_uri' E, [2024-05-14T07:31:34.210098 #1268856] ERROR -- : from /usr/lib/ruby/3.0.0/open-uri.rb:721:in `open' E, [2024-05-14T07:31:34.210109 #1268856] ERROR -- : from /usr/lib/ruby/3.0.0/open-uri.rb:729:in `read' E, [2024-05-14T07:31:34.210119 #1268856] ERROR -- : from /tmp/ruby/src/trunk/tool/downloader.rb:247:in `block in download' E, [2024-05-14T07:31:34.210133 #1268856] ERROR -- : from /tmp/ruby/src/trunk/tool/downloader.rb:378:in `with_retry' E, [2024-05-14T07:31:34.210144 #1268856] ERROR -- : from /tmp/ruby/src/trunk/tool/downloader.rb:246:in `download' E, [2024-05-14T07:31:34.210155 #1268856] ERROR -- : from /tmp/ruby/src/trunk/tool/downloader.rb:136:in `download' E, [2024-05-14T07:31:34.210165 #1268856] ERROR -- : from /tmp/ruby/src/trunk/tool/downloader.rb:482:in `block in
' E, [2024-05-14T07:31:34.210177 #1268856] ERROR -- : from /tmp/ruby/src/trunk/tool/downloader.rb:465:in `each' E, [2024-05-14T07:31:34.210199 #1268856] ERROR -- : from /tmp/ruby/src/trunk/tool/downloader.rb:465:in `
' E, [2024-05-14T07:31:34.214318 #1268856] ERROR -- : make: *** [uncommon.mk:1765: /tmp/ruby/src/trunk/enc/unicode/data/emoji/15.0/emoji-zwj-sequences.txt] Error 1 E, [2024-05-14T07:31:34.643173 #1268856] ERROR -- : /tmp/ruby/src/trunk/tool/downloader.rb:302:in `rescue in download': failed to download emoji/15.0/emoji-sequences.txt (RuntimeError) E, [2024-05-14T07:31:34.643361 #1268856] ERROR -- : EOFError: end of file reached: https://www.unicode.org/Public/emoji/15.0/emoji-sequences.txt E, [2024-05-14T07:31:34.643385 #1268856] ERROR -- : from /tmp/ruby/src/trunk/tool/downloader.rb:201:in `download' E, [2024-05-14T07:31:34.643399 #1268856] ERROR -- : from /tmp/ruby/src/trunk/tool/downloader.rb:136:in `download' E, [2024-05-14T07:31:34.643412 #1268856] ERROR -- : from /tmp/ruby/src/trunk/tool/downloader.rb:482:in `block in
' E, [2024-05-14T07:31:34.643425 #1268856] ERROR -- : from /tmp/ruby/src/trunk/tool/downloader.rb:465:in `each' E, [2024-05-14T07:31:34.643438 #1268856] ERROR -- : from /tmp/ruby/src/trunk/tool/downloader.rb:465:in `
' E, [2024-05-14T07:31:34.643452 #1268856] ERROR -- : /usr/lib/ruby/3.0.0/net/protocol.rb:227:in `rbuf_fill': end of file reached (EOFError) E, [2024-05-14T07:31:34.643477 #1268856] ERROR -- : from /usr/lib/ruby/3.0.0/net/protocol.rb:193:in `readuntil' E, [2024-05-14T07:31:34.643490 #1268856] ERROR -- : from /usr/lib/ruby/3.0.0/net/protocol.rb:203:in `readline' E, [2024-05-14T07:31:34.643504 #1268856] ERROR -- : from /usr/lib/ruby/3.0.0/net/http/response.rb:42:in `read_status_line' E, [2024-05-14T07:31:34.643517 #1268856] ERROR -- : from /usr/lib/ruby/3.0.0/net/http/response.rb:31:in `read_new' E, [2024-05-14T07:31:34.643530 #1268856] ERROR -- : from /usr/lib/ruby/3.0.0/net/http.rb:1557:in `block in transport_request' E, [2024-05-14T07:31:34.643543 #1268856] ERROR -- : from /usr/lib/ruby/3.0.0/net/http.rb:1548:in `catch' E, [2024-05-14T07:31:34.643826 #1268856] ERROR -- : from /usr/lib/ruby/3.0.0/net/http.rb:1548:in `transport_request' E, [2024-05-14T07:31:34.643845 #1268856] ERROR -- : from /usr/lib/ruby/3.0.0/net/http.rb:1521:in `request' E, [2024-05-14T07:31:34.643858 #1268856] ERROR -- : from /usr/lib/ruby/3.0.0/open-uri.rb:329:in `block in open_http' E, [2024-05-14T07:31:34.643871 #1268856] ERROR -- : from /usr/lib/ruby/3.0.0/net/http.rb:960:in `start' E, [2024-05-14T07:31:34.643884 #1268856] ERROR -- : from /usr/lib/ruby/3.0.0/open-uri.rb:323:in `open_http' E, [2024-05-14T07:31:34.643897 #1268856] ERROR -- : from /usr/lib/ruby/3.0.0/open-uri.rb:741:in `buffer_open' E, [2024-05-14T07:31:34.643914 #1268856] ERROR -- : from /usr/lib/ruby/3.0.0/open-uri.rb:212:in `block in open_loop' E, [2024-05-14T07:31:34.643927 #1268856] ERROR -- : from /usr/lib/ruby/3.0.0/open-uri.rb:210:in `catch' E, [2024-05-14T07:31:34.643939 #1268856] ERROR -- : from /usr/lib/ruby/3.0.0/open-uri.rb:210:in `open_loop' E, [2024-05-14T07:31:34.643952 #1268856] ERROR -- : from /usr/lib/ruby/3.0.0/open-uri.rb:151:in `open_uri' E, [2024-05-14T07:31:34.643965 #1268856] ERROR -- : from /usr/lib/ruby/3.0.0/open-uri.rb:721:in `open' E, [2024-05-14T07:31:34.643981 #1268856] ERROR -- : from /usr/lib/ruby/3.0.0/open-uri.rb:729:in `read' E, [2024-05-14T07:31:34.643995 #1268856] ERROR -- : from /tmp/ruby/src/trunk/tool/downloader.rb:247:in `block in download' E, [2024-05-14T07:31:34.644008 #1268856] ERROR -- : from /tmp/ruby/src/trunk/tool/downloader.rb:378:in `with_retry' E, [2024-05-14T07:31:34.644021 #1268856] ERROR -- : from /tmp/ruby/src/trunk/tool/downloader.rb:246:in `download' E, [2024-05-14T07:31:34.644037 #1268856] ERROR -- : from /tmp/ruby/src/trunk/tool/downloader.rb:136:in `download' E, [2024-05-14T07:31:34.644050 #1268856] ERROR -- : from /tmp/ruby/src/trunk/tool/downloader.rb:482:in `block in
' E, [2024-05-14T07:31:34.644063 #1268856] ERROR -- : from /tmp/ruby/src/trunk/tool/downloader.rb:465:in `each' E, [2024-05-14T07:31:34.644076 #1268856] ERROR -- : from /tmp/ruby/src/trunk/tool/downloader.rb:465:in `
' E, [2024-05-14T07:31:34.648394 #1268856] ERROR -- : make: *** [uncommon.mk:1765: /tmp/ruby/src/trunk/enc/unicode/data/emoji/15.0/emoji-test.txt] Error 1 I, [2024-05-14T07:31:34.648544 #1268856] INFO -- : downloading emoji/15.0/emoji-test.txt ... I, [2024-05-14T07:31:34.649042 #1268856] INFO -- : $$$[end] "make update-unicode -j20" exit with 512. I, [2024-05-14T07:31:34.649128 #1268856] INFO -- : $$$[beg] make update-download -j20 I, [2024-05-14T07:31:34.753760 #1268856] INFO -- : tool/config.guess already exists I, [2024-05-14T07:31:34.753797 #1268856] INFO -- : tool/config.sub already exists I, [2024-05-14T07:31:34.755835 #1268856] INFO -- : Update minitest to ea9caafc0754b1d6236a490d59e624b53209734a I, [2024-05-14T07:31:34.755968 #1268856] INFO -- : Update power_assert to 84e85124c5014a139af39161d484156cfe87a9ed I, [2024-05-14T07:31:34.756290 #1268856] INFO -- : Update rbs to ba7872795d5de04adb8ff500c0e6afdc81a041dd I, [2024-05-14T07:31:34.757179 #1268856] INFO -- : Update typeprof to b19a6416da3a05d57fadd6ffdadb382b6d236ca5 I, [2024-05-14T07:31:34.757460 #1268856] INFO -- : echo ea9caafc0754b1d6236a490d59e624b53209734a | /bin/sh /tmp/ruby/src/trunk/tool/ifchange /tmp/ruby/src/trunk/.bundle/.timestamp/minitest.revision - I, [2024-05-14T07:31:34.757704 #1268856] INFO -- : echo 84e85124c5014a139af39161d484156cfe87a9ed | /bin/sh /tmp/ruby/src/trunk/tool/ifchange /tmp/ruby/src/trunk/.bundle/.timestamp/power_assert.revision - I, [2024-05-14T07:31:34.757894 #1268856] INFO -- : echo ba7872795d5de04adb8ff500c0e6afdc81a041dd | /bin/sh /tmp/ruby/src/trunk/tool/ifchange /tmp/ruby/src/trunk/.bundle/.timestamp/rbs.revision - I, [2024-05-14T07:31:34.758201 #1268856] INFO -- : echo b19a6416da3a05d57fadd6ffdadb382b6d236ca5 | /bin/sh /tmp/ruby/src/trunk/tool/ifchange /tmp/ruby/src/trunk/.bundle/.timestamp/typeprof.revision - I, [2024-05-14T07:31:34.759358 #1268856] INFO -- : /tmp/ruby/src/trunk/.bundle/.timestamp/minitest.revision unchanged I, [2024-05-14T07:31:34.759459 #1268856] INFO -- : /tmp/ruby/src/trunk/.bundle/.timestamp/power_assert.revision unchanged I, [2024-05-14T07:31:34.759626 #1268856] INFO -- : /tmp/ruby/src/trunk/.bundle/.timestamp/rbs.revision unchanged I, [2024-05-14T07:31:34.760040 #1268856] INFO -- : /tmp/ruby/src/trunk/.bundle/.timestamp/typeprof.revision unchanged I, [2024-05-14T07:31:34.760382 #1268856] INFO -- : Building power_assert@84e85124c5014a139af39161d484156cfe87a9ed to /tmp/ruby/src/trunk/gems/power_assert-2.0.3.gem I, [2024-05-14T07:31:34.829438 #1268856] INFO -- : Successfully built RubyGem I, [2024-05-14T07:31:34.829495 #1268856] INFO -- : Name: power_assert I, [2024-05-14T07:31:34.829514 #1268856] INFO -- : Version: 2.0.4dev I, [2024-05-14T07:31:34.829525 #1268856] INFO -- : File: power_assert-2.0.4dev.gem I, [2024-05-14T07:31:34.874455 #1268856] INFO -- : $$$[end] "make update-download -j20" exit with 0. I, [2024-05-14T07:31:34.874516 #1268856] INFO -- : $$$[beg] make update-rubyspec -j20 I, [2024-05-14T07:31:34.933207 #1268856] INFO -- : make: Nothing to be done for 'update-rubyspec'. I, [2024-05-14T07:31:34.933462 #1268856] INFO -- : $$$[end] "make update-rubyspec -j20" exit with 0. I, [2024-05-14T07:31:34.933500 #1268856] INFO -- : $$$[beg] make update-src -j20 I, [2024-05-14T07:31:35.529612 #1268856] INFO -- : Already up to date. I, [2024-05-14T07:31:35.544405 #1268856] INFO -- : Latest commit hash = b60f09442a I, [2024-05-14T07:31:35.545770 #1268856] INFO -- : $$$[end] "make update-src -j20" exit with 0. I, [2024-05-14T07:31:35.545848 #1268856] INFO -- : $$$[beg] make after-update -j20 I, [2024-05-14T07:31:35.629769 #1268856] INFO -- : generating /tmp/ruby/src/trunk/ext/ripper/eventids2table.c I, [2024-05-14T07:31:35.633967 #1268856] INFO -- : make[1]: Entering directory '/tmp/ruby/src/trunk/ext/ripper' I, [2024-05-14T07:31:35.634014 #1268856] INFO -- : make[1]: Nothing to be done for 'src'. I, [2024-05-14T07:31:35.634027 #1268856] INFO -- : make[1]: Leaving directory '/tmp/ruby/src/trunk/ext/ripper' I, [2024-05-14T07:31:35.651391 #1268856] INFO -- : /tmp/ruby/src/trunk/revision.h updated I, [2024-05-14T07:31:35.652618 #1268856] INFO -- : generating x86_64-linux-fake.rb I, [2024-05-14T07:31:35.709483 #1268856] INFO -- : x86_64-linux-fake.rb updated I, [2024-05-14T07:31:35.711065 #1268856] INFO -- : generating enc.mk I, [2024-05-14T07:31:35.835673 #1268856] INFO -- : making srcs under enc I, [2024-05-14T07:31:35.865652 #1268856] INFO -- : make[1]: Entering directory '/tmp/ruby/build/trunk' I, [2024-05-14T07:31:35.865690 #1268856] INFO -- : make[1]: Nothing to be done for 'srcs'. I, [2024-05-14T07:31:35.865695 #1268856] INFO -- : make[1]: Leaving directory '/tmp/ruby/build/trunk' I, [2024-05-14T07:31:35.910656 #1268856] INFO -- : Update minitest to ea9caafc0754b1d6236a490d59e624b53209734a I, [2024-05-14T07:31:35.910872 #1268856] INFO -- : Update power_assert to 84e85124c5014a139af39161d484156cfe87a9ed I, [2024-05-14T07:31:35.911398 #1268856] INFO -- : Update rbs to ba7872795d5de04adb8ff500c0e6afdc81a041dd I, [2024-05-14T07:31:35.911670 #1268856] INFO -- : Update typeprof to b19a6416da3a05d57fadd6ffdadb382b6d236ca5 I, [2024-05-14T07:31:35.912078 #1268856] INFO -- : echo ea9caafc0754b1d6236a490d59e624b53209734a | /bin/sh /tmp/ruby/src/trunk/tool/ifchange /tmp/ruby/src/trunk/.bundle/.timestamp/minitest.revision - I, [2024-05-14T07:31:35.912316 #1268856] INFO -- : echo 84e85124c5014a139af39161d484156cfe87a9ed | /bin/sh /tmp/ruby/src/trunk/tool/ifchange /tmp/ruby/src/trunk/.bundle/.timestamp/power_assert.revision - I, [2024-05-14T07:31:35.913832 #1268856] INFO -- : echo ba7872795d5de04adb8ff500c0e6afdc81a041dd | /bin/sh /tmp/ruby/src/trunk/tool/ifchange /tmp/ruby/src/trunk/.bundle/.timestamp/rbs.revision - I, [2024-05-14T07:31:35.914051 #1268856] INFO -- : echo b19a6416da3a05d57fadd6ffdadb382b6d236ca5 | /bin/sh /tmp/ruby/src/trunk/tool/ifchange /tmp/ruby/src/trunk/.bundle/.timestamp/typeprof.revision - I, [2024-05-14T07:31:35.914240 #1268856] INFO -- : /tmp/ruby/src/trunk/.bundle/.timestamp/minitest.revision unchanged I, [2024-05-14T07:31:35.914357 #1268856] INFO -- : /tmp/ruby/src/trunk/.bundle/.timestamp/power_assert.revision unchanged I, [2024-05-14T07:31:35.915310 #1268856] INFO -- : Building power_assert@84e85124c5014a139af39161d484156cfe87a9ed to /tmp/ruby/src/trunk/gems/power_assert-2.0.3.gem I, [2024-05-14T07:31:35.915428 #1268856] INFO -- : /tmp/ruby/src/trunk/.bundle/.timestamp/rbs.revision unchanged I, [2024-05-14T07:31:35.915704 #1268856] INFO -- : /tmp/ruby/src/trunk/.bundle/.timestamp/typeprof.revision unchanged I, [2024-05-14T07:31:35.984401 #1268856] INFO -- : Successfully built RubyGem I, [2024-05-14T07:31:35.984453 #1268856] INFO -- : Name: power_assert I, [2024-05-14T07:31:35.984459 #1268856] INFO -- : Version: 2.0.4dev I, [2024-05-14T07:31:35.984468 #1268856] INFO -- : File: power_assert-2.0.4dev.gem I, [2024-05-14T07:31:35.986816 #1268856] INFO -- : Extracting bundle gem power_assert-2.0.3... I, [2024-05-14T07:31:36.047242 #1268856] INFO -- : Try with hash version of bundled gems instead of gems/power_assert-2.0.3.gem. We don't use this gem with release version of Ruby. I, [2024-05-14T07:31:36.052158 #1268856] INFO -- : Unpacked gems/power_assert-2.0.4dev.gem I, [2024-05-14T07:31:36.054466 #1268856] INFO -- : $$$[end] "make after-update -j20" exit with 0. I, [2024-05-14T07:31:36.054617 #1268856] INFO -- : $$$[beg] make miniruby -j20 I, [2024-05-14T07:31:36.111628 #1268856] INFO -- : BASERUBY = /usr/bin/ruby --disable=gems I, [2024-05-14T07:31:36.111672 #1268856] INFO -- : CC = gcc I, [2024-05-14T07:31:36.111685 #1268856] INFO -- : LD = ld I, [2024-05-14T07:31:36.111702 #1268856] INFO -- : LDSHARED = gcc -shared I, [2024-05-14T07:31:36.111714 #1268856] INFO -- : CFLAGS = -O3 -fno-fast-math -ggdb3 -Wall -Wextra -Wdeprecated-declarations -Wdiv-by-zero -Wduplicated-cond -Wimplicit-function-declaration -Wimplicit-int -Wpointer-arith -Wwrite-strings -Wold-style-definition -Wimplicit-fallthrough=0 -Wmissing-noreturn -Wno-cast-function-type -Wno-constant-logical-operand -Wno-long-long -Wno-missing-field-initializers -Wno-overlength-strings -Wno-packed-bitfield-compat -Wno-parentheses-equality -Wno-self-assign -Wno-tautological-compare -Wno-unused-parameter -Wno-unused-value -Wsuggest-attribute=format -Wsuggest-attribute=noreturn -Wunused-variable -Wmisleading-indentation -Wundef -fPIC I, [2024-05-14T07:31:36.111725 #1268856] INFO -- : XCFLAGS = -U_FORTIFY_SOURCE -D_FORTIFY_SOURCE=2 -fstack-protector-strong -fno-strict-overflow -fvisibility=hidden -fexcess-precision=standard -DRUBY_EXPORT -I. -I.ext/include/x86_64-linux -I/tmp/ruby/src/trunk/include -I/tmp/ruby/src/trunk -I/tmp/ruby/src/trunk/prism -I/tmp/ruby/src/trunk/enc/unicode/15.0.0 I, [2024-05-14T07:31:36.111745 #1268856] INFO -- : CPPFLAGS = I, [2024-05-14T07:31:36.111756 #1268856] INFO -- : DLDFLAGS = -Wl,--compress-debug-sections=zlib -Wl,-soname,libruby.so.3.4 -fstack-protector-strong I, [2024-05-14T07:31:36.111767 #1268856] INFO -- : SOLIBS = -lz -lrt -lrt -lgmp -ldl -lcrypt -lm -lpthread I, [2024-05-14T07:31:36.111777 #1268856] INFO -- : LANG = en_US.UTF-8 I, [2024-05-14T07:31:36.111787 #1268856] INFO -- : LC_ALL = I, [2024-05-14T07:31:36.111796 #1268856] INFO -- : LC_CTYPE = I, [2024-05-14T07:31:36.111917 #1268856] INFO -- : MFLAGS = -j20 --jobserver-auth=4,5 I, [2024-05-14T07:31:36.111937 #1268856] INFO -- : RUSTC = no I, [2024-05-14T07:31:36.111942 #1268856] INFO -- : YJIT_RUSTC_ARGS = --crate-name=yjit --crate-type=staticlib --edition=2021 -g -C lto=thin -C opt-level=3 -C overflow-checks=on '--out-dir=/tmp/ruby/build/trunk/yjit/target/release/' /tmp/ruby/src/trunk/yjit/src/lib.rs I, [2024-05-14T07:31:36.112984 #1268856] INFO -- : gcc (Ubuntu 11.4.0-1ubuntu1~22.04) 11.4.0 I, [2024-05-14T07:31:36.113009 #1268856] INFO -- : Copyright (C) 2021 Free Software Foundation, Inc. I, [2024-05-14T07:31:36.113014 #1268856] INFO -- : This is free software; see the source for copying conditions. There is NO I, [2024-05-14T07:31:36.113018 #1268856] INFO -- : warranty; not even for MERCHANTABILITY or FITNESS FOR A PARTICULAR PURPOSE. I, [2024-05-14T07:31:36.113022 #1268856] INFO -- : I, [2024-05-14T07:31:36.134038 #1268856] INFO -- : compiling /tmp/ruby/src/trunk/version.c I, [2024-05-14T07:31:36.236827 #1268856] INFO -- : linking miniruby I, [2024-05-14T07:31:36.758684 #1268856] INFO -- : $$$[end] "make miniruby -j20" exit with 0. I, [2024-05-14T07:31:36.758795 #1268856] INFO -- : $$$[beg] make ruby -j20 I, [2024-05-14T07:31:36.816300 #1268856] INFO -- : BASERUBY = /usr/bin/ruby --disable=gems I, [2024-05-14T07:31:36.816330 #1268856] INFO -- : CC = gcc I, [2024-05-14T07:31:36.816335 #1268856] INFO -- : LD = ld I, [2024-05-14T07:31:36.816339 #1268856] INFO -- : LDSHARED = gcc -shared I, [2024-05-14T07:31:36.816346 #1268856] INFO -- : CFLAGS = -O3 -fno-fast-math -ggdb3 -Wall -Wextra -Wdeprecated-declarations -Wdiv-by-zero -Wduplicated-cond -Wimplicit-function-declaration -Wimplicit-int -Wpointer-arith -Wwrite-strings -Wold-style-definition -Wimplicit-fallthrough=0 -Wmissing-noreturn -Wno-cast-function-type -Wno-constant-logical-operand -Wno-long-long -Wno-missing-field-initializers -Wno-overlength-strings -Wno-packed-bitfield-compat -Wno-parentheses-equality -Wno-self-assign -Wno-tautological-compare -Wno-unused-parameter -Wno-unused-value -Wsuggest-attribute=format -Wsuggest-attribute=noreturn -Wunused-variable -Wmisleading-indentation -Wundef -fPIC I, [2024-05-14T07:31:36.816351 #1268856] INFO -- : XCFLAGS = -U_FORTIFY_SOURCE -D_FORTIFY_SOURCE=2 -fstack-protector-strong -fno-strict-overflow -fvisibility=hidden -fexcess-precision=standard -DRUBY_EXPORT -I. -I.ext/include/x86_64-linux -I/tmp/ruby/src/trunk/include -I/tmp/ruby/src/trunk -I/tmp/ruby/src/trunk/prism -I/tmp/ruby/src/trunk/enc/unicode/15.0.0 I, [2024-05-14T07:31:36.816355 #1268856] INFO -- : CPPFLAGS = I, [2024-05-14T07:31:36.816358 #1268856] INFO -- : DLDFLAGS = -Wl,--compress-debug-sections=zlib -Wl,-soname,libruby.so.3.4 -fstack-protector-strong I, [2024-05-14T07:31:36.816362 #1268856] INFO -- : SOLIBS = -lz -lrt -lrt -lgmp -ldl -lcrypt -lm -lpthread I, [2024-05-14T07:31:36.816365 #1268856] INFO -- : LANG = en_US.UTF-8 I, [2024-05-14T07:31:36.816368 #1268856] INFO -- : LC_ALL = I, [2024-05-14T07:31:36.816372 #1268856] INFO -- : LC_CTYPE = I, [2024-05-14T07:31:36.816375 #1268856] INFO -- : MFLAGS = -j20 --jobserver-auth=4,5 I, [2024-05-14T07:31:36.816379 #1268856] INFO -- : RUSTC = no I, [2024-05-14T07:31:36.816383 #1268856] INFO -- : YJIT_RUSTC_ARGS = --crate-name=yjit --crate-type=staticlib --edition=2021 -g -C lto=thin -C opt-level=3 -C overflow-checks=on '--out-dir=/tmp/ruby/build/trunk/yjit/target/release/' /tmp/ruby/src/trunk/yjit/src/lib.rs I, [2024-05-14T07:31:36.817731 #1268856] INFO -- : gcc (Ubuntu 11.4.0-1ubuntu1~22.04) 11.4.0 I, [2024-05-14T07:31:36.817756 #1268856] INFO -- : Copyright (C) 2021 Free Software Foundation, Inc. I, [2024-05-14T07:31:36.817761 #1268856] INFO -- : This is free software; see the source for copying conditions. There is NO I, [2024-05-14T07:31:36.817765 #1268856] INFO -- : warranty; not even for MERCHANTABILITY or FITNESS FOR A PARTICULAR PURPOSE. I, [2024-05-14T07:31:36.817769 #1268856] INFO -- : I, [2024-05-14T07:31:36.926186 #1268856] INFO -- : builtin_binary.inc updated I, [2024-05-14T07:31:36.930775 #1268856] INFO -- : c5234a9416e4f20f175185e840b25b0f08674d14078ed7083f37e655458e3ca9 builtin_binary.inc I, [2024-05-14T07:31:36.931331 #1268856] INFO -- : compiling /tmp/ruby/src/trunk/builtin.c I, [2024-05-14T07:31:37.113275 #1268856] INFO -- : linking static-library libruby-static.a I, [2024-05-14T07:31:37.422853 #1268856] INFO -- : linking shared-library libruby.so.3.4.0 I, [2024-05-14T07:31:38.959539 #1268856] INFO -- : linking ruby I, [2024-05-14T07:31:38.984099 #1268856] INFO -- : $$$[end] "make ruby -j20" exit with 0. I, [2024-05-14T07:31:38.984229 #1268856] INFO -- : $$$[beg] make all -j20 I, [2024-05-14T07:31:39.046050 #1268856] INFO -- : BASERUBY = /usr/bin/ruby --disable=gems I, [2024-05-14T07:31:39.046097 #1268856] INFO -- : CC = gcc I, [2024-05-14T07:31:39.046106 #1268856] INFO -- : LD = ld I, [2024-05-14T07:31:39.046112 #1268856] INFO -- : LDSHARED = gcc -shared I, [2024-05-14T07:31:39.046119 #1268856] INFO -- : CFLAGS = -O3 -fno-fast-math -ggdb3 -Wall -Wextra -Wdeprecated-declarations -Wdiv-by-zero -Wduplicated-cond -Wimplicit-function-declaration -Wimplicit-int -Wpointer-arith -Wwrite-strings -Wold-style-definition -Wimplicit-fallthrough=0 -Wmissing-noreturn -Wno-cast-function-type -Wno-constant-logical-operand -Wno-long-long -Wno-missing-field-initializers -Wno-overlength-strings -Wno-packed-bitfield-compat -Wno-parentheses-equality -Wno-self-assign -Wno-tautological-compare -Wno-unused-parameter -Wno-unused-value -Wsuggest-attribute=format -Wsuggest-attribute=noreturn -Wunused-variable -Wmisleading-indentation -Wundef -fPIC I, [2024-05-14T07:31:39.046129 #1268856] INFO -- : XCFLAGS = -U_FORTIFY_SOURCE -D_FORTIFY_SOURCE=2 -fstack-protector-strong -fno-strict-overflow -fvisibility=hidden -fexcess-precision=standard -DRUBY_EXPORT -I. -I.ext/include/x86_64-linux -I/tmp/ruby/src/trunk/include -I/tmp/ruby/src/trunk -I/tmp/ruby/src/trunk/prism -I/tmp/ruby/src/trunk/enc/unicode/15.0.0 I, [2024-05-14T07:31:39.046135 #1268856] INFO -- : CPPFLAGS = I, [2024-05-14T07:31:39.046141 #1268856] INFO -- : DLDFLAGS = -Wl,--compress-debug-sections=zlib -Wl,-soname,libruby.so.3.4 -fstack-protector-strong I, [2024-05-14T07:31:39.046148 #1268856] INFO -- : SOLIBS = -lz -lrt -lrt -lgmp -ldl -lcrypt -lm -lpthread I, [2024-05-14T07:31:39.046154 #1268856] INFO -- : LANG = en_US.UTF-8 I, [2024-05-14T07:31:39.046160 #1268856] INFO -- : LC_ALL = I, [2024-05-14T07:31:39.046166 #1268856] INFO -- : LC_CTYPE = I, [2024-05-14T07:31:39.046177 #1268856] INFO -- : MFLAGS = -j20 --jobserver-auth=4,5 I, [2024-05-14T07:31:39.046183 #1268856] INFO -- : RUSTC = no I, [2024-05-14T07:31:39.046191 #1268856] INFO -- : YJIT_RUSTC_ARGS = --crate-name=yjit --crate-type=staticlib --edition=2021 -g -C lto=thin -C opt-level=3 -C overflow-checks=on '--out-dir=/tmp/ruby/build/trunk/yjit/target/release/' /tmp/ruby/src/trunk/yjit/src/lib.rs I, [2024-05-14T07:31:39.048339 #1268856] INFO -- : gcc (Ubuntu 11.4.0-1ubuntu1~22.04) 11.4.0 I, [2024-05-14T07:31:39.048377 #1268856] INFO -- : Copyright (C) 2021 Free Software Foundation, Inc. I, [2024-05-14T07:31:39.048388 #1268856] INFO -- : This is free software; see the source for copying conditions. There is NO I, [2024-05-14T07:31:39.048395 #1268856] INFO -- : warranty; not even for MERCHANTABILITY or FITNESS FOR A PARTICULAR PURPOSE. I, [2024-05-14T07:31:39.048413 #1268856] INFO -- : I, [2024-05-14T07:31:39.081620 #1268856] INFO -- : generating enc.mk I, [2024-05-14T07:31:39.083667 #1268856] INFO -- : building spec/ruby/optional/capi/ext/array_spec.so I, [2024-05-14T07:31:39.083901 #1268856] INFO -- : building spec/ruby/optional/capi/ext/basic_object_spec.so I, [2024-05-14T07:31:39.084175 #1268856] INFO -- : building spec/ruby/optional/capi/ext/bignum_spec.so I, [2024-05-14T07:31:39.085143 #1268856] INFO -- : building spec/ruby/optional/capi/ext/binding_spec.so I, [2024-05-14T07:31:39.086076 #1268856] INFO -- : building spec/ruby/optional/capi/ext/boolean_spec.so I, [2024-05-14T07:31:39.087063 #1268856] INFO -- : building spec/ruby/optional/capi/ext/class_id_under_autoload_spec.so I, [2024-05-14T07:31:39.088040 #1268856] INFO -- : building spec/ruby/optional/capi/ext/class_spec.so I, [2024-05-14T07:31:39.088290 #1268856] INFO -- : building spec/ruby/optional/capi/ext/class_under_autoload_spec.so I, [2024-05-14T07:31:39.089074 #1268856] INFO -- : building spec/ruby/optional/capi/ext/complex_spec.so I, [2024-05-14T07:31:39.089815 #1268856] INFO -- : building spec/ruby/optional/capi/ext/constants_spec.so I, [2024-05-14T07:31:39.090608 #1268856] INFO -- : building spec/ruby/optional/capi/ext/data_spec.so I, [2024-05-14T07:31:39.091419 #1268856] INFO -- : building spec/ruby/optional/capi/ext/debug_spec.so I, [2024-05-14T07:31:39.091980 #1268856] INFO -- : building spec/ruby/optional/capi/ext/encoding_spec.so I, [2024-05-14T07:31:39.092271 #1268856] INFO -- : building spec/ruby/optional/capi/ext/enumerator_spec.so I, [2024-05-14T07:31:39.093092 #1268856] INFO -- : building spec/ruby/optional/capi/ext/exception_spec.so I, [2024-05-14T07:31:39.093738 #1268856] INFO -- : building spec/ruby/optional/capi/ext/fiber_spec.so I, [2024-05-14T07:31:39.094079 #1268856] INFO -- : building spec/ruby/optional/capi/ext/file_spec.so I, [2024-05-14T07:31:39.094769 #1268856] INFO -- : building spec/ruby/optional/capi/ext/fixnum_spec.so I, [2024-05-14T07:31:39.095131 #1268856] INFO -- : building spec/ruby/optional/capi/ext/float_spec.so I, [2024-05-14T07:31:39.222423 #1268856] INFO -- : building spec/ruby/optional/capi/ext/gc_spec.so I, [2024-05-14T07:31:39.224926 #1268856] INFO -- : building spec/ruby/optional/capi/ext/globals_spec.so I, [2024-05-14T07:31:39.230923 #1268856] INFO -- : building spec/ruby/optional/capi/ext/hash_spec.so I, [2024-05-14T07:31:39.245603 #1268856] INFO -- : building spec/ruby/optional/capi/ext/integer_spec.so I, [2024-05-14T07:31:39.247849 #1268856] INFO -- : building spec/ruby/optional/capi/ext/io_spec.so I, [2024-05-14T07:31:39.249235 #1268856] INFO -- : building spec/ruby/optional/capi/ext/kernel_spec.so I, [2024-05-14T07:31:39.250494 #1268856] INFO -- : building spec/ruby/optional/capi/ext/language_spec.so I, [2024-05-14T07:31:39.256054 #1268856] INFO -- : building spec/ruby/optional/capi/ext/marshal_spec.so I, [2024-05-14T07:31:39.257646 #1268856] INFO -- : building spec/ruby/optional/capi/ext/module_spec.so I, [2024-05-14T07:31:39.259490 #1268856] INFO -- : building spec/ruby/optional/capi/ext/module_under_autoload_spec.so I, [2024-05-14T07:31:39.260093 #1268856] INFO -- : building spec/ruby/optional/capi/ext/mutex_spec.so I, [2024-05-14T07:31:39.276757 #1268856] INFO -- : building spec/ruby/optional/capi/ext/numeric_spec.so I, [2024-05-14T07:31:39.277093 #1268856] INFO -- : building spec/ruby/optional/capi/ext/object_spec.so I, [2024-05-14T07:31:39.277572 #1268856] INFO -- : building spec/ruby/optional/capi/ext/proc_spec.so I, [2024-05-14T07:31:39.278012 #1268856] INFO -- : building spec/ruby/optional/capi/ext/range_spec.so I, [2024-05-14T07:31:39.284116 #1268856] INFO -- : building spec/ruby/optional/capi/ext/rational_spec.so I, [2024-05-14T07:31:39.329294 #1268856] INFO -- : building spec/ruby/optional/capi/ext/rbasic_spec.so I, [2024-05-14T07:31:39.329826 #1268856] INFO -- : building spec/ruby/optional/capi/ext/regexp_spec.so I, [2024-05-14T07:31:39.394424 #1268856] INFO -- : building spec/ruby/optional/capi/ext/string_spec.so I, [2024-05-14T07:31:39.405573 #1268856] INFO -- : building spec/ruby/optional/capi/ext/struct_spec.so I, [2024-05-14T07:31:39.410788 #1268856] INFO -- : building spec/ruby/optional/capi/ext/st_spec.so I, [2024-05-14T07:31:39.412493 #1268856] INFO -- : building spec/ruby/optional/capi/ext/symbol_spec.so I, [2024-05-14T07:31:39.414966 #1268856] INFO -- : building spec/ruby/optional/capi/ext/thread_spec.so I, [2024-05-14T07:31:39.415746 #1268856] INFO -- : building spec/ruby/optional/capi/ext/time_spec.so I, [2024-05-14T07:31:39.420600 #1268856] INFO -- : building spec/ruby/optional/capi/ext/tracepoint_spec.so I, [2024-05-14T07:31:39.421326 #1268856] INFO -- : building spec/ruby/optional/capi/ext/typed_data_spec.so I, [2024-05-14T07:31:39.426171 #1268856] INFO -- : building spec/ruby/optional/capi/ext/util_spec.so I, [2024-05-14T07:31:39.439249 #1268856] INFO -- : making enc I, [2024-05-14T07:31:39.440139 #1268856] INFO -- : making srcs under enc I, [2024-05-14T07:31:39.465330 #1268856] INFO -- : make[1]: Entering directory '/tmp/ruby/build/trunk' I, [2024-05-14T07:31:39.465394 #1268856] INFO -- : make[1]: Nothing to be done for 'enc'. I, [2024-05-14T07:31:39.465411 #1268856] INFO -- : make[1]: Leaving directory '/tmp/ruby/build/trunk' I, [2024-05-14T07:31:39.488950 #1268856] INFO -- : make[1]: Entering directory '/tmp/ruby/build/trunk' I, [2024-05-14T07:31:39.489008 #1268856] INFO -- : make[1]: Nothing to be done for 'srcs'. I, [2024-05-14T07:31:39.489017 #1268856] INFO -- : make[1]: Leaving directory '/tmp/ruby/build/trunk' I, [2024-05-14T07:31:39.489812 #1268856] INFO -- : generating transdb.h I, [2024-05-14T07:31:39.618854 #1268856] INFO -- : transdb.h unchanged I, [2024-05-14T07:31:39.620276 #1268856] INFO -- : generating makefiles ext/configure-ext.mk I, [2024-05-14T07:31:39.620437 #1268856] INFO -- : making trans I, [2024-05-14T07:31:39.646986 #1268856] INFO -- : ext/configure-ext.mk updated I, [2024-05-14T07:31:39.649431 #1268856] INFO -- : make[1]: Entering directory '/tmp/ruby/build/trunk' I, [2024-05-14T07:31:39.656395 #1268856] INFO -- : make[1]: Entering directory '/tmp/ruby/build/trunk' I, [2024-05-14T07:31:39.656496 #1268856] INFO -- : make[1]: Nothing to be done for 'trans'. I, [2024-05-14T07:31:39.657671 #1268856] INFO -- : make[1]: Leaving directory '/tmp/ruby/build/trunk' I, [2024-05-14T07:31:39.657707 #1268856] INFO -- : making encs I, [2024-05-14T07:31:39.714309 #1268856] INFO -- : make[1]: Entering directory '/tmp/ruby/build/trunk' I, [2024-05-14T07:31:39.714387 #1268856] INFO -- : make[1]: Nothing to be done for 'encs'. I, [2024-05-14T07:31:39.714416 #1268856] INFO -- : make[1]: Leaving directory '/tmp/ruby/build/trunk' I, [2024-05-14T07:31:39.801911 #1268856] INFO -- : make[1]: Leaving directory '/tmp/ruby/build/trunk' I, [2024-05-14T07:31:39.802626 #1268856] INFO -- : generating makefile exts.mk I, [2024-05-14T07:31:39.841314 #1268856] INFO -- : exts.mk unchanged I, [2024-05-14T07:31:39.846321 #1268856] INFO -- : make[1]: Entering directory '/tmp/ruby/build/trunk' I, [2024-05-14T07:31:39.866353 #1268856] INFO -- : make[2]: Entering directory '/tmp/ruby/build/trunk/ext/digest' I, [2024-05-14T07:31:39.867349 #1268856] INFO -- : make[2]: Entering directory '/tmp/ruby/build/trunk/ext/json' I, [2024-05-14T07:31:39.867979 #1268856] INFO -- : make[2]: Entering directory '/tmp/ruby/build/trunk/ext/io/console' I, [2024-05-14T07:31:39.868173 #1268856] INFO -- : make[2]: Entering directory '/tmp/ruby/build/trunk/ext/coverage' I, [2024-05-14T07:31:39.868873 #1268856] INFO -- : make[2]: Entering directory '/tmp/ruby/build/trunk/ext/date' I, [2024-05-14T07:31:39.869280 #1268856] INFO -- : make[2]: Entering directory '/tmp/ruby/build/trunk/ext/rubyvm' I, [2024-05-14T07:31:39.869760 #1268856] INFO -- : make[2]: Entering directory '/tmp/ruby/build/trunk/ext/monitor' I, [2024-05-14T07:31:39.870659 #1268856] INFO -- : make[2]: Entering directory '/tmp/ruby/build/trunk/ext/pathname' I, [2024-05-14T07:31:39.870691 #1268856] INFO -- : make[2]: Entering directory '/tmp/ruby/build/trunk/ext/fiddle' I, [2024-05-14T07:31:39.871073 #1268856] INFO -- : make[2]: Entering directory '/tmp/ruby/build/trunk/ext/pty' I, [2024-05-14T07:31:39.871292 #1268856] INFO -- : make[2]: Leaving directory '/tmp/ruby/build/trunk/ext/io/console' I, [2024-05-14T07:31:39.871938 #1268856] INFO -- : make[2]: Leaving directory '/tmp/ruby/build/trunk/ext/rubyvm' I, [2024-05-14T07:31:39.872102 #1268856] INFO -- : make[2]: Leaving directory '/tmp/ruby/build/trunk/ext/coverage' I, [2024-05-14T07:31:39.872343 #1268856] INFO -- : make[2]: Entering directory '/tmp/ruby/build/trunk/ext/objspace' I, [2024-05-14T07:31:39.872788 #1268856] INFO -- : make[2]: Entering directory '/tmp/ruby/build/trunk/ext/psych' I, [2024-05-14T07:31:39.872861 #1268856] INFO -- : make[2]: Leaving directory '/tmp/ruby/build/trunk/ext/monitor' I, [2024-05-14T07:31:39.872979 #1268856] INFO -- : make[2]: Entering directory '/tmp/ruby/build/trunk/.bundle/gems/bigdecimal-3.1.8/ext/bigdecimal' I, [2024-05-14T07:31:39.873043 #1268856] INFO -- : make[2]: Leaving directory '/tmp/ruby/build/trunk/ext/date' I, [2024-05-14T07:31:39.873750 #1268856] INFO -- : make[2]: Entering directory '/tmp/ruby/build/trunk/.bundle/gems/debug-1.9.2/ext/debug' I, [2024-05-14T07:31:39.873833 #1268856] INFO -- : make[2]: Leaving directory '/tmp/ruby/build/trunk/ext/pathname' I, [2024-05-14T07:31:39.874277 #1268856] INFO -- : make[2]: Entering directory '/tmp/ruby/build/trunk/.bundle/gems/nkf-0.2.0/ext/nkf' I, [2024-05-14T07:31:39.874289 #1268856] INFO -- : make[2]: Leaving directory '/tmp/ruby/build/trunk/ext/pty' I, [2024-05-14T07:31:39.874313 #1268856] INFO -- : make[2]: Leaving directory '/tmp/ruby/build/trunk/ext/digest' I, [2024-05-14T07:31:39.874555 #1268856] INFO -- : make[2]: Entering directory '/tmp/ruby/build/trunk/.bundle/gems/racc-1.7.3/ext/racc/cparse' I, [2024-05-14T07:31:39.875084 #1268856] INFO -- : make[2]: Leaving directory '/tmp/ruby/build/trunk/ext/json' I, [2024-05-14T07:31:39.875378 #1268856] INFO -- : make[2]: Entering directory '/tmp/ruby/build/trunk/.bundle/gems/syslog-0.1.2/ext/syslog' I, [2024-05-14T07:31:39.875516 #1268856] INFO -- : make[2]: Entering directory '/tmp/ruby/build/trunk/ext/ripper' I, [2024-05-14T07:31:39.875828 #1268856] INFO -- : make[2]: Entering directory '/tmp/ruby/build/trunk/.bundle/gems/rbs-3.4.4/ext/rbs_extension' I, [2024-05-14T07:31:39.877530 #1268856] INFO -- : make[2]: Leaving directory '/tmp/ruby/build/trunk/ext/objspace' I, [2024-05-14T07:31:39.880079 #1268856] INFO -- : make[2]: Entering directory '/tmp/ruby/build/trunk/ext/socket' I, [2024-05-14T07:31:39.880113 #1268856] INFO -- : make[2]: Leaving directory '/tmp/ruby/build/trunk/ext/fiddle' I, [2024-05-14T07:31:39.880792 #1268856] INFO -- : make[2]: Leaving directory '/tmp/ruby/build/trunk/ext/ripper' I, [2024-05-14T07:31:39.881853 #1268856] INFO -- : make[2]: Leaving directory '/tmp/ruby/build/trunk/ext/psych' I, [2024-05-14T07:31:39.882120 #1268856] INFO -- : make[2]: Entering directory '/tmp/ruby/build/trunk/ext/digest/sha2' I, [2024-05-14T07:31:39.884290 #1268856] INFO -- : make[2]: Entering directory '/tmp/ruby/build/trunk/ext/openssl' I, [2024-05-14T07:31:39.884357 #1268856] INFO -- : make[2]: Leaving directory '/tmp/ruby/build/trunk/ext/digest/sha2' I, [2024-05-14T07:31:39.887094 #1268856] INFO -- : make[2]: Leaving directory '/tmp/ruby/build/trunk/ext/socket' I, [2024-05-14T07:31:39.896456 #1268856] INFO -- : make[2]: Leaving directory '/tmp/ruby/build/trunk/ext/openssl' I, [2024-05-14T07:31:39.898427 #1268856] INFO -- : make[2]: Leaving directory '/tmp/ruby/build/trunk/.bundle/gems/bigdecimal-3.1.8/ext/bigdecimal' I, [2024-05-14T07:31:39.898463 #1268856] INFO -- : make[2]: Leaving directory '/tmp/ruby/build/trunk/.bundle/gems/nkf-0.2.0/ext/nkf' I, [2024-05-14T07:31:39.898645 #1268856] INFO -- : make[2]: Leaving directory '/tmp/ruby/build/trunk/.bundle/gems/rbs-3.4.4/ext/rbs_extension' I, [2024-05-14T07:31:39.898788 #1268856] INFO -- : make[2]: Leaving directory '/tmp/ruby/build/trunk/.bundle/gems/syslog-0.1.2/ext/syslog' I, [2024-05-14T07:31:39.907745 #1268856] INFO -- : make[2]: Leaving directory '/tmp/ruby/build/trunk/.bundle/gems/racc-1.7.3/ext/racc/cparse' I, [2024-05-14T07:31:39.907778 #1268856] INFO -- : make[2]: Leaving directory '/tmp/ruby/build/trunk/.bundle/gems/debug-1.9.2/ext/debug' I, [2024-05-14T07:31:39.933324 #1268856] INFO -- : make[2]: Entering directory '/tmp/ruby/build/trunk' I, [2024-05-14T07:31:40.015722 #1268856] INFO -- : linking ruby I, [2024-05-14T07:31:40.038322 #1268856] INFO -- : make[2]: Leaving directory '/tmp/ruby/build/trunk' I, [2024-05-14T07:31:40.038888 #1268856] INFO -- : make[1]: Leaving directory '/tmp/ruby/build/trunk' I, [2024-05-14T07:31:40.042417 #1268856] INFO -- : make[1]: Entering directory '/tmp/ruby/build/trunk' I, [2024-05-14T07:31:40.042441 #1268856] INFO -- : make[1]: Nothing to be done for 'note'. I, [2024-05-14T07:31:40.042448 #1268856] INFO -- : make[1]: Leaving directory '/tmp/ruby/build/trunk' I, [2024-05-14T07:31:40.042901 #1268856] INFO -- : $$$[end] "make all -j20" exit with 0. I, [2024-05-14T07:31:40.043039 #1268856] INFO -- : $$$[beg] make install -j20 I, [2024-05-14T07:31:40.111768 #1268856] INFO -- : Update minitest to ea9caafc0754b1d6236a490d59e624b53209734a I, [2024-05-14T07:31:40.111912 #1268856] INFO -- : Update power_assert to 84e85124c5014a139af39161d484156cfe87a9ed I, [2024-05-14T07:31:40.112141 #1268856] INFO -- : Update rbs to ba7872795d5de04adb8ff500c0e6afdc81a041dd I, [2024-05-14T07:31:40.113102 #1268856] INFO -- : Update typeprof to b19a6416da3a05d57fadd6ffdadb382b6d236ca5 I, [2024-05-14T07:31:40.113977 #1268856] INFO -- : echo ea9caafc0754b1d6236a490d59e624b53209734a | /bin/sh /tmp/ruby/src/trunk/tool/ifchange /tmp/ruby/src/trunk/.bundle/.timestamp/minitest.revision - I, [2024-05-14T07:31:40.114049 #1268856] INFO -- : echo 84e85124c5014a139af39161d484156cfe87a9ed | /bin/sh /tmp/ruby/src/trunk/tool/ifchange /tmp/ruby/src/trunk/.bundle/.timestamp/power_assert.revision - I, [2024-05-14T07:31:40.114343 #1268856] INFO -- : echo ba7872795d5de04adb8ff500c0e6afdc81a041dd | /bin/sh /tmp/ruby/src/trunk/tool/ifchange /tmp/ruby/src/trunk/.bundle/.timestamp/rbs.revision - I, [2024-05-14T07:31:40.115109 #1268856] INFO -- : BASERUBY = /usr/bin/ruby --disable=gems I, [2024-05-14T07:31:40.115137 #1268856] INFO -- : CC = gcc I, [2024-05-14T07:31:40.115144 #1268856] INFO -- : LD = ld I, [2024-05-14T07:31:40.115150 #1268856] INFO -- : LDSHARED = gcc -shared I, [2024-05-14T07:31:40.115156 #1268856] INFO -- : CFLAGS = -O3 -fno-fast-math -ggdb3 -Wall -Wextra -Wdeprecated-declarations -Wdiv-by-zero -Wduplicated-cond -Wimplicit-function-declaration -Wimplicit-int -Wpointer-arith -Wwrite-strings -Wold-style-definition -Wimplicit-fallthrough=0 -Wmissing-noreturn -Wno-cast-function-type -Wno-constant-logical-operand -Wno-long-long -Wno-missing-field-initializers -Wno-overlength-strings -Wno-packed-bitfield-compat -Wno-parentheses-equality -Wno-self-assign -Wno-tautological-compare -Wno-unused-parameter -Wno-unused-value -Wsuggest-attribute=format -Wsuggest-attribute=noreturn -Wunused-variable -Wmisleading-indentation -Wundef -fPIC I, [2024-05-14T07:31:40.115162 #1268856] INFO -- : XCFLAGS = -U_FORTIFY_SOURCE -D_FORTIFY_SOURCE=2 -fstack-protector-strong -fno-strict-overflow -fvisibility=hidden -fexcess-precision=standard -DRUBY_EXPORT -I. -I.ext/include/x86_64-linux -I/tmp/ruby/src/trunk/include -I/tmp/ruby/src/trunk -I/tmp/ruby/src/trunk/prism -I/tmp/ruby/src/trunk/enc/unicode/15.0.0 I, [2024-05-14T07:31:40.115167 #1268856] INFO -- : CPPFLAGS = I, [2024-05-14T07:31:40.115171 #1268856] INFO -- : DLDFLAGS = -Wl,--compress-debug-sections=zlib -Wl,-soname,libruby.so.3.4 -fstack-protector-strong I, [2024-05-14T07:31:40.115177 #1268856] INFO -- : SOLIBS = -lz -lrt -lrt -lgmp -ldl -lcrypt -lm -lpthread I, [2024-05-14T07:31:40.115182 #1268856] INFO -- : LANG = en_US.UTF-8 I, [2024-05-14T07:31:40.115187 #1268856] INFO -- : LC_ALL = I, [2024-05-14T07:31:40.115197 #1268856] INFO -- : LC_CTYPE = I, [2024-05-14T07:31:40.115203 #1268856] INFO -- : MFLAGS = -j20 --jobserver-auth=4,5 I, [2024-05-14T07:31:40.115208 #1268856] INFO -- : RUSTC = no I, [2024-05-14T07:31:40.115213 #1268856] INFO -- : YJIT_RUSTC_ARGS = --crate-name=yjit --crate-type=staticlib --edition=2021 -g -C lto=thin -C opt-level=3 -C overflow-checks=on '--out-dir=/tmp/ruby/build/trunk/yjit/target/release/' /tmp/ruby/src/trunk/yjit/src/lib.rs I, [2024-05-14T07:31:40.116440 #1268856] INFO -- : /tmp/ruby/src/trunk/.bundle/.timestamp/minitest.revision unchanged I, [2024-05-14T07:31:40.116588 #1268856] INFO -- : /tmp/ruby/src/trunk/.bundle/.timestamp/rbs.revision unchanged I, [2024-05-14T07:31:40.116881 #1268856] INFO -- : /tmp/ruby/src/trunk/.bundle/.timestamp/power_assert.revision unchanged I, [2024-05-14T07:31:40.147616 #1268856] INFO -- : echo b19a6416da3a05d57fadd6ffdadb382b6d236ca5 | /bin/sh /tmp/ruby/src/trunk/tool/ifchange /tmp/ruby/src/trunk/.bundle/.timestamp/typeprof.revision - I, [2024-05-14T07:31:40.148382 #1268856] INFO -- : generating enc.mk I, [2024-05-14T07:31:40.148419 #1268856] INFO -- : gcc (Ubuntu 11.4.0-1ubuntu1~22.04) 11.4.0 I, [2024-05-14T07:31:40.148432 #1268856] INFO -- : Copyright (C) 2021 Free Software Foundation, Inc. I, [2024-05-14T07:31:40.148443 #1268856] INFO -- : This is free software; see the source for copying conditions. There is NO I, [2024-05-14T07:31:40.148454 #1268856] INFO -- : warranty; not even for MERCHANTABILITY or FITNESS FOR A PARTICULAR PURPOSE. I, [2024-05-14T07:31:40.148464 #1268856] INFO -- : I, [2024-05-14T07:31:40.149747 #1268856] INFO -- : /tmp/ruby/src/trunk/.bundle/.timestamp/typeprof.revision unchanged I, [2024-05-14T07:31:40.269124 #1268856] INFO -- : Building power_assert@84e85124c5014a139af39161d484156cfe87a9ed to /tmp/ruby/src/trunk/gems/power_assert-2.0.3.gem I, [2024-05-14T07:31:40.269895 #1268856] INFO -- : making srcs under enc I, [2024-05-14T07:31:40.270075 #1268856] INFO -- : making enc I, [2024-05-14T07:31:40.286971 #1268856] INFO -- : make[1]: Entering directory '/tmp/ruby/build/trunk' I, [2024-05-14T07:31:40.287032 #1268856] INFO -- : make[1]: Nothing to be done for 'enc'. I, [2024-05-14T07:31:40.287047 #1268856] INFO -- : make[1]: Leaving directory '/tmp/ruby/build/trunk' I, [2024-05-14T07:31:40.298856 #1268856] INFO -- : make[1]: Entering directory '/tmp/ruby/build/trunk' I, [2024-05-14T07:31:40.298914 #1268856] INFO -- : make[1]: Nothing to be done for 'srcs'. I, [2024-05-14T07:31:40.298929 #1268856] INFO -- : make[1]: Leaving directory '/tmp/ruby/build/trunk' I, [2024-05-14T07:31:40.299441 #1268856] INFO -- : generating transdb.h I, [2024-05-14T07:31:40.337640 #1268856] INFO -- : Successfully built RubyGem I, [2024-05-14T07:31:40.337705 #1268856] INFO -- : Name: power_assert I, [2024-05-14T07:31:40.337719 #1268856] INFO -- : Version: 2.0.4dev I, [2024-05-14T07:31:40.337730 #1268856] INFO -- : File: power_assert-2.0.4dev.gem I, [2024-05-14T07:31:40.339936 #1268856] INFO -- : Extracting bundle gem power_assert-2.0.3... I, [2024-05-14T07:31:40.396033 #1268856] INFO -- : transdb.h unchanged I, [2024-05-14T07:31:40.397645 #1268856] INFO -- : generating makefiles ext/configure-ext.mk I, [2024-05-14T07:31:40.397779 #1268856] INFO -- : making trans I, [2024-05-14T07:31:40.401013 #1268856] INFO -- : Try with hash version of bundled gems instead of gems/power_assert-2.0.3.gem. We don't use this gem with release version of Ruby. I, [2024-05-14T07:31:40.406029 #1268856] INFO -- : Unpacked gems/power_assert-2.0.4dev.gem I, [2024-05-14T07:31:40.424637 #1268856] INFO -- : ext/configure-ext.mk unchanged I, [2024-05-14T07:31:40.427067 #1268856] INFO -- : make[1]: Entering directory '/tmp/ruby/build/trunk' I, [2024-05-14T07:31:40.431382 #1268856] INFO -- : make[1]: Entering directory '/tmp/ruby/build/trunk' I, [2024-05-14T07:31:40.431478 #1268856] INFO -- : make[1]: Nothing to be done for 'trans'. I, [2024-05-14T07:31:40.431488 #1268856] INFO -- : make[1]: Leaving directory '/tmp/ruby/build/trunk' I, [2024-05-14T07:31:40.509291 #1268856] INFO -- : making encs I, [2024-05-14T07:31:40.553349 #1268856] INFO -- : make[1]: Entering directory '/tmp/ruby/build/trunk' I, [2024-05-14T07:31:40.553408 #1268856] INFO -- : make[1]: Nothing to be done for 'encs'. I, [2024-05-14T07:31:40.553421 #1268856] INFO -- : make[1]: Leaving directory '/tmp/ruby/build/trunk' I, [2024-05-14T07:31:40.577223 #1268856] INFO -- : make[1]: Leaving directory '/tmp/ruby/build/trunk' I, [2024-05-14T07:31:40.578126 #1268856] INFO -- : generating makefile exts.mk I, [2024-05-14T07:31:40.614972 #1268856] INFO -- : exts.mk unchanged I, [2024-05-14T07:31:40.619332 #1268856] INFO -- : make[1]: Entering directory '/tmp/ruby/build/trunk' I, [2024-05-14T07:31:40.637158 #1268856] INFO -- : make[2]: Entering directory '/tmp/ruby/build/trunk/ext/digest' I, [2024-05-14T07:31:40.638727 #1268856] INFO -- : make[2]: Entering directory '/tmp/ruby/build/trunk/ext/coverage' I, [2024-05-14T07:31:40.638805 #1268856] INFO -- : make[2]: Entering directory '/tmp/ruby/build/trunk/ext/json' I, [2024-05-14T07:31:40.639080 #1268856] INFO -- : make[2]: Entering directory '/tmp/ruby/build/trunk/ext/io/console' I, [2024-05-14T07:31:40.639495 #1268856] INFO -- : make[2]: Entering directory '/tmp/ruby/build/trunk/ext/date' I, [2024-05-14T07:31:40.640268 #1268856] INFO -- : make[2]: Entering directory '/tmp/ruby/build/trunk/ext/monitor' I, [2024-05-14T07:31:40.641047 #1268856] INFO -- : make[2]: Leaving directory '/tmp/ruby/build/trunk/ext/digest' I, [2024-05-14T07:31:40.641217 #1268856] INFO -- : make[2]: Entering directory '/tmp/ruby/build/trunk/ext/pathname' I, [2024-05-14T07:31:40.641309 #1268856] INFO -- : make[2]: Entering directory '/tmp/ruby/build/trunk/ext/rubyvm' I, [2024-05-14T07:31:40.641747 #1268856] INFO -- : make[2]: Leaving directory '/tmp/ruby/build/trunk/ext/io/console' I, [2024-05-14T07:31:40.641833 #1268856] INFO -- : make[2]: Leaving directory '/tmp/ruby/build/trunk/ext/coverage' I, [2024-05-14T07:31:40.641954 #1268856] INFO -- : make[2]: Entering directory '/tmp/ruby/build/trunk/ext/pty' I, [2024-05-14T07:31:40.642036 #1268856] INFO -- : make[2]: Entering directory '/tmp/ruby/build/trunk/ext/fiddle' I, [2024-05-14T07:31:40.642654 #1268856] INFO -- : make[2]: Entering directory '/tmp/ruby/build/trunk/ext/objspace' I, [2024-05-14T07:31:40.643120 #1268856] INFO -- : make[2]: Leaving directory '/tmp/ruby/build/trunk/ext/date' I, [2024-05-14T07:31:40.643271 #1268856] INFO -- : make[2]: Leaving directory '/tmp/ruby/build/trunk/ext/rubyvm' I, [2024-05-14T07:31:40.643390 #1268856] INFO -- : make[2]: Leaving directory '/tmp/ruby/build/trunk/ext/monitor' I, [2024-05-14T07:31:40.643490 #1268856] INFO -- : make[2]: Leaving directory '/tmp/ruby/build/trunk/ext/pathname' I, [2024-05-14T07:31:40.644322 #1268856] INFO -- : make[2]: Entering directory '/tmp/ruby/build/trunk/ext/psych' I, [2024-05-14T07:31:40.644586 #1268856] INFO -- : make[2]: Leaving directory '/tmp/ruby/build/trunk/ext/pty' I, [2024-05-14T07:31:40.644676 #1268856] INFO -- : make[2]: Entering directory '/tmp/ruby/build/trunk/.bundle/gems/debug-1.9.2/ext/debug' I, [2024-05-14T07:31:40.644821 #1268856] INFO -- : make[2]: Entering directory '/tmp/ruby/build/trunk/.bundle/gems/nkf-0.2.0/ext/nkf' I, [2024-05-14T07:31:40.644842 #1268856] INFO -- : make[2]: Entering directory '/tmp/ruby/build/trunk/.bundle/gems/bigdecimal-3.1.8/ext/bigdecimal' I, [2024-05-14T07:31:40.645939 #1268856] INFO -- : make[2]: Entering directory '/tmp/ruby/build/trunk/.bundle/gems/racc-1.7.3/ext/racc/cparse' I, [2024-05-14T07:31:40.646226 #1268856] INFO -- : make[2]: Entering directory '/tmp/ruby/build/trunk/.bundle/gems/syslog-0.1.2/ext/syslog' I, [2024-05-14T07:31:40.646532 #1268856] INFO -- : make[2]: Entering directory '/tmp/ruby/build/trunk/.bundle/gems/rbs-3.4.4/ext/rbs_extension' I, [2024-05-14T07:31:40.646737 #1268856] INFO -- : make[2]: Leaving directory '/tmp/ruby/build/trunk/ext/objspace' I, [2024-05-14T07:31:40.647020 #1268856] INFO -- : make[2]: Entering directory '/tmp/ruby/build/trunk/ext/ripper' I, [2024-05-14T07:31:40.648192 #1268856] INFO -- : make[2]: Leaving directory '/tmp/ruby/build/trunk/ext/json' I, [2024-05-14T07:31:40.649496 #1268856] INFO -- : make[2]: Leaving directory '/tmp/ruby/build/trunk/ext/fiddle' I, [2024-05-14T07:31:40.651773 #1268856] INFO -- : make[2]: Entering directory '/tmp/ruby/build/trunk/ext/socket' I, [2024-05-14T07:31:40.652198 #1268856] INFO -- : make[2]: Leaving directory '/tmp/ruby/build/trunk/ext/ripper' I, [2024-05-14T07:31:40.653536 #1268856] INFO -- : make[2]: Entering directory '/tmp/ruby/build/trunk/ext/digest/sha2' I, [2024-05-14T07:31:40.654681 #1268856] INFO -- : make[2]: Entering directory '/tmp/ruby/build/trunk/ext/openssl' I, [2024-05-14T07:31:40.655777 #1268856] INFO -- : make[2]: Leaving directory '/tmp/ruby/build/trunk/ext/digest/sha2' I, [2024-05-14T07:31:40.656975 #1268856] INFO -- : make[2]: Leaving directory '/tmp/ruby/build/trunk/ext/psych' I, [2024-05-14T07:31:40.658808 #1268856] INFO -- : make[2]: Leaving directory '/tmp/ruby/build/trunk/ext/socket' I, [2024-05-14T07:31:40.665939 #1268856] INFO -- : make[2]: Leaving directory '/tmp/ruby/build/trunk/ext/openssl' I, [2024-05-14T07:31:40.668257 #1268856] INFO -- : make[2]: Leaving directory '/tmp/ruby/build/trunk/.bundle/gems/racc-1.7.3/ext/racc/cparse' I, [2024-05-14T07:31:40.669048 #1268856] INFO -- : make[2]: Leaving directory '/tmp/ruby/build/trunk/.bundle/gems/syslog-0.1.2/ext/syslog' I, [2024-05-14T07:31:40.669861 #1268856] INFO -- : make[2]: Leaving directory '/tmp/ruby/build/trunk/.bundle/gems/bigdecimal-3.1.8/ext/bigdecimal' I, [2024-05-14T07:31:40.673712 #1268856] INFO -- : make[2]: Leaving directory '/tmp/ruby/build/trunk/.bundle/gems/nkf-0.2.0/ext/nkf' I, [2024-05-14T07:31:40.676593 #1268856] INFO -- : make[2]: Leaving directory '/tmp/ruby/build/trunk/.bundle/gems/rbs-3.4.4/ext/rbs_extension' I, [2024-05-14T07:31:40.677220 #1268856] INFO -- : make[2]: Leaving directory '/tmp/ruby/build/trunk/.bundle/gems/debug-1.9.2/ext/debug' I, [2024-05-14T07:31:40.702352 #1268856] INFO -- : make[2]: Entering directory '/tmp/ruby/build/trunk' I, [2024-05-14T07:31:40.766830 #1268856] INFO -- : make[2]: 'ruby' is up to date. I, [2024-05-14T07:31:40.766866 #1268856] INFO -- : make[2]: Leaving directory '/tmp/ruby/build/trunk' I, [2024-05-14T07:31:40.767042 #1268856] INFO -- : make[1]: Leaving directory '/tmp/ruby/build/trunk' I, [2024-05-14T07:31:40.770599 #1268856] INFO -- : make[1]: Entering directory '/tmp/ruby/build/trunk' I, [2024-05-14T07:31:40.770628 #1268856] INFO -- : make[1]: Nothing to be done for 'note'. I, [2024-05-14T07:31:40.770635 #1268856] INFO -- : make[1]: Leaving directory '/tmp/ruby/build/trunk' I, [2024-05-14T07:31:40.770825 #1268856] INFO -- : ./miniruby -I/tmp/ruby/src/trunk/lib -I. -I.ext/common /tmp/ruby/src/trunk/tool/runruby.rb --extout=.ext -- --disable-gems -r./x86_64-linux-fake /tmp/ruby/src/trunk/tool/rbinstall.rb --make="make" --dest-dir="" --extout=".ext" --ext-build-dir="./ext" --mflags="-j20 --jobserver-auth=4,5" --make-flags=" -j20 --jobserver-auth=4,5" --data-mode=0644 --prog-mode=0755 --installed-list .installed.list --mantype="doc" --gnumake --install=all --exclude=doc I, [2024-05-14T07:31:40.865178 #1268856] INFO -- : Installing to I, [2024-05-14T07:31:40.865237 #1268856] INFO -- : installing binary commands: /tmp/ruby/install/trunk/bin I, [2024-05-14T07:31:40.865334 #1268856] INFO -- : installing base libraries: /tmp/ruby/install/trunk/lib I, [2024-05-14T07:31:40.872472 #1268856] INFO -- : installing arch files: /tmp/ruby/install/trunk/lib/ruby/3.4.0+0/x86_64-linux I, [2024-05-14T07:31:40.872496 #1268856] INFO -- : installing pkgconfig data: /tmp/ruby/install/trunk/lib/pkgconfig I, [2024-05-14T07:31:40.872502 #1268856] INFO -- : installing extension objects: /tmp/ruby/install/trunk/lib/ruby/3.4.0+0/x86_64-linux I, [2024-05-14T07:31:40.881830 #1268856] INFO -- : installing extension objects: /tmp/ruby/install/trunk/lib/ruby/site_ruby/3.4.0+0/x86_64-linux I, [2024-05-14T07:31:40.881859 #1268856] INFO -- : installing extension objects: /tmp/ruby/install/trunk/lib/ruby/vendor_ruby/3.4.0+0/x86_64-linux I, [2024-05-14T07:31:40.881865 #1268856] INFO -- : installing extension headers: /tmp/ruby/install/trunk/include/ruby-3.4.0+0/x86_64-linux I, [2024-05-14T07:31:40.882000 #1268856] INFO -- : installing extension scripts: /tmp/ruby/install/trunk/lib/ruby/3.4.0+0 I, [2024-05-14T07:31:40.885874 #1268856] INFO -- : installing extension scripts: /tmp/ruby/install/trunk/lib/ruby/site_ruby/3.4.0+0 I, [2024-05-14T07:31:40.885896 #1268856] INFO -- : installing extension scripts: /tmp/ruby/install/trunk/lib/ruby/vendor_ruby/3.4.0+0 I, [2024-05-14T07:31:40.885901 #1268856] INFO -- : installing extension headers: /tmp/ruby/install/trunk/include/ruby-3.4.0+0/ruby I, [2024-05-14T07:31:40.885908 #1268856] INFO -- : installing command scripts: /tmp/ruby/install/trunk/bin I, [2024-05-14T07:31:40.885913 #1268856] INFO -- : installing library scripts: /tmp/ruby/install/trunk/lib/ruby/3.4.0+0 I, [2024-05-14T07:31:40.919359 #1268856] INFO -- : installing common headers: /tmp/ruby/install/trunk/include/ruby-3.4.0+0 I, [2024-05-14T07:31:40.924729 #1268856] INFO -- : installing manpages: /tmp/ruby/install/trunk/share/man/man1 I, [2024-05-14T07:31:40.924753 #1268856] INFO -- : installing default gems from lib: /tmp/ruby/install/trunk/lib/ruby/gems/3.4.0+0 I, [2024-05-14T07:31:40.947295 #1268856] INFO -- : benchmark 0.3.0 I, [2024-05-14T07:31:40.954102 #1268856] INFO -- : bundler 2.6.0.dev I, [2024-05-14T07:31:40.956201 #1268856] INFO -- : cgi 0.4.1 I, [2024-05-14T07:31:40.956732 #1268856] INFO -- : delegate 0.3.1 I, [2024-05-14T07:31:40.957220 #1268856] INFO -- : did_you_mean 1.6.3 I, [2024-05-14T07:31:40.957676 #1268856] INFO -- : english 0.8.0 I, [2024-05-14T07:31:40.958129 #1268856] INFO -- : erb 4.0.4 I, [2024-05-14T07:31:40.958890 #1268856] INFO -- : error_highlight 0.6.0 I, [2024-05-14T07:31:40.959314 #1268856] INFO -- : fileutils 1.7.2 I, [2024-05-14T07:31:40.959779 #1268856] INFO -- : find 0.2.0 I, [2024-05-14T07:31:40.960218 #1268856] INFO -- : forwardable 1.3.3 I, [2024-05-14T07:31:40.960676 #1268856] INFO -- : ipaddr 1.2.6 I, [2024-05-14T07:31:40.961192 #1268856] INFO -- : irb 1.13.1 I, [2024-05-14T07:31:40.962605 #1268856] INFO -- : logger 1.6.0 I, [2024-05-14T07:31:40.963103 #1268856] INFO -- : net-http 0.4.1 I, [2024-05-14T07:31:40.963621 #1268856] INFO -- : net-protocol 0.2.2 I, [2024-05-14T07:31:40.964127 #1268856] INFO -- : open-uri 0.4.1 I, [2024-05-14T07:31:40.964628 #1268856] INFO -- : open3 0.2.1 I, [2024-05-14T07:31:40.965103 #1268856] INFO -- : optparse 0.5.0 I, [2024-05-14T07:31:40.965520 #1268856] INFO -- : ostruct 0.6.0 I, [2024-05-14T07:31:40.966012 #1268856] INFO -- : pp 0.5.0 I, [2024-05-14T07:31:40.966569 #1268856] INFO -- : prettyprint 0.2.0 I, [2024-05-14T07:31:40.966953 #1268856] INFO -- : prism 0.29.0 I, [2024-05-14T07:31:40.967515 #1268856] INFO -- : pstore 0.1.3 I, [2024-05-14T07:31:40.968009 #1268856] INFO -- : rdoc 6.6.3.1 I, [2024-05-14T07:31:40.969574 #1268856] INFO -- : readline 0.0.4 I, [2024-05-14T07:31:40.970090 #1268856] INFO -- : reline 0.5.6 I, [2024-05-14T07:31:40.970625 #1268856] INFO -- : resolv 0.4.0 I, [2024-05-14T07:31:40.971129 #1268856] INFO -- : ruby2_keywords 0.0.5 I, [2024-05-14T07:31:40.971479 #1268856] INFO -- : securerandom 0.3.1 I, [2024-05-14T07:31:40.972073 #1268856] INFO -- : set 1.1.0 I, [2024-05-14T07:31:40.972593 #1268856] INFO -- : shellwords 0.2.0 I, [2024-05-14T07:31:40.973065 #1268856] INFO -- : singleton 0.2.0 I, [2024-05-14T07:31:40.973431 #1268856] INFO -- : syntax_suggest 2.0.0 I, [2024-05-14T07:31:40.974138 #1268856] INFO -- : tempfile 0.2.1 I, [2024-05-14T07:31:40.974606 #1268856] INFO -- : time 0.3.0 I, [2024-05-14T07:31:40.975123 #1268856] INFO -- : timeout 0.4.1 I, [2024-05-14T07:31:40.976346 #1268856] INFO -- : tmpdir 0.2.0 I, [2024-05-14T07:31:40.976875 #1268856] INFO -- : tsort 0.2.0 I, [2024-05-14T07:31:40.977355 #1268856] INFO -- : un 0.3.0 I, [2024-05-14T07:31:40.977799 #1268856] INFO -- : uri 0.13.0 I, [2024-05-14T07:31:40.978327 #1268856] INFO -- : weakref 0.1.3 I, [2024-05-14T07:31:40.978800 #1268856] INFO -- : yaml 0.3.0 I, [2024-05-14T07:31:40.979077 #1268856] INFO -- : installing default gems from ext: /tmp/ruby/install/trunk/lib/ruby/gems/3.4.0+0 I, [2024-05-14T07:31:40.985423 #1268856] INFO -- : date 3.3.4 I, [2024-05-14T07:31:40.986022 #1268856] INFO -- : digest 3.1.1 I, [2024-05-14T07:31:40.986492 #1268856] INFO -- : etc 1.4.3 I, [2024-05-14T07:31:40.987010 #1268856] INFO -- : fcntl 1.1.0 I, [2024-05-14T07:31:40.987497 #1268856] INFO -- : fiddle 1.1.3 I, [2024-05-14T07:31:40.987985 #1268856] INFO -- : io-console 0.7.2 I, [2024-05-14T07:31:40.988448 #1268856] INFO -- : io-nonblock 0.3.0 I, [2024-05-14T07:31:40.988858 #1268856] INFO -- : io-wait 0.3.1 I, [2024-05-14T07:31:40.989301 #1268856] INFO -- : json 2.7.2 I, [2024-05-14T07:31:40.990436 #1268856] INFO -- : openssl 3.2.0 I, [2024-05-14T07:31:40.991068 #1268856] INFO -- : pathname 0.3.0 I, [2024-05-14T07:31:40.991565 #1268856] INFO -- : psych 5.1.2 I, [2024-05-14T07:31:40.992211 #1268856] INFO -- : stringio 3.1.1 I, [2024-05-14T07:31:40.992729 #1268856] INFO -- : strscan 3.1.1 I, [2024-05-14T07:31:40.993190 #1268856] INFO -- : zlib 3.1.0 I, [2024-05-14T07:31:40.993548 #1268856] INFO -- : installing bundled gems: /tmp/ruby/install/trunk/lib/ruby/gems/3.4.0+0 I, [2024-05-14T07:31:40.993920 #1268856] INFO -- : minitest 5.22.3 I, [2024-05-14T07:31:41.001231 #1268856] INFO -- : rake 13.2.1 I, [2024-05-14T07:31:41.004501 #1268856] INFO -- : test-unit 3.6.2 I, [2024-05-14T07:31:41.008883 #1268856] INFO -- : rexml 3.2.6 I, [2024-05-14T07:31:41.012229 #1268856] INFO -- : rss 0.3.0 I, [2024-05-14T07:31:41.015157 #1268856] INFO -- : net-ftp 0.3.4 I, [2024-05-14T07:31:41.016667 #1268856] INFO -- : net-imap 0.4.11 I, [2024-05-14T07:31:41.019518 #1268856] INFO -- : net-pop 0.1.2 I, [2024-05-14T07:31:41.020439 #1268856] INFO -- : net-smtp 0.5.0 I, [2024-05-14T07:31:41.021498 #1268856] INFO -- : matrix 0.4.2 I, [2024-05-14T07:31:41.025114 #1268856] INFO -- : prime 0.1.2 I, [2024-05-14T07:31:41.030253 #1268856] INFO -- : rbs 3.4.4 I, [2024-05-14T07:31:41.052476 #1268856] INFO -- : typeprof 0.21.11 I, [2024-05-14T07:31:41.055042 #1268856] INFO -- : debug 1.9.2 I, [2024-05-14T07:31:41.058094 #1268856] INFO -- : racc 1.7.3 I, [2024-05-14T07:31:41.060541 #1268856] INFO -- : mutex_m 0.2.0 I, [2024-05-14T07:31:41.061707 #1268856] INFO -- : getoptlong 0.2.1 I, [2024-05-14T07:31:41.062980 #1268856] INFO -- : base64 0.2.0 I, [2024-05-14T07:31:41.064166 #1268856] INFO -- : bigdecimal 3.1.8 I, [2024-05-14T07:31:41.066113 #1268856] INFO -- : observer 0.1.2 I, [2024-05-14T07:31:41.067168 #1268856] INFO -- : abbrev 0.1.2 I, [2024-05-14T07:31:41.068599 #1268856] INFO -- : resolv-replace 0.1.1 I, [2024-05-14T07:31:41.069709 #1268856] INFO -- : rinda 0.2.0 I, [2024-05-14T07:31:41.071097 #1268856] INFO -- : drb 2.2.1 I, [2024-05-14T07:31:41.072724 #1268856] INFO -- : nkf 0.2.0 I, [2024-05-14T07:31:41.075108 #1268856] INFO -- : syslog 0.1.2 I, [2024-05-14T07:31:41.076654 #1268856] INFO -- : csv 3.3.0 I, [2024-05-14T07:31:41.078702 #1268856] INFO -- : installing bundled gem cache: /tmp/ruby/install/trunk/lib/ruby/gems/3.4.0+0/cache I, [2024-05-14T07:31:41.080229 #1268856] INFO -- : skipped bundled gems: I, [2024-05-14T07:31:41.080249 #1268856] INFO -- : power_assert-2.0.4dev.gem not found in bundled_gems I, [2024-05-14T07:31:41.083375 #1268856] INFO -- : $$$[end] "make install -j20" exit with 0. I, [2024-05-14T07:31:41.083500 #1268856] INFO -- : $$$[beg] make yes-btest TESTOPTS='-q -j20' I, [2024-05-14T07:31:46.168468 #1268856] INFO -- : PASS all 1936 tests E, [2024-05-14T07:31:46.175118 #1268856] ERROR -- : I, [2024-05-14T07:31:46.175299 #1268856] INFO -- : $$$[end] "make yes-btest TESTOPTS='-q -j20'" exit with 0. I, [2024-05-14T07:31:46.175385 #1268856] INFO -- : $$$[beg] make yes-test-basic TESTS='-j20' I, [2024-05-14T07:31:46.236149 #1268856] INFO -- : BASERUBY = /usr/bin/ruby --disable=gems I, [2024-05-14T07:31:46.236185 #1268856] INFO -- : CC = gcc I, [2024-05-14T07:31:46.236190 #1268856] INFO -- : LD = ld I, [2024-05-14T07:31:46.236194 #1268856] INFO -- : LDSHARED = gcc -shared I, [2024-05-14T07:31:46.236199 #1268856] INFO -- : CFLAGS = -O3 -fno-fast-math -ggdb3 -Wall -Wextra -Wdeprecated-declarations -Wdiv-by-zero -Wduplicated-cond -Wimplicit-function-declaration -Wimplicit-int -Wpointer-arith -Wwrite-strings -Wold-style-definition -Wimplicit-fallthrough=0 -Wmissing-noreturn -Wno-cast-function-type -Wno-constant-logical-operand -Wno-long-long -Wno-missing-field-initializers -Wno-overlength-strings -Wno-packed-bitfield-compat -Wno-parentheses-equality -Wno-self-assign -Wno-tautological-compare -Wno-unused-parameter -Wno-unused-value -Wsuggest-attribute=format -Wsuggest-attribute=noreturn -Wunused-variable -Wmisleading-indentation -Wundef -fPIC I, [2024-05-14T07:31:46.236203 #1268856] INFO -- : XCFLAGS = -U_FORTIFY_SOURCE -D_FORTIFY_SOURCE=2 -fstack-protector-strong -fno-strict-overflow -fvisibility=hidden -fexcess-precision=standard -DRUBY_EXPORT -I. -I.ext/include/x86_64-linux -I/tmp/ruby/src/trunk/include -I/tmp/ruby/src/trunk -I/tmp/ruby/src/trunk/prism -I/tmp/ruby/src/trunk/enc/unicode/15.0.0 I, [2024-05-14T07:31:46.236216 #1268856] INFO -- : CPPFLAGS = I, [2024-05-14T07:31:46.236220 #1268856] INFO -- : DLDFLAGS = -Wl,--compress-debug-sections=zlib -Wl,-soname,libruby.so.3.4 -fstack-protector-strong I, [2024-05-14T07:31:46.236224 #1268856] INFO -- : SOLIBS = -lz -lrt -lrt -lgmp -ldl -lcrypt -lm -lpthread I, [2024-05-14T07:31:46.236227 #1268856] INFO -- : LANG = en_US.UTF-8 I, [2024-05-14T07:31:46.236231 #1268856] INFO -- : LC_ALL = I, [2024-05-14T07:31:46.236234 #1268856] INFO -- : LC_CTYPE = I, [2024-05-14T07:31:46.236237 #1268856] INFO -- : MFLAGS = I, [2024-05-14T07:31:46.236241 #1268856] INFO -- : RUSTC = no I, [2024-05-14T07:31:46.236244 #1268856] INFO -- : YJIT_RUSTC_ARGS = --crate-name=yjit --crate-type=staticlib --edition=2021 -g -C lto=thin -C opt-level=3 -C overflow-checks=on '--out-dir=/tmp/ruby/build/trunk/yjit/target/release/' /tmp/ruby/src/trunk/yjit/src/lib.rs I, [2024-05-14T07:31:46.236806 #1268856] INFO -- : gcc (Ubuntu 11.4.0-1ubuntu1~22.04) 11.4.0 I, [2024-05-14T07:31:46.236826 #1268856] INFO -- : Copyright (C) 2021 Free Software Foundation, Inc. I, [2024-05-14T07:31:46.236832 #1268856] INFO -- : This is free software; see the source for copying conditions. There is NO I, [2024-05-14T07:31:46.236836 #1268856] INFO -- : warranty; not even for MERCHANTABILITY or FITNESS FOR A PARTICULAR PURPOSE. I, [2024-05-14T07:31:46.236840 #1268856] INFO -- : I, [2024-05-14T07:31:46.347582 #1268856] INFO -- : Checking leaked global symbols...none I, [2024-05-14T07:31:46.388097 #1268856] INFO -- : /tmp/ruby/src/trunk/basictest/test.rb:assignment ....................................................................................................................................................................................................................................................................................................................................................................................OK 372 I, [2024-05-14T07:31:46.388154 #1268856] INFO -- : /tmp/ruby/src/trunk/basictest/test.rb:condition ..OK 2 I, [2024-05-14T07:31:46.388162 #1268856] INFO -- : /tmp/ruby/src/trunk/basictest/test.rb:if/unless ...OK 3 I, [2024-05-14T07:31:46.388192 #1268856] INFO -- : /tmp/ruby/src/trunk/basictest/test.rb:case .....OK 5 I, [2024-05-14T07:31:46.388478 #1268856] INFO -- : /tmp/ruby/src/trunk/basictest/test.rb:while/until ........OK 8 I, [2024-05-14T07:31:46.388551 #1268856] INFO -- : /tmp/ruby/src/trunk/basictest/test.rb:exception ..........OK 10 I, [2024-05-14T07:31:46.388911 #1268856] INFO -- : /tmp/ruby/src/trunk/basictest/test.rb:array .......................................OK 39 I, [2024-05-14T07:31:46.389045 #1268856] INFO -- : /tmp/ruby/src/trunk/basictest/test.rb:hash ...........................OK 27 I, [2024-05-14T07:31:46.389999 #1268856] INFO -- : /tmp/ruby/src/trunk/basictest/test.rb:iterator ...........................................................................................................OK 107 I, [2024-05-14T07:31:46.390350 #1268856] INFO -- : /tmp/ruby/src/trunk/basictest/test.rb:float ................................................................................OK 80 I, [2024-05-14T07:31:46.391643 #1268856] INFO -- : /tmp/ruby/src/trunk/basictest/test.rb:bignum ...............................OK 31 I, [2024-05-14T07:31:46.392596 #1268856] INFO -- : /tmp/ruby/src/trunk/basictest/test.rb:string & char ..............................................................OK 62 I, [2024-05-14T07:31:46.392623 #1268856] INFO -- : /tmp/ruby/src/trunk/basictest/test.rb:assignment ..........OK 10 I, [2024-05-14T07:31:46.392650 #1268856] INFO -- : /tmp/ruby/src/trunk/basictest/test.rb:call ......OK 6 I, [2024-05-14T07:31:46.392712 #1268856] INFO -- : /tmp/ruby/src/trunk/basictest/test.rb:proc .........OK 9 I, [2024-05-14T07:31:46.493410 #1268856] INFO -- : /tmp/ruby/src/trunk/basictest/test.rb:signal ..OK 2 I, [2024-05-14T07:31:46.496224 #1268856] INFO -- : /tmp/ruby/src/trunk/basictest/test.rb:eval ...........................OK 27 I, [2024-05-14T07:31:46.608670 #1268856] INFO -- : /tmp/ruby/src/trunk/basictest/test.rb:system ........OK 8 I, [2024-05-14T07:31:46.608730 #1268856] INFO -- : /tmp/ruby/src/trunk/basictest/test.rb:const .....OK 5 I, [2024-05-14T07:31:46.608744 #1268856] INFO -- : /tmp/ruby/src/trunk/basictest/test.rb:clone .....OK 5 I, [2024-05-14T07:31:46.608838 #1268856] INFO -- : /tmp/ruby/src/trunk/basictest/test.rb:marshal ....OK 4 I, [2024-05-14T07:31:46.608859 #1268856] INFO -- : /tmp/ruby/src/trunk/basictest/test.rb:pack ....OK 4 I, [2024-05-14T07:31:46.608865 #1268856] INFO -- : /tmp/ruby/src/trunk/basictest/test.rb:math ..OK 2 I, [2024-05-14T07:31:46.608954 #1268856] INFO -- : /tmp/ruby/src/trunk/basictest/test.rb:struct ......OK 6 I, [2024-05-14T07:31:46.609065 #1268856] INFO -- : /tmp/ruby/src/trunk/basictest/test.rb:variable ............OK 12 I, [2024-05-14T07:31:46.609085 #1268856] INFO -- : /tmp/ruby/src/trunk/basictest/test.rb:trace ...OK 3 I, [2024-05-14T07:31:46.609092 #1268856] INFO -- : /tmp/ruby/src/trunk/basictest/test.rb:defined? ............OK 12 I, [2024-05-14T07:31:46.609182 #1268856] INFO -- : /tmp/ruby/src/trunk/basictest/test.rb:alias ......OK 6 I, [2024-05-14T07:31:46.609476 #1268856] INFO -- : /tmp/ruby/src/trunk/basictest/test.rb:path .......................OK 23 I, [2024-05-14T07:31:46.646078 #1268856] INFO -- : /tmp/ruby/src/trunk/basictest/test.rb:gc ....OK 4 I, [2024-05-14T07:31:46.648465 #1268856] INFO -- : I, [2024-05-14T07:31:46.648488 #1268856] INFO -- : test succeeded I, [2024-05-14T07:31:46.650149 #1268856] INFO -- : $$$[end] "make yes-test-basic TESTS='-j20'" exit with 0. I, [2024-05-14T07:31:46.650241 #1268856] INFO -- : $$$[beg] make yes-test-all TESTOPTS='--stderr-on-failure' TESTS='-j20' I, [2024-05-14T07:31:46.744954 #1268856] INFO -- : BASERUBY = /usr/bin/ruby --disable=gems I, [2024-05-14T07:31:46.744997 #1268856] INFO -- : CC = gcc I, [2024-05-14T07:31:46.745003 #1268856] INFO -- : LD = ld I, [2024-05-14T07:31:46.745008 #1268856] INFO -- : LDSHARED = gcc -shared I, [2024-05-14T07:31:46.745013 #1268856] INFO -- : CFLAGS = -O3 -fno-fast-math -ggdb3 -Wall -Wextra -Wdeprecated-declarations -Wdiv-by-zero -Wduplicated-cond -Wimplicit-function-declaration -Wimplicit-int -Wpointer-arith -Wwrite-strings -Wold-style-definition -Wimplicit-fallthrough=0 -Wmissing-noreturn -Wno-cast-function-type -Wno-constant-logical-operand -Wno-long-long -Wno-missing-field-initializers -Wno-overlength-strings -Wno-packed-bitfield-compat -Wno-parentheses-equality -Wno-self-assign -Wno-tautological-compare -Wno-unused-parameter -Wno-unused-value -Wsuggest-attribute=format -Wsuggest-attribute=noreturn -Wunused-variable -Wmisleading-indentation -Wundef -fPIC I, [2024-05-14T07:31:46.745018 #1268856] INFO -- : XCFLAGS = -U_FORTIFY_SOURCE -D_FORTIFY_SOURCE=2 -fstack-protector-strong -fno-strict-overflow -fvisibility=hidden -fexcess-precision=standard -DRUBY_EXPORT -I. -I.ext/include/x86_64-linux -I/tmp/ruby/src/trunk/include -I/tmp/ruby/src/trunk -I/tmp/ruby/src/trunk/prism -I/tmp/ruby/src/trunk/enc/unicode/15.0.0 I, [2024-05-14T07:31:46.745022 #1268856] INFO -- : CPPFLAGS = I, [2024-05-14T07:31:46.745027 #1268856] INFO -- : DLDFLAGS = -Wl,--compress-debug-sections=zlib -Wl,-soname,libruby.so.3.4 -fstack-protector-strong I, [2024-05-14T07:31:46.745031 #1268856] INFO -- : SOLIBS = -lz -lrt -lrt -lgmp -ldl -lcrypt -lm -lpthread I, [2024-05-14T07:31:46.745035 #1268856] INFO -- : LANG = en_US.UTF-8 I, [2024-05-14T07:31:46.745040 #1268856] INFO -- : LC_ALL = I, [2024-05-14T07:31:46.745044 #1268856] INFO -- : LC_CTYPE = I, [2024-05-14T07:31:46.745048 #1268856] INFO -- : MFLAGS = I, [2024-05-14T07:31:46.745052 #1268856] INFO -- : RUSTC = no I, [2024-05-14T07:31:46.745057 #1268856] INFO -- : YJIT_RUSTC_ARGS = --crate-name=yjit --crate-type=staticlib --edition=2021 -g -C lto=thin -C opt-level=3 -C overflow-checks=on '--out-dir=/tmp/ruby/build/trunk/yjit/target/release/' /tmp/ruby/src/trunk/yjit/src/lib.rs I, [2024-05-14T07:31:46.745622 #1268856] INFO -- : gcc (Ubuntu 11.4.0-1ubuntu1~22.04) 11.4.0 I, [2024-05-14T07:31:46.745647 #1268856] INFO -- : Copyright (C) 2021 Free Software Foundation, Inc. I, [2024-05-14T07:31:46.745654 #1268856] INFO -- : This is free software; see the source for copying conditions. There is NO I, [2024-05-14T07:31:46.745659 #1268856] INFO -- : warranty; not even for MERCHANTABILITY or FITNESS FOR A PARTICULAR PURPOSE. I, [2024-05-14T07:31:46.745663 #1268856] INFO -- : I, [2024-05-14T07:31:46.747296 #1268856] INFO -- : generating enc.mk I, [2024-05-14T07:31:46.864512 #1268856] INFO -- : making enc I, [2024-05-14T07:31:46.881692 #1268856] INFO -- : make[1]: Entering directory '/tmp/ruby/build/trunk' I, [2024-05-14T07:31:46.881714 #1268856] INFO -- : make[1]: Nothing to be done for 'enc'. I, [2024-05-14T07:31:46.881720 #1268856] INFO -- : make[1]: Leaving directory '/tmp/ruby/build/trunk' I, [2024-05-14T07:31:46.882326 #1268856] INFO -- : making srcs under enc I, [2024-05-14T07:31:46.912470 #1268856] INFO -- : make[1]: Entering directory '/tmp/ruby/build/trunk' I, [2024-05-14T07:31:46.912491 #1268856] INFO -- : make[1]: Nothing to be done for 'srcs'. I, [2024-05-14T07:31:46.912496 #1268856] INFO -- : make[1]: Leaving directory '/tmp/ruby/build/trunk' I, [2024-05-14T07:31:46.913448 #1268856] INFO -- : generating transdb.h I, [2024-05-14T07:31:47.011929 #1268856] INFO -- : transdb.h unchanged I, [2024-05-14T07:31:47.013337 #1268856] INFO -- : making trans I, [2024-05-14T07:31:47.046889 #1268856] INFO -- : make[1]: Entering directory '/tmp/ruby/build/trunk' I, [2024-05-14T07:31:47.046910 #1268856] INFO -- : make[1]: Nothing to be done for 'trans'. I, [2024-05-14T07:31:47.046916 #1268856] INFO -- : make[1]: Leaving directory '/tmp/ruby/build/trunk' I, [2024-05-14T07:31:47.047639 #1268856] INFO -- : making encs I, [2024-05-14T07:31:47.086145 #1268856] INFO -- : make[1]: Entering directory '/tmp/ruby/build/trunk' I, [2024-05-14T07:31:47.086166 #1268856] INFO -- : make[1]: Nothing to be done for 'encs'. I, [2024-05-14T07:31:47.086171 #1268856] INFO -- : make[1]: Leaving directory '/tmp/ruby/build/trunk' I, [2024-05-14T07:31:47.087901 #1268856] INFO -- : generating makefiles ext/configure-ext.mk I, [2024-05-14T07:31:47.114369 #1268856] INFO -- : ext/configure-ext.mk updated I, [2024-05-14T07:31:47.116664 #1268856] INFO -- : make[1]: Entering directory '/tmp/ruby/build/trunk' I, [2024-05-14T07:31:48.465064 #1268856] INFO -- : make[1]: Leaving directory '/tmp/ruby/build/trunk' I, [2024-05-14T07:31:48.465938 #1268856] INFO -- : generating makefile exts.mk I, [2024-05-14T07:31:48.502747 #1268856] INFO -- : exts.mk unchanged I, [2024-05-14T07:31:48.506918 #1268856] INFO -- : make[1]: Entering directory '/tmp/ruby/build/trunk' I, [2024-05-14T07:31:48.810993 #1268856] INFO -- : make[2]: Entering directory '/tmp/ruby/build/trunk/ext/coverage' I, [2024-05-14T07:31:48.814276 #1268856] INFO -- : make[2]: Leaving directory '/tmp/ruby/build/trunk/ext/coverage' I, [2024-05-14T07:31:48.819568 #1268856] INFO -- : make[2]: Entering directory '/tmp/ruby/build/trunk/ext/date' I, [2024-05-14T07:31:48.823925 #1268856] INFO -- : make[2]: Leaving directory '/tmp/ruby/build/trunk/ext/date' I, [2024-05-14T07:31:48.827640 #1268856] INFO -- : make[2]: Entering directory '/tmp/ruby/build/trunk/ext/digest' I, [2024-05-14T07:31:48.836658 #1268856] INFO -- : make[2]: Leaving directory '/tmp/ruby/build/trunk/ext/digest' I, [2024-05-14T07:31:48.862852 #1268856] INFO -- : make[2]: Entering directory '/tmp/ruby/build/trunk/ext/digest/sha2' I, [2024-05-14T07:31:48.867684 #1268856] INFO -- : make[2]: Leaving directory '/tmp/ruby/build/trunk/ext/digest/sha2' I, [2024-05-14T07:31:48.888769 #1268856] INFO -- : make[2]: Entering directory '/tmp/ruby/build/trunk/ext/fiddle' I, [2024-05-14T07:31:48.898606 #1268856] INFO -- : make[2]: Leaving directory '/tmp/ruby/build/trunk/ext/fiddle' I, [2024-05-14T07:31:48.903617 #1268856] INFO -- : make[2]: Entering directory '/tmp/ruby/build/trunk/ext/io/console' I, [2024-05-14T07:31:48.907804 #1268856] INFO -- : make[2]: Leaving directory '/tmp/ruby/build/trunk/ext/io/console' I, [2024-05-14T07:31:48.920913 #1268856] INFO -- : make[2]: Entering directory '/tmp/ruby/build/trunk/ext/json' I, [2024-05-14T07:31:48.931591 #1268856] INFO -- : make[2]: Leaving directory '/tmp/ruby/build/trunk/ext/json' I, [2024-05-14T07:31:48.945506 #1268856] INFO -- : make[2]: Entering directory '/tmp/ruby/build/trunk/ext/monitor' I, [2024-05-14T07:31:48.948708 #1268856] INFO -- : make[2]: Leaving directory '/tmp/ruby/build/trunk/ext/monitor' I, [2024-05-14T07:31:48.955468 #1268856] INFO -- : make[2]: Entering directory '/tmp/ruby/build/trunk/ext/objspace' I, [2024-05-14T07:31:48.961681 #1268856] INFO -- : make[2]: Leaving directory '/tmp/ruby/build/trunk/ext/objspace' I, [2024-05-14T07:31:48.978091 #1268856] INFO -- : make[2]: Entering directory '/tmp/ruby/build/trunk/ext/openssl' I, [2024-05-14T07:31:48.995059 #1268856] INFO -- : make[2]: Leaving directory '/tmp/ruby/build/trunk/ext/openssl' I, [2024-05-14T07:31:48.998821 #1268856] INFO -- : make[2]: Entering directory '/tmp/ruby/build/trunk/ext/pathname' I, [2024-05-14T07:31:49.002687 #1268856] INFO -- : make[2]: Leaving directory '/tmp/ruby/build/trunk/ext/pathname' I, [2024-05-14T07:31:49.009641 #1268856] INFO -- : make[2]: Entering directory '/tmp/ruby/build/trunk/ext/psych' I, [2024-05-14T07:31:49.031160 #1268856] INFO -- : make[2]: Leaving directory '/tmp/ruby/build/trunk/ext/psych' I, [2024-05-14T07:31:49.034846 #1268856] INFO -- : make[2]: Entering directory '/tmp/ruby/build/trunk/ext/pty' I, [2024-05-14T07:31:49.038498 #1268856] INFO -- : make[2]: Leaving directory '/tmp/ruby/build/trunk/ext/pty' I, [2024-05-14T07:31:49.053117 #1268856] INFO -- : make[2]: Entering directory '/tmp/ruby/build/trunk/ext/ripper' I, [2024-05-14T07:31:49.059447 #1268856] INFO -- : make[2]: Leaving directory '/tmp/ruby/build/trunk/ext/ripper' I, [2024-05-14T07:31:49.061473 #1268856] INFO -- : make[2]: Entering directory '/tmp/ruby/build/trunk/ext/rubyvm' I, [2024-05-14T07:31:49.064495 #1268856] INFO -- : make[2]: Leaving directory '/tmp/ruby/build/trunk/ext/rubyvm' I, [2024-05-14T07:31:49.074895 #1268856] INFO -- : make[2]: Entering directory '/tmp/ruby/build/trunk/ext/socket' I, [2024-05-14T07:31:49.081883 #1268856] INFO -- : make[2]: Leaving directory '/tmp/ruby/build/trunk/ext/socket' I, [2024-05-14T07:31:49.098502 #1268856] INFO -- : make[2]: Entering directory '/tmp/ruby/build/trunk/.bundle/gems/bigdecimal-3.1.8/ext/bigdecimal' I, [2024-05-14T07:31:49.126811 #1268856] INFO -- : make[2]: Leaving directory '/tmp/ruby/build/trunk/.bundle/gems/bigdecimal-3.1.8/ext/bigdecimal' I, [2024-05-14T07:31:49.128847 #1268856] INFO -- : make[2]: Entering directory '/tmp/ruby/build/trunk/.bundle/gems/debug-1.9.2/ext/debug' I, [2024-05-14T07:31:49.151257 #1268856] INFO -- : make[2]: Leaving directory '/tmp/ruby/build/trunk/.bundle/gems/debug-1.9.2/ext/debug' I, [2024-05-14T07:31:49.153198 #1268856] INFO -- : make[2]: Entering directory '/tmp/ruby/build/trunk/.bundle/gems/nkf-0.2.0/ext/nkf' I, [2024-05-14T07:31:49.175269 #1268856] INFO -- : make[2]: Leaving directory '/tmp/ruby/build/trunk/.bundle/gems/nkf-0.2.0/ext/nkf' I, [2024-05-14T07:31:49.177180 #1268856] INFO -- : make[2]: Entering directory '/tmp/ruby/build/trunk/.bundle/gems/racc-1.7.3/ext/racc/cparse' I, [2024-05-14T07:31:49.199924 #1268856] INFO -- : make[2]: Leaving directory '/tmp/ruby/build/trunk/.bundle/gems/racc-1.7.3/ext/racc/cparse' I, [2024-05-14T07:31:49.202311 #1268856] INFO -- : make[2]: Entering directory '/tmp/ruby/build/trunk/.bundle/gems/rbs-3.4.4/ext/rbs_extension' I, [2024-05-14T07:31:49.223343 #1268856] INFO -- : make[2]: Leaving directory '/tmp/ruby/build/trunk/.bundle/gems/rbs-3.4.4/ext/rbs_extension' I, [2024-05-14T07:31:49.225303 #1268856] INFO -- : make[2]: Entering directory '/tmp/ruby/build/trunk/.bundle/gems/syslog-0.1.2/ext/syslog' I, [2024-05-14T07:31:49.246745 #1268856] INFO -- : make[2]: Leaving directory '/tmp/ruby/build/trunk/.bundle/gems/syslog-0.1.2/ext/syslog' I, [2024-05-14T07:31:49.270182 #1268856] INFO -- : make[2]: Entering directory '/tmp/ruby/build/trunk' I, [2024-05-14T07:31:49.338643 #1268856] INFO -- : make[2]: 'ruby' is up to date. I, [2024-05-14T07:31:49.338681 #1268856] INFO -- : make[2]: Leaving directory '/tmp/ruby/build/trunk' I, [2024-05-14T07:31:49.338930 #1268856] INFO -- : make[1]: Leaving directory '/tmp/ruby/build/trunk' I, [2024-05-14T07:31:49.342428 #1268856] INFO -- : make[1]: Entering directory '/tmp/ruby/build/trunk' I, [2024-05-14T07:31:49.342457 #1268856] INFO -- : make[1]: Nothing to be done for 'note'. I, [2024-05-14T07:31:49.342465 #1268856] INFO -- : make[1]: Leaving directory '/tmp/ruby/build/trunk' I, [2024-05-14T07:31:49.422766 #1268856] INFO -- : Run options: I, [2024-05-14T07:31:49.422825 #1268856] INFO -- : --seed=38008 I, [2024-05-14T07:31:49.422831 #1268856] INFO -- : "--ruby=./miniruby -I/tmp/ruby/src/trunk/lib -I. -I.ext/common /tmp/ruby/src/trunk/tool/runruby.rb --extout=.ext -- --disable-gems" I, [2024-05-14T07:31:49.422835 #1268856] INFO -- : --excludes-dir=/tmp/ruby/src/trunk/test/.excludes I, [2024-05-14T07:31:49.422838 #1268856] INFO -- : --name=!/memory_leak/ I, [2024-05-14T07:31:49.422842 #1268856] INFO -- : --stderr-on-failure I, [2024-05-14T07:31:49.422845 #1268856] INFO -- : -j20 I, [2024-05-14T07:31:49.422849 #1268856] INFO -- : I, [2024-05-14T07:31:49.422853 #1268856] INFO -- : # Running tests: I, [2024-05-14T07:31:49.422856 #1268856] INFO -- : I, [2024-05-14T07:31:49.569263 #1268856] INFO -- : [ 1/885] 1310235=test_ractor_compatibility I, [2024-05-14T07:31:49.569410 #1268856] INFO -- : [ 2/885] 1310220=test_eval I, [2024-05-14T07:31:49.569905 #1268856] INFO -- : [ 3/885] 1310222=test_autoconf I, [2024-05-14T07:31:49.570002 #1268856] INFO -- : [ 4/885] 1310224=format_errors_test I, [2024-05-14T07:31:49.570263 #1268856] INFO -- : [ 5/885] 1310225=test_dir I, [2024-05-14T07:31:49.572080 #1268856] INFO -- : [ 6/885] 1310223=test_date_ractor I, [2024-05-14T07:31:49.573443 #1268856] INFO -- : [ 7/885] 1310220=test_gem_console_ui I, [2024-05-14T07:31:49.573831 #1268856] INFO -- : [ 8/885] 1310234=test_word I, [2024-05-14T07:31:49.573859 #1268856] INFO -- : [ 9/885] 1310238=test_gem_commands_cleanup_command I, [2024-05-14T07:31:49.574132 #1268856] INFO -- : [ 10/885] 1310237=test_cgi_multipart I, [2024-05-14T07:31:49.574935 #1268856] INFO -- : [ 11/885] 1310236=test_numeric I, [2024-05-14T07:31:49.576169 #1268856] INFO -- : [ 12/885] 1310239=test_member I, [2024-05-14T07:31:49.576876 #1268856] INFO -- : [ 13/885] 1310234=test_gem_source_fetch_problem I, [2024-05-14T07:31:49.578134 #1268856] INFO -- : [ 14/885] 1310222=json_generic_object_test I, [2024-05-14T07:31:49.578922 #1268856] INFO -- : [ 15/885] 1310239=test_http_request I, [2024-05-14T07:31:49.602773 #1268856] INFO -- : [ 16/885] 1310222=test_rdoc_generator_darkfish I, [2024-05-14T07:31:49.605017 #1268856] INFO -- : [ 17/885] 1310227=test_resize I, [2024-05-14T07:31:49.605083 #1268856] INFO -- : [ 18/885] 1310228=test_error_highlight I, [2024-05-14T07:31:49.605099 #1268856] INFO -- : [ 19/885] 1310229=test_rdoc_comment I, [2024-05-14T07:31:49.605115 #1268856] INFO -- : [ 20/885] 1310230=test_mailto I, [2024-05-14T07:31:49.605127 #1268856] INFO -- : [ 21/885] 1310236=test_coderange I, [2024-05-14T07:31:49.605140 #1268856] INFO -- : [ 22/885] 1310232=test_symbol I, [2024-05-14T07:31:49.605412 #1268856] INFO -- : [ 23/885] 1310226=location_test I, [2024-05-14T07:31:49.607831 #1268856] INFO -- : [ 24/885] 1310233=test_gem_resolver_requirement_list I, [2024-05-14T07:31:49.609892 #1268856] INFO -- : [ 25/885] 1310221=test_arith_seq_beg_len_step I, [2024-05-14T07:31:49.614894 #1268856] INFO -- : [ 26/885] 1310236=test_pkcs7 I, [2024-05-14T07:31:49.615970 #1268856] INFO -- : [ 27/885] 1310231=test_function_entry I, [2024-05-14T07:31:49.621551 #1268856] INFO -- : [ 28/885] 1310227=test_symbol I, [2024-05-14T07:31:49.624878 #1268856] INFO -- : [ 29/885] 1310231=test_coder I, [2024-05-14T07:31:49.626502 #1268856] INFO -- : [ 30/885] 1310224=test_nofree I, [2024-05-14T07:31:49.626686 #1268856] INFO -- : [ 31/885] 1310224=test_context I, [2024-05-14T07:31:49.636192 #1268856] INFO -- : [ 32/885] 1310232=test_gem_commands_pristine_command I, [2024-05-14T07:31:49.641304 #1268856] INFO -- : [ 33/885] 1310230=ruby_api_test I, [2024-05-14T07:31:49.643258 #1268856] INFO -- : [ 34/885] 1310239=test_find_executable I, [2024-05-14T07:31:49.657136 #1268856] INFO -- : [ 35/885] 1310231=test_lazy_enumerator I, [2024-05-14T07:31:49.664401 #1268856] INFO -- : [ 36/885] 1310239=test_enc_associate I, [2024-05-14T07:31:49.699849 #1268856] INFO -- : [ 37/885] 1310221=test_unix I, [2024-05-14T07:31:49.739759 #1268856] INFO -- : [ 38/885] 1310221=test_win32ole_variable I, [2024-05-14T07:31:49.747234 #1268856] INFO -- : [ 39/885] 1310221=test_io_wait_uncommon I, [2024-05-14T07:31:49.747673 #1268856] INFO -- : [ 40/885] 1310220=test_arity I, [2024-05-14T07:31:49.748670 #1268856] INFO -- : [ 41/885] 1310233=test_stringio I, [2024-05-14T07:31:49.753140 #1268856] INFO -- : [ 42/885] 1310220=test_gem_ci_detector I, [2024-05-14T07:31:49.755206 #1268856] INFO -- : [ 43/885] 1310220=test_bignum I, [2024-05-14T07:31:49.772154 #1268856] INFO -- : [ 44/885] 1310226=test_rdoc_class_module I, [2024-05-14T07:31:49.772707 #1268856] INFO -- : [ 45/885] 1310237=test_rdoc_generator_json_index I, [2024-05-14T07:31:49.772982 #1268856] INFO -- : [ 46/885] 1310234=test_win32ole_event I, [2024-05-14T07:31:49.786543 #1268856] INFO -- : [ 47/885] 1310221=test_time_tz I, [2024-05-14T07:31:49.787984 #1268856] INFO -- : [ 48/885] 1310234=ractor_test I, [2024-05-14T07:31:49.792054 #1268856] INFO -- : [ 49/885] 1310229=test_trace I, [2024-05-14T07:31:49.798497 #1268856] INFO -- : [ 50/885] 1310229=test_have_macro I, [2024-05-14T07:31:49.822333 #1268856] INFO -- : [ 51/885] 1310223=test_resolve_symbol I, [2024-05-14T07:31:49.825862 #1268856] INFO -- : [ 52/885] 1310225=test_complex2 I, [2024-05-14T07:31:49.826491 #1268856] INFO -- : [ 53/885] 1310221=test_gem_package I, [2024-05-14T07:31:49.833828 #1268856] INFO -- : [ 54/885] 1310236=test_threadgroup I, [2024-05-14T07:31:49.837037 #1268856] INFO -- : [ 55/885] 1310233=test_gem_specification I, [2024-05-14T07:31:49.856022 #1268856] INFO -- : [ 56/885] 1310225=test_enum I, [2024-05-14T07:31:49.865761 #1268856] INFO -- : [ 57/885] 1310224=test_rdoc_extend I, [2024-05-14T07:31:49.876883 #1268856] INFO -- : [ 58/885] 1310234=test_merge_keys I, [2024-05-14T07:31:49.893187 #1268856] INFO -- : [ 59/885] 1310230=test_gem_resolver_api_specification I, [2024-05-14T07:31:49.901462 #1268856] INFO -- : [ 60/885] 1310220=test_ipaddr I, [2024-05-14T07:31:49.901871 #1268856] INFO -- : [ 61/885] 1310234=test_rdoc_markup_to_ansi I, [2024-05-14T07:31:49.916139 #1268856] INFO -- : [ 62/885] 1310223=test_history I, [2024-05-14T07:31:49.923616 #1268856] INFO -- : [ 63/885] 1310220=test_mixed_unicode_escapes I, [2024-05-14T07:31:49.930096 #1268856] INFO -- : [ 64/885] 1310220=test_win32ole_variant I, [2024-05-14T07:31:49.933791 #1268856] INFO -- : [ 65/885] 1310220=test_cgi_core I, [2024-05-14T07:31:49.952901 #1268856] INFO -- : [ 66/885] 1310220=test_parser I, [2024-05-14T07:31:49.967158 #1268856] INFO -- : [ 67/885] 1310237=parse_stream_test I, [2024-05-14T07:31:49.980994 #1268856] INFO -- : [ 68/885] 1310231=test_registry I, [2024-05-14T07:31:49.982278 #1268856] INFO -- : [ 69/885] 1310231=test_gem_commands_open_command I, [2024-05-14T07:31:49.988686 #1268856] INFO -- : [ 70/885] 1310223=test_dns I, [2024-05-14T07:31:50.001424 #1268856] INFO -- : [ 71/885] 1310220=test_ractor I, [2024-05-14T07:31:50.013721 #1268856] INFO -- : [ 72/885] 1310235=test_gem_source_lock I, [2024-05-14T07:31:50.017491 #1268856] INFO -- : [ 73/885] 1310237=test_gem I, [2024-05-14T07:31:50.023369 #1268856] INFO -- : [ 74/885] 1310220=test_ssl I, [2024-05-14T07:31:50.044539 #1268856] INFO -- : [ 75/885] 1310228=test_ractor I, [2024-05-14T07:31:50.075097 #1268856] INFO -- : [ 76/885] 1310234=json_ext_parser_test I, [2024-05-14T07:31:50.077920 #1268856] INFO -- : [ 77/885] 1310234=test_thread I, [2024-05-14T07:31:50.106452 #1268856] INFO -- : [ 78/885] 1310230=test_my_integer I, [2024-05-14T07:31:50.115163 #1268856] INFO -- : [ 79/885] 1310230=test_debugger_integration I, [2024-05-14T07:31:50.133103 #1268856] INFO -- : [ 80/885] 1310224=test_rendering I, [2024-05-14T07:31:50.134153 #1268856] INFO -- : [ 81/885] 1310230=test_unicode_normalize I, [2024-05-14T07:31:50.140863 #1268856] INFO -- : [ 82/885] 1310224=test_marshal I, [2024-05-14T07:31:50.208478 #1268856] INFO -- : [ 83/885] 1310222=test_nonblock I, [2024-05-14T07:31:50.225366 #1268856] INFO -- : [ 84/885] 1310235=test_weakref I, [2024-05-14T07:31:50.229823 #1268856] INFO -- : [ 85/885] 1310222=test_alias I, [2024-05-14T07:31:50.249920 #1268856] INFO -- : [ 86/885] 1310231=test_timeout I, [2024-05-14T07:31:50.273098 #1268856] INFO -- : [ 87/885] 1310238=test_ancdata I, [2024-05-14T07:31:50.278243 #1268856] INFO -- : [ 88/885] 1310238=test_singleton_function I, [2024-05-14T07:31:50.287974 #1268856] INFO -- : [ 89/885] 1310238=test_rb_str_dup I, [2024-05-14T07:31:50.296943 #1268856] INFO -- : [ 90/885] 1310238=test_reline_key I, [2024-05-14T07:31:50.303255 #1268856] INFO -- : [ 91/885] 1310239=test_cgi_modruby I, [2024-05-14T07:31:50.312014 #1268856] INFO -- : [ 92/885] 1310239=test_integer I, [2024-05-14T07:31:50.325026 #1268856] INFO -- : [ 93/885] 1310235=test_super I, [2024-05-14T07:31:50.361900 #1268856] INFO -- : [ 94/885] 1310229=test_rubyoptions I, [2024-05-14T07:31:50.366922 #1268856] INFO -- : [ 95/885] 1310222=test_https_proxy I, [2024-05-14T07:31:50.368606 #1268856] INFO -- : [ 96/885] 1310238=test_call I, [2024-05-14T07:31:50.406973 #1268856] INFO -- : [ 97/885] 1310226=test_rubygems I, [2024-05-14T07:31:50.459045 #1268856] INFO -- : [ 98/885] 1310238=test_nextafter I, [2024-05-14T07:31:50.465199 #1268856] INFO -- : [ 99/885] 1310222=test_capacity I, [2024-05-14T07:31:50.469518 #1268856] INFO -- : [100/885] 1310223=test_stat I, [2024-05-14T07:31:50.470262 #1268856] INFO -- : [101/885] 1310223=test_gem_request_set_lockfile_tokenizer I, [2024-05-14T07:31:50.471407 #1268856] INFO -- : [102/885] 1310222=test_have_func I, [2024-05-14T07:31:50.479513 #1268856] INFO -- : [103/885] 1310228=test_gem_resolver_git_specification I, [2024-05-14T07:31:50.507148 #1268856] INFO -- : [104/885] 1310238=test_object_references I, [2024-05-14T07:31:50.515585 #1268856] INFO -- : [105/885] 1310238=test_usrmarshal I, [2024-05-14T07:31:50.537717 #1268856] INFO -- : [106/885] 1310224=test_rdoc_attr I, [2024-05-14T07:31:50.543492 #1268856] INFO -- : [107/885] 1310224=test_env I, [2024-05-14T07:31:50.574337 #1268856] INFO -- : [108/885] 1310220=desugar_compiler_test I, [2024-05-14T07:31:50.653138 #1268856] INFO -- : [109/885] 1310220=test_integer I, [2024-05-14T07:31:50.671897 #1268856] INFO -- : [110/885] 1310225=test_dryrun I, [2024-05-14T07:31:50.674614 #1268856] INFO -- : [111/885] 1310238=test_gem_commands_setup_command I, [2024-05-14T07:31:50.687480 #1268856] INFO -- : [112/885] 1310225=test_gem_resolver_api_set I, [2024-05-14T07:31:50.720125 #1268856] INFO -- : [113/885] 1310226=test_gem_safe_marshal I, [2024-05-14T07:31:50.721468 #1268856] INFO -- : [114/885] 1310220=test_enumerable I, [2024-05-14T07:31:50.722698 #1268856] INFO -- : [115/885] 1310223=test_config I, [2024-05-14T07:31:50.724507 #1268856] INFO -- : [116/885] 1310220=test_gem_resolver_vendor_set I, [2024-05-14T07:31:50.744841 #1268856] INFO -- : [117/885] 1310220=json_generator_test I, [2024-05-14T07:31:50.758303 #1268856] INFO -- : [118/885] 1310221=test_eval I, [2024-05-14T07:31:50.763311 #1268856] INFO -- : [119/885] 1310227=test_transcode I, [2024-05-14T07:31:50.837495 #1268856] INFO -- : [120/885] 1310220=test_update I, [2024-05-14T07:31:50.839670 #1268856] INFO -- : [121/885] 1310220=test_x509name I, [2024-05-14T07:31:50.841675 #1268856] INFO -- : [122/885] 1310235=test_fips I, [2024-05-14T07:31:50.863819 #1268856] INFO -- : [123/885] 1310228=test_x509store I, [2024-05-14T07:31:50.874572 #1268856] INFO -- : [124/885] 1310220=test_rdoc_code_object I, [2024-05-14T07:31:50.881438 #1268856] INFO -- : [125/885] 1310236=test_webauthn_listener I, [2024-05-14T07:31:50.899866 #1268856] INFO -- : [126/885] 1310225=test_helper I, [2024-05-14T07:31:50.958975 #1268856] INFO -- : [127/885] 1310227=test_random_formatter I, [2024-05-14T07:31:50.965557 #1268856] INFO -- : [128/885] 1310225=test_jaro_winkler I, [2024-05-14T07:31:50.975551 #1268856] INFO -- : [129/885] 1310227=test_gem_request_set_gem_dependency_api I, [2024-05-14T07:31:50.978896 #1268856] INFO -- : [130/885] 1310225=test_ast I, [2024-05-14T07:31:50.988413 #1268856] INFO -- : [131/885] 1310221=test_lambda I, [2024-05-14T07:31:51.064506 #1268856] INFO -- : [132/885] 1310221=test_integer_comb I, [2024-05-14T07:31:51.068739 #1268856] INFO -- : [133/885] 1310236=test_rdoc_markup_document I, [2024-05-14T07:31:51.075333 #1268856] INFO -- : [134/885] 1310235=test_tmpdir I, [2024-05-14T07:31:51.094129 #1268856] INFO -- : [135/885] 1310231=test_vm_dump I, [2024-05-14T07:31:51.107883 #1268856] INFO -- : [136/885] 1310231=errors_test I, [2024-05-14T07:31:51.108018 #1268856] INFO -- : [137/885] 1310228=test_gem_commands_check_command I, [2024-05-14T07:31:51.116992 #1268856] INFO -- : [138/885] 1310238=test_regexp I, [2024-05-14T07:31:51.132561 #1268856] INFO -- : [139/885] 1310228=static_inspect_test I, [2024-05-14T07:31:51.143645 #1268856] INFO -- : [140/885] 1310232=test_udp I, [2024-05-14T07:31:51.146602 #1268856] INFO -- : [141/885] 1310232=bom_test I, [2024-05-14T07:31:51.170583 #1268856] INFO -- : [142/885] 1310235=test_data_error I, [2024-05-14T07:31:51.218127 #1268856] INFO -- : [143/885] 1310228=unescape_test I, [2024-05-14T07:31:51.227541 #1268856] INFO -- : [144/885] 1310232=test_ostruct I, [2024-05-14T07:31:51.237796 #1268856] INFO -- : [145/885] 1310236=test_file I, [2024-05-14T07:31:51.238295 #1268856] INFO -- : [146/885] 1310235=test_force_exit I, [2024-05-14T07:31:51.252765 #1268856] INFO -- : [147/885] 1310223=test_range I, [2024-05-14T07:31:51.269881 #1268856] INFO -- : [148/885] 1310231=test_project_sanity I, [2024-05-14T07:31:51.314206 #1268856] INFO -- : [149/885] 1310231=command_line_test I, [2024-05-14T07:31:51.329679 #1268856] INFO -- : [150/885] 1310231=test_constant I, [2024-05-14T07:31:51.359508 #1268856] INFO -- : [151/885] 1310235=test_dup I, [2024-05-14T07:31:51.366532 #1268856] INFO -- : [152/885] 1310226=test_pty I, [2024-05-14T07:31:51.400438 #1268856] INFO -- : [153/885] 1310227=test_helper I, [2024-05-14T07:31:51.407557 #1268856] INFO -- : [154/885] 1310227=test_erb_command I, [2024-05-14T07:31:51.409441 #1268856] INFO -- : [155/885] 1310232=test_encoding I, [2024-05-14T07:31:51.414208 #1268856] INFO -- : [156/885] 1310220=test_gem_uri_formatter I, [2024-05-14T07:31:51.429011 #1268856] INFO -- : [157/885] 1310220=test_ensured I, [2024-05-14T07:31:51.457491 #1268856] INFO -- : [158/885] 1310227=test_locale I, [2024-05-14T07:31:51.506862 #1268856] INFO -- : [159/885] 1310220=test_addr I, [2024-05-14T07:31:51.520009 #1268856] INFO -- : [160/885] 1310220=library_symbols_test I, [2024-05-14T07:31:51.527606 #1268856] INFO -- : [161/885] 1310220=test_ts I, [2024-05-14T07:31:51.579974 #1268856] INFO -- : [162/885] 1310235=test_rdoc_ri_paths I, [2024-05-14T07:31:51.607378 #1268856] INFO -- : [163/885] 1310227=version_test I, [2024-05-14T07:31:51.631310 #1268856] INFO -- : [164/885] 1310232=test_object I, [2024-05-14T07:31:51.637509 #1268856] INFO -- : [165/885] 1310232=heredoc_dedent_test I, [2024-05-14T07:31:51.644189 #1268856] INFO -- : [166/885] 1310232=test_cgi_header I, [2024-05-14T07:31:51.666978 #1268856] INFO -- : [167/885] 1310232=test_arithmetic_sequence I, [2024-05-14T07:31:51.674679 #1268856] INFO -- : [168/885] 1310227=test_basicinstructions I, [2024-05-14T07:31:51.675572 #1268856] INFO -- : [169/885] 1310232=test_gem_gemcutter_utilities I, [2024-05-14T07:31:51.753865 #1268856] INFO -- : [170/885] 1310227=test_gem_command_manager I, [2024-05-14T07:31:51.767238 #1268856] INFO -- : [171/885] 1310235=test_key_actor_emacs I, [2024-05-14T07:31:51.842915 #1268856] INFO -- : [172/885] 1310226=test_sleep I, [2024-05-14T07:31:51.885739 #1268856] INFO -- : [173/885] 1310235=test_ruby_lex I, [2024-05-14T07:31:51.893796 #1268856] INFO -- : [174/885] 1310227=test_object I, [2024-05-14T07:31:52.003063 #1268856] INFO -- : [175/885] 1310220=test_date_arith I, [2024-05-14T07:31:52.013589 #1268856] INFO -- : [176/885] 1310232=test_gem_local_remote_options I, [2024-05-14T07:31:52.015606 #1268856] INFO -- : [177/885] 1310220=test_timeout I, [2024-05-14T07:31:52.020001 #1268856] INFO -- : [178/885] 1310223=test_ossl I, [2024-05-14T07:31:52.021300 #1268856] INFO -- : [179/885] 1310220=test_normalize I, [2024-05-14T07:31:52.022844 #1268856] INFO -- : [180/885] 1310220=test_change_word I, [2024-05-14T07:31:52.023621 #1268856] INFO -- : [181/885] 1310235=test_flip I, [2024-05-14T07:31:52.031059 #1268856] INFO -- : [182/885] 1310220=compiler_test I, [2024-05-14T07:31:52.033084 #1268856] INFO -- : [183/885] 1310220=test_signedness I, [2024-05-14T07:31:52.047335 #1268856] INFO -- : [184/885] 1310235=test_tsort I, [2024-05-14T07:31:52.051624 #1268856] INFO -- : [185/885] 1310232=test_rdoc_rd_block_parser I, [2024-05-14T07:31:52.057703 #1268856] INFO -- : [186/885] 1310235=test_pointer I, [2024-05-14T07:31:52.111526 #1268856] INFO -- : [187/885] 1310237=test_func I, [2024-05-14T07:31:52.133048 #1268856] INFO -- : [188/885] 1310222=test_big5 I, [2024-05-14T07:31:52.136197 #1268856] INFO -- : [189/885] 1310222=test_ractor I, [2024-05-14T07:31:52.179139 #1268856] INFO -- : [190/885] 1310233=test_type I, [2024-05-14T07:31:52.189281 #1268856] INFO -- : [191/885] 1310233=test_gem_platform I, [2024-05-14T07:31:52.200463 #1268856] INFO -- : [192/885] 1310222=test_placearg I, [2024-05-14T07:31:52.239476 #1268856] INFO -- : [193/885] 1310232=test_gem_package_task I, [2024-05-14T07:31:52.242694 #1268856] INFO -- : [194/885] 1310232=test_date_strptime I, [2024-05-14T07:31:52.262321 #1268856] INFO -- : [195/885] 1310227=test_rdoc_markup_hard_break I, [2024-05-14T07:31:52.308751 #1268856] INFO -- : [196/885] 1310233=test_gem_commands_push_command I, [2024-05-14T07:31:52.346542 #1268856] INFO -- : [197/885] 1310232=test_weakkeymap I, [2024-05-14T07:31:52.349527 #1268856] INFO -- : [198/885] 1310222=test_numhash I, [2024-05-14T07:31:52.361974 #1268856] INFO -- : [199/885] 1310222=test_pkey_rsa I, [2024-05-14T07:31:52.391561 #1268856] INFO -- : [200/885] 1310227=test_class_name_check I, [2024-05-14T07:31:52.411396 #1268856] INFO -- : [201/885] 1310227=test_keyword I, [2024-05-14T07:31:52.507577 #1268856] INFO -- : [202/885] 1310235=test_fd_setsize I, [2024-05-14T07:31:52.513106 #1268856] INFO -- : [203/885] 1310235=test_continuation I, [2024-05-14T07:31:52.517161 #1268856] INFO -- : [204/885] 1310235=test_win32ole_method I, [2024-05-14T07:31:52.521144 #1268856] INFO -- : [205/885] 1310235=test_delete I, [2024-05-14T07:31:52.528723 #1268856] INFO -- : [206/885] 1310235=test_logger I, [2024-05-14T07:31:52.529372 #1268856] INFO -- : [207/885] 1310232=test_file_exhaustive I, [2024-05-14T07:31:52.546843 #1268856] INFO -- : [208/885] 1310235=test_gem_update_suggestion I, [2024-05-14T07:31:52.562509 #1268856] INFO -- : [209/885] 1310239=test_files_test I, [2024-05-14T07:31:52.604672 #1268856] INFO -- : [210/885] 1310235=test_rdoc_parser_markdown I, [2024-05-14T07:31:52.637077 #1268856] INFO -- : [211/885] 1310239=test_not I, [2024-05-14T07:31:52.637658 #1268856] INFO -- : [212/885] 1310239=test_gem_resolver_lock_set I, [2024-05-14T07:31:52.644794 #1268856] INFO -- : [213/885] 1310235=test_import I, [2024-05-14T07:31:52.673256 #1268856] INFO -- : [214/885] 1310222=test_compile_prism I, [2024-05-14T07:31:52.843631 #1268856] INFO -- : [215/885] 1310233=test_terminfo I, [2024-05-14T07:31:52.865623 #1268856] INFO -- : [216/885] 1310239=test_date_compat I, [2024-05-14T07:31:52.867827 #1268856] INFO -- : [217/885] 1310239=test_rdoc_markup_to_html I, [2024-05-14T07:31:52.900090 #1268856] INFO -- : [218/885] 1310233=test_bug-14834 I, [2024-05-14T07:31:52.911323 #1268856] INFO -- : [219/885] 1310227=test_addrinfo I, [2024-05-14T07:31:52.936089 #1268856] INFO -- : [220/885] 1310227=test_http I, [2024-05-14T07:31:52.983304 #1268856] INFO -- : [221/885] 1310228=test_tree_spell_checker I, [2024-05-14T07:31:52.989872 #1268856] INFO -- : [222/885] 1310233=test_path I, [2024-05-14T07:31:52.995507 #1268856] INFO -- : [223/885] 1310222=test_case_mapping I, [2024-05-14T07:31:52.998973 #1268856] INFO -- : [224/885] 1310233=redundant_return_test I, [2024-05-14T07:31:53.005708 #1268856] INFO -- : [225/885] 1310222=test_bn I, [2024-05-14T07:31:53.014049 #1268856] INFO -- : [226/885] 1310228=test_win32ole_param_event I, [2024-05-14T07:31:53.020614 #1268856] INFO -- : [227/885] 1310228=test_koi8 I, [2024-05-14T07:31:53.022898 #1268856] INFO -- : [228/885] 1310222=parameters_signature_test I, [2024-05-14T07:31:53.025359 #1268856] INFO -- : [229/885] 1310228=test_rdoc_parser_changelog I, [2024-05-14T07:31:53.092487 #1268856] INFO -- : [230/885] 1310222=test_enumerator I, [2024-05-14T07:31:53.097579 #1268856] INFO -- : [231/885] 1310222=test_unicode I, [2024-05-14T07:31:53.117074 #1268856] INFO -- : [232/885] 1310233=test_rdoc_generator_pot I, [2024-05-14T07:31:53.143031 #1268856] INFO -- : [233/885] 1310239=test_gem_gem_runner I, [2024-05-14T07:31:53.175819 #1268856] INFO -- : [234/885] 1310222=test_filter I, [2024-05-14T07:31:53.200298 #1268856] INFO -- : [235/885] 1310239=static_literals_test I, [2024-05-14T07:31:53.212198 #1268856] INFO -- : [236/885] 1310222=test_data I, [2024-05-14T07:31:53.215997 #1268856] INFO -- : [237/885] 1310222=test_rdoc_method_attr I, [2024-05-14T07:31:53.249728 #1268856] INFO -- : [238/885] 1310228=test_key_event_record I, [2024-05-14T07:31:53.261741 #1268856] INFO -- : [239/885] 1310221=test_gem_uri I, [2024-05-14T07:31:53.286904 #1268856] INFO -- : [240/885] 1310221=test_random I, [2024-05-14T07:31:53.288854 #1268856] INFO -- : [241/885] 1310235=test_notimplement I, [2024-05-14T07:31:53.290700 #1268856] INFO -- : [242/885] 1310233=test_gem_commands_update_command I, [2024-05-14T07:31:53.291992 #1268856] INFO -- : [243/885] 1310221=test_gem_resolver_vendor_specification I, [2024-05-14T07:31:53.292768 #1268856] INFO -- : [244/885] 1310239=test_lexer I, [2024-05-14T07:31:53.295628 #1268856] INFO -- : [245/885] 1310235=test_thread_cv I, [2024-05-14T07:31:53.297813 #1268856] INFO -- : [246/885] 1310228=test_ssl_session I, [2024-05-14T07:31:53.308057 #1268856] INFO -- : [247/885] 1310239=test_rbconfig I, [2024-05-14T07:31:53.314515 #1268856] INFO -- : [248/885] 1310221=test_human_typo I, [2024-05-14T07:31:53.317608 #1268856] INFO -- : [249/885] 1310239=test_primitive I, [2024-05-14T07:31:53.322040 #1268856] INFO -- : [250/885] 1310221=test_name_error_extension I, [2024-05-14T07:31:53.326869 #1268856] INFO -- : [251/885] 1310239=test_chilled I, [2024-05-14T07:31:53.327394 #1268856] INFO -- : [252/885] 1310221=test_rdoc_i18n_locale I, [2024-05-14T07:31:53.329157 #1268856] INFO -- : [253/885] 1310222=test_win32ole_param I, [2024-05-14T07:31:53.330219 #1268856] INFO -- : [254/885] 1310222=test_gem_commands_yank_command I, [2024-05-14T07:31:53.334623 #1268856] INFO -- : [255/885] 1310239=test_pair I, [2024-05-14T07:31:53.364933 #1268856] INFO -- : [256/885] 1310230=test_document I, [2024-05-14T07:31:53.385792 #1268856] INFO -- : [257/885] 1310230=test_rdoc_generator_pot_po_entry I, [2024-05-14T07:31:53.452441 #1268856] INFO -- : [258/885] 1310224=test_euc_jp I, [2024-05-14T07:31:53.458948 #1268856] INFO -- : [259/885] 1310224=test_acceptable I, [2024-05-14T07:31:53.470756 #1268856] INFO -- : [260/885] 1310221=test_install I, [2024-05-14T07:31:53.520568 #1268856] INFO -- : [261/885] 1310230=test_rdoc_markup_to_label I, [2024-05-14T07:31:53.560301 #1268856] INFO -- : [262/885] 1310224=test_sockopt I, [2024-05-14T07:31:53.568925 #1268856] INFO -- : [263/885] 1310224=test_httpresponses I, [2024-05-14T07:31:53.587450 #1268856] INFO -- : [264/885] 1310230=test_encoding I, [2024-05-14T07:31:53.602911 #1268856] INFO -- : [265/885] 1310230=test_set_len I, [2024-05-14T07:31:53.605897 #1268856] INFO -- : [266/885] 1310224=test_httpheader I, [2024-05-14T07:31:53.607208 #1268856] INFO -- : [267/885] 1310230=test_gem_resolver_local_specification I, [2024-05-14T07:31:53.614259 #1268856] INFO -- : [268/885] 1310224=test_rdoc_ri_driver I, [2024-05-14T07:31:53.629543 #1268856] INFO -- : [269/885] 1310221=test_color I, [2024-05-14T07:31:53.637608 #1268856] INFO -- : [270/885] 1310230=json_encoding_test I, [2024-05-14T07:31:53.655464 #1268856] INFO -- : [271/885] 1310230=test_key_stroke I, [2024-05-14T07:31:53.710100 #1268856] INFO -- : [272/885] 1310230=test_help I, [2024-05-14T07:31:53.717106 #1268856] INFO -- : [273/885] 1310230=test_rdoc_markup_to_bs I, [2024-05-14T07:31:53.723674 #1268856] INFO -- : [274/885] 1310237=test_gem_commands_unpack_command I, [2024-05-14T07:31:53.734324 #1268856] INFO -- : [275/885] 1310230=test_files_lib I, [2024-05-14T07:31:53.744806 #1268856] INFO -- : [276/885] 1310231=test_beginendblock I, [2024-05-14T07:31:53.777741 #1268856] INFO -- : [277/885] 1310221=reflection_test I, [2024-05-14T07:31:53.820770 #1268856] INFO -- : [278/885] 1310224=test_gem_bundler_version_finder I, [2024-05-14T07:31:53.836199 #1268856] INFO -- : [279/885] 1310221=test_emoji_breaks I, [2024-05-14T07:31:53.839767 #1268856] INFO -- : [280/885] 1310221=test_within_pipe I, [2024-05-14T07:31:53.872181 #1268856] INFO -- : [281/885] 1310221=test_pinned I, [2024-05-14T07:31:53.913145 #1268856] INFO -- : [282/885] 1310221=test_time I, [2024-05-14T07:31:53.928220 #1268856] INFO -- : [283/885] 1310235=test_webauthn_listener_response I, [2024-05-14T07:31:53.930809 #1268856] INFO -- : [284/885] 1310222=test_to_ary_concat I, [2024-05-14T07:31:53.942907 #1268856] INFO -- : [285/885] 1310235=test_stream I, [2024-05-14T07:31:53.944091 #1268856] INFO -- : [286/885] 1310224=test_printf I, [2024-05-14T07:31:53.966740 #1268856] INFO -- : [287/885] 1310224=test_rdoc_markup_pre_process I, [2024-05-14T07:31:53.973350 #1268856] INFO -- : [288/885] 1310235=test_exit I, [2024-05-14T07:31:54.028919 #1268856] INFO -- : [289/885] 1310224=test_recursion I, [2024-05-14T07:31:54.029542 #1268856] INFO -- : [290/885] 1310224=test_history I, [2024-05-14T07:31:54.044520 #1268856] INFO -- : [291/885] 1310224=test_date_marshal I, [2024-05-14T07:31:54.044956 #1268856] INFO -- : [292/885] 1310237=test_mkmf I, [2024-05-14T07:31:54.050624 #1268856] INFO -- : [293/885] 1310224=test_delegate I, [2024-05-14T07:31:54.059756 #1268856] INFO -- : [294/885] 1310221=test_popen_deadlock I, [2024-05-14T07:31:54.066248 #1268856] INFO -- : [295/885] 1310235=test_bundled_ca I, [2024-05-14T07:31:54.067069 #1268856] INFO -- : [296/885] 1310224=test_closure I, [2024-05-14T07:31:54.082502 #1268856] INFO -- : [297/885] 1310237=test_fiber I, [2024-05-14T07:31:54.110552 #1268856] INFO -- : [298/885] 1310231=test_multi_irb_commands I, [2024-05-14T07:31:54.119757 #1268856] INFO -- : [299/885] 1310231=test_open3 I, [2024-05-14T07:31:54.226439 #1268856] INFO -- : [300/885] 1310228=test_ractor I, [2024-05-14T07:31:54.304517 #1268856] INFO -- : [301/885] 1310228=test_rdoc_servlet I, [2024-05-14T07:31:54.371901 #1268856] INFO -- : [302/885] 1310224=test_gem_security I, [2024-05-14T07:31:54.479020 #1268856] INFO -- : [303/885] 1310228=test_digest I, [2024-05-14T07:31:54.485588 #1268856] INFO -- : [304/885] 1310228=test_interned_str I, [2024-05-14T07:31:54.491145 #1268856] INFO -- : [305/885] 1310228=test_case_comprehensive I, [2024-05-14T07:31:54.522735 #1268856] INFO -- : [306/885] 1310220=test_gem_commands_build_command I, [2024-05-14T07:31:54.542617 #1268856] INFO -- : [307/885] 1310233=test_cmethod I, [2024-05-14T07:31:54.552159 #1268856] INFO -- : [308/885] 1310233=test_tracer I, [2024-05-14T07:31:54.601899 #1268856] INFO -- : [309/885] 1310233=test_append I, [2024-05-14T07:31:54.603297 #1268856] INFO -- : [310/885] 1310233=test_option I, [2024-05-14T07:31:54.651849 #1268856] INFO -- : [311/885] 1310221=test_gem_commands_server_command I, [2024-05-14T07:31:54.655946 #1268856] INFO -- : [312/885] 1310221=test_variable_name_check I, [2024-05-14T07:31:54.697441 #1268856] INFO -- : [313/885] 1310221=test_io_m17n I, [2024-05-14T07:31:54.728445 #1268856] INFO -- : [314/885] 1310233=test_did_you_mean I, [2024-05-14T07:31:54.784470 #1268856] INFO -- : [315/885] 1310222=test_rdoc_markup_heading I, [2024-05-14T07:31:54.787712 #1268856] INFO -- : [316/885] 1310222=test_iseq I, [2024-05-14T07:31:54.833742 #1268856] INFO -- : [317/885] 1310220=test_exception_at_throwing I, [2024-05-14T07:31:54.837829 #1268856] INFO -- : [318/885] 1310233=test_scheduler I, [2024-05-14T07:31:54.915794 #1268856] INFO -- : [319/885] 1310220=test_pkey_dsa I, [2024-05-14T07:31:54.987385 #1268856] INFO -- : [320/885] 1310233=test_class I, [2024-05-14T07:31:55.003568 #1268856] INFO -- : [321/885] 1310233=test_ocsp I, [2024-05-14T07:31:55.289787 #1268856] INFO -- : [322/885] 1310233=memsize_test I, [2024-05-14T07:31:55.291543 #1268856] INFO -- : [323/885] 1310233=test_nomethod_error I, [2024-05-14T07:31:55.297096 #1268856] INFO -- : [324/885] 1310233=json_parser_test I, [2024-05-14T07:31:55.333673 #1268856] INFO -- : [325/885] 1310233=test_config I, [2024-05-14T07:31:55.373078 #1268856] INFO -- : [326/885] 1310233=test_win32ole_variant_outarg I, [2024-05-14T07:31:55.374435 #1268856] INFO -- : [327/885] 1310233=test_dln I, [2024-05-14T07:31:55.377022 #1268856] INFO -- : [328/885] 1310233=test_gem_source_subpath_problem I, [2024-05-14T07:31:55.387522 #1268856] INFO -- : [329/885] 1310222=json_common_interface_test I, [2024-05-14T07:31:55.397068 #1268856] INFO -- : [330/885] 1310222=test_struct I, [2024-05-14T07:31:55.414586 #1268856] INFO -- : [331/885] 1310222=magic_comment_test I, [2024-05-14T07:31:55.428243 #1268856] INFO -- : [332/885] 1310222=test_rdoc_markup_to_html_snippet I, [2024-05-14T07:31:55.461812 #1268856] INFO -- : [333/885] 1310233=test_sexp I, [2024-05-14T07:31:55.472193 #1268856] INFO -- : [334/885] 1310233=test_rdoc_markup_include I, [2024-05-14T07:31:55.473904 #1268856] INFO -- : [335/885] 1310233=fuzzer_test I, [2024-05-14T07:31:55.490188 #1268856] INFO -- : [336/885] 1310233=test_variable I, [2024-05-14T07:31:55.508589 #1268856] INFO -- : [337/885] 1310222=test_pkg_config I, [2024-05-14T07:31:55.516547 #1268856] INFO -- : [338/885] 1310222=test_cparser I, [2024-05-14T07:31:55.576020 #1268856] INFO -- : [339/885] 1310233=test_serialize_subclasses I, [2024-05-14T07:31:55.579810 #1268856] INFO -- : [340/885] 1310233=test_insns_leaf I, [2024-05-14T07:31:55.580492 #1268856] INFO -- : [341/885] 1310233=test_color_printer I, [2024-05-14T07:31:55.586831 #1268856] INFO -- : [342/885] 1310233=test_deprecated I, [2024-05-14T07:31:55.590029 #1268856] INFO -- : [343/885] 1310233=test_div I, [2024-05-14T07:31:55.594962 #1268856] INFO -- : [344/885] 1310233=test_allocation I, [2024-05-14T07:31:55.681908 #1268856] INFO -- : [345/885] 1310235=test_engine I, [2024-05-14T07:31:55.686489 #1268856] INFO -- : [346/885] 1310235=test_win32ole_variant_m I, [2024-05-14T07:31:55.688762 #1268856] INFO -- : [347/885] 1310235=test_key_error I, [2024-05-14T07:31:55.696869 #1268856] INFO -- : [348/885] 1310235=test_mutex I, [2024-05-14T07:31:55.929102 #1268856] INFO -- : [349/885] 1310221=test_x509req I, [2024-05-14T07:31:56.100310 #1268856] INFO -- : [350/885] 1310221=test_rdoc_rd_inline I, [2024-05-14T07:31:56.119981 #1268856] INFO -- : [351/885] 1310221=test_files_test_1 I, [2024-05-14T07:31:56.170027 #1268856] INFO -- : [352/885] 1310230=test_set I, [2024-05-14T07:31:56.172863 #1268856] INFO -- : [353/885] 1310231=test_gem_path_support I, [2024-05-14T07:31:56.194678 #1268856] INFO -- : [354/885] 1310230=test_struct I, [2024-05-14T07:31:56.210897 #1268856] INFO -- : [355/885] 1310231=test_gem_commands_signout_command I, [2024-05-14T07:31:56.224341 #1268856] INFO -- : [356/885] 1310231=test_refinement I, [2024-05-14T07:31:56.298193 #1268856] INFO -- : [357/885] 1310222=test_regex_casefold I, [2024-05-14T07:31:56.727014 #1268856] INFO -- : [358/885] 1310239=test_gem_source_git I, [2024-05-14T07:31:56.798264 #1268856] INFO -- : [359/885] 1310222=test_dir_m17n I, [2024-05-14T07:31:56.821897 #1268856] INFO -- : [360/885] 1310220=test_gem_resolver_installer_set I, [2024-05-14T07:31:56.842944 #1268856] INFO -- : [361/885] 1310235=test_float I, [2024-05-14T07:31:56.846213 #1268856] INFO -- : [362/885] 1310226=test_cgi_cookie I, [2024-05-14T07:31:56.855346 #1268856] INFO -- : [363/885] 1310230=test_require I, [2024-05-14T07:31:56.861687 #1268856] INFO -- : [364/885] 1310226=test_process I, [2024-05-14T07:31:56.881108 #1268856] INFO -- : [365/885] 1310226=test_input_method I, [2024-05-14T07:31:56.985838 #1268856] INFO -- : [366/885] 1310226=test_windows_1252 I, [2024-05-14T07:31:56.990602 #1268856] INFO -- : [367/885] 1310226=test_rdoc_rd I, [2024-05-14T07:31:56.992645 #1268856] INFO -- : [368/885] 1310226=test_cgi_session I, [2024-05-14T07:31:57.007888 #1268856] INFO -- : [369/885] 1310226=test_metaclass I, [2024-05-14T07:31:57.010968 #1268856] INFO -- : [370/885] 1310226=test_rdoc_top_level I, [2024-05-14T07:31:57.035308 #1268856] INFO -- : [371/885] 1310220=test_fixnum I, [2024-05-14T07:31:57.051992 #1268856] INFO -- : [372/885] 1310220=test_signal I, [2024-05-14T07:31:57.213353 #1268856] INFO -- : [373/885] 1310239=test_x509crl I, [2024-05-14T07:31:57.320752 #1268856] INFO -- : [374/885] 1310236=test_debug I, [2024-05-14T07:31:57.321696 #1268856] INFO -- : [375/885] 1310236=test_memory_view I, [2024-05-14T07:31:57.323601 #1268856] INFO -- : [376/885] 1310226=pattern_test I, [2024-05-14T07:31:57.346722 #1268856] INFO -- : [377/885] 1310236=test_shellwords I, [2024-05-14T07:31:57.349567 #1268856] INFO -- : [378/885] 1310226=test_digest_extend I, [2024-05-14T07:31:57.354021 #1268856] INFO -- : [379/885] 1310236=test_iterator I, [2024-05-14T07:31:57.360954 #1268856] INFO -- : [380/885] 1310226=test_string I, [2024-05-14T07:31:57.365764 #1268856] INFO -- : [381/885] 1310226=test_omap I, [2024-05-14T07:31:57.382539 #1268856] INFO -- : [382/885] 1310226=test_storage I, [2024-05-14T07:31:57.385604 #1268856] INFO -- : [383/885] 1310226=test_gem_resolver_git_set I, [2024-05-14T07:31:57.391086 #1268856] INFO -- : [384/885] 1310239=test_new I, [2024-05-14T07:31:57.394216 #1268856] INFO -- : [385/885] 1310239=test_cipher I, [2024-05-14T07:31:57.441794 #1268856] INFO -- : [386/885] 1310239=test_gem_security_signer I, [2024-05-14T07:31:57.443265 #1268856] INFO -- : [387/885] 1310236=test_gem_source I, [2024-05-14T07:31:57.511559 #1268856] INFO -- : [388/885] 1310239=test_scalar_scanner I, [2024-05-14T07:31:57.524818 #1268856] INFO -- : [389/885] 1310239=test_gem_commands_outdated_command I, [2024-05-14T07:31:57.584854 #1268856] INFO -- : [390/885] 1310239=test_helper_method I, [2024-05-14T07:31:57.654200 #1268856] INFO -- : [391/885] 1310236=test_gem_package_tar_writer I, [2024-05-14T07:31:57.688940 #1268856] INFO -- : [392/885] 1310226=test_array I, [2024-05-14T07:31:57.710572 #1268856] INFO -- : [393/885] 1310236=test_gem_dependency_list I, [2024-05-14T07:31:57.729700 #1268856] INFO -- : [394/885] 1310239=test_benchmark I, [2024-05-14T07:31:57.777545 #1268856] INFO -- : [395/885] 1310236=test_win32ole_method_event I, [2024-05-14T07:31:57.783624 #1268856] INFO -- : [396/885] 1310236=test_nesting_parser I, [2024-05-14T07:31:57.907264 #1268856] INFO -- : [397/885] 1310236=test_https I, [2024-05-14T07:31:58.181101 #1268856] INFO -- : [398/885] 1310235=test_gem_ext_builder I, [2024-05-14T07:31:58.225872 #1268856] INFO -- : [399/885] 1310222=test_evaluation I, [2024-05-14T07:31:58.231883 #1268856] INFO -- : [400/885] 1310222=test_abi I, [2024-05-14T07:31:58.262319 #1268856] INFO -- : [401/885] 1310236=test_provider I, [2024-05-14T07:31:58.267665 #1268856] INFO -- : [402/885] 1310232=test_rdoc_parser_simple I, [2024-05-14T07:31:58.314212 #1268856] INFO -- : [403/885] 1310232=test_yamldbm I, [2024-05-14T07:31:58.322016 #1268856] INFO -- : [404/885] 1310232=test_gem_commands_rebuild_command I, [2024-05-14T07:31:58.361270 #1268856] INFO -- : [405/885] 1310232=test_load I, [2024-05-14T07:31:58.370445 #1268856] INFO -- : [406/885] 1310232=test_len I, [2024-05-14T07:31:58.374405 #1268856] INFO -- : [407/885] 1310232=test_yield_block I, [2024-05-14T07:31:58.375357 #1268856] INFO -- : [408/885] 1310232=test_completion I, [2024-05-14T07:31:58.385360 #1268856] INFO -- : [409/885] 1310223=test_gem_commands_cert_command I, [2024-05-14T07:31:58.398465 #1268856] INFO -- : [410/885] 1310222=test_erb I, [2024-05-14T07:31:58.452101 #1268856] INFO -- : [411/885] 1310222=test_x509ext I, [2024-05-14T07:31:58.458631 #1268856] INFO -- : [412/885] 1310222=test_gem_source_installed I, [2024-05-14T07:31:58.483852 #1268856] INFO -- : [413/885] 1310222=test_assembler I, [2024-05-14T07:31:58.484969 #1268856] INFO -- : [414/885] 1310222=test_propertyputref I, [2024-05-14T07:31:58.487229 #1268856] INFO -- : [415/885] 1310233=attribute_write_test I, [2024-05-14T07:31:58.488142 #1268856] INFO -- : [416/885] 1310222=test_spell_checker I, [2024-05-14T07:31:58.489459 #1268856] INFO -- : [417/885] 1310233=test_rational I, [2024-05-14T07:31:58.501052 #1268856] INFO -- : [418/885] 1310222=test_rational2 I, [2024-05-14T07:31:58.508464 #1268856] INFO -- : [419/885] 1310233=test_module I, [2024-05-14T07:31:58.513619 #1268856] INFO -- : [420/885] 1310222=test_gem_request_set I, [2024-05-14T07:31:58.620600 #1268856] INFO -- : [421/885] 1310236=constant_path_node_test I, [2024-05-14T07:31:58.696914 #1268856] INFO -- : [422/885] 1310236=test_ssl I, [2024-05-14T07:31:58.796609 #1268856] INFO -- : [423/885] 1310234=test_gem_ext_cargo_builder I, [2024-05-14T07:31:58.822585 #1268856] INFO -- : [424/885] 1310234=test_method_name_check I, [2024-05-14T07:31:58.847041 #1268856] INFO -- : [425/885] 1310234=test_arith_seq_extract I, [2024-05-14T07:31:58.892535 #1268856] INFO -- : [426/885] 1310222=test_parser I, [2024-05-14T07:31:58.920608 #1268856] INFO -- : [427/885] 1310222=test_whileuntil I, [2024-05-14T07:31:58.922996 #1268856] INFO -- : [428/885] 1310222=test_rdoc_generator_markup I, [2024-05-14T07:31:58.926503 #1268856] INFO -- : [429/885] 1310222=test_configuration I, [2024-05-14T07:31:58.991411 #1268856] INFO -- : [430/885] 1310232=test_rubyvm I, [2024-05-14T07:31:58.993012 #1268856] INFO -- : [431/885] 1310232=test_monitor I, [2024-05-14T07:31:58.997074 #1268856] INFO -- : [432/885] 1310222=test_buffered_io I, [2024-05-14T07:31:59.009211 #1268856] INFO -- : [433/885] 1310234=test_instrumentation_api I, [2024-05-14T07:31:59.019285 #1268856] INFO -- : [434/885] 1310229=integer_parse_test I, [2024-05-14T07:31:59.023291 #1268856] INFO -- : [435/885] 1310222=test_stringify_symbols I, [2024-05-14T07:31:59.024242 #1268856] INFO -- : [436/885] 1310239=test_boolean I, [2024-05-14T07:31:59.028900 #1268856] INFO -- : [437/885] 1310239=test_rdoc_include I, [2024-05-14T07:31:59.030840 #1268856] INFO -- : [438/885] 1310222=test_reqarg I, [2024-05-14T07:31:59.060251 #1268856] INFO -- : [439/885] 1310239=test_gem_commands_list_command I, [2024-05-14T07:31:59.070993 #1268856] INFO -- : [440/885] 1310239=test_stack I, [2024-05-14T07:31:59.081409 #1268856] INFO -- : [441/885] 1310229=test_too_many_dummy_encodings I, [2024-05-14T07:31:59.094101 #1268856] INFO -- : [442/885] 1310221=test_cesu8 I, [2024-05-14T07:31:59.097767 #1268856] INFO -- : [443/885] 1310221=test_econv I, [2024-05-14T07:31:59.137167 #1268856] INFO -- : [444/885] 1310229=test_rdoc_options I, [2024-05-14T07:31:59.137639 #1268856] INFO -- : [445/885] 1310220=test_gem_version I, [2024-05-14T07:31:59.166531 #1268856] INFO -- : [446/885] 1310235=test_ldap I, [2024-05-14T07:31:59.193112 #1268856] INFO -- : [447/885] 1310220=test_gem_commands_signin_command I, [2024-05-14T07:31:59.197597 #1268856] INFO -- : [448/885] 1310235=test_resource I, [2024-05-14T07:31:59.204981 #1268856] INFO -- : [449/885] 1310235=test_emitter I, [2024-05-14T07:31:59.205371 #1268856] INFO -- : [450/885] 1310232=test_string_processing I, [2024-05-14T07:31:59.209790 #1268856] INFO -- : [451/885] 1310235=test_fileutils I, [2024-05-14T07:31:59.220617 #1268856] INFO -- : [452/885] 1310232=test_complex I, [2024-05-14T07:31:59.272396 #1268856] INFO -- : [453/885] 1310220=test_gem_commands_search_command I, [2024-05-14T07:31:59.284036 #1268856] INFO -- : [454/885] 1310220=test_frozen_error I, [2024-05-14T07:31:59.298241 #1268856] INFO -- : [455/885] 1310230=test_method_cache I, [2024-05-14T07:31:59.304341 #1268856] INFO -- : [456/885] 1310220=test_gem_stub_specification I, [2024-05-14T07:31:59.305646 #1268856] INFO -- : [457/885] 1310230=test_gem_ext_ext_conf_builder I, [2024-05-14T07:31:59.346361 #1268856] INFO -- : [458/885] 1310222=test_path_to_class I, [2024-05-14T07:31:59.348095 #1268856] INFO -- : [459/885] 1310222=test_gem_dependency I, [2024-05-14T07:31:59.360035 #1268856] INFO -- : [460/885] 1310232=test_gem_resolver_specification I, [2024-05-14T07:31:59.394938 #1268856] INFO -- : [461/885] 1310232=test_rdoc_markup_verbatim I, [2024-05-14T07:31:59.397751 #1268856] INFO -- : [462/885] 1310232=test_inlinecache I, [2024-05-14T07:31:59.464933 #1268856] INFO -- : [463/885] 1310232=test_gem_remote_fetcher I, [2024-05-14T07:31:59.470764 #1268856] INFO -- : [464/885] 1310229=test_parse I, [2024-05-14T07:31:59.478069 #1268856] INFO -- : [465/885] 1310222=test_mdns I, [2024-05-14T07:31:59.478132 #1268856] INFO -- : [466/885] 1310220=test_gem_resolver_installed_specification I, [2024-05-14T07:31:59.483808 #1268856] INFO -- : [467/885] 1310222=test_scanner_events I, [2024-05-14T07:31:59.498403 #1268856] INFO -- : [468/885] 1310220=test_date_strftime I, [2024-05-14T07:31:59.512206 #1268856] INFO -- : [469/885] 1310222=test_rdoc_parser_rd I, [2024-05-14T07:31:59.515579 #1268856] INFO -- : [470/885] 1310231=test_gem_installer I, [2024-05-14T07:31:59.535475 #1268856] INFO -- : [471/885] 1310222=test_yamlstore I, [2024-05-14T07:31:59.548803 #1268856] INFO -- : [472/885] 1310222=test_asn1 I, [2024-05-14T07:31:59.574412 #1268856] INFO -- : [473/885] 1310222=test_random I, [2024-05-14T07:31:59.578305 #1268856] INFO -- : [474/885] 1310222=test_load I, [2024-05-14T07:31:59.588637 #1268856] INFO -- : [475/885] 1310222=json_string_matching_test I, [2024-05-14T07:31:59.592767 #1268856] INFO -- : [476/885] 1310222=test_const I, [2024-05-14T07:31:59.599436 #1268856] INFO -- : [477/885] 1310235=test_rdoc_normal_class I, [2024-05-14T07:31:59.600254 #1268856] INFO -- : [478/885] 1310222=test_class I, [2024-05-14T07:31:59.663905 #1268856] INFO -- : [479/885] 1310235=test_irb I, [2024-05-14T07:31:59.677419 #1268856] INFO -- : [480/885] 1310224=test_queue I, [2024-05-14T07:31:59.685302 #1268856] INFO -- : [481/885] 1310238=test_function I, [2024-05-14T07:31:59.687042 #1268856] INFO -- : [482/885] 1310224=test_noarg I, [2024-05-14T07:31:59.790951 #1268856] INFO -- : [483/885] 1310224=parse_comments_test I, [2024-05-14T07:31:59.795181 #1268856] INFO -- : [484/885] 1310224=test_tempfile I, [2024-05-14T07:31:59.822392 #1268856] INFO -- : [485/885] 1310223=test_prettyprint I, [2024-05-14T07:31:59.838933 #1268856] INFO -- : [486/885] 1310223=test_tracepoint I, [2024-05-14T07:31:59.885036 #1268856] INFO -- : [487/885] 1310235=test_gem_commands_help_command I, [2024-05-14T07:31:59.907542 #1268856] INFO -- : [488/885] 1310238=test_rdoc_markup I, [2024-05-14T07:31:59.935814 #1268856] INFO -- : [489/885] 1310239=test_duplicate I, [2024-05-14T07:31:59.937796 #1268856] INFO -- : [490/885] 1310237=test_basicsocket I, [2024-05-14T07:31:59.940148 #1268856] INFO -- : [491/885] 1310239=test_utf32 I, [2024-05-14T07:31:59.943792 #1268856] INFO -- : [492/885] 1310237=test_gem_resolver_index_specification I, [2024-05-14T07:31:59.949050 #1268856] INFO -- : [493/885] 1310239=test_internal_ivar I, [2024-05-14T07:31:59.953249 #1268856] INFO -- : [494/885] 1310239=test_digest I, [2024-05-14T07:31:59.957037 #1268856] INFO -- : [495/885] 1310235=test_marshalable I, [2024-05-14T07:31:59.961394 #1268856] INFO -- : [496/885] 1310235=test_require I, [2024-05-14T07:31:59.989089 #1268856] INFO -- : [497/885] 1310237=test_cgi_util I, [2024-05-14T07:32:00.033503 #1268856] INFO -- : [498/885] 1310229=test_gem_commands_contents_command I, [2024-05-14T07:32:00.062909 #1268856] INFO -- : [499/885] 1310238=test_gem_ext_cmake_builder I, [2024-05-14T07:32:00.093224 #1268856] INFO -- : [500/885] 1310238=test_wss I, [2024-05-14T07:32:00.100548 #1268856] INFO -- : [501/885] 1310238=test_fiddle I, [2024-05-14T07:32:00.101849 #1268856] INFO -- : [502/885] 1310223=test_find I, [2024-05-14T07:32:00.102995 #1268856] INFO -- : [503/885] 1310224=test_ractor I, [2024-05-14T07:32:00.114551 #1268856] INFO -- : [504/885] 1310223=test_pathname I, [2024-05-14T07:32:00.133762 #1268856] INFO -- : [505/885] 1310220=test_complexrational I, [2024-05-14T07:32:00.142449 #1268856] INFO -- : [506/885] 1310220=test_init I, [2024-05-14T07:32:00.146268 #1268856] INFO -- : [507/885] 1310221=test_gem_package_tar_reader I, [2024-05-14T07:32:00.165567 #1268856] INFO -- : [508/885] 1310237=regexp_test I, [2024-05-14T07:32:00.167904 #1268856] INFO -- : [509/885] 1310238=test_rdoc_encoding I, [2024-05-14T07:32:00.174041 #1268856] INFO -- : [510/885] 1310237=test_coverage I, [2024-05-14T07:32:00.185790 #1268856] INFO -- : [511/885] 1310224=test_file I, [2024-05-14T07:32:00.189828 #1268856] INFO -- : [512/885] 1310224=test_modify_expand I, [2024-05-14T07:32:00.191461 #1268856] INFO -- : [513/885] 1310238=test_rdoc_any_method I, [2024-05-14T07:32:00.193382 #1268856] INFO -- : [514/885] 1310221=test_gem_available_set I, [2024-05-14T07:32:00.193675 #1268856] INFO -- : [515/885] 1310224=test_rdoc_markdown I, [2024-05-14T07:32:00.304399 #1268856] INFO -- : [516/885] 1310221=test_bash_completion I, [2024-05-14T07:32:00.314172 #1268856] INFO -- : [517/885] 1310221=test_formatter I, [2024-05-14T07:32:00.320994 #1268856] INFO -- : [518/885] 1310221=test_rdoc_constant I, [2024-05-14T07:32:00.343803 #1268856] INFO -- : [519/885] 1310223=test_deprecate I, [2024-05-14T07:32:00.364704 #1268856] INFO -- : [520/885] 1310229=test_recorder I, [2024-05-14T07:32:00.370215 #1268856] INFO -- : [521/885] 1310229=test_gem_commands_owner_command I, [2024-05-14T07:32:00.371759 #1268856] INFO -- : [522/885] 1310223=test_gem_source_vendor I, [2024-05-14T07:32:00.380728 #1268856] INFO -- : [523/885] 1310223=test_big2str I, [2024-05-14T07:32:00.383856 #1268856] INFO -- : [524/885] 1310223=test_handle I, [2024-05-14T07:32:00.465117 #1268856] INFO -- : [525/885] 1310224=test_wait I, [2024-05-14T07:32:00.481986 #1268856] INFO -- : [526/885] 1310238=test_forwardable I, [2024-05-14T07:32:00.484558 #1268856] INFO -- : [527/885] 1310221=test_yaml I, [2024-05-14T07:32:00.500217 #1268856] INFO -- : [528/885] 1310238=test_rdoc_markup_formatter I, [2024-05-14T07:32:00.513701 #1268856] INFO -- : [529/885] 1310238=test_thread_queue I, [2024-05-14T07:32:00.528607 #1268856] INFO -- : [530/885] 1310223=test_nowrite I, [2024-05-14T07:32:00.529454 #1268856] INFO -- : [531/885] 1310224=test_gem_commands_sources_command I, [2024-05-14T07:32:00.541685 #1268856] INFO -- : [532/885] 1310223=test_ansi_without_terminfo I, [2024-05-14T07:32:00.548513 #1268856] INFO -- : [533/885] 1310223=test_ractor I, [2024-05-14T07:32:00.559343 #1268856] INFO -- : [534/885] 1310223=test_euc_tw I, [2024-05-14T07:32:00.561981 #1268856] INFO -- : [535/885] 1310223=test_bmethod I, [2024-05-14T07:32:00.566824 #1268856] INFO -- : [536/885] 1310223=json_fixtures_test I, [2024-05-14T07:32:00.579520 #1268856] INFO -- : [537/885] 1310220=test_shapes I, [2024-05-14T07:32:00.581194 #1268856] INFO -- : [538/885] 1310223=test_io_timeout I, [2024-05-14T07:32:00.584809 #1268856] INFO -- : [539/885] 1310220=test_rdoc_parser_c I, [2024-05-14T07:32:00.586227 #1268856] INFO -- : [540/885] 1310223=test_comparable I, [2024-05-14T07:32:00.591993 #1268856] INFO -- : [541/885] 1310223=test_enc_str_buf_cat I, [2024-05-14T07:32:00.595791 #1268856] INFO -- : [542/885] 1310221=test_class2name I, [2024-05-14T07:32:00.599287 #1268856] INFO -- : [543/885] 1310223=test_gbk I, [2024-05-14T07:32:00.600838 #1268856] INFO -- : [544/885] 1310221=test_profile_frames I, [2024-05-14T07:32:00.602564 #1268856] INFO -- : [545/885] 1310223=test_cstr I, [2024-05-14T07:32:00.621902 #1268856] INFO -- : [546/885] 1310233=test_pstore I, [2024-05-14T07:32:00.635624 #1268856] INFO -- : [547/885] 1310230=test_rdoc_markup_indented_paragraph I, [2024-05-14T07:32:00.649146 #1268856] INFO -- : [548/885] 1310230=test_io_buffer I, [2024-05-14T07:32:00.669544 #1268856] INFO -- : [549/885] 1310233=test_pack I, [2024-05-14T07:32:00.676441 #1268856] INFO -- : [550/885] 1310224=test_backtrace I, [2024-05-14T07:32:00.701998 #1268856] INFO -- : [551/885] 1310233=ruby_parser_test I, [2024-05-14T07:32:00.706103 #1268856] INFO -- : [552/885] 1310233=test_gem_resolver_conflict I, [2024-05-14T07:32:00.719839 #1268856] INFO -- : [553/885] 1310233=test_rdoc_task I, [2024-05-14T07:32:00.723844 #1268856] INFO -- : [554/885] 1310233=test_gem_commands_install_command I, [2024-05-14T07:32:00.736743 #1268856] INFO -- : [555/885] 1310239=test_clone I, [2024-05-14T07:32:00.764545 #1268856] INFO -- : [556/885] 1310230=test_readpartial I, [2024-05-14T07:32:00.787049 #1268856] INFO -- : [557/885] 1310221=locals_test I, [2024-05-14T07:32:00.799183 #1268856] INFO -- : [558/885] 1310220=test_rdoc_require I, [2024-05-14T07:32:00.808314 #1268856] INFO -- : [559/885] 1310220=test_rat I, [2024-05-14T07:32:00.815002 #1268856] INFO -- : [560/885] 1310220=test_webauthn_poller I, [2024-05-14T07:32:00.869549 #1268856] INFO -- : [561/885] 1310239=test_rdoc_markup_raw I, [2024-05-14T07:32:00.872361 #1268856] INFO -- : [562/885] 1310239=test_rdoc_markup_to_html_crossref I, [2024-05-14T07:32:00.943614 #1268856] INFO -- : [563/885] 1310220=test_typeddata I, [2024-05-14T07:32:00.951632 #1268856] INFO -- : [564/885] 1310237=encoding_test I, [2024-05-14T07:32:00.969486 #1268856] INFO -- : [565/885] 1310229=test_gem_resolver_best_set I, [2024-05-14T07:32:01.001384 #1268856] INFO -- : [566/885] 1310221=test_fstring I, [2024-05-14T07:32:01.029307 #1268856] INFO -- : [567/885] 1310229=test_array I, [2024-05-14T07:32:01.036014 #1268856] INFO -- : [568/885] 1310229=test_optparse I, [2024-05-14T07:32:01.063585 #1268856] INFO -- : [569/885] 1310237=parser_test I, [2024-05-14T07:32:01.068378 #1268856] INFO -- : [570/885] 1310237=test_convertible I, [2024-05-14T07:32:01.079943 #1268856] INFO -- : [571/885] 1310229=test_rdoc_alias I, [2024-05-14T07:32:01.084709 #1268856] INFO -- : [572/885] 1310221=test_yield I, [2024-05-14T07:32:01.094008 #1268856] INFO -- : [573/885] 1310235=test_stringscanner I, [2024-05-14T07:32:01.097407 #1268856] INFO -- : [574/885] 1310229=test_files_sample I, [2024-05-14T07:32:01.112312 #1268856] INFO -- : [575/885] 1310223=test_bigzero I, [2024-05-14T07:32:01.115409 #1268856] INFO -- : [576/885] 1310235=test_pkey_dh I, [2024-05-14T07:32:01.118134 #1268856] INFO -- : [577/885] 1310223=test_gem_package_tar_header I, [2024-05-14T07:32:01.123443 #1268856] INFO -- : [578/885] 1310239=test_iseq_load I, [2024-05-14T07:32:01.160450 #1268856] INFO -- : [579/885] 1310229=test_gem_util I, [2024-05-14T07:32:01.167006 #1268856] INFO -- : [580/885] 1310223=test_system I, [2024-05-14T07:32:01.170748 #1268856] INFO -- : [581/885] 1310235=test_pkcs12 I, [2024-05-14T07:32:01.173118 #1268856] INFO -- : [582/885] 1310230=test_yjit_exit_locations I, [2024-05-14T07:32:01.173201 #1268856] INFO -- : [583/885] 1310230=test_etc I, [2024-05-14T07:32:01.206776 #1268856] INFO -- : [584/885] 1310220=test_gem_config_file I, [2024-05-14T07:32:01.257809 #1268856] INFO -- : [585/885] 1310230=test_ripper I, [2024-05-14T07:32:01.271053 #1268856] INFO -- : [586/885] 1310232=test_protocol I, [2024-05-14T07:32:01.338125 #1268856] INFO -- : [587/885] 1310220=test_getopts I, [2024-05-14T07:32:01.341963 #1268856] INFO -- : [588/885] 1310229=test_gem_resolver_activation_request I, [2024-05-14T07:32:01.343991 #1268856] INFO -- : [589/885] 1310220=test_libs I, [2024-05-14T07:32:01.352866 #1268856] INFO -- : [590/885] 1310229=test_gc I, [2024-05-14T07:32:01.355685 #1268856] INFO -- : [591/885] 1310220=test_gem_commands_fetch_command I, [2024-05-14T07:32:01.358339 #1268856] INFO -- : [592/885] 1310229=test_math I, [2024-05-14T07:32:01.368633 #1268856] INFO -- : [593/885] 1310229=test_sleep I, [2024-05-14T07:32:01.446740 #1268856] INFO -- : [594/885] 1310235=test_config I, [2024-05-14T07:32:01.472871 #1268856] INFO -- : [595/885] 1310235=test_yaml_tree I, [2024-05-14T07:32:01.487622 #1268856] INFO -- : [596/885] 1310235=test_case I, [2024-05-14T07:32:01.507776 #1268856] INFO -- : [597/885] 1310235=test_sizeof I, [2024-05-14T07:32:01.519422 #1268856] INFO -- : [598/885] 1310220=test_face I, [2024-05-14T07:32:01.542947 #1268856] INFO -- : [599/885] 1310220=test_rendering I, [2024-05-14T07:32:01.550021 #1268856] INFO -- : [600/885] 1310220=test_autoload I, [2024-05-14T07:32:01.581421 #1268856] INFO -- : [601/885] 1310232=test_utf16 I, [2024-05-14T07:32:01.595330 #1268856] INFO -- : [602/885] 1310232=test_io I, [2024-05-14T07:32:01.662120 #1268856] INFO -- : [603/885] 1310230=test_unicode_escape I, [2024-05-14T07:32:01.767739 #1268856] INFO -- : [604/885] 1310230=test_gem_commands_exec_command I, [2024-05-14T07:32:01.914157 #1268856] INFO -- : [605/885] 1310224=test_io_wait I, [2024-05-14T07:32:01.918686 #1268856] INFO -- : [606/885] 1310234=test_kwargs I, [2024-05-14T07:32:01.924307 #1268856] INFO -- : [607/885] 1310234=warnings_test I, [2024-05-14T07:32:02.034197 #1268856] INFO -- : [608/885] 1310234=test_ellipsize I, [2024-05-14T07:32:02.049178 #1268856] INFO -- : [609/885] 1310234=test_date_attr I, [2024-05-14T07:32:02.053046 #1268856] INFO -- : [610/885] 1310233=test_console_attr I, [2024-05-14T07:32:02.053275 #1268856] INFO -- : [611/885] 1310234=test_summary I, [2024-05-14T07:32:02.055823 #1268856] INFO -- : [612/885] 1310233=test_type_completor I, [2024-05-14T07:32:02.060164 #1268856] INFO -- : [613/885] 1310222=test_gem_unsatisfiable_dependency_error I, [2024-05-14T07:32:02.062679 #1268856] INFO -- : [614/885] 1310233=test_win32ole_record I, [2024-05-14T07:32:02.065320 #1268856] INFO -- : [615/885] 1310233=test_cp949 I, [2024-05-14T07:32:02.074233 #1268856] INFO -- : [616/885] 1310233=test_foreach I, [2024-05-14T07:32:02.076020 #1268856] INFO -- : [617/885] 1310222=test_gem_source_specific_file I, [2024-05-14T07:32:02.077183 #1268856] INFO -- : [618/885] 1310233=test_condition I, [2024-05-14T07:32:02.083598 #1268856] INFO -- : [619/885] 1310233=test_gem_commands_uninstall_command I, [2024-05-14T07:32:02.089967 #1268856] INFO -- : [620/885] 1310223=test_io I, [2024-05-14T07:32:02.155946 #1268856] INFO -- : [621/885] 1310222=test_win32ole_type_event I, [2024-05-14T07:32:02.157506 #1268856] INFO -- : [622/885] 1310222=test_emoji I, [2024-05-14T07:32:02.162658 #1268856] INFO -- : [623/885] 1310234=test_sorted_set I, [2024-05-14T07:32:02.180030 #1268856] INFO -- : [624/885] 1310222=test_ubf_async_safe I, [2024-05-14T07:32:02.187440 #1268856] INFO -- : [625/885] 1310222=test_hash I, [2024-05-14T07:32:02.239086 #1268856] INFO -- : [626/885] 1310224=test_gem_impossible_dependencies_error I, [2024-05-14T07:32:02.248210 #1268856] INFO -- : [627/885] 1310224=test_array_create I, [2024-05-14T07:32:02.249757 #1268856] INFO -- : [628/885] 1310224=test_pack I, [2024-05-14T07:32:02.295991 #1268856] INFO -- : [629/885] 1310223=test_to_ruby I, [2024-05-14T07:32:02.309677 #1268856] INFO -- : [630/885] 1310234=test_pattern_key_name_check I, [2024-05-14T07:32:02.313215 #1268856] INFO -- : [631/885] 1310234=test_rdoc_rubygems_hook I, [2024-05-14T07:32:02.318140 #1268856] INFO -- : [632/885] 1310227=test_method I, [2024-05-14T07:32:02.349594 #1268856] INFO -- : [633/885] 1310223=test_gem_commands_query_command I, [2024-05-14T07:32:02.353989 #1268856] INFO -- : [634/885] 1310239=test_rdoc_context_section I, [2024-05-14T07:32:02.362038 #1268856] INFO -- : [635/885] 1310239=test_euc_kr I, [2024-05-14T07:32:02.370343 #1268856] INFO -- : [636/885] 1310239=test_ftp I, [2024-05-14T07:32:02.372680 #1268856] INFO -- : [637/885] 1310239=test_gem_security_trust_dir I, [2024-05-14T07:32:02.408242 #1268856] INFO -- : [638/885] 1310239=test_string_memory I, [2024-05-14T07:32:02.416693 #1268856] INFO -- : [639/885] 1310234=test_sprintf I, [2024-05-14T07:32:02.480132 #1268856] INFO -- : [640/885] 1310224=test_gem_requirement I, [2024-05-14T07:32:02.494896 #1268856] INFO -- : [641/885] 1310239=comments_test I, [2024-05-14T07:32:02.502502 #1268856] INFO -- : [642/885] 1310239=test_line_editor I, [2024-05-14T07:32:02.512269 #1268856] INFO -- : [643/885] 1310239=test_objspace I, [2024-05-14T07:32:02.524225 #1268856] INFO -- : [644/885] 1310226=ripper_test I, [2024-05-14T07:32:02.625109 #1268856] INFO -- : [645/885] 1310224=test_undef I, [2024-05-14T07:32:02.632907 #1268856] INFO -- : [646/885] 1310224=test_gem_commands_stale_command I, [2024-05-14T07:32:02.641554 #1268856] INFO -- : [647/885] 1310224=test_c_struct_entry I, [2024-05-14T07:32:02.659107 #1268856] INFO -- : [648/885] 1310234=test_lock_native_thread I, [2024-05-14T07:32:02.747431 #1268856] INFO -- : [649/885] 1310223=test_have_library I, [2024-05-14T07:32:02.814121 #1268856] INFO -- : [650/885] 1310230=test_remote_fetch_error I, [2024-05-14T07:32:02.817983 #1268856] INFO -- : [651/885] 1310233=test_show_source I, [2024-05-14T07:32:02.826948 #1268856] INFO -- : [652/885] 1310233=test_set I, [2024-05-14T07:32:02.830778 #1268856] INFO -- : [653/885] 1310233=test_hash I, [2024-05-14T07:32:02.836422 #1268856] INFO -- : [654/885] 1310230=test_tree_builder I, [2024-05-14T07:32:02.841071 #1268856] INFO -- : [655/885] 1310233=test_gem_resolver_dependency_request I, [2024-05-14T07:32:02.842983 #1268856] INFO -- : [656/885] 1310230=test_external_new I, [2024-05-14T07:32:02.850142 #1268856] INFO -- : [657/885] 1310230=test_alias_and_anchor I, [2024-05-14T07:32:02.857077 #1268856] INFO -- : [658/885] 1310230=test_postponed_job I, [2024-05-14T07:32:02.864992 #1268856] INFO -- : [659/885] 1310233=test_raise_exception I, [2024-05-14T07:32:02.929310 #1268856] INFO -- : [660/885] 1310234=test_gem_request_set_lockfile I, [2024-05-14T07:32:02.951601 #1268856] INFO -- : [661/885] 1310224=test_win32ole_typelib I, [2024-05-14T07:32:02.955196 #1268856] INFO -- : [662/885] 1310224=test_protect I, [2024-05-14T07:32:02.958656 #1268856] INFO -- : [663/885] 1310224=test_argf I, [2024-05-14T07:32:03.022293 #1268856] INFO -- : [664/885] 1310221=test_ns_spki I, [2024-05-14T07:32:03.042468 #1268856] INFO -- : [665/885] 1310221=test_framework I, [2024-05-14T07:32:03.042817 #1268856] INFO -- : [666/885] 1310221=test_kill_ring I, [2024-05-14T07:32:03.050124 #1268856] INFO -- : [667/885] 1310221=test_weakmap I, [2024-05-14T07:32:03.054732 #1268856] INFO -- : [668/885] 1310226=test_workspace I, [2024-05-14T07:32:03.153274 #1268856] INFO -- : [669/885] 1310226=test_yjit I, [2024-05-14T07:32:03.153616 #1268856] INFO -- : [670/885] 1310226=test_ws I, [2024-05-14T07:32:03.169414 #1268856] INFO -- : [671/885] 1310226=test_m17n I, [2024-05-14T07:32:03.186516 #1268856] INFO -- : [672/885] 1310234=test_gem_commands_environment_command I, [2024-05-14T07:32:03.238464 #1268856] INFO -- : [673/885] 1310226=test_rdoc_tom_doc I, [2024-05-14T07:32:03.238791 #1268856] INFO -- : [674/885] 1310234=test_rdoc_markup_to_tt_only I, [2024-05-14T07:32:03.249472 #1268856] INFO -- : [675/885] 1310226=test_hmac I, [2024-05-14T07:32:03.261241 #1268856] INFO -- : [676/885] 1310226=test_gem_command I, [2024-05-14T07:32:03.261519 #1268856] INFO -- : [677/885] 1310230=test_bug-3571 I, [2024-05-14T07:32:03.271289 #1268856] INFO -- : [678/885] 1310234=test_key_actor_vi I, [2024-05-14T07:32:03.280922 #1268856] INFO -- : [679/885] 1310230=test_common I, [2024-05-14T07:32:03.367661 #1268856] INFO -- : [680/885] 1310226=test_gem_spec_fetcher I, [2024-05-14T07:32:03.375738 #1268856] INFO -- : [681/885] 1310234=test_numeric I, [2024-05-14T07:32:03.399174 #1268856] INFO -- : [682/885] 1310233=test_assignment I, [2024-05-14T07:32:03.412362 #1268856] INFO -- : [683/885] 1310229=test_ifunless I, [2024-05-14T07:32:03.415210 #1268856] INFO -- : [684/885] 1310229=test_gem_commands_lock_command I, [2024-05-14T07:32:03.425015 #1268856] INFO -- : [685/885] 1310234=test_optarg I, [2024-05-14T07:32:03.442769 #1268856] INFO -- : [686/885] 1310229=test_yaml_special_cases I, [2024-05-14T07:32:03.457070 #1268856] INFO -- : [687/885] 1310229=test_gem_source_list I, [2024-05-14T07:32:03.468421 #1268856] INFO -- : [688/885] 1310234=test_config I, [2024-05-14T07:32:03.485172 #1268856] INFO -- : [689/885] 1310230=test_rdoc_token_stream I, [2024-05-14T07:32:03.494939 #1268856] INFO -- : [690/885] 1310234=test_address_resolve I, [2024-05-14T07:32:03.501420 #1268856] INFO -- : [691/885] 1310230=test_exception I, [2024-05-14T07:32:03.509579 #1268856] INFO -- : [692/885] 1310229=test_zsh_completion I, [2024-05-14T07:32:03.512427 #1268856] INFO -- : [693/885] 1310230=test_iter_break I, [2024-05-14T07:32:03.515929 #1268856] INFO -- : [694/885] 1310229=test_verbose I, [2024-05-14T07:32:03.519573 #1268856] INFO -- : [695/885] 1310230=test_rdoc_single_class I, [2024-05-14T07:32:03.528211 #1268856] INFO -- : [696/885] 1310230=test_num2int I, [2024-05-14T07:32:03.530790 #1268856] INFO -- : [697/885] 1310229=test_nil I, [2024-05-14T07:32:03.536466 #1268856] INFO -- : [698/885] 1310229=test_macro I, [2024-05-14T07:32:03.542022 #1268856] INFO -- : [699/885] 1310234=test_pp I, [2024-05-14T07:32:03.544755 #1268856] INFO -- : [700/885] 1310230=test_frozen I, [2024-05-14T07:32:03.550727 #1268856] INFO -- : [701/885] 1310230=test_gem_ext_configure_builder I, [2024-05-14T07:32:03.551087 #1268856] INFO -- : [702/885] 1310226=test_emitter I, [2024-05-14T07:32:03.557751 #1268856] INFO -- : [703/885] 1310226=test_gem_silent_ui I, [2024-05-14T07:32:03.579466 #1268856] INFO -- : [704/885] 1310234=test_files_ext I, [2024-05-14T07:32:03.585175 #1268856] INFO -- : [705/885] 1310229=test_bug-5832 I, [2024-05-14T07:32:03.593663 #1268856] INFO -- : [706/885] 1310229=test_kernel I, [2024-05-14T07:32:03.602832 #1268856] INFO -- : [707/885] 1310230=dispatcher_test I, [2024-05-14T07:32:03.603654 #1268856] INFO -- : [708/885] 1310226=test_eval_history I, [2024-05-14T07:32:03.614596 #1268856] INFO -- : [709/885] 1310230=test_gem_doctor I, [2024-05-14T07:32:03.618819 #1268856] INFO -- : [710/885] 1310226=test_kdf I, [2024-05-14T07:32:03.642123 #1268856] INFO -- : [711/885] 1310230=test_psych I, [2024-05-14T07:32:03.668522 #1268856] INFO -- : [712/885] 1310230=test_enc_raise I, [2024-05-14T07:32:03.669787 #1268856] INFO -- : [713/885] 1310230=!Nothing_to_test I, [2024-05-14T07:32:03.670243 #1268856] INFO -- : [714/885] 1310230=test_rdoc_markup_paragraph I, [2024-05-14T07:32:03.681206 #1268856] INFO -- : [715/885] 1310230=test_at_exit I, [2024-05-14T07:32:03.688992 #1268856] INFO -- : [716/885] 1310234=test_command I, [2024-05-14T07:32:03.704874 #1268856] INFO -- : [717/885] 1310226=test_gem_rdoc I, [2024-05-14T07:32:03.708709 #1268856] INFO -- : [718/885] 1310230=test_date I, [2024-05-14T07:32:03.718183 #1268856] INFO -- : [719/885] 1310230=test_gem_ext_cargo_builder_unit I, [2024-05-14T07:32:03.736841 #1268856] INFO -- : [720/885] 1310230=test_object_create_start I, [2024-05-14T07:32:03.739883 #1268856] INFO -- : [721/885] 1310230=test_rdoc_markup_attributes I, [2024-05-14T07:32:03.744046 #1268856] INFO -- : [722/885] 1310230=test_null I, [2024-05-14T07:32:03.750772 #1268856] INFO -- : [723/885] 1310230=test_win32ole_type I, [2024-05-14T07:32:03.756930 #1268856] INFO -- : [724/885] 1310230=test_mul I, [2024-05-14T07:32:03.767148 #1268856] INFO -- : [725/885] 1310230=test_rdoc_markup_to_rdoc I, [2024-05-14T07:32:03.771910 #1268856] INFO -- : [726/885] 1310223=test_rdoc_rd_inline_parser I, [2024-05-14T07:32:03.802410 #1268856] INFO -- : [727/885] 1310230=test_default_gems I, [2024-05-14T07:32:03.841387 #1268856] INFO -- : [728/885] 1310230=test_pipe I, [2024-05-14T07:32:03.854408 #1268856] INFO -- : [729/885] 1310226=test_thread I, [2024-05-14T07:32:03.858652 #1268856] INFO -- : [730/885] 1310226=test_trick I, [2024-05-14T07:32:03.891567 #1268856] INFO -- : [731/885] 1310223=test_pkey_ec I, [2024-05-14T07:32:03.950557 #1268856] INFO -- : [732/885] 1310234=test_date_parse I, [2024-05-14T07:32:03.965577 #1268856] INFO -- : [733/885] 1310223=test_key_name_check I, [2024-05-14T07:32:03.973894 #1268856] INFO -- : [734/885] 1310223=test_backtrace I, [2024-05-14T07:32:03.983493 #1268856] INFO -- : [735/885] 1310223=test_defined I, [2024-05-14T07:32:04.016174 #1268856] INFO -- : [736/885] 1310230=test_io_buffer I, [2024-05-14T07:32:04.062042 #1268856] INFO -- : [737/885] 1310223=test_rdoc_i18n_text I, [2024-05-14T07:32:04.066568 #1268856] INFO -- : [738/885] 1310234=test_gem_uninstaller I, [2024-05-14T07:32:04.076066 #1268856] INFO -- : [739/885] 1310223=test_buffering I, [2024-05-14T07:32:04.082124 #1268856] INFO -- : [740/885] 1310223=test_svcb_https I, [2024-05-14T07:32:04.092626 #1268856] INFO -- : [741/885] 1310230=test_gb18030 I, [2024-05-14T07:32:04.100024 #1268856] INFO -- : [742/885] 1310223=test_time I, [2024-05-14T07:32:04.105094 #1268856] INFO -- : [743/885] 1310230=test_windows_1251 I, [2024-05-14T07:32:04.108928 #1268856] INFO -- : [744/885] 1310230=test_rdoc_rdoc I, [2024-05-14T07:32:04.172011 #1268856] INFO -- : [745/885] 1310229=test_string I, [2024-05-14T07:32:04.234066 #1268856] INFO -- : [746/885] 1310223=test_proc I, [2024-05-14T07:32:04.251042 #1268856] INFO -- : [747/885] 1310230=test_gc_compact I, [2024-05-14T07:32:04.260910 #1268856] INFO -- : [748/885] 1310235=test_gem_resolver_index_set I, [2024-05-14T07:32:04.293829 #1268856] INFO -- : [749/885] 1310235=test_gem_package_old I, [2024-05-14T07:32:04.342387 #1268856] INFO -- : [750/885] 1310235=test_zlib I, [2024-05-14T07:32:04.477005 #1268856] INFO -- : [751/885] 1310231=test_cgi_tag_helper I, [2024-05-14T07:32:04.488622 #1268856] INFO -- : [752/885] 1310231=test_egrep_cpp I, [2024-05-14T07:32:04.533957 #1268856] INFO -- : [753/885] 1310233=test_ole_methods I, [2024-05-14T07:32:04.537689 #1268856] INFO -- : [754/885] 1310233=test_erb_m17n I, [2024-05-14T07:32:04.558364 #1268856] INFO -- : [755/885] 1310233=test_optimization I, [2024-05-14T07:32:04.614316 #1268856] INFO -- : [756/885] 1310231=test_date_conv I, [2024-05-14T07:32:04.625567 #1268856] INFO -- : [757/885] 1310231=test_folderitem2_invokeverb I, [2024-05-14T07:32:04.633229 #1268856] INFO -- : [758/885] 1310231=test_rdoc_markup_parser I, [2024-05-14T07:32:04.811877 #1268856] INFO -- : [759/885] 1310238=test_require_path_check I, [2024-05-14T07:32:04.848178 #1268856] INFO -- : [760/885] 1310231=test_fnmatch I, [2024-05-14T07:32:04.874680 #1268856] INFO -- : [761/885] 1310238=test_files_test_2 I, [2024-05-14T07:32:04.891215 #1268856] INFO -- : [762/885] 1310231=test_gem_validator I, [2024-05-14T07:32:04.912558 #1268856] INFO -- : [763/885] 1310231=test_rdoc_store I, [2024-05-14T07:32:04.995036 #1268856] INFO -- : [764/885] 1310234=test_depth_first I, [2024-05-14T07:32:05.000302 #1268856] INFO -- : [765/885] 1310234=test_gem_request_set_lockfile_parser I, [2024-05-14T07:32:05.058269 #1268856] INFO -- : [766/885] 1310223=test_x509attr I, [2024-05-14T07:32:05.065086 #1268856] INFO -- : [767/885] 1310223=test_raise I, [2024-05-14T07:32:05.066574 #1268856] INFO -- : [768/885] 1310223=test_pattern_matching I, [2024-05-14T07:32:05.100334 #1268856] INFO -- : [769/885] 1310223=test_rdoc_stats I, [2024-05-14T07:32:05.105020 #1268856] INFO -- : [770/885] 1310234=test_string I, [2024-05-14T07:32:05.124757 #1268856] INFO -- : [771/885] 1310234=test_qsort I, [2024-05-14T07:32:05.136294 #1268856] INFO -- : [772/885] 1310234=test_rdoc_parser I, [2024-05-14T07:32:05.148636 #1268856] INFO -- : [773/885] 1310234=test_gem_dependency_resolution_error I, [2024-05-14T07:32:05.154922 #1268856] INFO -- : [774/885] 1310234=test_custom_command I, [2024-05-14T07:32:05.162929 #1268856] INFO -- : [775/885] 1310234=json_addition_test I, [2024-05-14T07:32:05.176304 #1268856] INFO -- : [776/885] 1310234=test_cclass I, [2024-05-14T07:32:05.184217 #1268856] INFO -- : [777/885] 1310223=test_gem_request_connection_pools I, [2024-05-14T07:32:05.244204 #1268856] INFO -- : [778/885] 1310234=test_gem_version_option I, [2024-05-14T07:32:05.287392 #1268856] INFO -- : [779/885] 1310234=test_grapheme_breaks I, [2024-05-14T07:32:05.332549 #1268856] INFO -- : [780/885] 1310234=test_pkey I, [2024-05-14T07:32:05.389551 #1268856] INFO -- : [781/885] 1310234=test_case I, [2024-05-14T07:32:05.391427 #1268856] INFO -- : [782/885] 1310234=test_reline I, [2024-05-14T07:32:05.535080 #1268856] INFO -- : [783/885] 1310231=test_parser_events I, [2024-05-14T07:32:05.587873 #1268856] INFO -- : [784/885] 1310231=test_rdoc_generator_pot_po I, [2024-05-14T07:32:05.595945 #1268856] INFO -- : [785/885] 1310231=test_ansi_with_terminfo I, [2024-05-14T07:32:05.644526 #1268856] INFO -- : [786/885] 1310231=test_json_tree I, [2024-05-14T07:32:05.662076 #1268856] INFO -- : [787/885] 1310231=test_rdoc_markup_to_markdown I, [2024-05-14T07:32:05.693020 #1268856] INFO -- : [788/885] 1310237=test_m17n_comb I, [2024-05-14T07:32:05.697509 #1268856] INFO -- : [789/885] 1310231=test_memory_view I, [2024-05-14T07:32:05.704757 #1268856] INFO -- : [790/885] 1310234=test_ractor I, [2024-05-14T07:32:05.791441 #1268856] INFO -- : [791/885] 1310234=test_gem_stream_ui I, [2024-05-14T07:32:05.863029 #1268856] INFO -- : [792/885] 1310231=test_extlibs I, [2024-05-14T07:32:05.876494 #1268856] INFO -- : [793/885] 1310234=test_rdoc_generator_ri I, [2024-05-14T07:32:05.882741 #1268856] INFO -- : [794/885] 1310234=test_severity I, [2024-05-14T07:32:05.893782 #1268856] INFO -- : [795/885] 1310234=test_ractor I, [2024-05-14T07:32:05.918408 #1268856] INFO -- : [796/885] 1310234=test_require_lib I, [2024-05-14T07:32:06.000189 #1268856] INFO -- : [797/885] 1310220=parse_test I, [2024-05-14T07:32:06.228120 #1268856] INFO -- : [798/885] 1310223=test_gem_install_update_options I, [2024-05-14T07:32:06.367491 #1268856] INFO -- : [799/885] 1310223=test_rdoc_markup_to_table_of_contents I, [2024-05-14T07:32:06.402536 #1268856] INFO -- : [800/885] 1310223=test_socket I, [2024-05-14T07:32:06.404241 #1268856] INFO -- : [801/885] 1310222=test_thread I, [2024-05-14T07:32:06.591226 #1268856] INFO -- : [802/885] 1310226=test_objectspace I, [2024-05-14T07:32:06.622291 #1268856] INFO -- : [803/885] 1310222=test_literal I, [2024-05-14T07:32:06.725448 #1268856] INFO -- : [804/885] 1310224=test_str2big I, [2024-05-14T07:32:06.731546 #1268856] INFO -- : [805/885] 1310224=test_c_struct_builder I, [2024-05-14T07:32:06.851319 #1268856] INFO -- : [806/885] 1310224=test_dot_dot I, [2024-05-14T07:32:06.854497 #1268856] INFO -- : [807/885] 1310224=test_case_options I, [2024-05-14T07:32:06.860357 #1268856] INFO -- : [808/885] 1310224=test_store I, [2024-05-14T07:32:06.920441 #1268856] INFO -- : [809/885] 1310236=test_rdoc_cross_reference I, [2024-05-14T07:32:07.069258 #1268856] INFO -- : [810/885] 1310224=test_scalar I, [2024-05-14T07:32:07.076036 #1268856] INFO -- : [811/885] 1310224=test_gem_dependency_installer I, [2024-05-14T07:32:07.303436 #1268856] INFO -- : [812/885] 1310230=test_gem_commands_info_command I, [2024-05-14T07:32:07.315718 #1268856] INFO -- : [813/885] 1310230=test_bug_reporter I, [2024-05-14T07:32:07.349028 #1268856] INFO -- : [814/885] 1310222=test_rand I, [2024-05-14T07:32:07.504728 #1268856] INFO -- : [815/885] 1310223=test_gem_name_tuple I, [2024-05-14T07:32:07.520837 #1268856] INFO -- : [816/885] 1310223=test_gem_package_tar_reader_entry I, [2024-05-14T07:32:07.565392 #1268856] INFO -- : [817/885] 1310236=test_exception I, [2024-05-14T07:32:07.603515 #1268856] INFO -- : [818/885] 1310226=test_gem_request I, [2024-05-14T07:32:07.623172 #1268856] INFO -- : [819/885] 1310230=test_method_cache I, [2024-05-14T07:32:07.630686 #1268856] INFO -- : [820/885] 1310230=test_sprintf_comb I, [2024-05-14T07:32:07.654913 #1268856] INFO -- : [821/885] 1310227=test_gem_ext_cargo_builder_link_flag_converter I, [2024-05-14T07:32:07.697544 #1268856] INFO -- : [822/885] 1310222=test_gem_commands_mirror I, [2024-05-14T07:32:07.705758 #1268856] INFO -- : [823/885] 1310222=test_enumerator_kw I, [2024-05-14T07:32:07.709703 #1268856] INFO -- : [824/885] 1310222=test_gem_text I, [2024-05-14T07:32:07.728578 #1268856] INFO -- : [825/885] 1310227=test_settracefunc I, [2024-05-14T07:32:07.728702 #1268856] INFO -- : [826/885] 1310223=test_win32ole I, [2024-05-14T07:32:07.737481 #1268856] INFO -- : [827/885] 1310223=test_generic I, [2024-05-14T07:32:07.759519 #1268856] INFO -- : [828/885] 1310221=test_scan_args I, [2024-05-14T07:32:07.763753 #1268856] INFO -- : [829/885] 1310222=test_gem_commands_specification_command I, [2024-05-14T07:32:07.763821 #1268856] INFO -- : [830/885] 1310231=test_shift_jis I, [2024-05-14T07:32:07.765921 #1268856] INFO -- : [831/885] 1310231=test_gem_commands_which_command I, [2024-05-14T07:32:07.774203 #1268856] INFO -- : [832/885] 1310221=test_http I, [2024-05-14T07:32:07.786862 #1268856] INFO -- : [833/885] 1310223=test_enumerator I, [2024-05-14T07:32:07.790324 #1268856] INFO -- : [834/885] 1310230=test_inadvertent_creation I, [2024-05-14T07:32:07.793387 #1268856] INFO -- : [835/885] 1310221=test_flags I, [2024-05-14T07:32:07.806638 #1268856] INFO -- : [836/885] 1310231=test_rdoc_markup_attribute_manager I, [2024-05-14T07:32:07.808151 #1268856] INFO -- : [837/885] 1310226=test_name_error I, [2024-05-14T07:32:07.839286 #1268856] INFO -- : [838/885] 1310231=test_gem_commands_dependency_command I, [2024-05-14T07:32:07.873311 #1268856] INFO -- : [839/885] 1310237=test_safe_load I, [2024-05-14T07:32:07.874150 #1268856] INFO -- : [840/885] 1310222=test_gem_resolver_composed_set I, [2024-05-14T07:32:07.885095 #1268856] INFO -- : [841/885] 1310237=test_gem_resolver I, [2024-05-14T07:32:07.888824 #1268856] INFO -- : [842/885] 1310222=test_rdoc_context I, [2024-05-14T07:32:07.938566 #1268856] INFO -- : [843/885] 1310226=test_stream I, [2024-05-14T07:32:07.947370 #1268856] INFO -- : [844/885] 1310230=test_nil2vtempty I, [2024-05-14T07:32:07.949152 #1268856] INFO -- : [845/885] 1310226=test_rdoc_parser_ruby I, [2024-05-14T07:32:07.952185 #1268856] INFO -- : [846/885] 1310230=test_httpresponse I, [2024-05-14T07:32:07.953322 #1268856] INFO -- : [847/885] 1310231=test_open-uri I, [2024-05-14T07:32:08.045363 #1268856] INFO -- : [848/885] 1310230=test_gem_safe_yaml I, [2024-05-14T07:32:08.067546 #1268856] INFO -- : [849/885] 1310230=test_syntax I, [2024-05-14T07:32:08.137814 #1268856] INFO -- : [850/885] 1310237=test_data I, [2024-05-14T07:32:08.149383 #1268856] INFO -- : [851/885] 1310237=test_date_new I, [2024-05-14T07:32:08.157123 #1268856] INFO -- : [852/885] 1310237=index_write_test I, [2024-05-14T07:32:08.159868 #1268856] INFO -- : [853/885] 1310237=test_date_time I, [2024-05-14T07:32:08.165714 #1268856] INFO -- : [854/885] 1310238=test_rdoc_markup_to_joined_paragraph I, [2024-05-14T07:32:08.168986 #1268856] INFO -- : [855/885] 1310238=test_require I, [2024-05-14T07:32:08.169860 #1268856] INFO -- : [856/885] 1310238=test_iso_8859 I, [2024-05-14T07:32:08.170926 #1268856] INFO -- : [857/885] 1310237=test_tcp I, [2024-05-14T07:32:08.194085 #1268856] INFO -- : [858/885] 1310238=test_rdoc_text I, [2024-05-14T07:32:08.251746 #1268856] INFO -- : [859/885] 1310238=test_io_console I, [2024-05-14T07:32:08.316093 #1268856] INFO -- : [860/885] 1310237=test_singleton I, [2024-05-14T07:32:08.321681 #1268856] INFO -- : [861/885] 1310237=test_flush I, [2024-05-14T07:32:08.324848 #1268856] INFO -- : [862/885] 1310237=test_switch_hitter I, [2024-05-14T07:32:08.337238 #1268856] INFO -- : [863/885] 1310237=test_securerandom I, [2024-05-14T07:32:08.364711 #1268856] INFO -- : [864/885] 1310237=test_c_union_entity I, [2024-05-14T07:32:08.422684 #1268856] INFO -- : [865/885] 1310237=test_rdoc_normal_module I, [2024-05-14T07:32:08.471193 #1268856] INFO -- : [866/885] 1310237=test_rdoc_markdown_test I, [2024-05-14T07:32:08.538136 #1268856] INFO -- : [867/885] 1310231=test_logperiod I, [2024-05-14T07:32:08.547066 #1268856] INFO -- : [868/885] 1310231=test_passing_block I, [2024-05-14T07:32:08.611715 #1268856] INFO -- : [869/885] 1310222=test_thread_fd_close I, [2024-05-14T07:32:08.615019 #1268856] INFO -- : [870/885] 1310231=test_uncorrectable_name_check I, [2024-05-14T07:32:08.622366 #1268856] INFO -- : [871/885] 1310231=newline_test I, [2024-05-14T07:32:08.632961 #1268856] INFO -- : [872/885] 1310222=test_hash_create I, [2024-05-14T07:32:08.636401 #1268856] INFO -- : [873/885] 1310222=test_stringchar I, [2024-05-14T07:32:08.702743 #1268856] INFO -- : [874/885] 1310222=test_gem_source_local I, [2024-05-14T07:32:08.713750 #1268856] INFO -- : [875/885] 1310231=test_gem_security_policy I, [2024-05-14T07:32:08.715276 #1268856] INFO -- : [876/885] 1310220=test_process I, [2024-05-14T07:32:08.783265 #1268856] INFO -- : [877/885] 1310235=test_last_thread I, [2024-05-14T07:32:08.795682 #1268856] INFO -- : [878/885] 1310226=test_pack I, [2024-05-14T07:32:08.865421 #1268856] INFO -- : [879/885] 1310221=test_err_in_callback I, [2024-05-14T07:32:08.868747 #1268856] INFO -- : [880/885] 1310221=test_gem_resolver_lock_specification I, [2024-05-14T07:32:08.879490 #1268856] INFO -- : [881/885] 1310227=test_gc I, [2024-05-14T07:32:08.903070 #1268856] INFO -- : [882/885] 1310221=test_x509cert I, [2024-05-14T07:32:08.934911 #1268856] INFO -- : [883/885] 1310222=test_gem_ext_rake_builder I, [2024-05-14T07:32:09.020155 #1268856] INFO -- : [884/885] 1310226=test_arity I, [2024-05-14T07:32:09.042324 #1268856] INFO -- : [885/885] 1310226=test_logdevice I, [2024-05-14T07:32:22.540842 #1268856] INFO -- : Finished tests in 33.122934s, 796.3063 tests/s, 282357.8402 assertions/s. E, [2024-05-14T07:32:22.540941 #1268856] ERROR -- : Children under /tmp/rubytest.w0cmvz: E, [2024-05-14T07:32:22.540967 #1268856] ERROR -- : * drwx------ 4 80 2024-05-14 07:31:58 +0000 gem_rebuild20240514-1310232-j3m6om/ E, [2024-05-14T07:32:22.540978 #1268856] ERROR -- : * drwxrwxr-x 2 60 2024-05-14 07:31:58 +0000 new/ E, [2024-05-14T07:32:22.540983 #1268856] ERROR -- : * -rw-rw-r-- 1 4096 2024-05-14 07:31:58 +0000 rebuild_test_gem-1.0.0.gem E, [2024-05-14T07:32:22.540988 #1268856] ERROR -- : * drwxrwxr-x 2 60 2024-05-14 07:31:58 +0000 old/ E, [2024-05-14T07:32:22.540992 #1268856] ERROR -- : * -rw-rw-r-- 1 4096 2024-05-14 07:31:58 +0000 rebuild_test_gem-1.0.0.gem I, [2024-05-14T07:32:22.542163 #1268856] INFO -- : 26376 tests, 9352520 assertions, 0 failures, 0 errors, 306 skips I, [2024-05-14T07:32:22.542191 #1268856] INFO -- : I, [2024-05-14T07:32:22.542199 #1268856] INFO -- : ruby -v: ruby 3.4.0dev (2024-05-14T06:43:28Z master b60f09442a) [x86_64-linux] I, [2024-05-14T07:32:22.544239 #1268856] INFO -- : $$$[end] "make yes-test-all TESTOPTS='--stderr-on-failure' TESTS='-j20'" exit with 0. I, [2024-05-14T07:32:22.544370 #1268856] INFO -- : $$$[beg] make yes-test-rubyspec MSPECOPT='--error-output stderr --debug -j' TESTS='-j20' I, [2024-05-14T07:32:22.631597 #1268856] INFO -- : BASERUBY = /usr/bin/ruby --disable=gems I, [2024-05-14T07:32:22.631635 #1268856] INFO -- : CC = gcc I, [2024-05-14T07:32:22.631641 #1268856] INFO -- : LD = ld I, [2024-05-14T07:32:22.631646 #1268856] INFO -- : LDSHARED = gcc -shared I, [2024-05-14T07:32:22.631650 #1268856] INFO -- : CFLAGS = -O3 -fno-fast-math -ggdb3 -Wall -Wextra -Wdeprecated-declarations -Wdiv-by-zero -Wduplicated-cond -Wimplicit-function-declaration -Wimplicit-int -Wpointer-arith -Wwrite-strings -Wold-style-definition -Wimplicit-fallthrough=0 -Wmissing-noreturn -Wno-cast-function-type -Wno-constant-logical-operand -Wno-long-long -Wno-missing-field-initializers -Wno-overlength-strings -Wno-packed-bitfield-compat -Wno-parentheses-equality -Wno-self-assign -Wno-tautological-compare -Wno-unused-parameter -Wno-unused-value -Wsuggest-attribute=format -Wsuggest-attribute=noreturn -Wunused-variable -Wmisleading-indentation -Wundef -fPIC I, [2024-05-14T07:32:22.631655 #1268856] INFO -- : XCFLAGS = -U_FORTIFY_SOURCE -D_FORTIFY_SOURCE=2 -fstack-protector-strong -fno-strict-overflow -fvisibility=hidden -fexcess-precision=standard -DRUBY_EXPORT -I. -I.ext/include/x86_64-linux -I/tmp/ruby/src/trunk/include -I/tmp/ruby/src/trunk -I/tmp/ruby/src/trunk/prism -I/tmp/ruby/src/trunk/enc/unicode/15.0.0 I, [2024-05-14T07:32:22.631668 #1268856] INFO -- : CPPFLAGS = I, [2024-05-14T07:32:22.631672 #1268856] INFO -- : DLDFLAGS = -Wl,--compress-debug-sections=zlib -Wl,-soname,libruby.so.3.4 -fstack-protector-strong I, [2024-05-14T07:32:22.631676 #1268856] INFO -- : SOLIBS = -lz -lrt -lrt -lgmp -ldl -lcrypt -lm -lpthread I, [2024-05-14T07:32:22.631680 #1268856] INFO -- : LANG = en_US.UTF-8 I, [2024-05-14T07:32:22.631683 #1268856] INFO -- : LC_ALL = I, [2024-05-14T07:32:22.631687 #1268856] INFO -- : LC_CTYPE = I, [2024-05-14T07:32:22.631721 #1268856] INFO -- : MFLAGS = I, [2024-05-14T07:32:22.631727 #1268856] INFO -- : RUSTC = no I, [2024-05-14T07:32:22.631731 #1268856] INFO -- : YJIT_RUSTC_ARGS = --crate-name=yjit --crate-type=staticlib --edition=2021 -g -C lto=thin -C opt-level=3 -C overflow-checks=on '--out-dir=/tmp/ruby/build/trunk/yjit/target/release/' /tmp/ruby/src/trunk/yjit/src/lib.rs I, [2024-05-14T07:32:22.632231 #1268856] INFO -- : gcc (Ubuntu 11.4.0-1ubuntu1~22.04) 11.4.0 I, [2024-05-14T07:32:22.632252 #1268856] INFO -- : Copyright (C) 2021 Free Software Foundation, Inc. I, [2024-05-14T07:32:22.632258 #1268856] INFO -- : This is free software; see the source for copying conditions. There is NO I, [2024-05-14T07:32:22.632263 #1268856] INFO -- : warranty; not even for MERCHANTABILITY or FITNESS FOR A PARTICULAR PURPOSE. I, [2024-05-14T07:32:22.632268 #1268856] INFO -- : I, [2024-05-14T07:32:22.634192 #1268856] INFO -- : generating enc.mk I, [2024-05-14T07:32:22.750780 #1268856] INFO -- : making enc I, [2024-05-14T07:32:22.767814 #1268856] INFO -- : make[1]: Entering directory '/tmp/ruby/build/trunk' I, [2024-05-14T07:32:22.767836 #1268856] INFO -- : make[1]: Nothing to be done for 'enc'. I, [2024-05-14T07:32:22.767841 #1268856] INFO -- : make[1]: Leaving directory '/tmp/ruby/build/trunk' I, [2024-05-14T07:32:22.768461 #1268856] INFO -- : making srcs under enc I, [2024-05-14T07:32:22.797983 #1268856] INFO -- : make[1]: Entering directory '/tmp/ruby/build/trunk' I, [2024-05-14T07:32:22.798004 #1268856] INFO -- : make[1]: Nothing to be done for 'srcs'. I, [2024-05-14T07:32:22.798010 #1268856] INFO -- : make[1]: Leaving directory '/tmp/ruby/build/trunk' I, [2024-05-14T07:32:22.798927 #1268856] INFO -- : generating transdb.h I, [2024-05-14T07:32:22.895124 #1268856] INFO -- : transdb.h unchanged I, [2024-05-14T07:32:22.896413 #1268856] INFO -- : making trans I, [2024-05-14T07:32:22.929567 #1268856] INFO -- : make[1]: Entering directory '/tmp/ruby/build/trunk' I, [2024-05-14T07:32:22.929588 #1268856] INFO -- : make[1]: Nothing to be done for 'trans'. I, [2024-05-14T07:32:22.929593 #1268856] INFO -- : make[1]: Leaving directory '/tmp/ruby/build/trunk' I, [2024-05-14T07:32:22.930326 #1268856] INFO -- : making encs I, [2024-05-14T07:32:22.967536 #1268856] INFO -- : make[1]: Entering directory '/tmp/ruby/build/trunk' I, [2024-05-14T07:32:22.967557 #1268856] INFO -- : make[1]: Nothing to be done for 'encs'. I, [2024-05-14T07:32:22.967563 #1268856] INFO -- : make[1]: Leaving directory '/tmp/ruby/build/trunk' I, [2024-05-14T07:32:22.969358 #1268856] INFO -- : generating makefiles ext/configure-ext.mk I, [2024-05-14T07:32:22.995834 #1268856] INFO -- : ext/configure-ext.mk updated I, [2024-05-14T07:32:22.998300 #1268856] INFO -- : make[1]: Entering directory '/tmp/ruby/build/trunk' I, [2024-05-14T07:32:24.347204 #1268856] INFO -- : make[1]: Leaving directory '/tmp/ruby/build/trunk' I, [2024-05-14T07:32:24.347947 #1268856] INFO -- : generating makefile exts.mk I, [2024-05-14T07:32:24.384834 #1268856] INFO -- : exts.mk unchanged I, [2024-05-14T07:32:24.389581 #1268856] INFO -- : make[1]: Entering directory '/tmp/ruby/build/trunk' I, [2024-05-14T07:32:24.694128 #1268856] INFO -- : make[2]: Entering directory '/tmp/ruby/build/trunk/ext/coverage' I, [2024-05-14T07:32:24.698724 #1268856] INFO -- : make[2]: Leaving directory '/tmp/ruby/build/trunk/ext/coverage' I, [2024-05-14T07:32:24.705162 #1268856] INFO -- : make[2]: Entering directory '/tmp/ruby/build/trunk/ext/date' I, [2024-05-14T07:32:24.710282 #1268856] INFO -- : make[2]: Leaving directory '/tmp/ruby/build/trunk/ext/date' I, [2024-05-14T07:32:24.714148 #1268856] INFO -- : make[2]: Entering directory '/tmp/ruby/build/trunk/ext/digest' I, [2024-05-14T07:32:24.723227 #1268856] INFO -- : make[2]: Leaving directory '/tmp/ruby/build/trunk/ext/digest' I, [2024-05-14T07:32:24.749687 #1268856] INFO -- : make[2]: Entering directory '/tmp/ruby/build/trunk/ext/digest/sha2' I, [2024-05-14T07:32:24.754598 #1268856] INFO -- : make[2]: Leaving directory '/tmp/ruby/build/trunk/ext/digest/sha2' I, [2024-05-14T07:32:24.775914 #1268856] INFO -- : make[2]: Entering directory '/tmp/ruby/build/trunk/ext/fiddle' I, [2024-05-14T07:32:24.786543 #1268856] INFO -- : make[2]: Leaving directory '/tmp/ruby/build/trunk/ext/fiddle' I, [2024-05-14T07:32:24.791479 #1268856] INFO -- : make[2]: Entering directory '/tmp/ruby/build/trunk/ext/io/console' I, [2024-05-14T07:32:24.795601 #1268856] INFO -- : make[2]: Leaving directory '/tmp/ruby/build/trunk/ext/io/console' I, [2024-05-14T07:32:24.808509 #1268856] INFO -- : make[2]: Entering directory '/tmp/ruby/build/trunk/ext/json' I, [2024-05-14T07:32:24.818991 #1268856] INFO -- : make[2]: Leaving directory '/tmp/ruby/build/trunk/ext/json' I, [2024-05-14T07:32:24.834736 #1268856] INFO -- : make[2]: Entering directory '/tmp/ruby/build/trunk/ext/monitor' I, [2024-05-14T07:32:24.838796 #1268856] INFO -- : make[2]: Leaving directory '/tmp/ruby/build/trunk/ext/monitor' I, [2024-05-14T07:32:24.845908 #1268856] INFO -- : make[2]: Entering directory '/tmp/ruby/build/trunk/ext/objspace' I, [2024-05-14T07:32:24.851366 #1268856] INFO -- : make[2]: Leaving directory '/tmp/ruby/build/trunk/ext/objspace' I, [2024-05-14T07:32:24.868763 #1268856] INFO -- : make[2]: Entering directory '/tmp/ruby/build/trunk/ext/openssl' I, [2024-05-14T07:32:24.884472 #1268856] INFO -- : make[2]: Leaving directory '/tmp/ruby/build/trunk/ext/openssl' I, [2024-05-14T07:32:24.889219 #1268856] INFO -- : make[2]: Entering directory '/tmp/ruby/build/trunk/ext/pathname' I, [2024-05-14T07:32:24.893337 #1268856] INFO -- : make[2]: Leaving directory '/tmp/ruby/build/trunk/ext/pathname' I, [2024-05-14T07:32:24.900645 #1268856] INFO -- : make[2]: Entering directory '/tmp/ruby/build/trunk/ext/psych' I, [2024-05-14T07:32:24.919126 #1268856] INFO -- : make[2]: Leaving directory '/tmp/ruby/build/trunk/ext/psych' I, [2024-05-14T07:32:24.924042 #1268856] INFO -- : make[2]: Entering directory '/tmp/ruby/build/trunk/ext/pty' I, [2024-05-14T07:32:24.928119 #1268856] INFO -- : make[2]: Leaving directory '/tmp/ruby/build/trunk/ext/pty' I, [2024-05-14T07:32:24.942339 #1268856] INFO -- : make[2]: Entering directory '/tmp/ruby/build/trunk/ext/ripper' I, [2024-05-14T07:32:24.950331 #1268856] INFO -- : make[2]: Leaving directory '/tmp/ruby/build/trunk/ext/ripper' I, [2024-05-14T07:32:24.952873 #1268856] INFO -- : make[2]: Entering directory '/tmp/ruby/build/trunk/ext/rubyvm' I, [2024-05-14T07:32:24.956099 #1268856] INFO -- : make[2]: Leaving directory '/tmp/ruby/build/trunk/ext/rubyvm' I, [2024-05-14T07:32:24.969091 #1268856] INFO -- : make[2]: Entering directory '/tmp/ruby/build/trunk/ext/socket' I, [2024-05-14T07:32:24.977466 #1268856] INFO -- : make[2]: Leaving directory '/tmp/ruby/build/trunk/ext/socket' I, [2024-05-14T07:32:24.995710 #1268856] INFO -- : make[2]: Entering directory '/tmp/ruby/build/trunk/.bundle/gems/bigdecimal-3.1.8/ext/bigdecimal' I, [2024-05-14T07:32:25.022210 #1268856] INFO -- : make[2]: Leaving directory '/tmp/ruby/build/trunk/.bundle/gems/bigdecimal-3.1.8/ext/bigdecimal' I, [2024-05-14T07:32:25.024366 #1268856] INFO -- : make[2]: Entering directory '/tmp/ruby/build/trunk/.bundle/gems/debug-1.9.2/ext/debug' I, [2024-05-14T07:32:25.046938 #1268856] INFO -- : make[2]: Leaving directory '/tmp/ruby/build/trunk/.bundle/gems/debug-1.9.2/ext/debug' I, [2024-05-14T07:32:25.048880 #1268856] INFO -- : make[2]: Entering directory '/tmp/ruby/build/trunk/.bundle/gems/nkf-0.2.0/ext/nkf' I, [2024-05-14T07:32:25.073789 #1268856] INFO -- : make[2]: Leaving directory '/tmp/ruby/build/trunk/.bundle/gems/nkf-0.2.0/ext/nkf' I, [2024-05-14T07:32:25.076793 #1268856] INFO -- : make[2]: Entering directory '/tmp/ruby/build/trunk/.bundle/gems/racc-1.7.3/ext/racc/cparse' I, [2024-05-14T07:32:25.104912 #1268856] INFO -- : make[2]: Leaving directory '/tmp/ruby/build/trunk/.bundle/gems/racc-1.7.3/ext/racc/cparse' I, [2024-05-14T07:32:25.107327 #1268856] INFO -- : make[2]: Entering directory '/tmp/ruby/build/trunk/.bundle/gems/rbs-3.4.4/ext/rbs_extension' I, [2024-05-14T07:32:25.128953 #1268856] INFO -- : make[2]: Leaving directory '/tmp/ruby/build/trunk/.bundle/gems/rbs-3.4.4/ext/rbs_extension' I, [2024-05-14T07:32:25.130932 #1268856] INFO -- : make[2]: Entering directory '/tmp/ruby/build/trunk/.bundle/gems/syslog-0.1.2/ext/syslog' I, [2024-05-14T07:32:25.152635 #1268856] INFO -- : make[2]: Leaving directory '/tmp/ruby/build/trunk/.bundle/gems/syslog-0.1.2/ext/syslog' I, [2024-05-14T07:32:25.175999 #1268856] INFO -- : make[2]: Entering directory '/tmp/ruby/build/trunk' I, [2024-05-14T07:32:25.251442 #1268856] INFO -- : make[2]: 'ruby' is up to date. I, [2024-05-14T07:32:25.251479 #1268856] INFO -- : make[2]: Leaving directory '/tmp/ruby/build/trunk' I, [2024-05-14T07:32:25.251873 #1268856] INFO -- : make[1]: Leaving directory '/tmp/ruby/build/trunk' I, [2024-05-14T07:32:25.255305 #1268856] INFO -- : make[1]: Entering directory '/tmp/ruby/build/trunk' I, [2024-05-14T07:32:25.255325 #1268856] INFO -- : make[1]: Nothing to be done for 'note'. I, [2024-05-14T07:32:25.255331 #1268856] INFO -- : make[1]: Leaving directory '/tmp/ruby/build/trunk' E, [2024-05-14T07:32:25.314071 #1268856] ERROR -- : $ /tmp/ruby/build/trunk/miniruby -I/tmp/ruby/src/trunk/lib /tmp/ruby/src/trunk/tool/runruby.rb --archdir=/tmp/ruby/build/trunk --extout=.ext -- /tmp/ruby/src/trunk/spec/mspec/bin/mspec-run -B /tmp/ruby/src/trunk/spec/default.mspec --error-output stderr --debug -fy -o /tmp/rubytest.5q9brs/1-mspec-multi-0 E, [2024-05-14T07:32:25.314296 #1268856] ERROR -- : $ /tmp/ruby/build/trunk/miniruby -I/tmp/ruby/src/trunk/lib /tmp/ruby/src/trunk/tool/runruby.rb --archdir=/tmp/ruby/build/trunk --extout=.ext -- /tmp/ruby/src/trunk/spec/mspec/bin/mspec-run -B /tmp/ruby/src/trunk/spec/default.mspec --error-output stderr --debug -fy -o /tmp/rubytest.5q9brs/2-mspec-multi-1 E, [2024-05-14T07:32:25.314557 #1268856] ERROR -- : $ /tmp/ruby/build/trunk/miniruby -I/tmp/ruby/src/trunk/lib /tmp/ruby/src/trunk/tool/runruby.rb --archdir=/tmp/ruby/build/trunk --extout=.ext -- /tmp/ruby/src/trunk/spec/mspec/bin/mspec-run -B /tmp/ruby/src/trunk/spec/default.mspec --error-output stderr --debug -fy -o /tmp/rubytest.5q9brs/3-mspec-multi-2 E, [2024-05-14T07:32:25.314837 #1268856] ERROR -- : $ /tmp/ruby/build/trunk/miniruby -I/tmp/ruby/src/trunk/lib /tmp/ruby/src/trunk/tool/runruby.rb --archdir=/tmp/ruby/build/trunk --extout=.ext -- /tmp/ruby/src/trunk/spec/mspec/bin/mspec-run -B /tmp/ruby/src/trunk/spec/default.mspec --error-output stderr --debug -fy -o /tmp/rubytest.5q9brs/4-mspec-multi-3 E, [2024-05-14T07:32:25.315119 #1268856] ERROR -- : $ /tmp/ruby/build/trunk/miniruby -I/tmp/ruby/src/trunk/lib /tmp/ruby/src/trunk/tool/runruby.rb --archdir=/tmp/ruby/build/trunk --extout=.ext -- /tmp/ruby/src/trunk/spec/mspec/bin/mspec-run -B /tmp/ruby/src/trunk/spec/default.mspec --error-output stderr --debug -fy -o /tmp/rubytest.5q9brs/5-mspec-multi-4 E, [2024-05-14T07:32:25.315237 #1268856] ERROR -- : $ /tmp/ruby/build/trunk/miniruby -I/tmp/ruby/src/trunk/lib /tmp/ruby/src/trunk/tool/runruby.rb --archdir=/tmp/ruby/build/trunk --extout=.ext -- /tmp/ruby/src/trunk/spec/mspec/bin/mspec-run -B /tmp/ruby/src/trunk/spec/default.mspec --error-output stderr --debug -fy -o /tmp/rubytest.5q9brs/6-mspec-multi-5 E, [2024-05-14T07:32:25.315599 #1268856] ERROR -- : $ /tmp/ruby/build/trunk/miniruby -I/tmp/ruby/src/trunk/lib /tmp/ruby/src/trunk/tool/runruby.rb --archdir=/tmp/ruby/build/trunk --extout=.ext -- /tmp/ruby/src/trunk/spec/mspec/bin/mspec-run -B /tmp/ruby/src/trunk/spec/default.mspec --error-output stderr --debug -fy -o /tmp/rubytest.5q9brs/7-mspec-multi-6 E, [2024-05-14T07:32:25.315785 #1268856] ERROR -- : $ /tmp/ruby/build/trunk/miniruby -I/tmp/ruby/src/trunk/lib /tmp/ruby/src/trunk/tool/runruby.rb --archdir=/tmp/ruby/build/trunk --extout=.ext -- /tmp/ruby/src/trunk/spec/mspec/bin/mspec-run -B /tmp/ruby/src/trunk/spec/default.mspec --error-output stderr --debug -fy -o /tmp/rubytest.5q9brs/8-mspec-multi-7 E, [2024-05-14T07:32:25.316053 #1268856] ERROR -- : $ /tmp/ruby/build/trunk/miniruby -I/tmp/ruby/src/trunk/lib /tmp/ruby/src/trunk/tool/runruby.rb --archdir=/tmp/ruby/build/trunk --extout=.ext -- /tmp/ruby/src/trunk/spec/mspec/bin/mspec-run -B /tmp/ruby/src/trunk/spec/default.mspec --error-output stderr --debug -fy -o /tmp/rubytest.5q9brs/9-mspec-multi-8 E, [2024-05-14T07:32:25.316271 #1268856] ERROR -- : $ /tmp/ruby/build/trunk/miniruby -I/tmp/ruby/src/trunk/lib /tmp/ruby/src/trunk/tool/runruby.rb --archdir=/tmp/ruby/build/trunk --extout=.ext -- /tmp/ruby/src/trunk/spec/mspec/bin/mspec-run -B /tmp/ruby/src/trunk/spec/default.mspec --error-output stderr --debug -fy -o /tmp/rubytest.5q9brs/10-mspec-multi-9 E, [2024-05-14T07:32:25.316606 #1268856] ERROR -- : $ /tmp/ruby/build/trunk/miniruby -I/tmp/ruby/src/trunk/lib /tmp/ruby/src/trunk/tool/runruby.rb --archdir=/tmp/ruby/build/trunk --extout=.ext -- /tmp/ruby/src/trunk/spec/mspec/bin/mspec-run -B /tmp/ruby/src/trunk/spec/default.mspec --error-output stderr --debug -fy -o /tmp/rubytest.5q9brs/11-mspec-multi-10 E, [2024-05-14T07:32:25.316802 #1268856] ERROR -- : $ /tmp/ruby/build/trunk/miniruby -I/tmp/ruby/src/trunk/lib /tmp/ruby/src/trunk/tool/runruby.rb --archdir=/tmp/ruby/build/trunk --extout=.ext -- /tmp/ruby/src/trunk/spec/mspec/bin/mspec-run -B /tmp/ruby/src/trunk/spec/default.mspec --error-output stderr --debug -fy -o /tmp/rubytest.5q9brs/12-mspec-multi-11 E, [2024-05-14T07:32:25.317008 #1268856] ERROR -- : $ /tmp/ruby/build/trunk/miniruby -I/tmp/ruby/src/trunk/lib /tmp/ruby/src/trunk/tool/runruby.rb --archdir=/tmp/ruby/build/trunk --extout=.ext -- /tmp/ruby/src/trunk/spec/mspec/bin/mspec-run -B /tmp/ruby/src/trunk/spec/default.mspec --error-output stderr --debug -fy -o /tmp/rubytest.5q9brs/13-mspec-multi-12 E, [2024-05-14T07:32:25.317222 #1268856] ERROR -- : $ /tmp/ruby/build/trunk/miniruby -I/tmp/ruby/src/trunk/lib /tmp/ruby/src/trunk/tool/runruby.rb --archdir=/tmp/ruby/build/trunk --extout=.ext -- /tmp/ruby/src/trunk/spec/mspec/bin/mspec-run -B /tmp/ruby/src/trunk/spec/default.mspec --error-output stderr --debug -fy -o /tmp/rubytest.5q9brs/14-mspec-multi-13 E, [2024-05-14T07:32:25.317335 #1268856] ERROR -- : $ /tmp/ruby/build/trunk/miniruby -I/tmp/ruby/src/trunk/lib /tmp/ruby/src/trunk/tool/runruby.rb --archdir=/tmp/ruby/build/trunk --extout=.ext -- /tmp/ruby/src/trunk/spec/mspec/bin/mspec-run -B /tmp/ruby/src/trunk/spec/default.mspec --error-output stderr --debug -fy -o /tmp/rubytest.5q9brs/15-mspec-multi-14 E, [2024-05-14T07:32:25.317583 #1268856] ERROR -- : $ /tmp/ruby/build/trunk/miniruby -I/tmp/ruby/src/trunk/lib /tmp/ruby/src/trunk/tool/runruby.rb --archdir=/tmp/ruby/build/trunk --extout=.ext -- /tmp/ruby/src/trunk/spec/mspec/bin/mspec-run -B /tmp/ruby/src/trunk/spec/default.mspec --error-output stderr --debug -fy -o /tmp/rubytest.5q9brs/16-mspec-multi-15 E, [2024-05-14T07:32:25.317744 #1268856] ERROR -- : $ /tmp/ruby/build/trunk/miniruby -I/tmp/ruby/src/trunk/lib /tmp/ruby/src/trunk/tool/runruby.rb --archdir=/tmp/ruby/build/trunk --extout=.ext -- /tmp/ruby/src/trunk/spec/mspec/bin/mspec-run -B /tmp/ruby/src/trunk/spec/default.mspec --error-output stderr --debug -fy -o /tmp/rubytest.5q9brs/17-mspec-multi-16 E, [2024-05-14T07:32:25.317923 #1268856] ERROR -- : $ /tmp/ruby/build/trunk/miniruby -I/tmp/ruby/src/trunk/lib /tmp/ruby/src/trunk/tool/runruby.rb --archdir=/tmp/ruby/build/trunk --extout=.ext -- /tmp/ruby/src/trunk/spec/mspec/bin/mspec-run -B /tmp/ruby/src/trunk/spec/default.mspec --error-output stderr --debug -fy -o /tmp/rubytest.5q9brs/18-mspec-multi-17 E, [2024-05-14T07:32:25.320421 #1268856] ERROR -- : $ /tmp/ruby/build/trunk/miniruby -I/tmp/ruby/src/trunk/lib /tmp/ruby/src/trunk/tool/runruby.rb --archdir=/tmp/ruby/build/trunk --extout=.ext -- /tmp/ruby/src/trunk/spec/mspec/bin/mspec-run -B /tmp/ruby/src/trunk/spec/default.mspec --error-output stderr --debug -fy -o /tmp/rubytest.5q9brs/19-mspec-multi-18 E, [2024-05-14T07:32:25.320751 #1268856] ERROR -- : $ /tmp/ruby/build/trunk/miniruby -I/tmp/ruby/src/trunk/lib /tmp/ruby/src/trunk/tool/runruby.rb --archdir=/tmp/ruby/build/trunk --extout=.ext -- /tmp/ruby/src/trunk/spec/mspec/bin/mspec-run -B /tmp/ruby/src/trunk/spec/default.mspec --error-output stderr --debug -fy -o /tmp/rubytest.5q9brs/20-mspec-multi-19 I, [2024-05-14T07:32:25.489792 #1268856] INFO -- : ruby 3.4.0dev (2024-05-14T06:43:28Z master b60f09442a) [x86_64-linux] I, [2024-05-14T07:32:26.104101 #1268856] INFO -- : 0 ......................................................................... I, [2024-05-14T07:32:26.476783 #1268856] INFO -- : 73 ......................................................................... I, [2024-05-14T07:32:26.626534 #1268856] INFO -- : 146 ......................................................................... I, [2024-05-14T07:32:26.677874 #1268856] INFO -- : 219 ......................................................................... I, [2024-05-14T07:32:26.728183 #1268856] INFO -- : 292 ......................................................................... I, [2024-05-14T07:32:26.775250 #1268856] INFO -- : 365 ......................................................................... I, [2024-05-14T07:32:26.797861 #1268856] INFO -- : 438 ......................................................................... I, [2024-05-14T07:32:26.819327 #1268856] INFO -- : 511 ......................................................................... I, [2024-05-14T07:32:26.841032 #1268856] INFO -- : 584 ......................................................................... I, [2024-05-14T07:32:26.893715 #1268856] INFO -- : 657 ......................................................................... I, [2024-05-14T07:32:26.915801 #1268856] INFO -- : 730 ......................................................................... I, [2024-05-14T07:32:26.938146 #1268856] INFO -- : 803 ......................................................................... I, [2024-05-14T07:32:26.970382 #1268856] INFO -- : 876 ......................................................................... I, [2024-05-14T07:32:27.018756 #1268856] INFO -- : 949 ......................................................................... I, [2024-05-14T07:32:27.100762 #1268856] INFO -- : 1022 ......................................................................... I, [2024-05-14T07:32:27.280972 #1268856] INFO -- : 1095 ......................................................................... I, [2024-05-14T07:32:27.402182 #1268856] INFO -- : 1168 ......................................................................... I, [2024-05-14T07:32:27.456631 #1268856] INFO -- : 1241 ......................................................................... I, [2024-05-14T07:32:27.508124 #1268856] INFO -- : 1314 ......................................................................... I, [2024-05-14T07:32:27.524146 #1268856] INFO -- : 1387 ......................................................................... I, [2024-05-14T07:32:27.617176 #1268856] INFO -- : 1460 ......................................................................... I, [2024-05-14T07:32:28.059810 #1268856] INFO -- : 1533 ......................................................................... I, [2024-05-14T07:32:28.131723 #1268856] INFO -- : 1606 ......................................................................... I, [2024-05-14T07:32:28.235225 #1268856] INFO -- : 1679 ......................................................................... I, [2024-05-14T07:32:28.358715 #1268856] INFO -- : 1752 ......................................................................... I, [2024-05-14T07:32:28.463381 #1268856] INFO -- : 1825 ......................................................................... I, [2024-05-14T07:32:28.559253 #1268856] INFO -- : 1898 ......................................................................... I, [2024-05-14T07:32:28.637719 #1268856] INFO -- : 1971 ......................................................................... I, [2024-05-14T07:32:28.707838 #1268856] INFO -- : 2044 ......................................................................... I, [2024-05-14T07:32:28.753659 #1268856] INFO -- : 2117 ......................................................................... I, [2024-05-14T07:32:28.769898 #1268856] INFO -- : 2190 ......................................................................... I, [2024-05-14T07:32:28.786720 #1268856] INFO -- : 2263 ......................................................................... I, [2024-05-14T07:32:28.801892 #1268856] INFO -- : 2336 ......................................................................... I, [2024-05-14T07:32:28.843651 #1268856] INFO -- : 2409 ......................................................................... I, [2024-05-14T07:32:28.943132 #1268856] INFO -- : 2482 ......................................................................... I, [2024-05-14T07:32:28.968817 #1268856] INFO -- : 2555 ......................................................................... I, [2024-05-14T07:32:29.085273 #1268856] INFO -- : 2628 ......................................................................... I, [2024-05-14T07:32:29.169063 #1268856] INFO -- : 2701 ......................................................................... I, [2024-05-14T07:32:29.202773 #1268856] INFO -- : 2774 ......................................................................... I, [2024-05-14T07:32:29.262151 #1268856] INFO -- : 2847 ......................................................................... I, [2024-05-14T07:32:29.294643 #1268856] INFO -- : 2920 ......................................................................... I, [2024-05-14T07:32:29.316955 #1268856] INFO -- : 2993 ......................................................................... I, [2024-05-14T07:32:29.339147 #1268856] INFO -- : 3066 ......................................................................... I, [2024-05-14T07:32:29.351847 #1268856] INFO -- : 3139 ......................................................................... I, [2024-05-14T07:32:29.361229 #1268856] INFO -- : 3212 ......................................................................... I, [2024-05-14T07:32:29.388042 #1268856] INFO -- : 3285 ......................................................................... I, [2024-05-14T07:32:33.360866 #1268856] INFO -- : 3358 ........................................................................ I, [2024-05-14T07:32:33.360909 #1268856] INFO -- : I, [2024-05-14T07:32:33.360915 #1268856] INFO -- : Finished in 8.046038 seconds I, [2024-05-14T07:32:33.360919 #1268856] INFO -- : I, [2024-05-14T07:32:33.360923 #1268856] INFO -- : 3429 files, 32611 examples, 189878 expectations, 0 failures, 0 errors, 0 tagged I, [2024-05-14T07:32:33.362857 #1268856] INFO -- : $$$[end] "make yes-test-rubyspec MSPECOPT='--error-output stderr --debug -j' TESTS='-j20'" exit with 0.