# Logfile created on 2024-05-14 01:22:18 +0000 by logger.rb/v1.4.3 I, [2024-05-14T01:22:18.651880 #830162] INFO -- : #, @formatter=nil, @logdev=#, @binmode=false, @mon_data=#, @mon_data_owner_object_id=860>>> I, [2024-05-14T01:22:18.652003 #830162] INFO -- : $$$[beg] make update-unicode -j20 I, [2024-05-14T01:22:18.710675 #830162] INFO -- : Downloading Unicode emoji 15.0 files... I, [2024-05-14T01:22:18.710948 #830162] INFO -- : Downloading Unicode emoji 15.0 files... I, [2024-05-14T01:22:18.711654 #830162] INFO -- : Downloading Unicode emoji 15.0 files... I, [2024-05-14T01:22:18.757107 #830162] INFO -- : made symlink emoji/15.0/emoji-sequences.txt to /tmp/ruby/src/trunk/.downloaded-cache/emoji/15.0/emoji-sequences.txt I, [2024-05-14T01:22:18.757684 #830162] INFO -- : downloading emoji/15.0/emoji-test.txt ... /tmp/ruby/src/trunk/enc/unicode/data/emoji/15.0/emoji-sequences.txt already exists I, [2024-05-14T01:22:18.757826 #830162] INFO -- : downloading emoji/15.0/emoji-test.txt ... /tmp/ruby/src/trunk/enc/unicode/data/emoji/15.0/emoji-sequences.txt already exists E, [2024-05-14T01:22:19.215660 #830162] ERROR -- : /tmp/ruby/src/trunk/tool/downloader.rb:302:in `rescue in download': failed to download emoji/15.0/emoji-test.txt (RuntimeError) E, [2024-05-14T01:22:19.215822 #830162] ERROR -- : OpenURI::HTTPError: 403 Forbidden: https://www.unicode.org/Public/emoji/15.0/emoji-test.txt E, [2024-05-14T01:22:19.215841 #830162] ERROR -- : from /tmp/ruby/src/trunk/tool/downloader.rb:201:in `download' E, [2024-05-14T01:22:19.215855 #830162] ERROR -- : from /tmp/ruby/src/trunk/tool/downloader.rb:136:in `download' E, [2024-05-14T01:22:19.215868 #830162] ERROR -- : from /tmp/ruby/src/trunk/tool/downloader.rb:482:in `block in
' E, [2024-05-14T01:22:19.215881 #830162] ERROR -- : from /tmp/ruby/src/trunk/tool/downloader.rb:465:in `each' E, [2024-05-14T01:22:19.215897 #830162] ERROR -- : from /tmp/ruby/src/trunk/tool/downloader.rb:465:in `
' E, [2024-05-14T01:22:19.215908 #830162] ERROR -- : /usr/lib/ruby/3.0.0/open-uri.rb:364:in `open_http': 403 Forbidden (OpenURI::HTTPError) E, [2024-05-14T01:22:19.215919 #830162] ERROR -- : from /usr/lib/ruby/3.0.0/open-uri.rb:741:in `buffer_open' E, [2024-05-14T01:22:19.215939 #830162] ERROR -- : from /usr/lib/ruby/3.0.0/open-uri.rb:212:in `block in open_loop' E, [2024-05-14T01:22:19.215950 #830162] ERROR -- : from /usr/lib/ruby/3.0.0/open-uri.rb:210:in `catch' E, [2024-05-14T01:22:19.215960 #830162] ERROR -- : from /usr/lib/ruby/3.0.0/open-uri.rb:210:in `open_loop' E, [2024-05-14T01:22:19.215971 #830162] ERROR -- : from /usr/lib/ruby/3.0.0/open-uri.rb:151:in `open_uri' E, [2024-05-14T01:22:19.215981 #830162] ERROR -- : from /usr/lib/ruby/3.0.0/open-uri.rb:721:in `open' E, [2024-05-14T01:22:19.215992 #830162] ERROR -- : from /usr/lib/ruby/3.0.0/open-uri.rb:729:in `read' E, [2024-05-14T01:22:19.216020 #830162] ERROR -- : from /tmp/ruby/src/trunk/tool/downloader.rb:247:in `block in download' E, [2024-05-14T01:22:19.216032 #830162] ERROR -- : from /tmp/ruby/src/trunk/tool/downloader.rb:378:in `with_retry' E, [2024-05-14T01:22:19.216042 #830162] ERROR -- : from /tmp/ruby/src/trunk/tool/downloader.rb:246:in `download' E, [2024-05-14T01:22:19.216056 #830162] ERROR -- : from /tmp/ruby/src/trunk/tool/downloader.rb:136:in `download' E, [2024-05-14T01:22:19.216067 #830162] ERROR -- : from /tmp/ruby/src/trunk/tool/downloader.rb:482:in `block in
' E, [2024-05-14T01:22:19.216078 #830162] ERROR -- : from /tmp/ruby/src/trunk/tool/downloader.rb:465:in `each' E, [2024-05-14T01:22:19.216088 #830162] ERROR -- : from /tmp/ruby/src/trunk/tool/downloader.rb:465:in `
' E, [2024-05-14T01:22:19.218502 #830162] ERROR -- : /tmp/ruby/src/trunk/tool/downloader.rb:302:in `rescue in download': failed to download emoji/15.0/emoji-test.txt (RuntimeError) E, [2024-05-14T01:22:19.218578 #830162] ERROR -- : OpenURI::HTTPError: 403 Forbidden: https://www.unicode.org/Public/emoji/15.0/emoji-test.txt E, [2024-05-14T01:22:19.218594 #830162] ERROR -- : from /tmp/ruby/src/trunk/tool/downloader.rb:201:in `download' E, [2024-05-14T01:22:19.218614 #830162] ERROR -- : from /tmp/ruby/src/trunk/tool/downloader.rb:136:in `download' E, [2024-05-14T01:22:19.218624 #830162] ERROR -- : from /tmp/ruby/src/trunk/tool/downloader.rb:482:in `block in
' E, [2024-05-14T01:22:19.218634 #830162] ERROR -- : from /tmp/ruby/src/trunk/tool/downloader.rb:465:in `each' E, [2024-05-14T01:22:19.218644 #830162] ERROR -- : from /tmp/ruby/src/trunk/tool/downloader.rb:465:in `
' E, [2024-05-14T01:22:19.218653 #830162] ERROR -- : /usr/lib/ruby/3.0.0/open-uri.rb:364:in `open_http': 403 Forbidden (OpenURI::HTTPError) E, [2024-05-14T01:22:19.218663 #830162] ERROR -- : from /usr/lib/ruby/3.0.0/open-uri.rb:741:in `buffer_open' E, [2024-05-14T01:22:19.218672 #830162] ERROR -- : from /usr/lib/ruby/3.0.0/open-uri.rb:212:in `block in open_loop' E, [2024-05-14T01:22:19.218681 #830162] ERROR -- : from /usr/lib/ruby/3.0.0/open-uri.rb:210:in `catch' E, [2024-05-14T01:22:19.218694 #830162] ERROR -- : from /usr/lib/ruby/3.0.0/open-uri.rb:210:in `open_loop' E, [2024-05-14T01:22:19.218704 #830162] ERROR -- : from /usr/lib/ruby/3.0.0/open-uri.rb:151:in `open_uri' E, [2024-05-14T01:22:19.218713 #830162] ERROR -- : from /usr/lib/ruby/3.0.0/open-uri.rb:721:in `open' E, [2024-05-14T01:22:19.218722 #830162] ERROR -- : from /usr/lib/ruby/3.0.0/open-uri.rb:729:in `read' E, [2024-05-14T01:22:19.218732 #830162] ERROR -- : from /tmp/ruby/src/trunk/tool/downloader.rb:247:in `block in download' E, [2024-05-14T01:22:19.218741 #830162] ERROR -- : from /tmp/ruby/src/trunk/tool/downloader.rb:378:in `with_retry' E, [2024-05-14T01:22:19.218750 #830162] ERROR -- : from /tmp/ruby/src/trunk/tool/downloader.rb:246:in `download' E, [2024-05-14T01:22:19.218759 #830162] ERROR -- : from /tmp/ruby/src/trunk/tool/downloader.rb:136:in `download' E, [2024-05-14T01:22:19.218769 #830162] ERROR -- : from /tmp/ruby/src/trunk/tool/downloader.rb:482:in `block in
' E, [2024-05-14T01:22:19.218781 #830162] ERROR -- : from /tmp/ruby/src/trunk/tool/downloader.rb:465:in `each' E, [2024-05-14T01:22:19.218790 #830162] ERROR -- : from /tmp/ruby/src/trunk/tool/downloader.rb:465:in `
' E, [2024-05-14T01:22:19.220149 #830162] ERROR -- : make: *** [uncommon.mk:1765: /tmp/ruby/src/trunk/enc/unicode/data/emoji/15.0/emoji-test.txt] Error 1 E, [2024-05-14T01:22:19.220201 #830162] ERROR -- : make: *** Waiting for unfinished jobs.... E, [2024-05-14T01:22:19.222203 #830162] ERROR -- : make: *** [uncommon.mk:1765: /tmp/ruby/src/trunk/enc/unicode/data/emoji/15.0/emoji-sequences.txt] Error 1 E, [2024-05-14T01:22:19.222254 #830162] ERROR -- : make: *** Deleting file '/tmp/ruby/src/trunk/enc/unicode/data/emoji/15.0/emoji-sequences.txt' E, [2024-05-14T01:22:19.255266 #830162] ERROR -- : /tmp/ruby/src/trunk/tool/downloader.rb:302:in `rescue in download': failed to download emoji/15.0/emoji-test.txt (RuntimeError) E, [2024-05-14T01:22:19.255382 #830162] ERROR -- : OpenURI::HTTPError: 403 Forbidden: https://www.unicode.org/Public/emoji/15.0/emoji-test.txt E, [2024-05-14T01:22:19.255405 #830162] ERROR -- : from /tmp/ruby/src/trunk/tool/downloader.rb:201:in `download' E, [2024-05-14T01:22:19.255419 #830162] ERROR -- : from /tmp/ruby/src/trunk/tool/downloader.rb:136:in `download' E, [2024-05-14T01:22:19.255432 #830162] ERROR -- : from /tmp/ruby/src/trunk/tool/downloader.rb:482:in `block in
' E, [2024-05-14T01:22:19.255444 #830162] ERROR -- : from /tmp/ruby/src/trunk/tool/downloader.rb:465:in `each' E, [2024-05-14T01:22:19.255457 #830162] ERROR -- : from /tmp/ruby/src/trunk/tool/downloader.rb:465:in `
' E, [2024-05-14T01:22:19.255470 #830162] ERROR -- : /usr/lib/ruby/3.0.0/open-uri.rb:364:in `open_http': 403 Forbidden (OpenURI::HTTPError) E, [2024-05-14T01:22:19.255488 #830162] ERROR -- : from /usr/lib/ruby/3.0.0/open-uri.rb:741:in `buffer_open' E, [2024-05-14T01:22:19.255502 #830162] ERROR -- : from /usr/lib/ruby/3.0.0/open-uri.rb:212:in `block in open_loop' E, [2024-05-14T01:22:19.255515 #830162] ERROR -- : from /usr/lib/ruby/3.0.0/open-uri.rb:210:in `catch' E, [2024-05-14T01:22:19.255528 #830162] ERROR -- : from /usr/lib/ruby/3.0.0/open-uri.rb:210:in `open_loop' E, [2024-05-14T01:22:19.255540 #830162] ERROR -- : from /usr/lib/ruby/3.0.0/open-uri.rb:151:in `open_uri' E, [2024-05-14T01:22:19.255802 #830162] ERROR -- : from /usr/lib/ruby/3.0.0/open-uri.rb:721:in `open' E, [2024-05-14T01:22:19.255823 #830162] ERROR -- : from /usr/lib/ruby/3.0.0/open-uri.rb:729:in `read' E, [2024-05-14T01:22:19.255836 #830162] ERROR -- : from /tmp/ruby/src/trunk/tool/downloader.rb:247:in `block in download' E, [2024-05-14T01:22:19.255852 #830162] ERROR -- : from /tmp/ruby/src/trunk/tool/downloader.rb:378:in `with_retry' E, [2024-05-14T01:22:19.255864 #830162] ERROR -- : from /tmp/ruby/src/trunk/tool/downloader.rb:246:in `download' E, [2024-05-14T01:22:19.255877 #830162] ERROR -- : from /tmp/ruby/src/trunk/tool/downloader.rb:136:in `download' E, [2024-05-14T01:22:19.255890 #830162] ERROR -- : from /tmp/ruby/src/trunk/tool/downloader.rb:482:in `block in
' E, [2024-05-14T01:22:19.255903 #830162] ERROR -- : from /tmp/ruby/src/trunk/tool/downloader.rb:465:in `each' E, [2024-05-14T01:22:19.255920 #830162] ERROR -- : from /tmp/ruby/src/trunk/tool/downloader.rb:465:in `
' E, [2024-05-14T01:22:19.260095 #830162] ERROR -- : make: *** [uncommon.mk:1765: /tmp/ruby/src/trunk/enc/unicode/data/emoji/15.0/emoji-zwj-sequences.txt] Error 1 I, [2024-05-14T01:22:19.260267 #830162] INFO -- : downloading emoji/15.0/emoji-test.txt ... I, [2024-05-14T01:22:19.260973 #830162] INFO -- : $$$[end] "make update-unicode -j20" exit with 512. I, [2024-05-14T01:22:19.261048 #830162] INFO -- : $$$[beg] make update-download -j20 I, [2024-05-14T01:22:19.372315 #830162] INFO -- : tool/config.guess already exists I, [2024-05-14T01:22:19.372361 #830162] INFO -- : tool/config.sub already exists I, [2024-05-14T01:22:19.374636 #830162] INFO -- : Update minitest to ea9caafc0754b1d6236a490d59e624b53209734a I, [2024-05-14T01:22:19.374846 #830162] INFO -- : Update power_assert to 84e85124c5014a139af39161d484156cfe87a9ed I, [2024-05-14T01:22:19.375329 #830162] INFO -- : Update rbs to ba7872795d5de04adb8ff500c0e6afdc81a041dd I, [2024-05-14T01:22:19.375694 #830162] INFO -- : Update typeprof to b19a6416da3a05d57fadd6ffdadb382b6d236ca5 I, [2024-05-14T01:22:19.375821 #830162] INFO -- : echo ea9caafc0754b1d6236a490d59e624b53209734a | /bin/sh /tmp/ruby/src/trunk/tool/ifchange /tmp/ruby/src/trunk/.bundle/.timestamp/minitest.revision - I, [2024-05-14T01:22:19.376284 #830162] INFO -- : echo 84e85124c5014a139af39161d484156cfe87a9ed | /bin/sh /tmp/ruby/src/trunk/tool/ifchange /tmp/ruby/src/trunk/.bundle/.timestamp/power_assert.revision - I, [2024-05-14T01:22:19.376876 #830162] INFO -- : echo ba7872795d5de04adb8ff500c0e6afdc81a041dd | /bin/sh /tmp/ruby/src/trunk/tool/ifchange /tmp/ruby/src/trunk/.bundle/.timestamp/rbs.revision - I, [2024-05-14T01:22:19.377386 #830162] INFO -- : echo b19a6416da3a05d57fadd6ffdadb382b6d236ca5 | /bin/sh /tmp/ruby/src/trunk/tool/ifchange /tmp/ruby/src/trunk/.bundle/.timestamp/typeprof.revision - I, [2024-05-14T01:22:19.378089 #830162] INFO -- : /tmp/ruby/src/trunk/.bundle/.timestamp/minitest.revision unchanged I, [2024-05-14T01:22:19.378370 #830162] INFO -- : /tmp/ruby/src/trunk/.bundle/.timestamp/power_assert.revision unchanged I, [2024-05-14T01:22:19.378807 #830162] INFO -- : /tmp/ruby/src/trunk/.bundle/.timestamp/rbs.revision unchanged I, [2024-05-14T01:22:19.379305 #830162] INFO -- : /tmp/ruby/src/trunk/.bundle/.timestamp/typeprof.revision unchanged I, [2024-05-14T01:22:19.379452 #830162] INFO -- : Building power_assert@84e85124c5014a139af39161d484156cfe87a9ed to /tmp/ruby/src/trunk/gems/power_assert-2.0.3.gem I, [2024-05-14T01:22:19.448461 #830162] INFO -- : Successfully built RubyGem I, [2024-05-14T01:22:19.448527 #830162] INFO -- : Name: power_assert I, [2024-05-14T01:22:19.448553 #830162] INFO -- : Version: 2.0.4dev I, [2024-05-14T01:22:19.448569 #830162] INFO -- : File: power_assert-2.0.4dev.gem I, [2024-05-14T01:22:19.495098 #830162] INFO -- : $$$[end] "make update-download -j20" exit with 0. I, [2024-05-14T01:22:19.495154 #830162] INFO -- : $$$[beg] make update-rubyspec -j20 I, [2024-05-14T01:22:19.553173 #830162] INFO -- : make: Nothing to be done for 'update-rubyspec'. I, [2024-05-14T01:22:19.553500 #830162] INFO -- : $$$[end] "make update-rubyspec -j20" exit with 0. I, [2024-05-14T01:22:19.553532 #830162] INFO -- : $$$[beg] make update-src -j20 I, [2024-05-14T01:22:20.109411 #830162] INFO -- : Already up to date. I, [2024-05-14T01:22:20.126525 #830162] INFO -- : Latest commit hash = 5319587ac3 I, [2024-05-14T01:22:20.128157 #830162] INFO -- : $$$[end] "make update-src -j20" exit with 0. I, [2024-05-14T01:22:20.128229 #830162] INFO -- : $$$[beg] make after-update -j20 I, [2024-05-14T01:22:20.213387 #830162] INFO -- : generating /tmp/ruby/src/trunk/ext/ripper/eventids2table.c I, [2024-05-14T01:22:20.217675 #830162] INFO -- : make[1]: Entering directory '/tmp/ruby/src/trunk/ext/ripper' I, [2024-05-14T01:22:20.217697 #830162] INFO -- : make[1]: Nothing to be done for 'src'. I, [2024-05-14T01:22:20.217703 #830162] INFO -- : make[1]: Leaving directory '/tmp/ruby/src/trunk/ext/ripper' I, [2024-05-14T01:22:20.233588 #830162] INFO -- : /tmp/ruby/src/trunk/revision.h updated I, [2024-05-14T01:22:20.234885 #830162] INFO -- : generating x86_64-linux-fake.rb I, [2024-05-14T01:22:20.286041 #830162] INFO -- : x86_64-linux-fake.rb updated I, [2024-05-14T01:22:20.287237 #830162] INFO -- : generating enc.mk I, [2024-05-14T01:22:20.402950 #830162] INFO -- : making srcs under enc I, [2024-05-14T01:22:20.432563 #830162] INFO -- : make[1]: Entering directory '/tmp/ruby/build/trunk' I, [2024-05-14T01:22:20.432586 #830162] INFO -- : make[1]: Nothing to be done for 'srcs'. I, [2024-05-14T01:22:20.432591 #830162] INFO -- : make[1]: Leaving directory '/tmp/ruby/build/trunk' I, [2024-05-14T01:22:20.476908 #830162] INFO -- : Update minitest to ea9caafc0754b1d6236a490d59e624b53209734a I, [2024-05-14T01:22:20.477142 #830162] INFO -- : Update power_assert to 84e85124c5014a139af39161d484156cfe87a9ed I, [2024-05-14T01:22:20.477890 #830162] INFO -- : Update rbs to ba7872795d5de04adb8ff500c0e6afdc81a041dd I, [2024-05-14T01:22:20.478113 #830162] INFO -- : Update typeprof to b19a6416da3a05d57fadd6ffdadb382b6d236ca5 I, [2024-05-14T01:22:20.478607 #830162] INFO -- : echo ea9caafc0754b1d6236a490d59e624b53209734a | /bin/sh /tmp/ruby/src/trunk/tool/ifchange /tmp/ruby/src/trunk/.bundle/.timestamp/minitest.revision - I, [2024-05-14T01:22:20.478773 #830162] INFO -- : echo 84e85124c5014a139af39161d484156cfe87a9ed | /bin/sh /tmp/ruby/src/trunk/tool/ifchange /tmp/ruby/src/trunk/.bundle/.timestamp/power_assert.revision - I, [2024-05-14T01:22:20.480099 #830162] INFO -- : echo b19a6416da3a05d57fadd6ffdadb382b6d236ca5 | /bin/sh /tmp/ruby/src/trunk/tool/ifchange /tmp/ruby/src/trunk/.bundle/.timestamp/typeprof.revision - I, [2024-05-14T01:22:20.480244 #830162] INFO -- : echo ba7872795d5de04adb8ff500c0e6afdc81a041dd | /bin/sh /tmp/ruby/src/trunk/tool/ifchange /tmp/ruby/src/trunk/.bundle/.timestamp/rbs.revision - I, [2024-05-14T01:22:20.480418 #830162] INFO -- : /tmp/ruby/src/trunk/.bundle/.timestamp/minitest.revision unchanged I, [2024-05-14T01:22:20.480656 #830162] INFO -- : /tmp/ruby/src/trunk/.bundle/.timestamp/power_assert.revision unchanged I, [2024-05-14T01:22:20.481852 #830162] INFO -- : Building power_assert@84e85124c5014a139af39161d484156cfe87a9ed to /tmp/ruby/src/trunk/gems/power_assert-2.0.3.gem I, [2024-05-14T01:22:20.481875 #830162] INFO -- : /tmp/ruby/src/trunk/.bundle/.timestamp/rbs.revision unchanged I, [2024-05-14T01:22:20.482038 #830162] INFO -- : /tmp/ruby/src/trunk/.bundle/.timestamp/typeprof.revision unchanged I, [2024-05-14T01:22:20.551043 #830162] INFO -- : Successfully built RubyGem I, [2024-05-14T01:22:20.551099 #830162] INFO -- : Name: power_assert I, [2024-05-14T01:22:20.551117 #830162] INFO -- : Version: 2.0.4dev I, [2024-05-14T01:22:20.551128 #830162] INFO -- : File: power_assert-2.0.4dev.gem I, [2024-05-14T01:22:20.553359 #830162] INFO -- : Extracting bundle gem power_assert-2.0.3... I, [2024-05-14T01:22:20.614109 #830162] INFO -- : Try with hash version of bundled gems instead of gems/power_assert-2.0.3.gem. We don't use this gem with release version of Ruby. I, [2024-05-14T01:22:20.619018 #830162] INFO -- : Unpacked gems/power_assert-2.0.4dev.gem I, [2024-05-14T01:22:20.620761 #830162] INFO -- : $$$[end] "make after-update -j20" exit with 0. I, [2024-05-14T01:22:20.620938 #830162] INFO -- : $$$[beg] make miniruby -j20 I, [2024-05-14T01:22:20.678161 #830162] INFO -- : BASERUBY = /usr/bin/ruby --disable=gems I, [2024-05-14T01:22:20.678207 #830162] INFO -- : CC = gcc I, [2024-05-14T01:22:20.678223 #830162] INFO -- : LD = ld I, [2024-05-14T01:22:20.678236 #830162] INFO -- : LDSHARED = gcc -shared I, [2024-05-14T01:22:20.678249 #830162] INFO -- : CFLAGS = -O3 -fno-fast-math -ggdb3 -Wall -Wextra -Wdeprecated-declarations -Wdiv-by-zero -Wduplicated-cond -Wimplicit-function-declaration -Wimplicit-int -Wpointer-arith -Wwrite-strings -Wold-style-definition -Wimplicit-fallthrough=0 -Wmissing-noreturn -Wno-cast-function-type -Wno-constant-logical-operand -Wno-long-long -Wno-missing-field-initializers -Wno-overlength-strings -Wno-packed-bitfield-compat -Wno-parentheses-equality -Wno-self-assign -Wno-tautological-compare -Wno-unused-parameter -Wno-unused-value -Wsuggest-attribute=format -Wsuggest-attribute=noreturn -Wunused-variable -Wmisleading-indentation -Wundef -fPIC I, [2024-05-14T01:22:20.678262 #830162] INFO -- : XCFLAGS = -U_FORTIFY_SOURCE -D_FORTIFY_SOURCE=2 -fstack-protector-strong -fno-strict-overflow -fvisibility=hidden -fexcess-precision=standard -DRUBY_EXPORT -I. -I.ext/include/x86_64-linux -I/tmp/ruby/src/trunk/include -I/tmp/ruby/src/trunk -I/tmp/ruby/src/trunk/prism -I/tmp/ruby/src/trunk/enc/unicode/15.0.0 I, [2024-05-14T01:22:20.678275 #830162] INFO -- : CPPFLAGS = I, [2024-05-14T01:22:20.678287 #830162] INFO -- : DLDFLAGS = -Wl,--compress-debug-sections=zlib -Wl,-soname,libruby.so.3.4 -fstack-protector-strong I, [2024-05-14T01:22:20.678299 #830162] INFO -- : SOLIBS = -lz -lrt -lrt -lgmp -ldl -lcrypt -lm -lpthread I, [2024-05-14T01:22:20.678311 #830162] INFO -- : LANG = en_US.UTF-8 I, [2024-05-14T01:22:20.678322 #830162] INFO -- : LC_ALL = I, [2024-05-14T01:22:20.678334 #830162] INFO -- : LC_CTYPE = I, [2024-05-14T01:22:20.678345 #830162] INFO -- : MFLAGS = -j20 --jobserver-auth=4,5 I, [2024-05-14T01:22:20.678357 #830162] INFO -- : RUSTC = no I, [2024-05-14T01:22:20.678368 #830162] INFO -- : YJIT_RUSTC_ARGS = --crate-name=yjit --crate-type=staticlib --edition=2021 -g -C lto=thin -C opt-level=3 -C overflow-checks=on '--out-dir=/tmp/ruby/build/trunk/yjit/target/release/' /tmp/ruby/src/trunk/yjit/src/lib.rs I, [2024-05-14T01:22:20.679910 #830162] INFO -- : gcc (Ubuntu 11.4.0-1ubuntu1~22.04) 11.4.0 I, [2024-05-14T01:22:20.679976 #830162] INFO -- : Copyright (C) 2021 Free Software Foundation, Inc. I, [2024-05-14T01:22:20.679995 #830162] INFO -- : This is free software; see the source for copying conditions. There is NO I, [2024-05-14T01:22:20.680010 #830162] INFO -- : warranty; not even for MERCHANTABILITY or FITNESS FOR A PARTICULAR PURPOSE. I, [2024-05-14T01:22:20.680024 #830162] INFO -- : I, [2024-05-14T01:22:20.703769 #830162] INFO -- : compiling /tmp/ruby/src/trunk/version.c I, [2024-05-14T01:22:20.806206 #830162] INFO -- : linking miniruby I, [2024-05-14T01:22:21.355977 #830162] INFO -- : $$$[end] "make miniruby -j20" exit with 0. I, [2024-05-14T01:22:21.356097 #830162] INFO -- : $$$[beg] make ruby -j20 I, [2024-05-14T01:22:21.420263 #830162] INFO -- : BASERUBY = /usr/bin/ruby --disable=gems I, [2024-05-14T01:22:21.420313 #830162] INFO -- : CC = gcc I, [2024-05-14T01:22:21.420329 #830162] INFO -- : LD = ld I, [2024-05-14T01:22:21.420352 #830162] INFO -- : LDSHARED = gcc -shared I, [2024-05-14T01:22:21.420367 #830162] INFO -- : CFLAGS = -O3 -fno-fast-math -ggdb3 -Wall -Wextra -Wdeprecated-declarations -Wdiv-by-zero -Wduplicated-cond -Wimplicit-function-declaration -Wimplicit-int -Wpointer-arith -Wwrite-strings -Wold-style-definition -Wimplicit-fallthrough=0 -Wmissing-noreturn -Wno-cast-function-type -Wno-constant-logical-operand -Wno-long-long -Wno-missing-field-initializers -Wno-overlength-strings -Wno-packed-bitfield-compat -Wno-parentheses-equality -Wno-self-assign -Wno-tautological-compare -Wno-unused-parameter -Wno-unused-value -Wsuggest-attribute=format -Wsuggest-attribute=noreturn -Wunused-variable -Wmisleading-indentation -Wundef -fPIC I, [2024-05-14T01:22:21.420382 #830162] INFO -- : XCFLAGS = -U_FORTIFY_SOURCE -D_FORTIFY_SOURCE=2 -fstack-protector-strong -fno-strict-overflow -fvisibility=hidden -fexcess-precision=standard -DRUBY_EXPORT -I. -I.ext/include/x86_64-linux -I/tmp/ruby/src/trunk/include -I/tmp/ruby/src/trunk -I/tmp/ruby/src/trunk/prism -I/tmp/ruby/src/trunk/enc/unicode/15.0.0 I, [2024-05-14T01:22:21.420396 #830162] INFO -- : CPPFLAGS = I, [2024-05-14T01:22:21.420410 #830162] INFO -- : DLDFLAGS = -Wl,--compress-debug-sections=zlib -Wl,-soname,libruby.so.3.4 -fstack-protector-strong I, [2024-05-14T01:22:21.420423 #830162] INFO -- : SOLIBS = -lz -lrt -lrt -lgmp -ldl -lcrypt -lm -lpthread I, [2024-05-14T01:22:21.420436 #830162] INFO -- : LANG = en_US.UTF-8 I, [2024-05-14T01:22:21.420449 #830162] INFO -- : LC_ALL = I, [2024-05-14T01:22:21.420462 #830162] INFO -- : LC_CTYPE = I, [2024-05-14T01:22:21.420475 #830162] INFO -- : MFLAGS = -j20 --jobserver-auth=4,5 I, [2024-05-14T01:22:21.420488 #830162] INFO -- : RUSTC = no I, [2024-05-14T01:22:21.420501 #830162] INFO -- : YJIT_RUSTC_ARGS = --crate-name=yjit --crate-type=staticlib --edition=2021 -g -C lto=thin -C opt-level=3 -C overflow-checks=on '--out-dir=/tmp/ruby/build/trunk/yjit/target/release/' /tmp/ruby/src/trunk/yjit/src/lib.rs I, [2024-05-14T01:22:21.422585 #830162] INFO -- : gcc (Ubuntu 11.4.0-1ubuntu1~22.04) 11.4.0 I, [2024-05-14T01:22:21.422634 #830162] INFO -- : Copyright (C) 2021 Free Software Foundation, Inc. I, [2024-05-14T01:22:21.422651 #830162] INFO -- : This is free software; see the source for copying conditions. There is NO I, [2024-05-14T01:22:21.422666 #830162] INFO -- : warranty; not even for MERCHANTABILITY or FITNESS FOR A PARTICULAR PURPOSE. I, [2024-05-14T01:22:21.422679 #830162] INFO -- : I, [2024-05-14T01:22:21.535196 #830162] INFO -- : builtin_binary.inc updated I, [2024-05-14T01:22:21.539639 #830162] INFO -- : c5234a9416e4f20f175185e840b25b0f08674d14078ed7083f37e655458e3ca9 builtin_binary.inc I, [2024-05-14T01:22:21.540399 #830162] INFO -- : compiling /tmp/ruby/src/trunk/builtin.c I, [2024-05-14T01:22:21.723030 #830162] INFO -- : linking static-library libruby-static.a I, [2024-05-14T01:22:22.028917 #830162] INFO -- : linking shared-library libruby.so.3.4.0 I, [2024-05-14T01:22:23.564214 #830162] INFO -- : linking ruby I, [2024-05-14T01:22:23.590743 #830162] INFO -- : $$$[end] "make ruby -j20" exit with 0. I, [2024-05-14T01:22:23.590911 #830162] INFO -- : $$$[beg] make all -j20 I, [2024-05-14T01:22:23.656009 #830162] INFO -- : BASERUBY = /usr/bin/ruby --disable=gems I, [2024-05-14T01:22:23.656070 #830162] INFO -- : CC = gcc I, [2024-05-14T01:22:23.656087 #830162] INFO -- : LD = ld I, [2024-05-14T01:22:23.656101 #830162] INFO -- : LDSHARED = gcc -shared I, [2024-05-14T01:22:23.656116 #830162] INFO -- : CFLAGS = -O3 -fno-fast-math -ggdb3 -Wall -Wextra -Wdeprecated-declarations -Wdiv-by-zero -Wduplicated-cond -Wimplicit-function-declaration -Wimplicit-int -Wpointer-arith -Wwrite-strings -Wold-style-definition -Wimplicit-fallthrough=0 -Wmissing-noreturn -Wno-cast-function-type -Wno-constant-logical-operand -Wno-long-long -Wno-missing-field-initializers -Wno-overlength-strings -Wno-packed-bitfield-compat -Wno-parentheses-equality -Wno-self-assign -Wno-tautological-compare -Wno-unused-parameter -Wno-unused-value -Wsuggest-attribute=format -Wsuggest-attribute=noreturn -Wunused-variable -Wmisleading-indentation -Wundef -fPIC I, [2024-05-14T01:22:23.656134 #830162] INFO -- : XCFLAGS = -U_FORTIFY_SOURCE -D_FORTIFY_SOURCE=2 -fstack-protector-strong -fno-strict-overflow -fvisibility=hidden -fexcess-precision=standard -DRUBY_EXPORT -I. -I.ext/include/x86_64-linux -I/tmp/ruby/src/trunk/include -I/tmp/ruby/src/trunk -I/tmp/ruby/src/trunk/prism -I/tmp/ruby/src/trunk/enc/unicode/15.0.0 I, [2024-05-14T01:22:23.656149 #830162] INFO -- : CPPFLAGS = I, [2024-05-14T01:22:23.656163 #830162] INFO -- : DLDFLAGS = -Wl,--compress-debug-sections=zlib -Wl,-soname,libruby.so.3.4 -fstack-protector-strong I, [2024-05-14T01:22:23.656177 #830162] INFO -- : SOLIBS = -lz -lrt -lrt -lgmp -ldl -lcrypt -lm -lpthread I, [2024-05-14T01:22:23.656191 #830162] INFO -- : LANG = en_US.UTF-8 I, [2024-05-14T01:22:23.656204 #830162] INFO -- : LC_ALL = I, [2024-05-14T01:22:23.656217 #830162] INFO -- : LC_CTYPE = I, [2024-05-14T01:22:23.656231 #830162] INFO -- : MFLAGS = -j20 --jobserver-auth=4,5 I, [2024-05-14T01:22:23.656244 #830162] INFO -- : RUSTC = no I, [2024-05-14T01:22:23.656261 #830162] INFO -- : YJIT_RUSTC_ARGS = --crate-name=yjit --crate-type=staticlib --edition=2021 -g -C lto=thin -C opt-level=3 -C overflow-checks=on '--out-dir=/tmp/ruby/build/trunk/yjit/target/release/' /tmp/ruby/src/trunk/yjit/src/lib.rs I, [2024-05-14T01:22:23.658290 #830162] INFO -- : gcc (Ubuntu 11.4.0-1ubuntu1~22.04) 11.4.0 I, [2024-05-14T01:22:23.658348 #830162] INFO -- : Copyright (C) 2021 Free Software Foundation, Inc. I, [2024-05-14T01:22:23.658365 #830162] INFO -- : This is free software; see the source for copying conditions. There is NO I, [2024-05-14T01:22:23.658381 #830162] INFO -- : warranty; not even for MERCHANTABILITY or FITNESS FOR A PARTICULAR PURPOSE. I, [2024-05-14T01:22:23.658396 #830162] INFO -- : I, [2024-05-14T01:22:23.692722 #830162] INFO -- : generating enc.mk I, [2024-05-14T01:22:23.694664 #830162] INFO -- : building spec/ruby/optional/capi/ext/array_spec.so I, [2024-05-14T01:22:23.694986 #830162] INFO -- : building spec/ruby/optional/capi/ext/basic_object_spec.so I, [2024-05-14T01:22:23.695703 #830162] INFO -- : building spec/ruby/optional/capi/ext/bignum_spec.so I, [2024-05-14T01:22:23.696262 #830162] INFO -- : building spec/ruby/optional/capi/ext/binding_spec.so I, [2024-05-14T01:22:23.696414 #830162] INFO -- : building spec/ruby/optional/capi/ext/boolean_spec.so I, [2024-05-14T01:22:23.697492 #830162] INFO -- : building spec/ruby/optional/capi/ext/class_id_under_autoload_spec.so I, [2024-05-14T01:22:23.698268 #830162] INFO -- : building spec/ruby/optional/capi/ext/class_spec.so I, [2024-05-14T01:22:23.698734 #830162] INFO -- : building spec/ruby/optional/capi/ext/class_under_autoload_spec.so I, [2024-05-14T01:22:23.700042 #830162] INFO -- : building spec/ruby/optional/capi/ext/complex_spec.so I, [2024-05-14T01:22:23.701470 #830162] INFO -- : building spec/ruby/optional/capi/ext/constants_spec.so I, [2024-05-14T01:22:23.702343 #830162] INFO -- : building spec/ruby/optional/capi/ext/data_spec.so I, [2024-05-14T01:22:23.703057 #830162] INFO -- : building spec/ruby/optional/capi/ext/debug_spec.so I, [2024-05-14T01:22:23.703442 #830162] INFO -- : building spec/ruby/optional/capi/ext/encoding_spec.so I, [2024-05-14T01:22:23.704010 #830162] INFO -- : building spec/ruby/optional/capi/ext/enumerator_spec.so I, [2024-05-14T01:22:23.704259 #830162] INFO -- : building spec/ruby/optional/capi/ext/exception_spec.so I, [2024-05-14T01:22:23.705015 #830162] INFO -- : building spec/ruby/optional/capi/ext/fiber_spec.so I, [2024-05-14T01:22:23.705280 #830162] INFO -- : building spec/ruby/optional/capi/ext/file_spec.so I, [2024-05-14T01:22:23.705886 #830162] INFO -- : building spec/ruby/optional/capi/ext/fixnum_spec.so I, [2024-05-14T01:22:23.708092 #830162] INFO -- : building spec/ruby/optional/capi/ext/float_spec.so I, [2024-05-14T01:22:23.829279 #830162] INFO -- : building spec/ruby/optional/capi/ext/gc_spec.so I, [2024-05-14T01:22:23.833490 #830162] INFO -- : building spec/ruby/optional/capi/ext/globals_spec.so I, [2024-05-14T01:22:23.843059 #830162] INFO -- : building spec/ruby/optional/capi/ext/hash_spec.so I, [2024-05-14T01:22:23.851496 #830162] INFO -- : building spec/ruby/optional/capi/ext/integer_spec.so I, [2024-05-14T01:22:23.852273 #830162] INFO -- : building spec/ruby/optional/capi/ext/io_spec.so I, [2024-05-14T01:22:23.854304 #830162] INFO -- : building spec/ruby/optional/capi/ext/kernel_spec.so I, [2024-05-14T01:22:23.856912 #830162] INFO -- : building spec/ruby/optional/capi/ext/language_spec.so I, [2024-05-14T01:22:23.857475 #830162] INFO -- : building spec/ruby/optional/capi/ext/marshal_spec.so I, [2024-05-14T01:22:23.860558 #830162] INFO -- : building spec/ruby/optional/capi/ext/module_spec.so I, [2024-05-14T01:22:23.863451 #830162] INFO -- : building spec/ruby/optional/capi/ext/module_under_autoload_spec.so I, [2024-05-14T01:22:23.870339 #830162] INFO -- : building spec/ruby/optional/capi/ext/mutex_spec.so I, [2024-05-14T01:22:23.891818 #830162] INFO -- : building spec/ruby/optional/capi/ext/numeric_spec.so I, [2024-05-14T01:22:23.895938 #830162] INFO -- : building spec/ruby/optional/capi/ext/object_spec.so I, [2024-05-14T01:22:23.896384 #830162] INFO -- : building spec/ruby/optional/capi/ext/proc_spec.so I, [2024-05-14T01:22:23.897255 #830162] INFO -- : building spec/ruby/optional/capi/ext/range_spec.so I, [2024-05-14T01:22:23.898175 #830162] INFO -- : building spec/ruby/optional/capi/ext/rational_spec.so I, [2024-05-14T01:22:23.942834 #830162] INFO -- : building spec/ruby/optional/capi/ext/rbasic_spec.so I, [2024-05-14T01:22:23.969624 #830162] INFO -- : building spec/ruby/optional/capi/ext/regexp_spec.so I, [2024-05-14T01:22:23.994942 #830162] INFO -- : building spec/ruby/optional/capi/ext/string_spec.so I, [2024-05-14T01:22:23.997524 #830162] INFO -- : building spec/ruby/optional/capi/ext/struct_spec.so I, [2024-05-14T01:22:23.999289 #830162] INFO -- : building spec/ruby/optional/capi/ext/st_spec.so I, [2024-05-14T01:22:24.007735 #830162] INFO -- : building spec/ruby/optional/capi/ext/symbol_spec.so I, [2024-05-14T01:22:24.009045 #830162] INFO -- : building spec/ruby/optional/capi/ext/thread_spec.so I, [2024-05-14T01:22:24.011817 #830162] INFO -- : building spec/ruby/optional/capi/ext/time_spec.so I, [2024-05-14T01:22:24.020541 #830162] INFO -- : building spec/ruby/optional/capi/ext/tracepoint_spec.so I, [2024-05-14T01:22:24.027905 #830162] INFO -- : building spec/ruby/optional/capi/ext/typed_data_spec.so I, [2024-05-14T01:22:24.041978 #830162] INFO -- : building spec/ruby/optional/capi/ext/util_spec.so I, [2024-05-14T01:22:24.064393 #830162] INFO -- : making enc I, [2024-05-14T01:22:24.068961 #830162] INFO -- : making srcs under enc I, [2024-05-14T01:22:24.091051 #830162] INFO -- : make[1]: Entering directory '/tmp/ruby/build/trunk' I, [2024-05-14T01:22:24.091113 #830162] INFO -- : make[1]: Nothing to be done for 'enc'. I, [2024-05-14T01:22:24.091121 #830162] INFO -- : make[1]: Leaving directory '/tmp/ruby/build/trunk' I, [2024-05-14T01:22:24.117189 #830162] INFO -- : make[1]: Entering directory '/tmp/ruby/build/trunk' I, [2024-05-14T01:22:24.117251 #830162] INFO -- : make[1]: Nothing to be done for 'srcs'. I, [2024-05-14T01:22:24.117259 #830162] INFO -- : make[1]: Leaving directory '/tmp/ruby/build/trunk' I, [2024-05-14T01:22:24.117876 #830162] INFO -- : generating transdb.h I, [2024-05-14T01:22:24.240596 #830162] INFO -- : transdb.h unchanged I, [2024-05-14T01:22:24.242346 #830162] INFO -- : generating makefiles ext/configure-ext.mk I, [2024-05-14T01:22:24.242496 #830162] INFO -- : making trans I, [2024-05-14T01:22:24.268398 #830162] INFO -- : ext/configure-ext.mk updated I, [2024-05-14T01:22:24.271099 #830162] INFO -- : make[1]: Entering directory '/tmp/ruby/build/trunk' I, [2024-05-14T01:22:24.277327 #830162] INFO -- : make[1]: Entering directory '/tmp/ruby/build/trunk' I, [2024-05-14T01:22:24.277419 #830162] INFO -- : make[1]: Nothing to be done for 'trans'. I, [2024-05-14T01:22:24.277429 #830162] INFO -- : make[1]: Leaving directory '/tmp/ruby/build/trunk' I, [2024-05-14T01:22:24.338555 #830162] INFO -- : making encs I, [2024-05-14T01:22:24.401634 #830162] INFO -- : make[1]: Entering directory '/tmp/ruby/build/trunk' I, [2024-05-14T01:22:24.401682 #830162] INFO -- : make[1]: Nothing to be done for 'encs'. I, [2024-05-14T01:22:24.401687 #830162] INFO -- : make[1]: Leaving directory '/tmp/ruby/build/trunk' I, [2024-05-14T01:22:24.430256 #830162] INFO -- : make[1]: Leaving directory '/tmp/ruby/build/trunk' I, [2024-05-14T01:22:24.431255 #830162] INFO -- : generating makefile exts.mk I, [2024-05-14T01:22:24.468116 #830162] INFO -- : exts.mk unchanged I, [2024-05-14T01:22:24.473089 #830162] INFO -- : make[1]: Entering directory '/tmp/ruby/build/trunk' I, [2024-05-14T01:22:24.491002 #830162] INFO -- : make[2]: Entering directory '/tmp/ruby/build/trunk/ext/digest' I, [2024-05-14T01:22:24.493392 #830162] INFO -- : make[2]: Entering directory '/tmp/ruby/build/trunk/ext/coverage' I, [2024-05-14T01:22:24.493441 #830162] INFO -- : make[2]: Entering directory '/tmp/ruby/build/trunk/ext/json' I, [2024-05-14T01:22:24.493452 #830162] INFO -- : make[2]: Entering directory '/tmp/ruby/build/trunk/ext/date' I, [2024-05-14T01:22:24.493644 #830162] INFO -- : make[2]: Entering directory '/tmp/ruby/build/trunk/ext/io/console' I, [2024-05-14T01:22:24.494691 #830162] INFO -- : make[2]: Entering directory '/tmp/ruby/build/trunk/ext/monitor' I, [2024-05-14T01:22:24.494781 #830162] INFO -- : make[2]: Entering directory '/tmp/ruby/build/trunk/ext/rubyvm' I, [2024-05-14T01:22:24.495384 #830162] INFO -- : make[2]: Entering directory '/tmp/ruby/build/trunk/ext/pathname' I, [2024-05-14T01:22:24.495750 #830162] INFO -- : make[2]: Entering directory '/tmp/ruby/build/trunk/ext/pty' I, [2024-05-14T01:22:24.495884 #830162] INFO -- : make[2]: Entering directory '/tmp/ruby/build/trunk/ext/fiddle' I, [2024-05-14T01:22:24.496060 #830162] INFO -- : make[2]: Leaving directory '/tmp/ruby/build/trunk/ext/digest' I, [2024-05-14T01:22:24.496417 #830162] INFO -- : make[2]: Leaving directory '/tmp/ruby/build/trunk/ext/io/console' I, [2024-05-14T01:22:24.496931 #830162] INFO -- : make[2]: Leaving directory '/tmp/ruby/build/trunk/ext/coverage' I, [2024-05-14T01:22:24.497157 #830162] INFO -- : make[2]: Entering directory '/tmp/ruby/build/trunk/ext/objspace' I, [2024-05-14T01:22:24.497182 #830162] INFO -- : make[2]: Leaving directory '/tmp/ruby/build/trunk/ext/rubyvm' I, [2024-05-14T01:22:24.497249 #830162] INFO -- : make[2]: Leaving directory '/tmp/ruby/build/trunk/ext/monitor' I, [2024-05-14T01:22:24.497539 #830162] INFO -- : make[2]: Leaving directory '/tmp/ruby/build/trunk/ext/date' I, [2024-05-14T01:22:24.497940 #830162] INFO -- : make[2]: Entering directory '/tmp/ruby/build/trunk/ext/psych' I, [2024-05-14T01:22:24.498189 #830162] INFO -- : make[2]: Leaving directory '/tmp/ruby/build/trunk/ext/pathname' I, [2024-05-14T01:22:24.499111 #830162] INFO -- : make[2]: Leaving directory '/tmp/ruby/build/trunk/ext/pty' I, [2024-05-14T01:22:24.499187 #830162] INFO -- : make[2]: Entering directory '/tmp/ruby/build/trunk/.bundle/gems/debug-1.9.2/ext/debug' I, [2024-05-14T01:22:24.499222 #830162] INFO -- : make[2]: Entering directory '/tmp/ruby/build/trunk/.bundle/gems/bigdecimal-3.1.8/ext/bigdecimal' I, [2024-05-14T01:22:24.499439 #830162] INFO -- : make[2]: Entering directory '/tmp/ruby/build/trunk/.bundle/gems/racc-1.7.3/ext/racc/cparse' I, [2024-05-14T01:22:24.499464 #830162] INFO -- : make[2]: Leaving directory '/tmp/ruby/build/trunk/ext/json' I, [2024-05-14T01:22:24.499573 #830162] INFO -- : make[2]: Entering directory '/tmp/ruby/build/trunk/.bundle/gems/nkf-0.2.0/ext/nkf' I, [2024-05-14T01:22:24.500070 #830162] INFO -- : make[2]: Entering directory '/tmp/ruby/build/trunk/ext/ripper' I, [2024-05-14T01:22:24.500285 #830162] INFO -- : make[2]: Entering directory '/tmp/ruby/build/trunk/.bundle/gems/rbs-3.4.4/ext/rbs_extension' I, [2024-05-14T01:22:24.500416 #830162] INFO -- : make[2]: Entering directory '/tmp/ruby/build/trunk/.bundle/gems/syslog-0.1.2/ext/syslog' I, [2024-05-14T01:22:24.501517 #830162] INFO -- : make[2]: Leaving directory '/tmp/ruby/build/trunk/ext/objspace' I, [2024-05-14T01:22:24.504213 #830162] INFO -- : make[2]: Leaving directory '/tmp/ruby/build/trunk/ext/ripper' I, [2024-05-14T01:22:24.504833 #830162] INFO -- : make[2]: Entering directory '/tmp/ruby/build/trunk/ext/digest/sha2' I, [2024-05-14T01:22:24.504856 #830162] INFO -- : make[2]: Entering directory '/tmp/ruby/build/trunk/ext/socket' I, [2024-05-14T01:22:24.505487 #830162] INFO -- : make[2]: Leaving directory '/tmp/ruby/build/trunk/ext/fiddle' I, [2024-05-14T01:22:24.507085 #830162] INFO -- : make[2]: Leaving directory '/tmp/ruby/build/trunk/ext/digest/sha2' I, [2024-05-14T01:22:24.508244 #830162] INFO -- : make[2]: Entering directory '/tmp/ruby/build/trunk/ext/openssl' I, [2024-05-14T01:22:24.511101 #830162] INFO -- : make[2]: Leaving directory '/tmp/ruby/build/trunk/ext/socket' I, [2024-05-14T01:22:24.514252 #830162] INFO -- : make[2]: Leaving directory '/tmp/ruby/build/trunk/ext/psych' I, [2024-05-14T01:22:24.520620 #830162] INFO -- : make[2]: Leaving directory '/tmp/ruby/build/trunk/ext/openssl' I, [2024-05-14T01:22:24.521332 #830162] INFO -- : make[2]: Leaving directory '/tmp/ruby/build/trunk/.bundle/gems/debug-1.9.2/ext/debug' I, [2024-05-14T01:22:24.521400 #830162] INFO -- : make[2]: Leaving directory '/tmp/ruby/build/trunk/.bundle/gems/bigdecimal-3.1.8/ext/bigdecimal' I, [2024-05-14T01:22:24.524483 #830162] INFO -- : make[2]: Leaving directory '/tmp/ruby/build/trunk/.bundle/gems/racc-1.7.3/ext/racc/cparse' I, [2024-05-14T01:22:24.527670 #830162] INFO -- : make[2]: Leaving directory '/tmp/ruby/build/trunk/.bundle/gems/rbs-3.4.4/ext/rbs_extension' I, [2024-05-14T01:22:24.531389 #830162] INFO -- : make[2]: Leaving directory '/tmp/ruby/build/trunk/.bundle/gems/nkf-0.2.0/ext/nkf' I, [2024-05-14T01:22:24.531707 #830162] INFO -- : make[2]: Leaving directory '/tmp/ruby/build/trunk/.bundle/gems/syslog-0.1.2/ext/syslog' I, [2024-05-14T01:22:24.555267 #830162] INFO -- : make[2]: Entering directory '/tmp/ruby/build/trunk' I, [2024-05-14T01:22:24.623226 #830162] INFO -- : linking ruby I, [2024-05-14T01:22:24.645470 #830162] INFO -- : make[2]: Leaving directory '/tmp/ruby/build/trunk' I, [2024-05-14T01:22:24.645846 #830162] INFO -- : make[1]: Leaving directory '/tmp/ruby/build/trunk' I, [2024-05-14T01:22:24.649664 #830162] INFO -- : make[1]: Entering directory '/tmp/ruby/build/trunk' I, [2024-05-14T01:22:24.649717 #830162] INFO -- : make[1]: Nothing to be done for 'note'. I, [2024-05-14T01:22:24.649730 #830162] INFO -- : make[1]: Leaving directory '/tmp/ruby/build/trunk' I, [2024-05-14T01:22:24.650602 #830162] INFO -- : $$$[end] "make all -j20" exit with 0. I, [2024-05-14T01:22:24.650784 #830162] INFO -- : $$$[beg] make install -j20 I, [2024-05-14T01:22:24.723104 #830162] INFO -- : Update minitest to ea9caafc0754b1d6236a490d59e624b53209734a I, [2024-05-14T01:22:24.723278 #830162] INFO -- : Update power_assert to 84e85124c5014a139af39161d484156cfe87a9ed I, [2024-05-14T01:22:24.724038 #830162] INFO -- : Update rbs to ba7872795d5de04adb8ff500c0e6afdc81a041dd I, [2024-05-14T01:22:24.724123 #830162] INFO -- : Update typeprof to b19a6416da3a05d57fadd6ffdadb382b6d236ca5 I, [2024-05-14T01:22:24.725084 #830162] INFO -- : echo ea9caafc0754b1d6236a490d59e624b53209734a | /bin/sh /tmp/ruby/src/trunk/tool/ifchange /tmp/ruby/src/trunk/.bundle/.timestamp/minitest.revision - I, [2024-05-14T01:22:24.725230 #830162] INFO -- : echo 84e85124c5014a139af39161d484156cfe87a9ed | /bin/sh /tmp/ruby/src/trunk/tool/ifchange /tmp/ruby/src/trunk/.bundle/.timestamp/power_assert.revision - I, [2024-05-14T01:22:24.726365 #830162] INFO -- : BASERUBY = /usr/bin/ruby --disable=gems I, [2024-05-14T01:22:24.726428 #830162] INFO -- : CC = gcc I, [2024-05-14T01:22:24.726446 #830162] INFO -- : LD = ld I, [2024-05-14T01:22:24.726462 #830162] INFO -- : LDSHARED = gcc -shared I, [2024-05-14T01:22:24.726477 #830162] INFO -- : CFLAGS = -O3 -fno-fast-math -ggdb3 -Wall -Wextra -Wdeprecated-declarations -Wdiv-by-zero -Wduplicated-cond -Wimplicit-function-declaration -Wimplicit-int -Wpointer-arith -Wwrite-strings -Wold-style-definition -Wimplicit-fallthrough=0 -Wmissing-noreturn -Wno-cast-function-type -Wno-constant-logical-operand -Wno-long-long -Wno-missing-field-initializers -Wno-overlength-strings -Wno-packed-bitfield-compat -Wno-parentheses-equality -Wno-self-assign -Wno-tautological-compare -Wno-unused-parameter -Wno-unused-value -Wsuggest-attribute=format -Wsuggest-attribute=noreturn -Wunused-variable -Wmisleading-indentation -Wundef -fPIC I, [2024-05-14T01:22:24.726494 #830162] INFO -- : XCFLAGS = -U_FORTIFY_SOURCE -D_FORTIFY_SOURCE=2 -fstack-protector-strong -fno-strict-overflow -fvisibility=hidden -fexcess-precision=standard -DRUBY_EXPORT -I. -I.ext/include/x86_64-linux -I/tmp/ruby/src/trunk/include -I/tmp/ruby/src/trunk -I/tmp/ruby/src/trunk/prism -I/tmp/ruby/src/trunk/enc/unicode/15.0.0 I, [2024-05-14T01:22:24.726508 #830162] INFO -- : CPPFLAGS = I, [2024-05-14T01:22:24.726522 #830162] INFO -- : DLDFLAGS = -Wl,--compress-debug-sections=zlib -Wl,-soname,libruby.so.3.4 -fstack-protector-strong I, [2024-05-14T01:22:24.726536 #830162] INFO -- : SOLIBS = -lz -lrt -lrt -lgmp -ldl -lcrypt -lm -lpthread I, [2024-05-14T01:22:24.726549 #830162] INFO -- : LANG = en_US.UTF-8 I, [2024-05-14T01:22:24.726572 #830162] INFO -- : LC_ALL = I, [2024-05-14T01:22:24.726588 #830162] INFO -- : LC_CTYPE = I, [2024-05-14T01:22:24.726602 #830162] INFO -- : MFLAGS = -j20 --jobserver-auth=4,5 I, [2024-05-14T01:22:24.726617 #830162] INFO -- : RUSTC = no I, [2024-05-14T01:22:24.726632 #830162] INFO -- : YJIT_RUSTC_ARGS = --crate-name=yjit --crate-type=staticlib --edition=2021 -g -C lto=thin -C opt-level=3 -C overflow-checks=on '--out-dir=/tmp/ruby/build/trunk/yjit/target/release/' /tmp/ruby/src/trunk/yjit/src/lib.rs I, [2024-05-14T01:22:24.727627 #830162] INFO -- : /tmp/ruby/src/trunk/.bundle/.timestamp/power_assert.revision unchanged I, [2024-05-14T01:22:24.727696 #830162] INFO -- : /tmp/ruby/src/trunk/.bundle/.timestamp/minitest.revision unchanged I, [2024-05-14T01:22:24.755990 #830162] INFO -- : echo ba7872795d5de04adb8ff500c0e6afdc81a041dd | /bin/sh /tmp/ruby/src/trunk/tool/ifchange /tmp/ruby/src/trunk/.bundle/.timestamp/rbs.revision - I, [2024-05-14T01:22:24.756164 #830162] INFO -- : echo b19a6416da3a05d57fadd6ffdadb382b6d236ca5 | /bin/sh /tmp/ruby/src/trunk/tool/ifchange /tmp/ruby/src/trunk/.bundle/.timestamp/typeprof.revision - I, [2024-05-14T01:22:24.756986 #830162] INFO -- : generating enc.mk I, [2024-05-14T01:22:24.757037 #830162] INFO -- : gcc (Ubuntu 11.4.0-1ubuntu1~22.04) 11.4.0 I, [2024-05-14T01:22:24.757050 #830162] INFO -- : Copyright (C) 2021 Free Software Foundation, Inc. I, [2024-05-14T01:22:24.757062 #830162] INFO -- : This is free software; see the source for copying conditions. There is NO I, [2024-05-14T01:22:24.757073 #830162] INFO -- : warranty; not even for MERCHANTABILITY or FITNESS FOR A PARTICULAR PURPOSE. I, [2024-05-14T01:22:24.757083 #830162] INFO -- : I, [2024-05-14T01:22:24.758146 #830162] INFO -- : /tmp/ruby/src/trunk/.bundle/.timestamp/rbs.revision unchanged I, [2024-05-14T01:22:24.758203 #830162] INFO -- : /tmp/ruby/src/trunk/.bundle/.timestamp/typeprof.revision unchanged I, [2024-05-14T01:22:24.877731 #830162] INFO -- : Building power_assert@84e85124c5014a139af39161d484156cfe87a9ed to /tmp/ruby/src/trunk/gems/power_assert-2.0.3.gem I, [2024-05-14T01:22:24.878348 #830162] INFO -- : making srcs under enc I, [2024-05-14T01:22:24.878421 #830162] INFO -- : making enc I, [2024-05-14T01:22:24.895370 #830162] INFO -- : make[1]: Entering directory '/tmp/ruby/build/trunk' I, [2024-05-14T01:22:24.895421 #830162] INFO -- : make[1]: Nothing to be done for 'enc'. I, [2024-05-14T01:22:24.895434 #830162] INFO -- : make[1]: Leaving directory '/tmp/ruby/build/trunk' I, [2024-05-14T01:22:24.907864 #830162] INFO -- : make[1]: Entering directory '/tmp/ruby/build/trunk' I, [2024-05-14T01:22:24.907924 #830162] INFO -- : make[1]: Nothing to be done for 'srcs'. I, [2024-05-14T01:22:24.907943 #830162] INFO -- : make[1]: Leaving directory '/tmp/ruby/build/trunk' I, [2024-05-14T01:22:24.908602 #830162] INFO -- : generating transdb.h I, [2024-05-14T01:22:24.947160 #830162] INFO -- : Successfully built RubyGem I, [2024-05-14T01:22:24.947218 #830162] INFO -- : Name: power_assert I, [2024-05-14T01:22:24.947231 #830162] INFO -- : Version: 2.0.4dev I, [2024-05-14T01:22:24.947243 #830162] INFO -- : File: power_assert-2.0.4dev.gem I, [2024-05-14T01:22:24.949417 #830162] INFO -- : Extracting bundle gem power_assert-2.0.3... I, [2024-05-14T01:22:25.005322 #830162] INFO -- : transdb.h unchanged I, [2024-05-14T01:22:25.006982 #830162] INFO -- : generating makefiles ext/configure-ext.mk I, [2024-05-14T01:22:25.007103 #830162] INFO -- : making trans I, [2024-05-14T01:22:25.010392 #830162] INFO -- : Try with hash version of bundled gems instead of gems/power_assert-2.0.3.gem. We don't use this gem with release version of Ruby. I, [2024-05-14T01:22:25.015369 #830162] INFO -- : Unpacked gems/power_assert-2.0.4dev.gem I, [2024-05-14T01:22:25.033684 #830162] INFO -- : ext/configure-ext.mk unchanged I, [2024-05-14T01:22:25.036010 #830162] INFO -- : make[1]: Entering directory '/tmp/ruby/build/trunk' I, [2024-05-14T01:22:25.042079 #830162] INFO -- : make[1]: Entering directory '/tmp/ruby/build/trunk' I, [2024-05-14T01:22:25.042185 #830162] INFO -- : make[1]: Nothing to be done for 'trans'. I, [2024-05-14T01:22:25.042218 #830162] INFO -- : make[1]: Leaving directory '/tmp/ruby/build/trunk' I, [2024-05-14T01:22:25.043420 #830162] INFO -- : making encs I, [2024-05-14T01:22:25.100476 #830162] INFO -- : make[1]: Entering directory '/tmp/ruby/build/trunk' I, [2024-05-14T01:22:25.100555 #830162] INFO -- : make[1]: Nothing to be done for 'encs'. I, [2024-05-14T01:22:25.100585 #830162] INFO -- : make[1]: Leaving directory '/tmp/ruby/build/trunk' I, [2024-05-14T01:22:25.188197 #830162] INFO -- : make[1]: Leaving directory '/tmp/ruby/build/trunk' I, [2024-05-14T01:22:25.188979 #830162] INFO -- : generating makefile exts.mk I, [2024-05-14T01:22:25.226023 #830162] INFO -- : exts.mk unchanged I, [2024-05-14T01:22:25.230739 #830162] INFO -- : make[1]: Entering directory '/tmp/ruby/build/trunk' I, [2024-05-14T01:22:25.248712 #830162] INFO -- : make[2]: Entering directory '/tmp/ruby/build/trunk/ext/digest' I, [2024-05-14T01:22:25.250133 #830162] INFO -- : make[2]: Entering directory '/tmp/ruby/build/trunk/ext/json' I, [2024-05-14T01:22:25.250384 #830162] INFO -- : make[2]: Entering directory '/tmp/ruby/build/trunk/ext/coverage' I, [2024-05-14T01:22:25.250927 #830162] INFO -- : make[2]: Entering directory '/tmp/ruby/build/trunk/ext/io/console' I, [2024-05-14T01:22:25.250956 #830162] INFO -- : make[2]: Entering directory '/tmp/ruby/build/trunk/ext/date' I, [2024-05-14T01:22:25.251330 #830162] INFO -- : make[2]: Entering directory '/tmp/ruby/build/trunk/ext/rubyvm' I, [2024-05-14T01:22:25.251960 #830162] INFO -- : make[2]: Entering directory '/tmp/ruby/build/trunk/ext/monitor' I, [2024-05-14T01:22:25.252701 #830162] INFO -- : make[2]: Entering directory '/tmp/ruby/build/trunk/ext/pathname' I, [2024-05-14T01:22:25.253195 #830162] INFO -- : make[2]: Entering directory '/tmp/ruby/build/trunk/ext/pty' I, [2024-05-14T01:22:25.253395 #830162] INFO -- : make[2]: Entering directory '/tmp/ruby/build/trunk/ext/fiddle' I, [2024-05-14T01:22:25.253897 #830162] INFO -- : make[2]: Leaving directory '/tmp/ruby/build/trunk/ext/rubyvm' I, [2024-05-14T01:22:25.254285 #830162] INFO -- : make[2]: Leaving directory '/tmp/ruby/build/trunk/ext/coverage' I, [2024-05-14T01:22:25.254308 #830162] INFO -- : make[2]: Leaving directory '/tmp/ruby/build/trunk/ext/io/console' I, [2024-05-14T01:22:25.254540 #830162] INFO -- : make[2]: Entering directory '/tmp/ruby/build/trunk/ext/objspace' I, [2024-05-14T01:22:25.255050 #830162] INFO -- : make[2]: Leaving directory '/tmp/ruby/build/trunk/ext/date' I, [2024-05-14T01:22:25.255072 #830162] INFO -- : make[2]: Entering directory '/tmp/ruby/build/trunk/ext/psych' I, [2024-05-14T01:22:25.255122 #830162] INFO -- : make[2]: Leaving directory '/tmp/ruby/build/trunk/ext/monitor' I, [2024-05-14T01:22:25.255649 #830162] INFO -- : make[2]: Leaving directory '/tmp/ruby/build/trunk/ext/digest' I, [2024-05-14T01:22:25.255859 #830162] INFO -- : make[2]: Leaving directory '/tmp/ruby/build/trunk/ext/pathname' I, [2024-05-14T01:22:25.256447 #830162] INFO -- : make[2]: Leaving directory '/tmp/ruby/build/trunk/ext/pty' I, [2024-05-14T01:22:25.256457 #830162] INFO -- : make[2]: Entering directory '/tmp/ruby/build/trunk/.bundle/gems/debug-1.9.2/ext/debug' I, [2024-05-14T01:22:25.256731 #830162] INFO -- : make[2]: Entering directory '/tmp/ruby/build/trunk/.bundle/gems/bigdecimal-3.1.8/ext/bigdecimal' I, [2024-05-14T01:22:25.257151 #830162] INFO -- : make[2]: Entering directory '/tmp/ruby/build/trunk/ext/ripper' I, [2024-05-14T01:22:25.257388 #830162] INFO -- : make[2]: Leaving directory '/tmp/ruby/build/trunk/ext/json' I, [2024-05-14T01:22:25.258907 #830162] INFO -- : make[2]: Entering directory '/tmp/ruby/build/trunk/.bundle/gems/nkf-0.2.0/ext/nkf' I, [2024-05-14T01:22:25.259073 #830162] INFO -- : make[2]: Entering directory '/tmp/ruby/build/trunk/.bundle/gems/racc-1.7.3/ext/racc/cparse' I, [2024-05-14T01:22:25.259100 #830162] INFO -- : make[2]: Leaving directory '/tmp/ruby/build/trunk/ext/objspace' I, [2024-05-14T01:22:25.259240 #830162] INFO -- : make[2]: Entering directory '/tmp/ruby/build/trunk/.bundle/gems/syslog-0.1.2/ext/syslog' I, [2024-05-14T01:22:25.259836 #830162] INFO -- : make[2]: Entering directory '/tmp/ruby/build/trunk/.bundle/gems/rbs-3.4.4/ext/rbs_extension' I, [2024-05-14T01:22:25.260569 #830162] INFO -- : make[2]: Leaving directory '/tmp/ruby/build/trunk/ext/fiddle' I, [2024-05-14T01:22:25.261045 #830162] INFO -- : make[2]: Entering directory '/tmp/ruby/build/trunk/ext/socket' I, [2024-05-14T01:22:25.262399 #830162] INFO -- : make[2]: Leaving directory '/tmp/ruby/build/trunk/ext/ripper' I, [2024-05-14T01:22:25.262474 #830162] INFO -- : make[2]: Entering directory '/tmp/ruby/build/trunk/ext/digest/sha2' I, [2024-05-14T01:22:25.264719 #830162] INFO -- : make[2]: Entering directory '/tmp/ruby/build/trunk/ext/openssl' I, [2024-05-14T01:22:25.264992 #830162] INFO -- : make[2]: Leaving directory '/tmp/ruby/build/trunk/ext/digest/sha2' I, [2024-05-14T01:22:25.267336 #830162] INFO -- : make[2]: Leaving directory '/tmp/ruby/build/trunk/ext/socket' I, [2024-05-14T01:22:25.267824 #830162] INFO -- : make[2]: Leaving directory '/tmp/ruby/build/trunk/ext/psych' I, [2024-05-14T01:22:25.275860 #830162] INFO -- : make[2]: Leaving directory '/tmp/ruby/build/trunk/ext/openssl' I, [2024-05-14T01:22:25.279962 #830162] INFO -- : make[2]: Leaving directory '/tmp/ruby/build/trunk/.bundle/gems/debug-1.9.2/ext/debug' I, [2024-05-14T01:22:25.281177 #830162] INFO -- : make[2]: Leaving directory '/tmp/ruby/build/trunk/.bundle/gems/nkf-0.2.0/ext/nkf' I, [2024-05-14T01:22:25.281210 #830162] INFO -- : make[2]: Leaving directory '/tmp/ruby/build/trunk/.bundle/gems/syslog-0.1.2/ext/syslog' I, [2024-05-14T01:22:25.284436 #830162] INFO -- : make[2]: Leaving directory '/tmp/ruby/build/trunk/.bundle/gems/racc-1.7.3/ext/racc/cparse' I, [2024-05-14T01:22:25.287296 #830162] INFO -- : make[2]: Leaving directory '/tmp/ruby/build/trunk/.bundle/gems/bigdecimal-3.1.8/ext/bigdecimal' I, [2024-05-14T01:22:25.287955 #830162] INFO -- : make[2]: Leaving directory '/tmp/ruby/build/trunk/.bundle/gems/rbs-3.4.4/ext/rbs_extension' I, [2024-05-14T01:22:25.311846 #830162] INFO -- : make[2]: Entering directory '/tmp/ruby/build/trunk' I, [2024-05-14T01:22:25.381475 #830162] INFO -- : make[2]: 'ruby' is up to date. I, [2024-05-14T01:22:25.381509 #830162] INFO -- : make[2]: Leaving directory '/tmp/ruby/build/trunk' I, [2024-05-14T01:22:25.381940 #830162] INFO -- : make[1]: Leaving directory '/tmp/ruby/build/trunk' I, [2024-05-14T01:22:25.385715 #830162] INFO -- : make[1]: Entering directory '/tmp/ruby/build/trunk' I, [2024-05-14T01:22:25.385737 #830162] INFO -- : make[1]: Nothing to be done for 'note'. I, [2024-05-14T01:22:25.385744 #830162] INFO -- : make[1]: Leaving directory '/tmp/ruby/build/trunk' I, [2024-05-14T01:22:25.386093 #830162] INFO -- : ./miniruby -I/tmp/ruby/src/trunk/lib -I. -I.ext/common /tmp/ruby/src/trunk/tool/runruby.rb --extout=.ext -- --disable-gems -r./x86_64-linux-fake /tmp/ruby/src/trunk/tool/rbinstall.rb --make="make" --dest-dir="" --extout=".ext" --ext-build-dir="./ext" --mflags="-j20 --jobserver-auth=4,5" --make-flags=" -j20 --jobserver-auth=4,5" --data-mode=0644 --prog-mode=0755 --installed-list .installed.list --mantype="doc" --gnumake --install=all --exclude=doc I, [2024-05-14T01:22:25.480031 #830162] INFO -- : Installing to I, [2024-05-14T01:22:25.480105 #830162] INFO -- : installing binary commands: /tmp/ruby/install/trunk/bin I, [2024-05-14T01:22:25.480119 #830162] INFO -- : installing base libraries: /tmp/ruby/install/trunk/lib I, [2024-05-14T01:22:25.487487 #830162] INFO -- : installing arch files: /tmp/ruby/install/trunk/lib/ruby/3.4.0+0/x86_64-linux I, [2024-05-14T01:22:25.487545 #830162] INFO -- : installing pkgconfig data: /tmp/ruby/install/trunk/lib/pkgconfig I, [2024-05-14T01:22:25.487566 #830162] INFO -- : installing extension objects: /tmp/ruby/install/trunk/lib/ruby/3.4.0+0/x86_64-linux I, [2024-05-14T01:22:25.496927 #830162] INFO -- : installing extension objects: /tmp/ruby/install/trunk/lib/ruby/site_ruby/3.4.0+0/x86_64-linux I, [2024-05-14T01:22:25.496986 #830162] INFO -- : installing extension objects: /tmp/ruby/install/trunk/lib/ruby/vendor_ruby/3.4.0+0/x86_64-linux I, [2024-05-14T01:22:25.496999 #830162] INFO -- : installing extension headers: /tmp/ruby/install/trunk/include/ruby-3.4.0+0/x86_64-linux I, [2024-05-14T01:22:25.497031 #830162] INFO -- : installing extension scripts: /tmp/ruby/install/trunk/lib/ruby/3.4.0+0 I, [2024-05-14T01:22:25.500857 #830162] INFO -- : installing extension scripts: /tmp/ruby/install/trunk/lib/ruby/site_ruby/3.4.0+0 I, [2024-05-14T01:22:25.500921 #830162] INFO -- : installing extension scripts: /tmp/ruby/install/trunk/lib/ruby/vendor_ruby/3.4.0+0 I, [2024-05-14T01:22:25.500935 #830162] INFO -- : installing extension headers: /tmp/ruby/install/trunk/include/ruby-3.4.0+0/ruby I, [2024-05-14T01:22:25.500946 #830162] INFO -- : installing command scripts: /tmp/ruby/install/trunk/bin I, [2024-05-14T01:22:25.500958 #830162] INFO -- : installing library scripts: /tmp/ruby/install/trunk/lib/ruby/3.4.0+0 I, [2024-05-14T01:22:25.534407 #830162] INFO -- : installing common headers: /tmp/ruby/install/trunk/include/ruby-3.4.0+0 I, [2024-05-14T01:22:25.539677 #830162] INFO -- : installing manpages: /tmp/ruby/install/trunk/share/man/man1 I, [2024-05-14T01:22:25.539752 #830162] INFO -- : installing default gems from lib: /tmp/ruby/install/trunk/lib/ruby/gems/3.4.0+0 I, [2024-05-14T01:22:25.562229 #830162] INFO -- : benchmark 0.3.0 I, [2024-05-14T01:22:25.569095 #830162] INFO -- : bundler 2.6.0.dev I, [2024-05-14T01:22:25.571193 #830162] INFO -- : cgi 0.4.1 I, [2024-05-14T01:22:25.571737 #830162] INFO -- : delegate 0.3.1 I, [2024-05-14T01:22:25.572153 #830162] INFO -- : did_you_mean 1.6.3 I, [2024-05-14T01:22:25.572657 #830162] INFO -- : english 0.8.0 I, [2024-05-14T01:22:25.573109 #830162] INFO -- : erb 4.0.4 I, [2024-05-14T01:22:25.573813 #830162] INFO -- : error_highlight 0.6.0 I, [2024-05-14T01:22:25.574282 #830162] INFO -- : fileutils 1.7.2 I, [2024-05-14T01:22:25.574737 #830162] INFO -- : find 0.2.0 I, [2024-05-14T01:22:25.575194 #830162] INFO -- : forwardable 1.3.3 I, [2024-05-14T01:22:25.575626 #830162] INFO -- : ipaddr 1.2.6 I, [2024-05-14T01:22:25.575954 #830162] INFO -- : irb 1.13.1 I, [2024-05-14T01:22:25.577386 #830162] INFO -- : logger 1.6.0 I, [2024-05-14T01:22:25.577964 #830162] INFO -- : net-http 0.4.1 I, [2024-05-14T01:22:25.578403 #830162] INFO -- : net-protocol 0.2.2 I, [2024-05-14T01:22:25.578975 #830162] INFO -- : open-uri 0.4.1 I, [2024-05-14T01:22:25.579473 #830162] INFO -- : open3 0.2.1 I, [2024-05-14T01:22:25.579965 #830162] INFO -- : optparse 0.5.0 I, [2024-05-14T01:22:25.580468 #830162] INFO -- : ostruct 0.6.0 I, [2024-05-14T01:22:25.580882 #830162] INFO -- : pp 0.5.0 I, [2024-05-14T01:22:25.581434 #830162] INFO -- : prettyprint 0.2.0 I, [2024-05-14T01:22:25.581821 #830162] INFO -- : prism 0.29.0 I, [2024-05-14T01:22:25.582390 #830162] INFO -- : pstore 0.1.3 I, [2024-05-14T01:22:25.582750 #830162] INFO -- : rdoc 6.6.3.1 I, [2024-05-14T01:22:25.584418 #830162] INFO -- : readline 0.0.4 I, [2024-05-14T01:22:25.584854 #830162] INFO -- : reline 0.5.6 I, [2024-05-14T01:22:25.585393 #830162] INFO -- : resolv 0.4.0 I, [2024-05-14T01:22:25.585838 #830162] INFO -- : ruby2_keywords 0.0.5 I, [2024-05-14T01:22:25.586404 #830162] INFO -- : securerandom 0.3.1 I, [2024-05-14T01:22:25.586842 #830162] INFO -- : set 1.1.0 I, [2024-05-14T01:22:25.587356 #830162] INFO -- : shellwords 0.2.0 I, [2024-05-14T01:22:25.587859 #830162] INFO -- : singleton 0.2.0 I, [2024-05-14T01:22:25.588299 #830162] INFO -- : syntax_suggest 2.0.0 I, [2024-05-14T01:22:25.588912 #830162] INFO -- : tempfile 0.2.1 I, [2024-05-14T01:22:25.589390 #830162] INFO -- : time 0.3.0 I, [2024-05-14T01:22:25.589893 #830162] INFO -- : timeout 0.4.1 I, [2024-05-14T01:22:25.591015 #830162] INFO -- : tmpdir 0.2.0 I, [2024-05-14T01:22:25.591528 #830162] INFO -- : tsort 0.2.0 I, [2024-05-14T01:22:25.591949 #830162] INFO -- : un 0.3.0 I, [2024-05-14T01:22:25.592494 #830162] INFO -- : uri 0.13.0 I, [2024-05-14T01:22:25.592996 #830162] INFO -- : weakref 0.1.3 I, [2024-05-14T01:22:25.593452 #830162] INFO -- : yaml 0.3.0 I, [2024-05-14T01:22:25.593762 #830162] INFO -- : installing default gems from ext: /tmp/ruby/install/trunk/lib/ruby/gems/3.4.0+0 I, [2024-05-14T01:22:25.600299 #830162] INFO -- : date 3.3.4 I, [2024-05-14T01:22:25.600808 #830162] INFO -- : digest 3.1.1 I, [2024-05-14T01:22:25.601284 #830162] INFO -- : etc 1.4.3 I, [2024-05-14T01:22:25.601789 #830162] INFO -- : fcntl 1.1.0 I, [2024-05-14T01:22:25.602189 #830162] INFO -- : fiddle 1.1.3 I, [2024-05-14T01:22:25.602729 #830162] INFO -- : io-console 0.7.2 I, [2024-05-14T01:22:25.603214 #830162] INFO -- : io-nonblock 0.3.0 I, [2024-05-14T01:22:25.603668 #830162] INFO -- : io-wait 0.3.1 I, [2024-05-14T01:22:25.604190 #830162] INFO -- : json 2.7.2 I, [2024-05-14T01:22:25.605270 #830162] INFO -- : openssl 3.2.0 I, [2024-05-14T01:22:25.605884 #830162] INFO -- : pathname 0.3.0 I, [2024-05-14T01:22:25.606285 #830162] INFO -- : psych 5.1.2 I, [2024-05-14T01:22:25.606815 #830162] INFO -- : stringio 3.1.1 I, [2024-05-14T01:22:25.607384 #830162] INFO -- : strscan 3.1.1 I, [2024-05-14T01:22:25.607825 #830162] INFO -- : zlib 3.1.0 I, [2024-05-14T01:22:25.608262 #830162] INFO -- : installing bundled gems: /tmp/ruby/install/trunk/lib/ruby/gems/3.4.0+0 I, [2024-05-14T01:22:25.608525 #830162] INFO -- : minitest 5.22.3 I, [2024-05-14T01:22:25.615874 #830162] INFO -- : rake 13.2.1 I, [2024-05-14T01:22:25.619159 #830162] INFO -- : test-unit 3.6.2 I, [2024-05-14T01:22:25.623497 #830162] INFO -- : rexml 3.2.6 I, [2024-05-14T01:22:25.626812 #830162] INFO -- : rss 0.3.0 I, [2024-05-14T01:22:25.629790 #830162] INFO -- : net-ftp 0.3.4 I, [2024-05-14T01:22:25.631248 #830162] INFO -- : net-imap 0.4.11 I, [2024-05-14T01:22:25.634093 #830162] INFO -- : net-pop 0.1.2 I, [2024-05-14T01:22:25.634987 #830162] INFO -- : net-smtp 0.5.0 I, [2024-05-14T01:22:25.636120 #830162] INFO -- : matrix 0.4.2 I, [2024-05-14T01:22:25.639564 #830162] INFO -- : prime 0.1.2 I, [2024-05-14T01:22:25.645024 #830162] INFO -- : rbs 3.4.4 I, [2024-05-14T01:22:25.666976 #830162] INFO -- : typeprof 0.21.11 I, [2024-05-14T01:22:25.669868 #830162] INFO -- : debug 1.9.2 I, [2024-05-14T01:22:25.672537 #830162] INFO -- : racc 1.7.3 I, [2024-05-14T01:22:25.674976 #830162] INFO -- : mutex_m 0.2.0 I, [2024-05-14T01:22:25.676324 #830162] INFO -- : getoptlong 0.2.1 I, [2024-05-14T01:22:25.677587 #830162] INFO -- : base64 0.2.0 I, [2024-05-14T01:22:25.678572 #830162] INFO -- : bigdecimal 3.1.8 I, [2024-05-14T01:22:25.680656 #830162] INFO -- : observer 0.1.2 I, [2024-05-14T01:22:25.681722 #830162] INFO -- : abbrev 0.1.2 I, [2024-05-14T01:22:25.683146 #830162] INFO -- : resolv-replace 0.1.1 I, [2024-05-14T01:22:25.684439 #830162] INFO -- : rinda 0.2.0 I, [2024-05-14T01:22:25.685826 #830162] INFO -- : drb 2.2.1 I, [2024-05-14T01:22:25.687278 #830162] INFO -- : nkf 0.2.0 I, [2024-05-14T01:22:25.689674 #830162] INFO -- : syslog 0.1.2 I, [2024-05-14T01:22:25.691189 #830162] INFO -- : csv 3.3.0 I, [2024-05-14T01:22:25.693386 #830162] INFO -- : installing bundled gem cache: /tmp/ruby/install/trunk/lib/ruby/gems/3.4.0+0/cache I, [2024-05-14T01:22:25.694745 #830162] INFO -- : skipped bundled gems: I, [2024-05-14T01:22:25.694766 #830162] INFO -- : power_assert-2.0.4dev.gem not found in bundled_gems I, [2024-05-14T01:22:25.697945 #830162] INFO -- : $$$[end] "make install -j20" exit with 0. I, [2024-05-14T01:22:25.698055 #830162] INFO -- : $$$[beg] make yes-btest TESTOPTS='-q -j20' I, [2024-05-14T01:22:31.586037 #830162] INFO -- : PASS all 1936 tests E, [2024-05-14T01:22:31.591111 #830162] ERROR -- : I, [2024-05-14T01:22:31.591330 #830162] INFO -- : $$$[end] "make yes-btest TESTOPTS='-q -j20'" exit with 0. I, [2024-05-14T01:22:31.591419 #830162] INFO -- : $$$[beg] make yes-test-basic TESTS='-j20' I, [2024-05-14T01:22:31.659407 #830162] INFO -- : BASERUBY = /usr/bin/ruby --disable=gems I, [2024-05-14T01:22:31.659458 #830162] INFO -- : CC = gcc I, [2024-05-14T01:22:31.659468 #830162] INFO -- : LD = ld I, [2024-05-14T01:22:31.659475 #830162] INFO -- : LDSHARED = gcc -shared I, [2024-05-14T01:22:31.659483 #830162] INFO -- : CFLAGS = -O3 -fno-fast-math -ggdb3 -Wall -Wextra -Wdeprecated-declarations -Wdiv-by-zero -Wduplicated-cond -Wimplicit-function-declaration -Wimplicit-int -Wpointer-arith -Wwrite-strings -Wold-style-definition -Wimplicit-fallthrough=0 -Wmissing-noreturn -Wno-cast-function-type -Wno-constant-logical-operand -Wno-long-long -Wno-missing-field-initializers -Wno-overlength-strings -Wno-packed-bitfield-compat -Wno-parentheses-equality -Wno-self-assign -Wno-tautological-compare -Wno-unused-parameter -Wno-unused-value -Wsuggest-attribute=format -Wsuggest-attribute=noreturn -Wunused-variable -Wmisleading-indentation -Wundef -fPIC I, [2024-05-14T01:22:31.659497 #830162] INFO -- : XCFLAGS = -U_FORTIFY_SOURCE -D_FORTIFY_SOURCE=2 -fstack-protector-strong -fno-strict-overflow -fvisibility=hidden -fexcess-precision=standard -DRUBY_EXPORT -I. -I.ext/include/x86_64-linux -I/tmp/ruby/src/trunk/include -I/tmp/ruby/src/trunk -I/tmp/ruby/src/trunk/prism -I/tmp/ruby/src/trunk/enc/unicode/15.0.0 I, [2024-05-14T01:22:31.659504 #830162] INFO -- : CPPFLAGS = I, [2024-05-14T01:22:31.659511 #830162] INFO -- : DLDFLAGS = -Wl,--compress-debug-sections=zlib -Wl,-soname,libruby.so.3.4 -fstack-protector-strong I, [2024-05-14T01:22:31.659518 #830162] INFO -- : SOLIBS = -lz -lrt -lrt -lgmp -ldl -lcrypt -lm -lpthread I, [2024-05-14T01:22:31.659524 #830162] INFO -- : LANG = en_US.UTF-8 I, [2024-05-14T01:22:31.659531 #830162] INFO -- : LC_ALL = I, [2024-05-14T01:22:31.659537 #830162] INFO -- : LC_CTYPE = I, [2024-05-14T01:22:31.659543 #830162] INFO -- : MFLAGS = I, [2024-05-14T01:22:31.659549 #830162] INFO -- : RUSTC = no I, [2024-05-14T01:22:31.659556 #830162] INFO -- : YJIT_RUSTC_ARGS = --crate-name=yjit --crate-type=staticlib --edition=2021 -g -C lto=thin -C opt-level=3 -C overflow-checks=on '--out-dir=/tmp/ruby/build/trunk/yjit/target/release/' /tmp/ruby/src/trunk/yjit/src/lib.rs I, [2024-05-14T01:22:31.660398 #830162] INFO -- : gcc (Ubuntu 11.4.0-1ubuntu1~22.04) 11.4.0 I, [2024-05-14T01:22:31.660436 #830162] INFO -- : Copyright (C) 2021 Free Software Foundation, Inc. I, [2024-05-14T01:22:31.660446 #830162] INFO -- : This is free software; see the source for copying conditions. There is NO I, [2024-05-14T01:22:31.660453 #830162] INFO -- : warranty; not even for MERCHANTABILITY or FITNESS FOR A PARTICULAR PURPOSE. I, [2024-05-14T01:22:31.660470 #830162] INFO -- : I, [2024-05-14T01:22:31.766792 #830162] INFO -- : Checking leaked global symbols...none I, [2024-05-14T01:22:31.808007 #830162] INFO -- : /tmp/ruby/src/trunk/basictest/test.rb:assignment ....................................................................................................................................................................................................................................................................................................................................................................................OK 372 I, [2024-05-14T01:22:31.808065 #830162] INFO -- : /tmp/ruby/src/trunk/basictest/test.rb:condition ..OK 2 I, [2024-05-14T01:22:31.808071 #830162] INFO -- : /tmp/ruby/src/trunk/basictest/test.rb:if/unless ...OK 3 I, [2024-05-14T01:22:31.808082 #830162] INFO -- : /tmp/ruby/src/trunk/basictest/test.rb:case .....OK 5 I, [2024-05-14T01:22:31.808323 #830162] INFO -- : /tmp/ruby/src/trunk/basictest/test.rb:while/until ........OK 8 I, [2024-05-14T01:22:31.808385 #830162] INFO -- : /tmp/ruby/src/trunk/basictest/test.rb:exception ..........OK 10 I, [2024-05-14T01:22:31.808716 #830162] INFO -- : /tmp/ruby/src/trunk/basictest/test.rb:array .......................................OK 39 I, [2024-05-14T01:22:31.808840 #830162] INFO -- : /tmp/ruby/src/trunk/basictest/test.rb:hash ...........................OK 27 I, [2024-05-14T01:22:31.809693 #830162] INFO -- : /tmp/ruby/src/trunk/basictest/test.rb:iterator ...........................................................................................................OK 107 I, [2024-05-14T01:22:31.810020 #830162] INFO -- : /tmp/ruby/src/trunk/basictest/test.rb:float ................................................................................OK 80 I, [2024-05-14T01:22:31.811239 #830162] INFO -- : /tmp/ruby/src/trunk/basictest/test.rb:bignum ...............................OK 31 I, [2024-05-14T01:22:31.812149 #830162] INFO -- : /tmp/ruby/src/trunk/basictest/test.rb:string & char ..............................................................OK 62 I, [2024-05-14T01:22:31.812182 #830162] INFO -- : /tmp/ruby/src/trunk/basictest/test.rb:assignment ..........OK 10 I, [2024-05-14T01:22:31.812209 #830162] INFO -- : /tmp/ruby/src/trunk/basictest/test.rb:call ......OK 6 I, [2024-05-14T01:22:31.812270 #830162] INFO -- : /tmp/ruby/src/trunk/basictest/test.rb:proc .........OK 9 I, [2024-05-14T01:22:31.912957 #830162] INFO -- : /tmp/ruby/src/trunk/basictest/test.rb:signal ..OK 2 I, [2024-05-14T01:22:31.915823 #830162] INFO -- : /tmp/ruby/src/trunk/basictest/test.rb:eval ...........................OK 27 I, [2024-05-14T01:22:32.049125 #830162] INFO -- : /tmp/ruby/src/trunk/basictest/test.rb:system ........OK 8 I, [2024-05-14T01:22:32.049204 #830162] INFO -- : /tmp/ruby/src/trunk/basictest/test.rb:const .....OK 5 I, [2024-05-14T01:22:32.049215 #830162] INFO -- : /tmp/ruby/src/trunk/basictest/test.rb:clone .....OK 5 I, [2024-05-14T01:22:32.049419 #830162] INFO -- : /tmp/ruby/src/trunk/basictest/test.rb:marshal ....OK 4 I, [2024-05-14T01:22:32.049475 #830162] INFO -- : /tmp/ruby/src/trunk/basictest/test.rb:pack ....OK 4 I, [2024-05-14T01:22:32.049488 #830162] INFO -- : /tmp/ruby/src/trunk/basictest/test.rb:math ..OK 2 I, [2024-05-14T01:22:32.049598 #830162] INFO -- : /tmp/ruby/src/trunk/basictest/test.rb:struct ......OK 6 I, [2024-05-14T01:22:32.049768 #830162] INFO -- : /tmp/ruby/src/trunk/basictest/test.rb:variable ............OK 12 I, [2024-05-14T01:22:32.049807 #830162] INFO -- : /tmp/ruby/src/trunk/basictest/test.rb:trace ...OK 3 I, [2024-05-14T01:22:32.049818 #830162] INFO -- : /tmp/ruby/src/trunk/basictest/test.rb:defined? ............OK 12 I, [2024-05-14T01:22:32.049881 #830162] INFO -- : /tmp/ruby/src/trunk/basictest/test.rb:alias ......OK 6 I, [2024-05-14T01:22:32.050390 #830162] INFO -- : /tmp/ruby/src/trunk/basictest/test.rb:path .......................OK 23 I, [2024-05-14T01:22:32.088799 #830162] INFO -- : /tmp/ruby/src/trunk/basictest/test.rb:gc ....OK 4 I, [2024-05-14T01:22:32.091267 #830162] INFO -- : I, [2024-05-14T01:22:32.091295 #830162] INFO -- : test succeeded I, [2024-05-14T01:22:32.092739 #830162] INFO -- : $$$[end] "make yes-test-basic TESTS='-j20'" exit with 0. I, [2024-05-14T01:22:32.092822 #830162] INFO -- : $$$[beg] make yes-test-all TESTOPTS='--stderr-on-failure' TESTS='-j20' I, [2024-05-14T01:22:32.188613 #830162] INFO -- : BASERUBY = /usr/bin/ruby --disable=gems I, [2024-05-14T01:22:32.188651 #830162] INFO -- : CC = gcc I, [2024-05-14T01:22:32.188657 #830162] INFO -- : LD = ld I, [2024-05-14T01:22:32.188661 #830162] INFO -- : LDSHARED = gcc -shared I, [2024-05-14T01:22:32.188666 #830162] INFO -- : CFLAGS = -O3 -fno-fast-math -ggdb3 -Wall -Wextra -Wdeprecated-declarations -Wdiv-by-zero -Wduplicated-cond -Wimplicit-function-declaration -Wimplicit-int -Wpointer-arith -Wwrite-strings -Wold-style-definition -Wimplicit-fallthrough=0 -Wmissing-noreturn -Wno-cast-function-type -Wno-constant-logical-operand -Wno-long-long -Wno-missing-field-initializers -Wno-overlength-strings -Wno-packed-bitfield-compat -Wno-parentheses-equality -Wno-self-assign -Wno-tautological-compare -Wno-unused-parameter -Wno-unused-value -Wsuggest-attribute=format -Wsuggest-attribute=noreturn -Wunused-variable -Wmisleading-indentation -Wundef -fPIC I, [2024-05-14T01:22:32.188672 #830162] INFO -- : XCFLAGS = -U_FORTIFY_SOURCE -D_FORTIFY_SOURCE=2 -fstack-protector-strong -fno-strict-overflow -fvisibility=hidden -fexcess-precision=standard -DRUBY_EXPORT -I. -I.ext/include/x86_64-linux -I/tmp/ruby/src/trunk/include -I/tmp/ruby/src/trunk -I/tmp/ruby/src/trunk/prism -I/tmp/ruby/src/trunk/enc/unicode/15.0.0 I, [2024-05-14T01:22:32.188676 #830162] INFO -- : CPPFLAGS = I, [2024-05-14T01:22:32.188679 #830162] INFO -- : DLDFLAGS = -Wl,--compress-debug-sections=zlib -Wl,-soname,libruby.so.3.4 -fstack-protector-strong I, [2024-05-14T01:22:32.188683 #830162] INFO -- : SOLIBS = -lz -lrt -lrt -lgmp -ldl -lcrypt -lm -lpthread I, [2024-05-14T01:22:32.188686 #830162] INFO -- : LANG = en_US.UTF-8 I, [2024-05-14T01:22:32.188690 #830162] INFO -- : LC_ALL = I, [2024-05-14T01:22:32.188693 #830162] INFO -- : LC_CTYPE = I, [2024-05-14T01:22:32.188697 #830162] INFO -- : MFLAGS = I, [2024-05-14T01:22:32.188700 #830162] INFO -- : RUSTC = no I, [2024-05-14T01:22:32.188704 #830162] INFO -- : YJIT_RUSTC_ARGS = --crate-name=yjit --crate-type=staticlib --edition=2021 -g -C lto=thin -C opt-level=3 -C overflow-checks=on '--out-dir=/tmp/ruby/build/trunk/yjit/target/release/' /tmp/ruby/src/trunk/yjit/src/lib.rs I, [2024-05-14T01:22:32.189420 #830162] INFO -- : gcc (Ubuntu 11.4.0-1ubuntu1~22.04) 11.4.0 I, [2024-05-14T01:22:32.189440 #830162] INFO -- : Copyright (C) 2021 Free Software Foundation, Inc. I, [2024-05-14T01:22:32.189446 #830162] INFO -- : This is free software; see the source for copying conditions. There is NO I, [2024-05-14T01:22:32.189450 #830162] INFO -- : warranty; not even for MERCHANTABILITY or FITNESS FOR A PARTICULAR PURPOSE. I, [2024-05-14T01:22:32.189454 #830162] INFO -- : I, [2024-05-14T01:22:32.191176 #830162] INFO -- : generating enc.mk I, [2024-05-14T01:22:32.308556 #830162] INFO -- : making enc I, [2024-05-14T01:22:32.325765 #830162] INFO -- : make[1]: Entering directory '/tmp/ruby/build/trunk' I, [2024-05-14T01:22:32.325786 #830162] INFO -- : make[1]: Nothing to be done for 'enc'. I, [2024-05-14T01:22:32.325792 #830162] INFO -- : make[1]: Leaving directory '/tmp/ruby/build/trunk' I, [2024-05-14T01:22:32.326386 #830162] INFO -- : making srcs under enc I, [2024-05-14T01:22:32.356132 #830162] INFO -- : make[1]: Entering directory '/tmp/ruby/build/trunk' I, [2024-05-14T01:22:32.356155 #830162] INFO -- : make[1]: Nothing to be done for 'srcs'. I, [2024-05-14T01:22:32.356160 #830162] INFO -- : make[1]: Leaving directory '/tmp/ruby/build/trunk' I, [2024-05-14T01:22:32.356974 #830162] INFO -- : generating transdb.h I, [2024-05-14T01:22:32.452928 #830162] INFO -- : transdb.h unchanged I, [2024-05-14T01:22:32.454126 #830162] INFO -- : making trans I, [2024-05-14T01:22:32.488274 #830162] INFO -- : make[1]: Entering directory '/tmp/ruby/build/trunk' I, [2024-05-14T01:22:32.488302 #830162] INFO -- : make[1]: Nothing to be done for 'trans'. I, [2024-05-14T01:22:32.488308 #830162] INFO -- : make[1]: Leaving directory '/tmp/ruby/build/trunk' I, [2024-05-14T01:22:32.488973 #830162] INFO -- : making encs I, [2024-05-14T01:22:32.525948 #830162] INFO -- : make[1]: Entering directory '/tmp/ruby/build/trunk' I, [2024-05-14T01:22:32.525968 #830162] INFO -- : make[1]: Nothing to be done for 'encs'. I, [2024-05-14T01:22:32.525974 #830162] INFO -- : make[1]: Leaving directory '/tmp/ruby/build/trunk' I, [2024-05-14T01:22:32.527704 #830162] INFO -- : generating makefiles ext/configure-ext.mk I, [2024-05-14T01:22:32.553920 #830162] INFO -- : ext/configure-ext.mk updated I, [2024-05-14T01:22:32.556429 #830162] INFO -- : make[1]: Entering directory '/tmp/ruby/build/trunk' I, [2024-05-14T01:22:33.911609 #830162] INFO -- : make[1]: Leaving directory '/tmp/ruby/build/trunk' I, [2024-05-14T01:22:33.912233 #830162] INFO -- : generating makefile exts.mk I, [2024-05-14T01:22:33.950247 #830162] INFO -- : exts.mk unchanged I, [2024-05-14T01:22:33.954699 #830162] INFO -- : make[1]: Entering directory '/tmp/ruby/build/trunk' I, [2024-05-14T01:22:34.268471 #830162] INFO -- : make[2]: Entering directory '/tmp/ruby/build/trunk/ext/coverage' I, [2024-05-14T01:22:34.272741 #830162] INFO -- : make[2]: Leaving directory '/tmp/ruby/build/trunk/ext/coverage' I, [2024-05-14T01:22:34.279092 #830162] INFO -- : make[2]: Entering directory '/tmp/ruby/build/trunk/ext/date' I, [2024-05-14T01:22:34.284062 #830162] INFO -- : make[2]: Leaving directory '/tmp/ruby/build/trunk/ext/date' I, [2024-05-14T01:22:34.287835 #830162] INFO -- : make[2]: Entering directory '/tmp/ruby/build/trunk/ext/digest' I, [2024-05-14T01:22:34.296548 #830162] INFO -- : make[2]: Leaving directory '/tmp/ruby/build/trunk/ext/digest' I, [2024-05-14T01:22:34.323072 #830162] INFO -- : make[2]: Entering directory '/tmp/ruby/build/trunk/ext/digest/sha2' I, [2024-05-14T01:22:34.327824 #830162] INFO -- : make[2]: Leaving directory '/tmp/ruby/build/trunk/ext/digest/sha2' I, [2024-05-14T01:22:34.348745 #830162] INFO -- : make[2]: Entering directory '/tmp/ruby/build/trunk/ext/fiddle' I, [2024-05-14T01:22:34.357949 #830162] INFO -- : make[2]: Leaving directory '/tmp/ruby/build/trunk/ext/fiddle' I, [2024-05-14T01:22:34.362795 #830162] INFO -- : make[2]: Entering directory '/tmp/ruby/build/trunk/ext/io/console' I, [2024-05-14T01:22:34.366840 #830162] INFO -- : make[2]: Leaving directory '/tmp/ruby/build/trunk/ext/io/console' I, [2024-05-14T01:22:34.379177 #830162] INFO -- : make[2]: Entering directory '/tmp/ruby/build/trunk/ext/json' I, [2024-05-14T01:22:34.389535 #830162] INFO -- : make[2]: Leaving directory '/tmp/ruby/build/trunk/ext/json' I, [2024-05-14T01:22:34.404148 #830162] INFO -- : make[2]: Entering directory '/tmp/ruby/build/trunk/ext/monitor' I, [2024-05-14T01:22:34.408130 #830162] INFO -- : make[2]: Leaving directory '/tmp/ruby/build/trunk/ext/monitor' I, [2024-05-14T01:22:34.415033 #830162] INFO -- : make[2]: Entering directory '/tmp/ruby/build/trunk/ext/objspace' I, [2024-05-14T01:22:34.420401 #830162] INFO -- : make[2]: Leaving directory '/tmp/ruby/build/trunk/ext/objspace' I, [2024-05-14T01:22:34.437667 #830162] INFO -- : make[2]: Entering directory '/tmp/ruby/build/trunk/ext/openssl' I, [2024-05-14T01:22:34.452953 #830162] INFO -- : make[2]: Leaving directory '/tmp/ruby/build/trunk/ext/openssl' I, [2024-05-14T01:22:34.457693 #830162] INFO -- : make[2]: Entering directory '/tmp/ruby/build/trunk/ext/pathname' I, [2024-05-14T01:22:34.461810 #830162] INFO -- : make[2]: Leaving directory '/tmp/ruby/build/trunk/ext/pathname' I, [2024-05-14T01:22:34.468894 #830162] INFO -- : make[2]: Entering directory '/tmp/ruby/build/trunk/ext/psych' I, [2024-05-14T01:22:34.493426 #830162] INFO -- : make[2]: Leaving directory '/tmp/ruby/build/trunk/ext/psych' I, [2024-05-14T01:22:34.497286 #830162] INFO -- : make[2]: Entering directory '/tmp/ruby/build/trunk/ext/pty' I, [2024-05-14T01:22:34.501316 #830162] INFO -- : make[2]: Leaving directory '/tmp/ruby/build/trunk/ext/pty' I, [2024-05-14T01:22:34.516007 #830162] INFO -- : make[2]: Entering directory '/tmp/ruby/build/trunk/ext/ripper' I, [2024-05-14T01:22:34.523962 #830162] INFO -- : make[2]: Leaving directory '/tmp/ruby/build/trunk/ext/ripper' I, [2024-05-14T01:22:34.526307 #830162] INFO -- : make[2]: Entering directory '/tmp/ruby/build/trunk/ext/rubyvm' I, [2024-05-14T01:22:34.529588 #830162] INFO -- : make[2]: Leaving directory '/tmp/ruby/build/trunk/ext/rubyvm' I, [2024-05-14T01:22:34.542770 #830162] INFO -- : make[2]: Entering directory '/tmp/ruby/build/trunk/ext/socket' I, [2024-05-14T01:22:34.550964 #830162] INFO -- : make[2]: Leaving directory '/tmp/ruby/build/trunk/ext/socket' I, [2024-05-14T01:22:34.565243 #830162] INFO -- : make[2]: Entering directory '/tmp/ruby/build/trunk/.bundle/gems/bigdecimal-3.1.8/ext/bigdecimal' I, [2024-05-14T01:22:34.593375 #830162] INFO -- : make[2]: Leaving directory '/tmp/ruby/build/trunk/.bundle/gems/bigdecimal-3.1.8/ext/bigdecimal' I, [2024-05-14T01:22:34.595258 #830162] INFO -- : make[2]: Entering directory '/tmp/ruby/build/trunk/.bundle/gems/debug-1.9.2/ext/debug' I, [2024-05-14T01:22:34.618520 #830162] INFO -- : make[2]: Leaving directory '/tmp/ruby/build/trunk/.bundle/gems/debug-1.9.2/ext/debug' I, [2024-05-14T01:22:34.620622 #830162] INFO -- : make[2]: Entering directory '/tmp/ruby/build/trunk/.bundle/gems/nkf-0.2.0/ext/nkf' I, [2024-05-14T01:22:34.643615 #830162] INFO -- : make[2]: Leaving directory '/tmp/ruby/build/trunk/.bundle/gems/nkf-0.2.0/ext/nkf' I, [2024-05-14T01:22:34.645520 #830162] INFO -- : make[2]: Entering directory '/tmp/ruby/build/trunk/.bundle/gems/racc-1.7.3/ext/racc/cparse' I, [2024-05-14T01:22:34.671251 #830162] INFO -- : make[2]: Leaving directory '/tmp/ruby/build/trunk/.bundle/gems/racc-1.7.3/ext/racc/cparse' I, [2024-05-14T01:22:34.674458 #830162] INFO -- : make[2]: Entering directory '/tmp/ruby/build/trunk/.bundle/gems/rbs-3.4.4/ext/rbs_extension' I, [2024-05-14T01:22:34.700481 #830162] INFO -- : make[2]: Leaving directory '/tmp/ruby/build/trunk/.bundle/gems/rbs-3.4.4/ext/rbs_extension' I, [2024-05-14T01:22:34.702412 #830162] INFO -- : make[2]: Entering directory '/tmp/ruby/build/trunk/.bundle/gems/syslog-0.1.2/ext/syslog' I, [2024-05-14T01:22:34.724076 #830162] INFO -- : make[2]: Leaving directory '/tmp/ruby/build/trunk/.bundle/gems/syslog-0.1.2/ext/syslog' I, [2024-05-14T01:22:34.749889 #830162] INFO -- : make[2]: Entering directory '/tmp/ruby/build/trunk' I, [2024-05-14T01:22:34.819526 #830162] INFO -- : make[2]: 'ruby' is up to date. I, [2024-05-14T01:22:34.819570 #830162] INFO -- : make[2]: Leaving directory '/tmp/ruby/build/trunk' I, [2024-05-14T01:22:34.819679 #830162] INFO -- : make[1]: Leaving directory '/tmp/ruby/build/trunk' I, [2024-05-14T01:22:34.824239 #830162] INFO -- : make[1]: Entering directory '/tmp/ruby/build/trunk' I, [2024-05-14T01:22:34.824260 #830162] INFO -- : make[1]: Nothing to be done for 'note'. I, [2024-05-14T01:22:34.824266 #830162] INFO -- : make[1]: Leaving directory '/tmp/ruby/build/trunk' I, [2024-05-14T01:22:34.902844 #830162] INFO -- : Run options: I, [2024-05-14T01:22:34.902900 #830162] INFO -- : --seed=23105 I, [2024-05-14T01:22:34.902910 #830162] INFO -- : "--ruby=./miniruby -I/tmp/ruby/src/trunk/lib -I. -I.ext/common /tmp/ruby/src/trunk/tool/runruby.rb --extout=.ext -- --disable-gems" I, [2024-05-14T01:22:34.902914 #830162] INFO -- : --excludes-dir=/tmp/ruby/src/trunk/test/.excludes I, [2024-05-14T01:22:34.902918 #830162] INFO -- : --name=!/memory_leak/ I, [2024-05-14T01:22:34.902921 #830162] INFO -- : --stderr-on-failure I, [2024-05-14T01:22:34.902925 #830162] INFO -- : -j20 I, [2024-05-14T01:22:34.902929 #830162] INFO -- : I, [2024-05-14T01:22:34.902933 #830162] INFO -- : # Running tests: I, [2024-05-14T01:22:34.902936 #830162] INFO -- : I, [2024-05-14T01:22:35.051811 #830162] INFO -- : [ 1/885] 871524=test_shapes I, [2024-05-14T01:22:35.051881 #830162] INFO -- : [ 2/885] 871525=json_fixtures_test I, [2024-05-14T01:22:35.051957 #830162] INFO -- : [ 3/885] 871526=test_io_timeout I, [2024-05-14T01:22:35.052073 #830162] INFO -- : [ 4/885] 871529=test_rdoc_parser_c I, [2024-05-14T01:22:35.052151 #830162] INFO -- : [ 5/885] 871527=test_comparable I, [2024-05-14T01:22:35.054258 #830162] INFO -- : [ 6/885] 871528=test_enc_str_buf_cat I, [2024-05-14T01:22:35.054798 #830162] INFO -- : [ 7/885] 871540=test_class2name I, [2024-05-14T01:22:35.054824 #830162] INFO -- : [ 8/885] 871543=test_gbk I, [2024-05-14T01:22:35.054832 #830162] INFO -- : [ 9/885] 871538=test_profile_frames I, [2024-05-14T01:22:35.054839 #830162] INFO -- : [ 10/885] 871539=test_pstore I, [2024-05-14T01:22:35.054845 #830162] INFO -- : [ 11/885] 871541=test_cstr I, [2024-05-14T01:22:35.055819 #830162] INFO -- : [ 12/885] 871542=test_big2str I, [2024-05-14T01:22:35.057974 #830162] INFO -- : [ 13/885] 871528=test_wait I, [2024-05-14T01:22:35.058223 #830162] INFO -- : [ 14/885] 871526=test_handle I, [2024-05-14T01:22:35.058985 #830162] INFO -- : [ 15/885] 871540=test_forwardable I, [2024-05-14T01:22:35.059013 #830162] INFO -- : [ 16/885] 871542=test_yaml I, [2024-05-14T01:22:35.059024 #830162] INFO -- : [ 17/885] 871543=test_rdoc_markup_formatter I, [2024-05-14T01:22:35.060162 #830162] INFO -- : [ 18/885] 871527=test_thread_queue I, [2024-05-14T01:22:35.062425 #830162] INFO -- : [ 19/885] 871524=test_nowrite I, [2024-05-14T01:22:35.070895 #830162] INFO -- : [ 20/885] 871525=test_gem_commands_sources_command I, [2024-05-14T01:22:35.077569 #830162] INFO -- : [ 21/885] 871524=test_ansi_without_terminfo I, [2024-05-14T01:22:35.081319 #830162] INFO -- : [ 22/885] 871537=test_ractor I, [2024-05-14T01:22:35.085539 #830162] INFO -- : [ 23/885] 871533=test_euc_tw I, [2024-05-14T01:22:35.085599 #830162] INFO -- : [ 24/885] 871530=test_bmethod I, [2024-05-14T01:22:35.085607 #830162] INFO -- : [ 25/885] 871535=test_pathname I, [2024-05-14T01:22:35.085964 #830162] INFO -- : [ 26/885] 871536=test_complexrational I, [2024-05-14T01:22:35.086005 #830162] INFO -- : [ 27/885] 871534=test_init I, [2024-05-14T01:22:35.086167 #830162] INFO -- : [ 28/885] 871540=regexp_test I, [2024-05-14T01:22:35.086266 #830162] INFO -- : [ 29/885] 871531=test_gem_package_tar_reader I, [2024-05-14T01:22:35.086684 #830162] INFO -- : [ 30/885] 871532=test_rdoc_encoding I, [2024-05-14T01:22:35.089220 #830162] INFO -- : [ 31/885] 871533=test_coverage I, [2024-05-14T01:22:35.091395 #830162] INFO -- : [ 32/885] 871530=test_file I, [2024-05-14T01:22:35.093827 #830162] INFO -- : [ 33/885] 871536=test_rdoc_any_method I, [2024-05-14T01:22:35.094322 #830162] INFO -- : [ 34/885] 871537=test_modify_expand I, [2024-05-14T01:22:35.099513 #830162] INFO -- : [ 35/885] 871537=test_rdoc_markdown I, [2024-05-14T01:22:35.100470 #830162] INFO -- : [ 36/885] 871539=test_gem_available_set I, [2024-05-14T01:22:35.106500 #830162] INFO -- : [ 37/885] 871526=test_formatter I, [2024-05-14T01:22:35.110908 #830162] INFO -- : [ 38/885] 871526=test_bash_completion I, [2024-05-14T01:22:35.112041 #830162] INFO -- : [ 39/885] 871528=test_deprecate I, [2024-05-14T01:22:35.113521 #830162] INFO -- : [ 40/885] 871526=test_rdoc_constant I, [2024-05-14T01:22:35.118535 #830162] INFO -- : [ 41/885] 871530=test_recorder I, [2024-05-14T01:22:35.130406 #830162] INFO -- : [ 42/885] 871524=test_gem_source_vendor I, [2024-05-14T01:22:35.145014 #830162] INFO -- : [ 43/885] 871530=test_gem_commands_owner_command I, [2024-05-14T01:22:35.154527 #830162] INFO -- : [ 44/885] 871541=test_digest I, [2024-05-14T01:22:35.158611 #830162] INFO -- : [ 45/885] 871540=test_marshalable I, [2024-05-14T01:22:35.189910 #830162] INFO -- : [ 46/885] 871542=test_require I, [2024-05-14T01:22:35.207800 #830162] INFO -- : [ 47/885] 871540=test_cgi_util I, [2024-05-14T01:22:35.225106 #830162] INFO -- : [ 48/885] 871532=test_gem_commands_contents_command I, [2024-05-14T01:22:35.230318 #830162] INFO -- : [ 49/885] 871543=test_gem_ext_cmake_builder I, [2024-05-14T01:22:35.259990 #830162] INFO -- : [ 50/885] 871538=test_wss I, [2024-05-14T01:22:35.275889 #830162] INFO -- : [ 51/885] 871538=test_fiddle I, [2024-05-14T01:22:35.289073 #830162] INFO -- : [ 52/885] 871524=test_find I, [2024-05-14T01:22:35.293681 #830162] INFO -- : [ 53/885] 871538=test_ractor I, [2024-05-14T01:22:35.303061 #830162] INFO -- : [ 54/885] 871524=test_function I, [2024-05-14T01:22:35.312989 #830162] INFO -- : [ 55/885] 871526=test_queue I, [2024-05-14T01:22:35.318876 #830162] INFO -- : [ 56/885] 871528=test_noarg I, [2024-05-14T01:22:35.326526 #830162] INFO -- : [ 57/885] 871526=parse_comments_test I, [2024-05-14T01:22:35.328126 #830162] INFO -- : [ 58/885] 871535=test_tempfile I, [2024-05-14T01:22:35.352871 #830162] INFO -- : [ 59/885] 871531=test_tracepoint I, [2024-05-14T01:22:35.371096 #830162] INFO -- : [ 60/885] 871538=test_prettyprint I, [2024-05-14T01:22:35.387485 #830162] INFO -- : [ 61/885] 871538=test_gem_commands_help_command I, [2024-05-14T01:22:35.396179 #830162] INFO -- : [ 62/885] 871526=test_rdoc_markup I, [2024-05-14T01:22:35.404106 #830162] INFO -- : [ 63/885] 871526=test_duplicate I, [2024-05-14T01:22:35.407616 #830162] INFO -- : [ 64/885] 871526=test_utf32 I, [2024-05-14T01:22:35.411974 #830162] INFO -- : [ 65/885] 871526=test_basicsocket I, [2024-05-14T01:22:35.412802 #830162] INFO -- : [ 66/885] 871525=test_gem_resolver_index_specification I, [2024-05-14T01:22:35.415602 #830162] INFO -- : [ 67/885] 871529=test_internal_ivar I, [2024-05-14T01:22:35.417737 #830162] INFO -- : [ 68/885] 871540=test_rdoc_parser_rd I, [2024-05-14T01:22:35.418457 #830162] INFO -- : [ 69/885] 871529=test_date_strftime I, [2024-05-14T01:22:35.424117 #830162] INFO -- : [ 70/885] 871526=test_gem_installer I, [2024-05-14T01:22:35.427914 #830162] INFO -- : [ 71/885] 871539=test_yamlstore I, [2024-05-14T01:22:35.433349 #830162] INFO -- : [ 72/885] 871539=test_asn1 I, [2024-05-14T01:22:35.437009 #830162] INFO -- : [ 73/885] 871537=test_random I, [2024-05-14T01:22:35.451256 #830162] INFO -- : [ 74/885] 871539=json_string_matching_test I, [2024-05-14T01:22:35.457112 #830162] INFO -- : [ 75/885] 871525=test_load I, [2024-05-14T01:22:35.461412 #830162] INFO -- : [ 76/885] 871537=test_rdoc_normal_class I, [2024-05-14T01:22:35.466221 #830162] INFO -- : [ 77/885] 871539=test_class I, [2024-05-14T01:22:35.467044 #830162] INFO -- : [ 78/885] 871525=test_const I, [2024-05-14T01:22:35.469312 #830162] INFO -- : [ 79/885] 871543=test_irb I, [2024-05-14T01:22:35.474266 #830162] INFO -- : [ 80/885] 871525=test_complex I, [2024-05-14T01:22:35.490259 #830162] INFO -- : [ 81/885] 871532=test_gem_commands_search_command I, [2024-05-14T01:22:35.496457 #830162] INFO -- : [ 82/885] 871532=test_gem_stub_specification I, [2024-05-14T01:22:35.513719 #830162] INFO -- : [ 83/885] 871528=test_method_cache I, [2024-05-14T01:22:35.517189 #830162] INFO -- : [ 84/885] 871528=test_frozen_error I, [2024-05-14T01:22:35.520079 #830162] INFO -- : [ 85/885] 871524=test_gem_ext_ext_conf_builder I, [2024-05-14T01:22:35.523805 #830162] INFO -- : [ 86/885] 871528=test_path_to_class I, [2024-05-14T01:22:35.526735 #830162] INFO -- : [ 87/885] 871536=test_gem_resolver_specification I, [2024-05-14T01:22:35.530677 #830162] INFO -- : [ 88/885] 871528=test_gem_dependency I, [2024-05-14T01:22:35.542214 #830162] INFO -- : [ 89/885] 871535=test_inlinecache I, [2024-05-14T01:22:35.556716 #830162] INFO -- : [ 90/885] 871537=test_rdoc_markup_verbatim I, [2024-05-14T01:22:35.559328 #830162] INFO -- : [ 91/885] 871537=test_gem_remote_fetcher I, [2024-05-14T01:22:35.578994 #830162] INFO -- : [ 92/885] 871534=test_parse I, [2024-05-14T01:22:35.586647 #830162] INFO -- : [ 93/885] 871535=test_mdns I, [2024-05-14T01:22:35.610561 #830162] INFO -- : [ 94/885] 871535=test_gem_resolver_installed_specification I, [2024-05-14T01:22:35.616620 #830162] INFO -- : [ 95/885] 871531=test_scanner_events I, [2024-05-14T01:22:35.617016 #830162] INFO -- : [ 96/885] 871525=test_reqarg I, [2024-05-14T01:22:35.617243 #830162] INFO -- : [ 97/885] 871538=test_rdoc_include I, [2024-05-14T01:22:35.638993 #830162] INFO -- : [ 98/885] 871540=test_stack I, [2024-05-14T01:22:35.651654 #830162] INFO -- : [ 99/885] 871531=test_gem_commands_list_command I, [2024-05-14T01:22:35.661494 #830162] INFO -- : [100/885] 871531=test_too_many_dummy_encodings I, [2024-05-14T01:22:35.664738 #830162] INFO -- : [101/885] 871532=test_econv I, [2024-05-14T01:22:35.670018 #830162] INFO -- : [102/885] 871528=test_cesu8 I, [2024-05-14T01:22:35.688131 #830162] INFO -- : [103/885] 871528=test_rdoc_options I, [2024-05-14T01:22:35.732056 #830162] INFO -- : [104/885] 871531=test_gem_version I, [2024-05-14T01:22:35.737520 #830162] INFO -- : [105/885] 871536=test_ldap I, [2024-05-14T01:22:35.750900 #830162] INFO -- : [106/885] 871536=test_emitter I, [2024-05-14T01:22:35.756497 #830162] INFO -- : [107/885] 871536=test_gem_commands_signin_command I, [2024-05-14T01:22:35.786387 #830162] INFO -- : [108/885] 871535=test_resource I, [2024-05-14T01:22:35.786446 #830162] INFO -- : [109/885] 871538=test_string_processing I, [2024-05-14T01:22:35.794486 #830162] INFO -- : [110/885] 871531=test_fileutils I, [2024-05-14T01:22:35.799715 #830162] INFO -- : [111/885] 871535=test_tree_builder I, [2024-05-14T01:22:35.802407 #830162] INFO -- : [112/885] 871535=test_gem_resolver_dependency_request I, [2024-05-14T01:22:35.814871 #830162] INFO -- : [113/885] 871543=test_hash I, [2024-05-14T01:22:35.821069 #830162] INFO -- : [114/885] 871535=test_alias_and_anchor I, [2024-05-14T01:22:35.823178 #830162] INFO -- : [115/885] 871535=test_postponed_job I, [2024-05-14T01:22:35.847127 #830162] INFO -- : [116/885] 871543=test_external_new I, [2024-05-14T01:22:35.847503 #830162] INFO -- : [117/885] 871538=test_gem_request_set_lockfile I, [2024-05-14T01:22:35.849188 #830162] INFO -- : [118/885] 871533=test_raise_exception I, [2024-05-14T01:22:35.853597 #830162] INFO -- : [119/885] 871536=test_protect I, [2024-05-14T01:22:35.854160 #830162] INFO -- : [120/885] 871543=test_win32ole_typelib I, [2024-05-14T01:22:35.857021 #830162] INFO -- : [121/885] 871536=test_argf I, [2024-05-14T01:22:35.858346 #830162] INFO -- : [122/885] 871543=test_kill_ring I, [2024-05-14T01:22:35.871587 #830162] INFO -- : [123/885] 871543=test_ns_spki I, [2024-05-14T01:22:35.890389 #830162] INFO -- : [124/885] 871530=test_framework I, [2024-05-14T01:22:35.896909 #830162] INFO -- : [125/885] 871543=test_weakmap I, [2024-05-14T01:22:35.911806 #830162] INFO -- : [126/885] 871530=test_workspace I, [2024-05-14T01:22:35.964785 #830162] INFO -- : [127/885] 871525=test_yjit I, [2024-05-14T01:22:35.972405 #830162] INFO -- : [128/885] 871525=test_ws I, [2024-05-14T01:22:35.988873 #830162] INFO -- : [129/885] 871525=test_gem_commands_environment_command I, [2024-05-14T01:22:36.021786 #830162] INFO -- : [130/885] 871525=test_m17n I, [2024-05-14T01:22:36.028201 #830162] INFO -- : [131/885] 871541=test_gem_security_trust_dir I, [2024-05-14T01:22:36.070820 #830162] INFO -- : [132/885] 871529=test_string_memory I, [2024-05-14T01:22:36.091764 #830162] INFO -- : [133/885] 871525=comments_test I, [2024-05-14T01:22:36.098500 #830162] INFO -- : [134/885] 871529=test_sprintf I, [2024-05-14T01:22:36.111295 #830162] INFO -- : [135/885] 871530=test_gem_requirement I, [2024-05-14T01:22:36.112028 #830162] INFO -- : [136/885] 871531=test_line_editor I, [2024-05-14T01:22:36.113432 #830162] INFO -- : [137/885] 871538=test_objspace I, [2024-05-14T01:22:36.138932 #830162] INFO -- : [138/885] 871528=ripper_test I, [2024-05-14T01:22:36.142372 #830162] INFO -- : [139/885] 871535=test_undef I, [2024-05-14T01:22:36.145858 #830162] INFO -- : [140/885] 871535=test_c_struct_entry I, [2024-05-14T01:22:36.192459 #830162] INFO -- : [141/885] 871531=test_lock_native_thread I, [2024-05-14T01:22:36.200057 #830162] INFO -- : [142/885] 871534=test_gem_commands_stale_command I, [2024-05-14T01:22:36.205074 #830162] INFO -- : [143/885] 871525=test_have_library I, [2024-05-14T01:22:36.215164 #830162] INFO -- : [144/885] 871541=test_remote_fetch_error I, [2024-05-14T01:22:36.228821 #830162] INFO -- : [145/885] 871541=test_show_source I, [2024-05-14T01:22:36.263032 #830162] INFO -- : [146/885] 871530=test_set I, [2024-05-14T01:22:36.265995 #830162] INFO -- : [147/885] 871530=test_gem_impossible_dependencies_error I, [2024-05-14T01:22:36.273416 #830162] INFO -- : [148/885] 871530=test_array_create I, [2024-05-14T01:22:36.277584 #830162] INFO -- : [149/885] 871530=test_pack I, [2024-05-14T01:22:36.289149 #830162] INFO -- : [150/885] 871535=test_to_ruby I, [2024-05-14T01:22:36.290966 #830162] INFO -- : [151/885] 871529=test_pattern_key_name_check I, [2024-05-14T01:22:36.303164 #830162] INFO -- : [152/885] 871535=test_rdoc_rubygems_hook I, [2024-05-14T01:22:36.309462 #830162] INFO -- : [153/885] 871529=test_gem_commands_query_command I, [2024-05-14T01:22:36.352035 #830162] INFO -- : [154/885] 871541=test_method I, [2024-05-14T01:22:36.384138 #830162] INFO -- : [155/885] 871534=test_rdoc_context_section I, [2024-05-14T01:22:36.502674 #830162] INFO -- : [156/885] 871530=test_euc_kr I, [2024-05-14T01:22:36.506942 #830162] INFO -- : [157/885] 871530=test_ftp I, [2024-05-14T01:22:36.513257 #830162] INFO -- : [158/885] 871530=test_io_wait I, [2024-05-14T01:22:36.515838 #830162] INFO -- : [159/885] 871531=test_gem_commands_exec_command I, [2024-05-14T01:22:36.538785 #830162] INFO -- : [160/885] 871540=test_kwargs I, [2024-05-14T01:22:36.538852 #830162] INFO -- : [161/885] 871535=warnings_test I, [2024-05-14T01:22:36.538867 #830162] INFO -- : [162/885] 871540=test_ellipsize I, [2024-05-14T01:22:36.547400 #830162] INFO -- : [163/885] 871540=test_date_attr I, [2024-05-14T01:22:36.550420 #830162] INFO -- : [164/885] 871540=test_console_attr I, [2024-05-14T01:22:36.551454 #830162] INFO -- : [165/885] 871540=test_summary I, [2024-05-14T01:22:36.552754 #830162] INFO -- : [166/885] 871534=test_type_completor I, [2024-05-14T01:22:36.556865 #830162] INFO -- : [167/885] 871533=test_gem_unsatisfiable_dependency_error I, [2024-05-14T01:22:36.561061 #830162] INFO -- : [168/885] 871534=test_win32ole_record I, [2024-05-14T01:22:36.564553 #830162] INFO -- : [169/885] 871534=test_cp949 I, [2024-05-14T01:22:36.568652 #830162] INFO -- : [170/885] 871534=test_gem_commands_uninstall_command I, [2024-05-14T01:22:36.603878 #830162] INFO -- : [171/885] 871535=test_foreach I, [2024-05-14T01:22:36.607182 #830162] INFO -- : [172/885] 871535=test_gem_source_specific_file I, [2024-05-14T01:22:36.636831 #830162] INFO -- : [173/885] 871532=test_condition I, [2024-05-14T01:22:36.640209 #830162] INFO -- : [174/885] 871532=test_io I, [2024-05-14T01:22:36.646832 #830162] INFO -- : [175/885] 871542=test_sorted_set I, [2024-05-14T01:22:36.661804 #830162] INFO -- : [176/885] 871524=test_win32ole_type_event I, [2024-05-14T01:22:36.666865 #830162] INFO -- : [177/885] 871524=test_emoji I, [2024-05-14T01:22:36.685621 #830162] INFO -- : [178/885] 871540=test_ubf_async_safe I, [2024-05-14T01:22:36.687140 #830162] INFO -- : [179/885] 871535=test_hash I, [2024-05-14T01:22:36.693042 #830162] INFO -- : [180/885] 871540=test_libs I, [2024-05-14T01:22:36.693398 #830162] INFO -- : [181/885] 871524=test_math I, [2024-05-14T01:22:36.711508 #830162] INFO -- : [182/885] 871524=test_gem_commands_fetch_command I, [2024-05-14T01:22:36.750626 #830162] INFO -- : [183/885] 871533=test_gc I, [2024-05-14T01:22:36.752690 #830162] INFO -- : [184/885] 871540=test_sleep I, [2024-05-14T01:22:36.754441 #830162] INFO -- : [185/885] 871533=test_config I, [2024-05-14T01:22:36.757650 #830162] INFO -- : [186/885] 871528=test_yaml_tree I, [2024-05-14T01:22:36.780600 #830162] INFO -- : [187/885] 871528=test_sizeof I, [2024-05-14T01:22:36.813223 #830162] INFO -- : [188/885] 871533=test_case I, [2024-05-14T01:22:36.821822 #830162] INFO -- : [189/885] 871524=test_face I, [2024-05-14T01:22:36.832688 #830162] INFO -- : [190/885] 871533=test_rendering I, [2024-05-14T01:22:36.834871 #830162] INFO -- : [191/885] 871524=test_utf16 I, [2024-05-14T01:22:36.844452 #830162] INFO -- : [192/885] 871524=test_autoload I, [2024-05-14T01:22:36.847094 #830162] INFO -- : [193/885] 871530=test_io I, [2024-05-14T01:22:36.874656 #830162] INFO -- : [194/885] 871529=test_unicode_escape I, [2024-05-14T01:22:36.900721 #830162] INFO -- : [195/885] 871532=test_pkey_dh I, [2024-05-14T01:22:36.909897 #830162] INFO -- : [196/885] 871533=test_bigzero I, [2024-05-14T01:22:36.910784 #830162] INFO -- : [197/885] 871542=test_gem_package_tar_header I, [2024-05-14T01:22:36.913190 #830162] INFO -- : [198/885] 871533=test_gem_util I, [2024-05-14T01:22:36.946876 #830162] INFO -- : [199/885] 871542=test_iseq_load I, [2024-05-14T01:22:36.947363 #830162] INFO -- : [200/885] 871529=test_system I, [2024-05-14T01:22:36.965878 #830162] INFO -- : [201/885] 871532=test_pkcs12 I, [2024-05-14T01:22:37.098612 #830162] INFO -- : [202/885] 871533=test_yjit_exit_locations I, [2024-05-14T01:22:37.099860 #830162] INFO -- : [203/885] 871533=test_etc I, [2024-05-14T01:22:37.179708 #830162] INFO -- : [204/885] 871533=test_gem_config_file I, [2024-05-14T01:22:37.248454 #830162] INFO -- : [205/885] 871532=test_ripper I, [2024-05-14T01:22:37.283908 #830162] INFO -- : [206/885] 871533=test_getopts I, [2024-05-14T01:22:37.290531 #830162] INFO -- : [207/885] 871533=test_protocol I, [2024-05-14T01:22:37.365060 #830162] INFO -- : [208/885] 871534=test_gem_resolver_activation_request I, [2024-05-14T01:22:37.370569 #830162] INFO -- : [209/885] 871534=test_rat I, [2024-05-14T01:22:37.375279 #830162] INFO -- : [210/885] 871534=test_rdoc_markup_raw I, [2024-05-14T01:22:37.378822 #830162] INFO -- : [211/885] 871534=test_webauthn_poller I, [2024-05-14T01:22:37.391752 #830162] INFO -- : [212/885] 871525=test_rdoc_markup_to_html_crossref I, [2024-05-14T01:22:37.527100 #830162] INFO -- : [213/885] 871534=encoding_test I, [2024-05-14T01:22:37.539770 #830162] INFO -- : [214/885] 871532=test_gem_resolver_best_set I, [2024-05-14T01:22:37.542525 #830162] INFO -- : [215/885] 871531=test_typeddata I, [2024-05-14T01:22:37.568580 #830162] INFO -- : [216/885] 871537=test_fstring I, [2024-05-14T01:22:37.594996 #830162] INFO -- : [217/885] 871532=test_optparse I, [2024-05-14T01:22:37.595503 #830162] INFO -- : [218/885] 871533=test_array I, [2024-05-14T01:22:37.604795 #830162] INFO -- : [219/885] 871533=parser_test I, [2024-05-14T01:22:37.638667 #830162] INFO -- : [220/885] 871534=test_convertible I, [2024-05-14T01:22:37.665314 #830162] INFO -- : [221/885] 871532=test_rdoc_alias I, [2024-05-14T01:22:37.670525 #830162] INFO -- : [222/885] 871533=test_yield I, [2024-05-14T01:22:37.695461 #830162] INFO -- : [223/885] 871537=test_stringscanner I, [2024-05-14T01:22:37.732152 #830162] INFO -- : [224/885] 871537=test_files_sample I, [2024-05-14T01:22:37.736690 #830162] INFO -- : [225/885] 871532=test_rdoc_markup_indented_paragraph I, [2024-05-14T01:22:37.744091 #830162] INFO -- : [226/885] 871532=test_pack I, [2024-05-14T01:22:37.751716 #830162] INFO -- : [227/885] 871531=test_backtrace I, [2024-05-14T01:22:37.769902 #830162] INFO -- : [228/885] 871532=ruby_parser_test I, [2024-05-14T01:22:37.777641 #830162] INFO -- : [229/885] 871539=test_io_buffer I, [2024-05-14T01:22:37.798297 #830162] INFO -- : [230/885] 871537=test_gem_resolver_conflict I, [2024-05-14T01:22:37.813993 #830162] INFO -- : [231/885] 871537=test_rdoc_task I, [2024-05-14T01:22:37.817705 #830162] INFO -- : [232/885] 871537=test_clone I, [2024-05-14T01:22:37.840366 #830162] INFO -- : [233/885] 871532=test_gem_commands_install_command I, [2024-05-14T01:22:37.887970 #830162] INFO -- : [234/885] 871539=test_readpartial I, [2024-05-14T01:22:37.961931 #830162] INFO -- : [235/885] 871529=locals_test I, [2024-05-14T01:22:37.988066 #830162] INFO -- : [236/885] 871543=test_rdoc_require I, [2024-05-14T01:22:38.003187 #830162] INFO -- : [237/885] 871537=test_rdoc_store I, [2024-05-14T01:22:38.012109 #830162] INFO -- : [238/885] 871525=test_depth_first I, [2024-05-14T01:22:38.019597 #830162] INFO -- : [239/885] 871525=test_gem_request_set_lockfile_parser I, [2024-05-14T01:22:38.026940 #830162] INFO -- : [240/885] 871543=test_x509attr I, [2024-05-14T01:22:38.031031 #830162] INFO -- : [241/885] 871543=test_raise I, [2024-05-14T01:22:38.033175 #830162] INFO -- : [242/885] 871543=test_rdoc_stats I, [2024-05-14T01:22:38.056315 #830162] INFO -- : [243/885] 871543=test_pattern_matching I, [2024-05-14T01:22:38.076637 #830162] INFO -- : [244/885] 871543=test_string I, [2024-05-14T01:22:38.098033 #830162] INFO -- : [245/885] 871543=test_gem_dependency_resolution_error I, [2024-05-14T01:22:38.104551 #830162] INFO -- : [246/885] 871543=test_qsort I, [2024-05-14T01:22:38.108424 #830162] INFO -- : [247/885] 871543=test_rdoc_parser I, [2024-05-14T01:22:38.129189 #830162] INFO -- : [248/885] 871543=test_custom_command I, [2024-05-14T01:22:38.134140 #830162] INFO -- : [249/885] 871525=json_addition_test I, [2024-05-14T01:22:38.136898 #830162] INFO -- : [250/885] 871543=test_gc_compact I, [2024-05-14T01:22:38.153709 #830162] INFO -- : [251/885] 871525=test_string I, [2024-05-14T01:22:38.292805 #830162] INFO -- : [252/885] 871539=test_proc I, [2024-05-14T01:22:38.300864 #830162] INFO -- : [253/885] 871529=test_gem_resolver_index_set I, [2024-05-14T01:22:38.333630 #830162] INFO -- : [254/885] 871529=test_gem_package_old I, [2024-05-14T01:22:38.366410 #830162] INFO -- : [255/885] 871529=test_zlib I, [2024-05-14T01:22:38.431237 #830162] INFO -- : [256/885] 871542=test_cgi_tag_helper I, [2024-05-14T01:22:38.467715 #830162] INFO -- : [257/885] 871542=test_egrep_cpp I, [2024-05-14T01:22:38.615935 #830162] INFO -- : [258/885] 871542=test_erb_m17n I, [2024-05-14T01:22:38.619007 #830162] INFO -- : [259/885] 871537=test_ole_methods I, [2024-05-14T01:22:38.619082 #830162] INFO -- : [260/885] 871537=test_date_conv I, [2024-05-14T01:22:38.623147 #830162] INFO -- : [261/885] 871542=test_optimization I, [2024-05-14T01:22:38.625866 #830162] INFO -- : [262/885] 871537=test_rdoc_markup_parser I, [2024-05-14T01:22:38.673761 #830162] INFO -- : [263/885] 871537=test_require_path_check I, [2024-05-14T01:22:38.746560 #830162] INFO -- : [264/885] 871537=test_folderitem2_invokeverb I, [2024-05-14T01:22:38.747791 #830162] INFO -- : [265/885] 871537=test_fnmatch I, [2024-05-14T01:22:38.783714 #830162] INFO -- : [266/885] 871537=test_files_test_2 I, [2024-05-14T01:22:38.797810 #830162] INFO -- : [267/885] 871537=test_gem_validator I, [2024-05-14T01:22:38.805548 #830162] INFO -- : [268/885] 871537=test_io_buffer I, [2024-05-14T01:22:38.820172 #830162] INFO -- : [269/885] 871540=test_key_name_check I, [2024-05-14T01:22:38.825116 #830162] INFO -- : [270/885] 871540=test_backtrace I, [2024-05-14T01:22:38.832128 #830162] INFO -- : [271/885] 871540=test_defined I, [2024-05-14T01:22:38.846482 #830162] INFO -- : [272/885] 871537=test_rdoc_i18n_text I, [2024-05-14T01:22:38.855930 #830162] INFO -- : [273/885] 871537=test_gem_uninstaller I, [2024-05-14T01:22:38.859271 #830162] INFO -- : [274/885] 871541=test_buffering I, [2024-05-14T01:22:38.865439 #830162] INFO -- : [275/885] 871541=test_svcb_https I, [2024-05-14T01:22:38.891739 #830162] INFO -- : [276/885] 871541=test_gb18030 I, [2024-05-14T01:22:38.899873 #830162] INFO -- : [277/885] 871541=test_time I, [2024-05-14T01:22:38.906051 #830162] INFO -- : [278/885] 871540=test_windows_1251 I, [2024-05-14T01:22:38.908351 #830162] INFO -- : [279/885] 871540=test_rdoc_rdoc I, [2024-05-14T01:22:38.979764 #830162] INFO -- : [280/885] 871540=test_rdoc_markup_attributes I, [2024-05-14T01:22:38.980433 #830162] INFO -- : [281/885] 871540=test_null I, [2024-05-14T01:22:38.986844 #830162] INFO -- : [282/885] 871540=test_win32ole_type I, [2024-05-14T01:22:38.987245 #830162] INFO -- : [283/885] 871540=test_mul I, [2024-05-14T01:22:38.995480 #830162] INFO -- : [284/885] 871531=test_rdoc_markup_to_rdoc I, [2024-05-14T01:22:39.001415 #830162] INFO -- : [285/885] 871540=test_rdoc_rd_inline_parser I, [2024-05-14T01:22:39.018853 #830162] INFO -- : [286/885] 871540=test_default_gems I, [2024-05-14T01:22:39.026008 #830162] INFO -- : [287/885] 871541=test_thread I, [2024-05-14T01:22:39.028700 #830162] INFO -- : [288/885] 871541=test_trick I, [2024-05-14T01:22:39.043867 #830162] INFO -- : [289/885] 871539=test_pipe I, [2024-05-14T01:22:39.094928 #830162] INFO -- : [290/885] 871540=test_pkey_ec I, [2024-05-14T01:22:39.146923 #830162] INFO -- : [291/885] 871531=test_date_parse I, [2024-05-14T01:22:39.200289 #830162] INFO -- : [292/885] 871540=test_enc_raise I, [2024-05-14T01:22:39.203809 #830162] INFO -- : [293/885] 871540=test_psych I, [2024-05-14T01:22:39.217373 #830162] INFO -- : [294/885] 871539=!Nothing_to_test I, [2024-05-14T01:22:39.217894 #830162] INFO -- : [295/885] 871539=test_rdoc_markup_paragraph I, [2024-05-14T01:22:39.223397 #830162] INFO -- : [296/885] 871540=test_at_exit I, [2024-05-14T01:22:39.224987 #830162] INFO -- : [297/885] 871532=test_command I, [2024-05-14T01:22:39.243649 #830162] INFO -- : [298/885] 871540=test_gem_ext_cargo_builder_unit I, [2024-05-14T01:22:39.262697 #830162] INFO -- : [299/885] 871531=test_gem_rdoc I, [2024-05-14T01:22:39.329352 #830162] INFO -- : [300/885] 871539=test_date I, [2024-05-14T01:22:39.334971 #830162] INFO -- : [301/885] 871539=test_object_create_start I, [2024-05-14T01:22:39.337485 #830162] INFO -- : [302/885] 871539=test_emitter I, [2024-05-14T01:22:39.342316 #830162] INFO -- : [303/885] 871539=test_gem_silent_ui I, [2024-05-14T01:22:39.360918 #830162] INFO -- : [304/885] 871527=test_files_ext I, [2024-05-14T01:22:39.363052 #830162] INFO -- : [305/885] 871539=test_bug-5832 I, [2024-05-14T01:22:39.369455 #830162] INFO -- : [306/885] 871539=test_kernel I, [2024-05-14T01:22:39.399686 #830162] INFO -- : [307/885] 871531=test_eval_history I, [2024-05-14T01:22:39.415640 #830162] INFO -- : [308/885] 871540=dispatcher_test I, [2024-05-14T01:22:39.428354 #830162] INFO -- : [309/885] 871540=test_gem_doctor I, [2024-05-14T01:22:39.472917 #830162] INFO -- : [310/885] 871540=test_kdf I, [2024-05-14T01:22:39.490914 #830162] INFO -- : [311/885] 871531=test_config I, [2024-05-14T01:22:39.516338 #830162] INFO -- : [312/885] 871531=test_yaml_special_cases I, [2024-05-14T01:22:39.518073 #830162] INFO -- : [313/885] 871527=test_optarg I, [2024-05-14T01:22:39.530651 #830162] INFO -- : [314/885] 871531=test_gem_source_list I, [2024-05-14T01:22:39.542406 #830162] INFO -- : [315/885] 871540=test_rdoc_token_stream I, [2024-05-14T01:22:39.558653 #830162] INFO -- : [316/885] 871540=test_address_resolve I, [2024-05-14T01:22:39.592741 #830162] INFO -- : [317/885] 871531=test_zsh_completion I, [2024-05-14T01:22:39.599543 #830162] INFO -- : [318/885] 871531=test_exception I, [2024-05-14T01:22:39.605876 #830162] INFO -- : [319/885] 871531=test_iter_break I, [2024-05-14T01:22:39.612505 #830162] INFO -- : [320/885] 871531=test_verbose I, [2024-05-14T01:22:39.630115 #830162] INFO -- : [321/885] 871531=test_nil I, [2024-05-14T01:22:39.634989 #830162] INFO -- : [322/885] 871540=test_num2int I, [2024-05-14T01:22:39.635190 #830162] INFO -- : [323/885] 871531=test_rdoc_single_class I, [2024-05-14T01:22:39.637420 #830162] INFO -- : [324/885] 871527=test_macro I, [2024-05-14T01:22:39.647966 #830162] INFO -- : [325/885] 871540=test_frozen I, [2024-05-14T01:22:39.654448 #830162] INFO -- : [326/885] 871540=test_gem_ext_configure_builder I, [2024-05-14T01:22:39.658042 #830162] INFO -- : [327/885] 871531=test_pp I, [2024-05-14T01:22:39.684102 #830162] INFO -- : [328/885] 871532=test_rdoc_tom_doc I, [2024-05-14T01:22:39.691235 #830162] INFO -- : [329/885] 871527=test_hmac I, [2024-05-14T01:22:39.700631 #830162] INFO -- : [330/885] 871532=test_rdoc_markup_to_tt_only I, [2024-05-14T01:22:39.711041 #830162] INFO -- : [331/885] 871540=test_gem_command I, [2024-05-14T01:22:39.712271 #830162] INFO -- : [332/885] 871531=test_bug-3571 I, [2024-05-14T01:22:39.716648 #830162] INFO -- : [333/885] 871537=test_key_actor_vi I, [2024-05-14T01:22:39.728039 #830162] INFO -- : [334/885] 871531=test_common I, [2024-05-14T01:22:39.739001 #830162] INFO -- : [335/885] 871532=test_gem_spec_fetcher I, [2024-05-14T01:22:39.741556 #830162] INFO -- : [336/885] 871527=test_numeric I, [2024-05-14T01:22:39.798143 #830162] INFO -- : [337/885] 871528=test_assignment I, [2024-05-14T01:22:39.798460 #830162] INFO -- : [338/885] 871540=test_ifunless I, [2024-05-14T01:22:39.804048 #830162] INFO -- : [339/885] 871540=test_gem_commands_lock_command I, [2024-05-14T01:22:39.826824 #830162] INFO -- : [340/885] 871540=test_gem_source_local I, [2024-05-14T01:22:39.853175 #830162] INFO -- : [341/885] 871527=test_gem_security_policy I, [2024-05-14T01:22:39.870107 #830162] INFO -- : [342/885] 871539=test_last_thread I, [2024-05-14T01:22:39.926097 #830162] INFO -- : [343/885] 871532=test_process I, [2024-05-14T01:22:39.954381 #830162] INFO -- : [344/885] 871537=test_pack I, [2024-05-14T01:22:39.958156 #830162] INFO -- : [345/885] 871531=test_err_in_callback I, [2024-05-14T01:22:39.962370 #830162] INFO -- : [346/885] 871531=test_gem_resolver_lock_specification I, [2024-05-14T01:22:40.001555 #830162] INFO -- : [347/885] 871531=test_gc I, [2024-05-14T01:22:40.049207 #830162] INFO -- : [348/885] 871540=test_x509cert I, [2024-05-14T01:22:40.127396 #830162] INFO -- : [349/885] 871536=test_arity I, [2024-05-14T01:22:40.130871 #830162] INFO -- : [350/885] 871537=test_gem_ext_rake_builder I, [2024-05-14T01:22:40.142054 #830162] INFO -- : [351/885] 871536=test_logdevice I, [2024-05-14T01:22:40.315637 #830162] INFO -- : [352/885] 871540=test_singleton I, [2024-05-14T01:22:40.323228 #830162] INFO -- : [353/885] 871540=test_flush I, [2024-05-14T01:22:40.325418 #830162] INFO -- : [354/885] 871540=test_io_console I, [2024-05-14T01:22:40.392692 #830162] INFO -- : [355/885] 871526=test_switch_hitter I, [2024-05-14T01:22:40.408772 #830162] INFO -- : [356/885] 871527=test_securerandom I, [2024-05-14T01:22:40.421655 #830162] INFO -- : [357/885] 871526=test_rdoc_markdown_test I, [2024-05-14T01:22:40.446682 #830162] INFO -- : [358/885] 871527=test_c_union_entity I, [2024-05-14T01:22:40.492565 #830162] INFO -- : [359/885] 871527=test_rdoc_normal_module I, [2024-05-14T01:22:40.504610 #830162] INFO -- : [360/885] 871543=test_logperiod I, [2024-05-14T01:22:40.512186 #830162] INFO -- : [361/885] 871543=test_passing_block I, [2024-05-14T01:22:40.516684 #830162] INFO -- : [362/885] 871543=test_thread_fd_close I, [2024-05-14T01:22:40.523925 #830162] INFO -- : [363/885] 871543=test_uncorrectable_name_check I, [2024-05-14T01:22:40.530807 #830162] INFO -- : [364/885] 871543=newline_test I, [2024-05-14T01:22:40.678414 #830162] INFO -- : [365/885] 871543=test_hash_create I, [2024-05-14T01:22:40.680942 #830162] INFO -- : [366/885] 871543=test_stringchar I, [2024-05-14T01:22:40.756725 #830162] INFO -- : [367/885] 871543=test_rdoc_context I, [2024-05-14T01:22:40.785558 #830162] INFO -- : [368/885] 871527=test_stream I, [2024-05-14T01:22:40.811931 #830162] INFO -- : [369/885] 871527=test_nil2vtempty I, [2024-05-14T01:22:40.823965 #830162] INFO -- : [370/885] 871527=test_rdoc_parser_ruby I, [2024-05-14T01:22:40.894365 #830162] INFO -- : [371/885] 871537=test_open-uri I, [2024-05-14T01:22:40.928140 #830162] INFO -- : [372/885] 871535=test_httpresponse I, [2024-05-14T01:22:40.933158 #830162] INFO -- : [373/885] 871536=test_gem_safe_yaml I, [2024-05-14T01:22:40.940105 #830162] INFO -- : [374/885] 871536=test_syntax I, [2024-05-14T01:22:40.952252 #830162] INFO -- : [375/885] 871539=test_data I, [2024-05-14T01:22:40.959731 #830162] INFO -- : [376/885] 871539=index_write_test I, [2024-05-14T01:22:40.969247 #830162] INFO -- : [377/885] 871529=test_date_new I, [2024-05-14T01:22:40.974190 #830162] INFO -- : [378/885] 871529=test_require I, [2024-05-14T01:22:40.976739 #830162] INFO -- : [379/885] 871529=test_date_time I, [2024-05-14T01:22:40.979533 #830162] INFO -- : [380/885] 871528=test_rdoc_markup_to_joined_paragraph I, [2024-05-14T01:22:40.987714 #830162] INFO -- : [381/885] 871528=test_iso_8859 I, [2024-05-14T01:22:40.989808 #830162] INFO -- : [382/885] 871529=test_tcp I, [2024-05-14T01:22:41.007442 #830162] INFO -- : [383/885] 871535=test_rdoc_text I, [2024-05-14T01:22:41.011678 #830162] INFO -- : [384/885] 871528=test_gem_commands_specification_command I, [2024-05-14T01:22:41.039214 #830162] INFO -- : [385/885] 871529=test_gem_commands_which_command I, [2024-05-14T01:22:41.057322 #830162] INFO -- : [386/885] 871539=test_shift_jis I, [2024-05-14T01:22:41.060809 #830162] INFO -- : [387/885] 871539=test_http I, [2024-05-14T01:22:41.065583 #830162] INFO -- : [388/885] 871535=test_enumerator I, [2024-05-14T01:22:41.067755 #830162] INFO -- : [389/885] 871529=test_flags I, [2024-05-14T01:22:41.078449 #830162] INFO -- : [390/885] 871539=test_inadvertent_creation I, [2024-05-14T01:22:41.091447 #830162] INFO -- : [391/885] 871533=test_rdoc_markup_attribute_manager I, [2024-05-14T01:22:41.145678 #830162] INFO -- : [392/885] 871528=test_name_error I, [2024-05-14T01:22:41.185122 #830162] INFO -- : [393/885] 871539=test_gem_commands_dependency_command I, [2024-05-14T01:22:41.232934 #830162] INFO -- : [394/885] 871528=test_safe_load I, [2024-05-14T01:22:41.241721 #830162] INFO -- : [395/885] 871528=test_gem_resolver_composed_set I, [2024-05-14T01:22:41.256313 #830162] INFO -- : [396/885] 871528=test_gem_resolver I, [2024-05-14T01:22:41.264948 #830162] INFO -- : [397/885] 871537=test_method_cache I, [2024-05-14T01:22:41.268742 #830162] INFO -- : [398/885] 871537=test_gem_request I, [2024-05-14T01:22:41.277437 #830162] INFO -- : [399/885] 871539=test_sprintf_comb I, [2024-05-14T01:22:41.298486 #830162] INFO -- : [400/885] 871533=test_gem_commands_mirror I, [2024-05-14T01:22:41.313286 #830162] INFO -- : [401/885] 871533=test_gem_ext_cargo_builder_link_flag_converter I, [2024-05-14T01:22:41.359027 #830162] INFO -- : [402/885] 871533=test_enumerator_kw I, [2024-05-14T01:22:41.359094 #830162] INFO -- : [403/885] 871527=test_gem_text I, [2024-05-14T01:22:41.361330 #830162] INFO -- : [404/885] 871533=test_settracefunc I, [2024-05-14T01:22:41.404322 #830162] INFO -- : [405/885] 871527=test_generic I, [2024-05-14T01:22:41.416087 #830162] INFO -- : [406/885] 871539=test_win32ole I, [2024-05-14T01:22:41.422813 #830162] INFO -- : [407/885] 871539=test_scan_args I, [2024-05-14T01:22:41.428989 #830162] INFO -- : [408/885] 871539=test_case_options I, [2024-05-14T01:22:41.430427 #830162] INFO -- : [409/885] 871537=test_store I, [2024-05-14T01:22:41.431661 #830162] INFO -- : [410/885] 871539=test_rdoc_cross_reference I, [2024-05-14T01:22:41.436233 #830162] INFO -- : [411/885] 871543=test_scalar I, [2024-05-14T01:22:41.440963 #830162] INFO -- : [412/885] 871527=test_gem_dependency_installer I, [2024-05-14T01:22:41.441954 #830162] INFO -- : [413/885] 871543=test_gem_commands_info_command I, [2024-05-14T01:22:41.476135 #830162] INFO -- : [414/885] 871543=test_bug_reporter I, [2024-05-14T01:22:41.504826 #830162] INFO -- : [415/885] 871541=test_rand I, [2024-05-14T01:22:41.509919 #830162] INFO -- : [416/885] 871528=test_gem_package_tar_reader_entry I, [2024-05-14T01:22:41.637782 #830162] INFO -- : [417/885] 871537=test_gem_name_tuple I, [2024-05-14T01:22:41.655978 #830162] INFO -- : [418/885] 871537=test_exception I, [2024-05-14T01:22:41.705866 #830162] INFO -- : [419/885] 871524=test_gem_stream_ui I, [2024-05-14T01:22:41.731623 #830162] INFO -- : [420/885] 871528=test_extlibs I, [2024-05-14T01:22:41.745229 #830162] INFO -- : [421/885] 871539=test_rdoc_generator_ri I, [2024-05-14T01:22:41.749384 #830162] INFO -- : [422/885] 871539=test_ractor I, [2024-05-14T01:22:41.769025 #830162] INFO -- : [423/885] 871539=test_severity I, [2024-05-14T01:22:41.775967 #830162] INFO -- : [424/885] 871539=test_require_lib I, [2024-05-14T01:22:41.797034 #830162] INFO -- : [425/885] 871526=test_gem_install_update_options I, [2024-05-14T01:22:41.804044 #830162] INFO -- : [426/885] 871524=parse_test I, [2024-05-14T01:22:41.810015 #830162] INFO -- : [427/885] 871541=test_rdoc_markup_to_table_of_contents I, [2024-05-14T01:22:41.815446 #830162] INFO -- : [428/885] 871543=test_thread I, [2024-05-14T01:22:41.887026 #830162] INFO -- : [429/885] 871526=test_socket I, [2024-05-14T01:22:42.000157 #830162] INFO -- : [430/885] 871541=test_objectspace I, [2024-05-14T01:22:42.028358 #830162] INFO -- : [431/885] 871529=test_literal I, [2024-05-14T01:22:42.038560 #830162] INFO -- : [432/885] 871543=test_str2big I, [2024-05-14T01:22:42.043453 #830162] INFO -- : [433/885] 871543=test_dot_dot I, [2024-05-14T01:22:42.046872 #830162] INFO -- : [434/885] 871543=test_c_struct_builder I, [2024-05-14T01:22:42.146133 #830162] INFO -- : [435/885] 871543=test_cclass I, [2024-05-14T01:22:42.271683 #830162] INFO -- : [436/885] 871543=test_gem_request_connection_pools I, [2024-05-14T01:22:42.417841 #830162] INFO -- : [437/885] 871533=test_gem_version_option I, [2024-05-14T01:22:42.458160 #830162] INFO -- : [438/885] 871533=test_grapheme_breaks I, [2024-05-14T01:22:42.458582 #830162] INFO -- : [439/885] 871529=test_case I, [2024-05-14T01:22:42.460657 #830162] INFO -- : [440/885] 871529=test_pkey I, [2024-05-14T01:22:42.479036 #830162] INFO -- : [441/885] 871534=test_parser_events I, [2024-05-14T01:22:42.484692 #830162] INFO -- : [442/885] 871533=test_reline I, [2024-05-14T01:22:42.517697 #830162] INFO -- : [443/885] 871529=test_rdoc_generator_pot_po I, [2024-05-14T01:22:42.520939 #830162] INFO -- : [444/885] 871529=test_ansi_with_terminfo I, [2024-05-14T01:22:42.549222 #830162] INFO -- : [445/885] 871534=test_json_tree I, [2024-05-14T01:22:42.559633 #830162] INFO -- : [446/885] 871534=test_rdoc_markup_to_markdown I, [2024-05-14T01:22:42.572880 #830162] INFO -- : [447/885] 871529=test_memory_view I, [2024-05-14T01:22:42.598053 #830162] INFO -- : [448/885] 871534=test_m17n_comb I, [2024-05-14T01:22:42.775542 #830162] INFO -- : [449/885] 871529=test_ractor I, [2024-05-14T01:22:42.814545 #830162] INFO -- : [450/885] 871533=test_rdoc_attr I, [2024-05-14T01:22:42.826791 #830162] INFO -- : [451/885] 871533=test_env I, [2024-05-14T01:22:42.863736 #830162] INFO -- : [452/885] 871529=test_integer I, [2024-05-14T01:22:42.920708 #830162] INFO -- : [453/885] 871529=desugar_compiler_test I, [2024-05-14T01:22:42.921393 #830162] INFO -- : [454/885] 871541=test_dryrun I, [2024-05-14T01:22:42.924556 #830162] INFO -- : [455/885] 871540=test_gem_commands_setup_command I, [2024-05-14T01:22:42.936155 #830162] INFO -- : [456/885] 871529=test_cgi_modruby I, [2024-05-14T01:22:42.937666 #830162] INFO -- : [457/885] 871541=test_integer I, [2024-05-14T01:22:42.939722 #830162] INFO -- : [458/885] 871529=test_super I, [2024-05-14T01:22:43.203710 #830162] INFO -- : [459/885] 871526=test_rubyoptions I, [2024-05-14T01:22:43.310007 #830162] INFO -- : [460/885] 871543=test_call I, [2024-05-14T01:22:43.423523 #830162] INFO -- : [461/885] 871540=test_https_proxy I, [2024-05-14T01:22:43.440585 #830162] INFO -- : [462/885] 871543=test_rubygems I, [2024-05-14T01:22:43.487933 #830162] INFO -- : [463/885] 871540=test_nextafter I, [2024-05-14T01:22:43.559367 #830162] INFO -- : [464/885] 871540=test_capacity I, [2024-05-14T01:22:43.575898 #830162] INFO -- : [465/885] 871529=test_stat I, [2024-05-14T01:22:43.578560 #830162] INFO -- : [466/885] 871529=test_gem_request_set_lockfile_tokenizer I, [2024-05-14T01:22:43.594401 #830162] INFO -- : [467/885] 871540=test_have_func I, [2024-05-14T01:22:43.629594 #830162] INFO -- : [468/885] 871543=test_gem_resolver_git_specification I, [2024-05-14T01:22:43.650798 #830162] INFO -- : [469/885] 871529=test_object_references I, [2024-05-14T01:22:43.657195 #830162] INFO -- : [470/885] 871529=test_usrmarshal I, [2024-05-14T01:22:43.796474 #830162] INFO -- : [471/885] 871528=test_ssl I, [2024-05-14T01:22:43.816454 #830162] INFO -- : [472/885] 871530=test_ractor I, [2024-05-14T01:22:43.842053 #830162] INFO -- : [473/885] 871527=test_my_integer I, [2024-05-14T01:22:43.845045 #830162] INFO -- : [474/885] 871527=test_thread I, [2024-05-14T01:22:43.868324 #830162] INFO -- : [475/885] 871537=json_ext_parser_test I, [2024-05-14T01:22:43.875007 #830162] INFO -- : [476/885] 871537=test_debugger_integration I, [2024-05-14T01:22:43.892356 #830162] INFO -- : [477/885] 871537=test_rendering I, [2024-05-14T01:22:43.900116 #830162] INFO -- : [478/885] 871529=test_marshal I, [2024-05-14T01:22:43.904531 #830162] INFO -- : [479/885] 871537=test_unicode_normalize I, [2024-05-14T01:22:43.999341 #830162] INFO -- : [480/885] 871543=test_nonblock I, [2024-05-14T01:22:44.028201 #830162] INFO -- : [481/885] 871543=test_weakref I, [2024-05-14T01:22:44.254753 #830162] INFO -- : [482/885] 871543=test_alias I, [2024-05-14T01:22:44.273106 #830162] INFO -- : [483/885] 871530=test_timeout I, [2024-05-14T01:22:44.383955 #830162] INFO -- : [484/885] 871528=test_singleton_function I, [2024-05-14T01:22:44.387856 #830162] INFO -- : [485/885] 871528=test_ancdata I, [2024-05-14T01:22:44.395575 #830162] INFO -- : [486/885] 871528=test_rb_str_dup I, [2024-05-14T01:22:44.396731 #830162] INFO -- : [487/885] 871528=test_reline_key I, [2024-05-14T01:22:44.421780 #830162] INFO -- : [488/885] 871543=test_cgi_core I, [2024-05-14T01:22:44.436410 #830162] INFO -- : [489/885] 871543=test_parser I, [2024-05-14T01:22:44.447909 #830162] INFO -- : [490/885] 871543=parse_stream_test I, [2024-05-14T01:22:44.455401 #830162] INFO -- : [491/885] 871543=test_registry I, [2024-05-14T01:22:44.457400 #830162] INFO -- : [492/885] 871543=test_ractor I, [2024-05-14T01:22:44.463999 #830162] INFO -- : [493/885] 871529=test_gem_commands_open_command I, [2024-05-14T01:22:44.472750 #830162] INFO -- : [494/885] 871524=test_dns I, [2024-05-14T01:22:44.473337 #830162] INFO -- : [495/885] 871543=test_gem_source_lock I, [2024-05-14T01:22:44.496430 #830162] INFO -- : [496/885] 871528=test_gem I, [2024-05-14T01:22:44.523374 #830162] INFO -- : [497/885] 871543=test_rdoc_extend I, [2024-05-14T01:22:44.546328 #830162] INFO -- : [498/885] 871543=test_merge_keys I, [2024-05-14T01:22:44.579078 #830162] INFO -- : [499/885] 871543=test_gem_resolver_api_specification I, [2024-05-14T01:22:44.582109 #830162] INFO -- : [500/885] 871529=test_ipaddr I, [2024-05-14T01:22:44.613179 #830162] INFO -- : [501/885] 871529=test_history I, [2024-05-14T01:22:44.619205 #830162] INFO -- : [502/885] 871543=test_mixed_unicode_escapes I, [2024-05-14T01:22:44.623165 #830162] INFO -- : [503/885] 871543=test_rdoc_markup_to_ansi I, [2024-05-14T01:22:44.634427 #830162] INFO -- : [504/885] 871529=test_win32ole_variant I, [2024-05-14T01:22:44.640801 #830162] INFO -- : [505/885] 871529=test_win32ole_variable I, [2024-05-14T01:22:44.642560 #830162] INFO -- : [506/885] 871529=test_arity I, [2024-05-14T01:22:44.647593 #830162] INFO -- : [507/885] 871529=test_stringio I, [2024-05-14T01:22:44.666521 #830162] INFO -- : [508/885] 871543=test_io_wait_uncommon I, [2024-05-14T01:22:44.676321 #830162] INFO -- : [509/885] 871543=test_bignum I, [2024-05-14T01:22:44.816534 #830162] INFO -- : [510/885] 871543=test_rdoc_class_module I, [2024-05-14T01:22:44.822857 #830162] INFO -- : [511/885] 871529=test_gem_ci_detector I, [2024-05-14T01:22:44.829127 #830162] INFO -- : [512/885] 871529=test_rdoc_generator_json_index I, [2024-05-14T01:22:44.865559 #830162] INFO -- : [513/885] 871529=test_win32ole_event I, [2024-05-14T01:22:44.867157 #830162] INFO -- : [514/885] 871529=test_time_tz I, [2024-05-14T01:22:44.936296 #830162] INFO -- : [515/885] 871524=ractor_test I, [2024-05-14T01:22:44.977494 #830162] INFO -- : [516/885] 871529=test_trace I, [2024-05-14T01:22:44.994933 #830162] INFO -- : [517/885] 871529=test_have_macro I, [2024-05-14T01:22:45.019263 #830162] INFO -- : [518/885] 871542=test_complex2 I, [2024-05-14T01:22:45.023679 #830162] INFO -- : [519/885] 871524=test_resolve_symbol I, [2024-05-14T01:22:45.042103 #830162] INFO -- : [520/885] 871542=test_gem_package I, [2024-05-14T01:22:45.086962 #830162] INFO -- : [521/885] 871524=test_threadgroup I, [2024-05-14T01:22:45.151661 #830162] INFO -- : [522/885] 871534=test_gem_specification I, [2024-05-14T01:22:45.266699 #830162] INFO -- : [523/885] 871530=test_enum I, [2024-05-14T01:22:45.295342 #830162] INFO -- : [524/885] 871539=test_gem_resolver_requirement_list I, [2024-05-14T01:22:45.304170 #830162] INFO -- : [525/885] 871539=test_arith_seq_beg_len_step I, [2024-05-14T01:22:45.315882 #830162] INFO -- : [526/885] 871540=test_pkcs7 I, [2024-05-14T01:22:45.374878 #830162] INFO -- : [527/885] 871539=test_function_entry I, [2024-05-14T01:22:45.377567 #830162] INFO -- : [528/885] 871539=test_coder I, [2024-05-14T01:22:45.392393 #830162] INFO -- : [529/885] 871539=test_symbol I, [2024-05-14T01:22:45.449796 #830162] INFO -- : [530/885] 871543=test_context I, [2024-05-14T01:22:45.543303 #830162] INFO -- : [531/885] 871543=test_gem_commands_pristine_command I, [2024-05-14T01:22:45.543978 #830162] INFO -- : [532/885] 871540=test_nofree I, [2024-05-14T01:22:45.548366 #830162] INFO -- : [533/885] 871540=ruby_api_test I, [2024-05-14T01:22:45.551909 #830162] INFO -- : [534/885] 871529=test_find_executable I, [2024-05-14T01:22:45.556967 #830162] INFO -- : [535/885] 871529=test_enc_associate I, [2024-05-14T01:22:45.624755 #830162] INFO -- : [536/885] 871542=test_lazy_enumerator I, [2024-05-14T01:22:45.703461 #830162] INFO -- : [537/885] 871541=test_unix I, [2024-05-14T01:22:45.722638 #830162] INFO -- : [538/885] 871540=test_ractor_compatibility I, [2024-05-14T01:22:45.747358 #830162] INFO -- : [539/885] 871541=format_errors_test I, [2024-05-14T01:22:45.811353 #830162] INFO -- : [540/885] 871541=test_dir I, [2024-05-14T01:22:45.938525 #830162] INFO -- : [541/885] 871542=test_gem_console_ui I, [2024-05-14T01:22:45.943102 #830162] INFO -- : [542/885] 871542=test_date_ractor I, [2024-05-14T01:22:45.954602 #830162] INFO -- : [543/885] 871533=test_eval I, [2024-05-14T01:22:45.958496 #830162] INFO -- : [544/885] 871533=test_autoconf I, [2024-05-14T01:22:45.966412 #830162] INFO -- : [545/885] 871533=test_cgi_multipart I, [2024-05-14T01:22:46.095247 #830162] INFO -- : [546/885] 871524=test_word I, [2024-05-14T01:22:46.096008 #830162] INFO -- : [547/885] 871524=test_gem_commands_cleanup_command I, [2024-05-14T01:22:46.123473 #830162] INFO -- : [548/885] 871541=test_numeric I, [2024-05-14T01:22:46.134022 #830162] INFO -- : [549/885] 871529=test_member I, [2024-05-14T01:22:46.136537 #830162] INFO -- : [550/885] 871529=test_http_request I, [2024-05-14T01:22:46.148515 #830162] INFO -- : [551/885] 871533=json_generic_object_test I, [2024-05-14T01:22:46.149994 #830162] INFO -- : [552/885] 871541=test_gem_source_fetch_problem I, [2024-05-14T01:22:46.162861 #830162] INFO -- : [553/885] 871533=test_rdoc_generator_darkfish I, [2024-05-14T01:22:46.167642 #830162] INFO -- : [554/885] 871541=test_rdoc_comment I, [2024-05-14T01:22:46.218595 #830162] INFO -- : [555/885] 871540=test_resize I, [2024-05-14T01:22:46.220350 #830162] INFO -- : [556/885] 871541=test_error_highlight I, [2024-05-14T01:22:46.228156 #830162] INFO -- : [557/885] 871529=test_mailto I, [2024-05-14T01:22:46.228219 #830162] INFO -- : [558/885] 871530=test_coderange I, [2024-05-14T01:22:46.231632 #830162] INFO -- : [559/885] 871540=location_test I, [2024-05-14T01:22:46.233516 #830162] INFO -- : [560/885] 871530=test_symbol I, [2024-05-14T01:22:46.241480 #830162] INFO -- : [561/885] 871542=test_logger I, [2024-05-14T01:22:46.242098 #830162] INFO -- : [562/885] 871529=test_file_exhaustive I, [2024-05-14T01:22:46.245506 #830162] INFO -- : [563/885] 871530=test_gem_update_suggestion I, [2024-05-14T01:22:46.252286 #830162] INFO -- : [564/885] 871542=test_files_test I, [2024-05-14T01:22:46.300698 #830162] INFO -- : [565/885] 871540=test_rdoc_parser_markdown I, [2024-05-14T01:22:46.313984 #830162] INFO -- : [566/885] 871540=test_gem_resolver_lock_set I, [2024-05-14T01:22:46.327200 #830162] INFO -- : [567/885] 871530=test_not I, [2024-05-14T01:22:46.332978 #830162] INFO -- : [568/885] 871530=test_import I, [2024-05-14T01:22:46.340415 #830162] INFO -- : [569/885] 871540=test_gem_platform I, [2024-05-14T01:22:46.383136 #830162] INFO -- : [570/885] 871542=test_gem_package_task I, [2024-05-14T01:22:46.386545 #830162] INFO -- : [571/885] 871542=test_date_strptime I, [2024-05-14T01:22:46.429475 #830162] INFO -- : [572/885] 871540=test_placearg I, [2024-05-14T01:22:46.493292 #830162] INFO -- : [573/885] 871542=test_rdoc_markup_hard_break I, [2024-05-14T01:22:46.509581 #830162] INFO -- : [574/885] 871540=test_gem_commands_push_command I, [2024-05-14T01:22:46.587257 #830162] INFO -- : [575/885] 871533=test_weakkeymap I, [2024-05-14T01:22:46.604139 #830162] INFO -- : [576/885] 871524=test_numhash I, [2024-05-14T01:22:46.610023 #830162] INFO -- : [577/885] 871524=test_pkey_rsa I, [2024-05-14T01:22:46.618643 #830162] INFO -- : [578/885] 871528=test_class_name_check I, [2024-05-14T01:22:46.644091 #830162] INFO -- : [579/885] 871542=test_keyword I, [2024-05-14T01:22:46.644408 #830162] INFO -- : [580/885] 871528=test_fd_setsize I, [2024-05-14T01:22:46.647157 #830162] INFO -- : [581/885] 871528=test_continuation I, [2024-05-14T01:22:46.656111 #830162] INFO -- : [582/885] 871528=test_win32ole_method I, [2024-05-14T01:22:46.659492 #830162] INFO -- : [583/885] 871528=test_delete I, [2024-05-14T01:22:46.668409 #830162] INFO -- : [584/885] 871528=test_sleep I, [2024-05-14T01:22:46.700091 #830162] INFO -- : [585/885] 871541=test_date_arith I, [2024-05-14T01:22:46.711636 #830162] INFO -- : [586/885] 871541=test_ruby_lex I, [2024-05-14T01:22:46.861672 #830162] INFO -- : [587/885] 871533=test_object I, [2024-05-14T01:22:46.865522 #830162] INFO -- : [588/885] 871541=test_gem_local_remote_options I, [2024-05-14T01:22:46.911608 #830162] INFO -- : [589/885] 871541=test_timeout I, [2024-05-14T01:22:46.922525 #830162] INFO -- : [590/885] 871541=test_normalize I, [2024-05-14T01:22:46.922586 #830162] INFO -- : [591/885] 871541=test_ossl I, [2024-05-14T01:22:46.924933 #830162] INFO -- : [592/885] 871530=test_change_word I, [2024-05-14T01:22:46.930605 #830162] INFO -- : [593/885] 871530=test_flip I, [2024-05-14T01:22:46.939277 #830162] INFO -- : [594/885] 871524=compiler_test I, [2024-05-14T01:22:46.944258 #830162] INFO -- : [595/885] 871524=test_signedness I, [2024-05-14T01:22:46.953009 #830162] INFO -- : [596/885] 871530=test_tsort I, [2024-05-14T01:22:46.956279 #830162] INFO -- : [597/885] 871530=test_rdoc_rd_block_parser I, [2024-05-14T01:22:46.957697 #830162] INFO -- : [598/885] 871543=test_pointer I, [2024-05-14T01:22:46.979810 #830162] INFO -- : [599/885] 871540=test_big5 I, [2024-05-14T01:22:46.982257 #830162] INFO -- : [600/885] 871540=test_func I, [2024-05-14T01:22:47.084154 #830162] INFO -- : [601/885] 871537=test_ractor I, [2024-05-14T01:22:47.166440 #830162] INFO -- : [602/885] 871537=test_type I, [2024-05-14T01:22:47.171988 #830162] INFO -- : [603/885] 871530=version_test I, [2024-05-14T01:22:47.175056 #830162] INFO -- : [604/885] 871537=test_object I, [2024-05-14T01:22:47.184298 #830162] INFO -- : [605/885] 871537=test_cgi_header I, [2024-05-14T01:22:47.194468 #830162] INFO -- : [606/885] 871537=heredoc_dedent_test I, [2024-05-14T01:22:47.201139 #830162] INFO -- : [607/885] 871538=test_arithmetic_sequence I, [2024-05-14T01:22:47.209229 #830162] INFO -- : [608/885] 871538=test_basicinstructions I, [2024-05-14T01:22:47.229273 #830162] INFO -- : [609/885] 871542=test_gem_gemcutter_utilities I, [2024-05-14T01:22:47.256607 #830162] INFO -- : [610/885] 871530=test_gem_command_manager I, [2024-05-14T01:22:47.262921 #830162] INFO -- : [611/885] 871537=test_key_actor_emacs I, [2024-05-14T01:22:47.276808 #830162] INFO -- : [612/885] 871538=test_range I, [2024-05-14T01:22:47.277928 #830162] INFO -- : [613/885] 871533=test_project_sanity I, [2024-05-14T01:22:47.348333 #830162] INFO -- : [614/885] 871533=test_constant I, [2024-05-14T01:22:47.365410 #830162] INFO -- : [615/885] 871537=test_dup I, [2024-05-14T01:22:47.473824 #830162] INFO -- : [616/885] 871536=test_pty I, [2024-05-14T01:22:47.489819 #830162] INFO -- : [617/885] 871543=command_line_test I, [2024-05-14T01:22:47.495787 #830162] INFO -- : [618/885] 871543=test_erb_command I, [2024-05-14T01:22:47.508103 #830162] INFO -- : [619/885] 871530=test_helper I, [2024-05-14T01:22:47.511060 #830162] INFO -- : [620/885] 871530=test_encoding I, [2024-05-14T01:22:47.534891 #830162] INFO -- : [621/885] 871543=test_gem_uri_formatter I, [2024-05-14T01:22:47.545506 #830162] INFO -- : [622/885] 871543=test_ensured I, [2024-05-14T01:22:47.566165 #830162] INFO -- : [623/885] 871537=library_symbols_test I, [2024-05-14T01:22:47.571175 #830162] INFO -- : [624/885] 871537=test_locale I, [2024-05-14T01:22:47.590612 #830162] INFO -- : [625/885] 871542=test_addr I, [2024-05-14T01:22:47.615915 #830162] INFO -- : [626/885] 871542=test_ts I, [2024-05-14T01:22:47.617398 #830162] INFO -- : [627/885] 871543=test_rdoc_ri_paths I, [2024-05-14T01:22:47.621809 #830162] INFO -- : [628/885] 871531=test_integer_comb I, [2024-05-14T01:22:47.623292 #830162] INFO -- : [629/885] 871534=test_rdoc_markup_document I, [2024-05-14T01:22:47.637386 #830162] INFO -- : [630/885] 871534=test_tmpdir I, [2024-05-14T01:22:47.642434 #830162] INFO -- : [631/885] 871543=test_vm_dump I, [2024-05-14T01:22:47.645962 #830162] INFO -- : [632/885] 871543=errors_test I, [2024-05-14T01:22:47.650483 #830162] INFO -- : [633/885] 871537=test_gem_commands_check_command I, [2024-05-14T01:22:47.679547 #830162] INFO -- : [634/885] 871537=test_regexp I, [2024-05-14T01:22:47.714010 #830162] INFO -- : [635/885] 871534=static_inspect_test I, [2024-05-14T01:22:47.720301 #830162] INFO -- : [636/885] 871534=test_udp I, [2024-05-14T01:22:47.727157 #830162] INFO -- : [637/885] 871534=test_data_error I, [2024-05-14T01:22:47.729458 #830162] INFO -- : [638/885] 871543=bom_test I, [2024-05-14T01:22:47.744660 #830162] INFO -- : [639/885] 871543=test_ostruct I, [2024-05-14T01:22:47.759360 #830162] INFO -- : [640/885] 871530=unescape_test I, [2024-05-14T01:22:47.823931 #830162] INFO -- : [641/885] 871534=test_force_exit I, [2024-05-14T01:22:47.825226 #830162] INFO -- : [642/885] 871534=test_file I, [2024-05-14T01:22:47.830237 #830162] INFO -- : [643/885] 871538=test_update I, [2024-05-14T01:22:47.833086 #830162] INFO -- : [644/885] 871538=test_fips I, [2024-05-14T01:22:47.919958 #830162] INFO -- : [645/885] 871543=test_x509name I, [2024-05-14T01:22:47.925270 #830162] INFO -- : [646/885] 871543=test_x509store I, [2024-05-14T01:22:47.975807 #830162] INFO -- : [647/885] 871536=test_rdoc_code_object I, [2024-05-14T01:22:48.073276 #830162] INFO -- : [648/885] 871539=test_webauthn_listener I, [2024-05-14T01:22:48.086585 #830162] INFO -- : [649/885] 871538=test_random_formatter I, [2024-05-14T01:22:48.095103 #830162] INFO -- : [650/885] 871542=test_helper I, [2024-05-14T01:22:48.099967 #830162] INFO -- : [651/885] 871538=test_jaro_winkler I, [2024-05-14T01:22:48.110137 #830162] INFO -- : [652/885] 871538=test_ast I, [2024-05-14T01:22:48.127053 #830162] INFO -- : [653/885] 871543=test_gem_request_set_gem_dependency_api I, [2024-05-14T01:22:48.130655 #830162] INFO -- : [654/885] 871539=test_lambda I, [2024-05-14T01:22:48.159621 #830162] INFO -- : [655/885] 871542=test_gem_resolver_api_set I, [2024-05-14T01:22:48.210220 #830162] INFO -- : [656/885] 871539=test_gem_safe_marshal I, [2024-05-14T01:22:48.221603 #830162] INFO -- : [657/885] 871542=test_enumerable I, [2024-05-14T01:22:48.240526 #830162] INFO -- : [658/885] 871542=test_config I, [2024-05-14T01:22:48.300113 #830162] INFO -- : [659/885] 871543=test_gem_resolver_vendor_set I, [2024-05-14T01:22:48.317559 #830162] INFO -- : [660/885] 871543=json_generator_test I, [2024-05-14T01:22:48.355664 #830162] INFO -- : [661/885] 871536=test_eval I, [2024-05-14T01:22:48.415873 #830162] INFO -- : [662/885] 871543=test_transcode I, [2024-05-14T01:22:48.634045 #830162] INFO -- : [663/885] 871543=test_rdoc_markup_heading I, [2024-05-14T01:22:48.637637 #830162] INFO -- : [664/885] 871543=test_exception_at_throwing I, [2024-05-14T01:22:48.647123 #830162] INFO -- : [665/885] 871536=test_iseq I, [2024-05-14T01:22:48.671767 #830162] INFO -- : [666/885] 871542=test_scheduler I, [2024-05-14T01:22:48.686425 #830162] INFO -- : [667/885] 871540=test_pkey_dsa I, [2024-05-14T01:22:48.716626 #830162] INFO -- : [668/885] 871543=test_ocsp I, [2024-05-14T01:22:48.751121 #830162] INFO -- : [669/885] 871525=test_class I, [2024-05-14T01:22:48.757051 #830162] INFO -- : [670/885] 871525=test_interned_str I, [2024-05-14T01:22:48.769231 #830162] INFO -- : [671/885] 871525=test_case_comprehensive I, [2024-05-14T01:22:48.820807 #830162] INFO -- : [672/885] 871542=test_gem_commands_build_command I, [2024-05-14T01:22:48.893659 #830162] INFO -- : [673/885] 871539=test_cmethod I, [2024-05-14T01:22:48.893732 #830162] INFO -- : [674/885] 871539=test_tracer I, [2024-05-14T01:22:48.980710 #830162] INFO -- : [675/885] 871539=test_append I, [2024-05-14T01:22:48.994567 #830162] INFO -- : [676/885] 871539=test_option I, [2024-05-14T01:22:49.060089 #830162] INFO -- : [677/885] 871543=test_gem_commands_server_command I, [2024-05-14T01:22:49.061166 #830162] INFO -- : [678/885] 871543=test_io_m17n I, [2024-05-14T01:22:49.114339 #830162] INFO -- : [679/885] 871535=test_variable_name_check I, [2024-05-14T01:22:49.138589 #830162] INFO -- : [680/885] 871539=test_did_you_mean I, [2024-05-14T01:22:49.141005 #830162] INFO -- : [681/885] 871535=test_exit I, [2024-05-14T01:22:49.142474 #830162] INFO -- : [682/885] 871542=test_recursion I, [2024-05-14T01:22:49.147252 #830162] INFO -- : [683/885] 871542=test_history I, [2024-05-14T01:22:49.249603 #830162] INFO -- : [684/885] 871539=test_mkmf I, [2024-05-14T01:22:49.252451 #830162] INFO -- : [685/885] 871535=test_date_marshal I, [2024-05-14T01:22:49.256387 #830162] INFO -- : [686/885] 871535=test_delegate I, [2024-05-14T01:22:49.264727 #830162] INFO -- : [687/885] 871535=test_popen_deadlock I, [2024-05-14T01:22:49.275800 #830162] INFO -- : [688/885] 871542=test_bundled_ca I, [2024-05-14T01:22:49.304783 #830162] INFO -- : [689/885] 871539=test_closure I, [2024-05-14T01:22:49.305676 #830162] INFO -- : [690/885] 871524=test_multi_irb_commands I, [2024-05-14T01:22:49.312427 #830162] INFO -- : [691/885] 871536=test_fiber I, [2024-05-14T01:22:49.322143 #830162] INFO -- : [692/885] 871524=test_open3 I, [2024-05-14T01:22:49.402589 #830162] INFO -- : [693/885] 871540=test_ractor I, [2024-05-14T01:22:49.477002 #830162] INFO -- : [694/885] 871540=test_rdoc_servlet I, [2024-05-14T01:22:49.571530 #830162] INFO -- : [695/885] 871539=test_gem_security I, [2024-05-14T01:22:49.582596 #830162] INFO -- : [696/885] 871540=test_digest I, [2024-05-14T01:22:49.587714 #830162] INFO -- : [697/885] 871540=test_help I, [2024-05-14T01:22:49.604679 #830162] INFO -- : [698/885] 871540=test_rdoc_markup_to_bs I, [2024-05-14T01:22:49.646244 #830162] INFO -- : [699/885] 871540=test_files_lib I, [2024-05-14T01:22:49.842194 #830162] INFO -- : [700/885] 871530=test_gem_commands_unpack_command I, [2024-05-14T01:22:49.861945 #830162] INFO -- : [701/885] 871533=test_beginendblock I, [2024-05-14T01:22:49.891290 #830162] INFO -- : [702/885] 871535=reflection_test I, [2024-05-14T01:22:49.896717 #830162] INFO -- : [703/885] 871535=test_emoji_breaks I, [2024-05-14T01:22:49.903474 #830162] INFO -- : [704/885] 871535=test_gem_bundler_version_finder I, [2024-05-14T01:22:49.931284 #830162] INFO -- : [705/885] 871535=test_within_pipe I, [2024-05-14T01:22:50.037091 #830162] INFO -- : [706/885] 871535=test_pinned I, [2024-05-14T01:22:50.100223 #830162] INFO -- : [707/885] 871535=test_to_ary_concat I, [2024-05-14T01:22:50.210799 #830162] INFO -- : [708/885] 871533=test_webauthn_listener_response I, [2024-05-14T01:22:50.211680 #830162] INFO -- : [709/885] 871530=test_time I, [2024-05-14T01:22:50.234913 #830162] INFO -- : [710/885] 871533=test_stream I, [2024-05-14T01:22:50.239472 #830162] INFO -- : [711/885] 871533=test_printf I, [2024-05-14T01:22:50.257648 #830162] INFO -- : [712/885] 871533=test_rdoc_markup_pre_process I, [2024-05-14T01:22:50.334172 #830162] INFO -- : [713/885] 871533=test_install I, [2024-05-14T01:22:50.418660 #830162] INFO -- : [714/885] 871530=test_rdoc_markup_to_label I, [2024-05-14T01:22:50.437669 #830162] INFO -- : [715/885] 871543=test_sockopt I, [2024-05-14T01:22:50.444952 #830162] INFO -- : [716/885] 871530=test_set_len I, [2024-05-14T01:22:50.446634 #830162] INFO -- : [717/885] 871543=test_httpresponses I, [2024-05-14T01:22:50.452551 #830162] INFO -- : [718/885] 871530=test_encoding I, [2024-05-14T01:22:50.469725 #830162] INFO -- : [719/885] 871530=test_gem_resolver_local_specification I, [2024-05-14T01:22:50.504875 #830162] INFO -- : [720/885] 871530=test_httpheader I, [2024-05-14T01:22:50.507265 #830162] INFO -- : [721/885] 871543=test_rdoc_ri_driver I, [2024-05-14T01:22:50.538408 #830162] INFO -- : [722/885] 871530=json_encoding_test I, [2024-05-14T01:22:50.544722 #830162] INFO -- : [723/885] 871530=test_color I, [2024-05-14T01:22:50.574498 #830162] INFO -- : [724/885] 871533=test_key_stroke I, [2024-05-14T01:22:50.582261 #830162] INFO -- : [725/885] 871533=test_rbconfig I, [2024-05-14T01:22:50.586016 #830162] INFO -- : [726/885] 871533=test_human_typo I, [2024-05-14T01:22:50.591869 #830162] INFO -- : [727/885] 871530=test_primitive I, [2024-05-14T01:22:50.593884 #830162] INFO -- : [728/885] 871533=test_chilled I, [2024-05-14T01:22:50.597580 #830162] INFO -- : [729/885] 871533=test_name_error_extension I, [2024-05-14T01:22:50.598485 #830162] INFO -- : [730/885] 871530=test_rdoc_i18n_locale I, [2024-05-14T01:22:50.605003 #830162] INFO -- : [731/885] 871530=test_pair I, [2024-05-14T01:22:50.608156 #830162] INFO -- : [732/885] 871533=test_gem_commands_yank_command I, [2024-05-14T01:22:50.820142 #830162] INFO -- : [733/885] 871543=test_win32ole_param I, [2024-05-14T01:22:50.822762 #830162] INFO -- : [734/885] 871543=test_document I, [2024-05-14T01:22:50.832870 #830162] INFO -- : [735/885] 871543=test_acceptable I, [2024-05-14T01:22:50.907550 #830162] INFO -- : [736/885] 871543=test_rdoc_generator_pot_po_entry I, [2024-05-14T01:22:50.913739 #830162] INFO -- : [737/885] 871543=test_euc_jp I, [2024-05-14T01:22:50.923065 #830162] INFO -- : [738/885] 871543=test_rdoc_parser_changelog I, [2024-05-14T01:22:50.981638 #830162] INFO -- : [739/885] 871542=test_enumerator I, [2024-05-14T01:22:50.989235 #830162] INFO -- : [740/885] 871542=test_koi8 I, [2024-05-14T01:22:50.999000 #830162] INFO -- : [741/885] 871542=parameters_signature_test I, [2024-05-14T01:22:51.003704 #830162] INFO -- : [742/885] 871543=test_unicode I, [2024-05-14T01:22:51.013070 #830162] INFO -- : [743/885] 871542=test_rdoc_generator_pot I, [2024-05-14T01:22:51.014152 #830162] INFO -- : [744/885] 871543=test_filter I, [2024-05-14T01:22:51.022842 #830162] INFO -- : [745/885] 871531=test_gem_gem_runner I, [2024-05-14T01:22:51.046641 #830162] INFO -- : [746/885] 871542=static_literals_test I, [2024-05-14T01:22:51.051260 #830162] INFO -- : [747/885] 871543=test_data I, [2024-05-14T01:22:51.053131 #830162] INFO -- : [748/885] 871543=test_rdoc_method_attr I, [2024-05-14T01:22:51.072279 #830162] INFO -- : [749/885] 871542=test_gem_uri I, [2024-05-14T01:22:51.075783 #830162] INFO -- : [750/885] 871531=test_key_event_record I, [2024-05-14T01:22:51.078398 #830162] INFO -- : [751/885] 871531=test_notimplement I, [2024-05-14T01:22:51.082835 #830162] INFO -- : [752/885] 871531=test_random I, [2024-05-14T01:22:51.096262 #830162] INFO -- : [753/885] 871531=test_gem_resolver_vendor_specification I, [2024-05-14T01:22:51.100054 #830162] INFO -- : [754/885] 871533=test_gem_commands_update_command I, [2024-05-14T01:22:51.105183 #830162] INFO -- : [755/885] 871542=test_ssl_session I, [2024-05-14T01:22:51.127880 #830162] INFO -- : [756/885] 871531=test_lexer I, [2024-05-14T01:22:51.142303 #830162] INFO -- : [757/885] 871531=test_thread_cv I, [2024-05-14T01:22:51.169958 #830162] INFO -- : [758/885] 871543=test_terminfo I, [2024-05-14T01:22:51.171735 #830162] INFO -- : [759/885] 871543=test_compile_prism I, [2024-05-14T01:22:51.443033 #830162] INFO -- : [760/885] 871543=test_date_compat I, [2024-05-14T01:22:51.451762 #830162] INFO -- : [761/885] 871543=test_rdoc_markup_to_html I, [2024-05-14T01:22:51.496236 #830162] INFO -- : [762/885] 871535=test_bug-14834 I, [2024-05-14T01:22:51.530497 #830162] INFO -- : [763/885] 871543=test_addrinfo I, [2024-05-14T01:22:51.553479 #830162] INFO -- : [764/885] 871543=test_http I, [2024-05-14T01:22:51.561499 #830162] INFO -- : [765/885] 871535=test_tree_spell_checker I, [2024-05-14T01:22:51.587253 #830162] INFO -- : [766/885] 871535=test_path I, [2024-05-14T01:22:51.591536 #830162] INFO -- : [767/885] 871535=redundant_return_test I, [2024-05-14T01:22:51.600587 #830162] INFO -- : [768/885] 871535=test_case_mapping I, [2024-05-14T01:22:51.605893 #830162] INFO -- : [769/885] 871535=test_bn I, [2024-05-14T01:22:51.634525 #830162] INFO -- : [770/885] 871535=test_win32ole_param_event I, [2024-05-14T01:22:51.637161 #830162] INFO -- : [771/885] 871535=test_whileuntil I, [2024-05-14T01:22:51.641480 #830162] INFO -- : [772/885] 871535=test_rdoc_generator_markup I, [2024-05-14T01:22:51.646355 #830162] INFO -- : [773/885] 871535=test_configuration I, [2024-05-14T01:22:51.685992 #830162] INFO -- : [774/885] 871524=test_rubyvm I, [2024-05-14T01:22:51.688277 #830162] INFO -- : [775/885] 871528=test_monitor I, [2024-05-14T01:22:51.689829 #830162] INFO -- : [776/885] 871524=test_buffered_io I, [2024-05-14T01:22:51.748871 #830162] INFO -- : [777/885] 871524=test_stringify_symbols I, [2024-05-14T01:22:51.757675 #830162] INFO -- : [778/885] 871524=test_instrumentation_api I, [2024-05-14T01:22:51.760173 #830162] INFO -- : [779/885] 871535=integer_parse_test I, [2024-05-14T01:22:51.767078 #830162] INFO -- : [780/885] 871535=test_boolean I, [2024-05-14T01:22:51.778468 #830162] INFO -- : [781/885] 871535=test_module I, [2024-05-14T01:22:51.784673 #830162] INFO -- : [782/885] 871531=test_gem_request_set I, [2024-05-14T01:22:51.897568 #830162] INFO -- : [783/885] 871528=constant_path_node_test I, [2024-05-14T01:22:51.903361 #830162] INFO -- : [784/885] 871528=test_ssl I, [2024-05-14T01:22:52.190237 #830162] INFO -- : [785/885] 871531=test_gem_ext_cargo_builder I, [2024-05-14T01:22:52.199138 #830162] INFO -- : [786/885] 871542=test_method_name_check I, [2024-05-14T01:22:52.210907 #830162] INFO -- : [787/885] 871531=test_arith_seq_extract I, [2024-05-14T01:22:52.254069 #830162] INFO -- : [788/885] 871542=test_parser I, [2024-05-14T01:22:52.286286 #830162] INFO -- : [789/885] 871542=test_len I, [2024-05-14T01:22:52.289356 #830162] INFO -- : [790/885] 871542=test_yield_block I, [2024-05-14T01:22:52.289767 #830162] INFO -- : [791/885] 871542=test_gem_commands_cert_command I, [2024-05-14T01:22:52.324020 #830162] INFO -- : [792/885] 871533=test_completion I, [2024-05-14T01:22:52.400694 #830162] INFO -- : [793/885] 871531=test_erb I, [2024-05-14T01:22:52.472920 #830162] INFO -- : [794/885] 871531=test_x509ext I, [2024-05-14T01:22:52.479432 #830162] INFO -- : [795/885] 871531=test_gem_source_installed I, [2024-05-14T01:22:52.490404 #830162] INFO -- : [796/885] 871531=test_assembler I, [2024-05-14T01:22:52.490800 #830162] INFO -- : [797/885] 871531=attribute_write_test I, [2024-05-14T01:22:52.580958 #830162] INFO -- : [798/885] 871531=test_propertyputref I, [2024-05-14T01:22:52.583208 #830162] INFO -- : [799/885] 871531=test_spell_checker I, [2024-05-14T01:22:52.597574 #830162] INFO -- : [800/885] 871531=test_rational I, [2024-05-14T01:22:52.636516 #830162] INFO -- : [801/885] 871531=test_rational2 I, [2024-05-14T01:22:52.652390 #830162] INFO -- : [802/885] 871539=test_gem_source I, [2024-05-14T01:22:52.658949 #830162] INFO -- : [803/885] 871531=test_scalar_scanner I, [2024-05-14T01:22:52.666879 #830162] INFO -- : [804/885] 871531=test_gem_commands_outdated_command I, [2024-05-14T01:22:52.725271 #830162] INFO -- : [805/885] 871526=test_array I, [2024-05-14T01:22:52.736314 #830162] INFO -- : [806/885] 871531=test_helper_method I, [2024-05-14T01:22:52.741797 #830162] INFO -- : [807/885] 871531=test_gem_package_tar_writer I, [2024-05-14T01:22:52.855651 #830162] INFO -- : [808/885] 871531=test_gem_dependency_list I, [2024-05-14T01:22:52.912074 #830162] INFO -- : [809/885] 871540=test_benchmark I, [2024-05-14T01:22:52.916523 #830162] INFO -- : [810/885] 871531=test_win32ole_method_event I, [2024-05-14T01:22:52.921847 #830162] INFO -- : [811/885] 871531=test_nesting_parser I, [2024-05-14T01:22:52.939557 #830162] INFO -- : [812/885] 871531=test_https I, [2024-05-14T01:22:52.944797 #830162] INFO -- : [813/885] 871529=test_gem_ext_builder I, [2024-05-14T01:22:52.949734 #830162] INFO -- : [814/885] 871539=test_evaluation I, [2024-05-14T01:22:52.955708 #830162] INFO -- : [815/885] 871539=test_abi I, [2024-05-14T01:22:53.045731 #830162] INFO -- : [816/885] 871533=test_provider I, [2024-05-14T01:22:53.118319 #830162] INFO -- : [817/885] 871539=test_rdoc_parser_simple I, [2024-05-14T01:22:53.122083 #830162] INFO -- : [818/885] 871527=test_load I, [2024-05-14T01:22:53.126136 #830162] INFO -- : [819/885] 871527=test_yamldbm I, [2024-05-14T01:22:53.130275 #830162] INFO -- : [820/885] 871527=test_gem_commands_rebuild_command I, [2024-05-14T01:22:53.136419 #830162] INFO -- : [821/885] 871539=test_debug I, [2024-05-14T01:22:53.139745 #830162] INFO -- : [822/885] 871539=pattern_test I, [2024-05-14T01:22:53.173777 #830162] INFO -- : [823/885] 871539=test_memory_view I, [2024-05-14T01:22:53.176909 #830162] INFO -- : [824/885] 871527=test_shellwords I, [2024-05-14T01:22:53.185119 #830162] INFO -- : [825/885] 871527=test_digest_extend I, [2024-05-14T01:22:53.191477 #830162] INFO -- : [826/885] 871539=test_iterator I, [2024-05-14T01:22:53.198089 #830162] INFO -- : [827/885] 871527=test_string I, [2024-05-14T01:22:53.198943 #830162] INFO -- : [828/885] 871527=test_omap I, [2024-05-14T01:22:53.222681 #830162] INFO -- : [829/885] 871527=test_gem_resolver_git_set I, [2024-05-14T01:22:53.282056 #830162] INFO -- : [830/885] 871539=test_storage I, [2024-05-14T01:22:53.288212 #830162] INFO -- : [831/885] 871539=test_new I, [2024-05-14T01:22:53.288931 #830162] INFO -- : [832/885] 871531=test_cipher I, [2024-05-14T01:22:53.295442 #830162] INFO -- : [833/885] 871539=test_gem_security_signer I, [2024-05-14T01:22:53.361685 #830162] INFO -- : [834/885] 871531=test_regex_casefold I, [2024-05-14T01:22:53.419827 #830162] INFO -- : [835/885] 871539=test_gem_commands_signout_command I, [2024-05-14T01:22:53.437554 #830162] INFO -- : [836/885] 871539=test_refinement I, [2024-05-14T01:22:53.439644 #830162] INFO -- : [837/885] 871533=test_gem_source_git I, [2024-05-14T01:22:53.504405 #830162] INFO -- : [838/885] 871527=test_dir_m17n I, [2024-05-14T01:22:53.537888 #830162] INFO -- : [839/885] 871541=test_gem_resolver_installer_set I, [2024-05-14T01:22:53.639938 #830162] INFO -- : [840/885] 871542=test_float I, [2024-05-14T01:22:53.708470 #830162] INFO -- : [841/885] 871541=test_require I, [2024-05-14T01:22:53.727538 #830162] INFO -- : [842/885] 871531=test_cgi_cookie I, [2024-05-14T01:22:53.736491 #830162] INFO -- : [843/885] 871531=test_process I, [2024-05-14T01:22:53.774735 #830162] INFO -- : [844/885] 871531=test_input_method I, [2024-05-14T01:22:53.821746 #830162] INFO -- : [845/885] 871531=test_windows_1252 I, [2024-05-14T01:22:53.835649 #830162] INFO -- : [846/885] 871531=test_rdoc_rd I, [2024-05-14T01:22:53.861620 #830162] INFO -- : [847/885] 871531=test_cgi_session I, [2024-05-14T01:22:53.876232 #830162] INFO -- : [848/885] 871531=test_rdoc_top_level I, [2024-05-14T01:22:53.892903 #830162] INFO -- : [849/885] 871529=test_metaclass I, [2024-05-14T01:22:53.896295 #830162] INFO -- : [850/885] 871534=test_fixnum I, [2024-05-14T01:22:53.901348 #830162] INFO -- : [851/885] 871529=test_signal I, [2024-05-14T01:22:53.910776 #830162] INFO -- : [852/885] 871534=test_x509crl I, [2024-05-14T01:22:53.945512 #830162] INFO -- : [853/885] 871533=test_insns_leaf I, [2024-05-14T01:22:53.948085 #830162] INFO -- : [854/885] 871533=test_serialize_subclasses I, [2024-05-14T01:22:53.951712 #830162] INFO -- : [855/885] 871533=test_color_printer I, [2024-05-14T01:22:53.958829 #830162] INFO -- : [856/885] 871533=test_deprecated I, [2024-05-14T01:22:53.967784 #830162] INFO -- : [857/885] 871533=test_div I, [2024-05-14T01:22:53.971922 #830162] INFO -- : [858/885] 871533=test_allocation I, [2024-05-14T01:22:54.040348 #830162] INFO -- : [859/885] 871535=test_engine I, [2024-05-14T01:22:54.041192 #830162] INFO -- : [860/885] 871535=test_win32ole_variant_m I, [2024-05-14T01:22:54.041987 #830162] INFO -- : [861/885] 871535=test_key_error I, [2024-05-14T01:22:54.042541 #830162] INFO -- : [862/885] 871534=test_mutex I, [2024-05-14T01:22:54.045407 #830162] INFO -- : [863/885] 871535=test_x509req I, [2024-05-14T01:22:54.134734 #830162] INFO -- : [864/885] 871530=test_rdoc_rd_inline I, [2024-05-14T01:22:54.140413 #830162] INFO -- : [865/885] 871530=test_files_test_1 I, [2024-05-14T01:22:54.234204 #830162] INFO -- : [866/885] 871535=test_set I, [2024-05-14T01:22:54.240829 #830162] INFO -- : [867/885] 871540=test_struct I, [2024-05-14T01:22:54.260774 #830162] INFO -- : [868/885] 871535=test_gem_path_support I, [2024-05-14T01:22:54.300863 #830162] INFO -- : [869/885] 871535=json_parser_test I, [2024-05-14T01:22:54.309642 #830162] INFO -- : [870/885] 871531=test_nomethod_error I, [2024-05-14T01:22:54.311570 #830162] INFO -- : [871/885] 871531=memsize_test I, [2024-05-14T01:22:54.325128 #830162] INFO -- : [872/885] 871531=test_config I, [2024-05-14T01:22:54.355452 #830162] INFO -- : [873/885] 871535=test_win32ole_variant_outarg I, [2024-05-14T01:22:54.355994 #830162] INFO -- : [874/885] 871535=test_gem_source_subpath_problem I, [2024-05-14T01:22:54.401550 #830162] INFO -- : [875/885] 871531=test_dln I, [2024-05-14T01:22:54.402590 #830162] INFO -- : [876/885] 871531=json_common_interface_test I, [2024-05-14T01:22:54.439450 #830162] INFO -- : [877/885] 871531=test_struct I, [2024-05-14T01:22:54.444459 #830162] INFO -- : [878/885] 871531=magic_comment_test I, [2024-05-14T01:22:54.452619 #830162] INFO -- : [879/885] 871531=test_rdoc_markup_to_html_snippet I, [2024-05-14T01:22:54.496610 #830162] INFO -- : [880/885] 871535=fuzzer_test I, [2024-05-14T01:22:54.507127 #830162] INFO -- : [881/885] 871535=test_sexp I, [2024-05-14T01:22:54.515152 #830162] INFO -- : [882/885] 871531=test_rdoc_markup_include I, [2024-05-14T01:22:54.522466 #830162] INFO -- : [883/885] 871531=test_variable I, [2024-05-14T01:22:54.528436 #830162] INFO -- : [884/885] 871535=test_pkg_config I, [2024-05-14T01:22:54.550012 #830162] INFO -- : [885/885] 871535=test_cparser I, [2024-05-14T01:23:12.232030 #830162] INFO -- : Finished tests in 37.334063s, 706.2451 tests/s, 250557.6235 assertions/s. E, [2024-05-14T01:23:12.232106 #830162] ERROR -- : Children under /tmp/rubytest.v3m33f: E, [2024-05-14T01:23:12.232331 #830162] ERROR -- : * drwx------ 4 80 2024-05-14 01:22:53 +0000 gem_rebuild20240514-871527-r530t6/ E, [2024-05-14T01:23:12.232371 #830162] ERROR -- : * drwxrwxr-x 2 60 2024-05-14 01:22:53 +0000 new/ E, [2024-05-14T01:23:12.232386 #830162] ERROR -- : * -rw-rw-r-- 1 4096 2024-05-14 01:22:53 +0000 rebuild_test_gem-1.0.0.gem E, [2024-05-14T01:23:12.232399 #830162] ERROR -- : * drwxrwxr-x 2 60 2024-05-14 01:22:53 +0000 old/ E, [2024-05-14T01:23:12.232412 #830162] ERROR -- : * -rw-rw-r-- 1 4096 2024-05-14 01:22:53 +0000 rebuild_test_gem-1.0.0.gem I, [2024-05-14T01:23:12.233647 #830162] INFO -- : 26367 tests, 9354334 assertions, 0 failures, 0 errors, 312 skips I, [2024-05-14T01:23:12.233672 #830162] INFO -- : I, [2024-05-14T01:23:12.233679 #830162] INFO -- : ruby -v: ruby 3.4.0dev (2024-05-13T18:04:55Z master 5319587ac3) [x86_64-linux] I, [2024-05-14T01:23:12.235983 #830162] INFO -- : $$$[end] "make yes-test-all TESTOPTS='--stderr-on-failure' TESTS='-j20'" exit with 0. I, [2024-05-14T01:23:12.236143 #830162] INFO -- : $$$[beg] make yes-test-rubyspec MSPECOPT='--error-output stderr --debug -j' TESTS='-j20' I, [2024-05-14T01:23:12.336429 #830162] INFO -- : BASERUBY = /usr/bin/ruby --disable=gems I, [2024-05-14T01:23:12.336464 #830162] INFO -- : CC = gcc I, [2024-05-14T01:23:12.336470 #830162] INFO -- : LD = ld I, [2024-05-14T01:23:12.336474 #830162] INFO -- : LDSHARED = gcc -shared I, [2024-05-14T01:23:12.336478 #830162] INFO -- : CFLAGS = -O3 -fno-fast-math -ggdb3 -Wall -Wextra -Wdeprecated-declarations -Wdiv-by-zero -Wduplicated-cond -Wimplicit-function-declaration -Wimplicit-int -Wpointer-arith -Wwrite-strings -Wold-style-definition -Wimplicit-fallthrough=0 -Wmissing-noreturn -Wno-cast-function-type -Wno-constant-logical-operand -Wno-long-long -Wno-missing-field-initializers -Wno-overlength-strings -Wno-packed-bitfield-compat -Wno-parentheses-equality -Wno-self-assign -Wno-tautological-compare -Wno-unused-parameter -Wno-unused-value -Wsuggest-attribute=format -Wsuggest-attribute=noreturn -Wunused-variable -Wmisleading-indentation -Wundef -fPIC I, [2024-05-14T01:23:12.336497 #830162] INFO -- : XCFLAGS = -U_FORTIFY_SOURCE -D_FORTIFY_SOURCE=2 -fstack-protector-strong -fno-strict-overflow -fvisibility=hidden -fexcess-precision=standard -DRUBY_EXPORT -I. -I.ext/include/x86_64-linux -I/tmp/ruby/src/trunk/include -I/tmp/ruby/src/trunk -I/tmp/ruby/src/trunk/prism -I/tmp/ruby/src/trunk/enc/unicode/15.0.0 I, [2024-05-14T01:23:12.336502 #830162] INFO -- : CPPFLAGS = I, [2024-05-14T01:23:12.336506 #830162] INFO -- : DLDFLAGS = -Wl,--compress-debug-sections=zlib -Wl,-soname,libruby.so.3.4 -fstack-protector-strong I, [2024-05-14T01:23:12.336510 #830162] INFO -- : SOLIBS = -lz -lrt -lrt -lgmp -ldl -lcrypt -lm -lpthread I, [2024-05-14T01:23:12.336513 #830162] INFO -- : LANG = en_US.UTF-8 I, [2024-05-14T01:23:12.336517 #830162] INFO -- : LC_ALL = I, [2024-05-14T01:23:12.336521 #830162] INFO -- : LC_CTYPE = I, [2024-05-14T01:23:12.336524 #830162] INFO -- : MFLAGS = I, [2024-05-14T01:23:12.336528 #830162] INFO -- : RUSTC = no I, [2024-05-14T01:23:12.336532 #830162] INFO -- : YJIT_RUSTC_ARGS = --crate-name=yjit --crate-type=staticlib --edition=2021 -g -C lto=thin -C opt-level=3 -C overflow-checks=on '--out-dir=/tmp/ruby/build/trunk/yjit/target/release/' /tmp/ruby/src/trunk/yjit/src/lib.rs I, [2024-05-14T01:23:12.337072 #830162] INFO -- : gcc (Ubuntu 11.4.0-1ubuntu1~22.04) 11.4.0 I, [2024-05-14T01:23:12.337093 #830162] INFO -- : Copyright (C) 2021 Free Software Foundation, Inc. I, [2024-05-14T01:23:12.337098 #830162] INFO -- : This is free software; see the source for copying conditions. There is NO I, [2024-05-14T01:23:12.337102 #830162] INFO -- : warranty; not even for MERCHANTABILITY or FITNESS FOR A PARTICULAR PURPOSE. I, [2024-05-14T01:23:12.337106 #830162] INFO -- : I, [2024-05-14T01:23:12.338771 #830162] INFO -- : generating enc.mk I, [2024-05-14T01:23:12.457050 #830162] INFO -- : making enc I, [2024-05-14T01:23:12.474312 #830162] INFO -- : make[1]: Entering directory '/tmp/ruby/build/trunk' I, [2024-05-14T01:23:12.474338 #830162] INFO -- : make[1]: Nothing to be done for 'enc'. I, [2024-05-14T01:23:12.474350 #830162] INFO -- : make[1]: Leaving directory '/tmp/ruby/build/trunk' I, [2024-05-14T01:23:12.475138 #830162] INFO -- : making srcs under enc I, [2024-05-14T01:23:12.505578 #830162] INFO -- : make[1]: Entering directory '/tmp/ruby/build/trunk' I, [2024-05-14T01:23:12.505599 #830162] INFO -- : make[1]: Nothing to be done for 'srcs'. I, [2024-05-14T01:23:12.505605 #830162] INFO -- : make[1]: Leaving directory '/tmp/ruby/build/trunk' I, [2024-05-14T01:23:12.506587 #830162] INFO -- : generating transdb.h I, [2024-05-14T01:23:12.602661 #830162] INFO -- : transdb.h unchanged I, [2024-05-14T01:23:12.604012 #830162] INFO -- : making trans I, [2024-05-14T01:23:12.638454 #830162] INFO -- : make[1]: Entering directory '/tmp/ruby/build/trunk' I, [2024-05-14T01:23:12.638479 #830162] INFO -- : make[1]: Nothing to be done for 'trans'. I, [2024-05-14T01:23:12.638484 #830162] INFO -- : make[1]: Leaving directory '/tmp/ruby/build/trunk' I, [2024-05-14T01:23:12.639183 #830162] INFO -- : making encs I, [2024-05-14T01:23:12.676241 #830162] INFO -- : make[1]: Entering directory '/tmp/ruby/build/trunk' I, [2024-05-14T01:23:12.676263 #830162] INFO -- : make[1]: Nothing to be done for 'encs'. I, [2024-05-14T01:23:12.676269 #830162] INFO -- : make[1]: Leaving directory '/tmp/ruby/build/trunk' I, [2024-05-14T01:23:12.678031 #830162] INFO -- : generating makefiles ext/configure-ext.mk I, [2024-05-14T01:23:12.705876 #830162] INFO -- : ext/configure-ext.mk updated I, [2024-05-14T01:23:12.708295 #830162] INFO -- : make[1]: Entering directory '/tmp/ruby/build/trunk' I, [2024-05-14T01:23:14.057349 #830162] INFO -- : make[1]: Leaving directory '/tmp/ruby/build/trunk' I, [2024-05-14T01:23:14.058007 #830162] INFO -- : generating makefile exts.mk I, [2024-05-14T01:23:14.097244 #830162] INFO -- : exts.mk unchanged I, [2024-05-14T01:23:14.101885 #830162] INFO -- : make[1]: Entering directory '/tmp/ruby/build/trunk' I, [2024-05-14T01:23:14.411848 #830162] INFO -- : make[2]: Entering directory '/tmp/ruby/build/trunk/ext/coverage' I, [2024-05-14T01:23:14.415402 #830162] INFO -- : make[2]: Leaving directory '/tmp/ruby/build/trunk/ext/coverage' I, [2024-05-14T01:23:14.421932 #830162] INFO -- : make[2]: Entering directory '/tmp/ruby/build/trunk/ext/date' I, [2024-05-14T01:23:14.426642 #830162] INFO -- : make[2]: Leaving directory '/tmp/ruby/build/trunk/ext/date' I, [2024-05-14T01:23:14.430547 #830162] INFO -- : make[2]: Entering directory '/tmp/ruby/build/trunk/ext/digest' I, [2024-05-14T01:23:14.439382 #830162] INFO -- : make[2]: Leaving directory '/tmp/ruby/build/trunk/ext/digest' I, [2024-05-14T01:23:14.465774 #830162] INFO -- : make[2]: Entering directory '/tmp/ruby/build/trunk/ext/digest/sha2' I, [2024-05-14T01:23:14.470675 #830162] INFO -- : make[2]: Leaving directory '/tmp/ruby/build/trunk/ext/digest/sha2' I, [2024-05-14T01:23:14.492493 #830162] INFO -- : make[2]: Entering directory '/tmp/ruby/build/trunk/ext/fiddle' I, [2024-05-14T01:23:14.503435 #830162] INFO -- : make[2]: Leaving directory '/tmp/ruby/build/trunk/ext/fiddle' I, [2024-05-14T01:23:14.508455 #830162] INFO -- : make[2]: Entering directory '/tmp/ruby/build/trunk/ext/io/console' I, [2024-05-14T01:23:14.512621 #830162] INFO -- : make[2]: Leaving directory '/tmp/ruby/build/trunk/ext/io/console' I, [2024-05-14T01:23:14.525526 #830162] INFO -- : make[2]: Entering directory '/tmp/ruby/build/trunk/ext/json' I, [2024-05-14T01:23:14.536260 #830162] INFO -- : make[2]: Leaving directory '/tmp/ruby/build/trunk/ext/json' I, [2024-05-14T01:23:14.551481 #830162] INFO -- : make[2]: Entering directory '/tmp/ruby/build/trunk/ext/monitor' I, [2024-05-14T01:23:14.555461 #830162] INFO -- : make[2]: Leaving directory '/tmp/ruby/build/trunk/ext/monitor' I, [2024-05-14T01:23:14.562448 #830162] INFO -- : make[2]: Entering directory '/tmp/ruby/build/trunk/ext/objspace' I, [2024-05-14T01:23:14.568580 #830162] INFO -- : make[2]: Leaving directory '/tmp/ruby/build/trunk/ext/objspace' I, [2024-05-14T01:23:14.586100 #830162] INFO -- : make[2]: Entering directory '/tmp/ruby/build/trunk/ext/openssl' I, [2024-05-14T01:23:14.604018 #830162] INFO -- : make[2]: Leaving directory '/tmp/ruby/build/trunk/ext/openssl' I, [2024-05-14T01:23:14.608765 #830162] INFO -- : make[2]: Entering directory '/tmp/ruby/build/trunk/ext/pathname' I, [2024-05-14T01:23:14.612690 #830162] INFO -- : make[2]: Leaving directory '/tmp/ruby/build/trunk/ext/pathname' I, [2024-05-14T01:23:14.619780 #830162] INFO -- : make[2]: Entering directory '/tmp/ruby/build/trunk/ext/psych' I, [2024-05-14T01:23:14.643712 #830162] INFO -- : make[2]: Leaving directory '/tmp/ruby/build/trunk/ext/psych' I, [2024-05-14T01:23:14.647905 #830162] INFO -- : make[2]: Entering directory '/tmp/ruby/build/trunk/ext/pty' I, [2024-05-14T01:23:14.651903 #830162] INFO -- : make[2]: Leaving directory '/tmp/ruby/build/trunk/ext/pty' I, [2024-05-14T01:23:14.667735 #830162] INFO -- : make[2]: Entering directory '/tmp/ruby/build/trunk/ext/ripper' I, [2024-05-14T01:23:14.676042 #830162] INFO -- : make[2]: Leaving directory '/tmp/ruby/build/trunk/ext/ripper' I, [2024-05-14T01:23:14.678475 #830162] INFO -- : make[2]: Entering directory '/tmp/ruby/build/trunk/ext/rubyvm' I, [2024-05-14T01:23:14.681755 #830162] INFO -- : make[2]: Leaving directory '/tmp/ruby/build/trunk/ext/rubyvm' I, [2024-05-14T01:23:14.693498 #830162] INFO -- : make[2]: Entering directory '/tmp/ruby/build/trunk/ext/socket' I, [2024-05-14T01:23:14.700340 #830162] INFO -- : make[2]: Leaving directory '/tmp/ruby/build/trunk/ext/socket' I, [2024-05-14T01:23:14.712431 #830162] INFO -- : make[2]: Entering directory '/tmp/ruby/build/trunk/.bundle/gems/bigdecimal-3.1.8/ext/bigdecimal' I, [2024-05-14T01:23:14.736624 #830162] INFO -- : make[2]: Leaving directory '/tmp/ruby/build/trunk/.bundle/gems/bigdecimal-3.1.8/ext/bigdecimal' I, [2024-05-14T01:23:14.738570 #830162] INFO -- : make[2]: Entering directory '/tmp/ruby/build/trunk/.bundle/gems/debug-1.9.2/ext/debug' I, [2024-05-14T01:23:14.760351 #830162] INFO -- : make[2]: Leaving directory '/tmp/ruby/build/trunk/.bundle/gems/debug-1.9.2/ext/debug' I, [2024-05-14T01:23:14.762240 #830162] INFO -- : make[2]: Entering directory '/tmp/ruby/build/trunk/.bundle/gems/nkf-0.2.0/ext/nkf' I, [2024-05-14T01:23:14.783730 #830162] INFO -- : make[2]: Leaving directory '/tmp/ruby/build/trunk/.bundle/gems/nkf-0.2.0/ext/nkf' I, [2024-05-14T01:23:14.785539 #830162] INFO -- : make[2]: Entering directory '/tmp/ruby/build/trunk/.bundle/gems/racc-1.7.3/ext/racc/cparse' I, [2024-05-14T01:23:14.807022 #830162] INFO -- : make[2]: Leaving directory '/tmp/ruby/build/trunk/.bundle/gems/racc-1.7.3/ext/racc/cparse' I, [2024-05-14T01:23:14.809716 #830162] INFO -- : make[2]: Entering directory '/tmp/ruby/build/trunk/.bundle/gems/rbs-3.4.4/ext/rbs_extension' I, [2024-05-14T01:23:14.831402 #830162] INFO -- : make[2]: Leaving directory '/tmp/ruby/build/trunk/.bundle/gems/rbs-3.4.4/ext/rbs_extension' I, [2024-05-14T01:23:14.833530 #830162] INFO -- : make[2]: Entering directory '/tmp/ruby/build/trunk/.bundle/gems/syslog-0.1.2/ext/syslog' I, [2024-05-14T01:23:14.854717 #830162] INFO -- : make[2]: Leaving directory '/tmp/ruby/build/trunk/.bundle/gems/syslog-0.1.2/ext/syslog' I, [2024-05-14T01:23:14.878198 #830162] INFO -- : make[2]: Entering directory '/tmp/ruby/build/trunk' I, [2024-05-14T01:23:14.947916 #830162] INFO -- : make[2]: 'ruby' is up to date. I, [2024-05-14T01:23:14.947962 #830162] INFO -- : make[2]: Leaving directory '/tmp/ruby/build/trunk' I, [2024-05-14T01:23:14.948158 #830162] INFO -- : make[1]: Leaving directory '/tmp/ruby/build/trunk' I, [2024-05-14T01:23:14.951666 #830162] INFO -- : make[1]: Entering directory '/tmp/ruby/build/trunk' I, [2024-05-14T01:23:14.951696 #830162] INFO -- : make[1]: Nothing to be done for 'note'. I, [2024-05-14T01:23:14.951703 #830162] INFO -- : make[1]: Leaving directory '/tmp/ruby/build/trunk' E, [2024-05-14T01:23:15.007085 #830162] ERROR -- : $ /tmp/ruby/build/trunk/miniruby -I/tmp/ruby/src/trunk/lib /tmp/ruby/src/trunk/tool/runruby.rb --archdir=/tmp/ruby/build/trunk --extout=.ext -- /tmp/ruby/src/trunk/spec/mspec/bin/mspec-run -B /tmp/ruby/src/trunk/spec/default.mspec --error-output stderr --debug -fy -o /tmp/rubytest.83xfwy/1-mspec-multi-0 E, [2024-05-14T01:23:15.007254 #830162] ERROR -- : $ /tmp/ruby/build/trunk/miniruby -I/tmp/ruby/src/trunk/lib /tmp/ruby/src/trunk/tool/runruby.rb --archdir=/tmp/ruby/build/trunk --extout=.ext -- /tmp/ruby/src/trunk/spec/mspec/bin/mspec-run -B /tmp/ruby/src/trunk/spec/default.mspec --error-output stderr --debug -fy -o /tmp/rubytest.83xfwy/2-mspec-multi-1 E, [2024-05-14T01:23:15.007388 #830162] ERROR -- : $ /tmp/ruby/build/trunk/miniruby -I/tmp/ruby/src/trunk/lib /tmp/ruby/src/trunk/tool/runruby.rb --archdir=/tmp/ruby/build/trunk --extout=.ext -- /tmp/ruby/src/trunk/spec/mspec/bin/mspec-run -B /tmp/ruby/src/trunk/spec/default.mspec --error-output stderr --debug -fy -o /tmp/rubytest.83xfwy/3-mspec-multi-2 E, [2024-05-14T01:23:15.007540 #830162] ERROR -- : $ /tmp/ruby/build/trunk/miniruby -I/tmp/ruby/src/trunk/lib /tmp/ruby/src/trunk/tool/runruby.rb --archdir=/tmp/ruby/build/trunk --extout=.ext -- /tmp/ruby/src/trunk/spec/mspec/bin/mspec-run -B /tmp/ruby/src/trunk/spec/default.mspec --error-output stderr --debug -fy -o /tmp/rubytest.83xfwy/4-mspec-multi-3 E, [2024-05-14T01:23:15.007733 #830162] ERROR -- : $ /tmp/ruby/build/trunk/miniruby -I/tmp/ruby/src/trunk/lib /tmp/ruby/src/trunk/tool/runruby.rb --archdir=/tmp/ruby/build/trunk --extout=.ext -- /tmp/ruby/src/trunk/spec/mspec/bin/mspec-run -B /tmp/ruby/src/trunk/spec/default.mspec --error-output stderr --debug -fy -o /tmp/rubytest.83xfwy/5-mspec-multi-4 E, [2024-05-14T01:23:15.007755 #830162] ERROR -- : $ /tmp/ruby/build/trunk/miniruby -I/tmp/ruby/src/trunk/lib /tmp/ruby/src/trunk/tool/runruby.rb --archdir=/tmp/ruby/build/trunk --extout=.ext -- /tmp/ruby/src/trunk/spec/mspec/bin/mspec-run -B /tmp/ruby/src/trunk/spec/default.mspec --error-output stderr --debug -fy -o /tmp/rubytest.83xfwy/6-mspec-multi-5 E, [2024-05-14T01:23:15.007985 #830162] ERROR -- : $ /tmp/ruby/build/trunk/miniruby -I/tmp/ruby/src/trunk/lib /tmp/ruby/src/trunk/tool/runruby.rb --archdir=/tmp/ruby/build/trunk --extout=.ext -- /tmp/ruby/src/trunk/spec/mspec/bin/mspec-run -B /tmp/ruby/src/trunk/spec/default.mspec --error-output stderr --debug -fy -o /tmp/rubytest.83xfwy/7-mspec-multi-6 E, [2024-05-14T01:23:15.008165 #830162] ERROR -- : $ /tmp/ruby/build/trunk/miniruby -I/tmp/ruby/src/trunk/lib /tmp/ruby/src/trunk/tool/runruby.rb --archdir=/tmp/ruby/build/trunk --extout=.ext -- /tmp/ruby/src/trunk/spec/mspec/bin/mspec-run -B /tmp/ruby/src/trunk/spec/default.mspec --error-output stderr --debug -fy -o /tmp/rubytest.83xfwy/8-mspec-multi-7 E, [2024-05-14T01:23:15.008354 #830162] ERROR -- : $ /tmp/ruby/build/trunk/miniruby -I/tmp/ruby/src/trunk/lib /tmp/ruby/src/trunk/tool/runruby.rb --archdir=/tmp/ruby/build/trunk --extout=.ext -- /tmp/ruby/src/trunk/spec/mspec/bin/mspec-run -B /tmp/ruby/src/trunk/spec/default.mspec --error-output stderr --debug -fy -o /tmp/rubytest.83xfwy/9-mspec-multi-8 E, [2024-05-14T01:23:15.008537 #830162] ERROR -- : $ /tmp/ruby/build/trunk/miniruby -I/tmp/ruby/src/trunk/lib /tmp/ruby/src/trunk/tool/runruby.rb --archdir=/tmp/ruby/build/trunk --extout=.ext -- /tmp/ruby/src/trunk/spec/mspec/bin/mspec-run -B /tmp/ruby/src/trunk/spec/default.mspec --error-output stderr --debug -fy -o /tmp/rubytest.83xfwy/10-mspec-multi-9 E, [2024-05-14T01:23:15.008855 #830162] ERROR -- : $ /tmp/ruby/build/trunk/miniruby -I/tmp/ruby/src/trunk/lib /tmp/ruby/src/trunk/tool/runruby.rb --archdir=/tmp/ruby/build/trunk --extout=.ext -- /tmp/ruby/src/trunk/spec/mspec/bin/mspec-run -B /tmp/ruby/src/trunk/spec/default.mspec --error-output stderr --debug -fy -o /tmp/rubytest.83xfwy/11-mspec-multi-10 E, [2024-05-14T01:23:15.009066 #830162] ERROR -- : $ /tmp/ruby/build/trunk/miniruby -I/tmp/ruby/src/trunk/lib /tmp/ruby/src/trunk/tool/runruby.rb --archdir=/tmp/ruby/build/trunk --extout=.ext -- /tmp/ruby/src/trunk/spec/mspec/bin/mspec-run -B /tmp/ruby/src/trunk/spec/default.mspec --error-output stderr --debug -fy -o /tmp/rubytest.83xfwy/12-mspec-multi-11 E, [2024-05-14T01:23:15.009300 #830162] ERROR -- : $ /tmp/ruby/build/trunk/miniruby -I/tmp/ruby/src/trunk/lib /tmp/ruby/src/trunk/tool/runruby.rb --archdir=/tmp/ruby/build/trunk --extout=.ext -- /tmp/ruby/src/trunk/spec/mspec/bin/mspec-run -B /tmp/ruby/src/trunk/spec/default.mspec --error-output stderr --debug -fy -o /tmp/rubytest.83xfwy/13-mspec-multi-12 E, [2024-05-14T01:23:15.009552 #830162] ERROR -- : $ /tmp/ruby/build/trunk/miniruby -I/tmp/ruby/src/trunk/lib /tmp/ruby/src/trunk/tool/runruby.rb --archdir=/tmp/ruby/build/trunk --extout=.ext -- /tmp/ruby/src/trunk/spec/mspec/bin/mspec-run -B /tmp/ruby/src/trunk/spec/default.mspec --error-output stderr --debug -fy -o /tmp/rubytest.83xfwy/14-mspec-multi-13 E, [2024-05-14T01:23:15.009683 #830162] ERROR -- : $ /tmp/ruby/build/trunk/miniruby -I/tmp/ruby/src/trunk/lib /tmp/ruby/src/trunk/tool/runruby.rb --archdir=/tmp/ruby/build/trunk --extout=.ext -- /tmp/ruby/src/trunk/spec/mspec/bin/mspec-run -B /tmp/ruby/src/trunk/spec/default.mspec --error-output stderr --debug -fy -o /tmp/rubytest.83xfwy/15-mspec-multi-14 E, [2024-05-14T01:23:15.009869 #830162] ERROR -- : $ /tmp/ruby/build/trunk/miniruby -I/tmp/ruby/src/trunk/lib /tmp/ruby/src/trunk/tool/runruby.rb --archdir=/tmp/ruby/build/trunk --extout=.ext -- /tmp/ruby/src/trunk/spec/mspec/bin/mspec-run -B /tmp/ruby/src/trunk/spec/default.mspec --error-output stderr --debug -fy -o /tmp/rubytest.83xfwy/16-mspec-multi-15 E, [2024-05-14T01:23:15.010062 #830162] ERROR -- : $ /tmp/ruby/build/trunk/miniruby -I/tmp/ruby/src/trunk/lib /tmp/ruby/src/trunk/tool/runruby.rb --archdir=/tmp/ruby/build/trunk --extout=.ext -- /tmp/ruby/src/trunk/spec/mspec/bin/mspec-run -B /tmp/ruby/src/trunk/spec/default.mspec --error-output stderr --debug -fy -o /tmp/rubytest.83xfwy/17-mspec-multi-16 E, [2024-05-14T01:23:15.012202 #830162] ERROR -- : $ /tmp/ruby/build/trunk/miniruby -I/tmp/ruby/src/trunk/lib /tmp/ruby/src/trunk/tool/runruby.rb --archdir=/tmp/ruby/build/trunk --extout=.ext -- /tmp/ruby/src/trunk/spec/mspec/bin/mspec-run -B /tmp/ruby/src/trunk/spec/default.mspec --error-output stderr --debug -fy -o /tmp/rubytest.83xfwy/18-mspec-multi-17 E, [2024-05-14T01:23:15.012726 #830162] ERROR -- : $ /tmp/ruby/build/trunk/miniruby -I/tmp/ruby/src/trunk/lib /tmp/ruby/src/trunk/tool/runruby.rb --archdir=/tmp/ruby/build/trunk --extout=.ext -- /tmp/ruby/src/trunk/spec/mspec/bin/mspec-run -B /tmp/ruby/src/trunk/spec/default.mspec --error-output stderr --debug -fy -o /tmp/rubytest.83xfwy/19-mspec-multi-18 E, [2024-05-14T01:23:15.012993 #830162] ERROR -- : $ /tmp/ruby/build/trunk/miniruby -I/tmp/ruby/src/trunk/lib /tmp/ruby/src/trunk/tool/runruby.rb --archdir=/tmp/ruby/build/trunk --extout=.ext -- /tmp/ruby/src/trunk/spec/mspec/bin/mspec-run -B /tmp/ruby/src/trunk/spec/default.mspec --error-output stderr --debug -fy -o /tmp/rubytest.83xfwy/20-mspec-multi-19 I, [2024-05-14T01:23:15.179068 #830162] INFO -- : ruby 3.4.0dev (2024-05-13T18:04:55Z master 5319587ac3) [x86_64-linux] I, [2024-05-14T01:23:15.795942 #830162] INFO -- : 0 ......................................................................... I, [2024-05-14T01:23:16.162192 #830162] INFO -- : 73 ......................................................................... I, [2024-05-14T01:23:16.311895 #830162] INFO -- : 146 ......................................................................... I, [2024-05-14T01:23:16.379795 #830162] INFO -- : 219 ......................................................................... I, [2024-05-14T01:23:16.448627 #830162] INFO -- : 292 ......................................................................... I, [2024-05-14T01:23:16.483725 #830162] INFO -- : 365 ......................................................................... I, [2024-05-14T01:23:16.503712 #830162] INFO -- : 438 ......................................................................... I, [2024-05-14T01:23:16.523089 #830162] INFO -- : 511 ......................................................................... I, [2024-05-14T01:23:16.537669 #830162] INFO -- : 584 ......................................................................... I, [2024-05-14T01:23:16.590279 #830162] INFO -- : 657 ......................................................................... I, [2024-05-14T01:23:16.616780 #830162] INFO -- : 730 ......................................................................... I, [2024-05-14T01:23:16.638983 #830162] INFO -- : 803 ......................................................................... I, [2024-05-14T01:23:16.674517 #830162] INFO -- : 876 ......................................................................... I, [2024-05-14T01:23:16.724294 #830162] INFO -- : 949 ......................................................................... I, [2024-05-14T01:23:16.802283 #830162] INFO -- : 1022 ......................................................................... I, [2024-05-14T01:23:16.983867 #830162] INFO -- : 1095 ......................................................................... I, [2024-05-14T01:23:17.086995 #830162] INFO -- : 1168 ......................................................................... I, [2024-05-14T01:23:17.148869 #830162] INFO -- : 1241 ......................................................................... I, [2024-05-14T01:23:17.200930 #830162] INFO -- : 1314 ......................................................................... I, [2024-05-14T01:23:17.220251 #830162] INFO -- : 1387 ......................................................................... I, [2024-05-14T01:23:17.301011 #830162] INFO -- : 1460 ......................................................................... I, [2024-05-14T01:23:17.772817 #830162] INFO -- : 1533 ......................................................................... I, [2024-05-14T01:23:17.830686 #830162] INFO -- : 1606 ......................................................................... I, [2024-05-14T01:23:17.931863 #830162] INFO -- : 1679 ......................................................................... I, [2024-05-14T01:23:18.044619 #830162] INFO -- : 1752 ......................................................................... I, [2024-05-14T01:23:18.144394 #830162] INFO -- : 1825 ......................................................................... I, [2024-05-14T01:23:18.256588 #830162] INFO -- : 1898 ......................................................................... I, [2024-05-14T01:23:18.347187 #830162] INFO -- : 1971 ......................................................................... I, [2024-05-14T01:23:18.399342 #830162] INFO -- : 2044 ......................................................................... I, [2024-05-14T01:23:18.433024 #830162] INFO -- : 2117 ......................................................................... I, [2024-05-14T01:23:18.447823 #830162] INFO -- : 2190 ......................................................................... I, [2024-05-14T01:23:18.470796 #830162] INFO -- : 2263 ......................................................................... I, [2024-05-14T01:23:18.484452 #830162] INFO -- : 2336 ......................................................................... I, [2024-05-14T01:23:18.517946 #830162] INFO -- : 2409 ......................................................................... I, [2024-05-14T01:23:18.634790 #830162] INFO -- : 2482 ......................................................................... I, [2024-05-14T01:23:18.661141 #830162] INFO -- : 2555 ......................................................................... I, [2024-05-14T01:23:18.747494 #830162] INFO -- : 2628 ......................................................................... I, [2024-05-14T01:23:18.845089 #830162] INFO -- : 2701 ......................................................................... I, [2024-05-14T01:23:18.879559 #830162] INFO -- : 2774 ......................................................................... I, [2024-05-14T01:23:18.939257 #830162] INFO -- : 2847 ......................................................................... I, [2024-05-14T01:23:18.974219 #830162] INFO -- : 2920 ......................................................................... I, [2024-05-14T01:23:18.999893 #830162] INFO -- : 2993 ......................................................................... I, [2024-05-14T01:23:19.019583 #830162] INFO -- : 3066 ......................................................................... I, [2024-05-14T01:23:19.033891 #830162] INFO -- : 3139 ......................................................................... I, [2024-05-14T01:23:19.041542 #830162] INFO -- : 3212 ......................................................................... I, [2024-05-14T01:23:19.069679 #830162] INFO -- : 3285 ......................................................................... I, [2024-05-14T01:23:23.046205 #830162] INFO -- : 3358 ........................................................................ I, [2024-05-14T01:23:23.046269 #830162] INFO -- : I, [2024-05-14T01:23:23.046276 #830162] INFO -- : Finished in 8.038332 seconds I, [2024-05-14T01:23:23.046280 #830162] INFO -- : I, [2024-05-14T01:23:23.046285 #830162] INFO -- : 3429 files, 32611 examples, 189854 expectations, 0 failures, 0 errors, 0 tagged I, [2024-05-14T01:23:23.048599 #830162] INFO -- : $$$[end] "make yes-test-rubyspec MSPECOPT='--error-output stderr --debug -j' TESTS='-j20'" exit with 0.