# Logfile created on 2024-05-13 20:15:55 +0000 by logger.rb/v1.4.3 I, [2024-05-13T20:15:55.469941 #242627] INFO -- : #, @formatter=nil, @logdev=#, @binmode=false, @mon_data=#, @mon_data_owner_object_id=860>>> I, [2024-05-13T20:15:55.470064 #242627] INFO -- : $$$[beg] make update-unicode -j20 I, [2024-05-13T20:15:55.529214 #242627] INFO -- : Downloading Unicode emoji 15.0 files... I, [2024-05-13T20:15:55.529379 #242627] INFO -- : Downloading Unicode emoji 15.0 files... I, [2024-05-13T20:15:55.529744 #242627] INFO -- : Downloading Unicode emoji 15.0 files... I, [2024-05-13T20:15:55.571105 #242627] INFO -- : made symlink emoji/15.0/emoji-sequences.txt to /tmp/ruby/src/trunk/.downloaded-cache/emoji/15.0/emoji-sequences.txt I, [2024-05-13T20:15:55.571150 #242627] INFO -- : downloading emoji/15.0/emoji-test.txt ... /tmp/ruby/src/trunk/enc/unicode/data/emoji/15.0/emoji-sequences.txt already exists I, [2024-05-13T20:15:55.571158 #242627] INFO -- : /tmp/ruby/src/trunk/enc/unicode/data/emoji/15.0/emoji-sequences.txt already exists E, [2024-05-13T20:15:56.031548 #242627] ERROR -- : /tmp/ruby/src/trunk/tool/downloader.rb:302:in `rescue in download': failed to download emoji/15.0/emoji-test.txt (RuntimeError) E, [2024-05-13T20:15:56.031852 #242627] ERROR -- : OpenURI::HTTPError: 403 Forbidden: https://www.unicode.org/Public/emoji/15.0/emoji-test.txt E, [2024-05-13T20:15:56.031882 #242627] ERROR -- : from /tmp/ruby/src/trunk/tool/downloader.rb:201:in `download' E, [2024-05-13T20:15:56.031897 #242627] ERROR -- : from /tmp/ruby/src/trunk/tool/downloader.rb:136:in `download' E, [2024-05-13T20:15:56.031910 #242627] ERROR -- : from /tmp/ruby/src/trunk/tool/downloader.rb:482:in `block in
' E, [2024-05-13T20:15:56.031923 #242627] ERROR -- : from /tmp/ruby/src/trunk/tool/downloader.rb:465:in `each' E, [2024-05-13T20:15:56.031935 #242627] ERROR -- : from /tmp/ruby/src/trunk/tool/downloader.rb:465:in `
' E, [2024-05-13T20:15:56.031948 #242627] ERROR -- : /usr/lib/ruby/3.0.0/open-uri.rb:364:in `open_http': 403 Forbidden (OpenURI::HTTPError) E, [2024-05-13T20:15:56.031963 #242627] ERROR -- : from /usr/lib/ruby/3.0.0/open-uri.rb:741:in `buffer_open' E, [2024-05-13T20:15:56.031978 #242627] ERROR -- : from /usr/lib/ruby/3.0.0/open-uri.rb:212:in `block in open_loop' E, [2024-05-13T20:15:56.031989 #242627] ERROR -- : from /usr/lib/ruby/3.0.0/open-uri.rb:210:in `catch' E, [2024-05-13T20:15:56.032001 #242627] ERROR -- : from /usr/lib/ruby/3.0.0/open-uri.rb:210:in `open_loop' E, [2024-05-13T20:15:56.032013 #242627] ERROR -- : from /usr/lib/ruby/3.0.0/open-uri.rb:151:in `open_uri' E, [2024-05-13T20:15:56.032024 #242627] ERROR -- : from /usr/lib/ruby/3.0.0/open-uri.rb:721:in `open' E, [2024-05-13T20:15:56.032035 #242627] ERROR -- : from /usr/lib/ruby/3.0.0/open-uri.rb:729:in `read' E, [2024-05-13T20:15:56.032047 #242627] ERROR -- : from /tmp/ruby/src/trunk/tool/downloader.rb:247:in `block in download' E, [2024-05-13T20:15:56.032076 #242627] ERROR -- : from /tmp/ruby/src/trunk/tool/downloader.rb:378:in `with_retry' E, [2024-05-13T20:15:56.032088 #242627] ERROR -- : from /tmp/ruby/src/trunk/tool/downloader.rb:246:in `download' E, [2024-05-13T20:15:56.032104 #242627] ERROR -- : from /tmp/ruby/src/trunk/tool/downloader.rb:136:in `download' E, [2024-05-13T20:15:56.032116 #242627] ERROR -- : from /tmp/ruby/src/trunk/tool/downloader.rb:482:in `block in
' E, [2024-05-13T20:15:56.032128 #242627] ERROR -- : from /tmp/ruby/src/trunk/tool/downloader.rb:465:in `each' E, [2024-05-13T20:15:56.032140 #242627] ERROR -- : from /tmp/ruby/src/trunk/tool/downloader.rb:465:in `
' E, [2024-05-13T20:15:56.032156 #242627] ERROR -- : /tmp/ruby/src/trunk/tool/downloader.rb:302:in `rescue in download': failed to download emoji/15.0/emoji-test.txt (RuntimeError) E, [2024-05-13T20:15:56.032168 #242627] ERROR -- : OpenURI::HTTPError: 403 Forbidden: https://www.unicode.org/Public/emoji/15.0/emoji-test.txt E, [2024-05-13T20:15:56.032181 #242627] ERROR -- : from /tmp/ruby/src/trunk/tool/downloader.rb:201:in `download' E, [2024-05-13T20:15:56.032195 #242627] ERROR -- : from /tmp/ruby/src/trunk/tool/downloader.rb:136:in `download' E, [2024-05-13T20:15:56.032207 #242627] ERROR -- : from /tmp/ruby/src/trunk/tool/downloader.rb:482:in `block in
' E, [2024-05-13T20:15:56.032219 #242627] ERROR -- : from /tmp/ruby/src/trunk/tool/downloader.rb:465:in `each' E, [2024-05-13T20:15:56.032230 #242627] ERROR -- : from /tmp/ruby/src/trunk/tool/downloader.rb:465:in `
' E, [2024-05-13T20:15:56.032242 #242627] ERROR -- : /usr/lib/ruby/3.0.0/open-uri.rb:364:in `open_http': 403 Forbidden (OpenURI::HTTPError) E, [2024-05-13T20:15:56.032254 #242627] ERROR -- : from /usr/lib/ruby/3.0.0/open-uri.rb:741:in `buffer_open' E, [2024-05-13T20:15:56.032266 #242627] ERROR -- : from /usr/lib/ruby/3.0.0/open-uri.rb:212:in `block in open_loop' E, [2024-05-13T20:15:56.032278 #242627] ERROR -- : from /usr/lib/ruby/3.0.0/open-uri.rb:210:in `catch' E, [2024-05-13T20:15:56.032292 #242627] ERROR -- : from /usr/lib/ruby/3.0.0/open-uri.rb:210:in `open_loop' E, [2024-05-13T20:15:56.032304 #242627] ERROR -- : from /usr/lib/ruby/3.0.0/open-uri.rb:151:in `open_uri' E, [2024-05-13T20:15:56.032316 #242627] ERROR -- : from /usr/lib/ruby/3.0.0/open-uri.rb:721:in `open' E, [2024-05-13T20:15:56.032327 #242627] ERROR -- : from /usr/lib/ruby/3.0.0/open-uri.rb:729:in `read' E, [2024-05-13T20:15:56.032339 #242627] ERROR -- : from /tmp/ruby/src/trunk/tool/downloader.rb:247:in `block in download' E, [2024-05-13T20:15:56.032350 #242627] ERROR -- : from /tmp/ruby/src/trunk/tool/downloader.rb:378:in `with_retry' E, [2024-05-13T20:15:56.032362 #242627] ERROR -- : from /tmp/ruby/src/trunk/tool/downloader.rb:246:in `download' E, [2024-05-13T20:15:56.032373 #242627] ERROR -- : from /tmp/ruby/src/trunk/tool/downloader.rb:136:in `download' E, [2024-05-13T20:15:56.032385 #242627] ERROR -- : from /tmp/ruby/src/trunk/tool/downloader.rb:482:in `block in
' E, [2024-05-13T20:15:56.032399 #242627] ERROR -- : from /tmp/ruby/src/trunk/tool/downloader.rb:465:in `each' E, [2024-05-13T20:15:56.032410 #242627] ERROR -- : from /tmp/ruby/src/trunk/tool/downloader.rb:465:in `
' E, [2024-05-13T20:15:56.034360 #242627] ERROR -- : /tmp/ruby/src/trunk/tool/downloader.rb:302:in `rescue in download': failed to download emoji/15.0/emoji-test.txt (RuntimeError) E, [2024-05-13T20:15:56.034427 #242627] ERROR -- : OpenURI::HTTPError: 403 Forbidden: https://www.unicode.org/Public/emoji/15.0/emoji-test.txt E, [2024-05-13T20:15:56.034443 #242627] ERROR -- : from /tmp/ruby/src/trunk/tool/downloader.rb:201:in `download' E, [2024-05-13T20:15:56.034454 #242627] ERROR -- : from /tmp/ruby/src/trunk/tool/downloader.rb:136:in `download' E, [2024-05-13T20:15:56.034464 #242627] ERROR -- : from /tmp/ruby/src/trunk/tool/downloader.rb:482:in `block in
' E, [2024-05-13T20:15:56.034497 #242627] ERROR -- : from /tmp/ruby/src/trunk/tool/downloader.rb:465:in `each' E, [2024-05-13T20:15:56.034528 #242627] ERROR -- : from /tmp/ruby/src/trunk/tool/downloader.rb:465:in `
' E, [2024-05-13T20:15:56.034540 #242627] ERROR -- : /usr/lib/ruby/3.0.0/open-uri.rb:364:in `open_http': 403 Forbidden (OpenURI::HTTPError) E, [2024-05-13T20:15:56.034550 #242627] ERROR -- : from /usr/lib/ruby/3.0.0/open-uri.rb:741:in `buffer_open' E, [2024-05-13T20:15:56.034560 #242627] ERROR -- : from /usr/lib/ruby/3.0.0/open-uri.rb:212:in `block in open_loop' E, [2024-05-13T20:15:56.034570 #242627] ERROR -- : from /usr/lib/ruby/3.0.0/open-uri.rb:210:in `catch' E, [2024-05-13T20:15:56.034580 #242627] ERROR -- : from /usr/lib/ruby/3.0.0/open-uri.rb:210:in `open_loop' E, [2024-05-13T20:15:56.034590 #242627] ERROR -- : from /usr/lib/ruby/3.0.0/open-uri.rb:151:in `open_uri' E, [2024-05-13T20:15:56.034608 #242627] ERROR -- : from /usr/lib/ruby/3.0.0/open-uri.rb:721:in `open' E, [2024-05-13T20:15:56.034618 #242627] ERROR -- : from /usr/lib/ruby/3.0.0/open-uri.rb:729:in `read' E, [2024-05-13T20:15:56.034788 #242627] ERROR -- : from /tmp/ruby/src/trunk/tool/downloader.rb:247:in `block in download' E, [2024-05-13T20:15:56.034802 #242627] ERROR -- : from /tmp/ruby/src/trunk/tool/downloader.rb:378:in `with_retry' E, [2024-05-13T20:15:56.034812 #242627] ERROR -- : from /tmp/ruby/src/trunk/tool/downloader.rb:246:in `download' E, [2024-05-13T20:15:56.034821 #242627] ERROR -- : from /tmp/ruby/src/trunk/tool/downloader.rb:136:in `download' E, [2024-05-13T20:15:56.034830 #242627] ERROR -- : from /tmp/ruby/src/trunk/tool/downloader.rb:482:in `block in
' E, [2024-05-13T20:15:56.034840 #242627] ERROR -- : from /tmp/ruby/src/trunk/tool/downloader.rb:465:in `each' E, [2024-05-13T20:15:56.034849 #242627] ERROR -- : from /tmp/ruby/src/trunk/tool/downloader.rb:465:in `
' E, [2024-05-13T20:15:56.036436 #242627] ERROR -- : make: *** [uncommon.mk:1765: /tmp/ruby/src/trunk/enc/unicode/data/emoji/15.0/emoji-test.txt] Error 1 E, [2024-05-13T20:15:56.036498 #242627] ERROR -- : make: *** Waiting for unfinished jobs.... E, [2024-05-13T20:15:56.036712 #242627] ERROR -- : make: *** [uncommon.mk:1765: /tmp/ruby/src/trunk/enc/unicode/data/emoji/15.0/emoji-sequences.txt] Error 1 E, [2024-05-13T20:15:56.036772 #242627] ERROR -- : make: *** Deleting file '/tmp/ruby/src/trunk/enc/unicode/data/emoji/15.0/emoji-sequences.txt' E, [2024-05-13T20:15:56.039610 #242627] ERROR -- : make: *** [uncommon.mk:1765: /tmp/ruby/src/trunk/enc/unicode/data/emoji/15.0/emoji-zwj-sequences.txt] Error 1 I, [2024-05-13T20:15:56.039715 #242627] INFO -- : downloading emoji/15.0/emoji-test.txt ... downloading emoji/15.0/emoji-test.txt ... I, [2024-05-13T20:15:56.040261 #242627] INFO -- : $$$[end] "make update-unicode -j20" exit with 512. I, [2024-05-13T20:15:56.040332 #242627] INFO -- : $$$[beg] make update-download -j20 I, [2024-05-13T20:15:56.150300 #242627] INFO -- : tool/config.guess already exists I, [2024-05-13T20:15:56.150362 #242627] INFO -- : tool/config.sub already exists I, [2024-05-13T20:15:56.152888 #242627] INFO -- : Update minitest to ea9caafc0754b1d6236a490d59e624b53209734a I, [2024-05-13T20:15:56.153126 #242627] INFO -- : Update power_assert to 84e85124c5014a139af39161d484156cfe87a9ed I, [2024-05-13T20:15:56.153837 #242627] INFO -- : Update rbs to ba7872795d5de04adb8ff500c0e6afdc81a041dd I, [2024-05-13T20:15:56.154133 #242627] INFO -- : Update typeprof to b19a6416da3a05d57fadd6ffdadb382b6d236ca5 I, [2024-05-13T20:15:56.154278 #242627] INFO -- : echo ea9caafc0754b1d6236a490d59e624b53209734a | /bin/sh /tmp/ruby/src/trunk/tool/ifchange /tmp/ruby/src/trunk/.bundle/.timestamp/minitest.revision - I, [2024-05-13T20:15:56.154458 #242627] INFO -- : echo 84e85124c5014a139af39161d484156cfe87a9ed | /bin/sh /tmp/ruby/src/trunk/tool/ifchange /tmp/ruby/src/trunk/.bundle/.timestamp/power_assert.revision - I, [2024-05-13T20:15:56.155310 #242627] INFO -- : echo ba7872795d5de04adb8ff500c0e6afdc81a041dd | /bin/sh /tmp/ruby/src/trunk/tool/ifchange /tmp/ruby/src/trunk/.bundle/.timestamp/rbs.revision - I, [2024-05-13T20:15:56.155341 #242627] INFO -- : echo b19a6416da3a05d57fadd6ffdadb382b6d236ca5 | /bin/sh /tmp/ruby/src/trunk/tool/ifchange /tmp/ruby/src/trunk/.bundle/.timestamp/typeprof.revision - I, [2024-05-13T20:15:56.156262 #242627] INFO -- : /tmp/ruby/src/trunk/.bundle/.timestamp/minitest.revision unchanged I, [2024-05-13T20:15:56.156484 #242627] INFO -- : /tmp/ruby/src/trunk/.bundle/.timestamp/power_assert.revision unchanged I, [2024-05-13T20:15:56.156972 #242627] INFO -- : /tmp/ruby/src/trunk/.bundle/.timestamp/rbs.revision unchanged I, [2024-05-13T20:15:56.157023 #242627] INFO -- : /tmp/ruby/src/trunk/.bundle/.timestamp/typeprof.revision unchanged I, [2024-05-13T20:15:56.157453 #242627] INFO -- : Building power_assert@84e85124c5014a139af39161d484156cfe87a9ed to /tmp/ruby/src/trunk/gems/power_assert-2.0.3.gem I, [2024-05-13T20:15:56.226431 #242627] INFO -- : Successfully built RubyGem I, [2024-05-13T20:15:56.226483 #242627] INFO -- : Name: power_assert I, [2024-05-13T20:15:56.226496 #242627] INFO -- : Version: 2.0.4dev I, [2024-05-13T20:15:56.226502 #242627] INFO -- : File: power_assert-2.0.4dev.gem I, [2024-05-13T20:15:56.272006 #242627] INFO -- : $$$[end] "make update-download -j20" exit with 0. I, [2024-05-13T20:15:56.272043 #242627] INFO -- : $$$[beg] make update-rubyspec -j20 I, [2024-05-13T20:15:56.330382 #242627] INFO -- : make: Nothing to be done for 'update-rubyspec'. I, [2024-05-13T20:15:56.330796 #242627] INFO -- : $$$[end] "make update-rubyspec -j20" exit with 0. I, [2024-05-13T20:15:56.330848 #242627] INFO -- : $$$[beg] make update-src -j20 I, [2024-05-13T20:15:57.055076 #242627] INFO -- : Already up to date. I, [2024-05-13T20:15:57.073491 #242627] INFO -- : Latest commit hash = 5319587ac3 I, [2024-05-13T20:15:57.075541 #242627] INFO -- : $$$[end] "make update-src -j20" exit with 0. I, [2024-05-13T20:15:57.075595 #242627] INFO -- : $$$[beg] make after-update -j20 I, [2024-05-13T20:15:57.157197 #242627] INFO -- : generating /tmp/ruby/src/trunk/ext/ripper/eventids2table.c I, [2024-05-13T20:15:57.161521 #242627] INFO -- : make[1]: Entering directory '/tmp/ruby/src/trunk/ext/ripper' I, [2024-05-13T20:15:57.161543 #242627] INFO -- : make[1]: Nothing to be done for 'src'. I, [2024-05-13T20:15:57.161549 #242627] INFO -- : make[1]: Leaving directory '/tmp/ruby/src/trunk/ext/ripper' I, [2024-05-13T20:15:57.181726 #242627] INFO -- : /tmp/ruby/src/trunk/revision.h updated I, [2024-05-13T20:15:57.183817 #242627] INFO -- : generating x86_64-linux-fake.rb I, [2024-05-13T20:15:57.240061 #242627] INFO -- : x86_64-linux-fake.rb updated I, [2024-05-13T20:15:57.241500 #242627] INFO -- : generating enc.mk I, [2024-05-13T20:15:57.358395 #242627] INFO -- : making srcs under enc I, [2024-05-13T20:15:57.388077 #242627] INFO -- : make[1]: Entering directory '/tmp/ruby/build/trunk' I, [2024-05-13T20:15:57.388100 #242627] INFO -- : make[1]: Nothing to be done for 'srcs'. I, [2024-05-13T20:15:57.388105 #242627] INFO -- : make[1]: Leaving directory '/tmp/ruby/build/trunk' I, [2024-05-13T20:15:57.436292 #242627] INFO -- : Update minitest to ea9caafc0754b1d6236a490d59e624b53209734a I, [2024-05-13T20:15:57.436588 #242627] INFO -- : Update power_assert to 84e85124c5014a139af39161d484156cfe87a9ed I, [2024-05-13T20:15:57.437267 #242627] INFO -- : Update rbs to ba7872795d5de04adb8ff500c0e6afdc81a041dd I, [2024-05-13T20:15:57.437582 #242627] INFO -- : Update typeprof to b19a6416da3a05d57fadd6ffdadb382b6d236ca5 I, [2024-05-13T20:15:57.438035 #242627] INFO -- : echo ea9caafc0754b1d6236a490d59e624b53209734a | /bin/sh /tmp/ruby/src/trunk/tool/ifchange /tmp/ruby/src/trunk/.bundle/.timestamp/minitest.revision - I, [2024-05-13T20:15:57.438189 #242627] INFO -- : echo 84e85124c5014a139af39161d484156cfe87a9ed | /bin/sh /tmp/ruby/src/trunk/tool/ifchange /tmp/ruby/src/trunk/.bundle/.timestamp/power_assert.revision - I, [2024-05-13T20:15:57.439464 #242627] INFO -- : echo ba7872795d5de04adb8ff500c0e6afdc81a041dd | /bin/sh /tmp/ruby/src/trunk/tool/ifchange /tmp/ruby/src/trunk/.bundle/.timestamp/rbs.revision - I, [2024-05-13T20:15:57.439697 #242627] INFO -- : echo b19a6416da3a05d57fadd6ffdadb382b6d236ca5 | /bin/sh /tmp/ruby/src/trunk/tool/ifchange /tmp/ruby/src/trunk/.bundle/.timestamp/typeprof.revision - I, [2024-05-13T20:15:57.439918 #242627] INFO -- : /tmp/ruby/src/trunk/.bundle/.timestamp/minitest.revision unchanged I, [2024-05-13T20:15:57.440038 #242627] INFO -- : /tmp/ruby/src/trunk/.bundle/.timestamp/power_assert.revision unchanged I, [2024-05-13T20:15:57.441368 #242627] INFO -- : /tmp/ruby/src/trunk/.bundle/.timestamp/rbs.revision unchanged I, [2024-05-13T20:15:57.441389 #242627] INFO -- : Building power_assert@84e85124c5014a139af39161d484156cfe87a9ed to /tmp/ruby/src/trunk/gems/power_assert-2.0.3.gem I, [2024-05-13T20:15:57.441462 #242627] INFO -- : /tmp/ruby/src/trunk/.bundle/.timestamp/typeprof.revision unchanged I, [2024-05-13T20:15:57.510406 #242627] INFO -- : Successfully built RubyGem I, [2024-05-13T20:15:57.510450 #242627] INFO -- : Name: power_assert I, [2024-05-13T20:15:57.510456 #242627] INFO -- : Version: 2.0.4dev I, [2024-05-13T20:15:57.510460 #242627] INFO -- : File: power_assert-2.0.4dev.gem I, [2024-05-13T20:15:57.512702 #242627] INFO -- : Extracting bundle gem power_assert-2.0.3... I, [2024-05-13T20:15:57.575203 #242627] INFO -- : Try with hash version of bundled gems instead of gems/power_assert-2.0.3.gem. We don't use this gem with release version of Ruby. I, [2024-05-13T20:15:57.580095 #242627] INFO -- : Unpacked gems/power_assert-2.0.4dev.gem I, [2024-05-13T20:15:57.582561 #242627] INFO -- : $$$[end] "make after-update -j20" exit with 0. I, [2024-05-13T20:15:57.582700 #242627] INFO -- : $$$[beg] make miniruby -j20 I, [2024-05-13T20:15:57.639970 #242627] INFO -- : BASERUBY = /usr/bin/ruby --disable=gems I, [2024-05-13T20:15:57.639999 #242627] INFO -- : CC = gcc I, [2024-05-13T20:15:57.640011 #242627] INFO -- : LD = ld I, [2024-05-13T20:15:57.640015 #242627] INFO -- : LDSHARED = gcc -shared I, [2024-05-13T20:15:57.640019 #242627] INFO -- : CFLAGS = -O3 -fno-fast-math -ggdb3 -Wall -Wextra -Wdeprecated-declarations -Wdiv-by-zero -Wduplicated-cond -Wimplicit-function-declaration -Wimplicit-int -Wpointer-arith -Wwrite-strings -Wold-style-definition -Wimplicit-fallthrough=0 -Wmissing-noreturn -Wno-cast-function-type -Wno-constant-logical-operand -Wno-long-long -Wno-missing-field-initializers -Wno-overlength-strings -Wno-packed-bitfield-compat -Wno-parentheses-equality -Wno-self-assign -Wno-tautological-compare -Wno-unused-parameter -Wno-unused-value -Wsuggest-attribute=format -Wsuggest-attribute=noreturn -Wunused-variable -Wmisleading-indentation -Wundef -fPIC I, [2024-05-13T20:15:57.640024 #242627] INFO -- : XCFLAGS = -U_FORTIFY_SOURCE -D_FORTIFY_SOURCE=2 -fstack-protector-strong -fno-strict-overflow -fvisibility=hidden -fexcess-precision=standard -DRUBY_EXPORT -I. -I.ext/include/x86_64-linux -I/tmp/ruby/src/trunk/include -I/tmp/ruby/src/trunk -I/tmp/ruby/src/trunk/prism -I/tmp/ruby/src/trunk/enc/unicode/15.0.0 I, [2024-05-13T20:15:57.640028 #242627] INFO -- : CPPFLAGS = I, [2024-05-13T20:15:57.640031 #242627] INFO -- : DLDFLAGS = -Wl,--compress-debug-sections=zlib -Wl,-soname,libruby.so.3.4 -fstack-protector-strong I, [2024-05-13T20:15:57.640036 #242627] INFO -- : SOLIBS = -lz -lrt -lrt -lgmp -ldl -lcrypt -lm -lpthread I, [2024-05-13T20:15:57.640040 #242627] INFO -- : LANG = en_US.UTF-8 I, [2024-05-13T20:15:57.640043 #242627] INFO -- : LC_ALL = I, [2024-05-13T20:15:57.640047 #242627] INFO -- : LC_CTYPE = I, [2024-05-13T20:15:57.640051 #242627] INFO -- : MFLAGS = -j20 --jobserver-auth=4,5 I, [2024-05-13T20:15:57.640055 #242627] INFO -- : RUSTC = no I, [2024-05-13T20:15:57.640059 #242627] INFO -- : YJIT_RUSTC_ARGS = --crate-name=yjit --crate-type=staticlib --edition=2021 -g -C lto=thin -C opt-level=3 -C overflow-checks=on '--out-dir=/tmp/ruby/build/trunk/yjit/target/release/' /tmp/ruby/src/trunk/yjit/src/lib.rs I, [2024-05-13T20:15:57.641378 #242627] INFO -- : gcc (Ubuntu 11.4.0-1ubuntu1~22.04) 11.4.0 I, [2024-05-13T20:15:57.641408 #242627] INFO -- : Copyright (C) 2021 Free Software Foundation, Inc. I, [2024-05-13T20:15:57.641414 #242627] INFO -- : This is free software; see the source for copying conditions. There is NO I, [2024-05-13T20:15:57.641418 #242627] INFO -- : warranty; not even for MERCHANTABILITY or FITNESS FOR A PARTICULAR PURPOSE. I, [2024-05-13T20:15:57.641422 #242627] INFO -- : I, [2024-05-13T20:15:57.662176 #242627] INFO -- : compiling /tmp/ruby/src/trunk/version.c I, [2024-05-13T20:15:57.763469 #242627] INFO -- : linking miniruby I, [2024-05-13T20:15:58.285318 #242627] INFO -- : $$$[end] "make miniruby -j20" exit with 0. I, [2024-05-13T20:15:58.285418 #242627] INFO -- : $$$[beg] make ruby -j20 I, [2024-05-13T20:15:58.343204 #242627] INFO -- : BASERUBY = /usr/bin/ruby --disable=gems I, [2024-05-13T20:15:58.343240 #242627] INFO -- : CC = gcc I, [2024-05-13T20:15:58.343253 #242627] INFO -- : LD = ld I, [2024-05-13T20:15:58.343258 #242627] INFO -- : LDSHARED = gcc -shared I, [2024-05-13T20:15:58.343262 #242627] INFO -- : CFLAGS = -O3 -fno-fast-math -ggdb3 -Wall -Wextra -Wdeprecated-declarations -Wdiv-by-zero -Wduplicated-cond -Wimplicit-function-declaration -Wimplicit-int -Wpointer-arith -Wwrite-strings -Wold-style-definition -Wimplicit-fallthrough=0 -Wmissing-noreturn -Wno-cast-function-type -Wno-constant-logical-operand -Wno-long-long -Wno-missing-field-initializers -Wno-overlength-strings -Wno-packed-bitfield-compat -Wno-parentheses-equality -Wno-self-assign -Wno-tautological-compare -Wno-unused-parameter -Wno-unused-value -Wsuggest-attribute=format -Wsuggest-attribute=noreturn -Wunused-variable -Wmisleading-indentation -Wundef -fPIC I, [2024-05-13T20:15:58.343268 #242627] INFO -- : XCFLAGS = -U_FORTIFY_SOURCE -D_FORTIFY_SOURCE=2 -fstack-protector-strong -fno-strict-overflow -fvisibility=hidden -fexcess-precision=standard -DRUBY_EXPORT -I. -I.ext/include/x86_64-linux -I/tmp/ruby/src/trunk/include -I/tmp/ruby/src/trunk -I/tmp/ruby/src/trunk/prism -I/tmp/ruby/src/trunk/enc/unicode/15.0.0 I, [2024-05-13T20:15:58.343272 #242627] INFO -- : CPPFLAGS = I, [2024-05-13T20:15:58.343276 #242627] INFO -- : DLDFLAGS = -Wl,--compress-debug-sections=zlib -Wl,-soname,libruby.so.3.4 -fstack-protector-strong I, [2024-05-13T20:15:58.343280 #242627] INFO -- : SOLIBS = -lz -lrt -lrt -lgmp -ldl -lcrypt -lm -lpthread I, [2024-05-13T20:15:58.343284 #242627] INFO -- : LANG = en_US.UTF-8 I, [2024-05-13T20:15:58.343288 #242627] INFO -- : LC_ALL = I, [2024-05-13T20:15:58.343291 #242627] INFO -- : LC_CTYPE = I, [2024-05-13T20:15:58.343295 #242627] INFO -- : MFLAGS = -j20 --jobserver-auth=4,5 I, [2024-05-13T20:15:58.343299 #242627] INFO -- : RUSTC = no I, [2024-05-13T20:15:58.343303 #242627] INFO -- : YJIT_RUSTC_ARGS = --crate-name=yjit --crate-type=staticlib --edition=2021 -g -C lto=thin -C opt-level=3 -C overflow-checks=on '--out-dir=/tmp/ruby/build/trunk/yjit/target/release/' /tmp/ruby/src/trunk/yjit/src/lib.rs I, [2024-05-13T20:15:58.345014 #242627] INFO -- : gcc (Ubuntu 11.4.0-1ubuntu1~22.04) 11.4.0 I, [2024-05-13T20:15:58.345042 #242627] INFO -- : Copyright (C) 2021 Free Software Foundation, Inc. I, [2024-05-13T20:15:58.345050 #242627] INFO -- : This is free software; see the source for copying conditions. There is NO I, [2024-05-13T20:15:58.345055 #242627] INFO -- : warranty; not even for MERCHANTABILITY or FITNESS FOR A PARTICULAR PURPOSE. I, [2024-05-13T20:15:58.345060 #242627] INFO -- : I, [2024-05-13T20:15:58.453056 #242627] INFO -- : builtin_binary.inc updated I, [2024-05-13T20:15:58.457852 #242627] INFO -- : c5234a9416e4f20f175185e840b25b0f08674d14078ed7083f37e655458e3ca9 builtin_binary.inc I, [2024-05-13T20:15:58.458685 #242627] INFO -- : compiling /tmp/ruby/src/trunk/builtin.c I, [2024-05-13T20:15:58.642250 #242627] INFO -- : linking static-library libruby-static.a I, [2024-05-13T20:15:58.951421 #242627] INFO -- : linking shared-library libruby.so.3.4.0 I, [2024-05-13T20:16:00.506053 #242627] INFO -- : linking ruby I, [2024-05-13T20:16:00.529354 #242627] INFO -- : $$$[end] "make ruby -j20" exit with 0. I, [2024-05-13T20:16:00.529566 #242627] INFO -- : $$$[beg] make all -j20 I, [2024-05-13T20:16:00.587008 #242627] INFO -- : BASERUBY = /usr/bin/ruby --disable=gems I, [2024-05-13T20:16:00.587044 #242627] INFO -- : CC = gcc I, [2024-05-13T20:16:00.587052 #242627] INFO -- : LD = ld I, [2024-05-13T20:16:00.587059 #242627] INFO -- : LDSHARED = gcc -shared I, [2024-05-13T20:16:00.587066 #242627] INFO -- : CFLAGS = -O3 -fno-fast-math -ggdb3 -Wall -Wextra -Wdeprecated-declarations -Wdiv-by-zero -Wduplicated-cond -Wimplicit-function-declaration -Wimplicit-int -Wpointer-arith -Wwrite-strings -Wold-style-definition -Wimplicit-fallthrough=0 -Wmissing-noreturn -Wno-cast-function-type -Wno-constant-logical-operand -Wno-long-long -Wno-missing-field-initializers -Wno-overlength-strings -Wno-packed-bitfield-compat -Wno-parentheses-equality -Wno-self-assign -Wno-tautological-compare -Wno-unused-parameter -Wno-unused-value -Wsuggest-attribute=format -Wsuggest-attribute=noreturn -Wunused-variable -Wmisleading-indentation -Wundef -fPIC I, [2024-05-13T20:16:00.587073 #242627] INFO -- : XCFLAGS = -U_FORTIFY_SOURCE -D_FORTIFY_SOURCE=2 -fstack-protector-strong -fno-strict-overflow -fvisibility=hidden -fexcess-precision=standard -DRUBY_EXPORT -I. -I.ext/include/x86_64-linux -I/tmp/ruby/src/trunk/include -I/tmp/ruby/src/trunk -I/tmp/ruby/src/trunk/prism -I/tmp/ruby/src/trunk/enc/unicode/15.0.0 I, [2024-05-13T20:16:00.587081 #242627] INFO -- : CPPFLAGS = I, [2024-05-13T20:16:00.587086 #242627] INFO -- : DLDFLAGS = -Wl,--compress-debug-sections=zlib -Wl,-soname,libruby.so.3.4 -fstack-protector-strong I, [2024-05-13T20:16:00.587093 #242627] INFO -- : SOLIBS = -lz -lrt -lrt -lgmp -ldl -lcrypt -lm -lpthread I, [2024-05-13T20:16:00.587098 #242627] INFO -- : LANG = en_US.UTF-8 I, [2024-05-13T20:16:00.587104 #242627] INFO -- : LC_ALL = I, [2024-05-13T20:16:00.587110 #242627] INFO -- : LC_CTYPE = I, [2024-05-13T20:16:00.587116 #242627] INFO -- : MFLAGS = -j20 --jobserver-auth=4,5 I, [2024-05-13T20:16:00.587122 #242627] INFO -- : RUSTC = no I, [2024-05-13T20:16:00.587130 #242627] INFO -- : YJIT_RUSTC_ARGS = --crate-name=yjit --crate-type=staticlib --edition=2021 -g -C lto=thin -C opt-level=3 -C overflow-checks=on '--out-dir=/tmp/ruby/build/trunk/yjit/target/release/' /tmp/ruby/src/trunk/yjit/src/lib.rs I, [2024-05-13T20:16:00.588435 #242627] INFO -- : gcc (Ubuntu 11.4.0-1ubuntu1~22.04) 11.4.0 I, [2024-05-13T20:16:00.588465 #242627] INFO -- : Copyright (C) 2021 Free Software Foundation, Inc. I, [2024-05-13T20:16:00.588474 #242627] INFO -- : This is free software; see the source for copying conditions. There is NO I, [2024-05-13T20:16:00.588480 #242627] INFO -- : warranty; not even for MERCHANTABILITY or FITNESS FOR A PARTICULAR PURPOSE. I, [2024-05-13T20:16:00.588486 #242627] INFO -- : I, [2024-05-13T20:16:00.615676 #242627] INFO -- : generating enc.mk I, [2024-05-13T20:16:00.617569 #242627] INFO -- : building spec/ruby/optional/capi/ext/array_spec.so I, [2024-05-13T20:16:00.617858 #242627] INFO -- : building spec/ruby/optional/capi/ext/basic_object_spec.so I, [2024-05-13T20:16:00.618472 #242627] INFO -- : building spec/ruby/optional/capi/ext/bignum_spec.so I, [2024-05-13T20:16:00.619163 #242627] INFO -- : building spec/ruby/optional/capi/ext/binding_spec.so I, [2024-05-13T20:16:00.619609 #242627] INFO -- : building spec/ruby/optional/capi/ext/boolean_spec.so I, [2024-05-13T20:16:00.620538 #242627] INFO -- : building spec/ruby/optional/capi/ext/class_id_under_autoload_spec.so I, [2024-05-13T20:16:00.621621 #242627] INFO -- : building spec/ruby/optional/capi/ext/class_spec.so I, [2024-05-13T20:16:00.622382 #242627] INFO -- : building spec/ruby/optional/capi/ext/class_under_autoload_spec.so I, [2024-05-13T20:16:00.623023 #242627] INFO -- : building spec/ruby/optional/capi/ext/complex_spec.so I, [2024-05-13T20:16:00.623357 #242627] INFO -- : building spec/ruby/optional/capi/ext/constants_spec.so I, [2024-05-13T20:16:00.624069 #242627] INFO -- : building spec/ruby/optional/capi/ext/data_spec.so I, [2024-05-13T20:16:00.624319 #242627] INFO -- : building spec/ruby/optional/capi/ext/debug_spec.so I, [2024-05-13T20:16:00.625150 #242627] INFO -- : building spec/ruby/optional/capi/ext/encoding_spec.so I, [2024-05-13T20:16:00.625476 #242627] INFO -- : building spec/ruby/optional/capi/ext/enumerator_spec.so I, [2024-05-13T20:16:00.626425 #242627] INFO -- : building spec/ruby/optional/capi/ext/exception_spec.so I, [2024-05-13T20:16:00.626683 #242627] INFO -- : building spec/ruby/optional/capi/ext/fiber_spec.so I, [2024-05-13T20:16:00.627498 #242627] INFO -- : building spec/ruby/optional/capi/ext/file_spec.so I, [2024-05-13T20:16:00.627755 #242627] INFO -- : building spec/ruby/optional/capi/ext/fixnum_spec.so I, [2024-05-13T20:16:00.644172 #242627] INFO -- : building spec/ruby/optional/capi/ext/float_spec.so I, [2024-05-13T20:16:00.738902 #242627] INFO -- : building spec/ruby/optional/capi/ext/gc_spec.so I, [2024-05-13T20:16:00.770462 #242627] INFO -- : building spec/ruby/optional/capi/ext/globals_spec.so I, [2024-05-13T20:16:00.773612 #242627] INFO -- : building spec/ruby/optional/capi/ext/hash_spec.so I, [2024-05-13T20:16:00.776037 #242627] INFO -- : building spec/ruby/optional/capi/ext/integer_spec.so I, [2024-05-13T20:16:00.792659 #242627] INFO -- : building spec/ruby/optional/capi/ext/io_spec.so I, [2024-05-13T20:16:00.792967 #242627] INFO -- : building spec/ruby/optional/capi/ext/kernel_spec.so I, [2024-05-13T20:16:00.793549 #242627] INFO -- : building spec/ruby/optional/capi/ext/language_spec.so I, [2024-05-13T20:16:00.793852 #242627] INFO -- : building spec/ruby/optional/capi/ext/marshal_spec.so I, [2024-05-13T20:16:00.794715 #242627] INFO -- : building spec/ruby/optional/capi/ext/module_spec.so I, [2024-05-13T20:16:00.795273 #242627] INFO -- : building spec/ruby/optional/capi/ext/module_under_autoload_spec.so I, [2024-05-13T20:16:00.795821 #242627] INFO -- : building spec/ruby/optional/capi/ext/mutex_spec.so I, [2024-05-13T20:16:00.796334 #242627] INFO -- : building spec/ruby/optional/capi/ext/numeric_spec.so I, [2024-05-13T20:16:00.798996 #242627] INFO -- : building spec/ruby/optional/capi/ext/object_spec.so I, [2024-05-13T20:16:00.806784 #242627] INFO -- : building spec/ruby/optional/capi/ext/proc_spec.so I, [2024-05-13T20:16:00.826544 #242627] INFO -- : building spec/ruby/optional/capi/ext/range_spec.so I, [2024-05-13T20:16:00.830974 #242627] INFO -- : building spec/ruby/optional/capi/ext/rational_spec.so I, [2024-05-13T20:16:00.862784 #242627] INFO -- : building spec/ruby/optional/capi/ext/rbasic_spec.so I, [2024-05-13T20:16:00.883807 #242627] INFO -- : building spec/ruby/optional/capi/ext/regexp_spec.so I, [2024-05-13T20:16:00.905483 #242627] INFO -- : building spec/ruby/optional/capi/ext/string_spec.so I, [2024-05-13T20:16:00.919418 #242627] INFO -- : building spec/ruby/optional/capi/ext/struct_spec.so I, [2024-05-13T20:16:00.938159 #242627] INFO -- : building spec/ruby/optional/capi/ext/st_spec.so I, [2024-05-13T20:16:00.940404 #242627] INFO -- : building spec/ruby/optional/capi/ext/symbol_spec.so I, [2024-05-13T20:16:00.942822 #242627] INFO -- : building spec/ruby/optional/capi/ext/thread_spec.so I, [2024-05-13T20:16:00.950725 #242627] INFO -- : building spec/ruby/optional/capi/ext/time_spec.so I, [2024-05-13T20:16:00.956703 #242627] INFO -- : building spec/ruby/optional/capi/ext/tracepoint_spec.so I, [2024-05-13T20:16:00.965706 #242627] INFO -- : building spec/ruby/optional/capi/ext/typed_data_spec.so I, [2024-05-13T20:16:00.967488 #242627] INFO -- : building spec/ruby/optional/capi/ext/util_spec.so I, [2024-05-13T20:16:00.970898 #242627] INFO -- : making enc I, [2024-05-13T20:16:00.982857 #242627] INFO -- : making srcs under enc I, [2024-05-13T20:16:00.999112 #242627] INFO -- : make[1]: Entering directory '/tmp/ruby/build/trunk' I, [2024-05-13T20:16:00.999187 #242627] INFO -- : make[1]: Nothing to be done for 'enc'. I, [2024-05-13T20:16:00.999201 #242627] INFO -- : make[1]: Leaving directory '/tmp/ruby/build/trunk' I, [2024-05-13T20:16:01.032112 #242627] INFO -- : make[1]: Entering directory '/tmp/ruby/build/trunk' I, [2024-05-13T20:16:01.032177 #242627] INFO -- : make[1]: Nothing to be done for 'srcs'. I, [2024-05-13T20:16:01.032191 #242627] INFO -- : make[1]: Leaving directory '/tmp/ruby/build/trunk' I, [2024-05-13T20:16:01.032965 #242627] INFO -- : generating transdb.h I, [2024-05-13T20:16:01.160782 #242627] INFO -- : transdb.h unchanged I, [2024-05-13T20:16:01.162359 #242627] INFO -- : generating makefiles ext/configure-ext.mk I, [2024-05-13T20:16:01.162738 #242627] INFO -- : making trans I, [2024-05-13T20:16:01.189302 #242627] INFO -- : ext/configure-ext.mk updated I, [2024-05-13T20:16:01.191903 #242627] INFO -- : make[1]: Entering directory '/tmp/ruby/build/trunk' I, [2024-05-13T20:16:01.200615 #242627] INFO -- : make[1]: Entering directory '/tmp/ruby/build/trunk' I, [2024-05-13T20:16:01.200689 #242627] INFO -- : make[1]: Nothing to be done for 'trans'. I, [2024-05-13T20:16:01.200699 #242627] INFO -- : make[1]: Leaving directory '/tmp/ruby/build/trunk' I, [2024-05-13T20:16:01.259209 #242627] INFO -- : making encs I, [2024-05-13T20:16:01.300273 #242627] INFO -- : make[1]: Entering directory '/tmp/ruby/build/trunk' I, [2024-05-13T20:16:01.300331 #242627] INFO -- : make[1]: Nothing to be done for 'encs'. I, [2024-05-13T20:16:01.300340 #242627] INFO -- : make[1]: Leaving directory '/tmp/ruby/build/trunk' I, [2024-05-13T20:16:01.344620 #242627] INFO -- : make[1]: Leaving directory '/tmp/ruby/build/trunk' I, [2024-05-13T20:16:01.345332 #242627] INFO -- : generating makefile exts.mk I, [2024-05-13T20:16:01.382304 #242627] INFO -- : exts.mk unchanged I, [2024-05-13T20:16:01.386751 #242627] INFO -- : make[1]: Entering directory '/tmp/ruby/build/trunk' I, [2024-05-13T20:16:01.404830 #242627] INFO -- : make[2]: Entering directory '/tmp/ruby/build/trunk/ext/digest' I, [2024-05-13T20:16:01.406564 #242627] INFO -- : make[2]: Entering directory '/tmp/ruby/build/trunk/ext/coverage' I, [2024-05-13T20:16:01.406882 #242627] INFO -- : make[2]: Entering directory '/tmp/ruby/build/trunk/ext/json' I, [2024-05-13T20:16:01.407207 #242627] INFO -- : make[2]: Entering directory '/tmp/ruby/build/trunk/ext/io/console' I, [2024-05-13T20:16:01.407236 #242627] INFO -- : make[2]: Entering directory '/tmp/ruby/build/trunk/ext/date' I, [2024-05-13T20:16:01.408178 #242627] INFO -- : make[2]: Entering directory '/tmp/ruby/build/trunk/ext/rubyvm' I, [2024-05-13T20:16:01.408919 #242627] INFO -- : make[2]: Entering directory '/tmp/ruby/build/trunk/ext/monitor' I, [2024-05-13T20:16:01.409268 #242627] INFO -- : make[2]: Entering directory '/tmp/ruby/build/trunk/ext/pathname' I, [2024-05-13T20:16:01.409465 #242627] INFO -- : make[2]: Leaving directory '/tmp/ruby/build/trunk/ext/digest' I, [2024-05-13T20:16:01.409646 #242627] INFO -- : make[2]: Entering directory '/tmp/ruby/build/trunk/ext/fiddle' I, [2024-05-13T20:16:01.409753 #242627] INFO -- : make[2]: Entering directory '/tmp/ruby/build/trunk/ext/pty' I, [2024-05-13T20:16:01.410215 #242627] INFO -- : make[2]: Leaving directory '/tmp/ruby/build/trunk/ext/rubyvm' I, [2024-05-13T20:16:01.410536 #242627] INFO -- : make[2]: Leaving directory '/tmp/ruby/build/trunk/ext/coverage' I, [2024-05-13T20:16:01.410567 #242627] INFO -- : make[2]: Leaving directory '/tmp/ruby/build/trunk/ext/io/console' I, [2024-05-13T20:16:01.410808 #242627] INFO -- : make[2]: Leaving directory '/tmp/ruby/build/trunk/ext/date' I, [2024-05-13T20:16:01.411087 #242627] INFO -- : make[2]: Entering directory '/tmp/ruby/build/trunk/ext/objspace' I, [2024-05-13T20:16:01.411205 #242627] INFO -- : make[2]: Entering directory '/tmp/ruby/build/trunk/ext/psych' I, [2024-05-13T20:16:01.411644 #242627] INFO -- : make[2]: Entering directory '/tmp/ruby/build/trunk/.bundle/gems/bigdecimal-3.1.8/ext/bigdecimal' I, [2024-05-13T20:16:01.412130 #242627] INFO -- : make[2]: Leaving directory '/tmp/ruby/build/trunk/ext/pathname' I, [2024-05-13T20:16:01.412161 #242627] INFO -- : make[2]: Leaving directory '/tmp/ruby/build/trunk/ext/monitor' I, [2024-05-13T20:16:01.412739 #242627] INFO -- : make[2]: Entering directory '/tmp/ruby/build/trunk/.bundle/gems/debug-1.9.2/ext/debug' I, [2024-05-13T20:16:01.412901 #242627] INFO -- : make[2]: Leaving directory '/tmp/ruby/build/trunk/ext/pty' I, [2024-05-13T20:16:01.414164 #242627] INFO -- : make[2]: Entering directory '/tmp/ruby/build/trunk/ext/ripper' I, [2024-05-13T20:16:01.414708 #242627] INFO -- : make[2]: Leaving directory '/tmp/ruby/build/trunk/ext/objspace' I, [2024-05-13T20:16:01.415191 #242627] INFO -- : make[2]: Entering directory '/tmp/ruby/build/trunk/.bundle/gems/nkf-0.2.0/ext/nkf' I, [2024-05-13T20:16:01.415373 #242627] INFO -- : make[2]: Entering directory '/tmp/ruby/build/trunk/.bundle/gems/racc-1.7.3/ext/racc/cparse' I, [2024-05-13T20:16:01.415755 #242627] INFO -- : make[2]: Leaving directory '/tmp/ruby/build/trunk/ext/json' I, [2024-05-13T20:16:01.415783 #242627] INFO -- : make[2]: Entering directory '/tmp/ruby/build/trunk/.bundle/gems/rbs-3.4.4/ext/rbs_extension' I, [2024-05-13T20:16:01.415794 #242627] INFO -- : make[2]: Entering directory '/tmp/ruby/build/trunk/.bundle/gems/syslog-0.1.2/ext/syslog' I, [2024-05-13T20:16:01.416507 #242627] INFO -- : make[2]: Leaving directory '/tmp/ruby/build/trunk/ext/fiddle' I, [2024-05-13T20:16:01.417436 #242627] INFO -- : make[2]: Entering directory '/tmp/ruby/build/trunk/ext/socket' I, [2024-05-13T20:16:01.419086 #242627] INFO -- : make[2]: Entering directory '/tmp/ruby/build/trunk/ext/digest/sha2' I, [2024-05-13T20:16:01.420389 #242627] INFO -- : make[2]: Leaving directory '/tmp/ruby/build/trunk/ext/ripper' I, [2024-05-13T20:16:01.421736 #242627] INFO -- : make[2]: Entering directory '/tmp/ruby/build/trunk/ext/openssl' I, [2024-05-13T20:16:01.421902 #242627] INFO -- : make[2]: Leaving directory '/tmp/ruby/build/trunk/ext/psych' I, [2024-05-13T20:16:01.422339 #242627] INFO -- : make[2]: Leaving directory '/tmp/ruby/build/trunk/ext/digest/sha2' I, [2024-05-13T20:16:01.424056 #242627] INFO -- : make[2]: Leaving directory '/tmp/ruby/build/trunk/ext/socket' I, [2024-05-13T20:16:01.432940 #242627] INFO -- : make[2]: Leaving directory '/tmp/ruby/build/trunk/ext/openssl' I, [2024-05-13T20:16:01.437936 #242627] INFO -- : make[2]: Leaving directory '/tmp/ruby/build/trunk/.bundle/gems/bigdecimal-3.1.8/ext/bigdecimal' I, [2024-05-13T20:16:01.438741 #242627] INFO -- : make[2]: Leaving directory '/tmp/ruby/build/trunk/.bundle/gems/syslog-0.1.2/ext/syslog' I, [2024-05-13T20:16:01.440068 #242627] INFO -- : make[2]: Leaving directory '/tmp/ruby/build/trunk/.bundle/gems/rbs-3.4.4/ext/rbs_extension' I, [2024-05-13T20:16:01.441470 #242627] INFO -- : make[2]: Leaving directory '/tmp/ruby/build/trunk/.bundle/gems/nkf-0.2.0/ext/nkf' I, [2024-05-13T20:16:01.444074 #242627] INFO -- : make[2]: Leaving directory '/tmp/ruby/build/trunk/.bundle/gems/debug-1.9.2/ext/debug' I, [2024-05-13T20:16:01.445446 #242627] INFO -- : make[2]: Leaving directory '/tmp/ruby/build/trunk/.bundle/gems/racc-1.7.3/ext/racc/cparse' I, [2024-05-13T20:16:01.469043 #242627] INFO -- : make[2]: Entering directory '/tmp/ruby/build/trunk' I, [2024-05-13T20:16:01.535078 #242627] INFO -- : linking ruby I, [2024-05-13T20:16:01.557590 #242627] INFO -- : make[2]: Leaving directory '/tmp/ruby/build/trunk' I, [2024-05-13T20:16:01.557899 #242627] INFO -- : make[1]: Leaving directory '/tmp/ruby/build/trunk' I, [2024-05-13T20:16:01.561531 #242627] INFO -- : make[1]: Entering directory '/tmp/ruby/build/trunk' I, [2024-05-13T20:16:01.561552 #242627] INFO -- : make[1]: Nothing to be done for 'note'. I, [2024-05-13T20:16:01.561558 #242627] INFO -- : make[1]: Leaving directory '/tmp/ruby/build/trunk' I, [2024-05-13T20:16:01.562155 #242627] INFO -- : $$$[end] "make all -j20" exit with 0. I, [2024-05-13T20:16:01.562408 #242627] INFO -- : $$$[beg] make install -j20 I, [2024-05-13T20:16:01.631393 #242627] INFO -- : Update minitest to ea9caafc0754b1d6236a490d59e624b53209734a I, [2024-05-13T20:16:01.631549 #242627] INFO -- : Update power_assert to 84e85124c5014a139af39161d484156cfe87a9ed I, [2024-05-13T20:16:01.631774 #242627] INFO -- : Update rbs to ba7872795d5de04adb8ff500c0e6afdc81a041dd I, [2024-05-13T20:16:01.632226 #242627] INFO -- : Update typeprof to b19a6416da3a05d57fadd6ffdadb382b6d236ca5 I, [2024-05-13T20:16:01.633408 #242627] INFO -- : echo ea9caafc0754b1d6236a490d59e624b53209734a | /bin/sh /tmp/ruby/src/trunk/tool/ifchange /tmp/ruby/src/trunk/.bundle/.timestamp/minitest.revision - I, [2024-05-13T20:16:01.633677 #242627] INFO -- : echo 84e85124c5014a139af39161d484156cfe87a9ed | /bin/sh /tmp/ruby/src/trunk/tool/ifchange /tmp/ruby/src/trunk/.bundle/.timestamp/power_assert.revision - I, [2024-05-13T20:16:01.634598 #242627] INFO -- : BASERUBY = /usr/bin/ruby --disable=gems I, [2024-05-13T20:16:01.634627 #242627] INFO -- : CC = gcc I, [2024-05-13T20:16:01.634635 #242627] INFO -- : LD = ld I, [2024-05-13T20:16:01.634641 #242627] INFO -- : LDSHARED = gcc -shared I, [2024-05-13T20:16:01.634646 #242627] INFO -- : CFLAGS = -O3 -fno-fast-math -ggdb3 -Wall -Wextra -Wdeprecated-declarations -Wdiv-by-zero -Wduplicated-cond -Wimplicit-function-declaration -Wimplicit-int -Wpointer-arith -Wwrite-strings -Wold-style-definition -Wimplicit-fallthrough=0 -Wmissing-noreturn -Wno-cast-function-type -Wno-constant-logical-operand -Wno-long-long -Wno-missing-field-initializers -Wno-overlength-strings -Wno-packed-bitfield-compat -Wno-parentheses-equality -Wno-self-assign -Wno-tautological-compare -Wno-unused-parameter -Wno-unused-value -Wsuggest-attribute=format -Wsuggest-attribute=noreturn -Wunused-variable -Wmisleading-indentation -Wundef -fPIC I, [2024-05-13T20:16:01.634651 #242627] INFO -- : XCFLAGS = -U_FORTIFY_SOURCE -D_FORTIFY_SOURCE=2 -fstack-protector-strong -fno-strict-overflow -fvisibility=hidden -fexcess-precision=standard -DRUBY_EXPORT -I. -I.ext/include/x86_64-linux -I/tmp/ruby/src/trunk/include -I/tmp/ruby/src/trunk -I/tmp/ruby/src/trunk/prism -I/tmp/ruby/src/trunk/enc/unicode/15.0.0 I, [2024-05-13T20:16:01.634657 #242627] INFO -- : CPPFLAGS = I, [2024-05-13T20:16:01.634663 #242627] INFO -- : DLDFLAGS = -Wl,--compress-debug-sections=zlib -Wl,-soname,libruby.so.3.4 -fstack-protector-strong I, [2024-05-13T20:16:01.634668 #242627] INFO -- : SOLIBS = -lz -lrt -lrt -lgmp -ldl -lcrypt -lm -lpthread I, [2024-05-13T20:16:01.634677 #242627] INFO -- : LANG = en_US.UTF-8 I, [2024-05-13T20:16:01.634682 #242627] INFO -- : LC_ALL = I, [2024-05-13T20:16:01.634687 #242627] INFO -- : LC_CTYPE = I, [2024-05-13T20:16:01.634692 #242627] INFO -- : MFLAGS = -j20 --jobserver-auth=4,5 I, [2024-05-13T20:16:01.634696 #242627] INFO -- : RUSTC = no I, [2024-05-13T20:16:01.634701 #242627] INFO -- : YJIT_RUSTC_ARGS = --crate-name=yjit --crate-type=staticlib --edition=2021 -g -C lto=thin -C opt-level=3 -C overflow-checks=on '--out-dir=/tmp/ruby/build/trunk/yjit/target/release/' /tmp/ruby/src/trunk/yjit/src/lib.rs I, [2024-05-13T20:16:01.635934 #242627] INFO -- : /tmp/ruby/src/trunk/.bundle/.timestamp/minitest.revision unchanged I, [2024-05-13T20:16:01.635971 #242627] INFO -- : /tmp/ruby/src/trunk/.bundle/.timestamp/power_assert.revision unchanged I, [2024-05-13T20:16:01.666597 #242627] INFO -- : echo ba7872795d5de04adb8ff500c0e6afdc81a041dd | /bin/sh /tmp/ruby/src/trunk/tool/ifchange /tmp/ruby/src/trunk/.bundle/.timestamp/rbs.revision - I, [2024-05-13T20:16:01.666705 #242627] INFO -- : echo b19a6416da3a05d57fadd6ffdadb382b6d236ca5 | /bin/sh /tmp/ruby/src/trunk/tool/ifchange /tmp/ruby/src/trunk/.bundle/.timestamp/typeprof.revision - I, [2024-05-13T20:16:01.667321 #242627] INFO -- : generating enc.mk I, [2024-05-13T20:16:01.667377 #242627] INFO -- : gcc (Ubuntu 11.4.0-1ubuntu1~22.04) 11.4.0 I, [2024-05-13T20:16:01.667384 #242627] INFO -- : Copyright (C) 2021 Free Software Foundation, Inc. I, [2024-05-13T20:16:01.667388 #242627] INFO -- : This is free software; see the source for copying conditions. There is NO I, [2024-05-13T20:16:01.667392 #242627] INFO -- : warranty; not even for MERCHANTABILITY or FITNESS FOR A PARTICULAR PURPOSE. I, [2024-05-13T20:16:01.667396 #242627] INFO -- : I, [2024-05-13T20:16:01.668396 #242627] INFO -- : /tmp/ruby/src/trunk/.bundle/.timestamp/rbs.revision unchanged I, [2024-05-13T20:16:01.668563 #242627] INFO -- : /tmp/ruby/src/trunk/.bundle/.timestamp/typeprof.revision unchanged I, [2024-05-13T20:16:01.789535 #242627] INFO -- : Building power_assert@84e85124c5014a139af39161d484156cfe87a9ed to /tmp/ruby/src/trunk/gems/power_assert-2.0.3.gem I, [2024-05-13T20:16:01.790112 #242627] INFO -- : making srcs under enc I, [2024-05-13T20:16:01.790358 #242627] INFO -- : making enc I, [2024-05-13T20:16:01.807183 #242627] INFO -- : make[1]: Entering directory '/tmp/ruby/build/trunk' I, [2024-05-13T20:16:01.807215 #242627] INFO -- : make[1]: Nothing to be done for 'enc'. I, [2024-05-13T20:16:01.807221 #242627] INFO -- : make[1]: Leaving directory '/tmp/ruby/build/trunk' I, [2024-05-13T20:16:01.819731 #242627] INFO -- : make[1]: Entering directory '/tmp/ruby/build/trunk' I, [2024-05-13T20:16:01.819759 #242627] INFO -- : make[1]: Nothing to be done for 'srcs'. I, [2024-05-13T20:16:01.819769 #242627] INFO -- : make[1]: Leaving directory '/tmp/ruby/build/trunk' I, [2024-05-13T20:16:01.820525 #242627] INFO -- : generating transdb.h I, [2024-05-13T20:16:01.858555 #242627] INFO -- : Successfully built RubyGem I, [2024-05-13T20:16:01.858599 #242627] INFO -- : Name: power_assert I, [2024-05-13T20:16:01.858606 #242627] INFO -- : Version: 2.0.4dev I, [2024-05-13T20:16:01.858610 #242627] INFO -- : File: power_assert-2.0.4dev.gem I, [2024-05-13T20:16:01.860823 #242627] INFO -- : Extracting bundle gem power_assert-2.0.3... I, [2024-05-13T20:16:01.916619 #242627] INFO -- : transdb.h unchanged I, [2024-05-13T20:16:01.918020 #242627] INFO -- : generating makefiles ext/configure-ext.mk I, [2024-05-13T20:16:01.918348 #242627] INFO -- : making trans I, [2024-05-13T20:16:01.921915 #242627] INFO -- : Try with hash version of bundled gems instead of gems/power_assert-2.0.3.gem. We don't use this gem with release version of Ruby. I, [2024-05-13T20:16:01.926951 #242627] INFO -- : Unpacked gems/power_assert-2.0.4dev.gem I, [2024-05-13T20:16:01.944869 #242627] INFO -- : ext/configure-ext.mk unchanged I, [2024-05-13T20:16:01.947589 #242627] INFO -- : make[1]: Entering directory '/tmp/ruby/build/trunk' I, [2024-05-13T20:16:01.952953 #242627] INFO -- : make[1]: Entering directory '/tmp/ruby/build/trunk' I, [2024-05-13T20:16:01.953038 #242627] INFO -- : make[1]: Nothing to be done for 'trans'. I, [2024-05-13T20:16:01.953048 #242627] INFO -- : make[1]: Leaving directory '/tmp/ruby/build/trunk' I, [2024-05-13T20:16:01.953928 #242627] INFO -- : making encs I, [2024-05-13T20:16:02.012429 #242627] INFO -- : make[1]: Entering directory '/tmp/ruby/build/trunk' I, [2024-05-13T20:16:02.012500 #242627] INFO -- : make[1]: Nothing to be done for 'encs'. I, [2024-05-13T20:16:02.012529 #242627] INFO -- : make[1]: Leaving directory '/tmp/ruby/build/trunk' I, [2024-05-13T20:16:02.103154 #242627] INFO -- : make[1]: Leaving directory '/tmp/ruby/build/trunk' I, [2024-05-13T20:16:02.103813 #242627] INFO -- : generating makefile exts.mk I, [2024-05-13T20:16:02.140634 #242627] INFO -- : exts.mk unchanged I, [2024-05-13T20:16:02.145629 #242627] INFO -- : make[1]: Entering directory '/tmp/ruby/build/trunk' I, [2024-05-13T20:16:02.164453 #242627] INFO -- : make[2]: Entering directory '/tmp/ruby/build/trunk/ext/digest' I, [2024-05-13T20:16:02.165735 #242627] INFO -- : make[2]: Entering directory '/tmp/ruby/build/trunk/ext/json' I, [2024-05-13T20:16:02.165906 #242627] INFO -- : make[2]: Entering directory '/tmp/ruby/build/trunk/ext/coverage' I, [2024-05-13T20:16:02.166648 #242627] INFO -- : make[2]: Entering directory '/tmp/ruby/build/trunk/ext/date' I, [2024-05-13T20:16:02.166737 #242627] INFO -- : make[2]: Entering directory '/tmp/ruby/build/trunk/ext/io/console' I, [2024-05-13T20:16:02.167637 #242627] INFO -- : make[2]: Entering directory '/tmp/ruby/build/trunk/ext/monitor' I, [2024-05-13T20:16:02.168133 #242627] INFO -- : make[2]: Entering directory '/tmp/ruby/build/trunk/ext/pathname' I, [2024-05-13T20:16:02.168953 #242627] INFO -- : make[2]: Entering directory '/tmp/ruby/build/trunk/ext/fiddle' I, [2024-05-13T20:16:02.169012 #242627] INFO -- : make[2]: Leaving directory '/tmp/ruby/build/trunk/ext/coverage' I, [2024-05-13T20:16:02.169046 #242627] INFO -- : make[2]: Entering directory '/tmp/ruby/build/trunk/ext/pty' I, [2024-05-13T20:16:02.169573 #242627] INFO -- : make[2]: Leaving directory '/tmp/ruby/build/trunk/ext/io/console' I, [2024-05-13T20:16:02.169978 #242627] INFO -- : make[2]: Leaving directory '/tmp/ruby/build/trunk/ext/monitor' I, [2024-05-13T20:16:02.169998 #242627] INFO -- : make[2]: Leaving directory '/tmp/ruby/build/trunk/ext/digest' I, [2024-05-13T20:16:02.170133 #242627] INFO -- : make[2]: Leaving directory '/tmp/ruby/build/trunk/ext/date' I, [2024-05-13T20:16:02.170188 #242627] INFO -- : make[2]: Entering directory '/tmp/ruby/build/trunk/ext/rubyvm' I, [2024-05-13T20:16:02.170212 #242627] INFO -- : make[2]: Entering directory '/tmp/ruby/build/trunk/ext/objspace' I, [2024-05-13T20:16:02.170664 #242627] INFO -- : make[2]: Leaving directory '/tmp/ruby/build/trunk/ext/pathname' I, [2024-05-13T20:16:02.170744 #242627] INFO -- : make[2]: Entering directory '/tmp/ruby/build/trunk/ext/psych' I, [2024-05-13T20:16:02.170837 #242627] INFO -- : make[2]: Leaving directory '/tmp/ruby/build/trunk/ext/json' I, [2024-05-13T20:16:02.171717 #242627] INFO -- : make[2]: Leaving directory '/tmp/ruby/build/trunk/ext/rubyvm' I, [2024-05-13T20:16:02.172338 #242627] INFO -- : make[2]: Entering directory '/tmp/ruby/build/trunk/.bundle/gems/debug-1.9.2/ext/debug' I, [2024-05-13T20:16:02.172355 #242627] INFO -- : make[2]: Entering directory '/tmp/ruby/build/trunk/.bundle/gems/nkf-0.2.0/ext/nkf' I, [2024-05-13T20:16:02.172368 #242627] INFO -- : make[2]: Entering directory '/tmp/ruby/build/trunk/.bundle/gems/bigdecimal-3.1.8/ext/bigdecimal' I, [2024-05-13T20:16:02.172381 #242627] INFO -- : make[2]: Entering directory '/tmp/ruby/build/trunk/.bundle/gems/racc-1.7.3/ext/racc/cparse' I, [2024-05-13T20:16:02.172905 #242627] INFO -- : make[2]: Entering directory '/tmp/ruby/build/trunk/ext/ripper' I, [2024-05-13T20:16:02.173529 #242627] INFO -- : make[2]: Leaving directory '/tmp/ruby/build/trunk/ext/objspace' I, [2024-05-13T20:16:02.173612 #242627] INFO -- : make[2]: Leaving directory '/tmp/ruby/build/trunk/ext/pty' I, [2024-05-13T20:16:02.174161 #242627] INFO -- : make[2]: Entering directory '/tmp/ruby/build/trunk/.bundle/gems/syslog-0.1.2/ext/syslog' I, [2024-05-13T20:16:02.174673 #242627] INFO -- : make[2]: Entering directory '/tmp/ruby/build/trunk/.bundle/gems/rbs-3.4.4/ext/rbs_extension' I, [2024-05-13T20:16:02.175979 #242627] INFO -- : make[2]: Leaving directory '/tmp/ruby/build/trunk/ext/fiddle' I, [2024-05-13T20:16:02.178626 #242627] INFO -- : make[2]: Leaving directory '/tmp/ruby/build/trunk/ext/ripper' I, [2024-05-13T20:16:02.178899 #242627] INFO -- : make[2]: Entering directory '/tmp/ruby/build/trunk/ext/socket' I, [2024-05-13T20:16:02.179622 #242627] INFO -- : make[2]: Entering directory '/tmp/ruby/build/trunk/ext/digest/sha2' I, [2024-05-13T20:16:02.180228 #242627] INFO -- : make[2]: Entering directory '/tmp/ruby/build/trunk/ext/openssl' I, [2024-05-13T20:16:02.181802 #242627] INFO -- : make[2]: Leaving directory '/tmp/ruby/build/trunk/ext/digest/sha2' I, [2024-05-13T20:16:02.183783 #242627] INFO -- : make[2]: Leaving directory '/tmp/ruby/build/trunk/ext/psych' I, [2024-05-13T20:16:02.184814 #242627] INFO -- : make[2]: Leaving directory '/tmp/ruby/build/trunk/ext/socket' I, [2024-05-13T20:16:02.191340 #242627] INFO -- : make[2]: Leaving directory '/tmp/ruby/build/trunk/ext/openssl' I, [2024-05-13T20:16:02.195477 #242627] INFO -- : make[2]: Leaving directory '/tmp/ruby/build/trunk/.bundle/gems/bigdecimal-3.1.8/ext/bigdecimal' I, [2024-05-13T20:16:02.195882 #242627] INFO -- : make[2]: Leaving directory '/tmp/ruby/build/trunk/.bundle/gems/debug-1.9.2/ext/debug' I, [2024-05-13T20:16:02.197646 #242627] INFO -- : make[2]: Leaving directory '/tmp/ruby/build/trunk/.bundle/gems/nkf-0.2.0/ext/nkf' I, [2024-05-13T20:16:02.199710 #242627] INFO -- : make[2]: Leaving directory '/tmp/ruby/build/trunk/.bundle/gems/racc-1.7.3/ext/racc/cparse' I, [2024-05-13T20:16:02.204587 #242627] INFO -- : make[2]: Leaving directory '/tmp/ruby/build/trunk/.bundle/gems/rbs-3.4.4/ext/rbs_extension' I, [2024-05-13T20:16:02.207673 #242627] INFO -- : make[2]: Leaving directory '/tmp/ruby/build/trunk/.bundle/gems/syslog-0.1.2/ext/syslog' I, [2024-05-13T20:16:02.232917 #242627] INFO -- : make[2]: Entering directory '/tmp/ruby/build/trunk' I, [2024-05-13T20:16:02.306258 #242627] INFO -- : make[2]: 'ruby' is up to date. I, [2024-05-13T20:16:02.306295 #242627] INFO -- : make[2]: Leaving directory '/tmp/ruby/build/trunk' I, [2024-05-13T20:16:02.306820 #242627] INFO -- : make[1]: Leaving directory '/tmp/ruby/build/trunk' I, [2024-05-13T20:16:02.310662 #242627] INFO -- : make[1]: Entering directory '/tmp/ruby/build/trunk' I, [2024-05-13T20:16:02.310683 #242627] INFO -- : make[1]: Nothing to be done for 'note'. I, [2024-05-13T20:16:02.310689 #242627] INFO -- : make[1]: Leaving directory '/tmp/ruby/build/trunk' I, [2024-05-13T20:16:02.310991 #242627] INFO -- : ./miniruby -I/tmp/ruby/src/trunk/lib -I. -I.ext/common /tmp/ruby/src/trunk/tool/runruby.rb --extout=.ext -- --disable-gems -r./x86_64-linux-fake /tmp/ruby/src/trunk/tool/rbinstall.rb --make="make" --dest-dir="" --extout=".ext" --ext-build-dir="./ext" --mflags="-j20 --jobserver-auth=4,5" --make-flags=" -j20 --jobserver-auth=4,5" --data-mode=0644 --prog-mode=0755 --installed-list .installed.list --mantype="doc" --gnumake --install=all --exclude=doc I, [2024-05-13T20:16:02.404640 #242627] INFO -- : Installing to I, [2024-05-13T20:16:02.404700 #242627] INFO -- : installing binary commands: /tmp/ruby/install/trunk/bin I, [2024-05-13T20:16:02.404789 #242627] INFO -- : installing base libraries: /tmp/ruby/install/trunk/lib I, [2024-05-13T20:16:02.411814 #242627] INFO -- : installing arch files: /tmp/ruby/install/trunk/lib/ruby/3.4.0+0/x86_64-linux I, [2024-05-13T20:16:02.411847 #242627] INFO -- : installing pkgconfig data: /tmp/ruby/install/trunk/lib/pkgconfig I, [2024-05-13T20:16:02.411859 #242627] INFO -- : installing extension objects: /tmp/ruby/install/trunk/lib/ruby/3.4.0+0/x86_64-linux I, [2024-05-13T20:16:02.421210 #242627] INFO -- : installing extension objects: /tmp/ruby/install/trunk/lib/ruby/site_ruby/3.4.0+0/x86_64-linux I, [2024-05-13T20:16:02.421235 #242627] INFO -- : installing extension objects: /tmp/ruby/install/trunk/lib/ruby/vendor_ruby/3.4.0+0/x86_64-linux I, [2024-05-13T20:16:02.421242 #242627] INFO -- : installing extension headers: /tmp/ruby/install/trunk/include/ruby-3.4.0+0/x86_64-linux I, [2024-05-13T20:16:02.421388 #242627] INFO -- : installing extension scripts: /tmp/ruby/install/trunk/lib/ruby/3.4.0+0 I, [2024-05-13T20:16:02.425256 #242627] INFO -- : installing extension scripts: /tmp/ruby/install/trunk/lib/ruby/site_ruby/3.4.0+0 I, [2024-05-13T20:16:02.425281 #242627] INFO -- : installing extension scripts: /tmp/ruby/install/trunk/lib/ruby/vendor_ruby/3.4.0+0 I, [2024-05-13T20:16:02.425287 #242627] INFO -- : installing extension headers: /tmp/ruby/install/trunk/include/ruby-3.4.0+0/ruby I, [2024-05-13T20:16:02.425291 #242627] INFO -- : installing command scripts: /tmp/ruby/install/trunk/bin I, [2024-05-13T20:16:02.425297 #242627] INFO -- : installing library scripts: /tmp/ruby/install/trunk/lib/ruby/3.4.0+0 I, [2024-05-13T20:16:02.458705 #242627] INFO -- : installing common headers: /tmp/ruby/install/trunk/include/ruby-3.4.0+0 I, [2024-05-13T20:16:02.464063 #242627] INFO -- : installing manpages: /tmp/ruby/install/trunk/share/man/man1 I, [2024-05-13T20:16:02.464106 #242627] INFO -- : installing default gems from lib: /tmp/ruby/install/trunk/lib/ruby/gems/3.4.0+0 I, [2024-05-13T20:16:02.486389 #242627] INFO -- : benchmark 0.3.0 I, [2024-05-13T20:16:02.493213 #242627] INFO -- : bundler 2.6.0.dev I, [2024-05-13T20:16:02.495309 #242627] INFO -- : cgi 0.4.1 I, [2024-05-13T20:16:02.495882 #242627] INFO -- : delegate 0.3.1 I, [2024-05-13T20:16:02.496348 #242627] INFO -- : did_you_mean 1.6.3 I, [2024-05-13T20:16:02.496799 #242627] INFO -- : english 0.8.0 I, [2024-05-13T20:16:02.497257 #242627] INFO -- : erb 4.0.4 I, [2024-05-13T20:16:02.497951 #242627] INFO -- : error_highlight 0.6.0 I, [2024-05-13T20:16:02.498408 #242627] INFO -- : fileutils 1.7.2 I, [2024-05-13T20:16:02.498866 #242627] INFO -- : find 0.2.0 I, [2024-05-13T20:16:02.499250 #242627] INFO -- : forwardable 1.3.3 I, [2024-05-13T20:16:02.499674 #242627] INFO -- : ipaddr 1.2.6 I, [2024-05-13T20:16:02.500217 #242627] INFO -- : irb 1.13.1 I, [2024-05-13T20:16:02.501639 #242627] INFO -- : logger 1.6.0 I, [2024-05-13T20:16:02.502143 #242627] INFO -- : net-http 0.4.1 I, [2024-05-13T20:16:02.502640 #242627] INFO -- : net-protocol 0.2.2 I, [2024-05-13T20:16:02.503121 #242627] INFO -- : open-uri 0.4.1 I, [2024-05-13T20:16:02.503611 #242627] INFO -- : open3 0.2.1 I, [2024-05-13T20:16:02.504046 #242627] INFO -- : optparse 0.5.0 I, [2024-05-13T20:16:02.504525 #242627] INFO -- : ostruct 0.6.0 I, [2024-05-13T20:16:02.505090 #242627] INFO -- : pp 0.5.0 I, [2024-05-13T20:16:02.505512 #242627] INFO -- : prettyprint 0.2.0 I, [2024-05-13T20:16:02.505969 #242627] INFO -- : prism 0.29.0 I, [2024-05-13T20:16:02.506546 #242627] INFO -- : pstore 0.1.3 I, [2024-05-13T20:16:02.507001 #242627] INFO -- : rdoc 6.6.3.1 I, [2024-05-13T20:16:02.508578 #242627] INFO -- : readline 0.0.4 I, [2024-05-13T20:16:02.509084 #242627] INFO -- : reline 0.5.6 I, [2024-05-13T20:16:02.509602 #242627] INFO -- : resolv 0.4.0 I, [2024-05-13T20:16:02.510067 #242627] INFO -- : ruby2_keywords 0.0.5 I, [2024-05-13T20:16:02.510545 #242627] INFO -- : securerandom 0.3.1 I, [2024-05-13T20:16:02.510929 #242627] INFO -- : set 1.1.0 I, [2024-05-13T20:16:02.511496 #242627] INFO -- : shellwords 0.2.0 I, [2024-05-13T20:16:02.512019 #242627] INFO -- : singleton 0.2.0 I, [2024-05-13T20:16:02.512370 #242627] INFO -- : syntax_suggest 2.0.0 I, [2024-05-13T20:16:02.513156 #242627] INFO -- : tempfile 0.2.1 I, [2024-05-13T20:16:02.513638 #242627] INFO -- : time 0.3.0 I, [2024-05-13T20:16:02.514095 #242627] INFO -- : timeout 0.4.1 I, [2024-05-13T20:16:02.515155 #242627] INFO -- : tmpdir 0.2.0 I, [2024-05-13T20:16:02.515682 #242627] INFO -- : tsort 0.2.0 I, [2024-05-13T20:16:02.516165 #242627] INFO -- : un 0.3.0 I, [2024-05-13T20:16:02.516624 #242627] INFO -- : uri 0.13.0 I, [2024-05-13T20:16:02.517123 #242627] INFO -- : weakref 0.1.3 I, [2024-05-13T20:16:02.517596 #242627] INFO -- : yaml 0.3.0 I, [2024-05-13T20:16:02.517864 #242627] INFO -- : installing default gems from ext: /tmp/ruby/install/trunk/lib/ruby/gems/3.4.0+0 I, [2024-05-13T20:16:02.524234 #242627] INFO -- : date 3.3.4 I, [2024-05-13T20:16:02.524829 #242627] INFO -- : digest 3.1.1 I, [2024-05-13T20:16:02.525291 #242627] INFO -- : etc 1.4.3 I, [2024-05-13T20:16:02.525788 #242627] INFO -- : fcntl 1.1.0 I, [2024-05-13T20:16:02.526275 #242627] INFO -- : fiddle 1.1.3 I, [2024-05-13T20:16:02.526742 #242627] INFO -- : io-console 0.7.2 I, [2024-05-13T20:16:02.527349 #242627] INFO -- : io-nonblock 0.3.0 I, [2024-05-13T20:16:02.527808 #242627] INFO -- : io-wait 0.3.1 I, [2024-05-13T20:16:02.528376 #242627] INFO -- : json 2.7.2 I, [2024-05-13T20:16:02.529246 #242627] INFO -- : openssl 3.2.0 I, [2024-05-13T20:16:02.529946 #242627] INFO -- : pathname 0.3.0 I, [2024-05-13T20:16:02.530449 #242627] INFO -- : psych 5.1.2 I, [2024-05-13T20:16:02.531006 #242627] INFO -- : stringio 3.1.1 I, [2024-05-13T20:16:02.531516 #242627] INFO -- : strscan 3.1.1 I, [2024-05-13T20:16:02.531998 #242627] INFO -- : zlib 3.1.0 I, [2024-05-13T20:16:02.532355 #242627] INFO -- : installing bundled gems: /tmp/ruby/install/trunk/lib/ruby/gems/3.4.0+0 I, [2024-05-13T20:16:02.532652 #242627] INFO -- : minitest 5.22.3 I, [2024-05-13T20:16:02.540051 #242627] INFO -- : rake 13.2.1 I, [2024-05-13T20:16:02.543321 #242627] INFO -- : test-unit 3.6.2 I, [2024-05-13T20:16:02.547679 #242627] INFO -- : rexml 3.2.6 I, [2024-05-13T20:16:02.551010 #242627] INFO -- : rss 0.3.0 I, [2024-05-13T20:16:02.554007 #242627] INFO -- : net-ftp 0.3.4 I, [2024-05-13T20:16:02.555471 #242627] INFO -- : net-imap 0.4.11 I, [2024-05-13T20:16:02.558327 #242627] INFO -- : net-pop 0.1.2 I, [2024-05-13T20:16:02.559232 #242627] INFO -- : net-smtp 0.5.0 I, [2024-05-13T20:16:02.560401 #242627] INFO -- : matrix 0.4.2 I, [2024-05-13T20:16:02.563807 #242627] INFO -- : prime 0.1.2 I, [2024-05-13T20:16:02.569015 #242627] INFO -- : rbs 3.4.4 I, [2024-05-13T20:16:02.591220 #242627] INFO -- : typeprof 0.21.11 I, [2024-05-13T20:16:02.594229 #242627] INFO -- : debug 1.9.2 I, [2024-05-13T20:16:02.596904 #242627] INFO -- : racc 1.7.3 I, [2024-05-13T20:16:02.599314 #242627] INFO -- : mutex_m 0.2.0 I, [2024-05-13T20:16:02.600679 #242627] INFO -- : getoptlong 0.2.1 I, [2024-05-13T20:16:02.601932 #242627] INFO -- : base64 0.2.0 I, [2024-05-13T20:16:02.602936 #242627] INFO -- : bigdecimal 3.1.8 I, [2024-05-13T20:16:02.604996 #242627] INFO -- : observer 0.1.2 I, [2024-05-13T20:16:02.606083 #242627] INFO -- : abbrev 0.1.2 I, [2024-05-13T20:16:02.607494 #242627] INFO -- : resolv-replace 0.1.1 I, [2024-05-13T20:16:02.608779 #242627] INFO -- : rinda 0.2.0 I, [2024-05-13T20:16:02.610167 #242627] INFO -- : drb 2.2.1 I, [2024-05-13T20:16:02.611613 #242627] INFO -- : nkf 0.2.0 I, [2024-05-13T20:16:02.613999 #242627] INFO -- : syslog 0.1.2 I, [2024-05-13T20:16:02.615514 #242627] INFO -- : csv 3.3.0 I, [2024-05-13T20:16:02.617708 #242627] INFO -- : installing bundled gem cache: /tmp/ruby/install/trunk/lib/ruby/gems/3.4.0+0/cache I, [2024-05-13T20:16:02.619062 #242627] INFO -- : skipped bundled gems: I, [2024-05-13T20:16:02.619083 #242627] INFO -- : power_assert-2.0.4dev.gem not found in bundled_gems I, [2024-05-13T20:16:02.622221 #242627] INFO -- : $$$[end] "make install -j20" exit with 0. I, [2024-05-13T20:16:02.622416 #242627] INFO -- : $$$[beg] make yes-btest TESTOPTS='-q -j20' I, [2024-05-13T20:16:07.889221 #242627] INFO -- : PASS all 1936 tests E, [2024-05-13T20:16:07.894329 #242627] ERROR -- : I, [2024-05-13T20:16:07.894670 #242627] INFO -- : $$$[end] "make yes-btest TESTOPTS='-q -j20'" exit with 0. I, [2024-05-13T20:16:07.894751 #242627] INFO -- : $$$[beg] make yes-test-basic TESTS='-j20' I, [2024-05-13T20:16:07.954992 #242627] INFO -- : BASERUBY = /usr/bin/ruby --disable=gems I, [2024-05-13T20:16:07.955043 #242627] INFO -- : CC = gcc I, [2024-05-13T20:16:07.955059 #242627] INFO -- : LD = ld I, [2024-05-13T20:16:07.955074 #242627] INFO -- : LDSHARED = gcc -shared I, [2024-05-13T20:16:07.955088 #242627] INFO -- : CFLAGS = -O3 -fno-fast-math -ggdb3 -Wall -Wextra -Wdeprecated-declarations -Wdiv-by-zero -Wduplicated-cond -Wimplicit-function-declaration -Wimplicit-int -Wpointer-arith -Wwrite-strings -Wold-style-definition -Wimplicit-fallthrough=0 -Wmissing-noreturn -Wno-cast-function-type -Wno-constant-logical-operand -Wno-long-long -Wno-missing-field-initializers -Wno-overlength-strings -Wno-packed-bitfield-compat -Wno-parentheses-equality -Wno-self-assign -Wno-tautological-compare -Wno-unused-parameter -Wno-unused-value -Wsuggest-attribute=format -Wsuggest-attribute=noreturn -Wunused-variable -Wmisleading-indentation -Wundef -fPIC I, [2024-05-13T20:16:07.955107 #242627] INFO -- : XCFLAGS = -U_FORTIFY_SOURCE -D_FORTIFY_SOURCE=2 -fstack-protector-strong -fno-strict-overflow -fvisibility=hidden -fexcess-precision=standard -DRUBY_EXPORT -I. -I.ext/include/x86_64-linux -I/tmp/ruby/src/trunk/include -I/tmp/ruby/src/trunk -I/tmp/ruby/src/trunk/prism -I/tmp/ruby/src/trunk/enc/unicode/15.0.0 I, [2024-05-13T20:16:07.955121 #242627] INFO -- : CPPFLAGS = I, [2024-05-13T20:16:07.955135 #242627] INFO -- : DLDFLAGS = -Wl,--compress-debug-sections=zlib -Wl,-soname,libruby.so.3.4 -fstack-protector-strong I, [2024-05-13T20:16:07.955150 #242627] INFO -- : SOLIBS = -lz -lrt -lrt -lgmp -ldl -lcrypt -lm -lpthread I, [2024-05-13T20:16:07.955163 #242627] INFO -- : LANG = en_US.UTF-8 I, [2024-05-13T20:16:07.955176 #242627] INFO -- : LC_ALL = I, [2024-05-13T20:16:07.955190 #242627] INFO -- : LC_CTYPE = I, [2024-05-13T20:16:07.955203 #242627] INFO -- : MFLAGS = I, [2024-05-13T20:16:07.955215 #242627] INFO -- : RUSTC = no I, [2024-05-13T20:16:07.955228 #242627] INFO -- : YJIT_RUSTC_ARGS = --crate-name=yjit --crate-type=staticlib --edition=2021 -g -C lto=thin -C opt-level=3 -C overflow-checks=on '--out-dir=/tmp/ruby/build/trunk/yjit/target/release/' /tmp/ruby/src/trunk/yjit/src/lib.rs I, [2024-05-13T20:16:07.955513 #242627] INFO -- : gcc (Ubuntu 11.4.0-1ubuntu1~22.04) 11.4.0 I, [2024-05-13T20:16:07.955529 #242627] INFO -- : Copyright (C) 2021 Free Software Foundation, Inc. I, [2024-05-13T20:16:07.955561 #242627] INFO -- : This is free software; see the source for copying conditions. There is NO I, [2024-05-13T20:16:07.955583 #242627] INFO -- : warranty; not even for MERCHANTABILITY or FITNESS FOR A PARTICULAR PURPOSE. I, [2024-05-13T20:16:07.955596 #242627] INFO -- : I, [2024-05-13T20:16:08.062229 #242627] INFO -- : Checking leaked global symbols...none I, [2024-05-13T20:16:08.102397 #242627] INFO -- : /tmp/ruby/src/trunk/basictest/test.rb:assignment ....................................................................................................................................................................................................................................................................................................................................................................................OK 372 I, [2024-05-13T20:16:08.102483 #242627] INFO -- : /tmp/ruby/src/trunk/basictest/test.rb:condition ..OK 2 I, [2024-05-13T20:16:08.102499 #242627] INFO -- : /tmp/ruby/src/trunk/basictest/test.rb:if/unless ...OK 3 I, [2024-05-13T20:16:08.102513 #242627] INFO -- : /tmp/ruby/src/trunk/basictest/test.rb:case .....OK 5 I, [2024-05-13T20:16:08.102653 #242627] INFO -- : /tmp/ruby/src/trunk/basictest/test.rb:while/until ........OK 8 I, [2024-05-13T20:16:08.102701 #242627] INFO -- : /tmp/ruby/src/trunk/basictest/test.rb:exception ..........OK 10 I, [2024-05-13T20:16:08.102968 #242627] INFO -- : /tmp/ruby/src/trunk/basictest/test.rb:array .......................................OK 39 I, [2024-05-13T20:16:08.103067 #242627] INFO -- : /tmp/ruby/src/trunk/basictest/test.rb:hash ...........................OK 27 I, [2024-05-13T20:16:08.103793 #242627] INFO -- : /tmp/ruby/src/trunk/basictest/test.rb:iterator ...........................................................................................................OK 107 I, [2024-05-13T20:16:08.104070 #242627] INFO -- : /tmp/ruby/src/trunk/basictest/test.rb:float ................................................................................OK 80 I, [2024-05-13T20:16:08.105065 #242627] INFO -- : /tmp/ruby/src/trunk/basictest/test.rb:bignum ...............................OK 31 I, [2024-05-13T20:16:08.105825 #242627] INFO -- : /tmp/ruby/src/trunk/basictest/test.rb:string & char ..............................................................OK 62 I, [2024-05-13T20:16:08.105857 #242627] INFO -- : /tmp/ruby/src/trunk/basictest/test.rb:assignment ..........OK 10 I, [2024-05-13T20:16:08.105884 #242627] INFO -- : /tmp/ruby/src/trunk/basictest/test.rb:call ......OK 6 I, [2024-05-13T20:16:08.105936 #242627] INFO -- : /tmp/ruby/src/trunk/basictest/test.rb:proc .........OK 9 I, [2024-05-13T20:16:08.206636 #242627] INFO -- : /tmp/ruby/src/trunk/basictest/test.rb:signal ..OK 2 I, [2024-05-13T20:16:08.209928 #242627] INFO -- : /tmp/ruby/src/trunk/basictest/test.rb:eval ...........................OK 27 I, [2024-05-13T20:16:08.316821 #242627] INFO -- : /tmp/ruby/src/trunk/basictest/test.rb:system ........OK 8 I, [2024-05-13T20:16:08.316878 #242627] INFO -- : /tmp/ruby/src/trunk/basictest/test.rb:const .....OK 5 I, [2024-05-13T20:16:08.316884 #242627] INFO -- : /tmp/ruby/src/trunk/basictest/test.rb:clone .....OK 5 I, [2024-05-13T20:16:08.316987 #242627] INFO -- : /tmp/ruby/src/trunk/basictest/test.rb:marshal ....OK 4 I, [2024-05-13T20:16:08.317028 #242627] INFO -- : /tmp/ruby/src/trunk/basictest/test.rb:pack ....OK 4 I, [2024-05-13T20:16:08.317042 #242627] INFO -- : /tmp/ruby/src/trunk/basictest/test.rb:math ..OK 2 I, [2024-05-13T20:16:08.317136 #242627] INFO -- : /tmp/ruby/src/trunk/basictest/test.rb:struct ......OK 6 I, [2024-05-13T20:16:08.317268 #242627] INFO -- : /tmp/ruby/src/trunk/basictest/test.rb:variable ............OK 12 I, [2024-05-13T20:16:08.317288 #242627] INFO -- : /tmp/ruby/src/trunk/basictest/test.rb:trace ...OK 3 I, [2024-05-13T20:16:08.317295 #242627] INFO -- : /tmp/ruby/src/trunk/basictest/test.rb:defined? ............OK 12 I, [2024-05-13T20:16:08.317387 #242627] INFO -- : /tmp/ruby/src/trunk/basictest/test.rb:alias ......OK 6 I, [2024-05-13T20:16:08.317697 #242627] INFO -- : /tmp/ruby/src/trunk/basictest/test.rb:path .......................OK 23 I, [2024-05-13T20:16:08.354153 #242627] INFO -- : /tmp/ruby/src/trunk/basictest/test.rb:gc ....OK 4 I, [2024-05-13T20:16:08.356616 #242627] INFO -- : I, [2024-05-13T20:16:08.356661 #242627] INFO -- : test succeeded I, [2024-05-13T20:16:08.358288 #242627] INFO -- : $$$[end] "make yes-test-basic TESTS='-j20'" exit with 0. I, [2024-05-13T20:16:08.358371 #242627] INFO -- : $$$[beg] make yes-test-all TESTOPTS='--stderr-on-failure' TESTS='-j20' I, [2024-05-13T20:16:08.444319 #242627] INFO -- : BASERUBY = /usr/bin/ruby --disable=gems I, [2024-05-13T20:16:08.444367 #242627] INFO -- : CC = gcc I, [2024-05-13T20:16:08.444374 #242627] INFO -- : LD = ld I, [2024-05-13T20:16:08.444378 #242627] INFO -- : LDSHARED = gcc -shared I, [2024-05-13T20:16:08.444386 #242627] INFO -- : CFLAGS = -O3 -fno-fast-math -ggdb3 -Wall -Wextra -Wdeprecated-declarations -Wdiv-by-zero -Wduplicated-cond -Wimplicit-function-declaration -Wimplicit-int -Wpointer-arith -Wwrite-strings -Wold-style-definition -Wimplicit-fallthrough=0 -Wmissing-noreturn -Wno-cast-function-type -Wno-constant-logical-operand -Wno-long-long -Wno-missing-field-initializers -Wno-overlength-strings -Wno-packed-bitfield-compat -Wno-parentheses-equality -Wno-self-assign -Wno-tautological-compare -Wno-unused-parameter -Wno-unused-value -Wsuggest-attribute=format -Wsuggest-attribute=noreturn -Wunused-variable -Wmisleading-indentation -Wundef -fPIC I, [2024-05-13T20:16:08.444391 #242627] INFO -- : XCFLAGS = -U_FORTIFY_SOURCE -D_FORTIFY_SOURCE=2 -fstack-protector-strong -fno-strict-overflow -fvisibility=hidden -fexcess-precision=standard -DRUBY_EXPORT -I. -I.ext/include/x86_64-linux -I/tmp/ruby/src/trunk/include -I/tmp/ruby/src/trunk -I/tmp/ruby/src/trunk/prism -I/tmp/ruby/src/trunk/enc/unicode/15.0.0 I, [2024-05-13T20:16:08.444395 #242627] INFO -- : CPPFLAGS = I, [2024-05-13T20:16:08.444399 #242627] INFO -- : DLDFLAGS = -Wl,--compress-debug-sections=zlib -Wl,-soname,libruby.so.3.4 -fstack-protector-strong I, [2024-05-13T20:16:08.444403 #242627] INFO -- : SOLIBS = -lz -lrt -lrt -lgmp -ldl -lcrypt -lm -lpthread I, [2024-05-13T20:16:08.444407 #242627] INFO -- : LANG = en_US.UTF-8 I, [2024-05-13T20:16:08.444411 #242627] INFO -- : LC_ALL = I, [2024-05-13T20:16:08.444414 #242627] INFO -- : LC_CTYPE = I, [2024-05-13T20:16:08.444418 #242627] INFO -- : MFLAGS = I, [2024-05-13T20:16:08.444422 #242627] INFO -- : RUSTC = no I, [2024-05-13T20:16:08.444426 #242627] INFO -- : YJIT_RUSTC_ARGS = --crate-name=yjit --crate-type=staticlib --edition=2021 -g -C lto=thin -C opt-level=3 -C overflow-checks=on '--out-dir=/tmp/ruby/build/trunk/yjit/target/release/' /tmp/ruby/src/trunk/yjit/src/lib.rs I, [2024-05-13T20:16:08.445018 #242627] INFO -- : gcc (Ubuntu 11.4.0-1ubuntu1~22.04) 11.4.0 I, [2024-05-13T20:16:08.445041 #242627] INFO -- : Copyright (C) 2021 Free Software Foundation, Inc. I, [2024-05-13T20:16:08.445048 #242627] INFO -- : This is free software; see the source for copying conditions. There is NO I, [2024-05-13T20:16:08.445053 #242627] INFO -- : warranty; not even for MERCHANTABILITY or FITNESS FOR A PARTICULAR PURPOSE. I, [2024-05-13T20:16:08.445057 #242627] INFO -- : I, [2024-05-13T20:16:08.446700 #242627] INFO -- : generating enc.mk I, [2024-05-13T20:16:08.563732 #242627] INFO -- : making enc I, [2024-05-13T20:16:08.580770 #242627] INFO -- : make[1]: Entering directory '/tmp/ruby/build/trunk' I, [2024-05-13T20:16:08.580795 #242627] INFO -- : make[1]: Nothing to be done for 'enc'. I, [2024-05-13T20:16:08.580801 #242627] INFO -- : make[1]: Leaving directory '/tmp/ruby/build/trunk' I, [2024-05-13T20:16:08.581508 #242627] INFO -- : making srcs under enc I, [2024-05-13T20:16:08.610936 #242627] INFO -- : make[1]: Entering directory '/tmp/ruby/build/trunk' I, [2024-05-13T20:16:08.610959 #242627] INFO -- : make[1]: Nothing to be done for 'srcs'. I, [2024-05-13T20:16:08.610965 #242627] INFO -- : make[1]: Leaving directory '/tmp/ruby/build/trunk' I, [2024-05-13T20:16:08.611843 #242627] INFO -- : generating transdb.h I, [2024-05-13T20:16:08.708680 #242627] INFO -- : transdb.h unchanged I, [2024-05-13T20:16:08.710060 #242627] INFO -- : making trans I, [2024-05-13T20:16:08.743525 #242627] INFO -- : make[1]: Entering directory '/tmp/ruby/build/trunk' I, [2024-05-13T20:16:08.743554 #242627] INFO -- : make[1]: Nothing to be done for 'trans'. I, [2024-05-13T20:16:08.743560 #242627] INFO -- : make[1]: Leaving directory '/tmp/ruby/build/trunk' I, [2024-05-13T20:16:08.744203 #242627] INFO -- : making encs I, [2024-05-13T20:16:08.782949 #242627] INFO -- : make[1]: Entering directory '/tmp/ruby/build/trunk' I, [2024-05-13T20:16:08.782970 #242627] INFO -- : make[1]: Nothing to be done for 'encs'. I, [2024-05-13T20:16:08.782977 #242627] INFO -- : make[1]: Leaving directory '/tmp/ruby/build/trunk' I, [2024-05-13T20:16:08.784764 #242627] INFO -- : generating makefiles ext/configure-ext.mk I, [2024-05-13T20:16:08.811418 #242627] INFO -- : ext/configure-ext.mk updated I, [2024-05-13T20:16:08.813867 #242627] INFO -- : make[1]: Entering directory '/tmp/ruby/build/trunk' I, [2024-05-13T20:16:10.157386 #242627] INFO -- : make[1]: Leaving directory '/tmp/ruby/build/trunk' I, [2024-05-13T20:16:10.158057 #242627] INFO -- : generating makefile exts.mk I, [2024-05-13T20:16:10.194436 #242627] INFO -- : exts.mk unchanged I, [2024-05-13T20:16:10.198789 #242627] INFO -- : make[1]: Entering directory '/tmp/ruby/build/trunk' I, [2024-05-13T20:16:10.492082 #242627] INFO -- : make[2]: Entering directory '/tmp/ruby/build/trunk/ext/coverage' I, [2024-05-13T20:16:10.496616 #242627] INFO -- : make[2]: Leaving directory '/tmp/ruby/build/trunk/ext/coverage' I, [2024-05-13T20:16:10.502807 #242627] INFO -- : make[2]: Entering directory '/tmp/ruby/build/trunk/ext/date' I, [2024-05-13T20:16:10.507762 #242627] INFO -- : make[2]: Leaving directory '/tmp/ruby/build/trunk/ext/date' I, [2024-05-13T20:16:10.511416 #242627] INFO -- : make[2]: Entering directory '/tmp/ruby/build/trunk/ext/digest' I, [2024-05-13T20:16:10.519965 #242627] INFO -- : make[2]: Leaving directory '/tmp/ruby/build/trunk/ext/digest' I, [2024-05-13T20:16:10.544118 #242627] INFO -- : make[2]: Entering directory '/tmp/ruby/build/trunk/ext/digest/sha2' I, [2024-05-13T20:16:10.548810 #242627] INFO -- : make[2]: Leaving directory '/tmp/ruby/build/trunk/ext/digest/sha2' I, [2024-05-13T20:16:10.568451 #242627] INFO -- : make[2]: Entering directory '/tmp/ruby/build/trunk/ext/fiddle' I, [2024-05-13T20:16:10.579410 #242627] INFO -- : make[2]: Leaving directory '/tmp/ruby/build/trunk/ext/fiddle' I, [2024-05-13T20:16:10.584542 #242627] INFO -- : make[2]: Entering directory '/tmp/ruby/build/trunk/ext/io/console' I, [2024-05-13T20:16:10.588605 #242627] INFO -- : make[2]: Leaving directory '/tmp/ruby/build/trunk/ext/io/console' I, [2024-05-13T20:16:10.601106 #242627] INFO -- : make[2]: Entering directory '/tmp/ruby/build/trunk/ext/json' I, [2024-05-13T20:16:10.611770 #242627] INFO -- : make[2]: Leaving directory '/tmp/ruby/build/trunk/ext/json' I, [2024-05-13T20:16:10.626819 #242627] INFO -- : make[2]: Entering directory '/tmp/ruby/build/trunk/ext/monitor' I, [2024-05-13T20:16:10.630791 #242627] INFO -- : make[2]: Leaving directory '/tmp/ruby/build/trunk/ext/monitor' I, [2024-05-13T20:16:10.637746 #242627] INFO -- : make[2]: Entering directory '/tmp/ruby/build/trunk/ext/objspace' I, [2024-05-13T20:16:10.644214 #242627] INFO -- : make[2]: Leaving directory '/tmp/ruby/build/trunk/ext/objspace' I, [2024-05-13T20:16:10.660786 #242627] INFO -- : make[2]: Entering directory '/tmp/ruby/build/trunk/ext/openssl' I, [2024-05-13T20:16:10.675084 #242627] INFO -- : make[2]: Leaving directory '/tmp/ruby/build/trunk/ext/openssl' I, [2024-05-13T20:16:10.679876 #242627] INFO -- : make[2]: Entering directory '/tmp/ruby/build/trunk/ext/pathname' I, [2024-05-13T20:16:10.683817 #242627] INFO -- : make[2]: Leaving directory '/tmp/ruby/build/trunk/ext/pathname' I, [2024-05-13T20:16:10.690877 #242627] INFO -- : make[2]: Entering directory '/tmp/ruby/build/trunk/ext/psych' I, [2024-05-13T20:16:10.713027 #242627] INFO -- : make[2]: Leaving directory '/tmp/ruby/build/trunk/ext/psych' I, [2024-05-13T20:16:10.717356 #242627] INFO -- : make[2]: Entering directory '/tmp/ruby/build/trunk/ext/pty' I, [2024-05-13T20:16:10.721307 #242627] INFO -- : make[2]: Leaving directory '/tmp/ruby/build/trunk/ext/pty' I, [2024-05-13T20:16:10.736711 #242627] INFO -- : make[2]: Entering directory '/tmp/ruby/build/trunk/ext/ripper' I, [2024-05-13T20:16:10.744741 #242627] INFO -- : make[2]: Leaving directory '/tmp/ruby/build/trunk/ext/ripper' I, [2024-05-13T20:16:10.747135 #242627] INFO -- : make[2]: Entering directory '/tmp/ruby/build/trunk/ext/rubyvm' I, [2024-05-13T20:16:10.750330 #242627] INFO -- : make[2]: Leaving directory '/tmp/ruby/build/trunk/ext/rubyvm' I, [2024-05-13T20:16:10.761876 #242627] INFO -- : make[2]: Entering directory '/tmp/ruby/build/trunk/ext/socket' I, [2024-05-13T20:16:10.769058 #242627] INFO -- : make[2]: Leaving directory '/tmp/ruby/build/trunk/ext/socket' I, [2024-05-13T20:16:10.786845 #242627] INFO -- : make[2]: Entering directory '/tmp/ruby/build/trunk/.bundle/gems/bigdecimal-3.1.8/ext/bigdecimal' I, [2024-05-13T20:16:10.816610 #242627] INFO -- : make[2]: Leaving directory '/tmp/ruby/build/trunk/.bundle/gems/bigdecimal-3.1.8/ext/bigdecimal' I, [2024-05-13T20:16:10.818874 #242627] INFO -- : make[2]: Entering directory '/tmp/ruby/build/trunk/.bundle/gems/debug-1.9.2/ext/debug' I, [2024-05-13T20:16:10.845277 #242627] INFO -- : make[2]: Leaving directory '/tmp/ruby/build/trunk/.bundle/gems/debug-1.9.2/ext/debug' I, [2024-05-13T20:16:10.847244 #242627] INFO -- : make[2]: Entering directory '/tmp/ruby/build/trunk/.bundle/gems/nkf-0.2.0/ext/nkf' I, [2024-05-13T20:16:10.868323 #242627] INFO -- : make[2]: Leaving directory '/tmp/ruby/build/trunk/.bundle/gems/nkf-0.2.0/ext/nkf' I, [2024-05-13T20:16:10.870207 #242627] INFO -- : make[2]: Entering directory '/tmp/ruby/build/trunk/.bundle/gems/racc-1.7.3/ext/racc/cparse' I, [2024-05-13T20:16:10.891900 #242627] INFO -- : make[2]: Leaving directory '/tmp/ruby/build/trunk/.bundle/gems/racc-1.7.3/ext/racc/cparse' I, [2024-05-13T20:16:10.894070 #242627] INFO -- : make[2]: Entering directory '/tmp/ruby/build/trunk/.bundle/gems/rbs-3.4.4/ext/rbs_extension' I, [2024-05-13T20:16:10.916208 #242627] INFO -- : make[2]: Leaving directory '/tmp/ruby/build/trunk/.bundle/gems/rbs-3.4.4/ext/rbs_extension' I, [2024-05-13T20:16:10.918158 #242627] INFO -- : make[2]: Entering directory '/tmp/ruby/build/trunk/.bundle/gems/syslog-0.1.2/ext/syslog' I, [2024-05-13T20:16:10.939342 #242627] INFO -- : make[2]: Leaving directory '/tmp/ruby/build/trunk/.bundle/gems/syslog-0.1.2/ext/syslog' I, [2024-05-13T20:16:10.967893 #242627] INFO -- : make[2]: Entering directory '/tmp/ruby/build/trunk' I, [2024-05-13T20:16:11.036369 #242627] INFO -- : make[2]: 'ruby' is up to date. I, [2024-05-13T20:16:11.036407 #242627] INFO -- : make[2]: Leaving directory '/tmp/ruby/build/trunk' I, [2024-05-13T20:16:11.036866 #242627] INFO -- : make[1]: Leaving directory '/tmp/ruby/build/trunk' I, [2024-05-13T20:16:11.040399 #242627] INFO -- : make[1]: Entering directory '/tmp/ruby/build/trunk' I, [2024-05-13T20:16:11.040419 #242627] INFO -- : make[1]: Nothing to be done for 'note'. I, [2024-05-13T20:16:11.040425 #242627] INFO -- : make[1]: Leaving directory '/tmp/ruby/build/trunk' I, [2024-05-13T20:16:11.121628 #242627] INFO -- : Run options: I, [2024-05-13T20:16:11.121672 #242627] INFO -- : --seed=58831 I, [2024-05-13T20:16:11.121681 #242627] INFO -- : "--ruby=./miniruby -I/tmp/ruby/src/trunk/lib -I. -I.ext/common /tmp/ruby/src/trunk/tool/runruby.rb --extout=.ext -- --disable-gems" I, [2024-05-13T20:16:11.121685 #242627] INFO -- : --excludes-dir=/tmp/ruby/src/trunk/test/.excludes I, [2024-05-13T20:16:11.121689 #242627] INFO -- : --name=!/memory_leak/ I, [2024-05-13T20:16:11.121693 #242627] INFO -- : --stderr-on-failure I, [2024-05-13T20:16:11.121696 #242627] INFO -- : -j20 I, [2024-05-13T20:16:11.121700 #242627] INFO -- : I, [2024-05-13T20:16:11.121704 #242627] INFO -- : # Running tests: I, [2024-05-13T20:16:11.121707 #242627] INFO -- : I, [2024-05-13T20:16:11.270748 #242627] INFO -- : [ 1/885] 283999=test_gem_stream_ui I, [2024-05-13T20:16:11.270806 #242627] INFO -- : [ 2/885] 283983=test_rdoc_generator_ri I, [2024-05-13T20:16:11.270824 #242627] INFO -- : [ 3/885] 283985=test_extlibs I, [2024-05-13T20:16:11.270834 #242627] INFO -- : [ 4/885] 283984=test_require_lib I, [2024-05-13T20:16:11.270840 #242627] INFO -- : [ 5/885] 283986=test_gem_install_update_options I, [2024-05-13T20:16:11.273050 #242627] INFO -- : [ 6/885] 283987=parse_test I, [2024-05-13T20:16:11.273749 #242627] INFO -- : [ 7/885] 283997=test_ractor I, [2024-05-13T20:16:11.273781 #242627] INFO -- : [ 8/885] 284000=test_severity I, [2024-05-13T20:16:11.273788 #242627] INFO -- : [ 9/885] 284001=test_thread I, [2024-05-13T20:16:11.273795 #242627] INFO -- : [ 10/885] 283996=test_socket I, [2024-05-13T20:16:11.280207 #242627] INFO -- : [ 11/885] 283998=test_objectspace I, [2024-05-13T20:16:11.285974 #242627] INFO -- : [ 12/885] 284000=test_rdoc_markup_to_table_of_contents I, [2024-05-13T20:16:11.293110 #242627] INFO -- : [ 13/885] 283997=test_str2big I, [2024-05-13T20:16:11.294249 #242627] INFO -- : [ 14/885] 283997=test_dot_dot I, [2024-05-13T20:16:11.296337 #242627] INFO -- : [ 15/885] 283995=test_c_struct_builder I, [2024-05-13T20:16:11.298080 #242627] INFO -- : [ 16/885] 283982=test_literal I, [2024-05-13T20:16:11.304110 #242627] INFO -- : [ 17/885] 283997=test_gem_request_connection_pools I, [2024-05-13T20:16:11.304367 #242627] INFO -- : [ 18/885] 283992=test_grapheme_breaks I, [2024-05-13T20:16:11.304464 #242627] INFO -- : [ 19/885] 283989=test_gem_version_option I, [2024-05-13T20:16:11.304566 #242627] INFO -- : [ 20/885] 283990=test_cclass I, [2024-05-13T20:16:11.304666 #242627] INFO -- : [ 21/885] 283991=test_parser_events I, [2024-05-13T20:16:11.304849 #242627] INFO -- : [ 22/885] 283993=test_reline I, [2024-05-13T20:16:11.308712 #242627] INFO -- : [ 23/885] 283994=test_case I, [2024-05-13T20:16:11.320014 #242627] INFO -- : [ 24/885] 283988=test_pkey I, [2024-05-13T20:16:11.329083 #242627] INFO -- : [ 25/885] 283994=test_rdoc_markup_to_markdown I, [2024-05-13T20:16:11.340065 #242627] INFO -- : [ 26/885] 283992=test_json_tree I, [2024-05-13T20:16:11.348680 #242627] INFO -- : [ 27/885] 283995=test_rdoc_generator_pot_po I, [2024-05-13T20:16:11.357754 #242627] INFO -- : [ 28/885] 283992=test_ansi_with_terminfo I, [2024-05-13T20:16:11.377571 #242627] INFO -- : [ 29/885] 283991=test_ractor I, [2024-05-13T20:16:11.396727 #242627] INFO -- : [ 30/885] 283988=test_m17n_comb I, [2024-05-13T20:16:11.406568 #242627] INFO -- : [ 31/885] 283990=test_memory_view I, [2024-05-13T20:16:11.416395 #242627] INFO -- : [ 32/885] 283992=test_sprintf_comb I, [2024-05-13T20:16:11.436642 #242627] INFO -- : [ 33/885] 283990=test_method_cache I, [2024-05-13T20:16:11.439009 #242627] INFO -- : [ 34/885] 283990=test_gem_request I, [2024-05-13T20:16:11.444028 #242627] INFO -- : [ 35/885] 283983=test_gem_commands_mirror I, [2024-05-13T20:16:11.449190 #242627] INFO -- : [ 36/885] 283991=test_gem_ext_cargo_builder_link_flag_converter I, [2024-05-13T20:16:11.454868 #242627] INFO -- : [ 37/885] 284000=test_gem_text I, [2024-05-13T20:16:11.464186 #242627] INFO -- : [ 38/885] 283994=test_settracefunc I, [2024-05-13T20:16:11.473988 #242627] INFO -- : [ 39/885] 283999=test_enumerator_kw I, [2024-05-13T20:16:11.479582 #242627] INFO -- : [ 40/885] 283999=test_scan_args I, [2024-05-13T20:16:11.488454 #242627] INFO -- : [ 41/885] 283999=test_win32ole I, [2024-05-13T20:16:11.490029 #242627] INFO -- : [ 42/885] 283995=test_generic I, [2024-05-13T20:16:11.493889 #242627] INFO -- : [ 43/885] 283999=test_store I, [2024-05-13T20:16:11.498966 #242627] INFO -- : [ 44/885] 284001=test_case_options I, [2024-05-13T20:16:11.504805 #242627] INFO -- : [ 45/885] 284001=test_gem_dependency_installer I, [2024-05-13T20:16:11.536786 #242627] INFO -- : [ 46/885] 283986=test_scalar I, [2024-05-13T20:16:11.544062 #242627] INFO -- : [ 47/885] 283986=test_gem_commands_info_command I, [2024-05-13T20:16:11.555421 #242627] INFO -- : [ 48/885] 283989=test_rdoc_cross_reference I, [2024-05-13T20:16:11.563298 #242627] INFO -- : [ 49/885] 283995=test_rand I, [2024-05-13T20:16:11.574354 #242627] INFO -- : [ 50/885] 283986=test_gem_package_tar_reader_entry I, [2024-05-13T20:16:11.591783 #242627] INFO -- : [ 51/885] 283993=test_gem_name_tuple I, [2024-05-13T20:16:11.603338 #242627] INFO -- : [ 52/885] 283992=test_bug_reporter I, [2024-05-13T20:16:11.652335 #242627] INFO -- : [ 53/885] 283983=test_exception I, [2024-05-13T20:16:11.655865 #242627] INFO -- : [ 54/885] 283991=test_stream I, [2024-05-13T20:16:11.659718 #242627] INFO -- : [ 55/885] 283999=test_nil2vtempty I, [2024-05-13T20:16:11.660773 #242627] INFO -- : [ 56/885] 283999=test_rdoc_context I, [2024-05-13T20:16:11.679299 #242627] INFO -- : [ 57/885] 283991=test_rdoc_parser_ruby I, [2024-05-13T20:16:11.685017 #242627] INFO -- : [ 58/885] 284000=test_httpresponse I, [2024-05-13T20:16:11.739025 #242627] INFO -- : [ 59/885] 283993=test_open-uri I, [2024-05-13T20:16:11.746771 #242627] INFO -- : [ 60/885] 283986=test_data I, [2024-05-13T20:16:11.752941 #242627] INFO -- : [ 61/885] 283990=index_write_test I, [2024-05-13T20:16:11.757730 #242627] INFO -- : [ 62/885] 283986=test_date_new I, [2024-05-13T20:16:11.767892 #242627] INFO -- : [ 63/885] 283986=test_require I, [2024-05-13T20:16:11.770654 #242627] INFO -- : [ 64/885] 284000=test_date_time I, [2024-05-13T20:16:11.770736 #242627] INFO -- : [ 65/885] 283986=test_rdoc_markup_to_joined_paragraph I, [2024-05-13T20:16:11.788310 #242627] INFO -- : [ 66/885] 283995=test_gem_safe_yaml I, [2024-05-13T20:16:11.798318 #242627] INFO -- : [ 67/885] 284000=test_syntax I, [2024-05-13T20:16:11.819295 #242627] INFO -- : [ 68/885] 283990=test_rdoc_text I, [2024-05-13T20:16:11.944819 #242627] INFO -- : [ 69/885] 283986=test_iso_8859 I, [2024-05-13T20:16:11.972523 #242627] INFO -- : [ 70/885] 283995=test_tcp I, [2024-05-13T20:16:11.994536 #242627] INFO -- : [ 71/885] 283986=test_gem_commands_specification_command I, [2024-05-13T20:16:12.009121 #242627] INFO -- : [ 72/885] 283995=test_enumerator I, [2024-05-13T20:16:12.017809 #242627] INFO -- : [ 73/885] 283982=test_flags I, [2024-05-13T20:16:12.023024 #242627] INFO -- : [ 74/885] 283990=test_inadvertent_creation I, [2024-05-13T20:16:12.051829 #242627] INFO -- : [ 75/885] 283992=test_gem_commands_which_command I, [2024-05-13T20:16:12.125380 #242627] INFO -- : [ 76/885] 283986=test_shift_jis I, [2024-05-13T20:16:12.129895 #242627] INFO -- : [ 77/885] 283986=test_http I, [2024-05-13T20:16:12.153212 #242627] INFO -- : [ 78/885] 283986=test_rdoc_markup_attribute_manager I, [2024-05-13T20:16:12.164286 #242627] INFO -- : [ 79/885] 283990=test_name_error I, [2024-05-13T20:16:12.182453 #242627] INFO -- : [ 80/885] 283986=test_gem_resolver_composed_set I, [2024-05-13T20:16:12.192039 #242627] INFO -- : [ 81/885] 283989=test_safe_load I, [2024-05-13T20:16:12.196884 #242627] INFO -- : [ 82/885] 283986=test_gem_resolver I, [2024-05-13T20:16:12.211724 #242627] INFO -- : [ 83/885] 283998=test_gem_commands_dependency_command I, [2024-05-13T20:16:12.223144 #242627] INFO -- : [ 84/885] 283989=test_gem_source_local I, [2024-05-13T20:16:12.239597 #242627] INFO -- : [ 85/885] 283993=test_gem_security_policy I, [2024-05-13T20:16:12.260308 #242627] INFO -- : [ 86/885] 283991=test_pack I, [2024-05-13T20:16:12.286343 #242627] INFO -- : [ 87/885] 283990=test_last_thread I, [2024-05-13T20:16:12.293323 #242627] INFO -- : [ 88/885] 283992=test_process I, [2024-05-13T20:16:12.406044 #242627] INFO -- : [ 89/885] 283994=test_gc I, [2024-05-13T20:16:12.460992 #242627] INFO -- : [ 90/885] 283998=test_x509cert I, [2024-05-13T20:16:12.476320 #242627] INFO -- : [ 91/885] 283986=test_err_in_callback I, [2024-05-13T20:16:12.479222 #242627] INFO -- : [ 92/885] 283986=test_gem_resolver_lock_specification I, [2024-05-13T20:16:12.479718 #242627] INFO -- : [ 93/885] 283991=test_logdevice I, [2024-05-13T20:16:12.485382 #242627] INFO -- : [ 94/885] 283993=test_arity I, [2024-05-13T20:16:12.487230 #242627] INFO -- : [ 95/885] 283993=test_gem_ext_rake_builder I, [2024-05-13T20:16:12.492513 #242627] INFO -- : [ 96/885] 283989=test_switch_hitter I, [2024-05-13T20:16:12.509744 #242627] INFO -- : [ 97/885] 283989=test_flush I, [2024-05-13T20:16:12.517624 #242627] INFO -- : [ 98/885] 283986=test_singleton I, [2024-05-13T20:16:12.517798 #242627] INFO -- : [ 99/885] 283989=test_io_console I, [2024-05-13T20:16:12.520397 #242627] INFO -- : [100/885] 283999=test_c_union_entity I, [2024-05-13T20:16:12.523595 #242627] INFO -- : [101/885] 283986=test_rdoc_normal_module I, [2024-05-13T20:16:12.555526 #242627] INFO -- : [102/885] 283997=test_rdoc_markdown_test I, [2024-05-13T20:16:12.555768 #242627] INFO -- : [103/885] 283999=test_logperiod I, [2024-05-13T20:16:12.564797 #242627] INFO -- : [104/885] 283999=test_securerandom I, [2024-05-13T20:16:12.588519 #242627] INFO -- : [105/885] 283999=test_thread_fd_close I, [2024-05-13T20:16:12.591102 #242627] INFO -- : [106/885] 283999=test_passing_block I, [2024-05-13T20:16:12.595703 #242627] INFO -- : [107/885] 283999=test_hash_create I, [2024-05-13T20:16:12.598108 #242627] INFO -- : [108/885] 283999=test_stringchar I, [2024-05-13T20:16:12.607148 #242627] INFO -- : [109/885] 283986=test_uncorrectable_name_check I, [2024-05-13T20:16:12.614729 #242627] INFO -- : [110/885] 283986=newline_test I, [2024-05-13T20:16:12.673984 #242627] INFO -- : [111/885] 283999=test_config I, [2024-05-13T20:16:12.694860 #242627] INFO -- : [112/885] 283996=test_optarg I, [2024-05-13T20:16:12.726641 #242627] INFO -- : [113/885] 283998=test_yaml_special_cases I, [2024-05-13T20:16:12.731265 #242627] INFO -- : [114/885] 283999=test_gem_source_list I, [2024-05-13T20:16:12.738301 #242627] INFO -- : [115/885] 283998=test_address_resolve I, [2024-05-13T20:16:12.761468 #242627] INFO -- : [116/885] 283998=test_rdoc_token_stream I, [2024-05-13T20:16:12.773519 #242627] INFO -- : [117/885] 283999=test_zsh_completion I, [2024-05-13T20:16:12.776210 #242627] INFO -- : [118/885] 283986=test_exception I, [2024-05-13T20:16:12.779100 #242627] INFO -- : [119/885] 283999=test_iter_break I, [2024-05-13T20:16:12.779436 #242627] INFO -- : [120/885] 283999=test_macro I, [2024-05-13T20:16:12.783184 #242627] INFO -- : [121/885] 283999=test_frozen I, [2024-05-13T20:16:12.783473 #242627] INFO -- : [122/885] 283986=test_gem_ext_configure_builder I, [2024-05-13T20:16:12.787757 #242627] INFO -- : [123/885] 283999=test_pp I, [2024-05-13T20:16:12.814601 #242627] INFO -- : [124/885] 283999=test_verbose I, [2024-05-13T20:16:12.826467 #242627] INFO -- : [125/885] 283996=test_rdoc_single_class I, [2024-05-13T20:16:12.832559 #242627] INFO -- : [126/885] 283999=test_nil I, [2024-05-13T20:16:12.834547 #242627] INFO -- : [127/885] 283999=test_num2int I, [2024-05-13T20:16:12.841225 #242627] INFO -- : [128/885] 283986=test_rdoc_tom_doc I, [2024-05-13T20:16:12.842562 #242627] INFO -- : [129/885] 283999=test_hmac I, [2024-05-13T20:16:12.852675 #242627] INFO -- : [130/885] 283999=test_rdoc_markup_to_tt_only I, [2024-05-13T20:16:12.861667 #242627] INFO -- : [131/885] 283986=test_common I, [2024-05-13T20:16:12.888670 #242627] INFO -- : [132/885] 283999=test_gem_spec_fetcher I, [2024-05-13T20:16:12.914932 #242627] INFO -- : [133/885] 283998=test_gem_command I, [2024-05-13T20:16:12.987305 #242627] INFO -- : [134/885] 283998=test_key_actor_vi I, [2024-05-13T20:16:12.994901 #242627] INFO -- : [135/885] 283996=test_bug-3571 I, [2024-05-13T20:16:13.014983 #242627] INFO -- : [136/885] 283996=test_assignment I, [2024-05-13T20:16:13.046376 #242627] INFO -- : [137/885] 283982=test_ifunless I, [2024-05-13T20:16:13.048704 #242627] INFO -- : [138/885] 283982=test_gem_commands_lock_command I, [2024-05-13T20:16:13.070235 #242627] INFO -- : [139/885] 283999=test_numeric I, [2024-05-13T20:16:13.074070 #242627] INFO -- : [140/885] 283986=test_rdoc_markup_paragraph I, [2024-05-13T20:16:13.078232 #242627] INFO -- : [141/885] 283986=test_enc_raise I, [2024-05-13T20:16:13.084580 #242627] INFO -- : [142/885] 283986=test_psych I, [2024-05-13T20:16:13.110820 #242627] INFO -- : [143/885] 283986=!Nothing_to_test I, [2024-05-13T20:16:13.111020 #242627] INFO -- : [144/885] 283986=test_at_exit I, [2024-05-13T20:16:13.138249 #242627] INFO -- : [145/885] 283986=test_command I, [2024-05-13T20:16:13.151002 #242627] INFO -- : [146/885] 283999=test_gem_ext_cargo_builder_unit I, [2024-05-13T20:16:13.155493 #242627] INFO -- : [147/885] 283993=test_gem_rdoc I, [2024-05-13T20:16:13.171769 #242627] INFO -- : [148/885] 283988=test_date I, [2024-05-13T20:16:13.172169 #242627] INFO -- : [149/885] 283999=test_object_create_start I, [2024-05-13T20:16:13.173276 #242627] INFO -- : [150/885] 283999=test_gem_silent_ui I, [2024-05-13T20:16:13.178482 #242627] INFO -- : [151/885] 283985=test_emitter I, [2024-05-13T20:16:13.179425 #242627] INFO -- : [152/885] 283988=test_bug-5832 I, [2024-05-13T20:16:13.182869 #242627] INFO -- : [153/885] 283988=test_files_ext I, [2024-05-13T20:16:13.190643 #242627] INFO -- : [154/885] 283998=test_eval_history I, [2024-05-13T20:16:13.209508 #242627] INFO -- : [155/885] 283999=dispatcher_test I, [2024-05-13T20:16:13.216394 #242627] INFO -- : [156/885] 283985=test_kernel I, [2024-05-13T20:16:13.247329 #242627] INFO -- : [157/885] 283982=test_kdf I, [2024-05-13T20:16:13.256167 #242627] INFO -- : [158/885] 283998=test_gem_doctor I, [2024-05-13T20:16:13.277840 #242627] INFO -- : [159/885] 283999=test_rdoc_i18n_text I, [2024-05-13T20:16:13.284398 #242627] INFO -- : [160/885] 283998=test_io_buffer I, [2024-05-13T20:16:13.289827 #242627] INFO -- : [161/885] 283999=test_key_name_check I, [2024-05-13T20:16:13.297630 #242627] INFO -- : [162/885] 283999=test_defined I, [2024-05-13T20:16:13.300672 #242627] INFO -- : [163/885] 283991=test_backtrace I, [2024-05-13T20:16:13.305333 #242627] INFO -- : [164/885] 283991=test_buffering I, [2024-05-13T20:16:13.313639 #242627] INFO -- : [165/885] 283991=test_svcb_https I, [2024-05-13T20:16:13.337462 #242627] INFO -- : [166/885] 283998=test_gb18030 I, [2024-05-13T20:16:13.341796 #242627] INFO -- : [167/885] 283998=test_gem_uninstaller I, [2024-05-13T20:16:13.342350 #242627] INFO -- : [168/885] 283982=test_rdoc_rdoc I, [2024-05-13T20:16:13.342945 #242627] INFO -- : [169/885] 283991=test_windows_1251 I, [2024-05-13T20:16:13.347337 #242627] INFO -- : [170/885] 283991=test_time I, [2024-05-13T20:16:13.361448 #242627] INFO -- : [171/885] 283993=test_rdoc_markup_attributes I, [2024-05-13T20:16:13.361673 #242627] INFO -- : [172/885] 283990=test_rdoc_markup_to_rdoc I, [2024-05-13T20:16:13.385566 #242627] INFO -- : [173/885] 283999=test_rdoc_rd_inline_parser I, [2024-05-13T20:16:13.398220 #242627] INFO -- : [174/885] 283993=test_default_gems I, [2024-05-13T20:16:13.399631 #242627] INFO -- : [175/885] 283990=test_null I, [2024-05-13T20:16:13.411948 #242627] INFO -- : [176/885] 283988=test_win32ole_type I, [2024-05-13T20:16:13.413419 #242627] INFO -- : [177/885] 283988=test_mul I, [2024-05-13T20:16:13.420744 #242627] INFO -- : [178/885] 283988=test_pkey_ec I, [2024-05-13T20:16:13.427035 #242627] INFO -- : [179/885] 283990=test_trick I, [2024-05-13T20:16:13.439368 #242627] INFO -- : [180/885] 283999=test_thread I, [2024-05-13T20:16:13.449683 #242627] INFO -- : [181/885] 283999=test_pipe I, [2024-05-13T20:16:13.452476 #242627] INFO -- : [182/885] 283993=test_date_parse I, [2024-05-13T20:16:13.460698 #242627] INFO -- : [183/885] 283986=test_depth_first I, [2024-05-13T20:16:13.462911 #242627] INFO -- : [184/885] 283986=test_gem_request_set_lockfile_parser I, [2024-05-13T20:16:13.488239 #242627] INFO -- : [185/885] 283991=test_raise I, [2024-05-13T20:16:13.489317 #242627] INFO -- : [186/885] 283988=test_x509attr I, [2024-05-13T20:16:13.491920 #242627] INFO -- : [187/885] 283991=test_rdoc_store I, [2024-05-13T20:16:13.492627 #242627] INFO -- : [188/885] 283988=test_string I, [2024-05-13T20:16:13.528163 #242627] INFO -- : [189/885] 283983=test_rdoc_stats I, [2024-05-13T20:16:13.532203 #242627] INFO -- : [190/885] 283988=test_pattern_matching I, [2024-05-13T20:16:13.563055 #242627] INFO -- : [191/885] 283993=test_gem_dependency_resolution_error I, [2024-05-13T20:16:13.567961 #242627] INFO -- : [192/885] 283993=test_rdoc_parser I, [2024-05-13T20:16:13.569467 #242627] INFO -- : [193/885] 283988=test_qsort I, [2024-05-13T20:16:13.572007 #242627] INFO -- : [194/885] 283988=test_custom_command I, [2024-05-13T20:16:13.589051 #242627] INFO -- : [195/885] 283999=json_addition_test I, [2024-05-13T20:16:13.594986 #242627] INFO -- : [196/885] 283986=test_gem_resolver_index_set I, [2024-05-13T20:16:13.608228 #242627] INFO -- : [197/885] 283999=test_gem_package_old I, [2024-05-13T20:16:13.612809 #242627] INFO -- : [198/885] 283993=test_gc_compact I, [2024-05-13T20:16:13.615227 #242627] INFO -- : [199/885] 283983=test_proc I, [2024-05-13T20:16:13.631609 #242627] INFO -- : [200/885] 283986=test_string I, [2024-05-13T20:16:13.649363 #242627] INFO -- : [201/885] 283997=test_erb_m17n I, [2024-05-13T20:16:13.656312 #242627] INFO -- : [202/885] 283982=test_ole_methods I, [2024-05-13T20:16:13.658678 #242627] INFO -- : [203/885] 283999=test_date_conv I, [2024-05-13T20:16:13.659721 #242627] INFO -- : [204/885] 283982=test_optimization I, [2024-05-13T20:16:13.660485 #242627] INFO -- : [205/885] 283997=test_zlib I, [2024-05-13T20:16:13.667028 #242627] INFO -- : [206/885] 283999=test_cgi_tag_helper I, [2024-05-13T20:16:13.683093 #242627] INFO -- : [207/885] 283999=test_egrep_cpp I, [2024-05-13T20:16:13.689186 #242627] INFO -- : [208/885] 283988=test_fnmatch I, [2024-05-13T20:16:13.751488 #242627] INFO -- : [209/885] 283988=test_files_test_2 I, [2024-05-13T20:16:13.752104 #242627] INFO -- : [210/885] 283988=test_rdoc_markup_parser I, [2024-05-13T20:16:13.856634 #242627] INFO -- : [211/885] 283999=test_require_path_check I, [2024-05-13T20:16:13.880632 #242627] INFO -- : [212/885] 283985=test_folderitem2_invokeverb I, [2024-05-13T20:16:13.885320 #242627] INFO -- : [213/885] 283985=test_gem_validator I, [2024-05-13T20:16:13.894351 #242627] INFO -- : [214/885] 284001=test_rdoc_markup_to_html_crossref I, [2024-05-13T20:16:13.912392 #242627] INFO -- : [215/885] 283985=encoding_test I, [2024-05-13T20:16:13.936996 #242627] INFO -- : [216/885] 283999=test_gem_resolver_best_set I, [2024-05-13T20:16:13.959431 #242627] INFO -- : [217/885] 283988=test_typeddata I, [2024-05-13T20:16:14.019508 #242627] INFO -- : [218/885] 283991=test_rat I, [2024-05-13T20:16:14.023167 #242627] INFO -- : [219/885] 283999=test_webauthn_poller I, [2024-05-13T20:16:14.024246 #242627] INFO -- : [220/885] 283991=test_rdoc_markup_raw I, [2024-05-13T20:16:14.027791 #242627] INFO -- : [221/885] 283991=test_optparse I, [2024-05-13T20:16:14.029501 #242627] INFO -- : [222/885] 283987=test_array I, [2024-05-13T20:16:14.053532 #242627] INFO -- : [223/885] 283987=test_fstring I, [2024-05-13T20:16:14.070871 #242627] INFO -- : [224/885] 283985=test_rdoc_alias I, [2024-05-13T20:16:14.079549 #242627] INFO -- : [225/885] 283991=test_yield I, [2024-05-13T20:16:14.163035 #242627] INFO -- : [226/885] 283988=parser_test I, [2024-05-13T20:16:14.163782 #242627] INFO -- : [227/885] 283999=test_convertible I, [2024-05-13T20:16:14.179676 #242627] INFO -- : [228/885] 283987=test_stringscanner I, [2024-05-13T20:16:14.187879 #242627] INFO -- : [229/885] 283998=test_files_sample I, [2024-05-13T20:16:14.212579 #242627] INFO -- : [230/885] 283987=test_rdoc_markup_indented_paragraph I, [2024-05-13T20:16:14.228759 #242627] INFO -- : [231/885] 283988=test_gem_resolver_conflict I, [2024-05-13T20:16:14.278624 #242627] INFO -- : [232/885] 283985=test_rdoc_task I, [2024-05-13T20:16:14.283102 #242627] INFO -- : [233/885] 283985=test_backtrace I, [2024-05-13T20:16:14.298005 #242627] INFO -- : [234/885] 283998=test_pack I, [2024-05-13T20:16:14.323095 #242627] INFO -- : [235/885] 283998=ruby_parser_test I, [2024-05-13T20:16:14.334666 #242627] INFO -- : [236/885] 283987=test_io_buffer I, [2024-05-13T20:16:14.383183 #242627] INFO -- : [237/885] 283988=test_readpartial I, [2024-05-13T20:16:14.398299 #242627] INFO -- : [238/885] 283998=test_clone I, [2024-05-13T20:16:14.445241 #242627] INFO -- : [239/885] 283987=test_gem_commands_install_command I, [2024-05-13T20:16:14.452258 #242627] INFO -- : [240/885] 283983=test_rdoc_require I, [2024-05-13T20:16:14.476332 #242627] INFO -- : [241/885] 283983=locals_test I, [2024-05-13T20:16:14.533762 #242627] INFO -- : [242/885] 284001=test_sleep I, [2024-05-13T20:16:14.613662 #242627] INFO -- : [243/885] 283998=test_config I, [2024-05-13T20:16:14.664284 #242627] INFO -- : [244/885] 283998=test_libs I, [2024-05-13T20:16:14.706868 #242627] INFO -- : [245/885] 283998=test_math I, [2024-05-13T20:16:14.744695 #242627] INFO -- : [246/885] 283998=test_gem_commands_fetch_command I, [2024-05-13T20:16:14.770864 #242627] INFO -- : [247/885] 283996=test_gc I, [2024-05-13T20:16:14.774915 #242627] INFO -- : [248/885] 283996=test_yaml_tree I, [2024-05-13T20:16:14.785257 #242627] INFO -- : [249/885] 283988=test_rendering I, [2024-05-13T20:16:14.790295 #242627] INFO -- : [250/885] 283988=test_sizeof I, [2024-05-13T20:16:14.834890 #242627] INFO -- : [251/885] 283996=test_case I, [2024-05-13T20:16:14.863343 #242627] INFO -- : [252/885] 283996=test_face I, [2024-05-13T20:16:14.889881 #242627] INFO -- : [253/885] 283984=test_io I, [2024-05-13T20:16:14.910144 #242627] INFO -- : [254/885] 283998=test_unicode_escape I, [2024-05-13T20:16:14.922976 #242627] INFO -- : [255/885] 283983=test_utf16 I, [2024-05-13T20:16:14.929650 #242627] INFO -- : [256/885] 283996=test_autoload I, [2024-05-13T20:16:14.944686 #242627] INFO -- : [257/885] 283983=test_gem_package_tar_header I, [2024-05-13T20:16:15.008122 #242627] INFO -- : [258/885] 283983=test_gem_util I, [2024-05-13T20:16:15.014592 #242627] INFO -- : [259/885] 283998=test_iseq_load I, [2024-05-13T20:16:15.149730 #242627] INFO -- : [260/885] 283989=test_pkey_dh I, [2024-05-13T20:16:15.153685 #242627] INFO -- : [261/885] 283983=test_bigzero I, [2024-05-13T20:16:15.162825 #242627] INFO -- : [262/885] 283983=test_system I, [2024-05-13T20:16:15.279351 #242627] INFO -- : [263/885] 283989=test_pkcs12 I, [2024-05-13T20:16:15.415724 #242627] INFO -- : [264/885] 283990=test_etc I, [2024-05-13T20:16:15.497448 #242627] INFO -- : [265/885] 283990=test_yjit_exit_locations I, [2024-05-13T20:16:15.500063 #242627] INFO -- : [266/885] 283990=test_getopts I, [2024-05-13T20:16:15.508880 #242627] INFO -- : [267/885] 283990=test_protocol I, [2024-05-13T20:16:15.601721 #242627] INFO -- : [268/885] 283989=test_gem_resolver_activation_request I, [2024-05-13T20:16:15.613436 #242627] INFO -- : [269/885] 283989=test_gem_config_file I, [2024-05-13T20:16:15.626500 #242627] INFO -- : [270/885] 283985=test_ripper I, [2024-05-13T20:16:15.718902 #242627] INFO -- : [271/885] 283989=test_pattern_key_name_check I, [2024-05-13T20:16:15.725799 #242627] INFO -- : [272/885] 283989=test_to_ruby I, [2024-05-13T20:16:15.733857 #242627] INFO -- : [273/885] 283989=test_gem_impossible_dependencies_error I, [2024-05-13T20:16:15.736475 #242627] INFO -- : [274/885] 283989=test_array_create I, [2024-05-13T20:16:15.742244 #242627] INFO -- : [275/885] 283989=test_pack I, [2024-05-13T20:16:15.750389 #242627] INFO -- : [276/885] 283998=test_gem_commands_query_command I, [2024-05-13T20:16:15.824891 #242627] INFO -- : [277/885] 283990=test_method I, [2024-05-13T20:16:15.865851 #242627] INFO -- : [278/885] 283991=test_rdoc_rubygems_hook I, [2024-05-13T20:16:15.924127 #242627] INFO -- : [279/885] 283993=test_rdoc_context_section I, [2024-05-13T20:16:15.930792 #242627] INFO -- : [280/885] 283989=test_euc_kr I, [2024-05-13T20:16:15.933634 #242627] INFO -- : [281/885] 283989=test_ftp I, [2024-05-13T20:16:15.940796 #242627] INFO -- : [282/885] 283993=test_ellipsize I, [2024-05-13T20:16:15.954508 #242627] INFO -- : [283/885] 283989=test_date_attr I, [2024-05-13T20:16:15.956333 #242627] INFO -- : [284/885] 283993=test_io_wait I, [2024-05-13T20:16:15.958169 #242627] INFO -- : [285/885] 283989=test_gem_commands_exec_command I, [2024-05-13T20:16:15.965968 #242627] INFO -- : [286/885] 283991=warnings_test I, [2024-05-13T20:16:16.023357 #242627] INFO -- : [287/885] 283991=test_kwargs I, [2024-05-13T20:16:16.034976 #242627] INFO -- : [288/885] 283991=test_type_completor I, [2024-05-13T20:16:16.036661 #242627] INFO -- : [289/885] 283991=test_console_attr I, [2024-05-13T20:16:16.040710 #242627] INFO -- : [290/885] 283991=test_summary I, [2024-05-13T20:16:16.041257 #242627] INFO -- : [291/885] 283985=test_cp949 I, [2024-05-13T20:16:16.047347 #242627] INFO -- : [292/885] 283985=test_gem_commands_uninstall_command I, [2024-05-13T20:16:16.085482 #242627] INFO -- : [293/885] 283987=test_gem_source_specific_file I, [2024-05-13T20:16:16.100602 #242627] INFO -- : [294/885] 283991=test_foreach I, [2024-05-13T20:16:16.103457 #242627] INFO -- : [295/885] 283991=test_condition I, [2024-05-13T20:16:16.110546 #242627] INFO -- : [296/885] 283991=test_gem_unsatisfiable_dependency_error I, [2024-05-13T20:16:16.119835 #242627] INFO -- : [297/885] 283991=test_win32ole_record I, [2024-05-13T20:16:16.123481 #242627] INFO -- : [298/885] 283991=test_sorted_set I, [2024-05-13T20:16:16.185904 #242627] INFO -- : [299/885] 283987=test_win32ole_type_event I, [2024-05-13T20:16:16.196107 #242627] INFO -- : [300/885] 283987=test_emoji I, [2024-05-13T20:16:16.223161 #242627] INFO -- : [301/885] 283987=test_ubf_async_safe I, [2024-05-13T20:16:16.223797 #242627] INFO -- : [302/885] 283998=test_hash I, [2024-05-13T20:16:16.226959 #242627] INFO -- : [303/885] 283987=test_io I, [2024-05-13T20:16:16.274564 #242627] INFO -- : [304/885] 283983=test_gem_request_set_lockfile I, [2024-05-13T20:16:16.287624 #242627] INFO -- : [305/885] 283993=test_raise_exception I, [2024-05-13T20:16:16.373754 #242627] INFO -- : [306/885] 283997=test_protect I, [2024-05-13T20:16:16.376760 #242627] INFO -- : [307/885] 283997=test_win32ole_typelib I, [2024-05-13T20:16:16.380565 #242627] INFO -- : [308/885] 283997=test_tree_builder I, [2024-05-13T20:16:16.393357 #242627] INFO -- : [309/885] 283997=test_gem_resolver_dependency_request I, [2024-05-13T20:16:16.399608 #242627] INFO -- : [310/885] 283991=test_hash I, [2024-05-13T20:16:16.411030 #242627] INFO -- : [311/885] 283991=test_postponed_job I, [2024-05-13T20:16:16.412816 #242627] INFO -- : [312/885] 283997=test_alias_and_anchor I, [2024-05-13T20:16:16.420094 #242627] INFO -- : [313/885] 283997=test_external_new I, [2024-05-13T20:16:16.424611 #242627] INFO -- : [314/885] 283997=test_kill_ring I, [2024-05-13T20:16:16.467305 #242627] INFO -- : [315/885] 283987=test_ns_spki I, [2024-05-13T20:16:16.479611 #242627] INFO -- : [316/885] 283997=test_framework I, [2024-05-13T20:16:16.494396 #242627] INFO -- : [317/885] 283997=test_argf I, [2024-05-13T20:16:16.511224 #242627] INFO -- : [318/885] 283987=test_ws I, [2024-05-13T20:16:16.516505 #242627] INFO -- : [319/885] 283987=test_gem_commands_environment_command I, [2024-05-13T20:16:16.568822 #242627] INFO -- : [320/885] 284001=test_m17n I, [2024-05-13T20:16:16.584264 #242627] INFO -- : [321/885] 283987=test_workspace I, [2024-05-13T20:16:16.623649 #242627] INFO -- : [322/885] 283983=test_weakmap I, [2024-05-13T20:16:16.651035 #242627] INFO -- : [323/885] 284001=test_yjit I, [2024-05-13T20:16:16.673601 #242627] INFO -- : [324/885] 284001=test_string_memory I, [2024-05-13T20:16:16.711289 #242627] INFO -- : [325/885] 284001=comments_test I, [2024-05-13T20:16:16.733833 #242627] INFO -- : [326/885] 283985=test_sprintf I, [2024-05-13T20:16:16.791422 #242627] INFO -- : [327/885] 284001=test_gem_requirement I, [2024-05-13T20:16:16.825077 #242627] INFO -- : [328/885] 283987=test_gem_security_trust_dir I, [2024-05-13T20:16:16.828431 #242627] INFO -- : [329/885] 283991=test_line_editor I, [2024-05-13T20:16:16.876609 #242627] INFO -- : [330/885] 283987=test_objspace I, [2024-05-13T20:16:16.909366 #242627] INFO -- : [331/885] 283985=ripper_test I, [2024-05-13T20:16:16.915636 #242627] INFO -- : [332/885] 283991=test_undef I, [2024-05-13T20:16:16.916660 #242627] INFO -- : [333/885] 283991=test_c_struct_entry I, [2024-05-13T20:16:16.949985 #242627] INFO -- : [334/885] 284001=test_lock_native_thread I, [2024-05-13T20:16:16.967740 #242627] INFO -- : [335/885] 283993=test_gem_commands_stale_command I, [2024-05-13T20:16:16.975373 #242627] INFO -- : [336/885] 283989=test_remote_fetch_error I, [2024-05-13T20:16:16.976895 #242627] INFO -- : [337/885] 283993=test_have_library I, [2024-05-13T20:16:16.988552 #242627] INFO -- : [338/885] 283989=test_show_source I, [2024-05-13T20:16:17.100535 #242627] INFO -- : [339/885] 283989=test_set I, [2024-05-13T20:16:17.112585 #242627] INFO -- : [340/885] 283989=test_frozen_error I, [2024-05-13T20:16:17.115153 #242627] INFO -- : [341/885] 283989=test_gem_stub_specification I, [2024-05-13T20:16:17.117230 #242627] INFO -- : [342/885] 283995=test_method_cache I, [2024-05-13T20:16:17.120807 #242627] INFO -- : [343/885] 283995=test_gem_ext_ext_conf_builder I, [2024-05-13T20:16:17.168061 #242627] INFO -- : [344/885] 283991=test_complex I, [2024-05-13T20:16:17.238032 #242627] INFO -- : [345/885] 284001=test_gem_commands_search_command I, [2024-05-13T20:16:17.246150 #242627] INFO -- : [346/885] 284001=test_inlinecache I, [2024-05-13T20:16:17.261332 #242627] INFO -- : [347/885] 283989=test_rdoc_markup_verbatim I, [2024-05-13T20:16:17.266602 #242627] INFO -- : [348/885] 283989=test_path_to_class I, [2024-05-13T20:16:17.271237 #242627] INFO -- : [349/885] 283989=test_gem_resolver_specification I, [2024-05-13T20:16:17.290044 #242627] INFO -- : [350/885] 283989=test_gem_dependency I, [2024-05-13T20:16:17.308270 #242627] INFO -- : [351/885] 284001=test_parse I, [2024-05-13T20:16:17.330245 #242627] INFO -- : [352/885] 283991=test_mdns I, [2024-05-13T20:16:17.336795 #242627] INFO -- : [353/885] 283991=test_gem_remote_fetcher I, [2024-05-13T20:16:17.357060 #242627] INFO -- : [354/885] 283985=test_scanner_events I, [2024-05-13T20:16:17.383048 #242627] INFO -- : [355/885] 283985=test_gem_resolver_installed_specification I, [2024-05-13T20:16:17.396494 #242627] INFO -- : [356/885] 283985=test_rdoc_include I, [2024-05-13T20:16:17.420138 #242627] INFO -- : [357/885] 283989=test_reqarg I, [2024-05-13T20:16:17.425575 #242627] INFO -- : [358/885] 284000=test_gem_commands_list_command I, [2024-05-13T20:16:17.435991 #242627] INFO -- : [359/885] 283985=test_stack I, [2024-05-13T20:16:17.442761 #242627] INFO -- : [360/885] 284000=test_too_many_dummy_encodings I, [2024-05-13T20:16:17.512462 #242627] INFO -- : [361/885] 284000=test_gem_version I, [2024-05-13T20:16:17.610780 #242627] INFO -- : [362/885] 284000=test_econv I, [2024-05-13T20:16:17.834600 #242627] INFO -- : [363/885] 283989=test_cesu8 I, [2024-05-13T20:16:17.848963 #242627] INFO -- : [364/885] 283989=test_rdoc_options I, [2024-05-13T20:16:17.891549 #242627] INFO -- : [365/885] 283988=test_string_processing I, [2024-05-13T20:16:17.900028 #242627] INFO -- : [366/885] 283988=test_fileutils I, [2024-05-13T20:16:17.927274 #242627] INFO -- : [367/885] 284001=test_ldap I, [2024-05-13T20:16:17.949018 #242627] INFO -- : [368/885] 284001=test_emitter I, [2024-05-13T20:16:17.962209 #242627] INFO -- : [369/885] 284001=test_resource I, [2024-05-13T20:16:17.990582 #242627] INFO -- : [370/885] 284001=test_gem_commands_signin_command I, [2024-05-13T20:16:18.086926 #242627] INFO -- : [371/885] 284001=test_function I, [2024-05-13T20:16:18.114271 #242627] INFO -- : [372/885] 283989=test_queue I, [2024-05-13T20:16:18.120745 #242627] INFO -- : [373/885] 283989=test_tempfile I, [2024-05-13T20:16:18.208696 #242627] INFO -- : [374/885] 283993=parse_comments_test I, [2024-05-13T20:16:18.268651 #242627] INFO -- : [375/885] 283988=test_noarg I, [2024-05-13T20:16:18.272279 #242627] INFO -- : [376/885] 283993=test_duplicate I, [2024-05-13T20:16:18.275378 #242627] INFO -- : [377/885] 283993=test_utf32 I, [2024-05-13T20:16:18.281908 #242627] INFO -- : [378/885] 283993=test_basicsocket I, [2024-05-13T20:16:18.288754 #242627] INFO -- : [379/885] 283993=test_prettyprint I, [2024-05-13T20:16:18.308401 #242627] INFO -- : [380/885] 283993=test_tracepoint I, [2024-05-13T20:16:18.316336 #242627] INFO -- : [381/885] 284001=test_gem_commands_help_command I, [2024-05-13T20:16:18.351400 #242627] INFO -- : [382/885] 283989=test_rdoc_markup I, [2024-05-13T20:16:18.361276 #242627] INFO -- : [383/885] 283989=test_internal_ivar I, [2024-05-13T20:16:18.370657 #242627] INFO -- : [384/885] 283989=test_gem_resolver_index_specification I, [2024-05-13T20:16:18.384061 #242627] INFO -- : [385/885] 283995=test_date_strftime I, [2024-05-13T20:16:18.387451 #242627] INFO -- : [386/885] 283985=test_rdoc_parser_rd I, [2024-05-13T20:16:18.401234 #242627] INFO -- : [387/885] 283989=test_yamlstore I, [2024-05-13T20:16:18.408154 #242627] INFO -- : [388/885] 284001=test_gem_installer I, [2024-05-13T20:16:18.411740 #242627] INFO -- : [389/885] 283989=json_string_matching_test I, [2024-05-13T20:16:18.420019 #242627] INFO -- : [390/885] 283985=test_load I, [2024-05-13T20:16:18.421604 #242627] INFO -- : [391/885] 283989=test_class I, [2024-05-13T20:16:18.431523 #242627] INFO -- : [392/885] 283985=test_rdoc_normal_class I, [2024-05-13T20:16:18.491799 #242627] INFO -- : [393/885] 283988=test_const I, [2024-05-13T20:16:18.494555 #242627] INFO -- : [394/885] 283988=test_asn1 I, [2024-05-13T20:16:18.502878 #242627] INFO -- : [395/885] 283985=test_random I, [2024-05-13T20:16:18.510840 #242627] INFO -- : [396/885] 283988=test_irb I, [2024-05-13T20:16:18.511422 #242627] INFO -- : [397/885] 283985=regexp_test I, [2024-05-13T20:16:18.533034 #242627] INFO -- : [398/885] 283985=test_gem_package_tar_reader I, [2024-05-13T20:16:18.557544 #242627] INFO -- : [399/885] 283993=test_rdoc_encoding I, [2024-05-13T20:16:18.576539 #242627] INFO -- : [400/885] 283985=test_coverage I, [2024-05-13T20:16:18.594184 #242627] INFO -- : [401/885] 283993=test_pathname I, [2024-05-13T20:16:18.646156 #242627] INFO -- : [402/885] 284000=test_complexrational I, [2024-05-13T20:16:18.654700 #242627] INFO -- : [403/885] 284000=test_init I, [2024-05-13T20:16:18.801938 #242627] INFO -- : [404/885] 283993=test_rdoc_any_method I, [2024-05-13T20:16:18.844927 #242627] INFO -- : [405/885] 283988=test_modify_expand I, [2024-05-13T20:16:18.853366 #242627] INFO -- : [406/885] 283988=test_rdoc_markdown I, [2024-05-13T20:16:18.963757 #242627] INFO -- : [407/885] 283994=test_gem_available_set I, [2024-05-13T20:16:19.014195 #242627] INFO -- : [408/885] 283999=test_file I, [2024-05-13T20:16:19.031780 #242627] INFO -- : [409/885] 283999=test_deprecate I, [2024-05-13T20:16:19.061517 #242627] INFO -- : [410/885] 283995=test_rdoc_constant I, [2024-05-13T20:16:19.073492 #242627] INFO -- : [411/885] 283999=test_bash_completion I, [2024-05-13T20:16:19.076383 #242627] INFO -- : [412/885] 283999=test_formatter I, [2024-05-13T20:16:19.082195 #242627] INFO -- : [413/885] 283999=test_recorder I, [2024-05-13T20:16:19.084729 #242627] INFO -- : [414/885] 283999=test_gem_source_vendor I, [2024-05-13T20:16:19.093081 #242627] INFO -- : [415/885] 283999=test_gem_commands_owner_command I, [2024-05-13T20:16:19.180039 #242627] INFO -- : [416/885] 283988=test_marshalable I, [2024-05-13T20:16:19.185579 #242627] INFO -- : [417/885] 283988=test_digest I, [2024-05-13T20:16:19.191503 #242627] INFO -- : [418/885] 283993=test_gem_commands_contents_command I, [2024-05-13T20:16:19.207093 #242627] INFO -- : [419/885] 284000=test_gem_ext_cmake_builder I, [2024-05-13T20:16:19.225005 #242627] INFO -- : [420/885] 283995=test_require I, [2024-05-13T20:16:19.228153 #242627] INFO -- : [421/885] 284000=test_cgi_util I, [2024-05-13T20:16:19.247972 #242627] INFO -- : [422/885] 283994=test_fiddle I, [2024-05-13T20:16:19.275524 #242627] INFO -- : [423/885] 283993=test_wss I, [2024-05-13T20:16:19.281419 #242627] INFO -- : [424/885] 283993=test_ractor I, [2024-05-13T20:16:19.314114 #242627] INFO -- : [425/885] 283994=test_find I, [2024-05-13T20:16:19.350896 #242627] INFO -- : [426/885] 283994=test_io_timeout I, [2024-05-13T20:16:19.355965 #242627] INFO -- : [427/885] 283994=test_shapes I, [2024-05-13T20:16:19.362453 #242627] INFO -- : [428/885] 283994=json_fixtures_test I, [2024-05-13T20:16:19.373930 #242627] INFO -- : [429/885] 283994=test_comparable I, [2024-05-13T20:16:19.387771 #242627] INFO -- : [430/885] 283994=test_rdoc_parser_c I, [2024-05-13T20:16:19.408479 #242627] INFO -- : [431/885] 283993=test_class2name I, [2024-05-13T20:16:19.416806 #242627] INFO -- : [432/885] 283993=test_gbk I, [2024-05-13T20:16:19.428701 #242627] INFO -- : [433/885] 283993=test_enc_str_buf_cat I, [2024-05-13T20:16:19.431084 #242627] INFO -- : [434/885] 283993=test_pstore I, [2024-05-13T20:16:19.446608 #242627] INFO -- : [435/885] 283985=test_cstr I, [2024-05-13T20:16:19.448188 #242627] INFO -- : [436/885] 283991=test_profile_frames I, [2024-05-13T20:16:19.469841 #242627] INFO -- : [437/885] 283993=test_big2str I, [2024-05-13T20:16:19.474498 #242627] INFO -- : [438/885] 283993=test_forwardable I, [2024-05-13T20:16:19.481167 #242627] INFO -- : [439/885] 284000=test_yaml I, [2024-05-13T20:16:19.496184 #242627] INFO -- : [440/885] 283993=test_wait I, [2024-05-13T20:16:19.536746 #242627] INFO -- : [441/885] 283983=test_handle I, [2024-05-13T20:16:19.567620 #242627] INFO -- : [442/885] 283993=test_thread_queue I, [2024-05-13T20:16:19.586450 #242627] INFO -- : [443/885] 284000=test_nowrite I, [2024-05-13T20:16:19.605217 #242627] INFO -- : [444/885] 284000=test_rdoc_markup_formatter I, [2024-05-13T20:16:19.614192 #242627] INFO -- : [445/885] 284000=test_ractor I, [2024-05-13T20:16:19.622431 #242627] INFO -- : [446/885] 284000=test_euc_tw I, [2024-05-13T20:16:19.625061 #242627] INFO -- : [447/885] 284000=test_bmethod I, [2024-05-13T20:16:19.630062 #242627] INFO -- : [448/885] 284000=test_gem_commands_sources_command I, [2024-05-13T20:16:19.642144 #242627] INFO -- : [449/885] 283991=test_ansi_without_terminfo I, [2024-05-13T20:16:19.652992 #242627] INFO -- : [450/885] 283991=test_color_printer I, [2024-05-13T20:16:19.662814 #242627] INFO -- : [451/885] 283999=test_deprecated I, [2024-05-13T20:16:19.663904 #242627] INFO -- : [452/885] 283991=test_insns_leaf I, [2024-05-13T20:16:19.671501 #242627] INFO -- : [453/885] 283999=test_serialize_subclasses I, [2024-05-13T20:16:19.674113 #242627] INFO -- : [454/885] 283999=test_key_error I, [2024-05-13T20:16:19.675887 #242627] INFO -- : [455/885] 283991=test_allocation I, [2024-05-13T20:16:19.680141 #242627] INFO -- : [456/885] 283999=test_div I, [2024-05-13T20:16:19.684912 #242627] INFO -- : [457/885] 283999=test_win32ole_variant_m I, [2024-05-13T20:16:19.686851 #242627] INFO -- : [458/885] 283999=test_engine I, [2024-05-13T20:16:19.688827 #242627] INFO -- : [459/885] 283999=test_rdoc_rd_inline I, [2024-05-13T20:16:19.693425 #242627] INFO -- : [460/885] 283999=test_mutex I, [2024-05-13T20:16:19.773980 #242627] INFO -- : [461/885] 283983=test_x509req I, [2024-05-13T20:16:19.790687 #242627] INFO -- : [462/885] 284000=test_set I, [2024-05-13T20:16:19.820253 #242627] INFO -- : [463/885] 284000=test_struct I, [2024-05-13T20:16:19.823532 #242627] INFO -- : [464/885] 283998=test_gem_path_support I, [2024-05-13T20:16:19.842482 #242627] INFO -- : [465/885] 283994=test_files_test_1 I, [2024-05-13T20:16:19.855896 #242627] INFO -- : [466/885] 283998=test_config I, [2024-05-13T20:16:19.889301 #242627] INFO -- : [467/885] 283998=test_nomethod_error I, [2024-05-13T20:16:19.890030 #242627] INFO -- : [468/885] 283996=json_parser_test I, [2024-05-13T20:16:19.893182 #242627] INFO -- : [469/885] 283998=memsize_test I, [2024-05-13T20:16:19.895095 #242627] INFO -- : [470/885] 283998=test_dln I, [2024-05-13T20:16:19.898910 #242627] INFO -- : [471/885] 283998=test_gem_source_subpath_problem I, [2024-05-13T20:16:19.931411 #242627] INFO -- : [472/885] 283996=json_common_interface_test I, [2024-05-13T20:16:19.937138 #242627] INFO -- : [473/885] 283983=test_win32ole_variant_outarg I, [2024-05-13T20:16:19.938463 #242627] INFO -- : [474/885] 283996=fuzzer_test I, [2024-05-13T20:16:19.943724 #242627] INFO -- : [475/885] 283983=test_sexp I, [2024-05-13T20:16:19.953942 #242627] INFO -- : [476/885] 283983=test_rdoc_markup_include I, [2024-05-13T20:16:19.965587 #242627] INFO -- : [477/885] 283983=test_variable I, [2024-05-13T20:16:20.003660 #242627] INFO -- : [478/885] 283998=test_struct I, [2024-05-13T20:16:20.015461 #242627] INFO -- : [479/885] 283988=magic_comment_test I, [2024-05-13T20:16:20.019424 #242627] INFO -- : [480/885] 283998=test_rdoc_markup_to_html_snippet I, [2024-05-13T20:16:20.023595 #242627] INFO -- : [481/885] 283988=test_cparser I, [2024-05-13T20:16:20.025571 #242627] INFO -- : [482/885] 283996=test_pkg_config I, [2024-05-13T20:16:20.077000 #242627] INFO -- : [483/885] 283983=test_shellwords I, [2024-05-13T20:16:20.082887 #242627] INFO -- : [484/885] 283996=test_debug I, [2024-05-13T20:16:20.086128 #242627] INFO -- : [485/885] 283983=test_memory_view I, [2024-05-13T20:16:20.089335 #242627] INFO -- : [486/885] 283996=pattern_test I, [2024-05-13T20:16:20.103227 #242627] INFO -- : [487/885] 283998=test_iterator I, [2024-05-13T20:16:20.111390 #242627] INFO -- : [488/885] 283996=test_string I, [2024-05-13T20:16:20.114545 #242627] INFO -- : [489/885] 283996=test_omap I, [2024-05-13T20:16:20.122007 #242627] INFO -- : [490/885] 283996=test_digest_extend I, [2024-05-13T20:16:20.125648 #242627] INFO -- : [491/885] 283996=test_storage I, [2024-05-13T20:16:20.129485 #242627] INFO -- : [492/885] 283996=test_gem_resolver_git_set I, [2024-05-13T20:16:20.134302 #242627] INFO -- : [493/885] 283983=test_cipher I, [2024-05-13T20:16:20.155126 #242627] INFO -- : [494/885] 283990=test_gem_security_signer I, [2024-05-13T20:16:20.166083 #242627] INFO -- : [495/885] 283983=test_new I, [2024-05-13T20:16:20.168780 #242627] INFO -- : [496/885] 283983=test_dir_m17n I, [2024-05-13T20:16:20.182040 #242627] INFO -- : [497/885] 283998=test_gem_resolver_installer_set I, [2024-05-13T20:16:20.196409 #242627] INFO -- : [498/885] 283985=test_regex_casefold I, [2024-05-13T20:16:20.235509 #242627] INFO -- : [499/885] 284000=test_refinement I, [2024-05-13T20:16:20.243204 #242627] INFO -- : [500/885] 283990=test_gem_commands_signout_command I, [2024-05-13T20:16:20.263706 #242627] INFO -- : [501/885] 283990=test_gem_source_git I, [2024-05-13T20:16:20.376754 #242627] INFO -- : [502/885] 283995=test_float I, [2024-05-13T20:16:20.444353 #242627] INFO -- : [503/885] 283998=test_require I, [2024-05-13T20:16:20.543495 #242627] INFO -- : [504/885] 283989=test_cgi_cookie I, [2024-05-13T20:16:20.558427 #242627] INFO -- : [505/885] 283989=test_input_method I, [2024-05-13T20:16:20.589205 #242627] INFO -- : [506/885] 283989=test_windows_1252 I, [2024-05-13T20:16:20.596596 #242627] INFO -- : [507/885] 283989=test_process I, [2024-05-13T20:16:20.622911 #242627] INFO -- : [508/885] 283989=test_fixnum I, [2024-05-13T20:16:20.633904 #242627] INFO -- : [509/885] 283989=test_signal I, [2024-05-13T20:16:20.655451 #242627] INFO -- : [510/885] 283996=test_x509crl I, [2024-05-13T20:16:20.775826 #242627] INFO -- : [511/885] 283990=test_rdoc_rd I, [2024-05-13T20:16:20.780588 #242627] INFO -- : [512/885] 283990=test_cgi_session I, [2024-05-13T20:16:20.781825 #242627] INFO -- : [513/885] 283996=test_rdoc_top_level I, [2024-05-13T20:16:20.793401 #242627] INFO -- : [514/885] 283990=test_metaclass I, [2024-05-13T20:16:20.803932 #242627] INFO -- : [515/885] 283990=test_gem_commands_cert_command I, [2024-05-13T20:16:20.834162 #242627] INFO -- : [516/885] 283999=test_completion I, [2024-05-13T20:16:20.850230 #242627] INFO -- : [517/885] 283985=test_len I, [2024-05-13T20:16:20.850644 #242627] INFO -- : [518/885] 283985=test_yield_block I, [2024-05-13T20:16:20.855864 #242627] INFO -- : [519/885] 283985=test_erb I, [2024-05-13T20:16:20.859071 #242627] INFO -- : [520/885] 283997=test_x509ext I, [2024-05-13T20:16:20.870088 #242627] INFO -- : [521/885] 283997=test_gem_source_installed I, [2024-05-13T20:16:20.873414 #242627] INFO -- : [522/885] 283988=test_assembler I, [2024-05-13T20:16:20.875074 #242627] INFO -- : [523/885] 283988=test_spell_checker I, [2024-05-13T20:16:20.885432 #242627] INFO -- : [524/885] 283988=test_propertyputref I, [2024-05-13T20:16:20.886804 #242627] INFO -- : [525/885] 283988=attribute_write_test I, [2024-05-13T20:16:20.889097 #242627] INFO -- : [526/885] 283988=test_rational2 I, [2024-05-13T20:16:20.895141 #242627] INFO -- : [527/885] 283997=test_rational I, [2024-05-13T20:16:20.898226 #242627] INFO -- : [528/885] 283985=test_gem_commands_outdated_command I, [2024-05-13T20:16:20.900119 #242627] INFO -- : [529/885] 283988=test_array I, [2024-05-13T20:16:20.923316 #242627] INFO -- : [530/885] 283997=test_helper_method I, [2024-05-13T20:16:20.938955 #242627] INFO -- : [531/885] 283985=test_gem_package_tar_writer I, [2024-05-13T20:16:20.998258 #242627] INFO -- : [532/885] 283997=test_gem_source I, [2024-05-13T20:16:21.018961 #242627] INFO -- : [533/885] 283985=test_scalar_scanner I, [2024-05-13T20:16:21.025714 #242627] INFO -- : [534/885] 283985=test_win32ole_method_event I, [2024-05-13T20:16:21.028653 #242627] INFO -- : [535/885] 283985=test_nesting_parser I, [2024-05-13T20:16:21.099907 #242627] INFO -- : [536/885] 283996=test_gem_dependency_list I, [2024-05-13T20:16:21.115528 #242627] INFO -- : [537/885] 283985=test_benchmark I, [2024-05-13T20:16:21.153205 #242627] INFO -- : [538/885] 283996=test_evaluation I, [2024-05-13T20:16:21.166530 #242627] INFO -- : [539/885] 283996=test_https I, [2024-05-13T20:16:21.305727 #242627] INFO -- : [540/885] 283997=test_gem_ext_builder I, [2024-05-13T20:16:21.356613 #242627] INFO -- : [541/885] 283984=test_rdoc_parser_simple I, [2024-05-13T20:16:21.396927 #242627] INFO -- : [542/885] 283999=test_load I, [2024-05-13T20:16:21.399368 #242627] INFO -- : [543/885] 283999=test_yamldbm I, [2024-05-13T20:16:21.403541 #242627] INFO -- : [544/885] 283999=test_gem_commands_rebuild_command I, [2024-05-13T20:16:21.439826 #242627] INFO -- : [545/885] 283999=test_abi I, [2024-05-13T20:16:21.462037 #242627] INFO -- : [546/885] 283983=test_provider I, [2024-05-13T20:16:21.475348 #242627] INFO -- : [547/885] 283984=test_rdoc_generator_markup I, [2024-05-13T20:16:21.493630 #242627] INFO -- : [548/885] 283984=test_whileuntil I, [2024-05-13T20:16:21.497198 #242627] INFO -- : [549/885] 283984=test_monitor I, [2024-05-13T20:16:21.527907 #242627] INFO -- : [550/885] 283996=test_buffered_io I, [2024-05-13T20:16:21.533332 #242627] INFO -- : [551/885] 283996=test_configuration I, [2024-05-13T20:16:21.632320 #242627] INFO -- : [552/885] 283999=test_rubyvm I, [2024-05-13T20:16:21.636199 #242627] INFO -- : [553/885] 283996=test_stringify_symbols I, [2024-05-13T20:16:21.647258 #242627] INFO -- : [554/885] 283999=test_instrumentation_api I, [2024-05-13T20:16:21.665761 #242627] INFO -- : [555/885] 283996=integer_parse_test I, [2024-05-13T20:16:21.666305 #242627] INFO -- : [556/885] 283996=test_boolean I, [2024-05-13T20:16:21.675587 #242627] INFO -- : [557/885] 283996=test_gem_request_set I, [2024-05-13T20:16:21.710404 #242627] INFO -- : [558/885] 283984=test_module I, [2024-05-13T20:16:21.752722 #242627] INFO -- : [559/885] 283983=test_ssl I, [2024-05-13T20:16:21.812659 #242627] INFO -- : [560/885] 283995=test_gem_ext_cargo_builder I, [2024-05-13T20:16:21.843951 #242627] INFO -- : [561/885] 283995=constant_path_node_test I, [2024-05-13T20:16:21.903355 #242627] INFO -- : [562/885] 283995=test_parser I, [2024-05-13T20:16:21.926554 #242627] INFO -- : [563/885] 283995=test_method_name_check I, [2024-05-13T20:16:21.953146 #242627] INFO -- : [564/885] 283995=test_arith_seq_extract I, [2024-05-13T20:16:21.990165 #242627] INFO -- : [565/885] 283982=test_rdoc_generator_pot I, [2024-05-13T20:16:21.995422 #242627] INFO -- : [566/885] 283982=test_enumerator I, [2024-05-13T20:16:22.002140 #242627] INFO -- : [567/885] 283982=test_rdoc_parser_changelog I, [2024-05-13T20:16:22.029791 #242627] INFO -- : [568/885] 283996=parameters_signature_test I, [2024-05-13T20:16:22.035013 #242627] INFO -- : [569/885] 283996=test_koi8 I, [2024-05-13T20:16:22.038971 #242627] INFO -- : [570/885] 283996=test_unicode I, [2024-05-13T20:16:22.043048 #242627] INFO -- : [571/885] 283996=test_rdoc_method_attr I, [2024-05-13T20:16:22.088703 #242627] INFO -- : [572/885] 283982=test_filter I, [2024-05-13T20:16:22.109255 #242627] INFO -- : [573/885] 283995=test_gem_gem_runner I, [2024-05-13T20:16:22.121661 #242627] INFO -- : [574/885] 283982=test_data I, [2024-05-13T20:16:22.123269 #242627] INFO -- : [575/885] 283996=static_literals_test I, [2024-05-13T20:16:22.126035 #242627] INFO -- : [576/885] 283996=test_gem_resolver_vendor_specification I, [2024-05-13T20:16:22.131875 #242627] INFO -- : [577/885] 283982=test_gem_commands_update_command I, [2024-05-13T20:16:22.154279 #242627] INFO -- : [578/885] 283995=test_gem_uri I, [2024-05-13T20:16:22.158004 #242627] INFO -- : [579/885] 283996=test_key_event_record I, [2024-05-13T20:16:22.160519 #242627] INFO -- : [580/885] 283996=test_notimplement I, [2024-05-13T20:16:22.165437 #242627] INFO -- : [581/885] 283996=test_random I, [2024-05-13T20:16:22.176123 #242627] INFO -- : [582/885] 283995=test_ssl_session I, [2024-05-13T20:16:22.182013 #242627] INFO -- : [583/885] 283996=test_lexer I, [2024-05-13T20:16:22.193489 #242627] INFO -- : [584/885] 283996=test_thread_cv I, [2024-05-13T20:16:22.263608 #242627] INFO -- : [585/885] 283991=test_terminfo I, [2024-05-13T20:16:22.275579 #242627] INFO -- : [586/885] 283991=test_compile_prism I, [2024-05-13T20:16:22.366769 #242627] INFO -- : [587/885] 283985=test_bug-14834 I, [2024-05-13T20:16:22.433716 #242627] INFO -- : [588/885] 283997=test_date_compat I, [2024-05-13T20:16:22.451524 #242627] INFO -- : [589/885] 283997=test_rdoc_markup_to_html I, [2024-05-13T20:16:22.456020 #242627] INFO -- : [590/885] 283985=test_tree_spell_checker I, [2024-05-13T20:16:22.485549 #242627] INFO -- : [591/885] 283985=test_http I, [2024-05-13T20:16:22.522359 #242627] INFO -- : [592/885] 283997=test_addrinfo I, [2024-05-13T20:16:22.525713 #242627] INFO -- : [593/885] 283994=test_bn I, [2024-05-13T20:16:22.543484 #242627] INFO -- : [594/885] 283997=test_win32ole_param_event I, [2024-05-13T20:16:22.545929 #242627] INFO -- : [595/885] 283994=test_path I, [2024-05-13T20:16:22.547049 #242627] INFO -- : [596/885] 283991=redundant_return_test I, [2024-05-13T20:16:22.548622 #242627] INFO -- : [597/885] 283997=test_case_mapping I, [2024-05-13T20:16:22.551323 #242627] INFO -- : [598/885] 283991=test_sockopt I, [2024-05-13T20:16:22.554302 #242627] INFO -- : [599/885] 283997=test_install I, [2024-05-13T20:16:22.557809 #242627] INFO -- : [600/885] 283991=test_rdoc_markup_to_label I, [2024-05-13T20:16:22.571959 #242627] INFO -- : [601/885] 283994=test_gem_resolver_local_specification I, [2024-05-13T20:16:22.586133 #242627] INFO -- : [602/885] 283991=test_httpheader I, [2024-05-13T20:16:22.599599 #242627] INFO -- : [603/885] 283994=test_rdoc_ri_driver I, [2024-05-13T20:16:22.632694 #242627] INFO -- : [604/885] 283991=test_set_len I, [2024-05-13T20:16:22.641435 #242627] INFO -- : [605/885] 283991=test_httpresponses I, [2024-05-13T20:16:22.644327 #242627] INFO -- : [606/885] 283991=test_encoding I, [2024-05-13T20:16:22.657327 #242627] INFO -- : [607/885] 283991=test_key_stroke I, [2024-05-13T20:16:22.666122 #242627] INFO -- : [608/885] 283991=json_encoding_test I, [2024-05-13T20:16:22.680231 #242627] INFO -- : [609/885] 283991=test_color I, [2024-05-13T20:16:22.699409 #242627] INFO -- : [610/885] 283997=test_rbconfig I, [2024-05-13T20:16:22.704451 #242627] INFO -- : [611/885] 283997=test_primitive I, [2024-05-13T20:16:22.715405 #242627] INFO -- : [612/885] 283997=test_human_typo I, [2024-05-13T20:16:22.728094 #242627] INFO -- : [613/885] 283997=test_chilled I, [2024-05-13T20:16:22.731081 #242627] INFO -- : [614/885] 283997=test_name_error_extension I, [2024-05-13T20:16:22.734158 #242627] INFO -- : [615/885] 283997=test_rdoc_i18n_locale I, [2024-05-13T20:16:22.742587 #242627] INFO -- : [616/885] 283997=test_document I, [2024-05-13T20:16:22.744848 #242627] INFO -- : [617/885] 283997=test_acceptable I, [2024-05-13T20:16:22.748840 #242627] INFO -- : [618/885] 283991=test_rdoc_generator_pot_po_entry I, [2024-05-13T20:16:22.754442 #242627] INFO -- : [619/885] 283991=test_euc_jp I, [2024-05-13T20:16:22.774071 #242627] INFO -- : [620/885] 283989=test_pair I, [2024-05-13T20:16:22.780827 #242627] INFO -- : [621/885] 283991=test_gem_commands_yank_command I, [2024-05-13T20:16:22.824084 #242627] INFO -- : [622/885] 283996=test_win32ole_param I, [2024-05-13T20:16:22.828917 #242627] INFO -- : [623/885] 283996=test_recursion I, [2024-05-13T20:16:22.835371 #242627] INFO -- : [624/885] 283994=test_exit I, [2024-05-13T20:16:22.837067 #242627] INFO -- : [625/885] 283996=test_delegate I, [2024-05-13T20:16:22.847543 #242627] INFO -- : [626/885] 283996=test_popen_deadlock I, [2024-05-13T20:16:22.883577 #242627] INFO -- : [627/885] 283998=test_history I, [2024-05-13T20:16:22.892732 #242627] INFO -- : [628/885] 283998=test_mkmf I, [2024-05-13T20:16:22.893741 #242627] INFO -- : [629/885] 283994=test_date_marshal I, [2024-05-13T20:16:22.898298 #242627] INFO -- : [630/885] 283994=test_multi_irb_commands I, [2024-05-13T20:16:22.899000 #242627] INFO -- : [631/885] 283997=test_fiber I, [2024-05-13T20:16:22.900714 #242627] INFO -- : [632/885] 284001=test_open3 I, [2024-05-13T20:16:22.912250 #242627] INFO -- : [633/885] 283994=test_bundled_ca I, [2024-05-13T20:16:22.915811 #242627] INFO -- : [634/885] 283998=test_closure I, [2024-05-13T20:16:23.143178 #242627] INFO -- : [635/885] 283995=test_digest I, [2024-05-13T20:16:23.145081 #242627] INFO -- : [636/885] 283995=test_ractor I, [2024-05-13T20:16:23.233815 #242627] INFO -- : [637/885] 283995=test_rdoc_servlet I, [2024-05-13T20:16:23.235083 #242627] INFO -- : [638/885] 283998=test_gem_security I, [2024-05-13T20:16:23.244713 #242627] INFO -- : [639/885] 283984=test_files_lib I, [2024-05-13T20:16:23.262520 #242627] INFO -- : [640/885] 283991=test_gem_commands_unpack_command I, [2024-05-13T20:16:23.307606 #242627] INFO -- : [641/885] 283982=test_beginendblock I, [2024-05-13T20:16:23.369406 #242627] INFO -- : [642/885] 283995=test_help I, [2024-05-13T20:16:23.379551 #242627] INFO -- : [643/885] 283995=test_rdoc_markup_to_bs I, [2024-05-13T20:16:23.410502 #242627] INFO -- : [644/885] 283995=test_emoji_breaks I, [2024-05-13T20:16:23.417513 #242627] INFO -- : [645/885] 283995=test_gem_bundler_version_finder I, [2024-05-13T20:16:23.436194 #242627] INFO -- : [646/885] 283995=test_within_pipe I, [2024-05-13T20:16:23.442726 #242627] INFO -- : [647/885] 283996=reflection_test I, [2024-05-13T20:16:23.450121 #242627] INFO -- : [648/885] 283996=test_pinned I, [2024-05-13T20:16:23.476064 #242627] INFO -- : [649/885] 283995=test_rdoc_markup_pre_process I, [2024-05-13T20:16:23.494300 #242627] INFO -- : [650/885] 283996=test_printf I, [2024-05-13T20:16:23.511197 #242627] INFO -- : [651/885] 283996=test_to_ary_concat I, [2024-05-13T20:16:23.543020 #242627] INFO -- : [652/885] 283995=test_webauthn_listener_response I, [2024-05-13T20:16:23.551025 #242627] INFO -- : [653/885] 283995=test_time I, [2024-05-13T20:16:23.560665 #242627] INFO -- : [654/885] 283991=test_stream I, [2024-05-13T20:16:23.588776 #242627] INFO -- : [655/885] 283991=test_exception_at_throwing I, [2024-05-13T20:16:23.636822 #242627] INFO -- : [656/885] 283982=test_iseq I, [2024-05-13T20:16:23.647918 #242627] INFO -- : [657/885] 283991=test_rdoc_markup_heading I, [2024-05-13T20:16:23.659355 #242627] INFO -- : [658/885] 283991=test_scheduler I, [2024-05-13T20:16:23.670797 #242627] INFO -- : [659/885] 283995=test_ocsp I, [2024-05-13T20:16:23.841922 #242627] INFO -- : [660/885] 283991=test_class I, [2024-05-13T20:16:23.849801 #242627] INFO -- : [661/885] 283991=test_pkey_dsa I, [2024-05-13T20:16:24.022510 #242627] INFO -- : [662/885] 283993=test_interned_str I, [2024-05-13T20:16:24.027660 #242627] INFO -- : [663/885] 283993=test_case_comprehensive I, [2024-05-13T20:16:24.037410 #242627] INFO -- : [664/885] 283995=test_gem_commands_build_command I, [2024-05-13T20:16:24.131127 #242627] INFO -- : [665/885] 284000=test_append I, [2024-05-13T20:16:24.134708 #242627] INFO -- : [666/885] 284000=test_option I, [2024-05-13T20:16:24.228792 #242627] INFO -- : [667/885] 283982=test_cmethod I, [2024-05-13T20:16:24.232988 #242627] INFO -- : [668/885] 283982=test_tracer I, [2024-05-13T20:16:24.234537 #242627] INFO -- : [669/885] 284000=test_io_m17n I, [2024-05-13T20:16:24.320812 #242627] INFO -- : [670/885] 283994=test_variable_name_check I, [2024-05-13T20:16:24.324333 #242627] INFO -- : [671/885] 283982=test_did_you_mean I, [2024-05-13T20:16:24.342857 #242627] INFO -- : [672/885] 283995=test_gem_commands_server_command I, [2024-05-13T20:16:24.349877 #242627] INFO -- : [673/885] 283995=test_update I, [2024-05-13T20:16:24.355046 #242627] INFO -- : [674/885] 283995=test_fips I, [2024-05-13T20:16:24.388308 #242627] INFO -- : [675/885] 283994=test_x509name I, [2024-05-13T20:16:24.394365 #242627] INFO -- : [676/885] 283994=test_rdoc_code_object I, [2024-05-13T20:16:24.425151 #242627] INFO -- : [677/885] 283991=test_x509store I, [2024-05-13T20:16:24.459597 #242627] INFO -- : [678/885] 283982=test_webauthn_listener I, [2024-05-13T20:16:24.497389 #242627] INFO -- : Leaked file descriptor: WebauthnListenerTest#test_wait_for_otp_code_get_follows_options: 11 : # I, [2024-05-13T20:16:24.534199 #242627] INFO -- : COMMAND PID USER FD TYPE DEVICE SIZE/OFF NODE NAME I, [2024-05-13T20:16:24.534256 #242627] INFO -- : ruby 283982 ko1 11u IPv4 120715609 0t0 TCP localhost:40035->localhost:60070 (CLOSE_WAIT) I, [2024-05-13T20:16:24.553186 #242627] INFO -- : Closed file descriptor: WebauthnListenerTest#test_wait_for_otp_code_incorrect_path: 11 I, [2024-05-13T20:16:24.567461 #242627] INFO -- : [679/885] 283982=test_gem_request_set_gem_dependency_api I, [2024-05-13T20:16:24.569685 #242627] INFO -- : [680/885] 283999=test_ast I, [2024-05-13T20:16:24.614236 #242627] INFO -- : [681/885] 283995=test_lambda I, [2024-05-13T20:16:24.623672 #242627] INFO -- : [682/885] 283991=test_random_formatter I, [2024-05-13T20:16:24.637824 #242627] INFO -- : [683/885] 283991=test_helper I, [2024-05-13T20:16:24.639072 #242627] INFO -- : [684/885] 283991=test_jaro_winkler I, [2024-05-13T20:16:24.646372 #242627] INFO -- : [685/885] 283991=test_gem_safe_marshal I, [2024-05-13T20:16:24.683238 #242627] INFO -- : [686/885] 283995=test_gem_resolver_api_set I, [2024-05-13T20:16:24.746342 #242627] INFO -- : [687/885] 283995=test_config I, [2024-05-13T20:16:24.764571 #242627] INFO -- : [688/885] 283982=test_gem_resolver_vendor_set I, [2024-05-13T20:16:24.777980 #242627] INFO -- : [689/885] 283994=test_enumerable I, [2024-05-13T20:16:24.783291 #242627] INFO -- : [690/885] 283982=test_eval I, [2024-05-13T20:16:24.787274 #242627] INFO -- : [691/885] 283994=json_generator_test I, [2024-05-13T20:16:24.887162 #242627] INFO -- : [692/885] 283994=test_transcode I, [2024-05-13T20:16:25.025996 #242627] INFO -- : [693/885] 283982=test_project_sanity I, [2024-05-13T20:16:25.067998 #242627] INFO -- : [694/885] 283982=test_range I, [2024-05-13T20:16:25.104387 #242627] INFO -- : [695/885] 283994=test_constant I, [2024-05-13T20:16:25.113783 #242627] INFO -- : [696/885] 283986=test_pty I, [2024-05-13T20:16:25.162340 #242627] INFO -- : [697/885] 283991=test_dup I, [2024-05-13T20:16:25.191034 #242627] INFO -- : [698/885] 283996=command_line_test I, [2024-05-13T20:16:25.200532 #242627] INFO -- : [699/885] 283996=test_gem_uri_formatter I, [2024-05-13T20:16:25.218926 #242627] INFO -- : [700/885] 283996=test_helper I, [2024-05-13T20:16:25.220136 #242627] INFO -- : [701/885] 283996=test_erb_command I, [2024-05-13T20:16:25.248406 #242627] INFO -- : [702/885] 284001=test_encoding I, [2024-05-13T20:16:25.250533 #242627] INFO -- : [703/885] 283996=test_ts I, [2024-05-13T20:16:25.268175 #242627] INFO -- : [704/885] 283995=test_ensured I, [2024-05-13T20:16:25.311818 #242627] INFO -- : [705/885] 283995=library_symbols_test I, [2024-05-13T20:16:25.316846 #242627] INFO -- : [706/885] 283995=test_locale I, [2024-05-13T20:16:25.330661 #242627] INFO -- : [707/885] 283991=test_addr I, [2024-05-13T20:16:25.341520 #242627] INFO -- : [708/885] 283991=test_rdoc_ri_paths I, [2024-05-13T20:16:25.363807 #242627] INFO -- : [709/885] 283991=test_vm_dump I, [2024-05-13T20:16:25.366735 #242627] INFO -- : [710/885] 283991=test_rdoc_markup_document I, [2024-05-13T20:16:25.375773 #242627] INFO -- : [711/885] 283991=test_integer_comb I, [2024-05-13T20:16:25.408193 #242627] INFO -- : [712/885] 283995=test_tmpdir I, [2024-05-13T20:16:25.470055 #242627] INFO -- : [713/885] 284001=errors_test I, [2024-05-13T20:16:25.481503 #242627] INFO -- : [714/885] 283988=test_gem_commands_check_command I, [2024-05-13T20:16:25.483437 #242627] INFO -- : [715/885] 283995=test_regexp I, [2024-05-13T20:16:25.500639 #242627] INFO -- : [716/885] 283988=static_inspect_test I, [2024-05-13T20:16:25.503521 #242627] INFO -- : [717/885] 283988=test_data_error I, [2024-05-13T20:16:25.540594 #242627] INFO -- : [718/885] 284001=bom_test I, [2024-05-13T20:16:25.542102 #242627] INFO -- : [719/885] 283986=test_file I, [2024-05-13T20:16:25.547997 #242627] INFO -- : [720/885] 284001=test_force_exit I, [2024-05-13T20:16:25.582630 #242627] INFO -- : [721/885] 283990=test_ostruct I, [2024-05-13T20:16:25.585031 #242627] INFO -- : [722/885] 283988=unescape_test I, [2024-05-13T20:16:25.596691 #242627] INFO -- : [723/885] 284000=test_udp I, [2024-05-13T20:16:25.601668 #242627] INFO -- : [724/885] 284000=test_date_arith I, [2024-05-13T20:16:25.609416 #242627] INFO -- : [725/885] 284000=test_ruby_lex I, [2024-05-13T20:16:25.660104 #242627] INFO -- : [726/885] 284001=test_object I, [2024-05-13T20:16:25.672905 #242627] INFO -- : [727/885] 283996=test_gem_local_remote_options I, [2024-05-13T20:16:25.703370 #242627] INFO -- : [728/885] 283996=test_sleep I, [2024-05-13T20:16:25.715700 #242627] INFO -- : [729/885] 283990=test_change_word I, [2024-05-13T20:16:25.736747 #242627] INFO -- : [730/885] 283990=compiler_test I, [2024-05-13T20:16:25.737557 #242627] INFO -- : [731/885] 284000=test_flip I, [2024-05-13T20:16:25.745363 #242627] INFO -- : [732/885] 283990=test_timeout I, [2024-05-13T20:16:25.747562 #242627] INFO -- : [733/885] 283990=test_ossl I, [2024-05-13T20:16:25.762109 #242627] INFO -- : [734/885] 284000=test_normalize I, [2024-05-13T20:16:25.762924 #242627] INFO -- : [735/885] 284000=test_rdoc_rd_block_parser I, [2024-05-13T20:16:25.808052 #242627] INFO -- : [736/885] 284000=test_signedness I, [2024-05-13T20:16:25.892602 #242627] INFO -- : [737/885] 283982=test_tsort I, [2024-05-13T20:16:25.943236 #242627] INFO -- : [738/885] 283982=test_ractor I, [2024-05-13T20:16:25.976739 #242627] INFO -- : [739/885] 283982=test_type I, [2024-05-13T20:16:25.989786 #242627] INFO -- : [740/885] 283982=test_pointer I, [2024-05-13T20:16:26.007335 #242627] INFO -- : [741/885] 284001=test_func I, [2024-05-13T20:16:26.090599 #242627] INFO -- : [742/885] 283989=test_big5 I, [2024-05-13T20:16:26.101687 #242627] INFO -- : [743/885] 283989=version_test I, [2024-05-13T20:16:26.188194 #242627] INFO -- : [744/885] 283989=test_cgi_header I, [2024-05-13T20:16:26.190387 #242627] INFO -- : [745/885] 283989=heredoc_dedent_test I, [2024-05-13T20:16:26.197950 #242627] INFO -- : [746/885] 283989=test_object I, [2024-05-13T20:16:26.202676 #242627] INFO -- : [747/885] 283989=test_arithmetic_sequence I, [2024-05-13T20:16:26.224786 #242627] INFO -- : [748/885] 283989=test_key_actor_emacs I, [2024-05-13T20:16:26.349319 #242627] INFO -- : [749/885] 283989=test_gem_gemcutter_utilities I, [2024-05-13T20:16:26.599767 #242627] INFO -- : [750/885] 283988=test_basicinstructions I, [2024-05-13T20:16:26.640349 #242627] INFO -- : [751/885] 283982=test_gem_command_manager I, [2024-05-13T20:16:26.648730 #242627] INFO -- : [752/885] 283988=test_logger I, [2024-05-13T20:16:26.662323 #242627] INFO -- : [753/885] 283988=test_file_exhaustive I, [2024-05-13T20:16:26.663073 #242627] INFO -- : [754/885] 283984=test_gem_update_suggestion I, [2024-05-13T20:16:26.730359 #242627] INFO -- : [755/885] 283989=test_files_test I, [2024-05-13T20:16:26.801397 #242627] INFO -- : [756/885] 283982=test_rdoc_parser_markdown I, [2024-05-13T20:16:26.804900 #242627] INFO -- : [757/885] 283989=test_import I, [2024-05-13T20:16:26.822137 #242627] INFO -- : [758/885] 283982=test_gem_resolver_lock_set I, [2024-05-13T20:16:26.844548 #242627] INFO -- : [759/885] 283982=test_not I, [2024-05-13T20:16:26.848345 #242627] INFO -- : [760/885] 283982=test_date_strptime I, [2024-05-13T20:16:26.939634 #242627] INFO -- : [761/885] 283984=test_gem_package_task I, [2024-05-13T20:16:26.942558 #242627] INFO -- : [762/885] 283984=test_placearg I, [2024-05-13T20:16:27.011138 #242627] INFO -- : [763/885] 283982=test_rdoc_markup_hard_break I, [2024-05-13T20:16:27.019114 #242627] INFO -- : [764/885] 283982=test_gem_platform I, [2024-05-13T20:16:27.078022 #242627] INFO -- : [765/885] 283984=test_pkey_rsa I, [2024-05-13T20:16:27.136421 #242627] INFO -- : [766/885] 283982=test_weakkeymap I, [2024-05-13T20:16:27.140071 #242627] INFO -- : [767/885] 284001=test_gem_commands_push_command I, [2024-05-13T20:16:27.173541 #242627] INFO -- : [768/885] 283991=test_numhash I, [2024-05-13T20:16:27.180443 #242627] INFO -- : [769/885] 283991=test_fd_setsize I, [2024-05-13T20:16:27.181629 #242627] INFO -- : [770/885] 283991=test_continuation I, [2024-05-13T20:16:27.186641 #242627] INFO -- : [771/885] 283991=test_class_name_check I, [2024-05-13T20:16:27.189593 #242627] INFO -- : [772/885] 283994=test_keyword I, [2024-05-13T20:16:27.209184 #242627] INFO -- : [773/885] 283991=test_delete I, [2024-05-13T20:16:27.217520 #242627] INFO -- : [774/885] 283991=test_win32ole_method I, [2024-05-13T20:16:27.222944 #242627] INFO -- : [775/885] 283991=test_pkcs7 I, [2024-05-13T20:16:27.261262 #242627] INFO -- : [776/885] 283984=test_gem_resolver_requirement_list I, [2024-05-13T20:16:27.265210 #242627] INFO -- : [777/885] 283984=test_arith_seq_beg_len_step I, [2024-05-13T20:16:27.309218 #242627] INFO -- : [778/885] 283984=test_function_entry I, [2024-05-13T20:16:27.311381 #242627] INFO -- : [779/885] 283984=ruby_api_test I, [2024-05-13T20:16:27.335024 #242627] INFO -- : [780/885] 283982=test_find_executable I, [2024-05-13T20:16:27.339035 #242627] INFO -- : [781/885] 283982=test_coder I, [2024-05-13T20:16:27.346776 #242627] INFO -- : [782/885] 283982=test_symbol I, [2024-05-13T20:16:27.361437 #242627] INFO -- : [783/885] 283991=test_gem_commands_pristine_command I, [2024-05-13T20:16:27.539167 #242627] INFO -- : [784/885] 284001=test_context I, [2024-05-13T20:16:27.577561 #242627] INFO -- : [785/885] 283984=test_nofree I, [2024-05-13T20:16:27.583587 #242627] INFO -- : [786/885] 283984=test_unix I, [2024-05-13T20:16:27.616321 #242627] INFO -- : [787/885] 284001=test_lazy_enumerator I, [2024-05-13T20:16:27.621159 #242627] INFO -- : [788/885] 283984=test_enc_associate I, [2024-05-13T20:16:27.667021 #242627] INFO -- : [789/885] 283989=test_ractor_compatibility I, [2024-05-13T20:16:27.784702 #242627] INFO -- : [790/885] 283994=test_dir I, [2024-05-13T20:16:27.880903 #242627] INFO -- : [791/885] 284001=format_errors_test I, [2024-05-13T20:16:27.883458 #242627] INFO -- : [792/885] 284001=test_gem_console_ui I, [2024-05-13T20:16:27.894307 #242627] INFO -- : [793/885] 284001=test_date_ractor I, [2024-05-13T20:16:28.007276 #242627] INFO -- : [794/885] 283994=test_autoconf I, [2024-05-13T20:16:28.011479 #242627] INFO -- : [795/885] 283994=test_eval I, [2024-05-13T20:16:28.014525 #242627] INFO -- : [796/885] 283994=test_numeric I, [2024-05-13T20:16:28.023874 #242627] INFO -- : [797/885] 283994=test_member I, [2024-05-13T20:16:28.031505 #242627] INFO -- : [798/885] 283994=test_cgi_multipart I, [2024-05-13T20:16:28.107866 #242627] INFO -- : [799/885] 284001=test_word I, [2024-05-13T20:16:28.108151 #242627] INFO -- : [800/885] 284001=test_gem_commands_cleanup_command I, [2024-05-13T20:16:28.141912 #242627] INFO -- : [801/885] 283989=test_rdoc_generator_darkfish I, [2024-05-13T20:16:28.163448 #242627] INFO -- : [802/885] 283984=test_rdoc_comment I, [2024-05-13T20:16:28.188115 #242627] INFO -- : [803/885] 283994=test_resize I, [2024-05-13T20:16:28.205061 #242627] INFO -- : [804/885] 283994=test_error_highlight I, [2024-05-13T20:16:28.232004 #242627] INFO -- : [805/885] 283984=test_http_request I, [2024-05-13T20:16:28.303983 #242627] INFO -- : [806/885] 283984=json_generic_object_test I, [2024-05-13T20:16:28.315534 #242627] INFO -- : [807/885] 284000=test_gem_source_fetch_problem I, [2024-05-13T20:16:28.320272 #242627] INFO -- : [808/885] 283984=test_coderange I, [2024-05-13T20:16:28.323705 #242627] INFO -- : [809/885] 283984=location_test I, [2024-05-13T20:16:28.328181 #242627] INFO -- : [810/885] 284000=test_symbol I, [2024-05-13T20:16:28.332324 #242627] INFO -- : [811/885] 284000=test_mailto I, [2024-05-13T20:16:28.338454 #242627] INFO -- : [812/885] 284000=test_rdoc_extend I, [2024-05-13T20:16:28.346205 #242627] INFO -- : [813/885] 283984=test_merge_keys I, [2024-05-13T20:16:28.374437 #242627] INFO -- : [814/885] 283984=test_gem_resolver_api_specification I, [2024-05-13T20:16:28.408125 #242627] INFO -- : [815/885] 283984=test_win32ole_variant I, [2024-05-13T20:16:28.412267 #242627] INFO -- : [816/885] 283984=test_ipaddr I, [2024-05-13T20:16:28.432805 #242627] INFO -- : [817/885] 283984=test_history I, [2024-05-13T20:16:28.438583 #242627] INFO -- : [818/885] 284000=test_mixed_unicode_escapes I, [2024-05-13T20:16:28.444531 #242627] INFO -- : [819/885] 284000=test_rdoc_markup_to_ansi I, [2024-05-13T20:16:28.454357 #242627] INFO -- : [820/885] 283991=test_bignum I, [2024-05-13T20:16:28.475162 #242627] INFO -- : [821/885] 284000=test_rdoc_class_module I, [2024-05-13T20:16:28.475908 #242627] INFO -- : [822/885] 283984=test_gem_ci_detector I, [2024-05-13T20:16:28.480894 #242627] INFO -- : [823/885] 283984=test_win32ole_variable I, [2024-05-13T20:16:28.482752 #242627] INFO -- : [824/885] 283984=test_arity I, [2024-05-13T20:16:28.490331 #242627] INFO -- : [825/885] 283984=test_stringio I, [2024-05-13T20:16:28.492675 #242627] INFO -- : [826/885] 283989=test_io_wait_uncommon I, [2024-05-13T20:16:28.499781 #242627] INFO -- : [827/885] 283989=ractor_test I, [2024-05-13T20:16:28.543750 #242627] INFO -- : [828/885] 283991=test_trace I, [2024-05-13T20:16:28.561807 #242627] INFO -- : [829/885] 283991=test_rdoc_generator_json_index I, [2024-05-13T20:16:28.563357 #242627] INFO -- : [830/885] 283989=test_time_tz I, [2024-05-13T20:16:28.595625 #242627] INFO -- : [831/885] 283991=test_win32ole_event I, [2024-05-13T20:16:28.602301 #242627] INFO -- : [832/885] 283989=test_have_macro I, [2024-05-13T20:16:28.607224 #242627] INFO -- : [833/885] 283991=test_resolve_symbol I, [2024-05-13T20:16:28.636608 #242627] INFO -- : [834/885] 283984=test_complex2 I, [2024-05-13T20:16:28.656919 #242627] INFO -- : [835/885] 283984=test_gem_package I, [2024-05-13T20:16:28.680616 #242627] INFO -- : [836/885] 283991=test_gem_specification I, [2024-05-13T20:16:28.728222 #242627] INFO -- : [837/885] 284001=test_enum I, [2024-05-13T20:16:28.738882 #242627] INFO -- : [838/885] 283994=test_threadgroup I, [2024-05-13T20:16:28.826982 #242627] INFO -- : [839/885] 283997=test_ssl I, [2024-05-13T20:16:28.948917 #242627] INFO -- : [840/885] 283992=test_my_integer I, [2024-05-13T20:16:28.953515 #242627] INFO -- : [841/885] 283992=json_ext_parser_test I, [2024-05-13T20:16:28.955664 #242627] INFO -- : [842/885] 283989=test_thread I, [2024-05-13T20:16:28.970059 #242627] INFO -- : [843/885] 283992=test_debugger_integration I, [2024-05-13T20:16:28.989230 #242627] INFO -- : [844/885] 283992=test_rendering I, [2024-05-13T20:16:28.995589 #242627] INFO -- : [845/885] 283992=test_ractor I, [2024-05-13T20:16:29.115188 #242627] INFO -- : [846/885] 284000=test_alias I, [2024-05-13T20:16:29.271383 #242627] INFO -- : [847/885] 283992=test_timeout I, [2024-05-13T20:16:29.294024 #242627] INFO -- : [848/885] 284000=test_marshal I, [2024-05-13T20:16:29.314257 #242627] INFO -- : [849/885] 283997=test_unicode_normalize I, [2024-05-13T20:16:29.357097 #242627] INFO -- : [850/885] 283984=test_weakref I, [2024-05-13T20:16:29.486213 #242627] INFO -- : [851/885] 283984=test_nonblock I, [2024-05-13T20:16:29.494381 #242627] INFO -- : [852/885] 283984=test_rb_str_dup I, [2024-05-13T20:16:29.496957 #242627] INFO -- : [853/885] 283984=test_reline_key I, [2024-05-13T20:16:29.499924 #242627] INFO -- : [854/885] 283984=test_ancdata I, [2024-05-13T20:16:29.501241 #242627] INFO -- : [855/885] 283984=test_singleton_function I, [2024-05-13T20:16:29.504626 #242627] INFO -- : [856/885] 283984=test_cgi_core I, [2024-05-13T20:16:29.514517 #242627] INFO -- : [857/885] 283984=test_parser I, [2024-05-13T20:16:29.520402 #242627] INFO -- : [858/885] 283984=parse_stream_test I, [2024-05-13T20:16:29.522729 #242627] INFO -- : [859/885] 283984=test_registry I, [2024-05-13T20:16:29.524705 #242627] INFO -- : [860/885] 283984=test_gem_source_lock I, [2024-05-13T20:16:29.550529 #242627] INFO -- : [861/885] 283984=test_gem I, [2024-05-13T20:16:29.554746 #242627] INFO -- : [862/885] 284001=test_ractor I, [2024-05-13T20:16:29.582914 #242627] INFO -- : [863/885] 284001=test_gem_commands_open_command I, [2024-05-13T20:16:29.684025 #242627] INFO -- : [864/885] 284001=test_dns I, [2024-05-13T20:16:29.719518 #242627] INFO -- : [865/885] 283983=test_env I, [2024-05-13T20:16:29.750266 #242627] INFO -- : [866/885] 283994=test_rdoc_attr I, [2024-05-13T20:16:29.761117 #242627] INFO -- : [867/885] 283994=test_dryrun I, [2024-05-13T20:16:29.788593 #242627] INFO -- : [868/885] 283994=test_integer I, [2024-05-13T20:16:29.855384 #242627] INFO -- : [869/885] 283994=desugar_compiler_test I, [2024-05-13T20:16:29.879837 #242627] INFO -- : [870/885] 283982=test_gem_commands_setup_command I, [2024-05-13T20:16:29.960764 #242627] INFO -- : [871/885] 283994=test_super I, [2024-05-13T20:16:30.018551 #242627] INFO -- : [872/885] 284000=test_rubyoptions I, [2024-05-13T20:16:30.120183 #242627] INFO -- : [873/885] 283992=test_cgi_modruby I, [2024-05-13T20:16:30.126536 #242627] INFO -- : [874/885] 284001=test_integer I, [2024-05-13T20:16:30.137933 #242627] INFO -- : [875/885] 283992=test_call I, [2024-05-13T20:16:30.195484 #242627] INFO -- : [876/885] 283982=test_https_proxy I, [2024-05-13T20:16:30.233161 #242627] INFO -- : [877/885] 283982=test_rubygems I, [2024-05-13T20:16:30.261670 #242627] INFO -- : [878/885] 283992=test_stat I, [2024-05-13T20:16:30.267219 #242627] INFO -- : [879/885] 283992=test_gem_request_set_lockfile_tokenizer I, [2024-05-13T20:16:30.334176 #242627] INFO -- : [880/885] 283982=test_have_func I, [2024-05-13T20:16:30.342361 #242627] INFO -- : [881/885] 283992=test_nextafter I, [2024-05-13T20:16:30.428148 #242627] INFO -- : [882/885] 283992=test_capacity I, [2024-05-13T20:16:30.430497 #242627] INFO -- : [883/885] 283992=test_object_references I, [2024-05-13T20:16:30.443444 #242627] INFO -- : [884/885] 283992=test_usrmarshal I, [2024-05-13T20:16:30.684701 #242627] INFO -- : [885/885] 283992=test_gem_resolver_git_specification I, [2024-05-13T20:16:49.758686 #242627] INFO -- : Finished tests in 38.641977s, 682.5738 tests/s, 242087.6110 assertions/s. E, [2024-05-13T20:16:49.758925 #242627] ERROR -- : Children under /tmp/rubytest.16orqk: E, [2024-05-13T20:16:49.758960 #242627] ERROR -- : * drwx------ 4 80 2024-05-13 20:16:21 +0000 gem_rebuild20240513-283999-hywnf6/ E, [2024-05-13T20:16:49.758968 #242627] ERROR -- : * drwxrwxr-x 2 60 2024-05-13 20:16:21 +0000 new/ E, [2024-05-13T20:16:49.758972 #242627] ERROR -- : * -rw-rw-r-- 1 4096 2024-05-13 20:16:21 +0000 rebuild_test_gem-1.0.0.gem E, [2024-05-13T20:16:49.758978 #242627] ERROR -- : * drwxrwxr-x 2 60 2024-05-13 20:16:21 +0000 old/ E, [2024-05-13T20:16:49.758982 #242627] ERROR -- : * -rw-rw-r-- 1 4096 2024-05-13 20:16:21 +0000 rebuild_test_gem-1.0.0.gem I, [2024-05-13T20:16:49.760177 #242627] INFO -- : 26376 tests, 9354744 assertions, 0 failures, 0 errors, 306 skips I, [2024-05-13T20:16:49.760200 #242627] INFO -- : I, [2024-05-13T20:16:49.760208 #242627] INFO -- : ruby -v: ruby 3.4.0dev (2024-05-13T18:04:55Z master 5319587ac3) [x86_64-linux] I, [2024-05-13T20:16:49.762287 #242627] INFO -- : $$$[end] "make yes-test-all TESTOPTS='--stderr-on-failure' TESTS='-j20'" exit with 0. I, [2024-05-13T20:16:49.762508 #242627] INFO -- : $$$[beg] make yes-test-rubyspec MSPECOPT='--error-output stderr --debug -j' TESTS='-j20' I, [2024-05-13T20:16:49.849273 #242627] INFO -- : BASERUBY = /usr/bin/ruby --disable=gems I, [2024-05-13T20:16:49.849312 #242627] INFO -- : CC = gcc I, [2024-05-13T20:16:49.849318 #242627] INFO -- : LD = ld I, [2024-05-13T20:16:49.849332 #242627] INFO -- : LDSHARED = gcc -shared I, [2024-05-13T20:16:49.849337 #242627] INFO -- : CFLAGS = -O3 -fno-fast-math -ggdb3 -Wall -Wextra -Wdeprecated-declarations -Wdiv-by-zero -Wduplicated-cond -Wimplicit-function-declaration -Wimplicit-int -Wpointer-arith -Wwrite-strings -Wold-style-definition -Wimplicit-fallthrough=0 -Wmissing-noreturn -Wno-cast-function-type -Wno-constant-logical-operand -Wno-long-long -Wno-missing-field-initializers -Wno-overlength-strings -Wno-packed-bitfield-compat -Wno-parentheses-equality -Wno-self-assign -Wno-tautological-compare -Wno-unused-parameter -Wno-unused-value -Wsuggest-attribute=format -Wsuggest-attribute=noreturn -Wunused-variable -Wmisleading-indentation -Wundef -fPIC I, [2024-05-13T20:16:49.849341 #242627] INFO -- : XCFLAGS = -U_FORTIFY_SOURCE -D_FORTIFY_SOURCE=2 -fstack-protector-strong -fno-strict-overflow -fvisibility=hidden -fexcess-precision=standard -DRUBY_EXPORT -I. -I.ext/include/x86_64-linux -I/tmp/ruby/src/trunk/include -I/tmp/ruby/src/trunk -I/tmp/ruby/src/trunk/prism -I/tmp/ruby/src/trunk/enc/unicode/15.0.0 I, [2024-05-13T20:16:49.849345 #242627] INFO -- : CPPFLAGS = I, [2024-05-13T20:16:49.849349 #242627] INFO -- : DLDFLAGS = -Wl,--compress-debug-sections=zlib -Wl,-soname,libruby.so.3.4 -fstack-protector-strong I, [2024-05-13T20:16:49.849353 #242627] INFO -- : SOLIBS = -lz -lrt -lrt -lgmp -ldl -lcrypt -lm -lpthread I, [2024-05-13T20:16:49.849356 #242627] INFO -- : LANG = en_US.UTF-8 I, [2024-05-13T20:16:49.849360 #242627] INFO -- : LC_ALL = I, [2024-05-13T20:16:49.849363 #242627] INFO -- : LC_CTYPE = I, [2024-05-13T20:16:49.849367 #242627] INFO -- : MFLAGS = I, [2024-05-13T20:16:49.849370 #242627] INFO -- : RUSTC = no I, [2024-05-13T20:16:49.849374 #242627] INFO -- : YJIT_RUSTC_ARGS = --crate-name=yjit --crate-type=staticlib --edition=2021 -g -C lto=thin -C opt-level=3 -C overflow-checks=on '--out-dir=/tmp/ruby/build/trunk/yjit/target/release/' /tmp/ruby/src/trunk/yjit/src/lib.rs I, [2024-05-13T20:16:49.849906 #242627] INFO -- : gcc (Ubuntu 11.4.0-1ubuntu1~22.04) 11.4.0 I, [2024-05-13T20:16:49.849927 #242627] INFO -- : Copyright (C) 2021 Free Software Foundation, Inc. I, [2024-05-13T20:16:49.849934 #242627] INFO -- : This is free software; see the source for copying conditions. There is NO I, [2024-05-13T20:16:49.849938 #242627] INFO -- : warranty; not even for MERCHANTABILITY or FITNESS FOR A PARTICULAR PURPOSE. I, [2024-05-13T20:16:49.849942 #242627] INFO -- : I, [2024-05-13T20:16:49.851545 #242627] INFO -- : generating enc.mk I, [2024-05-13T20:16:49.969561 #242627] INFO -- : making enc I, [2024-05-13T20:16:49.986787 #242627] INFO -- : make[1]: Entering directory '/tmp/ruby/build/trunk' I, [2024-05-13T20:16:49.986814 #242627] INFO -- : make[1]: Nothing to be done for 'enc'. I, [2024-05-13T20:16:49.986821 #242627] INFO -- : make[1]: Leaving directory '/tmp/ruby/build/trunk' I, [2024-05-13T20:16:49.987384 #242627] INFO -- : making srcs under enc I, [2024-05-13T20:16:50.017470 #242627] INFO -- : make[1]: Entering directory '/tmp/ruby/build/trunk' I, [2024-05-13T20:16:50.017492 #242627] INFO -- : make[1]: Nothing to be done for 'srcs'. I, [2024-05-13T20:16:50.017498 #242627] INFO -- : make[1]: Leaving directory '/tmp/ruby/build/trunk' I, [2024-05-13T20:16:50.018346 #242627] INFO -- : generating transdb.h I, [2024-05-13T20:16:50.114341 #242627] INFO -- : transdb.h unchanged I, [2024-05-13T20:16:50.115482 #242627] INFO -- : making trans I, [2024-05-13T20:16:50.149195 #242627] INFO -- : make[1]: Entering directory '/tmp/ruby/build/trunk' I, [2024-05-13T20:16:50.149216 #242627] INFO -- : make[1]: Nothing to be done for 'trans'. I, [2024-05-13T20:16:50.149221 #242627] INFO -- : make[1]: Leaving directory '/tmp/ruby/build/trunk' I, [2024-05-13T20:16:50.149866 #242627] INFO -- : making encs I, [2024-05-13T20:16:50.187543 #242627] INFO -- : make[1]: Entering directory '/tmp/ruby/build/trunk' I, [2024-05-13T20:16:50.187564 #242627] INFO -- : make[1]: Nothing to be done for 'encs'. I, [2024-05-13T20:16:50.187578 #242627] INFO -- : make[1]: Leaving directory '/tmp/ruby/build/trunk' I, [2024-05-13T20:16:50.189270 #242627] INFO -- : generating makefiles ext/configure-ext.mk I, [2024-05-13T20:16:50.216873 #242627] INFO -- : ext/configure-ext.mk updated I, [2024-05-13T20:16:50.219360 #242627] INFO -- : make[1]: Entering directory '/tmp/ruby/build/trunk' I, [2024-05-13T20:16:51.566962 #242627] INFO -- : make[1]: Leaving directory '/tmp/ruby/build/trunk' I, [2024-05-13T20:16:51.567616 #242627] INFO -- : generating makefile exts.mk I, [2024-05-13T20:16:51.603864 #242627] INFO -- : exts.mk unchanged I, [2024-05-13T20:16:51.608222 #242627] INFO -- : make[1]: Entering directory '/tmp/ruby/build/trunk' I, [2024-05-13T20:16:51.950175 #242627] INFO -- : make[2]: Entering directory '/tmp/ruby/build/trunk/ext/coverage' I, [2024-05-13T20:16:51.954075 #242627] INFO -- : make[2]: Leaving directory '/tmp/ruby/build/trunk/ext/coverage' I, [2024-05-13T20:16:51.959457 #242627] INFO -- : make[2]: Entering directory '/tmp/ruby/build/trunk/ext/date' I, [2024-05-13T20:16:51.964489 #242627] INFO -- : make[2]: Leaving directory '/tmp/ruby/build/trunk/ext/date' I, [2024-05-13T20:16:51.968288 #242627] INFO -- : make[2]: Entering directory '/tmp/ruby/build/trunk/ext/digest' I, [2024-05-13T20:16:51.977131 #242627] INFO -- : make[2]: Leaving directory '/tmp/ruby/build/trunk/ext/digest' I, [2024-05-13T20:16:52.003462 #242627] INFO -- : make[2]: Entering directory '/tmp/ruby/build/trunk/ext/digest/sha2' I, [2024-05-13T20:16:52.008230 #242627] INFO -- : make[2]: Leaving directory '/tmp/ruby/build/trunk/ext/digest/sha2' I, [2024-05-13T20:16:52.030025 #242627] INFO -- : make[2]: Entering directory '/tmp/ruby/build/trunk/ext/fiddle' I, [2024-05-13T20:16:52.040826 #242627] INFO -- : make[2]: Leaving directory '/tmp/ruby/build/trunk/ext/fiddle' I, [2024-05-13T20:16:52.045776 #242627] INFO -- : make[2]: Entering directory '/tmp/ruby/build/trunk/ext/io/console' I, [2024-05-13T20:16:52.049958 #242627] INFO -- : make[2]: Leaving directory '/tmp/ruby/build/trunk/ext/io/console' I, [2024-05-13T20:16:52.062654 #242627] INFO -- : make[2]: Entering directory '/tmp/ruby/build/trunk/ext/json' I, [2024-05-13T20:16:52.073190 #242627] INFO -- : make[2]: Leaving directory '/tmp/ruby/build/trunk/ext/json' I, [2024-05-13T20:16:52.088344 #242627] INFO -- : make[2]: Entering directory '/tmp/ruby/build/trunk/ext/monitor' I, [2024-05-13T20:16:52.092368 #242627] INFO -- : make[2]: Leaving directory '/tmp/ruby/build/trunk/ext/monitor' I, [2024-05-13T20:16:52.099542 #242627] INFO -- : make[2]: Entering directory '/tmp/ruby/build/trunk/ext/objspace' I, [2024-05-13T20:16:52.105633 #242627] INFO -- : make[2]: Leaving directory '/tmp/ruby/build/trunk/ext/objspace' I, [2024-05-13T20:16:52.123304 #242627] INFO -- : make[2]: Entering directory '/tmp/ruby/build/trunk/ext/openssl' I, [2024-05-13T20:16:52.136322 #242627] INFO -- : make[2]: Leaving directory '/tmp/ruby/build/trunk/ext/openssl' I, [2024-05-13T20:16:52.139213 #242627] INFO -- : make[2]: Entering directory '/tmp/ruby/build/trunk/ext/pathname' I, [2024-05-13T20:16:52.141917 #242627] INFO -- : make[2]: Leaving directory '/tmp/ruby/build/trunk/ext/pathname' I, [2024-05-13T20:16:52.145977 #242627] INFO -- : make[2]: Entering directory '/tmp/ruby/build/trunk/ext/psych' I, [2024-05-13T20:16:52.166400 #242627] INFO -- : make[2]: Leaving directory '/tmp/ruby/build/trunk/ext/psych' I, [2024-05-13T20:16:52.171012 #242627] INFO -- : make[2]: Entering directory '/tmp/ruby/build/trunk/ext/pty' I, [2024-05-13T20:16:52.175118 #242627] INFO -- : make[2]: Leaving directory '/tmp/ruby/build/trunk/ext/pty' I, [2024-05-13T20:16:52.191410 #242627] INFO -- : make[2]: Entering directory '/tmp/ruby/build/trunk/ext/ripper' I, [2024-05-13T20:16:52.198844 #242627] INFO -- : make[2]: Leaving directory '/tmp/ruby/build/trunk/ext/ripper' I, [2024-05-13T20:16:52.201338 #242627] INFO -- : make[2]: Entering directory '/tmp/ruby/build/trunk/ext/rubyvm' I, [2024-05-13T20:16:52.204563 #242627] INFO -- : make[2]: Leaving directory '/tmp/ruby/build/trunk/ext/rubyvm' I, [2024-05-13T20:16:52.216819 #242627] INFO -- : make[2]: Entering directory '/tmp/ruby/build/trunk/ext/socket' I, [2024-05-13T20:16:52.226750 #242627] INFO -- : make[2]: Leaving directory '/tmp/ruby/build/trunk/ext/socket' I, [2024-05-13T20:16:52.245238 #242627] INFO -- : make[2]: Entering directory '/tmp/ruby/build/trunk/.bundle/gems/bigdecimal-3.1.8/ext/bigdecimal' I, [2024-05-13T20:16:52.272075 #242627] INFO -- : make[2]: Leaving directory '/tmp/ruby/build/trunk/.bundle/gems/bigdecimal-3.1.8/ext/bigdecimal' I, [2024-05-13T20:16:52.274083 #242627] INFO -- : make[2]: Entering directory '/tmp/ruby/build/trunk/.bundle/gems/debug-1.9.2/ext/debug' I, [2024-05-13T20:16:52.295402 #242627] INFO -- : make[2]: Leaving directory '/tmp/ruby/build/trunk/.bundle/gems/debug-1.9.2/ext/debug' I, [2024-05-13T20:16:52.297163 #242627] INFO -- : make[2]: Entering directory '/tmp/ruby/build/trunk/.bundle/gems/nkf-0.2.0/ext/nkf' I, [2024-05-13T20:16:52.321656 #242627] INFO -- : make[2]: Leaving directory '/tmp/ruby/build/trunk/.bundle/gems/nkf-0.2.0/ext/nkf' I, [2024-05-13T20:16:52.323725 #242627] INFO -- : make[2]: Entering directory '/tmp/ruby/build/trunk/.bundle/gems/racc-1.7.3/ext/racc/cparse' I, [2024-05-13T20:16:52.344869 #242627] INFO -- : make[2]: Leaving directory '/tmp/ruby/build/trunk/.bundle/gems/racc-1.7.3/ext/racc/cparse' I, [2024-05-13T20:16:52.347388 #242627] INFO -- : make[2]: Entering directory '/tmp/ruby/build/trunk/.bundle/gems/rbs-3.4.4/ext/rbs_extension' I, [2024-05-13T20:16:52.368519 #242627] INFO -- : make[2]: Leaving directory '/tmp/ruby/build/trunk/.bundle/gems/rbs-3.4.4/ext/rbs_extension' I, [2024-05-13T20:16:52.370635 #242627] INFO -- : make[2]: Entering directory '/tmp/ruby/build/trunk/.bundle/gems/syslog-0.1.2/ext/syslog' I, [2024-05-13T20:16:52.391777 #242627] INFO -- : make[2]: Leaving directory '/tmp/ruby/build/trunk/.bundle/gems/syslog-0.1.2/ext/syslog' I, [2024-05-13T20:16:52.415114 #242627] INFO -- : make[2]: Entering directory '/tmp/ruby/build/trunk' I, [2024-05-13T20:16:52.481766 #242627] INFO -- : make[2]: 'ruby' is up to date. I, [2024-05-13T20:16:52.481811 #242627] INFO -- : make[2]: Leaving directory '/tmp/ruby/build/trunk' I, [2024-05-13T20:16:52.482078 #242627] INFO -- : make[1]: Leaving directory '/tmp/ruby/build/trunk' I, [2024-05-13T20:16:52.485699 #242627] INFO -- : make[1]: Entering directory '/tmp/ruby/build/trunk' I, [2024-05-13T20:16:52.485724 #242627] INFO -- : make[1]: Nothing to be done for 'note'. I, [2024-05-13T20:16:52.485731 #242627] INFO -- : make[1]: Leaving directory '/tmp/ruby/build/trunk' E, [2024-05-13T20:16:52.542189 #242627] ERROR -- : $ /tmp/ruby/build/trunk/miniruby -I/tmp/ruby/src/trunk/lib /tmp/ruby/src/trunk/tool/runruby.rb --archdir=/tmp/ruby/build/trunk --extout=.ext -- /tmp/ruby/src/trunk/spec/mspec/bin/mspec-run -B /tmp/ruby/src/trunk/spec/default.mspec --error-output stderr --debug -fy -o /tmp/rubytest.3mmu0p/1-mspec-multi-0 E, [2024-05-13T20:16:52.542402 #242627] ERROR -- : $ /tmp/ruby/build/trunk/miniruby -I/tmp/ruby/src/trunk/lib /tmp/ruby/src/trunk/tool/runruby.rb --archdir=/tmp/ruby/build/trunk --extout=.ext -- /tmp/ruby/src/trunk/spec/mspec/bin/mspec-run -B /tmp/ruby/src/trunk/spec/default.mspec --error-output stderr --debug -fy -o /tmp/rubytest.3mmu0p/2-mspec-multi-1 E, [2024-05-13T20:16:52.542692 #242627] ERROR -- : $ /tmp/ruby/build/trunk/miniruby -I/tmp/ruby/src/trunk/lib /tmp/ruby/src/trunk/tool/runruby.rb --archdir=/tmp/ruby/build/trunk --extout=.ext -- /tmp/ruby/src/trunk/spec/mspec/bin/mspec-run -B /tmp/ruby/src/trunk/spec/default.mspec --error-output stderr --debug -fy -o /tmp/rubytest.3mmu0p/3-mspec-multi-2 E, [2024-05-13T20:16:52.542971 #242627] ERROR -- : $ /tmp/ruby/build/trunk/miniruby -I/tmp/ruby/src/trunk/lib /tmp/ruby/src/trunk/tool/runruby.rb --archdir=/tmp/ruby/build/trunk --extout=.ext -- /tmp/ruby/src/trunk/spec/mspec/bin/mspec-run -B /tmp/ruby/src/trunk/spec/default.mspec --error-output stderr --debug -fy -o /tmp/rubytest.3mmu0p/4-mspec-multi-3 E, [2024-05-13T20:16:52.543181 #242627] ERROR -- : $ /tmp/ruby/build/trunk/miniruby -I/tmp/ruby/src/trunk/lib /tmp/ruby/src/trunk/tool/runruby.rb --archdir=/tmp/ruby/build/trunk --extout=.ext -- /tmp/ruby/src/trunk/spec/mspec/bin/mspec-run -B /tmp/ruby/src/trunk/spec/default.mspec --error-output stderr --debug -fy -o /tmp/rubytest.3mmu0p/5-mspec-multi-4 E, [2024-05-13T20:16:52.543287 #242627] ERROR -- : $ /tmp/ruby/build/trunk/miniruby -I/tmp/ruby/src/trunk/lib /tmp/ruby/src/trunk/tool/runruby.rb --archdir=/tmp/ruby/build/trunk --extout=.ext -- /tmp/ruby/src/trunk/spec/mspec/bin/mspec-run -B /tmp/ruby/src/trunk/spec/default.mspec --error-output stderr --debug -fy -o /tmp/rubytest.3mmu0p/6-mspec-multi-5 E, [2024-05-13T20:16:52.543633 #242627] ERROR -- : $ /tmp/ruby/build/trunk/miniruby -I/tmp/ruby/src/trunk/lib /tmp/ruby/src/trunk/tool/runruby.rb --archdir=/tmp/ruby/build/trunk --extout=.ext -- /tmp/ruby/src/trunk/spec/mspec/bin/mspec-run -B /tmp/ruby/src/trunk/spec/default.mspec --error-output stderr --debug -fy -o /tmp/rubytest.3mmu0p/7-mspec-multi-6 E, [2024-05-13T20:16:52.543900 #242627] ERROR -- : $ /tmp/ruby/build/trunk/miniruby -I/tmp/ruby/src/trunk/lib /tmp/ruby/src/trunk/tool/runruby.rb --archdir=/tmp/ruby/build/trunk --extout=.ext -- /tmp/ruby/src/trunk/spec/mspec/bin/mspec-run -B /tmp/ruby/src/trunk/spec/default.mspec --error-output stderr --debug -fy -o /tmp/rubytest.3mmu0p/8-mspec-multi-7 E, [2024-05-13T20:16:52.544254 #242627] ERROR -- : $ /tmp/ruby/build/trunk/miniruby -I/tmp/ruby/src/trunk/lib /tmp/ruby/src/trunk/tool/runruby.rb --archdir=/tmp/ruby/build/trunk --extout=.ext -- /tmp/ruby/src/trunk/spec/mspec/bin/mspec-run -B /tmp/ruby/src/trunk/spec/default.mspec --error-output stderr --debug -fy -o /tmp/rubytest.3mmu0p/9-mspec-multi-8 E, [2024-05-13T20:16:52.544617 #242627] ERROR -- : $ /tmp/ruby/build/trunk/miniruby -I/tmp/ruby/src/trunk/lib /tmp/ruby/src/trunk/tool/runruby.rb --archdir=/tmp/ruby/build/trunk --extout=.ext -- /tmp/ruby/src/trunk/spec/mspec/bin/mspec-run -B /tmp/ruby/src/trunk/spec/default.mspec --error-output stderr --debug -fy -o /tmp/rubytest.3mmu0p/10-mspec-multi-9 E, [2024-05-13T20:16:52.544907 #242627] ERROR -- : $ /tmp/ruby/build/trunk/miniruby -I/tmp/ruby/src/trunk/lib /tmp/ruby/src/trunk/tool/runruby.rb --archdir=/tmp/ruby/build/trunk --extout=.ext -- /tmp/ruby/src/trunk/spec/mspec/bin/mspec-run -B /tmp/ruby/src/trunk/spec/default.mspec --error-output stderr --debug -fy -o /tmp/rubytest.3mmu0p/11-mspec-multi-10 E, [2024-05-13T20:16:52.545183 #242627] ERROR -- : $ /tmp/ruby/build/trunk/miniruby -I/tmp/ruby/src/trunk/lib /tmp/ruby/src/trunk/tool/runruby.rb --archdir=/tmp/ruby/build/trunk --extout=.ext -- /tmp/ruby/src/trunk/spec/mspec/bin/mspec-run -B /tmp/ruby/src/trunk/spec/default.mspec --error-output stderr --debug -fy -o /tmp/rubytest.3mmu0p/12-mspec-multi-11 E, [2024-05-13T20:16:52.545470 #242627] ERROR -- : $ /tmp/ruby/build/trunk/miniruby -I/tmp/ruby/src/trunk/lib /tmp/ruby/src/trunk/tool/runruby.rb --archdir=/tmp/ruby/build/trunk --extout=.ext -- /tmp/ruby/src/trunk/spec/mspec/bin/mspec-run -B /tmp/ruby/src/trunk/spec/default.mspec --error-output stderr --debug -fy -o /tmp/rubytest.3mmu0p/13-mspec-multi-12 E, [2024-05-13T20:16:52.545743 #242627] ERROR -- : $ /tmp/ruby/build/trunk/miniruby -I/tmp/ruby/src/trunk/lib /tmp/ruby/src/trunk/tool/runruby.rb --archdir=/tmp/ruby/build/trunk --extout=.ext -- /tmp/ruby/src/trunk/spec/mspec/bin/mspec-run -B /tmp/ruby/src/trunk/spec/default.mspec --error-output stderr --debug -fy -o /tmp/rubytest.3mmu0p/14-mspec-multi-13 E, [2024-05-13T20:16:52.545926 #242627] ERROR -- : $ /tmp/ruby/build/trunk/miniruby -I/tmp/ruby/src/trunk/lib /tmp/ruby/src/trunk/tool/runruby.rb --archdir=/tmp/ruby/build/trunk --extout=.ext -- /tmp/ruby/src/trunk/spec/mspec/bin/mspec-run -B /tmp/ruby/src/trunk/spec/default.mspec --error-output stderr --debug -fy -o /tmp/rubytest.3mmu0p/15-mspec-multi-14 E, [2024-05-13T20:16:52.546121 #242627] ERROR -- : $ /tmp/ruby/build/trunk/miniruby -I/tmp/ruby/src/trunk/lib /tmp/ruby/src/trunk/tool/runruby.rb --archdir=/tmp/ruby/build/trunk --extout=.ext -- /tmp/ruby/src/trunk/spec/mspec/bin/mspec-run -B /tmp/ruby/src/trunk/spec/default.mspec --error-output stderr --debug -fy -o /tmp/rubytest.3mmu0p/16-mspec-multi-15 E, [2024-05-13T20:16:52.546318 #242627] ERROR -- : $ /tmp/ruby/build/trunk/miniruby -I/tmp/ruby/src/trunk/lib /tmp/ruby/src/trunk/tool/runruby.rb --archdir=/tmp/ruby/build/trunk --extout=.ext -- /tmp/ruby/src/trunk/spec/mspec/bin/mspec-run -B /tmp/ruby/src/trunk/spec/default.mspec --error-output stderr --debug -fy -o /tmp/rubytest.3mmu0p/17-mspec-multi-16 E, [2024-05-13T20:16:52.546497 #242627] ERROR -- : $ /tmp/ruby/build/trunk/miniruby -I/tmp/ruby/src/trunk/lib /tmp/ruby/src/trunk/tool/runruby.rb --archdir=/tmp/ruby/build/trunk --extout=.ext -- /tmp/ruby/src/trunk/spec/mspec/bin/mspec-run -B /tmp/ruby/src/trunk/spec/default.mspec --error-output stderr --debug -fy -o /tmp/rubytest.3mmu0p/18-mspec-multi-17 E, [2024-05-13T20:16:52.549455 #242627] ERROR -- : $ /tmp/ruby/build/trunk/miniruby -I/tmp/ruby/src/trunk/lib /tmp/ruby/src/trunk/tool/runruby.rb --archdir=/tmp/ruby/build/trunk --extout=.ext -- /tmp/ruby/src/trunk/spec/mspec/bin/mspec-run -B /tmp/ruby/src/trunk/spec/default.mspec --error-output stderr --debug -fy -o /tmp/rubytest.3mmu0p/19-mspec-multi-18 E, [2024-05-13T20:16:52.549732 #242627] ERROR -- : $ /tmp/ruby/build/trunk/miniruby -I/tmp/ruby/src/trunk/lib /tmp/ruby/src/trunk/tool/runruby.rb --archdir=/tmp/ruby/build/trunk --extout=.ext -- /tmp/ruby/src/trunk/spec/mspec/bin/mspec-run -B /tmp/ruby/src/trunk/spec/default.mspec --error-output stderr --debug -fy -o /tmp/rubytest.3mmu0p/20-mspec-multi-19 I, [2024-05-13T20:16:52.726455 #242627] INFO -- : ruby 3.4.0dev (2024-05-13T18:04:55Z master 5319587ac3) [x86_64-linux] I, [2024-05-13T20:16:53.341199 #242627] INFO -- : 0 ......................................................................... I, [2024-05-13T20:16:53.740223 #242627] INFO -- : 73 ......................................................................... I, [2024-05-13T20:16:53.869874 #242627] INFO -- : 146 ......................................................................... I, [2024-05-13T20:16:53.920968 #242627] INFO -- : 219 ......................................................................... I, [2024-05-13T20:16:53.972064 #242627] INFO -- : 292 ......................................................................... I, [2024-05-13T20:16:54.014877 #242627] INFO -- : 365 ......................................................................... I, [2024-05-13T20:16:54.038191 #242627] INFO -- : 438 ......................................................................... I, [2024-05-13T20:16:54.052805 #242627] INFO -- : 511 ......................................................................... I, [2024-05-13T20:16:54.069351 #242627] INFO -- : 584 ......................................................................... I, [2024-05-13T20:16:54.127010 #242627] INFO -- : 657 ......................................................................... I, [2024-05-13T20:16:54.154634 #242627] INFO -- : 730 ......................................................................... I, [2024-05-13T20:16:54.173820 #242627] INFO -- : 803 ......................................................................... I, [2024-05-13T20:16:54.205908 #242627] INFO -- : 876 ......................................................................... I, [2024-05-13T20:16:54.250573 #242627] INFO -- : 949 ......................................................................... I, [2024-05-13T20:16:54.359001 #242627] INFO -- : 1022 ......................................................................... I, [2024-05-13T20:16:54.497111 #242627] INFO -- : 1095 ......................................................................... I, [2024-05-13T20:16:54.615406 #242627] INFO -- : 1168 ......................................................................... I, [2024-05-13T20:16:54.678024 #242627] INFO -- : 1241 ......................................................................... I, [2024-05-13T20:16:54.725519 #242627] INFO -- : 1314 ......................................................................... I, [2024-05-13T20:16:54.742460 #242627] INFO -- : 1387 ......................................................................... I, [2024-05-13T20:16:54.823280 #242627] INFO -- : 1460 ......................................................................... I, [2024-05-13T20:16:55.324859 #242627] INFO -- : 1533 ......................................................................... I, [2024-05-13T20:16:55.373554 #242627] INFO -- : 1606 ......................................................................... I, [2024-05-13T20:16:55.459008 #242627] INFO -- : 1679 ......................................................................... I, [2024-05-13T20:16:55.573034 #242627] INFO -- : 1752 ......................................................................... I, [2024-05-13T20:16:55.668541 #242627] INFO -- : 1825 ......................................................................... I, [2024-05-13T20:16:55.762877 #242627] INFO -- : 1898 ......................................................................... I, [2024-05-13T20:16:55.840796 #242627] INFO -- : 1971 ......................................................................... I, [2024-05-13T20:16:55.918240 #242627] INFO -- : 2044 ......................................................................... I, [2024-05-13T20:16:55.966372 #242627] INFO -- : 2117 ......................................................................... I, [2024-05-13T20:16:55.978883 #242627] INFO -- : 2190 ......................................................................... I, [2024-05-13T20:16:55.996729 #242627] INFO -- : 2263 ......................................................................... I, [2024-05-13T20:16:56.011763 #242627] INFO -- : 2336 ......................................................................... I, [2024-05-13T20:16:56.050151 #242627] INFO -- : 2409 ......................................................................... I, [2024-05-13T20:16:56.155879 #242627] INFO -- : 2482 ......................................................................... I, [2024-05-13T20:16:56.184818 #242627] INFO -- : 2555 ......................................................................... I, [2024-05-13T20:16:56.283942 #242627] INFO -- : 2628 ......................................................................... I, [2024-05-13T20:16:56.381304 #242627] INFO -- : 2701 ......................................................................... I, [2024-05-13T20:16:56.411743 #242627] INFO -- : 2774 ......................................................................... I, [2024-05-13T20:16:56.472340 #242627] INFO -- : 2847 ......................................................................... I, [2024-05-13T20:16:56.504261 #242627] INFO -- : 2920 ......................................................................... I, [2024-05-13T20:16:56.528935 #242627] INFO -- : 2993 ......................................................................... I, [2024-05-13T20:16:56.547035 #242627] INFO -- : 3066 ......................................................................... I, [2024-05-13T20:16:56.560505 #242627] INFO -- : 3139 ......................................................................... I, [2024-05-13T20:16:56.570098 #242627] INFO -- : 3212 ......................................................................... I, [2024-05-13T20:16:56.597820 #242627] INFO -- : 3285 ......................................................................... I, [2024-05-13T20:17:00.572854 #242627] INFO -- : 3358 ........................................................................ I, [2024-05-13T20:17:00.572933 #242627] INFO -- : I, [2024-05-13T20:17:00.572947 #242627] INFO -- : Finished in 8.029839 seconds I, [2024-05-13T20:17:00.572959 #242627] INFO -- : I, [2024-05-13T20:17:00.572970 #242627] INFO -- : 3429 files, 32611 examples, 196049 expectations, 0 failures, 0 errors, 0 tagged I, [2024-05-13T20:17:00.575122 #242627] INFO -- : $$$[end] "make yes-test-rubyspec MSPECOPT='--error-output stderr --debug -j' TESTS='-j20'" exit with 0.