# Logfile created on 2024-05-13 06:02:02 +0000 by logger.rb/v1.4.3 I, [2024-05-13T06:02:02.818439 #373899] INFO -- : #, @formatter=nil, @logdev=#, @binmode=false, @mon_data=#, @mon_data_owner_object_id=860>>> I, [2024-05-13T06:02:02.818562 #373899] INFO -- : $$$[beg] make update-unicode -j20 I, [2024-05-13T06:02:02.877730 #373899] INFO -- : Downloading Unicode emoji 15.0 files... I, [2024-05-13T06:02:02.877949 #373899] INFO -- : Downloading Unicode emoji 15.0 files... I, [2024-05-13T06:02:02.878349 #373899] INFO -- : Downloading Unicode emoji 15.0 files... I, [2024-05-13T06:02:02.920076 #373899] INFO -- : made symlink emoji/15.0/emoji-sequences.txt to /tmp/ruby/src/trunk/.downloaded-cache/emoji/15.0/emoji-sequences.txt I, [2024-05-13T06:02:02.920186 #373899] INFO -- : downloading emoji/15.0/emoji-test.txt ... /tmp/ruby/src/trunk/enc/unicode/data/emoji/15.0/emoji-sequences.txt already exists I, [2024-05-13T06:02:02.920349 #373899] INFO -- : downloading emoji/15.0/emoji-test.txt ... /tmp/ruby/src/trunk/enc/unicode/data/emoji/15.0/emoji-sequences.txt already exists E, [2024-05-13T06:02:03.369183 #373899] ERROR -- : /tmp/ruby/src/trunk/tool/downloader.rb:302:in `rescue in download': failed to download emoji/15.0/emoji-test.txt (RuntimeError) E, [2024-05-13T06:02:03.369333 #373899] ERROR -- : OpenURI::HTTPError: 403 Forbidden: https://www.unicode.org/Public/emoji/15.0/emoji-test.txt E, [2024-05-13T06:02:03.369359 #373899] ERROR -- : from /tmp/ruby/src/trunk/tool/downloader.rb:201:in `download' E, [2024-05-13T06:02:03.369373 #373899] ERROR -- : from /tmp/ruby/src/trunk/tool/downloader.rb:136:in `download' E, [2024-05-13T06:02:03.369386 #373899] ERROR -- : from /tmp/ruby/src/trunk/tool/downloader.rb:482:in `block in
' E, [2024-05-13T06:02:03.369398 #373899] ERROR -- : from /tmp/ruby/src/trunk/tool/downloader.rb:465:in `each' E, [2024-05-13T06:02:03.369411 #373899] ERROR -- : from /tmp/ruby/src/trunk/tool/downloader.rb:465:in `
' E, [2024-05-13T06:02:03.369423 #373899] ERROR -- : /usr/lib/ruby/3.0.0/open-uri.rb:364:in `open_http': 403 Forbidden (OpenURI::HTTPError) E, [2024-05-13T06:02:03.369434 #373899] ERROR -- : from /usr/lib/ruby/3.0.0/open-uri.rb:741:in `buffer_open' E, [2024-05-13T06:02:03.369449 #373899] ERROR -- : from /usr/lib/ruby/3.0.0/open-uri.rb:212:in `block in open_loop' E, [2024-05-13T06:02:03.369461 #373899] ERROR -- : from /usr/lib/ruby/3.0.0/open-uri.rb:210:in `catch' E, [2024-05-13T06:02:03.369473 #373899] ERROR -- : from /usr/lib/ruby/3.0.0/open-uri.rb:210:in `open_loop' E, [2024-05-13T06:02:03.369484 #373899] ERROR -- : from /usr/lib/ruby/3.0.0/open-uri.rb:151:in `open_uri' E, [2024-05-13T06:02:03.369496 #373899] ERROR -- : from /usr/lib/ruby/3.0.0/open-uri.rb:721:in `open' E, [2024-05-13T06:02:03.369507 #373899] ERROR -- : from /usr/lib/ruby/3.0.0/open-uri.rb:729:in `read' E, [2024-05-13T06:02:03.369538 #373899] ERROR -- : from /tmp/ruby/src/trunk/tool/downloader.rb:247:in `block in download' E, [2024-05-13T06:02:03.369551 #373899] ERROR -- : from /tmp/ruby/src/trunk/tool/downloader.rb:378:in `with_retry' E, [2024-05-13T06:02:03.369562 #373899] ERROR -- : from /tmp/ruby/src/trunk/tool/downloader.rb:246:in `download' E, [2024-05-13T06:02:03.369578 #373899] ERROR -- : from /tmp/ruby/src/trunk/tool/downloader.rb:136:in `download' E, [2024-05-13T06:02:03.369590 #373899] ERROR -- : from /tmp/ruby/src/trunk/tool/downloader.rb:482:in `block in
' E, [2024-05-13T06:02:03.369602 #373899] ERROR -- : from /tmp/ruby/src/trunk/tool/downloader.rb:465:in `each' E, [2024-05-13T06:02:03.369613 #373899] ERROR -- : from /tmp/ruby/src/trunk/tool/downloader.rb:465:in `
' E, [2024-05-13T06:02:03.373722 #373899] ERROR -- : make: *** [uncommon.mk:1765: /tmp/ruby/src/trunk/enc/unicode/data/emoji/15.0/emoji-test.txt] Error 1 E, [2024-05-13T06:02:03.373781 #373899] ERROR -- : make: *** Waiting for unfinished jobs.... E, [2024-05-13T06:02:03.387772 #373899] ERROR -- : /tmp/ruby/src/trunk/tool/downloader.rb:302:in `rescue in download': failed to download emoji/15.0/emoji-test.txt (RuntimeError) E, [2024-05-13T06:02:03.387863 #373899] ERROR -- : OpenURI::HTTPError: 403 Forbidden: https://www.unicode.org/Public/emoji/15.0/emoji-test.txt E, [2024-05-13T06:02:03.387881 #373899] ERROR -- : from /tmp/ruby/src/trunk/tool/downloader.rb:201:in `download' E, [2024-05-13T06:02:03.387893 #373899] ERROR -- : from /tmp/ruby/src/trunk/tool/downloader.rb:136:in `download' E, [2024-05-13T06:02:03.387903 #373899] ERROR -- : from /tmp/ruby/src/trunk/tool/downloader.rb:482:in `block in
' E, [2024-05-13T06:02:03.387914 #373899] ERROR -- : from /tmp/ruby/src/trunk/tool/downloader.rb:465:in `each' E, [2024-05-13T06:02:03.387925 #373899] ERROR -- : from /tmp/ruby/src/trunk/tool/downloader.rb:465:in `
' E, [2024-05-13T06:02:03.387936 #373899] ERROR -- : /usr/lib/ruby/3.0.0/open-uri.rb:364:in `open_http': 403 Forbidden (OpenURI::HTTPError) E, [2024-05-13T06:02:03.387948 #373899] ERROR -- : from /usr/lib/ruby/3.0.0/open-uri.rb:741:in `buffer_open' E, [2024-05-13T06:02:03.387962 #373899] ERROR -- : from /usr/lib/ruby/3.0.0/open-uri.rb:212:in `block in open_loop' E, [2024-05-13T06:02:03.387973 #373899] ERROR -- : from /usr/lib/ruby/3.0.0/open-uri.rb:210:in `catch' E, [2024-05-13T06:02:03.387984 #373899] ERROR -- : from /usr/lib/ruby/3.0.0/open-uri.rb:210:in `open_loop' E, [2024-05-13T06:02:03.387994 #373899] ERROR -- : from /usr/lib/ruby/3.0.0/open-uri.rb:151:in `open_uri' E, [2024-05-13T06:02:03.388005 #373899] ERROR -- : from /usr/lib/ruby/3.0.0/open-uri.rb:721:in `open' E, [2024-05-13T06:02:03.388015 #373899] ERROR -- : from /usr/lib/ruby/3.0.0/open-uri.rb:729:in `read' E, [2024-05-13T06:02:03.388026 #373899] ERROR -- : from /tmp/ruby/src/trunk/tool/downloader.rb:247:in `block in download' E, [2024-05-13T06:02:03.388037 #373899] ERROR -- : from /tmp/ruby/src/trunk/tool/downloader.rb:378:in `with_retry' E, [2024-05-13T06:02:03.388050 #373899] ERROR -- : from /tmp/ruby/src/trunk/tool/downloader.rb:246:in `download' E, [2024-05-13T06:02:03.388060 #373899] ERROR -- : from /tmp/ruby/src/trunk/tool/downloader.rb:136:in `download' E, [2024-05-13T06:02:03.388071 #373899] ERROR -- : from /tmp/ruby/src/trunk/tool/downloader.rb:482:in `block in
' E, [2024-05-13T06:02:03.388082 #373899] ERROR -- : from /tmp/ruby/src/trunk/tool/downloader.rb:465:in `each' E, [2024-05-13T06:02:03.388099 #373899] ERROR -- : from /tmp/ruby/src/trunk/tool/downloader.rb:465:in `
' E, [2024-05-13T06:02:03.392166 #373899] ERROR -- : make: *** [uncommon.mk:1765: /tmp/ruby/src/trunk/enc/unicode/data/emoji/15.0/emoji-zwj-sequences.txt] Error 1 E, [2024-05-13T06:02:03.408390 #373899] ERROR -- : /tmp/ruby/src/trunk/tool/downloader.rb:302:in `rescue in download': failed to download emoji/15.0/emoji-test.txt (RuntimeError) E, [2024-05-13T06:02:03.408482 #373899] ERROR -- : OpenURI::HTTPError: 403 Forbidden: https://www.unicode.org/Public/emoji/15.0/emoji-test.txt E, [2024-05-13T06:02:03.408520 #373899] ERROR -- : from /tmp/ruby/src/trunk/tool/downloader.rb:201:in `download' E, [2024-05-13T06:02:03.408532 #373899] ERROR -- : from /tmp/ruby/src/trunk/tool/downloader.rb:136:in `download' E, [2024-05-13T06:02:03.408544 #373899] ERROR -- : from /tmp/ruby/src/trunk/tool/downloader.rb:482:in `block in
' E, [2024-05-13T06:02:03.408559 #373899] ERROR -- : from /tmp/ruby/src/trunk/tool/downloader.rb:465:in `each' E, [2024-05-13T06:02:03.408571 #373899] ERROR -- : from /tmp/ruby/src/trunk/tool/downloader.rb:465:in `
' E, [2024-05-13T06:02:03.408583 #373899] ERROR -- : /usr/lib/ruby/3.0.0/open-uri.rb:364:in `open_http': 403 Forbidden (OpenURI::HTTPError) E, [2024-05-13T06:02:03.408595 #373899] ERROR -- : from /usr/lib/ruby/3.0.0/open-uri.rb:741:in `buffer_open' E, [2024-05-13T06:02:03.408610 #373899] ERROR -- : from /usr/lib/ruby/3.0.0/open-uri.rb:212:in `block in open_loop' E, [2024-05-13T06:02:03.408622 #373899] ERROR -- : from /usr/lib/ruby/3.0.0/open-uri.rb:210:in `catch' E, [2024-05-13T06:02:03.408633 #373899] ERROR -- : from /usr/lib/ruby/3.0.0/open-uri.rb:210:in `open_loop' E, [2024-05-13T06:02:03.408645 #373899] ERROR -- : from /usr/lib/ruby/3.0.0/open-uri.rb:151:in `open_uri' E, [2024-05-13T06:02:03.408656 #373899] ERROR -- : from /usr/lib/ruby/3.0.0/open-uri.rb:721:in `open' E, [2024-05-13T06:02:03.408904 #373899] ERROR -- : from /usr/lib/ruby/3.0.0/open-uri.rb:729:in `read' E, [2024-05-13T06:02:03.408917 #373899] ERROR -- : from /tmp/ruby/src/trunk/tool/downloader.rb:247:in `block in download' E, [2024-05-13T06:02:03.408937 #373899] ERROR -- : from /tmp/ruby/src/trunk/tool/downloader.rb:378:in `with_retry' E, [2024-05-13T06:02:03.408949 #373899] ERROR -- : from /tmp/ruby/src/trunk/tool/downloader.rb:246:in `download' E, [2024-05-13T06:02:03.408960 #373899] ERROR -- : from /tmp/ruby/src/trunk/tool/downloader.rb:136:in `download' E, [2024-05-13T06:02:03.408972 #373899] ERROR -- : from /tmp/ruby/src/trunk/tool/downloader.rb:482:in `block in
' E, [2024-05-13T06:02:03.408984 #373899] ERROR -- : from /tmp/ruby/src/trunk/tool/downloader.rb:465:in `each' E, [2024-05-13T06:02:03.408995 #373899] ERROR -- : from /tmp/ruby/src/trunk/tool/downloader.rb:465:in `
' E, [2024-05-13T06:02:03.412907 #373899] ERROR -- : make: *** [uncommon.mk:1765: /tmp/ruby/src/trunk/enc/unicode/data/emoji/15.0/emoji-sequences.txt] Error 1 E, [2024-05-13T06:02:03.412966 #373899] ERROR -- : make: *** Deleting file '/tmp/ruby/src/trunk/enc/unicode/data/emoji/15.0/emoji-sequences.txt' I, [2024-05-13T06:02:03.413019 #373899] INFO -- : downloading emoji/15.0/emoji-test.txt ... I, [2024-05-13T06:02:03.413447 #373899] INFO -- : $$$[end] "make update-unicode -j20" exit with 512. I, [2024-05-13T06:02:03.413524 #373899] INFO -- : $$$[beg] make update-download -j20 I, [2024-05-13T06:02:03.528889 #373899] INFO -- : tool/config.guess already exists I, [2024-05-13T06:02:03.528927 #373899] INFO -- : tool/config.sub already exists I, [2024-05-13T06:02:03.531054 #373899] INFO -- : Update minitest to ea9caafc0754b1d6236a490d59e624b53209734a I, [2024-05-13T06:02:03.531095 #373899] INFO -- : Update power_assert to 84e85124c5014a139af39161d484156cfe87a9ed I, [2024-05-13T06:02:03.531369 #373899] INFO -- : Update rbs to ba7872795d5de04adb8ff500c0e6afdc81a041dd I, [2024-05-13T06:02:03.531989 #373899] INFO -- : Update typeprof to b19a6416da3a05d57fadd6ffdadb382b6d236ca5 I, [2024-05-13T06:02:03.532287 #373899] INFO -- : echo ea9caafc0754b1d6236a490d59e624b53209734a | /bin/sh /tmp/ruby/src/trunk/tool/ifchange /tmp/ruby/src/trunk/.bundle/.timestamp/minitest.revision - I, [2024-05-13T06:02:03.532563 #373899] INFO -- : echo ba7872795d5de04adb8ff500c0e6afdc81a041dd | /bin/sh /tmp/ruby/src/trunk/tool/ifchange /tmp/ruby/src/trunk/.bundle/.timestamp/rbs.revision - I, [2024-05-13T06:02:03.532758 #373899] INFO -- : echo 84e85124c5014a139af39161d484156cfe87a9ed | /bin/sh /tmp/ruby/src/trunk/tool/ifchange /tmp/ruby/src/trunk/.bundle/.timestamp/power_assert.revision - I, [2024-05-13T06:02:03.533135 #373899] INFO -- : echo b19a6416da3a05d57fadd6ffdadb382b6d236ca5 | /bin/sh /tmp/ruby/src/trunk/tool/ifchange /tmp/ruby/src/trunk/.bundle/.timestamp/typeprof.revision - I, [2024-05-13T06:02:03.534436 #373899] INFO -- : /tmp/ruby/src/trunk/.bundle/.timestamp/rbs.revision unchanged I, [2024-05-13T06:02:03.534456 #373899] INFO -- : /tmp/ruby/src/trunk/.bundle/.timestamp/minitest.revision unchanged I, [2024-05-13T06:02:03.534902 #373899] INFO -- : /tmp/ruby/src/trunk/.bundle/.timestamp/power_assert.revision unchanged I, [2024-05-13T06:02:03.535001 #373899] INFO -- : /tmp/ruby/src/trunk/.bundle/.timestamp/typeprof.revision unchanged I, [2024-05-13T06:02:03.535879 #373899] INFO -- : Building power_assert@84e85124c5014a139af39161d484156cfe87a9ed to /tmp/ruby/src/trunk/gems/power_assert-2.0.3.gem I, [2024-05-13T06:02:03.604784 #373899] INFO -- : Successfully built RubyGem I, [2024-05-13T06:02:03.604848 #373899] INFO -- : Name: power_assert I, [2024-05-13T06:02:03.604875 #373899] INFO -- : Version: 2.0.4dev I, [2024-05-13T06:02:03.604891 #373899] INFO -- : File: power_assert-2.0.4dev.gem I, [2024-05-13T06:02:03.650944 #373899] INFO -- : $$$[end] "make update-download -j20" exit with 0. I, [2024-05-13T06:02:03.650983 #373899] INFO -- : $$$[beg] make update-rubyspec -j20 I, [2024-05-13T06:02:03.709557 #373899] INFO -- : make: Nothing to be done for 'update-rubyspec'. I, [2024-05-13T06:02:03.709959 #373899] INFO -- : $$$[end] "make update-rubyspec -j20" exit with 0. I, [2024-05-13T06:02:03.709995 #373899] INFO -- : $$$[beg] make update-src -j20 I, [2024-05-13T06:02:04.380632 #373899] INFO -- : Already up to date. I, [2024-05-13T06:02:04.398961 #373899] INFO -- : Latest commit hash = 3c16d93cd3 I, [2024-05-13T06:02:04.400717 #373899] INFO -- : $$$[end] "make update-src -j20" exit with 0. I, [2024-05-13T06:02:04.400795 #373899] INFO -- : $$$[beg] make after-update -j20 I, [2024-05-13T06:02:04.483158 #373899] INFO -- : generating /tmp/ruby/src/trunk/ext/ripper/eventids2table.c I, [2024-05-13T06:02:04.487444 #373899] INFO -- : make[1]: Entering directory '/tmp/ruby/src/trunk/ext/ripper' I, [2024-05-13T06:02:04.487465 #373899] INFO -- : make[1]: Nothing to be done for 'src'. I, [2024-05-13T06:02:04.487471 #373899] INFO -- : make[1]: Leaving directory '/tmp/ruby/src/trunk/ext/ripper' I, [2024-05-13T06:02:04.506074 #373899] INFO -- : /tmp/ruby/src/trunk/revision.h updated I, [2024-05-13T06:02:04.507379 #373899] INFO -- : generating x86_64-linux-fake.rb I, [2024-05-13T06:02:04.558093 #373899] INFO -- : x86_64-linux-fake.rb updated I, [2024-05-13T06:02:04.559303 #373899] INFO -- : generating enc.mk I, [2024-05-13T06:02:04.676764 #373899] INFO -- : making srcs under enc I, [2024-05-13T06:02:04.706654 #373899] INFO -- : make[1]: Entering directory '/tmp/ruby/build/trunk' I, [2024-05-13T06:02:04.706681 #373899] INFO -- : make[1]: Nothing to be done for 'srcs'. I, [2024-05-13T06:02:04.706688 #373899] INFO -- : make[1]: Leaving directory '/tmp/ruby/build/trunk' I, [2024-05-13T06:02:04.752329 #373899] INFO -- : Update minitest to ea9caafc0754b1d6236a490d59e624b53209734a I, [2024-05-13T06:02:04.752640 #373899] INFO -- : Update power_assert to 84e85124c5014a139af39161d484156cfe87a9ed I, [2024-05-13T06:02:04.753475 #373899] INFO -- : Update rbs to ba7872795d5de04adb8ff500c0e6afdc81a041dd I, [2024-05-13T06:02:04.753625 #373899] INFO -- : Update typeprof to b19a6416da3a05d57fadd6ffdadb382b6d236ca5 I, [2024-05-13T06:02:04.754157 #373899] INFO -- : echo ea9caafc0754b1d6236a490d59e624b53209734a | /bin/sh /tmp/ruby/src/trunk/tool/ifchange /tmp/ruby/src/trunk/.bundle/.timestamp/minitest.revision - I, [2024-05-13T06:02:04.754335 #373899] INFO -- : echo 84e85124c5014a139af39161d484156cfe87a9ed | /bin/sh /tmp/ruby/src/trunk/tool/ifchange /tmp/ruby/src/trunk/.bundle/.timestamp/power_assert.revision - I, [2024-05-13T06:02:04.755726 #373899] INFO -- : echo ba7872795d5de04adb8ff500c0e6afdc81a041dd | /bin/sh /tmp/ruby/src/trunk/tool/ifchange /tmp/ruby/src/trunk/.bundle/.timestamp/rbs.revision - I, [2024-05-13T06:02:04.756194 #373899] INFO -- : echo b19a6416da3a05d57fadd6ffdadb382b6d236ca5 | /bin/sh /tmp/ruby/src/trunk/tool/ifchange /tmp/ruby/src/trunk/.bundle/.timestamp/typeprof.revision - I, [2024-05-13T06:02:04.756498 #373899] INFO -- : /tmp/ruby/src/trunk/.bundle/.timestamp/minitest.revision unchanged I, [2024-05-13T06:02:04.756523 #373899] INFO -- : /tmp/ruby/src/trunk/.bundle/.timestamp/power_assert.revision unchanged I, [2024-05-13T06:02:04.757769 #373899] INFO -- : Building power_assert@84e85124c5014a139af39161d484156cfe87a9ed to /tmp/ruby/src/trunk/gems/power_assert-2.0.3.gem I, [2024-05-13T06:02:04.757793 #373899] INFO -- : /tmp/ruby/src/trunk/.bundle/.timestamp/rbs.revision unchanged I, [2024-05-13T06:02:04.758267 #373899] INFO -- : /tmp/ruby/src/trunk/.bundle/.timestamp/typeprof.revision unchanged I, [2024-05-13T06:02:04.827791 #373899] INFO -- : Successfully built RubyGem I, [2024-05-13T06:02:04.827833 #373899] INFO -- : Name: power_assert I, [2024-05-13T06:02:04.827842 #373899] INFO -- : Version: 2.0.4dev I, [2024-05-13T06:02:04.827847 #373899] INFO -- : File: power_assert-2.0.4dev.gem I, [2024-05-13T06:02:04.829962 #373899] INFO -- : Extracting bundle gem power_assert-2.0.3... I, [2024-05-13T06:02:04.890931 #373899] INFO -- : Try with hash version of bundled gems instead of gems/power_assert-2.0.3.gem. We don't use this gem with release version of Ruby. I, [2024-05-13T06:02:04.895925 #373899] INFO -- : Unpacked gems/power_assert-2.0.4dev.gem I, [2024-05-13T06:02:04.897826 #373899] INFO -- : $$$[end] "make after-update -j20" exit with 0. I, [2024-05-13T06:02:04.897944 #373899] INFO -- : $$$[beg] make miniruby -j20 I, [2024-05-13T06:02:04.955443 #373899] INFO -- : BASERUBY = /usr/bin/ruby --disable=gems I, [2024-05-13T06:02:04.955490 #373899] INFO -- : CC = gcc I, [2024-05-13T06:02:04.955504 #373899] INFO -- : LD = ld I, [2024-05-13T06:02:04.955515 #373899] INFO -- : LDSHARED = gcc -shared I, [2024-05-13T06:02:04.955527 #373899] INFO -- : CFLAGS = -O3 -fno-fast-math -ggdb3 -Wall -Wextra -Wdeprecated-declarations -Wdiv-by-zero -Wduplicated-cond -Wimplicit-function-declaration -Wimplicit-int -Wpointer-arith -Wwrite-strings -Wold-style-definition -Wimplicit-fallthrough=0 -Wmissing-noreturn -Wno-cast-function-type -Wno-constant-logical-operand -Wno-long-long -Wno-missing-field-initializers -Wno-overlength-strings -Wno-packed-bitfield-compat -Wno-parentheses-equality -Wno-self-assign -Wno-tautological-compare -Wno-unused-parameter -Wno-unused-value -Wsuggest-attribute=format -Wsuggest-attribute=noreturn -Wunused-variable -Wmisleading-indentation -Wundef -fPIC I, [2024-05-13T06:02:04.955539 #373899] INFO -- : XCFLAGS = -U_FORTIFY_SOURCE -D_FORTIFY_SOURCE=2 -fstack-protector-strong -fno-strict-overflow -fvisibility=hidden -fexcess-precision=standard -DRUBY_EXPORT -I. -I.ext/include/x86_64-linux -I/tmp/ruby/src/trunk/include -I/tmp/ruby/src/trunk -I/tmp/ruby/src/trunk/prism -I/tmp/ruby/src/trunk/enc/unicode/15.0.0 I, [2024-05-13T06:02:04.955551 #373899] INFO -- : CPPFLAGS = I, [2024-05-13T06:02:04.955562 #373899] INFO -- : DLDFLAGS = -Wl,--compress-debug-sections=zlib -Wl,-soname,libruby.so.3.4 -fstack-protector-strong I, [2024-05-13T06:02:04.955574 #373899] INFO -- : SOLIBS = -lz -lrt -lrt -lgmp -ldl -lcrypt -lm -lpthread I, [2024-05-13T06:02:04.955585 #373899] INFO -- : LANG = en_US.UTF-8 I, [2024-05-13T06:02:04.955596 #373899] INFO -- : LC_ALL = I, [2024-05-13T06:02:04.955607 #373899] INFO -- : LC_CTYPE = I, [2024-05-13T06:02:04.955618 #373899] INFO -- : MFLAGS = -j20 --jobserver-auth=4,5 I, [2024-05-13T06:02:04.955629 #373899] INFO -- : RUSTC = no I, [2024-05-13T06:02:04.955640 #373899] INFO -- : YJIT_RUSTC_ARGS = --crate-name=yjit --crate-type=staticlib --edition=2021 -g -C lto=thin -C opt-level=3 -C overflow-checks=on '--out-dir=/tmp/ruby/build/trunk/yjit/target/release/' /tmp/ruby/src/trunk/yjit/src/lib.rs I, [2024-05-13T06:02:04.957031 #373899] INFO -- : gcc (Ubuntu 11.4.0-1ubuntu1~22.04) 11.4.0 I, [2024-05-13T06:02:04.957106 #373899] INFO -- : Copyright (C) 2021 Free Software Foundation, Inc. I, [2024-05-13T06:02:04.957123 #373899] INFO -- : This is free software; see the source for copying conditions. There is NO I, [2024-05-13T06:02:04.957137 #373899] INFO -- : warranty; not even for MERCHANTABILITY or FITNESS FOR A PARTICULAR PURPOSE. I, [2024-05-13T06:02:04.957150 #373899] INFO -- : I, [2024-05-13T06:02:04.980144 #373899] INFO -- : compiling /tmp/ruby/src/trunk/version.c I, [2024-05-13T06:02:05.081840 #373899] INFO -- : linking miniruby I, [2024-05-13T06:02:05.636507 #373899] INFO -- : $$$[end] "make miniruby -j20" exit with 0. I, [2024-05-13T06:02:05.636624 #373899] INFO -- : $$$[beg] make ruby -j20 I, [2024-05-13T06:02:05.700141 #373899] INFO -- : BASERUBY = /usr/bin/ruby --disable=gems I, [2024-05-13T06:02:05.700197 #373899] INFO -- : CC = gcc I, [2024-05-13T06:02:05.700213 #373899] INFO -- : LD = ld I, [2024-05-13T06:02:05.700232 #373899] INFO -- : LDSHARED = gcc -shared I, [2024-05-13T06:02:05.700246 #373899] INFO -- : CFLAGS = -O3 -fno-fast-math -ggdb3 -Wall -Wextra -Wdeprecated-declarations -Wdiv-by-zero -Wduplicated-cond -Wimplicit-function-declaration -Wimplicit-int -Wpointer-arith -Wwrite-strings -Wold-style-definition -Wimplicit-fallthrough=0 -Wmissing-noreturn -Wno-cast-function-type -Wno-constant-logical-operand -Wno-long-long -Wno-missing-field-initializers -Wno-overlength-strings -Wno-packed-bitfield-compat -Wno-parentheses-equality -Wno-self-assign -Wno-tautological-compare -Wno-unused-parameter -Wno-unused-value -Wsuggest-attribute=format -Wsuggest-attribute=noreturn -Wunused-variable -Wmisleading-indentation -Wundef -fPIC I, [2024-05-13T06:02:05.700260 #373899] INFO -- : XCFLAGS = -U_FORTIFY_SOURCE -D_FORTIFY_SOURCE=2 -fstack-protector-strong -fno-strict-overflow -fvisibility=hidden -fexcess-precision=standard -DRUBY_EXPORT -I. -I.ext/include/x86_64-linux -I/tmp/ruby/src/trunk/include -I/tmp/ruby/src/trunk -I/tmp/ruby/src/trunk/prism -I/tmp/ruby/src/trunk/enc/unicode/15.0.0 I, [2024-05-13T06:02:05.700272 #373899] INFO -- : CPPFLAGS = I, [2024-05-13T06:02:05.700284 #373899] INFO -- : DLDFLAGS = -Wl,--compress-debug-sections=zlib -Wl,-soname,libruby.so.3.4 -fstack-protector-strong I, [2024-05-13T06:02:05.700296 #373899] INFO -- : SOLIBS = -lz -lrt -lrt -lgmp -ldl -lcrypt -lm -lpthread I, [2024-05-13T06:02:05.700307 #373899] INFO -- : LANG = en_US.UTF-8 I, [2024-05-13T06:02:05.700319 #373899] INFO -- : LC_ALL = I, [2024-05-13T06:02:05.700330 #373899] INFO -- : LC_CTYPE = I, [2024-05-13T06:02:05.700342 #373899] INFO -- : MFLAGS = -j20 --jobserver-auth=4,5 I, [2024-05-13T06:02:05.700354 #373899] INFO -- : RUSTC = no I, [2024-05-13T06:02:05.700366 #373899] INFO -- : YJIT_RUSTC_ARGS = --crate-name=yjit --crate-type=staticlib --edition=2021 -g -C lto=thin -C opt-level=3 -C overflow-checks=on '--out-dir=/tmp/ruby/build/trunk/yjit/target/release/' /tmp/ruby/src/trunk/yjit/src/lib.rs I, [2024-05-13T06:02:05.702661 #373899] INFO -- : gcc (Ubuntu 11.4.0-1ubuntu1~22.04) 11.4.0 I, [2024-05-13T06:02:05.702711 #373899] INFO -- : Copyright (C) 2021 Free Software Foundation, Inc. I, [2024-05-13T06:02:05.702729 #373899] INFO -- : This is free software; see the source for copying conditions. There is NO I, [2024-05-13T06:02:05.702740 #373899] INFO -- : warranty; not even for MERCHANTABILITY or FITNESS FOR A PARTICULAR PURPOSE. I, [2024-05-13T06:02:05.702751 #373899] INFO -- : I, [2024-05-13T06:02:05.811802 #373899] INFO -- : builtin_binary.inc updated I, [2024-05-13T06:02:05.816279 #373899] INFO -- : c5234a9416e4f20f175185e840b25b0f08674d14078ed7083f37e655458e3ca9 builtin_binary.inc I, [2024-05-13T06:02:05.816995 #373899] INFO -- : compiling /tmp/ruby/src/trunk/builtin.c I, [2024-05-13T06:02:05.999933 #373899] INFO -- : linking static-library libruby-static.a I, [2024-05-13T06:02:06.305016 #373899] INFO -- : linking shared-library libruby.so.3.4.0 I, [2024-05-13T06:02:07.857888 #373899] INFO -- : linking ruby I, [2024-05-13T06:02:07.883887 #373899] INFO -- : $$$[end] "make ruby -j20" exit with 0. I, [2024-05-13T06:02:07.884028 #373899] INFO -- : $$$[beg] make all -j20 I, [2024-05-13T06:02:07.949191 #373899] INFO -- : BASERUBY = /usr/bin/ruby --disable=gems I, [2024-05-13T06:02:07.949255 #373899] INFO -- : CC = gcc I, [2024-05-13T06:02:07.949273 #373899] INFO -- : LD = ld I, [2024-05-13T06:02:07.949289 #373899] INFO -- : LDSHARED = gcc -shared I, [2024-05-13T06:02:07.949304 #373899] INFO -- : CFLAGS = -O3 -fno-fast-math -ggdb3 -Wall -Wextra -Wdeprecated-declarations -Wdiv-by-zero -Wduplicated-cond -Wimplicit-function-declaration -Wimplicit-int -Wpointer-arith -Wwrite-strings -Wold-style-definition -Wimplicit-fallthrough=0 -Wmissing-noreturn -Wno-cast-function-type -Wno-constant-logical-operand -Wno-long-long -Wno-missing-field-initializers -Wno-overlength-strings -Wno-packed-bitfield-compat -Wno-parentheses-equality -Wno-self-assign -Wno-tautological-compare -Wno-unused-parameter -Wno-unused-value -Wsuggest-attribute=format -Wsuggest-attribute=noreturn -Wunused-variable -Wmisleading-indentation -Wundef -fPIC I, [2024-05-13T06:02:07.949324 #373899] INFO -- : XCFLAGS = -U_FORTIFY_SOURCE -D_FORTIFY_SOURCE=2 -fstack-protector-strong -fno-strict-overflow -fvisibility=hidden -fexcess-precision=standard -DRUBY_EXPORT -I. -I.ext/include/x86_64-linux -I/tmp/ruby/src/trunk/include -I/tmp/ruby/src/trunk -I/tmp/ruby/src/trunk/prism -I/tmp/ruby/src/trunk/enc/unicode/15.0.0 I, [2024-05-13T06:02:07.949338 #373899] INFO -- : CPPFLAGS = I, [2024-05-13T06:02:07.949352 #373899] INFO -- : DLDFLAGS = -Wl,--compress-debug-sections=zlib -Wl,-soname,libruby.so.3.4 -fstack-protector-strong I, [2024-05-13T06:02:07.949366 #373899] INFO -- : SOLIBS = -lz -lrt -lrt -lgmp -ldl -lcrypt -lm -lpthread I, [2024-05-13T06:02:07.949379 #373899] INFO -- : LANG = en_US.UTF-8 I, [2024-05-13T06:02:07.949393 #373899] INFO -- : LC_ALL = I, [2024-05-13T06:02:07.949406 #373899] INFO -- : LC_CTYPE = I, [2024-05-13T06:02:07.949420 #373899] INFO -- : MFLAGS = -j20 --jobserver-auth=4,5 I, [2024-05-13T06:02:07.949434 #373899] INFO -- : RUSTC = no I, [2024-05-13T06:02:07.949450 #373899] INFO -- : YJIT_RUSTC_ARGS = --crate-name=yjit --crate-type=staticlib --edition=2021 -g -C lto=thin -C opt-level=3 -C overflow-checks=on '--out-dir=/tmp/ruby/build/trunk/yjit/target/release/' /tmp/ruby/src/trunk/yjit/src/lib.rs I, [2024-05-13T06:02:07.951606 #373899] INFO -- : gcc (Ubuntu 11.4.0-1ubuntu1~22.04) 11.4.0 I, [2024-05-13T06:02:07.951673 #373899] INFO -- : Copyright (C) 2021 Free Software Foundation, Inc. I, [2024-05-13T06:02:07.951717 #373899] INFO -- : This is free software; see the source for copying conditions. There is NO I, [2024-05-13T06:02:07.951736 #373899] INFO -- : warranty; not even for MERCHANTABILITY or FITNESS FOR A PARTICULAR PURPOSE. I, [2024-05-13T06:02:07.951752 #373899] INFO -- : I, [2024-05-13T06:02:07.982994 #373899] INFO -- : generating enc.mk I, [2024-05-13T06:02:07.984846 #373899] INFO -- : building spec/ruby/optional/capi/ext/array_spec.so I, [2024-05-13T06:02:07.985147 #373899] INFO -- : building spec/ruby/optional/capi/ext/basic_object_spec.so I, [2024-05-13T06:02:07.985941 #373899] INFO -- : building spec/ruby/optional/capi/ext/bignum_spec.so I, [2024-05-13T06:02:07.986997 #373899] INFO -- : building spec/ruby/optional/capi/ext/binding_spec.so I, [2024-05-13T06:02:07.987391 #373899] INFO -- : building spec/ruby/optional/capi/ext/boolean_spec.so I, [2024-05-13T06:02:07.988174 #373899] INFO -- : building spec/ruby/optional/capi/ext/class_id_under_autoload_spec.so I, [2024-05-13T06:02:07.989088 #373899] INFO -- : building spec/ruby/optional/capi/ext/class_spec.so I, [2024-05-13T06:02:07.989967 #373899] INFO -- : building spec/ruby/optional/capi/ext/class_under_autoload_spec.so I, [2024-05-13T06:02:07.990590 #373899] INFO -- : building spec/ruby/optional/capi/ext/complex_spec.so I, [2024-05-13T06:02:07.990899 #373899] INFO -- : building spec/ruby/optional/capi/ext/constants_spec.so I, [2024-05-13T06:02:07.991562 #373899] INFO -- : building spec/ruby/optional/capi/ext/data_spec.so I, [2024-05-13T06:02:07.991851 #373899] INFO -- : building spec/ruby/optional/capi/ext/debug_spec.so I, [2024-05-13T06:02:07.992674 #373899] INFO -- : building spec/ruby/optional/capi/ext/encoding_spec.so I, [2024-05-13T06:02:07.992974 #373899] INFO -- : building spec/ruby/optional/capi/ext/enumerator_spec.so I, [2024-05-13T06:02:07.993884 #373899] INFO -- : building spec/ruby/optional/capi/ext/exception_spec.so I, [2024-05-13T06:02:07.994599 #373899] INFO -- : building spec/ruby/optional/capi/ext/fiber_spec.so I, [2024-05-13T06:02:07.994848 #373899] INFO -- : building spec/ruby/optional/capi/ext/file_spec.so I, [2024-05-13T06:02:07.995448 #373899] INFO -- : building spec/ruby/optional/capi/ext/fixnum_spec.so I, [2024-05-13T06:02:07.995679 #373899] INFO -- : building spec/ruby/optional/capi/ext/float_spec.so I, [2024-05-13T06:02:08.118897 #373899] INFO -- : building spec/ruby/optional/capi/ext/gc_spec.so I, [2024-05-13T06:02:08.123632 #373899] INFO -- : building spec/ruby/optional/capi/ext/globals_spec.so I, [2024-05-13T06:02:08.126939 #373899] INFO -- : building spec/ruby/optional/capi/ext/hash_spec.so I, [2024-05-13T06:02:08.141877 #373899] INFO -- : building spec/ruby/optional/capi/ext/integer_spec.so I, [2024-05-13T06:02:08.144708 #373899] INFO -- : building spec/ruby/optional/capi/ext/io_spec.so I, [2024-05-13T06:02:08.152968 #373899] INFO -- : building spec/ruby/optional/capi/ext/kernel_spec.so I, [2024-05-13T06:02:08.154268 #373899] INFO -- : building spec/ruby/optional/capi/ext/language_spec.so I, [2024-05-13T06:02:08.156832 #373899] INFO -- : building spec/ruby/optional/capi/ext/marshal_spec.so I, [2024-05-13T06:02:08.162598 #373899] INFO -- : building spec/ruby/optional/capi/ext/module_spec.so I, [2024-05-13T06:02:08.163868 #373899] INFO -- : building spec/ruby/optional/capi/ext/module_under_autoload_spec.so I, [2024-05-13T06:02:08.167117 #373899] INFO -- : building spec/ruby/optional/capi/ext/mutex_spec.so I, [2024-05-13T06:02:08.173126 #373899] INFO -- : building spec/ruby/optional/capi/ext/numeric_spec.so I, [2024-05-13T06:02:08.180871 #373899] INFO -- : building spec/ruby/optional/capi/ext/object_spec.so I, [2024-05-13T06:02:08.181295 #373899] INFO -- : building spec/ruby/optional/capi/ext/proc_spec.so I, [2024-05-13T06:02:08.185972 #373899] INFO -- : building spec/ruby/optional/capi/ext/range_spec.so I, [2024-05-13T06:02:08.186499 #373899] INFO -- : building spec/ruby/optional/capi/ext/rational_spec.so I, [2024-05-13T06:02:08.231319 #373899] INFO -- : building spec/ruby/optional/capi/ext/rbasic_spec.so I, [2024-05-13T06:02:08.251865 #373899] INFO -- : building spec/ruby/optional/capi/ext/regexp_spec.so I, [2024-05-13T06:02:08.284646 #373899] INFO -- : building spec/ruby/optional/capi/ext/string_spec.so I, [2024-05-13T06:02:08.288125 #373899] INFO -- : building spec/ruby/optional/capi/ext/struct_spec.so I, [2024-05-13T06:02:08.305841 #373899] INFO -- : building spec/ruby/optional/capi/ext/st_spec.so I, [2024-05-13T06:02:08.307589 #373899] INFO -- : building spec/ruby/optional/capi/ext/symbol_spec.so I, [2024-05-13T06:02:08.310994 #373899] INFO -- : building spec/ruby/optional/capi/ext/thread_spec.so I, [2024-05-13T06:02:08.311247 #373899] INFO -- : building spec/ruby/optional/capi/ext/time_spec.so I, [2024-05-13T06:02:08.314273 #373899] INFO -- : building spec/ruby/optional/capi/ext/tracepoint_spec.so I, [2024-05-13T06:02:08.315572 #373899] INFO -- : building spec/ruby/optional/capi/ext/typed_data_spec.so I, [2024-05-13T06:02:08.321679 #373899] INFO -- : building spec/ruby/optional/capi/ext/util_spec.so I, [2024-05-13T06:02:08.339754 #373899] INFO -- : making enc I, [2024-05-13T06:02:08.350947 #373899] INFO -- : making srcs under enc I, [2024-05-13T06:02:08.366933 #373899] INFO -- : make[1]: Entering directory '/tmp/ruby/build/trunk' I, [2024-05-13T06:02:08.367019 #373899] INFO -- : make[1]: Nothing to be done for 'enc'. I, [2024-05-13T06:02:08.367061 #373899] INFO -- : make[1]: Leaving directory '/tmp/ruby/build/trunk' I, [2024-05-13T06:02:08.389637 #373899] INFO -- : make[1]: Entering directory '/tmp/ruby/build/trunk' I, [2024-05-13T06:02:08.389697 #373899] INFO -- : make[1]: Nothing to be done for 'srcs'. I, [2024-05-13T06:02:08.389705 #373899] INFO -- : make[1]: Leaving directory '/tmp/ruby/build/trunk' I, [2024-05-13T06:02:08.390331 #373899] INFO -- : generating transdb.h I, [2024-05-13T06:02:08.492412 #373899] INFO -- : transdb.h unchanged I, [2024-05-13T06:02:08.493609 #373899] INFO -- : generating makefiles ext/configure-ext.mk I, [2024-05-13T06:02:08.493770 #373899] INFO -- : making trans I, [2024-05-13T06:02:08.520309 #373899] INFO -- : ext/configure-ext.mk updated I, [2024-05-13T06:02:08.522696 #373899] INFO -- : make[1]: Entering directory '/tmp/ruby/build/trunk' I, [2024-05-13T06:02:08.530070 #373899] INFO -- : make[1]: Entering directory '/tmp/ruby/build/trunk' I, [2024-05-13T06:02:08.530140 #373899] INFO -- : make[1]: Nothing to be done for 'trans'. I, [2024-05-13T06:02:08.530150 #373899] INFO -- : make[1]: Leaving directory '/tmp/ruby/build/trunk' I, [2024-05-13T06:02:08.530856 #373899] INFO -- : making encs I, [2024-05-13T06:02:08.588453 #373899] INFO -- : make[1]: Entering directory '/tmp/ruby/build/trunk' I, [2024-05-13T06:02:08.588525 #373899] INFO -- : make[1]: Nothing to be done for 'encs'. I, [2024-05-13T06:02:08.588551 #373899] INFO -- : make[1]: Leaving directory '/tmp/ruby/build/trunk' I, [2024-05-13T06:02:08.677869 #373899] INFO -- : make[1]: Leaving directory '/tmp/ruby/build/trunk' I, [2024-05-13T06:02:08.678415 #373899] INFO -- : generating makefile exts.mk I, [2024-05-13T06:02:08.715395 #373899] INFO -- : exts.mk unchanged I, [2024-05-13T06:02:08.720338 #373899] INFO -- : make[1]: Entering directory '/tmp/ruby/build/trunk' I, [2024-05-13T06:02:08.738766 #373899] INFO -- : make[2]: Entering directory '/tmp/ruby/build/trunk/ext/digest' I, [2024-05-13T06:02:08.739553 #373899] INFO -- : make[2]: Entering directory '/tmp/ruby/build/trunk/ext/json' I, [2024-05-13T06:02:08.739581 #373899] INFO -- : make[2]: Entering directory '/tmp/ruby/build/trunk/ext/coverage' I, [2024-05-13T06:02:08.739979 #373899] INFO -- : make[2]: Entering directory '/tmp/ruby/build/trunk/ext/io/console' I, [2024-05-13T06:02:08.740223 #373899] INFO -- : make[2]: Entering directory '/tmp/ruby/build/trunk/ext/date' I, [2024-05-13T06:02:08.741636 #373899] INFO -- : make[2]: Entering directory '/tmp/ruby/build/trunk/ext/monitor' I, [2024-05-13T06:02:08.742188 #373899] INFO -- : make[2]: Entering directory '/tmp/ruby/build/trunk/ext/pty' I, [2024-05-13T06:02:08.742202 #373899] INFO -- : make[2]: Entering directory '/tmp/ruby/build/trunk/ext/pathname' I, [2024-05-13T06:02:08.742209 #373899] INFO -- : make[2]: Entering directory '/tmp/ruby/build/trunk/ext/rubyvm' I, [2024-05-13T06:02:08.742443 #373899] INFO -- : make[2]: Leaving directory '/tmp/ruby/build/trunk/ext/coverage' I, [2024-05-13T06:02:08.742479 #373899] INFO -- : make[2]: Entering directory '/tmp/ruby/build/trunk/ext/fiddle' I, [2024-05-13T06:02:08.742616 #373899] INFO -- : make[2]: Leaving directory '/tmp/ruby/build/trunk/ext/io/console' I, [2024-05-13T06:02:08.743099 #373899] INFO -- : make[2]: Entering directory '/tmp/ruby/build/trunk/ext/objspace' I, [2024-05-13T06:02:08.743612 #373899] INFO -- : make[2]: Leaving directory '/tmp/ruby/build/trunk/ext/monitor' I, [2024-05-13T06:02:08.744125 #373899] INFO -- : make[2]: Leaving directory '/tmp/ruby/build/trunk/ext/date' I, [2024-05-13T06:02:08.744440 #373899] INFO -- : make[2]: Entering directory '/tmp/ruby/build/trunk/ext/psych' I, [2024-05-13T06:02:08.744511 #373899] INFO -- : make[2]: Leaving directory '/tmp/ruby/build/trunk/ext/digest' I, [2024-05-13T06:02:08.744542 #373899] INFO -- : make[2]: Leaving directory '/tmp/ruby/build/trunk/ext/pathname' I, [2024-05-13T06:02:08.744783 #373899] INFO -- : make[2]: Leaving directory '/tmp/ruby/build/trunk/ext/rubyvm' I, [2024-05-13T06:02:08.744801 #373899] INFO -- : make[2]: Leaving directory '/tmp/ruby/build/trunk/ext/pty' I, [2024-05-13T06:02:08.745146 #373899] INFO -- : make[2]: Leaving directory '/tmp/ruby/build/trunk/ext/json' I, [2024-05-13T06:02:08.746385 #373899] INFO -- : make[2]: Entering directory '/tmp/ruby/build/trunk/ext/ripper' I, [2024-05-13T06:02:08.746771 #373899] INFO -- : make[2]: Leaving directory '/tmp/ruby/build/trunk/ext/objspace' I, [2024-05-13T06:02:08.747045 #373899] INFO -- : make[2]: Entering directory '/tmp/ruby/build/trunk/.bundle/gems/bigdecimal-3.1.8/ext/bigdecimal' I, [2024-05-13T06:02:08.747366 #373899] INFO -- : make[2]: Entering directory '/tmp/ruby/build/trunk/.bundle/gems/nkf-0.2.0/ext/nkf' I, [2024-05-13T06:02:08.747392 #373899] INFO -- : make[2]: Entering directory '/tmp/ruby/build/trunk/.bundle/gems/debug-1.9.2/ext/debug' I, [2024-05-13T06:02:08.747506 #373899] INFO -- : make[2]: Entering directory '/tmp/ruby/build/trunk/.bundle/gems/racc-1.7.3/ext/racc/cparse' I, [2024-05-13T06:02:08.747853 #373899] INFO -- : make[2]: Entering directory '/tmp/ruby/build/trunk/.bundle/gems/syslog-0.1.2/ext/syslog' I, [2024-05-13T06:02:08.748295 #373899] INFO -- : make[2]: Entering directory '/tmp/ruby/build/trunk/.bundle/gems/rbs-3.4.4/ext/rbs_extension' I, [2024-05-13T06:02:08.749359 #373899] INFO -- : make[2]: Leaving directory '/tmp/ruby/build/trunk/ext/fiddle' I, [2024-05-13T06:02:08.751668 #373899] INFO -- : make[2]: Leaving directory '/tmp/ruby/build/trunk/ext/ripper' I, [2024-05-13T06:02:08.753236 #373899] INFO -- : make[2]: Entering directory '/tmp/ruby/build/trunk/ext/digest/sha2' I, [2024-05-13T06:02:08.753909 #373899] INFO -- : make[2]: Leaving directory '/tmp/ruby/build/trunk/ext/psych' I, [2024-05-13T06:02:08.754491 #373899] INFO -- : make[2]: Entering directory '/tmp/ruby/build/trunk/ext/openssl' I, [2024-05-13T06:02:08.755652 #373899] INFO -- : make[2]: Entering directory '/tmp/ruby/build/trunk/ext/socket' I, [2024-05-13T06:02:08.756476 #373899] INFO -- : make[2]: Leaving directory '/tmp/ruby/build/trunk/ext/digest/sha2' I, [2024-05-13T06:02:08.761721 #373899] INFO -- : make[2]: Leaving directory '/tmp/ruby/build/trunk/ext/socket' I, [2024-05-13T06:02:08.770896 #373899] INFO -- : make[2]: Leaving directory '/tmp/ruby/build/trunk/.bundle/gems/rbs-3.4.4/ext/rbs_extension' I, [2024-05-13T06:02:08.770994 #373899] INFO -- : make[2]: Leaving directory '/tmp/ruby/build/trunk/ext/openssl' I, [2024-05-13T06:02:08.771517 #373899] INFO -- : make[2]: Leaving directory '/tmp/ruby/build/trunk/.bundle/gems/bigdecimal-3.1.8/ext/bigdecimal' I, [2024-05-13T06:02:08.772238 #373899] INFO -- : make[2]: Leaving directory '/tmp/ruby/build/trunk/.bundle/gems/racc-1.7.3/ext/racc/cparse' I, [2024-05-13T06:02:08.772518 #373899] INFO -- : make[2]: Leaving directory '/tmp/ruby/build/trunk/.bundle/gems/debug-1.9.2/ext/debug' I, [2024-05-13T06:02:08.779345 #373899] INFO -- : make[2]: Leaving directory '/tmp/ruby/build/trunk/.bundle/gems/nkf-0.2.0/ext/nkf' I, [2024-05-13T06:02:08.781447 #373899] INFO -- : make[2]: Leaving directory '/tmp/ruby/build/trunk/.bundle/gems/syslog-0.1.2/ext/syslog' I, [2024-05-13T06:02:08.805538 #373899] INFO -- : make[2]: Entering directory '/tmp/ruby/build/trunk' I, [2024-05-13T06:02:08.881171 #373899] INFO -- : linking ruby I, [2024-05-13T06:02:08.903608 #373899] INFO -- : make[2]: Leaving directory '/tmp/ruby/build/trunk' I, [2024-05-13T06:02:08.904009 #373899] INFO -- : make[1]: Leaving directory '/tmp/ruby/build/trunk' I, [2024-05-13T06:02:08.907934 #373899] INFO -- : make[1]: Entering directory '/tmp/ruby/build/trunk' I, [2024-05-13T06:02:08.907978 #373899] INFO -- : make[1]: Nothing to be done for 'note'. I, [2024-05-13T06:02:08.907983 #373899] INFO -- : make[1]: Leaving directory '/tmp/ruby/build/trunk' I, [2024-05-13T06:02:08.908499 #373899] INFO -- : $$$[end] "make all -j20" exit with 0. I, [2024-05-13T06:02:08.908653 #373899] INFO -- : $$$[beg] make install -j20 I, [2024-05-13T06:02:08.978453 #373899] INFO -- : Update minitest to ea9caafc0754b1d6236a490d59e624b53209734a I, [2024-05-13T06:02:08.978703 #373899] INFO -- : Update power_assert to 84e85124c5014a139af39161d484156cfe87a9ed I, [2024-05-13T06:02:08.979176 #373899] INFO -- : Update rbs to ba7872795d5de04adb8ff500c0e6afdc81a041dd I, [2024-05-13T06:02:08.979624 #373899] INFO -- : Update typeprof to b19a6416da3a05d57fadd6ffdadb382b6d236ca5 I, [2024-05-13T06:02:08.980677 #373899] INFO -- : echo ea9caafc0754b1d6236a490d59e624b53209734a | /bin/sh /tmp/ruby/src/trunk/tool/ifchange /tmp/ruby/src/trunk/.bundle/.timestamp/minitest.revision - I, [2024-05-13T06:02:08.981068 #373899] INFO -- : echo 84e85124c5014a139af39161d484156cfe87a9ed | /bin/sh /tmp/ruby/src/trunk/tool/ifchange /tmp/ruby/src/trunk/.bundle/.timestamp/power_assert.revision - I, [2024-05-13T06:02:08.982316 #373899] INFO -- : BASERUBY = /usr/bin/ruby --disable=gems I, [2024-05-13T06:02:08.982357 #373899] INFO -- : CC = gcc I, [2024-05-13T06:02:08.982371 #373899] INFO -- : LD = ld I, [2024-05-13T06:02:08.982382 #373899] INFO -- : LDSHARED = gcc -shared I, [2024-05-13T06:02:08.982396 #373899] INFO -- : CFLAGS = -O3 -fno-fast-math -ggdb3 -Wall -Wextra -Wdeprecated-declarations -Wdiv-by-zero -Wduplicated-cond -Wimplicit-function-declaration -Wimplicit-int -Wpointer-arith -Wwrite-strings -Wold-style-definition -Wimplicit-fallthrough=0 -Wmissing-noreturn -Wno-cast-function-type -Wno-constant-logical-operand -Wno-long-long -Wno-missing-field-initializers -Wno-overlength-strings -Wno-packed-bitfield-compat -Wno-parentheses-equality -Wno-self-assign -Wno-tautological-compare -Wno-unused-parameter -Wno-unused-value -Wsuggest-attribute=format -Wsuggest-attribute=noreturn -Wunused-variable -Wmisleading-indentation -Wundef -fPIC I, [2024-05-13T06:02:08.982408 #373899] INFO -- : XCFLAGS = -U_FORTIFY_SOURCE -D_FORTIFY_SOURCE=2 -fstack-protector-strong -fno-strict-overflow -fvisibility=hidden -fexcess-precision=standard -DRUBY_EXPORT -I. -I.ext/include/x86_64-linux -I/tmp/ruby/src/trunk/include -I/tmp/ruby/src/trunk -I/tmp/ruby/src/trunk/prism -I/tmp/ruby/src/trunk/enc/unicode/15.0.0 I, [2024-05-13T06:02:08.982419 #373899] INFO -- : CPPFLAGS = I, [2024-05-13T06:02:08.982429 #373899] INFO -- : DLDFLAGS = -Wl,--compress-debug-sections=zlib -Wl,-soname,libruby.so.3.4 -fstack-protector-strong I, [2024-05-13T06:02:08.982440 #373899] INFO -- : SOLIBS = -lz -lrt -lrt -lgmp -ldl -lcrypt -lm -lpthread I, [2024-05-13T06:02:08.982450 #373899] INFO -- : LANG = en_US.UTF-8 I, [2024-05-13T06:02:08.982464 #373899] INFO -- : LC_ALL = I, [2024-05-13T06:02:08.982473 #373899] INFO -- : LC_CTYPE = I, [2024-05-13T06:02:08.982483 #373899] INFO -- : MFLAGS = -j20 --jobserver-auth=4,5 I, [2024-05-13T06:02:08.982492 #373899] INFO -- : RUSTC = no I, [2024-05-13T06:02:08.982502 #373899] INFO -- : YJIT_RUSTC_ARGS = --crate-name=yjit --crate-type=staticlib --edition=2021 -g -C lto=thin -C opt-level=3 -C overflow-checks=on '--out-dir=/tmp/ruby/build/trunk/yjit/target/release/' /tmp/ruby/src/trunk/yjit/src/lib.rs I, [2024-05-13T06:02:08.983602 #373899] INFO -- : /tmp/ruby/src/trunk/.bundle/.timestamp/minitest.revision unchanged I, [2024-05-13T06:02:08.983996 #373899] INFO -- : /tmp/ruby/src/trunk/.bundle/.timestamp/power_assert.revision unchanged I, [2024-05-13T06:02:09.013461 #373899] INFO -- : echo ba7872795d5de04adb8ff500c0e6afdc81a041dd | /bin/sh /tmp/ruby/src/trunk/tool/ifchange /tmp/ruby/src/trunk/.bundle/.timestamp/rbs.revision - I, [2024-05-13T06:02:09.013604 #373899] INFO -- : echo b19a6416da3a05d57fadd6ffdadb382b6d236ca5 | /bin/sh /tmp/ruby/src/trunk/tool/ifchange /tmp/ruby/src/trunk/.bundle/.timestamp/typeprof.revision - I, [2024-05-13T06:02:09.014309 #373899] INFO -- : generating enc.mk I, [2024-05-13T06:02:09.014333 #373899] INFO -- : gcc (Ubuntu 11.4.0-1ubuntu1~22.04) 11.4.0 I, [2024-05-13T06:02:09.014340 #373899] INFO -- : Copyright (C) 2021 Free Software Foundation, Inc. I, [2024-05-13T06:02:09.014347 #373899] INFO -- : This is free software; see the source for copying conditions. There is NO I, [2024-05-13T06:02:09.014353 #373899] INFO -- : warranty; not even for MERCHANTABILITY or FITNESS FOR A PARTICULAR PURPOSE. I, [2024-05-13T06:02:09.014359 #373899] INFO -- : I, [2024-05-13T06:02:09.015392 #373899] INFO -- : /tmp/ruby/src/trunk/.bundle/.timestamp/rbs.revision unchanged I, [2024-05-13T06:02:09.015496 #373899] INFO -- : /tmp/ruby/src/trunk/.bundle/.timestamp/typeprof.revision unchanged I, [2024-05-13T06:02:09.134977 #373899] INFO -- : Building power_assert@84e85124c5014a139af39161d484156cfe87a9ed to /tmp/ruby/src/trunk/gems/power_assert-2.0.3.gem I, [2024-05-13T06:02:09.135587 #373899] INFO -- : making srcs under enc I, [2024-05-13T06:02:09.135805 #373899] INFO -- : making enc I, [2024-05-13T06:02:09.152944 #373899] INFO -- : make[1]: Entering directory '/tmp/ruby/build/trunk' I, [2024-05-13T06:02:09.152977 #373899] INFO -- : make[1]: Nothing to be done for 'enc'. I, [2024-05-13T06:02:09.152982 #373899] INFO -- : make[1]: Leaving directory '/tmp/ruby/build/trunk' I, [2024-05-13T06:02:09.166316 #373899] INFO -- : make[1]: Entering directory '/tmp/ruby/build/trunk' I, [2024-05-13T06:02:09.166339 #373899] INFO -- : make[1]: Nothing to be done for 'srcs'. I, [2024-05-13T06:02:09.166349 #373899] INFO -- : make[1]: Leaving directory '/tmp/ruby/build/trunk' I, [2024-05-13T06:02:09.167173 #373899] INFO -- : generating transdb.h I, [2024-05-13T06:02:09.204191 #373899] INFO -- : Successfully built RubyGem I, [2024-05-13T06:02:09.204249 #373899] INFO -- : Name: power_assert I, [2024-05-13T06:02:09.204262 #373899] INFO -- : Version: 2.0.4dev I, [2024-05-13T06:02:09.204274 #373899] INFO -- : File: power_assert-2.0.4dev.gem I, [2024-05-13T06:02:09.206467 #373899] INFO -- : Extracting bundle gem power_assert-2.0.3... I, [2024-05-13T06:02:09.264284 #373899] INFO -- : transdb.h unchanged I, [2024-05-13T06:02:09.265905 #373899] INFO -- : generating makefiles ext/configure-ext.mk I, [2024-05-13T06:02:09.266059 #373899] INFO -- : making trans I, [2024-05-13T06:02:09.267588 #373899] INFO -- : Try with hash version of bundled gems instead of gems/power_assert-2.0.3.gem. We don't use this gem with release version of Ruby. I, [2024-05-13T06:02:09.272597 #373899] INFO -- : Unpacked gems/power_assert-2.0.4dev.gem I, [2024-05-13T06:02:09.292772 #373899] INFO -- : ext/configure-ext.mk unchanged I, [2024-05-13T06:02:09.295045 #373899] INFO -- : make[1]: Entering directory '/tmp/ruby/build/trunk' I, [2024-05-13T06:02:09.300510 #373899] INFO -- : make[1]: Entering directory '/tmp/ruby/build/trunk' I, [2024-05-13T06:02:09.300615 #373899] INFO -- : make[1]: Nothing to be done for 'trans'. I, [2024-05-13T06:02:09.300649 #373899] INFO -- : make[1]: Leaving directory '/tmp/ruby/build/trunk' I, [2024-05-13T06:02:09.301662 #373899] INFO -- : making encs I, [2024-05-13T06:02:09.358540 #373899] INFO -- : make[1]: Entering directory '/tmp/ruby/build/trunk' I, [2024-05-13T06:02:09.358611 #373899] INFO -- : make[1]: Nothing to be done for 'encs'. I, [2024-05-13T06:02:09.358639 #373899] INFO -- : make[1]: Leaving directory '/tmp/ruby/build/trunk' I, [2024-05-13T06:02:09.445286 #373899] INFO -- : make[1]: Leaving directory '/tmp/ruby/build/trunk' I, [2024-05-13T06:02:09.445953 #373899] INFO -- : generating makefile exts.mk I, [2024-05-13T06:02:09.483803 #373899] INFO -- : exts.mk unchanged I, [2024-05-13T06:02:09.488632 #373899] INFO -- : make[1]: Entering directory '/tmp/ruby/build/trunk' I, [2024-05-13T06:02:09.508254 #373899] INFO -- : make[2]: Entering directory '/tmp/ruby/build/trunk/ext/digest' I, [2024-05-13T06:02:09.510103 #373899] INFO -- : make[2]: Entering directory '/tmp/ruby/build/trunk/ext/coverage' I, [2024-05-13T06:02:09.510151 #373899] INFO -- : make[2]: Entering directory '/tmp/ruby/build/trunk/ext/json' I, [2024-05-13T06:02:09.510706 #373899] INFO -- : make[2]: Entering directory '/tmp/ruby/build/trunk/ext/date' I, [2024-05-13T06:02:09.510917 #373899] INFO -- : make[2]: Entering directory '/tmp/ruby/build/trunk/ext/io/console' I, [2024-05-13T06:02:09.511594 #373899] INFO -- : make[2]: Entering directory '/tmp/ruby/build/trunk/ext/monitor' I, [2024-05-13T06:02:09.512080 #373899] INFO -- : make[2]: Leaving directory '/tmp/ruby/build/trunk/ext/digest' I, [2024-05-13T06:02:09.512952 #373899] INFO -- : make[2]: Entering directory '/tmp/ruby/build/trunk/ext/pathname' I, [2024-05-13T06:02:09.513142 #373899] INFO -- : make[2]: Entering directory '/tmp/ruby/build/trunk/ext/pty' I, [2024-05-13T06:02:09.513179 #373899] INFO -- : make[2]: Leaving directory '/tmp/ruby/build/trunk/ext/coverage' I, [2024-05-13T06:02:09.513241 #373899] INFO -- : make[2]: Entering directory '/tmp/ruby/build/trunk/ext/fiddle' I, [2024-05-13T06:02:09.513530 #373899] INFO -- : make[2]: Leaving directory '/tmp/ruby/build/trunk/ext/date' I, [2024-05-13T06:02:09.514068 #373899] INFO -- : make[2]: Leaving directory '/tmp/ruby/build/trunk/ext/monitor' I, [2024-05-13T06:02:09.514177 #373899] INFO -- : make[2]: Entering directory '/tmp/ruby/build/trunk/ext/rubyvm' I, [2024-05-13T06:02:09.514225 #373899] INFO -- : make[2]: Entering directory '/tmp/ruby/build/trunk/ext/psych' I, [2024-05-13T06:02:09.514427 #373899] INFO -- : make[2]: Entering directory '/tmp/ruby/build/trunk/ext/objspace' I, [2024-05-13T06:02:09.515348 #373899] INFO -- : make[2]: Entering directory '/tmp/ruby/build/trunk/.bundle/gems/bigdecimal-3.1.8/ext/bigdecimal' I, [2024-05-13T06:02:09.515528 #373899] INFO -- : make[2]: Leaving directory '/tmp/ruby/build/trunk/ext/pathname' I, [2024-05-13T06:02:09.515723 #373899] INFO -- : make[2]: Leaving directory '/tmp/ruby/build/trunk/ext/json' I, [2024-05-13T06:02:09.516139 #373899] INFO -- : make[2]: Entering directory '/tmp/ruby/build/trunk/.bundle/gems/debug-1.9.2/ext/debug' I, [2024-05-13T06:02:09.516617 #373899] INFO -- : make[2]: Leaving directory '/tmp/ruby/build/trunk/ext/pty' I, [2024-05-13T06:02:09.516644 #373899] INFO -- : make[2]: Entering directory '/tmp/ruby/build/trunk/.bundle/gems/nkf-0.2.0/ext/nkf' I, [2024-05-13T06:02:09.516655 #373899] INFO -- : make[2]: Entering directory '/tmp/ruby/build/trunk/.bundle/gems/racc-1.7.3/ext/racc/cparse' I, [2024-05-13T06:02:09.517292 #373899] INFO -- : make[2]: Leaving directory '/tmp/ruby/build/trunk/ext/rubyvm' I, [2024-05-13T06:02:09.518183 #373899] INFO -- : make[2]: Entering directory '/tmp/ruby/build/trunk/.bundle/gems/syslog-0.1.2/ext/syslog' I, [2024-05-13T06:02:09.518695 #373899] INFO -- : make[2]: Leaving directory '/tmp/ruby/build/trunk/ext/objspace' I, [2024-05-13T06:02:09.518803 #373899] INFO -- : make[2]: Entering directory '/tmp/ruby/build/trunk/.bundle/gems/rbs-3.4.4/ext/rbs_extension' I, [2024-05-13T06:02:09.519094 #373899] INFO -- : make[2]: Entering directory '/tmp/ruby/build/trunk/ext/ripper' I, [2024-05-13T06:02:09.521488 #373899] INFO -- : make[2]: Entering directory '/tmp/ruby/build/trunk/ext/digest/sha2' I, [2024-05-13T06:02:09.521702 #373899] INFO -- : make[2]: Leaving directory '/tmp/ruby/build/trunk/ext/fiddle' I, [2024-05-13T06:02:09.523701 #373899] INFO -- : make[2]: Entering directory '/tmp/ruby/build/trunk/ext/socket' I, [2024-05-13T06:02:09.523825 #373899] INFO -- : make[2]: Leaving directory '/tmp/ruby/build/trunk/ext/digest/sha2' I, [2024-05-13T06:02:09.524760 #373899] INFO -- : make[2]: Leaving directory '/tmp/ruby/build/trunk/ext/ripper' I, [2024-05-13T06:02:09.526371 #373899] INFO -- : make[2]: Leaving directory '/tmp/ruby/build/trunk/ext/io/console' I, [2024-05-13T06:02:09.526726 #373899] INFO -- : make[2]: Entering directory '/tmp/ruby/build/trunk/ext/openssl' I, [2024-05-13T06:02:09.526894 #373899] INFO -- : make[2]: Leaving directory '/tmp/ruby/build/trunk/ext/psych' I, [2024-05-13T06:02:09.529726 #373899] INFO -- : make[2]: Leaving directory '/tmp/ruby/build/trunk/ext/socket' I, [2024-05-13T06:02:09.537885 #373899] INFO -- : make[2]: Leaving directory '/tmp/ruby/build/trunk/ext/openssl' I, [2024-05-13T06:02:09.539119 #373899] INFO -- : make[2]: Leaving directory '/tmp/ruby/build/trunk/.bundle/gems/debug-1.9.2/ext/debug' I, [2024-05-13T06:02:09.539249 #373899] INFO -- : make[2]: Leaving directory '/tmp/ruby/build/trunk/.bundle/gems/nkf-0.2.0/ext/nkf' I, [2024-05-13T06:02:09.542025 #373899] INFO -- : make[2]: Leaving directory '/tmp/ruby/build/trunk/.bundle/gems/bigdecimal-3.1.8/ext/bigdecimal' I, [2024-05-13T06:02:09.542585 #373899] INFO -- : make[2]: Leaving directory '/tmp/ruby/build/trunk/.bundle/gems/syslog-0.1.2/ext/syslog' I, [2024-05-13T06:02:09.542607 #373899] INFO -- : make[2]: Leaving directory '/tmp/ruby/build/trunk/.bundle/gems/racc-1.7.3/ext/racc/cparse' I, [2024-05-13T06:02:09.548659 #373899] INFO -- : make[2]: Leaving directory '/tmp/ruby/build/trunk/.bundle/gems/rbs-3.4.4/ext/rbs_extension' I, [2024-05-13T06:02:09.573165 #373899] INFO -- : make[2]: Entering directory '/tmp/ruby/build/trunk' I, [2024-05-13T06:02:09.646977 #373899] INFO -- : make[2]: 'ruby' is up to date. I, [2024-05-13T06:02:09.647011 #373899] INFO -- : make[2]: Leaving directory '/tmp/ruby/build/trunk' I, [2024-05-13T06:02:09.647282 #373899] INFO -- : make[1]: Leaving directory '/tmp/ruby/build/trunk' I, [2024-05-13T06:02:09.650801 #373899] INFO -- : make[1]: Entering directory '/tmp/ruby/build/trunk' I, [2024-05-13T06:02:09.650822 #373899] INFO -- : make[1]: Nothing to be done for 'note'. I, [2024-05-13T06:02:09.650827 #373899] INFO -- : make[1]: Leaving directory '/tmp/ruby/build/trunk' I, [2024-05-13T06:02:09.651025 #373899] INFO -- : ./miniruby -I/tmp/ruby/src/trunk/lib -I. -I.ext/common /tmp/ruby/src/trunk/tool/runruby.rb --extout=.ext -- --disable-gems -r./x86_64-linux-fake /tmp/ruby/src/trunk/tool/rbinstall.rb --make="make" --dest-dir="" --extout=".ext" --ext-build-dir="./ext" --mflags="-j20 --jobserver-auth=4,5" --make-flags=" -j20 --jobserver-auth=4,5" --data-mode=0644 --prog-mode=0755 --installed-list .installed.list --mantype="doc" --gnumake --install=all --exclude=doc I, [2024-05-13T06:02:09.749402 #373899] INFO -- : Installing to I, [2024-05-13T06:02:09.749460 #373899] INFO -- : installing binary commands: /tmp/ruby/install/trunk/bin I, [2024-05-13T06:02:09.749549 #373899] INFO -- : installing base libraries: /tmp/ruby/install/trunk/lib I, [2024-05-13T06:02:09.756632 #373899] INFO -- : installing arch files: /tmp/ruby/install/trunk/lib/ruby/3.4.0+0/x86_64-linux I, [2024-05-13T06:02:09.756662 #373899] INFO -- : installing pkgconfig data: /tmp/ruby/install/trunk/lib/pkgconfig I, [2024-05-13T06:02:09.756675 #373899] INFO -- : installing extension objects: /tmp/ruby/install/trunk/lib/ruby/3.4.0+0/x86_64-linux I, [2024-05-13T06:02:09.765908 #373899] INFO -- : installing extension objects: /tmp/ruby/install/trunk/lib/ruby/site_ruby/3.4.0+0/x86_64-linux I, [2024-05-13T06:02:09.765932 #373899] INFO -- : installing extension objects: /tmp/ruby/install/trunk/lib/ruby/vendor_ruby/3.4.0+0/x86_64-linux I, [2024-05-13T06:02:09.765939 #373899] INFO -- : installing extension headers: /tmp/ruby/install/trunk/include/ruby-3.4.0+0/x86_64-linux I, [2024-05-13T06:02:09.766097 #373899] INFO -- : installing extension scripts: /tmp/ruby/install/trunk/lib/ruby/3.4.0+0 I, [2024-05-13T06:02:09.769876 #373899] INFO -- : installing extension scripts: /tmp/ruby/install/trunk/lib/ruby/site_ruby/3.4.0+0 I, [2024-05-13T06:02:09.769901 #373899] INFO -- : installing extension scripts: /tmp/ruby/install/trunk/lib/ruby/vendor_ruby/3.4.0+0 I, [2024-05-13T06:02:09.769906 #373899] INFO -- : installing extension headers: /tmp/ruby/install/trunk/include/ruby-3.4.0+0/ruby I, [2024-05-13T06:02:09.769910 #373899] INFO -- : installing command scripts: /tmp/ruby/install/trunk/bin I, [2024-05-13T06:02:09.769915 #373899] INFO -- : installing library scripts: /tmp/ruby/install/trunk/lib/ruby/3.4.0+0 I, [2024-05-13T06:02:09.803202 #373899] INFO -- : installing common headers: /tmp/ruby/install/trunk/include/ruby-3.4.0+0 I, [2024-05-13T06:02:09.808535 #373899] INFO -- : installing manpages: /tmp/ruby/install/trunk/share/man/man1 I, [2024-05-13T06:02:09.808579 #373899] INFO -- : installing default gems from lib: /tmp/ruby/install/trunk/lib/ruby/gems/3.4.0+0 I, [2024-05-13T06:02:09.830938 #373899] INFO -- : benchmark 0.3.0 I, [2024-05-13T06:02:09.837752 #373899] INFO -- : bundler 2.6.0.dev I, [2024-05-13T06:02:09.839854 #373899] INFO -- : cgi 0.4.1 I, [2024-05-13T06:02:09.840388 #373899] INFO -- : delegate 0.3.1 I, [2024-05-13T06:02:09.840871 #373899] INFO -- : did_you_mean 1.6.3 I, [2024-05-13T06:02:09.841324 #373899] INFO -- : english 0.8.0 I, [2024-05-13T06:02:09.841777 #373899] INFO -- : erb 4.0.4 I, [2024-05-13T06:02:09.842532 #373899] INFO -- : error_highlight 0.6.0 I, [2024-05-13T06:02:09.842953 #373899] INFO -- : fileutils 1.7.2 I, [2024-05-13T06:02:09.843393 #373899] INFO -- : find 0.2.0 I, [2024-05-13T06:02:09.843775 #373899] INFO -- : forwardable 1.3.3 I, [2024-05-13T06:02:09.844321 #373899] INFO -- : ipaddr 1.2.6 I, [2024-05-13T06:02:09.844755 #373899] INFO -- : irb 1.13.1 I, [2024-05-13T06:02:09.846155 #373899] INFO -- : logger 1.6.0 I, [2024-05-13T06:02:09.846664 #373899] INFO -- : net-http 0.4.1 I, [2024-05-13T06:02:09.847157 #373899] INFO -- : net-protocol 0.2.2 I, [2024-05-13T06:02:09.847646 #373899] INFO -- : open-uri 0.4.1 I, [2024-05-13T06:02:09.848207 #373899] INFO -- : open3 0.2.1 I, [2024-05-13T06:02:09.848612 #373899] INFO -- : optparse 0.5.0 I, [2024-05-13T06:02:09.849169 #373899] INFO -- : ostruct 0.6.0 I, [2024-05-13T06:02:09.849592 #373899] INFO -- : pp 0.5.0 I, [2024-05-13T06:02:09.850067 #373899] INFO -- : prettyprint 0.2.0 I, [2024-05-13T06:02:09.850598 #373899] INFO -- : prism 0.29.0 I, [2024-05-13T06:02:09.851092 #373899] INFO -- : pstore 0.1.3 I, [2024-05-13T06:02:09.851551 #373899] INFO -- : rdoc 6.6.3.1 I, [2024-05-13T06:02:09.853126 #373899] INFO -- : readline 0.0.4 I, [2024-05-13T06:02:09.853630 #373899] INFO -- : reline 0.5.6 I, [2024-05-13T06:02:09.854147 #373899] INFO -- : resolv 0.4.0 I, [2024-05-13T06:02:09.854619 #373899] INFO -- : ruby2_keywords 0.0.5 I, [2024-05-13T06:02:09.855093 #373899] INFO -- : securerandom 0.3.1 I, [2024-05-13T06:02:09.855570 #373899] INFO -- : set 1.1.0 I, [2024-05-13T06:02:09.856124 #373899] INFO -- : shellwords 0.2.0 I, [2024-05-13T06:02:09.856579 #373899] INFO -- : singleton 0.2.0 I, [2024-05-13T06:02:09.857045 #373899] INFO -- : syntax_suggest 2.0.0 I, [2024-05-13T06:02:09.857648 #373899] INFO -- : tempfile 0.2.1 I, [2024-05-13T06:02:09.858109 #373899] INFO -- : time 0.3.0 I, [2024-05-13T06:02:09.858695 #373899] INFO -- : timeout 0.4.1 I, [2024-05-13T06:02:09.859788 #373899] INFO -- : tmpdir 0.2.0 I, [2024-05-13T06:02:09.860248 #373899] INFO -- : tsort 0.2.0 I, [2024-05-13T06:02:09.860717 #373899] INFO -- : un 0.3.0 I, [2024-05-13T06:02:09.861183 #373899] INFO -- : uri 0.13.0 I, [2024-05-13T06:02:09.861684 #373899] INFO -- : weakref 0.1.3 I, [2024-05-13T06:02:09.862164 #373899] INFO -- : yaml 0.3.0 I, [2024-05-13T06:02:09.862441 #373899] INFO -- : installing default gems from ext: /tmp/ruby/install/trunk/lib/ruby/gems/3.4.0+0 I, [2024-05-13T06:02:09.868828 #373899] INFO -- : date 3.3.4 I, [2024-05-13T06:02:09.869413 #373899] INFO -- : digest 3.1.1 I, [2024-05-13T06:02:09.869891 #373899] INFO -- : etc 1.4.3 I, [2024-05-13T06:02:09.870387 #373899] INFO -- : fcntl 1.1.0 I, [2024-05-13T06:02:09.870877 #373899] INFO -- : fiddle 1.1.3 I, [2024-05-13T06:02:09.871355 #373899] INFO -- : io-console 0.7.2 I, [2024-05-13T06:02:09.871886 #373899] INFO -- : io-nonblock 0.3.0 I, [2024-05-13T06:02:09.872478 #373899] INFO -- : io-wait 0.3.1 I, [2024-05-13T06:02:09.872872 #373899] INFO -- : json 2.7.2 I, [2024-05-13T06:02:09.873725 #373899] INFO -- : openssl 3.2.0 I, [2024-05-13T06:02:09.874515 #373899] INFO -- : pathname 0.3.0 I, [2024-05-13T06:02:09.875014 #373899] INFO -- : psych 5.1.2 I, [2024-05-13T06:02:09.875559 #373899] INFO -- : stringio 3.1.1 I, [2024-05-13T06:02:09.876080 #373899] INFO -- : strscan 3.1.1 I, [2024-05-13T06:02:09.876549 #373899] INFO -- : zlib 3.1.0 I, [2024-05-13T06:02:09.876944 #373899] INFO -- : installing bundled gems: /tmp/ruby/install/trunk/lib/ruby/gems/3.4.0+0 I, [2024-05-13T06:02:09.877211 #373899] INFO -- : minitest 5.22.3 I, [2024-05-13T06:02:09.884552 #373899] INFO -- : rake 13.2.1 I, [2024-05-13T06:02:09.887878 #373899] INFO -- : test-unit 3.6.2 I, [2024-05-13T06:02:09.892169 #373899] INFO -- : rexml 3.2.6 I, [2024-05-13T06:02:09.895496 #373899] INFO -- : rss 0.3.0 I, [2024-05-13T06:02:09.898491 #373899] INFO -- : net-ftp 0.3.4 I, [2024-05-13T06:02:09.899960 #373899] INFO -- : net-imap 0.4.11 I, [2024-05-13T06:02:09.902788 #373899] INFO -- : net-pop 0.1.2 I, [2024-05-13T06:02:09.903686 #373899] INFO -- : net-smtp 0.5.0 I, [2024-05-13T06:02:09.904838 #373899] INFO -- : matrix 0.4.2 I, [2024-05-13T06:02:09.908314 #373899] INFO -- : prime 0.1.2 I, [2024-05-13T06:02:09.913568 #373899] INFO -- : rbs 3.4.4 I, [2024-05-13T06:02:09.935451 #373899] INFO -- : typeprof 0.21.11 I, [2024-05-13T06:02:09.938337 #373899] INFO -- : debug 1.9.2 I, [2024-05-13T06:02:09.940995 #373899] INFO -- : racc 1.7.3 I, [2024-05-13T06:02:09.943407 #373899] INFO -- : mutex_m 0.2.0 I, [2024-05-13T06:02:09.944787 #373899] INFO -- : getoptlong 0.2.1 I, [2024-05-13T06:02:09.946061 #373899] INFO -- : base64 0.2.0 I, [2024-05-13T06:02:09.947047 #373899] INFO -- : bigdecimal 3.1.8 I, [2024-05-13T06:02:09.948987 #373899] INFO -- : observer 0.1.2 I, [2024-05-13T06:02:09.950043 #373899] INFO -- : abbrev 0.1.2 I, [2024-05-13T06:02:09.951431 #373899] INFO -- : resolv-replace 0.1.1 I, [2024-05-13T06:02:09.952702 #373899] INFO -- : rinda 0.2.0 I, [2024-05-13T06:02:09.954079 #373899] INFO -- : drb 2.2.1 I, [2024-05-13T06:02:09.955580 #373899] INFO -- : nkf 0.2.0 I, [2024-05-13T06:02:09.958091 #373899] INFO -- : syslog 0.1.2 I, [2024-05-13T06:02:09.959609 #373899] INFO -- : csv 3.3.0 I, [2024-05-13T06:02:09.961800 #373899] INFO -- : installing bundled gem cache: /tmp/ruby/install/trunk/lib/ruby/gems/3.4.0+0/cache I, [2024-05-13T06:02:09.963158 #373899] INFO -- : skipped bundled gems: I, [2024-05-13T06:02:09.963179 #373899] INFO -- : power_assert-2.0.4dev.gem not found in bundled_gems I, [2024-05-13T06:02:09.966280 #373899] INFO -- : $$$[end] "make install -j20" exit with 0. I, [2024-05-13T06:02:09.966373 #373899] INFO -- : $$$[beg] make yes-btest TESTOPTS='-q -j20' I, [2024-05-13T06:02:14.851250 #373899] INFO -- : PASS all 1936 tests E, [2024-05-13T06:02:14.859663 #373899] ERROR -- : I, [2024-05-13T06:02:14.859983 #373899] INFO -- : $$$[end] "make yes-btest TESTOPTS='-q -j20'" exit with 0. I, [2024-05-13T06:02:14.860098 #373899] INFO -- : $$$[beg] make yes-test-basic TESTS='-j20' I, [2024-05-13T06:02:14.926993 #373899] INFO -- : BASERUBY = /usr/bin/ruby --disable=gems I, [2024-05-13T06:02:14.927047 #373899] INFO -- : CC = gcc I, [2024-05-13T06:02:14.927064 #373899] INFO -- : LD = ld I, [2024-05-13T06:02:14.927081 #373899] INFO -- : LDSHARED = gcc -shared I, [2024-05-13T06:02:14.927096 #373899] INFO -- : CFLAGS = -O3 -fno-fast-math -ggdb3 -Wall -Wextra -Wdeprecated-declarations -Wdiv-by-zero -Wduplicated-cond -Wimplicit-function-declaration -Wimplicit-int -Wpointer-arith -Wwrite-strings -Wold-style-definition -Wimplicit-fallthrough=0 -Wmissing-noreturn -Wno-cast-function-type -Wno-constant-logical-operand -Wno-long-long -Wno-missing-field-initializers -Wno-overlength-strings -Wno-packed-bitfield-compat -Wno-parentheses-equality -Wno-self-assign -Wno-tautological-compare -Wno-unused-parameter -Wno-unused-value -Wsuggest-attribute=format -Wsuggest-attribute=noreturn -Wunused-variable -Wmisleading-indentation -Wundef -fPIC I, [2024-05-13T06:02:14.927120 #373899] INFO -- : XCFLAGS = -U_FORTIFY_SOURCE -D_FORTIFY_SOURCE=2 -fstack-protector-strong -fno-strict-overflow -fvisibility=hidden -fexcess-precision=standard -DRUBY_EXPORT -I. -I.ext/include/x86_64-linux -I/tmp/ruby/src/trunk/include -I/tmp/ruby/src/trunk -I/tmp/ruby/src/trunk/prism -I/tmp/ruby/src/trunk/enc/unicode/15.0.0 I, [2024-05-13T06:02:14.927135 #373899] INFO -- : CPPFLAGS = I, [2024-05-13T06:02:14.927150 #373899] INFO -- : DLDFLAGS = -Wl,--compress-debug-sections=zlib -Wl,-soname,libruby.so.3.4 -fstack-protector-strong I, [2024-05-13T06:02:14.927166 #373899] INFO -- : SOLIBS = -lz -lrt -lrt -lgmp -ldl -lcrypt -lm -lpthread I, [2024-05-13T06:02:14.927180 #373899] INFO -- : LANG = en_US.UTF-8 I, [2024-05-13T06:02:14.927194 #373899] INFO -- : LC_ALL = I, [2024-05-13T06:02:14.927208 #373899] INFO -- : LC_CTYPE = I, [2024-05-13T06:02:14.927221 #373899] INFO -- : MFLAGS = I, [2024-05-13T06:02:14.927235 #373899] INFO -- : RUSTC = no I, [2024-05-13T06:02:14.927249 #373899] INFO -- : YJIT_RUSTC_ARGS = --crate-name=yjit --crate-type=staticlib --edition=2021 -g -C lto=thin -C opt-level=3 -C overflow-checks=on '--out-dir=/tmp/ruby/build/trunk/yjit/target/release/' /tmp/ruby/src/trunk/yjit/src/lib.rs I, [2024-05-13T06:02:14.927875 #373899] INFO -- : gcc (Ubuntu 11.4.0-1ubuntu1~22.04) 11.4.0 I, [2024-05-13T06:02:14.927929 #373899] INFO -- : Copyright (C) 2021 Free Software Foundation, Inc. I, [2024-05-13T06:02:14.927948 #373899] INFO -- : This is free software; see the source for copying conditions. There is NO I, [2024-05-13T06:02:14.927963 #373899] INFO -- : warranty; not even for MERCHANTABILITY or FITNESS FOR A PARTICULAR PURPOSE. I, [2024-05-13T06:02:14.927990 #373899] INFO -- : I, [2024-05-13T06:02:15.034929 #373899] INFO -- : Checking leaked global symbols...none I, [2024-05-13T06:02:15.077370 #373899] INFO -- : /tmp/ruby/src/trunk/basictest/test.rb:assignment ....................................................................................................................................................................................................................................................................................................................................................................................OK 372 I, [2024-05-13T06:02:15.077471 #373899] INFO -- : /tmp/ruby/src/trunk/basictest/test.rb:condition ..OK 2 I, [2024-05-13T06:02:15.077490 #373899] INFO -- : /tmp/ruby/src/trunk/basictest/test.rb:if/unless ...OK 3 I, [2024-05-13T06:02:15.077506 #373899] INFO -- : /tmp/ruby/src/trunk/basictest/test.rb:case .....OK 5 I, [2024-05-13T06:02:15.077812 #373899] INFO -- : /tmp/ruby/src/trunk/basictest/test.rb:while/until ........OK 8 I, [2024-05-13T06:02:15.077891 #373899] INFO -- : /tmp/ruby/src/trunk/basictest/test.rb:exception ..........OK 10 I, [2024-05-13T06:02:15.078323 #373899] INFO -- : /tmp/ruby/src/trunk/basictest/test.rb:array .......................................OK 39 I, [2024-05-13T06:02:15.078475 #373899] INFO -- : /tmp/ruby/src/trunk/basictest/test.rb:hash ...........................OK 27 I, [2024-05-13T06:02:15.079732 #373899] INFO -- : /tmp/ruby/src/trunk/basictest/test.rb:iterator ...........................................................................................................OK 107 I, [2024-05-13T06:02:15.080246 #373899] INFO -- : /tmp/ruby/src/trunk/basictest/test.rb:float ................................................................................OK 80 I, [2024-05-13T06:02:15.082036 #373899] INFO -- : /tmp/ruby/src/trunk/basictest/test.rb:bignum ...............................OK 31 I, [2024-05-13T06:02:15.082828 #373899] INFO -- : /tmp/ruby/src/trunk/basictest/test.rb:string & char ..............................................................OK 62 I, [2024-05-13T06:02:15.082851 #373899] INFO -- : /tmp/ruby/src/trunk/basictest/test.rb:assignment ..........OK 10 I, [2024-05-13T06:02:15.082869 #373899] INFO -- : /tmp/ruby/src/trunk/basictest/test.rb:call ......OK 6 I, [2024-05-13T06:02:15.082911 #373899] INFO -- : /tmp/ruby/src/trunk/basictest/test.rb:proc .........OK 9 I, [2024-05-13T06:02:15.183479 #373899] INFO -- : /tmp/ruby/src/trunk/basictest/test.rb:signal ..OK 2 I, [2024-05-13T06:02:15.185119 #373899] INFO -- : /tmp/ruby/src/trunk/basictest/test.rb:eval ...........................OK 27 I, [2024-05-13T06:02:15.301660 #373899] INFO -- : /tmp/ruby/src/trunk/basictest/test.rb:system ........OK 8 I, [2024-05-13T06:02:15.301745 #373899] INFO -- : /tmp/ruby/src/trunk/basictest/test.rb:const .....OK 5 I, [2024-05-13T06:02:15.301762 #373899] INFO -- : /tmp/ruby/src/trunk/basictest/test.rb:clone .....OK 5 I, [2024-05-13T06:02:15.301789 #373899] INFO -- : /tmp/ruby/src/trunk/basictest/test.rb:marshal ....OK 4 I, [2024-05-13T06:02:15.301901 #373899] INFO -- : /tmp/ruby/src/trunk/basictest/test.rb:pack ....OK 4 I, [2024-05-13T06:02:15.301938 #373899] INFO -- : /tmp/ruby/src/trunk/basictest/test.rb:math ..OK 2 I, [2024-05-13T06:02:15.301955 #373899] INFO -- : /tmp/ruby/src/trunk/basictest/test.rb:struct ......OK 6 I, [2024-05-13T06:02:15.301983 #373899] INFO -- : /tmp/ruby/src/trunk/basictest/test.rb:variable ............OK 12 I, [2024-05-13T06:02:15.302007 #373899] INFO -- : /tmp/ruby/src/trunk/basictest/test.rb:trace ...OK 3 I, [2024-05-13T06:02:15.302099 #373899] INFO -- : /tmp/ruby/src/trunk/basictest/test.rb:defined? ............OK 12 I, [2024-05-13T06:02:15.302126 #373899] INFO -- : /tmp/ruby/src/trunk/basictest/test.rb:alias ......OK 6 I, [2024-05-13T06:02:15.302469 #373899] INFO -- : /tmp/ruby/src/trunk/basictest/test.rb:path .......................OK 23 I, [2024-05-13T06:02:15.340514 #373899] INFO -- : /tmp/ruby/src/trunk/basictest/test.rb:gc ....OK 4 I, [2024-05-13T06:02:15.342894 #373899] INFO -- : I, [2024-05-13T06:02:15.342966 #373899] INFO -- : test succeeded I, [2024-05-13T06:02:15.344324 #373899] INFO -- : $$$[end] "make yes-test-basic TESTS='-j20'" exit with 0. I, [2024-05-13T06:02:15.344438 #373899] INFO -- : $$$[beg] make yes-test-all TESTOPTS='--stderr-on-failure' TESTS='-j20' I, [2024-05-13T06:02:15.441966 #373899] INFO -- : BASERUBY = /usr/bin/ruby --disable=gems I, [2024-05-13T06:02:15.442039 #373899] INFO -- : CC = gcc I, [2024-05-13T06:02:15.442056 #373899] INFO -- : LD = ld I, [2024-05-13T06:02:15.442070 #373899] INFO -- : LDSHARED = gcc -shared I, [2024-05-13T06:02:15.442085 #373899] INFO -- : CFLAGS = -O3 -fno-fast-math -ggdb3 -Wall -Wextra -Wdeprecated-declarations -Wdiv-by-zero -Wduplicated-cond -Wimplicit-function-declaration -Wimplicit-int -Wpointer-arith -Wwrite-strings -Wold-style-definition -Wimplicit-fallthrough=0 -Wmissing-noreturn -Wno-cast-function-type -Wno-constant-logical-operand -Wno-long-long -Wno-missing-field-initializers -Wno-overlength-strings -Wno-packed-bitfield-compat -Wno-parentheses-equality -Wno-self-assign -Wno-tautological-compare -Wno-unused-parameter -Wno-unused-value -Wsuggest-attribute=format -Wsuggest-attribute=noreturn -Wunused-variable -Wmisleading-indentation -Wundef -fPIC I, [2024-05-13T06:02:15.442114 #373899] INFO -- : XCFLAGS = -U_FORTIFY_SOURCE -D_FORTIFY_SOURCE=2 -fstack-protector-strong -fno-strict-overflow -fvisibility=hidden -fexcess-precision=standard -DRUBY_EXPORT -I. -I.ext/include/x86_64-linux -I/tmp/ruby/src/trunk/include -I/tmp/ruby/src/trunk -I/tmp/ruby/src/trunk/prism -I/tmp/ruby/src/trunk/enc/unicode/15.0.0 I, [2024-05-13T06:02:15.442127 #373899] INFO -- : CPPFLAGS = I, [2024-05-13T06:02:15.442140 #373899] INFO -- : DLDFLAGS = -Wl,--compress-debug-sections=zlib -Wl,-soname,libruby.so.3.4 -fstack-protector-strong I, [2024-05-13T06:02:15.442154 #373899] INFO -- : SOLIBS = -lz -lrt -lrt -lgmp -ldl -lcrypt -lm -lpthread I, [2024-05-13T06:02:15.442167 #373899] INFO -- : LANG = en_US.UTF-8 I, [2024-05-13T06:02:15.442180 #373899] INFO -- : LC_ALL = I, [2024-05-13T06:02:15.442193 #373899] INFO -- : LC_CTYPE = I, [2024-05-13T06:02:15.442206 #373899] INFO -- : MFLAGS = I, [2024-05-13T06:02:15.442219 #373899] INFO -- : RUSTC = no I, [2024-05-13T06:02:15.442236 #373899] INFO -- : YJIT_RUSTC_ARGS = --crate-name=yjit --crate-type=staticlib --edition=2021 -g -C lto=thin -C opt-level=3 -C overflow-checks=on '--out-dir=/tmp/ruby/build/trunk/yjit/target/release/' /tmp/ruby/src/trunk/yjit/src/lib.rs I, [2024-05-13T06:02:15.442597 #373899] INFO -- : gcc (Ubuntu 11.4.0-1ubuntu1~22.04) 11.4.0 I, [2024-05-13T06:02:15.442657 #373899] INFO -- : Copyright (C) 2021 Free Software Foundation, Inc. I, [2024-05-13T06:02:15.442673 #373899] INFO -- : This is free software; see the source for copying conditions. There is NO I, [2024-05-13T06:02:15.442689 #373899] INFO -- : warranty; not even for MERCHANTABILITY or FITNESS FOR A PARTICULAR PURPOSE. I, [2024-05-13T06:02:15.442703 #373899] INFO -- : I, [2024-05-13T06:02:15.444258 #373899] INFO -- : generating enc.mk I, [2024-05-13T06:02:15.562777 #373899] INFO -- : making enc I, [2024-05-13T06:02:15.580011 #373899] INFO -- : make[1]: Entering directory '/tmp/ruby/build/trunk' I, [2024-05-13T06:02:15.580077 #373899] INFO -- : make[1]: Nothing to be done for 'enc'. I, [2024-05-13T06:02:15.580090 #373899] INFO -- : make[1]: Leaving directory '/tmp/ruby/build/trunk' I, [2024-05-13T06:02:15.580740 #373899] INFO -- : making srcs under enc I, [2024-05-13T06:02:15.610120 #373899] INFO -- : make[1]: Entering directory '/tmp/ruby/build/trunk' I, [2024-05-13T06:02:15.610183 #373899] INFO -- : make[1]: Nothing to be done for 'srcs'. I, [2024-05-13T06:02:15.610196 #373899] INFO -- : make[1]: Leaving directory '/tmp/ruby/build/trunk' I, [2024-05-13T06:02:15.611087 #373899] INFO -- : generating transdb.h I, [2024-05-13T06:02:15.707137 #373899] INFO -- : transdb.h unchanged I, [2024-05-13T06:02:15.708334 #373899] INFO -- : making trans I, [2024-05-13T06:02:15.742426 #373899] INFO -- : make[1]: Entering directory '/tmp/ruby/build/trunk' I, [2024-05-13T06:02:15.742513 #373899] INFO -- : make[1]: Nothing to be done for 'trans'. I, [2024-05-13T06:02:15.742530 #373899] INFO -- : make[1]: Leaving directory '/tmp/ruby/build/trunk' I, [2024-05-13T06:02:15.743144 #373899] INFO -- : making encs I, [2024-05-13T06:02:15.780476 #373899] INFO -- : make[1]: Entering directory '/tmp/ruby/build/trunk' I, [2024-05-13T06:02:15.780545 #373899] INFO -- : make[1]: Nothing to be done for 'encs'. I, [2024-05-13T06:02:15.780565 #373899] INFO -- : make[1]: Leaving directory '/tmp/ruby/build/trunk' I, [2024-05-13T06:02:15.782273 #373899] INFO -- : generating makefiles ext/configure-ext.mk I, [2024-05-13T06:02:15.808786 #373899] INFO -- : ext/configure-ext.mk updated I, [2024-05-13T06:02:15.811236 #373899] INFO -- : make[1]: Entering directory '/tmp/ruby/build/trunk' I, [2024-05-13T06:02:17.154230 #373899] INFO -- : make[1]: Leaving directory '/tmp/ruby/build/trunk' I, [2024-05-13T06:02:17.154982 #373899] INFO -- : generating makefile exts.mk I, [2024-05-13T06:02:17.191363 #373899] INFO -- : exts.mk unchanged I, [2024-05-13T06:02:17.195931 #373899] INFO -- : make[1]: Entering directory '/tmp/ruby/build/trunk' I, [2024-05-13T06:02:17.517376 #373899] INFO -- : make[2]: Entering directory '/tmp/ruby/build/trunk/ext/coverage' I, [2024-05-13T06:02:17.521559 #373899] INFO -- : make[2]: Leaving directory '/tmp/ruby/build/trunk/ext/coverage' I, [2024-05-13T06:02:17.527885 #373899] INFO -- : make[2]: Entering directory '/tmp/ruby/build/trunk/ext/date' I, [2024-05-13T06:02:17.532854 #373899] INFO -- : make[2]: Leaving directory '/tmp/ruby/build/trunk/ext/date' I, [2024-05-13T06:02:17.536663 #373899] INFO -- : make[2]: Entering directory '/tmp/ruby/build/trunk/ext/digest' I, [2024-05-13T06:02:17.545772 #373899] INFO -- : make[2]: Leaving directory '/tmp/ruby/build/trunk/ext/digest' I, [2024-05-13T06:02:17.572708 #373899] INFO -- : make[2]: Entering directory '/tmp/ruby/build/trunk/ext/digest/sha2' I, [2024-05-13T06:02:17.577564 #373899] INFO -- : make[2]: Leaving directory '/tmp/ruby/build/trunk/ext/digest/sha2' I, [2024-05-13T06:02:17.598888 #373899] INFO -- : make[2]: Entering directory '/tmp/ruby/build/trunk/ext/fiddle' I, [2024-05-13T06:02:17.609611 #373899] INFO -- : make[2]: Leaving directory '/tmp/ruby/build/trunk/ext/fiddle' I, [2024-05-13T06:02:17.614647 #373899] INFO -- : make[2]: Entering directory '/tmp/ruby/build/trunk/ext/io/console' I, [2024-05-13T06:02:17.618813 #373899] INFO -- : make[2]: Leaving directory '/tmp/ruby/build/trunk/ext/io/console' I, [2024-05-13T06:02:17.631472 #373899] INFO -- : make[2]: Entering directory '/tmp/ruby/build/trunk/ext/json' I, [2024-05-13T06:02:17.641889 #373899] INFO -- : make[2]: Leaving directory '/tmp/ruby/build/trunk/ext/json' I, [2024-05-13T06:02:17.657122 #373899] INFO -- : make[2]: Entering directory '/tmp/ruby/build/trunk/ext/monitor' I, [2024-05-13T06:02:17.661033 #373899] INFO -- : make[2]: Leaving directory '/tmp/ruby/build/trunk/ext/monitor' I, [2024-05-13T06:02:17.668525 #373899] INFO -- : make[2]: Entering directory '/tmp/ruby/build/trunk/ext/objspace' I, [2024-05-13T06:02:17.674790 #373899] INFO -- : make[2]: Leaving directory '/tmp/ruby/build/trunk/ext/objspace' I, [2024-05-13T06:02:17.692487 #373899] INFO -- : make[2]: Entering directory '/tmp/ruby/build/trunk/ext/openssl' I, [2024-05-13T06:02:17.709565 #373899] INFO -- : make[2]: Leaving directory '/tmp/ruby/build/trunk/ext/openssl' I, [2024-05-13T06:02:17.714322 #373899] INFO -- : make[2]: Entering directory '/tmp/ruby/build/trunk/ext/pathname' I, [2024-05-13T06:02:17.717820 #373899] INFO -- : make[2]: Leaving directory '/tmp/ruby/build/trunk/ext/pathname' I, [2024-05-13T06:02:17.725123 #373899] INFO -- : make[2]: Entering directory '/tmp/ruby/build/trunk/ext/psych' I, [2024-05-13T06:02:17.745278 #373899] INFO -- : make[2]: Leaving directory '/tmp/ruby/build/trunk/ext/psych' I, [2024-05-13T06:02:17.750512 #373899] INFO -- : make[2]: Entering directory '/tmp/ruby/build/trunk/ext/pty' I, [2024-05-13T06:02:17.754560 #373899] INFO -- : make[2]: Leaving directory '/tmp/ruby/build/trunk/ext/pty' I, [2024-05-13T06:02:17.769583 #373899] INFO -- : make[2]: Entering directory '/tmp/ruby/build/trunk/ext/ripper' I, [2024-05-13T06:02:17.777045 #373899] INFO -- : make[2]: Leaving directory '/tmp/ruby/build/trunk/ext/ripper' I, [2024-05-13T06:02:17.779507 #373899] INFO -- : make[2]: Entering directory '/tmp/ruby/build/trunk/ext/rubyvm' I, [2024-05-13T06:02:17.782705 #373899] INFO -- : make[2]: Leaving directory '/tmp/ruby/build/trunk/ext/rubyvm' I, [2024-05-13T06:02:17.795179 #373899] INFO -- : make[2]: Entering directory '/tmp/ruby/build/trunk/ext/socket' I, [2024-05-13T06:02:17.803176 #373899] INFO -- : make[2]: Leaving directory '/tmp/ruby/build/trunk/ext/socket' I, [2024-05-13T06:02:17.822341 #373899] INFO -- : make[2]: Entering directory '/tmp/ruby/build/trunk/.bundle/gems/bigdecimal-3.1.8/ext/bigdecimal' I, [2024-05-13T06:02:17.850594 #373899] INFO -- : make[2]: Leaving directory '/tmp/ruby/build/trunk/.bundle/gems/bigdecimal-3.1.8/ext/bigdecimal' I, [2024-05-13T06:02:17.852824 #373899] INFO -- : make[2]: Entering directory '/tmp/ruby/build/trunk/.bundle/gems/debug-1.9.2/ext/debug' I, [2024-05-13T06:02:17.875552 #373899] INFO -- : make[2]: Leaving directory '/tmp/ruby/build/trunk/.bundle/gems/debug-1.9.2/ext/debug' I, [2024-05-13T06:02:17.877496 #373899] INFO -- : make[2]: Entering directory '/tmp/ruby/build/trunk/.bundle/gems/nkf-0.2.0/ext/nkf' I, [2024-05-13T06:02:17.899615 #373899] INFO -- : make[2]: Leaving directory '/tmp/ruby/build/trunk/.bundle/gems/nkf-0.2.0/ext/nkf' I, [2024-05-13T06:02:17.901550 #373899] INFO -- : make[2]: Entering directory '/tmp/ruby/build/trunk/.bundle/gems/racc-1.7.3/ext/racc/cparse' I, [2024-05-13T06:02:17.923034 #373899] INFO -- : make[2]: Leaving directory '/tmp/ruby/build/trunk/.bundle/gems/racc-1.7.3/ext/racc/cparse' I, [2024-05-13T06:02:17.925449 #373899] INFO -- : make[2]: Entering directory '/tmp/ruby/build/trunk/.bundle/gems/rbs-3.4.4/ext/rbs_extension' I, [2024-05-13T06:02:17.946376 #373899] INFO -- : make[2]: Leaving directory '/tmp/ruby/build/trunk/.bundle/gems/rbs-3.4.4/ext/rbs_extension' I, [2024-05-13T06:02:17.948273 #373899] INFO -- : make[2]: Entering directory '/tmp/ruby/build/trunk/.bundle/gems/syslog-0.1.2/ext/syslog' I, [2024-05-13T06:02:17.969591 #373899] INFO -- : make[2]: Leaving directory '/tmp/ruby/build/trunk/.bundle/gems/syslog-0.1.2/ext/syslog' I, [2024-05-13T06:02:17.993877 #373899] INFO -- : make[2]: Entering directory '/tmp/ruby/build/trunk' I, [2024-05-13T06:02:18.068156 #373899] INFO -- : make[2]: 'ruby' is up to date. I, [2024-05-13T06:02:18.068222 #373899] INFO -- : make[2]: Leaving directory '/tmp/ruby/build/trunk' I, [2024-05-13T06:02:18.068725 #373899] INFO -- : make[1]: Leaving directory '/tmp/ruby/build/trunk' I, [2024-05-13T06:02:18.072340 #373899] INFO -- : make[1]: Entering directory '/tmp/ruby/build/trunk' I, [2024-05-13T06:02:18.072407 #373899] INFO -- : make[1]: Nothing to be done for 'note'. I, [2024-05-13T06:02:18.072421 #373899] INFO -- : make[1]: Leaving directory '/tmp/ruby/build/trunk' I, [2024-05-13T06:02:18.147511 #373899] INFO -- : Run options: I, [2024-05-13T06:02:18.147592 #373899] INFO -- : --seed=17554 I, [2024-05-13T06:02:18.147606 #373899] INFO -- : "--ruby=./miniruby -I/tmp/ruby/src/trunk/lib -I. -I.ext/common /tmp/ruby/src/trunk/tool/runruby.rb --extout=.ext -- --disable-gems" I, [2024-05-13T06:02:18.147623 #373899] INFO -- : --excludes-dir=/tmp/ruby/src/trunk/test/.excludes I, [2024-05-13T06:02:18.147633 #373899] INFO -- : --name=!/memory_leak/ I, [2024-05-13T06:02:18.147643 #373899] INFO -- : --stderr-on-failure I, [2024-05-13T06:02:18.147653 #373899] INFO -- : -j20 I, [2024-05-13T06:02:18.147663 #373899] INFO -- : I, [2024-05-13T06:02:18.147673 #373899] INFO -- : # Running tests: I, [2024-05-13T06:02:18.147682 #373899] INFO -- : I, [2024-05-13T06:02:18.269742 #373899] INFO -- : [ 1/885] 415259=test_merge_keys I, [2024-05-13T06:02:18.295181 #373899] INFO -- : [ 2/885] 415259=test_rdoc_extend I, [2024-05-13T06:02:18.295251 #373899] INFO -- : [ 3/885] 415261=test_history I, [2024-05-13T06:02:18.295261 #373899] INFO -- : [ 4/885] 415262=test_mixed_unicode_escapes I, [2024-05-13T06:02:18.295743 #373899] INFO -- : [ 5/885] 415263=test_rdoc_markup_to_ansi I, [2024-05-13T06:02:18.297806 #373899] INFO -- : [ 6/885] 415264=test_ipaddr I, [2024-05-13T06:02:18.297847 #373899] INFO -- : [ 7/885] 415274=test_win32ole_variant I, [2024-05-13T06:02:18.298610 #373899] INFO -- : [ 8/885] 415262=test_gem_resolver_api_specification I, [2024-05-13T06:02:18.298696 #373899] INFO -- : [ 9/885] 415276=test_win32ole_event I, [2024-05-13T06:02:18.298924 #373899] INFO -- : [ 10/885] 415275=test_time_tz I, [2024-05-13T06:02:18.299016 #373899] INFO -- : [ 11/885] 415277=test_rdoc_generator_json_index I, [2024-05-13T06:02:18.300061 #373899] INFO -- : [ 12/885] 415260=ractor_test I, [2024-05-13T06:02:18.302562 #373899] INFO -- : [ 13/885] 415278=test_trace I, [2024-05-13T06:02:18.302751 #373899] INFO -- : [ 14/885] 415276=test_arity I, [2024-05-13T06:02:18.307381 #373899] INFO -- : [ 15/885] 415274=test_stringio I, [2024-05-13T06:02:18.309017 #373899] INFO -- : [ 16/885] 415276=test_io_wait_uncommon I, [2024-05-13T06:02:18.312446 #373899] INFO -- : [ 17/885] 415278=test_win32ole_variable I, [2024-05-13T06:02:18.313332 #373899] INFO -- : [ 18/885] 415278=test_bignum I, [2024-05-13T06:02:18.329136 #373899] INFO -- : [ 19/885] 415265=test_rdoc_class_module I, [2024-05-13T06:02:18.329332 #373899] INFO -- : [ 20/885] 415266=test_gem_ci_detector I, [2024-05-13T06:02:18.329682 #373899] INFO -- : [ 21/885] 415270=test_threadgroup I, [2024-05-13T06:02:18.329699 #373899] INFO -- : [ 22/885] 415272=test_gem_specification I, [2024-05-13T06:02:18.329839 #373899] INFO -- : [ 23/885] 415269=test_enum I, [2024-05-13T06:02:18.330591 #373899] INFO -- : [ 24/885] 415264=test_complex2 I, [2024-05-13T06:02:18.330799 #373899] INFO -- : [ 25/885] 415276=test_resolve_symbol I, [2024-05-13T06:02:18.335043 #373899] INFO -- : [ 26/885] 415271=test_gem_package I, [2024-05-13T06:02:18.338158 #373899] INFO -- : [ 27/885] 415268=test_have_macro I, [2024-05-13T06:02:18.339453 #373899] INFO -- : [ 28/885] 415264=test_function_entry I, [2024-05-13T06:02:18.343735 #373899] INFO -- : [ 29/885] 415264=test_arith_seq_beg_len_step I, [2024-05-13T06:02:18.357054 #373899] INFO -- : [ 30/885] 415273=test_gem_resolver_requirement_list I, [2024-05-13T06:02:18.368374 #373899] INFO -- : [ 31/885] 415275=test_pkcs7 I, [2024-05-13T06:02:18.370316 #373899] INFO -- : [ 32/885] 415260=test_enc_associate I, [2024-05-13T06:02:18.376011 #373899] INFO -- : [ 33/885] 415261=test_lazy_enumerator I, [2024-05-13T06:02:18.383736 #373899] INFO -- : [ 34/885] 415267=test_unix I, [2024-05-13T06:02:18.402153 #373899] INFO -- : [ 35/885] 415264=test_context I, [2024-05-13T06:02:18.417155 #373899] INFO -- : [ 36/885] 415276=test_gem_commands_pristine_command I, [2024-05-13T06:02:18.418561 #373899] INFO -- : [ 37/885] 415259=test_nofree I, [2024-05-13T06:02:18.421082 #373899] INFO -- : [ 38/885] 415259=test_coder I, [2024-05-13T06:02:18.421696 #373899] INFO -- : [ 39/885] 415278=test_symbol I, [2024-05-13T06:02:18.425490 #373899] INFO -- : [ 40/885] 415267=test_find_executable I, [2024-05-13T06:02:18.443751 #373899] INFO -- : [ 41/885] 415259=ruby_api_test I, [2024-05-13T06:02:18.454057 #373899] INFO -- : [ 42/885] 415274=test_cgi_multipart I, [2024-05-13T06:02:18.456564 #373899] INFO -- : [ 43/885] 415267=test_word I, [2024-05-13T06:02:18.457453 #373899] INFO -- : [ 44/885] 415267=test_gem_commands_cleanup_command I, [2024-05-13T06:02:18.492578 #373899] INFO -- : [ 45/885] 415263=test_member I, [2024-05-13T06:02:18.493917 #373899] INFO -- : [ 46/885] 415263=test_numeric I, [2024-05-13T06:02:18.510915 #373899] INFO -- : [ 47/885] 415277=format_errors_test I, [2024-05-13T06:02:18.516472 #373899] INFO -- : [ 48/885] 415273=test_dir I, [2024-05-13T06:02:18.523701 #373899] INFO -- : [ 49/885] 415263=test_date_ractor I, [2024-05-13T06:02:18.539005 #373899] INFO -- : [ 50/885] 415266=test_gem_console_ui I, [2024-05-13T06:02:18.565373 #373899] INFO -- : [ 51/885] 415266=test_eval I, [2024-05-13T06:02:18.565723 #373899] INFO -- : [ 52/885] 415266=test_autoconf I, [2024-05-13T06:02:18.571489 #373899] INFO -- : [ 53/885] 415266=test_ractor_compatibility I, [2024-05-13T06:02:18.578310 #373899] INFO -- : [ 54/885] 415277=test_mailto I, [2024-05-13T06:02:18.584992 #373899] INFO -- : [ 55/885] 415262=location_test I, [2024-05-13T06:02:18.596374 #373899] INFO -- : [ 56/885] 415275=test_symbol I, [2024-05-13T06:02:18.606236 #373899] INFO -- : [ 57/885] 415277=test_coderange I, [2024-05-13T06:02:18.609722 #373899] INFO -- : [ 58/885] 415277=test_http_request I, [2024-05-13T06:02:18.611273 #373899] INFO -- : [ 59/885] 415275=test_gem_source_fetch_problem I, [2024-05-13T06:02:18.617691 #373899] INFO -- : [ 60/885] 415264=json_generic_object_test I, [2024-05-13T06:02:18.632823 #373899] INFO -- : [ 61/885] 415264=test_rdoc_comment I, [2024-05-13T06:02:18.657571 #373899] INFO -- : [ 62/885] 415274=test_resize I, [2024-05-13T06:02:18.662590 #373899] INFO -- : [ 63/885] 415259=test_error_highlight I, [2024-05-13T06:02:18.662939 #373899] INFO -- : [ 64/885] 415274=test_rdoc_generator_darkfish I, [2024-05-13T06:02:18.666676 #373899] INFO -- : [ 65/885] 415277=test_integer I, [2024-05-13T06:02:18.724423 #373899] INFO -- : [ 66/885] 415277=desugar_compiler_test I, [2024-05-13T06:02:18.731908 #373899] INFO -- : [ 67/885] 415275=test_dryrun I, [2024-05-13T06:02:18.737462 #373899] INFO -- : [ 68/885] 415277=test_rdoc_attr I, [2024-05-13T06:02:18.740322 #373899] INFO -- : [ 69/885] 415262=test_env I, [2024-05-13T06:02:18.743467 #373899] INFO -- : [ 70/885] 415261=test_gem_commands_setup_command I, [2024-05-13T06:02:18.748894 #373899] INFO -- : [ 71/885] 415277=test_rubygems I, [2024-05-13T06:02:18.765735 #373899] INFO -- : [ 72/885] 415273=test_call I, [2024-05-13T06:02:18.767648 #373899] INFO -- : [ 73/885] 415275=test_https_proxy I, [2024-05-13T06:02:18.810483 #373899] INFO -- : [ 74/885] 415264=test_integer I, [2024-05-13T06:02:18.822885 #373899] INFO -- : [ 75/885] 415263=test_cgi_modruby I, [2024-05-13T06:02:18.832443 #373899] INFO -- : [ 76/885] 415263=test_rubyoptions I, [2024-05-13T06:02:18.833831 #373899] INFO -- : [ 77/885] 415275=test_super I, [2024-05-13T06:02:18.900514 #373899] INFO -- : [ 78/885] 415268=test_gem_resolver_git_specification I, [2024-05-13T06:02:18.910406 #373899] INFO -- : [ 79/885] 415273=test_usrmarshal I, [2024-05-13T06:02:18.923557 #373899] INFO -- : [ 80/885] 415260=test_object_references I, [2024-05-13T06:02:18.977439 #373899] INFO -- : [ 81/885] 415260=test_capacity I, [2024-05-13T06:02:18.980856 #373899] INFO -- : [ 82/885] 415260=test_nextafter I, [2024-05-13T06:02:19.026687 #373899] INFO -- : [ 83/885] 415267=test_have_func I, [2024-05-13T06:02:19.029663 #373899] INFO -- : [ 84/885] 415259=test_stat I, [2024-05-13T06:02:19.031349 #373899] INFO -- : [ 85/885] 415266=test_gem_request_set_lockfile_tokenizer I, [2024-05-13T06:02:19.032071 #373899] INFO -- : [ 86/885] 415259=test_ractor I, [2024-05-13T06:02:19.059033 #373899] INFO -- : [ 87/885] 415260=test_debugger_integration I, [2024-05-13T06:02:19.076290 #373899] INFO -- : [ 88/885] 415260=test_rendering I, [2024-05-13T06:02:19.092981 #373899] INFO -- : [ 89/885] 415277=test_my_integer I, [2024-05-13T06:02:19.095236 #373899] INFO -- : [ 90/885] 415277=test_thread I, [2024-05-13T06:02:19.095627 #373899] INFO -- : [ 91/885] 415266=json_ext_parser_test I, [2024-05-13T06:02:19.107441 #373899] INFO -- : [ 92/885] 415266=test_ssl I, [2024-05-13T06:02:19.119880 #373899] INFO -- : [ 93/885] 415271=test_singleton_function I, [2024-05-13T06:02:19.124003 #373899] INFO -- : [ 94/885] 415271=test_ancdata I, [2024-05-13T06:02:19.128752 #373899] INFO -- : [ 95/885] 415271=test_reline_key I, [2024-05-13T06:02:19.152507 #373899] INFO -- : [ 96/885] 415260=test_rb_str_dup I, [2024-05-13T06:02:19.158033 #373899] INFO -- : [ 97/885] 415269=test_nonblock I, [2024-05-13T06:02:19.159441 #373899] INFO -- : [ 98/885] 415260=test_weakref I, [2024-05-13T06:02:19.159969 #373899] INFO -- : [ 99/885] 415273=test_marshal I, [2024-05-13T06:02:19.181499 #373899] INFO -- : [100/885] 415271=test_unicode_normalize I, [2024-05-13T06:02:19.182887 #373899] INFO -- : [101/885] 415265=test_timeout I, [2024-05-13T06:02:19.209647 #373899] INFO -- : [102/885] 415269=test_alias I, [2024-05-13T06:02:19.282121 #373899] INFO -- : [103/885] 415274=test_parser I, [2024-05-13T06:02:19.282293 #373899] INFO -- : [104/885] 415260=test_cgi_core I, [2024-05-13T06:02:19.301307 #373899] INFO -- : [105/885] 415260=test_ractor I, [2024-05-13T06:02:19.304917 #373899] INFO -- : [106/885] 415268=test_gem_commands_open_command I, [2024-05-13T06:02:19.310595 #373899] INFO -- : [107/885] 415274=test_dns I, [2024-05-13T06:02:19.313305 #373899] INFO -- : [108/885] 415275=test_gem I, [2024-05-13T06:02:19.315805 #373899] INFO -- : [109/885] 415260=test_gem_source_lock I, [2024-05-13T06:02:19.349493 #373899] INFO -- : [110/885] 415270=test_registry I, [2024-05-13T06:02:19.351841 #373899] INFO -- : [111/885] 415270=parse_stream_test I, [2024-05-13T06:02:19.363389 #373899] INFO -- : [112/885] 415269=test_encoding I, [2024-05-13T06:02:19.416845 #373899] INFO -- : [113/885] 415268=test_erb_command I, [2024-05-13T06:02:19.427086 #373899] INFO -- : [114/885] 415259=test_helper I, [2024-05-13T06:02:19.428270 #373899] INFO -- : [115/885] 415259=test_gem_uri_formatter I, [2024-05-13T06:02:19.438835 #373899] INFO -- : [116/885] 415261=test_constant I, [2024-05-13T06:02:19.447281 #373899] INFO -- : [117/885] 415268=test_dup I, [2024-05-13T06:02:19.447695 #373899] INFO -- : [118/885] 415270=test_pty I, [2024-05-13T06:02:19.503344 #373899] INFO -- : [119/885] 415273=command_line_test I, [2024-05-13T06:02:19.551018 #373899] INFO -- : [120/885] 415260=test_range I, [2024-05-13T06:02:19.590559 #373899] INFO -- : [121/885] 415273=test_project_sanity I, [2024-05-13T06:02:19.598650 #373899] INFO -- : [122/885] 415269=test_rdoc_ri_paths I, [2024-05-13T06:02:19.623845 #373899] INFO -- : [123/885] 415266=library_symbols_test I, [2024-05-13T06:02:19.637495 #373899] INFO -- : [124/885] 415259=test_locale I, [2024-05-13T06:02:19.650870 #373899] INFO -- : [125/885] 415273=test_addr I, [2024-05-13T06:02:19.661406 #373899] INFO -- : [126/885] 415268=test_ensured I, [2024-05-13T06:02:19.682536 #373899] INFO -- : [127/885] 415273=test_ts I, [2024-05-13T06:02:19.690863 #373899] INFO -- : [128/885] 415278=test_gem_commands_check_command I, [2024-05-13T06:02:19.704270 #373899] INFO -- : [129/885] 415266=test_regexp I, [2024-05-13T06:02:19.733517 #373899] INFO -- : [130/885] 415268=errors_test I, [2024-05-13T06:02:19.777089 #373899] INFO -- : [131/885] 415269=test_integer_comb I, [2024-05-13T06:02:19.806695 #373899] INFO -- : [132/885] 415259=test_rdoc_markup_document I, [2024-05-13T06:02:19.815105 #373899] INFO -- : [133/885] 415274=test_tmpdir I, [2024-05-13T06:02:19.820324 #373899] INFO -- : [134/885] 415259=test_vm_dump I, [2024-05-13T06:02:19.825041 #373899] INFO -- : [135/885] 415259=test_udp I, [2024-05-13T06:02:19.829461 #373899] INFO -- : [136/885] 415259=unescape_test I, [2024-05-13T06:02:19.902915 #373899] INFO -- : [137/885] 415274=test_ostruct I, [2024-05-13T06:02:19.908177 #373899] INFO -- : [138/885] 415278=test_force_exit I, [2024-05-13T06:02:19.909778 #373899] INFO -- : [139/885] 415268=test_file I, [2024-05-13T06:02:19.919708 #373899] INFO -- : [140/885] 415270=test_data_error I, [2024-05-13T06:02:19.997570 #373899] INFO -- : [141/885] 415265=bom_test I, [2024-05-13T06:02:19.999018 #373899] INFO -- : [142/885] 415278=static_inspect_test I, [2024-05-13T06:02:20.017591 #373899] INFO -- : [143/885] 415270=test_x509store I, [2024-05-13T06:02:20.053937 #373899] INFO -- : [144/885] 415276=test_rdoc_code_object I, [2024-05-13T06:02:20.066882 #373899] INFO -- : [145/885] 415278=test_fips I, [2024-05-13T06:02:20.081454 #373899] INFO -- : [146/885] 415274=test_x509name I, [2024-05-13T06:02:20.083005 #373899] INFO -- : [147/885] 415265=test_update I, [2024-05-13T06:02:20.105475 #373899] INFO -- : [148/885] 415265=test_jaro_winkler I, [2024-05-13T06:02:20.108917 #373899] INFO -- : [149/885] 415265=test_random_formatter I, [2024-05-13T06:02:20.131499 #373899] INFO -- : [150/885] 415274=test_helper I, [2024-05-13T06:02:20.133546 #373899] INFO -- : [151/885] 415265=test_ast I, [2024-05-13T06:02:20.195211 #373899] INFO -- : [152/885] 415274=test_gem_request_set_gem_dependency_api I, [2024-05-13T06:02:20.199313 #373899] INFO -- : [153/885] 415273=test_lambda I, [2024-05-13T06:02:20.228701 #373899] INFO -- : [154/885] 415260=test_webauthn_listener I, [2024-05-13T06:02:20.248107 #373899] INFO -- : [155/885] 415273=test_enumerable I, [2024-05-13T06:02:20.276018 #373899] INFO -- : [156/885] 415273=test_gem_resolver_vendor_set I, [2024-05-13T06:02:20.277380 #373899] INFO -- : [157/885] 415260=test_config I, [2024-05-13T06:02:20.293932 #373899] INFO -- : [158/885] 415267=test_gem_resolver_api_set I, [2024-05-13T06:02:20.297852 #373899] INFO -- : [159/885] 415273=test_gem_safe_marshal I, [2024-05-13T06:02:20.319294 #373899] INFO -- : [160/885] 415278=test_transcode I, [2024-05-13T06:02:20.332612 #373899] INFO -- : [161/885] 415267=json_generator_test I, [2024-05-13T06:02:20.410045 #373899] INFO -- : [162/885] 415267=test_eval I, [2024-05-13T06:02:20.435319 #373899] INFO -- : [163/885] 415270=test_gem_update_suggestion I, [2024-05-13T06:02:20.480382 #373899] INFO -- : [164/885] 415272=test_files_test I, [2024-05-13T06:02:20.513807 #373899] INFO -- : [165/885] 415278=test_file_exhaustive I, [2024-05-13T06:02:20.526981 #373899] INFO -- : [166/885] 415274=test_logger I, [2024-05-13T06:02:20.542197 #373899] INFO -- : [167/885] 415274=test_gem_resolver_lock_set I, [2024-05-13T06:02:20.560773 #373899] INFO -- : [168/885] 415272=test_not I, [2024-05-13T06:02:20.567867 #373899] INFO -- : [169/885] 415274=test_import I, [2024-05-13T06:02:20.568772 #373899] INFO -- : [170/885] 415272=test_rdoc_parser_markdown I, [2024-05-13T06:02:20.602286 #373899] INFO -- : [171/885] 415267=test_numhash I, [2024-05-13T06:02:20.605096 #373899] INFO -- : [172/885] 415267=test_gem_commands_push_command I, [2024-05-13T06:02:20.629166 #373899] INFO -- : [173/885] 415270=test_weakkeymap I, [2024-05-13T06:02:20.640357 #373899] INFO -- : [174/885] 415276=test_pkey_rsa I, [2024-05-13T06:02:20.752786 #373899] INFO -- : [175/885] 415272=test_gem_platform I, [2024-05-13T06:02:20.784057 #373899] INFO -- : [176/885] 415270=test_rdoc_markup_hard_break I, [2024-05-13T06:02:20.784419 #373899] INFO -- : [177/885] 415260=test_gem_package_task I, [2024-05-13T06:02:20.790064 #373899] INFO -- : [178/885] 415273=test_date_strptime I, [2024-05-13T06:02:20.790439 #373899] INFO -- : [179/885] 415260=test_placearg I, [2024-05-13T06:02:20.872614 #373899] INFO -- : [180/885] 415272=test_win32ole_method I, [2024-05-13T06:02:20.878693 #373899] INFO -- : [181/885] 415272=test_delete I, [2024-05-13T06:02:20.880596 #373899] INFO -- : [182/885] 415273=test_class_name_check I, [2024-05-13T06:02:20.883828 #373899] INFO -- : [183/885] 415272=test_keyword I, [2024-05-13T06:02:20.903483 #373899] INFO -- : [184/885] 415273=test_continuation I, [2024-05-13T06:02:20.909737 #373899] INFO -- : [185/885] 415273=test_fd_setsize I, [2024-05-13T06:02:20.911608 #373899] INFO -- : [186/885] 415273=test_normalize I, [2024-05-13T06:02:20.913961 #373899] INFO -- : [187/885] 415273=test_ossl I, [2024-05-13T06:02:20.922794 #373899] INFO -- : [188/885] 415260=test_timeout I, [2024-05-13T06:02:20.931383 #373899] INFO -- : [189/885] 415260=test_flip I, [2024-05-13T06:02:20.934545 #373899] INFO -- : [190/885] 415270=compiler_test I, [2024-05-13T06:02:20.944950 #373899] INFO -- : [191/885] 415270=test_change_word I, [2024-05-13T06:02:20.947356 #373899] INFO -- : [192/885] 415270=test_sleep I, [2024-05-13T06:02:20.964420 #373899] INFO -- : [193/885] 415260=test_gem_local_remote_options I, [2024-05-13T06:02:20.969243 #373899] INFO -- : [194/885] 415276=test_date_arith I, [2024-05-13T06:02:20.978904 #373899] INFO -- : [195/885] 415276=test_ruby_lex I, [2024-05-13T06:02:21.019843 #373899] INFO -- : [196/885] 415260=test_object I, [2024-05-13T06:02:21.082748 #373899] INFO -- : [197/885] 415267=test_pointer I, [2024-05-13T06:02:21.237792 #373899] INFO -- : [198/885] 415275=test_big5 I, [2024-05-13T06:02:21.244645 #373899] INFO -- : [199/885] 415275=test_func I, [2024-05-13T06:02:21.257666 #373899] INFO -- : [200/885] 415276=test_type I, [2024-05-13T06:02:21.261829 #373899] INFO -- : [201/885] 415276=test_ractor I, [2024-05-13T06:02:21.293563 #373899] INFO -- : [202/885] 415259=test_tsort I, [2024-05-13T06:02:21.299212 #373899] INFO -- : [203/885] 415259=test_signedness I, [2024-05-13T06:02:21.315371 #373899] INFO -- : [204/885] 415276=test_rdoc_rd_block_parser I, [2024-05-13T06:02:21.352953 #373899] INFO -- : [205/885] 415276=test_object I, [2024-05-13T06:02:21.361655 #373899] INFO -- : [206/885] 415276=test_cgi_header I, [2024-05-13T06:02:21.368411 #373899] INFO -- : [207/885] 415267=heredoc_dedent_test I, [2024-05-13T06:02:21.378636 #373899] INFO -- : [208/885] 415276=version_test I, [2024-05-13T06:02:21.401486 #373899] INFO -- : [209/885] 415274=test_gem_command_manager I, [2024-05-13T06:02:21.457806 #373899] INFO -- : [210/885] 415272=test_basicinstructions I, [2024-05-13T06:02:21.463459 #373899] INFO -- : [211/885] 415260=test_gem_gemcutter_utilities I, [2024-05-13T06:02:21.463710 #373899] INFO -- : [212/885] 415276=test_key_actor_emacs I, [2024-05-13T06:02:21.474449 #373899] INFO -- : [213/885] 415267=test_arithmetic_sequence I, [2024-05-13T06:02:21.491770 #373899] INFO -- : [214/885] 415267=test_set_len I, [2024-05-13T06:02:21.497851 #373899] INFO -- : [215/885] 415267=test_httpresponses I, [2024-05-13T06:02:21.512854 #373899] INFO -- : [216/885] 415272=test_encoding I, [2024-05-13T06:02:21.518246 #373899] INFO -- : [217/885] 415274=test_rdoc_ri_driver I, [2024-05-13T06:02:21.526719 #373899] INFO -- : [218/885] 415272=test_httpheader I, [2024-05-13T06:02:21.559562 #373899] INFO -- : [219/885] 415267=test_gem_resolver_local_specification I, [2024-05-13T06:02:21.573532 #373899] INFO -- : [220/885] 415264=test_rdoc_markup_to_label I, [2024-05-13T06:02:21.577831 #373899] INFO -- : [221/885] 415272=test_install I, [2024-05-13T06:02:21.607938 #373899] INFO -- : [222/885] 415262=test_sockopt I, [2024-05-13T06:02:21.612255 #373899] INFO -- : [223/885] 415262=json_encoding_test I, [2024-05-13T06:02:21.612713 #373899] INFO -- : [224/885] 415267=test_color I, [2024-05-13T06:02:21.612921 #373899] INFO -- : [225/885] 415276=test_key_stroke I, [2024-05-13T06:02:21.616748 #373899] INFO -- : [226/885] 415264=test_human_typo I, [2024-05-13T06:02:21.618540 #373899] INFO -- : [227/885] 415276=test_primitive I, [2024-05-13T06:02:21.627585 #373899] INFO -- : [228/885] 415262=test_rbconfig I, [2024-05-13T06:02:21.629689 #373899] INFO -- : [229/885] 415276=test_pair I, [2024-05-13T06:02:21.631064 #373899] INFO -- : [230/885] 415262=test_win32ole_param I, [2024-05-13T06:02:21.631496 #373899] INFO -- : [231/885] 415264=test_gem_commands_yank_command I, [2024-05-13T06:02:21.634636 #373899] INFO -- : [232/885] 415262=test_acceptable I, [2024-05-13T06:02:21.762014 #373899] INFO -- : [233/885] 415267=test_rdoc_generator_pot_po_entry I, [2024-05-13T06:02:21.787471 #373899] INFO -- : [234/885] 415262=test_euc_jp I, [2024-05-13T06:02:21.790767 #373899] INFO -- : [235/885] 415262=test_document I, [2024-05-13T06:02:21.791201 #373899] INFO -- : [236/885] 415274=test_rdoc_i18n_locale I, [2024-05-13T06:02:21.796783 #373899] INFO -- : [237/885] 415262=test_chilled I, [2024-05-13T06:02:21.799398 #373899] INFO -- : [238/885] 415274=test_name_error_extension I, [2024-05-13T06:02:21.800155 #373899] INFO -- : [239/885] 415262=static_literals_test I, [2024-05-13T06:02:21.805083 #373899] INFO -- : [240/885] 415274=test_data I, [2024-05-13T06:02:21.805662 #373899] INFO -- : [241/885] 415260=test_filter I, [2024-05-13T06:02:21.807360 #373899] INFO -- : [242/885] 415262=test_gem_gem_runner I, [2024-05-13T06:02:21.808610 #373899] INFO -- : [243/885] 415274=test_rdoc_method_attr I, [2024-05-13T06:02:21.836717 #373899] INFO -- : [244/885] 415260=test_unicode I, [2024-05-13T06:02:21.842657 #373899] INFO -- : [245/885] 415272=test_rdoc_parser_changelog I, [2024-05-13T06:02:21.845422 #373899] INFO -- : [246/885] 415260=test_enumerator I, [2024-05-13T06:02:21.848891 #373899] INFO -- : [247/885] 415260=test_koi8 I, [2024-05-13T06:02:21.852184 #373899] INFO -- : [248/885] 415260=parameters_signature_test I, [2024-05-13T06:02:21.862215 #373899] INFO -- : [249/885] 415262=test_rdoc_generator_pot I, [2024-05-13T06:02:21.903143 #373899] INFO -- : [250/885] 415272=test_ssl_session I, [2024-05-13T06:02:21.903932 #373899] INFO -- : [251/885] 415267=test_lexer I, [2024-05-13T06:02:21.918311 #373899] INFO -- : [252/885] 415274=test_thread_cv I, [2024-05-13T06:02:21.921134 #373899] INFO -- : [253/885] 415267=test_notimplement I, [2024-05-13T06:02:21.924141 #373899] INFO -- : [254/885] 415260=test_random I, [2024-05-13T06:02:21.928205 #373899] INFO -- : [255/885] 415267=test_gem_uri I, [2024-05-13T06:02:21.929323 #373899] INFO -- : [256/885] 415260=test_key_event_record I, [2024-05-13T06:02:21.932110 #373899] INFO -- : [257/885] 415260=test_gem_resolver_vendor_specification I, [2024-05-13T06:02:21.933707 #373899] INFO -- : [258/885] 415261=test_gem_commands_update_command I, [2024-05-13T06:02:21.948621 #373899] INFO -- : [259/885] 415260=test_rdoc_markup_to_html I, [2024-05-13T06:02:21.960570 #373899] INFO -- : [260/885] 415267=test_date_compat I, [2024-05-13T06:02:21.964316 #373899] INFO -- : [261/885] 415267=test_bug-14834 I, [2024-05-13T06:02:22.007707 #373899] INFO -- : [262/885] 415267=test_terminfo I, [2024-05-13T06:02:22.014953 #373899] INFO -- : [263/885] 415267=test_compile_prism I, [2024-05-13T06:02:22.068233 #373899] INFO -- : [264/885] 415262=redundant_return_test I, [2024-05-13T06:02:22.074055 #373899] INFO -- : [265/885] 415262=test_case_mapping I, [2024-05-13T06:02:22.084072 #373899] INFO -- : [266/885] 415262=test_path I, [2024-05-13T06:02:22.091356 #373899] INFO -- : [267/885] 415262=test_win32ole_param_event I, [2024-05-13T06:02:22.096296 #373899] INFO -- : [268/885] 415262=test_bn I, [2024-05-13T06:02:22.114778 #373899] INFO -- : [269/885] 415262=test_addrinfo I, [2024-05-13T06:02:22.156489 #373899] INFO -- : [270/885] 415262=test_http I, [2024-05-13T06:02:22.169619 #373899] INFO -- : [271/885] 415275=test_tree_spell_checker I, [2024-05-13T06:02:22.200326 #373899] INFO -- : [272/885] 415275=test_rdoc_markup_heading I, [2024-05-13T06:02:22.210326 #373899] INFO -- : [273/885] 415260=test_exception_at_throwing I, [2024-05-13T06:02:22.219024 #373899] INFO -- : [274/885] 415264=test_iseq I, [2024-05-13T06:02:22.269326 #373899] INFO -- : [275/885] 415267=test_pkey_dsa I, [2024-05-13T06:02:22.278308 #373899] INFO -- : [276/885] 415260=test_ocsp I, [2024-05-13T06:02:22.306470 #373899] INFO -- : [277/885] 415271=test_class I, [2024-05-13T06:02:22.318620 #373899] INFO -- : [278/885] 415271=test_scheduler I, [2024-05-13T06:02:22.358274 #373899] INFO -- : [279/885] 415275=test_gem_commands_build_command I, [2024-05-13T06:02:22.462650 #373899] INFO -- : [280/885] 415271=test_case_comprehensive I, [2024-05-13T06:02:22.555089 #373899] INFO -- : [281/885] 415274=test_interned_str I, [2024-05-13T06:02:22.556943 #373899] INFO -- : [282/885] 415274=test_gem_commands_server_command I, [2024-05-13T06:02:22.564568 #373899] INFO -- : [283/885] 415274=test_did_you_mean I, [2024-05-13T06:02:22.619614 #373899] INFO -- : [284/885] 415260=test_io_m17n I, [2024-05-13T06:02:22.664259 #373899] INFO -- : [285/885] 415275=test_variable_name_check I, [2024-05-13T06:02:22.668764 #373899] INFO -- : [286/885] 415274=test_tracer I, [2024-05-13T06:02:22.691416 #373899] INFO -- : [287/885] 415275=test_cmethod I, [2024-05-13T06:02:22.692519 #373899] INFO -- : [288/885] 415275=test_option I, [2024-05-13T06:02:22.723347 #373899] INFO -- : [289/885] 415264=test_append I, [2024-05-13T06:02:22.725866 #373899] INFO -- : [290/885] 415264=test_mkmf I, [2024-05-13T06:02:22.740959 #373899] INFO -- : [291/885] 415274=test_date_marshal I, [2024-05-13T06:02:22.744765 #373899] INFO -- : [292/885] 415274=test_history I, [2024-05-13T06:02:22.752847 #373899] INFO -- : [293/885] 415274=test_popen_deadlock I, [2024-05-13T06:02:22.761779 #373899] INFO -- : [294/885] 415264=test_delegate I, [2024-05-13T06:02:22.779856 #373899] INFO -- : [295/885] 415264=test_exit I, [2024-05-13T06:02:22.826519 #373899] INFO -- : [296/885] 415264=test_recursion I, [2024-05-13T06:02:22.842345 #373899] INFO -- : [297/885] 415264=test_rdoc_servlet I, [2024-05-13T06:02:22.849258 #373899] INFO -- : [298/885] 415275=test_gem_security I, [2024-05-13T06:02:22.882078 #373899] INFO -- : [299/885] 415272=test_ractor I, [2024-05-13T06:02:22.930515 #373899] INFO -- : [300/885] 415269=test_digest I, [2024-05-13T06:02:22.942429 #373899] INFO -- : [301/885] 415267=test_bundled_ca I, [2024-05-13T06:02:22.960359 #373899] INFO -- : [302/885] 415272=test_closure I, [2024-05-13T06:02:22.965657 #373899] INFO -- : [303/885] 415269=test_open3 I, [2024-05-13T06:02:23.004245 #373899] INFO -- : [304/885] 415264=test_multi_irb_commands I, [2024-05-13T06:02:23.008059 #373899] INFO -- : [305/885] 415264=test_fiber I, [2024-05-13T06:02:23.173150 #373899] INFO -- : [306/885] 415272=reflection_test I, [2024-05-13T06:02:23.257449 #373899] INFO -- : [307/885] 415272=test_within_pipe I, [2024-05-13T06:02:23.321548 #373899] INFO -- : [308/885] 415274=test_emoji_breaks I, [2024-05-13T06:02:23.333603 #373899] INFO -- : [309/885] 415274=test_gem_bundler_version_finder I, [2024-05-13T06:02:23.349103 #373899] INFO -- : [310/885] 415272=test_help I, [2024-05-13T06:02:23.354631 #373899] INFO -- : [311/885] 415274=test_rdoc_markup_to_bs I, [2024-05-13T06:02:23.359567 #373899] INFO -- : [312/885] 415261=test_beginendblock I, [2024-05-13T06:02:23.361841 #373899] INFO -- : [313/885] 415272=test_files_lib I, [2024-05-13T06:02:23.361901 #373899] INFO -- : [314/885] 415272=test_gem_commands_unpack_command I, [2024-05-13T06:02:23.391553 #373899] INFO -- : [315/885] 415274=test_stream I, [2024-05-13T06:02:23.400232 #373899] INFO -- : [316/885] 415274=test_to_ary_concat I, [2024-05-13T06:02:23.552365 #373899] INFO -- : [317/885] 415259=test_time I, [2024-05-13T06:02:23.563746 #373899] INFO -- : [318/885] 415272=test_webauthn_listener_response I, [2024-05-13T06:02:23.594878 #373899] INFO -- : [319/885] 415272=test_printf I, [2024-05-13T06:02:23.612079 #373899] INFO -- : [320/885] 415272=test_rdoc_markup_pre_process I, [2024-05-13T06:02:23.686604 #373899] INFO -- : [321/885] 415272=test_pinned I, [2024-05-13T06:02:23.734293 #373899] INFO -- : [322/885] 415272=test_digest_extend I, [2024-05-13T06:02:23.740995 #373899] INFO -- : [323/885] 415259=test_omap I, [2024-05-13T06:02:23.743670 #373899] INFO -- : [324/885] 415259=test_iterator I, [2024-05-13T06:02:23.754642 #373899] INFO -- : [325/885] 415272=test_string I, [2024-05-13T06:02:23.759758 #373899] INFO -- : [326/885] 415272=pattern_test I, [2024-05-13T06:02:23.773370 #373899] INFO -- : [327/885] 415261=test_memory_view I, [2024-05-13T06:02:23.779151 #373899] INFO -- : [328/885] 415272=test_debug I, [2024-05-13T06:02:23.788752 #373899] INFO -- : [329/885] 415272=test_shellwords I, [2024-05-13T06:02:23.793515 #373899] INFO -- : [330/885] 415272=test_new I, [2024-05-13T06:02:23.796233 #373899] INFO -- : [331/885] 415261=test_gem_security_signer I, [2024-05-13T06:02:23.801738 #373899] INFO -- : [332/885] 415272=test_cipher I, [2024-05-13T06:02:23.833688 #373899] INFO -- : [333/885] 415259=test_gem_resolver_git_set I, [2024-05-13T06:02:23.845038 #373899] INFO -- : [334/885] 415272=test_storage I, [2024-05-13T06:02:23.861105 #373899] INFO -- : [335/885] 415272=test_require I, [2024-05-13T06:02:23.936545 #373899] INFO -- : [336/885] 415261=test_cgi_cookie I, [2024-05-13T06:02:23.948876 #373899] INFO -- : [337/885] 415261=test_float I, [2024-05-13T06:02:23.975537 #373899] INFO -- : [338/885] 415260=test_gem_source_git I, [2024-05-13T06:02:24.158937 #373899] INFO -- : [339/885] 415259=test_regex_casefold I, [2024-05-13T06:02:24.278682 #373899] INFO -- : [340/885] 415267=test_gem_commands_signout_command I, [2024-05-13T06:02:24.286639 #373899] INFO -- : [341/885] 415267=test_refinement I, [2024-05-13T06:02:24.325027 #373899] INFO -- : [342/885] 415274=test_gem_resolver_installer_set I, [2024-05-13T06:02:24.460750 #373899] INFO -- : [343/885] 415260=test_dir_m17n I, [2024-05-13T06:02:24.471575 #373899] INFO -- : [344/885] 415274=test_rdoc_top_level I, [2024-05-13T06:02:24.672117 #373899] INFO -- : [345/885] 415274=test_metaclass I, [2024-05-13T06:02:24.676253 #373899] INFO -- : [346/885] 415274=test_rdoc_rd I, [2024-05-13T06:02:24.699747 #373899] INFO -- : [347/885] 415274=test_cgi_session I, [2024-05-13T06:02:24.713963 #373899] INFO -- : [348/885] 415274=test_x509crl I, [2024-05-13T06:02:24.719042 #373899] INFO -- : [349/885] 415259=test_fixnum I, [2024-05-13T06:02:24.731123 #373899] INFO -- : [350/885] 415259=test_signal I, [2024-05-13T06:02:24.851936 #373899] INFO -- : [351/885] 415274=test_process I, [2024-05-13T06:02:24.876812 #373899] INFO -- : [352/885] 415274=test_input_method I, [2024-05-13T06:02:24.897948 #373899] INFO -- : [353/885] 415274=test_windows_1252 I, [2024-05-13T06:02:24.920189 #373899] INFO -- : [354/885] 415274=test_div I, [2024-05-13T06:02:24.923900 #373899] INFO -- : [355/885] 415274=test_allocation I, [2024-05-13T06:02:25.158475 #373899] INFO -- : [356/885] 415269=test_engine I, [2024-05-13T06:02:25.162057 #373899] INFO -- : [357/885] 415269=test_win32ole_variant_m I, [2024-05-13T06:02:25.164252 #373899] INFO -- : [358/885] 415269=test_key_error I, [2024-05-13T06:02:25.168917 #373899] INFO -- : [359/885] 415269=test_insns_leaf I, [2024-05-13T06:02:25.174428 #373899] INFO -- : [360/885] 415269=test_serialize_subclasses I, [2024-05-13T06:02:25.185005 #373899] INFO -- : [361/885] 415276=test_color_printer I, [2024-05-13T06:02:25.193038 #373899] INFO -- : [362/885] 415276=test_deprecated I, [2024-05-13T06:02:25.195549 #373899] INFO -- : [363/885] 415276=test_files_test_1 I, [2024-05-13T06:02:25.202015 #373899] INFO -- : [364/885] 415269=test_struct I, [2024-05-13T06:02:25.289770 #373899] INFO -- : [365/885] 415261=test_gem_path_support I, [2024-05-13T06:02:25.309515 #373899] INFO -- : [366/885] 415261=test_set I, [2024-05-13T06:02:25.325801 #373899] INFO -- : [367/885] 415261=test_mutex I, [2024-05-13T06:02:25.593760 #373899] INFO -- : [368/885] 415278=test_x509req I, [2024-05-13T06:02:25.604012 #373899] INFO -- : [369/885] 415260=test_rdoc_rd_inline I, [2024-05-13T06:02:25.611982 #373899] INFO -- : [370/885] 415260=test_win32ole_variant_outarg I, [2024-05-13T06:02:25.614466 #373899] INFO -- : [371/885] 415260=json_common_interface_test I, [2024-05-13T06:02:25.626051 #373899] INFO -- : [372/885] 415260=test_gem_source_subpath_problem I, [2024-05-13T06:02:25.757216 #373899] INFO -- : [373/885] 415260=test_dln I, [2024-05-13T06:02:25.760815 #373899] INFO -- : [374/885] 415260=json_parser_test I, [2024-05-13T06:02:25.801727 #373899] INFO -- : [375/885] 415278=test_nomethod_error I, [2024-05-13T06:02:25.804378 #373899] INFO -- : [376/885] 415278=memsize_test I, [2024-05-13T06:02:25.806869 #373899] INFO -- : [377/885] 415278=test_config I, [2024-05-13T06:02:25.810309 #373899] INFO -- : [378/885] 415260=test_pkg_config I, [2024-05-13T06:02:25.823410 #373899] INFO -- : [379/885] 415260=test_cparser I, [2024-05-13T06:02:25.834434 #373899] INFO -- : [380/885] 415278=magic_comment_test I, [2024-05-13T06:02:25.849911 #373899] INFO -- : [381/885] 415278=test_rdoc_markup_to_html_snippet I, [2024-05-13T06:02:25.864826 #373899] INFO -- : [382/885] 415269=test_struct I, [2024-05-13T06:02:25.869576 #373899] INFO -- : [383/885] 415269=test_variable I, [2024-05-13T06:02:25.950549 #373899] INFO -- : [384/885] 415270=fuzzer_test I, [2024-05-13T06:02:25.959803 #373899] INFO -- : [385/885] 415270=test_sexp I, [2024-05-13T06:02:25.976546 #373899] INFO -- : [386/885] 415268=test_rdoc_markup_include I, [2024-05-13T06:02:25.979266 #373899] INFO -- : [387/885] 415269=test_rubyvm I, [2024-05-13T06:02:25.984994 #373899] INFO -- : [388/885] 415269=test_configuration I, [2024-05-13T06:02:26.001728 #373899] INFO -- : [389/885] 415270=test_monitor I, [2024-05-13T06:02:26.091975 #373899] INFO -- : [390/885] 415269=test_buffered_io I, [2024-05-13T06:02:26.122407 #373899] INFO -- : [391/885] 415278=test_whileuntil I, [2024-05-13T06:02:26.127880 #373899] INFO -- : [392/885] 415278=test_rdoc_generator_markup I, [2024-05-13T06:02:26.135635 #373899] INFO -- : [393/885] 415278=test_boolean I, [2024-05-13T06:02:26.145416 #373899] INFO -- : [394/885] 415268=test_stringify_symbols I, [2024-05-13T06:02:26.157927 #373899] INFO -- : [395/885] 415268=test_instrumentation_api I, [2024-05-13T06:02:26.163122 #373899] INFO -- : [396/885] 415278=integer_parse_test I, [2024-05-13T06:02:26.168132 #373899] INFO -- : [397/885] 415278=constant_path_node_test I, [2024-05-13T06:02:26.173673 #373899] INFO -- : [398/885] 415269=test_ssl I, [2024-05-13T06:02:26.177104 #373899] INFO -- : [399/885] 415278=test_gem_ext_cargo_builder I, [2024-05-13T06:02:26.199631 #373899] INFO -- : [400/885] 415278=test_module I, [2024-05-13T06:02:26.208842 #373899] INFO -- : [401/885] 415270=test_gem_request_set I, [2024-05-13T06:02:26.323529 #373899] INFO -- : [402/885] 415275=test_method_name_check I, [2024-05-13T06:02:26.341249 #373899] INFO -- : [403/885] 415275=test_arith_seq_extract I, [2024-05-13T06:02:26.412010 #373899] INFO -- : [404/885] 415272=test_parser I, [2024-05-13T06:02:26.423959 #373899] INFO -- : [405/885] 415260=test_gem_source_installed I, [2024-05-13T06:02:26.429043 #373899] INFO -- : [406/885] 415272=test_erb I, [2024-05-13T06:02:26.432475 #373899] INFO -- : [407/885] 415260=test_x509ext I, [2024-05-13T06:02:26.436537 #373899] INFO -- : [408/885] 415260=test_yield_block I, [2024-05-13T06:02:26.439169 #373899] INFO -- : [409/885] 415260=test_len I, [2024-05-13T06:02:26.440124 #373899] INFO -- : [410/885] 415260=test_gem_commands_cert_command I, [2024-05-13T06:02:26.449950 #373899] INFO -- : [411/885] 415261=test_completion I, [2024-05-13T06:02:26.480506 #373899] INFO -- : [412/885] 415272=test_rational I, [2024-05-13T06:02:26.491575 #373899] INFO -- : [413/885] 415272=test_rational2 I, [2024-05-13T06:02:26.503974 #373899] INFO -- : [414/885] 415272=attribute_write_test I, [2024-05-13T06:02:26.506453 #373899] INFO -- : [415/885] 415272=test_propertyputref I, [2024-05-13T06:02:26.507756 #373899] INFO -- : [416/885] 415272=test_spell_checker I, [2024-05-13T06:02:26.518062 #373899] INFO -- : [417/885] 415272=test_assembler I, [2024-05-13T06:02:26.523081 #373899] INFO -- : [418/885] 415272=test_benchmark I, [2024-05-13T06:02:26.537846 #373899] INFO -- : [419/885] 415275=test_gem_dependency_list I, [2024-05-13T06:02:26.617706 #373899] INFO -- : [420/885] 415275=test_nesting_parser I, [2024-05-13T06:02:26.636517 #373899] INFO -- : [421/885] 415270=test_win32ole_method_event I, [2024-05-13T06:02:26.638542 #373899] INFO -- : [422/885] 415270=test_scalar_scanner I, [2024-05-13T06:02:26.653606 #373899] INFO -- : [423/885] 415270=test_gem_source I, [2024-05-13T06:02:26.708031 #373899] INFO -- : [424/885] 415275=test_array I, [2024-05-13T06:02:26.753653 #373899] INFO -- : [425/885] 415259=test_helper_method I, [2024-05-13T06:02:26.760763 #373899] INFO -- : [426/885] 415259=test_gem_package_tar_writer I, [2024-05-13T06:02:26.799136 #373899] INFO -- : [427/885] 415270=test_gem_commands_outdated_command I, [2024-05-13T06:02:26.838948 #373899] INFO -- : [428/885] 415270=test_provider I, [2024-05-13T06:02:26.889771 #373899] INFO -- : [429/885] 415259=test_abi I, [2024-05-13T06:02:27.057608 #373899] INFO -- : [430/885] 415259=test_load I, [2024-05-13T06:02:27.060872 #373899] INFO -- : [431/885] 415259=test_yamldbm I, [2024-05-13T06:02:27.068206 #373899] INFO -- : [432/885] 415259=test_gem_commands_rebuild_command I, [2024-05-13T06:02:27.085984 #373899] INFO -- : [433/885] 415261=test_rdoc_parser_simple I, [2024-05-13T06:02:27.103217 #373899] INFO -- : [434/885] 415261=test_gem_ext_builder I, [2024-05-13T06:02:27.142899 #373899] INFO -- : [435/885] 415259=test_https I, [2024-05-13T06:02:27.207191 #373899] INFO -- : [436/885] 415270=test_evaluation I, [2024-05-13T06:02:27.211201 #373899] INFO -- : [437/885] 415270=test_noarg I, [2024-05-13T06:02:27.261358 #373899] INFO -- : [438/885] 415273=parse_comments_test I, [2024-05-13T06:02:27.264371 #373899] INFO -- : [439/885] 415273=test_tempfile I, [2024-05-13T06:02:27.291610 #373899] INFO -- : [440/885] 415260=test_function I, [2024-05-13T06:02:27.316509 #373899] INFO -- : [441/885] 415274=test_queue I, [2024-05-13T06:02:27.326771 #373899] INFO -- : [442/885] 415274=test_gem_resolver_index_specification I, [2024-05-13T06:02:27.357047 #373899] INFO -- : [443/885] 415274=test_internal_ivar I, [2024-05-13T06:02:27.365724 #373899] INFO -- : [444/885] 415274=test_gem_commands_help_command I, [2024-05-13T06:02:27.392216 #373899] INFO -- : [445/885] 415270=test_rdoc_markup I, [2024-05-13T06:02:27.401188 #373899] INFO -- : [446/885] 415274=test_tracepoint I, [2024-05-13T06:02:27.407863 #373899] INFO -- : [447/885] 415270=test_prettyprint I, [2024-05-13T06:02:27.418536 #373899] INFO -- : [448/885] 415270=test_utf32 I, [2024-05-13T06:02:27.424867 #373899] INFO -- : [449/885] 415270=test_basicsocket I, [2024-05-13T06:02:27.431743 #373899] INFO -- : [450/885] 415270=test_duplicate I, [2024-05-13T06:02:27.433398 #373899] INFO -- : [451/885] 415270=test_gem_installer I, [2024-05-13T06:02:27.463388 #373899] INFO -- : [452/885] 415267=test_yamlstore I, [2024-05-13T06:02:27.493878 #373899] INFO -- : [453/885] 415267=test_rdoc_parser_rd I, [2024-05-13T06:02:27.516828 #373899] INFO -- : [454/885] 415273=test_date_strftime I, [2024-05-13T06:02:27.517752 #373899] INFO -- : [455/885] 415259=test_irb I, [2024-05-13T06:02:27.519302 #373899] INFO -- : [456/885] 415260=test_random I, [2024-05-13T06:02:27.524008 #373899] INFO -- : [457/885] 415260=test_asn1 I, [2024-05-13T06:02:27.544232 #373899] INFO -- : [458/885] 415260=test_rdoc_normal_class I, [2024-05-13T06:02:27.549217 #373899] INFO -- : [459/885] 415267=test_class I, [2024-05-13T06:02:27.609574 #373899] INFO -- : [460/885] 415274=test_const I, [2024-05-13T06:02:27.615262 #373899] INFO -- : [461/885] 415274=json_string_matching_test I, [2024-05-13T06:02:27.622891 #373899] INFO -- : [462/885] 415274=test_load I, [2024-05-13T06:02:27.632731 #373899] INFO -- : [463/885] 415274=test_gem_resolver_specification I, [2024-05-13T06:02:27.639877 #373899] INFO -- : [464/885] 415260=test_gem_dependency I, [2024-05-13T06:02:27.652731 #373899] INFO -- : [465/885] 415274=test_path_to_class I, [2024-05-13T06:02:27.655460 #373899] INFO -- : [466/885] 415274=test_inlinecache I, [2024-05-13T06:02:27.700169 #373899] INFO -- : [467/885] 415274=test_rdoc_markup_verbatim I, [2024-05-13T06:02:27.704553 #373899] INFO -- : [468/885] 415274=test_gem_commands_search_command I, [2024-05-13T06:02:27.710046 #373899] INFO -- : [469/885] 415274=test_complex I, [2024-05-13T06:02:27.716415 #373899] INFO -- : [470/885] 415259=test_gem_ext_ext_conf_builder I, [2024-05-13T06:02:27.791057 #373899] INFO -- : [471/885] 415272=test_method_cache I, [2024-05-13T06:02:27.792320 #373899] INFO -- : [472/885] 415272=test_gem_stub_specification I, [2024-05-13T06:02:27.798306 #373899] INFO -- : [473/885] 415260=test_frozen_error I, [2024-05-13T06:02:27.801180 #373899] INFO -- : [474/885] 415260=test_gem_resolver_installed_specification I, [2024-05-13T06:02:27.806199 #373899] INFO -- : [475/885] 415274=test_scanner_events I, [2024-05-13T06:02:27.821610 #373899] INFO -- : [476/885] 415260=test_gem_remote_fetcher I, [2024-05-13T06:02:27.837934 #373899] INFO -- : [477/885] 415274=test_mdns I, [2024-05-13T06:02:27.844155 #373899] INFO -- : [478/885] 415274=test_parse I, [2024-05-13T06:02:27.871588 #373899] INFO -- : [479/885] 415277=test_too_many_dummy_encodings I, [2024-05-13T06:02:27.925375 #373899] INFO -- : [480/885] 415263=test_reqarg I, [2024-05-13T06:02:27.930006 #373899] INFO -- : [481/885] 415277=test_rdoc_include I, [2024-05-13T06:02:27.935301 #373899] INFO -- : [482/885] 415272=test_stack I, [2024-05-13T06:02:27.959017 #373899] INFO -- : [483/885] 415277=test_gem_commands_list_command I, [2024-05-13T06:02:27.972377 #373899] INFO -- : [484/885] 415277=test_emitter I, [2024-05-13T06:02:27.988676 #373899] INFO -- : [485/885] 415261=test_gem_commands_signin_command I, [2024-05-13T06:02:27.991945 #373899] INFO -- : [486/885] 415277=test_resource I, [2024-05-13T06:02:27.997650 #373899] INFO -- : [487/885] 415277=test_ldap I, [2024-05-13T06:02:27.999360 #373899] INFO -- : [488/885] 415277=test_string_processing I, [2024-05-13T06:02:28.037230 #373899] INFO -- : [489/885] 415277=test_fileutils I, [2024-05-13T06:02:28.050201 #373899] INFO -- : [490/885] 415278=test_rdoc_options I, [2024-05-13T06:02:28.090411 #373899] INFO -- : [491/885] 415261=test_econv I, [2024-05-13T06:02:28.209246 #373899] INFO -- : [492/885] 415276=test_cesu8 I, [2024-05-13T06:02:28.215259 #373899] INFO -- : [493/885] 415276=test_gem_version I, [2024-05-13T06:02:28.230946 #373899] INFO -- : [494/885] 415273=test_rdoc_parser_c I, [2024-05-13T06:02:28.295258 #373899] INFO -- : [495/885] 415266=test_comparable I, [2024-05-13T06:02:28.297346 #373899] INFO -- : [496/885] 415278=test_shapes I, [2024-05-13T06:02:28.302223 #373899] INFO -- : [497/885] 415266=json_fixtures_test I, [2024-05-13T06:02:28.305230 #373899] INFO -- : [498/885] 415278=test_io_timeout I, [2024-05-13T06:02:28.305684 #373899] INFO -- : [499/885] 415276=test_profile_frames I, [2024-05-13T06:02:28.306330 #373899] INFO -- : [500/885] 415263=test_pstore I, [2024-05-13T06:02:28.308498 #373899] INFO -- : [501/885] 415266=test_cstr I, [2024-05-13T06:02:28.309221 #373899] INFO -- : [502/885] 415278=test_enc_str_buf_cat I, [2024-05-13T06:02:28.312445 #373899] INFO -- : [503/885] 415278=test_gbk I, [2024-05-13T06:02:28.318918 #373899] INFO -- : [504/885] 415278=test_class2name I, [2024-05-13T06:02:28.323415 #373899] INFO -- : [505/885] 415278=test_wait I, [2024-05-13T06:02:28.351031 #373899] INFO -- : [506/885] 415263=test_handle I, [2024-05-13T06:02:28.366380 #373899] INFO -- : [507/885] 415274=test_yaml I, [2024-05-13T06:02:28.412275 #373899] INFO -- : [508/885] 415278=test_forwardable I, [2024-05-13T06:02:28.417495 #373899] INFO -- : [509/885] 415277=test_big2str I, [2024-05-13T06:02:28.421801 #373899] INFO -- : [510/885] 415277=test_gem_commands_sources_command I, [2024-05-13T06:02:28.427076 #373899] INFO -- : [511/885] 415278=test_ansi_without_terminfo I, [2024-05-13T06:02:28.441548 #373899] INFO -- : [512/885] 415274=test_bmethod I, [2024-05-13T06:02:28.442718 #373899] INFO -- : [513/885] 415278=test_ractor I, [2024-05-13T06:02:28.449891 #373899] INFO -- : [514/885] 415274=test_euc_tw I, [2024-05-13T06:02:28.451361 #373899] INFO -- : [515/885] 415274=test_rdoc_markup_formatter I, [2024-05-13T06:02:28.456141 #373899] INFO -- : [516/885] 415274=test_nowrite I, [2024-05-13T06:02:28.458525 #373899] INFO -- : [517/885] 415278=test_thread_queue I, [2024-05-13T06:02:28.468487 #373899] INFO -- : [518/885] 415274=test_file I, [2024-05-13T06:02:28.481627 #373899] INFO -- : [519/885] 415274=test_rdoc_markdown I, [2024-05-13T06:02:28.495528 #373899] INFO -- : [520/885] 415276=test_gem_available_set I, [2024-05-13T06:02:28.510206 #373899] INFO -- : [521/885] 415263=test_rdoc_any_method I, [2024-05-13T06:02:28.560808 #373899] INFO -- : [522/885] 415276=test_modify_expand I, [2024-05-13T06:02:28.564559 #373899] INFO -- : [523/885] 415276=test_complexrational I, [2024-05-13T06:02:28.570128 #373899] INFO -- : [524/885] 415276=test_init I, [2024-05-13T06:02:28.594488 #373899] INFO -- : [525/885] 415277=test_pathname I, [2024-05-13T06:02:28.662040 #373899] INFO -- : [526/885] 415274=test_rdoc_encoding I, [2024-05-13T06:02:28.665187 #373899] INFO -- : [527/885] 415266=test_coverage I, [2024-05-13T06:02:28.691033 #373899] INFO -- : [528/885] 415274=regexp_test I, [2024-05-13T06:02:28.699331 #373899] INFO -- : [529/885] 415274=test_gem_package_tar_reader I, [2024-05-13T06:02:28.710670 #373899] INFO -- : [530/885] 415273=test_gem_source_vendor I, [2024-05-13T06:02:28.720393 #373899] INFO -- : [531/885] 415273=test_gem_commands_owner_command I, [2024-05-13T06:02:28.728696 #373899] INFO -- : [532/885] 415274=test_recorder I, [2024-05-13T06:02:28.730026 #373899] INFO -- : [533/885] 415274=test_formatter I, [2024-05-13T06:02:28.733259 #373899] INFO -- : [534/885] 415274=test_bash_completion I, [2024-05-13T06:02:28.737693 #373899] INFO -- : [535/885] 415274=test_deprecate I, [2024-05-13T06:02:28.759430 #373899] INFO -- : [536/885] 415274=test_rdoc_constant I, [2024-05-13T06:02:28.795177 #373899] INFO -- : [537/885] 415277=test_cgi_util I, [2024-05-13T06:02:28.832223 #373899] INFO -- : [538/885] 415274=test_require I, [2024-05-13T06:02:28.932953 #373899] INFO -- : [539/885] 415276=test_gem_ext_cmake_builder I, [2024-05-13T06:02:28.953566 #373899] INFO -- : [540/885] 415276=test_gem_commands_contents_command I, [2024-05-13T06:02:28.957883 #373899] INFO -- : [541/885] 415272=test_digest I, [2024-05-13T06:02:29.002251 #373899] INFO -- : [542/885] 415264=test_marshalable I, [2024-05-13T06:02:29.008095 #373899] INFO -- : [543/885] 415264=test_find I, [2024-05-13T06:02:29.019157 #373899] INFO -- : [544/885] 415276=test_ractor I, [2024-05-13T06:02:29.019949 #373899] INFO -- : [545/885] 415263=test_wss I, [2024-05-13T06:02:29.020579 #373899] INFO -- : [546/885] 415264=test_fiddle I, [2024-05-13T06:02:29.026666 #373899] INFO -- : [547/885] 415259=test_yaml_tree I, [2024-05-13T06:02:29.037829 #373899] INFO -- : [548/885] 415263=test_gem_commands_fetch_command I, [2024-05-13T06:02:29.057247 #373899] INFO -- : [549/885] 415259=test_math I, [2024-05-13T06:02:29.060807 #373899] INFO -- : [550/885] 415277=test_gc I, [2024-05-13T06:02:29.062485 #373899] INFO -- : [551/885] 415277=test_libs I, [2024-05-13T06:02:29.080009 #373899] INFO -- : [552/885] 415264=test_config I, [2024-05-13T06:02:29.082443 #373899] INFO -- : [553/885] 415261=test_sleep I, [2024-05-13T06:02:29.093137 #373899] INFO -- : [554/885] 415277=test_utf16 I, [2024-05-13T06:02:29.099089 #373899] INFO -- : [555/885] 415259=test_autoload I, [2024-05-13T06:02:29.105918 #373899] INFO -- : [556/885] 415277=test_unicode_escape I, [2024-05-13T06:02:29.120926 #373899] INFO -- : [557/885] 415264=test_io I, [2024-05-13T06:02:29.121456 #373899] INFO -- : [558/885] 415268=test_face I, [2024-05-13T06:02:29.131266 #373899] INFO -- : [559/885] 415276=test_sizeof I, [2024-05-13T06:02:29.201112 #373899] INFO -- : [560/885] 415277=test_case I, [2024-05-13T06:02:29.202181 #373899] INFO -- : [561/885] 415268=test_rendering I, [2024-05-13T06:02:29.230404 #373899] INFO -- : [562/885] 415277=test_pkcs12 I, [2024-05-13T06:02:29.256841 #373899] INFO -- : [563/885] 415268=test_system I, [2024-05-13T06:02:29.313454 #373899] INFO -- : [564/885] 415273=test_pkey_dh I, [2024-05-13T06:02:29.324085 #373899] INFO -- : [565/885] 415263=test_bigzero I, [2024-05-13T06:02:29.326092 #373899] INFO -- : [566/885] 415263=test_gem_util I, [2024-05-13T06:02:29.417217 #373899] INFO -- : [567/885] 415266=test_iseq_load I, [2024-05-13T06:02:29.435497 #373899] INFO -- : [568/885] 415273=test_gem_package_tar_header I, [2024-05-13T06:02:29.486480 #373899] INFO -- : [569/885] 415273=test_ripper I, [2024-05-13T06:02:29.489127 #373899] INFO -- : [570/885] 415263=test_gem_config_file I, [2024-05-13T06:02:29.614736 #373899] INFO -- : [571/885] 415263=test_gem_resolver_activation_request I, [2024-05-13T06:02:29.632243 #373899] INFO -- : [572/885] 415263=test_getopts I, [2024-05-13T06:02:29.636860 #373899] INFO -- : [573/885] 415263=test_protocol I, [2024-05-13T06:02:29.718966 #373899] INFO -- : [574/885] 415260=test_yjit_exit_locations I, [2024-05-13T06:02:29.721394 #373899] INFO -- : [575/885] 415260=test_etc I, [2024-05-13T06:02:29.725957 #373899] INFO -- : [576/885] 415267=test_fstring I, [2024-05-13T06:02:29.762897 #373899] INFO -- : [577/885] 415277=test_optparse I, [2024-05-13T06:02:29.779347 #373899] INFO -- : [578/885] 415272=test_array I, [2024-05-13T06:02:29.786180 #373899] INFO -- : [579/885] 415272=test_rdoc_markup_raw I, [2024-05-13T06:02:29.789450 #373899] INFO -- : [580/885] 415272=test_webauthn_poller I, [2024-05-13T06:02:29.792424 #373899] INFO -- : [581/885] 415260=test_rat I, [2024-05-13T06:02:29.801381 #373899] INFO -- : [582/885] 415260=encoding_test I, [2024-05-13T06:02:29.808113 #373899] INFO -- : [583/885] 415273=test_gem_resolver_best_set I, [2024-05-13T06:02:29.812925 #373899] INFO -- : [584/885] 415277=test_typeddata I, [2024-05-13T06:02:29.874558 #373899] INFO -- : [585/885] 415267=test_rdoc_markup_to_html_crossref I, [2024-05-13T06:02:29.882161 #373899] INFO -- : [586/885] 415273=test_files_sample I, [2024-05-13T06:02:29.890155 #373899] INFO -- : [587/885] 415260=test_stringscanner I, [2024-05-13T06:02:29.913110 #373899] INFO -- : [588/885] 415274=parser_test I, [2024-05-13T06:02:29.917292 #373899] INFO -- : [589/885] 415260=test_convertible I, [2024-05-13T06:02:29.918253 #373899] INFO -- : [590/885] 415274=test_yield I, [2024-05-13T06:02:29.939679 #373899] INFO -- : [591/885] 415272=test_rdoc_alias I, [2024-05-13T06:02:29.944985 #373899] INFO -- : [592/885] 415263=test_pack I, [2024-05-13T06:02:29.951379 #373899] INFO -- : [593/885] 415272=test_backtrace I, [2024-05-13T06:02:29.960098 #373899] INFO -- : [594/885] 415263=ruby_parser_test I, [2024-05-13T06:02:29.982967 #373899] INFO -- : [595/885] 415277=test_io_buffer I, [2024-05-13T06:02:29.998561 #373899] INFO -- : [596/885] 415273=test_rdoc_task I, [2024-05-13T06:02:30.010467 #373899] INFO -- : [597/885] 415273=test_gem_resolver_conflict I, [2024-05-13T06:02:30.022577 #373899] INFO -- : [598/885] 415273=test_rdoc_markup_indented_paragraph I, [2024-05-13T06:02:30.025118 #373899] INFO -- : [599/885] 415273=locals_test I, [2024-05-13T06:02:30.028895 #373899] INFO -- : [600/885] 415263=test_rdoc_require I, [2024-05-13T06:02:30.041046 #373899] INFO -- : [601/885] 415263=test_gem_commands_install_command I, [2024-05-13T06:02:30.091277 #373899] INFO -- : [602/885] 415277=test_clone I, [2024-05-13T06:02:30.103396 #373899] INFO -- : [603/885] 415268=test_readpartial I, [2024-05-13T06:02:30.158367 #373899] INFO -- : [604/885] 415267=test_alias_and_anchor I, [2024-05-13T06:02:30.165637 #373899] INFO -- : [605/885] 415267=test_postponed_job I, [2024-05-13T06:02:30.305110 #373899] INFO -- : [606/885] 415277=test_external_new I, [2024-05-13T06:02:30.308776 #373899] INFO -- : [607/885] 415277=test_tree_builder I, [2024-05-13T06:02:30.314066 #373899] INFO -- : [608/885] 415277=test_gem_resolver_dependency_request I, [2024-05-13T06:02:30.327484 #373899] INFO -- : [609/885] 415275=test_hash I, [2024-05-13T06:02:30.340133 #373899] INFO -- : [610/885] 415277=test_protect I, [2024-05-13T06:02:30.342876 #373899] INFO -- : [611/885] 415275=test_win32ole_typelib I, [2024-05-13T06:02:30.344287 #373899] INFO -- : [612/885] 415277=test_gem_request_set_lockfile I, [2024-05-13T06:02:30.346275 #373899] INFO -- : [613/885] 415275=test_raise_exception I, [2024-05-13T06:02:30.432385 #373899] INFO -- : [614/885] 415273=test_yjit I, [2024-05-13T06:02:30.432446 #373899] INFO -- : [615/885] 415273=test_weakmap I, [2024-05-13T06:02:30.508622 #373899] INFO -- : [616/885] 415268=test_workspace I, [2024-05-13T06:02:30.558484 #373899] INFO -- : [617/885] 415266=test_gem_commands_environment_command I, [2024-05-13T06:02:30.564082 #373899] INFO -- : [618/885] 415267=test_m17n I, [2024-05-13T06:02:30.598160 #373899] INFO -- : [619/885] 415267=test_ws I, [2024-05-13T06:02:30.600333 #373899] INFO -- : [620/885] 415267=test_argf I, [2024-05-13T06:02:30.620268 #373899] INFO -- : [621/885] 415266=test_kill_ring I, [2024-05-13T06:02:30.658632 #373899] INFO -- : [622/885] 415268=test_ns_spki I, [2024-05-13T06:02:30.677223 #373899] INFO -- : [623/885] 415266=test_framework I, [2024-05-13T06:02:30.685976 #373899] INFO -- : [624/885] 415268=test_undef I, [2024-05-13T06:02:30.693755 #373899] INFO -- : [625/885] 415268=test_line_editor I, [2024-05-13T06:02:30.696736 #373899] INFO -- : [626/885] 415266=test_objspace I, [2024-05-13T06:02:30.697146 #373899] INFO -- : [627/885] 415268=ripper_test I, [2024-05-13T06:02:30.714056 #373899] INFO -- : [628/885] 415277=test_gem_security_trust_dir I, [2024-05-13T06:02:30.754851 #373899] INFO -- : [629/885] 415277=comments_test I, [2024-05-13T06:02:30.761508 #373899] INFO -- : [630/885] 415277=test_sprintf I, [2024-05-13T06:02:30.834473 #373899] INFO -- : [631/885] 415275=test_gem_requirement I, [2024-05-13T06:02:30.982901 #373899] INFO -- : [632/885] 415275=test_string_memory I, [2024-05-13T06:02:31.033822 #373899] INFO -- : [633/885] 415277=test_set I, [2024-05-13T06:02:31.040734 #373899] INFO -- : [634/885] 415277=test_show_source I, [2024-05-13T06:02:31.061419 #373899] INFO -- : [635/885] 415275=test_have_library I, [2024-05-13T06:02:31.104103 #373899] INFO -- : [636/885] 415277=test_remote_fetch_error I, [2024-05-13T06:02:31.116033 #373899] INFO -- : [637/885] 415277=test_c_struct_entry I, [2024-05-13T06:02:31.128402 #373899] INFO -- : [638/885] 415261=test_lock_native_thread I, [2024-05-13T06:02:31.222534 #373899] INFO -- : [639/885] 415268=test_gem_commands_stale_command I, [2024-05-13T06:02:31.232531 #373899] INFO -- : [640/885] 415268=test_rdoc_rubygems_hook I, [2024-05-13T06:02:31.299730 #373899] INFO -- : [641/885] 415272=test_gem_commands_query_command I, [2024-05-13T06:02:31.313055 #373899] INFO -- : [642/885] 415263=test_method I, [2024-05-13T06:02:31.360156 #373899] INFO -- : [643/885] 415268=test_array_create I, [2024-05-13T06:02:31.362258 #373899] INFO -- : [644/885] 415268=test_pack I, [2024-05-13T06:02:31.385713 #373899] INFO -- : [645/885] 415261=test_gem_impossible_dependencies_error I, [2024-05-13T06:02:31.396101 #373899] INFO -- : [646/885] 415261=test_to_ruby I, [2024-05-13T06:02:31.403151 #373899] INFO -- : [647/885] 415261=test_pattern_key_name_check I, [2024-05-13T06:02:31.404605 #373899] INFO -- : [648/885] 415277=test_ftp I, [2024-05-13T06:02:31.407537 #373899] INFO -- : [649/885] 415277=test_rdoc_context_section I, [2024-05-13T06:02:31.411840 #373899] INFO -- : [650/885] 415261=test_euc_kr I, [2024-05-13T06:02:31.412770 #373899] INFO -- : [651/885] 415277=test_summary I, [2024-05-13T06:02:31.416574 #373899] INFO -- : [652/885] 415261=test_console_attr I, [2024-05-13T06:02:31.418540 #373899] INFO -- : [653/885] 415261=test_type_completor I, [2024-05-13T06:02:31.422937 #373899] INFO -- : [654/885] 415261=test_kwargs I, [2024-05-13T06:02:31.423211 #373899] INFO -- : [655/885] 415261=warnings_test I, [2024-05-13T06:02:31.476290 #373899] INFO -- : [656/885] 415277=test_io_wait I, [2024-05-13T06:02:31.478338 #373899] INFO -- : [657/885] 415261=test_gem_commands_exec_command I, [2024-05-13T06:02:31.606333 #373899] INFO -- : [658/885] 415268=test_date_attr I, [2024-05-13T06:02:31.613048 #373899] INFO -- : [659/885] 415268=test_ellipsize I, [2024-05-13T06:02:31.630529 #373899] INFO -- : [660/885] 415262=test_io I, [2024-05-13T06:02:31.631665 #373899] INFO -- : [661/885] 415268=test_ubf_async_safe I, [2024-05-13T06:02:31.641611 #373899] INFO -- : [662/885] 415268=test_hash I, [2024-05-13T06:02:31.706763 #373899] INFO -- : [663/885] 415276=test_sorted_set I, [2024-05-13T06:02:31.718986 #373899] INFO -- : [664/885] 415270=test_win32ole_type_event I, [2024-05-13T06:02:31.722472 #373899] INFO -- : [665/885] 415270=test_emoji I, [2024-05-13T06:02:31.742186 #373899] INFO -- : [666/885] 415270=test_win32ole_record I, [2024-05-13T06:02:31.746279 #373899] INFO -- : [667/885] 415270=test_gem_unsatisfiable_dependency_error I, [2024-05-13T06:02:31.750200 #373899] INFO -- : [668/885] 415270=test_gem_commands_uninstall_command I, [2024-05-13T06:02:31.771088 #373899] INFO -- : [669/885] 415272=test_foreach I, [2024-05-13T06:02:31.778948 #373899] INFO -- : [670/885] 415272=test_gem_source_specific_file I, [2024-05-13T06:02:31.807030 #373899] INFO -- : [671/885] 415277=test_condition I, [2024-05-13T06:02:31.810185 #373899] INFO -- : [672/885] 415277=test_cp949 I, [2024-05-13T06:02:31.814479 #373899] INFO -- : [673/885] 415277=!Nothing_to_test I, [2024-05-13T06:02:31.815811 #373899] INFO -- : [674/885] 415277=test_enc_raise I, [2024-05-13T06:02:31.823415 #373899] INFO -- : [675/885] 415277=test_psych I, [2024-05-13T06:02:31.836121 #373899] INFO -- : [676/885] 415274=test_rdoc_markup_paragraph I, [2024-05-13T06:02:31.836691 #373899] INFO -- : [677/885] 415272=test_object_create_start I, [2024-05-13T06:02:31.837585 #373899] INFO -- : [678/885] 415272=test_gem_ext_cargo_builder_unit I, [2024-05-13T06:02:31.840355 #373899] INFO -- : [679/885] 415274=test_gem_rdoc I, [2024-05-13T06:02:31.849657 #373899] INFO -- : [680/885] 415277=test_date I, [2024-05-13T06:02:31.856113 #373899] INFO -- : [681/885] 415277=test_at_exit I, [2024-05-13T06:02:31.864759 #373899] INFO -- : [682/885] 415272=test_command I, [2024-05-13T06:02:31.872753 #373899] INFO -- : [683/885] 415277=test_files_ext I, [2024-05-13T06:02:31.877666 #373899] INFO -- : [684/885] 415276=test_bug-5832 I, [2024-05-13T06:02:31.880035 #373899] INFO -- : [685/885] 415276=test_emitter I, [2024-05-13T06:02:31.883474 #373899] INFO -- : [686/885] 415262=test_gem_silent_ui I, [2024-05-13T06:02:31.886833 #373899] INFO -- : [687/885] 415276=test_gem_doctor I, [2024-05-13T06:02:31.919551 #373899] INFO -- : [688/885] 415262=test_kdf I, [2024-05-13T06:02:31.920265 #373899] INFO -- : [689/885] 415276=test_kernel I, [2024-05-13T06:02:31.938286 #373899] INFO -- : [690/885] 415274=test_eval_history I, [2024-05-13T06:02:31.946100 #373899] INFO -- : [691/885] 415274=dispatcher_test I, [2024-05-13T06:02:31.960962 #373899] INFO -- : [692/885] 415274=test_rdoc_token_stream I, [2024-05-13T06:02:31.969773 #373899] INFO -- : [693/885] 415274=test_address_resolve I, [2024-05-13T06:02:31.970861 #373899] INFO -- : [694/885] 415262=test_config I, [2024-05-13T06:02:31.982557 #373899] INFO -- : [695/885] 415274=test_yaml_special_cases I, [2024-05-13T06:02:32.009902 #373899] INFO -- : [696/885] 415274=test_optarg I, [2024-05-13T06:02:32.029733 #373899] INFO -- : [697/885] 415262=test_gem_source_list I, [2024-05-13T06:02:32.061667 #373899] INFO -- : [698/885] 415262=test_num2int I, [2024-05-13T06:02:32.062115 #373899] INFO -- : [699/885] 415277=test_nil I, [2024-05-13T06:02:32.066166 #373899] INFO -- : [700/885] 415277=test_rdoc_single_class I, [2024-05-13T06:02:32.069095 #373899] INFO -- : [701/885] 415262=test_verbose I, [2024-05-13T06:02:32.069888 #373899] INFO -- : [702/885] 415277=test_frozen I, [2024-05-13T06:02:32.073248 #373899] INFO -- : [703/885] 415277=test_gem_ext_configure_builder I, [2024-05-13T06:02:32.077569 #373899] INFO -- : [704/885] 415274=test_pp I, [2024-05-13T06:02:32.092729 #373899] INFO -- : [705/885] 415262=test_macro I, [2024-05-13T06:02:32.096614 #373899] INFO -- : [706/885] 415272=test_iter_break I, [2024-05-13T06:02:32.097646 #373899] INFO -- : [707/885] 415262=test_zsh_completion I, [2024-05-13T06:02:32.100374 #373899] INFO -- : [708/885] 415262=test_exception I, [2024-05-13T06:02:32.100572 #373899] INFO -- : [709/885] 415272=test_hmac I, [2024-05-13T06:02:32.104113 #373899] INFO -- : [710/885] 415277=test_rdoc_markup_to_tt_only I, [2024-05-13T06:02:32.106156 #373899] INFO -- : [711/885] 415272=test_rdoc_tom_doc I, [2024-05-13T06:02:32.107364 #373899] INFO -- : [712/885] 415262=test_numeric I, [2024-05-13T06:02:32.123420 #373899] INFO -- : [713/885] 415274=test_gem_commands_lock_command I, [2024-05-13T06:02:32.135686 #373899] INFO -- : [714/885] 415277=test_assignment I, [2024-05-13T06:02:32.142037 #373899] INFO -- : [715/885] 415272=test_ifunless I, [2024-05-13T06:02:32.142960 #373899] INFO -- : [716/885] 415272=test_bug-3571 I, [2024-05-13T06:02:32.150324 #373899] INFO -- : [717/885] 415274=test_key_actor_vi I, [2024-05-13T06:02:32.158923 #373899] INFO -- : [718/885] 415272=test_gem_command I, [2024-05-13T06:02:32.170596 #373899] INFO -- : [719/885] 415262=test_gem_spec_fetcher I, [2024-05-13T06:02:32.206283 #373899] INFO -- : [720/885] 415275=test_common I, [2024-05-13T06:02:32.234424 #373899] INFO -- : [721/885] 415274=test_rdoc_stats I, [2024-05-13T06:02:32.265620 #373899] INFO -- : [722/885] 415274=test_pattern_matching I, [2024-05-13T06:02:32.289032 #373899] INFO -- : [723/885] 415272=test_string I, [2024-05-13T06:02:32.304241 #373899] INFO -- : [724/885] 415262=test_rdoc_store I, [2024-05-13T06:02:32.304299 #373899] INFO -- : [725/885] 415274=test_x509attr I, [2024-05-13T06:02:32.309307 #373899] INFO -- : [726/885] 415272=test_raise I, [2024-05-13T06:02:32.313933 #373899] INFO -- : [727/885] 415272=test_depth_first I, [2024-05-13T06:02:32.314749 #373899] INFO -- : [728/885] 415274=test_gem_request_set_lockfile_parser I, [2024-05-13T06:02:32.317605 #373899] INFO -- : [729/885] 415272=test_custom_command I, [2024-05-13T06:02:32.326530 #373899] INFO -- : [730/885] 415272=json_addition_test I, [2024-05-13T06:02:32.347066 #373899] INFO -- : [731/885] 415272=test_gem_dependency_resolution_error I, [2024-05-13T06:02:32.353941 #373899] INFO -- : [732/885] 415272=test_qsort I, [2024-05-13T06:02:32.359742 #373899] INFO -- : [733/885] 415272=test_rdoc_parser I, [2024-05-13T06:02:32.366888 #373899] INFO -- : [734/885] 415276=test_egrep_cpp I, [2024-05-13T06:02:32.379962 #373899] INFO -- : [735/885] 415272=test_zlib I, [2024-05-13T06:02:32.384771 #373899] INFO -- : [736/885] 415275=test_cgi_tag_helper I, [2024-05-13T06:02:32.401519 #373899] INFO -- : [737/885] 415275=test_date_conv I, [2024-05-13T06:02:32.404346 #373899] INFO -- : [738/885] 415270=test_optimization I, [2024-05-13T06:02:32.409572 #373899] INFO -- : [739/885] 415275=test_ole_methods I, [2024-05-13T06:02:32.412961 #373899] INFO -- : [740/885] 415275=test_erb_m17n I, [2024-05-13T06:02:32.413736 #373899] INFO -- : [741/885] 415274=test_gc_compact I, [2024-05-13T06:02:32.421939 #373899] INFO -- : [742/885] 415275=test_string I, [2024-05-13T06:02:32.431969 #373899] INFO -- : [743/885] 415261=test_proc I, [2024-05-13T06:02:32.508292 #373899] INFO -- : [744/885] 415276=test_gem_package_old I, [2024-05-13T06:02:32.545179 #373899] INFO -- : [745/885] 415276=test_gem_resolver_index_set I, [2024-05-13T06:02:32.582352 #373899] INFO -- : [746/885] 415276=test_gem_validator I, [2024-05-13T06:02:32.600921 #373899] INFO -- : [747/885] 415276=test_rdoc_markup_parser I, [2024-05-13T06:02:32.631629 #373899] INFO -- : [748/885] 415276=test_require_path_check I, [2024-05-13T06:02:32.649324 #373899] INFO -- : [749/885] 415278=test_folderitem2_invokeverb I, [2024-05-13T06:02:32.652606 #373899] INFO -- : [750/885] 415278=test_files_test_2 I, [2024-05-13T06:02:32.712969 #373899] INFO -- : [751/885] 415276=test_fnmatch I, [2024-05-13T06:02:32.753473 #373899] INFO -- : [752/885] 415276=test_io_buffer I, [2024-05-13T06:02:32.803664 #373899] INFO -- : [753/885] 415276=test_key_name_check I, [2024-05-13T06:02:32.809852 #373899] INFO -- : [754/885] 415276=test_backtrace I, [2024-05-13T06:02:32.816520 #373899] INFO -- : [755/885] 415276=test_defined I, [2024-05-13T06:02:32.894976 #373899] INFO -- : [756/885] 415276=test_rdoc_i18n_text I, [2024-05-13T06:02:32.914856 #373899] INFO -- : [757/885] 415276=test_time I, [2024-05-13T06:02:32.919126 #373899] INFO -- : [758/885] 415262=test_windows_1251 I, [2024-05-13T06:02:32.924091 #373899] INFO -- : [759/885] 415262=test_rdoc_rdoc I, [2024-05-13T06:02:33.021620 #373899] INFO -- : [760/885] 415262=test_gem_uninstaller I, [2024-05-13T06:02:33.034604 #373899] INFO -- : [761/885] 415276=test_gb18030 I, [2024-05-13T06:02:33.044287 #373899] INFO -- : [762/885] 415276=test_buffering I, [2024-05-13T06:02:33.045935 #373899] INFO -- : [763/885] 415276=test_svcb_https I, [2024-05-13T06:02:33.078368 #373899] INFO -- : [764/885] 415276=test_mul I, [2024-05-13T06:02:33.084266 #373899] INFO -- : [765/885] 415276=test_null I, [2024-05-13T06:02:33.087316 #373899] INFO -- : [766/885] 415276=test_win32ole_type I, [2024-05-13T06:02:33.088054 #373899] INFO -- : [767/885] 415276=test_default_gems I, [2024-05-13T06:02:33.154966 #373899] INFO -- : [768/885] 415276=test_rdoc_markup_to_rdoc I, [2024-05-13T06:02:33.183457 #373899] INFO -- : [769/885] 415276=test_rdoc_rd_inline_parser I, [2024-05-13T06:02:33.188273 #373899] INFO -- : [770/885] 415261=test_rdoc_markup_attributes I, [2024-05-13T06:02:33.189982 #373899] INFO -- : [771/885] 415261=test_date_parse I, [2024-05-13T06:02:33.202513 #373899] INFO -- : [772/885] 415276=test_thread I, [2024-05-13T06:02:33.208810 #373899] INFO -- : [773/885] 415276=test_trick I, [2024-05-13T06:02:33.297995 #373899] INFO -- : [774/885] 415259=test_pipe I, [2024-05-13T06:02:33.304030 #373899] INFO -- : [775/885] 415261=test_pkey_ec I, [2024-05-13T06:02:33.321062 #373899] INFO -- : [776/885] 415277=test_gem_ext_cargo_builder_link_flag_converter I, [2024-05-13T06:02:33.374604 #373899] INFO -- : [777/885] 415277=test_gem_commands_mirror I, [2024-05-13T06:02:33.394631 #373899] INFO -- : [778/885] 415261=test_method_cache I, [2024-05-13T06:02:33.404315 #373899] INFO -- : [779/885] 415261=test_gem_request I, [2024-05-13T06:02:33.408229 #373899] INFO -- : [780/885] 415277=test_sprintf_comb I, [2024-05-13T06:02:33.447758 #373899] INFO -- : [781/885] 415259=test_generic I, [2024-05-13T06:02:33.504082 #373899] INFO -- : [782/885] 415259=test_win32ole I, [2024-05-13T06:02:33.517017 #373899] INFO -- : [783/885] 415259=test_scan_args I, [2024-05-13T06:02:33.536989 #373899] INFO -- : [784/885] 415259=test_enumerator_kw I, [2024-05-13T06:02:33.542202 #373899] INFO -- : [785/885] 415259=test_gem_text I, [2024-05-13T06:02:33.553703 #373899] INFO -- : [786/885] 415277=test_settracefunc I, [2024-05-13T06:02:33.591935 #373899] INFO -- : [787/885] 415261=test_rdoc_cross_reference I, [2024-05-13T06:02:33.618140 #373899] INFO -- : [788/885] 415259=test_gem_commands_info_command I, [2024-05-13T06:02:33.651986 #373899] INFO -- : [789/885] 415259=test_scalar I, [2024-05-13T06:02:33.659229 #373899] INFO -- : [790/885] 415259=test_gem_dependency_installer I, [2024-05-13T06:02:34.033726 #373899] INFO -- : [791/885] 415261=test_case_options I, [2024-05-13T06:02:34.043447 #373899] INFO -- : [792/885] 415261=test_store I, [2024-05-13T06:02:34.049993 #373899] INFO -- : [793/885] 415262=test_exception I, [2024-05-13T06:02:34.263015 #373899] INFO -- : [794/885] 415261=test_bug_reporter I, [2024-05-13T06:02:34.271510 #373899] INFO -- : [795/885] 415269=test_gem_package_tar_reader_entry I, [2024-05-13T06:02:34.672437 #373899] INFO -- : [796/885] 415267=test_gem_name_tuple I, [2024-05-13T06:02:34.710307 #373899] INFO -- : [797/885] 415267=test_rand I, [2024-05-13T06:02:34.730315 #373899] INFO -- : [798/885] 415260=test_ractor I, [2024-05-13T06:02:34.756214 #373899] INFO -- : [799/885] 415260=test_severity I, [2024-05-13T06:02:34.756499 #373899] INFO -- : [800/885] 415261=test_gem_install_update_options I, [2024-05-13T06:02:34.773335 #373899] INFO -- : [801/885] 415260=parse_test I, [2024-05-13T06:02:34.774662 #373899] INFO -- : [802/885] 415277=test_require_lib I, [2024-05-13T06:02:34.783767 #373899] INFO -- : [803/885] 415269=test_extlibs I, [2024-05-13T06:02:34.794723 #373899] INFO -- : [804/885] 415273=test_rdoc_generator_ri I, [2024-05-13T06:02:34.799375 #373899] INFO -- : [805/885] 415273=test_gem_stream_ui I, [2024-05-13T06:02:34.898406 #373899] INFO -- : [806/885] 415261=test_literal I, [2024-05-13T06:02:34.948420 #373899] INFO -- : [807/885] 415273=test_dot_dot I, [2024-05-13T06:02:34.959243 #373899] INFO -- : [808/885] 415273=test_c_struct_builder I, [2024-05-13T06:02:35.075461 #373899] INFO -- : [809/885] 415273=test_str2big I, [2024-05-13T06:02:35.080914 #373899] INFO -- : [810/885] 415273=test_rdoc_markup_to_table_of_contents I, [2024-05-13T06:02:35.088614 #373899] INFO -- : [811/885] 415267=test_objectspace I, [2024-05-13T06:02:35.110499 #373899] INFO -- : [812/885] 415273=test_thread I, [2024-05-13T06:02:35.293803 #373899] INFO -- : [813/885] 415274=test_socket I, [2024-05-13T06:02:35.331812 #373899] INFO -- : [814/885] 415273=test_case I, [2024-05-13T06:02:35.337593 #373899] INFO -- : [815/885] 415273=test_pkey I, [2024-05-13T06:02:35.400657 #373899] INFO -- : [816/885] 415273=test_parser_events I, [2024-05-13T06:02:35.506892 #373899] INFO -- : [817/885] 415273=test_reline I, [2024-05-13T06:02:35.627413 #373899] INFO -- : [818/885] 415261=test_cclass I, [2024-05-13T06:02:35.830954 #373899] INFO -- : [819/885] 415278=test_gem_version_option I, [2024-05-13T06:02:35.835521 #373899] INFO -- : [820/885] 415261=test_grapheme_breaks I, [2024-05-13T06:02:35.862288 #373899] INFO -- : [821/885] 415261=test_gem_request_connection_pools I, [2024-05-13T06:02:35.876030 #373899] INFO -- : [822/885] 415278=test_memory_view I, [2024-05-13T06:02:35.879879 #373899] INFO -- : [823/885] 415273=test_m17n_comb I, [2024-05-13T06:02:36.019560 #373899] INFO -- : [824/885] 415278=test_ractor I, [2024-05-13T06:02:36.093752 #373899] INFO -- : [825/885] 415278=test_ansi_with_terminfo I, [2024-05-13T06:02:36.093828 #373899] INFO -- : [826/885] 415278=test_rdoc_generator_pot_po I, [2024-05-13T06:02:36.099377 #373899] INFO -- : [827/885] 415278=test_json_tree I, [2024-05-13T06:02:36.109905 #373899] INFO -- : [828/885] 415278=test_rdoc_markup_to_markdown I, [2024-05-13T06:02:36.147711 #373899] INFO -- : [829/885] 415278=test_last_thread I, [2024-05-13T06:02:36.181650 #373899] INFO -- : [830/885] 415267=test_process I, [2024-05-13T06:02:36.284774 #373899] INFO -- : [831/885] 415268=test_pack I, [2024-05-13T06:02:36.537707 #373899] INFO -- : [832/885] 415268=test_gem_source_local I, [2024-05-13T06:02:36.643638 #373899] INFO -- : [833/885] 415276=test_gem_security_policy I, [2024-05-13T06:02:36.646494 #373899] INFO -- : [834/885] 415259=test_arity I, [2024-05-13T06:02:36.656138 #373899] INFO -- : [835/885] 415259=test_gem_ext_rake_builder I, [2024-05-13T06:02:36.784026 #373899] INFO -- : [836/885] 415263=test_logdevice I, [2024-05-13T06:02:36.842537 #373899] INFO -- : [837/885] 415268=test_gem_resolver_lock_specification I, [2024-05-13T06:02:36.843252 #373899] INFO -- : [838/885] 415272=test_err_in_callback I, [2024-05-13T06:02:36.848306 #373899] INFO -- : [839/885] 415272=test_x509cert I, [2024-05-13T06:02:36.882010 #373899] INFO -- : [840/885] 415268=test_gc I, [2024-05-13T06:02:36.912679 #373899] INFO -- : [841/885] 415261=test_securerandom I, [2024-05-13T06:02:36.949837 #373899] INFO -- : [842/885] 415261=test_logperiod I, [2024-05-13T06:02:36.964392 #373899] INFO -- : [843/885] 415261=test_rdoc_markdown_test I, [2024-05-13T06:02:36.974800 #373899] INFO -- : [844/885] 415274=test_c_union_entity I, [2024-05-13T06:02:37.061467 #373899] INFO -- : [845/885] 415276=test_rdoc_normal_module I, [2024-05-13T06:02:37.066345 #373899] INFO -- : [846/885] 415274=test_flush I, [2024-05-13T06:02:37.099060 #373899] INFO -- : [847/885] 415274=test_singleton I, [2024-05-13T06:02:37.126413 #373899] INFO -- : [848/885] 415274=test_io_console I, [2024-05-13T06:02:37.130618 #373899] INFO -- : [849/885] 415276=test_switch_hitter I, [2024-05-13T06:02:37.154155 #373899] INFO -- : [850/885] 415276=newline_test I, [2024-05-13T06:02:37.184661 #373899] INFO -- : [851/885] 415272=test_uncorrectable_name_check I, [2024-05-13T06:02:37.186181 #373899] INFO -- : [852/885] 415272=test_stringchar I, [2024-05-13T06:02:37.228856 #373899] INFO -- : [853/885] 415278=test_hash_create I, [2024-05-13T06:02:37.229391 #373899] INFO -- : [854/885] 415278=test_passing_block I, [2024-05-13T06:02:37.234628 #373899] INFO -- : [855/885] 415278=test_thread_fd_close I, [2024-05-13T06:02:37.234715 #373899] INFO -- : [856/885] 415262=test_rdoc_parser_ruby I, [2024-05-13T06:02:37.250931 #373899] INFO -- : [857/885] 415278=test_open-uri I, [2024-05-13T06:02:37.264379 #373899] INFO -- : [858/885] 415276=test_httpresponse I, [2024-05-13T06:02:37.272885 #373899] INFO -- : [859/885] 415269=test_rdoc_context I, [2024-05-13T06:02:37.273497 #373899] INFO -- : [860/885] 415272=test_nil2vtempty I, [2024-05-13T06:02:37.277242 #373899] INFO -- : [861/885] 415272=test_stream I, [2024-05-13T06:02:37.285020 #373899] INFO -- : [862/885] 415272=test_tcp I, [2024-05-13T06:02:37.365619 #373899] INFO -- : [863/885] 415276=test_iso_8859 I, [2024-05-13T06:02:37.403032 #373899] INFO -- : [864/885] 415276=test_rdoc_text I, [2024-05-13T06:02:37.463521 #373899] INFO -- : [865/885] 415276=test_syntax I, [2024-05-13T06:02:37.483973 #373899] INFO -- : [866/885] 415272=test_gem_safe_yaml I, [2024-05-13T06:02:37.498763 #373899] INFO -- : [867/885] 415272=test_require I, [2024-05-13T06:02:37.499642 #373899] INFO -- : [868/885] 415272=test_date_time I, [2024-05-13T06:02:37.512739 #373899] INFO -- : [869/885] 415272=test_rdoc_markup_to_joined_paragraph I, [2024-05-13T06:02:37.518214 #373899] INFO -- : [870/885] 415272=test_data I, [2024-05-13T06:02:37.526115 #373899] INFO -- : [871/885] 415272=test_date_new I, [2024-05-13T06:02:37.538753 #373899] INFO -- : [872/885] 415272=index_write_test I, [2024-05-13T06:02:37.571423 #373899] INFO -- : [873/885] 415272=test_http I, [2024-05-13T06:02:37.577732 #373899] INFO -- : [874/885] 415272=test_gem_commands_which_command I, [2024-05-13T06:02:37.617868 #373899] INFO -- : [875/885] 415272=test_shift_jis I, [2024-05-13T06:02:37.622500 #373899] INFO -- : [876/885] 415272=test_flags I, [2024-05-13T06:02:37.646506 #373899] INFO -- : [877/885] 415259=test_inadvertent_creation I, [2024-05-13T06:02:37.801918 #373899] INFO -- : [878/885] 415263=test_enumerator I, [2024-05-13T06:02:37.840767 #373899] INFO -- : [879/885] 415259=test_gem_commands_specification_command I, [2024-05-13T06:02:37.888147 #373899] INFO -- : [880/885] 415262=test_gem_commands_dependency_command I, [2024-05-13T06:02:37.924875 #373899] INFO -- : [881/885] 415278=test_gem_resolver I, [2024-05-13T06:02:37.975120 #373899] INFO -- : [882/885] 415262=test_safe_load I, [2024-05-13T06:02:37.986467 #373899] INFO -- : [883/885] 415262=test_gem_resolver_composed_set I, [2024-05-13T06:02:37.987421 #373899] INFO -- : [884/885] 415259=test_rdoc_markup_attribute_manager I, [2024-05-13T06:02:38.002372 #373899] INFO -- : [885/885] 415262=test_name_error I, [2024-05-13T06:02:51.365159 #373899] INFO -- : Finished tests in 33.222707s, 793.5837 tests/s, 281551.7097 assertions/s. E, [2024-05-13T06:02:51.365414 #373899] ERROR -- : Children under /tmp/rubytest.143gyg: E, [2024-05-13T06:02:51.366655 #373899] ERROR -- : * drwx------ 4 80 2024-05-13 06:02:27 +0000 gem_rebuild20240513-415259-8fxu0i/ E, [2024-05-13T06:02:51.366665 #373899] ERROR -- : * drwxrwxr-x 2 60 2024-05-13 06:02:27 +0000 new/ E, [2024-05-13T06:02:51.366670 #373899] ERROR -- : * -rw-rw-r-- 1 4096 2024-05-13 06:02:27 +0000 rebuild_test_gem-1.0.0.gem E, [2024-05-13T06:02:51.366674 #373899] ERROR -- : * drwxrwxr-x 2 60 2024-05-13 06:02:27 +0000 old/ E, [2024-05-13T06:02:51.366678 #373899] ERROR -- : * -rw-rw-r-- 1 4096 2024-05-13 06:02:27 +0000 rebuild_test_gem-1.0.0.gem I, [2024-05-13T06:02:51.366783 #373899] INFO -- : 26365 tests, 9353910 assertions, 0 failures, 0 errors, 304 skips I, [2024-05-13T06:02:51.366817 #373899] INFO -- : I, [2024-05-13T06:02:51.366829 #373899] INFO -- : ruby -v: ruby 3.4.0dev (2024-05-12T23:26:54Z master 3c16d93cd3) [x86_64-linux] I, [2024-05-13T06:02:51.368960 #373899] INFO -- : $$$[end] "make yes-test-all TESTOPTS='--stderr-on-failure' TESTS='-j20'" exit with 0. I, [2024-05-13T06:02:51.369082 #373899] INFO -- : $$$[beg] make yes-test-rubyspec MSPECOPT='--error-output stderr --debug -j' TESTS='-j20' I, [2024-05-13T06:02:51.459842 #373899] INFO -- : BASERUBY = /usr/bin/ruby --disable=gems I, [2024-05-13T06:02:51.459878 #373899] INFO -- : CC = gcc I, [2024-05-13T06:02:51.459883 #373899] INFO -- : LD = ld I, [2024-05-13T06:02:51.459887 #373899] INFO -- : LDSHARED = gcc -shared I, [2024-05-13T06:02:51.459891 #373899] INFO -- : CFLAGS = -O3 -fno-fast-math -ggdb3 -Wall -Wextra -Wdeprecated-declarations -Wdiv-by-zero -Wduplicated-cond -Wimplicit-function-declaration -Wimplicit-int -Wpointer-arith -Wwrite-strings -Wold-style-definition -Wimplicit-fallthrough=0 -Wmissing-noreturn -Wno-cast-function-type -Wno-constant-logical-operand -Wno-long-long -Wno-missing-field-initializers -Wno-overlength-strings -Wno-packed-bitfield-compat -Wno-parentheses-equality -Wno-self-assign -Wno-tautological-compare -Wno-unused-parameter -Wno-unused-value -Wsuggest-attribute=format -Wsuggest-attribute=noreturn -Wunused-variable -Wmisleading-indentation -Wundef -fPIC I, [2024-05-13T06:02:51.459903 #373899] INFO -- : XCFLAGS = -U_FORTIFY_SOURCE -D_FORTIFY_SOURCE=2 -fstack-protector-strong -fno-strict-overflow -fvisibility=hidden -fexcess-precision=standard -DRUBY_EXPORT -I. -I.ext/include/x86_64-linux -I/tmp/ruby/src/trunk/include -I/tmp/ruby/src/trunk -I/tmp/ruby/src/trunk/prism -I/tmp/ruby/src/trunk/enc/unicode/15.0.0 I, [2024-05-13T06:02:51.459907 #373899] INFO -- : CPPFLAGS = I, [2024-05-13T06:02:51.459910 #373899] INFO -- : DLDFLAGS = -Wl,--compress-debug-sections=zlib -Wl,-soname,libruby.so.3.4 -fstack-protector-strong I, [2024-05-13T06:02:51.459915 #373899] INFO -- : SOLIBS = -lz -lrt -lrt -lgmp -ldl -lcrypt -lm -lpthread I, [2024-05-13T06:02:51.459918 #373899] INFO -- : LANG = en_US.UTF-8 I, [2024-05-13T06:02:51.459921 #373899] INFO -- : LC_ALL = I, [2024-05-13T06:02:51.459925 #373899] INFO -- : LC_CTYPE = I, [2024-05-13T06:02:51.459928 #373899] INFO -- : MFLAGS = I, [2024-05-13T06:02:51.459931 #373899] INFO -- : RUSTC = no I, [2024-05-13T06:02:51.459935 #373899] INFO -- : YJIT_RUSTC_ARGS = --crate-name=yjit --crate-type=staticlib --edition=2021 -g -C lto=thin -C opt-level=3 -C overflow-checks=on '--out-dir=/tmp/ruby/build/trunk/yjit/target/release/' /tmp/ruby/src/trunk/yjit/src/lib.rs I, [2024-05-13T06:02:51.460545 #373899] INFO -- : gcc (Ubuntu 11.4.0-1ubuntu1~22.04) 11.4.0 I, [2024-05-13T06:02:51.460565 #373899] INFO -- : Copyright (C) 2021 Free Software Foundation, Inc. I, [2024-05-13T06:02:51.460571 #373899] INFO -- : This is free software; see the source for copying conditions. There is NO I, [2024-05-13T06:02:51.460576 #373899] INFO -- : warranty; not even for MERCHANTABILITY or FITNESS FOR A PARTICULAR PURPOSE. I, [2024-05-13T06:02:51.460580 #373899] INFO -- : I, [2024-05-13T06:02:51.462684 #373899] INFO -- : generating enc.mk I, [2024-05-13T06:02:51.580589 #373899] INFO -- : making enc I, [2024-05-13T06:02:51.598052 #373899] INFO -- : make[1]: Entering directory '/tmp/ruby/build/trunk' I, [2024-05-13T06:02:51.598076 #373899] INFO -- : make[1]: Nothing to be done for 'enc'. I, [2024-05-13T06:02:51.598082 #373899] INFO -- : make[1]: Leaving directory '/tmp/ruby/build/trunk' I, [2024-05-13T06:02:51.598723 #373899] INFO -- : making srcs under enc I, [2024-05-13T06:02:51.628771 #373899] INFO -- : make[1]: Entering directory '/tmp/ruby/build/trunk' I, [2024-05-13T06:02:51.628792 #373899] INFO -- : make[1]: Nothing to be done for 'srcs'. I, [2024-05-13T06:02:51.628798 #373899] INFO -- : make[1]: Leaving directory '/tmp/ruby/build/trunk' I, [2024-05-13T06:02:51.629637 #373899] INFO -- : generating transdb.h I, [2024-05-13T06:02:51.726139 #373899] INFO -- : transdb.h unchanged I, [2024-05-13T06:02:51.727414 #373899] INFO -- : making trans I, [2024-05-13T06:02:51.761277 #373899] INFO -- : make[1]: Entering directory '/tmp/ruby/build/trunk' I, [2024-05-13T06:02:51.761305 #373899] INFO -- : make[1]: Nothing to be done for 'trans'. I, [2024-05-13T06:02:51.761313 #373899] INFO -- : make[1]: Leaving directory '/tmp/ruby/build/trunk' I, [2024-05-13T06:02:51.762007 #373899] INFO -- : making encs I, [2024-05-13T06:02:51.799228 #373899] INFO -- : make[1]: Entering directory '/tmp/ruby/build/trunk' I, [2024-05-13T06:02:51.799248 #373899] INFO -- : make[1]: Nothing to be done for 'encs'. I, [2024-05-13T06:02:51.799254 #373899] INFO -- : make[1]: Leaving directory '/tmp/ruby/build/trunk' I, [2024-05-13T06:02:51.801169 #373899] INFO -- : generating makefiles ext/configure-ext.mk I, [2024-05-13T06:02:51.827842 #373899] INFO -- : ext/configure-ext.mk updated I, [2024-05-13T06:02:51.830343 #373899] INFO -- : make[1]: Entering directory '/tmp/ruby/build/trunk' I, [2024-05-13T06:02:53.175962 #373899] INFO -- : make[1]: Leaving directory '/tmp/ruby/build/trunk' I, [2024-05-13T06:02:53.176746 #373899] INFO -- : generating makefile exts.mk I, [2024-05-13T06:02:53.213265 #373899] INFO -- : exts.mk unchanged I, [2024-05-13T06:02:53.217808 #373899] INFO -- : make[1]: Entering directory '/tmp/ruby/build/trunk' I, [2024-05-13T06:02:53.558199 #373899] INFO -- : make[2]: Entering directory '/tmp/ruby/build/trunk/ext/coverage' I, [2024-05-13T06:02:53.562966 #373899] INFO -- : make[2]: Leaving directory '/tmp/ruby/build/trunk/ext/coverage' I, [2024-05-13T06:02:53.569385 #373899] INFO -- : make[2]: Entering directory '/tmp/ruby/build/trunk/ext/date' I, [2024-05-13T06:02:53.574527 #373899] INFO -- : make[2]: Leaving directory '/tmp/ruby/build/trunk/ext/date' I, [2024-05-13T06:02:53.578539 #373899] INFO -- : make[2]: Entering directory '/tmp/ruby/build/trunk/ext/digest' I, [2024-05-13T06:02:53.587603 #373899] INFO -- : make[2]: Leaving directory '/tmp/ruby/build/trunk/ext/digest' I, [2024-05-13T06:02:53.614927 #373899] INFO -- : make[2]: Entering directory '/tmp/ruby/build/trunk/ext/digest/sha2' I, [2024-05-13T06:02:53.620058 #373899] INFO -- : make[2]: Leaving directory '/tmp/ruby/build/trunk/ext/digest/sha2' I, [2024-05-13T06:02:53.641830 #373899] INFO -- : make[2]: Entering directory '/tmp/ruby/build/trunk/ext/fiddle' I, [2024-05-13T06:02:53.652809 #373899] INFO -- : make[2]: Leaving directory '/tmp/ruby/build/trunk/ext/fiddle' I, [2024-05-13T06:02:53.657812 #373899] INFO -- : make[2]: Entering directory '/tmp/ruby/build/trunk/ext/io/console' I, [2024-05-13T06:02:53.662011 #373899] INFO -- : make[2]: Leaving directory '/tmp/ruby/build/trunk/ext/io/console' I, [2024-05-13T06:02:53.674624 #373899] INFO -- : make[2]: Entering directory '/tmp/ruby/build/trunk/ext/json' I, [2024-05-13T06:02:53.685184 #373899] INFO -- : make[2]: Leaving directory '/tmp/ruby/build/trunk/ext/json' I, [2024-05-13T06:02:53.700016 #373899] INFO -- : make[2]: Entering directory '/tmp/ruby/build/trunk/ext/monitor' I, [2024-05-13T06:02:53.703038 #373899] INFO -- : make[2]: Leaving directory '/tmp/ruby/build/trunk/ext/monitor' I, [2024-05-13T06:02:53.709897 #373899] INFO -- : make[2]: Entering directory '/tmp/ruby/build/trunk/ext/objspace' I, [2024-05-13T06:02:53.715293 #373899] INFO -- : make[2]: Leaving directory '/tmp/ruby/build/trunk/ext/objspace' I, [2024-05-13T06:02:53.733345 #373899] INFO -- : make[2]: Entering directory '/tmp/ruby/build/trunk/ext/openssl' I, [2024-05-13T06:02:53.747716 #373899] INFO -- : make[2]: Leaving directory '/tmp/ruby/build/trunk/ext/openssl' I, [2024-05-13T06:02:53.752575 #373899] INFO -- : make[2]: Entering directory '/tmp/ruby/build/trunk/ext/pathname' I, [2024-05-13T06:02:53.756562 #373899] INFO -- : make[2]: Leaving directory '/tmp/ruby/build/trunk/ext/pathname' I, [2024-05-13T06:02:53.763773 #373899] INFO -- : make[2]: Entering directory '/tmp/ruby/build/trunk/ext/psych' I, [2024-05-13T06:02:53.788667 #373899] INFO -- : make[2]: Leaving directory '/tmp/ruby/build/trunk/ext/psych' I, [2024-05-13T06:02:53.793931 #373899] INFO -- : make[2]: Entering directory '/tmp/ruby/build/trunk/ext/pty' I, [2024-05-13T06:02:53.798196 #373899] INFO -- : make[2]: Leaving directory '/tmp/ruby/build/trunk/ext/pty' I, [2024-05-13T06:02:53.814327 #373899] INFO -- : make[2]: Entering directory '/tmp/ruby/build/trunk/ext/ripper' I, [2024-05-13T06:02:53.822645 #373899] INFO -- : make[2]: Leaving directory '/tmp/ruby/build/trunk/ext/ripper' I, [2024-05-13T06:02:53.825099 #373899] INFO -- : make[2]: Entering directory '/tmp/ruby/build/trunk/ext/rubyvm' I, [2024-05-13T06:02:53.828400 #373899] INFO -- : make[2]: Leaving directory '/tmp/ruby/build/trunk/ext/rubyvm' I, [2024-05-13T06:02:53.842165 #373899] INFO -- : make[2]: Entering directory '/tmp/ruby/build/trunk/ext/socket' I, [2024-05-13T06:02:53.852646 #373899] INFO -- : make[2]: Leaving directory '/tmp/ruby/build/trunk/ext/socket' I, [2024-05-13T06:02:53.870813 #373899] INFO -- : make[2]: Entering directory '/tmp/ruby/build/trunk/.bundle/gems/bigdecimal-3.1.8/ext/bigdecimal' I, [2024-05-13T06:02:53.898553 #373899] INFO -- : make[2]: Leaving directory '/tmp/ruby/build/trunk/.bundle/gems/bigdecimal-3.1.8/ext/bigdecimal' I, [2024-05-13T06:02:53.900575 #373899] INFO -- : make[2]: Entering directory '/tmp/ruby/build/trunk/.bundle/gems/debug-1.9.2/ext/debug' I, [2024-05-13T06:02:53.922989 #373899] INFO -- : make[2]: Leaving directory '/tmp/ruby/build/trunk/.bundle/gems/debug-1.9.2/ext/debug' I, [2024-05-13T06:02:53.925011 #373899] INFO -- : make[2]: Entering directory '/tmp/ruby/build/trunk/.bundle/gems/nkf-0.2.0/ext/nkf' I, [2024-05-13T06:02:53.951704 #373899] INFO -- : make[2]: Leaving directory '/tmp/ruby/build/trunk/.bundle/gems/nkf-0.2.0/ext/nkf' I, [2024-05-13T06:02:53.954156 #373899] INFO -- : make[2]: Entering directory '/tmp/ruby/build/trunk/.bundle/gems/racc-1.7.3/ext/racc/cparse' I, [2024-05-13T06:02:53.980456 #373899] INFO -- : make[2]: Leaving directory '/tmp/ruby/build/trunk/.bundle/gems/racc-1.7.3/ext/racc/cparse' I, [2024-05-13T06:02:53.982651 #373899] INFO -- : make[2]: Entering directory '/tmp/ruby/build/trunk/.bundle/gems/rbs-3.4.4/ext/rbs_extension' I, [2024-05-13T06:02:54.009344 #373899] INFO -- : make[2]: Leaving directory '/tmp/ruby/build/trunk/.bundle/gems/rbs-3.4.4/ext/rbs_extension' I, [2024-05-13T06:02:54.012017 #373899] INFO -- : make[2]: Entering directory '/tmp/ruby/build/trunk/.bundle/gems/syslog-0.1.2/ext/syslog' I, [2024-05-13T06:02:54.039209 #373899] INFO -- : make[2]: Leaving directory '/tmp/ruby/build/trunk/.bundle/gems/syslog-0.1.2/ext/syslog' I, [2024-05-13T06:02:54.063825 #373899] INFO -- : make[2]: Entering directory '/tmp/ruby/build/trunk' I, [2024-05-13T06:02:54.132879 #373899] INFO -- : make[2]: 'ruby' is up to date. I, [2024-05-13T06:02:54.132916 #373899] INFO -- : make[2]: Leaving directory '/tmp/ruby/build/trunk' I, [2024-05-13T06:02:54.133165 #373899] INFO -- : make[1]: Leaving directory '/tmp/ruby/build/trunk' I, [2024-05-13T06:02:54.136606 #373899] INFO -- : make[1]: Entering directory '/tmp/ruby/build/trunk' I, [2024-05-13T06:02:54.136630 #373899] INFO -- : make[1]: Nothing to be done for 'note'. I, [2024-05-13T06:02:54.136641 #373899] INFO -- : make[1]: Leaving directory '/tmp/ruby/build/trunk' E, [2024-05-13T06:02:54.194634 #373899] ERROR -- : $ /tmp/ruby/build/trunk/miniruby -I/tmp/ruby/src/trunk/lib /tmp/ruby/src/trunk/tool/runruby.rb --archdir=/tmp/ruby/build/trunk --extout=.ext -- /tmp/ruby/src/trunk/spec/mspec/bin/mspec-run -B /tmp/ruby/src/trunk/spec/default.mspec --error-output stderr --debug -fy -o /tmp/rubytest.jize94/1-mspec-multi-0 E, [2024-05-13T06:02:54.194813 #373899] ERROR -- : $ /tmp/ruby/build/trunk/miniruby -I/tmp/ruby/src/trunk/lib /tmp/ruby/src/trunk/tool/runruby.rb --archdir=/tmp/ruby/build/trunk --extout=.ext -- /tmp/ruby/src/trunk/spec/mspec/bin/mspec-run -B /tmp/ruby/src/trunk/spec/default.mspec --error-output stderr --debug -fy -o /tmp/rubytest.jize94/2-mspec-multi-1 E, [2024-05-13T06:02:54.195149 #373899] ERROR -- : $ /tmp/ruby/build/trunk/miniruby -I/tmp/ruby/src/trunk/lib /tmp/ruby/src/trunk/tool/runruby.rb --archdir=/tmp/ruby/build/trunk --extout=.ext -- /tmp/ruby/src/trunk/spec/mspec/bin/mspec-run -B /tmp/ruby/src/trunk/spec/default.mspec --error-output stderr --debug -fy -o /tmp/rubytest.jize94/3-mspec-multi-2 E, [2024-05-13T06:02:54.195327 #373899] ERROR -- : $ /tmp/ruby/build/trunk/miniruby -I/tmp/ruby/src/trunk/lib /tmp/ruby/src/trunk/tool/runruby.rb --archdir=/tmp/ruby/build/trunk --extout=.ext -- /tmp/ruby/src/trunk/spec/mspec/bin/mspec-run -B /tmp/ruby/src/trunk/spec/default.mspec --error-output stderr --debug -fy -o /tmp/rubytest.jize94/4-mspec-multi-3 E, [2024-05-13T06:02:54.195517 #373899] ERROR -- : $ /tmp/ruby/build/trunk/miniruby -I/tmp/ruby/src/trunk/lib /tmp/ruby/src/trunk/tool/runruby.rb --archdir=/tmp/ruby/build/trunk --extout=.ext -- /tmp/ruby/src/trunk/spec/mspec/bin/mspec-run -B /tmp/ruby/src/trunk/spec/default.mspec --error-output stderr --debug -fy -o /tmp/rubytest.jize94/5-mspec-multi-4 E, [2024-05-13T06:02:54.195767 #373899] ERROR -- : $ /tmp/ruby/build/trunk/miniruby -I/tmp/ruby/src/trunk/lib /tmp/ruby/src/trunk/tool/runruby.rb --archdir=/tmp/ruby/build/trunk --extout=.ext -- /tmp/ruby/src/trunk/spec/mspec/bin/mspec-run -B /tmp/ruby/src/trunk/spec/default.mspec --error-output stderr --debug -fy -o /tmp/rubytest.jize94/6-mspec-multi-5 E, [2024-05-13T06:02:54.195813 #373899] ERROR -- : $ /tmp/ruby/build/trunk/miniruby -I/tmp/ruby/src/trunk/lib /tmp/ruby/src/trunk/tool/runruby.rb --archdir=/tmp/ruby/build/trunk --extout=.ext -- /tmp/ruby/src/trunk/spec/mspec/bin/mspec-run -B /tmp/ruby/src/trunk/spec/default.mspec --error-output stderr --debug -fy -o /tmp/rubytest.jize94/7-mspec-multi-6 E, [2024-05-13T06:02:54.196031 #373899] ERROR -- : $ /tmp/ruby/build/trunk/miniruby -I/tmp/ruby/src/trunk/lib /tmp/ruby/src/trunk/tool/runruby.rb --archdir=/tmp/ruby/build/trunk --extout=.ext -- /tmp/ruby/src/trunk/spec/mspec/bin/mspec-run -B /tmp/ruby/src/trunk/spec/default.mspec --error-output stderr --debug -fy -o /tmp/rubytest.jize94/8-mspec-multi-7 E, [2024-05-13T06:02:54.196223 #373899] ERROR -- : $ /tmp/ruby/build/trunk/miniruby -I/tmp/ruby/src/trunk/lib /tmp/ruby/src/trunk/tool/runruby.rb --archdir=/tmp/ruby/build/trunk --extout=.ext -- /tmp/ruby/src/trunk/spec/mspec/bin/mspec-run -B /tmp/ruby/src/trunk/spec/default.mspec --error-output stderr --debug -fy -o /tmp/rubytest.jize94/9-mspec-multi-8 E, [2024-05-13T06:02:54.196497 #373899] ERROR -- : $ /tmp/ruby/build/trunk/miniruby -I/tmp/ruby/src/trunk/lib /tmp/ruby/src/trunk/tool/runruby.rb --archdir=/tmp/ruby/build/trunk --extout=.ext -- /tmp/ruby/src/trunk/spec/mspec/bin/mspec-run -B /tmp/ruby/src/trunk/spec/default.mspec --error-output stderr --debug -fy -o /tmp/rubytest.jize94/10-mspec-multi-9 E, [2024-05-13T06:02:54.196662 #373899] ERROR -- : $ /tmp/ruby/build/trunk/miniruby -I/tmp/ruby/src/trunk/lib /tmp/ruby/src/trunk/tool/runruby.rb --archdir=/tmp/ruby/build/trunk --extout=.ext -- /tmp/ruby/src/trunk/spec/mspec/bin/mspec-run -B /tmp/ruby/src/trunk/spec/default.mspec --error-output stderr --debug -fy -o /tmp/rubytest.jize94/11-mspec-multi-10 E, [2024-05-13T06:02:54.196822 #373899] ERROR -- : $ /tmp/ruby/build/trunk/miniruby -I/tmp/ruby/src/trunk/lib /tmp/ruby/src/trunk/tool/runruby.rb --archdir=/tmp/ruby/build/trunk --extout=.ext -- /tmp/ruby/src/trunk/spec/mspec/bin/mspec-run -B /tmp/ruby/src/trunk/spec/default.mspec --error-output stderr --debug -fy -o /tmp/rubytest.jize94/12-mspec-multi-11 E, [2024-05-13T06:02:54.197027 #373899] ERROR -- : $ /tmp/ruby/build/trunk/miniruby -I/tmp/ruby/src/trunk/lib /tmp/ruby/src/trunk/tool/runruby.rb --archdir=/tmp/ruby/build/trunk --extout=.ext -- /tmp/ruby/src/trunk/spec/mspec/bin/mspec-run -B /tmp/ruby/src/trunk/spec/default.mspec --error-output stderr --debug -fy -o /tmp/rubytest.jize94/13-mspec-multi-12 E, [2024-05-13T06:02:54.197213 #373899] ERROR -- : $ /tmp/ruby/build/trunk/miniruby -I/tmp/ruby/src/trunk/lib /tmp/ruby/src/trunk/tool/runruby.rb --archdir=/tmp/ruby/build/trunk --extout=.ext -- /tmp/ruby/src/trunk/spec/mspec/bin/mspec-run -B /tmp/ruby/src/trunk/spec/default.mspec --error-output stderr --debug -fy -o /tmp/rubytest.jize94/14-mspec-multi-13 E, [2024-05-13T06:02:54.197431 #373899] ERROR -- : $ /tmp/ruby/build/trunk/miniruby -I/tmp/ruby/src/trunk/lib /tmp/ruby/src/trunk/tool/runruby.rb --archdir=/tmp/ruby/build/trunk --extout=.ext -- /tmp/ruby/src/trunk/spec/mspec/bin/mspec-run -B /tmp/ruby/src/trunk/spec/default.mspec --error-output stderr --debug -fy -o /tmp/rubytest.jize94/15-mspec-multi-14 E, [2024-05-13T06:02:54.197552 #373899] ERROR -- : $ /tmp/ruby/build/trunk/miniruby -I/tmp/ruby/src/trunk/lib /tmp/ruby/src/trunk/tool/runruby.rb --archdir=/tmp/ruby/build/trunk --extout=.ext -- /tmp/ruby/src/trunk/spec/mspec/bin/mspec-run -B /tmp/ruby/src/trunk/spec/default.mspec --error-output stderr --debug -fy -o /tmp/rubytest.jize94/16-mspec-multi-15 E, [2024-05-13T06:02:54.197763 #373899] ERROR -- : $ /tmp/ruby/build/trunk/miniruby -I/tmp/ruby/src/trunk/lib /tmp/ruby/src/trunk/tool/runruby.rb --archdir=/tmp/ruby/build/trunk --extout=.ext -- /tmp/ruby/src/trunk/spec/mspec/bin/mspec-run -B /tmp/ruby/src/trunk/spec/default.mspec --error-output stderr --debug -fy -o /tmp/rubytest.jize94/17-mspec-multi-16 E, [2024-05-13T06:02:54.198002 #373899] ERROR -- : $ /tmp/ruby/build/trunk/miniruby -I/tmp/ruby/src/trunk/lib /tmp/ruby/src/trunk/tool/runruby.rb --archdir=/tmp/ruby/build/trunk --extout=.ext -- /tmp/ruby/src/trunk/spec/mspec/bin/mspec-run -B /tmp/ruby/src/trunk/spec/default.mspec --error-output stderr --debug -fy -o /tmp/rubytest.jize94/18-mspec-multi-17 E, [2024-05-13T06:02:54.200764 #373899] ERROR -- : $ /tmp/ruby/build/trunk/miniruby -I/tmp/ruby/src/trunk/lib /tmp/ruby/src/trunk/tool/runruby.rb --archdir=/tmp/ruby/build/trunk --extout=.ext -- /tmp/ruby/src/trunk/spec/mspec/bin/mspec-run -B /tmp/ruby/src/trunk/spec/default.mspec --error-output stderr --debug -fy -o /tmp/rubytest.jize94/19-mspec-multi-18 E, [2024-05-13T06:02:54.201145 #373899] ERROR -- : $ /tmp/ruby/build/trunk/miniruby -I/tmp/ruby/src/trunk/lib /tmp/ruby/src/trunk/tool/runruby.rb --archdir=/tmp/ruby/build/trunk --extout=.ext -- /tmp/ruby/src/trunk/spec/mspec/bin/mspec-run -B /tmp/ruby/src/trunk/spec/default.mspec --error-output stderr --debug -fy -o /tmp/rubytest.jize94/20-mspec-multi-19 I, [2024-05-13T06:02:54.362783 #373899] INFO -- : ruby 3.4.0dev (2024-05-12T23:26:54Z master 3c16d93cd3) [x86_64-linux] I, [2024-05-13T06:02:54.998256 #373899] INFO -- : 0 ......................................................................... I, [2024-05-13T06:02:55.338510 #373899] INFO -- : 73 ......................................................................... I, [2024-05-13T06:02:55.494989 #373899] INFO -- : 146 ......................................................................... I, [2024-05-13T06:02:55.539076 #373899] INFO -- : 219 ......................................................................... I, [2024-05-13T06:02:55.597245 #373899] INFO -- : 292 ......................................................................... I, [2024-05-13T06:02:55.640066 #373899] INFO -- : 365 ......................................................................... I, [2024-05-13T06:02:55.660947 #373899] INFO -- : 438 ......................................................................... I, [2024-05-13T06:02:55.679263 #373899] INFO -- : 511 ......................................................................... I, [2024-05-13T06:02:55.698042 #373899] INFO -- : 584 ......................................................................... I, [2024-05-13T06:02:55.746502 #373899] INFO -- : 657 ......................................................................... I, [2024-05-13T06:02:55.773250 #373899] INFO -- : 730 ......................................................................... I, [2024-05-13T06:02:55.797007 #373899] INFO -- : 803 ......................................................................... I, [2024-05-13T06:02:55.828305 #373899] INFO -- : 876 ......................................................................... I, [2024-05-13T06:02:55.879770 #373899] INFO -- : 949 ......................................................................... I, [2024-05-13T06:02:55.969768 #373899] INFO -- : 1022 ......................................................................... I, [2024-05-13T06:02:56.144092 #373899] INFO -- : 1095 ......................................................................... I, [2024-05-13T06:02:56.268511 #373899] INFO -- : 1168 ......................................................................... I, [2024-05-13T06:02:56.334170 #373899] INFO -- : 1241 ......................................................................... I, [2024-05-13T06:02:56.377520 #373899] INFO -- : 1314 ......................................................................... I, [2024-05-13T06:02:56.394665 #373899] INFO -- : 1387 ......................................................................... I, [2024-05-13T06:02:56.506605 #373899] INFO -- : 1460 ......................................................................... I, [2024-05-13T06:02:56.968895 #373899] INFO -- : 1533 ......................................................................... I, [2024-05-13T06:02:57.026016 #373899] INFO -- : 1606 ......................................................................... I, [2024-05-13T06:02:57.099135 #373899] INFO -- : 1679 ......................................................................... I, [2024-05-13T06:02:57.210133 #373899] INFO -- : 1752 ......................................................................... I, [2024-05-13T06:02:57.312190 #373899] INFO -- : 1825 ......................................................................... I, [2024-05-13T06:02:57.405891 #373899] INFO -- : 1898 ......................................................................... I, [2024-05-13T06:02:57.492903 #373899] INFO -- : 1971 ......................................................................... I, [2024-05-13T06:02:57.555010 #373899] INFO -- : 2044 ......................................................................... I, [2024-05-13T06:02:57.608361 #373899] INFO -- : 2117 ......................................................................... I, [2024-05-13T06:02:57.624539 #373899] INFO -- : 2190 ......................................................................... I, [2024-05-13T06:02:57.643600 #373899] INFO -- : 2263 ......................................................................... I, [2024-05-13T06:02:57.658474 #373899] INFO -- : 2336 ......................................................................... I, [2024-05-13T06:02:57.693071 #373899] INFO -- : 2409 ......................................................................... I, [2024-05-13T06:02:57.782247 #373899] INFO -- : 2482 ......................................................................... I, [2024-05-13T06:02:57.808080 #373899] INFO -- : 2555 ......................................................................... I, [2024-05-13T06:02:57.933272 #373899] INFO -- : 2628 ......................................................................... I, [2024-05-13T06:02:58.034452 #373899] INFO -- : 2701 ......................................................................... I, [2024-05-13T06:02:58.062048 #373899] INFO -- : 2774 ......................................................................... I, [2024-05-13T06:02:58.116276 #373899] INFO -- : 2847 ......................................................................... I, [2024-05-13T06:02:58.145995 #373899] INFO -- : 2920 ......................................................................... I, [2024-05-13T06:02:58.168142 #373899] INFO -- : 2993 ......................................................................... I, [2024-05-13T06:02:58.188402 #373899] INFO -- : 3066 ......................................................................... I, [2024-05-13T06:02:58.199593 #373899] INFO -- : 3139 ......................................................................... I, [2024-05-13T06:02:58.209471 #373899] INFO -- : 3212 ......................................................................... I, [2024-05-13T06:02:58.238432 #373899] INFO -- : 3285 ......................................................................... I, [2024-05-13T06:03:02.219226 #373899] INFO -- : 3358 ........................................................................ I, [2024-05-13T06:03:02.219298 #373899] INFO -- : I, [2024-05-13T06:03:02.219306 #373899] INFO -- : Finished in 8.023845 seconds I, [2024-05-13T06:03:02.219311 #373899] INFO -- : I, [2024-05-13T06:03:02.219316 #373899] INFO -- : 3429 files, 32611 examples, 207715 expectations, 0 failures, 0 errors, 0 tagged I, [2024-05-13T06:03:02.221824 #373899] INFO -- : $$$[end] "make yes-test-rubyspec MSPECOPT='--error-output stderr --debug -j' TESTS='-j20'" exit with 0.