# Logfile created on 2024-05-13 04:29:17 +0000 by logger.rb/v1.4.3 I, [2024-05-13T04:29:17.236522 #1066487] INFO -- : #, @formatter=nil, @logdev=#, @binmode=false, @mon_data=#, @mon_data_owner_object_id=860>>> I, [2024-05-13T04:29:17.236648 #1066487] INFO -- : $$$[beg] make update-unicode -j20 I, [2024-05-13T04:29:17.295257 #1066487] INFO -- : Downloading Unicode emoji 15.0 files... I, [2024-05-13T04:29:17.295525 #1066487] INFO -- : Downloading Unicode emoji 15.0 files... I, [2024-05-13T04:29:17.295789 #1066487] INFO -- : Downloading Unicode emoji 15.0 files... I, [2024-05-13T04:29:17.338030 #1066487] INFO -- : made symlink emoji/15.0/emoji-sequences.txt to /tmp/ruby/src/trunk/.downloaded-cache/emoji/15.0/emoji-sequences.txt E, [2024-05-13T04:29:17.785223 #1066487] ERROR -- : /tmp/ruby/src/trunk/tool/downloader.rb:302:in `rescue in download': failed to download emoji/15.0/emoji-test.txt (RuntimeError) E, [2024-05-13T04:29:17.785337 #1066487] ERROR -- : OpenURI::HTTPError: 403 Forbidden: https://www.unicode.org/Public/emoji/15.0/emoji-test.txt E, [2024-05-13T04:29:17.785356 #1066487] ERROR -- : from /tmp/ruby/src/trunk/tool/downloader.rb:201:in `download' E, [2024-05-13T04:29:17.785368 #1066487] ERROR -- : from /tmp/ruby/src/trunk/tool/downloader.rb:136:in `download' E, [2024-05-13T04:29:17.785394 #1066487] ERROR -- : from /tmp/ruby/src/trunk/tool/downloader.rb:482:in `block in
' E, [2024-05-13T04:29:17.785408 #1066487] ERROR -- : from /tmp/ruby/src/trunk/tool/downloader.rb:465:in `each' E, [2024-05-13T04:29:17.785420 #1066487] ERROR -- : from /tmp/ruby/src/trunk/tool/downloader.rb:465:in `
' E, [2024-05-13T04:29:17.785432 #1066487] ERROR -- : /usr/lib/ruby/3.0.0/open-uri.rb:364:in `open_http': 403 Forbidden (OpenURI::HTTPError) E, [2024-05-13T04:29:17.785444 #1066487] ERROR -- : from /usr/lib/ruby/3.0.0/open-uri.rb:741:in `buffer_open' E, [2024-05-13T04:29:17.785459 #1066487] ERROR -- : from /usr/lib/ruby/3.0.0/open-uri.rb:212:in `block in open_loop' E, [2024-05-13T04:29:17.785471 #1066487] ERROR -- : from /usr/lib/ruby/3.0.0/open-uri.rb:210:in `catch' E, [2024-05-13T04:29:17.785483 #1066487] ERROR -- : from /usr/lib/ruby/3.0.0/open-uri.rb:210:in `open_loop' E, [2024-05-13T04:29:17.785495 #1066487] ERROR -- : from /usr/lib/ruby/3.0.0/open-uri.rb:151:in `open_uri' E, [2024-05-13T04:29:17.785507 #1066487] ERROR -- : from /usr/lib/ruby/3.0.0/open-uri.rb:721:in `open' E, [2024-05-13T04:29:17.785520 #1066487] ERROR -- : from /usr/lib/ruby/3.0.0/open-uri.rb:729:in `read' E, [2024-05-13T04:29:17.785531 #1066487] ERROR -- : from /tmp/ruby/src/trunk/tool/downloader.rb:247:in `block in download' E, [2024-05-13T04:29:17.785542 #1066487] ERROR -- : from /tmp/ruby/src/trunk/tool/downloader.rb:378:in `with_retry' E, [2024-05-13T04:29:17.785552 #1066487] ERROR -- : from /tmp/ruby/src/trunk/tool/downloader.rb:246:in `download' E, [2024-05-13T04:29:17.785583 #1066487] ERROR -- : from /tmp/ruby/src/trunk/tool/downloader.rb:136:in `download' E, [2024-05-13T04:29:17.785594 #1066487] ERROR -- : from /tmp/ruby/src/trunk/tool/downloader.rb:482:in `block in
' E, [2024-05-13T04:29:17.785605 #1066487] ERROR -- : from /tmp/ruby/src/trunk/tool/downloader.rb:465:in `each' E, [2024-05-13T04:29:17.785616 #1066487] ERROR -- : from /tmp/ruby/src/trunk/tool/downloader.rb:465:in `
' E, [2024-05-13T04:29:17.789447 #1066487] ERROR -- : make: *** [uncommon.mk:1765: /tmp/ruby/src/trunk/enc/unicode/data/emoji/15.0/emoji-test.txt] Error 1 E, [2024-05-13T04:29:17.789503 #1066487] ERROR -- : make: *** Waiting for unfinished jobs.... E, [2024-05-13T04:29:18.232898 #1066487] ERROR -- : /tmp/ruby/src/trunk/tool/downloader.rb:302:in `rescue in download': failed to download emoji/15.0/emoji-sequences.txt (RuntimeError) E, [2024-05-13T04:29:18.232950 #1066487] ERROR -- : EOFError: end of file reached: https://www.unicode.org/Public/emoji/15.0/emoji-sequences.txt E, [2024-05-13T04:29:18.232956 #1066487] ERROR -- : from /tmp/ruby/src/trunk/tool/downloader.rb:201:in `download' E, [2024-05-13T04:29:18.232961 #1066487] ERROR -- : from /tmp/ruby/src/trunk/tool/downloader.rb:136:in `download' E, [2024-05-13T04:29:18.232965 #1066487] ERROR -- : from /tmp/ruby/src/trunk/tool/downloader.rb:482:in `block in
' E, [2024-05-13T04:29:18.232969 #1066487] ERROR -- : from /tmp/ruby/src/trunk/tool/downloader.rb:465:in `each' E, [2024-05-13T04:29:18.232973 #1066487] ERROR -- : from /tmp/ruby/src/trunk/tool/downloader.rb:465:in `
' E, [2024-05-13T04:29:18.232977 #1066487] ERROR -- : /usr/lib/ruby/3.0.0/net/protocol.rb:227:in `rbuf_fill': end of file reached (EOFError) E, [2024-05-13T04:29:18.232981 #1066487] ERROR -- : from /usr/lib/ruby/3.0.0/net/protocol.rb:193:in `readuntil' E, [2024-05-13T04:29:18.232986 #1066487] ERROR -- : from /usr/lib/ruby/3.0.0/net/protocol.rb:203:in `readline' E, [2024-05-13T04:29:18.232991 #1066487] ERROR -- : from /usr/lib/ruby/3.0.0/net/http/response.rb:42:in `read_status_line' E, [2024-05-13T04:29:18.232995 #1066487] ERROR -- : from /usr/lib/ruby/3.0.0/net/http/response.rb:31:in `read_new' E, [2024-05-13T04:29:18.233000 #1066487] ERROR -- : from /usr/lib/ruby/3.0.0/net/http.rb:1557:in `block in transport_request' E, [2024-05-13T04:29:18.233004 #1066487] ERROR -- : from /usr/lib/ruby/3.0.0/net/http.rb:1548:in `catch' E, [2024-05-13T04:29:18.233008 #1066487] ERROR -- : from /usr/lib/ruby/3.0.0/net/http.rb:1548:in `transport_request' E, [2024-05-13T04:29:18.233012 #1066487] ERROR -- : from /usr/lib/ruby/3.0.0/net/http.rb:1521:in `request' E, [2024-05-13T04:29:18.233016 #1066487] ERROR -- : from /usr/lib/ruby/3.0.0/open-uri.rb:329:in `block in open_http' E, [2024-05-13T04:29:18.233021 #1066487] ERROR -- : from /usr/lib/ruby/3.0.0/net/http.rb:960:in `start' E, [2024-05-13T04:29:18.233025 #1066487] ERROR -- : from /usr/lib/ruby/3.0.0/open-uri.rb:323:in `open_http' E, [2024-05-13T04:29:18.233029 #1066487] ERROR -- : from /usr/lib/ruby/3.0.0/open-uri.rb:741:in `buffer_open' E, [2024-05-13T04:29:18.233033 #1066487] ERROR -- : from /usr/lib/ruby/3.0.0/open-uri.rb:212:in `block in open_loop' E, [2024-05-13T04:29:18.233037 #1066487] ERROR -- : from /usr/lib/ruby/3.0.0/open-uri.rb:210:in `catch' E, [2024-05-13T04:29:18.233041 #1066487] ERROR -- : from /usr/lib/ruby/3.0.0/open-uri.rb:210:in `open_loop' E, [2024-05-13T04:29:18.233045 #1066487] ERROR -- : from /usr/lib/ruby/3.0.0/open-uri.rb:151:in `open_uri' E, [2024-05-13T04:29:18.233049 #1066487] ERROR -- : from /usr/lib/ruby/3.0.0/open-uri.rb:721:in `open' E, [2024-05-13T04:29:18.233053 #1066487] ERROR -- : from /usr/lib/ruby/3.0.0/open-uri.rb:729:in `read' E, [2024-05-13T04:29:18.233058 #1066487] ERROR -- : from /tmp/ruby/src/trunk/tool/downloader.rb:247:in `block in download' E, [2024-05-13T04:29:18.233062 #1066487] ERROR -- : from /tmp/ruby/src/trunk/tool/downloader.rb:378:in `with_retry' E, [2024-05-13T04:29:18.233066 #1066487] ERROR -- : from /tmp/ruby/src/trunk/tool/downloader.rb:246:in `download' E, [2024-05-13T04:29:18.233076 #1066487] ERROR -- : from /tmp/ruby/src/trunk/tool/downloader.rb:136:in `download' E, [2024-05-13T04:29:18.233080 #1066487] ERROR -- : from /tmp/ruby/src/trunk/tool/downloader.rb:482:in `block in
' E, [2024-05-13T04:29:18.233085 #1066487] ERROR -- : from /tmp/ruby/src/trunk/tool/downloader.rb:465:in `each' E, [2024-05-13T04:29:18.233089 #1066487] ERROR -- : from /tmp/ruby/src/trunk/tool/downloader.rb:465:in `
' E, [2024-05-13T04:29:18.235220 #1066487] ERROR -- : make: *** [uncommon.mk:1765: /tmp/ruby/src/trunk/enc/unicode/data/emoji/15.0/emoji-zwj-sequences.txt] Error 1 E, [2024-05-13T04:29:18.246426 #1066487] ERROR -- : /tmp/ruby/src/trunk/tool/downloader.rb:302:in `rescue in download': failed to download emoji/15.0/emoji-sequences.txt (RuntimeError) E, [2024-05-13T04:29:18.246510 #1066487] ERROR -- : EOFError: end of file reached: https://www.unicode.org/Public/emoji/15.0/emoji-sequences.txt E, [2024-05-13T04:29:18.246529 #1066487] ERROR -- : from /tmp/ruby/src/trunk/tool/downloader.rb:201:in `download' E, [2024-05-13T04:29:18.246542 #1066487] ERROR -- : from /tmp/ruby/src/trunk/tool/downloader.rb:136:in `download' E, [2024-05-13T04:29:18.246554 #1066487] ERROR -- : from /tmp/ruby/src/trunk/tool/downloader.rb:482:in `block in
' E, [2024-05-13T04:29:18.246770 #1066487] ERROR -- : from /tmp/ruby/src/trunk/tool/downloader.rb:465:in `each' E, [2024-05-13T04:29:18.246783 #1066487] ERROR -- : from /tmp/ruby/src/trunk/tool/downloader.rb:465:in `
' E, [2024-05-13T04:29:18.246795 #1066487] ERROR -- : /usr/lib/ruby/3.0.0/net/protocol.rb:227:in `rbuf_fill': end of file reached (EOFError) E, [2024-05-13T04:29:18.246818 #1066487] ERROR -- : from /usr/lib/ruby/3.0.0/net/protocol.rb:193:in `readuntil' E, [2024-05-13T04:29:18.246831 #1066487] ERROR -- : from /usr/lib/ruby/3.0.0/net/protocol.rb:203:in `readline' E, [2024-05-13T04:29:18.246843 #1066487] ERROR -- : from /usr/lib/ruby/3.0.0/net/http/response.rb:42:in `read_status_line' E, [2024-05-13T04:29:18.246854 #1066487] ERROR -- : from /usr/lib/ruby/3.0.0/net/http/response.rb:31:in `read_new' E, [2024-05-13T04:29:18.246881 #1066487] ERROR -- : from /usr/lib/ruby/3.0.0/net/http.rb:1557:in `block in transport_request' E, [2024-05-13T04:29:18.246893 #1066487] ERROR -- : from /usr/lib/ruby/3.0.0/net/http.rb:1548:in `catch' E, [2024-05-13T04:29:18.246905 #1066487] ERROR -- : from /usr/lib/ruby/3.0.0/net/http.rb:1548:in `transport_request' E, [2024-05-13T04:29:18.246917 #1066487] ERROR -- : from /usr/lib/ruby/3.0.0/net/http.rb:1521:in `request' E, [2024-05-13T04:29:18.246928 #1066487] ERROR -- : from /usr/lib/ruby/3.0.0/open-uri.rb:329:in `block in open_http' E, [2024-05-13T04:29:18.246940 #1066487] ERROR -- : from /usr/lib/ruby/3.0.0/net/http.rb:960:in `start' E, [2024-05-13T04:29:18.246951 #1066487] ERROR -- : from /usr/lib/ruby/3.0.0/open-uri.rb:323:in `open_http' E, [2024-05-13T04:29:18.246963 #1066487] ERROR -- : from /usr/lib/ruby/3.0.0/open-uri.rb:741:in `buffer_open' E, [2024-05-13T04:29:18.246975 #1066487] ERROR -- : from /usr/lib/ruby/3.0.0/open-uri.rb:212:in `block in open_loop' E, [2024-05-13T04:29:18.246990 #1066487] ERROR -- : from /usr/lib/ruby/3.0.0/open-uri.rb:210:in `catch' E, [2024-05-13T04:29:18.247001 #1066487] ERROR -- : from /usr/lib/ruby/3.0.0/open-uri.rb:210:in `open_loop' E, [2024-05-13T04:29:18.247013 #1066487] ERROR -- : from /usr/lib/ruby/3.0.0/open-uri.rb:151:in `open_uri' E, [2024-05-13T04:29:18.247025 #1066487] ERROR -- : from /usr/lib/ruby/3.0.0/open-uri.rb:721:in `open' E, [2024-05-13T04:29:18.247037 #1066487] ERROR -- : from /usr/lib/ruby/3.0.0/open-uri.rb:729:in `read' E, [2024-05-13T04:29:18.247048 #1066487] ERROR -- : from /tmp/ruby/src/trunk/tool/downloader.rb:247:in `block in download' E, [2024-05-13T04:29:18.247060 #1066487] ERROR -- : from /tmp/ruby/src/trunk/tool/downloader.rb:378:in `with_retry' E, [2024-05-13T04:29:18.247072 #1066487] ERROR -- : from /tmp/ruby/src/trunk/tool/downloader.rb:246:in `download' E, [2024-05-13T04:29:18.247101 #1066487] ERROR -- : from /tmp/ruby/src/trunk/tool/downloader.rb:136:in `download' E, [2024-05-13T04:29:18.247113 #1066487] ERROR -- : from /tmp/ruby/src/trunk/tool/downloader.rb:482:in `block in
' E, [2024-05-13T04:29:18.247125 #1066487] ERROR -- : from /tmp/ruby/src/trunk/tool/downloader.rb:465:in `each' E, [2024-05-13T04:29:18.247137 #1066487] ERROR -- : from /tmp/ruby/src/trunk/tool/downloader.rb:465:in `
' E, [2024-05-13T04:29:18.251023 #1066487] ERROR -- : make: *** [uncommon.mk:1765: /tmp/ruby/src/trunk/enc/unicode/data/emoji/15.0/emoji-sequences.txt] Error 1 E, [2024-05-13T04:29:18.251091 #1066487] ERROR -- : make: *** Deleting file '/tmp/ruby/src/trunk/enc/unicode/data/emoji/15.0/emoji-sequences.txt' I, [2024-05-13T04:29:18.251168 #1066487] INFO -- : downloading emoji/15.0/emoji-sequences.txt ... downloading emoji/15.0/emoji-sequences.txt ... downloading emoji/15.0/emoji-test.txt ... I, [2024-05-13T04:29:18.251708 #1066487] INFO -- : $$$[end] "make update-unicode -j20" exit with 512. I, [2024-05-13T04:29:18.251806 #1066487] INFO -- : $$$[beg] make update-download -j20 I, [2024-05-13T04:29:18.357110 #1066487] INFO -- : tool/config.guess already exists I, [2024-05-13T04:29:18.357155 #1066487] INFO -- : tool/config.sub already exists I, [2024-05-13T04:29:18.359304 #1066487] INFO -- : Update minitest to ea9caafc0754b1d6236a490d59e624b53209734a I, [2024-05-13T04:29:18.359399 #1066487] INFO -- : Update power_assert to 84e85124c5014a139af39161d484156cfe87a9ed I, [2024-05-13T04:29:18.359713 #1066487] INFO -- : Update rbs to ba7872795d5de04adb8ff500c0e6afdc81a041dd I, [2024-05-13T04:29:18.359746 #1066487] INFO -- : Update typeprof to b19a6416da3a05d57fadd6ffdadb382b6d236ca5 I, [2024-05-13T04:29:18.360667 #1066487] INFO -- : echo ea9caafc0754b1d6236a490d59e624b53209734a | /bin/sh /tmp/ruby/src/trunk/tool/ifchange /tmp/ruby/src/trunk/.bundle/.timestamp/minitest.revision - I, [2024-05-13T04:29:18.360888 #1066487] INFO -- : echo 84e85124c5014a139af39161d484156cfe87a9ed | /bin/sh /tmp/ruby/src/trunk/tool/ifchange /tmp/ruby/src/trunk/.bundle/.timestamp/power_assert.revision - I, [2024-05-13T04:29:18.361038 #1066487] INFO -- : echo ba7872795d5de04adb8ff500c0e6afdc81a041dd | /bin/sh /tmp/ruby/src/trunk/tool/ifchange /tmp/ruby/src/trunk/.bundle/.timestamp/rbs.revision - I, [2024-05-13T04:29:18.361357 #1066487] INFO -- : echo b19a6416da3a05d57fadd6ffdadb382b6d236ca5 | /bin/sh /tmp/ruby/src/trunk/tool/ifchange /tmp/ruby/src/trunk/.bundle/.timestamp/typeprof.revision - I, [2024-05-13T04:29:18.362767 #1066487] INFO -- : /tmp/ruby/src/trunk/.bundle/.timestamp/minitest.revision unchanged I, [2024-05-13T04:29:18.362804 #1066487] INFO -- : /tmp/ruby/src/trunk/.bundle/.timestamp/power_assert.revision unchanged I, [2024-05-13T04:29:18.363061 #1066487] INFO -- : /tmp/ruby/src/trunk/.bundle/.timestamp/typeprof.revision unchanged I, [2024-05-13T04:29:18.363099 #1066487] INFO -- : /tmp/ruby/src/trunk/.bundle/.timestamp/rbs.revision unchanged I, [2024-05-13T04:29:18.363790 #1066487] INFO -- : Building power_assert@84e85124c5014a139af39161d484156cfe87a9ed to /tmp/ruby/src/trunk/gems/power_assert-2.0.3.gem I, [2024-05-13T04:29:18.433241 #1066487] INFO -- : Successfully built RubyGem I, [2024-05-13T04:29:18.433297 #1066487] INFO -- : Name: power_assert I, [2024-05-13T04:29:18.433317 #1066487] INFO -- : Version: 2.0.4dev I, [2024-05-13T04:29:18.433328 #1066487] INFO -- : File: power_assert-2.0.4dev.gem I, [2024-05-13T04:29:18.478288 #1066487] INFO -- : $$$[end] "make update-download -j20" exit with 0. I, [2024-05-13T04:29:18.478328 #1066487] INFO -- : $$$[beg] make update-rubyspec -j20 I, [2024-05-13T04:29:18.545136 #1066487] INFO -- : make: Nothing to be done for 'update-rubyspec'. I, [2024-05-13T04:29:18.545702 #1066487] INFO -- : $$$[end] "make update-rubyspec -j20" exit with 0. I, [2024-05-13T04:29:18.545746 #1066487] INFO -- : $$$[beg] make update-src -j20 I, [2024-05-13T04:29:19.101105 #1066487] INFO -- : Already up to date. I, [2024-05-13T04:29:19.116901 #1066487] INFO -- : Latest commit hash = 3c16d93cd3 I, [2024-05-13T04:29:19.118678 #1066487] INFO -- : $$$[end] "make update-src -j20" exit with 0. I, [2024-05-13T04:29:19.118762 #1066487] INFO -- : $$$[beg] make after-update -j20 I, [2024-05-13T04:29:19.199647 #1066487] INFO -- : generating /tmp/ruby/src/trunk/ext/ripper/eventids2table.c I, [2024-05-13T04:29:19.203835 #1066487] INFO -- : make[1]: Entering directory '/tmp/ruby/src/trunk/ext/ripper' I, [2024-05-13T04:29:19.203858 #1066487] INFO -- : make[1]: Nothing to be done for 'src'. I, [2024-05-13T04:29:19.203864 #1066487] INFO -- : make[1]: Leaving directory '/tmp/ruby/src/trunk/ext/ripper' I, [2024-05-13T04:29:19.220853 #1066487] INFO -- : /tmp/ruby/src/trunk/revision.h updated I, [2024-05-13T04:29:19.222179 #1066487] INFO -- : generating x86_64-linux-fake.rb I, [2024-05-13T04:29:19.272813 #1066487] INFO -- : x86_64-linux-fake.rb updated I, [2024-05-13T04:29:19.274369 #1066487] INFO -- : generating enc.mk I, [2024-05-13T04:29:19.391064 #1066487] INFO -- : making srcs under enc I, [2024-05-13T04:29:19.421294 #1066487] INFO -- : make[1]: Entering directory '/tmp/ruby/build/trunk' I, [2024-05-13T04:29:19.421319 #1066487] INFO -- : make[1]: Nothing to be done for 'srcs'. I, [2024-05-13T04:29:19.421325 #1066487] INFO -- : make[1]: Leaving directory '/tmp/ruby/build/trunk' I, [2024-05-13T04:29:19.465912 #1066487] INFO -- : Update minitest to ea9caafc0754b1d6236a490d59e624b53209734a I, [2024-05-13T04:29:19.466108 #1066487] INFO -- : Update power_assert to 84e85124c5014a139af39161d484156cfe87a9ed I, [2024-05-13T04:29:19.466714 #1066487] INFO -- : Update rbs to ba7872795d5de04adb8ff500c0e6afdc81a041dd I, [2024-05-13T04:29:19.466963 #1066487] INFO -- : Update typeprof to b19a6416da3a05d57fadd6ffdadb382b6d236ca5 I, [2024-05-13T04:29:19.467832 #1066487] INFO -- : echo ea9caafc0754b1d6236a490d59e624b53209734a | /bin/sh /tmp/ruby/src/trunk/tool/ifchange /tmp/ruby/src/trunk/.bundle/.timestamp/minitest.revision - I, [2024-05-13T04:29:19.467986 #1066487] INFO -- : echo 84e85124c5014a139af39161d484156cfe87a9ed | /bin/sh /tmp/ruby/src/trunk/tool/ifchange /tmp/ruby/src/trunk/.bundle/.timestamp/power_assert.revision - I, [2024-05-13T04:29:19.469237 #1066487] INFO -- : echo ba7872795d5de04adb8ff500c0e6afdc81a041dd | /bin/sh /tmp/ruby/src/trunk/tool/ifchange /tmp/ruby/src/trunk/.bundle/.timestamp/rbs.revision - I, [2024-05-13T04:29:19.469406 #1066487] INFO -- : echo b19a6416da3a05d57fadd6ffdadb382b6d236ca5 | /bin/sh /tmp/ruby/src/trunk/tool/ifchange /tmp/ruby/src/trunk/.bundle/.timestamp/typeprof.revision - I, [2024-05-13T04:29:19.469816 #1066487] INFO -- : /tmp/ruby/src/trunk/.bundle/.timestamp/minitest.revision unchanged I, [2024-05-13T04:29:19.469831 #1066487] INFO -- : /tmp/ruby/src/trunk/.bundle/.timestamp/power_assert.revision unchanged I, [2024-05-13T04:29:19.470888 #1066487] INFO -- : /tmp/ruby/src/trunk/.bundle/.timestamp/rbs.revision unchanged I, [2024-05-13T04:29:19.471036 #1066487] INFO -- : Building power_assert@84e85124c5014a139af39161d484156cfe87a9ed to /tmp/ruby/src/trunk/gems/power_assert-2.0.3.gem I, [2024-05-13T04:29:19.471067 #1066487] INFO -- : /tmp/ruby/src/trunk/.bundle/.timestamp/typeprof.revision unchanged I, [2024-05-13T04:29:19.540472 #1066487] INFO -- : Successfully built RubyGem I, [2024-05-13T04:29:19.540511 #1066487] INFO -- : Name: power_assert I, [2024-05-13T04:29:19.540518 #1066487] INFO -- : Version: 2.0.4dev I, [2024-05-13T04:29:19.540522 #1066487] INFO -- : File: power_assert-2.0.4dev.gem I, [2024-05-13T04:29:19.542742 #1066487] INFO -- : Extracting bundle gem power_assert-2.0.3... I, [2024-05-13T04:29:19.604948 #1066487] INFO -- : Try with hash version of bundled gems instead of gems/power_assert-2.0.3.gem. We don't use this gem with release version of Ruby. I, [2024-05-13T04:29:19.609910 #1066487] INFO -- : Unpacked gems/power_assert-2.0.4dev.gem I, [2024-05-13T04:29:19.611956 #1066487] INFO -- : $$$[end] "make after-update -j20" exit with 0. I, [2024-05-13T04:29:19.612074 #1066487] INFO -- : $$$[beg] make miniruby -j20 I, [2024-05-13T04:29:19.676019 #1066487] INFO -- : BASERUBY = /usr/bin/ruby --disable=gems I, [2024-05-13T04:29:19.676066 #1066487] INFO -- : CC = gcc I, [2024-05-13T04:29:19.676079 #1066487] INFO -- : LD = ld I, [2024-05-13T04:29:19.676090 #1066487] INFO -- : LDSHARED = gcc -shared I, [2024-05-13T04:29:19.676101 #1066487] INFO -- : CFLAGS = -O3 -fno-fast-math -ggdb3 -Wall -Wextra -Wdeprecated-declarations -Wdiv-by-zero -Wduplicated-cond -Wimplicit-function-declaration -Wimplicit-int -Wpointer-arith -Wwrite-strings -Wold-style-definition -Wimplicit-fallthrough=0 -Wmissing-noreturn -Wno-cast-function-type -Wno-constant-logical-operand -Wno-long-long -Wno-missing-field-initializers -Wno-overlength-strings -Wno-packed-bitfield-compat -Wno-parentheses-equality -Wno-self-assign -Wno-tautological-compare -Wno-unused-parameter -Wno-unused-value -Wsuggest-attribute=format -Wsuggest-attribute=noreturn -Wunused-variable -Wmisleading-indentation -Wundef -fPIC I, [2024-05-13T04:29:19.676112 #1066487] INFO -- : XCFLAGS = -U_FORTIFY_SOURCE -D_FORTIFY_SOURCE=2 -fstack-protector-strong -fno-strict-overflow -fvisibility=hidden -fexcess-precision=standard -DRUBY_EXPORT -I. -I.ext/include/x86_64-linux -I/tmp/ruby/src/trunk/include -I/tmp/ruby/src/trunk -I/tmp/ruby/src/trunk/prism -I/tmp/ruby/src/trunk/enc/unicode/15.0.0 I, [2024-05-13T04:29:19.676123 #1066487] INFO -- : CPPFLAGS = I, [2024-05-13T04:29:19.676133 #1066487] INFO -- : DLDFLAGS = -Wl,--compress-debug-sections=zlib -Wl,-soname,libruby.so.3.4 -fstack-protector-strong I, [2024-05-13T04:29:19.676144 #1066487] INFO -- : SOLIBS = -lz -lrt -lrt -lgmp -ldl -lcrypt -lm -lpthread I, [2024-05-13T04:29:19.676154 #1066487] INFO -- : LANG = en_US.UTF-8 I, [2024-05-13T04:29:19.676164 #1066487] INFO -- : LC_ALL = I, [2024-05-13T04:29:19.676175 #1066487] INFO -- : LC_CTYPE = I, [2024-05-13T04:29:19.676185 #1066487] INFO -- : MFLAGS = -j20 --jobserver-auth=4,5 I, [2024-05-13T04:29:19.676195 #1066487] INFO -- : RUSTC = no I, [2024-05-13T04:29:19.676206 #1066487] INFO -- : YJIT_RUSTC_ARGS = --crate-name=yjit --crate-type=staticlib --edition=2021 -g -C lto=thin -C opt-level=3 -C overflow-checks=on '--out-dir=/tmp/ruby/build/trunk/yjit/target/release/' /tmp/ruby/src/trunk/yjit/src/lib.rs I, [2024-05-13T04:29:19.677412 #1066487] INFO -- : gcc (Ubuntu 11.4.0-1ubuntu1~22.04) 11.4.0 I, [2024-05-13T04:29:19.677456 #1066487] INFO -- : Copyright (C) 2021 Free Software Foundation, Inc. I, [2024-05-13T04:29:19.677470 #1066487] INFO -- : This is free software; see the source for copying conditions. There is NO I, [2024-05-13T04:29:19.677481 #1066487] INFO -- : warranty; not even for MERCHANTABILITY or FITNESS FOR A PARTICULAR PURPOSE. I, [2024-05-13T04:29:19.677493 #1066487] INFO -- : I, [2024-05-13T04:29:19.701172 #1066487] INFO -- : compiling /tmp/ruby/src/trunk/version.c I, [2024-05-13T04:29:19.803648 #1066487] INFO -- : linking miniruby I, [2024-05-13T04:29:20.326398 #1066487] INFO -- : $$$[end] "make miniruby -j20" exit with 0. I, [2024-05-13T04:29:20.326523 #1066487] INFO -- : $$$[beg] make ruby -j20 I, [2024-05-13T04:29:20.384323 #1066487] INFO -- : BASERUBY = /usr/bin/ruby --disable=gems I, [2024-05-13T04:29:20.384351 #1066487] INFO -- : CC = gcc I, [2024-05-13T04:29:20.384356 #1066487] INFO -- : LD = ld I, [2024-05-13T04:29:20.384360 #1066487] INFO -- : LDSHARED = gcc -shared I, [2024-05-13T04:29:20.384368 #1066487] INFO -- : CFLAGS = -O3 -fno-fast-math -ggdb3 -Wall -Wextra -Wdeprecated-declarations -Wdiv-by-zero -Wduplicated-cond -Wimplicit-function-declaration -Wimplicit-int -Wpointer-arith -Wwrite-strings -Wold-style-definition -Wimplicit-fallthrough=0 -Wmissing-noreturn -Wno-cast-function-type -Wno-constant-logical-operand -Wno-long-long -Wno-missing-field-initializers -Wno-overlength-strings -Wno-packed-bitfield-compat -Wno-parentheses-equality -Wno-self-assign -Wno-tautological-compare -Wno-unused-parameter -Wno-unused-value -Wsuggest-attribute=format -Wsuggest-attribute=noreturn -Wunused-variable -Wmisleading-indentation -Wundef -fPIC I, [2024-05-13T04:29:20.384377 #1066487] INFO -- : XCFLAGS = -U_FORTIFY_SOURCE -D_FORTIFY_SOURCE=2 -fstack-protector-strong -fno-strict-overflow -fvisibility=hidden -fexcess-precision=standard -DRUBY_EXPORT -I. -I.ext/include/x86_64-linux -I/tmp/ruby/src/trunk/include -I/tmp/ruby/src/trunk -I/tmp/ruby/src/trunk/prism -I/tmp/ruby/src/trunk/enc/unicode/15.0.0 I, [2024-05-13T04:29:20.384381 #1066487] INFO -- : CPPFLAGS = I, [2024-05-13T04:29:20.384385 #1066487] INFO -- : DLDFLAGS = -Wl,--compress-debug-sections=zlib -Wl,-soname,libruby.so.3.4 -fstack-protector-strong I, [2024-05-13T04:29:20.384389 #1066487] INFO -- : SOLIBS = -lz -lrt -lrt -lgmp -ldl -lcrypt -lm -lpthread I, [2024-05-13T04:29:20.384392 #1066487] INFO -- : LANG = en_US.UTF-8 I, [2024-05-13T04:29:20.384396 #1066487] INFO -- : LC_ALL = I, [2024-05-13T04:29:20.384399 #1066487] INFO -- : LC_CTYPE = I, [2024-05-13T04:29:20.384402 #1066487] INFO -- : MFLAGS = -j20 --jobserver-auth=4,5 I, [2024-05-13T04:29:20.384406 #1066487] INFO -- : RUSTC = no I, [2024-05-13T04:29:20.384410 #1066487] INFO -- : YJIT_RUSTC_ARGS = --crate-name=yjit --crate-type=staticlib --edition=2021 -g -C lto=thin -C opt-level=3 -C overflow-checks=on '--out-dir=/tmp/ruby/build/trunk/yjit/target/release/' /tmp/ruby/src/trunk/yjit/src/lib.rs I, [2024-05-13T04:29:20.385784 #1066487] INFO -- : gcc (Ubuntu 11.4.0-1ubuntu1~22.04) 11.4.0 I, [2024-05-13T04:29:20.385804 #1066487] INFO -- : Copyright (C) 2021 Free Software Foundation, Inc. I, [2024-05-13T04:29:20.385813 #1066487] INFO -- : This is free software; see the source for copying conditions. There is NO I, [2024-05-13T04:29:20.385817 #1066487] INFO -- : warranty; not even for MERCHANTABILITY or FITNESS FOR A PARTICULAR PURPOSE. I, [2024-05-13T04:29:20.385821 #1066487] INFO -- : I, [2024-05-13T04:29:20.492449 #1066487] INFO -- : builtin_binary.inc updated I, [2024-05-13T04:29:20.496943 #1066487] INFO -- : c5234a9416e4f20f175185e840b25b0f08674d14078ed7083f37e655458e3ca9 builtin_binary.inc I, [2024-05-13T04:29:20.497672 #1066487] INFO -- : compiling /tmp/ruby/src/trunk/builtin.c I, [2024-05-13T04:29:20.679694 #1066487] INFO -- : linking static-library libruby-static.a I, [2024-05-13T04:29:20.987333 #1066487] INFO -- : linking shared-library libruby.so.3.4.0 I, [2024-05-13T04:29:22.541623 #1066487] INFO -- : linking ruby I, [2024-05-13T04:29:22.563985 #1066487] INFO -- : $$$[end] "make ruby -j20" exit with 0. I, [2024-05-13T04:29:22.564114 #1066487] INFO -- : $$$[beg] make all -j20 I, [2024-05-13T04:29:22.621511 #1066487] INFO -- : BASERUBY = /usr/bin/ruby --disable=gems I, [2024-05-13T04:29:22.621543 #1066487] INFO -- : CC = gcc I, [2024-05-13T04:29:22.621548 #1066487] INFO -- : LD = ld I, [2024-05-13T04:29:22.621552 #1066487] INFO -- : LDSHARED = gcc -shared I, [2024-05-13T04:29:22.621556 #1066487] INFO -- : CFLAGS = -O3 -fno-fast-math -ggdb3 -Wall -Wextra -Wdeprecated-declarations -Wdiv-by-zero -Wduplicated-cond -Wimplicit-function-declaration -Wimplicit-int -Wpointer-arith -Wwrite-strings -Wold-style-definition -Wimplicit-fallthrough=0 -Wmissing-noreturn -Wno-cast-function-type -Wno-constant-logical-operand -Wno-long-long -Wno-missing-field-initializers -Wno-overlength-strings -Wno-packed-bitfield-compat -Wno-parentheses-equality -Wno-self-assign -Wno-tautological-compare -Wno-unused-parameter -Wno-unused-value -Wsuggest-attribute=format -Wsuggest-attribute=noreturn -Wunused-variable -Wmisleading-indentation -Wundef -fPIC I, [2024-05-13T04:29:22.621561 #1066487] INFO -- : XCFLAGS = -U_FORTIFY_SOURCE -D_FORTIFY_SOURCE=2 -fstack-protector-strong -fno-strict-overflow -fvisibility=hidden -fexcess-precision=standard -DRUBY_EXPORT -I. -I.ext/include/x86_64-linux -I/tmp/ruby/src/trunk/include -I/tmp/ruby/src/trunk -I/tmp/ruby/src/trunk/prism -I/tmp/ruby/src/trunk/enc/unicode/15.0.0 I, [2024-05-13T04:29:22.621565 #1066487] INFO -- : CPPFLAGS = I, [2024-05-13T04:29:22.621569 #1066487] INFO -- : DLDFLAGS = -Wl,--compress-debug-sections=zlib -Wl,-soname,libruby.so.3.4 -fstack-protector-strong I, [2024-05-13T04:29:22.621578 #1066487] INFO -- : SOLIBS = -lz -lrt -lrt -lgmp -ldl -lcrypt -lm -lpthread I, [2024-05-13T04:29:22.621582 #1066487] INFO -- : LANG = en_US.UTF-8 I, [2024-05-13T04:29:22.621585 #1066487] INFO -- : LC_ALL = I, [2024-05-13T04:29:22.621589 #1066487] INFO -- : LC_CTYPE = I, [2024-05-13T04:29:22.621593 #1066487] INFO -- : MFLAGS = -j20 --jobserver-auth=4,5 I, [2024-05-13T04:29:22.621596 #1066487] INFO -- : RUSTC = no I, [2024-05-13T04:29:22.621601 #1066487] INFO -- : YJIT_RUSTC_ARGS = --crate-name=yjit --crate-type=staticlib --edition=2021 -g -C lto=thin -C opt-level=3 -C overflow-checks=on '--out-dir=/tmp/ruby/build/trunk/yjit/target/release/' /tmp/ruby/src/trunk/yjit/src/lib.rs I, [2024-05-13T04:29:22.622975 #1066487] INFO -- : gcc (Ubuntu 11.4.0-1ubuntu1~22.04) 11.4.0 I, [2024-05-13T04:29:22.622996 #1066487] INFO -- : Copyright (C) 2021 Free Software Foundation, Inc. I, [2024-05-13T04:29:22.623002 #1066487] INFO -- : This is free software; see the source for copying conditions. There is NO I, [2024-05-13T04:29:22.623006 #1066487] INFO -- : warranty; not even for MERCHANTABILITY or FITNESS FOR A PARTICULAR PURPOSE. I, [2024-05-13T04:29:22.623009 #1066487] INFO -- : I, [2024-05-13T04:29:22.651649 #1066487] INFO -- : generating enc.mk I, [2024-05-13T04:29:22.653495 #1066487] INFO -- : building spec/ruby/optional/capi/ext/array_spec.so I, [2024-05-13T04:29:22.653865 #1066487] INFO -- : building spec/ruby/optional/capi/ext/basic_object_spec.so I, [2024-05-13T04:29:22.654437 #1066487] INFO -- : building spec/ruby/optional/capi/ext/bignum_spec.so I, [2024-05-13T04:29:22.655092 #1066487] INFO -- : building spec/ruby/optional/capi/ext/binding_spec.so I, [2024-05-13T04:29:22.655204 #1066487] INFO -- : building spec/ruby/optional/capi/ext/boolean_spec.so I, [2024-05-13T04:29:22.655847 #1066487] INFO -- : building spec/ruby/optional/capi/ext/class_id_under_autoload_spec.so I, [2024-05-13T04:29:22.656559 #1066487] INFO -- : building spec/ruby/optional/capi/ext/class_spec.so I, [2024-05-13T04:29:22.657040 #1066487] INFO -- : building spec/ruby/optional/capi/ext/class_under_autoload_spec.so I, [2024-05-13T04:29:22.657467 #1066487] INFO -- : building spec/ruby/optional/capi/ext/complex_spec.so I, [2024-05-13T04:29:22.657869 #1066487] INFO -- : building spec/ruby/optional/capi/ext/constants_spec.so I, [2024-05-13T04:29:22.658705 #1066487] INFO -- : building spec/ruby/optional/capi/ext/data_spec.so I, [2024-05-13T04:29:22.659549 #1066487] INFO -- : building spec/ruby/optional/capi/ext/debug_spec.so I, [2024-05-13T04:29:22.659899 #1066487] INFO -- : building spec/ruby/optional/capi/ext/encoding_spec.so I, [2024-05-13T04:29:22.660560 #1066487] INFO -- : building spec/ruby/optional/capi/ext/enumerator_spec.so I, [2024-05-13T04:29:22.660881 #1066487] INFO -- : building spec/ruby/optional/capi/ext/exception_spec.so I, [2024-05-13T04:29:22.661627 #1066487] INFO -- : building spec/ruby/optional/capi/ext/fiber_spec.so I, [2024-05-13T04:29:22.661935 #1066487] INFO -- : building spec/ruby/optional/capi/ext/file_spec.so I, [2024-05-13T04:29:22.662579 #1066487] INFO -- : building spec/ruby/optional/capi/ext/fixnum_spec.so I, [2024-05-13T04:29:22.664024 #1066487] INFO -- : building spec/ruby/optional/capi/ext/float_spec.so I, [2024-05-13T04:29:22.785609 #1066487] INFO -- : building spec/ruby/optional/capi/ext/gc_spec.so I, [2024-05-13T04:29:22.787700 #1066487] INFO -- : building spec/ruby/optional/capi/ext/globals_spec.so I, [2024-05-13T04:29:22.798916 #1066487] INFO -- : building spec/ruby/optional/capi/ext/hash_spec.so I, [2024-05-13T04:29:22.799484 #1066487] INFO -- : building spec/ruby/optional/capi/ext/integer_spec.so I, [2024-05-13T04:29:22.804399 #1066487] INFO -- : building spec/ruby/optional/capi/ext/io_spec.so I, [2024-05-13T04:29:22.808726 #1066487] INFO -- : building spec/ruby/optional/capi/ext/kernel_spec.so I, [2024-05-13T04:29:22.811162 #1066487] INFO -- : building spec/ruby/optional/capi/ext/language_spec.so I, [2024-05-13T04:29:22.818314 #1066487] INFO -- : building spec/ruby/optional/capi/ext/marshal_spec.so I, [2024-05-13T04:29:22.820675 #1066487] INFO -- : building spec/ruby/optional/capi/ext/module_spec.so I, [2024-05-13T04:29:22.837004 #1066487] INFO -- : building spec/ruby/optional/capi/ext/module_under_autoload_spec.so I, [2024-05-13T04:29:22.839394 #1066487] INFO -- : building spec/ruby/optional/capi/ext/mutex_spec.so I, [2024-05-13T04:29:22.847779 #1066487] INFO -- : building spec/ruby/optional/capi/ext/numeric_spec.so I, [2024-05-13T04:29:22.848074 #1066487] INFO -- : building spec/ruby/optional/capi/ext/object_spec.so I, [2024-05-13T04:29:22.853765 #1066487] INFO -- : building spec/ruby/optional/capi/ext/proc_spec.so I, [2024-05-13T04:29:22.854278 #1066487] INFO -- : building spec/ruby/optional/capi/ext/range_spec.so I, [2024-05-13T04:29:22.864272 #1066487] INFO -- : building spec/ruby/optional/capi/ext/rational_spec.so I, [2024-05-13T04:29:22.873000 #1066487] INFO -- : building spec/ruby/optional/capi/ext/rbasic_spec.so I, [2024-05-13T04:29:22.928626 #1066487] INFO -- : building spec/ruby/optional/capi/ext/regexp_spec.so I, [2024-05-13T04:29:22.954507 #1066487] INFO -- : building spec/ruby/optional/capi/ext/string_spec.so I, [2024-05-13T04:29:22.964491 #1066487] INFO -- : building spec/ruby/optional/capi/ext/struct_spec.so I, [2024-05-13T04:29:22.974420 #1066487] INFO -- : building spec/ruby/optional/capi/ext/st_spec.so I, [2024-05-13T04:29:22.974793 #1066487] INFO -- : building spec/ruby/optional/capi/ext/symbol_spec.so I, [2024-05-13T04:29:22.975265 #1066487] INFO -- : building spec/ruby/optional/capi/ext/thread_spec.so I, [2024-05-13T04:29:22.976197 #1066487] INFO -- : building spec/ruby/optional/capi/ext/time_spec.so I, [2024-05-13T04:29:22.977742 #1066487] INFO -- : building spec/ruby/optional/capi/ext/tracepoint_spec.so I, [2024-05-13T04:29:22.998291 #1066487] INFO -- : building spec/ruby/optional/capi/ext/typed_data_spec.so I, [2024-05-13T04:29:23.000711 #1066487] INFO -- : building spec/ruby/optional/capi/ext/util_spec.so I, [2024-05-13T04:29:23.003729 #1066487] INFO -- : making enc I, [2024-05-13T04:29:23.007913 #1066487] INFO -- : making srcs under enc I, [2024-05-13T04:29:23.029721 #1066487] INFO -- : make[1]: Entering directory '/tmp/ruby/build/trunk' I, [2024-05-13T04:29:23.029783 #1066487] INFO -- : make[1]: Nothing to be done for 'enc'. I, [2024-05-13T04:29:23.029797 #1066487] INFO -- : make[1]: Leaving directory '/tmp/ruby/build/trunk' I, [2024-05-13T04:29:23.053453 #1066487] INFO -- : make[1]: Entering directory '/tmp/ruby/build/trunk' I, [2024-05-13T04:29:23.053519 #1066487] INFO -- : make[1]: Nothing to be done for 'srcs'. I, [2024-05-13T04:29:23.053543 #1066487] INFO -- : make[1]: Leaving directory '/tmp/ruby/build/trunk' I, [2024-05-13T04:29:23.054143 #1066487] INFO -- : generating transdb.h I, [2024-05-13T04:29:23.152909 #1066487] INFO -- : transdb.h unchanged I, [2024-05-13T04:29:23.153971 #1066487] INFO -- : generating makefiles ext/configure-ext.mk I, [2024-05-13T04:29:23.154177 #1066487] INFO -- : making trans I, [2024-05-13T04:29:23.180394 #1066487] INFO -- : ext/configure-ext.mk updated I, [2024-05-13T04:29:23.182446 #1066487] INFO -- : make[1]: Entering directory '/tmp/ruby/build/trunk' I, [2024-05-13T04:29:23.187857 #1066487] INFO -- : make[1]: Entering directory '/tmp/ruby/build/trunk' I, [2024-05-13T04:29:23.187946 #1066487] INFO -- : make[1]: Nothing to be done for 'trans'. I, [2024-05-13T04:29:23.187961 #1066487] INFO -- : make[1]: Leaving directory '/tmp/ruby/build/trunk' I, [2024-05-13T04:29:23.188660 #1066487] INFO -- : making encs I, [2024-05-13T04:29:23.246503 #1066487] INFO -- : make[1]: Entering directory '/tmp/ruby/build/trunk' I, [2024-05-13T04:29:23.246576 #1066487] INFO -- : make[1]: Nothing to be done for 'encs'. I, [2024-05-13T04:29:23.246601 #1066487] INFO -- : make[1]: Leaving directory '/tmp/ruby/build/trunk' I, [2024-05-13T04:29:23.341235 #1066487] INFO -- : make[1]: Leaving directory '/tmp/ruby/build/trunk' I, [2024-05-13T04:29:23.341861 #1066487] INFO -- : generating makefile exts.mk I, [2024-05-13T04:29:23.379636 #1066487] INFO -- : exts.mk unchanged I, [2024-05-13T04:29:23.384392 #1066487] INFO -- : make[1]: Entering directory '/tmp/ruby/build/trunk' I, [2024-05-13T04:29:23.402882 #1066487] INFO -- : make[2]: Entering directory '/tmp/ruby/build/trunk/ext/digest' I, [2024-05-13T04:29:23.404121 #1066487] INFO -- : make[2]: Entering directory '/tmp/ruby/build/trunk/ext/json' I, [2024-05-13T04:29:23.404342 #1066487] INFO -- : make[2]: Entering directory '/tmp/ruby/build/trunk/ext/coverage' I, [2024-05-13T04:29:23.405225 #1066487] INFO -- : make[2]: Entering directory '/tmp/ruby/build/trunk/ext/date' I, [2024-05-13T04:29:23.405814 #1066487] INFO -- : make[2]: Entering directory '/tmp/ruby/build/trunk/ext/io/console' I, [2024-05-13T04:29:23.406333 #1066487] INFO -- : make[2]: Entering directory '/tmp/ruby/build/trunk/ext/monitor' I, [2024-05-13T04:29:23.406471 #1066487] INFO -- : make[2]: Entering directory '/tmp/ruby/build/trunk/ext/rubyvm' I, [2024-05-13T04:29:23.407029 #1066487] INFO -- : make[2]: Entering directory '/tmp/ruby/build/trunk/ext/pathname' I, [2024-05-13T04:29:23.407293 #1066487] INFO -- : make[2]: Entering directory '/tmp/ruby/build/trunk/ext/fiddle' I, [2024-05-13T04:29:23.407823 #1066487] INFO -- : make[2]: Leaving directory '/tmp/ruby/build/trunk/ext/digest' I, [2024-05-13T04:29:23.407888 #1066487] INFO -- : make[2]: Entering directory '/tmp/ruby/build/trunk/ext/pty' I, [2024-05-13T04:29:23.408142 #1066487] INFO -- : make[2]: Leaving directory '/tmp/ruby/build/trunk/ext/coverage' I, [2024-05-13T04:29:23.408697 #1066487] INFO -- : make[2]: Entering directory '/tmp/ruby/build/trunk/ext/objspace' I, [2024-05-13T04:29:23.409002 #1066487] INFO -- : make[2]: Leaving directory '/tmp/ruby/build/trunk/ext/rubyvm' I, [2024-05-13T04:29:23.409202 #1066487] INFO -- : make[2]: Leaving directory '/tmp/ruby/build/trunk/ext/io/console' I, [2024-05-13T04:29:23.409495 #1066487] INFO -- : make[2]: Leaving directory '/tmp/ruby/build/trunk/ext/date' I, [2024-05-13T04:29:23.409519 #1066487] INFO -- : make[2]: Entering directory '/tmp/ruby/build/trunk/ext/psych' I, [2024-05-13T04:29:23.409627 #1066487] INFO -- : make[2]: Leaving directory '/tmp/ruby/build/trunk/ext/monitor' I, [2024-05-13T04:29:23.410022 #1066487] INFO -- : make[2]: Leaving directory '/tmp/ruby/build/trunk/ext/pathname' I, [2024-05-13T04:29:23.410673 #1066487] INFO -- : make[2]: Entering directory '/tmp/ruby/build/trunk/.bundle/gems/nkf-0.2.0/ext/nkf' I, [2024-05-13T04:29:23.410702 #1066487] INFO -- : make[2]: Entering directory '/tmp/ruby/build/trunk/.bundle/gems/debug-1.9.2/ext/debug' I, [2024-05-13T04:29:23.410716 #1066487] INFO -- : make[2]: Entering directory '/tmp/ruby/build/trunk/.bundle/gems/bigdecimal-3.1.8/ext/bigdecimal' I, [2024-05-13T04:29:23.411117 #1066487] INFO -- : make[2]: Leaving directory '/tmp/ruby/build/trunk/ext/pty' I, [2024-05-13T04:29:23.411562 #1066487] INFO -- : make[2]: Entering directory '/tmp/ruby/build/trunk/ext/ripper' I, [2024-05-13T04:29:23.412144 #1066487] INFO -- : make[2]: Entering directory '/tmp/ruby/build/trunk/.bundle/gems/racc-1.7.3/ext/racc/cparse' I, [2024-05-13T04:29:23.412459 #1066487] INFO -- : make[2]: Entering directory '/tmp/ruby/build/trunk/.bundle/gems/syslog-0.1.2/ext/syslog' I, [2024-05-13T04:29:23.412560 #1066487] INFO -- : make[2]: Entering directory '/tmp/ruby/build/trunk/.bundle/gems/rbs-3.4.4/ext/rbs_extension' I, [2024-05-13T04:29:23.413011 #1066487] INFO -- : make[2]: Leaving directory '/tmp/ruby/build/trunk/ext/json' I, [2024-05-13T04:29:23.413910 #1066487] INFO -- : make[2]: Leaving directory '/tmp/ruby/build/trunk/ext/objspace' I, [2024-05-13T04:29:23.416030 #1066487] INFO -- : make[2]: Entering directory '/tmp/ruby/build/trunk/ext/digest/sha2' I, [2024-05-13T04:29:23.416438 #1066487] INFO -- : make[2]: Leaving directory '/tmp/ruby/build/trunk/ext/fiddle' I, [2024-05-13T04:29:23.416836 #1066487] INFO -- : make[2]: Entering directory '/tmp/ruby/build/trunk/ext/socket' I, [2024-05-13T04:29:23.417158 #1066487] INFO -- : make[2]: Leaving directory '/tmp/ruby/build/trunk/ext/ripper' I, [2024-05-13T04:29:23.419329 #1066487] INFO -- : make[2]: Leaving directory '/tmp/ruby/build/trunk/ext/digest/sha2' I, [2024-05-13T04:29:23.420911 #1066487] INFO -- : make[2]: Entering directory '/tmp/ruby/build/trunk/ext/openssl' I, [2024-05-13T04:29:23.422124 #1066487] INFO -- : make[2]: Leaving directory '/tmp/ruby/build/trunk/ext/psych' I, [2024-05-13T04:29:23.422744 #1066487] INFO -- : make[2]: Leaving directory '/tmp/ruby/build/trunk/ext/socket' I, [2024-05-13T04:29:23.432173 #1066487] INFO -- : make[2]: Leaving directory '/tmp/ruby/build/trunk/ext/openssl' I, [2024-05-13T04:29:23.433785 #1066487] INFO -- : make[2]: Leaving directory '/tmp/ruby/build/trunk/.bundle/gems/nkf-0.2.0/ext/nkf' I, [2024-05-13T04:29:23.435677 #1066487] INFO -- : make[2]: Leaving directory '/tmp/ruby/build/trunk/.bundle/gems/racc-1.7.3/ext/racc/cparse' I, [2024-05-13T04:29:23.435883 #1066487] INFO -- : make[2]: Leaving directory '/tmp/ruby/build/trunk/.bundle/gems/syslog-0.1.2/ext/syslog' I, [2024-05-13T04:29:23.437169 #1066487] INFO -- : make[2]: Leaving directory '/tmp/ruby/build/trunk/.bundle/gems/rbs-3.4.4/ext/rbs_extension' I, [2024-05-13T04:29:23.443209 #1066487] INFO -- : make[2]: Leaving directory '/tmp/ruby/build/trunk/.bundle/gems/debug-1.9.2/ext/debug' I, [2024-05-13T04:29:23.444000 #1066487] INFO -- : make[2]: Leaving directory '/tmp/ruby/build/trunk/.bundle/gems/bigdecimal-3.1.8/ext/bigdecimal' I, [2024-05-13T04:29:23.467827 #1066487] INFO -- : make[2]: Entering directory '/tmp/ruby/build/trunk' I, [2024-05-13T04:29:23.538048 #1066487] INFO -- : linking ruby I, [2024-05-13T04:29:23.560088 #1066487] INFO -- : make[2]: Leaving directory '/tmp/ruby/build/trunk' I, [2024-05-13T04:29:23.560571 #1066487] INFO -- : make[1]: Leaving directory '/tmp/ruby/build/trunk' I, [2024-05-13T04:29:23.564354 #1066487] INFO -- : make[1]: Entering directory '/tmp/ruby/build/trunk' I, [2024-05-13T04:29:23.564375 #1066487] INFO -- : make[1]: Nothing to be done for 'note'. I, [2024-05-13T04:29:23.564381 #1066487] INFO -- : make[1]: Leaving directory '/tmp/ruby/build/trunk' I, [2024-05-13T04:29:23.564931 #1066487] INFO -- : $$$[end] "make all -j20" exit with 0. I, [2024-05-13T04:29:23.565089 #1066487] INFO -- : $$$[beg] make install -j20 I, [2024-05-13T04:29:23.627494 #1066487] INFO -- : Update minitest to ea9caafc0754b1d6236a490d59e624b53209734a I, [2024-05-13T04:29:23.627561 #1066487] INFO -- : Update power_assert to 84e85124c5014a139af39161d484156cfe87a9ed I, [2024-05-13T04:29:23.627757 #1066487] INFO -- : Update rbs to ba7872795d5de04adb8ff500c0e6afdc81a041dd I, [2024-05-13T04:29:23.628044 #1066487] INFO -- : Update typeprof to b19a6416da3a05d57fadd6ffdadb382b6d236ca5 I, [2024-05-13T04:29:23.628737 #1066487] INFO -- : echo ea9caafc0754b1d6236a490d59e624b53209734a | /bin/sh /tmp/ruby/src/trunk/tool/ifchange /tmp/ruby/src/trunk/.bundle/.timestamp/minitest.revision - I, [2024-05-13T04:29:23.628912 #1066487] INFO -- : echo 84e85124c5014a139af39161d484156cfe87a9ed | /bin/sh /tmp/ruby/src/trunk/tool/ifchange /tmp/ruby/src/trunk/.bundle/.timestamp/power_assert.revision - I, [2024-05-13T04:29:23.629802 #1066487] INFO -- : BASERUBY = /usr/bin/ruby --disable=gems I, [2024-05-13T04:29:23.629832 #1066487] INFO -- : CC = gcc I, [2024-05-13T04:29:23.629845 #1066487] INFO -- : LD = ld I, [2024-05-13T04:29:23.629855 #1066487] INFO -- : LDSHARED = gcc -shared I, [2024-05-13T04:29:23.629865 #1066487] INFO -- : CFLAGS = -O3 -fno-fast-math -ggdb3 -Wall -Wextra -Wdeprecated-declarations -Wdiv-by-zero -Wduplicated-cond -Wimplicit-function-declaration -Wimplicit-int -Wpointer-arith -Wwrite-strings -Wold-style-definition -Wimplicit-fallthrough=0 -Wmissing-noreturn -Wno-cast-function-type -Wno-constant-logical-operand -Wno-long-long -Wno-missing-field-initializers -Wno-overlength-strings -Wno-packed-bitfield-compat -Wno-parentheses-equality -Wno-self-assign -Wno-tautological-compare -Wno-unused-parameter -Wno-unused-value -Wsuggest-attribute=format -Wsuggest-attribute=noreturn -Wunused-variable -Wmisleading-indentation -Wundef -fPIC I, [2024-05-13T04:29:23.629891 #1066487] INFO -- : XCFLAGS = -U_FORTIFY_SOURCE -D_FORTIFY_SOURCE=2 -fstack-protector-strong -fno-strict-overflow -fvisibility=hidden -fexcess-precision=standard -DRUBY_EXPORT -I. -I.ext/include/x86_64-linux -I/tmp/ruby/src/trunk/include -I/tmp/ruby/src/trunk -I/tmp/ruby/src/trunk/prism -I/tmp/ruby/src/trunk/enc/unicode/15.0.0 I, [2024-05-13T04:29:23.629903 #1066487] INFO -- : CPPFLAGS = I, [2024-05-13T04:29:23.629913 #1066487] INFO -- : DLDFLAGS = -Wl,--compress-debug-sections=zlib -Wl,-soname,libruby.so.3.4 -fstack-protector-strong I, [2024-05-13T04:29:23.629924 #1066487] INFO -- : SOLIBS = -lz -lrt -lrt -lgmp -ldl -lcrypt -lm -lpthread I, [2024-05-13T04:29:23.629935 #1066487] INFO -- : LANG = en_US.UTF-8 I, [2024-05-13T04:29:23.629945 #1066487] INFO -- : LC_ALL = I, [2024-05-13T04:29:23.629955 #1066487] INFO -- : LC_CTYPE = I, [2024-05-13T04:29:23.629965 #1066487] INFO -- : MFLAGS = -j20 --jobserver-auth=4,5 I, [2024-05-13T04:29:23.629977 #1066487] INFO -- : RUSTC = no I, [2024-05-13T04:29:23.629988 #1066487] INFO -- : YJIT_RUSTC_ARGS = --crate-name=yjit --crate-type=staticlib --edition=2021 -g -C lto=thin -C opt-level=3 -C overflow-checks=on '--out-dir=/tmp/ruby/build/trunk/yjit/target/release/' /tmp/ruby/src/trunk/yjit/src/lib.rs I, [2024-05-13T04:29:23.630865 #1066487] INFO -- : /tmp/ruby/src/trunk/.bundle/.timestamp/power_assert.revision unchanged I, [2024-05-13T04:29:23.630895 #1066487] INFO -- : /tmp/ruby/src/trunk/.bundle/.timestamp/minitest.revision unchanged I, [2024-05-13T04:29:23.656983 #1066487] INFO -- : echo ba7872795d5de04adb8ff500c0e6afdc81a041dd | /bin/sh /tmp/ruby/src/trunk/tool/ifchange /tmp/ruby/src/trunk/.bundle/.timestamp/rbs.revision - I, [2024-05-13T04:29:23.657161 #1066487] INFO -- : echo b19a6416da3a05d57fadd6ffdadb382b6d236ca5 | /bin/sh /tmp/ruby/src/trunk/tool/ifchange /tmp/ruby/src/trunk/.bundle/.timestamp/typeprof.revision - I, [2024-05-13T04:29:23.658068 #1066487] INFO -- : generating enc.mk I, [2024-05-13T04:29:23.658104 #1066487] INFO -- : gcc (Ubuntu 11.4.0-1ubuntu1~22.04) 11.4.0 I, [2024-05-13T04:29:23.658119 #1066487] INFO -- : Copyright (C) 2021 Free Software Foundation, Inc. I, [2024-05-13T04:29:23.658131 #1066487] INFO -- : This is free software; see the source for copying conditions. There is NO I, [2024-05-13T04:29:23.658142 #1066487] INFO -- : warranty; not even for MERCHANTABILITY or FITNESS FOR A PARTICULAR PURPOSE. I, [2024-05-13T04:29:23.658153 #1066487] INFO -- : I, [2024-05-13T04:29:23.659066 #1066487] INFO -- : /tmp/ruby/src/trunk/.bundle/.timestamp/rbs.revision unchanged I, [2024-05-13T04:29:23.659195 #1066487] INFO -- : /tmp/ruby/src/trunk/.bundle/.timestamp/typeprof.revision unchanged I, [2024-05-13T04:29:23.779365 #1066487] INFO -- : Building power_assert@84e85124c5014a139af39161d484156cfe87a9ed to /tmp/ruby/src/trunk/gems/power_assert-2.0.3.gem I, [2024-05-13T04:29:23.779678 #1066487] INFO -- : making srcs under enc I, [2024-05-13T04:29:23.780038 #1066487] INFO -- : making enc I, [2024-05-13T04:29:23.797026 #1066487] INFO -- : make[1]: Entering directory '/tmp/ruby/build/trunk' I, [2024-05-13T04:29:23.797055 #1066487] INFO -- : make[1]: Nothing to be done for 'enc'. I, [2024-05-13T04:29:23.797061 #1066487] INFO -- : make[1]: Leaving directory '/tmp/ruby/build/trunk' I, [2024-05-13T04:29:23.809078 #1066487] INFO -- : make[1]: Entering directory '/tmp/ruby/build/trunk' I, [2024-05-13T04:29:23.809101 #1066487] INFO -- : make[1]: Nothing to be done for 'srcs'. I, [2024-05-13T04:29:23.809107 #1066487] INFO -- : make[1]: Leaving directory '/tmp/ruby/build/trunk' I, [2024-05-13T04:29:23.809885 #1066487] INFO -- : generating transdb.h I, [2024-05-13T04:29:23.848444 #1066487] INFO -- : Successfully built RubyGem I, [2024-05-13T04:29:23.848491 #1066487] INFO -- : Name: power_assert I, [2024-05-13T04:29:23.848501 #1066487] INFO -- : Version: 2.0.4dev I, [2024-05-13T04:29:23.848505 #1066487] INFO -- : File: power_assert-2.0.4dev.gem I, [2024-05-13T04:29:23.850653 #1066487] INFO -- : Extracting bundle gem power_assert-2.0.3... I, [2024-05-13T04:29:23.906524 #1066487] INFO -- : transdb.h unchanged I, [2024-05-13T04:29:23.908141 #1066487] INFO -- : generating makefiles ext/configure-ext.mk I, [2024-05-13T04:29:23.908456 #1066487] INFO -- : making trans I, [2024-05-13T04:29:23.912257 #1066487] INFO -- : Try with hash version of bundled gems instead of gems/power_assert-2.0.3.gem. We don't use this gem with release version of Ruby. I, [2024-05-13T04:29:23.917262 #1066487] INFO -- : Unpacked gems/power_assert-2.0.4dev.gem I, [2024-05-13T04:29:23.935180 #1066487] INFO -- : ext/configure-ext.mk unchanged I, [2024-05-13T04:29:23.937617 #1066487] INFO -- : make[1]: Entering directory '/tmp/ruby/build/trunk' I, [2024-05-13T04:29:23.943417 #1066487] INFO -- : make[1]: Entering directory '/tmp/ruby/build/trunk' I, [2024-05-13T04:29:23.943508 #1066487] INFO -- : make[1]: Nothing to be done for 'trans'. I, [2024-05-13T04:29:23.943518 #1066487] INFO -- : make[1]: Leaving directory '/tmp/ruby/build/trunk' I, [2024-05-13T04:29:23.944575 #1066487] INFO -- : making encs I, [2024-05-13T04:29:24.002162 #1066487] INFO -- : make[1]: Entering directory '/tmp/ruby/build/trunk' I, [2024-05-13T04:29:24.002236 #1066487] INFO -- : make[1]: Nothing to be done for 'encs'. I, [2024-05-13T04:29:24.002262 #1066487] INFO -- : make[1]: Leaving directory '/tmp/ruby/build/trunk' I, [2024-05-13T04:29:24.085988 #1066487] INFO -- : make[1]: Leaving directory '/tmp/ruby/build/trunk' I, [2024-05-13T04:29:24.086657 #1066487] INFO -- : generating makefile exts.mk I, [2024-05-13T04:29:24.123615 #1066487] INFO -- : exts.mk unchanged I, [2024-05-13T04:29:24.128993 #1066487] INFO -- : make[1]: Entering directory '/tmp/ruby/build/trunk' I, [2024-05-13T04:29:24.147108 #1066487] INFO -- : make[2]: Entering directory '/tmp/ruby/build/trunk/ext/digest' I, [2024-05-13T04:29:24.148555 #1066487] INFO -- : make[2]: Entering directory '/tmp/ruby/build/trunk/ext/json' I, [2024-05-13T04:29:24.148752 #1066487] INFO -- : make[2]: Entering directory '/tmp/ruby/build/trunk/ext/coverage' I, [2024-05-13T04:29:24.149554 #1066487] INFO -- : make[2]: Entering directory '/tmp/ruby/build/trunk/ext/date' I, [2024-05-13T04:29:24.149701 #1066487] INFO -- : make[2]: Entering directory '/tmp/ruby/build/trunk/ext/io/console' I, [2024-05-13T04:29:24.150114 #1066487] INFO -- : make[2]: Entering directory '/tmp/ruby/build/trunk/ext/rubyvm' I, [2024-05-13T04:29:24.150680 #1066487] INFO -- : make[2]: Entering directory '/tmp/ruby/build/trunk/ext/monitor' I, [2024-05-13T04:29:24.151493 #1066487] INFO -- : make[2]: Entering directory '/tmp/ruby/build/trunk/ext/pathname' I, [2024-05-13T04:29:24.151930 #1066487] INFO -- : make[2]: Entering directory '/tmp/ruby/build/trunk/ext/fiddle' I, [2024-05-13T04:29:24.152071 #1066487] INFO -- : make[2]: Entering directory '/tmp/ruby/build/trunk/ext/pty' I, [2024-05-13T04:29:24.152492 #1066487] INFO -- : make[2]: Leaving directory '/tmp/ruby/build/trunk/ext/coverage' I, [2024-05-13T04:29:24.152588 #1066487] INFO -- : make[2]: Leaving directory '/tmp/ruby/build/trunk/ext/rubyvm' I, [2024-05-13T04:29:24.152947 #1066487] INFO -- : make[2]: Leaving directory '/tmp/ruby/build/trunk/ext/io/console' I, [2024-05-13T04:29:24.152971 #1066487] INFO -- : make[2]: Entering directory '/tmp/ruby/build/trunk/ext/objspace' I, [2024-05-13T04:29:24.153677 #1066487] INFO -- : make[2]: Leaving directory '/tmp/ruby/build/trunk/ext/date' I, [2024-05-13T04:29:24.153734 #1066487] INFO -- : make[2]: Entering directory '/tmp/ruby/build/trunk/ext/psych' I, [2024-05-13T04:29:24.153872 #1066487] INFO -- : make[2]: Leaving directory '/tmp/ruby/build/trunk/ext/monitor' I, [2024-05-13T04:29:24.153980 #1066487] INFO -- : make[2]: Leaving directory '/tmp/ruby/build/trunk/ext/digest' I, [2024-05-13T04:29:24.154715 #1066487] INFO -- : make[2]: Entering directory '/tmp/ruby/build/trunk/.bundle/gems/bigdecimal-3.1.8/ext/bigdecimal' I, [2024-05-13T04:29:24.154745 #1066487] INFO -- : make[2]: Leaving directory '/tmp/ruby/build/trunk/ext/pty' I, [2024-05-13T04:29:24.154755 #1066487] INFO -- : make[2]: Entering directory '/tmp/ruby/build/trunk/.bundle/gems/debug-1.9.2/ext/debug' I, [2024-05-13T04:29:24.154761 #1066487] INFO -- : make[2]: Leaving directory '/tmp/ruby/build/trunk/ext/pathname' I, [2024-05-13T04:29:24.156010 #1066487] INFO -- : make[2]: Entering directory '/tmp/ruby/build/trunk/.bundle/gems/nkf-0.2.0/ext/nkf' I, [2024-05-13T04:29:24.156216 #1066487] INFO -- : make[2]: Entering directory '/tmp/ruby/build/trunk/.bundle/gems/racc-1.7.3/ext/racc/cparse' I, [2024-05-13T04:29:24.156243 #1066487] INFO -- : make[2]: Entering directory '/tmp/ruby/build/trunk/ext/ripper' I, [2024-05-13T04:29:24.157025 #1066487] INFO -- : make[2]: Leaving directory '/tmp/ruby/build/trunk/ext/objspace' I, [2024-05-13T04:29:24.157262 #1066487] INFO -- : make[2]: Entering directory '/tmp/ruby/build/trunk/.bundle/gems/syslog-0.1.2/ext/syslog' I, [2024-05-13T04:29:24.158075 #1066487] INFO -- : make[2]: Leaving directory '/tmp/ruby/build/trunk/ext/json' I, [2024-05-13T04:29:24.158670 #1066487] INFO -- : make[2]: Entering directory '/tmp/ruby/build/trunk/.bundle/gems/rbs-3.4.4/ext/rbs_extension' I, [2024-05-13T04:29:24.159592 #1066487] INFO -- : make[2]: Entering directory '/tmp/ruby/build/trunk/ext/socket' I, [2024-05-13T04:29:24.161348 #1066487] INFO -- : make[2]: Leaving directory '/tmp/ruby/build/trunk/ext/fiddle' I, [2024-05-13T04:29:24.162312 #1066487] INFO -- : make[2]: Entering directory '/tmp/ruby/build/trunk/ext/digest/sha2' I, [2024-05-13T04:29:24.162512 #1066487] INFO -- : make[2]: Leaving directory '/tmp/ruby/build/trunk/ext/ripper' I, [2024-05-13T04:29:24.164415 #1066487] INFO -- : make[2]: Leaving directory '/tmp/ruby/build/trunk/ext/psych' I, [2024-05-13T04:29:24.164613 #1066487] INFO -- : make[2]: Leaving directory '/tmp/ruby/build/trunk/ext/digest/sha2' I, [2024-05-13T04:29:24.165243 #1066487] INFO -- : make[2]: Entering directory '/tmp/ruby/build/trunk/ext/openssl' I, [2024-05-13T04:29:24.168576 #1066487] INFO -- : make[2]: Leaving directory '/tmp/ruby/build/trunk/ext/socket' I, [2024-05-13T04:29:24.176485 #1066487] INFO -- : make[2]: Leaving directory '/tmp/ruby/build/trunk/ext/openssl' I, [2024-05-13T04:29:24.179184 #1066487] INFO -- : make[2]: Leaving directory '/tmp/ruby/build/trunk/.bundle/gems/debug-1.9.2/ext/debug' I, [2024-05-13T04:29:24.179226 #1066487] INFO -- : make[2]: Leaving directory '/tmp/ruby/build/trunk/.bundle/gems/nkf-0.2.0/ext/nkf' I, [2024-05-13T04:29:24.180145 #1066487] INFO -- : make[2]: Leaving directory '/tmp/ruby/build/trunk/.bundle/gems/bigdecimal-3.1.8/ext/bigdecimal' I, [2024-05-13T04:29:24.186173 #1066487] INFO -- : make[2]: Leaving directory '/tmp/ruby/build/trunk/.bundle/gems/syslog-0.1.2/ext/syslog' I, [2024-05-13T04:29:24.187163 #1066487] INFO -- : make[2]: Leaving directory '/tmp/ruby/build/trunk/.bundle/gems/racc-1.7.3/ext/racc/cparse' I, [2024-05-13T04:29:24.188522 #1066487] INFO -- : make[2]: Leaving directory '/tmp/ruby/build/trunk/.bundle/gems/rbs-3.4.4/ext/rbs_extension' I, [2024-05-13T04:29:24.213026 #1066487] INFO -- : make[2]: Entering directory '/tmp/ruby/build/trunk' I, [2024-05-13T04:29:24.278563 #1066487] INFO -- : make[2]: 'ruby' is up to date. I, [2024-05-13T04:29:24.278598 #1066487] INFO -- : make[2]: Leaving directory '/tmp/ruby/build/trunk' I, [2024-05-13T04:29:24.279048 #1066487] INFO -- : make[1]: Leaving directory '/tmp/ruby/build/trunk' I, [2024-05-13T04:29:24.282712 #1066487] INFO -- : make[1]: Entering directory '/tmp/ruby/build/trunk' I, [2024-05-13T04:29:24.282733 #1066487] INFO -- : make[1]: Nothing to be done for 'note'. I, [2024-05-13T04:29:24.282738 #1066487] INFO -- : make[1]: Leaving directory '/tmp/ruby/build/trunk' I, [2024-05-13T04:29:24.283102 #1066487] INFO -- : ./miniruby -I/tmp/ruby/src/trunk/lib -I. -I.ext/common /tmp/ruby/src/trunk/tool/runruby.rb --extout=.ext -- --disable-gems -r./x86_64-linux-fake /tmp/ruby/src/trunk/tool/rbinstall.rb --make="make" --dest-dir="" --extout=".ext" --ext-build-dir="./ext" --mflags="-j20 --jobserver-auth=4,5" --make-flags=" -j20 --jobserver-auth=4,5" --data-mode=0644 --prog-mode=0755 --installed-list .installed.list --mantype="doc" --gnumake --install=all --exclude=doc I, [2024-05-13T04:29:24.377161 #1066487] INFO -- : Installing to I, [2024-05-13T04:29:24.377241 #1066487] INFO -- : installing binary commands: /tmp/ruby/install/trunk/bin I, [2024-05-13T04:29:24.377373 #1066487] INFO -- : installing base libraries: /tmp/ruby/install/trunk/lib I, [2024-05-13T04:29:24.384620 #1066487] INFO -- : installing arch files: /tmp/ruby/install/trunk/lib/ruby/3.4.0+0/x86_64-linux I, [2024-05-13T04:29:24.384677 #1066487] INFO -- : installing pkgconfig data: /tmp/ruby/install/trunk/lib/pkgconfig I, [2024-05-13T04:29:24.384713 #1066487] INFO -- : installing extension objects: /tmp/ruby/install/trunk/lib/ruby/3.4.0+0/x86_64-linux I, [2024-05-13T04:29:24.393976 #1066487] INFO -- : installing extension objects: /tmp/ruby/install/trunk/lib/ruby/site_ruby/3.4.0+0/x86_64-linux I, [2024-05-13T04:29:24.394010 #1066487] INFO -- : installing extension objects: /tmp/ruby/install/trunk/lib/ruby/vendor_ruby/3.4.0+0/x86_64-linux I, [2024-05-13T04:29:24.394085 #1066487] INFO -- : installing extension headers: /tmp/ruby/install/trunk/include/ruby-3.4.0+0/x86_64-linux I, [2024-05-13T04:29:24.394221 #1066487] INFO -- : installing extension scripts: /tmp/ruby/install/trunk/lib/ruby/3.4.0+0 I, [2024-05-13T04:29:24.397983 #1066487] INFO -- : installing extension scripts: /tmp/ruby/install/trunk/lib/ruby/site_ruby/3.4.0+0 I, [2024-05-13T04:29:24.398008 #1066487] INFO -- : installing extension scripts: /tmp/ruby/install/trunk/lib/ruby/vendor_ruby/3.4.0+0 I, [2024-05-13T04:29:24.398015 #1066487] INFO -- : installing extension headers: /tmp/ruby/install/trunk/include/ruby-3.4.0+0/ruby I, [2024-05-13T04:29:24.398070 #1066487] INFO -- : installing command scripts: /tmp/ruby/install/trunk/bin I, [2024-05-13T04:29:24.398141 #1066487] INFO -- : installing library scripts: /tmp/ruby/install/trunk/lib/ruby/3.4.0+0 I, [2024-05-13T04:29:24.431218 #1066487] INFO -- : installing common headers: /tmp/ruby/install/trunk/include/ruby-3.4.0+0 I, [2024-05-13T04:29:24.436626 #1066487] INFO -- : installing manpages: /tmp/ruby/install/trunk/share/man/man1 I, [2024-05-13T04:29:24.436767 #1066487] INFO -- : installing default gems from lib: /tmp/ruby/install/trunk/lib/ruby/gems/3.4.0+0 I, [2024-05-13T04:29:24.459096 #1066487] INFO -- : benchmark 0.3.0 I, [2024-05-13T04:29:24.465982 #1066487] INFO -- : bundler 2.6.0.dev I, [2024-05-13T04:29:24.468104 #1066487] INFO -- : cgi 0.4.1 I, [2024-05-13T04:29:24.468669 #1066487] INFO -- : delegate 0.3.1 I, [2024-05-13T04:29:24.469175 #1066487] INFO -- : did_you_mean 1.6.3 I, [2024-05-13T04:29:24.469666 #1066487] INFO -- : english 0.8.0 I, [2024-05-13T04:29:24.470157 #1066487] INFO -- : erb 4.0.4 I, [2024-05-13T04:29:24.470914 #1066487] INFO -- : error_highlight 0.6.0 I, [2024-05-13T04:29:24.471399 #1066487] INFO -- : fileutils 1.7.2 I, [2024-05-13T04:29:24.471910 #1066487] INFO -- : find 0.2.0 I, [2024-05-13T04:29:24.472414 #1066487] INFO -- : forwardable 1.3.3 I, [2024-05-13T04:29:24.472889 #1066487] INFO -- : ipaddr 1.2.6 I, [2024-05-13T04:29:24.473361 #1066487] INFO -- : irb 1.13.1 I, [2024-05-13T04:29:24.474831 #1066487] INFO -- : logger 1.6.0 I, [2024-05-13T04:29:24.475359 #1066487] INFO -- : net-http 0.4.1 I, [2024-05-13T04:29:24.475915 #1066487] INFO -- : net-protocol 0.2.2 I, [2024-05-13T04:29:24.476439 #1066487] INFO -- : open-uri 0.4.1 I, [2024-05-13T04:29:24.477031 #1066487] INFO -- : open3 0.2.1 I, [2024-05-13T04:29:24.477547 #1066487] INFO -- : optparse 0.5.0 I, [2024-05-13T04:29:24.478055 #1066487] INFO -- : ostruct 0.6.0 I, [2024-05-13T04:29:24.478590 #1066487] INFO -- : pp 0.5.0 I, [2024-05-13T04:29:24.479118 #1066487] INFO -- : prettyprint 0.2.0 I, [2024-05-13T04:29:24.479609 #1066487] INFO -- : prism 0.29.0 I, [2024-05-13T04:29:24.480166 #1066487] INFO -- : pstore 0.1.3 I, [2024-05-13T04:29:24.480656 #1066487] INFO -- : rdoc 6.6.3.1 I, [2024-05-13T04:29:24.482273 #1066487] INFO -- : readline 0.0.4 I, [2024-05-13T04:29:24.482803 #1066487] INFO -- : reline 0.5.6 I, [2024-05-13T04:29:24.483358 #1066487] INFO -- : resolv 0.4.0 I, [2024-05-13T04:29:24.483916 #1066487] INFO -- : ruby2_keywords 0.0.5 I, [2024-05-13T04:29:24.484424 #1066487] INFO -- : securerandom 0.3.1 I, [2024-05-13T04:29:24.484924 #1066487] INFO -- : set 1.1.0 I, [2024-05-13T04:29:24.485475 #1066487] INFO -- : shellwords 0.2.0 I, [2024-05-13T04:29:24.485988 #1066487] INFO -- : singleton 0.2.0 I, [2024-05-13T04:29:24.486475 #1066487] INFO -- : syntax_suggest 2.0.0 I, [2024-05-13T04:29:24.487198 #1066487] INFO -- : tempfile 0.2.1 I, [2024-05-13T04:29:24.487736 #1066487] INFO -- : time 0.3.0 I, [2024-05-13T04:29:24.488265 #1066487] INFO -- : timeout 0.4.1 I, [2024-05-13T04:29:24.489327 #1066487] INFO -- : tmpdir 0.2.0 I, [2024-05-13T04:29:24.489888 #1066487] INFO -- : tsort 0.2.0 I, [2024-05-13T04:29:24.490398 #1066487] INFO -- : un 0.3.0 I, [2024-05-13T04:29:24.490904 #1066487] INFO -- : uri 0.13.0 I, [2024-05-13T04:29:24.491436 #1066487] INFO -- : weakref 0.1.3 I, [2024-05-13T04:29:24.491998 #1066487] INFO -- : yaml 0.3.0 I, [2024-05-13T04:29:24.492413 #1066487] INFO -- : installing default gems from ext: /tmp/ruby/install/trunk/lib/ruby/gems/3.4.0+0 I, [2024-05-13T04:29:24.498787 #1066487] INFO -- : date 3.3.4 I, [2024-05-13T04:29:24.499332 #1066487] INFO -- : digest 3.1.1 I, [2024-05-13T04:29:24.499961 #1066487] INFO -- : etc 1.4.3 I, [2024-05-13T04:29:24.500506 #1066487] INFO -- : fcntl 1.1.0 I, [2024-05-13T04:29:24.501036 #1066487] INFO -- : fiddle 1.1.3 I, [2024-05-13T04:29:24.501556 #1066487] INFO -- : io-console 0.7.2 I, [2024-05-13T04:29:24.502061 #1066487] INFO -- : io-nonblock 0.3.0 I, [2024-05-13T04:29:24.502685 #1066487] INFO -- : io-wait 0.3.1 I, [2024-05-13T04:29:24.503176 #1066487] INFO -- : json 2.7.2 I, [2024-05-13T04:29:24.504082 #1066487] INFO -- : openssl 3.2.0 I, [2024-05-13T04:29:24.504817 #1066487] INFO -- : pathname 0.3.0 I, [2024-05-13T04:29:24.505346 #1066487] INFO -- : psych 5.1.2 I, [2024-05-13T04:29:24.505932 #1066487] INFO -- : stringio 3.1.1 I, [2024-05-13T04:29:24.506484 #1066487] INFO -- : strscan 3.1.1 I, [2024-05-13T04:29:24.506997 #1066487] INFO -- : zlib 3.1.0 I, [2024-05-13T04:29:24.507418 #1066487] INFO -- : installing bundled gems: /tmp/ruby/install/trunk/lib/ruby/gems/3.4.0+0 I, [2024-05-13T04:29:24.507835 #1066487] INFO -- : minitest 5.22.3 I, [2024-05-13T04:29:24.515104 #1066487] INFO -- : rake 13.2.1 I, [2024-05-13T04:29:24.518486 #1066487] INFO -- : test-unit 3.6.2 I, [2024-05-13T04:29:24.522807 #1066487] INFO -- : rexml 3.2.6 I, [2024-05-13T04:29:24.526239 #1066487] INFO -- : rss 0.3.0 I, [2024-05-13T04:29:24.529206 #1066487] INFO -- : net-ftp 0.3.4 I, [2024-05-13T04:29:24.530686 #1066487] INFO -- : net-imap 0.4.11 I, [2024-05-13T04:29:24.533609 #1066487] INFO -- : net-pop 0.1.2 I, [2024-05-13T04:29:24.534546 #1066487] INFO -- : net-smtp 0.5.0 I, [2024-05-13T04:29:24.535633 #1066487] INFO -- : matrix 0.4.2 I, [2024-05-13T04:29:24.539168 #1066487] INFO -- : prime 0.1.2 I, [2024-05-13T04:29:24.544468 #1066487] INFO -- : rbs 3.4.4 I, [2024-05-13T04:29:24.566497 #1066487] INFO -- : typeprof 0.21.11 I, [2024-05-13T04:29:24.569079 #1066487] INFO -- : debug 1.9.2 I, [2024-05-13T04:29:24.571766 #1066487] INFO -- : racc 1.7.3 I, [2024-05-13T04:29:24.574258 #1066487] INFO -- : mutex_m 0.2.0 I, [2024-05-13T04:29:24.575461 #1066487] INFO -- : getoptlong 0.2.1 I, [2024-05-13T04:29:24.576785 #1066487] INFO -- : base64 0.2.0 I, [2024-05-13T04:29:24.577846 #1066487] INFO -- : bigdecimal 3.1.8 I, [2024-05-13T04:29:24.580224 #1066487] INFO -- : observer 0.1.2 I, [2024-05-13T04:29:24.581338 #1066487] INFO -- : abbrev 0.1.2 I, [2024-05-13T04:29:24.582780 #1066487] INFO -- : resolv-replace 0.1.1 I, [2024-05-13T04:29:24.583940 #1066487] INFO -- : rinda 0.2.0 I, [2024-05-13T04:29:24.585350 #1066487] INFO -- : drb 2.2.1 I, [2024-05-13T04:29:24.586860 #1066487] INFO -- : nkf 0.2.0 I, [2024-05-13T04:29:24.589464 #1066487] INFO -- : syslog 0.1.2 I, [2024-05-13T04:29:24.591023 #1066487] INFO -- : csv 3.3.0 I, [2024-05-13T04:29:24.593113 #1066487] INFO -- : installing bundled gem cache: /tmp/ruby/install/trunk/lib/ruby/gems/3.4.0+0/cache I, [2024-05-13T04:29:24.594469 #1066487] INFO -- : skipped bundled gems: I, [2024-05-13T04:29:24.594485 #1066487] INFO -- : power_assert-2.0.4dev.gem not found in bundled_gems I, [2024-05-13T04:29:24.597648 #1066487] INFO -- : $$$[end] "make install -j20" exit with 0. I, [2024-05-13T04:29:24.597760 #1066487] INFO -- : $$$[beg] make yes-btest TESTOPTS='-q -j20' I, [2024-05-13T04:29:29.582707 #1066487] INFO -- : PASS all 1936 tests E, [2024-05-13T04:29:29.587860 #1066487] ERROR -- : I, [2024-05-13T04:29:29.588057 #1066487] INFO -- : $$$[end] "make yes-btest TESTOPTS='-q -j20'" exit with 0. I, [2024-05-13T04:29:29.588146 #1066487] INFO -- : $$$[beg] make yes-test-basic TESTS='-j20' I, [2024-05-13T04:29:29.648356 #1066487] INFO -- : BASERUBY = /usr/bin/ruby --disable=gems I, [2024-05-13T04:29:29.648384 #1066487] INFO -- : CC = gcc I, [2024-05-13T04:29:29.648390 #1066487] INFO -- : LD = ld I, [2024-05-13T04:29:29.648393 #1066487] INFO -- : LDSHARED = gcc -shared I, [2024-05-13T04:29:29.648397 #1066487] INFO -- : CFLAGS = -O3 -fno-fast-math -ggdb3 -Wall -Wextra -Wdeprecated-declarations -Wdiv-by-zero -Wduplicated-cond -Wimplicit-function-declaration -Wimplicit-int -Wpointer-arith -Wwrite-strings -Wold-style-definition -Wimplicit-fallthrough=0 -Wmissing-noreturn -Wno-cast-function-type -Wno-constant-logical-operand -Wno-long-long -Wno-missing-field-initializers -Wno-overlength-strings -Wno-packed-bitfield-compat -Wno-parentheses-equality -Wno-self-assign -Wno-tautological-compare -Wno-unused-parameter -Wno-unused-value -Wsuggest-attribute=format -Wsuggest-attribute=noreturn -Wunused-variable -Wmisleading-indentation -Wundef -fPIC I, [2024-05-13T04:29:29.648402 #1066487] INFO -- : XCFLAGS = -U_FORTIFY_SOURCE -D_FORTIFY_SOURCE=2 -fstack-protector-strong -fno-strict-overflow -fvisibility=hidden -fexcess-precision=standard -DRUBY_EXPORT -I. -I.ext/include/x86_64-linux -I/tmp/ruby/src/trunk/include -I/tmp/ruby/src/trunk -I/tmp/ruby/src/trunk/prism -I/tmp/ruby/src/trunk/enc/unicode/15.0.0 I, [2024-05-13T04:29:29.648405 #1066487] INFO -- : CPPFLAGS = I, [2024-05-13T04:29:29.648409 #1066487] INFO -- : DLDFLAGS = -Wl,--compress-debug-sections=zlib -Wl,-soname,libruby.so.3.4 -fstack-protector-strong I, [2024-05-13T04:29:29.648413 #1066487] INFO -- : SOLIBS = -lz -lrt -lrt -lgmp -ldl -lcrypt -lm -lpthread I, [2024-05-13T04:29:29.648416 #1066487] INFO -- : LANG = en_US.UTF-8 I, [2024-05-13T04:29:29.648420 #1066487] INFO -- : LC_ALL = I, [2024-05-13T04:29:29.648423 #1066487] INFO -- : LC_CTYPE = I, [2024-05-13T04:29:29.648426 #1066487] INFO -- : MFLAGS = I, [2024-05-13T04:29:29.648430 #1066487] INFO -- : RUSTC = no I, [2024-05-13T04:29:29.648433 #1066487] INFO -- : YJIT_RUSTC_ARGS = --crate-name=yjit --crate-type=staticlib --edition=2021 -g -C lto=thin -C opt-level=3 -C overflow-checks=on '--out-dir=/tmp/ruby/build/trunk/yjit/target/release/' /tmp/ruby/src/trunk/yjit/src/lib.rs I, [2024-05-13T04:29:29.648975 #1066487] INFO -- : gcc (Ubuntu 11.4.0-1ubuntu1~22.04) 11.4.0 I, [2024-05-13T04:29:29.648995 #1066487] INFO -- : Copyright (C) 2021 Free Software Foundation, Inc. I, [2024-05-13T04:29:29.649001 #1066487] INFO -- : This is free software; see the source for copying conditions. There is NO I, [2024-05-13T04:29:29.649008 #1066487] INFO -- : warranty; not even for MERCHANTABILITY or FITNESS FOR A PARTICULAR PURPOSE. I, [2024-05-13T04:29:29.649014 #1066487] INFO -- : I, [2024-05-13T04:29:29.752539 #1066487] INFO -- : Checking leaked global symbols...none I, [2024-05-13T04:29:29.794233 #1066487] INFO -- : /tmp/ruby/src/trunk/basictest/test.rb:assignment ....................................................................................................................................................................................................................................................................................................................................................................................OK 372 I, [2024-05-13T04:29:29.794301 #1066487] INFO -- : /tmp/ruby/src/trunk/basictest/test.rb:condition ..OK 2 I, [2024-05-13T04:29:29.794310 #1066487] INFO -- : /tmp/ruby/src/trunk/basictest/test.rb:if/unless ...OK 3 I, [2024-05-13T04:29:29.794347 #1066487] INFO -- : /tmp/ruby/src/trunk/basictest/test.rb:case .....OK 5 I, [2024-05-13T04:29:29.794733 #1066487] INFO -- : /tmp/ruby/src/trunk/basictest/test.rb:while/until ........OK 8 I, [2024-05-13T04:29:29.794823 #1066487] INFO -- : /tmp/ruby/src/trunk/basictest/test.rb:exception ..........OK 10 I, [2024-05-13T04:29:29.795293 #1066487] INFO -- : /tmp/ruby/src/trunk/basictest/test.rb:array .......................................OK 39 I, [2024-05-13T04:29:29.795463 #1066487] INFO -- : /tmp/ruby/src/trunk/basictest/test.rb:hash ...........................OK 27 I, [2024-05-13T04:29:29.796664 #1066487] INFO -- : /tmp/ruby/src/trunk/basictest/test.rb:iterator ...........................................................................................................OK 107 I, [2024-05-13T04:29:29.797120 #1066487] INFO -- : /tmp/ruby/src/trunk/basictest/test.rb:float ................................................................................OK 80 I, [2024-05-13T04:29:29.798739 #1066487] INFO -- : /tmp/ruby/src/trunk/basictest/test.rb:bignum ...............................OK 31 I, [2024-05-13T04:29:29.799952 #1066487] INFO -- : /tmp/ruby/src/trunk/basictest/test.rb:string & char ..............................................................OK 62 I, [2024-05-13T04:29:29.800005 #1066487] INFO -- : /tmp/ruby/src/trunk/basictest/test.rb:assignment ..........OK 10 I, [2024-05-13T04:29:29.800053 #1066487] INFO -- : /tmp/ruby/src/trunk/basictest/test.rb:call ......OK 6 I, [2024-05-13T04:29:29.800138 #1066487] INFO -- : /tmp/ruby/src/trunk/basictest/test.rb:proc .........OK 9 I, [2024-05-13T04:29:29.900838 #1066487] INFO -- : /tmp/ruby/src/trunk/basictest/test.rb:signal ..OK 2 I, [2024-05-13T04:29:29.903453 #1066487] INFO -- : /tmp/ruby/src/trunk/basictest/test.rb:eval ...........................OK 27 I, [2024-05-13T04:29:30.025435 #1066487] INFO -- : /tmp/ruby/src/trunk/basictest/test.rb:system ........OK 8 I, [2024-05-13T04:29:30.025511 #1066487] INFO -- : /tmp/ruby/src/trunk/basictest/test.rb:const .....OK 5 I, [2024-05-13T04:29:30.025535 #1066487] INFO -- : /tmp/ruby/src/trunk/basictest/test.rb:clone .....OK 5 I, [2024-05-13T04:29:30.025706 #1066487] INFO -- : /tmp/ruby/src/trunk/basictest/test.rb:marshal ....OK 4 I, [2024-05-13T04:29:30.025774 #1066487] INFO -- : /tmp/ruby/src/trunk/basictest/test.rb:pack ....OK 4 I, [2024-05-13T04:29:30.025796 #1066487] INFO -- : /tmp/ruby/src/trunk/basictest/test.rb:math ..OK 2 I, [2024-05-13T04:29:30.025902 #1066487] INFO -- : /tmp/ruby/src/trunk/basictest/test.rb:struct ......OK 6 I, [2024-05-13T04:29:30.026079 #1066487] INFO -- : /tmp/ruby/src/trunk/basictest/test.rb:variable ............OK 12 I, [2024-05-13T04:29:30.026115 #1066487] INFO -- : /tmp/ruby/src/trunk/basictest/test.rb:trace ...OK 3 I, [2024-05-13T04:29:30.026127 #1066487] INFO -- : /tmp/ruby/src/trunk/basictest/test.rb:defined? ............OK 12 I, [2024-05-13T04:29:30.026177 #1066487] INFO -- : /tmp/ruby/src/trunk/basictest/test.rb:alias ......OK 6 I, [2024-05-13T04:29:30.026658 #1066487] INFO -- : /tmp/ruby/src/trunk/basictest/test.rb:path .......................OK 23 I, [2024-05-13T04:29:30.062438 #1066487] INFO -- : /tmp/ruby/src/trunk/basictest/test.rb:gc ....OK 4 I, [2024-05-13T04:29:30.064929 #1066487] INFO -- : I, [2024-05-13T04:29:30.064955 #1066487] INFO -- : test succeeded I, [2024-05-13T04:29:30.066553 #1066487] INFO -- : $$$[end] "make yes-test-basic TESTS='-j20'" exit with 0. I, [2024-05-13T04:29:30.066648 #1066487] INFO -- : $$$[beg] make yes-test-all TESTOPTS='--stderr-on-failure' TESTS='-j20' I, [2024-05-13T04:29:30.154748 #1066487] INFO -- : BASERUBY = /usr/bin/ruby --disable=gems I, [2024-05-13T04:29:30.154784 #1066487] INFO -- : CC = gcc I, [2024-05-13T04:29:30.154790 #1066487] INFO -- : LD = ld I, [2024-05-13T04:29:30.154793 #1066487] INFO -- : LDSHARED = gcc -shared I, [2024-05-13T04:29:30.154798 #1066487] INFO -- : CFLAGS = -O3 -fno-fast-math -ggdb3 -Wall -Wextra -Wdeprecated-declarations -Wdiv-by-zero -Wduplicated-cond -Wimplicit-function-declaration -Wimplicit-int -Wpointer-arith -Wwrite-strings -Wold-style-definition -Wimplicit-fallthrough=0 -Wmissing-noreturn -Wno-cast-function-type -Wno-constant-logical-operand -Wno-long-long -Wno-missing-field-initializers -Wno-overlength-strings -Wno-packed-bitfield-compat -Wno-parentheses-equality -Wno-self-assign -Wno-tautological-compare -Wno-unused-parameter -Wno-unused-value -Wsuggest-attribute=format -Wsuggest-attribute=noreturn -Wunused-variable -Wmisleading-indentation -Wundef -fPIC I, [2024-05-13T04:29:30.154814 #1066487] INFO -- : XCFLAGS = -U_FORTIFY_SOURCE -D_FORTIFY_SOURCE=2 -fstack-protector-strong -fno-strict-overflow -fvisibility=hidden -fexcess-precision=standard -DRUBY_EXPORT -I. -I.ext/include/x86_64-linux -I/tmp/ruby/src/trunk/include -I/tmp/ruby/src/trunk -I/tmp/ruby/src/trunk/prism -I/tmp/ruby/src/trunk/enc/unicode/15.0.0 I, [2024-05-13T04:29:30.154818 #1066487] INFO -- : CPPFLAGS = I, [2024-05-13T04:29:30.154822 #1066487] INFO -- : DLDFLAGS = -Wl,--compress-debug-sections=zlib -Wl,-soname,libruby.so.3.4 -fstack-protector-strong I, [2024-05-13T04:29:30.154826 #1066487] INFO -- : SOLIBS = -lz -lrt -lrt -lgmp -ldl -lcrypt -lm -lpthread I, [2024-05-13T04:29:30.154829 #1066487] INFO -- : LANG = en_US.UTF-8 I, [2024-05-13T04:29:30.154833 #1066487] INFO -- : LC_ALL = I, [2024-05-13T04:29:30.154836 #1066487] INFO -- : LC_CTYPE = I, [2024-05-13T04:29:30.154840 #1066487] INFO -- : MFLAGS = I, [2024-05-13T04:29:30.154845 #1066487] INFO -- : RUSTC = no I, [2024-05-13T04:29:30.154849 #1066487] INFO -- : YJIT_RUSTC_ARGS = --crate-name=yjit --crate-type=staticlib --edition=2021 -g -C lto=thin -C opt-level=3 -C overflow-checks=on '--out-dir=/tmp/ruby/build/trunk/yjit/target/release/' /tmp/ruby/src/trunk/yjit/src/lib.rs I, [2024-05-13T04:29:30.155450 #1066487] INFO -- : gcc (Ubuntu 11.4.0-1ubuntu1~22.04) 11.4.0 I, [2024-05-13T04:29:30.155470 #1066487] INFO -- : Copyright (C) 2021 Free Software Foundation, Inc. I, [2024-05-13T04:29:30.155477 #1066487] INFO -- : This is free software; see the source for copying conditions. There is NO I, [2024-05-13T04:29:30.155481 #1066487] INFO -- : warranty; not even for MERCHANTABILITY or FITNESS FOR A PARTICULAR PURPOSE. I, [2024-05-13T04:29:30.155485 #1066487] INFO -- : I, [2024-05-13T04:29:30.157195 #1066487] INFO -- : generating enc.mk I, [2024-05-13T04:29:30.273751 #1066487] INFO -- : making enc I, [2024-05-13T04:29:30.290711 #1066487] INFO -- : make[1]: Entering directory '/tmp/ruby/build/trunk' I, [2024-05-13T04:29:30.290741 #1066487] INFO -- : make[1]: Nothing to be done for 'enc'. I, [2024-05-13T04:29:30.290749 #1066487] INFO -- : make[1]: Leaving directory '/tmp/ruby/build/trunk' I, [2024-05-13T04:29:30.291442 #1066487] INFO -- : making srcs under enc I, [2024-05-13T04:29:30.321619 #1066487] INFO -- : make[1]: Entering directory '/tmp/ruby/build/trunk' I, [2024-05-13T04:29:30.321641 #1066487] INFO -- : make[1]: Nothing to be done for 'srcs'. I, [2024-05-13T04:29:30.321646 #1066487] INFO -- : make[1]: Leaving directory '/tmp/ruby/build/trunk' I, [2024-05-13T04:29:30.322647 #1066487] INFO -- : generating transdb.h I, [2024-05-13T04:29:30.418636 #1066487] INFO -- : transdb.h unchanged I, [2024-05-13T04:29:30.419933 #1066487] INFO -- : making trans I, [2024-05-13T04:29:30.453489 #1066487] INFO -- : make[1]: Entering directory '/tmp/ruby/build/trunk' I, [2024-05-13T04:29:30.453510 #1066487] INFO -- : make[1]: Nothing to be done for 'trans'. I, [2024-05-13T04:29:30.453515 #1066487] INFO -- : make[1]: Leaving directory '/tmp/ruby/build/trunk' I, [2024-05-13T04:29:30.454274 #1066487] INFO -- : making encs I, [2024-05-13T04:29:30.491656 #1066487] INFO -- : make[1]: Entering directory '/tmp/ruby/build/trunk' I, [2024-05-13T04:29:30.491677 #1066487] INFO -- : make[1]: Nothing to be done for 'encs'. I, [2024-05-13T04:29:30.491682 #1066487] INFO -- : make[1]: Leaving directory '/tmp/ruby/build/trunk' I, [2024-05-13T04:29:30.493453 #1066487] INFO -- : generating makefiles ext/configure-ext.mk I, [2024-05-13T04:29:30.519999 #1066487] INFO -- : ext/configure-ext.mk updated I, [2024-05-13T04:29:30.522550 #1066487] INFO -- : make[1]: Entering directory '/tmp/ruby/build/trunk' I, [2024-05-13T04:29:31.868204 #1066487] INFO -- : make[1]: Leaving directory '/tmp/ruby/build/trunk' I, [2024-05-13T04:29:31.869105 #1066487] INFO -- : generating makefile exts.mk I, [2024-05-13T04:29:31.905465 #1066487] INFO -- : exts.mk unchanged I, [2024-05-13T04:29:31.909958 #1066487] INFO -- : make[1]: Entering directory '/tmp/ruby/build/trunk' I, [2024-05-13T04:29:32.222711 #1066487] INFO -- : make[2]: Entering directory '/tmp/ruby/build/trunk/ext/coverage' I, [2024-05-13T04:29:32.226932 #1066487] INFO -- : make[2]: Leaving directory '/tmp/ruby/build/trunk/ext/coverage' I, [2024-05-13T04:29:32.233783 #1066487] INFO -- : make[2]: Entering directory '/tmp/ruby/build/trunk/ext/date' I, [2024-05-13T04:29:32.238969 #1066487] INFO -- : make[2]: Leaving directory '/tmp/ruby/build/trunk/ext/date' I, [2024-05-13T04:29:32.242792 #1066487] INFO -- : make[2]: Entering directory '/tmp/ruby/build/trunk/ext/digest' I, [2024-05-13T04:29:32.251817 #1066487] INFO -- : make[2]: Leaving directory '/tmp/ruby/build/trunk/ext/digest' I, [2024-05-13T04:29:32.277970 #1066487] INFO -- : make[2]: Entering directory '/tmp/ruby/build/trunk/ext/digest/sha2' I, [2024-05-13T04:29:32.282830 #1066487] INFO -- : make[2]: Leaving directory '/tmp/ruby/build/trunk/ext/digest/sha2' I, [2024-05-13T04:29:32.303120 #1066487] INFO -- : make[2]: Entering directory '/tmp/ruby/build/trunk/ext/fiddle' I, [2024-05-13T04:29:32.310322 #1066487] INFO -- : make[2]: Leaving directory '/tmp/ruby/build/trunk/ext/fiddle' I, [2024-05-13T04:29:32.314224 #1066487] INFO -- : make[2]: Entering directory '/tmp/ruby/build/trunk/ext/io/console' I, [2024-05-13T04:29:32.318520 #1066487] INFO -- : make[2]: Leaving directory '/tmp/ruby/build/trunk/ext/io/console' I, [2024-05-13T04:29:32.330284 #1066487] INFO -- : make[2]: Entering directory '/tmp/ruby/build/trunk/ext/json' I, [2024-05-13T04:29:32.340980 #1066487] INFO -- : make[2]: Leaving directory '/tmp/ruby/build/trunk/ext/json' I, [2024-05-13T04:29:32.355782 #1066487] INFO -- : make[2]: Entering directory '/tmp/ruby/build/trunk/ext/monitor' I, [2024-05-13T04:29:32.359724 #1066487] INFO -- : make[2]: Leaving directory '/tmp/ruby/build/trunk/ext/monitor' I, [2024-05-13T04:29:32.366575 #1066487] INFO -- : make[2]: Entering directory '/tmp/ruby/build/trunk/ext/objspace' I, [2024-05-13T04:29:32.371421 #1066487] INFO -- : make[2]: Leaving directory '/tmp/ruby/build/trunk/ext/objspace' I, [2024-05-13T04:29:32.387389 #1066487] INFO -- : make[2]: Entering directory '/tmp/ruby/build/trunk/ext/openssl' I, [2024-05-13T04:29:32.401765 #1066487] INFO -- : make[2]: Leaving directory '/tmp/ruby/build/trunk/ext/openssl' I, [2024-05-13T04:29:32.404848 #1066487] INFO -- : make[2]: Entering directory '/tmp/ruby/build/trunk/ext/pathname' I, [2024-05-13T04:29:32.408178 #1066487] INFO -- : make[2]: Leaving directory '/tmp/ruby/build/trunk/ext/pathname' I, [2024-05-13T04:29:32.414401 #1066487] INFO -- : make[2]: Entering directory '/tmp/ruby/build/trunk/ext/psych' I, [2024-05-13T04:29:32.434987 #1066487] INFO -- : make[2]: Leaving directory '/tmp/ruby/build/trunk/ext/psych' I, [2024-05-13T04:29:32.438248 #1066487] INFO -- : make[2]: Entering directory '/tmp/ruby/build/trunk/ext/pty' I, [2024-05-13T04:29:32.441428 #1066487] INFO -- : make[2]: Leaving directory '/tmp/ruby/build/trunk/ext/pty' I, [2024-05-13T04:29:32.457014 #1066487] INFO -- : make[2]: Entering directory '/tmp/ruby/build/trunk/ext/ripper' I, [2024-05-13T04:29:32.464150 #1066487] INFO -- : make[2]: Leaving directory '/tmp/ruby/build/trunk/ext/ripper' I, [2024-05-13T04:29:32.466501 #1066487] INFO -- : make[2]: Entering directory '/tmp/ruby/build/trunk/ext/rubyvm' I, [2024-05-13T04:29:32.469772 #1066487] INFO -- : make[2]: Leaving directory '/tmp/ruby/build/trunk/ext/rubyvm' I, [2024-05-13T04:29:32.480978 #1066487] INFO -- : make[2]: Entering directory '/tmp/ruby/build/trunk/ext/socket' I, [2024-05-13T04:29:32.487900 #1066487] INFO -- : make[2]: Leaving directory '/tmp/ruby/build/trunk/ext/socket' I, [2024-05-13T04:29:32.504303 #1066487] INFO -- : make[2]: Entering directory '/tmp/ruby/build/trunk/.bundle/gems/bigdecimal-3.1.8/ext/bigdecimal' I, [2024-05-13T04:29:32.530813 #1066487] INFO -- : make[2]: Leaving directory '/tmp/ruby/build/trunk/.bundle/gems/bigdecimal-3.1.8/ext/bigdecimal' I, [2024-05-13T04:29:32.532588 #1066487] INFO -- : make[2]: Entering directory '/tmp/ruby/build/trunk/.bundle/gems/debug-1.9.2/ext/debug' I, [2024-05-13T04:29:32.556779 #1066487] INFO -- : make[2]: Leaving directory '/tmp/ruby/build/trunk/.bundle/gems/debug-1.9.2/ext/debug' I, [2024-05-13T04:29:32.558671 #1066487] INFO -- : make[2]: Entering directory '/tmp/ruby/build/trunk/.bundle/gems/nkf-0.2.0/ext/nkf' I, [2024-05-13T04:29:32.579827 #1066487] INFO -- : make[2]: Leaving directory '/tmp/ruby/build/trunk/.bundle/gems/nkf-0.2.0/ext/nkf' I, [2024-05-13T04:29:32.581976 #1066487] INFO -- : make[2]: Entering directory '/tmp/ruby/build/trunk/.bundle/gems/racc-1.7.3/ext/racc/cparse' I, [2024-05-13T04:29:32.603572 #1066487] INFO -- : make[2]: Leaving directory '/tmp/ruby/build/trunk/.bundle/gems/racc-1.7.3/ext/racc/cparse' I, [2024-05-13T04:29:32.605967 #1066487] INFO -- : make[2]: Entering directory '/tmp/ruby/build/trunk/.bundle/gems/rbs-3.4.4/ext/rbs_extension' I, [2024-05-13T04:29:32.627020 #1066487] INFO -- : make[2]: Leaving directory '/tmp/ruby/build/trunk/.bundle/gems/rbs-3.4.4/ext/rbs_extension' I, [2024-05-13T04:29:32.628951 #1066487] INFO -- : make[2]: Entering directory '/tmp/ruby/build/trunk/.bundle/gems/syslog-0.1.2/ext/syslog' I, [2024-05-13T04:29:32.650053 #1066487] INFO -- : make[2]: Leaving directory '/tmp/ruby/build/trunk/.bundle/gems/syslog-0.1.2/ext/syslog' I, [2024-05-13T04:29:32.673235 #1066487] INFO -- : make[2]: Entering directory '/tmp/ruby/build/trunk' I, [2024-05-13T04:29:32.750106 #1066487] INFO -- : make[2]: 'ruby' is up to date. I, [2024-05-13T04:29:32.750145 #1066487] INFO -- : make[2]: Leaving directory '/tmp/ruby/build/trunk' I, [2024-05-13T04:29:32.750461 #1066487] INFO -- : make[1]: Leaving directory '/tmp/ruby/build/trunk' I, [2024-05-13T04:29:32.754142 #1066487] INFO -- : make[1]: Entering directory '/tmp/ruby/build/trunk' I, [2024-05-13T04:29:32.754164 #1066487] INFO -- : make[1]: Nothing to be done for 'note'. I, [2024-05-13T04:29:32.754170 #1066487] INFO -- : make[1]: Leaving directory '/tmp/ruby/build/trunk' I, [2024-05-13T04:29:32.837390 #1066487] INFO -- : Run options: I, [2024-05-13T04:29:32.837448 #1066487] INFO -- : --seed=58736 I, [2024-05-13T04:29:32.837455 #1066487] INFO -- : "--ruby=./miniruby -I/tmp/ruby/src/trunk/lib -I. -I.ext/common /tmp/ruby/src/trunk/tool/runruby.rb --extout=.ext -- --disable-gems" I, [2024-05-13T04:29:32.837460 #1066487] INFO -- : --excludes-dir=/tmp/ruby/src/trunk/test/.excludes I, [2024-05-13T04:29:32.837463 #1066487] INFO -- : --name=!/memory_leak/ I, [2024-05-13T04:29:32.837467 #1066487] INFO -- : --stderr-on-failure I, [2024-05-13T04:29:32.837471 #1066487] INFO -- : -j20 I, [2024-05-13T04:29:32.837474 #1066487] INFO -- : I, [2024-05-13T04:29:32.837478 #1066487] INFO -- : # Running tests: I, [2024-05-13T04:29:32.837482 #1066487] INFO -- : I, [2024-05-13T04:29:32.985096 #1066487] INFO -- : [ 1/885] 1107858=test_gem_source_installed I, [2024-05-13T04:29:32.985156 #1066487] INFO -- : [ 2/885] 1107856=test_erb I, [2024-05-13T04:29:32.985365 #1066487] INFO -- : [ 3/885] 1107859=test_x509ext I, [2024-05-13T04:29:32.985399 #1066487] INFO -- : [ 4/885] 1107855=test_completion I, [2024-05-13T04:29:32.987179 #1066487] INFO -- : [ 5/885] 1107860=test_gem_commands_cert_command I, [2024-05-13T04:29:32.988111 #1066487] INFO -- : [ 6/885] 1107872=test_yield_block I, [2024-05-13T04:29:32.988208 #1066487] INFO -- : [ 7/885] 1107873=test_len I, [2024-05-13T04:29:32.988538 #1066487] INFO -- : [ 8/885] 1107869=test_rational2 I, [2024-05-13T04:29:32.988684 #1066487] INFO -- : [ 9/885] 1107874=test_rational I, [2024-05-13T04:29:32.991126 #1066487] INFO -- : [ 10/885] 1107870=test_propertyputref I, [2024-05-13T04:29:32.991186 #1066487] INFO -- : [ 11/885] 1107870=attribute_write_test I, [2024-05-13T04:29:32.991717 #1066487] INFO -- : [ 12/885] 1107873=test_spell_checker I, [2024-05-13T04:29:32.991763 #1066487] INFO -- : [ 13/885] 1107868=test_assembler I, [2024-05-13T04:29:32.992225 #1066487] INFO -- : [ 14/885] 1107872=test_nesting_parser I, [2024-05-13T04:29:32.994770 #1066487] INFO -- : [ 15/885] 1107871=test_win32ole_method_event I, [2024-05-13T04:29:32.994829 #1066487] INFO -- : [ 16/885] 1107868=test_benchmark I, [2024-05-13T04:29:33.001478 #1066487] INFO -- : [ 17/885] 1107871=test_gem_dependency_list I, [2024-05-13T04:29:33.001537 #1066487] INFO -- : [ 18/885] 1107869=test_helper_method I, [2024-05-13T04:29:33.002451 #1066487] INFO -- : [ 19/885] 1107873=test_gem_package_tar_writer I, [2024-05-13T04:29:33.017070 #1066487] INFO -- : [ 20/885] 1107874=test_array I, [2024-05-13T04:29:33.018513 #1066487] INFO -- : [ 21/885] 1107857=test_gem_commands_outdated_command I, [2024-05-13T04:29:33.021332 #1066487] INFO -- : [ 22/885] 1107861=test_scalar_scanner I, [2024-05-13T04:29:33.021422 #1066487] INFO -- : [ 23/885] 1107862=test_gem_source I, [2024-05-13T04:29:33.021517 #1066487] INFO -- : [ 24/885] 1107863=test_yamldbm I, [2024-05-13T04:29:33.021622 #1066487] INFO -- : [ 25/885] 1107864=test_gem_commands_rebuild_command I, [2024-05-13T04:29:33.021716 #1066487] INFO -- : [ 26/885] 1107865=test_load I, [2024-05-13T04:29:33.021817 #1066487] INFO -- : [ 27/885] 1107866=test_rdoc_parser_simple I, [2024-05-13T04:29:33.021930 #1066487] INFO -- : [ 28/885] 1107867=test_provider I, [2024-05-13T04:29:33.036310 #1066487] INFO -- : [ 29/885] 1107865=test_abi I, [2024-05-13T04:29:33.043534 #1066487] INFO -- : [ 30/885] 1107859=test_evaluation I, [2024-05-13T04:29:33.053555 #1066487] INFO -- : [ 31/885] 1107856=test_gem_ext_builder I, [2024-05-13T04:29:33.059857 #1066487] INFO -- : [ 32/885] 1107859=test_https I, [2024-05-13T04:29:33.064178 #1066487] INFO -- : [ 33/885] 1107861=test_monitor I, [2024-05-13T04:29:33.074169 #1066487] INFO -- : [ 34/885] 1107863=test_buffered_io I, [2024-05-13T04:29:33.082609 #1066487] INFO -- : [ 35/885] 1107870=test_rubyvm I, [2024-05-13T04:29:33.085252 #1066487] INFO -- : [ 36/885] 1107870=test_configuration I, [2024-05-13T04:29:33.093290 #1066487] INFO -- : [ 37/885] 1107872=test_rdoc_generator_markup I, [2024-05-13T04:29:33.133282 #1066487] INFO -- : [ 38/885] 1107869=test_whileuntil I, [2024-05-13T04:29:33.137244 #1066487] INFO -- : [ 39/885] 1107869=test_boolean I, [2024-05-13T04:29:33.162771 #1066487] INFO -- : [ 40/885] 1107858=integer_parse_test I, [2024-05-13T04:29:33.170549 #1066487] INFO -- : [ 41/885] 1107869=test_instrumentation_api I, [2024-05-13T04:29:33.172181 #1066487] INFO -- : [ 42/885] 1107870=test_stringify_symbols I, [2024-05-13T04:29:33.182833 #1066487] INFO -- : [ 43/885] 1107870=test_ssl I, [2024-05-13T04:29:33.194214 #1066487] INFO -- : [ 44/885] 1107863=test_gem_ext_cargo_builder I, [2024-05-13T04:29:33.195295 #1066487] INFO -- : [ 45/885] 1107866=constant_path_node_test I, [2024-05-13T04:29:33.205721 #1066487] INFO -- : [ 46/885] 1107871=test_gem_request_set I, [2024-05-13T04:29:33.211894 #1066487] INFO -- : [ 47/885] 1107872=test_module I, [2024-05-13T04:29:33.222785 #1066487] INFO -- : [ 48/885] 1107858=test_parser I, [2024-05-13T04:29:33.231023 #1066487] INFO -- : [ 49/885] 1107865=test_method_name_check I, [2024-05-13T04:29:33.249380 #1066487] INFO -- : [ 50/885] 1107873=test_arith_seq_extract I, [2024-05-13T04:29:33.261627 #1066487] INFO -- : [ 51/885] 1107865=test_key_error I, [2024-05-13T04:29:33.263749 #1066487] INFO -- : [ 52/885] 1107865=test_div I, [2024-05-13T04:29:33.263833 #1066487] INFO -- : [ 53/885] 1107858=test_allocation I, [2024-05-13T04:29:33.273219 #1066487] INFO -- : [ 54/885] 1107865=test_engine I, [2024-05-13T04:29:33.278057 #1066487] INFO -- : [ 55/885] 1107861=test_win32ole_variant_m I, [2024-05-13T04:29:33.278835 #1066487] INFO -- : [ 56/885] 1107861=test_deprecated I, [2024-05-13T04:29:33.281881 #1066487] INFO -- : [ 57/885] 1107866=test_color_printer I, [2024-05-13T04:29:33.285913 #1066487] INFO -- : [ 58/885] 1107864=test_serialize_subclasses I, [2024-05-13T04:29:33.286760 #1066487] INFO -- : [ 59/885] 1107861=test_insns_leaf I, [2024-05-13T04:29:33.290301 #1066487] INFO -- : [ 60/885] 1107864=test_gem_path_support I, [2024-05-13T04:29:33.291584 #1066487] INFO -- : [ 61/885] 1107861=test_struct I, [2024-05-13T04:29:33.298860 #1066487] INFO -- : [ 62/885] 1107865=test_set I, [2024-05-13T04:29:33.310313 #1066487] INFO -- : [ 63/885] 1107864=test_files_test_1 I, [2024-05-13T04:29:33.311916 #1066487] INFO -- : [ 64/885] 1107857=test_rdoc_rd_inline I, [2024-05-13T04:29:33.332428 #1066487] INFO -- : [ 65/885] 1107865=test_mutex I, [2024-05-13T04:29:33.368996 #1066487] INFO -- : [ 66/885] 1107866=test_x509req I, [2024-05-13T04:29:33.391838 #1066487] INFO -- : [ 67/885] 1107863=json_common_interface_test I, [2024-05-13T04:29:33.405035 #1066487] INFO -- : [ 68/885] 1107873=test_dln I, [2024-05-13T04:29:33.405719 #1066487] INFO -- : [ 69/885] 1107873=test_gem_source_subpath_problem I, [2024-05-13T04:29:33.412672 #1066487] INFO -- : [ 70/885] 1107863=test_win32ole_variant_outarg I, [2024-05-13T04:29:33.421121 #1066487] INFO -- : [ 71/885] 1107863=test_config I, [2024-05-13T04:29:33.432671 #1066487] INFO -- : [ 72/885] 1107867=memsize_test I, [2024-05-13T04:29:33.444922 #1066487] INFO -- : [ 73/885] 1107863=test_nomethod_error I, [2024-05-13T04:29:33.449020 #1066487] INFO -- : [ 74/885] 1107857=json_parser_test I, [2024-05-13T04:29:33.449487 #1066487] INFO -- : [ 75/885] 1107862=test_cparser I, [2024-05-13T04:29:33.453179 #1066487] INFO -- : [ 76/885] 1107863=test_pkg_config I, [2024-05-13T04:29:33.464745 #1066487] INFO -- : [ 77/885] 1107859=test_variable I, [2024-05-13T04:29:33.498002 #1066487] INFO -- : [ 78/885] 1107863=test_rdoc_markup_include I, [2024-05-13T04:29:33.502830 #1066487] INFO -- : [ 79/885] 1107857=test_sexp I, [2024-05-13T04:29:33.504992 #1066487] INFO -- : [ 80/885] 1107867=fuzzer_test I, [2024-05-13T04:29:33.514968 #1066487] INFO -- : [ 81/885] 1107867=magic_comment_test I, [2024-05-13T04:29:33.520061 #1066487] INFO -- : [ 82/885] 1107867=test_rdoc_markup_to_html_snippet I, [2024-05-13T04:29:33.531163 #1066487] INFO -- : [ 83/885] 1107873=test_struct I, [2024-05-13T04:29:33.535613 #1066487] INFO -- : [ 84/885] 1107857=test_omap I, [2024-05-13T04:29:33.537298 #1066487] INFO -- : [ 85/885] 1107873=test_iterator I, [2024-05-13T04:29:33.544636 #1066487] INFO -- : [ 86/885] 1107857=test_string I, [2024-05-13T04:29:33.548139 #1066487] INFO -- : [ 87/885] 1107857=test_digest_extend I, [2024-05-13T04:29:33.556241 #1066487] INFO -- : [ 88/885] 1107871=test_shellwords I, [2024-05-13T04:29:33.559158 #1066487] INFO -- : [ 89/885] 1107857=test_memory_view I, [2024-05-13T04:29:33.562498 #1066487] INFO -- : [ 90/885] 1107871=pattern_test I, [2024-05-13T04:29:33.565380 #1066487] INFO -- : [ 91/885] 1107866=test_debug I, [2024-05-13T04:29:33.568023 #1066487] INFO -- : [ 92/885] 1107866=test_gem_security_signer I, [2024-05-13T04:29:33.568711 #1066487] INFO -- : [ 93/885] 1107859=test_cipher I, [2024-05-13T04:29:33.584180 #1066487] INFO -- : [ 94/885] 1107857=test_new I, [2024-05-13T04:29:33.587438 #1066487] INFO -- : [ 95/885] 1107857=test_storage I, [2024-05-13T04:29:33.588731 #1066487] INFO -- : [ 96/885] 1107855=test_gem_resolver_git_set I, [2024-05-13T04:29:33.591160 #1066487] INFO -- : [ 97/885] 1107857=test_cgi_cookie I, [2024-05-13T04:29:33.603517 #1066487] INFO -- : [ 98/885] 1107859=test_require I, [2024-05-13T04:29:33.607040 #1066487] INFO -- : [ 99/885] 1107857=test_float I, [2024-05-13T04:29:33.623712 #1066487] INFO -- : [100/885] 1107873=test_gem_resolver_installer_set I, [2024-05-13T04:29:33.646618 #1066487] INFO -- : [101/885] 1107863=test_dir_m17n I, [2024-05-13T04:29:33.669218 #1066487] INFO -- : [102/885] 1107862=test_gem_source_git I, [2024-05-13T04:29:33.684198 #1066487] INFO -- : [103/885] 1107871=test_gem_commands_signout_command I, [2024-05-13T04:29:33.699868 #1066487] INFO -- : [104/885] 1107871=test_refinement I, [2024-05-13T04:29:33.716102 #1066487] INFO -- : [105/885] 1107867=test_regex_casefold I, [2024-05-13T04:29:33.750762 #1066487] INFO -- : [106/885] 1107866=test_x509crl I, [2024-05-13T04:29:33.864549 #1066487] INFO -- : [107/885] 1107873=test_fixnum I, [2024-05-13T04:29:33.875042 #1066487] INFO -- : [108/885] 1107873=test_signal I, [2024-05-13T04:29:33.882731 #1066487] INFO -- : [109/885] 1107866=test_metaclass I, [2024-05-13T04:29:33.888632 #1066487] INFO -- : [110/885] 1107866=test_rdoc_top_level I, [2024-05-13T04:29:34.002162 #1066487] INFO -- : [111/885] 1107861=test_rdoc_rd I, [2024-05-13T04:29:34.011736 #1066487] INFO -- : [112/885] 1107867=test_cgi_session I, [2024-05-13T04:29:34.024852 #1066487] INFO -- : [113/885] 1107867=test_input_method I, [2024-05-13T04:29:34.039961 #1066487] INFO -- : [114/885] 1107855=test_windows_1252 I, [2024-05-13T04:29:34.042593 #1066487] INFO -- : [115/885] 1107855=test_process I, [2024-05-13T04:29:34.063668 #1066487] INFO -- : [116/885] 1107855=test_popen_deadlock I, [2024-05-13T04:29:34.081508 #1066487] INFO -- : [117/885] 1107860=test_delegate I, [2024-05-13T04:29:34.092963 #1066487] INFO -- : [118/885] 1107860=test_date_marshal I, [2024-05-13T04:29:34.093347 #1066487] INFO -- : [119/885] 1107866=test_mkmf I, [2024-05-13T04:29:34.103206 #1066487] INFO -- : [120/885] 1107860=test_history I, [2024-05-13T04:29:34.115122 #1066487] INFO -- : [121/885] 1107866=test_recursion I, [2024-05-13T04:29:34.118054 #1066487] INFO -- : [122/885] 1107866=test_exit I, [2024-05-13T04:29:34.125939 #1066487] INFO -- : [123/885] 1107867=test_digest I, [2024-05-13T04:29:34.139633 #1066487] INFO -- : [124/885] 1107867=test_rdoc_servlet I, [2024-05-13T04:29:34.143606 #1066487] INFO -- : [125/885] 1107868=test_gem_security I, [2024-05-13T04:29:34.157902 #1066487] INFO -- : [126/885] 1107862=test_ractor I, [2024-05-13T04:29:34.175712 #1066487] INFO -- : [127/885] 1107861=test_open3 I, [2024-05-13T04:29:34.188831 #1066487] INFO -- : [128/885] 1107862=test_fiber I, [2024-05-13T04:29:34.198101 #1066487] INFO -- : [129/885] 1107860=test_multi_irb_commands I, [2024-05-13T04:29:34.200265 #1066487] INFO -- : [130/885] 1107860=test_closure I, [2024-05-13T04:29:34.206347 #1066487] INFO -- : [131/885] 1107866=test_bundled_ca I, [2024-05-13T04:29:34.261392 #1066487] INFO -- : [132/885] 1107867=test_within_pipe I, [2024-05-13T04:29:34.268625 #1066487] INFO -- : [133/885] 1107856=test_gem_bundler_version_finder I, [2024-05-13T04:29:34.290373 #1066487] INFO -- : [134/885] 1107867=test_emoji_breaks I, [2024-05-13T04:29:34.292713 #1066487] INFO -- : [135/885] 1107867=reflection_test I, [2024-05-13T04:29:34.296304 #1066487] INFO -- : [136/885] 1107867=test_beginendblock I, [2024-05-13T04:29:34.300976 #1066487] INFO -- : [137/885] 1107856=test_gem_commands_unpack_command I, [2024-05-13T04:29:34.452369 #1066487] INFO -- : [138/885] 1107860=test_files_lib I, [2024-05-13T04:29:34.465654 #1066487] INFO -- : [139/885] 1107865=test_help I, [2024-05-13T04:29:34.475041 #1066487] INFO -- : [140/885] 1107865=test_rdoc_markup_to_bs I, [2024-05-13T04:29:34.623116 #1066487] INFO -- : [141/885] 1107865=test_printf I, [2024-05-13T04:29:34.632222 #1066487] INFO -- : [142/885] 1107865=test_rdoc_markup_pre_process I, [2024-05-13T04:29:34.637343 #1066487] INFO -- : [143/885] 1107855=test_stream I, [2024-05-13T04:29:34.641235 #1066487] INFO -- : [144/885] 1107856=test_webauthn_listener_response I, [2024-05-13T04:29:34.661008 #1066487] INFO -- : [145/885] 1107855=test_time I, [2024-05-13T04:29:34.664548 #1066487] INFO -- : [146/885] 1107856=test_to_ary_concat I, [2024-05-13T04:29:34.669761 #1066487] INFO -- : [147/885] 1107865=test_pinned I, [2024-05-13T04:29:34.681760 #1066487] INFO -- : [148/885] 1107867=test_iseq I, [2024-05-13T04:29:34.687287 #1066487] INFO -- : [149/885] 1107865=test_exception_at_throwing I, [2024-05-13T04:29:34.736167 #1066487] INFO -- : [150/885] 1107865=test_rdoc_markup_heading I, [2024-05-13T04:29:34.750263 #1066487] INFO -- : [151/885] 1107865=test_class I, [2024-05-13T04:29:34.769710 #1066487] INFO -- : [152/885] 1107865=test_ocsp I, [2024-05-13T04:29:34.785560 #1066487] INFO -- : [153/885] 1107872=test_pkey_dsa I, [2024-05-13T04:29:34.789556 #1066487] INFO -- : [154/885] 1107855=test_scheduler I, [2024-05-13T04:29:34.902065 #1066487] INFO -- : [155/885] 1107857=test_gem_commands_build_command I, [2024-05-13T04:29:34.926624 #1066487] INFO -- : [156/885] 1107855=test_case_comprehensive I, [2024-05-13T04:29:35.021126 #1066487] INFO -- : [157/885] 1107865=test_interned_str I, [2024-05-13T04:29:35.039605 #1066487] INFO -- : [158/885] 1107863=test_did_you_mean I, [2024-05-13T04:29:35.043468 #1066487] INFO -- : [159/885] 1107865=test_variable_name_check I, [2024-05-13T04:29:35.091821 #1066487] INFO -- : [160/885] 1107865=test_io_m17n I, [2024-05-13T04:29:35.166248 #1066487] INFO -- : [161/885] 1107863=test_gem_commands_server_command I, [2024-05-13T04:29:35.176132 #1066487] INFO -- : [162/885] 1107863=test_option I, [2024-05-13T04:29:35.215149 #1066487] INFO -- : [163/885] 1107857=test_append I, [2024-05-13T04:29:35.232257 #1066487] INFO -- : [164/885] 1107857=test_tracer I, [2024-05-13T04:29:35.255121 #1066487] INFO -- : [165/885] 1107867=test_cmethod I, [2024-05-13T04:29:35.258746 #1066487] INFO -- : [166/885] 1107867=test_rdoc_method_attr I, [2024-05-13T04:29:35.269643 #1066487] INFO -- : [167/885] 1107863=static_literals_test I, [2024-05-13T04:29:35.302836 #1066487] INFO -- : [168/885] 1107874=test_data I, [2024-05-13T04:29:35.304833 #1066487] INFO -- : [169/885] 1107874=test_gem_gem_runner I, [2024-05-13T04:29:35.353375 #1066487] INFO -- : [170/885] 1107863=test_filter I, [2024-05-13T04:29:35.373633 #1066487] INFO -- : [171/885] 1107857=test_rdoc_generator_pot I, [2024-05-13T04:29:35.383845 #1066487] INFO -- : [172/885] 1107863=test_unicode I, [2024-05-13T04:29:35.397105 #1066487] INFO -- : [173/885] 1107867=test_koi8 I, [2024-05-13T04:29:35.401430 #1066487] INFO -- : [174/885] 1107867=parameters_signature_test I, [2024-05-13T04:29:35.409878 #1066487] INFO -- : [175/885] 1107867=test_rdoc_parser_changelog I, [2024-05-13T04:29:35.411869 #1066487] INFO -- : [176/885] 1107856=test_enumerator I, [2024-05-13T04:29:35.417289 #1066487] INFO -- : [177/885] 1107856=test_lexer I, [2024-05-13T04:29:35.419036 #1066487] INFO -- : [178/885] 1107857=test_thread_cv I, [2024-05-13T04:29:35.434028 #1066487] INFO -- : [179/885] 1107856=test_ssl_session I, [2024-05-13T04:29:35.434495 #1066487] INFO -- : [180/885] 1107863=test_gem_commands_update_command I, [2024-05-13T04:29:35.480310 #1066487] INFO -- : [181/885] 1107867=test_gem_resolver_vendor_specification I, [2024-05-13T04:29:35.495923 #1066487] INFO -- : [182/885] 1107864=test_random I, [2024-05-13T04:29:35.503972 #1066487] INFO -- : [183/885] 1107864=test_notimplement I, [2024-05-13T04:29:35.506766 #1066487] INFO -- : [184/885] 1107864=test_key_event_record I, [2024-05-13T04:29:35.554553 #1066487] INFO -- : [185/885] 1107864=test_gem_uri I, [2024-05-13T04:29:35.557723 #1066487] INFO -- : [186/885] 1107874=test_bug-14834 I, [2024-05-13T04:29:35.587301 #1066487] INFO -- : [187/885] 1107864=test_rdoc_markup_to_html I, [2024-05-13T04:29:35.631356 #1066487] INFO -- : [188/885] 1107858=test_date_compat I, [2024-05-13T04:29:35.635555 #1066487] INFO -- : [189/885] 1107858=test_compile_prism I, [2024-05-13T04:29:35.641903 #1066487] INFO -- : [190/885] 1107874=test_terminfo I, [2024-05-13T04:29:35.649402 #1066487] INFO -- : [191/885] 1107867=test_win32ole_param_event I, [2024-05-13T04:29:35.658873 #1066487] INFO -- : [192/885] 1107867=test_bn I, [2024-05-13T04:29:35.681218 #1066487] INFO -- : [193/885] 1107867=test_case_mapping I, [2024-05-13T04:29:35.684975 #1066487] INFO -- : [194/885] 1107874=redundant_return_test I, [2024-05-13T04:29:35.689549 #1066487] INFO -- : [195/885] 1107867=test_path I, [2024-05-13T04:29:35.693662 #1066487] INFO -- : [196/885] 1107867=test_tree_spell_checker I, [2024-05-13T04:29:35.735230 #1066487] INFO -- : [197/885] 1107874=test_addrinfo I, [2024-05-13T04:29:35.745264 #1066487] INFO -- : [198/885] 1107867=test_http I, [2024-05-13T04:29:35.783953 #1066487] INFO -- : [199/885] 1107874=test_rdoc_ri_driver I, [2024-05-13T04:29:35.784217 #1066487] INFO -- : [200/885] 1107872=test_gem_resolver_local_specification I, [2024-05-13T04:29:35.886676 #1066487] INFO -- : [201/885] 1107864=test_httpheader I, [2024-05-13T04:29:35.904415 #1066487] INFO -- : [202/885] 1107858=test_httpresponses I, [2024-05-13T04:29:35.922941 #1066487] INFO -- : [203/885] 1107872=test_encoding I, [2024-05-13T04:29:35.932293 #1066487] INFO -- : [204/885] 1107872=test_set_len I, [2024-05-13T04:29:35.935442 #1066487] INFO -- : [205/885] 1107858=test_sockopt I, [2024-05-13T04:29:35.939322 #1066487] INFO -- : [206/885] 1107858=test_rdoc_markup_to_label I, [2024-05-13T04:29:35.949283 #1066487] INFO -- : [207/885] 1107864=test_install I, [2024-05-13T04:29:35.955152 #1066487] INFO -- : [208/885] 1107872=test_key_stroke I, [2024-05-13T04:29:35.965679 #1066487] INFO -- : [209/885] 1107872=test_color I, [2024-05-13T04:29:36.024046 #1066487] INFO -- : [210/885] 1107873=json_encoding_test I, [2024-05-13T04:29:36.028785 #1066487] INFO -- : [211/885] 1107873=test_primitive I, [2024-05-13T04:29:36.039226 #1066487] INFO -- : [212/885] 1107873=test_human_typo I, [2024-05-13T04:29:36.042660 #1066487] INFO -- : [213/885] 1107873=test_rbconfig I, [2024-05-13T04:29:36.046034 #1066487] INFO -- : [214/885] 1107873=test_euc_jp I, [2024-05-13T04:29:36.048806 #1066487] INFO -- : [215/885] 1107873=test_rdoc_generator_pot_po_entry I, [2024-05-13T04:29:36.050498 #1066487] INFO -- : [216/885] 1107872=test_acceptable I, [2024-05-13T04:29:36.057509 #1066487] INFO -- : [217/885] 1107857=test_document I, [2024-05-13T04:29:36.068610 #1066487] INFO -- : [218/885] 1107857=test_gem_commands_yank_command I, [2024-05-13T04:29:36.121260 #1066487] INFO -- : [219/885] 1107869=test_win32ole_param I, [2024-05-13T04:29:36.124542 #1066487] INFO -- : [220/885] 1107869=test_pair I, [2024-05-13T04:29:36.125051 #1066487] INFO -- : [221/885] 1107874=test_rdoc_i18n_locale I, [2024-05-13T04:29:36.130328 #1066487] INFO -- : [222/885] 1107874=test_name_error_extension I, [2024-05-13T04:29:36.134041 #1066487] INFO -- : [223/885] 1107874=test_chilled I, [2024-05-13T04:29:36.136441 #1066487] INFO -- : [224/885] 1107874=test_flip I, [2024-05-13T04:29:36.151959 #1066487] INFO -- : [225/885] 1107874=compiler_test I, [2024-05-13T04:29:36.153190 #1066487] INFO -- : [226/885] 1107858=test_change_word I, [2024-05-13T04:29:36.158673 #1066487] INFO -- : [227/885] 1107873=test_ossl I, [2024-05-13T04:29:36.160072 #1066487] INFO -- : [228/885] 1107874=test_normalize I, [2024-05-13T04:29:36.162509 #1066487] INFO -- : [229/885] 1107874=test_timeout I, [2024-05-13T04:29:36.165802 #1066487] INFO -- : [230/885] 1107858=test_gem_local_remote_options I, [2024-05-13T04:29:36.168329 #1066487] INFO -- : [231/885] 1107874=test_ruby_lex I, [2024-05-13T04:29:36.177713 #1066487] INFO -- : [232/885] 1107864=test_object I, [2024-05-13T04:29:36.180717 #1066487] INFO -- : [233/885] 1107872=test_date_arith I, [2024-05-13T04:29:36.190083 #1066487] INFO -- : [234/885] 1107872=test_sleep I, [2024-05-13T04:29:36.207389 #1066487] INFO -- : [235/885] 1107866=test_type I, [2024-05-13T04:29:36.211640 #1066487] INFO -- : [236/885] 1107858=test_ractor I, [2024-05-13T04:29:36.213509 #1066487] INFO -- : [237/885] 1107866=test_pointer I, [2024-05-13T04:29:36.257862 #1066487] INFO -- : [238/885] 1107858=test_func I, [2024-05-13T04:29:36.278229 #1066487] INFO -- : [239/885] 1107859=test_big5 I, [2024-05-13T04:29:36.279403 #1066487] INFO -- : [240/885] 1107859=test_rdoc_rd_block_parser I, [2024-05-13T04:29:36.286680 #1066487] INFO -- : [241/885] 1107874=test_tsort I, [2024-05-13T04:29:36.288608 #1066487] INFO -- : [242/885] 1107861=test_signedness I, [2024-05-13T04:29:36.292020 #1066487] INFO -- : [243/885] 1107874=heredoc_dedent_test I, [2024-05-13T04:29:36.299649 #1066487] INFO -- : [244/885] 1107874=test_cgi_header I, [2024-05-13T04:29:36.303104 #1066487] INFO -- : [245/885] 1107874=test_object I, [2024-05-13T04:29:36.326277 #1066487] INFO -- : [246/885] 1107874=version_test I, [2024-05-13T04:29:36.337171 #1066487] INFO -- : [247/885] 1107874=test_key_actor_emacs I, [2024-05-13T04:29:36.401816 #1066487] INFO -- : [248/885] 1107874=test_gem_command_manager I, [2024-05-13T04:29:36.432860 #1066487] INFO -- : [249/885] 1107856=test_basicinstructions I, [2024-05-13T04:29:36.448958 #1066487] INFO -- : [250/885] 1107859=test_gem_gemcutter_utilities I, [2024-05-13T04:29:36.454126 #1066487] INFO -- : [251/885] 1107865=test_arithmetic_sequence I, [2024-05-13T04:29:36.476798 #1066487] INFO -- : [252/885] 1107865=test_gem_update_suggestion I, [2024-05-13T04:29:36.489252 #1066487] INFO -- : [253/885] 1107863=test_files_test I, [2024-05-13T04:29:36.497053 #1066487] INFO -- : [254/885] 1107874=test_file_exhaustive I, [2024-05-13T04:29:36.506892 #1066487] INFO -- : [255/885] 1107856=test_logger I, [2024-05-13T04:29:36.521925 #1066487] INFO -- : [256/885] 1107856=test_import I, [2024-05-13T04:29:36.554793 #1066487] INFO -- : [257/885] 1107857=test_not I, [2024-05-13T04:29:36.557707 #1066487] INFO -- : [258/885] 1107857=test_gem_resolver_lock_set I, [2024-05-13T04:29:36.582371 #1066487] INFO -- : [259/885] 1107857=test_rdoc_parser_markdown I, [2024-05-13T04:29:36.594263 #1066487] INFO -- : [260/885] 1107863=test_pkey_rsa I, [2024-05-13T04:29:36.598240 #1066487] INFO -- : [261/885] 1107864=test_numhash I, [2024-05-13T04:29:36.604208 #1066487] INFO -- : [262/885] 1107864=test_gem_commands_push_command I, [2024-05-13T04:29:36.607315 #1066487] INFO -- : [263/885] 1107857=test_weakkeymap I, [2024-05-13T04:29:36.695196 #1066487] INFO -- : [264/885] 1107866=test_rdoc_markup_hard_break I, [2024-05-13T04:29:36.701080 #1066487] INFO -- : [265/885] 1107866=test_placearg I, [2024-05-13T04:29:36.706772 #1066487] INFO -- : [266/885] 1107865=test_gem_package_task I, [2024-05-13T04:29:36.715140 #1066487] INFO -- : [267/885] 1107865=test_date_strptime I, [2024-05-13T04:29:36.827829 #1066487] INFO -- : [268/885] 1107860=test_gem_platform I, [2024-05-13T04:29:36.846928 #1066487] INFO -- : [269/885] 1107863=test_delete I, [2024-05-13T04:29:36.850068 #1066487] INFO -- : [270/885] 1107866=test_win32ole_method I, [2024-05-13T04:29:36.850772 #1066487] INFO -- : [271/885] 1107863=test_continuation I, [2024-05-13T04:29:36.853996 #1066487] INFO -- : [272/885] 1107863=test_fd_setsize I, [2024-05-13T04:29:36.854572 #1066487] INFO -- : [273/885] 1107866=test_class_name_check I, [2024-05-13T04:29:36.856964 #1066487] INFO -- : [274/885] 1107863=test_keyword I, [2024-05-13T04:29:36.871840 #1066487] INFO -- : [275/885] 1107856=test_rdoc_code_object I, [2024-05-13T04:29:36.873874 #1066487] INFO -- : [276/885] 1107865=test_x509store I, [2024-05-13T04:29:36.881793 #1066487] INFO -- : [277/885] 1107866=test_x509name I, [2024-05-13T04:29:36.891854 #1066487] INFO -- : [278/885] 1107866=test_fips I, [2024-05-13T04:29:36.913234 #1066487] INFO -- : [279/885] 1107860=test_update I, [2024-05-13T04:29:36.916640 #1066487] INFO -- : [280/885] 1107857=test_gem_request_set_gem_dependency_api I, [2024-05-13T04:29:36.922984 #1066487] INFO -- : [281/885] 1107860=test_ast I, [2024-05-13T04:29:36.961165 #1066487] INFO -- : [282/885] 1107859=test_lambda I, [2024-05-13T04:29:37.035490 #1066487] INFO -- : [283/885] 1107859=test_jaro_winkler I, [2024-05-13T04:29:37.045399 #1066487] INFO -- : [284/885] 1107859=test_helper I, [2024-05-13T04:29:37.061243 #1066487] INFO -- : [285/885] 1107857=test_random_formatter I, [2024-05-13T04:29:37.065741 #1066487] INFO -- : [286/885] 1107871=test_webauthn_listener I, [2024-05-13T04:29:37.075635 #1066487] INFO -- : [287/885] 1107857=test_gem_resolver_vendor_set I, [2024-05-13T04:29:37.082066 #1066487] INFO -- : [288/885] 1107864=test_config I, [2024-05-13T04:29:37.093441 #1066487] INFO -- : [289/885] 1107857=test_enumerable I, [2024-05-13T04:29:37.096699 #1066487] INFO -- : [290/885] 1107857=test_gem_safe_marshal I, [2024-05-13T04:29:37.113985 #1066487] INFO -- : [291/885] 1107858=test_gem_resolver_api_set I, [2024-05-13T04:29:37.120236 #1066487] INFO -- : [292/885] 1107871=test_transcode I, [2024-05-13T04:29:37.122272 #1066487] INFO -- : [293/885] 1107866=test_eval I, [2024-05-13T04:29:37.132692 #1066487] INFO -- : [294/885] 1107859=json_generator_test I, [2024-05-13T04:29:37.159005 #1066487] INFO -- : [295/885] 1107858=test_gem_uri_formatter I, [2024-05-13T04:29:37.172986 #1066487] INFO -- : [296/885] 1107858=test_encoding I, [2024-05-13T04:29:37.241468 #1066487] INFO -- : [297/885] 1107859=test_helper I, [2024-05-13T04:29:37.242623 #1066487] INFO -- : [298/885] 1107859=test_erb_command I, [2024-05-13T04:29:37.273026 #1066487] INFO -- : [299/885] 1107865=command_line_test I, [2024-05-13T04:29:37.296312 #1066487] INFO -- : [300/885] 1107859=test_constant I, [2024-05-13T04:29:37.320133 #1066487] INFO -- : [301/885] 1107856=test_dup I, [2024-05-13T04:29:37.325791 #1066487] INFO -- : [302/885] 1107866=test_pty I, [2024-05-13T04:29:37.351696 #1066487] INFO -- : [303/885] 1107871=test_range I, [2024-05-13T04:29:37.372612 #1066487] INFO -- : [304/885] 1107865=test_project_sanity I, [2024-05-13T04:29:37.382900 #1066487] INFO -- : [305/885] 1107858=test_rdoc_ri_paths I, [2024-05-13T04:29:37.393478 #1066487] INFO -- : [306/885] 1107863=test_ts I, [2024-05-13T04:29:37.405086 #1066487] INFO -- : [307/885] 1107858=test_locale I, [2024-05-13T04:29:37.416447 #1066487] INFO -- : [308/885] 1107865=test_addr I, [2024-05-13T04:29:37.448645 #1066487] INFO -- : [309/885] 1107865=library_symbols_test I, [2024-05-13T04:29:37.452451 #1066487] INFO -- : [310/885] 1107865=test_ensured I, [2024-05-13T04:29:37.486832 #1066487] INFO -- : [311/885] 1107864=test_gem_commands_check_command I, [2024-05-13T04:29:37.507634 #1066487] INFO -- : [312/885] 1107864=test_regexp I, [2024-05-13T04:29:37.519797 #1066487] INFO -- : [313/885] 1107856=errors_test I, [2024-05-13T04:29:37.522397 #1066487] INFO -- : [314/885] 1107865=test_vm_dump I, [2024-05-13T04:29:37.524170 #1066487] INFO -- : [315/885] 1107865=test_integer_comb I, [2024-05-13T04:29:37.531328 #1066487] INFO -- : [316/885] 1107858=test_rdoc_markup_document I, [2024-05-13T04:29:37.535108 #1066487] INFO -- : [317/885] 1107857=test_tmpdir I, [2024-05-13T04:29:37.540706 #1066487] INFO -- : [318/885] 1107858=test_ostruct I, [2024-05-13T04:29:37.600437 #1066487] INFO -- : [319/885] 1107857=unescape_test I, [2024-05-13T04:29:37.665886 #1066487] INFO -- : [320/885] 1107856=test_file I, [2024-05-13T04:29:37.672268 #1066487] INFO -- : [321/885] 1107858=test_force_exit I, [2024-05-13T04:29:37.673093 #1066487] INFO -- : [322/885] 1107858=bom_test I, [2024-05-13T04:29:37.683696 #1066487] INFO -- : [323/885] 1107858=test_data_error I, [2024-05-13T04:29:37.771335 #1066487] INFO -- : [324/885] 1107858=test_udp I, [2024-05-13T04:29:37.776510 #1066487] INFO -- : [325/885] 1107858=static_inspect_test I, [2024-05-13T04:29:37.779148 #1066487] INFO -- : [326/885] 1107858=test_debugger_integration I, [2024-05-13T04:29:37.782921 #1066487] INFO -- : [327/885] 1107866=test_rendering I, [2024-05-13T04:29:37.794561 #1066487] INFO -- : [328/885] 1107866=json_ext_parser_test I, [2024-05-13T04:29:37.795028 #1066487] INFO -- : [329/885] 1107858=test_thread I, [2024-05-13T04:29:37.805551 #1066487] INFO -- : [330/885] 1107866=test_my_integer I, [2024-05-13T04:29:37.807278 #1066487] INFO -- : [331/885] 1107866=test_ractor I, [2024-05-13T04:29:37.843338 #1066487] INFO -- : [332/885] 1107863=test_ssl I, [2024-05-13T04:29:38.059725 #1066487] INFO -- : [333/885] 1107871=test_reline_key I, [2024-05-13T04:29:38.121854 #1066487] INFO -- : [334/885] 1107871=test_rb_str_dup I, [2024-05-13T04:29:38.125624 #1066487] INFO -- : [335/885] 1107871=test_ancdata I, [2024-05-13T04:29:38.130326 #1066487] INFO -- : [336/885] 1107871=test_singleton_function I, [2024-05-13T04:29:38.132924 #1066487] INFO -- : [337/885] 1107871=test_timeout I, [2024-05-13T04:29:38.254052 #1066487] INFO -- : [338/885] 1107863=test_alias I, [2024-05-13T04:29:38.270598 #1066487] INFO -- : [339/885] 1107866=test_nonblock I, [2024-05-13T04:29:38.287607 #1066487] INFO -- : [340/885] 1107866=test_weakref I, [2024-05-13T04:29:38.393637 #1066487] INFO -- : [341/885] 1107866=test_unicode_normalize I, [2024-05-13T04:29:38.416193 #1066487] INFO -- : [342/885] 1107863=test_marshal I, [2024-05-13T04:29:38.465151 #1066487] INFO -- : [343/885] 1107861=test_parser I, [2024-05-13T04:29:38.482452 #1066487] INFO -- : [344/885] 1107861=test_cgi_core I, [2024-05-13T04:29:38.500201 #1066487] INFO -- : [345/885] 1107861=test_gem I, [2024-05-13T04:29:38.969996 #1066487] INFO -- : [346/885] 1107871=test_gem_source_lock I, [2024-05-13T04:29:39.008444 #1066487] INFO -- : [347/885] 1107871=test_gem_commands_open_command I, [2024-05-13T04:29:39.026414 #1066487] INFO -- : [348/885] 1107863=test_dns I, [2024-05-13T04:29:39.075552 #1066487] INFO -- : [349/885] 1107871=test_ractor I, [2024-05-13T04:29:39.092110 #1066487] INFO -- : [350/885] 1107871=test_registry I, [2024-05-13T04:29:39.094662 #1066487] INFO -- : [351/885] 1107871=parse_stream_test I, [2024-05-13T04:29:39.099783 #1066487] INFO -- : [352/885] 1107871=test_dryrun I, [2024-05-13T04:29:39.124044 #1066487] INFO -- : [353/885] 1107871=desugar_compiler_test I, [2024-05-13T04:29:39.135009 #1066487] INFO -- : [354/885] 1107871=test_integer I, [2024-05-13T04:29:39.182811 #1066487] INFO -- : [355/885] 1107871=test_env I, [2024-05-13T04:29:39.194572 #1066487] INFO -- : [356/885] 1107859=test_rdoc_attr I, [2024-05-13T04:29:39.208176 #1066487] INFO -- : [357/885] 1107859=test_gem_commands_setup_command I, [2024-05-13T04:29:39.489720 #1066487] INFO -- : [358/885] 1107863=test_rubygems I, [2024-05-13T04:29:39.526843 #1066487] INFO -- : [359/885] 1107869=test_https_proxy I, [2024-05-13T04:29:39.583057 #1066487] INFO -- : [360/885] 1107869=test_call I, [2024-05-13T04:29:39.589564 #1066487] INFO -- : [361/885] 1107857=test_rubyoptions I, [2024-05-13T04:29:39.619853 #1066487] INFO -- : [362/885] 1107863=test_super I, [2024-05-13T04:29:39.665523 #1066487] INFO -- : [363/885] 1107869=test_integer I, [2024-05-13T04:29:39.766182 #1066487] INFO -- : [364/885] 1107859=test_cgi_modruby I, [2024-05-13T04:29:39.785421 #1066487] INFO -- : [365/885] 1107859=test_usrmarshal I, [2024-05-13T04:29:39.964820 #1066487] INFO -- : [366/885] 1107859=test_object_references I, [2024-05-13T04:29:39.977999 #1066487] INFO -- : [367/885] 1107859=test_gem_resolver_git_specification I, [2024-05-13T04:29:40.062622 #1066487] INFO -- : [368/885] 1107865=test_have_func I, [2024-05-13T04:29:40.117061 #1066487] INFO -- : [369/885] 1107862=test_stat I, [2024-05-13T04:29:40.132061 #1066487] INFO -- : [370/885] 1107862=test_gem_request_set_lockfile_tokenizer I, [2024-05-13T04:29:40.163113 #1066487] INFO -- : [371/885] 1107862=test_capacity I, [2024-05-13T04:29:40.167928 #1066487] INFO -- : [372/885] 1107862=test_nextafter I, [2024-05-13T04:29:40.189094 #1066487] INFO -- : [373/885] 1107859=test_function_entry I, [2024-05-13T04:29:40.192276 #1066487] INFO -- : [374/885] 1107859=test_pkcs7 I, [2024-05-13T04:29:40.232031 #1066487] INFO -- : [375/885] 1107862=test_arith_seq_beg_len_step I, [2024-05-13T04:29:40.241542 #1066487] INFO -- : [376/885] 1107863=test_gem_resolver_requirement_list I, [2024-05-13T04:29:40.247686 #1066487] INFO -- : [377/885] 1107863=test_unix I, [2024-05-13T04:29:40.272156 #1066487] INFO -- : [378/885] 1107863=test_lazy_enumerator I, [2024-05-13T04:29:40.306290 #1066487] INFO -- : [379/885] 1107862=test_enc_associate I, [2024-05-13T04:29:40.421104 #1066487] INFO -- : [380/885] 1107859=test_find_executable I, [2024-05-13T04:29:40.425278 #1066487] INFO -- : [381/885] 1107859=ruby_api_test I, [2024-05-13T04:29:40.494104 #1066487] INFO -- : [382/885] 1107861=test_nofree I, [2024-05-13T04:29:40.499103 #1066487] INFO -- : [383/885] 1107861=test_context I, [2024-05-13T04:29:40.518555 #1066487] INFO -- : [384/885] 1107859=test_gem_commands_pristine_command I, [2024-05-13T04:29:40.668228 #1066487] INFO -- : [385/885] 1107863=test_symbol I, [2024-05-13T04:29:40.696336 #1066487] INFO -- : [386/885] 1107861=test_coder I, [2024-05-13T04:29:40.709623 #1066487] INFO -- : [387/885] 1107861=test_member I, [2024-05-13T04:29:40.713511 #1066487] INFO -- : [388/885] 1107861=test_numeric I, [2024-05-13T04:29:40.718542 #1066487] INFO -- : [389/885] 1107861=test_word I, [2024-05-13T04:29:40.722364 #1066487] INFO -- : [390/885] 1107861=test_gem_commands_cleanup_command I, [2024-05-13T04:29:40.802845 #1066487] INFO -- : [391/885] 1107862=test_cgi_multipart I, [2024-05-13T04:29:40.939355 #1066487] INFO -- : [392/885] 1107862=test_eval I, [2024-05-13T04:29:40.945071 #1066487] INFO -- : [393/885] 1107862=test_autoconf I, [2024-05-13T04:29:40.949210 #1066487] INFO -- : [394/885] 1107862=format_errors_test I, [2024-05-13T04:29:40.994682 #1066487] INFO -- : [395/885] 1107866=test_dir I, [2024-05-13T04:29:41.048951 #1066487] INFO -- : [396/885] 1107862=test_gem_console_ui I, [2024-05-13T04:29:41.049759 #1066487] INFO -- : [397/885] 1107862=test_date_ractor I, [2024-05-13T04:29:41.088295 #1066487] INFO -- : [398/885] 1107870=test_ractor_compatibility I, [2024-05-13T04:29:41.193861 #1066487] INFO -- : [399/885] 1107872=test_symbol I, [2024-05-13T04:29:41.197182 #1066487] INFO -- : [400/885] 1107872=location_test I, [2024-05-13T04:29:41.276211 #1066487] INFO -- : [401/885] 1107862=test_coderange I, [2024-05-13T04:29:41.278916 #1066487] INFO -- : [402/885] 1107861=test_mailto I, [2024-05-13T04:29:41.286153 #1066487] INFO -- : [403/885] 1107862=test_resize I, [2024-05-13T04:29:41.289310 #1066487] INFO -- : [404/885] 1107862=test_error_highlight I, [2024-05-13T04:29:41.296853 #1066487] INFO -- : [405/885] 1107866=test_rdoc_comment I, [2024-05-13T04:29:41.298012 #1066487] INFO -- : [406/885] 1107861=test_rdoc_generator_darkfish I, [2024-05-13T04:29:41.316019 #1066487] INFO -- : [407/885] 1107872=json_generic_object_test I, [2024-05-13T04:29:41.333293 #1066487] INFO -- : [408/885] 1107872=test_gem_source_fetch_problem I, [2024-05-13T04:29:41.342231 #1066487] INFO -- : [409/885] 1107866=test_http_request I, [2024-05-13T04:29:41.345611 #1066487] INFO -- : [410/885] 1107872=test_merge_keys I, [2024-05-13T04:29:41.351435 #1066487] INFO -- : [411/885] 1107872=test_rdoc_extend I, [2024-05-13T04:29:41.367623 #1066487] INFO -- : [412/885] 1107865=test_win32ole_variant I, [2024-05-13T04:29:41.373467 #1066487] INFO -- : [413/885] 1107865=test_rdoc_markup_to_ansi I, [2024-05-13T04:29:41.408086 #1066487] INFO -- : [414/885] 1107866=test_history I, [2024-05-13T04:29:41.414218 #1066487] INFO -- : [415/885] 1107865=test_mixed_unicode_escapes I, [2024-05-13T04:29:41.415779 #1066487] INFO -- : [416/885] 1107872=test_ipaddr I, [2024-05-13T04:29:41.420376 #1066487] INFO -- : [417/885] 1107865=test_gem_resolver_api_specification I, [2024-05-13T04:29:41.428699 #1066487] INFO -- : [418/885] 1107866=ractor_test I, [2024-05-13T04:29:41.433409 #1066487] INFO -- : [419/885] 1107872=test_trace I, [2024-05-13T04:29:41.444125 #1066487] INFO -- : [420/885] 1107872=test_win32ole_event I, [2024-05-13T04:29:41.450299 #1066487] INFO -- : [421/885] 1107872=test_time_tz I, [2024-05-13T04:29:41.482435 #1066487] INFO -- : [422/885] 1107865=test_rdoc_generator_json_index I, [2024-05-13T04:29:41.489708 #1066487] INFO -- : [423/885] 1107872=test_gem_ci_detector I, [2024-05-13T04:29:41.491133 #1066487] INFO -- : [424/885] 1107866=test_bignum I, [2024-05-13T04:29:41.495749 #1066487] INFO -- : [425/885] 1107872=test_rdoc_class_module I, [2024-05-13T04:29:41.513652 #1066487] INFO -- : [426/885] 1107870=test_io_wait_uncommon I, [2024-05-13T04:29:41.516074 #1066487] INFO -- : [427/885] 1107870=test_arity I, [2024-05-13T04:29:41.522545 #1066487] INFO -- : [428/885] 1107870=test_stringio I, [2024-05-13T04:29:41.547470 #1066487] INFO -- : [429/885] 1107865=test_win32ole_variable I, [2024-05-13T04:29:41.555003 #1066487] INFO -- : [430/885] 1107865=test_gem_specification I, [2024-05-13T04:29:41.600001 #1066487] INFO -- : [431/885] 1107866=test_enum I, [2024-05-13T04:29:41.602338 #1066487] INFO -- : [432/885] 1107861=test_threadgroup I, [2024-05-13T04:29:41.665979 #1066487] INFO -- : [433/885] 1107870=test_resolve_symbol I, [2024-05-13T04:29:41.693148 #1066487] INFO -- : [434/885] 1107859=test_complex2 I, [2024-05-13T04:29:41.707889 #1066487] INFO -- : [435/885] 1107859=test_gem_package I, [2024-05-13T04:29:41.716893 #1066487] INFO -- : [436/885] 1107871=test_have_macro I, [2024-05-13T04:29:41.739156 #1066487] INFO -- : [437/885] 1107870=test_rdoc_parser_ruby I, [2024-05-13T04:29:41.787111 #1066487] INFO -- : [438/885] 1107862=test_httpresponse I, [2024-05-13T04:29:41.871226 #1066487] INFO -- : [439/885] 1107862=test_open-uri I, [2024-05-13T04:29:41.995141 #1066487] INFO -- : [440/885] 1107869=test_nil2vtempty I, [2024-05-13T04:29:41.996450 #1066487] INFO -- : [441/885] 1107869=test_stream I, [2024-05-13T04:29:42.003694 #1066487] INFO -- : [442/885] 1107869=test_rdoc_context I, [2024-05-13T04:29:42.140515 #1066487] INFO -- : [443/885] 1107872=test_rdoc_text I, [2024-05-13T04:29:42.160801 #1066487] INFO -- : [444/885] 1107872=test_tcp I, [2024-05-13T04:29:42.184352 #1066487] INFO -- : [445/885] 1107862=test_iso_8859 I, [2024-05-13T04:29:42.196673 #1066487] INFO -- : [446/885] 1107872=test_date_time I, [2024-05-13T04:29:42.207168 #1066487] INFO -- : [447/885] 1107872=test_rdoc_markup_to_joined_paragraph I, [2024-05-13T04:29:42.208753 #1066487] INFO -- : [448/885] 1107862=test_require I, [2024-05-13T04:29:42.210096 #1066487] INFO -- : [449/885] 1107862=test_data I, [2024-05-13T04:29:42.212987 #1066487] INFO -- : [450/885] 1107872=index_write_test I, [2024-05-13T04:29:42.213614 #1066487] INFO -- : [451/885] 1107872=test_date_new I, [2024-05-13T04:29:42.215207 #1066487] INFO -- : [452/885] 1107862=test_syntax I, [2024-05-13T04:29:42.220126 #1066487] INFO -- : [453/885] 1107871=test_gem_safe_yaml I, [2024-05-13T04:29:42.221762 #1066487] INFO -- : [454/885] 1107872=test_inadvertent_creation I, [2024-05-13T04:29:42.230908 #1066487] INFO -- : [455/885] 1107871=test_flags I, [2024-05-13T04:29:42.274585 #1066487] INFO -- : [456/885] 1107870=test_enumerator I, [2024-05-13T04:29:42.293270 #1066487] INFO -- : [457/885] 1107859=test_http I, [2024-05-13T04:29:42.298820 #1066487] INFO -- : [458/885] 1107859=test_shift_jis I, [2024-05-13T04:29:42.302276 #1066487] INFO -- : [459/885] 1107859=test_gem_commands_which_command I, [2024-05-13T04:29:42.310486 #1066487] INFO -- : [460/885] 1107872=test_gem_commands_specification_command I, [2024-05-13T04:29:42.322111 #1066487] INFO -- : [461/885] 1107874=test_gem_resolver I, [2024-05-13T04:29:42.331568 #1066487] INFO -- : [462/885] 1107859=test_safe_load I, [2024-05-13T04:29:42.339643 #1066487] INFO -- : [463/885] 1107859=test_gem_resolver_composed_set I, [2024-05-13T04:29:42.353672 #1066487] INFO -- : [464/885] 1107859=test_gem_commands_dependency_command I, [2024-05-13T04:29:42.423290 #1066487] INFO -- : [465/885] 1107859=test_rdoc_markup_attribute_manager I, [2024-05-13T04:29:42.451615 #1066487] INFO -- : [466/885] 1107859=test_name_error I, [2024-05-13T04:29:42.478079 #1066487] INFO -- : [467/885] 1107872=test_pack I, [2024-05-13T04:29:42.529176 #1066487] INFO -- : [468/885] 1107874=test_process I, [2024-05-13T04:29:42.570919 #1066487] INFO -- : [469/885] 1107859=test_last_thread I, [2024-05-13T04:29:42.608479 #1066487] INFO -- : [470/885] 1107861=test_gem_source_local I, [2024-05-13T04:29:42.641318 #1066487] INFO -- : [471/885] 1107872=test_gem_security_policy I, [2024-05-13T04:29:42.668917 #1066487] INFO -- : [472/885] 1107866=test_logdevice I, [2024-05-13T04:29:42.706928 #1066487] INFO -- : [473/885] 1107873=test_gem_ext_rake_builder I, [2024-05-13T04:29:42.873050 #1066487] INFO -- : [474/885] 1107861=test_arity I, [2024-05-13T04:29:42.878217 #1066487] INFO -- : [475/885] 1107861=test_x509cert I, [2024-05-13T04:29:42.922082 #1066487] INFO -- : [476/885] 1107872=test_gc I, [2024-05-13T04:29:42.968257 #1066487] INFO -- : [477/885] 1107869=test_gem_resolver_lock_specification I, [2024-05-13T04:29:42.968902 #1066487] INFO -- : [478/885] 1107868=test_err_in_callback I, [2024-05-13T04:29:42.977207 #1066487] INFO -- : [479/885] 1107868=test_logperiod I, [2024-05-13T04:29:42.985710 #1066487] INFO -- : [480/885] 1107868=test_rdoc_normal_module I, [2024-05-13T04:29:43.141739 #1066487] INFO -- : [481/885] 1107869=test_c_union_entity I, [2024-05-13T04:29:43.174975 #1066487] INFO -- : [482/885] 1107861=test_rdoc_markdown_test I, [2024-05-13T04:29:43.202432 #1066487] INFO -- : [483/885] 1107868=test_securerandom I, [2024-05-13T04:29:43.202495 #1066487] INFO -- : [484/885] 1107871=test_switch_hitter I, [2024-05-13T04:29:43.202859 #1066487] INFO -- : [485/885] 1107863=test_io_console I, [2024-05-13T04:29:43.204448 #1066487] INFO -- : [486/885] 1107869=test_flush I, [2024-05-13T04:29:43.209018 #1066487] INFO -- : [487/885] 1107869=test_singleton I, [2024-05-13T04:29:43.213756 #1066487] INFO -- : [488/885] 1107869=test_stringchar I, [2024-05-13T04:29:43.216822 #1066487] INFO -- : [489/885] 1107871=test_hash_create I, [2024-05-13T04:29:43.218838 #1066487] INFO -- : [490/885] 1107871=newline_test I, [2024-05-13T04:29:43.238330 #1066487] INFO -- : [491/885] 1107868=test_uncorrectable_name_check I, [2024-05-13T04:29:43.246811 #1066487] INFO -- : [492/885] 1107868=test_thread_fd_close I, [2024-05-13T04:29:43.249328 #1066487] INFO -- : [493/885] 1107868=test_passing_block I, [2024-05-13T04:29:43.254934 #1066487] INFO -- : [494/885] 1107868=parse_test I, [2024-05-13T04:29:43.284749 #1066487] INFO -- : [495/885] 1107869=test_gem_install_update_options I, [2024-05-13T04:29:43.328052 #1066487] INFO -- : [496/885] 1107871=test_require_lib I, [2024-05-13T04:29:43.380314 #1066487] INFO -- : [497/885] 1107869=test_severity I, [2024-05-13T04:29:43.402643 #1066487] INFO -- : [498/885] 1107869=test_ractor I, [2024-05-13T04:29:43.407992 #1066487] INFO -- : [499/885] 1107869=test_extlibs I, [2024-05-13T04:29:43.467198 #1066487] INFO -- : [500/885] 1107873=test_rdoc_generator_ri I, [2024-05-13T04:29:43.476420 #1066487] INFO -- : [501/885] 1107873=test_gem_stream_ui I, [2024-05-13T04:29:43.509614 #1066487] INFO -- : [502/885] 1107866=test_c_struct_builder I, [2024-05-13T04:29:43.574361 #1066487] INFO -- : [503/885] 1107873=test_dot_dot I, [2024-05-13T04:29:43.579870 #1066487] INFO -- : [504/885] 1107873=test_str2big I, [2024-05-13T04:29:43.583483 #1066487] INFO -- : [505/885] 1107873=test_literal I, [2024-05-13T04:29:43.642225 #1066487] INFO -- : [506/885] 1107859=test_objectspace I, [2024-05-13T04:29:43.672968 #1066487] INFO -- : [507/885] 1107866=test_socket I, [2024-05-13T04:29:43.739384 #1066487] INFO -- : [508/885] 1107856=test_thread I, [2024-05-13T04:29:43.837379 #1066487] INFO -- : [509/885] 1107865=test_rdoc_markup_to_table_of_contents I, [2024-05-13T04:29:43.865247 #1066487] INFO -- : [510/885] 1107865=test_reline I, [2024-05-13T04:29:43.956760 #1066487] INFO -- : [511/885] 1107856=test_parser_events I, [2024-05-13T04:29:44.042671 #1066487] INFO -- : [512/885] 1107856=test_pkey I, [2024-05-13T04:29:44.063889 #1066487] INFO -- : [513/885] 1107873=test_case I, [2024-05-13T04:29:44.066949 #1066487] INFO -- : [514/885] 1107873=test_gem_version_option I, [2024-05-13T04:29:44.087608 #1066487] INFO -- : [515/885] 1107856=test_grapheme_breaks I, [2024-05-13T04:29:44.110137 #1066487] INFO -- : [516/885] 1107873=test_gem_request_connection_pools I, [2024-05-13T04:29:44.123887 #1066487] INFO -- : [517/885] 1107856=test_cclass I, [2024-05-13T04:29:44.176658 #1066487] INFO -- : [518/885] 1107865=test_ractor I, [2024-05-13T04:29:44.242676 #1066487] INFO -- : [519/885] 1107865=test_m17n_comb I, [2024-05-13T04:29:44.246226 #1066487] INFO -- : [520/885] 1107856=test_memory_view I, [2024-05-13T04:29:44.413662 #1066487] INFO -- : [521/885] 1107856=test_json_tree I, [2024-05-13T04:29:44.419304 #1066487] INFO -- : [522/885] 1107856=test_rdoc_markup_to_markdown I, [2024-05-13T04:29:44.455832 #1066487] INFO -- : [523/885] 1107856=test_ansi_with_terminfo I, [2024-05-13T04:29:44.471359 #1066487] INFO -- : [524/885] 1107861=test_rdoc_generator_pot_po I, [2024-05-13T04:29:44.475641 #1066487] INFO -- : [525/885] 1107861=test_gem_commands_mirror I, [2024-05-13T04:29:44.481452 #1066487] INFO -- : [526/885] 1107861=test_gem_ext_cargo_builder_link_flag_converter I, [2024-05-13T04:29:44.493376 #1066487] INFO -- : [527/885] 1107856=test_sprintf_comb I, [2024-05-13T04:29:44.552911 #1066487] INFO -- : [528/885] 1107861=test_gem_request I, [2024-05-13T04:29:44.603348 #1066487] INFO -- : [529/885] 1107859=test_method_cache I, [2024-05-13T04:29:44.607490 #1066487] INFO -- : [530/885] 1107859=test_scan_args I, [2024-05-13T04:29:44.616151 #1066487] INFO -- : [531/885] 1107859=test_win32ole I, [2024-05-13T04:29:44.621349 #1066487] INFO -- : [532/885] 1107859=test_generic I, [2024-05-13T04:29:44.644172 #1066487] INFO -- : [533/885] 1107856=test_gem_text I, [2024-05-13T04:29:44.646164 #1066487] INFO -- : [534/885] 1107859=test_settracefunc I, [2024-05-13T04:29:44.685113 #1066487] INFO -- : [535/885] 1107856=test_enumerator_kw I, [2024-05-13T04:29:44.689419 #1066487] INFO -- : [536/885] 1107856=test_gem_commands_info_command I, [2024-05-13T04:29:44.709397 #1066487] INFO -- : [537/885] 1107856=test_scalar I, [2024-05-13T04:29:44.713797 #1066487] INFO -- : [538/885] 1107856=test_gem_dependency_installer I, [2024-05-13T04:29:44.756890 #1066487] INFO -- : [539/885] 1107861=test_rdoc_cross_reference I, [2024-05-13T04:29:45.037989 #1066487] INFO -- : [540/885] 1107866=test_store I, [2024-05-13T04:29:45.082630 #1066487] INFO -- : [541/885] 1107867=test_case_options I, [2024-05-13T04:29:45.088788 #1066487] INFO -- : [542/885] 1107867=test_exception I, [2024-05-13T04:29:45.144873 #1066487] INFO -- : [543/885] 1107873=test_gem_name_tuple I, [2024-05-13T04:29:45.156283 #1066487] INFO -- : [544/885] 1107873=test_gem_package_tar_reader_entry I, [2024-05-13T04:29:45.248807 #1066487] INFO -- : [545/885] 1107861=test_rand I, [2024-05-13T04:29:45.251127 #1066487] INFO -- : [546/885] 1107866=test_bug_reporter I, [2024-05-13T04:29:45.322456 #1066487] INFO -- : [547/885] 1107873=test_rdoc_i18n_text I, [2024-05-13T04:29:45.327148 #1066487] INFO -- : [548/885] 1107873=test_key_name_check I, [2024-05-13T04:29:45.329593 #1066487] INFO -- : [549/885] 1107869=test_backtrace I, [2024-05-13T04:29:45.332497 #1066487] INFO -- : [550/885] 1107873=test_defined I, [2024-05-13T04:29:45.333596 #1066487] INFO -- : [551/885] 1107869=test_io_buffer I, [2024-05-13T04:29:45.387657 #1066487] INFO -- : [552/885] 1107869=test_rdoc_rdoc I, [2024-05-13T04:29:45.418207 #1066487] INFO -- : [553/885] 1107873=test_time I, [2024-05-13T04:29:45.468011 #1066487] INFO -- : [554/885] 1107869=test_windows_1251 I, [2024-05-13T04:29:45.471265 #1066487] INFO -- : [555/885] 1107869=test_gb18030 I, [2024-05-13T04:29:45.484951 #1066487] INFO -- : [556/885] 1107869=test_buffering I, [2024-05-13T04:29:45.490342 #1066487] INFO -- : [557/885] 1107869=test_svcb_https I, [2024-05-13T04:29:45.494927 #1066487] INFO -- : [558/885] 1107869=test_gem_uninstaller I, [2024-05-13T04:29:45.535330 #1066487] INFO -- : [559/885] 1107873=test_default_gems I, [2024-05-13T04:29:45.598652 #1066487] INFO -- : [560/885] 1107873=test_rdoc_markup_to_rdoc I, [2024-05-13T04:29:45.605063 #1066487] INFO -- : [561/885] 1107861=test_rdoc_rd_inline_parser I, [2024-05-13T04:29:45.622476 #1066487] INFO -- : [562/885] 1107866=test_mul I, [2024-05-13T04:29:45.623987 #1066487] INFO -- : [563/885] 1107861=test_null I, [2024-05-13T04:29:45.627397 #1066487] INFO -- : [564/885] 1107861=test_win32ole_type I, [2024-05-13T04:29:45.628820 #1066487] INFO -- : [565/885] 1107866=test_rdoc_markup_attributes I, [2024-05-13T04:29:45.632339 #1066487] INFO -- : [566/885] 1107861=test_date_parse I, [2024-05-13T04:29:45.635513 #1066487] INFO -- : [567/885] 1107866=test_pkey_ec I, [2024-05-13T04:29:45.643384 #1066487] INFO -- : [568/885] 1107873=test_pipe I, [2024-05-13T04:29:45.692839 #1066487] INFO -- : [569/885] 1107868=test_thread I, [2024-05-13T04:29:45.693175 #1066487] INFO -- : [570/885] 1107868=test_trick I, [2024-05-13T04:29:45.715043 #1066487] INFO -- : [571/885] 1107866=test_string I, [2024-05-13T04:29:45.719923 #1066487] INFO -- : [572/885] 1107859=test_pattern_matching I, [2024-05-13T04:29:45.728686 #1066487] INFO -- : [573/885] 1107861=test_rdoc_stats I, [2024-05-13T04:29:45.730327 #1066487] INFO -- : [574/885] 1107866=test_x509attr I, [2024-05-13T04:29:45.735098 #1066487] INFO -- : [575/885] 1107866=test_raise I, [2024-05-13T04:29:45.736912 #1066487] INFO -- : [576/885] 1107866=test_depth_first I, [2024-05-13T04:29:45.747736 #1066487] INFO -- : [577/885] 1107866=test_gem_request_set_lockfile_parser I, [2024-05-13T04:29:45.747785 #1066487] INFO -- : [578/885] 1107859=test_rdoc_store I, [2024-05-13T04:29:45.760014 #1066487] INFO -- : [579/885] 1107861=test_custom_command I, [2024-05-13T04:29:45.763080 #1066487] INFO -- : [580/885] 1107861=json_addition_test I, [2024-05-13T04:29:45.788623 #1066487] INFO -- : [581/885] 1107873=test_qsort I, [2024-05-13T04:29:45.789368 #1066487] INFO -- : [582/885] 1107861=test_rdoc_parser I, [2024-05-13T04:29:45.796342 #1066487] INFO -- : [583/885] 1107873=test_gem_dependency_resolution_error I, [2024-05-13T04:29:45.798488 #1066487] INFO -- : [584/885] 1107873=test_optimization I, [2024-05-13T04:29:45.816586 #1066487] INFO -- : [585/885] 1107861=test_date_conv I, [2024-05-13T04:29:45.822414 #1066487] INFO -- : [586/885] 1107861=test_erb_m17n I, [2024-05-13T04:29:45.836716 #1066487] INFO -- : [587/885] 1107861=test_ole_methods I, [2024-05-13T04:29:45.839841 #1066487] INFO -- : [588/885] 1107861=test_egrep_cpp I, [2024-05-13T04:29:45.879368 #1066487] INFO -- : [589/885] 1107866=test_zlib I, [2024-05-13T04:29:45.910539 #1066487] INFO -- : [590/885] 1107863=test_cgi_tag_helper I, [2024-05-13T04:29:45.944924 #1066487] INFO -- : [591/885] 1107863=test_gem_package_old I, [2024-05-13T04:29:45.950082 #1066487] INFO -- : [592/885] 1107861=test_gem_resolver_index_set I, [2024-05-13T04:29:45.972376 #1066487] INFO -- : [593/885] 1107863=test_string I, [2024-05-13T04:29:45.986200 #1066487] INFO -- : [594/885] 1107861=test_proc I, [2024-05-13T04:29:46.478354 #1066487] INFO -- : [595/885] 1107869=test_gc_compact I, [2024-05-13T04:29:46.607005 #1066487] INFO -- : [596/885] 1107859=test_gem_validator I, [2024-05-13T04:29:46.632414 #1066487] INFO -- : [597/885] 1107859=test_files_test_2 I, [2024-05-13T04:29:46.713752 #1066487] INFO -- : [598/885] 1107858=test_fnmatch I, [2024-05-13T04:29:46.756994 #1066487] INFO -- : [599/885] 1107858=test_folderitem2_invokeverb I, [2024-05-13T04:29:46.763559 #1066487] INFO -- : [600/885] 1107858=test_rdoc_markup_parser I, [2024-05-13T04:29:46.839977 #1066487] INFO -- : [601/885] 1107858=test_require_path_check I, [2024-05-13T04:29:46.862629 #1066487] INFO -- : [602/885] 1107861=test_address_resolve I, [2024-05-13T04:29:46.910116 #1066487] INFO -- : [603/885] 1107858=test_rdoc_token_stream I, [2024-05-13T04:29:46.915727 #1066487] INFO -- : [604/885] 1107858=test_optarg I, [2024-05-13T04:29:46.969739 #1066487] INFO -- : [605/885] 1107861=test_yaml_special_cases I, [2024-05-13T04:29:46.988270 #1066487] INFO -- : [606/885] 1107861=test_gem_source_list I, [2024-05-13T04:29:47.051898 #1066487] INFO -- : [607/885] 1107865=test_config I, [2024-05-13T04:29:47.077808 #1066487] INFO -- : [608/885] 1107871=test_pp I, [2024-05-13T04:29:47.084226 #1066487] INFO -- : [609/885] 1107858=test_frozen I, [2024-05-13T04:29:47.092064 #1066487] INFO -- : [610/885] 1107865=test_gem_ext_configure_builder I, [2024-05-13T04:29:47.095312 #1066487] INFO -- : [611/885] 1107858=test_macro I, [2024-05-13T04:29:47.102889 #1066487] INFO -- : [612/885] 1107858=test_rdoc_single_class I, [2024-05-13T04:29:47.105830 #1066487] INFO -- : [613/885] 1107856=test_nil I, [2024-05-13T04:29:47.106527 #1066487] INFO -- : [614/885] 1107858=test_num2int I, [2024-05-13T04:29:47.110114 #1066487] INFO -- : [615/885] 1107856=test_verbose I, [2024-05-13T04:29:47.111829 #1066487] INFO -- : [616/885] 1107861=test_iter_break I, [2024-05-13T04:29:47.115248 #1066487] INFO -- : [617/885] 1107858=test_exception I, [2024-05-13T04:29:47.116162 #1066487] INFO -- : [618/885] 1107861=test_zsh_completion I, [2024-05-13T04:29:47.120191 #1066487] INFO -- : [619/885] 1107871=test_rdoc_markup_to_tt_only I, [2024-05-13T04:29:47.124145 #1066487] INFO -- : [620/885] 1107861=test_hmac I, [2024-05-13T04:29:47.125795 #1066487] INFO -- : [621/885] 1107858=test_rdoc_tom_doc I, [2024-05-13T04:29:47.132409 #1066487] INFO -- : [622/885] 1107861=test_gem_commands_lock_command I, [2024-05-13T04:29:47.144655 #1066487] INFO -- : [623/885] 1107856=test_assignment I, [2024-05-13T04:29:47.145851 #1066487] INFO -- : [624/885] 1107858=test_ifunless I, [2024-05-13T04:29:47.162513 #1066487] INFO -- : [625/885] 1107865=test_numeric I, [2024-05-13T04:29:47.163552 #1066487] INFO -- : [626/885] 1107861=test_gem_spec_fetcher I, [2024-05-13T04:29:47.168106 #1066487] INFO -- : [627/885] 1107858=test_common I, [2024-05-13T04:29:47.249607 #1066487] INFO -- : [628/885] 1107865=test_bug-3571 I, [2024-05-13T04:29:47.266759 #1066487] INFO -- : [629/885] 1107865=test_key_actor_vi I, [2024-05-13T04:29:47.358700 #1066487] INFO -- : [630/885] 1107865=test_gem_command I, [2024-05-13T04:29:47.367759 #1066487] INFO -- : [631/885] 1107871=test_rdoc_markup_paragraph I, [2024-05-13T04:29:47.370456 #1066487] INFO -- : [632/885] 1107871=!Nothing_to_test I, [2024-05-13T04:29:47.372944 #1066487] INFO -- : [633/885] 1107871=test_psych I, [2024-05-13T04:29:47.383342 #1066487] INFO -- : [634/885] 1107858=test_enc_raise I, [2024-05-13T04:29:47.387412 #1066487] INFO -- : [635/885] 1107858=test_object_create_start I, [2024-05-13T04:29:47.390257 #1066487] INFO -- : [636/885] 1107858=test_gem_rdoc I, [2024-05-13T04:29:47.396859 #1066487] INFO -- : [637/885] 1107861=test_date I, [2024-05-13T04:29:47.406338 #1066487] INFO -- : [638/885] 1107867=test_gem_ext_cargo_builder_unit I, [2024-05-13T04:29:47.406683 #1066487] INFO -- : [639/885] 1107861=test_at_exit I, [2024-05-13T04:29:47.413697 #1066487] INFO -- : [640/885] 1107871=test_command I, [2024-05-13T04:29:47.427653 #1066487] INFO -- : [641/885] 1107867=test_files_ext I, [2024-05-13T04:29:47.467744 #1066487] INFO -- : [642/885] 1107861=test_bug-5832 I, [2024-05-13T04:29:47.470919 #1066487] INFO -- : [643/885] 1107861=test_gem_silent_ui I, [2024-05-13T04:29:47.497547 #1066487] INFO -- : [644/885] 1107865=test_emitter I, [2024-05-13T04:29:47.501996 #1066487] INFO -- : [645/885] 1107865=test_gem_doctor I, [2024-05-13T04:29:47.503714 #1066487] INFO -- : [646/885] 1107858=test_kdf I, [2024-05-13T04:29:47.517027 #1066487] INFO -- : [647/885] 1107867=dispatcher_test I, [2024-05-13T04:29:47.535230 #1066487] INFO -- : [648/885] 1107867=test_eval_history I, [2024-05-13T04:29:47.538916 #1066487] INFO -- : [649/885] 1107861=test_kernel I, [2024-05-13T04:29:47.543875 #1066487] INFO -- : [650/885] 1107867=test_method I, [2024-05-13T04:29:47.557166 #1066487] INFO -- : [651/885] 1107865=test_gem_commands_query_command I, [2024-05-13T04:29:47.577683 #1066487] INFO -- : [652/885] 1107858=test_rdoc_rubygems_hook I, [2024-05-13T04:29:47.682586 #1066487] INFO -- : [653/885] 1107858=test_to_ruby I, [2024-05-13T04:29:47.706207 #1066487] INFO -- : [654/885] 1107870=test_pattern_key_name_check I, [2024-05-13T04:29:47.713796 #1066487] INFO -- : [655/885] 1107858=test_array_create I, [2024-05-13T04:29:47.715337 #1066487] INFO -- : [656/885] 1107858=test_pack I, [2024-05-13T04:29:47.737738 #1066487] INFO -- : [657/885] 1107870=test_gem_impossible_dependencies_error I, [2024-05-13T04:29:47.844791 #1066487] INFO -- : [658/885] 1107871=test_ftp I, [2024-05-13T04:29:47.867756 #1066487] INFO -- : [659/885] 1107870=test_rdoc_context_section I, [2024-05-13T04:29:47.877007 #1066487] INFO -- : [660/885] 1107871=test_euc_kr I, [2024-05-13T04:29:47.879902 #1066487] INFO -- : [661/885] 1107871=test_type_completor I, [2024-05-13T04:29:47.885078 #1066487] INFO -- : [662/885] 1107871=test_summary I, [2024-05-13T04:29:47.886437 #1066487] INFO -- : [663/885] 1107870=test_console_attr I, [2024-05-13T04:29:47.886600 #1066487] INFO -- : [664/885] 1107870=test_date_attr I, [2024-05-13T04:29:47.903204 #1066487] INFO -- : [665/885] 1107870=test_ellipsize I, [2024-05-13T04:29:47.924060 #1066487] INFO -- : [666/885] 1107858=test_kwargs I, [2024-05-13T04:29:47.926272 #1066487] INFO -- : [667/885] 1107870=warnings_test I, [2024-05-13T04:29:47.926835 #1066487] INFO -- : [668/885] 1107858=test_gem_commands_exec_command I, [2024-05-13T04:29:47.942824 #1066487] INFO -- : [669/885] 1107870=test_io_wait I, [2024-05-13T04:29:48.032531 #1066487] INFO -- : [670/885] 1107868=test_ubf_async_safe I, [2024-05-13T04:29:48.034939 #1066487] INFO -- : [671/885] 1107871=test_hash I, [2024-05-13T04:29:48.054696 #1066487] INFO -- : [672/885] 1107868=test_win32ole_type_event I, [2024-05-13T04:29:48.058310 #1066487] INFO -- : [673/885] 1107868=test_emoji I, [2024-05-13T04:29:48.094396 #1066487] INFO -- : [674/885] 1107865=test_sorted_set I, [2024-05-13T04:29:48.110076 #1066487] INFO -- : [675/885] 1107868=test_io I, [2024-05-13T04:29:48.215404 #1066487] INFO -- : [676/885] 1107861=test_foreach I, [2024-05-13T04:29:48.220339 #1066487] INFO -- : [677/885] 1107861=test_gem_source_specific_file I, [2024-05-13T04:29:48.287889 #1066487] INFO -- : [678/885] 1107870=test_condition I, [2024-05-13T04:29:48.293317 #1066487] INFO -- : [679/885] 1107870=test_gem_commands_uninstall_command I, [2024-05-13T04:29:48.302855 #1066487] INFO -- : [680/885] 1107861=test_cp949 I, [2024-05-13T04:29:48.313017 #1066487] INFO -- : [681/885] 1107861=test_win32ole_record I, [2024-05-13T04:29:48.316361 #1066487] INFO -- : [682/885] 1107861=test_gem_unsatisfiable_dependency_error I, [2024-05-13T04:29:48.329785 #1066487] INFO -- : [683/885] 1107861=test_win32ole_typelib I, [2024-05-13T04:29:48.335084 #1066487] INFO -- : [684/885] 1107861=test_protect I, [2024-05-13T04:29:48.335723 #1066487] INFO -- : [685/885] 1107861=test_raise_exception I, [2024-05-13T04:29:48.373400 #1066487] INFO -- : [686/885] 1107865=test_gem_request_set_lockfile I, [2024-05-13T04:29:48.401071 #1066487] INFO -- : [687/885] 1107868=test_external_new I, [2024-05-13T04:29:48.409442 #1066487] INFO -- : [688/885] 1107868=test_alias_and_anchor I, [2024-05-13T04:29:48.433941 #1066487] INFO -- : [689/885] 1107868=test_postponed_job I, [2024-05-13T04:29:48.719413 #1066487] INFO -- : [690/885] 1107862=test_hash I, [2024-05-13T04:29:48.736636 #1066487] INFO -- : [691/885] 1107862=test_tree_builder I, [2024-05-13T04:29:48.760043 #1066487] INFO -- : [692/885] 1107862=test_gem_resolver_dependency_request I, [2024-05-13T04:29:48.788180 #1066487] INFO -- : [693/885] 1107862=test_m17n I, [2024-05-13T04:29:48.812765 #1066487] INFO -- : [694/885] 1107868=test_gem_commands_environment_command I, [2024-05-13T04:29:48.848591 #1066487] INFO -- : [695/885] 1107862=test_ws I, [2024-05-13T04:29:48.856445 #1066487] INFO -- : [696/885] 1107857=test_yjit I, [2024-05-13T04:29:48.858675 #1066487] INFO -- : [697/885] 1107868=test_weakmap I, [2024-05-13T04:29:48.860429 #1066487] INFO -- : [698/885] 1107862=test_workspace I, [2024-05-13T04:29:48.870127 #1066487] INFO -- : [699/885] 1107857=test_ns_spki I, [2024-05-13T04:29:48.879732 #1066487] INFO -- : [700/885] 1107865=test_framework I, [2024-05-13T04:29:48.879803 #1066487] INFO -- : [701/885] 1107865=test_kill_ring I, [2024-05-13T04:29:48.879920 #1066487] INFO -- : [702/885] 1107865=test_argf I, [2024-05-13T04:29:48.892373 #1066487] INFO -- : [703/885] 1107857=test_undef I, [2024-05-13T04:29:48.897801 #1066487] INFO -- : [704/885] 1107857=test_line_editor I, [2024-05-13T04:29:48.898236 #1066487] INFO -- : [705/885] 1107856=ripper_test I, [2024-05-13T04:29:48.910143 #1066487] INFO -- : [706/885] 1107857=test_objspace I, [2024-05-13T04:29:48.987685 #1066487] INFO -- : [707/885] 1107861=test_sprintf I, [2024-05-13T04:29:48.996410 #1066487] INFO -- : [708/885] 1107858=test_gem_requirement I, [2024-05-13T04:29:49.024893 #1066487] INFO -- : [709/885] 1107864=comments_test I, [2024-05-13T04:29:49.086225 #1066487] INFO -- : [710/885] 1107864=test_string_memory I, [2024-05-13T04:29:49.099970 #1066487] INFO -- : [711/885] 1107858=test_gem_security_trust_dir I, [2024-05-13T04:29:49.100157 #1066487] INFO -- : [712/885] 1107869=test_set I, [2024-05-13T04:29:49.107507 #1066487] INFO -- : [713/885] 1107869=test_show_source I, [2024-05-13T04:29:49.116494 #1066487] INFO -- : [714/885] 1107869=test_have_library I, [2024-05-13T04:29:49.129627 #1066487] INFO -- : [715/885] 1107862=test_remote_fetch_error I, [2024-05-13T04:29:49.136492 #1066487] INFO -- : [716/885] 1107862=test_gem_commands_stale_command I, [2024-05-13T04:29:49.140296 #1066487] INFO -- : [717/885] 1107858=test_lock_native_thread I, [2024-05-13T04:29:49.145554 #1066487] INFO -- : [718/885] 1107870=test_c_struct_entry I, [2024-05-13T04:29:49.153452 #1066487] INFO -- : [719/885] 1107862=test_array I, [2024-05-13T04:29:49.175334 #1066487] INFO -- : [720/885] 1107864=test_optparse I, [2024-05-13T04:29:49.184349 #1066487] INFO -- : [721/885] 1107862=test_fstring I, [2024-05-13T04:29:49.242687 #1066487] INFO -- : [722/885] 1107864=test_typeddata I, [2024-05-13T04:29:49.266811 #1066487] INFO -- : [723/885] 1107861=encoding_test I, [2024-05-13T04:29:49.363763 #1066487] INFO -- : [724/885] 1107862=test_gem_resolver_best_set I, [2024-05-13T04:29:49.380459 #1066487] INFO -- : [725/885] 1107870=test_rdoc_markup_to_html_crossref I, [2024-05-13T04:29:49.420271 #1066487] INFO -- : [726/885] 1107862=test_webauthn_poller I, [2024-05-13T04:29:49.437465 #1066487] INFO -- : [727/885] 1107856=test_rdoc_markup_raw I, [2024-05-13T04:29:49.446978 #1066487] INFO -- : [728/885] 1107856=test_rat I, [2024-05-13T04:29:49.458120 #1066487] INFO -- : [729/885] 1107858=test_files_sample I, [2024-05-13T04:29:49.467901 #1066487] INFO -- : [730/885] 1107856=test_stringscanner I, [2024-05-13T04:29:49.490529 #1066487] INFO -- : [731/885] 1107861=test_yield I, [2024-05-13T04:29:49.503104 #1066487] INFO -- : [732/885] 1107864=test_rdoc_alias I, [2024-05-13T04:29:49.504131 #1066487] INFO -- : [733/885] 1107856=parser_test I, [2024-05-13T04:29:49.511995 #1066487] INFO -- : [734/885] 1107856=test_convertible I, [2024-05-13T04:29:49.540506 #1066487] INFO -- : [735/885] 1107858=test_rdoc_task I, [2024-05-13T04:29:49.544901 #1066487] INFO -- : [736/885] 1107858=test_gem_resolver_conflict I, [2024-05-13T04:29:49.549400 #1066487] INFO -- : [737/885] 1107864=test_io_buffer I, [2024-05-13T04:29:49.560199 #1066487] INFO -- : [738/885] 1107858=test_pack I, [2024-05-13T04:29:49.592630 #1066487] INFO -- : [739/885] 1107858=test_backtrace I, [2024-05-13T04:29:49.597202 #1066487] INFO -- : [740/885] 1107862=ruby_parser_test I, [2024-05-13T04:29:49.598948 #1066487] INFO -- : [741/885] 1107862=test_rdoc_markup_indented_paragraph I, [2024-05-13T04:29:49.663707 #1066487] INFO -- : [742/885] 1107864=test_rdoc_require I, [2024-05-13T04:29:49.665814 #1066487] INFO -- : [743/885] 1107870=locals_test I, [2024-05-13T04:29:49.676901 #1066487] INFO -- : [744/885] 1107864=test_readpartial I, [2024-05-13T04:29:49.748842 #1066487] INFO -- : [745/885] 1107872=test_clone I, [2024-05-13T04:29:49.762710 #1066487] INFO -- : [746/885] 1107862=test_gem_commands_install_command I, [2024-05-13T04:29:49.962630 #1066487] INFO -- : [747/885] 1107872=test_yaml_tree I, [2024-05-13T04:29:49.971364 #1066487] INFO -- : [748/885] 1107870=test_config I, [2024-05-13T04:29:49.995736 #1066487] INFO -- : [749/885] 1107872=test_sleep I, [2024-05-13T04:29:50.013281 #1066487] INFO -- : [750/885] 1107870=test_gc I, [2024-05-13T04:29:50.016323 #1066487] INFO -- : [751/885] 1107870=test_math I, [2024-05-13T04:29:50.028312 #1066487] INFO -- : [752/885] 1107870=test_gem_commands_fetch_command I, [2024-05-13T04:29:50.079951 #1066487] INFO -- : [753/885] 1107864=test_libs I, [2024-05-13T04:29:50.091272 #1066487] INFO -- : [754/885] 1107864=test_unicode_escape I, [2024-05-13T04:29:50.145888 #1066487] INFO -- : [755/885] 1107859=test_io I, [2024-05-13T04:29:50.147998 #1066487] INFO -- : [756/885] 1107870=test_autoload I, [2024-05-13T04:29:50.181335 #1066487] INFO -- : [757/885] 1107864=test_utf16 I, [2024-05-13T04:29:50.209380 #1066487] INFO -- : [758/885] 1107864=test_rendering I, [2024-05-13T04:29:50.241431 #1066487] INFO -- : [759/885] 1107864=test_face I, [2024-05-13T04:29:50.251351 #1066487] INFO -- : [760/885] 1107864=test_case I, [2024-05-13T04:29:50.284224 #1066487] INFO -- : [761/885] 1107864=test_sizeof I, [2024-05-13T04:29:50.408605 #1066487] INFO -- : [762/885] 1107869=test_pkcs12 I, [2024-05-13T04:29:50.979814 #1066487] INFO -- : [763/885] 1107869=test_system I, [2024-05-13T04:29:50.979878 #1066487] INFO -- : [764/885] 1107858=test_iseq_load I, [2024-05-13T04:29:51.245977 #1066487] INFO -- : [765/885] 1107862=test_gem_util I, [2024-05-13T04:29:51.434860 #1066487] INFO -- : [766/885] 1107862=test_gem_package_tar_header I, [2024-05-13T04:29:51.470564 #1066487] INFO -- : [767/885] 1107862=test_bigzero I, [2024-05-13T04:29:51.480282 #1066487] INFO -- : [768/885] 1107862=test_pkey_dh I, [2024-05-13T04:29:51.560559 #1066487] INFO -- : [769/885] 1107862=test_gem_resolver_activation_request I, [2024-05-13T04:29:51.573591 #1066487] INFO -- : [770/885] 1107862=test_protocol I, [2024-05-13T04:29:51.618101 #1066487] INFO -- : [771/885] 1107868=test_getopts I, [2024-05-13T04:29:51.630883 #1066487] INFO -- : [772/885] 1107868=test_ripper I, [2024-05-13T04:29:51.883283 #1066487] INFO -- : [773/885] 1107862=test_gem_config_file I, [2024-05-13T04:29:51.929832 #1066487] INFO -- : [774/885] 1107868=test_etc I, [2024-05-13T04:29:52.003997 #1066487] INFO -- : [775/885] 1107868=test_yjit_exit_locations I, [2024-05-13T04:29:52.005151 #1066487] INFO -- : [776/885] 1107868=test_gem_available_set I, [2024-05-13T04:29:52.015761 #1066487] INFO -- : [777/885] 1107869=test_rdoc_markdown I, [2024-05-13T04:29:52.038275 #1066487] INFO -- : [778/885] 1107862=test_modify_expand I, [2024-05-13T04:29:52.040238 #1066487] INFO -- : [779/885] 1107872=test_rdoc_any_method I, [2024-05-13T04:29:52.045280 #1066487] INFO -- : [780/885] 1107862=test_file I, [2024-05-13T04:29:52.046754 #1066487] INFO -- : [781/885] 1107862=test_rdoc_encoding I, [2024-05-13T04:29:52.073474 #1066487] INFO -- : [782/885] 1107867=test_coverage I, [2024-05-13T04:29:52.089497 #1066487] INFO -- : [783/885] 1107855=test_gem_package_tar_reader I, [2024-05-13T04:29:52.091399 #1066487] INFO -- : [784/885] 1107862=regexp_test I, [2024-05-13T04:29:52.102812 #1066487] INFO -- : [785/885] 1107862=test_complexrational I, [2024-05-13T04:29:52.106806 #1066487] INFO -- : [786/885] 1107868=test_init I, [2024-05-13T04:29:52.108342 #1066487] INFO -- : [787/885] 1107862=test_pathname I, [2024-05-13T04:29:52.141618 #1066487] INFO -- : [788/885] 1107855=test_gem_commands_owner_command I, [2024-05-13T04:29:52.236792 #1066487] INFO -- : [789/885] 1107869=test_gem_source_vendor I, [2024-05-13T04:29:52.246128 #1066487] INFO -- : [790/885] 1107869=test_recorder I, [2024-05-13T04:29:52.251932 #1066487] INFO -- : [791/885] 1107869=test_rdoc_constant I, [2024-05-13T04:29:52.318912 #1066487] INFO -- : [792/885] 1107862=test_deprecate I, [2024-05-13T04:29:52.337453 #1066487] INFO -- : [793/885] 1107869=test_bash_completion I, [2024-05-13T04:29:52.344772 #1066487] INFO -- : [794/885] 1107869=test_formatter I, [2024-05-13T04:29:52.349589 #1066487] INFO -- : [795/885] 1107869=test_gem_ext_cmake_builder I, [2024-05-13T04:29:52.350564 #1066487] INFO -- : [796/885] 1107862=test_gem_commands_contents_command I, [2024-05-13T04:29:52.365516 #1066487] INFO -- : [797/885] 1107869=test_cgi_util I, [2024-05-13T04:29:52.370077 #1066487] INFO -- : [798/885] 1107872=test_require I, [2024-05-13T04:29:52.442507 #1066487] INFO -- : [799/885] 1107862=test_marshalable I, [2024-05-13T04:29:52.444413 #1066487] INFO -- : [800/885] 1107862=test_digest I, [2024-05-13T04:29:52.467640 #1066487] INFO -- : [801/885] 1107858=test_ractor I, [2024-05-13T04:29:52.496009 #1066487] INFO -- : [802/885] 1107861=test_find I, [2024-05-13T04:29:52.510745 #1066487] INFO -- : [803/885] 1107861=test_fiddle I, [2024-05-13T04:29:52.516756 #1066487] INFO -- : [804/885] 1107868=test_wss I, [2024-05-13T04:29:52.520764 #1066487] INFO -- : [805/885] 1107873=test_comparable I, [2024-05-13T04:29:52.527198 #1066487] INFO -- : [806/885] 1107873=test_rdoc_parser_c I, [2024-05-13T04:29:52.538142 #1066487] INFO -- : [807/885] 1107868=test_io_timeout I, [2024-05-13T04:29:52.542824 #1066487] INFO -- : [808/885] 1107868=json_fixtures_test I, [2024-05-13T04:29:52.552051 #1066487] INFO -- : [809/885] 1107868=test_shapes I, [2024-05-13T04:29:52.555136 #1066487] INFO -- : [810/885] 1107868=test_cstr I, [2024-05-13T04:29:52.575459 #1066487] INFO -- : [811/885] 1107858=test_pstore I, [2024-05-13T04:29:52.591482 #1066487] INFO -- : [812/885] 1107861=test_profile_frames I, [2024-05-13T04:29:52.596453 #1066487] INFO -- : [813/885] 1107869=test_gbk I, [2024-05-13T04:29:52.601654 #1066487] INFO -- : [814/885] 1107869=test_class2name I, [2024-05-13T04:29:52.603467 #1066487] INFO -- : [815/885] 1107871=test_enc_str_buf_cat I, [2024-05-13T04:29:52.607829 #1066487] INFO -- : [816/885] 1107871=test_yaml I, [2024-05-13T04:29:52.609453 #1066487] INFO -- : [817/885] 1107869=test_forwardable I, [2024-05-13T04:29:52.620623 #1066487] INFO -- : [818/885] 1107858=test_handle I, [2024-05-13T04:29:52.631052 #1066487] INFO -- : [819/885] 1107869=test_wait I, [2024-05-13T04:29:52.700194 #1066487] INFO -- : [820/885] 1107871=test_big2str I, [2024-05-13T04:29:52.704031 #1066487] INFO -- : [821/885] 1107855=test_bmethod I, [2024-05-13T04:29:52.705313 #1066487] INFO -- : [822/885] 1107871=test_euc_tw I, [2024-05-13T04:29:52.707891 #1066487] INFO -- : [823/885] 1107855=test_ractor I, [2024-05-13T04:29:52.708520 #1066487] INFO -- : [824/885] 1107869=test_gem_commands_sources_command I, [2024-05-13T04:29:52.711226 #1066487] INFO -- : [825/885] 1107871=test_ansi_without_terminfo I, [2024-05-13T04:29:52.718787 #1066487] INFO -- : [826/885] 1107871=test_nowrite I, [2024-05-13T04:29:52.721045 #1066487] INFO -- : [827/885] 1107855=test_thread_queue I, [2024-05-13T04:29:52.733852 #1066487] INFO -- : [828/885] 1107871=test_rdoc_markup_formatter I, [2024-05-13T04:29:52.745100 #1066487] INFO -- : [829/885] 1107871=test_rdoc_markup_verbatim I, [2024-05-13T04:29:52.748788 #1066487] INFO -- : [830/885] 1107871=test_inlinecache I, [2024-05-13T04:29:52.765451 #1066487] INFO -- : [831/885] 1107861=test_gem_dependency I, [2024-05-13T04:29:52.787247 #1066487] INFO -- : [832/885] 1107873=test_gem_resolver_specification I, [2024-05-13T04:29:52.805928 #1066487] INFO -- : [833/885] 1107873=test_path_to_class I, [2024-05-13T04:29:52.809812 #1066487] INFO -- : [834/885] 1107873=test_gem_ext_ext_conf_builder I, [2024-05-13T04:29:52.827858 #1066487] INFO -- : [835/885] 1107871=test_frozen_error I, [2024-05-13T04:29:52.832918 #1066487] INFO -- : [836/885] 1107871=test_gem_stub_specification I, [2024-05-13T04:29:52.845032 #1066487] INFO -- : [837/885] 1107866=test_method_cache I, [2024-05-13T04:29:52.845102 #1066487] INFO -- : [838/885] 1107866=test_gem_commands_search_command I, [2024-05-13T04:29:52.846689 #1066487] INFO -- : [839/885] 1107869=test_complex I, [2024-05-13T04:29:52.858218 #1066487] INFO -- : [840/885] 1107866=test_scanner_events I, [2024-05-13T04:29:52.871611 #1066487] INFO -- : [841/885] 1107867=test_gem_resolver_installed_specification I, [2024-05-13T04:29:52.884246 #1066487] INFO -- : [842/885] 1107866=test_mdns I, [2024-05-13T04:29:52.889721 #1066487] INFO -- : [843/885] 1107866=test_parse I, [2024-05-13T04:29:52.897376 #1066487] INFO -- : [844/885] 1107867=test_gem_remote_fetcher I, [2024-05-13T04:29:52.911071 #1066487] INFO -- : [845/885] 1107861=test_too_many_dummy_encodings I, [2024-05-13T04:29:52.963836 #1066487] INFO -- : [846/885] 1107871=test_rdoc_include I, [2024-05-13T04:29:52.983114 #1066487] INFO -- : [847/885] 1107861=test_reqarg I, [2024-05-13T04:29:52.990796 #1066487] INFO -- : [848/885] 1107869=test_gem_commands_list_command I, [2024-05-13T04:29:53.006998 #1066487] INFO -- : [849/885] 1107869=test_stack I, [2024-05-13T04:29:53.028599 #1066487] INFO -- : [850/885] 1107871=test_string_processing I, [2024-05-13T04:29:53.040680 #1066487] INFO -- : [851/885] 1107871=test_fileutils I, [2024-05-13T04:29:53.075223 #1066487] INFO -- : [852/885] 1107868=test_gem_commands_signin_command I, [2024-05-13T04:29:53.095460 #1066487] INFO -- : [853/885] 1107858=test_resource I, [2024-05-13T04:29:53.104988 #1066487] INFO -- : [854/885] 1107858=test_emitter I, [2024-05-13T04:29:53.110663 #1066487] INFO -- : [855/885] 1107858=test_ldap I, [2024-05-13T04:29:53.116820 #1066487] INFO -- : [856/885] 1107858=test_gem_version I, [2024-05-13T04:29:53.138340 #1066487] INFO -- : [857/885] 1107868=test_rdoc_options I, [2024-05-13T04:29:53.191607 #1066487] INFO -- : [858/885] 1107858=test_cesu8 I, [2024-05-13T04:29:53.196776 #1066487] INFO -- : [859/885] 1107858=test_econv I, [2024-05-13T04:29:53.228933 #1066487] INFO -- : [860/885] 1107865=test_tempfile I, [2024-05-13T04:29:53.268699 #1066487] INFO -- : [861/885] 1107862=test_noarg I, [2024-05-13T04:29:53.339406 #1066487] INFO -- : [862/885] 1107871=parse_comments_test I, [2024-05-13T04:29:53.344172 #1066487] INFO -- : [863/885] 1107871=test_queue I, [2024-05-13T04:29:53.349437 #1066487] INFO -- : [864/885] 1107871=test_function I, [2024-05-13T04:29:53.362860 #1066487] INFO -- : [865/885] 1107868=test_internal_ivar I, [2024-05-13T04:29:53.366761 #1066487] INFO -- : [866/885] 1107868=test_gem_resolver_index_specification I, [2024-05-13T04:29:53.370674 #1066487] INFO -- : [867/885] 1107861=test_basicsocket I, [2024-05-13T04:29:53.378781 #1066487] INFO -- : [868/885] 1107861=test_utf32 I, [2024-05-13T04:29:53.384438 #1066487] INFO -- : [869/885] 1107861=test_duplicate I, [2024-05-13T04:29:53.390859 #1066487] INFO -- : [870/885] 1107861=test_gem_commands_help_command I, [2024-05-13T04:29:53.411982 #1066487] INFO -- : [871/885] 1107864=test_rdoc_markup I, [2024-05-13T04:29:53.415794 #1066487] INFO -- : [872/885] 1107868=test_prettyprint I, [2024-05-13T04:29:53.417567 #1066487] INFO -- : [873/885] 1107864=test_tracepoint I, [2024-05-13T04:29:53.422309 #1066487] INFO -- : [874/885] 1107866=test_yamlstore I, [2024-05-13T04:29:53.427176 #1066487] INFO -- : [875/885] 1107868=test_gem_installer I, [2024-05-13T04:29:53.432771 #1066487] INFO -- : [876/885] 1107866=test_date_strftime I, [2024-05-13T04:29:53.451149 #1066487] INFO -- : [877/885] 1107861=test_rdoc_parser_rd I, [2024-05-13T04:29:53.454144 #1066487] INFO -- : [878/885] 1107862=test_irb I, [2024-05-13T04:29:53.462949 #1066487] INFO -- : [879/885] 1107861=test_const I, [2024-05-13T04:29:53.463670 #1066487] INFO -- : [880/885] 1107861=test_rdoc_normal_class I, [2024-05-13T04:29:53.502778 #1066487] INFO -- : [881/885] 1107861=test_class I, [2024-05-13T04:29:53.537328 #1066487] INFO -- : [882/885] 1107865=test_load I, [2024-05-13T04:29:53.544146 #1066487] INFO -- : [883/885] 1107872=json_string_matching_test I, [2024-05-13T04:29:53.549075 #1066487] INFO -- : [884/885] 1107865=test_random I, [2024-05-13T04:29:53.553032 #1066487] INFO -- : [885/885] 1107865=test_asn1 I, [2024-05-13T04:30:07.508238 #1066487] INFO -- : Finished tests in 34.675719s, 761.5127 tests/s, 269745.6391 assertions/s. E, [2024-05-13T04:30:07.508292 #1066487] ERROR -- : Children under /tmp/rubytest.da4tx7: E, [2024-05-13T04:30:07.508388 #1066487] ERROR -- : * drwx------ 4 80 2024-05-13 04:29:33 +0000 gem_rebuild20240513-1107864-zzh7c4/ E, [2024-05-13T04:30:07.508395 #1066487] ERROR -- : * drwxrwxr-x 2 60 2024-05-13 04:29:33 +0000 new/ E, [2024-05-13T04:30:07.508399 #1066487] ERROR -- : * -rw-rw-r-- 1 4096 2024-05-13 04:29:33 +0000 rebuild_test_gem-1.0.0.gem E, [2024-05-13T04:30:07.508404 #1066487] ERROR -- : * drwxrwxr-x 2 60 2024-05-13 04:29:33 +0000 old/ E, [2024-05-13T04:30:07.508408 #1066487] ERROR -- : * -rw-rw-r-- 1 4096 2024-05-13 04:29:33 +0000 rebuild_test_gem-1.0.0.gem I, [2024-05-13T04:30:07.509626 #1066487] INFO -- : 26406 tests, 9353624 assertions, 0 failures, 0 errors, 306 skips I, [2024-05-13T04:30:07.509654 #1066487] INFO -- : I, [2024-05-13T04:30:07.509662 #1066487] INFO -- : ruby -v: ruby 3.4.0dev (2024-05-12T23:26:54Z master 3c16d93cd3) [x86_64-linux] I, [2024-05-13T04:30:07.511605 #1066487] INFO -- : $$$[end] "make yes-test-all TESTOPTS='--stderr-on-failure' TESTS='-j20'" exit with 0. I, [2024-05-13T04:30:07.511728 #1066487] INFO -- : $$$[beg] make yes-test-rubyspec MSPECOPT='--error-output stderr --debug -j' TESTS='-j20' I, [2024-05-13T04:30:07.599246 #1066487] INFO -- : BASERUBY = /usr/bin/ruby --disable=gems I, [2024-05-13T04:30:07.599291 #1066487] INFO -- : CC = gcc I, [2024-05-13T04:30:07.599297 #1066487] INFO -- : LD = ld I, [2024-05-13T04:30:07.599302 #1066487] INFO -- : LDSHARED = gcc -shared I, [2024-05-13T04:30:07.599306 #1066487] INFO -- : CFLAGS = -O3 -fno-fast-math -ggdb3 -Wall -Wextra -Wdeprecated-declarations -Wdiv-by-zero -Wduplicated-cond -Wimplicit-function-declaration -Wimplicit-int -Wpointer-arith -Wwrite-strings -Wold-style-definition -Wimplicit-fallthrough=0 -Wmissing-noreturn -Wno-cast-function-type -Wno-constant-logical-operand -Wno-long-long -Wno-missing-field-initializers -Wno-overlength-strings -Wno-packed-bitfield-compat -Wno-parentheses-equality -Wno-self-assign -Wno-tautological-compare -Wno-unused-parameter -Wno-unused-value -Wsuggest-attribute=format -Wsuggest-attribute=noreturn -Wunused-variable -Wmisleading-indentation -Wundef -fPIC I, [2024-05-13T04:30:07.599311 #1066487] INFO -- : XCFLAGS = -U_FORTIFY_SOURCE -D_FORTIFY_SOURCE=2 -fstack-protector-strong -fno-strict-overflow -fvisibility=hidden -fexcess-precision=standard -DRUBY_EXPORT -I. -I.ext/include/x86_64-linux -I/tmp/ruby/src/trunk/include -I/tmp/ruby/src/trunk -I/tmp/ruby/src/trunk/prism -I/tmp/ruby/src/trunk/enc/unicode/15.0.0 I, [2024-05-13T04:30:07.599316 #1066487] INFO -- : CPPFLAGS = I, [2024-05-13T04:30:07.599321 #1066487] INFO -- : DLDFLAGS = -Wl,--compress-debug-sections=zlib -Wl,-soname,libruby.so.3.4 -fstack-protector-strong I, [2024-05-13T04:30:07.599326 #1066487] INFO -- : SOLIBS = -lz -lrt -lrt -lgmp -ldl -lcrypt -lm -lpthread I, [2024-05-13T04:30:07.599331 #1066487] INFO -- : LANG = en_US.UTF-8 I, [2024-05-13T04:30:07.599335 #1066487] INFO -- : LC_ALL = I, [2024-05-13T04:30:07.599340 #1066487] INFO -- : LC_CTYPE = I, [2024-05-13T04:30:07.599344 #1066487] INFO -- : MFLAGS = I, [2024-05-13T04:30:07.599349 #1066487] INFO -- : RUSTC = no I, [2024-05-13T04:30:07.599353 #1066487] INFO -- : YJIT_RUSTC_ARGS = --crate-name=yjit --crate-type=staticlib --edition=2021 -g -C lto=thin -C opt-level=3 -C overflow-checks=on '--out-dir=/tmp/ruby/build/trunk/yjit/target/release/' /tmp/ruby/src/trunk/yjit/src/lib.rs I, [2024-05-13T04:30:07.599838 #1066487] INFO -- : gcc (Ubuntu 11.4.0-1ubuntu1~22.04) 11.4.0 I, [2024-05-13T04:30:07.599859 #1066487] INFO -- : Copyright (C) 2021 Free Software Foundation, Inc. I, [2024-05-13T04:30:07.599865 #1066487] INFO -- : This is free software; see the source for copying conditions. There is NO I, [2024-05-13T04:30:07.599871 #1066487] INFO -- : warranty; not even for MERCHANTABILITY or FITNESS FOR A PARTICULAR PURPOSE. I, [2024-05-13T04:30:07.599875 #1066487] INFO -- : I, [2024-05-13T04:30:07.601664 #1066487] INFO -- : generating enc.mk I, [2024-05-13T04:30:07.719787 #1066487] INFO -- : making enc I, [2024-05-13T04:30:07.736923 #1066487] INFO -- : make[1]: Entering directory '/tmp/ruby/build/trunk' I, [2024-05-13T04:30:07.736946 #1066487] INFO -- : make[1]: Nothing to be done for 'enc'. I, [2024-05-13T04:30:07.736951 #1066487] INFO -- : make[1]: Leaving directory '/tmp/ruby/build/trunk' I, [2024-05-13T04:30:07.737730 #1066487] INFO -- : making srcs under enc I, [2024-05-13T04:30:07.767339 #1066487] INFO -- : make[1]: Entering directory '/tmp/ruby/build/trunk' I, [2024-05-13T04:30:07.767364 #1066487] INFO -- : make[1]: Nothing to be done for 'srcs'. I, [2024-05-13T04:30:07.767370 #1066487] INFO -- : make[1]: Leaving directory '/tmp/ruby/build/trunk' I, [2024-05-13T04:30:07.768100 #1066487] INFO -- : generating transdb.h I, [2024-05-13T04:30:07.865607 #1066487] INFO -- : transdb.h unchanged I, [2024-05-13T04:30:07.867028 #1066487] INFO -- : making trans I, [2024-05-13T04:30:07.901078 #1066487] INFO -- : make[1]: Entering directory '/tmp/ruby/build/trunk' I, [2024-05-13T04:30:07.901099 #1066487] INFO -- : make[1]: Nothing to be done for 'trans'. I, [2024-05-13T04:30:07.901104 #1066487] INFO -- : make[1]: Leaving directory '/tmp/ruby/build/trunk' I, [2024-05-13T04:30:07.901807 #1066487] INFO -- : making encs I, [2024-05-13T04:30:07.939211 #1066487] INFO -- : make[1]: Entering directory '/tmp/ruby/build/trunk' I, [2024-05-13T04:30:07.939239 #1066487] INFO -- : make[1]: Nothing to be done for 'encs'. I, [2024-05-13T04:30:07.939244 #1066487] INFO -- : make[1]: Leaving directory '/tmp/ruby/build/trunk' I, [2024-05-13T04:30:07.941118 #1066487] INFO -- : generating makefiles ext/configure-ext.mk I, [2024-05-13T04:30:07.967526 #1066487] INFO -- : ext/configure-ext.mk updated I, [2024-05-13T04:30:07.969964 #1066487] INFO -- : make[1]: Entering directory '/tmp/ruby/build/trunk' I, [2024-05-13T04:30:09.312474 #1066487] INFO -- : make[1]: Leaving directory '/tmp/ruby/build/trunk' I, [2024-05-13T04:30:09.313067 #1066487] INFO -- : generating makefile exts.mk I, [2024-05-13T04:30:09.350380 #1066487] INFO -- : exts.mk unchanged I, [2024-05-13T04:30:09.354738 #1066487] INFO -- : make[1]: Entering directory '/tmp/ruby/build/trunk' I, [2024-05-13T04:30:09.645277 #1066487] INFO -- : make[2]: Entering directory '/tmp/ruby/build/trunk/ext/coverage' I, [2024-05-13T04:30:09.650030 #1066487] INFO -- : make[2]: Leaving directory '/tmp/ruby/build/trunk/ext/coverage' I, [2024-05-13T04:30:09.656556 #1066487] INFO -- : make[2]: Entering directory '/tmp/ruby/build/trunk/ext/date' I, [2024-05-13T04:30:09.661658 #1066487] INFO -- : make[2]: Leaving directory '/tmp/ruby/build/trunk/ext/date' I, [2024-05-13T04:30:09.665522 #1066487] INFO -- : make[2]: Entering directory '/tmp/ruby/build/trunk/ext/digest' I, [2024-05-13T04:30:09.674390 #1066487] INFO -- : make[2]: Leaving directory '/tmp/ruby/build/trunk/ext/digest' I, [2024-05-13T04:30:09.700734 #1066487] INFO -- : make[2]: Entering directory '/tmp/ruby/build/trunk/ext/digest/sha2' I, [2024-05-13T04:30:09.705532 #1066487] INFO -- : make[2]: Leaving directory '/tmp/ruby/build/trunk/ext/digest/sha2' I, [2024-05-13T04:30:09.726642 #1066487] INFO -- : make[2]: Entering directory '/tmp/ruby/build/trunk/ext/fiddle' I, [2024-05-13T04:30:09.737394 #1066487] INFO -- : make[2]: Leaving directory '/tmp/ruby/build/trunk/ext/fiddle' I, [2024-05-13T04:30:09.742511 #1066487] INFO -- : make[2]: Entering directory '/tmp/ruby/build/trunk/ext/io/console' I, [2024-05-13T04:30:09.746700 #1066487] INFO -- : make[2]: Leaving directory '/tmp/ruby/build/trunk/ext/io/console' I, [2024-05-13T04:30:09.759606 #1066487] INFO -- : make[2]: Entering directory '/tmp/ruby/build/trunk/ext/json' I, [2024-05-13T04:30:09.770060 #1066487] INFO -- : make[2]: Leaving directory '/tmp/ruby/build/trunk/ext/json' I, [2024-05-13T04:30:09.784874 #1066487] INFO -- : make[2]: Entering directory '/tmp/ruby/build/trunk/ext/monitor' I, [2024-05-13T04:30:09.788564 #1066487] INFO -- : make[2]: Leaving directory '/tmp/ruby/build/trunk/ext/monitor' I, [2024-05-13T04:30:09.795613 #1066487] INFO -- : make[2]: Entering directory '/tmp/ruby/build/trunk/ext/objspace' I, [2024-05-13T04:30:09.802033 #1066487] INFO -- : make[2]: Leaving directory '/tmp/ruby/build/trunk/ext/objspace' I, [2024-05-13T04:30:09.820410 #1066487] INFO -- : make[2]: Entering directory '/tmp/ruby/build/trunk/ext/openssl' I, [2024-05-13T04:30:09.833535 #1066487] INFO -- : make[2]: Leaving directory '/tmp/ruby/build/trunk/ext/openssl' I, [2024-05-13T04:30:09.836425 #1066487] INFO -- : make[2]: Entering directory '/tmp/ruby/build/trunk/ext/pathname' I, [2024-05-13T04:30:09.838989 #1066487] INFO -- : make[2]: Leaving directory '/tmp/ruby/build/trunk/ext/pathname' I, [2024-05-13T04:30:09.843393 #1066487] INFO -- : make[2]: Entering directory '/tmp/ruby/build/trunk/ext/psych' I, [2024-05-13T04:30:09.858964 #1066487] INFO -- : make[2]: Leaving directory '/tmp/ruby/build/trunk/ext/psych' I, [2024-05-13T04:30:09.863063 #1066487] INFO -- : make[2]: Entering directory '/tmp/ruby/build/trunk/ext/pty' I, [2024-05-13T04:30:09.867119 #1066487] INFO -- : make[2]: Leaving directory '/tmp/ruby/build/trunk/ext/pty' I, [2024-05-13T04:30:09.882514 #1066487] INFO -- : make[2]: Entering directory '/tmp/ruby/build/trunk/ext/ripper' I, [2024-05-13T04:30:09.890749 #1066487] INFO -- : make[2]: Leaving directory '/tmp/ruby/build/trunk/ext/ripper' I, [2024-05-13T04:30:09.893358 #1066487] INFO -- : make[2]: Entering directory '/tmp/ruby/build/trunk/ext/rubyvm' I, [2024-05-13T04:30:09.896569 #1066487] INFO -- : make[2]: Leaving directory '/tmp/ruby/build/trunk/ext/rubyvm' I, [2024-05-13T04:30:09.907722 #1066487] INFO -- : make[2]: Entering directory '/tmp/ruby/build/trunk/ext/socket' I, [2024-05-13T04:30:09.917419 #1066487] INFO -- : make[2]: Leaving directory '/tmp/ruby/build/trunk/ext/socket' I, [2024-05-13T04:30:09.935628 #1066487] INFO -- : make[2]: Entering directory '/tmp/ruby/build/trunk/.bundle/gems/bigdecimal-3.1.8/ext/bigdecimal' I, [2024-05-13T04:30:09.964016 #1066487] INFO -- : make[2]: Leaving directory '/tmp/ruby/build/trunk/.bundle/gems/bigdecimal-3.1.8/ext/bigdecimal' I, [2024-05-13T04:30:09.965947 #1066487] INFO -- : make[2]: Entering directory '/tmp/ruby/build/trunk/.bundle/gems/debug-1.9.2/ext/debug' I, [2024-05-13T04:30:09.988851 #1066487] INFO -- : make[2]: Leaving directory '/tmp/ruby/build/trunk/.bundle/gems/debug-1.9.2/ext/debug' I, [2024-05-13T04:30:09.991006 #1066487] INFO -- : make[2]: Entering directory '/tmp/ruby/build/trunk/.bundle/gems/nkf-0.2.0/ext/nkf' I, [2024-05-13T04:30:10.013496 #1066487] INFO -- : make[2]: Leaving directory '/tmp/ruby/build/trunk/.bundle/gems/nkf-0.2.0/ext/nkf' I, [2024-05-13T04:30:10.015827 #1066487] INFO -- : make[2]: Entering directory '/tmp/ruby/build/trunk/.bundle/gems/racc-1.7.3/ext/racc/cparse' I, [2024-05-13T04:30:10.038788 #1066487] INFO -- : make[2]: Leaving directory '/tmp/ruby/build/trunk/.bundle/gems/racc-1.7.3/ext/racc/cparse' I, [2024-05-13T04:30:10.041078 #1066487] INFO -- : make[2]: Entering directory '/tmp/ruby/build/trunk/.bundle/gems/rbs-3.4.4/ext/rbs_extension' I, [2024-05-13T04:30:10.062302 #1066487] INFO -- : make[2]: Leaving directory '/tmp/ruby/build/trunk/.bundle/gems/rbs-3.4.4/ext/rbs_extension' I, [2024-05-13T04:30:10.064428 #1066487] INFO -- : make[2]: Entering directory '/tmp/ruby/build/trunk/.bundle/gems/syslog-0.1.2/ext/syslog' I, [2024-05-13T04:30:10.086413 #1066487] INFO -- : make[2]: Leaving directory '/tmp/ruby/build/trunk/.bundle/gems/syslog-0.1.2/ext/syslog' I, [2024-05-13T04:30:10.111442 #1066487] INFO -- : make[2]: Entering directory '/tmp/ruby/build/trunk' I, [2024-05-13T04:30:10.174874 #1066487] INFO -- : make[2]: 'ruby' is up to date. I, [2024-05-13T04:30:10.174910 #1066487] INFO -- : make[2]: Leaving directory '/tmp/ruby/build/trunk' I, [2024-05-13T04:30:10.175325 #1066487] INFO -- : make[1]: Leaving directory '/tmp/ruby/build/trunk' I, [2024-05-13T04:30:10.178940 #1066487] INFO -- : make[1]: Entering directory '/tmp/ruby/build/trunk' I, [2024-05-13T04:30:10.178963 #1066487] INFO -- : make[1]: Nothing to be done for 'note'. I, [2024-05-13T04:30:10.178969 #1066487] INFO -- : make[1]: Leaving directory '/tmp/ruby/build/trunk' E, [2024-05-13T04:30:10.235676 #1066487] ERROR -- : $ /tmp/ruby/build/trunk/miniruby -I/tmp/ruby/src/trunk/lib /tmp/ruby/src/trunk/tool/runruby.rb --archdir=/tmp/ruby/build/trunk --extout=.ext -- /tmp/ruby/src/trunk/spec/mspec/bin/mspec-run -B /tmp/ruby/src/trunk/spec/default.mspec --error-output stderr --debug -fy -o /tmp/rubytest.gp4oxf/1-mspec-multi-0 E, [2024-05-13T04:30:10.235820 #1066487] ERROR -- : $ /tmp/ruby/build/trunk/miniruby -I/tmp/ruby/src/trunk/lib /tmp/ruby/src/trunk/tool/runruby.rb --archdir=/tmp/ruby/build/trunk --extout=.ext -- /tmp/ruby/src/trunk/spec/mspec/bin/mspec-run -B /tmp/ruby/src/trunk/spec/default.mspec --error-output stderr --debug -fy -o /tmp/rubytest.gp4oxf/2-mspec-multi-1 E, [2024-05-13T04:30:10.236075 #1066487] ERROR -- : $ /tmp/ruby/build/trunk/miniruby -I/tmp/ruby/src/trunk/lib /tmp/ruby/src/trunk/tool/runruby.rb --archdir=/tmp/ruby/build/trunk --extout=.ext -- /tmp/ruby/src/trunk/spec/mspec/bin/mspec-run -B /tmp/ruby/src/trunk/spec/default.mspec --error-output stderr --debug -fy -o /tmp/rubytest.gp4oxf/3-mspec-multi-2 E, [2024-05-13T04:30:10.236352 #1066487] ERROR -- : $ /tmp/ruby/build/trunk/miniruby -I/tmp/ruby/src/trunk/lib /tmp/ruby/src/trunk/tool/runruby.rb --archdir=/tmp/ruby/build/trunk --extout=.ext -- /tmp/ruby/src/trunk/spec/mspec/bin/mspec-run -B /tmp/ruby/src/trunk/spec/default.mspec --error-output stderr --debug -fy -o /tmp/rubytest.gp4oxf/4-mspec-multi-3 E, [2024-05-13T04:30:10.236620 #1066487] ERROR -- : $ /tmp/ruby/build/trunk/miniruby -I/tmp/ruby/src/trunk/lib /tmp/ruby/src/trunk/tool/runruby.rb --archdir=/tmp/ruby/build/trunk --extout=.ext -- /tmp/ruby/src/trunk/spec/mspec/bin/mspec-run -B /tmp/ruby/src/trunk/spec/default.mspec --error-output stderr --debug -fy -o /tmp/rubytest.gp4oxf/5-mspec-multi-4 E, [2024-05-13T04:30:10.236746 #1066487] ERROR -- : $ /tmp/ruby/build/trunk/miniruby -I/tmp/ruby/src/trunk/lib /tmp/ruby/src/trunk/tool/runruby.rb --archdir=/tmp/ruby/build/trunk --extout=.ext -- /tmp/ruby/src/trunk/spec/mspec/bin/mspec-run -B /tmp/ruby/src/trunk/spec/default.mspec --error-output stderr --debug -fy -o /tmp/rubytest.gp4oxf/6-mspec-multi-5 E, [2024-05-13T04:30:10.237136 #1066487] ERROR -- : $ /tmp/ruby/build/trunk/miniruby -I/tmp/ruby/src/trunk/lib /tmp/ruby/src/trunk/tool/runruby.rb --archdir=/tmp/ruby/build/trunk --extout=.ext -- /tmp/ruby/src/trunk/spec/mspec/bin/mspec-run -B /tmp/ruby/src/trunk/spec/default.mspec --error-output stderr --debug -fy -o /tmp/rubytest.gp4oxf/7-mspec-multi-6 E, [2024-05-13T04:30:10.237314 #1066487] ERROR -- : $ /tmp/ruby/build/trunk/miniruby -I/tmp/ruby/src/trunk/lib /tmp/ruby/src/trunk/tool/runruby.rb --archdir=/tmp/ruby/build/trunk --extout=.ext -- /tmp/ruby/src/trunk/spec/mspec/bin/mspec-run -B /tmp/ruby/src/trunk/spec/default.mspec --error-output stderr --debug -fy -o /tmp/rubytest.gp4oxf/8-mspec-multi-7 E, [2024-05-13T04:30:10.237508 #1066487] ERROR -- : $ /tmp/ruby/build/trunk/miniruby -I/tmp/ruby/src/trunk/lib /tmp/ruby/src/trunk/tool/runruby.rb --archdir=/tmp/ruby/build/trunk --extout=.ext -- /tmp/ruby/src/trunk/spec/mspec/bin/mspec-run -B /tmp/ruby/src/trunk/spec/default.mspec --error-output stderr --debug -fy -o /tmp/rubytest.gp4oxf/9-mspec-multi-8 E, [2024-05-13T04:30:10.237730 #1066487] ERROR -- : $ /tmp/ruby/build/trunk/miniruby -I/tmp/ruby/src/trunk/lib /tmp/ruby/src/trunk/tool/runruby.rb --archdir=/tmp/ruby/build/trunk --extout=.ext -- /tmp/ruby/src/trunk/spec/mspec/bin/mspec-run -B /tmp/ruby/src/trunk/spec/default.mspec --error-output stderr --debug -fy -o /tmp/rubytest.gp4oxf/10-mspec-multi-9 E, [2024-05-13T04:30:10.238093 #1066487] ERROR -- : $ /tmp/ruby/build/trunk/miniruby -I/tmp/ruby/src/trunk/lib /tmp/ruby/src/trunk/tool/runruby.rb --archdir=/tmp/ruby/build/trunk --extout=.ext -- /tmp/ruby/src/trunk/spec/mspec/bin/mspec-run -B /tmp/ruby/src/trunk/spec/default.mspec --error-output stderr --debug -fy -o /tmp/rubytest.gp4oxf/11-mspec-multi-10 E, [2024-05-13T04:30:10.238318 #1066487] ERROR -- : $ /tmp/ruby/build/trunk/miniruby -I/tmp/ruby/src/trunk/lib /tmp/ruby/src/trunk/tool/runruby.rb --archdir=/tmp/ruby/build/trunk --extout=.ext -- /tmp/ruby/src/trunk/spec/mspec/bin/mspec-run -B /tmp/ruby/src/trunk/spec/default.mspec --error-output stderr --debug -fy -o /tmp/rubytest.gp4oxf/12-mspec-multi-11 E, [2024-05-13T04:30:10.238547 #1066487] ERROR -- : $ /tmp/ruby/build/trunk/miniruby -I/tmp/ruby/src/trunk/lib /tmp/ruby/src/trunk/tool/runruby.rb --archdir=/tmp/ruby/build/trunk --extout=.ext -- /tmp/ruby/src/trunk/spec/mspec/bin/mspec-run -B /tmp/ruby/src/trunk/spec/default.mspec --error-output stderr --debug -fy -o /tmp/rubytest.gp4oxf/13-mspec-multi-12 E, [2024-05-13T04:30:10.238723 #1066487] ERROR -- : $ /tmp/ruby/build/trunk/miniruby -I/tmp/ruby/src/trunk/lib /tmp/ruby/src/trunk/tool/runruby.rb --archdir=/tmp/ruby/build/trunk --extout=.ext -- /tmp/ruby/src/trunk/spec/mspec/bin/mspec-run -B /tmp/ruby/src/trunk/spec/default.mspec --error-output stderr --debug -fy -o /tmp/rubytest.gp4oxf/14-mspec-multi-13 E, [2024-05-13T04:30:10.238920 #1066487] ERROR -- : $ /tmp/ruby/build/trunk/miniruby -I/tmp/ruby/src/trunk/lib /tmp/ruby/src/trunk/tool/runruby.rb --archdir=/tmp/ruby/build/trunk --extout=.ext -- /tmp/ruby/src/trunk/spec/mspec/bin/mspec-run -B /tmp/ruby/src/trunk/spec/default.mspec --error-output stderr --debug -fy -o /tmp/rubytest.gp4oxf/15-mspec-multi-14 E, [2024-05-13T04:30:10.239098 #1066487] ERROR -- : $ /tmp/ruby/build/trunk/miniruby -I/tmp/ruby/src/trunk/lib /tmp/ruby/src/trunk/tool/runruby.rb --archdir=/tmp/ruby/build/trunk --extout=.ext -- /tmp/ruby/src/trunk/spec/mspec/bin/mspec-run -B /tmp/ruby/src/trunk/spec/default.mspec --error-output stderr --debug -fy -o /tmp/rubytest.gp4oxf/16-mspec-multi-15 E, [2024-05-13T04:30:10.239291 #1066487] ERROR -- : $ /tmp/ruby/build/trunk/miniruby -I/tmp/ruby/src/trunk/lib /tmp/ruby/src/trunk/tool/runruby.rb --archdir=/tmp/ruby/build/trunk --extout=.ext -- /tmp/ruby/src/trunk/spec/mspec/bin/mspec-run -B /tmp/ruby/src/trunk/spec/default.mspec --error-output stderr --debug -fy -o /tmp/rubytest.gp4oxf/17-mspec-multi-16 E, [2024-05-13T04:30:10.239477 #1066487] ERROR -- : $ /tmp/ruby/build/trunk/miniruby -I/tmp/ruby/src/trunk/lib /tmp/ruby/src/trunk/tool/runruby.rb --archdir=/tmp/ruby/build/trunk --extout=.ext -- /tmp/ruby/src/trunk/spec/mspec/bin/mspec-run -B /tmp/ruby/src/trunk/spec/default.mspec --error-output stderr --debug -fy -o /tmp/rubytest.gp4oxf/18-mspec-multi-17 E, [2024-05-13T04:30:10.241870 #1066487] ERROR -- : $ /tmp/ruby/build/trunk/miniruby -I/tmp/ruby/src/trunk/lib /tmp/ruby/src/trunk/tool/runruby.rb --archdir=/tmp/ruby/build/trunk --extout=.ext -- /tmp/ruby/src/trunk/spec/mspec/bin/mspec-run -B /tmp/ruby/src/trunk/spec/default.mspec --error-output stderr --debug -fy -o /tmp/rubytest.gp4oxf/19-mspec-multi-18 E, [2024-05-13T04:30:10.242027 #1066487] ERROR -- : $ /tmp/ruby/build/trunk/miniruby -I/tmp/ruby/src/trunk/lib /tmp/ruby/src/trunk/tool/runruby.rb --archdir=/tmp/ruby/build/trunk --extout=.ext -- /tmp/ruby/src/trunk/spec/mspec/bin/mspec-run -B /tmp/ruby/src/trunk/spec/default.mspec --error-output stderr --debug -fy -o /tmp/rubytest.gp4oxf/20-mspec-multi-19 I, [2024-05-13T04:30:10.410323 #1066487] INFO -- : ruby 3.4.0dev (2024-05-12T23:26:54Z master 3c16d93cd3) [x86_64-linux] I, [2024-05-13T04:30:11.023366 #1066487] INFO -- : 0 ......................................................................... I, [2024-05-13T04:30:11.398977 #1066487] INFO -- : 73 ......................................................................... I, [2024-05-13T04:30:11.547232 #1066487] INFO -- : 146 ......................................................................... I, [2024-05-13T04:30:11.591701 #1066487] INFO -- : 219 ......................................................................... I, [2024-05-13T04:30:11.671731 #1066487] INFO -- : 292 ......................................................................... I, [2024-05-13T04:30:11.706996 #1066487] INFO -- : 365 ......................................................................... I, [2024-05-13T04:30:11.728902 #1066487] INFO -- : 438 ......................................................................... I, [2024-05-13T04:30:11.747979 #1066487] INFO -- : 511 ......................................................................... I, [2024-05-13T04:30:11.766728 #1066487] INFO -- : 584 ......................................................................... I, [2024-05-13T04:30:11.827427 #1066487] INFO -- : 657 ......................................................................... I, [2024-05-13T04:30:11.855030 #1066487] INFO -- : 730 ......................................................................... I, [2024-05-13T04:30:11.874857 #1066487] INFO -- : 803 ......................................................................... I, [2024-05-13T04:30:11.903477 #1066487] INFO -- : 876 ......................................................................... I, [2024-05-13T04:30:11.949067 #1066487] INFO -- : 949 ......................................................................... I, [2024-05-13T04:30:12.057518 #1066487] INFO -- : 1022 ......................................................................... I, [2024-05-13T04:30:12.210681 #1066487] INFO -- : 1095 ......................................................................... I, [2024-05-13T04:30:12.320082 #1066487] INFO -- : 1168 ......................................................................... I, [2024-05-13T04:30:12.378969 #1066487] INFO -- : 1241 ......................................................................... I, [2024-05-13T04:30:12.422852 #1066487] INFO -- : 1314 ......................................................................... I, [2024-05-13T04:30:12.440430 #1066487] INFO -- : 1387 ......................................................................... I, [2024-05-13T04:30:12.545046 #1066487] INFO -- : 1460 ......................................................................... I, [2024-05-13T04:30:12.991040 #1066487] INFO -- : 1533 ......................................................................... I, [2024-05-13T04:30:13.053751 #1066487] INFO -- : 1606 ......................................................................... I, [2024-05-13T04:30:13.151382 #1066487] INFO -- : 1679 ......................................................................... I, [2024-05-13T04:30:13.269734 #1066487] INFO -- : 1752 ......................................................................... I, [2024-05-13T04:30:13.350406 #1066487] INFO -- : 1825 ......................................................................... I, [2024-05-13T04:30:13.444533 #1066487] INFO -- : 1898 ......................................................................... I, [2024-05-13T04:30:13.532978 #1066487] INFO -- : 1971 ......................................................................... I, [2024-05-13T04:30:13.590758 #1066487] INFO -- : 2044 ......................................................................... I, [2024-05-13T04:30:13.655977 #1066487] INFO -- : 2117 ......................................................................... I, [2024-05-13T04:30:13.676554 #1066487] INFO -- : 2190 ......................................................................... I, [2024-05-13T04:30:13.697408 #1066487] INFO -- : 2263 ......................................................................... I, [2024-05-13T04:30:13.712681 #1066487] INFO -- : 2336 ......................................................................... I, [2024-05-13T04:30:13.751681 #1066487] INFO -- : 2409 ......................................................................... I, [2024-05-13T04:30:13.859704 #1066487] INFO -- : 2482 ......................................................................... I, [2024-05-13T04:30:13.887791 #1066487] INFO -- : 2555 ......................................................................... I, [2024-05-13T04:30:13.977972 #1066487] INFO -- : 2628 ......................................................................... I, [2024-05-13T04:30:14.071315 #1066487] INFO -- : 2701 ......................................................................... I, [2024-05-13T04:30:14.109479 #1066487] INFO -- : 2774 ......................................................................... I, [2024-05-13T04:30:14.170438 #1066487] INFO -- : 2847 ......................................................................... I, [2024-05-13T04:30:14.207079 #1066487] INFO -- : 2920 ......................................................................... I, [2024-05-13T04:30:14.237126 #1066487] INFO -- : 2993 ......................................................................... I, [2024-05-13T04:30:14.262364 #1066487] INFO -- : 3066 ......................................................................... I, [2024-05-13T04:30:14.277965 #1066487] INFO -- : 3139 ......................................................................... I, [2024-05-13T04:30:14.288604 #1066487] INFO -- : 3212 ......................................................................... I, [2024-05-13T04:30:14.319888 #1066487] INFO -- : 3285 ......................................................................... I, [2024-05-13T04:30:18.288925 #1066487] INFO -- : 3358 ........................................................................ I, [2024-05-13T04:30:18.288976 #1066487] INFO -- : I, [2024-05-13T04:30:18.288983 #1066487] INFO -- : Finished in 8.052518 seconds I, [2024-05-13T04:30:18.288987 #1066487] INFO -- : I, [2024-05-13T04:30:18.288995 #1066487] INFO -- : 3429 files, 32611 examples, 171512 expectations, 0 failures, 0 errors, 0 tagged I, [2024-05-13T04:30:18.290995 #1066487] INFO -- : $$$[end] "make yes-test-rubyspec MSPECOPT='--error-output stderr --debug -j' TESTS='-j20'" exit with 0.