# Logfile created on 2024-05-12 14:51:24 +0000 by logger.rb/v1.4.3 I, [2024-05-12T14:51:24.346954 #2663356] INFO -- : #, @formatter=nil, @logdev=#, @binmode=false, @mon_data=#, @mon_data_owner_object_id=860>>> I, [2024-05-12T14:51:24.347078 #2663356] INFO -- : $$$[beg] make update-unicode -j20 I, [2024-05-12T14:51:24.406191 #2663356] INFO -- : Downloading Unicode emoji 15.0 files... I, [2024-05-12T14:51:24.406411 #2663356] INFO -- : Downloading Unicode emoji 15.0 files... I, [2024-05-12T14:51:24.407203 #2663356] INFO -- : Downloading Unicode emoji 15.0 files... I, [2024-05-12T14:51:24.451027 #2663356] INFO -- : made symlink emoji/15.0/emoji-sequences.txt to /tmp/ruby/src/trunk/.downloaded-cache/emoji/15.0/emoji-sequences.txt I, [2024-05-12T14:51:24.451240 #2663356] INFO -- : downloading emoji/15.0/emoji-sequences.txt ... downloading emoji/15.0/emoji-test.txt ... /tmp/ruby/src/trunk/enc/unicode/data/emoji/15.0/emoji-sequences.txt already exists E, [2024-05-12T14:51:24.900887 #2663356] ERROR -- : /tmp/ruby/src/trunk/tool/downloader.rb:302:in `rescue in download': failed to download emoji/15.0/emoji-test.txt (RuntimeError) E, [2024-05-12T14:51:24.901002 #2663356] ERROR -- : OpenURI::HTTPError: 403 Forbidden: https://www.unicode.org/Public/emoji/15.0/emoji-test.txt E, [2024-05-12T14:51:24.901020 #2663356] ERROR -- : from /tmp/ruby/src/trunk/tool/downloader.rb:201:in `download' E, [2024-05-12T14:51:24.901033 #2663356] ERROR -- : from /tmp/ruby/src/trunk/tool/downloader.rb:136:in `download' E, [2024-05-12T14:51:24.901044 #2663356] ERROR -- : from /tmp/ruby/src/trunk/tool/downloader.rb:482:in `block in
' E, [2024-05-12T14:51:24.901056 #2663356] ERROR -- : from /tmp/ruby/src/trunk/tool/downloader.rb:465:in `each' E, [2024-05-12T14:51:24.901067 #2663356] ERROR -- : from /tmp/ruby/src/trunk/tool/downloader.rb:465:in `
' E, [2024-05-12T14:51:24.901078 #2663356] ERROR -- : /usr/lib/ruby/3.0.0/open-uri.rb:364:in `open_http': 403 Forbidden (OpenURI::HTTPError) E, [2024-05-12T14:51:24.901089 #2663356] ERROR -- : from /usr/lib/ruby/3.0.0/open-uri.rb:741:in `buffer_open' E, [2024-05-12T14:51:24.901104 #2663356] ERROR -- : from /usr/lib/ruby/3.0.0/open-uri.rb:212:in `block in open_loop' E, [2024-05-12T14:51:24.901114 #2663356] ERROR -- : from /usr/lib/ruby/3.0.0/open-uri.rb:210:in `catch' E, [2024-05-12T14:51:24.901125 #2663356] ERROR -- : from /usr/lib/ruby/3.0.0/open-uri.rb:210:in `open_loop' E, [2024-05-12T14:51:24.901136 #2663356] ERROR -- : from /usr/lib/ruby/3.0.0/open-uri.rb:151:in `open_uri' E, [2024-05-12T14:51:24.901147 #2663356] ERROR -- : from /usr/lib/ruby/3.0.0/open-uri.rb:721:in `open' E, [2024-05-12T14:51:24.901157 #2663356] ERROR -- : from /usr/lib/ruby/3.0.0/open-uri.rb:729:in `read' E, [2024-05-12T14:51:24.901168 #2663356] ERROR -- : from /tmp/ruby/src/trunk/tool/downloader.rb:247:in `block in download' E, [2024-05-12T14:51:24.901195 #2663356] ERROR -- : from /tmp/ruby/src/trunk/tool/downloader.rb:378:in `with_retry' E, [2024-05-12T14:51:24.901210 #2663356] ERROR -- : from /tmp/ruby/src/trunk/tool/downloader.rb:246:in `download' E, [2024-05-12T14:51:24.901222 #2663356] ERROR -- : from /tmp/ruby/src/trunk/tool/downloader.rb:136:in `download' E, [2024-05-12T14:51:24.901232 #2663356] ERROR -- : from /tmp/ruby/src/trunk/tool/downloader.rb:482:in `block in
' E, [2024-05-12T14:51:24.901243 #2663356] ERROR -- : from /tmp/ruby/src/trunk/tool/downloader.rb:465:in `each' E, [2024-05-12T14:51:24.901253 #2663356] ERROR -- : from /tmp/ruby/src/trunk/tool/downloader.rb:465:in `
' E, [2024-05-12T14:51:24.905236 #2663356] ERROR -- : make: *** [uncommon.mk:1765: /tmp/ruby/src/trunk/enc/unicode/data/emoji/15.0/emoji-sequences.txt] Error 1 E, [2024-05-12T14:51:24.905289 #2663356] ERROR -- : make: *** Deleting file '/tmp/ruby/src/trunk/enc/unicode/data/emoji/15.0/emoji-sequences.txt' E, [2024-05-12T14:51:24.905303 #2663356] ERROR -- : make: *** Waiting for unfinished jobs.... E, [2024-05-12T14:51:24.921426 #2663356] ERROR -- : /tmp/ruby/src/trunk/tool/downloader.rb:302:in `rescue in download': failed to download emoji/15.0/emoji-test.txt (RuntimeError) E, [2024-05-12T14:51:24.921514 #2663356] ERROR -- : OpenURI::HTTPError: 403 Forbidden: https://www.unicode.org/Public/emoji/15.0/emoji-test.txt E, [2024-05-12T14:51:24.921534 #2663356] ERROR -- : from /tmp/ruby/src/trunk/tool/downloader.rb:201:in `download' E, [2024-05-12T14:51:24.921546 #2663356] ERROR -- : from /tmp/ruby/src/trunk/tool/downloader.rb:136:in `download' E, [2024-05-12T14:51:24.921558 #2663356] ERROR -- : from /tmp/ruby/src/trunk/tool/downloader.rb:482:in `block in
' E, [2024-05-12T14:51:24.921570 #2663356] ERROR -- : from /tmp/ruby/src/trunk/tool/downloader.rb:465:in `each' E, [2024-05-12T14:51:24.921582 #2663356] ERROR -- : from /tmp/ruby/src/trunk/tool/downloader.rb:465:in `
' E, [2024-05-12T14:51:24.921598 #2663356] ERROR -- : /usr/lib/ruby/3.0.0/open-uri.rb:364:in `open_http': 403 Forbidden (OpenURI::HTTPError) E, [2024-05-12T14:51:24.921611 #2663356] ERROR -- : from /usr/lib/ruby/3.0.0/open-uri.rb:741:in `buffer_open' E, [2024-05-12T14:51:24.921623 #2663356] ERROR -- : from /usr/lib/ruby/3.0.0/open-uri.rb:212:in `block in open_loop' E, [2024-05-12T14:51:24.921635 #2663356] ERROR -- : from /usr/lib/ruby/3.0.0/open-uri.rb:210:in `catch' E, [2024-05-12T14:51:24.921646 #2663356] ERROR -- : from /usr/lib/ruby/3.0.0/open-uri.rb:210:in `open_loop' E, [2024-05-12T14:51:24.921658 #2663356] ERROR -- : from /usr/lib/ruby/3.0.0/open-uri.rb:151:in `open_uri' E, [2024-05-12T14:51:24.921669 #2663356] ERROR -- : from /usr/lib/ruby/3.0.0/open-uri.rb:721:in `open' E, [2024-05-12T14:51:24.921681 #2663356] ERROR -- : from /usr/lib/ruby/3.0.0/open-uri.rb:729:in `read' E, [2024-05-12T14:51:24.921693 #2663356] ERROR -- : from /tmp/ruby/src/trunk/tool/downloader.rb:247:in `block in download' E, [2024-05-12T14:51:24.921708 #2663356] ERROR -- : from /tmp/ruby/src/trunk/tool/downloader.rb:378:in `with_retry' E, [2024-05-12T14:51:24.921720 #2663356] ERROR -- : from /tmp/ruby/src/trunk/tool/downloader.rb:246:in `download' E, [2024-05-12T14:51:24.921731 #2663356] ERROR -- : from /tmp/ruby/src/trunk/tool/downloader.rb:136:in `download' E, [2024-05-12T14:51:24.921743 #2663356] ERROR -- : from /tmp/ruby/src/trunk/tool/downloader.rb:482:in `block in
' E, [2024-05-12T14:51:24.921755 #2663356] ERROR -- : from /tmp/ruby/src/trunk/tool/downloader.rb:465:in `each' E, [2024-05-12T14:51:24.921766 #2663356] ERROR -- : from /tmp/ruby/src/trunk/tool/downloader.rb:465:in `
' E, [2024-05-12T14:51:24.925998 #2663356] ERROR -- : make: *** [uncommon.mk:1765: /tmp/ruby/src/trunk/enc/unicode/data/emoji/15.0/emoji-zwj-sequences.txt] Error 1 E, [2024-05-12T14:51:25.341500 #2663356] ERROR -- : /tmp/ruby/src/trunk/tool/downloader.rb:302:in `rescue in download': failed to download emoji/15.0/emoji-sequences.txt (RuntimeError) E, [2024-05-12T14:51:25.341671 #2663356] ERROR -- : EOFError: end of file reached: https://www.unicode.org/Public/emoji/15.0/emoji-sequences.txt E, [2024-05-12T14:51:25.341695 #2663356] ERROR -- : from /tmp/ruby/src/trunk/tool/downloader.rb:201:in `download' E, [2024-05-12T14:51:25.341709 #2663356] ERROR -- : from /tmp/ruby/src/trunk/tool/downloader.rb:136:in `download' E, [2024-05-12T14:51:25.341723 #2663356] ERROR -- : from /tmp/ruby/src/trunk/tool/downloader.rb:482:in `block in
' E, [2024-05-12T14:51:25.341736 #2663356] ERROR -- : from /tmp/ruby/src/trunk/tool/downloader.rb:465:in `each' E, [2024-05-12T14:51:25.341750 #2663356] ERROR -- : from /tmp/ruby/src/trunk/tool/downloader.rb:465:in `
' E, [2024-05-12T14:51:25.341763 #2663356] ERROR -- : /usr/lib/ruby/3.0.0/net/protocol.rb:227:in `rbuf_fill': end of file reached (EOFError) E, [2024-05-12T14:51:25.341782 #2663356] ERROR -- : from /usr/lib/ruby/3.0.0/net/protocol.rb:193:in `readuntil' E, [2024-05-12T14:51:25.341796 #2663356] ERROR -- : from /usr/lib/ruby/3.0.0/net/protocol.rb:203:in `readline' E, [2024-05-12T14:51:25.341809 #2663356] ERROR -- : from /usr/lib/ruby/3.0.0/net/http/response.rb:42:in `read_status_line' E, [2024-05-12T14:51:25.341822 #2663356] ERROR -- : from /usr/lib/ruby/3.0.0/net/http/response.rb:31:in `read_new' E, [2024-05-12T14:51:25.341835 #2663356] ERROR -- : from /usr/lib/ruby/3.0.0/net/http.rb:1557:in `block in transport_request' E, [2024-05-12T14:51:25.341848 #2663356] ERROR -- : from /usr/lib/ruby/3.0.0/net/http.rb:1548:in `catch' E, [2024-05-12T14:51:25.342095 #2663356] ERROR -- : from /usr/lib/ruby/3.0.0/net/http.rb:1548:in `transport_request' E, [2024-05-12T14:51:25.342108 #2663356] ERROR -- : from /usr/lib/ruby/3.0.0/net/http.rb:1521:in `request' E, [2024-05-12T14:51:25.342120 #2663356] ERROR -- : from /usr/lib/ruby/3.0.0/open-uri.rb:329:in `block in open_http' E, [2024-05-12T14:51:25.342132 #2663356] ERROR -- : from /usr/lib/ruby/3.0.0/net/http.rb:960:in `start' E, [2024-05-12T14:51:25.342144 #2663356] ERROR -- : from /usr/lib/ruby/3.0.0/open-uri.rb:323:in `open_http' E, [2024-05-12T14:51:25.342159 #2663356] ERROR -- : from /usr/lib/ruby/3.0.0/open-uri.rb:741:in `buffer_open' E, [2024-05-12T14:51:25.342171 #2663356] ERROR -- : from /usr/lib/ruby/3.0.0/open-uri.rb:212:in `block in open_loop' E, [2024-05-12T14:51:25.342182 #2663356] ERROR -- : from /usr/lib/ruby/3.0.0/open-uri.rb:210:in `catch' E, [2024-05-12T14:51:25.342194 #2663356] ERROR -- : from /usr/lib/ruby/3.0.0/open-uri.rb:210:in `open_loop' E, [2024-05-12T14:51:25.342205 #2663356] ERROR -- : from /usr/lib/ruby/3.0.0/open-uri.rb:151:in `open_uri' E, [2024-05-12T14:51:25.342217 #2663356] ERROR -- : from /usr/lib/ruby/3.0.0/open-uri.rb:721:in `open' E, [2024-05-12T14:51:25.342228 #2663356] ERROR -- : from /usr/lib/ruby/3.0.0/open-uri.rb:729:in `read' E, [2024-05-12T14:51:25.342243 #2663356] ERROR -- : from /tmp/ruby/src/trunk/tool/downloader.rb:247:in `block in download' E, [2024-05-12T14:51:25.342255 #2663356] ERROR -- : from /tmp/ruby/src/trunk/tool/downloader.rb:378:in `with_retry' E, [2024-05-12T14:51:25.342269 #2663356] ERROR -- : from /tmp/ruby/src/trunk/tool/downloader.rb:246:in `download' E, [2024-05-12T14:51:25.342281 #2663356] ERROR -- : from /tmp/ruby/src/trunk/tool/downloader.rb:136:in `download' E, [2024-05-12T14:51:25.342292 #2663356] ERROR -- : from /tmp/ruby/src/trunk/tool/downloader.rb:482:in `block in
' E, [2024-05-12T14:51:25.342304 #2663356] ERROR -- : from /tmp/ruby/src/trunk/tool/downloader.rb:465:in `each' E, [2024-05-12T14:51:25.342316 #2663356] ERROR -- : from /tmp/ruby/src/trunk/tool/downloader.rb:465:in `
' E, [2024-05-12T14:51:25.347063 #2663356] ERROR -- : make: *** [uncommon.mk:1765: /tmp/ruby/src/trunk/enc/unicode/data/emoji/15.0/emoji-test.txt] Error 1 I, [2024-05-12T14:51:25.347166 #2663356] INFO -- : downloading emoji/15.0/emoji-test.txt ... I, [2024-05-12T14:51:25.347714 #2663356] INFO -- : $$$[end] "make update-unicode -j20" exit with 512. I, [2024-05-12T14:51:25.347786 #2663356] INFO -- : $$$[beg] make update-download -j20 I, [2024-05-12T14:51:25.454620 #2663356] INFO -- : tool/config.guess already exists I, [2024-05-12T14:51:25.454666 #2663356] INFO -- : tool/config.sub already exists I, [2024-05-12T14:51:25.456938 #2663356] INFO -- : Update minitest to ea9caafc0754b1d6236a490d59e624b53209734a I, [2024-05-12T14:51:25.457207 #2663356] INFO -- : Update power_assert to 84e85124c5014a139af39161d484156cfe87a9ed I, [2024-05-12T14:51:25.457929 #2663356] INFO -- : Update rbs to ba7872795d5de04adb8ff500c0e6afdc81a041dd I, [2024-05-12T14:51:25.458204 #2663356] INFO -- : Update typeprof to b19a6416da3a05d57fadd6ffdadb382b6d236ca5 I, [2024-05-12T14:51:25.458375 #2663356] INFO -- : echo ea9caafc0754b1d6236a490d59e624b53209734a | /bin/sh /tmp/ruby/src/trunk/tool/ifchange /tmp/ruby/src/trunk/.bundle/.timestamp/minitest.revision - I, [2024-05-12T14:51:25.458526 #2663356] INFO -- : echo 84e85124c5014a139af39161d484156cfe87a9ed | /bin/sh /tmp/ruby/src/trunk/tool/ifchange /tmp/ruby/src/trunk/.bundle/.timestamp/power_assert.revision - I, [2024-05-12T14:51:25.459410 #2663356] INFO -- : echo ba7872795d5de04adb8ff500c0e6afdc81a041dd | /bin/sh /tmp/ruby/src/trunk/tool/ifchange /tmp/ruby/src/trunk/.bundle/.timestamp/rbs.revision - I, [2024-05-12T14:51:25.459970 #2663356] INFO -- : echo b19a6416da3a05d57fadd6ffdadb382b6d236ca5 | /bin/sh /tmp/ruby/src/trunk/tool/ifchange /tmp/ruby/src/trunk/.bundle/.timestamp/typeprof.revision - I, [2024-05-12T14:51:25.460337 #2663356] INFO -- : /tmp/ruby/src/trunk/.bundle/.timestamp/minitest.revision unchanged I, [2024-05-12T14:51:25.460699 #2663356] INFO -- : /tmp/ruby/src/trunk/.bundle/.timestamp/power_assert.revision unchanged I, [2024-05-12T14:51:25.461348 #2663356] INFO -- : /tmp/ruby/src/trunk/.bundle/.timestamp/rbs.revision unchanged I, [2024-05-12T14:51:25.461996 #2663356] INFO -- : Building power_assert@84e85124c5014a139af39161d484156cfe87a9ed to /tmp/ruby/src/trunk/gems/power_assert-2.0.3.gem I, [2024-05-12T14:51:25.462024 #2663356] INFO -- : /tmp/ruby/src/trunk/.bundle/.timestamp/typeprof.revision unchanged I, [2024-05-12T14:51:25.532098 #2663356] INFO -- : Successfully built RubyGem I, [2024-05-12T14:51:25.532166 #2663356] INFO -- : Name: power_assert I, [2024-05-12T14:51:25.532192 #2663356] INFO -- : Version: 2.0.4dev I, [2024-05-12T14:51:25.532209 #2663356] INFO -- : File: power_assert-2.0.4dev.gem I, [2024-05-12T14:51:25.577426 #2663356] INFO -- : $$$[end] "make update-download -j20" exit with 0. I, [2024-05-12T14:51:25.577466 #2663356] INFO -- : $$$[beg] make update-rubyspec -j20 I, [2024-05-12T14:51:25.635846 #2663356] INFO -- : make: Nothing to be done for 'update-rubyspec'. I, [2024-05-12T14:51:25.636109 #2663356] INFO -- : $$$[end] "make update-rubyspec -j20" exit with 0. I, [2024-05-12T14:51:25.636135 #2663356] INFO -- : $$$[beg] make update-src -j20 I, [2024-05-12T14:51:26.264584 #2663356] INFO -- : Already up to date. I, [2024-05-12T14:51:26.279192 #2663356] INFO -- : Latest commit hash = b911d2222f I, [2024-05-12T14:51:26.280498 #2663356] INFO -- : $$$[end] "make update-src -j20" exit with 0. I, [2024-05-12T14:51:26.280578 #2663356] INFO -- : $$$[beg] make after-update -j20 I, [2024-05-12T14:51:26.354274 #2663356] INFO -- : generating /tmp/ruby/src/trunk/ext/ripper/eventids2table.c I, [2024-05-12T14:51:26.358658 #2663356] INFO -- : make[1]: Entering directory '/tmp/ruby/src/trunk/ext/ripper' I, [2024-05-12T14:51:26.358704 #2663356] INFO -- : make[1]: Nothing to be done for 'src'. I, [2024-05-12T14:51:26.358718 #2663356] INFO -- : make[1]: Leaving directory '/tmp/ruby/src/trunk/ext/ripper' I, [2024-05-12T14:51:26.374696 #2663356] INFO -- : /tmp/ruby/src/trunk/revision.h updated I, [2024-05-12T14:51:26.375699 #2663356] INFO -- : generating x86_64-linux-fake.rb I, [2024-05-12T14:51:26.428737 #2663356] INFO -- : x86_64-linux-fake.rb updated I, [2024-05-12T14:51:26.430061 #2663356] INFO -- : generating enc.mk I, [2024-05-12T14:51:26.549357 #2663356] INFO -- : making srcs under enc I, [2024-05-12T14:51:26.578757 #2663356] INFO -- : make[1]: Entering directory '/tmp/ruby/build/trunk' I, [2024-05-12T14:51:26.578839 #2663356] INFO -- : make[1]: Nothing to be done for 'srcs'. I, [2024-05-12T14:51:26.578856 #2663356] INFO -- : make[1]: Leaving directory '/tmp/ruby/build/trunk' I, [2024-05-12T14:51:26.623415 #2663356] INFO -- : Update minitest to ea9caafc0754b1d6236a490d59e624b53209734a I, [2024-05-12T14:51:26.623466 #2663356] INFO -- : Update power_assert to 84e85124c5014a139af39161d484156cfe87a9ed I, [2024-05-12T14:51:26.623722 #2663356] INFO -- : Update rbs to ba7872795d5de04adb8ff500c0e6afdc81a041dd I, [2024-05-12T14:51:26.624271 #2663356] INFO -- : Update typeprof to b19a6416da3a05d57fadd6ffdadb382b6d236ca5 I, [2024-05-12T14:51:26.624661 #2663356] INFO -- : echo ea9caafc0754b1d6236a490d59e624b53209734a | /bin/sh /tmp/ruby/src/trunk/tool/ifchange /tmp/ruby/src/trunk/.bundle/.timestamp/minitest.revision - I, [2024-05-12T14:51:26.624846 #2663356] INFO -- : echo 84e85124c5014a139af39161d484156cfe87a9ed | /bin/sh /tmp/ruby/src/trunk/tool/ifchange /tmp/ruby/src/trunk/.bundle/.timestamp/power_assert.revision - I, [2024-05-12T14:51:26.625103 #2663356] INFO -- : echo ba7872795d5de04adb8ff500c0e6afdc81a041dd | /bin/sh /tmp/ruby/src/trunk/tool/ifchange /tmp/ruby/src/trunk/.bundle/.timestamp/rbs.revision - I, [2024-05-12T14:51:26.626197 #2663356] INFO -- : echo b19a6416da3a05d57fadd6ffdadb382b6d236ca5 | /bin/sh /tmp/ruby/src/trunk/tool/ifchange /tmp/ruby/src/trunk/.bundle/.timestamp/typeprof.revision - I, [2024-05-12T14:51:26.626415 #2663356] INFO -- : /tmp/ruby/src/trunk/.bundle/.timestamp/minitest.revision unchanged I, [2024-05-12T14:51:26.626776 #2663356] INFO -- : /tmp/ruby/src/trunk/.bundle/.timestamp/power_assert.revision unchanged I, [2024-05-12T14:51:26.626812 #2663356] INFO -- : /tmp/ruby/src/trunk/.bundle/.timestamp/rbs.revision unchanged I, [2024-05-12T14:51:26.627662 #2663356] INFO -- : /tmp/ruby/src/trunk/.bundle/.timestamp/typeprof.revision unchanged I, [2024-05-12T14:51:26.627710 #2663356] INFO -- : Building power_assert@84e85124c5014a139af39161d484156cfe87a9ed to /tmp/ruby/src/trunk/gems/power_assert-2.0.3.gem I, [2024-05-12T14:51:26.696724 #2663356] INFO -- : Successfully built RubyGem I, [2024-05-12T14:51:26.696766 #2663356] INFO -- : Name: power_assert I, [2024-05-12T14:51:26.696772 #2663356] INFO -- : Version: 2.0.4dev I, [2024-05-12T14:51:26.696781 #2663356] INFO -- : File: power_assert-2.0.4dev.gem I, [2024-05-12T14:51:26.698814 #2663356] INFO -- : Extracting bundle gem power_assert-2.0.3... I, [2024-05-12T14:51:26.759424 #2663356] INFO -- : Try with hash version of bundled gems instead of gems/power_assert-2.0.3.gem. We don't use this gem with release version of Ruby. I, [2024-05-12T14:51:26.764391 #2663356] INFO -- : Unpacked gems/power_assert-2.0.4dev.gem I, [2024-05-12T14:51:26.766206 #2663356] INFO -- : $$$[end] "make after-update -j20" exit with 0. I, [2024-05-12T14:51:26.766384 #2663356] INFO -- : $$$[beg] make miniruby -j20 I, [2024-05-12T14:51:26.827951 #2663356] INFO -- : BASERUBY = /usr/bin/ruby --disable=gems I, [2024-05-12T14:51:26.828006 #2663356] INFO -- : CC = gcc I, [2024-05-12T14:51:26.828024 #2663356] INFO -- : LD = ld I, [2024-05-12T14:51:26.828038 #2663356] INFO -- : LDSHARED = gcc -shared I, [2024-05-12T14:51:26.828053 #2663356] INFO -- : CFLAGS = -O3 -fno-fast-math -ggdb3 -Wall -Wextra -Wdeprecated-declarations -Wdiv-by-zero -Wduplicated-cond -Wimplicit-function-declaration -Wimplicit-int -Wpointer-arith -Wwrite-strings -Wold-style-definition -Wimplicit-fallthrough=0 -Wmissing-noreturn -Wno-cast-function-type -Wno-constant-logical-operand -Wno-long-long -Wno-missing-field-initializers -Wno-overlength-strings -Wno-packed-bitfield-compat -Wno-parentheses-equality -Wno-self-assign -Wno-tautological-compare -Wno-unused-parameter -Wno-unused-value -Wsuggest-attribute=format -Wsuggest-attribute=noreturn -Wunused-variable -Wmisleading-indentation -Wundef -fPIC I, [2024-05-12T14:51:26.828068 #2663356] INFO -- : XCFLAGS = -U_FORTIFY_SOURCE -D_FORTIFY_SOURCE=2 -fstack-protector-strong -fno-strict-overflow -fvisibility=hidden -fexcess-precision=standard -DRUBY_EXPORT -I. -I.ext/include/x86_64-linux -I/tmp/ruby/src/trunk/include -I/tmp/ruby/src/trunk -I/tmp/ruby/src/trunk/prism -I/tmp/ruby/src/trunk/enc/unicode/15.0.0 I, [2024-05-12T14:51:26.828095 #2663356] INFO -- : CPPFLAGS = I, [2024-05-12T14:51:26.828110 #2663356] INFO -- : DLDFLAGS = -Wl,--compress-debug-sections=zlib -Wl,-soname,libruby.so.3.4 -fstack-protector-strong I, [2024-05-12T14:51:26.828125 #2663356] INFO -- : SOLIBS = -lz -lrt -lrt -lgmp -ldl -lcrypt -lm -lpthread I, [2024-05-12T14:51:26.828138 #2663356] INFO -- : LANG = en_US.UTF-8 I, [2024-05-12T14:51:26.828152 #2663356] INFO -- : LC_ALL = I, [2024-05-12T14:51:26.828165 #2663356] INFO -- : LC_CTYPE = I, [2024-05-12T14:51:26.828179 #2663356] INFO -- : MFLAGS = -j20 --jobserver-auth=4,5 I, [2024-05-12T14:51:26.828192 #2663356] INFO -- : RUSTC = no I, [2024-05-12T14:51:26.828205 #2663356] INFO -- : YJIT_RUSTC_ARGS = --crate-name=yjit --crate-type=staticlib --edition=2021 -g -C lto=thin -C opt-level=3 -C overflow-checks=on '--out-dir=/tmp/ruby/build/trunk/yjit/target/release/' /tmp/ruby/src/trunk/yjit/src/lib.rs I, [2024-05-12T14:51:26.830441 #2663356] INFO -- : gcc (Ubuntu 11.4.0-1ubuntu1~22.04) 11.4.0 I, [2024-05-12T14:51:26.830497 #2663356] INFO -- : Copyright (C) 2021 Free Software Foundation, Inc. I, [2024-05-12T14:51:26.830514 #2663356] INFO -- : This is free software; see the source for copying conditions. There is NO I, [2024-05-12T14:51:26.830530 #2663356] INFO -- : warranty; not even for MERCHANTABILITY or FITNESS FOR A PARTICULAR PURPOSE. I, [2024-05-12T14:51:26.830544 #2663356] INFO -- : I, [2024-05-12T14:51:26.855471 #2663356] INFO -- : compiling /tmp/ruby/src/trunk/version.c I, [2024-05-12T14:51:26.957440 #2663356] INFO -- : linking miniruby I, [2024-05-12T14:51:27.477399 #2663356] INFO -- : $$$[end] "make miniruby -j20" exit with 0. I, [2024-05-12T14:51:27.477557 #2663356] INFO -- : $$$[beg] make ruby -j20 I, [2024-05-12T14:51:27.536738 #2663356] INFO -- : BASERUBY = /usr/bin/ruby --disable=gems I, [2024-05-12T14:51:27.536775 #2663356] INFO -- : CC = gcc I, [2024-05-12T14:51:27.536781 #2663356] INFO -- : LD = ld I, [2024-05-12T14:51:27.536785 #2663356] INFO -- : LDSHARED = gcc -shared I, [2024-05-12T14:51:27.536792 #2663356] INFO -- : CFLAGS = -O3 -fno-fast-math -ggdb3 -Wall -Wextra -Wdeprecated-declarations -Wdiv-by-zero -Wduplicated-cond -Wimplicit-function-declaration -Wimplicit-int -Wpointer-arith -Wwrite-strings -Wold-style-definition -Wimplicit-fallthrough=0 -Wmissing-noreturn -Wno-cast-function-type -Wno-constant-logical-operand -Wno-long-long -Wno-missing-field-initializers -Wno-overlength-strings -Wno-packed-bitfield-compat -Wno-parentheses-equality -Wno-self-assign -Wno-tautological-compare -Wno-unused-parameter -Wno-unused-value -Wsuggest-attribute=format -Wsuggest-attribute=noreturn -Wunused-variable -Wmisleading-indentation -Wundef -fPIC I, [2024-05-12T14:51:27.536797 #2663356] INFO -- : XCFLAGS = -U_FORTIFY_SOURCE -D_FORTIFY_SOURCE=2 -fstack-protector-strong -fno-strict-overflow -fvisibility=hidden -fexcess-precision=standard -DRUBY_EXPORT -I. -I.ext/include/x86_64-linux -I/tmp/ruby/src/trunk/include -I/tmp/ruby/src/trunk -I/tmp/ruby/src/trunk/prism -I/tmp/ruby/src/trunk/enc/unicode/15.0.0 I, [2024-05-12T14:51:27.536801 #2663356] INFO -- : CPPFLAGS = I, [2024-05-12T14:51:27.536805 #2663356] INFO -- : DLDFLAGS = -Wl,--compress-debug-sections=zlib -Wl,-soname,libruby.so.3.4 -fstack-protector-strong I, [2024-05-12T14:51:27.536809 #2663356] INFO -- : SOLIBS = -lz -lrt -lrt -lgmp -ldl -lcrypt -lm -lpthread I, [2024-05-12T14:51:27.536813 #2663356] INFO -- : LANG = en_US.UTF-8 I, [2024-05-12T14:51:27.536817 #2663356] INFO -- : LC_ALL = I, [2024-05-12T14:51:27.536820 #2663356] INFO -- : LC_CTYPE = I, [2024-05-12T14:51:27.536824 #2663356] INFO -- : MFLAGS = -j20 --jobserver-auth=4,5 I, [2024-05-12T14:51:27.536828 #2663356] INFO -- : RUSTC = no I, [2024-05-12T14:51:27.536832 #2663356] INFO -- : YJIT_RUSTC_ARGS = --crate-name=yjit --crate-type=staticlib --edition=2021 -g -C lto=thin -C opt-level=3 -C overflow-checks=on '--out-dir=/tmp/ruby/build/trunk/yjit/target/release/' /tmp/ruby/src/trunk/yjit/src/lib.rs I, [2024-05-12T14:51:27.538307 #2663356] INFO -- : gcc (Ubuntu 11.4.0-1ubuntu1~22.04) 11.4.0 I, [2024-05-12T14:51:27.538336 #2663356] INFO -- : Copyright (C) 2021 Free Software Foundation, Inc. I, [2024-05-12T14:51:27.538342 #2663356] INFO -- : This is free software; see the source for copying conditions. There is NO I, [2024-05-12T14:51:27.538347 #2663356] INFO -- : warranty; not even for MERCHANTABILITY or FITNESS FOR A PARTICULAR PURPOSE. I, [2024-05-12T14:51:27.538351 #2663356] INFO -- : I, [2024-05-12T14:51:27.647847 #2663356] INFO -- : builtin_binary.inc updated I, [2024-05-12T14:51:27.652470 #2663356] INFO -- : c5234a9416e4f20f175185e840b25b0f08674d14078ed7083f37e655458e3ca9 builtin_binary.inc I, [2024-05-12T14:51:27.653287 #2663356] INFO -- : compiling /tmp/ruby/src/trunk/builtin.c I, [2024-05-12T14:51:27.834686 #2663356] INFO -- : linking static-library libruby-static.a I, [2024-05-12T14:51:28.142210 #2663356] INFO -- : linking shared-library libruby.so.3.4.0 I, [2024-05-12T14:51:29.693475 #2663356] INFO -- : linking ruby I, [2024-05-12T14:51:29.720964 #2663356] INFO -- : $$$[end] "make ruby -j20" exit with 0. I, [2024-05-12T14:51:29.721128 #2663356] INFO -- : $$$[beg] make all -j20 I, [2024-05-12T14:51:29.778678 #2663356] INFO -- : BASERUBY = /usr/bin/ruby --disable=gems I, [2024-05-12T14:51:29.778710 #2663356] INFO -- : CC = gcc I, [2024-05-12T14:51:29.778715 #2663356] INFO -- : LD = ld I, [2024-05-12T14:51:29.778719 #2663356] INFO -- : LDSHARED = gcc -shared I, [2024-05-12T14:51:29.778723 #2663356] INFO -- : CFLAGS = -O3 -fno-fast-math -ggdb3 -Wall -Wextra -Wdeprecated-declarations -Wdiv-by-zero -Wduplicated-cond -Wimplicit-function-declaration -Wimplicit-int -Wpointer-arith -Wwrite-strings -Wold-style-definition -Wimplicit-fallthrough=0 -Wmissing-noreturn -Wno-cast-function-type -Wno-constant-logical-operand -Wno-long-long -Wno-missing-field-initializers -Wno-overlength-strings -Wno-packed-bitfield-compat -Wno-parentheses-equality -Wno-self-assign -Wno-tautological-compare -Wno-unused-parameter -Wno-unused-value -Wsuggest-attribute=format -Wsuggest-attribute=noreturn -Wunused-variable -Wmisleading-indentation -Wundef -fPIC I, [2024-05-12T14:51:29.778728 #2663356] INFO -- : XCFLAGS = -U_FORTIFY_SOURCE -D_FORTIFY_SOURCE=2 -fstack-protector-strong -fno-strict-overflow -fvisibility=hidden -fexcess-precision=standard -DRUBY_EXPORT -I. -I.ext/include/x86_64-linux -I/tmp/ruby/src/trunk/include -I/tmp/ruby/src/trunk -I/tmp/ruby/src/trunk/prism -I/tmp/ruby/src/trunk/enc/unicode/15.0.0 I, [2024-05-12T14:51:29.778732 #2663356] INFO -- : CPPFLAGS = I, [2024-05-12T14:51:29.778736 #2663356] INFO -- : DLDFLAGS = -Wl,--compress-debug-sections=zlib -Wl,-soname,libruby.so.3.4 -fstack-protector-strong I, [2024-05-12T14:51:29.778739 #2663356] INFO -- : SOLIBS = -lz -lrt -lrt -lgmp -ldl -lcrypt -lm -lpthread I, [2024-05-12T14:51:29.778743 #2663356] INFO -- : LANG = en_US.UTF-8 I, [2024-05-12T14:51:29.778746 #2663356] INFO -- : LC_ALL = I, [2024-05-12T14:51:29.778750 #2663356] INFO -- : LC_CTYPE = I, [2024-05-12T14:51:29.778758 #2663356] INFO -- : MFLAGS = -j20 --jobserver-auth=4,5 I, [2024-05-12T14:51:29.778761 #2663356] INFO -- : RUSTC = no I, [2024-05-12T14:51:29.778767 #2663356] INFO -- : YJIT_RUSTC_ARGS = --crate-name=yjit --crate-type=staticlib --edition=2021 -g -C lto=thin -C opt-level=3 -C overflow-checks=on '--out-dir=/tmp/ruby/build/trunk/yjit/target/release/' /tmp/ruby/src/trunk/yjit/src/lib.rs I, [2024-05-12T14:51:29.780751 #2663356] INFO -- : gcc (Ubuntu 11.4.0-1ubuntu1~22.04) 11.4.0 I, [2024-05-12T14:51:29.780772 #2663356] INFO -- : Copyright (C) 2021 Free Software Foundation, Inc. I, [2024-05-12T14:51:29.780778 #2663356] INFO -- : This is free software; see the source for copying conditions. There is NO I, [2024-05-12T14:51:29.780783 #2663356] INFO -- : warranty; not even for MERCHANTABILITY or FITNESS FOR A PARTICULAR PURPOSE. I, [2024-05-12T14:51:29.780794 #2663356] INFO -- : I, [2024-05-12T14:51:29.816203 #2663356] INFO -- : generating enc.mk I, [2024-05-12T14:51:29.818304 #2663356] INFO -- : building spec/ruby/optional/capi/ext/array_spec.so I, [2024-05-12T14:51:29.818686 #2663356] INFO -- : building spec/ruby/optional/capi/ext/basic_object_spec.so I, [2024-05-12T14:51:29.819399 #2663356] INFO -- : building spec/ruby/optional/capi/ext/bignum_spec.so I, [2024-05-12T14:51:29.819920 #2663356] INFO -- : building spec/ruby/optional/capi/ext/binding_spec.so I, [2024-05-12T14:51:29.820162 #2663356] INFO -- : building spec/ruby/optional/capi/ext/boolean_spec.so I, [2024-05-12T14:51:29.820985 #2663356] INFO -- : building spec/ruby/optional/capi/ext/class_id_under_autoload_spec.so I, [2024-05-12T14:51:29.821510 #2663356] INFO -- : building spec/ruby/optional/capi/ext/class_spec.so I, [2024-05-12T14:51:29.822136 #2663356] INFO -- : building spec/ruby/optional/capi/ext/class_under_autoload_spec.so I, [2024-05-12T14:51:29.823521 #2663356] INFO -- : building spec/ruby/optional/capi/ext/complex_spec.so I, [2024-05-12T14:51:29.824610 #2663356] INFO -- : building spec/ruby/optional/capi/ext/constants_spec.so I, [2024-05-12T14:51:29.825262 #2663356] INFO -- : building spec/ruby/optional/capi/ext/data_spec.so I, [2024-05-12T14:51:29.826277 #2663356] INFO -- : building spec/ruby/optional/capi/ext/debug_spec.so I, [2024-05-12T14:51:29.827092 #2663356] INFO -- : building spec/ruby/optional/capi/ext/encoding_spec.so I, [2024-05-12T14:51:29.827383 #2663356] INFO -- : building spec/ruby/optional/capi/ext/enumerator_spec.so I, [2024-05-12T14:51:29.828001 #2663356] INFO -- : building spec/ruby/optional/capi/ext/exception_spec.so I, [2024-05-12T14:51:29.828286 #2663356] INFO -- : building spec/ruby/optional/capi/ext/fiber_spec.so I, [2024-05-12T14:51:29.828980 #2663356] INFO -- : building spec/ruby/optional/capi/ext/file_spec.so I, [2024-05-12T14:51:29.829167 #2663356] INFO -- : building spec/ruby/optional/capi/ext/fixnum_spec.so I, [2024-05-12T14:51:29.830044 #2663356] INFO -- : building spec/ruby/optional/capi/ext/float_spec.so I, [2024-05-12T14:51:29.952806 #2663356] INFO -- : building spec/ruby/optional/capi/ext/gc_spec.so I, [2024-05-12T14:51:29.956562 #2663356] INFO -- : building spec/ruby/optional/capi/ext/globals_spec.so I, [2024-05-12T14:51:29.960478 #2663356] INFO -- : building spec/ruby/optional/capi/ext/hash_spec.so I, [2024-05-12T14:51:29.968281 #2663356] INFO -- : building spec/ruby/optional/capi/ext/integer_spec.so I, [2024-05-12T14:51:29.970181 #2663356] INFO -- : building spec/ruby/optional/capi/ext/io_spec.so I, [2024-05-12T14:51:29.979678 #2663356] INFO -- : building spec/ruby/optional/capi/ext/kernel_spec.so I, [2024-05-12T14:51:29.997074 #2663356] INFO -- : building spec/ruby/optional/capi/ext/language_spec.so I, [2024-05-12T14:51:30.004316 #2663356] INFO -- : building spec/ruby/optional/capi/ext/marshal_spec.so I, [2024-05-12T14:51:30.005045 #2663356] INFO -- : building spec/ruby/optional/capi/ext/module_spec.so I, [2024-05-12T14:51:30.005652 #2663356] INFO -- : building spec/ruby/optional/capi/ext/module_under_autoload_spec.so I, [2024-05-12T14:51:30.006143 #2663356] INFO -- : building spec/ruby/optional/capi/ext/mutex_spec.so I, [2024-05-12T14:51:30.009275 #2663356] INFO -- : building spec/ruby/optional/capi/ext/numeric_spec.so I, [2024-05-12T14:51:30.011639 #2663356] INFO -- : building spec/ruby/optional/capi/ext/object_spec.so I, [2024-05-12T14:51:30.015833 #2663356] INFO -- : building spec/ruby/optional/capi/ext/proc_spec.so I, [2024-05-12T14:51:30.016671 #2663356] INFO -- : building spec/ruby/optional/capi/ext/range_spec.so I, [2024-05-12T14:51:30.028194 #2663356] INFO -- : building spec/ruby/optional/capi/ext/rational_spec.so I, [2024-05-12T14:51:30.051431 #2663356] INFO -- : building spec/ruby/optional/capi/ext/rbasic_spec.so I, [2024-05-12T14:51:30.056629 #2663356] INFO -- : building spec/ruby/optional/capi/ext/regexp_spec.so I, [2024-05-12T14:51:30.127181 #2663356] INFO -- : building spec/ruby/optional/capi/ext/string_spec.so I, [2024-05-12T14:51:30.137164 #2663356] INFO -- : building spec/ruby/optional/capi/ext/struct_spec.so I, [2024-05-12T14:51:30.137636 #2663356] INFO -- : building spec/ruby/optional/capi/ext/st_spec.so I, [2024-05-12T14:51:30.145136 #2663356] INFO -- : building spec/ruby/optional/capi/ext/symbol_spec.so I, [2024-05-12T14:51:30.145734 #2663356] INFO -- : building spec/ruby/optional/capi/ext/thread_spec.so I, [2024-05-12T14:51:30.151108 #2663356] INFO -- : building spec/ruby/optional/capi/ext/time_spec.so I, [2024-05-12T14:51:30.154355 #2663356] INFO -- : building spec/ruby/optional/capi/ext/tracepoint_spec.so I, [2024-05-12T14:51:30.155809 #2663356] INFO -- : building spec/ruby/optional/capi/ext/typed_data_spec.so I, [2024-05-12T14:51:30.160388 #2663356] INFO -- : building spec/ruby/optional/capi/ext/util_spec.so I, [2024-05-12T14:51:30.161899 #2663356] INFO -- : making enc I, [2024-05-12T14:51:30.168601 #2663356] INFO -- : making srcs under enc I, [2024-05-12T14:51:30.188424 #2663356] INFO -- : make[1]: Entering directory '/tmp/ruby/build/trunk' I, [2024-05-12T14:51:30.188493 #2663356] INFO -- : make[1]: Nothing to be done for 'enc'. I, [2024-05-12T14:51:30.188516 #2663356] INFO -- : make[1]: Leaving directory '/tmp/ruby/build/trunk' I, [2024-05-12T14:51:30.216429 #2663356] INFO -- : make[1]: Entering directory '/tmp/ruby/build/trunk' I, [2024-05-12T14:51:30.216490 #2663356] INFO -- : make[1]: Nothing to be done for 'srcs'. I, [2024-05-12T14:51:30.216500 #2663356] INFO -- : make[1]: Leaving directory '/tmp/ruby/build/trunk' I, [2024-05-12T14:51:30.217199 #2663356] INFO -- : generating transdb.h I, [2024-05-12T14:51:30.347341 #2663356] INFO -- : transdb.h unchanged I, [2024-05-12T14:51:30.349131 #2663356] INFO -- : generating makefiles ext/configure-ext.mk I, [2024-05-12T14:51:30.349389 #2663356] INFO -- : making trans I, [2024-05-12T14:51:30.376631 #2663356] INFO -- : ext/configure-ext.mk updated I, [2024-05-12T14:51:30.379220 #2663356] INFO -- : make[1]: Entering directory '/tmp/ruby/build/trunk' I, [2024-05-12T14:51:30.385393 #2663356] INFO -- : make[1]: Entering directory '/tmp/ruby/build/trunk' I, [2024-05-12T14:51:30.386868 #2663356] INFO -- : make[1]: Nothing to be done for 'trans'. I, [2024-05-12T14:51:30.386897 #2663356] INFO -- : make[1]: Leaving directory '/tmp/ruby/build/trunk' I, [2024-05-12T14:51:30.386905 #2663356] INFO -- : making encs I, [2024-05-12T14:51:30.445850 #2663356] INFO -- : make[1]: Entering directory '/tmp/ruby/build/trunk' I, [2024-05-12T14:51:30.445923 #2663356] INFO -- : make[1]: Nothing to be done for 'encs'. I, [2024-05-12T14:51:30.445952 #2663356] INFO -- : make[1]: Leaving directory '/tmp/ruby/build/trunk' I, [2024-05-12T14:51:30.533903 #2663356] INFO -- : make[1]: Leaving directory '/tmp/ruby/build/trunk' I, [2024-05-12T14:51:30.534584 #2663356] INFO -- : generating makefile exts.mk I, [2024-05-12T14:51:30.571786 #2663356] INFO -- : exts.mk unchanged I, [2024-05-12T14:51:30.575994 #2663356] INFO -- : make[1]: Entering directory '/tmp/ruby/build/trunk' I, [2024-05-12T14:51:30.594352 #2663356] INFO -- : make[2]: Entering directory '/tmp/ruby/build/trunk/ext/digest' I, [2024-05-12T14:51:30.595894 #2663356] INFO -- : make[2]: Entering directory '/tmp/ruby/build/trunk/ext/coverage' I, [2024-05-12T14:51:30.596062 #2663356] INFO -- : make[2]: Entering directory '/tmp/ruby/build/trunk/ext/json' I, [2024-05-12T14:51:30.596252 #2663356] INFO -- : make[2]: Entering directory '/tmp/ruby/build/trunk/ext/io/console' I, [2024-05-12T14:51:30.596835 #2663356] INFO -- : make[2]: Entering directory '/tmp/ruby/build/trunk/ext/date' I, [2024-05-12T14:51:30.597206 #2663356] INFO -- : make[2]: Entering directory '/tmp/ruby/build/trunk/ext/rubyvm' I, [2024-05-12T14:51:30.597925 #2663356] INFO -- : make[2]: Entering directory '/tmp/ruby/build/trunk/ext/monitor' I, [2024-05-12T14:51:30.598493 #2663356] INFO -- : make[2]: Entering directory '/tmp/ruby/build/trunk/ext/pathname' I, [2024-05-12T14:51:30.598990 #2663356] INFO -- : make[2]: Entering directory '/tmp/ruby/build/trunk/ext/fiddle' I, [2024-05-12T14:51:30.599177 #2663356] INFO -- : make[2]: Entering directory '/tmp/ruby/build/trunk/ext/pty' I, [2024-05-12T14:51:30.599546 #2663356] INFO -- : make[2]: Leaving directory '/tmp/ruby/build/trunk/ext/io/console' I, [2024-05-12T14:51:30.599572 #2663356] INFO -- : make[2]: Leaving directory '/tmp/ruby/build/trunk/ext/coverage' I, [2024-05-12T14:51:30.599865 #2663356] INFO -- : make[2]: Leaving directory '/tmp/ruby/build/trunk/ext/rubyvm' I, [2024-05-12T14:51:30.600458 #2663356] INFO -- : make[2]: Entering directory '/tmp/ruby/build/trunk/ext/objspace' I, [2024-05-12T14:51:30.600841 #2663356] INFO -- : make[2]: Leaving directory '/tmp/ruby/build/trunk/ext/digest' I, [2024-05-12T14:51:30.600976 #2663356] INFO -- : make[2]: Entering directory '/tmp/ruby/build/trunk/ext/psych' I, [2024-05-12T14:51:30.601113 #2663356] INFO -- : make[2]: Leaving directory '/tmp/ruby/build/trunk/ext/monitor' I, [2024-05-12T14:51:30.601137 #2663356] INFO -- : make[2]: Leaving directory '/tmp/ruby/build/trunk/ext/date' I, [2024-05-12T14:51:30.601768 #2663356] INFO -- : make[2]: Leaving directory '/tmp/ruby/build/trunk/ext/pathname' I, [2024-05-12T14:51:30.602006 #2663356] INFO -- : make[2]: Entering directory '/tmp/ruby/build/trunk/.bundle/gems/bigdecimal-3.1.8/ext/bigdecimal' I, [2024-05-12T14:51:30.602073 #2663356] INFO -- : make[2]: Entering directory '/tmp/ruby/build/trunk/.bundle/gems/debug-1.9.2/ext/debug' I, [2024-05-12T14:51:30.602092 #2663356] INFO -- : make[2]: Leaving directory '/tmp/ruby/build/trunk/ext/pty' I, [2024-05-12T14:51:30.602188 #2663356] INFO -- : make[2]: Entering directory '/tmp/ruby/build/trunk/.bundle/gems/nkf-0.2.0/ext/nkf' I, [2024-05-12T14:51:30.602505 #2663356] INFO -- : make[2]: Entering directory '/tmp/ruby/build/trunk/.bundle/gems/racc-1.7.3/ext/racc/cparse' I, [2024-05-12T14:51:30.603367 #2663356] INFO -- : make[2]: Entering directory '/tmp/ruby/build/trunk/.bundle/gems/syslog-0.1.2/ext/syslog' I, [2024-05-12T14:51:30.603463 #2663356] INFO -- : make[2]: Entering directory '/tmp/ruby/build/trunk/ext/ripper' I, [2024-05-12T14:51:30.603735 #2663356] INFO -- : make[2]: Entering directory '/tmp/ruby/build/trunk/.bundle/gems/rbs-3.4.4/ext/rbs_extension' I, [2024-05-12T14:51:30.604608 #2663356] INFO -- : make[2]: Leaving directory '/tmp/ruby/build/trunk/ext/json' I, [2024-05-12T14:51:30.605629 #2663356] INFO -- : make[2]: Leaving directory '/tmp/ruby/build/trunk/ext/objspace' I, [2024-05-12T14:51:30.607453 #2663356] INFO -- : make[2]: Leaving directory '/tmp/ruby/build/trunk/ext/fiddle' I, [2024-05-12T14:51:30.607487 #2663356] INFO -- : make[2]: Entering directory '/tmp/ruby/build/trunk/ext/socket' I, [2024-05-12T14:51:30.608826 #2663356] INFO -- : make[2]: Leaving directory '/tmp/ruby/build/trunk/ext/ripper' I, [2024-05-12T14:51:30.609486 #2663356] INFO -- : make[2]: Entering directory '/tmp/ruby/build/trunk/ext/digest/sha2' I, [2024-05-12T14:51:30.611667 #2663356] INFO -- : make[2]: Leaving directory '/tmp/ruby/build/trunk/ext/psych' I, [2024-05-12T14:51:30.611864 #2663356] INFO -- : make[2]: Leaving directory '/tmp/ruby/build/trunk/ext/digest/sha2' I, [2024-05-12T14:51:30.612293 #2663356] INFO -- : make[2]: Entering directory '/tmp/ruby/build/trunk/ext/openssl' I, [2024-05-12T14:51:30.615898 #2663356] INFO -- : make[2]: Leaving directory '/tmp/ruby/build/trunk/ext/socket' I, [2024-05-12T14:51:30.623697 #2663356] INFO -- : make[2]: Leaving directory '/tmp/ruby/build/trunk/ext/openssl' I, [2024-05-12T14:51:30.625626 #2663356] INFO -- : make[2]: Leaving directory '/tmp/ruby/build/trunk/.bundle/gems/racc-1.7.3/ext/racc/cparse' I, [2024-05-12T14:51:30.625690 #2663356] INFO -- : make[2]: Leaving directory '/tmp/ruby/build/trunk/.bundle/gems/bigdecimal-3.1.8/ext/bigdecimal' I, [2024-05-12T14:51:30.626702 #2663356] INFO -- : make[2]: Leaving directory '/tmp/ruby/build/trunk/.bundle/gems/nkf-0.2.0/ext/nkf' I, [2024-05-12T14:51:30.627928 #2663356] INFO -- : make[2]: Leaving directory '/tmp/ruby/build/trunk/.bundle/gems/rbs-3.4.4/ext/rbs_extension' I, [2024-05-12T14:51:30.628033 #2663356] INFO -- : make[2]: Leaving directory '/tmp/ruby/build/trunk/.bundle/gems/debug-1.9.2/ext/debug' I, [2024-05-12T14:51:30.634601 #2663356] INFO -- : make[2]: Leaving directory '/tmp/ruby/build/trunk/.bundle/gems/syslog-0.1.2/ext/syslog' I, [2024-05-12T14:51:30.659721 #2663356] INFO -- : make[2]: Entering directory '/tmp/ruby/build/trunk' I, [2024-05-12T14:51:30.737885 #2663356] INFO -- : linking ruby I, [2024-05-12T14:51:30.760214 #2663356] INFO -- : make[2]: Leaving directory '/tmp/ruby/build/trunk' I, [2024-05-12T14:51:30.760603 #2663356] INFO -- : make[1]: Leaving directory '/tmp/ruby/build/trunk' I, [2024-05-12T14:51:30.764203 #2663356] INFO -- : make[1]: Entering directory '/tmp/ruby/build/trunk' I, [2024-05-12T14:51:30.764252 #2663356] INFO -- : make[1]: Nothing to be done for 'note'. I, [2024-05-12T14:51:30.764264 #2663356] INFO -- : make[1]: Leaving directory '/tmp/ruby/build/trunk' I, [2024-05-12T14:51:30.765475 #2663356] INFO -- : $$$[end] "make all -j20" exit with 0. I, [2024-05-12T14:51:30.765756 #2663356] INFO -- : $$$[beg] make install -j20 I, [2024-05-12T14:51:30.829419 #2663356] INFO -- : Update minitest to ea9caafc0754b1d6236a490d59e624b53209734a I, [2024-05-12T14:51:30.829649 #2663356] INFO -- : Update power_assert to 84e85124c5014a139af39161d484156cfe87a9ed I, [2024-05-12T14:51:30.830788 #2663356] INFO -- : Update rbs to ba7872795d5de04adb8ff500c0e6afdc81a041dd I, [2024-05-12T14:51:30.831079 #2663356] INFO -- : Update typeprof to b19a6416da3a05d57fadd6ffdadb382b6d236ca5 I, [2024-05-12T14:51:30.832693 #2663356] INFO -- : echo ea9caafc0754b1d6236a490d59e624b53209734a | /bin/sh /tmp/ruby/src/trunk/tool/ifchange /tmp/ruby/src/trunk/.bundle/.timestamp/minitest.revision - I, [2024-05-12T14:51:30.832931 #2663356] INFO -- : echo 84e85124c5014a139af39161d484156cfe87a9ed | /bin/sh /tmp/ruby/src/trunk/tool/ifchange /tmp/ruby/src/trunk/.bundle/.timestamp/power_assert.revision - I, [2024-05-12T14:51:30.834606 #2663356] INFO -- : BASERUBY = /usr/bin/ruby --disable=gems I, [2024-05-12T14:51:30.834653 #2663356] INFO -- : CC = gcc I, [2024-05-12T14:51:30.834672 #2663356] INFO -- : LD = ld I, [2024-05-12T14:51:30.834688 #2663356] INFO -- : LDSHARED = gcc -shared I, [2024-05-12T14:51:30.834704 #2663356] INFO -- : CFLAGS = -O3 -fno-fast-math -ggdb3 -Wall -Wextra -Wdeprecated-declarations -Wdiv-by-zero -Wduplicated-cond -Wimplicit-function-declaration -Wimplicit-int -Wpointer-arith -Wwrite-strings -Wold-style-definition -Wimplicit-fallthrough=0 -Wmissing-noreturn -Wno-cast-function-type -Wno-constant-logical-operand -Wno-long-long -Wno-missing-field-initializers -Wno-overlength-strings -Wno-packed-bitfield-compat -Wno-parentheses-equality -Wno-self-assign -Wno-tautological-compare -Wno-unused-parameter -Wno-unused-value -Wsuggest-attribute=format -Wsuggest-attribute=noreturn -Wunused-variable -Wmisleading-indentation -Wundef -fPIC I, [2024-05-12T14:51:30.834721 #2663356] INFO -- : XCFLAGS = -U_FORTIFY_SOURCE -D_FORTIFY_SOURCE=2 -fstack-protector-strong -fno-strict-overflow -fvisibility=hidden -fexcess-precision=standard -DRUBY_EXPORT -I. -I.ext/include/x86_64-linux -I/tmp/ruby/src/trunk/include -I/tmp/ruby/src/trunk -I/tmp/ruby/src/trunk/prism -I/tmp/ruby/src/trunk/enc/unicode/15.0.0 I, [2024-05-12T14:51:30.834738 #2663356] INFO -- : CPPFLAGS = I, [2024-05-12T14:51:30.834754 #2663356] INFO -- : DLDFLAGS = -Wl,--compress-debug-sections=zlib -Wl,-soname,libruby.so.3.4 -fstack-protector-strong I, [2024-05-12T14:51:30.834770 #2663356] INFO -- : SOLIBS = -lz -lrt -lrt -lgmp -ldl -lcrypt -lm -lpthread I, [2024-05-12T14:51:30.834785 #2663356] INFO -- : LANG = en_US.UTF-8 I, [2024-05-12T14:51:30.834801 #2663356] INFO -- : LC_ALL = I, [2024-05-12T14:51:30.834816 #2663356] INFO -- : LC_CTYPE = I, [2024-05-12T14:51:30.834837 #2663356] INFO -- : MFLAGS = -j20 --jobserver-auth=4,5 I, [2024-05-12T14:51:30.834853 #2663356] INFO -- : RUSTC = no I, [2024-05-12T14:51:30.834879 #2663356] INFO -- : YJIT_RUSTC_ARGS = --crate-name=yjit --crate-type=staticlib --edition=2021 -g -C lto=thin -C opt-level=3 -C overflow-checks=on '--out-dir=/tmp/ruby/build/trunk/yjit/target/release/' /tmp/ruby/src/trunk/yjit/src/lib.rs I, [2024-05-12T14:51:30.835381 #2663356] INFO -- : /tmp/ruby/src/trunk/.bundle/.timestamp/minitest.revision unchanged I, [2024-05-12T14:51:30.835670 #2663356] INFO -- : /tmp/ruby/src/trunk/.bundle/.timestamp/power_assert.revision unchanged I, [2024-05-12T14:51:30.862842 #2663356] INFO -- : echo ba7872795d5de04adb8ff500c0e6afdc81a041dd | /bin/sh /tmp/ruby/src/trunk/tool/ifchange /tmp/ruby/src/trunk/.bundle/.timestamp/rbs.revision - I, [2024-05-12T14:51:30.863000 #2663356] INFO -- : echo b19a6416da3a05d57fadd6ffdadb382b6d236ca5 | /bin/sh /tmp/ruby/src/trunk/tool/ifchange /tmp/ruby/src/trunk/.bundle/.timestamp/typeprof.revision - I, [2024-05-12T14:51:30.863482 #2663356] INFO -- : generating enc.mk I, [2024-05-12T14:51:30.863590 #2663356] INFO -- : gcc (Ubuntu 11.4.0-1ubuntu1~22.04) 11.4.0 I, [2024-05-12T14:51:30.863604 #2663356] INFO -- : Copyright (C) 2021 Free Software Foundation, Inc. I, [2024-05-12T14:51:30.863616 #2663356] INFO -- : This is free software; see the source for copying conditions. There is NO I, [2024-05-12T14:51:30.863626 #2663356] INFO -- : warranty; not even for MERCHANTABILITY or FITNESS FOR A PARTICULAR PURPOSE. I, [2024-05-12T14:51:30.863636 #2663356] INFO -- : I, [2024-05-12T14:51:30.864959 #2663356] INFO -- : /tmp/ruby/src/trunk/.bundle/.timestamp/rbs.revision unchanged I, [2024-05-12T14:51:30.864989 #2663356] INFO -- : /tmp/ruby/src/trunk/.bundle/.timestamp/typeprof.revision unchanged I, [2024-05-12T14:51:30.987191 #2663356] INFO -- : Building power_assert@84e85124c5014a139af39161d484156cfe87a9ed to /tmp/ruby/src/trunk/gems/power_assert-2.0.3.gem I, [2024-05-12T14:51:30.987810 #2663356] INFO -- : making srcs under enc I, [2024-05-12T14:51:30.987860 #2663356] INFO -- : making enc I, [2024-05-12T14:51:31.004694 #2663356] INFO -- : make[1]: Entering directory '/tmp/ruby/build/trunk' I, [2024-05-12T14:51:31.004756 #2663356] INFO -- : make[1]: Nothing to be done for 'enc'. I, [2024-05-12T14:51:31.004770 #2663356] INFO -- : make[1]: Leaving directory '/tmp/ruby/build/trunk' I, [2024-05-12T14:51:31.016927 #2663356] INFO -- : make[1]: Entering directory '/tmp/ruby/build/trunk' I, [2024-05-12T14:51:31.016986 #2663356] INFO -- : make[1]: Nothing to be done for 'srcs'. I, [2024-05-12T14:51:31.016999 #2663356] INFO -- : make[1]: Leaving directory '/tmp/ruby/build/trunk' I, [2024-05-12T14:51:31.017790 #2663356] INFO -- : generating transdb.h I, [2024-05-12T14:51:31.055930 #2663356] INFO -- : Successfully built RubyGem I, [2024-05-12T14:51:31.055992 #2663356] INFO -- : Name: power_assert I, [2024-05-12T14:51:31.056006 #2663356] INFO -- : Version: 2.0.4dev I, [2024-05-12T14:51:31.056017 #2663356] INFO -- : File: power_assert-2.0.4dev.gem I, [2024-05-12T14:51:31.058106 #2663356] INFO -- : Extracting bundle gem power_assert-2.0.3... I, [2024-05-12T14:51:31.114735 #2663356] INFO -- : transdb.h unchanged I, [2024-05-12T14:51:31.116173 #2663356] INFO -- : generating makefiles ext/configure-ext.mk I, [2024-05-12T14:51:31.116301 #2663356] INFO -- : making trans I, [2024-05-12T14:51:31.120745 #2663356] INFO -- : Try with hash version of bundled gems instead of gems/power_assert-2.0.3.gem. We don't use this gem with release version of Ruby. I, [2024-05-12T14:51:31.125773 #2663356] INFO -- : Unpacked gems/power_assert-2.0.4dev.gem I, [2024-05-12T14:51:31.143074 #2663356] INFO -- : ext/configure-ext.mk unchanged I, [2024-05-12T14:51:31.145476 #2663356] INFO -- : make[1]: Entering directory '/tmp/ruby/build/trunk' I, [2024-05-12T14:51:31.150666 #2663356] INFO -- : make[1]: Entering directory '/tmp/ruby/build/trunk' I, [2024-05-12T14:51:31.150763 #2663356] INFO -- : make[1]: Nothing to be done for 'trans'. I, [2024-05-12T14:51:31.150772 #2663356] INFO -- : make[1]: Leaving directory '/tmp/ruby/build/trunk' I, [2024-05-12T14:51:31.151406 #2663356] INFO -- : making encs I, [2024-05-12T14:51:31.202292 #2663356] INFO -- : make[1]: Entering directory '/tmp/ruby/build/trunk' I, [2024-05-12T14:51:31.202363 #2663356] INFO -- : make[1]: Nothing to be done for 'encs'. I, [2024-05-12T14:51:31.202388 #2663356] INFO -- : make[1]: Leaving directory '/tmp/ruby/build/trunk' I, [2024-05-12T14:51:31.290570 #2663356] INFO -- : make[1]: Leaving directory '/tmp/ruby/build/trunk' I, [2024-05-12T14:51:31.291203 #2663356] INFO -- : generating makefile exts.mk I, [2024-05-12T14:51:31.329463 #2663356] INFO -- : exts.mk unchanged I, [2024-05-12T14:51:31.335129 #2663356] INFO -- : make[1]: Entering directory '/tmp/ruby/build/trunk' I, [2024-05-12T14:51:31.357869 #2663356] INFO -- : make[2]: Entering directory '/tmp/ruby/build/trunk/ext/digest' I, [2024-05-12T14:51:31.358801 #2663356] INFO -- : make[2]: Entering directory '/tmp/ruby/build/trunk/ext/json' I, [2024-05-12T14:51:31.359253 #2663356] INFO -- : make[2]: Entering directory '/tmp/ruby/build/trunk/ext/coverage' I, [2024-05-12T14:51:31.359593 #2663356] INFO -- : make[2]: Entering directory '/tmp/ruby/build/trunk/ext/io/console' I, [2024-05-12T14:51:31.360350 #2663356] INFO -- : make[2]: Entering directory '/tmp/ruby/build/trunk/ext/date' I, [2024-05-12T14:51:31.360614 #2663356] INFO -- : make[2]: Entering directory '/tmp/ruby/build/trunk/ext/monitor' I, [2024-05-12T14:51:31.362125 #2663356] INFO -- : make[2]: Leaving directory '/tmp/ruby/build/trunk/ext/digest' I, [2024-05-12T14:51:31.362262 #2663356] INFO -- : make[2]: Entering directory '/tmp/ruby/build/trunk/ext/rubyvm' I, [2024-05-12T14:51:31.362446 #2663356] INFO -- : make[2]: Entering directory '/tmp/ruby/build/trunk/ext/fiddle' I, [2024-05-12T14:51:31.362857 #2663356] INFO -- : make[2]: Entering directory '/tmp/ruby/build/trunk/ext/pathname' I, [2024-05-12T14:51:31.362891 #2663356] INFO -- : make[2]: Leaving directory '/tmp/ruby/build/trunk/ext/io/console' I, [2024-05-12T14:51:31.362906 #2663356] INFO -- : make[2]: Leaving directory '/tmp/ruby/build/trunk/ext/coverage' I, [2024-05-12T14:51:31.363178 #2663356] INFO -- : make[2]: Entering directory '/tmp/ruby/build/trunk/ext/pty' I, [2024-05-12T14:51:31.363316 #2663356] INFO -- : make[2]: Entering directory '/tmp/ruby/build/trunk/ext/objspace' I, [2024-05-12T14:51:31.363724 #2663356] INFO -- : make[2]: Leaving directory '/tmp/ruby/build/trunk/ext/monitor' I, [2024-05-12T14:51:31.364409 #2663356] INFO -- : make[2]: Leaving directory '/tmp/ruby/build/trunk/ext/json' I, [2024-05-12T14:51:31.364514 #2663356] INFO -- : make[2]: Leaving directory '/tmp/ruby/build/trunk/ext/rubyvm' I, [2024-05-12T14:51:31.364538 #2663356] INFO -- : make[2]: Leaving directory '/tmp/ruby/build/trunk/ext/date' I, [2024-05-12T14:51:31.365271 #2663356] INFO -- : make[2]: Entering directory '/tmp/ruby/build/trunk/ext/psych' I, [2024-05-12T14:51:31.365419 #2663356] INFO -- : make[2]: Leaving directory '/tmp/ruby/build/trunk/ext/pty' I, [2024-05-12T14:51:31.365637 #2663356] INFO -- : make[2]: Leaving directory '/tmp/ruby/build/trunk/ext/pathname' I, [2024-05-12T14:51:31.367010 #2663356] INFO -- : make[2]: Leaving directory '/tmp/ruby/build/trunk/ext/objspace' I, [2024-05-12T14:51:31.367040 #2663356] INFO -- : make[2]: Entering directory '/tmp/ruby/build/trunk/.bundle/gems/debug-1.9.2/ext/debug' I, [2024-05-12T14:51:31.367215 #2663356] INFO -- : make[2]: Entering directory '/tmp/ruby/build/trunk/.bundle/gems/racc-1.7.3/ext/racc/cparse' I, [2024-05-12T14:51:31.367362 #2663356] INFO -- : make[2]: Entering directory '/tmp/ruby/build/trunk/.bundle/gems/bigdecimal-3.1.8/ext/bigdecimal' I, [2024-05-12T14:51:31.367428 #2663356] INFO -- : make[2]: Leaving directory '/tmp/ruby/build/trunk/ext/fiddle' I, [2024-05-12T14:51:31.367918 #2663356] INFO -- : make[2]: Entering directory '/tmp/ruby/build/trunk/.bundle/gems/nkf-0.2.0/ext/nkf' I, [2024-05-12T14:51:31.368233 #2663356] INFO -- : make[2]: Entering directory '/tmp/ruby/build/trunk/.bundle/gems/syslog-0.1.2/ext/syslog' I, [2024-05-12T14:51:31.368396 #2663356] INFO -- : make[2]: Entering directory '/tmp/ruby/build/trunk/ext/ripper' I, [2024-05-12T14:51:31.368680 #2663356] INFO -- : make[2]: Entering directory '/tmp/ruby/build/trunk/.bundle/gems/rbs-3.4.4/ext/rbs_extension' I, [2024-05-12T14:51:31.371843 #2663356] INFO -- : make[2]: Entering directory '/tmp/ruby/build/trunk/ext/digest/sha2' I, [2024-05-12T14:51:31.372503 #2663356] INFO -- : make[2]: Entering directory '/tmp/ruby/build/trunk/ext/socket' I, [2024-05-12T14:51:31.373698 #2663356] INFO -- : make[2]: Leaving directory '/tmp/ruby/build/trunk/ext/ripper' I, [2024-05-12T14:51:31.374105 #2663356] INFO -- : make[2]: Leaving directory '/tmp/ruby/build/trunk/ext/digest/sha2' I, [2024-05-12T14:51:31.375809 #2663356] INFO -- : make[2]: Entering directory '/tmp/ruby/build/trunk/ext/openssl' I, [2024-05-12T14:51:31.376081 #2663356] INFO -- : make[2]: Leaving directory '/tmp/ruby/build/trunk/ext/psych' I, [2024-05-12T14:51:31.378365 #2663356] INFO -- : make[2]: Leaving directory '/tmp/ruby/build/trunk/ext/socket' I, [2024-05-12T14:51:31.387052 #2663356] INFO -- : make[2]: Leaving directory '/tmp/ruby/build/trunk/ext/openssl' I, [2024-05-12T14:51:31.389554 #2663356] INFO -- : make[2]: Leaving directory '/tmp/ruby/build/trunk/.bundle/gems/racc-1.7.3/ext/racc/cparse' I, [2024-05-12T14:51:31.391290 #2663356] INFO -- : make[2]: Leaving directory '/tmp/ruby/build/trunk/.bundle/gems/debug-1.9.2/ext/debug' I, [2024-05-12T14:51:31.391967 #2663356] INFO -- : make[2]: Leaving directory '/tmp/ruby/build/trunk/.bundle/gems/syslog-0.1.2/ext/syslog' I, [2024-05-12T14:51:31.392530 #2663356] INFO -- : make[2]: Leaving directory '/tmp/ruby/build/trunk/.bundle/gems/nkf-0.2.0/ext/nkf' I, [2024-05-12T14:51:31.398849 #2663356] INFO -- : make[2]: Leaving directory '/tmp/ruby/build/trunk/.bundle/gems/bigdecimal-3.1.8/ext/bigdecimal' I, [2024-05-12T14:51:31.401353 #2663356] INFO -- : make[2]: Leaving directory '/tmp/ruby/build/trunk/.bundle/gems/rbs-3.4.4/ext/rbs_extension' I, [2024-05-12T14:51:31.425704 #2663356] INFO -- : make[2]: Entering directory '/tmp/ruby/build/trunk' I, [2024-05-12T14:51:31.493843 #2663356] INFO -- : make[2]: 'ruby' is up to date. I, [2024-05-12T14:51:31.493922 #2663356] INFO -- : make[2]: Leaving directory '/tmp/ruby/build/trunk' I, [2024-05-12T14:51:31.494205 #2663356] INFO -- : make[1]: Leaving directory '/tmp/ruby/build/trunk' I, [2024-05-12T14:51:31.497927 #2663356] INFO -- : make[1]: Entering directory '/tmp/ruby/build/trunk' I, [2024-05-12T14:51:31.497987 #2663356] INFO -- : make[1]: Nothing to be done for 'note'. I, [2024-05-12T14:51:31.498007 #2663356] INFO -- : make[1]: Leaving directory '/tmp/ruby/build/trunk' I, [2024-05-12T14:51:31.498244 #2663356] INFO -- : ./miniruby -I/tmp/ruby/src/trunk/lib -I. -I.ext/common /tmp/ruby/src/trunk/tool/runruby.rb --extout=.ext -- --disable-gems -r./x86_64-linux-fake /tmp/ruby/src/trunk/tool/rbinstall.rb --make="make" --dest-dir="" --extout=".ext" --ext-build-dir="./ext" --mflags="-j20 --jobserver-auth=4,5" --make-flags=" -j20 --jobserver-auth=4,5" --data-mode=0644 --prog-mode=0755 --installed-list .installed.list --mantype="doc" --gnumake --install=all --exclude=doc I, [2024-05-12T14:51:31.593666 #2663356] INFO -- : Installing to I, [2024-05-12T14:51:31.593747 #2663356] INFO -- : installing binary commands: /tmp/ruby/install/trunk/bin I, [2024-05-12T14:51:31.593762 #2663356] INFO -- : installing base libraries: /tmp/ruby/install/trunk/lib I, [2024-05-12T14:51:31.601203 #2663356] INFO -- : installing arch files: /tmp/ruby/install/trunk/lib/ruby/3.4.0+0/x86_64-linux I, [2024-05-12T14:51:31.601264 #2663356] INFO -- : installing pkgconfig data: /tmp/ruby/install/trunk/lib/pkgconfig I, [2024-05-12T14:51:31.601278 #2663356] INFO -- : installing extension objects: /tmp/ruby/install/trunk/lib/ruby/3.4.0+0/x86_64-linux I, [2024-05-12T14:51:31.610612 #2663356] INFO -- : installing extension objects: /tmp/ruby/install/trunk/lib/ruby/site_ruby/3.4.0+0/x86_64-linux I, [2024-05-12T14:51:31.610681 #2663356] INFO -- : installing extension objects: /tmp/ruby/install/trunk/lib/ruby/vendor_ruby/3.4.0+0/x86_64-linux I, [2024-05-12T14:51:31.610695 #2663356] INFO -- : installing extension headers: /tmp/ruby/install/trunk/include/ruby-3.4.0+0/x86_64-linux I, [2024-05-12T14:51:31.610708 #2663356] INFO -- : installing extension scripts: /tmp/ruby/install/trunk/lib/ruby/3.4.0+0 I, [2024-05-12T14:51:31.614637 #2663356] INFO -- : installing extension scripts: /tmp/ruby/install/trunk/lib/ruby/site_ruby/3.4.0+0 I, [2024-05-12T14:51:31.614698 #2663356] INFO -- : installing extension scripts: /tmp/ruby/install/trunk/lib/ruby/vendor_ruby/3.4.0+0 I, [2024-05-12T14:51:31.614717 #2663356] INFO -- : installing extension headers: /tmp/ruby/install/trunk/include/ruby-3.4.0+0/ruby I, [2024-05-12T14:51:31.614728 #2663356] INFO -- : installing command scripts: /tmp/ruby/install/trunk/bin I, [2024-05-12T14:51:31.614741 #2663356] INFO -- : installing library scripts: /tmp/ruby/install/trunk/lib/ruby/3.4.0+0 I, [2024-05-12T14:51:31.648003 #2663356] INFO -- : installing common headers: /tmp/ruby/install/trunk/include/ruby-3.4.0+0 I, [2024-05-12T14:51:31.653419 #2663356] INFO -- : installing manpages: /tmp/ruby/install/trunk/share/man/man1 I, [2024-05-12T14:51:31.653483 #2663356] INFO -- : installing default gems from lib: /tmp/ruby/install/trunk/lib/ruby/gems/3.4.0+0 I, [2024-05-12T14:51:31.675653 #2663356] INFO -- : benchmark 0.3.0 I, [2024-05-12T14:51:31.682428 #2663356] INFO -- : bundler 2.6.0.dev I, [2024-05-12T14:51:31.684604 #2663356] INFO -- : cgi 0.4.1 I, [2024-05-12T14:51:31.685139 #2663356] INFO -- : delegate 0.3.1 I, [2024-05-12T14:51:31.685594 #2663356] INFO -- : did_you_mean 1.6.3 I, [2024-05-12T14:51:31.686051 #2663356] INFO -- : english 0.8.0 I, [2024-05-12T14:51:31.686509 #2663356] INFO -- : erb 4.0.4 I, [2024-05-12T14:51:31.687231 #2663356] INFO -- : error_highlight 0.6.0 I, [2024-05-12T14:51:31.687669 #2663356] INFO -- : fileutils 1.7.2 I, [2024-05-12T14:51:31.688081 #2663356] INFO -- : find 0.2.0 I, [2024-05-12T14:51:31.688516 #2663356] INFO -- : forwardable 1.3.3 I, [2024-05-12T14:51:31.688953 #2663356] INFO -- : ipaddr 1.2.6 I, [2024-05-12T14:51:31.689451 #2663356] INFO -- : irb 1.13.1 I, [2024-05-12T14:51:31.690915 #2663356] INFO -- : logger 1.6.0 I, [2024-05-12T14:51:31.691371 #2663356] INFO -- : net-http 0.4.1 I, [2024-05-12T14:51:31.691862 #2663356] INFO -- : net-protocol 0.2.2 I, [2024-05-12T14:51:31.692345 #2663356] INFO -- : open-uri 0.4.1 I, [2024-05-12T14:51:31.692839 #2663356] INFO -- : open3 0.2.1 I, [2024-05-12T14:51:31.693314 #2663356] INFO -- : optparse 0.5.0 I, [2024-05-12T14:51:31.693727 #2663356] INFO -- : ostruct 0.6.0 I, [2024-05-12T14:51:31.694214 #2663356] INFO -- : pp 0.5.0 I, [2024-05-12T14:51:31.694764 #2663356] INFO -- : prettyprint 0.2.0 I, [2024-05-12T14:51:31.695142 #2663356] INFO -- : prism 0.29.0 I, [2024-05-12T14:51:31.695685 #2663356] INFO -- : pstore 0.1.3 I, [2024-05-12T14:51:31.696088 #2663356] INFO -- : rdoc 6.6.3.1 I, [2024-05-12T14:51:31.697713 #2663356] INFO -- : readline 0.0.4 I, [2024-05-12T14:51:31.698216 #2663356] INFO -- : reline 0.5.6 I, [2024-05-12T14:51:31.698756 #2663356] INFO -- : resolv 0.4.0 I, [2024-05-12T14:51:31.699232 #2663356] INFO -- : ruby2_keywords 0.0.5 I, [2024-05-12T14:51:31.699684 #2663356] INFO -- : securerandom 0.3.1 I, [2024-05-12T14:51:31.700202 #2663356] INFO -- : set 1.1.0 I, [2024-05-12T14:51:31.700658 #2663356] INFO -- : shellwords 0.2.0 I, [2024-05-12T14:51:31.701184 #2663356] INFO -- : singleton 0.2.0 I, [2024-05-12T14:51:31.701630 #2663356] INFO -- : syntax_suggest 2.0.0 I, [2024-05-12T14:51:31.702256 #2663356] INFO -- : tempfile 0.2.1 I, [2024-05-12T14:51:31.702801 #2663356] INFO -- : time 0.3.0 I, [2024-05-12T14:51:31.703290 #2663356] INFO -- : timeout 0.4.1 I, [2024-05-12T14:51:31.704314 #2663356] INFO -- : tmpdir 0.2.0 I, [2024-05-12T14:51:31.704773 #2663356] INFO -- : tsort 0.2.0 I, [2024-05-12T14:51:31.705256 #2663356] INFO -- : un 0.3.0 I, [2024-05-12T14:51:31.705781 #2663356] INFO -- : uri 0.13.0 I, [2024-05-12T14:51:31.706277 #2663356] INFO -- : weakref 0.1.3 I, [2024-05-12T14:51:31.706761 #2663356] INFO -- : yaml 0.3.0 I, [2024-05-12T14:51:31.707106 #2663356] INFO -- : installing default gems from ext: /tmp/ruby/install/trunk/lib/ruby/gems/3.4.0+0 I, [2024-05-12T14:51:31.713422 #2663356] INFO -- : date 3.3.4 I, [2024-05-12T14:51:31.713935 #2663356] INFO -- : digest 3.1.1 I, [2024-05-12T14:51:31.714413 #2663356] INFO -- : etc 1.4.3 I, [2024-05-12T14:51:31.714914 #2663356] INFO -- : fcntl 1.1.0 I, [2024-05-12T14:51:31.715374 #2663356] INFO -- : fiddle 1.1.3 I, [2024-05-12T14:51:31.715969 #2663356] INFO -- : io-console 0.7.2 I, [2024-05-12T14:51:31.716403 #2663356] INFO -- : io-nonblock 0.3.0 I, [2024-05-12T14:51:31.716927 #2663356] INFO -- : io-wait 0.3.1 I, [2024-05-12T14:51:31.717299 #2663356] INFO -- : json 2.7.2 I, [2024-05-12T14:51:31.718448 #2663356] INFO -- : openssl 3.2.0 I, [2024-05-12T14:51:31.718974 #2663356] INFO -- : pathname 0.3.0 I, [2024-05-12T14:51:31.719530 #2663356] INFO -- : psych 5.1.2 I, [2024-05-12T14:51:31.720058 #2663356] INFO -- : stringio 3.1.1 I, [2024-05-12T14:51:31.720593 #2663356] INFO -- : strscan 3.1.1 I, [2024-05-12T14:51:31.721058 #2663356] INFO -- : zlib 3.1.0 I, [2024-05-12T14:51:31.721378 #2663356] INFO -- : installing bundled gems: /tmp/ruby/install/trunk/lib/ruby/gems/3.4.0+0 I, [2024-05-12T14:51:31.721702 #2663356] INFO -- : minitest 5.22.3 I, [2024-05-12T14:51:31.729048 #2663356] INFO -- : rake 13.2.1 I, [2024-05-12T14:51:31.732446 #2663356] INFO -- : test-unit 3.6.2 I, [2024-05-12T14:51:31.736716 #2663356] INFO -- : rexml 3.2.6 I, [2024-05-12T14:51:31.740039 #2663356] INFO -- : rss 0.3.0 I, [2024-05-12T14:51:31.742913 #2663356] INFO -- : net-ftp 0.3.4 I, [2024-05-12T14:51:31.744360 #2663356] INFO -- : net-imap 0.4.11 I, [2024-05-12T14:51:31.747204 #2663356] INFO -- : net-pop 0.1.2 I, [2024-05-12T14:51:31.748180 #2663356] INFO -- : net-smtp 0.5.0 I, [2024-05-12T14:51:31.749248 #2663356] INFO -- : matrix 0.4.2 I, [2024-05-12T14:51:31.752681 #2663356] INFO -- : prime 0.1.2 I, [2024-05-12T14:51:31.758045 #2663356] INFO -- : rbs 3.4.4 I, [2024-05-12T14:51:31.780465 #2663356] INFO -- : typeprof 0.21.11 I, [2024-05-12T14:51:31.783005 #2663356] INFO -- : debug 1.9.2 I, [2024-05-12T14:51:31.785673 #2663356] INFO -- : racc 1.7.3 I, [2024-05-12T14:51:31.788248 #2663356] INFO -- : mutex_m 0.2.0 I, [2024-05-12T14:51:31.789419 #2663356] INFO -- : getoptlong 0.2.1 I, [2024-05-12T14:51:31.790671 #2663356] INFO -- : base64 0.2.0 I, [2024-05-12T14:51:31.791660 #2663356] INFO -- : bigdecimal 3.1.8 I, [2024-05-12T14:51:31.793610 #2663356] INFO -- : observer 0.1.2 I, [2024-05-12T14:51:31.794671 #2663356] INFO -- : abbrev 0.1.2 I, [2024-05-12T14:51:31.796251 #2663356] INFO -- : resolv-replace 0.1.1 I, [2024-05-12T14:51:31.797376 #2663356] INFO -- : rinda 0.2.0 I, [2024-05-12T14:51:31.798742 #2663356] INFO -- : drb 2.2.1 I, [2024-05-12T14:51:31.800208 #2663356] INFO -- : nkf 0.2.0 I, [2024-05-12T14:51:31.802584 #2663356] INFO -- : syslog 0.1.2 I, [2024-05-12T14:51:31.804239 #2663356] INFO -- : csv 3.3.0 I, [2024-05-12T14:51:31.806275 #2663356] INFO -- : installing bundled gem cache: /tmp/ruby/install/trunk/lib/ruby/gems/3.4.0+0/cache I, [2024-05-12T14:51:31.807638 #2663356] INFO -- : skipped bundled gems: I, [2024-05-12T14:51:31.807658 #2663356] INFO -- : power_assert-2.0.4dev.gem not found in bundled_gems I, [2024-05-12T14:51:31.810859 #2663356] INFO -- : $$$[end] "make install -j20" exit with 0. I, [2024-05-12T14:51:31.811012 #2663356] INFO -- : $$$[beg] make yes-btest TESTOPTS='-q -j20' I, [2024-05-12T14:51:37.105565 #2663356] INFO -- : PASS all 1936 tests E, [2024-05-12T14:51:37.111295 #2663356] ERROR -- : I, [2024-05-12T14:51:37.111485 #2663356] INFO -- : $$$[end] "make yes-btest TESTOPTS='-q -j20'" exit with 0. I, [2024-05-12T14:51:37.111608 #2663356] INFO -- : $$$[beg] make yes-test-basic TESTS='-j20' I, [2024-05-12T14:51:37.171373 #2663356] INFO -- : BASERUBY = /usr/bin/ruby --disable=gems I, [2024-05-12T14:51:37.171427 #2663356] INFO -- : CC = gcc I, [2024-05-12T14:51:37.171445 #2663356] INFO -- : LD = ld I, [2024-05-12T14:51:37.171462 #2663356] INFO -- : LDSHARED = gcc -shared I, [2024-05-12T14:51:37.171478 #2663356] INFO -- : CFLAGS = -O3 -fno-fast-math -ggdb3 -Wall -Wextra -Wdeprecated-declarations -Wdiv-by-zero -Wduplicated-cond -Wimplicit-function-declaration -Wimplicit-int -Wpointer-arith -Wwrite-strings -Wold-style-definition -Wimplicit-fallthrough=0 -Wmissing-noreturn -Wno-cast-function-type -Wno-constant-logical-operand -Wno-long-long -Wno-missing-field-initializers -Wno-overlength-strings -Wno-packed-bitfield-compat -Wno-parentheses-equality -Wno-self-assign -Wno-tautological-compare -Wno-unused-parameter -Wno-unused-value -Wsuggest-attribute=format -Wsuggest-attribute=noreturn -Wunused-variable -Wmisleading-indentation -Wundef -fPIC I, [2024-05-12T14:51:37.171494 #2663356] INFO -- : XCFLAGS = -U_FORTIFY_SOURCE -D_FORTIFY_SOURCE=2 -fstack-protector-strong -fno-strict-overflow -fvisibility=hidden -fexcess-precision=standard -DRUBY_EXPORT -I. -I.ext/include/x86_64-linux -I/tmp/ruby/src/trunk/include -I/tmp/ruby/src/trunk -I/tmp/ruby/src/trunk/prism -I/tmp/ruby/src/trunk/enc/unicode/15.0.0 I, [2024-05-12T14:51:37.171528 #2663356] INFO -- : CPPFLAGS = I, [2024-05-12T14:51:37.171544 #2663356] INFO -- : DLDFLAGS = -Wl,--compress-debug-sections=zlib -Wl,-soname,libruby.so.3.4 -fstack-protector-strong I, [2024-05-12T14:51:37.171560 #2663356] INFO -- : SOLIBS = -lz -lrt -lrt -lgmp -ldl -lcrypt -lm -lpthread I, [2024-05-12T14:51:37.171575 #2663356] INFO -- : LANG = en_US.UTF-8 I, [2024-05-12T14:51:37.171589 #2663356] INFO -- : LC_ALL = I, [2024-05-12T14:51:37.171604 #2663356] INFO -- : LC_CTYPE = I, [2024-05-12T14:51:37.171618 #2663356] INFO -- : MFLAGS = I, [2024-05-12T14:51:37.171632 #2663356] INFO -- : RUSTC = no I, [2024-05-12T14:51:37.171647 #2663356] INFO -- : YJIT_RUSTC_ARGS = --crate-name=yjit --crate-type=staticlib --edition=2021 -g -C lto=thin -C opt-level=3 -C overflow-checks=on '--out-dir=/tmp/ruby/build/trunk/yjit/target/release/' /tmp/ruby/src/trunk/yjit/src/lib.rs I, [2024-05-12T14:51:37.172226 #2663356] INFO -- : gcc (Ubuntu 11.4.0-1ubuntu1~22.04) 11.4.0 I, [2024-05-12T14:51:37.172281 #2663356] INFO -- : Copyright (C) 2021 Free Software Foundation, Inc. I, [2024-05-12T14:51:37.172299 #2663356] INFO -- : This is free software; see the source for copying conditions. There is NO I, [2024-05-12T14:51:37.172315 #2663356] INFO -- : warranty; not even for MERCHANTABILITY or FITNESS FOR A PARTICULAR PURPOSE. I, [2024-05-12T14:51:37.172343 #2663356] INFO -- : I, [2024-05-12T14:51:37.287647 #2663356] INFO -- : Checking leaked global symbols...none I, [2024-05-12T14:51:37.327892 #2663356] INFO -- : /tmp/ruby/src/trunk/basictest/test.rb:assignment ....................................................................................................................................................................................................................................................................................................................................................................................OK 372 I, [2024-05-12T14:51:37.327954 #2663356] INFO -- : /tmp/ruby/src/trunk/basictest/test.rb:condition ..OK 2 I, [2024-05-12T14:51:37.327960 #2663356] INFO -- : /tmp/ruby/src/trunk/basictest/test.rb:if/unless ...OK 3 I, [2024-05-12T14:51:37.327981 #2663356] INFO -- : /tmp/ruby/src/trunk/basictest/test.rb:case .....OK 5 I, [2024-05-12T14:51:37.328163 #2663356] INFO -- : /tmp/ruby/src/trunk/basictest/test.rb:while/until ........OK 8 I, [2024-05-12T14:51:37.328214 #2663356] INFO -- : /tmp/ruby/src/trunk/basictest/test.rb:exception ..........OK 10 I, [2024-05-12T14:51:37.328483 #2663356] INFO -- : /tmp/ruby/src/trunk/basictest/test.rb:array .......................................OK 39 I, [2024-05-12T14:51:37.328585 #2663356] INFO -- : /tmp/ruby/src/trunk/basictest/test.rb:hash ...........................OK 27 I, [2024-05-12T14:51:37.329299 #2663356] INFO -- : /tmp/ruby/src/trunk/basictest/test.rb:iterator ...........................................................................................................OK 107 I, [2024-05-12T14:51:37.329576 #2663356] INFO -- : /tmp/ruby/src/trunk/basictest/test.rb:float ................................................................................OK 80 I, [2024-05-12T14:51:37.330584 #2663356] INFO -- : /tmp/ruby/src/trunk/basictest/test.rb:bignum ...............................OK 31 I, [2024-05-12T14:51:37.331353 #2663356] INFO -- : /tmp/ruby/src/trunk/basictest/test.rb:string & char ..............................................................OK 62 I, [2024-05-12T14:51:37.331386 #2663356] INFO -- : /tmp/ruby/src/trunk/basictest/test.rb:assignment ..........OK 10 I, [2024-05-12T14:51:37.331413 #2663356] INFO -- : /tmp/ruby/src/trunk/basictest/test.rb:call ......OK 6 I, [2024-05-12T14:51:37.331466 #2663356] INFO -- : /tmp/ruby/src/trunk/basictest/test.rb:proc .........OK 9 I, [2024-05-12T14:51:37.432138 #2663356] INFO -- : /tmp/ruby/src/trunk/basictest/test.rb:signal ..OK 2 I, [2024-05-12T14:51:37.434743 #2663356] INFO -- : /tmp/ruby/src/trunk/basictest/test.rb:eval ...........................OK 27 I, [2024-05-12T14:51:37.548105 #2663356] INFO -- : /tmp/ruby/src/trunk/basictest/test.rb:system ........OK 8 I, [2024-05-12T14:51:37.548191 #2663356] INFO -- : /tmp/ruby/src/trunk/basictest/test.rb:const .....OK 5 I, [2024-05-12T14:51:37.548215 #2663356] INFO -- : /tmp/ruby/src/trunk/basictest/test.rb:clone .....OK 5 I, [2024-05-12T14:51:37.548229 #2663356] INFO -- : /tmp/ruby/src/trunk/basictest/test.rb:marshal ....OK 4 I, [2024-05-12T14:51:37.548241 #2663356] INFO -- : /tmp/ruby/src/trunk/basictest/test.rb:pack ....OK 4 I, [2024-05-12T14:51:37.548253 #2663356] INFO -- : /tmp/ruby/src/trunk/basictest/test.rb:math ..OK 2 I, [2024-05-12T14:51:37.548348 #2663356] INFO -- : /tmp/ruby/src/trunk/basictest/test.rb:struct ......OK 6 I, [2024-05-12T14:51:37.548390 #2663356] INFO -- : /tmp/ruby/src/trunk/basictest/test.rb:variable ............OK 12 I, [2024-05-12T14:51:37.548423 #2663356] INFO -- : /tmp/ruby/src/trunk/basictest/test.rb:trace ...OK 3 I, [2024-05-12T14:51:37.548467 #2663356] INFO -- : /tmp/ruby/src/trunk/basictest/test.rb:defined? ............OK 12 I, [2024-05-12T14:51:37.548507 #2663356] INFO -- : /tmp/ruby/src/trunk/basictest/test.rb:alias ......OK 6 I, [2024-05-12T14:51:37.548842 #2663356] INFO -- : /tmp/ruby/src/trunk/basictest/test.rb:path .......................OK 23 I, [2024-05-12T14:51:37.583834 #2663356] INFO -- : /tmp/ruby/src/trunk/basictest/test.rb:gc ....OK 4 I, [2024-05-12T14:51:37.586331 #2663356] INFO -- : I, [2024-05-12T14:51:37.586403 #2663356] INFO -- : test succeeded I, [2024-05-12T14:51:37.588411 #2663356] INFO -- : $$$[end] "make yes-test-basic TESTS='-j20'" exit with 0. I, [2024-05-12T14:51:37.588565 #2663356] INFO -- : $$$[beg] make yes-test-all TESTOPTS='--stderr-on-failure' TESTS='-j20' I, [2024-05-12T14:51:37.676285 #2663356] INFO -- : BASERUBY = /usr/bin/ruby --disable=gems I, [2024-05-12T14:51:37.676330 #2663356] INFO -- : CC = gcc I, [2024-05-12T14:51:37.676336 #2663356] INFO -- : LD = ld I, [2024-05-12T14:51:37.676340 #2663356] INFO -- : LDSHARED = gcc -shared I, [2024-05-12T14:51:37.676345 #2663356] INFO -- : CFLAGS = -O3 -fno-fast-math -ggdb3 -Wall -Wextra -Wdeprecated-declarations -Wdiv-by-zero -Wduplicated-cond -Wimplicit-function-declaration -Wimplicit-int -Wpointer-arith -Wwrite-strings -Wold-style-definition -Wimplicit-fallthrough=0 -Wmissing-noreturn -Wno-cast-function-type -Wno-constant-logical-operand -Wno-long-long -Wno-missing-field-initializers -Wno-overlength-strings -Wno-packed-bitfield-compat -Wno-parentheses-equality -Wno-self-assign -Wno-tautological-compare -Wno-unused-parameter -Wno-unused-value -Wsuggest-attribute=format -Wsuggest-attribute=noreturn -Wunused-variable -Wmisleading-indentation -Wundef -fPIC I, [2024-05-12T14:51:37.676349 #2663356] INFO -- : XCFLAGS = -U_FORTIFY_SOURCE -D_FORTIFY_SOURCE=2 -fstack-protector-strong -fno-strict-overflow -fvisibility=hidden -fexcess-precision=standard -DRUBY_EXPORT -I. -I.ext/include/x86_64-linux -I/tmp/ruby/src/trunk/include -I/tmp/ruby/src/trunk -I/tmp/ruby/src/trunk/prism -I/tmp/ruby/src/trunk/enc/unicode/15.0.0 I, [2024-05-12T14:51:37.676353 #2663356] INFO -- : CPPFLAGS = I, [2024-05-12T14:51:37.676357 #2663356] INFO -- : DLDFLAGS = -Wl,--compress-debug-sections=zlib -Wl,-soname,libruby.so.3.4 -fstack-protector-strong I, [2024-05-12T14:51:37.676361 #2663356] INFO -- : SOLIBS = -lz -lrt -lrt -lgmp -ldl -lcrypt -lm -lpthread I, [2024-05-12T14:51:37.676365 #2663356] INFO -- : LANG = en_US.UTF-8 I, [2024-05-12T14:51:37.676368 #2663356] INFO -- : LC_ALL = I, [2024-05-12T14:51:37.676372 #2663356] INFO -- : LC_CTYPE = I, [2024-05-12T14:51:37.676376 #2663356] INFO -- : MFLAGS = I, [2024-05-12T14:51:37.676379 #2663356] INFO -- : RUSTC = no I, [2024-05-12T14:51:37.676383 #2663356] INFO -- : YJIT_RUSTC_ARGS = --crate-name=yjit --crate-type=staticlib --edition=2021 -g -C lto=thin -C opt-level=3 -C overflow-checks=on '--out-dir=/tmp/ruby/build/trunk/yjit/target/release/' /tmp/ruby/src/trunk/yjit/src/lib.rs I, [2024-05-12T14:51:37.677094 #2663356] INFO -- : gcc (Ubuntu 11.4.0-1ubuntu1~22.04) 11.4.0 I, [2024-05-12T14:51:37.677114 #2663356] INFO -- : Copyright (C) 2021 Free Software Foundation, Inc. I, [2024-05-12T14:51:37.677121 #2663356] INFO -- : This is free software; see the source for copying conditions. There is NO I, [2024-05-12T14:51:37.677126 #2663356] INFO -- : warranty; not even for MERCHANTABILITY or FITNESS FOR A PARTICULAR PURPOSE. I, [2024-05-12T14:51:37.677130 #2663356] INFO -- : I, [2024-05-12T14:51:37.679012 #2663356] INFO -- : generating enc.mk I, [2024-05-12T14:51:37.798310 #2663356] INFO -- : making enc I, [2024-05-12T14:51:37.815503 #2663356] INFO -- : make[1]: Entering directory '/tmp/ruby/build/trunk' I, [2024-05-12T14:51:37.815528 #2663356] INFO -- : make[1]: Nothing to be done for 'enc'. I, [2024-05-12T14:51:37.815534 #2663356] INFO -- : make[1]: Leaving directory '/tmp/ruby/build/trunk' I, [2024-05-12T14:51:37.816102 #2663356] INFO -- : making srcs under enc I, [2024-05-12T14:51:37.846058 #2663356] INFO -- : make[1]: Entering directory '/tmp/ruby/build/trunk' I, [2024-05-12T14:51:37.846079 #2663356] INFO -- : make[1]: Nothing to be done for 'srcs'. I, [2024-05-12T14:51:37.846086 #2663356] INFO -- : make[1]: Leaving directory '/tmp/ruby/build/trunk' I, [2024-05-12T14:51:37.846925 #2663356] INFO -- : generating transdb.h I, [2024-05-12T14:51:37.943388 #2663356] INFO -- : transdb.h unchanged I, [2024-05-12T14:51:37.944665 #2663356] INFO -- : making trans I, [2024-05-12T14:51:37.978529 #2663356] INFO -- : make[1]: Entering directory '/tmp/ruby/build/trunk' I, [2024-05-12T14:51:37.978550 #2663356] INFO -- : make[1]: Nothing to be done for 'trans'. I, [2024-05-12T14:51:37.978556 #2663356] INFO -- : make[1]: Leaving directory '/tmp/ruby/build/trunk' I, [2024-05-12T14:51:37.979217 #2663356] INFO -- : making encs I, [2024-05-12T14:51:38.016697 #2663356] INFO -- : make[1]: Entering directory '/tmp/ruby/build/trunk' I, [2024-05-12T14:51:38.016717 #2663356] INFO -- : make[1]: Nothing to be done for 'encs'. I, [2024-05-12T14:51:38.016723 #2663356] INFO -- : make[1]: Leaving directory '/tmp/ruby/build/trunk' I, [2024-05-12T14:51:38.018451 #2663356] INFO -- : generating makefiles ext/configure-ext.mk I, [2024-05-12T14:51:38.044813 #2663356] INFO -- : ext/configure-ext.mk updated I, [2024-05-12T14:51:38.047317 #2663356] INFO -- : make[1]: Entering directory '/tmp/ruby/build/trunk' I, [2024-05-12T14:51:39.391188 #2663356] INFO -- : make[1]: Leaving directory '/tmp/ruby/build/trunk' I, [2024-05-12T14:51:39.391936 #2663356] INFO -- : generating makefile exts.mk I, [2024-05-12T14:51:39.429447 #2663356] INFO -- : exts.mk unchanged I, [2024-05-12T14:51:39.433833 #2663356] INFO -- : make[1]: Entering directory '/tmp/ruby/build/trunk' I, [2024-05-12T14:51:39.769821 #2663356] INFO -- : make[2]: Entering directory '/tmp/ruby/build/trunk/ext/coverage' I, [2024-05-12T14:51:39.773816 #2663356] INFO -- : make[2]: Leaving directory '/tmp/ruby/build/trunk/ext/coverage' I, [2024-05-12T14:51:39.779357 #2663356] INFO -- : make[2]: Entering directory '/tmp/ruby/build/trunk/ext/date' I, [2024-05-12T14:51:39.784384 #2663356] INFO -- : make[2]: Leaving directory '/tmp/ruby/build/trunk/ext/date' I, [2024-05-12T14:51:39.788328 #2663356] INFO -- : make[2]: Entering directory '/tmp/ruby/build/trunk/ext/digest' I, [2024-05-12T14:51:39.797647 #2663356] INFO -- : make[2]: Leaving directory '/tmp/ruby/build/trunk/ext/digest' I, [2024-05-12T14:51:39.824123 #2663356] INFO -- : make[2]: Entering directory '/tmp/ruby/build/trunk/ext/digest/sha2' I, [2024-05-12T14:51:39.828951 #2663356] INFO -- : make[2]: Leaving directory '/tmp/ruby/build/trunk/ext/digest/sha2' I, [2024-05-12T14:51:39.849571 #2663356] INFO -- : make[2]: Entering directory '/tmp/ruby/build/trunk/ext/fiddle' I, [2024-05-12T14:51:39.859728 #2663356] INFO -- : make[2]: Leaving directory '/tmp/ruby/build/trunk/ext/fiddle' I, [2024-05-12T14:51:39.864677 #2663356] INFO -- : make[2]: Entering directory '/tmp/ruby/build/trunk/ext/io/console' I, [2024-05-12T14:51:39.868778 #2663356] INFO -- : make[2]: Leaving directory '/tmp/ruby/build/trunk/ext/io/console' I, [2024-05-12T14:51:39.881836 #2663356] INFO -- : make[2]: Entering directory '/tmp/ruby/build/trunk/ext/json' I, [2024-05-12T14:51:39.892352 #2663356] INFO -- : make[2]: Leaving directory '/tmp/ruby/build/trunk/ext/json' I, [2024-05-12T14:51:39.907517 #2663356] INFO -- : make[2]: Entering directory '/tmp/ruby/build/trunk/ext/monitor' I, [2024-05-12T14:51:39.911715 #2663356] INFO -- : make[2]: Leaving directory '/tmp/ruby/build/trunk/ext/monitor' I, [2024-05-12T14:51:39.918745 #2663356] INFO -- : make[2]: Entering directory '/tmp/ruby/build/trunk/ext/objspace' I, [2024-05-12T14:51:39.924831 #2663356] INFO -- : make[2]: Leaving directory '/tmp/ruby/build/trunk/ext/objspace' I, [2024-05-12T14:51:39.942037 #2663356] INFO -- : make[2]: Entering directory '/tmp/ruby/build/trunk/ext/openssl' I, [2024-05-12T14:51:39.961605 #2663356] INFO -- : make[2]: Leaving directory '/tmp/ruby/build/trunk/ext/openssl' I, [2024-05-12T14:51:39.965226 #2663356] INFO -- : make[2]: Entering directory '/tmp/ruby/build/trunk/ext/pathname' I, [2024-05-12T14:51:39.969296 #2663356] INFO -- : make[2]: Leaving directory '/tmp/ruby/build/trunk/ext/pathname' I, [2024-05-12T14:51:39.977162 #2663356] INFO -- : make[2]: Entering directory '/tmp/ruby/build/trunk/ext/psych' I, [2024-05-12T14:51:39.998104 #2663356] INFO -- : make[2]: Leaving directory '/tmp/ruby/build/trunk/ext/psych' I, [2024-05-12T14:51:40.002069 #2663356] INFO -- : make[2]: Entering directory '/tmp/ruby/build/trunk/ext/pty' I, [2024-05-12T14:51:40.005000 #2663356] INFO -- : make[2]: Leaving directory '/tmp/ruby/build/trunk/ext/pty' I, [2024-05-12T14:51:40.019812 #2663356] INFO -- : make[2]: Entering directory '/tmp/ruby/build/trunk/ext/ripper' I, [2024-05-12T14:51:40.026588 #2663356] INFO -- : make[2]: Leaving directory '/tmp/ruby/build/trunk/ext/ripper' I, [2024-05-12T14:51:40.028871 #2663356] INFO -- : make[2]: Entering directory '/tmp/ruby/build/trunk/ext/rubyvm' I, [2024-05-12T14:51:40.032031 #2663356] INFO -- : make[2]: Leaving directory '/tmp/ruby/build/trunk/ext/rubyvm' I, [2024-05-12T14:51:40.045623 #2663356] INFO -- : make[2]: Entering directory '/tmp/ruby/build/trunk/ext/socket' I, [2024-05-12T14:51:40.056288 #2663356] INFO -- : make[2]: Leaving directory '/tmp/ruby/build/trunk/ext/socket' I, [2024-05-12T14:51:40.074448 #2663356] INFO -- : make[2]: Entering directory '/tmp/ruby/build/trunk/.bundle/gems/bigdecimal-3.1.8/ext/bigdecimal' I, [2024-05-12T14:51:40.102363 #2663356] INFO -- : make[2]: Leaving directory '/tmp/ruby/build/trunk/.bundle/gems/bigdecimal-3.1.8/ext/bigdecimal' I, [2024-05-12T14:51:40.104407 #2663356] INFO -- : make[2]: Entering directory '/tmp/ruby/build/trunk/.bundle/gems/debug-1.9.2/ext/debug' I, [2024-05-12T14:51:40.126628 #2663356] INFO -- : make[2]: Leaving directory '/tmp/ruby/build/trunk/.bundle/gems/debug-1.9.2/ext/debug' I, [2024-05-12T14:51:40.128607 #2663356] INFO -- : make[2]: Entering directory '/tmp/ruby/build/trunk/.bundle/gems/nkf-0.2.0/ext/nkf' I, [2024-05-12T14:51:40.150045 #2663356] INFO -- : make[2]: Leaving directory '/tmp/ruby/build/trunk/.bundle/gems/nkf-0.2.0/ext/nkf' I, [2024-05-12T14:51:40.151975 #2663356] INFO -- : make[2]: Entering directory '/tmp/ruby/build/trunk/.bundle/gems/racc-1.7.3/ext/racc/cparse' I, [2024-05-12T14:51:40.173200 #2663356] INFO -- : make[2]: Leaving directory '/tmp/ruby/build/trunk/.bundle/gems/racc-1.7.3/ext/racc/cparse' I, [2024-05-12T14:51:40.175397 #2663356] INFO -- : make[2]: Entering directory '/tmp/ruby/build/trunk/.bundle/gems/rbs-3.4.4/ext/rbs_extension' I, [2024-05-12T14:51:40.196912 #2663356] INFO -- : make[2]: Leaving directory '/tmp/ruby/build/trunk/.bundle/gems/rbs-3.4.4/ext/rbs_extension' I, [2024-05-12T14:51:40.199091 #2663356] INFO -- : make[2]: Entering directory '/tmp/ruby/build/trunk/.bundle/gems/syslog-0.1.2/ext/syslog' I, [2024-05-12T14:51:40.220370 #2663356] INFO -- : make[2]: Leaving directory '/tmp/ruby/build/trunk/.bundle/gems/syslog-0.1.2/ext/syslog' I, [2024-05-12T14:51:40.244631 #2663356] INFO -- : make[2]: Entering directory '/tmp/ruby/build/trunk' I, [2024-05-12T14:51:40.313005 #2663356] INFO -- : make[2]: 'ruby' is up to date. I, [2024-05-12T14:51:40.313041 #2663356] INFO -- : make[2]: Leaving directory '/tmp/ruby/build/trunk' I, [2024-05-12T14:51:40.313461 #2663356] INFO -- : make[1]: Leaving directory '/tmp/ruby/build/trunk' I, [2024-05-12T14:51:40.317125 #2663356] INFO -- : make[1]: Entering directory '/tmp/ruby/build/trunk' I, [2024-05-12T14:51:40.317153 #2663356] INFO -- : make[1]: Nothing to be done for 'note'. I, [2024-05-12T14:51:40.317159 #2663356] INFO -- : make[1]: Leaving directory '/tmp/ruby/build/trunk' I, [2024-05-12T14:51:40.395711 #2663356] INFO -- : Run options: I, [2024-05-12T14:51:40.395776 #2663356] INFO -- : --seed=26746 I, [2024-05-12T14:51:40.395783 #2663356] INFO -- : "--ruby=./miniruby -I/tmp/ruby/src/trunk/lib -I. -I.ext/common /tmp/ruby/src/trunk/tool/runruby.rb --extout=.ext -- --disable-gems" I, [2024-05-12T14:51:40.395787 #2663356] INFO -- : --excludes-dir=/tmp/ruby/src/trunk/test/.excludes I, [2024-05-12T14:51:40.395791 #2663356] INFO -- : --name=!/memory_leak/ I, [2024-05-12T14:51:40.395794 #2663356] INFO -- : --stderr-on-failure I, [2024-05-12T14:51:40.395797 #2663356] INFO -- : -j20 I, [2024-05-12T14:51:40.395801 #2663356] INFO -- : I, [2024-05-12T14:51:40.395805 #2663356] INFO -- : # Running tests: I, [2024-05-12T14:51:40.395808 #2663356] INFO -- : I, [2024-05-12T14:51:40.543859 #2663356] INFO -- : [ 1/885] 2704714=test_gem_version I, [2024-05-12T14:51:40.543919 #2663356] INFO -- : [ 2/885] 2704719=test_rdoc_options I, [2024-05-12T14:51:40.543929 #2663356] INFO -- : [ 3/885] 2704717=test_econv I, [2024-05-12T14:51:40.544121 #2663356] INFO -- : [ 4/885] 2704715=test_cesu8 I, [2024-05-12T14:51:40.544156 #2663356] INFO -- : [ 5/885] 2704718=test_string_processing I, [2024-05-12T14:51:40.546260 #2663356] INFO -- : [ 6/885] 2704716=test_fileutils I, [2024-05-12T14:51:40.546633 #2663356] INFO -- : [ 7/885] 2704729=test_emitter I, [2024-05-12T14:51:40.546730 #2663356] INFO -- : [ 8/885] 2704731=test_resource I, [2024-05-12T14:51:40.547035 #2663356] INFO -- : [ 9/885] 2704733=test_gem_commands_signin_command I, [2024-05-12T14:51:40.547127 #2663356] INFO -- : [ 10/885] 2704732=test_ldap I, [2024-05-12T14:51:40.548072 #2663356] INFO -- : [ 11/885] 2704730=test_rdoc_include I, [2024-05-12T14:51:40.554550 #2663356] INFO -- : [ 12/885] 2704715=test_reqarg I, [2024-05-12T14:51:40.574521 #2663356] INFO -- : [ 13/885] 2704732=test_gem_commands_list_command I, [2024-05-12T14:51:40.577388 #2663356] INFO -- : [ 14/885] 2704723=test_stack I, [2024-05-12T14:51:40.578518 #2663356] INFO -- : [ 15/885] 2704726=test_too_many_dummy_encodings I, [2024-05-12T14:51:40.578965 #2663356] INFO -- : [ 16/885] 2704724=test_mdns I, [2024-05-12T14:51:40.579053 #2663356] INFO -- : [ 17/885] 2704725=test_parse I, [2024-05-12T14:51:40.579420 #2663356] INFO -- : [ 18/885] 2704727=test_gem_remote_fetcher I, [2024-05-12T14:51:40.580451 #2663356] INFO -- : [ 19/885] 2704731=test_scanner_events I, [2024-05-12T14:51:40.584563 #2663356] INFO -- : [ 20/885] 2704728=test_gem_resolver_installed_specification I, [2024-05-12T14:51:40.590204 #2663356] INFO -- : [ 21/885] 2704729=test_gem_ext_ext_conf_builder I, [2024-05-12T14:51:40.593809 #2663356] INFO -- : [ 22/885] 2704720=test_frozen_error I, [2024-05-12T14:51:40.595702 #2663356] INFO -- : [ 23/885] 2704721=test_gem_stub_specification I, [2024-05-12T14:51:40.597079 #2663356] INFO -- : [ 24/885] 2704722=test_method_cache I, [2024-05-12T14:51:40.601644 #2663356] INFO -- : [ 25/885] 2704722=test_gem_commands_search_command I, [2024-05-12T14:51:40.602165 #2663356] INFO -- : [ 26/885] 2704720=test_complex I, [2024-05-12T14:51:40.611786 #2663356] INFO -- : [ 27/885] 2704718=test_inlinecache I, [2024-05-12T14:51:40.616433 #2663356] INFO -- : [ 28/885] 2704724=test_rdoc_markup_verbatim I, [2024-05-12T14:51:40.624799 #2663356] INFO -- : [ 29/885] 2704731=test_gem_resolver_specification I, [2024-05-12T14:51:40.670136 #2663356] INFO -- : [ 30/885] 2704726=test_gem_dependency I, [2024-05-12T14:51:40.704139 #2663356] INFO -- : [ 31/885] 2704714=test_path_to_class I, [2024-05-12T14:51:40.710669 #2663356] INFO -- : [ 32/885] 2704718=test_class I, [2024-05-12T14:51:40.710850 #2663356] INFO -- : [ 33/885] 2704714=test_rdoc_normal_class I, [2024-05-12T14:51:40.742779 #2663356] INFO -- : [ 34/885] 2704732=test_const I, [2024-05-12T14:51:40.743254 #2663356] INFO -- : [ 35/885] 2704724=json_string_matching_test I, [2024-05-12T14:51:40.746909 #2663356] INFO -- : [ 36/885] 2704732=test_load I, [2024-05-12T14:51:40.754176 #2663356] INFO -- : [ 37/885] 2704732=test_random I, [2024-05-12T14:51:40.754408 #2663356] INFO -- : [ 38/885] 2704724=test_asn1 I, [2024-05-12T14:51:40.760058 #2663356] INFO -- : [ 39/885] 2704720=test_irb I, [2024-05-12T14:51:40.788511 #2663356] INFO -- : [ 40/885] 2704732=test_date_strftime I, [2024-05-12T14:51:40.801872 #2663356] INFO -- : [ 41/885] 2704730=test_rdoc_parser_rd I, [2024-05-12T14:51:40.816604 #2663356] INFO -- : [ 42/885] 2704733=test_yamlstore I, [2024-05-12T14:51:40.817523 #2663356] INFO -- : [ 43/885] 2704724=test_gem_installer I, [2024-05-12T14:51:40.819763 #2663356] INFO -- : [ 44/885] 2704722=test_utf32 I, [2024-05-12T14:51:40.825864 #2663356] INFO -- : [ 45/885] 2704722=test_basicsocket I, [2024-05-12T14:51:40.826720 #2663356] INFO -- : [ 46/885] 2704730=test_duplicate I, [2024-05-12T14:51:40.830255 #2663356] INFO -- : [ 47/885] 2704730=test_gem_commands_help_command I, [2024-05-12T14:51:40.844042 #2663356] INFO -- : [ 48/885] 2704722=test_rdoc_markup I, [2024-05-12T14:51:40.847710 #2663356] INFO -- : [ 49/885] 2704731=test_prettyprint I, [2024-05-12T14:51:40.848268 #2663356] INFO -- : [ 50/885] 2704728=test_tracepoint I, [2024-05-12T14:51:40.863991 #2663356] INFO -- : [ 51/885] 2704733=test_internal_ivar I, [2024-05-12T14:51:40.866288 #2663356] INFO -- : [ 52/885] 2704733=test_gem_resolver_index_specification I, [2024-05-12T14:51:40.868946 #2663356] INFO -- : [ 53/885] 2704731=test_function I, [2024-05-12T14:51:40.911827 #2663356] INFO -- : [ 54/885] 2704721=test_queue I, [2024-05-12T14:51:40.926694 #2663356] INFO -- : [ 55/885] 2704715=test_tempfile I, [2024-05-12T14:51:40.930355 #2663356] INFO -- : [ 56/885] 2704721=parse_comments_test I, [2024-05-12T14:51:40.939215 #2663356] INFO -- : [ 57/885] 2704733=test_noarg I, [2024-05-12T14:51:40.957829 #2663356] INFO -- : [ 58/885] 2704719=test_fiddle I, [2024-05-12T14:51:40.967619 #2663356] INFO -- : [ 59/885] 2704716=test_wss I, [2024-05-12T14:51:40.971882 #2663356] INFO -- : [ 60/885] 2704722=test_ractor I, [2024-05-12T14:51:40.984998 #2663356] INFO -- : [ 61/885] 2704716=test_find I, [2024-05-12T14:51:40.987014 #2663356] INFO -- : [ 62/885] 2704719=test_marshalable I, [2024-05-12T14:51:40.991787 #2663356] INFO -- : [ 63/885] 2704719=test_digest I, [2024-05-12T14:51:40.998127 #2663356] INFO -- : [ 64/885] 2704716=test_gem_ext_cmake_builder I, [2024-05-12T14:51:40.999636 #2663356] INFO -- : [ 65/885] 2704721=test_gem_commands_contents_command I, [2024-05-12T14:51:41.008560 #2663356] INFO -- : [ 66/885] 2704726=test_cgi_util I, [2024-05-12T14:51:41.013640 #2663356] INFO -- : [ 67/885] 2704714=test_require I, [2024-05-12T14:51:41.062378 #2663356] INFO -- : [ 68/885] 2704722=test_deprecate I, [2024-05-12T14:51:41.082007 #2663356] INFO -- : [ 69/885] 2704721=test_rdoc_constant I, [2024-05-12T14:51:41.083562 #2663356] INFO -- : [ 70/885] 2704731=test_bash_completion I, [2024-05-12T14:51:41.087482 #2663356] INFO -- : [ 71/885] 2704731=test_formatter I, [2024-05-12T14:51:41.089676 #2663356] INFO -- : [ 72/885] 2704722=test_gem_source_vendor I, [2024-05-12T14:51:41.093534 #2663356] INFO -- : [ 73/885] 2704731=test_gem_commands_owner_command I, [2024-05-12T14:51:41.098602 #2663356] INFO -- : [ 74/885] 2704730=test_recorder I, [2024-05-12T14:51:41.101127 #2663356] INFO -- : [ 75/885] 2704722=test_rdoc_encoding I, [2024-05-12T14:51:41.103686 #2663356] INFO -- : [ 76/885] 2704730=test_coverage I, [2024-05-12T14:51:41.113850 #2663356] INFO -- : [ 77/885] 2704728=regexp_test I, [2024-05-12T14:51:41.121319 #2663356] INFO -- : [ 78/885] 2704720=test_gem_package_tar_reader I, [2024-05-12T14:51:41.123080 #2663356] INFO -- : [ 79/885] 2704722=test_complexrational I, [2024-05-12T14:51:41.131032 #2663356] INFO -- : [ 80/885] 2704722=test_init I, [2024-05-12T14:51:41.136260 #2663356] INFO -- : [ 81/885] 2704733=test_pathname I, [2024-05-12T14:51:41.169306 #2663356] INFO -- : [ 82/885] 2704716=test_rdoc_markdown I, [2024-05-12T14:51:41.173333 #2663356] INFO -- : [ 83/885] 2704715=test_gem_available_set I, [2024-05-12T14:51:41.195500 #2663356] INFO -- : [ 84/885] 2704725=test_rdoc_any_method I, [2024-05-12T14:51:41.199062 #2663356] INFO -- : [ 85/885] 2704728=test_modify_expand I, [2024-05-12T14:51:41.205832 #2663356] INFO -- : [ 86/885] 2704728=test_file I, [2024-05-12T14:51:41.220863 #2663356] INFO -- : [ 87/885] 2704728=test_nowrite I, [2024-05-12T14:51:41.241971 #2663356] INFO -- : [ 88/885] 2704726=test_thread_queue I, [2024-05-12T14:51:41.246390 #2663356] INFO -- : [ 89/885] 2704728=test_rdoc_markup_formatter I, [2024-05-12T14:51:41.283913 #2663356] INFO -- : [ 90/885] 2704732=test_bmethod I, [2024-05-12T14:51:41.288727 #2663356] INFO -- : [ 91/885] 2704732=test_euc_tw I, [2024-05-12T14:51:41.293466 #2663356] INFO -- : [ 92/885] 2704732=test_ractor I, [2024-05-12T14:51:41.305018 #2663356] INFO -- : [ 93/885] 2704732=test_gem_commands_sources_command I, [2024-05-12T14:51:41.346082 #2663356] INFO -- : [ 94/885] 2704721=test_ansi_without_terminfo I, [2024-05-12T14:51:41.362518 #2663356] INFO -- : [ 95/885] 2704720=test_big2str I, [2024-05-12T14:51:41.366920 #2663356] INFO -- : [ 96/885] 2704733=test_yaml I, [2024-05-12T14:51:41.371021 #2663356] INFO -- : [ 97/885] 2704720=test_forwardable I, [2024-05-12T14:51:41.391768 #2663356] INFO -- : [ 98/885] 2704721=test_wait I, [2024-05-12T14:51:41.396116 #2663356] INFO -- : [ 99/885] 2704720=test_handle I, [2024-05-12T14:51:41.405072 #2663356] INFO -- : [100/885] 2704728=test_gbk I, [2024-05-12T14:51:41.409003 #2663356] INFO -- : [101/885] 2704728=test_class2name I, [2024-05-12T14:51:41.412726 #2663356] INFO -- : [102/885] 2704728=test_enc_str_buf_cat I, [2024-05-12T14:51:41.416957 #2663356] INFO -- : [103/885] 2704728=test_pstore I, [2024-05-12T14:51:41.443081 #2663356] INFO -- : [104/885] 2704721=test_cstr I, [2024-05-12T14:51:41.458057 #2663356] INFO -- : [105/885] 2704728=test_profile_frames I, [2024-05-12T14:51:41.469618 #2663356] INFO -- : [106/885] 2704732=test_io_timeout I, [2024-05-12T14:51:41.471585 #2663356] INFO -- : [107/885] 2704733=test_shapes I, [2024-05-12T14:51:41.474305 #2663356] INFO -- : [108/885] 2704732=json_fixtures_test I, [2024-05-12T14:51:41.477297 #2663356] INFO -- : [109/885] 2704723=test_comparable I, [2024-05-12T14:51:41.480728 #2663356] INFO -- : [110/885] 2704723=test_rdoc_parser_c I, [2024-05-12T14:51:41.480800 #2663356] INFO -- : [111/885] 2704733=test_readpartial I, [2024-05-12T14:51:41.484479 #2663356] INFO -- : [112/885] 2704732=test_clone I, [2024-05-12T14:51:41.527620 #2663356] INFO -- : [113/885] 2704715=test_gem_commands_install_command I, [2024-05-12T14:51:41.534069 #2663356] INFO -- : [114/885] 2704720=test_rdoc_require I, [2024-05-12T14:51:41.554604 #2663356] INFO -- : [115/885] 2704717=locals_test I, [2024-05-12T14:51:41.586974 #2663356] INFO -- : [116/885] 2704716=test_rdoc_markup_indented_paragraph I, [2024-05-12T14:51:41.592407 #2663356] INFO -- : [117/885] 2704716=test_rdoc_task I, [2024-05-12T14:51:41.594670 #2663356] INFO -- : [118/885] 2704716=test_gem_resolver_conflict I, [2024-05-12T14:51:41.605720 #2663356] INFO -- : [119/885] 2704722=test_backtrace I, [2024-05-12T14:51:41.608413 #2663356] INFO -- : [120/885] 2704716=test_pack I, [2024-05-12T14:51:41.630164 #2663356] INFO -- : [121/885] 2704716=ruby_parser_test I, [2024-05-12T14:51:41.632650 #2663356] INFO -- : [122/885] 2704731=test_io_buffer I, [2024-05-12T14:51:41.639671 #2663356] INFO -- : [123/885] 2704732=test_yield I, [2024-05-12T14:51:41.643854 #2663356] INFO -- : [124/885] 2704728=test_rdoc_alias I, [2024-05-12T14:51:41.652237 #2663356] INFO -- : [125/885] 2704720=parser_test I, [2024-05-12T14:51:41.699360 #2663356] INFO -- : [126/885] 2704723=test_convertible I, [2024-05-12T14:51:41.700382 #2663356] INFO -- : [127/885] 2704728=test_files_sample I, [2024-05-12T14:51:41.702129 #2663356] INFO -- : [128/885] 2704720=test_stringscanner I, [2024-05-12T14:51:41.718116 #2663356] INFO -- : [129/885] 2704716=encoding_test I, [2024-05-12T14:51:41.736057 #2663356] INFO -- : [130/885] 2704720=test_gem_resolver_best_set I, [2024-05-12T14:51:41.739202 #2663356] INFO -- : [131/885] 2704731=test_typeddata I, [2024-05-12T14:51:41.749949 #2663356] INFO -- : [132/885] 2704719=test_rdoc_markup_to_html_crossref I, [2024-05-12T14:51:41.781440 #2663356] INFO -- : [133/885] 2704716=test_webauthn_poller I, [2024-05-12T14:51:41.785206 #2663356] INFO -- : [134/885] 2704721=test_rdoc_markup_raw I, [2024-05-12T14:51:41.786911 #2663356] INFO -- : [135/885] 2704721=test_rat I, [2024-05-12T14:51:41.792918 #2663356] INFO -- : [136/885] 2704721=test_optparse I, [2024-05-12T14:51:41.798639 #2663356] INFO -- : [137/885] 2704728=test_array I, [2024-05-12T14:51:41.804871 #2663356] INFO -- : [138/885] 2704728=test_fstring I, [2024-05-12T14:51:41.815043 #2663356] INFO -- : [139/885] 2704720=test_etc I, [2024-05-12T14:51:41.836823 #2663356] INFO -- : [140/885] 2704721=test_yjit_exit_locations I, [2024-05-12T14:51:41.838258 #2663356] INFO -- : [141/885] 2704721=test_gem_resolver_activation_request I, [2024-05-12T14:51:41.844710 #2663356] INFO -- : [142/885] 2704725=test_getopts I, [2024-05-12T14:51:41.848909 #2663356] INFO -- : [143/885] 2704725=test_protocol I, [2024-05-12T14:51:41.850361 #2663356] INFO -- : [144/885] 2704721=test_ripper I, [2024-05-12T14:51:41.887631 #2663356] INFO -- : [145/885] 2704717=test_gem_config_file I, [2024-05-12T14:51:41.893166 #2663356] INFO -- : [146/885] 2704733=test_gem_util I, [2024-05-12T14:51:41.900092 #2663356] INFO -- : [147/885] 2704728=test_iseq_load I, [2024-05-12T14:51:41.905304 #2663356] INFO -- : [148/885] 2704720=test_gem_package_tar_header I, [2024-05-12T14:51:41.913877 #2663356] INFO -- : [149/885] 2704731=test_pkey_dh I, [2024-05-12T14:51:41.915414 #2663356] INFO -- : [150/885] 2704729=test_bigzero I, [2024-05-12T14:51:41.916294 #2663356] INFO -- : [151/885] 2704730=test_pkcs12 I, [2024-05-12T14:51:41.919223 #2663356] INFO -- : [152/885] 2704716=test_system I, [2024-05-12T14:51:41.920432 #2663356] INFO -- : [153/885] 2704729=test_rendering I, [2024-05-12T14:51:41.964318 #2663356] INFO -- : [154/885] 2704720=test_face I, [2024-05-12T14:51:41.986388 #2663356] INFO -- : [155/885] 2704720=test_sizeof I, [2024-05-12T14:51:41.996121 #2663356] INFO -- : [156/885] 2704731=test_case I, [2024-05-12T14:51:42.020216 #2663356] INFO -- : [157/885] 2704731=test_unicode_escape I, [2024-05-12T14:51:42.030012 #2663356] INFO -- : [158/885] 2704729=test_io I, [2024-05-12T14:51:42.052371 #2663356] INFO -- : [159/885] 2704719=test_utf16 I, [2024-05-12T14:51:42.062486 #2663356] INFO -- : [160/885] 2704719=test_autoload I, [2024-05-12T14:51:42.077829 #2663356] INFO -- : [161/885] 2704733=test_config I, [2024-05-12T14:51:42.106350 #2663356] INFO -- : [162/885] 2704731=test_sleep I, [2024-05-12T14:51:42.120022 #2663356] INFO -- : [163/885] 2704733=test_math I, [2024-05-12T14:51:42.135404 #2663356] INFO -- : [164/885] 2704733=test_gem_commands_fetch_command I, [2024-05-12T14:51:42.144634 #2663356] INFO -- : [165/885] 2704721=test_gc I, [2024-05-12T14:51:42.145370 #2663356] INFO -- : [166/885] 2704721=test_libs I, [2024-05-12T14:51:42.165624 #2663356] INFO -- : [167/885] 2704725=test_yaml_tree I, [2024-05-12T14:51:42.169234 #2663356] INFO -- : [168/885] 2704717=test_gem_commands_uninstall_command I, [2024-05-12T14:51:42.169703 #2663356] INFO -- : [169/885] 2704721=test_gem_source_specific_file I, [2024-05-12T14:51:42.178967 #2663356] INFO -- : [170/885] 2704714=test_foreach I, [2024-05-12T14:51:42.184119 #2663356] INFO -- : [171/885] 2704714=test_condition I, [2024-05-12T14:51:42.186666 #2663356] INFO -- : [172/885] 2704714=test_cp949 I, [2024-05-12T14:51:42.187360 #2663356] INFO -- : [173/885] 2704714=test_win32ole_record I, [2024-05-12T14:51:42.191698 #2663356] INFO -- : [174/885] 2704714=test_gem_unsatisfiable_dependency_error I, [2024-05-12T14:51:42.201204 #2663356] INFO -- : [175/885] 2704725=test_ubf_async_safe I, [2024-05-12T14:51:42.203709 #2663356] INFO -- : [176/885] 2704714=test_hash I, [2024-05-12T14:51:42.209322 #2663356] INFO -- : [177/885] 2704725=test_sorted_set I, [2024-05-12T14:51:42.247168 #2663356] INFO -- : [178/885] 2704721=test_win32ole_type_event I, [2024-05-12T14:51:42.249912 #2663356] INFO -- : [179/885] 2704721=test_emoji I, [2024-05-12T14:51:42.271587 #2663356] INFO -- : [180/885] 2704721=test_io I, [2024-05-12T14:51:42.288087 #2663356] INFO -- : [181/885] 2704733=test_date_attr I, [2024-05-12T14:51:42.292709 #2663356] INFO -- : [182/885] 2704733=test_ellipsize I, [2024-05-12T14:51:42.307457 #2663356] INFO -- : [183/885] 2704733=warnings_test I, [2024-05-12T14:51:42.320185 #2663356] INFO -- : [184/885] 2704730=test_kwargs I, [2024-05-12T14:51:42.320681 #2663356] INFO -- : [185/885] 2704730=test_io_wait I, [2024-05-12T14:51:42.390812 #2663356] INFO -- : [186/885] 2704733=test_gem_commands_exec_command I, [2024-05-12T14:51:42.484829 #2663356] INFO -- : [187/885] 2704725=test_type_completor I, [2024-05-12T14:51:42.487286 #2663356] INFO -- : [188/885] 2704725=test_summary I, [2024-05-12T14:51:42.497895 #2663356] INFO -- : [189/885] 2704721=test_console_attr I, [2024-05-12T14:51:42.501621 #2663356] INFO -- : [190/885] 2704721=test_rdoc_context_section I, [2024-05-12T14:51:42.512461 #2663356] INFO -- : [191/885] 2704721=test_euc_kr I, [2024-05-12T14:51:42.524709 #2663356] INFO -- : [192/885] 2704721=test_ftp I, [2024-05-12T14:51:42.554331 #2663356] INFO -- : [193/885] 2704721=test_pattern_key_name_check I, [2024-05-12T14:51:42.562830 #2663356] INFO -- : [194/885] 2704728=test_to_ruby I, [2024-05-12T14:51:42.563131 #2663356] INFO -- : [195/885] 2704721=test_array_create I, [2024-05-12T14:51:42.564382 #2663356] INFO -- : [196/885] 2704721=test_pack I, [2024-05-12T14:51:42.565847 #2663356] INFO -- : [197/885] 2704725=test_gem_impossible_dependencies_error I, [2024-05-12T14:51:42.569707 #2663356] INFO -- : [198/885] 2704728=test_gem_commands_query_command I, [2024-05-12T14:51:42.617635 #2663356] INFO -- : [199/885] 2704718=test_method I, [2024-05-12T14:51:42.622274 #2663356] INFO -- : [200/885] 2704727=test_rdoc_rubygems_hook I, [2024-05-12T14:51:42.651910 #2663356] INFO -- : [201/885] 2704730=test_remote_fetch_error I, [2024-05-12T14:51:42.678671 #2663356] INFO -- : [202/885] 2704730=test_have_library I, [2024-05-12T14:51:42.725961 #2663356] INFO -- : [203/885] 2704725=test_lock_native_thread I, [2024-05-12T14:51:42.749045 #2663356] INFO -- : [204/885] 2704716=test_c_struct_entry I, [2024-05-12T14:51:42.802875 #2663356] INFO -- : [205/885] 2704721=test_gem_commands_stale_command I, [2024-05-12T14:51:42.809444 #2663356] INFO -- : [206/885] 2704727=test_set I, [2024-05-12T14:51:42.813021 #2663356] INFO -- : [207/885] 2704721=test_show_source I, [2024-05-12T14:51:42.817738 #2663356] INFO -- : [208/885] 2704727=comments_test I, [2024-05-12T14:51:42.861176 #2663356] INFO -- : [209/885] 2704721=test_sprintf I, [2024-05-12T14:51:42.862225 #2663356] INFO -- : [210/885] 2704727=test_gem_requirement I, [2024-05-12T14:51:42.894879 #2663356] INFO -- : [211/885] 2704716=test_string_memory I, [2024-05-12T14:51:42.897164 #2663356] INFO -- : [212/885] 2704722=test_gem_security_trust_dir I, [2024-05-12T14:51:42.924715 #2663356] INFO -- : [213/885] 2704717=test_undef I, [2024-05-12T14:51:42.926298 #2663356] INFO -- : [214/885] 2704716=test_line_editor I, [2024-05-12T14:51:42.929452 #2663356] INFO -- : [215/885] 2704717=ripper_test I, [2024-05-12T14:51:42.930504 #2663356] INFO -- : [216/885] 2704722=test_objspace I, [2024-05-12T14:51:42.963878 #2663356] INFO -- : [217/885] 2704728=test_kill_ring I, [2024-05-12T14:51:42.966802 #2663356] INFO -- : [218/885] 2704716=test_ns_spki I, [2024-05-12T14:51:42.991816 #2663356] INFO -- : [219/885] 2704725=test_framework I, [2024-05-12T14:51:42.996855 #2663356] INFO -- : [220/885] 2704716=test_argf I, [2024-05-12T14:51:43.003536 #2663356] INFO -- : [221/885] 2704727=test_gem_commands_environment_command I, [2024-05-12T14:51:43.017705 #2663356] INFO -- : [222/885] 2704725=test_m17n I, [2024-05-12T14:51:43.022385 #2663356] INFO -- : [223/885] 2704728=test_ws I, [2024-05-12T14:51:43.022450 #2663356] INFO -- : [224/885] 2704715=test_yjit I, [2024-05-12T14:51:43.026996 #2663356] INFO -- : [225/885] 2704728=test_workspace I, [2024-05-12T14:51:43.029805 #2663356] INFO -- : [226/885] 2704715=test_weakmap I, [2024-05-12T14:51:43.043921 #2663356] INFO -- : [227/885] 2704727=test_protect I, [2024-05-12T14:51:43.047921 #2663356] INFO -- : [228/885] 2704727=test_win32ole_typelib I, [2024-05-12T14:51:43.052005 #2663356] INFO -- : [229/885] 2704727=test_gem_request_set_lockfile I, [2024-05-12T14:51:43.067620 #2663356] INFO -- : [230/885] 2704721=test_raise_exception I, [2024-05-12T14:51:43.086580 #2663356] INFO -- : [231/885] 2704725=test_postponed_job I, [2024-05-12T14:51:43.165345 #2663356] INFO -- : [232/885] 2704728=test_alias_and_anchor I, [2024-05-12T14:51:43.171137 #2663356] INFO -- : [233/885] 2704728=test_external_new I, [2024-05-12T14:51:43.179248 #2663356] INFO -- : [234/885] 2704728=test_tree_builder I, [2024-05-12T14:51:43.196010 #2663356] INFO -- : [235/885] 2704728=test_gem_resolver_dependency_request I, [2024-05-12T14:51:43.214543 #2663356] INFO -- : [236/885] 2704728=test_hash I, [2024-05-12T14:51:43.225948 #2663356] INFO -- : [237/885] 2704728=test_gem_spec_fetcher I, [2024-05-12T14:51:43.335076 #2663356] INFO -- : [238/885] 2704733=test_common I, [2024-05-12T14:51:43.391271 #2663356] INFO -- : [239/885] 2704728=test_key_actor_vi I, [2024-05-12T14:51:43.392892 #2663356] INFO -- : [240/885] 2704727=test_bug-3571 I, [2024-05-12T14:51:43.411091 #2663356] INFO -- : [241/885] 2704727=test_gem_command I, [2024-05-12T14:51:43.425597 #2663356] INFO -- : [242/885] 2704717=test_gem_commands_lock_command I, [2024-05-12T14:51:43.446828 #2663356] INFO -- : [243/885] 2704717=test_assignment I, [2024-05-12T14:51:43.478256 #2663356] INFO -- : [244/885] 2704725=test_ifunless I, [2024-05-12T14:51:43.482560 #2663356] INFO -- : [245/885] 2704725=test_numeric I, [2024-05-12T14:51:43.489355 #2663356] INFO -- : [246/885] 2704727=test_rdoc_tom_doc I, [2024-05-12T14:51:43.502984 #2663356] INFO -- : [247/885] 2704728=test_hmac I, [2024-05-12T14:51:43.513114 #2663356] INFO -- : [248/885] 2704728=test_rdoc_markup_to_tt_only I, [2024-05-12T14:51:43.519010 #2663356] INFO -- : [249/885] 2704727=test_iter_break I, [2024-05-12T14:51:43.520935 #2663356] INFO -- : [250/885] 2704727=test_zsh_completion I, [2024-05-12T14:51:43.523836 #2663356] INFO -- : [251/885] 2704727=test_exception I, [2024-05-12T14:51:43.530162 #2663356] INFO -- : [252/885] 2704727=test_frozen I, [2024-05-12T14:51:43.537116 #2663356] INFO -- : [253/885] 2704727=test_gem_ext_configure_builder I, [2024-05-12T14:51:43.546715 #2663356] INFO -- : [254/885] 2704728=test_pp I, [2024-05-12T14:51:43.553136 #2663356] INFO -- : [255/885] 2704725=test_macro I, [2024-05-12T14:51:43.573242 #2663356] INFO -- : [256/885] 2704733=test_rdoc_single_class I, [2024-05-12T14:51:43.590577 #2663356] INFO -- : [257/885] 2704732=test_nil I, [2024-05-12T14:51:43.592499 #2663356] INFO -- : [258/885] 2704728=test_num2int I, [2024-05-12T14:51:43.596242 #2663356] INFO -- : [259/885] 2704727=test_verbose I, [2024-05-12T14:51:43.597026 #2663356] INFO -- : [260/885] 2704732=test_config I, [2024-05-12T14:51:43.606327 #2663356] INFO -- : [261/885] 2704728=test_optarg I, [2024-05-12T14:51:43.614819 #2663356] INFO -- : [262/885] 2704727=test_yaml_special_cases I, [2024-05-12T14:51:43.621292 #2663356] INFO -- : [263/885] 2704727=test_gem_source_list I, [2024-05-12T14:51:43.642163 #2663356] INFO -- : [264/885] 2704725=test_address_resolve I, [2024-05-12T14:51:43.656555 #2663356] INFO -- : [265/885] 2704725=test_rdoc_token_stream I, [2024-05-12T14:51:43.661663 #2663356] INFO -- : [266/885] 2704725=test_eval_history I, [2024-05-12T14:51:43.669615 #2663356] INFO -- : [267/885] 2704732=dispatcher_test I, [2024-05-12T14:51:43.710531 #2663356] INFO -- : [268/885] 2704727=test_kernel I, [2024-05-12T14:51:43.714526 #2663356] INFO -- : [269/885] 2704733=test_kdf I, [2024-05-12T14:51:43.725626 #2663356] INFO -- : [270/885] 2704725=test_gem_doctor I, [2024-05-12T14:51:43.739942 #2663356] INFO -- : [271/885] 2704730=test_gem_silent_ui I, [2024-05-12T14:51:43.743271 #2663356] INFO -- : [272/885] 2704728=test_emitter I, [2024-05-12T14:51:43.749421 #2663356] INFO -- : [273/885] 2704728=test_bug-5832 I, [2024-05-12T14:51:43.752087 #2663356] INFO -- : [274/885] 2704728=test_files_ext I, [2024-05-12T14:51:43.754416 #2663356] INFO -- : [275/885] 2704728=test_gem_ext_cargo_builder_unit I, [2024-05-12T14:51:43.761822 #2663356] INFO -- : [276/885] 2704725=test_gem_rdoc I, [2024-05-12T14:51:43.775415 #2663356] INFO -- : [277/885] 2704730=test_date I, [2024-05-12T14:51:43.779387 #2663356] INFO -- : [278/885] 2704728=test_at_exit I, [2024-05-12T14:51:43.783089 #2663356] INFO -- : [279/885] 2704730=test_command I, [2024-05-12T14:51:43.783397 #2663356] INFO -- : [280/885] 2704721=test_object_create_start I, [2024-05-12T14:51:43.785921 #2663356] INFO -- : [281/885] 2704721=test_rdoc_markup_paragraph I, [2024-05-12T14:51:43.789065 #2663356] INFO -- : [282/885] 2704733=!Nothing_to_test I, [2024-05-12T14:51:43.790110 #2663356] INFO -- : [283/885] 2704721=test_enc_raise I, [2024-05-12T14:51:43.793688 #2663356] INFO -- : [284/885] 2704733=test_psych I, [2024-05-12T14:51:43.797631 #2663356] INFO -- : [285/885] 2704721=test_pkey_ec I, [2024-05-12T14:51:43.797703 #2663356] INFO -- : [286/885] 2704732=test_trick I, [2024-05-12T14:51:43.801701 #2663356] INFO -- : [287/885] 2704728=test_thread I, [2024-05-12T14:51:43.804447 #2663356] INFO -- : [288/885] 2704728=test_pipe I, [2024-05-12T14:51:43.826363 #2663356] INFO -- : [289/885] 2704733=test_date_parse I, [2024-05-12T14:51:43.871396 #2663356] INFO -- : [290/885] 2704725=test_rdoc_markup_attributes I, [2024-05-12T14:51:43.873849 #2663356] INFO -- : [291/885] 2704725=test_default_gems I, [2024-05-12T14:51:43.892205 #2663356] INFO -- : [292/885] 2704721=test_rdoc_markup_to_rdoc I, [2024-05-12T14:51:43.923106 #2663356] INFO -- : [293/885] 2704725=test_rdoc_rd_inline_parser I, [2024-05-12T14:51:43.936048 #2663356] INFO -- : [294/885] 2704721=test_mul I, [2024-05-12T14:51:43.942645 #2663356] INFO -- : [295/885] 2704733=test_null I, [2024-05-12T14:51:43.942989 #2663356] INFO -- : [296/885] 2704721=test_win32ole_type I, [2024-05-12T14:51:43.946041 #2663356] INFO -- : [297/885] 2704721=test_gb18030 I, [2024-05-12T14:51:43.947648 #2663356] INFO -- : [298/885] 2704733=test_buffering I, [2024-05-12T14:51:43.949822 #2663356] INFO -- : [299/885] 2704721=test_svcb_https I, [2024-05-12T14:51:43.955863 #2663356] INFO -- : [300/885] 2704733=test_gem_uninstaller I, [2024-05-12T14:51:43.956463 #2663356] INFO -- : [301/885] 2704728=test_rdoc_rdoc I, [2024-05-12T14:51:43.959596 #2663356] INFO -- : [302/885] 2704725=test_windows_1251 I, [2024-05-12T14:51:43.962907 #2663356] INFO -- : [303/885] 2704725=test_time I, [2024-05-12T14:51:43.971171 #2663356] INFO -- : [304/885] 2704721=test_rdoc_i18n_text I, [2024-05-12T14:51:43.975464 #2663356] INFO -- : [305/885] 2704721=test_io_buffer I, [2024-05-12T14:51:44.019723 #2663356] INFO -- : [306/885] 2704721=test_key_name_check I, [2024-05-12T14:51:44.033340 #2663356] INFO -- : [307/885] 2704721=test_defined I, [2024-05-12T14:51:44.057774 #2663356] INFO -- : [308/885] 2704728=test_backtrace I, [2024-05-12T14:51:44.060458 #2663356] INFO -- : [309/885] 2704728=test_files_test_2 I, [2024-05-12T14:51:44.067157 #2663356] INFO -- : [310/885] 2704728=test_fnmatch I, [2024-05-12T14:51:44.095880 #2663356] INFO -- : [311/885] 2704725=test_rdoc_markup_parser I, [2024-05-12T14:51:44.110389 #2663356] INFO -- : [312/885] 2704728=test_require_path_check I, [2024-05-12T14:51:44.118215 #2663356] INFO -- : [313/885] 2704721=test_folderitem2_invokeverb I, [2024-05-12T14:51:44.130931 #2663356] INFO -- : [314/885] 2704721=test_gem_validator I, [2024-05-12T14:51:44.138197 #2663356] INFO -- : [315/885] 2704725=test_gem_package_old I, [2024-05-12T14:51:44.141706 #2663356] INFO -- : [316/885] 2704730=test_gem_resolver_index_set I, [2024-05-12T14:51:44.160840 #2663356] INFO -- : [317/885] 2704731=test_gc_compact I, [2024-05-12T14:51:44.173085 #2663356] INFO -- : [318/885] 2704730=test_proc I, [2024-05-12T14:51:44.173371 #2663356] INFO -- : [319/885] 2704725=test_string I, [2024-05-12T14:51:44.180148 #2663356] INFO -- : [320/885] 2704721=test_date_conv I, [2024-05-12T14:51:44.180630 #2663356] INFO -- : [321/885] 2704721=test_optimization I, [2024-05-12T14:51:44.186777 #2663356] INFO -- : [322/885] 2704728=test_erb_m17n I, [2024-05-12T14:51:44.190617 #2663356] INFO -- : [323/885] 2704728=test_ole_methods I, [2024-05-12T14:51:44.198939 #2663356] INFO -- : [324/885] 2704728=test_egrep_cpp I, [2024-05-12T14:51:44.242710 #2663356] INFO -- : [325/885] 2704727=test_zlib I, [2024-05-12T14:51:44.372651 #2663356] INFO -- : [326/885] 2704728=test_cgi_tag_helper I, [2024-05-12T14:51:44.388536 #2663356] INFO -- : [327/885] 2704728=test_gem_dependency_resolution_error I, [2024-05-12T14:51:44.390793 #2663356] INFO -- : [328/885] 2704728=test_rdoc_parser I, [2024-05-12T14:51:44.414060 #2663356] INFO -- : [329/885] 2704728=test_qsort I, [2024-05-12T14:51:44.415653 #2663356] INFO -- : [330/885] 2704717=test_custom_command I, [2024-05-12T14:51:44.415724 #2663356] INFO -- : [331/885] 2704728=json_addition_test I, [2024-05-12T14:51:44.436831 #2663356] INFO -- : [332/885] 2704728=test_raise I, [2024-05-12T14:51:44.445395 #2663356] INFO -- : [333/885] 2704728=test_x509attr I, [2024-05-12T14:51:44.448152 #2663356] INFO -- : [334/885] 2704728=test_depth_first I, [2024-05-12T14:51:44.456849 #2663356] INFO -- : [335/885] 2704728=test_gem_request_set_lockfile_parser I, [2024-05-12T14:51:44.497380 #2663356] INFO -- : [336/885] 2704717=test_rdoc_store I, [2024-05-12T14:51:44.620672 #2663356] INFO -- : [337/885] 2704728=test_string I, [2024-05-12T14:51:44.641801 #2663356] INFO -- : [338/885] 2704728=test_rdoc_stats I, [2024-05-12T14:51:44.663412 #2663356] INFO -- : [339/885] 2704728=test_pattern_matching I, [2024-05-12T14:51:44.691796 #2663356] INFO -- : [340/885] 2704718=test_rdoc_markup_to_markdown I, [2024-05-12T14:51:44.695330 #2663356] INFO -- : [341/885] 2704728=test_json_tree I, [2024-05-12T14:51:44.701229 #2663356] INFO -- : [342/885] 2704728=test_ansi_with_terminfo I, [2024-05-12T14:51:44.703409 #2663356] INFO -- : [343/885] 2704728=test_rdoc_generator_pot_po I, [2024-05-12T14:51:44.710059 #2663356] INFO -- : [344/885] 2704728=test_ractor I, [2024-05-12T14:51:44.763216 #2663356] INFO -- : [345/885] 2704733=test_m17n_comb I, [2024-05-12T14:51:44.795122 #2663356] INFO -- : [346/885] 2704728=test_memory_view I, [2024-05-12T14:51:44.931799 #2663356] INFO -- : [347/885] 2704718=test_grapheme_breaks I, [2024-05-12T14:51:44.977798 #2663356] INFO -- : [348/885] 2704728=test_gem_version_option I, [2024-05-12T14:51:44.979122 #2663356] INFO -- : [349/885] 2704718=test_gem_request_connection_pools I, [2024-05-12T14:51:45.006354 #2663356] INFO -- : [350/885] 2704730=test_cclass I, [2024-05-12T14:51:45.013658 #2663356] INFO -- : [351/885] 2704728=test_parser_events I, [2024-05-12T14:51:45.073821 #2663356] INFO -- : [352/885] 2704728=test_reline I, [2024-05-12T14:51:45.144306 #2663356] INFO -- : [353/885] 2704730=test_case I, [2024-05-12T14:51:45.145397 #2663356] INFO -- : [354/885] 2704730=test_pkey I, [2024-05-12T14:51:45.196725 #2663356] INFO -- : [355/885] 2704730=test_objectspace I, [2024-05-12T14:51:45.279921 #2663356] INFO -- : [356/885] 2704720=test_thread I, [2024-05-12T14:51:45.335889 #2663356] INFO -- : [357/885] 2704714=test_socket I, [2024-05-12T14:51:45.365903 #2663356] INFO -- : [358/885] 2704717=test_rdoc_markup_to_table_of_contents I, [2024-05-12T14:51:45.395492 #2663356] INFO -- : [359/885] 2704717=test_dot_dot I, [2024-05-12T14:51:45.396092 #2663356] INFO -- : [360/885] 2704717=test_c_struct_builder I, [2024-05-12T14:51:45.443215 #2663356] INFO -- : [361/885] 2704726=test_str2big I, [2024-05-12T14:51:45.447463 #2663356] INFO -- : [362/885] 2704726=test_literal I, [2024-05-12T14:51:45.450085 #2663356] INFO -- : [363/885] 2704728=test_rdoc_generator_ri I, [2024-05-12T14:51:45.458003 #2663356] INFO -- : [364/885] 2704728=test_extlibs I, [2024-05-12T14:51:45.499784 #2663356] INFO -- : [365/885] 2704720=test_gem_stream_ui I, [2024-05-12T14:51:45.504202 #2663356] INFO -- : [366/885] 2704717=test_gem_install_update_options I, [2024-05-12T14:51:45.586649 #2663356] INFO -- : [367/885] 2704720=parse_test I, [2024-05-12T14:51:45.632305 #2663356] INFO -- : [368/885] 2704717=test_require_lib I, [2024-05-12T14:51:45.770725 #2663356] INFO -- : [369/885] 2704724=test_ractor I, [2024-05-12T14:51:45.788947 #2663356] INFO -- : [370/885] 2704724=test_severity I, [2024-05-12T14:51:45.794946 #2663356] INFO -- : [371/885] 2704724=test_gem_package_tar_reader_entry I, [2024-05-12T14:51:45.922543 #2663356] INFO -- : [372/885] 2704726=test_gem_name_tuple I, [2024-05-12T14:51:45.932326 #2663356] INFO -- : [373/885] 2704726=test_rand I, [2024-05-12T14:51:46.005561 #2663356] INFO -- : [374/885] 2704724=test_bug_reporter I, [2024-05-12T14:51:46.036755 #2663356] INFO -- : [375/885] 2704715=test_exception I, [2024-05-12T14:51:46.096950 #2663356] INFO -- : [376/885] 2704730=test_store I, [2024-05-12T14:51:46.123356 #2663356] INFO -- : [377/885] 2704726=test_case_options I, [2024-05-12T14:51:46.127778 #2663356] INFO -- : [378/885] 2704726=test_gem_commands_info_command I, [2024-05-12T14:51:46.180231 #2663356] INFO -- : [379/885] 2704726=test_gem_dependency_installer I, [2024-05-12T14:51:46.193744 #2663356] INFO -- : [380/885] 2704718=test_scalar I, [2024-05-12T14:51:46.215578 #2663356] INFO -- : [381/885] 2704718=test_rdoc_cross_reference I, [2024-05-12T14:51:46.238463 #2663356] INFO -- : [382/885] 2704730=test_gem_text I, [2024-05-12T14:51:46.275251 #2663356] INFO -- : [383/885] 2704730=test_settracefunc I, [2024-05-12T14:51:46.343646 #2663356] INFO -- : [384/885] 2704732=test_enumerator_kw I, [2024-05-12T14:51:46.347498 #2663356] INFO -- : [385/885] 2704732=test_scan_args I, [2024-05-12T14:51:46.361202 #2663356] INFO -- : [386/885] 2704732=test_generic I, [2024-05-12T14:51:46.364922 #2663356] INFO -- : [387/885] 2704724=test_win32ole I, [2024-05-12T14:51:46.369662 #2663356] INFO -- : [388/885] 2704724=test_sprintf_comb I, [2024-05-12T14:51:46.378094 #2663356] INFO -- : [389/885] 2704723=test_method_cache I, [2024-05-12T14:51:46.380094 #2663356] INFO -- : [390/885] 2704723=test_gem_request I, [2024-05-12T14:51:46.411524 #2663356] INFO -- : [391/885] 2704732=test_gem_commands_mirror I, [2024-05-12T14:51:46.417443 #2663356] INFO -- : [392/885] 2704732=test_gem_ext_cargo_builder_link_flag_converter I, [2024-05-12T14:51:46.465608 #2663356] INFO -- : [393/885] 2704732=test_rdoc_markup_attribute_manager I, [2024-05-12T14:51:46.489395 #2663356] INFO -- : [394/885] 2704724=test_name_error I, [2024-05-12T14:51:46.559324 #2663356] INFO -- : [395/885] 2704724=test_gem_resolver I, [2024-05-12T14:51:46.608335 #2663356] INFO -- : [396/885] 2704714=test_gem_resolver_composed_set I, [2024-05-12T14:51:46.623455 #2663356] INFO -- : [397/885] 2704714=test_safe_load I, [2024-05-12T14:51:46.633527 #2663356] INFO -- : [398/885] 2704732=test_gem_commands_dependency_command I, [2024-05-12T14:51:46.635192 #2663356] INFO -- : [399/885] 2704714=test_gem_commands_specification_command I, [2024-05-12T14:51:46.648477 #2663356] INFO -- : [400/885] 2704718=test_flags I, [2024-05-12T14:51:46.673740 #2663356] INFO -- : [401/885] 2704733=test_inadvertent_creation I, [2024-05-12T14:51:46.691149 #2663356] INFO -- : [402/885] 2704732=test_enumerator I, [2024-05-12T14:51:46.750519 #2663356] INFO -- : [403/885] 2704724=test_http I, [2024-05-12T14:51:46.777935 #2663356] INFO -- : [404/885] 2704714=test_gem_commands_which_command I, [2024-05-12T14:51:46.781937 #2663356] INFO -- : [405/885] 2704724=test_shift_jis I, [2024-05-12T14:51:46.784255 #2663356] INFO -- : [406/885] 2704724=test_require I, [2024-05-12T14:51:46.787593 #2663356] INFO -- : [407/885] 2704731=test_date_time I, [2024-05-12T14:51:46.787658 #2663356] INFO -- : [408/885] 2704724=test_rdoc_markup_to_joined_paragraph I, [2024-05-12T14:51:46.787812 #2663356] INFO -- : [409/885] 2704723=test_data I, [2024-05-12T14:51:46.793572 #2663356] INFO -- : [410/885] 2704724=index_write_test I, [2024-05-12T14:51:46.797135 #2663356] INFO -- : [411/885] 2704731=test_date_new I, [2024-05-12T14:51:46.798331 #2663356] INFO -- : [412/885] 2704733=test_syntax I, [2024-05-12T14:51:46.805424 #2663356] INFO -- : [413/885] 2704731=test_gem_safe_yaml I, [2024-05-12T14:51:46.808637 #2663356] INFO -- : [414/885] 2704723=test_rdoc_text I, [2024-05-12T14:51:46.814470 #2663356] INFO -- : [415/885] 2704731=test_tcp I, [2024-05-12T14:51:46.815284 #2663356] INFO -- : [416/885] 2704714=test_iso_8859 I, [2024-05-12T14:51:46.834047 #2663356] INFO -- : [417/885] 2704719=test_nil2vtempty I, [2024-05-12T14:51:46.836931 #2663356] INFO -- : [418/885] 2704719=test_stream I, [2024-05-12T14:51:46.842827 #2663356] INFO -- : [419/885] 2704719=test_rdoc_context I, [2024-05-12T14:51:46.853200 #2663356] INFO -- : [420/885] 2704714=test_rdoc_parser_ruby I, [2024-05-12T14:51:46.857333 #2663356] INFO -- : [421/885] 2704723=test_httpresponse I, [2024-05-12T14:51:46.876838 #2663356] INFO -- : [422/885] 2704724=test_open-uri I, [2024-05-12T14:51:46.919980 #2663356] INFO -- : [423/885] 2704723=test_thread_fd_close I, [2024-05-12T14:51:46.921635 #2663356] INFO -- : [424/885] 2704723=test_passing_block I, [2024-05-12T14:51:46.924689 #2663356] INFO -- : [425/885] 2704723=test_stringchar I, [2024-05-12T14:51:46.937699 #2663356] INFO -- : [426/885] 2704716=test_hash_create I, [2024-05-12T14:51:46.941583 #2663356] INFO -- : [427/885] 2704716=newline_test I, [2024-05-12T14:51:46.986255 #2663356] INFO -- : [428/885] 2704723=test_uncorrectable_name_check I, [2024-05-12T14:51:46.992604 #2663356] INFO -- : [429/885] 2704723=test_switch_hitter I, [2024-05-12T14:51:46.996650 #2663356] INFO -- : [430/885] 2704731=test_singleton I, [2024-05-12T14:51:47.002044 #2663356] INFO -- : [431/885] 2704723=test_flush I, [2024-05-12T14:51:47.003670 #2663356] INFO -- : [432/885] 2704731=test_io_console I, [2024-05-12T14:51:47.005188 #2663356] INFO -- : [433/885] 2704723=test_logperiod I, [2024-05-12T14:51:47.011202 #2663356] INFO -- : [434/885] 2704723=test_rdoc_normal_module I, [2024-05-12T14:51:47.034531 #2663356] INFO -- : [435/885] 2704716=test_c_union_entity I, [2024-05-12T14:51:47.078461 #2663356] INFO -- : [436/885] 2704716=test_rdoc_markdown_test I, [2024-05-12T14:51:47.090970 #2663356] INFO -- : [437/885] 2704723=test_securerandom I, [2024-05-12T14:51:47.110809 #2663356] INFO -- : [438/885] 2704730=test_x509cert I, [2024-05-12T14:51:47.129361 #2663356] INFO -- : [439/885] 2704723=test_gc I, [2024-05-12T14:51:47.194741 #2663356] INFO -- : [440/885] 2704728=test_gem_resolver_lock_specification I, [2024-05-12T14:51:47.224559 #2663356] INFO -- : [441/885] 2704728=test_err_in_callback I, [2024-05-12T14:51:47.227472 #2663356] INFO -- : [442/885] 2704728=test_logdevice I, [2024-05-12T14:51:47.303826 #2663356] INFO -- : [443/885] 2704724=test_arity I, [2024-05-12T14:51:47.309766 #2663356] INFO -- : [444/885] 2704724=test_gem_ext_rake_builder I, [2024-05-12T14:51:47.398729 #2663356] INFO -- : [445/885] 2704730=test_gem_source_local I, [2024-05-12T14:51:47.410630 #2663356] INFO -- : [446/885] 2704714=test_gem_security_policy I, [2024-05-12T14:51:47.663704 #2663356] INFO -- : [447/885] 2704714=test_pack I, [2024-05-12T14:51:47.689064 #2663356] INFO -- : [448/885] 2704730=test_last_thread I, [2024-05-12T14:51:47.776649 #2663356] INFO -- : [449/885] 2704727=test_process I, [2024-05-12T14:51:47.799346 #2663356] INFO -- : [450/885] 2704718=test_rdoc_comment I, [2024-05-12T14:51:47.813644 #2663356] INFO -- : [451/885] 2704719=test_resize I, [2024-05-12T14:51:47.832888 #2663356] INFO -- : [452/885] 2704719=test_error_highlight I, [2024-05-12T14:51:47.862861 #2663356] INFO -- : [453/885] 2704718=test_rdoc_generator_darkfish I, [2024-05-12T14:51:47.867059 #2663356] INFO -- : [454/885] 2704714=test_http_request I, [2024-05-12T14:51:47.917068 #2663356] INFO -- : [455/885] 2704714=json_generic_object_test I, [2024-05-12T14:51:47.930356 #2663356] INFO -- : [456/885] 2704714=test_gem_source_fetch_problem I, [2024-05-12T14:51:47.944730 #2663356] INFO -- : [457/885] 2704714=location_test I, [2024-05-12T14:51:47.968697 #2663356] INFO -- : [458/885] 2704724=test_symbol I, [2024-05-12T14:51:47.972873 #2663356] INFO -- : [459/885] 2704724=test_coderange I, [2024-05-12T14:51:47.977806 #2663356] INFO -- : [460/885] 2704724=test_mailto I, [2024-05-12T14:51:47.985159 #2663356] INFO -- : [461/885] 2704716=test_dir I, [2024-05-12T14:51:47.985877 #2663356] INFO -- : [462/885] 2704724=format_errors_test I, [2024-05-12T14:51:47.989397 #2663356] INFO -- : [463/885] 2704724=test_gem_console_ui I, [2024-05-12T14:51:47.995708 #2663356] INFO -- : [464/885] 2704724=test_date_ractor I, [2024-05-12T14:51:48.085720 #2663356] INFO -- : [465/885] 2704714=test_autoconf I, [2024-05-12T14:51:48.094369 #2663356] INFO -- : [466/885] 2704714=test_eval I, [2024-05-12T14:51:48.103885 #2663356] INFO -- : [467/885] 2704714=test_ractor_compatibility I, [2024-05-12T14:51:48.138608 #2663356] INFO -- : [468/885] 2704728=test_member I, [2024-05-12T14:51:48.139444 #2663356] INFO -- : [469/885] 2704728=test_numeric I, [2024-05-12T14:51:48.146501 #2663356] INFO -- : [470/885] 2704728=test_cgi_multipart I, [2024-05-12T14:51:48.242650 #2663356] INFO -- : [471/885] 2704720=test_word I, [2024-05-12T14:51:48.249306 #2663356] INFO -- : [472/885] 2704720=test_gem_commands_cleanup_command I, [2024-05-12T14:51:48.250025 #2663356] INFO -- : [473/885] 2704715=test_find_executable I, [2024-05-12T14:51:48.253928 #2663356] INFO -- : [474/885] 2704718=ruby_api_test I, [2024-05-12T14:51:48.276940 #2663356] INFO -- : [475/885] 2704724=test_gem_commands_pristine_command I, [2024-05-12T14:51:48.289439 #2663356] INFO -- : [476/885] 2704728=test_context I, [2024-05-12T14:51:48.292416 #2663356] INFO -- : [477/885] 2704715=test_nofree I, [2024-05-12T14:51:48.294552 #2663356] INFO -- : [478/885] 2704715=test_coder I, [2024-05-12T14:51:48.300264 #2663356] INFO -- : [479/885] 2704716=test_symbol I, [2024-05-12T14:51:48.311451 #2663356] INFO -- : [480/885] 2704715=test_unix I, [2024-05-12T14:51:48.345487 #2663356] INFO -- : [481/885] 2704719=test_lazy_enumerator I, [2024-05-12T14:51:48.345822 #2663356] INFO -- : [482/885] 2704715=test_enc_associate I, [2024-05-12T14:51:48.408797 #2663356] INFO -- : [483/885] 2704728=test_pkcs7 I, [2024-05-12T14:51:48.538714 #2663356] INFO -- : [484/885] 2704726=test_arith_seq_beg_len_step I, [2024-05-12T14:51:48.544329 #2663356] INFO -- : [485/885] 2704718=test_gem_resolver_requirement_list I, [2024-05-12T14:51:48.554944 #2663356] INFO -- : [486/885] 2704718=test_function_entry I, [2024-05-12T14:51:48.562983 #2663356] INFO -- : [487/885] 2704718=test_resolve_symbol I, [2024-05-12T14:51:48.564534 #2663356] INFO -- : [488/885] 2704714=test_complex2 I, [2024-05-12T14:51:48.576615 #2663356] INFO -- : [489/885] 2704714=test_gem_package I, [2024-05-12T14:51:48.591164 #2663356] INFO -- : [490/885] 2704728=test_have_macro I, [2024-05-12T14:51:48.620930 #2663356] INFO -- : [491/885] 2704726=test_gem_specification I, [2024-05-12T14:51:48.645103 #2663356] INFO -- : [492/885] 2704718=test_enum I, [2024-05-12T14:51:48.763348 #2663356] INFO -- : [493/885] 2704730=test_threadgroup I, [2024-05-12T14:51:48.776314 #2663356] INFO -- : [494/885] 2704720=test_bignum I, [2024-05-12T14:51:48.809766 #2663356] INFO -- : [495/885] 2704719=test_rdoc_class_module I, [2024-05-12T14:51:48.885224 #2663356] INFO -- : [496/885] 2704715=test_gem_ci_detector I, [2024-05-12T14:51:48.893641 #2663356] INFO -- : [497/885] 2704715=test_arity I, [2024-05-12T14:51:48.894934 #2663356] INFO -- : [498/885] 2704720=test_stringio I, [2024-05-12T14:51:48.896643 #2663356] INFO -- : [499/885] 2704715=test_io_wait_uncommon I, [2024-05-12T14:51:48.902140 #2663356] INFO -- : [500/885] 2704715=test_win32ole_variable I, [2024-05-12T14:51:48.904497 #2663356] INFO -- : [501/885] 2704715=ractor_test I, [2024-05-12T14:51:48.996417 #2663356] INFO -- : [502/885] 2704715=test_trace I, [2024-05-12T14:51:49.005424 #2663356] INFO -- : [503/885] 2704715=test_time_tz I, [2024-05-12T14:51:49.028134 #2663356] INFO -- : [504/885] 2704720=test_win32ole_event I, [2024-05-12T14:51:49.033224 #2663356] INFO -- : [505/885] 2704720=test_rdoc_generator_json_index I, [2024-05-12T14:51:49.052933 #2663356] INFO -- : [506/885] 2704715=test_gem_resolver_api_specification I, [2024-05-12T14:51:49.084200 #2663356] INFO -- : [507/885] 2704715=test_win32ole_variant I, [2024-05-12T14:51:49.090389 #2663356] INFO -- : [508/885] 2704720=test_history I, [2024-05-12T14:51:49.090826 #2663356] INFO -- : [509/885] 2704715=test_mixed_unicode_escapes I, [2024-05-12T14:51:49.094978 #2663356] INFO -- : [510/885] 2704715=test_rdoc_markup_to_ansi I, [2024-05-12T14:51:49.102368 #2663356] INFO -- : [511/885] 2704720=test_ipaddr I, [2024-05-12T14:51:49.107025 #2663356] INFO -- : [512/885] 2704728=test_rdoc_extend I, [2024-05-12T14:51:49.126188 #2663356] INFO -- : [513/885] 2704728=test_merge_keys I, [2024-05-12T14:51:49.132963 #2663356] INFO -- : [514/885] 2704729=test_registry I, [2024-05-12T14:51:49.133422 #2663356] INFO -- : [515/885] 2704720=parse_stream_test I, [2024-05-12T14:51:49.135322 #2663356] INFO -- : [516/885] 2704729=test_gem I, [2024-05-12T14:51:49.135870 #2663356] INFO -- : [517/885] 2704728=test_gem_source_lock I, [2024-05-12T14:51:49.141796 #2663356] INFO -- : [518/885] 2704720=test_ractor I, [2024-05-12T14:51:49.147257 #2663356] INFO -- : [519/885] 2704715=test_gem_commands_open_command I, [2024-05-12T14:51:49.158163 #2663356] INFO -- : [520/885] 2704720=test_dns I, [2024-05-12T14:51:49.179735 #2663356] INFO -- : [521/885] 2704728=test_cgi_core I, [2024-05-12T14:51:49.189274 #2663356] INFO -- : [522/885] 2704728=test_parser I, [2024-05-12T14:51:49.206804 #2663356] INFO -- : [523/885] 2704728=test_timeout I, [2024-05-12T14:51:49.256999 #2663356] INFO -- : [524/885] 2704715=test_alias I, [2024-05-12T14:51:49.257282 #2663356] INFO -- : [525/885] 2704717=test_weakref I, [2024-05-12T14:51:49.332497 #2663356] INFO -- : [526/885] 2704714=test_nonblock I, [2024-05-12T14:51:49.345184 #2663356] INFO -- : [527/885] 2704714=test_marshal I, [2024-05-12T14:51:49.455651 #2663356] INFO -- : [528/885] 2704715=test_unicode_normalize I, [2024-05-12T14:51:49.469257 #2663356] INFO -- : [529/885] 2704717=test_reline_key I, [2024-05-12T14:51:49.479875 #2663356] INFO -- : [530/885] 2704717=test_rb_str_dup I, [2024-05-12T14:51:49.486646 #2663356] INFO -- : [531/885] 2704717=test_ancdata I, [2024-05-12T14:51:49.490210 #2663356] INFO -- : [532/885] 2704717=test_singleton_function I, [2024-05-12T14:51:49.494244 #2663356] INFO -- : [533/885] 2704717=test_ssl I, [2024-05-12T14:51:49.503804 #2663356] INFO -- : [534/885] 2704719=test_debugger_integration I, [2024-05-12T14:51:49.521525 #2663356] INFO -- : [535/885] 2704719=test_rendering I, [2024-05-12T14:51:49.573723 #2663356] INFO -- : [536/885] 2704719=test_my_integer I, [2024-05-12T14:51:49.579012 #2663356] INFO -- : [537/885] 2704719=json_ext_parser_test I, [2024-05-12T14:51:49.590821 #2663356] INFO -- : [538/885] 2704719=test_thread I, [2024-05-12T14:51:49.595640 #2663356] INFO -- : [539/885] 2704718=test_ractor I, [2024-05-12T14:51:49.600542 #2663356] INFO -- : [540/885] 2704731=test_have_func I, [2024-05-12T14:51:49.691292 #2663356] INFO -- : [541/885] 2704720=test_stat I, [2024-05-12T14:51:49.692678 #2663356] INFO -- : [542/885] 2704724=test_gem_request_set_lockfile_tokenizer I, [2024-05-12T14:51:49.695056 #2663356] INFO -- : [543/885] 2704720=test_capacity I, [2024-05-12T14:51:49.701894 #2663356] INFO -- : [544/885] 2704720=test_nextafter I, [2024-05-12T14:51:49.763500 #2663356] INFO -- : [545/885] 2704730=test_usrmarshal I, [2024-05-12T14:51:49.765283 #2663356] INFO -- : [546/885] 2704724=test_object_references I, [2024-05-12T14:51:49.790582 #2663356] INFO -- : [547/885] 2704724=test_gem_resolver_git_specification I, [2024-05-12T14:51:49.802199 #2663356] INFO -- : [548/885] 2704720=test_rubyoptions I, [2024-05-12T14:51:49.867679 #2663356] INFO -- : [549/885] 2704714=test_super I, [2024-05-12T14:51:49.994994 #2663356] INFO -- : [550/885] 2704718=test_integer I, [2024-05-12T14:51:49.997796 #2663356] INFO -- : [551/885] 2704724=test_cgi_modruby I, [2024-05-12T14:51:50.009264 #2663356] INFO -- : [552/885] 2704724=test_rubygems I, [2024-05-12T14:51:50.024185 #2663356] INFO -- : [553/885] 2704717=test_call I, [2024-05-12T14:51:50.042333 #2663356] INFO -- : [554/885] 2704730=test_https_proxy I, [2024-05-12T14:51:50.089433 #2663356] INFO -- : [555/885] 2704730=test_gem_commands_setup_command I, [2024-05-12T14:51:50.167429 #2663356] INFO -- : [556/885] 2704728=test_env I, [2024-05-12T14:51:50.204491 #2663356] INFO -- : [557/885] 2704724=test_rdoc_attr I, [2024-05-12T14:51:50.215810 #2663356] INFO -- : [558/885] 2704724=test_dryrun I, [2024-05-12T14:51:50.225192 #2663356] INFO -- : [559/885] 2704717=test_integer I, [2024-05-12T14:51:50.281246 #2663356] INFO -- : [560/885] 2704724=desugar_compiler_test I, [2024-05-12T14:51:50.301917 #2663356] INFO -- : [561/885] 2704724=test_eval I, [2024-05-12T14:51:50.315897 #2663356] INFO -- : [562/885] 2704717=json_generator_test I, [2024-05-12T14:51:50.419535 #2663356] INFO -- : [563/885] 2704717=test_transcode I, [2024-05-12T14:51:50.517487 #2663356] INFO -- : [564/885] 2704716=test_gem_safe_marshal I, [2024-05-12T14:51:50.593190 #2663356] INFO -- : [565/885] 2704730=test_gem_resolver_api_set I, [2024-05-12T14:51:50.596097 #2663356] INFO -- : [566/885] 2704724=test_gem_resolver_vendor_set I, [2024-05-12T14:51:50.618853 #2663356] INFO -- : [567/885] 2704724=test_config I, [2024-05-12T14:51:50.634153 #2663356] INFO -- : [568/885] 2704717=test_enumerable I, [2024-05-12T14:51:50.646610 #2663356] INFO -- : [569/885] 2704717=test_webauthn_listener I, [2024-05-12T14:51:50.649117 #2663356] INFO -- : [570/885] 2704730=test_gem_request_set_gem_dependency_api I, [2024-05-12T14:51:50.764430 #2663356] INFO -- : [571/885] 2704717=test_ast I, [2024-05-12T14:51:50.768027 #2663356] INFO -- : [572/885] 2704714=test_lambda I, [2024-05-12T14:51:50.832676 #2663356] INFO -- : [573/885] 2704714=test_jaro_winkler I, [2024-05-12T14:51:50.839086 #2663356] INFO -- : [574/885] 2704714=test_random_formatter I, [2024-05-12T14:51:50.856126 #2663356] INFO -- : [575/885] 2704714=test_helper I, [2024-05-12T14:51:50.856433 #2663356] INFO -- : [576/885] 2704714=test_fips I, [2024-05-12T14:51:50.873055 #2663356] INFO -- : [577/885] 2704730=test_x509name I, [2024-05-12T14:51:50.882959 #2663356] INFO -- : [578/885] 2704730=test_update I, [2024-05-12T14:51:50.887383 #2663356] INFO -- : [579/885] 2704730=test_rdoc_code_object I, [2024-05-12T14:51:50.889447 #2663356] INFO -- : [580/885] 2704726=test_x509store I, [2024-05-12T14:51:51.148593 #2663356] INFO -- : [581/885] 2704726=static_inspect_test I, [2024-05-12T14:51:51.167840 #2663356] INFO -- : [582/885] 2704724=test_file I, [2024-05-12T14:51:51.174931 #2663356] INFO -- : [583/885] 2704714=test_force_exit I, [2024-05-12T14:51:51.187399 #2663356] INFO -- : [584/885] 2704729=test_ostruct I, [2024-05-12T14:51:51.205868 #2663356] INFO -- : [585/885] 2704730=unescape_test I, [2024-05-12T14:51:51.229285 #2663356] INFO -- : [586/885] 2704716=test_data_error I, [2024-05-12T14:51:51.236043 #2663356] INFO -- : [587/885] 2704726=bom_test I, [2024-05-12T14:51:51.243312 #2663356] INFO -- : [588/885] 2704726=test_udp I, [2024-05-12T14:51:51.245342 #2663356] INFO -- : [589/885] 2704726=test_vm_dump I, [2024-05-12T14:51:51.260363 #2663356] INFO -- : [590/885] 2704726=test_rdoc_markup_document I, [2024-05-12T14:51:51.300699 #2663356] INFO -- : [591/885] 2704714=test_integer_comb I, [2024-05-12T14:51:51.301321 #2663356] INFO -- : [592/885] 2704716=test_tmpdir I, [2024-05-12T14:51:51.353055 #2663356] INFO -- : [593/885] 2704729=test_gem_commands_check_command I, [2024-05-12T14:51:51.354001 #2663356] INFO -- : [594/885] 2704731=test_regexp I, [2024-05-12T14:51:51.374004 #2663356] INFO -- : [595/885] 2704729=errors_test I, [2024-05-12T14:51:51.379676 #2663356] INFO -- : [596/885] 2704716=test_ts I, [2024-05-12T14:51:51.424810 #2663356] INFO -- : [597/885] 2704726=library_symbols_test I, [2024-05-12T14:51:51.429746 #2663356] INFO -- : [598/885] 2704726=test_locale I, [2024-05-12T14:51:51.534638 #2663356] INFO -- : [599/885] 2704729=test_addr I, [2024-05-12T14:51:51.559983 #2663356] INFO -- : [600/885] 2704726=test_ensured I, [2024-05-12T14:51:51.564810 #2663356] INFO -- : [601/885] 2704729=test_rdoc_ri_paths I, [2024-05-12T14:51:51.613814 #2663356] INFO -- : [602/885] 2704726=test_constant I, [2024-05-12T14:51:51.741998 #2663356] INFO -- : [603/885] 2704729=test_pty I, [2024-05-12T14:51:51.853135 #2663356] INFO -- : [604/885] 2704716=test_dup I, [2024-05-12T14:51:52.037434 #2663356] INFO -- : [605/885] 2704716=command_line_test I, [2024-05-12T14:51:52.058077 #2663356] INFO -- : [606/885] 2704716=test_project_sanity I, [2024-05-12T14:51:52.136654 #2663356] INFO -- : [607/885] 2704716=test_range I, [2024-05-12T14:51:52.222955 #2663356] INFO -- : [608/885] 2704729=test_gem_uri_formatter I, [2024-05-12T14:51:52.240347 #2663356] INFO -- : [609/885] 2704729=test_encoding I, [2024-05-12T14:51:52.322335 #2663356] INFO -- : [610/885] 2704721=test_helper I, [2024-05-12T14:51:52.323930 #2663356] INFO -- : [611/885] 2704721=test_erb_command I, [2024-05-12T14:51:52.392040 #2663356] INFO -- : [612/885] 2704721=test_arithmetic_sequence I, [2024-05-12T14:51:52.401550 #2663356] INFO -- : [613/885] 2704721=test_key_actor_emacs I, [2024-05-12T14:51:52.435834 #2663356] INFO -- : [614/885] 2704729=test_gem_command_manager I, [2024-05-12T14:51:52.507599 #2663356] INFO -- : [615/885] 2704721=test_gem_gemcutter_utilities I, [2024-05-12T14:51:52.566009 #2663356] INFO -- : [616/885] 2704729=test_basicinstructions I, [2024-05-12T14:51:52.651712 #2663356] INFO -- : [617/885] 2704729=version_test I, [2024-05-12T14:51:52.654009 #2663356] INFO -- : [618/885] 2704729=test_cgi_header I, [2024-05-12T14:51:52.659148 #2663356] INFO -- : [619/885] 2704729=heredoc_dedent_test I, [2024-05-12T14:51:52.674727 #2663356] INFO -- : [620/885] 2704729=test_object I, [2024-05-12T14:51:52.678578 #2663356] INFO -- : [621/885] 2704729=test_rdoc_rd_block_parser I, [2024-05-12T14:51:52.756364 #2663356] INFO -- : [622/885] 2704729=test_tsort I, [2024-05-12T14:51:52.765215 #2663356] INFO -- : [623/885] 2704729=test_signedness I, [2024-05-12T14:51:52.842907 #2663356] INFO -- : [624/885] 2704721=test_type I, [2024-05-12T14:51:52.862235 #2663356] INFO -- : [625/885] 2704721=test_ractor I, [2024-05-12T14:51:52.862838 #2663356] INFO -- : [626/885] 2704716=test_pointer I, [2024-05-12T14:51:52.910703 #2663356] INFO -- : [627/885] 2704721=test_func I, [2024-05-12T14:51:52.981332 #2663356] INFO -- : [628/885] 2704718=test_big5 I, [2024-05-12T14:51:52.982306 #2663356] INFO -- : [629/885] 2704718=test_gem_local_remote_options I, [2024-05-12T14:51:52.983155 #2663356] INFO -- : [630/885] 2704722=test_date_arith I, [2024-05-12T14:51:52.993677 #2663356] INFO -- : [631/885] 2704722=test_ruby_lex I, [2024-05-12T14:51:53.027119 #2663356] INFO -- : [632/885] 2704718=test_object I, [2024-05-12T14:51:53.153963 #2663356] INFO -- : [633/885] 2704728=test_sleep I, [2024-05-12T14:51:53.155064 #2663356] INFO -- : [634/885] 2704722=compiler_test I, [2024-05-12T14:51:53.267133 #2663356] INFO -- : [635/885] 2704722=test_flip I, [2024-05-12T14:51:53.276009 #2663356] INFO -- : [636/885] 2704733=test_change_word I, [2024-05-12T14:51:53.289068 #2663356] INFO -- : [637/885] 2704733=test_ossl I, [2024-05-12T14:51:53.302202 #2663356] INFO -- : [638/885] 2704722=test_normalize I, [2024-05-12T14:51:53.303778 #2663356] INFO -- : [639/885] 2704722=test_timeout I, [2024-05-12T14:51:53.332869 #2663356] INFO -- : [640/885] 2704722=test_continuation I, [2024-05-12T14:51:53.334267 #2663356] INFO -- : [641/885] 2704716=test_fd_setsize I, [2024-05-12T14:51:53.338411 #2663356] INFO -- : [642/885] 2704716=test_class_name_check I, [2024-05-12T14:51:53.343944 #2663356] INFO -- : [643/885] 2704722=test_keyword I, [2024-05-12T14:51:53.360619 #2663356] INFO -- : [644/885] 2704716=test_delete I, [2024-05-12T14:51:53.365071 #2663356] INFO -- : [645/885] 2704716=test_win32ole_method I, [2024-05-12T14:51:53.368678 #2663356] INFO -- : [646/885] 2704716=test_rdoc_markup_hard_break I, [2024-05-12T14:51:53.370010 #2663356] INFO -- : [647/885] 2704716=test_date_strptime I, [2024-05-12T14:51:53.376105 #2663356] INFO -- : [648/885] 2704730=test_gem_package_task I, [2024-05-12T14:51:53.384246 #2663356] INFO -- : [649/885] 2704730=test_placearg I, [2024-05-12T14:51:53.438612 #2663356] INFO -- : [650/885] 2704718=test_gem_platform I, [2024-05-12T14:51:53.439832 #2663356] INFO -- : [651/885] 2704730=test_pkey_rsa I, [2024-05-12T14:51:53.478978 #2663356] INFO -- : [652/885] 2704716=test_numhash I, [2024-05-12T14:51:53.488284 #2663356] INFO -- : [653/885] 2704716=test_weakkeymap I, [2024-05-12T14:51:53.519579 #2663356] INFO -- : [654/885] 2704723=test_gem_commands_push_command I, [2024-05-12T14:51:53.524167 #2663356] INFO -- : [655/885] 2704718=test_rdoc_parser_markdown I, [2024-05-12T14:51:53.543633 #2663356] INFO -- : [656/885] 2704718=test_import I, [2024-05-12T14:51:53.678567 #2663356] INFO -- : [657/885] 2704730=test_gem_resolver_lock_set I, [2024-05-12T14:51:53.700982 #2663356] INFO -- : [658/885] 2704714=test_not I, [2024-05-12T14:51:53.707993 #2663356] INFO -- : [659/885] 2704730=test_logger I, [2024-05-12T14:51:53.710745 #2663356] INFO -- : [660/885] 2704714=test_gem_update_suggestion I, [2024-05-12T14:51:53.719863 #2663356] INFO -- : [661/885] 2704730=test_files_test I, [2024-05-12T14:51:53.751466 #2663356] INFO -- : [662/885] 2704716=test_file_exhaustive I, [2024-05-12T14:51:53.800076 #2663356] INFO -- : [663/885] 2704714=test_tree_spell_checker I, [2024-05-12T14:51:53.801913 #2663356] INFO -- : [664/885] 2704730=test_http I, [2024-05-12T14:51:53.824051 #2663356] INFO -- : [665/885] 2704714=test_addrinfo I, [2024-05-12T14:51:53.870837 #2663356] INFO -- : [666/885] 2704714=test_win32ole_param_event I, [2024-05-12T14:51:53.873139 #2663356] INFO -- : [667/885] 2704714=test_bn I, [2024-05-12T14:51:53.891038 #2663356] INFO -- : [668/885] 2704714=redundant_return_test I, [2024-05-12T14:51:53.899299 #2663356] INFO -- : [669/885] 2704714=test_case_mapping I, [2024-05-12T14:51:53.902731 #2663356] INFO -- : [670/885] 2704714=test_path I, [2024-05-12T14:51:53.910040 #2663356] INFO -- : [671/885] 2704714=test_terminfo I, [2024-05-12T14:51:53.912234 #2663356] INFO -- : [672/885] 2704722=test_compile_prism I, [2024-05-12T14:51:53.915488 #2663356] INFO -- : [673/885] 2704714=test_bug-14834 I, [2024-05-12T14:51:54.014665 #2663356] INFO -- : [674/885] 2704714=test_rdoc_markup_to_html I, [2024-05-12T14:51:54.091340 #2663356] INFO -- : [675/885] 2704714=test_date_compat I, [2024-05-12T14:51:54.092172 #2663356] INFO -- : [676/885] 2704714=test_gem_resolver_vendor_specification I, [2024-05-12T14:51:54.097398 #2663356] INFO -- : [677/885] 2704723=test_gem_commands_update_command I, [2024-05-12T14:51:54.110837 #2663356] INFO -- : [678/885] 2704726=test_notimplement I, [2024-05-12T14:51:54.115442 #2663356] INFO -- : [679/885] 2704726=test_random I, [2024-05-12T14:51:54.119307 #2663356] INFO -- : [680/885] 2704714=test_gem_uri I, [2024-05-12T14:51:54.124838 #2663356] INFO -- : [681/885] 2704726=test_key_event_record I, [2024-05-12T14:51:54.130192 #2663356] INFO -- : [682/885] 2704726=test_ssl_session I, [2024-05-12T14:51:54.148529 #2663356] INFO -- : [683/885] 2704714=test_lexer I, [2024-05-12T14:51:54.159614 #2663356] INFO -- : [684/885] 2704714=test_thread_cv I, [2024-05-12T14:51:54.191042 #2663356] INFO -- : [685/885] 2704722=test_rdoc_generator_pot I, [2024-05-12T14:51:54.234973 #2663356] INFO -- : [686/885] 2704722=test_unicode I, [2024-05-12T14:51:54.248304 #2663356] INFO -- : [687/885] 2704722=test_enumerator I, [2024-05-12T14:51:54.256259 #2663356] INFO -- : [688/885] 2704722=test_rdoc_parser_changelog I, [2024-05-12T14:51:54.339159 #2663356] INFO -- : [689/885] 2704732=parameters_signature_test I, [2024-05-12T14:51:54.340724 #2663356] INFO -- : [690/885] 2704722=test_koi8 I, [2024-05-12T14:51:54.345609 #2663356] INFO -- : [691/885] 2704732=test_rdoc_method_attr I, [2024-05-12T14:51:54.350358 #2663356] INFO -- : [692/885] 2704722=test_data I, [2024-05-12T14:51:54.356457 #2663356] INFO -- : [693/885] 2704722=static_literals_test I, [2024-05-12T14:51:54.358245 #2663356] INFO -- : [694/885] 2704722=test_filter I, [2024-05-12T14:51:54.413050 #2663356] INFO -- : [695/885] 2704722=test_gem_gem_runner I, [2024-05-12T14:51:54.424850 #2663356] INFO -- : [696/885] 2704721=test_rdoc_i18n_locale I, [2024-05-12T14:51:54.427240 #2663356] INFO -- : [697/885] 2704721=test_chilled I, [2024-05-12T14:51:54.435779 #2663356] INFO -- : [698/885] 2704721=test_name_error_extension I, [2024-05-12T14:51:54.440146 #2663356] INFO -- : [699/885] 2704721=test_acceptable I, [2024-05-12T14:51:54.463895 #2663356] INFO -- : [700/885] 2704722=test_euc_jp I, [2024-05-12T14:51:54.471668 #2663356] INFO -- : [701/885] 2704722=test_rdoc_generator_pot_po_entry I, [2024-05-12T14:51:54.478105 #2663356] INFO -- : [702/885] 2704722=test_document I, [2024-05-12T14:51:54.500442 #2663356] INFO -- : [703/885] 2704718=test_pair I, [2024-05-12T14:51:54.509566 #2663356] INFO -- : [704/885] 2704722=test_gem_commands_yank_command I, [2024-05-12T14:51:54.514423 #2663356] INFO -- : [705/885] 2704721=test_win32ole_param I, [2024-05-12T14:51:54.515132 #2663356] INFO -- : [706/885] 2704721=test_rbconfig I, [2024-05-12T14:51:54.521353 #2663356] INFO -- : [707/885] 2704721=test_primitive I, [2024-05-12T14:51:54.527100 #2663356] INFO -- : [708/885] 2704732=test_human_typo I, [2024-05-12T14:51:54.529812 #2663356] INFO -- : [709/885] 2704721=test_key_stroke I, [2024-05-12T14:51:54.533705 #2663356] INFO -- : [710/885] 2704721=json_encoding_test I, [2024-05-12T14:51:54.538318 #2663356] INFO -- : [711/885] 2704721=test_color I, [2024-05-12T14:51:54.540360 #2663356] INFO -- : [712/885] 2704732=test_sockopt I, [2024-05-12T14:51:54.544842 #2663356] INFO -- : [713/885] 2704732=test_rdoc_markup_to_label I, [2024-05-12T14:51:54.576308 #2663356] INFO -- : [714/885] 2704732=test_install I, [2024-05-12T14:51:54.585537 #2663356] INFO -- : [715/885] 2704721=test_rdoc_ri_driver I, [2024-05-12T14:51:54.783852 #2663356] INFO -- : [716/885] 2704721=test_gem_resolver_local_specification I, [2024-05-12T14:51:54.784474 #2663356] INFO -- : [717/885] 2704732=test_httpheader I, [2024-05-12T14:51:54.792452 #2663356] INFO -- : [718/885] 2704721=test_set_len I, [2024-05-12T14:51:54.794623 #2663356] INFO -- : [719/885] 2704721=test_httpresponses I, [2024-05-12T14:51:54.795443 #2663356] INFO -- : [720/885] 2704714=test_encoding I, [2024-05-12T14:51:54.809947 #2663356] INFO -- : [721/885] 2704714=test_pinned I, [2024-05-12T14:51:54.810327 #2663356] INFO -- : [722/885] 2704721=test_rdoc_markup_pre_process I, [2024-05-12T14:51:54.815519 #2663356] INFO -- : [723/885] 2704732=test_printf I, [2024-05-12T14:51:54.840993 #2663356] INFO -- : [724/885] 2704732=test_stream I, [2024-05-12T14:51:54.850657 #2663356] INFO -- : [725/885] 2704714=test_to_ary_concat I, [2024-05-12T14:51:54.861551 #2663356] INFO -- : [726/885] 2704732=test_webauthn_listener_response I, [2024-05-12T14:51:54.882666 #2663356] INFO -- : [727/885] 2704732=test_time I, [2024-05-12T14:51:54.928818 #2663356] INFO -- : [728/885] 2704721=test_beginendblock I, [2024-05-12T14:51:54.975205 #2663356] INFO -- : [729/885] 2704722=test_files_lib I, [2024-05-12T14:51:55.004489 #2663356] INFO -- : [730/885] 2704729=test_gem_commands_unpack_command I, [2024-05-12T14:51:55.056663 #2663356] INFO -- : [731/885] 2704732=test_help I, [2024-05-12T14:51:55.057815 #2663356] INFO -- : [732/885] 2704715=test_rdoc_markup_to_bs I, [2024-05-12T14:51:55.062600 #2663356] INFO -- : [733/885] 2704726=test_within_pipe I, [2024-05-12T14:51:55.065606 #2663356] INFO -- : [734/885] 2704732=test_emoji_breaks I, [2024-05-12T14:51:55.070187 #2663356] INFO -- : [735/885] 2704732=test_gem_bundler_version_finder I, [2024-05-12T14:51:55.084804 #2663356] INFO -- : [736/885] 2704726=reflection_test I, [2024-05-12T14:51:55.089908 #2663356] INFO -- : [737/885] 2704726=test_open3 I, [2024-05-12T14:51:55.091222 #2663356] INFO -- : [738/885] 2704732=test_multi_irb_commands I, [2024-05-12T14:51:55.097541 #2663356] INFO -- : [739/885] 2704715=test_fiber I, [2024-05-12T14:51:55.100314 #2663356] INFO -- : [740/885] 2704732=test_closure I, [2024-05-12T14:51:55.230451 #2663356] INFO -- : [741/885] 2704723=test_bundled_ca I, [2024-05-12T14:51:55.256132 #2663356] INFO -- : [742/885] 2704721=test_digest I, [2024-05-12T14:51:55.266298 #2663356] INFO -- : [743/885] 2704721=test_rdoc_servlet I, [2024-05-12T14:51:55.314036 #2663356] INFO -- : [744/885] 2704729=test_gem_security I, [2024-05-12T14:51:55.392372 #2663356] INFO -- : [745/885] 2704721=test_ractor I, [2024-05-12T14:51:55.463096 #2663356] INFO -- : [746/885] 2704732=test_recursion I, [2024-05-12T14:51:55.470178 #2663356] INFO -- : [747/885] 2704732=test_exit I, [2024-05-12T14:51:55.472032 #2663356] INFO -- : [748/885] 2704721=test_popen_deadlock I, [2024-05-12T14:51:55.547165 #2663356] INFO -- : [749/885] 2704732=test_delegate I, [2024-05-12T14:51:55.557889 #2663356] INFO -- : [750/885] 2704732=test_mkmf I, [2024-05-12T14:51:55.571156 #2663356] INFO -- : [751/885] 2704732=test_date_marshal I, [2024-05-12T14:51:55.579256 #2663356] INFO -- : [752/885] 2704732=test_history I, [2024-05-12T14:51:55.639862 #2663356] INFO -- : [753/885] 2704732=test_option I, [2024-05-12T14:51:55.742260 #2663356] INFO -- : [754/885] 2704732=test_append I, [2024-05-12T14:51:55.747911 #2663356] INFO -- : [755/885] 2704732=test_tracer I, [2024-05-12T14:51:55.751939 #2663356] INFO -- : [756/885] 2704732=test_cmethod I, [2024-05-12T14:51:55.756864 #2663356] INFO -- : [757/885] 2704732=test_did_you_mean I, [2024-05-12T14:51:55.865442 #2663356] INFO -- : [758/885] 2704725=test_io_m17n I, [2024-05-12T14:51:55.902518 #2663356] INFO -- : [759/885] 2704732=test_variable_name_check I, [2024-05-12T14:51:55.953779 #2663356] INFO -- : [760/885] 2704732=test_gem_commands_server_command I, [2024-05-12T14:51:55.959027 #2663356] INFO -- : [761/885] 2704732=test_case_comprehensive I, [2024-05-12T14:51:56.086934 #2663356] INFO -- : [762/885] 2704721=test_interned_str I, [2024-05-12T14:51:56.087453 #2663356] INFO -- : [763/885] 2704721=test_gem_commands_build_command I, [2024-05-12T14:51:56.091931 #2663356] INFO -- : [764/885] 2704714=test_scheduler I, [2024-05-12T14:51:56.239907 #2663356] INFO -- : [765/885] 2704714=test_ocsp I, [2024-05-12T14:51:56.396148 #2663356] INFO -- : [766/885] 2704721=test_class I, [2024-05-12T14:51:56.405464 #2663356] INFO -- : [767/885] 2704721=test_pkey_dsa I, [2024-05-12T14:51:56.506754 #2663356] INFO -- : [768/885] 2704714=test_exception_at_throwing I, [2024-05-12T14:51:56.545323 #2663356] INFO -- : [769/885] 2704714=test_iseq I, [2024-05-12T14:51:56.669801 #2663356] INFO -- : [770/885] 2704723=test_rdoc_markup_heading I, [2024-05-12T14:51:56.694546 #2663356] INFO -- : [771/885] 2704723=test_variable I, [2024-05-12T14:51:56.772370 #2663356] INFO -- : [772/885] 2704723=fuzzer_test I, [2024-05-12T14:51:56.816392 #2663356] INFO -- : [773/885] 2704723=test_rdoc_markup_include I, [2024-05-12T14:51:56.839621 #2663356] INFO -- : [774/885] 2704723=test_sexp I, [2024-05-12T14:51:56.851667 #2663356] INFO -- : [775/885] 2704723=magic_comment_test I, [2024-05-12T14:51:56.857978 #2663356] INFO -- : [776/885] 2704723=test_rdoc_markup_to_html_snippet I, [2024-05-12T14:51:56.924100 #2663356] INFO -- : [777/885] 2704723=test_struct I, [2024-05-12T14:51:56.931711 #2663356] INFO -- : [778/885] 2704723=test_cparser I, [2024-05-12T14:51:57.031024 #2663356] INFO -- : [779/885] 2704726=test_pkg_config I, [2024-05-12T14:51:57.049567 #2663356] INFO -- : [780/885] 2704726=test_config I, [2024-05-12T14:51:57.076225 #2663356] INFO -- : [781/885] 2704726=test_nomethod_error I, [2024-05-12T14:51:57.088168 #2663356] INFO -- : [782/885] 2704726=json_parser_test I, [2024-05-12T14:51:57.093234 #2663356] INFO -- : [783/885] 2704714=memsize_test I, [2024-05-12T14:51:57.095548 #2663356] INFO -- : [784/885] 2704714=json_common_interface_test I, [2024-05-12T14:51:57.098399 #2663356] INFO -- : [785/885] 2704725=test_dln I, [2024-05-12T14:51:57.099217 #2663356] INFO -- : [786/885] 2704725=test_gem_source_subpath_problem I, [2024-05-12T14:51:57.105041 #2663356] INFO -- : [787/885] 2704714=test_win32ole_variant_outarg I, [2024-05-12T14:51:57.106258 #2663356] INFO -- : [788/885] 2704714=test_rdoc_rd_inline I, [2024-05-12T14:51:57.112402 #2663356] INFO -- : [789/885] 2704714=test_mutex I, [2024-05-12T14:51:57.155700 #2663356] INFO -- : [790/885] 2704726=test_x509req I, [2024-05-12T14:51:57.200237 #2663356] INFO -- : [791/885] 2704725=test_struct I, [2024-05-12T14:51:57.235608 #2663356] INFO -- : [792/885] 2704724=test_gem_path_support I, [2024-05-12T14:51:57.255375 #2663356] INFO -- : [793/885] 2704724=test_set I, [2024-05-12T14:51:57.270222 #2663356] INFO -- : [794/885] 2704724=test_files_test_1 I, [2024-05-12T14:51:57.336504 #2663356] INFO -- : [795/885] 2704726=test_deprecated I, [2024-05-12T14:51:57.340332 #2663356] INFO -- : [796/885] 2704726=test_color_printer I, [2024-05-12T14:51:57.345953 #2663356] INFO -- : [797/885] 2704726=test_insns_leaf I, [2024-05-12T14:51:57.349660 #2663356] INFO -- : [798/885] 2704726=test_serialize_subclasses I, [2024-05-12T14:51:57.351970 #2663356] INFO -- : [799/885] 2704726=test_key_error I, [2024-05-12T14:51:57.355937 #2663356] INFO -- : [800/885] 2704726=test_allocation I, [2024-05-12T14:51:57.510605 #2663356] INFO -- : [801/885] 2704725=test_div I, [2024-05-12T14:51:57.519936 #2663356] INFO -- : [802/885] 2704725=test_win32ole_variant_m I, [2024-05-12T14:51:57.530104 #2663356] INFO -- : [803/885] 2704725=test_engine I, [2024-05-12T14:51:57.535159 #2663356] INFO -- : [804/885] 2704725=test_input_method I, [2024-05-12T14:51:57.579732 #2663356] INFO -- : [805/885] 2704725=test_windows_1252 I, [2024-05-12T14:51:57.586623 #2663356] INFO -- : [806/885] 2704725=test_process I, [2024-05-12T14:51:57.616877 #2663356] INFO -- : [807/885] 2704725=test_x509crl I, [2024-05-12T14:51:57.778144 #2663356] INFO -- : [808/885] 2704725=test_fixnum I, [2024-05-12T14:51:57.786279 #2663356] INFO -- : [809/885] 2704725=test_signal I, [2024-05-12T14:51:57.841937 #2663356] INFO -- : [810/885] 2704722=test_rdoc_top_level I, [2024-05-12T14:51:57.890950 #2663356] INFO -- : [811/885] 2704723=test_metaclass I, [2024-05-12T14:51:57.893385 #2663356] INFO -- : [812/885] 2704718=test_rdoc_rd I, [2024-05-12T14:51:57.897902 #2663356] INFO -- : [813/885] 2704723=test_cgi_session I, [2024-05-12T14:51:57.899507 #2663356] INFO -- : [814/885] 2704718=test_gem_resolver_installer_set I, [2024-05-12T14:51:57.911637 #2663356] INFO -- : [815/885] 2704723=test_dir_m17n I, [2024-05-12T14:51:58.046263 #2663356] INFO -- : [816/885] 2704722=test_gem_source_git I, [2024-05-12T14:51:58.104960 #2663356] INFO -- : [817/885] 2704718=test_regex_casefold I, [2024-05-12T14:51:58.127482 #2663356] INFO -- : [818/885] 2704721=test_refinement I, [2024-05-12T14:51:58.158319 #2663356] INFO -- : [819/885] 2704728=test_gem_commands_signout_command I, [2024-05-12T14:51:58.171788 #2663356] INFO -- : [820/885] 2704728=test_require I, [2024-05-12T14:51:58.243589 #2663356] INFO -- : [821/885] 2704714=test_cgi_cookie I, [2024-05-12T14:51:58.257342 #2663356] INFO -- : [822/885] 2704714=test_float I, [2024-05-12T14:51:58.540978 #2663356] INFO -- : [823/885] 2704722=test_storage I, [2024-05-12T14:51:58.545125 #2663356] INFO -- : [824/885] 2704722=test_gem_resolver_git_set I, [2024-05-12T14:51:58.667797 #2663356] INFO -- : [825/885] 2704719=test_gem_security_signer I, [2024-05-12T14:51:58.763327 #2663356] INFO -- : [826/885] 2704718=test_cipher I, [2024-05-12T14:51:58.811416 #2663356] INFO -- : [827/885] 2704718=test_new I, [2024-05-12T14:51:58.812836 #2663356] INFO -- : [828/885] 2704718=test_shellwords I, [2024-05-12T14:51:58.820269 #2663356] INFO -- : [829/885] 2704718=test_memory_view I, [2024-05-12T14:51:58.829946 #2663356] INFO -- : [830/885] 2704722=pattern_test I, [2024-05-12T14:51:58.844273 #2663356] INFO -- : [831/885] 2704718=test_debug I, [2024-05-12T14:51:58.848046 #2663356] INFO -- : [832/885] 2704722=test_omap I, [2024-05-12T14:51:58.848844 #2663356] INFO -- : [833/885] 2704718=test_iterator I, [2024-05-12T14:51:58.854324 #2663356] INFO -- : [834/885] 2704722=test_string I, [2024-05-12T14:51:58.856955 #2663356] INFO -- : [835/885] 2704722=test_digest_extend I, [2024-05-12T14:51:58.867284 #2663356] INFO -- : [836/885] 2704722=test_evaluation I, [2024-05-12T14:51:58.874549 #2663356] INFO -- : [837/885] 2704722=test_gem_ext_builder I, [2024-05-12T14:51:58.897715 #2663356] INFO -- : [838/885] 2704719=test_https I, [2024-05-12T14:51:58.946811 #2663356] INFO -- : [839/885] 2704720=test_load I, [2024-05-12T14:51:58.950257 #2663356] INFO -- : [840/885] 2704718=test_yamldbm I, [2024-05-12T14:51:58.950330 #2663356] INFO -- : [841/885] 2704720=test_gem_commands_rebuild_command I, [2024-05-12T14:51:58.956363 #2663356] INFO -- : [842/885] 2704718=test_rdoc_parser_simple I, [2024-05-12T14:51:58.978497 #2663356] INFO -- : [843/885] 2704718=test_provider I, [2024-05-12T14:51:58.984344 #2663356] INFO -- : [844/885] 2704720=test_abi I, [2024-05-12T14:51:59.123367 #2663356] INFO -- : [845/885] 2704720=test_array I, [2024-05-12T14:51:59.253050 #2663356] INFO -- : [846/885] 2704719=test_helper_method I, [2024-05-12T14:51:59.259550 #2663356] INFO -- : [847/885] 2704723=test_gem_package_tar_writer I, [2024-05-12T14:51:59.301818 #2663356] INFO -- : [848/885] 2704719=test_gem_commands_outdated_command I, [2024-05-12T14:51:59.347344 #2663356] INFO -- : [849/885] 2704719=test_scalar_scanner I, [2024-05-12T14:51:59.362325 #2663356] INFO -- : [850/885] 2704719=test_gem_source I, [2024-05-12T14:51:59.391321 #2663356] INFO -- : [851/885] 2704718=test_nesting_parser I, [2024-05-12T14:51:59.399227 #2663356] INFO -- : [852/885] 2704723=test_win32ole_method_event I, [2024-05-12T14:51:59.401437 #2663356] INFO -- : [853/885] 2704723=test_benchmark I, [2024-05-12T14:51:59.470659 #2663356] INFO -- : [854/885] 2704718=test_gem_dependency_list I, [2024-05-12T14:51:59.554033 #2663356] INFO -- : [855/885] 2704718=test_spell_checker I, [2024-05-12T14:51:59.573960 #2663356] INFO -- : [856/885] 2704719=test_propertyputref I, [2024-05-12T14:51:59.576184 #2663356] INFO -- : [857/885] 2704718=attribute_write_test I, [2024-05-12T14:51:59.578811 #2663356] INFO -- : [858/885] 2704719=test_assembler I, [2024-05-12T14:51:59.580520 #2663356] INFO -- : [859/885] 2704719=test_rational2 I, [2024-05-12T14:51:59.582904 #2663356] INFO -- : [860/885] 2704718=test_rational I, [2024-05-12T14:51:59.592601 #2663356] INFO -- : [861/885] 2704719=test_gem_commands_cert_command I, [2024-05-12T14:51:59.607604 #2663356] INFO -- : [862/885] 2704718=test_completion I, [2024-05-12T14:51:59.720659 #2663356] INFO -- : [863/885] 2704733=test_yield_block I, [2024-05-12T14:51:59.723888 #2663356] INFO -- : [864/885] 2704733=test_len I, [2024-05-12T14:51:59.724456 #2663356] INFO -- : [865/885] 2704733=test_gem_source_installed I, [2024-05-12T14:51:59.736887 #2663356] INFO -- : [866/885] 2704733=test_erb I, [2024-05-12T14:51:59.739258 #2663356] INFO -- : [867/885] 2704716=test_x509ext I, [2024-05-12T14:51:59.743858 #2663356] INFO -- : [868/885] 2704716=test_parser I, [2024-05-12T14:51:59.760876 #2663356] INFO -- : [869/885] 2704716=test_method_name_check I, [2024-05-12T14:51:59.772463 #2663356] INFO -- : [870/885] 2704716=test_arith_seq_extract I, [2024-05-12T14:51:59.791628 #2663356] INFO -- : [871/885] 2704733=test_gem_request_set I, [2024-05-12T14:51:59.856316 #2663356] INFO -- : [872/885] 2704714=test_module I, [2024-05-12T14:51:59.901884 #2663356] INFO -- : [873/885] 2704716=test_ssl I, [2024-05-12T14:51:59.945365 #2663356] INFO -- : [874/885] 2704725=test_gem_ext_cargo_builder I, [2024-05-12T14:51:59.960392 #2663356] INFO -- : [875/885] 2704725=constant_path_node_test I, [2024-05-12T14:52:00.023628 #2663356] INFO -- : [876/885] 2704726=test_stringify_symbols I, [2024-05-12T14:52:00.026843 #2663356] INFO -- : [877/885] 2704725=integer_parse_test I, [2024-05-12T14:52:00.029372 #2663356] INFO -- : [878/885] 2704725=test_instrumentation_api I, [2024-05-12T14:52:00.034748 #2663356] INFO -- : [879/885] 2704726=test_boolean I, [2024-05-12T14:52:00.040425 #2663356] INFO -- : [880/885] 2704726=test_rdoc_generator_markup I, [2024-05-12T14:52:00.045836 #2663356] INFO -- : [881/885] 2704722=test_whileuntil I, [2024-05-12T14:52:00.050722 #2663356] INFO -- : [882/885] 2704722=test_monitor I, [2024-05-12T14:52:00.051319 #2663356] INFO -- : [883/885] 2704726=test_buffered_io I, [2024-05-12T14:52:00.061668 #2663356] INFO -- : [884/885] 2704729=test_rubyvm I, [2024-05-12T14:52:00.066700 #2663356] INFO -- : [885/885] 2704729=test_configuration I, [2024-05-12T14:52:16.906549 #2663356] INFO -- : Finished tests in 36.515665s, 721.9915 tests/s, 256134.7295 assertions/s. E, [2024-05-12T14:52:16.906672 #2663356] ERROR -- : Children under /tmp/rubytest.1gvzlf: E, [2024-05-12T14:52:16.906699 #2663356] ERROR -- : * drwx------ 4 80 2024-05-12 14:51:58 +0000 gem_rebuild20240512-2704720-yswhy7/ E, [2024-05-12T14:52:16.906712 #2663356] ERROR -- : * drwxrwxr-x 2 60 2024-05-12 14:51:58 +0000 new/ E, [2024-05-12T14:52:16.906716 #2663356] ERROR -- : * -rw-rw-r-- 1 4096 2024-05-12 14:51:58 +0000 rebuild_test_gem-1.0.0.gem E, [2024-05-12T14:52:16.906720 #2663356] ERROR -- : * drwxrwxr-x 2 60 2024-05-12 14:51:58 +0000 old/ E, [2024-05-12T14:52:16.906724 #2663356] ERROR -- : * -rw-rw-r-- 1 4096 2024-05-12 14:51:58 +0000 rebuild_test_gem-1.0.0.gem I, [2024-05-12T14:52:16.907950 #2663356] INFO -- : 26364 tests, 9352930 assertions, 0 failures, 0 errors, 304 skips I, [2024-05-12T14:52:16.907981 #2663356] INFO -- : I, [2024-05-12T14:52:16.907990 #2663356] INFO -- : ruby -v: ruby 3.4.0dev (2024-05-12T07:23:00Z master b911d2222f) [x86_64-linux] I, [2024-05-12T14:52:16.910081 #2663356] INFO -- : $$$[end] "make yes-test-all TESTOPTS='--stderr-on-failure' TESTS='-j20'" exit with 0. I, [2024-05-12T14:52:16.910287 #2663356] INFO -- : $$$[beg] make yes-test-rubyspec MSPECOPT='--error-output stderr --debug -j' TESTS='-j20' I, [2024-05-12T14:52:17.002371 #2663356] INFO -- : BASERUBY = /usr/bin/ruby --disable=gems I, [2024-05-12T14:52:17.002430 #2663356] INFO -- : CC = gcc I, [2024-05-12T14:52:17.002449 #2663356] INFO -- : LD = ld I, [2024-05-12T14:52:17.002465 #2663356] INFO -- : LDSHARED = gcc -shared I, [2024-05-12T14:52:17.002483 #2663356] INFO -- : CFLAGS = -O3 -fno-fast-math -ggdb3 -Wall -Wextra -Wdeprecated-declarations -Wdiv-by-zero -Wduplicated-cond -Wimplicit-function-declaration -Wimplicit-int -Wpointer-arith -Wwrite-strings -Wold-style-definition -Wimplicit-fallthrough=0 -Wmissing-noreturn -Wno-cast-function-type -Wno-constant-logical-operand -Wno-long-long -Wno-missing-field-initializers -Wno-overlength-strings -Wno-packed-bitfield-compat -Wno-parentheses-equality -Wno-self-assign -Wno-tautological-compare -Wno-unused-parameter -Wno-unused-value -Wsuggest-attribute=format -Wsuggest-attribute=noreturn -Wunused-variable -Wmisleading-indentation -Wundef -fPIC I, [2024-05-12T14:52:17.002498 #2663356] INFO -- : XCFLAGS = -U_FORTIFY_SOURCE -D_FORTIFY_SOURCE=2 -fstack-protector-strong -fno-strict-overflow -fvisibility=hidden -fexcess-precision=standard -DRUBY_EXPORT -I. -I.ext/include/x86_64-linux -I/tmp/ruby/src/trunk/include -I/tmp/ruby/src/trunk -I/tmp/ruby/src/trunk/prism -I/tmp/ruby/src/trunk/enc/unicode/15.0.0 I, [2024-05-12T14:52:17.002534 #2663356] INFO -- : CPPFLAGS = I, [2024-05-12T14:52:17.002550 #2663356] INFO -- : DLDFLAGS = -Wl,--compress-debug-sections=zlib -Wl,-soname,libruby.so.3.4 -fstack-protector-strong I, [2024-05-12T14:52:17.002564 #2663356] INFO -- : SOLIBS = -lz -lrt -lrt -lgmp -ldl -lcrypt -lm -lpthread I, [2024-05-12T14:52:17.002577 #2663356] INFO -- : LANG = en_US.UTF-8 I, [2024-05-12T14:52:17.002590 #2663356] INFO -- : LC_ALL = I, [2024-05-12T14:52:17.002604 #2663356] INFO -- : LC_CTYPE = I, [2024-05-12T14:52:17.002617 #2663356] INFO -- : MFLAGS = I, [2024-05-12T14:52:17.002630 #2663356] INFO -- : RUSTC = no I, [2024-05-12T14:52:17.002644 #2663356] INFO -- : YJIT_RUSTC_ARGS = --crate-name=yjit --crate-type=staticlib --edition=2021 -g -C lto=thin -C opt-level=3 -C overflow-checks=on '--out-dir=/tmp/ruby/build/trunk/yjit/target/release/' /tmp/ruby/src/trunk/yjit/src/lib.rs I, [2024-05-12T14:52:17.003043 #2663356] INFO -- : gcc (Ubuntu 11.4.0-1ubuntu1~22.04) 11.4.0 I, [2024-05-12T14:52:17.003102 #2663356] INFO -- : Copyright (C) 2021 Free Software Foundation, Inc. I, [2024-05-12T14:52:17.003118 #2663356] INFO -- : This is free software; see the source for copying conditions. There is NO I, [2024-05-12T14:52:17.003133 #2663356] INFO -- : warranty; not even for MERCHANTABILITY or FITNESS FOR A PARTICULAR PURPOSE. I, [2024-05-12T14:52:17.003148 #2663356] INFO -- : I, [2024-05-12T14:52:17.004855 #2663356] INFO -- : generating enc.mk I, [2024-05-12T14:52:17.121595 #2663356] INFO -- : making enc I, [2024-05-12T14:52:17.138964 #2663356] INFO -- : make[1]: Entering directory '/tmp/ruby/build/trunk' I, [2024-05-12T14:52:17.139019 #2663356] INFO -- : make[1]: Nothing to be done for 'enc'. I, [2024-05-12T14:52:17.139032 #2663356] INFO -- : make[1]: Leaving directory '/tmp/ruby/build/trunk' I, [2024-05-12T14:52:17.139591 #2663356] INFO -- : making srcs under enc I, [2024-05-12T14:52:17.169404 #2663356] INFO -- : make[1]: Entering directory '/tmp/ruby/build/trunk' I, [2024-05-12T14:52:17.169468 #2663356] INFO -- : make[1]: Nothing to be done for 'srcs'. I, [2024-05-12T14:52:17.169483 #2663356] INFO -- : make[1]: Leaving directory '/tmp/ruby/build/trunk' I, [2024-05-12T14:52:17.170413 #2663356] INFO -- : generating transdb.h I, [2024-05-12T14:52:17.268656 #2663356] INFO -- : transdb.h unchanged I, [2024-05-12T14:52:17.270058 #2663356] INFO -- : making trans I, [2024-05-12T14:52:17.305372 #2663356] INFO -- : make[1]: Entering directory '/tmp/ruby/build/trunk' I, [2024-05-12T14:52:17.305440 #2663356] INFO -- : make[1]: Nothing to be done for 'trans'. I, [2024-05-12T14:52:17.305454 #2663356] INFO -- : make[1]: Leaving directory '/tmp/ruby/build/trunk' I, [2024-05-12T14:52:17.306098 #2663356] INFO -- : making encs I, [2024-05-12T14:52:17.343130 #2663356] INFO -- : make[1]: Entering directory '/tmp/ruby/build/trunk' I, [2024-05-12T14:52:17.343193 #2663356] INFO -- : make[1]: Nothing to be done for 'encs'. I, [2024-05-12T14:52:17.343206 #2663356] INFO -- : make[1]: Leaving directory '/tmp/ruby/build/trunk' I, [2024-05-12T14:52:17.345067 #2663356] INFO -- : generating makefiles ext/configure-ext.mk I, [2024-05-12T14:52:17.371704 #2663356] INFO -- : ext/configure-ext.mk updated I, [2024-05-12T14:52:17.374187 #2663356] INFO -- : make[1]: Entering directory '/tmp/ruby/build/trunk' I, [2024-05-12T14:52:18.731827 #2663356] INFO -- : make[1]: Leaving directory '/tmp/ruby/build/trunk' I, [2024-05-12T14:52:18.732413 #2663356] INFO -- : generating makefile exts.mk I, [2024-05-12T14:52:18.769005 #2663356] INFO -- : exts.mk unchanged I, [2024-05-12T14:52:18.773318 #2663356] INFO -- : make[1]: Entering directory '/tmp/ruby/build/trunk' I, [2024-05-12T14:52:19.070600 #2663356] INFO -- : make[2]: Entering directory '/tmp/ruby/build/trunk/ext/coverage' I, [2024-05-12T14:52:19.075329 #2663356] INFO -- : make[2]: Leaving directory '/tmp/ruby/build/trunk/ext/coverage' I, [2024-05-12T14:52:19.081749 #2663356] INFO -- : make[2]: Entering directory '/tmp/ruby/build/trunk/ext/date' I, [2024-05-12T14:52:19.086897 #2663356] INFO -- : make[2]: Leaving directory '/tmp/ruby/build/trunk/ext/date' I, [2024-05-12T14:52:19.090768 #2663356] INFO -- : make[2]: Entering directory '/tmp/ruby/build/trunk/ext/digest' I, [2024-05-12T14:52:19.099645 #2663356] INFO -- : make[2]: Leaving directory '/tmp/ruby/build/trunk/ext/digest' I, [2024-05-12T14:52:19.125495 #2663356] INFO -- : make[2]: Entering directory '/tmp/ruby/build/trunk/ext/digest/sha2' I, [2024-05-12T14:52:19.130342 #2663356] INFO -- : make[2]: Leaving directory '/tmp/ruby/build/trunk/ext/digest/sha2' I, [2024-05-12T14:52:19.151271 #2663356] INFO -- : make[2]: Entering directory '/tmp/ruby/build/trunk/ext/fiddle' I, [2024-05-12T14:52:19.160934 #2663356] INFO -- : make[2]: Leaving directory '/tmp/ruby/build/trunk/ext/fiddle' I, [2024-05-12T14:52:19.165890 #2663356] INFO -- : make[2]: Entering directory '/tmp/ruby/build/trunk/ext/io/console' I, [2024-05-12T14:52:19.170059 #2663356] INFO -- : make[2]: Leaving directory '/tmp/ruby/build/trunk/ext/io/console' I, [2024-05-12T14:52:19.183270 #2663356] INFO -- : make[2]: Entering directory '/tmp/ruby/build/trunk/ext/json' I, [2024-05-12T14:52:19.193865 #2663356] INFO -- : make[2]: Leaving directory '/tmp/ruby/build/trunk/ext/json' I, [2024-05-12T14:52:19.209169 #2663356] INFO -- : make[2]: Entering directory '/tmp/ruby/build/trunk/ext/monitor' I, [2024-05-12T14:52:19.213150 #2663356] INFO -- : make[2]: Leaving directory '/tmp/ruby/build/trunk/ext/monitor' I, [2024-05-12T14:52:19.220299 #2663356] INFO -- : make[2]: Entering directory '/tmp/ruby/build/trunk/ext/objspace' I, [2024-05-12T14:52:19.226460 #2663356] INFO -- : make[2]: Leaving directory '/tmp/ruby/build/trunk/ext/objspace' I, [2024-05-12T14:52:19.245117 #2663356] INFO -- : make[2]: Entering directory '/tmp/ruby/build/trunk/ext/openssl' I, [2024-05-12T14:52:19.261398 #2663356] INFO -- : make[2]: Leaving directory '/tmp/ruby/build/trunk/ext/openssl' I, [2024-05-12T14:52:19.264564 #2663356] INFO -- : make[2]: Entering directory '/tmp/ruby/build/trunk/ext/pathname' I, [2024-05-12T14:52:19.267665 #2663356] INFO -- : make[2]: Leaving directory '/tmp/ruby/build/trunk/ext/pathname' I, [2024-05-12T14:52:19.273736 #2663356] INFO -- : make[2]: Entering directory '/tmp/ruby/build/trunk/ext/psych' I, [2024-05-12T14:52:19.292217 #2663356] INFO -- : make[2]: Leaving directory '/tmp/ruby/build/trunk/ext/psych' I, [2024-05-12T14:52:19.296213 #2663356] INFO -- : make[2]: Entering directory '/tmp/ruby/build/trunk/ext/pty' I, [2024-05-12T14:52:19.300168 #2663356] INFO -- : make[2]: Leaving directory '/tmp/ruby/build/trunk/ext/pty' I, [2024-05-12T14:52:19.315005 #2663356] INFO -- : make[2]: Entering directory '/tmp/ruby/build/trunk/ext/ripper' I, [2024-05-12T14:52:19.322804 #2663356] INFO -- : make[2]: Leaving directory '/tmp/ruby/build/trunk/ext/ripper' I, [2024-05-12T14:52:19.325300 #2663356] INFO -- : make[2]: Entering directory '/tmp/ruby/build/trunk/ext/rubyvm' I, [2024-05-12T14:52:19.328559 #2663356] INFO -- : make[2]: Leaving directory '/tmp/ruby/build/trunk/ext/rubyvm' I, [2024-05-12T14:52:19.340278 #2663356] INFO -- : make[2]: Entering directory '/tmp/ruby/build/trunk/ext/socket' I, [2024-05-12T14:52:19.346757 #2663356] INFO -- : make[2]: Leaving directory '/tmp/ruby/build/trunk/ext/socket' I, [2024-05-12T14:52:19.357677 #2663356] INFO -- : make[2]: Entering directory '/tmp/ruby/build/trunk/.bundle/gems/bigdecimal-3.1.8/ext/bigdecimal' I, [2024-05-12T14:52:19.382465 #2663356] INFO -- : make[2]: Leaving directory '/tmp/ruby/build/trunk/.bundle/gems/bigdecimal-3.1.8/ext/bigdecimal' I, [2024-05-12T14:52:19.384493 #2663356] INFO -- : make[2]: Entering directory '/tmp/ruby/build/trunk/.bundle/gems/debug-1.9.2/ext/debug' I, [2024-05-12T14:52:19.405623 #2663356] INFO -- : make[2]: Leaving directory '/tmp/ruby/build/trunk/.bundle/gems/debug-1.9.2/ext/debug' I, [2024-05-12T14:52:19.407506 #2663356] INFO -- : make[2]: Entering directory '/tmp/ruby/build/trunk/.bundle/gems/nkf-0.2.0/ext/nkf' I, [2024-05-12T14:52:19.428874 #2663356] INFO -- : make[2]: Leaving directory '/tmp/ruby/build/trunk/.bundle/gems/nkf-0.2.0/ext/nkf' I, [2024-05-12T14:52:19.430846 #2663356] INFO -- : make[2]: Entering directory '/tmp/ruby/build/trunk/.bundle/gems/racc-1.7.3/ext/racc/cparse' I, [2024-05-12T14:52:19.452024 #2663356] INFO -- : make[2]: Leaving directory '/tmp/ruby/build/trunk/.bundle/gems/racc-1.7.3/ext/racc/cparse' I, [2024-05-12T14:52:19.454207 #2663356] INFO -- : make[2]: Entering directory '/tmp/ruby/build/trunk/.bundle/gems/rbs-3.4.4/ext/rbs_extension' I, [2024-05-12T14:52:19.475603 #2663356] INFO -- : make[2]: Leaving directory '/tmp/ruby/build/trunk/.bundle/gems/rbs-3.4.4/ext/rbs_extension' I, [2024-05-12T14:52:19.477692 #2663356] INFO -- : make[2]: Entering directory '/tmp/ruby/build/trunk/.bundle/gems/syslog-0.1.2/ext/syslog' I, [2024-05-12T14:52:19.499391 #2663356] INFO -- : make[2]: Leaving directory '/tmp/ruby/build/trunk/.bundle/gems/syslog-0.1.2/ext/syslog' I, [2024-05-12T14:52:19.522907 #2663356] INFO -- : make[2]: Entering directory '/tmp/ruby/build/trunk' I, [2024-05-12T14:52:19.586926 #2663356] INFO -- : make[2]: 'ruby' is up to date. I, [2024-05-12T14:52:19.586992 #2663356] INFO -- : make[2]: Leaving directory '/tmp/ruby/build/trunk' I, [2024-05-12T14:52:19.587413 #2663356] INFO -- : make[1]: Leaving directory '/tmp/ruby/build/trunk' I, [2024-05-12T14:52:19.590871 #2663356] INFO -- : make[1]: Entering directory '/tmp/ruby/build/trunk' I, [2024-05-12T14:52:19.590935 #2663356] INFO -- : make[1]: Nothing to be done for 'note'. I, [2024-05-12T14:52:19.590948 #2663356] INFO -- : make[1]: Leaving directory '/tmp/ruby/build/trunk' E, [2024-05-12T14:52:19.648017 #2663356] ERROR -- : $ /tmp/ruby/build/trunk/miniruby -I/tmp/ruby/src/trunk/lib /tmp/ruby/src/trunk/tool/runruby.rb --archdir=/tmp/ruby/build/trunk --extout=.ext -- /tmp/ruby/src/trunk/spec/mspec/bin/mspec-run -B /tmp/ruby/src/trunk/spec/default.mspec --error-output stderr --debug -fy -o /tmp/rubytest.0zk0f7/1-mspec-multi-0 E, [2024-05-12T14:52:19.648232 #2663356] ERROR -- : $ /tmp/ruby/build/trunk/miniruby -I/tmp/ruby/src/trunk/lib /tmp/ruby/src/trunk/tool/runruby.rb --archdir=/tmp/ruby/build/trunk --extout=.ext -- /tmp/ruby/src/trunk/spec/mspec/bin/mspec-run -B /tmp/ruby/src/trunk/spec/default.mspec --error-output stderr --debug -fy -o /tmp/rubytest.0zk0f7/2-mspec-multi-1 E, [2024-05-12T14:52:19.648515 #2663356] ERROR -- : $ /tmp/ruby/build/trunk/miniruby -I/tmp/ruby/src/trunk/lib /tmp/ruby/src/trunk/tool/runruby.rb --archdir=/tmp/ruby/build/trunk --extout=.ext -- /tmp/ruby/src/trunk/spec/mspec/bin/mspec-run -B /tmp/ruby/src/trunk/spec/default.mspec --error-output stderr --debug -fy -o /tmp/rubytest.0zk0f7/3-mspec-multi-2 E, [2024-05-12T14:52:19.648813 #2663356] ERROR -- : $ /tmp/ruby/build/trunk/miniruby -I/tmp/ruby/src/trunk/lib /tmp/ruby/src/trunk/tool/runruby.rb --archdir=/tmp/ruby/build/trunk --extout=.ext -- /tmp/ruby/src/trunk/spec/mspec/bin/mspec-run -B /tmp/ruby/src/trunk/spec/default.mspec --error-output stderr --debug -fy -o /tmp/rubytest.0zk0f7/4-mspec-multi-3 E, [2024-05-12T14:52:19.649100 #2663356] ERROR -- : $ /tmp/ruby/build/trunk/miniruby -I/tmp/ruby/src/trunk/lib /tmp/ruby/src/trunk/tool/runruby.rb --archdir=/tmp/ruby/build/trunk --extout=.ext -- /tmp/ruby/src/trunk/spec/mspec/bin/mspec-run -B /tmp/ruby/src/trunk/spec/default.mspec --error-output stderr --debug -fy -o /tmp/rubytest.0zk0f7/5-mspec-multi-4 E, [2024-05-12T14:52:19.649219 #2663356] ERROR -- : $ /tmp/ruby/build/trunk/miniruby -I/tmp/ruby/src/trunk/lib /tmp/ruby/src/trunk/tool/runruby.rb --archdir=/tmp/ruby/build/trunk --extout=.ext -- /tmp/ruby/src/trunk/spec/mspec/bin/mspec-run -B /tmp/ruby/src/trunk/spec/default.mspec --error-output stderr --debug -fy -o /tmp/rubytest.0zk0f7/6-mspec-multi-5 E, [2024-05-12T14:52:19.649534 #2663356] ERROR -- : $ /tmp/ruby/build/trunk/miniruby -I/tmp/ruby/src/trunk/lib /tmp/ruby/src/trunk/tool/runruby.rb --archdir=/tmp/ruby/build/trunk --extout=.ext -- /tmp/ruby/src/trunk/spec/mspec/bin/mspec-run -B /tmp/ruby/src/trunk/spec/default.mspec --error-output stderr --debug -fy -o /tmp/rubytest.0zk0f7/7-mspec-multi-6 E, [2024-05-12T14:52:19.649766 #2663356] ERROR -- : $ /tmp/ruby/build/trunk/miniruby -I/tmp/ruby/src/trunk/lib /tmp/ruby/src/trunk/tool/runruby.rb --archdir=/tmp/ruby/build/trunk --extout=.ext -- /tmp/ruby/src/trunk/spec/mspec/bin/mspec-run -B /tmp/ruby/src/trunk/spec/default.mspec --error-output stderr --debug -fy -o /tmp/rubytest.0zk0f7/8-mspec-multi-7 E, [2024-05-12T14:52:19.649974 #2663356] ERROR -- : $ /tmp/ruby/build/trunk/miniruby -I/tmp/ruby/src/trunk/lib /tmp/ruby/src/trunk/tool/runruby.rb --archdir=/tmp/ruby/build/trunk --extout=.ext -- /tmp/ruby/src/trunk/spec/mspec/bin/mspec-run -B /tmp/ruby/src/trunk/spec/default.mspec --error-output stderr --debug -fy -o /tmp/rubytest.0zk0f7/9-mspec-multi-8 E, [2024-05-12T14:52:19.650174 #2663356] ERROR -- : $ /tmp/ruby/build/trunk/miniruby -I/tmp/ruby/src/trunk/lib /tmp/ruby/src/trunk/tool/runruby.rb --archdir=/tmp/ruby/build/trunk --extout=.ext -- /tmp/ruby/src/trunk/spec/mspec/bin/mspec-run -B /tmp/ruby/src/trunk/spec/default.mspec --error-output stderr --debug -fy -o /tmp/rubytest.0zk0f7/10-mspec-multi-9 E, [2024-05-12T14:52:19.650483 #2663356] ERROR -- : $ /tmp/ruby/build/trunk/miniruby -I/tmp/ruby/src/trunk/lib /tmp/ruby/src/trunk/tool/runruby.rb --archdir=/tmp/ruby/build/trunk --extout=.ext -- /tmp/ruby/src/trunk/spec/mspec/bin/mspec-run -B /tmp/ruby/src/trunk/spec/default.mspec --error-output stderr --debug -fy -o /tmp/rubytest.0zk0f7/11-mspec-multi-10 E, [2024-05-12T14:52:19.650666 #2663356] ERROR -- : $ /tmp/ruby/build/trunk/miniruby -I/tmp/ruby/src/trunk/lib /tmp/ruby/src/trunk/tool/runruby.rb --archdir=/tmp/ruby/build/trunk --extout=.ext -- /tmp/ruby/src/trunk/spec/mspec/bin/mspec-run -B /tmp/ruby/src/trunk/spec/default.mspec --error-output stderr --debug -fy -o /tmp/rubytest.0zk0f7/12-mspec-multi-11 E, [2024-05-12T14:52:19.650843 #2663356] ERROR -- : $ /tmp/ruby/build/trunk/miniruby -I/tmp/ruby/src/trunk/lib /tmp/ruby/src/trunk/tool/runruby.rb --archdir=/tmp/ruby/build/trunk --extout=.ext -- /tmp/ruby/src/trunk/spec/mspec/bin/mspec-run -B /tmp/ruby/src/trunk/spec/default.mspec --error-output stderr --debug -fy -o /tmp/rubytest.0zk0f7/13-mspec-multi-12 E, [2024-05-12T14:52:19.651021 #2663356] ERROR -- : $ /tmp/ruby/build/trunk/miniruby -I/tmp/ruby/src/trunk/lib /tmp/ruby/src/trunk/tool/runruby.rb --archdir=/tmp/ruby/build/trunk --extout=.ext -- /tmp/ruby/src/trunk/spec/mspec/bin/mspec-run -B /tmp/ruby/src/trunk/spec/default.mspec --error-output stderr --debug -fy -o /tmp/rubytest.0zk0f7/14-mspec-multi-13 E, [2024-05-12T14:52:19.651272 #2663356] ERROR -- : $ /tmp/ruby/build/trunk/miniruby -I/tmp/ruby/src/trunk/lib /tmp/ruby/src/trunk/tool/runruby.rb --archdir=/tmp/ruby/build/trunk --extout=.ext -- /tmp/ruby/src/trunk/spec/mspec/bin/mspec-run -B /tmp/ruby/src/trunk/spec/default.mspec --error-output stderr --debug -fy -o /tmp/rubytest.0zk0f7/15-mspec-multi-14 E, [2024-05-12T14:52:19.651492 #2663356] ERROR -- : $ /tmp/ruby/build/trunk/miniruby -I/tmp/ruby/src/trunk/lib /tmp/ruby/src/trunk/tool/runruby.rb --archdir=/tmp/ruby/build/trunk --extout=.ext -- /tmp/ruby/src/trunk/spec/mspec/bin/mspec-run -B /tmp/ruby/src/trunk/spec/default.mspec --error-output stderr --debug -fy -o /tmp/rubytest.0zk0f7/16-mspec-multi-15 E, [2024-05-12T14:52:19.651789 #2663356] ERROR -- : $ /tmp/ruby/build/trunk/miniruby -I/tmp/ruby/src/trunk/lib /tmp/ruby/src/trunk/tool/runruby.rb --archdir=/tmp/ruby/build/trunk --extout=.ext -- /tmp/ruby/src/trunk/spec/mspec/bin/mspec-run -B /tmp/ruby/src/trunk/spec/default.mspec --error-output stderr --debug -fy -o /tmp/rubytest.0zk0f7/17-mspec-multi-16 E, [2024-05-12T14:52:19.654461 #2663356] ERROR -- : $ /tmp/ruby/build/trunk/miniruby -I/tmp/ruby/src/trunk/lib /tmp/ruby/src/trunk/tool/runruby.rb --archdir=/tmp/ruby/build/trunk --extout=.ext -- /tmp/ruby/src/trunk/spec/mspec/bin/mspec-run -B /tmp/ruby/src/trunk/spec/default.mspec --error-output stderr --debug -fy -o /tmp/rubytest.0zk0f7/18-mspec-multi-17 E, [2024-05-12T14:52:19.655209 #2663356] ERROR -- : $ /tmp/ruby/build/trunk/miniruby -I/tmp/ruby/src/trunk/lib /tmp/ruby/src/trunk/tool/runruby.rb --archdir=/tmp/ruby/build/trunk --extout=.ext -- /tmp/ruby/src/trunk/spec/mspec/bin/mspec-run -B /tmp/ruby/src/trunk/spec/default.mspec --error-output stderr --debug -fy -o /tmp/rubytest.0zk0f7/19-mspec-multi-18 E, [2024-05-12T14:52:19.655561 #2663356] ERROR -- : $ /tmp/ruby/build/trunk/miniruby -I/tmp/ruby/src/trunk/lib /tmp/ruby/src/trunk/tool/runruby.rb --archdir=/tmp/ruby/build/trunk --extout=.ext -- /tmp/ruby/src/trunk/spec/mspec/bin/mspec-run -B /tmp/ruby/src/trunk/spec/default.mspec --error-output stderr --debug -fy -o /tmp/rubytest.0zk0f7/20-mspec-multi-19 I, [2024-05-12T14:52:19.821128 #2663356] INFO -- : ruby 3.4.0dev (2024-05-12T07:23:00Z master b911d2222f) [x86_64-linux] I, [2024-05-12T14:52:20.415746 #2663356] INFO -- : 0 ......................................................................... I, [2024-05-12T14:52:20.851868 #2663356] INFO -- : 73 ......................................................................... I, [2024-05-12T14:52:20.981569 #2663356] INFO -- : 146 ......................................................................... I, [2024-05-12T14:52:21.021481 #2663356] INFO -- : 219 ......................................................................... I, [2024-05-12T14:52:21.080527 #2663356] INFO -- : 292 ......................................................................... I, [2024-05-12T14:52:21.116358 #2663356] INFO -- : 365 ......................................................................... I, [2024-05-12T14:52:21.132520 #2663356] INFO -- : 438 ......................................................................... I, [2024-05-12T14:52:21.149054 #2663356] INFO -- : 511 ......................................................................... I, [2024-05-12T14:52:21.165108 #2663356] INFO -- : 584 ......................................................................... I, [2024-05-12T14:52:21.228900 #2663356] INFO -- : 657 ......................................................................... I, [2024-05-12T14:52:21.256317 #2663356] INFO -- : 730 ......................................................................... I, [2024-05-12T14:52:21.280032 #2663356] INFO -- : 803 ......................................................................... I, [2024-05-12T14:52:21.320414 #2663356] INFO -- : 876 ......................................................................... I, [2024-05-12T14:52:21.364880 #2663356] INFO -- : 949 ......................................................................... I, [2024-05-12T14:52:21.467986 #2663356] INFO -- : 1022 ......................................................................... I, [2024-05-12T14:52:21.618548 #2663356] INFO -- : 1095 ......................................................................... I, [2024-05-12T14:52:21.728878 #2663356] INFO -- : 1168 ......................................................................... I, [2024-05-12T14:52:21.790234 #2663356] INFO -- : 1241 ......................................................................... I, [2024-05-12T14:52:21.841490 #2663356] INFO -- : 1314 ......................................................................... I, [2024-05-12T14:52:21.856328 #2663356] INFO -- : 1387 ......................................................................... I, [2024-05-12T14:52:21.949880 #2663356] INFO -- : 1460 ......................................................................... I, [2024-05-12T14:52:22.404496 #2663356] INFO -- : 1533 ......................................................................... I, [2024-05-12T14:52:22.485051 #2663356] INFO -- : 1606 ......................................................................... I, [2024-05-12T14:52:22.591416 #2663356] INFO -- : 1679 ......................................................................... I, [2024-05-12T14:52:22.721403 #2663356] INFO -- : 1752 ......................................................................... I, [2024-05-12T14:52:22.810503 #2663356] INFO -- : 1825 ......................................................................... I, [2024-05-12T14:52:22.904388 #2663356] INFO -- : 1898 ......................................................................... I, [2024-05-12T14:52:22.997183 #2663356] INFO -- : 1971 ......................................................................... I, [2024-05-12T14:52:23.061798 #2663356] INFO -- : 2044 ......................................................................... I, [2024-05-12T14:52:23.105495 #2663356] INFO -- : 2117 ......................................................................... I, [2024-05-12T14:52:23.120187 #2663356] INFO -- : 2190 ......................................................................... I, [2024-05-12T14:52:23.137221 #2663356] INFO -- : 2263 ......................................................................... I, [2024-05-12T14:52:23.151787 #2663356] INFO -- : 2336 ......................................................................... I, [2024-05-12T14:52:23.183513 #2663356] INFO -- : 2409 ......................................................................... I, [2024-05-12T14:52:23.285116 #2663356] INFO -- : 2482 ......................................................................... I, [2024-05-12T14:52:23.309650 #2663356] INFO -- : 2555 ......................................................................... I, [2024-05-12T14:52:23.415910 #2663356] INFO -- : 2628 ......................................................................... I, [2024-05-12T14:52:23.513424 #2663356] INFO -- : 2701 ......................................................................... I, [2024-05-12T14:52:23.545734 #2663356] INFO -- : 2774 ......................................................................... I, [2024-05-12T14:52:23.604354 #2663356] INFO -- : 2847 ......................................................................... I, [2024-05-12T14:52:23.634914 #2663356] INFO -- : 2920 ......................................................................... I, [2024-05-12T14:52:23.657145 #2663356] INFO -- : 2993 ......................................................................... I, [2024-05-12T14:52:23.676985 #2663356] INFO -- : 3066 ......................................................................... I, [2024-05-12T14:52:23.688442 #2663356] INFO -- : 3139 ......................................................................... I, [2024-05-12T14:52:23.695430 #2663356] INFO -- : 3212 ......................................................................... I, [2024-05-12T14:52:23.720340 #2663356] INFO -- : 3285 ......................................................................... I, [2024-05-12T14:52:27.700964 #2663356] INFO -- : 3358 ........................................................................ I, [2024-05-12T14:52:27.701022 #2663356] INFO -- : I, [2024-05-12T14:52:27.701029 #2663356] INFO -- : Finished in 8.052112 seconds I, [2024-05-12T14:52:27.701032 #2663356] INFO -- : I, [2024-05-12T14:52:27.701036 #2663356] INFO -- : 3429 files, 32611 examples, 195775 expectations, 0 failures, 0 errors, 0 tagged I, [2024-05-12T14:52:27.703300 #2663356] INFO -- : $$$[end] "make yes-test-rubyspec MSPECOPT='--error-output stderr --debug -j' TESTS='-j20'" exit with 0.